##TITLE=Analysis number 324014
Compound Code rf 04491
Book Reference b
Project Code adrs
Chemist Name sigma-aldrich
##JCAMPDX= 6.0         $$ Bruker NMR JCAMP-DX V2.0
##DATA TYPE= NMR SPECTRUM
##DATA CLASS= NTUPLES
##ORIGIN= Bruker BioSpin GmbH
##OWNER= nmr
$$ XWIN-NMR		Version 3.5
$$ Fri Nov 10 18:07:05 2006 GMT Standard Time (UT+0h)  MAYBRIDGE\nmr@NMR_250MHZ
##.OBSERVE FREQUENCY= 250.131544655141
##.OBSERVE NUCLEUS= ^1H
##.ACQUISITION MODE= SIMULTANEOUS (DQD)
##.ACQUISITION SCHEME= undefined
##.AVERAGES= 16
##.DIGITISER RES= 18
##SPECTROMETER/DATA SYSTEM= dpx250
##.PULSE SEQUENCE= zg30
##.SOLVENT NAME= CDCl3
##.SHIFT REFERENCE= (INTERNAL, CDCl3, 0, 16.522)
##AUDIT TRAIL= $$ (NUMBER, WHEN, WHO, WHERE, WHAT)
$$ ##TITLE= Audit trail, XWIN-NMR		Version 3.5
$$ ##JCAMPDX= 5.01
$$ ##ORIGIN= Bruker BioSpin GmbH
$$ ##OWNER= nmr
$$ C:\u/data/dgb/nmr/ADRS/2720/pdata/1/auditp.txt
$$ ##AUDIT TRAIL=  $$ (NUMBER, WHEN, WHO, WHERE, WHAT)
(   1,<2006-11-10 18:06:42.98 +000>,<MAYBRIDGE\nmr>,<NMR_250MHZ>,
      <created by zg, POWCHK disabled, PULCHK disabled
       configuration hash MD5:
       49 4B E0 1D 92 C2 6B 37 9F E6 65 BC 52 41 86 1D
       data hash MD5: 64K
       91 92 81 C7 A2 92 0C B7 29 6C 29 99 E7 A7 BF 3A>)
(   2,<2006-11-10 18:06:56.76 +000>,<MAYBRIDGE\nmr>,<NMR_250MHZ>,
      <Start of raw data processing
       ef LB = 0.3 FT_mod = 6 PKNL = 1 SI = 32K 
       data hash MD5: 32K
       4D 43 40 5A 9E 56 FB A4 0F B4 0D 51 92 2C C6 C4>)
(   3,<2006-11-10 18:06:58.37 +000>,<MAYBRIDGE\nmr>,<NMR_250MHZ>,
      <apk 
       data hash MD5: 32K
       6D 1F 65 74 DA 1C 64 E4 B3 64 F6 6C DD 2B 6E 47>)
(   4,<2006-11-10 18:06:59.11 +000>,<MAYBRIDGE\nmr>,<NMR_250MHZ>,
      <abs ABSG = 5 
       data hash MD5: 32K
       0A 7F D3 99 87 18 F5 84 F3 66 7E 99 93 9C 62 5C>)
$$ ##END=
$$ 
$$ hash MD5
$$ E3 AF F6 BF AC 2C 83 E3 0E D7 10 58 F3 B1 BE AF
##$RELAX= 
##$RELAX= 
##$RELAX= 
##$RELAX= 
##$RELAX= 
##$RELAX= 
##$RELAX= 
$$ Bruker specific parameters
$$ --------------------------
##$DU= <C:\u>
##$EXPNO= 2720
##$NAME= <ADRS>
##$PROCNO= 1
##$TYPE= <nmr>
##$USER= <dgb>
##$AMP= (0..31)
100 100 100 100 100 100 100 100 100 100 100 100 100 100 100 100 100 100 
100 100 100 100 100 100 100 100 100 100 100 100 100 100 
##$AQSEQ= 0
##$AQ_mod= 3
##$AUNM= <au_zg>
##$AUTOPOS= <56 >
##$BF1= 250.13
##$BF2= 250.13
##$BF3= 250.13
##$BF4= 250.13
##$BF5= 500.13
##$BF6= 500.13
##$BF7= 500.13
##$BF8= 500.13
##$BYTORDA= 1
##$CFDGTYP= 0
##$CFRGTYP= 5
##$CHEMSTR= <none>
##$CNST= (0..31)
1 1 145 1 1 1 1 1 1 1 1 1 1 1 1 1 1 1 1 1 1 1 1 1 1 1 1 1 1 1 1 1 
##$CPDPRG= <>
##$CPDPRG1= <>
##$CPDPRG2= <>
##$CPDPRG3= <>
##$CPDPRG4= <mlev>
##$CPDPRG5= <mlev>
##$CPDPRG6= <mlev>
##$CPDPRG7= <mlev>
##$CPDPRG8= <mlev>
##$CPDPRGB= <>
##$CPDPRGT= <>
##$D= (0..31)
0 1 0 0 0 0 0 0 0 0.06 0 0 0 0 0 0 0.0002 0 0 0 0 0 0 0 0 0 0 0 0 0 0 
0 
##$DATE= 1163182002
##$DBL= (0..7)
120 120 120 120 120 120 120 120 
##$DBP= (0..7)
150 150 150 150 150 150 150 150 
##$DBP07= 0
##$DBPNAM0= <>
##$DBPNAM1= <>
$$ [...]
##$SUBNAM7= <"">
##$SUBNAM8= <"">
##$SUBNAM9= <"">
##$SW= 20.6930455092707
##$SWIBOX= (0..15)
0 0 3 0 0 0 0 0 0 0 0 0 0 0 0 0 
##$SW_h= 5175.983436853
##$TD= 65536
##$TD0= 1
##$TE= 683.16
##$TE2= 300
##$TE3= 300
##$TEG= 300
##$TL= (0..7)
0 120 120 120 120 120 120 120 
##$TP= (0..7)
150 150 150 150 150 150 150 150 
##$TP07= 0
##$TPNAME0= <>
##$TPNAME1= <>
##$TPNAME2= <>
##$TPNAME3= <>
##$TPNAME4= <>
##$TPNAME5= <>
##$TPNAME6= <>
##$TPNAME7= <>
##$TPOAL= (0..7)
0.5 0.5 0.5 0.5 0.5 0.5 0.5 0.5 
##$TPOFFS= (0..7)
0 0 0 0 0 0 0 0 
##$TUNHIN= 0
##$TUNHOUT= 0
##$TUNXOUT= 0
##$USERA1= <user>
##$USERA2= <user>
##$USERA3= <user>
##$USERA4= <user>
##$USERA5= <user>
##$V9= 5
##$VALIST= <valist>
##$VCLIST= <CCCCCCCCCCCCCCC>
##$VD= 0
##$VDLIST= <DDDDDDDDDDDDDDD>
##$VPLIST= <PPPPPPPPPPPPPPP>
##$VTLIST= <TTTTTTTTTTTTTTT>
##$WBST= 1024
##$WBSW= 4
##$XGAIN= (0..3)
0 0 0 0 
##$XL= 0
##$YL= 0
##$YMAX_a= 418334
##$YMIN_a= -334075
##$ZGOPTNS= <>
##$ZL1= 120
##$ZL2= 120
##$ZL3= 120
##$ZL4= 120
##$ABSF1= 16.522
##$ABSF2= -4.171173
##$ABSG= 5
##$ABSL= 3
##$ALPHA= 0
##$AQORDER= 0
##$ASSFAC= 0
##$ASSFACI= 0
##$ASSFACX= 0
##$ASSWID= 0
##$AUNMP= <proc_1d>
##$AZFE= 0.1
##$AZFW= 0.1
##$BCFW= 0
##$BC_mod= 0
##$BYTORDP= 0
##$COROFFS= 0
##$CY= 12.5
##$DATMOD= 1
##$DC= 0
##$DFILT= <>
##$DTYPP= 0
##$F1P= 14.0000005364418
##$F2P= -0.99999901652339
##$FCOR= 0.5
##$FTSIZE= 32768
##$FT_mod= 6
##$GAMMA= 0
##$GB= 0
##$INTBC= 1
##$INTSCL= 1
##$ISEN= 128
##$LB= 0.3
##$LEV0= 0
##$LPBIN= 0
##$MAXI= 10000
##$MC2= 0
##$MEAN= 0
##$ME_mod= 0
##$MI= 0
##$NCOEF= 0
##$NC_proc= -5
##$NLEV= 6
##$NOISF1= 0
##$NOISF2= 0
##$NSP= 0
##$NTH_PI= 0
##$NZP= 0
##$OFFSET= 16.522
##$PC= 1
##$PHC0= -42.79922
##$PHC1= 5.67646
##$PH_mod= 1
##$PKNL= yes
##$PPARMOD= 0
##$PSCAL= 4
##$PSIGN= 0
##$REVERSE= no
##$SF= 250.13
##$SI= 32768
##$SIGF1= 0
##$SIGF2= 0
##$SINO= 400
##$SIOLD= 32768
##$SREGLST= <1H.CDCl3>
##$SSB= 0
##$STSI= 32768
##$STSR= 0
##$SW_p= 5175.98343685301
##$SYMM= 0
##$S_DEV= 0
##$TDeff= 65536
##$TDoff= 0
##$TI= <Analysis number 999999
Compound Code 99
Book Reference 9
Project Code 9>
##$TILT= no
##$TM1= 0
##$TM2= 0
##$TOPLEV= 0
##$USERP1= <user>
##$USERP2= <user>
##$USERP3= <user>
##$USERP4= <user>
##$USERP5= <user>
##$WDW= 1
##$XDIM= 32768
##$YMAX_p= 520523303
##$YMIN_p= -1581761
$$ End of Bruker specific parameters
$$ ---------------------------------
##NTUPLES= NMR SPECTRUM
##VAR_NAME=  FREQUENCY,     SPECTRUM/REAL,   SPECTRUM/IMAG
##SYMBOL=    X,             R,               I
##VAR_TYPE=  INDEPENDENT,   DEPENDENT,       DEPENDENT
##VAR_FORM=  AFFN,          ASDF,            ASDF
##VAR_DIM=   32768,         32768,           32768
##UNITS=     HZ,            ARBITRARY UNITS, ARBITRARY UNITS
##FACTOR=    0.157963299565203, 1,           1
##FIRST=     4132.6476996994, 0,             0
##LAST=      -1043.33573715361, 0,           0
##MIN=       -1043.33573715361, -1581761,    0
##MAX=       4132.6476996994, 520523303,     0
$$ Real data points
##PAGE= N=1
##DATA TABLE= (X++(R..R)), XYDATA
$$ [...]
26871 -387593 -256037 -147558 27985 388816 470708 505707 557524 451693 239024 190930
26861 190930 -208365 -536700 -55331 365033 449006 261464 271503 -7451 -99960 -293066
26851 -293066 -528874 -364505 -75353 -24592 416457 586853 534038 641337 769583 513401
26841 513401 503199 265075 -445760 -340046 -216693 32394 339548 710391 996885 621380
26831 621380 421941 60823 -73523 -195909 73872 318790 251140 558340 1188422 1364017
26821 1364017 1070123 713439 582553 568402 494432 92311 189278 669463 740991 479483
26811 479483 314052 132349 -150532 -204896 -66149 403965 228550 295825 378728 235357
26801 235357 -206211 -464563 -434629 -431552 225187 346988 149023 -279713 108544 499103
26791 499103 154411 -265968 -112702 -159711 63834 279119 -50423 -208759 -523978 -311116
26781 -311116 -141230 202675 -141471 -281809 -212771 -257515 -153030 -163542 -195423 -164312
26771 -164312 368821 603150 457552 108350 -49429 -135848 -236879 6030 271102 259800
26761 259800 411843 804477 554114 400150 319203 116860 192856 12044 -257660 172215
26751 172215 83862 -15977 -50989 -125031 -49034 -147641 -475079 -363962 -128715 -241922 154680
26740 154680 52773 -141012 -19712 39820 145074 472211 537696 346299 207558 578700
26730 578700 745351 647173 80092 -365383 -447477 -389835 -364623 73561 445416 156357
26720 156357 -199788 -43378 344081 328370 198127 315312 191202 143217 -283889 -470855
26710 -470855 60161 187884 -181079 -568981 -662903 -165714 -153022 -281705 -161527 -19640
26700 -19640 217875 219 178722 262654 39039 -259739 -434240 181223 166560 -241084
26690 -241084 -117095 139640 59275 202564 586582 687648 -5693 -666575 -409897 -192169
26680 -192169 -172068 -100328 -267334 -462218 146554 291381 345334 440144 335809 414378
26670 414378 -38846 -163250 -286944 -58433 13603 -107213 248329 189880 237054 366480
26660 366480 467598 313829 186234 -19851 145363 144240 21897 281548 330947 193462
26650 193462 118889 285316 -41281 -207515 -352149 -315640 -179631 482007 429616 -193860
26640 -193860 -456054 -323351 -247856 -61367 177217 -216669 -442877 -166731 14223 382349
26630 382349 600316 540384 319910 245838 -76923 -35359 -310046 -595847 -286115 -133075
26620 -133075 -506729 -427817 -339435 -567392 -473148 -325817 -82177 314975 -99557 -338241
26610 -338241 -554988 -556256 -166261 207975 238884 153736 -188045 58907 191057 454952
26600 454952 99522 154376 272251 161368 -137543 -386046 -164658 370571 157939 -229901
26590 -229901 -130603 170655 160449 369208 361364 -70084 -349995 -150953 -294362 -377955
26580 -377955 -253702 -39854 -150731 -173172 -100811 -258418 -441293 -694671 -770361 -491354
26570 -491354 -475049 -552361 -591738 -645881 -538073 -615964 -520438 -26440 -215398 -682792 -735889
26559 -735889 -164753 204012 179799 224782 304847 362318 288871 315485 204399 -152302 42949
26548 42949 111302 -308192 -498919 -275516 -237687 -166024 31505 623985 277085 122846
26538 122846 321216 557438 473571 347780 601352 244483 -439265 -883893 -167726 458327
26528 458327 230515 -597379 -907501 -607303 -366971 -8460 -289000 -341226 -403037 -251157
26518 -251157 -93664 25489 -159741 -527429 -587043 -843153 -473776 74195 158722 351051
26508 351051 295344 369189 82357 -40467 12496 -388119 -404700 -510531 -650129 -392844
26498 -392844 -439543 -585301 -446599 -530815 -271757 -77643 195391 317445 348550 190977
26488 190977 88289 -213607 -302080 -196141 -337183 -450948 -354774 -243441 -360062 -250068
26478 -250068 23235 36458 102276 225755 336549 324838 307480 149545 -13152 -133179
26468 -133179 63218 421091 355671 58847 26870 152256 312913 214752 -176002 -335011
26458 -335011 -210084 -249383 -301261 -282605 -705705 -645123 -82515 346972 487440 735153
26448 735153 585239 443509 376172 83176 -20650 88222 491305 540228 353060 -26033
26438 -26033 -348833 -303830 -2740 279772 432860 296683 444240 652077 744329 856675
26428 856675 519680 49396 -294015 -182729 -309827 -829134 -765879 -340552 -223720 -115860
26418 -115860 343803 611359 423522 -254684 -760491 -633382 -611854 -926627 -678660 -464613
26408 -464613 163206 397446 526542 599653 595032 328139 155322 594855 799360 721421
26398 721421 769158 165904 204852 446985 93885 -376146 -251289 -52031 362623 458543
26388 458543 369596 -167597 -899854 -1017581 -1194367 -1079627 -855576 -713391 -618520 -316726
26378 -316726 -271846 -404909 -248345 175153 -125727 62613 145309 -13445 164852 -3610
26368 -3610 -494831 -504849 -162423 -194130 -523543 -762008 -398139 -425485 -160395 -373988
26358 -373988 -280953 -474497 -544060 -445433 -148567 65643 109409 55103 150433 323061 408670
26347 408670 3771 -266320 -435118 -401986 -245272 -288455 -68021 55358 501504 -62489
26337 -62489 -516354 -390387 -181417 131146 237027 241102 220438 179498 112966 225777 468665
26326 468665 597571 568380 503534 86640 -427005 -395125 -151748 -6964 58931 66471 2467
26315 2467 141795 551176 -61831 -193207 -179405 -234755 -329981 38048 380144 251816
26305 251816 133903 215524 402707 179232 307429 5084 182411 407046 461870 372467
26295 372467 526287 604533 351836 265703 46810 -325817 -387807 -201193 70473 428937
26285 428937 752641 459096 -33520 -702 -239197 -151873 -22836 -364656 -149777 -354692
26275 -354692 -474805 -255065 -12536 155799 187662 -358935 -416450 -354331 -569055 -574659
26265 -574659 -65308 -26065 -194664 -340087 243172 267603 -139218 -38272 -365580 -675446
26255 -675446 -446970 -97794 -644090 -938115 -884542 -442661 -315702 -158179 234157 156965
26245 156965 28281 173058 313065 383871 77224 120025 418949 164939 146932 418008
26235 418008 63241 -316985 -540628 -434046 -71347 -28592 -251953 -146071 -39332 329446
26225 329446 -63261 -510008 -550092 -300115 -297282 -308008 -35546 170870 452579 223956
26215 223956 -33901 33870 -182109 -798904 -991950 -808786 -26547 281207 439623 335842
26205 335842 -65838 -82200 5963 97278 -129333 -14344 -26080 192974 197741 155128 573036
26194 573036 926579 483797 179919 -479250 -583294 -603763 -280901 -97667 -53000 -255834
26184 -255834 -310882 -144137 142450 51221 115365 37230 -76538 63903 -230949 -447338
26174 -447338 -227915 -466442 -255669 273192 -224583 -358486 -560088 -361149 -313729 -89728
26164 -89728 274964 813647 761781 5642 -185668 -338385 -275953 -132091 21028 94441
26154 94441 12841 -159298 -193126 -243745 -173327 201595 355000 641037 571056 61284 205762
26143 205762 177905 438700 529129 239051 235220 108346 -83173 -409310 -643179 -316040
26133 -316040 -209242 54833 223508 -87765 -325165 -313399 -192699 -664963 -1074540 -1093478
26123 -1093478 -427207 148023 -324056 -636957 -210320 -111575 -205355 53818 32965 450096
26113 450096 792459 761041 265905 239573 285913 -4956 -39337 10464 -135788 -252954
26103 -252954 -268821 181722 412742 260557 22315 -164576 -85580 -50311 -191930 -86882
26093 -86882 54076 -288512 -257882 -388151 -85266 470988 922886 848059 254919 29596
26083 29596 -89890 270111 555186 -25663 -190126 71330 -33789 -191811 -347087 -328071
26073 -328071 -324888 -292620 -186889 -202584 -147279 207078 374298 764510 743804 137881 -559440
26062 -559440 -1066001 -974196 -887984 -744735 -168446 561580 97836 86604 479087 672606
26052 672606 652606 939243 609227 261934 -136059 -186245 -212005 -319125 -297852 -117698
26042 -117698 167832 155238 190024 192506 44630 124595 168770 162831 -68265 -57044 -227416
26031 -227416 3994 -60289 -144895 -25458 123362 188847 561049 602687 568849 305481
26021 305481 177906 262865 228484 23958 126444 18606 57223 405661 359894 133495
26011 133495 546554 674680 453626 522717 453722 353979 678426 849331 564471 36441
26001 36441 -98420 -43000 86276 -351430 13466 -13684 -990 180330 -47121 -250486
25991 -250486 -546776 -725978 -351462 -59597 42210 -105064 27885 384730 651976 634994
25981 634994 396256 476964 491174 686680 851076 1033631 1013398 630698 279609 518703
25971 518703 686748 876476 520672 407970 585201 815986 758914 586707 444264 168242
25961 168242 128579 449800 805235 869325 666373 458985 141916 220479 222947 140643 204081
25950 204081 360847 683917 971276 780122 383117 300474 310431 240127 103439 83312
25940 83312 -244284 -379884 -389903 -308910 -259069 -66619 144623 470397 375491 -170062
25930 -170062 233035 139643 -465510 -539844 -478323 -325265 -17376 76105 -278933 -265486
25920 -265486 -26467 -249587 -391129 -28572 314342 153086 -39628 -376324 -166746 198566
25910 198566 203942 199674 -221954 -560982 -312372 81554 -112563 152181 59349 -102434
25900 -102434 -111830 -530908 -651281 -600875 -168299 104091 38111 -285407 -225602 -197935 -214322
25889 -214322 -523957 -746171 -558870 -423516 -139441 -60542 -154897 -120076 -115110 273520
25879 273520 457281 231965 132843 23461 -231413 -427233 -122184 -285073 -306590 6431
25869 6431 144583 288448 386274 202009 109092 -240076 -416946 -409137 -152280 -172818 -278485
25858 -278485 -377685 -772135 -686811 -1050 215304 -393041 -615428 -328871 -493088 -523386
25848 -523386 -860259 -1293136 -986932 -523544 -71886 147276 -36881 192475 1266129
25839 1266129 1025782 158510 -101376 -197784 -247918 -161621 -334895 34875 362610 264357
25829 264357 118276 17417 -15189 79382 600418 562216 594531 443399 383878 622195
25819 622195 514292 216491 90951 -34693 -157149 -134254 53387 374477 720934 278790
25809 278790 -50060 -172132 -145763 169179 121974 -339671 -275020 -38097 394199 137678
25799 137678 24004 112094 587156 528995 155684 -330810 -120771 321837 669489 387577
25789 387577 407069 88546 -175531 -337701 -346598 -123927 66794 43889 424797 370178
25779 370178 222459 335332 402095 419515 600122 418509 193291 -145365 -81979 -100015
25769 -100015 -232815 -413520 -439033 4387 -232585 -398349 -483837 -718216 -646312 -383693
25759 -383693 -398754 -415070 -116392 216356 318938 317315 368403 563516 470295 135492 -352094
25748 -352094 -509669 -178776 360110 436739 284099 478659 646684 695527 309273 241093
25738 241093 130583 -86472 2706 -25831 -198546 -474079 -632776 -80978 293140 347824
25728 347824 141261 157902 -351458 -365352 -141136 141440 163720 39192 -186021 -523110
25718 -523110 -192324 416828 617547 365997 212677 -214538 -571993 -281798 114710 224998
25708 224998 278609 719516 801739 444410 394702 608515 175904 -257754 -420595 -281601
25698 -281601 -49253 -163335 109980 184309 175618 130289 55881 -481798 -535053 -117291 86565
25687 86565 -48756 -86812 -102289 -204568 -139356 202028 347118 218708 -34142 220070
25677 220070 68584 169573 180036 -18267 70834 592 -151549 -263617 -455509 -599662
25667 -599662 -533963 -361700 -383646 -329971 -409529 -549786 -679124 -683456 -613831 -342265 -293605
25656 -293605 -214016 70480 -59466 -284062 -238589 -563891 -533737 -139986 276798 488207
25646 488207 700536 439899 -18750 -67011 268656 265622 90190 -37967 67077 238874
25636 238874 -8178 -720024 -919971 -480053 181434 728184 568864 560226 335593 -159679
25626 -159679 -241384 -140602 300171 874919 1070678 1068598 678573 484870 172875 -696534
25616 -696534 -783442 -39453 562970 385877 -199044 -659896 -795417 -886364 -569573 -96793
25606 -96793 -162552 -423789 -685971 -633562 140622 775280 537018 92637 -96751 -306999
25596 -306999 -466879 -383989 -653601 -499945 -335059 -126022 -266842 -221499 -439395 -661673
25586 -661673 -657900 -516886 -256598 -444452 -867210 -904349 -25551 522841 489213 462011
25576 462011 469499 207085 347640 -124897 -219826 82311 445997 555087 436516 -1070
25566 -1070 -82078 82754 532387 639689 340236 611970 890697 757206 422541 215088
25556 215088 128372 374189 218268 -114937 -509457 -689952 -777078 -978094 -475526 -149612
25546 -149612 -102793 72666 262891 95225 381445 395461 343431 297496 391850 130680
25536 130680 7389 131914 -132476 -116973 194216 -8326 18493 -213342 -84709 -32818
25526 -32818 -128123 -568965 -517212 -529686 -386961 -209304 53778 -276629 -531767 -439930
25516 -439930 -281223 169192 225381 76595 -160931 -276485 -405535 -402228 -190369 -84419
25506 -84419 -66235 -53173 -111330 -562772 -624192 -533103 -649103 -653097 -361895 184663 325403
25495 325403 168777 -151256 -326419 -304652 -88510 32691 -167514 -247887 -330367 -583856
25485 -583856 -761493 -436525 -313178 -142525 -107068 -76849 -128812 91463 -2033 108491
25475 108491 111516 259494 199118 -184980 -435214 -818140 -966388 -591099 -617344 -775455
25465 -775455 -643426 -733355 -547724 128849 184956 -89824 -125210 -89365 -282117 -230362
25455 -230362 156286 227459 -158703 -415035 -164501 -93407 210855 179192 -268292 -636308
25445 -636308 -583858 -183370 91391 -197720 -128270 -69346 -64780 99376 308469 269027 -174237
25434 -174237 -205670 42137 -172756 191436 92619 -143861 -178645 -581654 -1064772 -827502
25424 -827502 -377405 -305726 -285664 270431 598997 629085 365433 570062 413085 11340
25414 11340 114091 303787 524697 682116 287690 325488 441032 422815 299595 238569
25404 238569 104856 -4667 248491 11809 -167932 -264552 -403157 -108331 -53153 43921
25394 43921 -104791 -496889 -418578 -28329 -34784 -76142 -157998 -21978 -132007 -221679 -528616
25383 -528616 -597821 -361192 185026 430864 296220 353407 310139 157616 309708 421698
25373 421698 330231 -132923 -152798 -232177 -130707 -6611 -146901 -543425 -1048498 -551361
25363 -551361 41044 84521 295132 598038 362986 9644 -245481 -292768 -248258 -251197
25353 -251197 52096 380724 107096 -349999 -71229 -140492 -147646 -158118 -307813 -163904
25343 -163904 130381 238046 157452 -329514 -20162 185532 246268 -180417 -478423 -596908
25333 -596908 -393310 26705 -99998 -535949 -343405 346136 588181 259600 290043 208690
25323 208690 132531 -64119 82843 -191229 -289194 -247173 -208451 -207878 60125 377034 175446
25312 175446 163479 686165 777427 220053 107556 44548 -84717 187830 452756 362201
25302 362201 376861 326307 -302936 -245899 16374 -288501 -399275 -265079 -259071 -411840
25292 -411840 -136817 -210529 -62252 -175313 -251222 -362399 -388393 -326305 -826064 -1105050
25282 -1105050 -1313082 -1050709 -422093 68780 -200857 -516438 -189683 90406 113527 -108913
25272 -108913 -209401 46252 -197052 187796 418853 103414 126088 -234353 -188753 -259418
25262 -259418 -512480 -416185 -415136 -671800 -605115 -264060 -368382 -569952 -705106 -500591
25252 -500591 -201073 -637489 -343464 -258881 7387 40749 -54200 -171105 -167419 106751
25242 106751 181803 8177 -100754 -116818 -98353 22011 -176723 151817 514628 650067
25232 650067 461449 250090 82053 -14544 -440751 -167643 117688 41835 -70904 121186
25222 121186 525407 73155 -232259 -339471 -341958 316298 162504 -364215 -1036262 -969258
25212 -969258 -825877 -827020 -490269 -252573 -214820 104950 262139 419532 297473 -236972
25202 -236972 -104859 -231723 -439942 -418968 -554392 -551870 -429924 -129711 56017 376069
25192 376069 85576 -93965 -51034 208287 480367 206088 210814 61114 259594 571095
25182 571095 75540 -619621 -374566 387499 608647 228882 -136726 -432776 -304949 -292975
25172 -292975 -204911 -374418 -374693 -278571 -358138 -290356 -55630 -17883 -45794 -153036 -278113
25161 -278113 -301824 -590799 -435792 -129453 -242816 -427941 -499463 -911941 -760567 -523964
25151 -523964 -525429 -651742 -234066 -475203 -809687 -749624 -611116 -349166 351012 229544
25141 229544 68921 179131 287776 698469 747178 661120 621200 196759 425440 556980
25131 556980 589180 613863 324148 -157757 -372896 -622187 -351850 -352721 -53629 -50781 -112362
25120 -112362 -39500 -126966 203461 -181409 -221106 118579 42870 169418 315229 497792
25110 497792 46496 -124060 -174157 62528 225950 461199 60196 74067 324528 103569
25100 103569 -40754 -37214 97002 180743 509119 361109 -183827 -408352 -583228 -136506
25090 -136506 42147 369870 480987 346735 -46111 275793 109989 -229506 -409388 -197550
25080 -197550 -48955 -396925 -525070 -235647 -391480 -450816 30870 742953 727069 156433
25070 156433 280016 548398 122328 -554639 -769989 -497463 -72998 -178685 82086 -183206
25060 -183206 -451221 -234771 38258 340110 442658 214035 -31194 -42783 258607 66531
25050 66531 -385502 -621223 -177621 194474 276331 369604 361369 557773 228918 -70726
25040 -70726 -149836 166249 -38970 -313218 -384675 -81821 -220586 -432934 -305621 -152635
25030 -152635 273058 421517 619647 976941 755629 629974 283850 -104083 -91631 70723
25020 70723 56874 -270422 -577695 -565696 -550711 -700146 -681293 -244766 52915 -12821 718758
25009 718758 1307451 779643 175648 166327 322607 -17743 -63799 -247709 -465112 -275620
24999 -275620 20526 48236 1211 -341944 -351300 -298224 -33771 447474 390139 456901 429632
24988 429632 385530 520550 239314 33311 64041 -150430 -162533 8934 334684 -174421
24978 -174421 -426405 -795802 -868213 -23696 91366 265715 394838 -38039 -249472 -395150
24968 -395150 -559877 -378598 -121012 -276637 -288191 70095 316669 -69405 6618 -253526
24958 -253526 -330130 30662 139522 99507 -42262 -373636 -662389 -854848 -616344 417773
24948 417773 616715 133499 -212359 55710 -137062 -501422 -450069 -295704 -350558 -332738
24938 -332738 -301000 -308628 -486996 -781012 -684998 -411368 -557575 -1015549 -898174 -401838
24928 -401838 -55841 -205957 -180897 -244694 -246341 60561 161353 382821 338313 36416
24918 36416 209013 258512 197518 269450 134963 -74020 -335148 -224750 -191260 -234569 234626
24907 234626 312221 332019 319986 257322 153104 399437 386787 238392 141985 168372 440748
24896 440748 278861 256805 617202 726888 495055 50816 -333481 -91857 231114 103697
24886 103697 205263 116586 -185494 234966 329390 79570 87276 669992 818190 634020
24876 634020 272779 198800 -89302 -113588 97473 -274759 -443029 -44364 236969 461194
24866 461194 878529 898098 384271 87987 179166 18101 276728 562836 619822 528111
24856 528111 214721 -26949 -300371 -372772 -482717 -119417 -161718 -427051 -347480 30395
24846 30395 41202 140789 223603 418368 46827 -15953 408851 696211 573056 846189
24836 846189 677810 235838 215442 586209 669461 448719 321380 -37773 -278646 -120965
24826 -120965 459280 1134907 948765 707599 607557 579508 540344 23071 -447769 -280138
24816 -280138 393890 453940 32976 -135215 -305999 -332696 -479668 -717581 -856579 -1161509
24806 -1161509 -919838 -454351 -155283 88394 141934 238213 208926 51791 81537 -239172
24796 -239172 -210754 117222 172602 -23775 -456126 -533644 -485573 -252637 -347025 -664549
24786 -664549 -749230 -781570 -533233 -192836 245086 291718 -116806 -512297 -884967 -638020
24776 -638020 -68197 -73769 26126 129891 358621 103844 -36644 18745 -218764 -147965
24766 -147965 40511 341138 518496 134272 -487376 -648521 -628760 -628524 -392708 -211088
24756 -211088 -50638 341550 405596 61755 -153243 -313101 -101826 46305 112940 -63421
24746 -63421 -142248 -288667 -270636 -378522 -98369 61988 -94175 -172173 -58961 -12251
24736 -12251 402131 422466 224949 74329 109445 -99928 -28805 205118 232170 270085 111946
24725 111946 -29649 47760 643133 385805 -301706 -229585 -129001 65344 3223 -185236
24715 -185236 -390246 -177549 -606602 -529520 -340909 -261627 -67190 318689 148706 68559
24705 68559 -79216 -74698 -207573 -75831 168099 148521 360564 258260 311060 557850
24695 557850 96856 -133491 -270496 -726630 -571137 -461243 -598514 -212942 146548 311643
24685 311643 27922 -183591 -290731 -149619 -6626 220643 616309 -1431 -245907 56445
24675 56445 134022 26454 73151 277057 315248 605712 674493 517406 719163 451648
24665 451648 210040 -127158 -291085 6477 -565137 -851867 -529894 -249290 -253437 143584
24655 143584 203447 -320158 -474524 -598091 -424896 -457732 -472128 -357685 -283893 -380681
24645 -380681 -552116 -375397 -514496 -363731 -500691 -569580 -567985 -120760 -122363 -141407 -61613
24634 -61613 6746 -161852 -91720 13326 178906 30005 393266 493256 -38609 -468452
24624 -468452 -668557 28632 279922 349122 574300 714489 287666 97572 106391 283553
24614 283553 236473 294520 70852 -191561 -428989 -407411 -229084 -114234 -171648 -235415
24604 -235415 -290589 -328112 -265832 -168160 -351374 -219841 -127255 97528 80306 -179008 -550546
24593 -550546 -490330 -421349 -571115 -450900 -224117 -527886 -506039 -588653 -796553 -999434
24583 -999434 -807974 -692798 -624688 -518482 -409349 -206532 -89263 -375852 -697160 -681509
24573 -681509 -311084 -378460 -447762 -410236 -633382 -521937 -770630 -638019 -50406 -1697
24563 -1697 -101488 -344751 -329009 -444395 -163767 -97211 246049 106005 -110366 -143324 -102062
24552 -102062 33065 366972 10518 220004 194448 -120093 7505 174919 -76753 -318879
24542 -318879 -324823 -673528 -690996 -666264 -753163 -455609 -385368 -111158 -28317 -32633 -114679
24531 -114679 -186697 236634 559998 692855 404245 -100590 -290171 -486501 -408357 80728
24521 80728 448517 462888 483940 512445 400526 458731 168325 -53656 102114 163774 110890
24510 110890 123242 287136 528360 101305 49273 -248621 -86225 -249931 -884215 -929333
24500 -929333 -581763 -88496 -183749 -654153 -663108 -180870 467933 611788 520817 233242
24490 233242 131209 -283708 -261363 2614 9804 -476780 -874324 -968243 -742641 -131257
24480 -131257 9784 -1151 -60598 -165052 -416825 -378317 -173386 -5912 439724 657610
24470 657610 528378 91570 -28153 227374 288876 300321 77640 -283797 -93920 -60784
24460 -60784 -25408 225381 450867 289058 -16966 -33663 -37808 -109996 -280740 -58567 356999
24449 356999 162373 -312374 -401732 -131787 433173 438830 243868 -91659 -50932 -358724
24439 -358724 -321397 -390361 -277526 64031 -118162 329639 361340 385373 430061 96798
24429 96798 296654 55050 33798 437738 577617 1004891 1084854 611765 119183 138440
24419 138440 29826 -441493 -256099 137937 57102 -170930 -150006 -30970 349846 150811
24409 150811 91889 72985 -24210 -113557 -162949 -380568 -86381 365778 174262 16409
24399 16409 129786 86966 -212556 -407356 -480686 -475341 -629364 -733539 -726411 -821649 -544719
24388 -544719 -377956 -343625 -608546 -406596 -54138 146052 123573 349073 544980 508326
24378 508326 411615 242714 109543 -182620 -589440 -397811 181530 48122 -393318 -301793
24368 -301793 -121846 -4594 298280 272563 26785 144002 437417 505743 2836 -456171
24358 -456171 -436441 -536142 -496810 -426906 -679577 -598111 35436 441830 343173 146767 -16419
24347 -16419 261187 33142 149355 -62785 -72812 176712 91120 -306614 -515262 -27475
24337 -27475 247027 568267 883857 583757 490849 566125 618014 405204 321308 227156 22768
24326 22768 -86919 -138080 -161767 -198463 -349561 -545232 -382563 -282591 -365560 -508278 -372266
24315 -372266 -59796 119229 147098 167805 533535 449762 33312 -31847 -42310 81094
24305 81094 -133970 -286504 -120289 100334 298795 333670 60577 -263500 -487369 -765441
24295 -765441 -610588 -442175 -99135 -668426 -651814 -443085 -173904 100359 385330 680803
24285 680803 1124837 1046682 773126 230252 -308200 -370145 -398556 -31985 215638 281196
24275 281196 123990 238216 36529 194097 39224 -314479 -938923 -1123872 -1097517 -363428
24265 -363428 -152313 -487530 -194197 72454 -244016 -404695 -136117 -167073 -507122 -399800
24255 -399800 -317304 -260825 39648 192571 361227 200506 149076 128714 13292 15683 167439
24244 167439 393273 35575 -55773 106019 211246 -245325 -297208 -441867 -112292 280436
24234 280436 116454 -99883 -75248 268624 267783 58760 -70174 -64279 205581 -39536 -401384
24223 -401384 -291544 -647555 -778756 -359971 -617059 -560966 -537906 -237756 211543 165729
24213 165729 414854 644529 476422 259787 -89335 -479362 -486231 -552467 -471353 -283063
24203 -283063 -383580 -234019 -50859 16783 290986 807710 745511 662731 663011 125990 -106689
24192 -106689 217114 217939 312169 482416 497328 528143 437567 54363 -75481 213081 82483
24181 82483 186108 318833 197226 376776 483733 438140 -11923 211434 318242 365278
24171 365278 244726 72182 100605 187571 85062 -121735 -31977 35301 -175382 164906
24161 164906 744542 740723 664737 254850 302615 298635 -26084 -310892 -213713 -99759 -23537
24150 -23537 -23231 -379125 -171151 -165978 -526911 -771073 -1019278 -1081229 -1252636 -1428386 -495912
24139 -495912 23275 -81960 -196676 -334052 -498460 -478008 -336189 -396862 -426467 -93192
24129 -93192 172930 13833 -311671 -385029 -287251 -464003 -473037 -125671 55985 -91356
24119 -91356 -203091 -129220 -40758 -430794 -604468 -367654 -665683 -807594 -708766 -531079
24109 -531079 -497856 -530337 -328710 -337020 -46304 -234974 -210197 250235 588499 610609 74448
24098 74448 -91491 253695 205136 240647 294933 315745 134444 -164992 -299786 -48291
24088 -48291 -157378 -256519 -504228 -598702 -236771 -77188 94274 534529 800068 794980
24078 794980 625000 497619 362531 31145 -310460 -252286 218963 300340 137529 -148611
24068 -148611 -129014 80841 -4353 -292859 -159237 -262446 -166398 -79551 -91483 -11811 -221226
24057 -221226 -123477 -129742 -62250 103470 174278 356850 187537 103319 -214537 -302007 -260921
24046 -260921 -218802 -191299 -1571 -131110 -43603 -570816 -832838 -937623 -676798 -483819
24036 -483819 -417241 -176972 80092 299856 716364 591457 423085 659397 390496 239102
24026 239102 72663 -338149 -506708 -496948 -770154 -694545 -305750 -264547 -486210 -170540
24016 -170540 104545 358296 208454 -98642 -127198 -32372 344817 625055 329931 122303
24006 122303 435061 227502 -78539 -211049 -29970 -218849 -162800 -80958 -10259 -270032
23996 -270032 -511718 -527793 -334460 -235906 102354 85417 -108254 -106641 99701 517794
23986 517794 -178212 -473466 -398459 8958 259459 -11275 68197 -25058 -162083 -140242
23976 -140242 -40683 286678 274028 -278150 -702182 -837969 -302564 -308406 -528768 -233999
23966 -233999 20091 271464 516602 705182 574461 66554 38503 81420 74436 -456711
23956 -456711 -1033187 -874296 -611587 -328432 -315898 -111970 -291804 -806252 -427164 76219
23946 76219 -200087 -212243 -292168 -300064 -149081 -113417 -399587 -659838 -422648 -644065 -1165299
23935 -1165299 -961489 -668475 -358268 -168271 -83182 -123660 -119927 -197811 -184020 -33781
23925 -33781 8469 -2988 -245519 -63318 41284 -253431 -260423 -496538 -509649 -34048 334106
23914 334106 -203713 -325718 -107727 -33859 -270230 -406056 -532677 -619143 -235638 -6577
23904 -6577 -63663 -118358 -68090 -271453 -482920 -897844 -1072895 -850555 -200684 223190
23894 223190 75913 122707 141479 -64771 -141662 -226146 -42190 166046 335886 193324
23884 193324 163286 -133872 -63362 -245873 -18594 172996 53218 36627 231412 171431
23874 171431 200999 265842 328106 632279 352469 11364 -68344 75743 -436690 -470372
23864 -470372 -511998 -342033 296354 58541 -252300 -323182 -195955 -136796 97972 133039
23854 133039 -6664 265131 621416 682254 681492 503774 -15432 -327561 -393725 -494842
23844 -494842 -258848 105546 28145 -49131 50998 -83303 -163701 -423946 -33148 127924
23834 127924 -225413 -28526 -173241 -217619 -351792 -265575 -189271 -177415 -521362 -686284
23824 -686284 -781170 -706833 -895017 -778884 -406964 -1406 130656 40975 44986 -222316
23814 -222316 -374794 137829 516843 785134 606833 201747 -222544 -423922 -535541 -327151
23804 -327151 -504608 -515939 -602609 -600334 -597071 -358915 -442 372115 577950 346875 -42028
23793 -42028 -167274 -255679 -480463 -539278 -433792 -188844 -564839 -477519 -189651 -217157
23783 -217157 -209427 -60867 -124474 277114 445200 492066 605184 501791 366745 -52163
23773 -52163 -307914 -625356 -846506 -460300 -63845 -142234 37598 208931 -100670 213599
23763 213599 1249 745 62184 -133662 -231633 -45476 539880 611879 240162 169980 406101
23752 406101 92823 -74382 -122346 -212901 -551081 -421114 38077 -251842 -138081 -312868
23742 -312868 -376178 -507224 -598990 -525450 -242396 197634 519510 261945 95706 -41504
23732 -41504 41 223076 284103 465763 662555 665454 560175 803698 638989 530049
23722 530049 539525 581413 235968 244880 169527 120969 -92887 28712 -200635 -245459 -518178
23711 -518178 -255929 -367628 -278616 -458958 -615965 -736104 -638249 -538240 -420230 -253029
23701 -253029 -357180 -411297 -446060 -371431 -18755 178757 573942 689149 180213 -151756
23691 -151756 -401284 -465681 4499 307804 208284 -26461 -371858 -236944 9341 25031
23681 25031 -188352 -587481 -616205 -297615 -122767 -17577 -142915 -426900 -391335 -415420
23671 -415420 -797465 -1108509 -836641 -494091 -204992 -88155 -86920 -468302 -535543 -447692
23661 -447692 -128517 -157022 -526468 -801082 -557973 -371586 83748 -63178 -263328 49623
23651 49623 256515 -8840 -443997 -436187 -52263 110257 196005 639758 452455 -102637
23641 -102637 -11335 147807 -218249 -405321 -792860 -811253 -496426 -202074 -125267 -199805
23631 -199805 -365544 18074 779926 983856 885866 408462 402490 442794 208151 46124
23621 46124 101712 166163 -123962 -345470 -46254 152797 168410 302522 517437 417383
23611 417383 87854 300908 215712 308574 542859 469892 63611 25328 103570 100856 229758
23600 229758 316308 656680 377450 82529 162987 308355 304155 132930 -197204 -122003
23590 -122003 300130 153486 300272 248129 22268 -272997 -530649 -405121 -330529 -277653
23580 -277653 -121863 -224554 -387610 -644010 -666098 -478058 96356 137177 -172756 -357603
23570 -357603 -83258 38774 -231899 -54967 -154331 210674 -111 -164434 -169419 -273327
23560 -273327 -409552 -280058 -583439 -366334 -215599 -178216 -81207 268225 189628 187313
23550 187313 185381 345215 495314 -92851 64092 173115 377183 267500 -377887 -630614
23540 -630614 -803665 -547964 19878 226927 127875 192973 156468 48619 -99812 -166984
23530 -166984 171006 576881 378078 -6470 113823 18496 -38070 -166262 -513843 -515176
23520 -515176 -343262 -186872 47710 167122 171479 219335 569637 434851 164327 -274139
23510 -274139 -600895 -200430 -36627 84230 363126 276321 75900 135242 162303 158584
23500 158584 -123337 -310555 -93802 137425 413458 371520 742515 778317 797163 897051
23490 897051 912934 603333 601425 709609 330472 29430 -126569 -551797 -518138 -269696
23480 -269696 -110820 2144 230182 222651 255565 238614 247560 40789 -346840 -92678 -125938
23469 -125938 -439990 -738582 -192448 -88855 -203728 -149085 116355 289756 151113 277128
23459 277128 199576 -10775 -152109 -676343 -780850 -598465 -786679 -548733 -151178 42680
23449 42680 -72343 34189 22427 228339 401369 95100 -164868 -133950 -537358 -540075
23439 -540075 -343762 197959 558611 409248 -12177 -92658 -148895 -518461 -269318 29953
23429 29953 -212401 -415883 130022 52456 -389637 -514388 -183754 -61031 -23985 -13580
23419 -13580 -91506 -99649 429947 673685 193970 -81793 66975 497424 947382 873302
23409 873302 -17302 -1065927 -981137 -986394 -814357 -418993 -225826 149466 175937 175866 -50382
23398 -50382 -61843 4021 27878 94929 39707 1913 11616 201783 513947 519472 -237786
23387 -237786 -266240 -147760 -226715 -365039 -62830 187312 -47980 -231523 -346172 -604464
23377 -604464 -599399 -497498 -302847 -646193 -591272 -482081 -256047 80020 -322588 -552992
23367 -552992 -410638 -524182 -373162 -60470 -58903 -89752 -20508 131271 -318804 -137010
23357 -137010 -294313 -191400 220217 39693 -430298 -584115 -199748 -36628 -78213 -116472
23347 -116472 -44525 -249804 89255 -9144 -29539 -75878 -225752 -233569 -41174 409 -518897
23336 -518897 -563780 -442657 -760884 -945829 -869134 -480579 -166710 -94564 11349 135902
23326 135902 149468 -286112 -1639 357931 419786 337025 102242 74355 211167 412684
23316 412684 295803 -129529 -379842 -479130 -729673 -354624 1155 72650 117759 27382
23306 27382 -293625 -291637 405171 430441 -107965 -397747 -85161 172419 84582 -233514
23296 -233514 -214619 167103 41759 -132974 -63107 -328705 -730636 -629317 -356928 -106405
23286 -106405 -64723 365330 598676 611458 -38344 -696279 -606249 20615 337723 552893
23276 552893 432568 426422 280814 -108839 -176224 -143818 -228804 -28236 -29178 60784 -58198
23265 -58198 347813 158524 215222 59968 390991 464251 296840 526704 468200 173639
23255 173639 -177529 -486067 114657 323417 147339 83633 -109540 -111072 303365 234747
23245 234747 117433 -471298 -373950 -32219 -105258 194553 236664 526906 1022414 1154311
23235 1154311 948601 710943 863731 707927 239324 110750 354595 156009 -67154
23226 -67154 -113182 -216768 -525462 -443565 -100592 116243 -81948 -528097 -505550 -163167
23216 -163167 -282699 -350483 -397093 -855425 -1326941 -766505 -384633 -550044 -553766 -455940
23206 -455940 -266820 -461425 -526978 -480845 140364 263429 -32631 -465868 -546404 -279189
23196 -279189 -399733 -568737 -449050 -216386 -212576 -26274 154657 407470 -154511 -344458
23186 -344458 -750071 -709438 -505353 -510638 -315205 -11248 -91308 -303179 104304 397137
23176 397137 700054 711306 166263 -169102 -86526 -183305 42241 522946 580693 313886
23166 313886 374491 574250 519381 460454 324271 435580 246018 283754 668561 868971
23156 868971 301893 -100267 -110525 -75907 21124 394590 66804 276572 398883 292341
23146 292341 558636 722852 271183 -39166 44176 284835 -385273 -1087742 -772727 -32952
23136 -32952 153211 -251476 -190304 -102303 256295 -78548 -154641 -89248 -102822 -192034 58409
23125 58409 -294467 -398938 -428731 -669981 -851516 -714890 -808712 98908 581631 202065
23115 202065 -51668 70061 -141417 -519123 -47549 421798 710158 962142 605582 329176
23105 329176 181130 206108 203089 130609 -71808 163917 -154467 -356702 356547 492027
23095 492027 778155 694684 577043 542855 893481 579801 581801 499204 208551 -99553
23085 -99553 -296687 -280391 -18125 -150668 -263015 -175224 -323711 -531703 -21087 384308
23075 384308 181434 99601 523887 159359 87794 80410 -207803 -290566 -273534 -278109 -371843
23064 -371843 -688289 -768467 -828538 -569500 -467108 -583889 -1061226 -551150 -180976 -278805
23054 -278805 -299922 -459142 -74810 -300533 -553547 -257842 -189044 -502206 -579670 -548690
23044 -548690 -558575 -183374 -192683 -755724 -712844 -783024 -553788 -125877 57713 -606199 -442575
23033 -442575 -265747 46031 232151 -7440 28297 447934 992441 1118249 772472 630593
23023 630593 3868 -277757 -399994 -399300 -335843 -528091 -738110 -737433 -832986 -570615 -348294
23012 -348294 -195954 -234150 -499999 -443409 -112126 -150729 -580190 -317727 -63478 118552
23002 118552 379997 265202 301962 134919 -198502 -479411 -598688 -370193 148197 311092
22992 311092 323804 361035 405281 497515 127317 279956 323792 75257 -173865 -413850
22982 -413850 -692950 -756002 -566230 -294841 -41028 91352 263522 -88343 -483931 -542301
22972 -542301 -141319 140661 83388 9032 -236322 1057 -68978 142871 178401 180312 630030
22961 630030 725884 368775 67084 -12674 374377 825816 644970 383684 192184 18012
22951 18012 -45069 179835 223190 216972 425094 212121 -93087 -213382 -240382 -227369 -106902
22940 -106902 -451507 -507859 -647789 -365741 -32558 -66003 -2319 34294 139771 159311
22930 159311 461849 577680 490360 392704 453966 514551 678363 673129 765047 526601 471398
22919 471398 171375 4381 -147506 165243 330331 439195 542659 655123 484612 -49012
22909 -49012 -701207 -827964 -861018 -876363 -137591 244694 171457 360996 381675 273101
22899 273101 -210907 -421499 -139631 88093 222339 -36709 -249104 -88150 273282 254113
22889 254113 389324 529429 779633 1216443 630191 -379040 -530760 262340 465857
22880 465857 -77891 61747 99989 -107420 -571 176206 213017 261206 83656 -116631
22870 -116631 -303316 -534872 -743632 -829366 -773008 -474822 -143927 -249445 -319361 113714
22860 113714 400799 -39462 -193715 26749 119867 29269 -91182 -99884 -304249 -811450
22850 -811450 -833680 -827353 -557364 93580 6715 -375293 -419844 -159974 63934 291822
22840 291822 358019 -78371 -311829 40744 165692 83300 -27169 -41604 -20867 529030
22830 529030 891644 436962 40976 -301411 -672478 -568318 -638971 -421138 -204382 -291545
22820 -291545 -155710 62848 -88341 -39438 -52817 -111016 -5191 372181 477349 552349
22810 552349 457586 383673 433818 98717 -224844 -308327 -311312 -341341 -321122 -300423 268532
22799 268532 555793 322108 51738 -480452 -674066 -179570 440556 375212 68753 284235
22789 284235 -51819 -513108 -582259 -205728 -387935 -294682 -474608 -188250 -57932 -140342
22779 -140342 -236089 -299121 -470218 -394665 -631717 -584669 -369481 -133140 230728 21463
22769 21463 -246259 -214267 -538210 -812977 -977460 -735401 -578701 -379838 -664517 -870634
22759 -870634 -492936 -64320 -251838 -342608 252927 379020 274400 -269854 -385355 -506281
22749 -506281 -637919 -425269 -303792 -437794 -681578 -609542 -150407 -172347 -446210 -220104
22739 -220104 137180 370805 136921 -243943 9705 30639 253392 498528 190578 -314894
22729 -314894 -265926 294797 -103165 45217 352735 262488 362544 167707 -394565 -460420
22719 -460420 -125651 -207959 -475678 -715133 -433614 54625 32250 -63686 -316457 -353442
22709 -353442 -208820 -812071 -546573 -74720 223737 255192 456860 683578 337308 -155711
22699 -155711 -332616 -320586 -578090 -511311 -180284 71619 -166608 -487785 -147138 -74380
22689 -74380 -212235 113265 302416 313845 212196 98384 -298133 -461517 -592042 -481561
22679 -481561 -862818 -800827 -355040 -52952 172599 103168 303161 520519 142498 -30626
22669 -30626 -30897 -76286 33767 49348 311194 236238 213334 182369 -35264 -69682 18634
22658 18634 276277 499517 286055 372978 600170 721594 821924 893374 589725 439699
22648 439699 478755 200312 -385920 36539 193015 129559 118120 -10988 -69078 -10625
22638 -10625 -16553 292418 546912 582720 498467 552317 550445 266176 215261 7131 -349042
22627 -349042 -498836 -523502 36814 262707 118093 -99903 -397057 -509283 -141967 6985
22617 6985 -490275 -644273 -541285 -238978 -392208 -357433 -88394 216775 261698 95385
22607 95385 47720 -240081 -510155 125841 227849 256832 -40295 -208941 -120641 -249757
22597 -249757 3779 -83153 -215714 -50455 -794768 -1162078 -1458657 -1151322 -1012552 -588196
22587 -588196 -273214 -68186 -156150 -120720 -255583 55662 273988 -94613 -194943 -121223
22577 -121223 112886 -78889 -61593 2771 -45870 -251514 -7517 222791 400614 622729
22567 622729 641749 262659 154491 -99860 190736 111075 -114035 -109150 -226730 -108826
22557 -108826 -160426 -815414 -910389 -403405 -180265 -68924 76213 -207748 -424489 -764156
22547 -764156 -800250 -1096997 -1005710 -442361 110894 220781 -126231 -488063 -780591 -497438
22537 -497438 71384 -99360 -700425 -839752 -830474 -243203 404919 428960 231027 431908
22527 431908 100431 -176510 17500 432448 375216 152246 155749 219701 423795 98928
22517 98928 142429 465570 49253 82249 33186 524745 641855 214846 -355292 -27746
22507 -27746 323275 -300565 -256075 5892 236022 408862 465397 449256 -138559 -640912
22497 -640912 -215964 -106163 -271557 -176951 449020 581713 743318 648977 447753 -76087
22487 -76087 -86796 -132686 47170 500724 679114 674122 302368 354985 394478 -83696 -362156
22476 -362156 -737303 -706472 -579056 -272067 100777 -225996 -732167 -1029815 -919259 -518390
22466 -518390 -561683 -676890 -527461 -573598 -711108 -503176 -208023 -336171 -344060 -94789
22456 -94789 13417 41893 125842 -182 -539982 -358292 -358058 -335108 -236553 -56857 -49873
22445 -49873 -88905 -105775 203179 245081 546 -43127 114388 359259 505151 443333 295405
22434 295405 74649 -5592 81045 32474 168843 35901 -359882 -300377 -280187 -517304
22424 -517304 -364727 -451937 -57449 315577 987420 847960 943544 893660 503013 376801
22414 376801 124141 -309216 -417947 -812259 -952469 -1005264 -1007739 -629732 -347566 -332592
22404 -332592 -356329 -384982 -444820 -189451 -713162 -779589 -657485 -366693 -381028 -288716 -186170
22393 -186170 -281677 -199290 -44608 226503 594273 378724 439293 220554 -119499 228184
22383 228184 298199 86391 306829 379555 39861 136661 -65147 -485216 -338330 -408246
22373 -408246 -574358 -303931 -173791 -200045 -35616 14194 122327 47009 -222042 -588272
22363 -588272 -954294 -813975 -283518 -364523 -462076 -569836 -439945 -220480 81575 112182
22353 112182 -427682 -762123 -991852 -909388 -601372 102106 40608 -218893 -377035 -614687
22343 -614687 -460581 -536666 -518420 -657329 -784242 -1077772 -915990 -459267 -2592 -79595
22333 -79595 27203 337586 536130 33690 -411519 -460026 -85664 -93969 -68969 -20085 14703
22322 14703 341061 470810 325889 -359149 -624634 -365496 -397377 -385830 -453007 -747043
22312 -747043 -402469 -57059 -161712 -12667 -267347 -152065 586863 935729 831704 614174
22302 614174 281254 429107 371648 115062 41710 -374480 -740759 -496472 -144644 84243
22292 84243 478153 230246 -132039 -282408 -464603 -261654 -425818 -336812 -158345 78328
22282 78328 81358 81130 146149 -79199 -287118 -277368 -47495 225601 304583 -52423 -171796
22271 -171796 -299377 -549002 -911863 -466256 -2107 225909 248756 -79980 -254841 -47241
22261 -47241 -412727 -467568 -102110 27375 308643 198042 78627 232928 1426 -43924
22251 -43924 362833 77701 -325476 -18155 -65037 198261 317056 -168790 -245173 -237384
22241 -237384 -393764 -279375 -360329 128603 -41972 -655422 -903695 -960128 -485787 -115668
22231 -115668 -164916 -264276 -363234 -359720 -56322 123407 -251717 -534831 -560889 -166667 -351075
22220 -351075 -480752 -440552 -219596 -183314 -181948 -277915 -27711 -158132 -84087 -37600 188189
22209 188189 392475 885048 326823 177235 104459 57853 326875 62573 -129724 -235623
22199 -235623 -239583 -228708 -446312 -629435 -546724 -430137 -365225 -711277 -764049 -472367 -723808
22188 -723808 -837900 -1253157 -873706 -760732 -1114586 -438320 -95118 -480195 -598070 -576166
22178 -576166 -470843 -689119 -974540 -753854 -427658 -515629 -523071 -416684 -481404 -637616
22168 -637616 -698815 -483673 -122559 -249171 -295594 -73305 93380 194665 -152657 -126847
22158 -126847 124672 174794 -26519 -191015 -9437 44399 -91935 21467 -211636 -128042
22148 -128042 252759 438341 158907 258246 290253 -123282 -686858 -362365 -347750 -722248
22138 -722248 -562901 -558946 -448563 -573886 -414331 -184116 158162 634068 906341 579395
22128 579395 122207 19937 92216 -24165 -152136 -494950 -920441 -896211 -994539 -1073529
22118 -1073529 -798705 -358050 137303 155183 113474 -103019 -263705 -580796 -1254264 -1262046
22108 -1262046 -749708 -145484 19505 20517 8240 -88973 527062 605494 -40802 -400322
22098 -400322 -314414 -280548 -133879 -274284 -218744 257589 730157 805028 636047 221339
22088 221339 125620 601605 521744 251243 173261 40973 65046 -294867 -386806 -393970 -282037
22077 -282037 -849680 -1027355 -729308 -476884 -497172 -152574 207420 -168877 -38663 250297
22067 250297 -110310 -408433 -133731 -466213 -475721 -310821 -257625 -264744 -303644 9641 187523
22056 187523 -387980 -662681 -192628 12330 -155899 484700 595204 174772 146607 1914
22046 1914 -111233 33286 -202206 -378488 -337540 -286743 -254105 -312591 9654 67342 -199378
22035 -199378 -361808 -570432 -325056 135638 176187 132621 162696 140590 -249755 -465854
22025 -465854 -535997 -600441 -369227 67645 425252 621610 579115 454017 573838 526462
22015 526462 331564 182520 204826 156319 62232 -204928 -459688 -675235 -633377 -146042
22005 -146042 202099 279409 626833 632994 50 -439883 -372649 5664 -68219 75730
21995 75730 171349 -30160 -259882 -549232 -121467 357056 383330 181367 26338 -64126
21985 -64126 -41825 -281289 10771 -42143 -408732 -544982 -405837 -563726 -533522 -345940
21975 -345940 -270400 -355033 -91205 234008 92494 -344549 -163149 228991 93788 155374
21965 155374 251340 371401 194395 -29665 29219 135703 -181397 -321993 -97792 -297663
21955 -297663 -611367 -326089 -539775 -725934 -880365 -810498 -735565 -622013 -662911 -441731
21945 -441731 -510369 -409653 -564405 -755979 -581288 -253721 46182 -298450 -630831 -810420
21935 -810420 -349787 101430 208264 -261449 -215636 -83903 -362658 -328869 -319106 -78288
21925 -78288 267652 5768 -431053 -243191 -209620 -71894 472518 567098 644628 413034
21915 413034 262934 -138447 -376826 -50291 13588 170372 251763 409615 681836 728555
21905 728555 914929 734446 588448 416571 348914 195734 16458 197826 340705 517927
21895 517927 646276 612895 708188 461751 144708 128838 187801 185304 -54400 29324 128380
21884 128380 -514234 -765309 -440942 -686955 -630661 -238672 -201324 125457 -38858 -241342
21874 -241342 148352 593996 569070 334835 -8308 -23870 142551 240041 -65373 -669176
21864 -669176 -795388 -612246 -611471 -651529 -309580 -187322 -71865 99959 -263498 -958710
21854 -958710 -660826 -473653 -364215 -709190 -764748 -639872 -338513 -227207 -72527 -476177
21844 -476177 -523604 -721004 -360525 151250 598624 456814 235813 364013 127336 -318518
21834 -318518 -214265 113715 -4309 -360950 -501321 -171925 58290 -81360 -60212 228172
21824 228172 118999 -174290 -30403 128709 -299274 -81082 273780 268037 182858 491359
21814 491359 1042476 672312 238060 443204 725975 403074 360235 596643 442504 225333
21804 225333 -194441 -83138 -4358 139254 540793 388667 244067 250230 -92870 -647656
21794 -647656 -815178 -865340 -427438 -356081 -361836 -476507 -346482 -381105 -240466 405533
21784 405533 361835 282335 -89118 -531334 -466077 -347142 -45456 216354 114376 37886
21774 37886 -27383 -276839 -184391 17282 110054 336873 374684 291903 -66959 -146994 -486271
21763 -486271 -526702 -258208 27501 141382 592439 466961 199573 522600 595937 528641
21753 528641 300962 236924 664134 663274 275040 216991 131824 464985 607846 521919 636641
21742 636641 540116 478616 645470 345714 90114 25022 317104 128443 158329 377754
21732 377754 557728 419911 235565 168125 49161 69906 -228204 -267889 -38002 167435
21722 167435 431680 625824 138471 265388 368393 38143 -36193 253523 178583 133174
21712 133174 267380 -150039 -107094 77807 188630 -102863 -269765 -130003 -161702 62738
21702 62738 113647 274756 313217 -206101 -477295 -329109 -430248 -635013 -2761 -125557
21692 -125557 -623090 -966048 -858167 -695490 -195087 56556 306988 56785 -116570 -1392
21682 -1392 -68707 -118179 -223276 -80567 -63006 -124426 -308331 -186880 -339629 -687472 -744552
21671 -744552 -98593 -184305 -383537 -184175 50195 -150811 -594189 -838591 -716924 -348909
21661 -348909 45261 -208509 -127520 130324 -371012 -579237 -227134 -154061 3734 -127041
21651 -127041 -679371 -928577 -349857 269278 322479 -128620 -389026 -484502 -489964 -775789
21641 -775789 -911027 -713514 -587967 -408159 -169873 -30565 128085 38268 205179 308613
21631 308613 539080 541656 173427 274539 326107 -49347 76502 300599 266340 225594
21621 225594 -120471 -296961 -309427 -410279 -48610 253591 65039 100178 -22498 240538
21611 240538 790921 1417456 1652862 1562187 1700685 2171562 2067576 1952488 1764244 1577114
21601 1577114 1646110 1668556 1693943 1510636 1571946 1362353 1125822 1397266 1618302 2022819
21591 2022819 2042633 1654972 1645831 2230039 2461232 2004623 1988400 1937824 1694514 1549041
21581 1549041 1290500 1314334 1408171 1364962 982955 581403 307883 253487 372661 487300
21571 487300 456232 590258 473972 518137 792027 245994 130341 344041 276339 126061
21561 126061 68405 653840 577142 291300 95173 -449482 46202 -13044 -548887 -320879
21551 -320879 78695 484950 131937 -15666 97730 70506 493254 785906 363128 -326929
21541 -326929 -565968 -767873 -784636 -500592 -324874 -508625 -730195 -856728 -684506 -305100
21531 -305100 467529 199017 -143443 272388 354457 540850 566951 297359 331363 108976
21521 108976 -55815 38091 202250 184588 11346 -229969 -191875 247705 432635 212948
21511 212948 22407 -67011 23897 132732 -209213 -533743 -376601 139435 424108 312099
21501 312099 372510 180930 -111473 52954 406354 476972 191233 169632 419319 748826
21491 748826 333193 4666 54504 207325 403094 218658 32300 181779 -160375 5596
21481 5596 127004 552982 719928 538252 486821 458087 700288 593545 233160 284384
21471 284384 447630 433181 382327 192423 -21707 451546 404441 -346230 -674175 -672055
21461 -672055 10987 334921 399677 425341 125993 -124884 -611933 -577644 -368223 85559
21451 85559 170300 179774 425282 522749 -12563 -262122 -133728 247334 454656 122158
21441 122158 -108589 289249 393717 -302450 -849463 -561023 -444207 -49762 62731 -197117
21431 -197117 30134 69372 -180175 302086 832610 150104 -339437 12756 -210847 -285862
21421 -285862 -45986 -55591 16399 -530614 -1014306 -1213697 -862002 -700075 -549661 -29087
21411 -29087 -82928 59502 227737 136873 -178597 -586104 -356024 -503499 -624933 -459210
21401 -459210 -211971 85446 538840 484788 138854 -146257 -613244 -804427 -530342 -423271
21391 -423271 -515602 -586254 -374614 -697021 -792238 -442861 -98282 -263564 -330062 -297982
21381 -297982 -186383 114970 -115812 -457603 -499207 -256263 -20523 181733 115696 -121055
21371 -121055 -144413 -67211 -78520 -121832 -226090 -83067 135073 163782 348073 451445
21361 451445 380778 219536 367975 232956 251345 -52639 145296 31739 20763 -186590
21351 -186590 -471700 -176213 -553227 -542408 -81197 165882 556206 325915 40953 6408
21341 6408 123012 199616 136467 490597 760411 476443 291002 -244315 -335559 -469382
21331 -469382 -438841 -614895 -698987 -539305 -200964 -7514 89825 -222163 -409728 -425584
21321 -425584 -181500 -308322 -284006 188181 352752 -159698 -168221 354745 487267 554648
21311 554648 472883 187973 89069 266041 490983 685443 882517 694546 506285 648080
21301 648080 479890 341649 94383 141375 366940 328453 540880 517610 435232 -284310
21291 -284310 -385568 -14820 -287816 -65706 -35718 -562 514263 690664 706952 473768
21281 473768 482497 900080 850274 405162 333485 17338 -235119 -129017 -288454 -260000
21271 -260000 -201694 360221 518897 214902 387217 689002 655136 235018 31828 78958
21261 78958 -51143 -422200 -247687 45819 211304 192365 -119280 -23040 187660 648369
21251 648369 433859 271882 230967 333502 579770 638918 222335 -378069 -294453 150461
21241 150461 631315 870872 509616 140131 154983 -61522 -166334 436378 603425 432190
21231 432190 156996 211627 -77843 -782575 -775178 -428088 42613 172563 125291 172438
21221 172438 109286 253053 239459 397324 329943 307097 418827 465162 547348 661177 474962
21210 474962 335641 102289 104101 -227966 -338532 -73452 75853 463242 -36149 -211286
21200 -211286 -68660 -40971 138690 672915 559661 426611 418794 471918 194907 52387
21190 52387 91080 -298385 5029 183130 429209 294055 672249 599784 449389 206876
21180 206876 249106 301193 272394 158021 370946 737607 985165 436954 -142198 -42895
21170 -42895 391978 478677 273837 849969 1059680 1056023 457917 94148 202480 494422
21160 494422 490913 694219 683689 237564 307901 243650 -96254 -151825 20022 522167 481999
21149 481999 632478 601680 479934 528062 548118 923425 737378 238967 511614 836219
21139 836219 839904 509975 117418 229735 325726 656138 1048324 1126153 1129904 942644 488390
21128 488390 745329 968663 1103453 1034554 1010797 944094 568732 793011 557731 709912
21118 709912 1067544 961203 1132921 1447644 1143758 737471 555743 588524 1024008 904272
21108 904272 1133680 838779 783863 771070 673463 520098 506075 288827 173276 48453
21098 48453 56718 529144 806389 824538 832521 1005556 963708 1023260 1049636 1499789 1506858
21087 1506858 1529305 1559638 1853669 1532379 1464192 1858959 1934869 1931304 1885609 1662047 1534901
21076 1534901 1056216 1157207 1328269 1397340 1443691 1694858 2213726 2602554 2866821 2778197
21066 2778197 3075538 3275103 3061548 2886555 3322844 3389789 3734804 4447788 4984635 5339045
21056 5339045 5434417 5614045 5982355 6588902 7331245 8072808 8262655 8453043 8674137 8719527
21046 8719527 9119987 8868425 8762415 9704039 10850388 11679285 12580822 13653726 14562257
21037 14562257 15310163 16240438 17668335 19010505 20864600 23166703 25145572 26623601
21029 26623601 28574633 30865818 33567862 37018124 41410509 46529266 53406835 62616384
21021 62616384 75670995 93538962 118024863 151289048 193586255 244143466 300213847
21014 300213847 355899741 403524929 432693847 443566705 444896744 437782689 417707405
21007 417707405 380718237 336597971 297549803 270046421 257715395 262445699 283418436
21000 283418436 317467462 359467659 403842470 443265617 465539070 468431145 461203411
20993 461203411 445799571 417638432 371285075 314040151 258596051 210440627 171602828
20986 171602828 141816246 118574172 100945083 87326782 75983855 66861353 59933012
20979 59933012 54187118 49630446 45762596 42370908 39270715 36639300 34133114 31837405
20971 31837405 29840616 28192930 26858150 25798148 24606755 24078082 23799124 22914697
20963 22914697 22071927 21440580 20832471 19932699 19177018 18494423 17639427 16658946 16164935
20954 16164935 15919023 16081384 15714989 15388784 15428877 15278057 14731548 14348790 13400907
20945 13400907 12587255 11862260 11390969 10733538 9582649 8661734 8195894 7802329 7439666
20936 7439666 6972505 6131407 6150369 6128210 5806954 5778610 5268163 5054603 5215135 5531566
20926 5531566 5483486 5040133 4901348 4914531 4798466 4511618 4121144 4258200 3964275 4043561
20916 4043561 4267131 3785768 3548409 3269900 3150224 3272451 3113518 2819525 2563007
20907 2563007 2591979 2338048 2592451 2557557 2369012 2246102 2225471 2132951 2388886 2485179
20897 2485179 2368006 2068660 2159992 2604092 2722316 2603121 2546883 2622039 2608329 2328943
20887 2328943 2146128 2135718 2349395 2511874 2286989 1701852 2132797 2108869 1770425 1938326
20877 1938326 1912211 1520454 1218928 1405997 1487384 1964028 2430252 2608951 2311075 2169914
20867 2169914 2045258 1766189 1861515 2015459 1467514 1263753 1315865 1254433 866722 577503
20857 577503 340517 223755 236637 307640 238532 242889 338678 626978 1029509 813620 630791
20846 630791 746535 680963 582617 371597 307678 709386 524856 463974 672942 505425
20836 505425 415804 448749 1223682 1447201 1311419 1265711 947813 1091813 1025823 1143076
20826 1143076 1278665 1259849 887873 994454 1033870 911480 781224 816130 1406956 1222064
20816 1222064 942711 1017753 1018610 1092057 1015609 923208 678218 629558 267867 -259599 -69597
20805 -69597 -158309 -134090 244535 447456 404800 271919 192761 237961 38809 283922 460095
20794 460095 603352 418081 -157640 -627662 -273423 117381 106280 -22121 118914 814883
20784 814883 726426 359433 398839 464711 826261 960570 1200512 1054353 610246 429195
20774 429195 87590 361970 701657 505609 477764 475746 678476 668272 458719 396003
20764 396003 314566 21730 -208868 319648 978956 771183 454074 738184 586690 100007
20754 100007 -295439 -383432 -24107 -183806 -209140 -538883 -252368 -228671 -104969 44293
20744 44293 -197820 -315698 -284960 -49997 -33327 -151253 60468 18269 313170 238457
20734 238457 -134657 -166410 217990 170971 210527 358121 136890 210833 197747 484408
20724 484408 287516 99253 111327 72815 12979 -50240 -87946 -211127 125228 -39729
20714 -39729 -345043 -463190 -486938 -586849 -663117 -257279 196734 191237 256125 139540 -38993
20703 -38993 108968 -25216 -101737 -135611 -131942 166140 16065 93481 18355 155651 202204
20692 202204 36218 -226618 -102436 -435891 -420518 -264116 -114376 -27597 -23512 11275
20682 11275 341150 505702 892787 777904 575994 559812 514025 218900 -4754 -138039
20672 -138039 16750 4925 414061 483128 684958 1079901 575794 12864 -76002 -650760
20662 -650760 -826620 -560387 -149139 38712 -219739 -735951 -796679 -156108 117131 -239444
20652 -239444 -437770 197601 836721 1037944 938833 661990 364371 286030 199727 369529
20642 369529 37376 -151304 -310945 -354313 -503361 -350333 -4518 38084 157454 369215
20632 369215 445713 367535 -110915 -199950 12954 -1283 -14345 374138 249634 184417 269203
20621 269203 481588 378679 48496 -208382 -456486 -495146 -288800 47132 332209 254844
20611 254844 484399 361244 497259 154337 -298645 -377199 -3924 100324 -324374 -598762
20601 -598762 -744280 -971280 -611039 133481 387769 -39888 -847015 -631294 -558017 -377233
20591 -377233 10489 -126117 -765195 -710614 -299573 -444843 -423542 -271666 -343389 -357547
20581 -357547 -305429 642795 999328 483268 -267666 -179529 255731 615949 678118 548939
20571 548939 446779 68561 30201 61806 117368 377371 75258 -162139 -325056 -368764
20561 -368764 -688805 -697387 -864896 -544826 -259346 -440830 -953656 -864829 -729662 -320418
20551 -320418 -88566 250946 150771 129126 -199326 -413077 -76942 33491 140437 190719
20541 190719 6916 -212530 -428395 -398011 -248160 -445276 -237393 -95523 -192991 -344247
20531 -344247 -595432 -869963 -956053 -720867 -522578 -463809 -145574 -69389 188961 330549
20521 330549 584187 960376 364759 -6789 -539703 -910783 -1049301 -774942 -182373 -118999
20511 -118999 -39334 -180803 151389 584925 604062 333243 77504 40865 -35248 -140890
20501 -140890 43294 510634 539549 346697 264104 429524 97057 -205189 29207 327539
20491 327539 55574 47628 -11130 44100 335434 532917 450021 -63645 244491 2290
20481 2290 110476 445377 624896 414688 441306 547886 688706 398714 453652 411225
20471 411225 542255 506791 603206 598038 309457 32073 63778 -82181 -15340 272543 -16775
20460 -16775 -204327 -83858 -319530 -270178 -343974 -417427 -195424 -353248 -440916 -292803
20450 -292803 -517673 -547485 -60874 68278 479228 357937 -235441 -325560 -208949 -330093
20440 -330093 -118211 -186301 233029 470926 338982 151422 159426 112753 54138 -24619 -349853
20429 -349853 -53144 56814 49730 -131852 26000 252963 -1913 972 293857 503180
20419 503180 648466 671159 984671 1104400 1431911 2054717 2510277 2888889 2789303 2398261
20409 2398261 2130265 2144499 2202368 1798440 1464171 1435770 1415505 1745860 1905087 2004728
20399 2004728 2073989 2018711 2385751 2440628 2559243 2853186 2609685 2059591 1997019 1955204
20389 1955204 1515577 1168793 1090561 1037749 663014 685012 1022752 779774 332148 166887
20379 166887 236247 199415 432321 654105 356742 150924 -247326 -478039 -366855 -68761
20369 -68761 -89171 -114753 -62701 75852 320824 193065 165702 521854 308213 15586
20359 15586 -146917 526195 970805 985397 1054518 1061305 1087737 1177740 1106756 1050394 1296640
20348 1296640 1600392 2049945 2160750 1743775 1673775 1744939 1511734 1060618 580146 768392
20338 768392 821213 885374 827158 551381 532597 880472 1184959 1068343 1310321 1234447
20328 1234447 848523 970002 827687 904797 818097 698057 620121 468101 143388 89170
20318 89170 482074 861012 650090 409734 229806 148971 144477 178282 203039 205292 565970
20307 565970 650809 660089 627069 602740 647863 475573 297183 190654 424235 520632 736815
20296 736815 882440 1201288 1337386 1627958 1986728 1863406 1561449 1066960 920235 1106197
20286 1106197 716589 799276 844056 1138306 1002508 640535 784429 1082431 1603632 2026712
20276 2026712 1960163 1847363 1505254 1286784 1349833 1155065 1271193 1355403 808920 176914
20266 176914 227441 328377 420117 352134 419547 174162 235851 699870 759671 474715 359034
20255 359034 292181 -102117 -427360 -276613 -124730 151549 226616 111850 126270 195633
20245 195633 261376 308016 200943 325696 365805 404752 164935 -394045 -315695 -146906
20235 -146906 -225002 132895 316925 57929 -277767 33449 348637 -278982 -746766 -464876
20225 -464876 -122591 21504 -385091 -638331 -768623 -386089 -362738 -686385 -332792 -26796
20215 -26796 -218312 115170 137532 320123 622718 722635 711021 471973 138104 -106136
20205 -106136 -447579 -59060 194607 621002 993593 465407 396930 578418 247142 -213723
20195 -213723 -183023 13752 416291 203016 167267 73809 429089 667991 260148 150521
20185 150521 191867 107858 304779 377039 107741 25912 -73993 222587 -56419 -778754
20175 -778754 -515714 32044 73920 119948 -20028 199545 433018 337278 408817 538617
20165 538617 7586 -495799 -367312 -194893 -783450 -929188 -779038 -483012 -281242 -404809
20155 -404809 -510839 -219696 -278958 -250681 -259161 -161440 -139017 -73179 -16227 -200618 -316110
20144 -316110 -210369 141861 92848 -54515 -468984 -228854 -70805 -253663 -337006 271969
20134 271969 281717 94262 -144399 154064 404274 300139 417696 676873 560815 436963
20124 436963 157991 482835 757882 133195 279772 645293 859540 831900 961437 763273
20114 763273 233722 19579 7890 198066 -22307 361932 924398 1087664 1221662 823902
20104 823902 244020 -266209 27629 424478 242379 239202 540194 661267 221734 -214680
20094 -214680 -502782 -465988 -107818 204759 60414 36758 -61957 -60085 -208613 -122552 446518
20083 446518 595797 212899 -80496 -18380 -115190 -170854 -181102 -364834 -353786 -105043
20073 -105043 294042 516865 658448 693801 1022582 1106221 628722 194279 335808 337978
20063 337978 224035 177664 192433 257273 650795 604863 399687 578114 832040 1007762
20053 1007762 956850 796859 794254 756076 617466 285537 -131695 -13815 -228366 -78760
20043 -78760 -161550 -286640 -17597 -135269 -335428 -125991 148078 56284 -17572 200831
20033 200831 150075 -19537 -197177 -178848 -124012 -198959 -250431 1882 227918 296320 147183
20022 147183 54073 -46592 278480 371631 195540 -174230 -420561 -142332 338260 724092
20012 724092 451062 -102921 -130187 85499 122496 138576 119093 -233331 -339270 266787
20002 266787 131206 143488 -5853 -47901 663177 931246 843297 1053047 1125355 1268226
19992 1268226 857794 417633 119690 286964 282633 305893 34590 196093 125002 -1406
19982 -1406 22285 614751 712305 245257 395729 570668 590609 -18788 72843 490094 473965
19971 473965 530976 285908 295443 309773 49083 -261718 202753 251702 24316 -300347
19961 -300347 -484654 -439532 -64570 -34898 -169637 -289492 -258980 -316424 -381109 -386350 53945
19950 53945 365007 316047 117239 -431469 -84565 204372 43621 -111621 98688 228841
19940 228841 456476 393642 -25693 70600 112634 -296502 -268612 -370735 -375753 118152 292782
19929 292782 573831 411010 419077 767369 559324 481428 888471 1302654 716725 13764
19919 13764 -208901 92543 630249 1122962 531068 316816 347568 396764 286337 -14842
19909 -14842 -152873 -34268 257715 296786 312025 448433 605546 462838 584816 626509
19899 626509 398154 -46899 -46675 223727 582394 681749 640692 733911 870993 705085 730324
19888 730324 520594 166275 366677 582805 895490 1032038 766033 1007048 987599 1130976
19878 1130976 1119923 978662 999687 787609 827492 830948 1066924 1152528 1568771 2044189
19868 2044189 2438794 2560207 2946617 2995625 2886086 2908910 2865109 2533627 2036751 2190593
19858 2190593 2263594 2202696 2251249 2850996 3031133 2947046 3285851 3668188 3951505 4176120
19848 4176120 4629375 4583117 4552931 4464015 4412063 4429110 4649152 4599899 4846531 5130097
19838 5130097 5836749 6599846 6938673 8350032 9736547 10885723 12977711 13928038 14493088
19829 14493088 14956917 15579849 16425547 17927722 20300453 23668634 28610773 36284180
19821 36284180 47436552 64733022 91334710 129854241 179704740 234602982 285458749
19814 285458749 324771196 332672809 288781737 232944010 184179592 145587211 119438103
19807 119438103 103206103 94813678 93398451 100723775 118389695 148795754 190600713
19800 190600713 239394427 286679661 322993673 332104505 290549645 233013847 181970971
19793 181970971 139998917 109540582 88100147 72293000 59862434 50584483 43963545
19786 43963545 39040645 35394091 33399783 33116911 33161083 32862422 32889976 32841546 32674251
19777 32674251 32128925 31021512 30339344 29830889 30173944 31462221 33883963 38092196 44495139
19768 44495139 54227890 69604331 93850565 129720825 177906726 234556655 292875595
19761 292875595 341574340 370208663 347256626 286504466 228152062 179252980 144201951
19754 144201951 121620865 108782211 103851302 106401513 118866226 145097001 185287876
19747 185287876 235779532 289446799 334534380 362309146 341859818 280773814 220446574
19740 220446574 169181332 129921862 102582012 83378306 68764311 57138329 48194383
19733 48194383 41517200 36327481 32672347 30600661 29530733 28686158 27039654 25035804
19725 25035804 23157983 21298981 19136068 17106963 15527548 13974904 12691323 11895176
19717 11895176 11594996 11507889 11536442 11635271 11457602 11488844 12152268 12537786 12065067 11042756
19707 11042756 9969263 8989368 8250363 7665751 6858811 6159519 5403621 5273001 5074827
19698 5074827 5033428 4829397 4441093 4444364 4514781 4811638 4673150 4420711 4343111 4128193
19688 4128193 4023718 3669402 3613478 3443498 3617340 3822359 3598813 3813612 3500533 3041934
19678 3041934 2944836 2601977 2481487 2880581 3114727 2893584 2719515 2579599 2616219 2669288
19668 2669288 2645705 2531912 2226847 2025839 1959661 1928596 1936070 2100372 1879130 1844042
19658 1844042 2279635 2170376 2046110 1967523 1663216 1710880 1727895 1837624 2137710 1770232
19648 1770232 1602603 1571999 1334873 1375981 1599931 1454311 1111878 1017195 1260291 1500866
19638 1500866 1866530 1639610 1313586 1418204 1612529 1712000 2202059 2232948 2153759 2166473
19628 2166473 1580124 1436002 1218630 1123548 1257320 1257419 1117485 838679 654766 743304
19618 743304 889888 961065 804384 598582 459048 394515 627354 641036 989198 1276154
19608 1276154 1195554 887490 421024 518623 1083190 1081862 885935 876154 1176220 740702
19598 740702 461634 281437 155103 258910 300764 117808 -22609 -214840 -188508 -35412
19588 -35412 111347 433301 411979 236269 157649 508844 879157 598943 832693 1108860
19578 1108860 1094913 1003715 649395 498961 762851 331026 224724 54998 293049 736178
19568 736178 357546 350327 363652 172536 80019 121614 149179 292433 459452 480798 2815
19557 2815 -178369 -363809 -327329 -6174 -117075 2243 59313 69969 54453 -357405 -186131
19546 -186131 -170735 -87785 -1639 172828 501012 740234 1080702 1019240 379067 175453
19536 175453 453560 601696 570376 52266 65486 475 -257781 -252122 -91938 -133645 156
19525 156 326807 955679 944179 526146 505780 135177 41710 249361 640888 449570 173703
19514 173703 373733 659732 220179 55053 -16133 -28516 -203758 -179014 590876 958094
19504 958094 584240 33287 -294619 -158718 -506563 -464760 -397330 -152553 -306962 -319243
19494 -319243 186476 580996 401921 118420 74106 608851 468587 284051 520472 539785
19484 539785 471890 103966 -79449 -139330 -160441 1253 167296 -142433 -463706 -428291
19474 -428291 -338096 -277325 -377557 -803850 -445779 238416 45430 -120149 11774 348888
19464 348888 289289 -69182 80122 -21264 -367868 -77381 -466604 -868528 -746854 -780402
19454 -780402 -621862 -447774 -463008 -254659 111721 393354 429626 -50524 -569692 -420999
19444 -420999 -193806 234997 705589 710045 351335 -165625 97940 346861 224901 -27840
19434 -27840 -571941 -940709 -734050 -663547 -437576 -302734 -374365 -432423 -490126 159671
19424 159671 534879 392463 539780 749953 807411 855486 -19491 -683906 -457350 -297759
19414 -297759 -463321 -413647 -6364 194624 24955 216635 328938 236156 227598 -127035
19404 -127035 -311486 -475848 -362149 -8085 679 77443 -61231 -50617 -182369 -106258
19394 -106258 391572 726986 680720 541094 240161 -159259 -125734 532308 297531 89452
19384 89452 200297 78858 99384 258101 -60873 -121996 151776 702809 696795 303563
19374 303563 379670 442426 397207 161351 163074 64913 -6905 114119 -36993 -377788 -451777
19363 -451777 -305046 -257091 125842 249652 397005 381837 413986 284775 141474 -64257
19353 -64257 -483896 -562042 -93074 198108 148156 -64139 -286022 310187 299786 -188444
19343 -188444 -595676 -302998 159630 337358 261027 46943 172280 244681 240687 -157878
19333 -157878 81327 132276 480244 468434 290340 304820 274110 270473 405211 383834 244296
19322 244296 -250589 -731960 -741468 -699314 -779754 -836585 -474108 -292267 -516402 -452632 224269
19311 224269 439646 61025 -192567 220219 260604 303150 -70814 -2376 215211 423526
19301 423526 493340 384494 334263 305849 300675 414701 433248 -88187 -251549 38799 111799
19290 111799 -300981 -503194 -5609 -51343 109574 -45007 -284437 -284637 155331 417875
19280 417875 423833 451545 641748 936963 880562 765739 992383 1000977 640341 119267 21004
19269 21004 234811 402721 329479 389696 616958 699753 856668 1162890 1793894 1905715
19259 1905715 2124655 1839552 1621980 1127755 589605 307867 529422 665734 681322 534707
19249 534707 628727 261531 322559 464534 543721 560403 558939 433724 15693 106364 392041
19238 392041 532144 586475 607698 791304 897019 1376523 1396454 984040 479772 270090
19228 270090 271306 302027 517744 1033691 1537177 1776778 1837790 1816878 1652825 1598170 1562920
19217 1562920 1010718 519098 409397 334467 654499 994667 1022165 929775 1379133 1865442
19207 1865442 1977816 1828967 1991289 1965040 1624021 1468907 1034611 826028 873343 777571
19197 777571 714158 409505 259117 -161440 -419520 -345157 -99840 18780 -185919 -306773
19187 -306773 -258276 -428061 -200743 -94186 -356148 -719528 -454429 -209461 8759 -92618
19177 -92618 502210 1035729 1058919 1119526 1100675 692508 -3748 -137009 -24816 -333739
19167 -333739 -273865 115032 153719 170482 505319 153764 -289458 -303399 -130816 -287708
19157 -287708 115084 206630 -55557 -339955 -54896 54406 -119244 -629783 -447548 -124059
19147 -124059 -419940 -440498 -45249 175930 50127 -294412 -382603 -56530 -142487 106193
19137 106193 364402 548078 464709 322024 7139 -271235 46608 468390 530764 309688
19127 309688 78023 334563 371057 384610 400734 700560 468779 101558 -9206 47913
19117 47913 40241 -274246 -76076 -204295 -424480 -342198 -45199 231741 373996 289077
19107 289077 -53228 -407237 -431738 -456768 -124379 171447 677550 623963 896498 931035
19097 931035 744858 1168409 1170734 970037 1059512 1364233 1579689 1998252 2781780 2968116
19087 2968116 2616942 2336473 2286156 2467765 2407925 2285306 2245381 2011495 1592206 1421526
19077 1421526 954031 480499 609997 461391 -216469 -390165 -73565 193141 425819
19068 425819 761230 639576 183027 -342 489126 357019 240706 312596 605354 826743
19058 826743 842921 697962 564435 365278 324775 -111576 -304352 -271409 -215530 95567
19048 95567 182502 -4416 115993 192977 -294025 -452403 -144554 83676 382178 976479
19038 976479 1233728 1905225 2280816 2559166 2877369 3077007 2713655 2467085 2232339 2134107
19028 2134107 2004366 1462940 1141845 859131 553895 -3300 6505 -47681 -694130 -791327
19018 -791327 -560357 -186297 408681 278124 353216 254765 -164689 -226094 -124594 -153374
19008 -153374 -347152 -585013 -227127 -106515 -377822 29270 -163741 -85519 -11178 -323620
18998 -323620 -124694 15278 -199891 -322719 -448006 -661445 -607024 -783634 -433784 -280641
18988 -280641 -471167 -480163 -160125 148477 166255 457070 186604 -128676 -169120 394779
18978 394779 228474 -389480 -513995 -596319 -920464 -889603 -665845 -493276 -198906 187209
18968 187209 261005 268275 139331 169406 244575 300387 -424789 -781065 -543278 -380571 -19962
18957 -19962 -10615 -97647 -84050 -138467 17060 152529 350735 344969 -261816 -140123 389833
18946 389833 -3104 -178979 -109561 -52141 325292 126144 280619 737384 1156825 569340
18936 569340 308692 -247452 -287814 -144678 22087 369162 247115 -433082 -228723 -314425
18926 -314425 -722026 -271664 52895 -443090 -752773 -511905 -510436 -509864 195554 12027
18916 12027 -238516 -366955 167430 -14716 -363303 -430227 -348316 178551 50315 -199817
18906 -199817 -460934 -8177 533701 746599 611446 239040 -130887 7647 354846 332303
18896 332303 -10367 297572 468098 284570 25849 -413707 -853616 -480023 92974 411483
18886 411483 514706 -159035 -521838 -332182 -89103 -366162 -394688 -429989 -602942 -465375
18876 -465375 -557385 -533279 -699868 -670584 -725450 -467609 -132152 379486 66169 -191940
18866 -191940 -160969 57873 150030 87497 -78965 -148410 -293389 84734 178341 387211
18856 387211 283993 -22033 62494 423688 329382 305036 186055 336602 646834 775882
18846 775882 495905 -90994 -324746 -510902 -422969 -363277 -54978 4743 -85669 -122841
18836 -122841 336928 421510 55290 -459360 -316850 -93688 157982 168148 17612 205586
18826 205586 188711 99924 -34728 559779 715176 437742 -50539 -55771 108495 207307
18816 207307 401300 382035 365976 450739 564326 958121 686634 335088 24850 324778
18806 324778 499330 596309 471876 556070 61702 -95792 -186888 74049 167117 208017
18796 208017 442826 229839 353200 508022 244453 442027 959955 770664 117348 157170
18786 157170 386723 515892 801350 605401 179671 145978 180349 75328 203807 215708
18776 215708 271601 586217 683249 742912 1295800 1609595 1795718 2004313 2145595 2477931
18766 2477931 1892657 1243343 1055813 993128 883185 668886 291808 275966 429177 223342
18756 223342 210635 221328 10146 -12302 -147295 -65320 163898 134428 -61645 14626 -179913
18745 -179913 111719 377367 836081 946022 274895 222503 440876 876121 894583 722998
18735 722998 777891 983173 677485 363448 177175 -125783 -173241 -169006 -367774 135632
18725 135632 345634 554776 636704 229845 37734 159737 266214 213499 159862 -312958
18715 -312958 -635355 -780403 -763682 -300861 155345 -19291 12797 136229 162498 444050
18705 444050 164895 -41256 -151793 -632059 -473119 -452019 -395524 -401147 -370462 -122106
18695 -122106 83381 210241 205963 244343 484381 463095 298315 62351 -533993 -811607
18685 -811607 -592225 -467948 -334219 -36325 89474 204496 282965 -66183 97256 182667
18675 182667 143344 -202394 -168955 483638 1046939 951878 607816 273016 115472 396560
18665 396560 874203 799815 812928 421019 433674 -149756 -71677 715792 861734 882077
18655 882077 1052001 822217 427416 718133 301219 -211558 -407677 -577367 -210920 247706
18645 247706 359665 657738 855123 786061 950063 613778 349784 361326 213722 401720
18635 401720 128129 227076 673408 699919 583012 798611 750626 809491 670370 970853
18625 970853 662294 531658 731034 919729 752084 175173 244805 326277 537420 602744
18615 602744 793140 693343 680693 765421 707447 716552 1035731 1262675 1340766 1245403 762455
18604 762455 296047 708640 680661 462180 423169 452925 810205 1201456 1373075 2227862
18594 2227862 2617341 2460537 2929373 3243237 3671800 3802156 3375742 3090909 3115508 2965686
18584 2965686 2507375 2358440 2724995 2567745 2146378 2269227 2804803 2799811 2421363 2215221
18574 2215221 2504280 2824133 2565641 3261882 3887365 4380867 5042319 5739424 6290899
18565 6290899 7322659 8359357 9256617 10248138 11194885 11895270 12230685 13607461 14725229
18556 14725229 15887217 17249163 18767326 21025673 24155118 28260000 33843317 41201473
18548 41201473 50986885 65754944 88662747 123472973 173652339 238363501 313806881
18541 313806881 391881363 466891433 515565826 520523303 516585933 508572519 489909758
18534 489909758 431957537 348019964 272755043 209428767 162028734 128583833 103987802
18527 103987802 84702069 70004629 58795531 49697172 42557870 37653318 33885432
18520 33885432 31181758 29311535 27383706 25615843 24275275 23577924 23096591 22732583
18512 22732583 22057660 21441178 21100049 21218161 21627463 22133480 21803338 22042733 22519602
18503 22519602 23516051 24094432 25164410 26455829 28231483 30782730 34354710 39435527
18495 39435527 47144103 58276448 74923866 100964016 139961224 193264375 258001907
18488 258001907 328650826 398890894 460047924 481172826 478478210 473540258 461956114
18481 461956114 428834647 357177452 282799603 219131348 168157201 131407111 105642484
18474 105642484 85993798 70291670 58453098 49386627 42367885 36666201 32699554
18467 32699554 29503563 27104795 25328765 23744332 22078593 20700072 19508515 18179770
18459 18179770 17031589 15971036 14875333 13736449 13303232 13328380 12633628 11924845 11525451
18450 11525451 11542814 11854201 12200390 12309350 12450227 12131357 11535464 11295965 10513351
18441 10513351 9704043 9077450 8394558 7958785 7275887 6561134 6134434 5608964 5253179
18432 5253179 5013871 4809345 4670630 4382546 4307158 3968835 3792870 4005835 4251882 4581933
18422 4581933 4336278 3873703 3804374 4040624 4269065 4294529 4178812 3694648 3437825 3582325
18412 3582325 3966459 4064901 3435588 3437577 3773254 3793054 3639502 3495504 3148854 2921305
18402 2921305 2852234 3026371 3291898 3337560 4047289 4540070 4814146 4790182 5045580 5397846
18392 5397846 5768010 5783413 5511257 5517153 5100034 3728147 2775901 2601656 2470279 2297123
18382 2297123 2187112 1510967 1248511 1346852 1403516 1522163 1812063 1854033 1717470 1696086
18372 1696086 1464508 1369181 1245052 1538470 2018205 2084994 1869598 2410901 2776294 2228975
18362 2228975 1625867 1131560 1248639 1165100 1123634 1487311 2087340 2028467 1881934 1460104
18352 1460104 1438824 1197322 1055012 1034153 1235567 1475993 1235340 1333653 1027711 1060695
18342 1060695 1064708 955300 1069439 1181392 887940 848881 869112 453310 300969 807780
18332 807780 924216 739386 463931 316188 428257 655676 684522 456016 403631 649464
18322 649464 928732 898380 773201 1075730 1244638 826980 682559 691307 840436 962448
18312 962448 483100 -246964 -607968 -399507 -301294 -63791 -185219 236935 346064 731890
18302 731890 837333 474983 603470 679001 661007 871316 754687 601978 583261 962616
18292 962616 766712 749043 867255 805711 822095 634509 569059 604863 756367 406045
18282 406045 -86855 -173682 -84571 131190 394914 769016 1101791 1135412 1096651 728214
18272 728214 325479 145239 256819 497695 293415 371715 902479 1115073 886147 758899
18262 758899 416706 321489 161674 -13213 -50112 383945 925523 1256139 997403 642672
18252 642672 333902 404059 251346 -90400 -244142 -243501 173994 504198 824940 1231641
18242 1231641 846733 255908 46648 224824 -207613 -139844 943886 1175974 929110
18233 929110 775980 218262 60951 159886 76401 -8506 61744 659941 734520 560781
18223 560781 751793 713684 636317 624237 190637 100900 212064 412000 561347 622298
18213 622298 232413 181636 392175 -134827 -425028 -235449 192655 478760 734449 725098
18203 725098 175492 175903 336625 557175 416637 515808 550409 606992 351682 394314 314607
18192 314607 175977 -160407 -170369 -301121 -463341 -283029 -404755 -205967 30472 174958
18182 174958 62394 -93435 -69583 -38894 105720 273790 414850 354418 111309 274659
18172 274659 479830 843776 899358 677940 933649 798273 1268833 1418593 1492715 1297230
18162 1297230 1220025 1486730 1581106 1323378 1379755 1196755 1281122 1698388 1807544 1781976
18152 1781976 1403806 1159782 1189390 1204488 1339564 1875300 2162616 2047279 2279134 2737601
18142 2737601 2858586 2992548 3175922 3408890 3392147 3742864 3811703 4287891 5018092 5513758
18132 5513758 5979815 6852799 7453897 7536467 7910449 9408664 10930267 12576283 14445048
18123 14445048 16546238 19375419 23155518 27499363 33719768 43053042 57440107 79951532
18115 79951532 115482156 169082628 241438768 324868670 406762825 471731417 500219372
18108 500219372 440791246 346943938 264242246 195891041 147367841 115009251 91903149
18101 91903149 73587933 59626070 48404190 39525422 32931679 28029568 23927584 20975765
18093 20975765 18887024 16715946 15413062 14539889 13442634 12168281 11056677 10166113
18085 10166113 9062884 8442544 8001606 7975600 8034950 7492024 7187968 6520169 6172074
18076 6172074 6091297 6315946 5806214 5586550 5702218 5521659 5089774 4866281 4713342 4558519
18066 4558519 3782476 3312377 3371740 3878623 4113483 4222821 3881610 3683970 3425777 3289661
18056 3289661 3239784 2996612 2676979 2725328 2736448 2797614 2865807 2983877 2640275 2578167
18046 2578167 2445546 2246159 2006895 1800426 1825935 1960130 1695144 1388920 1358001 1641881
18036 1641881 1657204 1761496 1646125 1177624 1057312 690656 534623 562665 905894 933835
18026 933835 565610 385989 701670 1199810 1727081 1565141 1017970 409700 259537 83050
18016 83050 184901 353062 344940 389652 424409 840338 1108785 1438540 1464775 896977 698406
18005 698406 941985 1227802 1006065 899732 897776 1184417 1294921 905723 866273 1189832
17995 1189832 840921 938523 1375264 1382391 1329321 1563565 2187839 2722301 2885252 3358291
17985 3358291 3379920 3372445 3484386 3910027 3977674 3940687 3081553 2411238 1740216 1063246
17975 1063246 1332516 1251164 1080360 860367 156868 -247396 161036 550700 174335 565829
17965 565829 712925 458330 360016 398840 463909 228274 102817 369421 586609 698458
17955 698458 827355 977366 407572 417422 971259 1483343 1471559 1074157 902615 228027
17945 228027 75354 177761 39236 55373 550976 943335 635473 360147 997334 1557343
17935 1557343 1791455 1875613 2312725 2435760 2632584 2681145 2738346 2686817 2731175 3017459
17925 3017459 2417450 1673340 957040 832695 801456 871240 774796 918343 871654 804407
17915 804407 997615 848711 754201 366448 -272759 -479154 -152709 444971 920097 712748
17905 712748 676091 916785 791708 586029 664643 909354 773095 452252 586662 783909
17895 783909 1124669 1242234 1012841 610700 -46719 -201264 -222154 236782 229413 -228940
17885 -228940 -218744 41710 191098 270692 393306 560455 836939 1240241 988934 828226
17875 828226 817877 647071 137619 -173494 -133804 -156813 -270522 -46190 -1746 64370
17865 64370 307621 557191 753471 407186 127597 243498 266650 334325 400698 397060 389851
17854 389851 366356 363890 228981 -25816 -60467 -364878 -36709 -98278 105981 217423
17844 217423 271741 243827 -138220 -474757 -385771 -338900 -460749 -736742 -277900 -26380
17834 -26380 178869 587445 744991 432066 37092 15135 35908 68106 -190112 171740
17824 171740 70050 224454 450045 855955 1264140 847820 558512 322890 -261228 80885
17814 80885 -92933 -11079 116341 382390 52291 141469 161235 472850 750317 305887
17804 305887 167755 171830 78194 271264 -8016 -43043 -218217 -360346 -181446 -185158 -407700
17793 -407700 -176917 -217769 -52808 114659 325672 509133 759008 751084 604219 750201
17783 750201 388404 119443 -565 376910 364802 9937 25119 -88380 202467 206033
17773 206033 389235 328418 422251 701966 504860 252851 403290 974996 859251 303265
17763 303265 53822 80430 257338 183617 298961 507830 422180 626900 734857 557909
17753 557909 335936 -172018 -372335 394839 782625 405750 95086 158506 -126026 29755
17743 29755 -206271 -218467 -93838 206924 168759 168047 484733 480252 22042 -96507 23135
17732 23135 96723 -178139 -243416 -442 48903 -209746 -28742 436523 338598 486657
17722 486657 602929 484237 552023 439182 265321 147684 37170 -486604 -287496 77618
17712 77618 -148563 -48083 284400 690209 633833 81578 -115705 145523 195371 -167962
17702 -167962 -139745 -113832 -469832 -641609 -459804 -109539 132211 261368 106291 -55303
17692 -55303 -81055 -62398 -385669 -524761 -240402 -116912 -47802 23194 151189 412768
17682 412768 369509 434754 566306 191079 20887 -70978 -180135 100468 106189 32104 265566
17671 265566 485410 4166 -268793 -649163 -702433 -154518 234879 515818 626970 275485
17661 275485 -175116 -129348 -224295 -397749 -271807 -466736 -322581 333016 341006 525166
17651 525166 410630 -237919 -262997 59887 183920 -133301 -202906 -349267 -123236 159806
17641 159806 529715 -14231 -99459 -139471 -412162 -56432 208281 59010 -239898 -29060
17631 -29060 232310 17422 -31354 -44073 -298455 -572329 -338059 -140850 75750 155751
17621 155751 268858 114370 56366 48900 266436 372757 92594 -240358 -187392 -456858
17611 -456858 -227636 4254 -443851 -632651 -688805 -219036 32467 -233271 40825 -55396
17601 -55396 -144569 236030 456885 152407 -181213 -291471 -400604 -434317 -343983 -218751
17591 -218751 -122963 -218666 362550 620589 432290 560507 793712 386033 -208903 16095
17581 16095 390989 476123 255821 -212777 -326985 -237727 -271071 -68176 -31492 77513
17571 77513 327918 683717 301233 66441 370699 42504 -83839 494589 922771 1000548
17561 1000548 991034 833705 914941 423923 63212 516484 538056 723615 590932 137103
17551 137103 65904 345349 514881 381009 12599 101331 527289 589470 300358 442642
17541 442642 690262 958304 1180332 1180993 669404 662611 428301 70475 74165 177692 185678
17530 185678 204267 223745 158796 -133474 -324685 -390057 -268955 100733 127256 157336 290133
17519 290133 -292936 -244371 142367 60623 -463 263697 162611 -40675 119008 229080
17509 229080 -26819 -80327 -50670 -305856 -112113 288146 272048 600821 496387 244003
17499 244003 309533 609134 623501 637850 627943 362271 164938 -283254 -178586 164926
17489 164926 555454 384190 120174 500718 268468 152649 -49988 -16025 38227 43441
17479 43441 135344 95295 -23284 252779 629631 619469 723181 427062 522979 892629
17469 892629 610461 345407 -103051 -381198 -56200 -55847 -227603 -535230 -335149 189092
17459 189092 -178487 -173270 -268771 -141021 -46992 477509 126667 89797 274735 406967
17449 406967 586093 1170532 1764237 1939140 2588693 3090787 3292376 3078396 2647648 2264464
17439 2264464 1515679 1090190 923771 1034526 739641 492072 354781 406541 363578 263901
17429 263901 225607 141844 111771 243635 326857 394725 275533 -179339 159069 160065 260359
17418 260359 467050 420890 376197 38226 25376 184281 -464052 -553013 -368072 -491496
17408 -491496 -518098 -351948 -190833 259558 379386 360728 184010 375411 100672 -115931
17398 -115931 -446941 -724092 -299743 -1264 -51653 -161505 -195401 63270 22707 212822
17388 212822 473733 199382 -198013 224270 318460 211037 -73831 -488075 -210412 -93076
17378 -93076 -12104 -30931 213086 351938 382401 524266 194471 30666 -117400 13077
17368 13077 77032 78867 541518 646004 759535 446555 -210224 -99496 157281 189440
17358 189440 -231754 -626799 -863914 -641196 -499685 -151498 52182 535988 813188 734243
17348 734243 420386 -52736 41486 -107461 -230842 -360192 -330509 6859 347467 159295
17338 159295 -150122 -415491 -351388 28462 144944 189521 438930 625131 326954 -54771
17328 -54771 -79411 -110554 -125858 389580 796179 570953 503164 399602 545455 501291 528364
17317 528364 450334 517671 521357 287975 253470 621302 503120 317814 384387 498542 257880
17306 257880 295492 -120889 -160976 113460 151808 235301 290734 337163 310663 26802 -158034
17295 -158034 -176962 -363181 -13338 -33469 -439826 -666345 -399491 42347 357127 678571
17285 678571 720442 174022 45165 -70764 -227773 -188586 -439275 -87726 -53248 -416250
17275 -416250 -736305 -629282 -656100 -477141 -250401 166441 -51134 -578990 -652327 -289279
17265 -289279 -170453 127617 813482 541376 424717 823703 567191 41318 -500080 -522959
17255 -522959 -137660 -121322 -274847 -166032 169145 -96253 -487552 -656178 -820672 -826196
17245 -826196 -563930 -149287 157615 380580 365301 431849 366348 -23021 -70152 -33514
17235 -33514 75328 73533 305494 271014 242406 339149 404319 -204936 -965429 -771189 -268455
17224 -268455 -335194 -540193 -482221 100456 650315 781701 572160 78776 346266 476319
17214 476319 580750 375091 112414 -232438 4799 223030 -107535 -594628 -562817 -266346
17204 -266346 -111840 10331 -527774 -605874 -44478 338168 395129 335289 247685 -44105
17194 -44105 -539568 -472719 -221998 480981 569680 315091 -10716 170601 177154 368170
17184 368170 159666 120808 249819 38093 -225225 -507752 -713743 -854932 -404676 -199826
17174 -199826 -436711 -551039 -393681 -561206 -394004 -174751 48971 -184376 -610496 -669164
17164 -669164 -840390 -732137 -384611 -330499 -349884 -317477 -355826 -487286 -388973 -435482 -218825
17153 -218825 -150184 -243723 7625 138051 -331815 -514626 -431658 -303009 -398494 -795752
17143 -795752 -960149 -395494 155785 256523 -72679 -46421 268861 215717 187310 7664
17133 7664 -488152 -347689 262569 290763 98735 60419 88370 690540 1137132 756180
17123 756180 544864 353830 357644 223605 91851 73140 -162877 -319695 -228548 56539
17113 56539 -5915 -189766 225332 214885 7684 -1053 -230143 -370723 -171092 -196070 -169820
17102 -169820 -107270 -227444 -180840 394301 131012 -141894 -311032 146279 555642 557095
17092 557095 304880 -33713 -276141 -385583 -285567 -645815 -643203 -162511 232456 511486
17082 511486 440105 260406 299320 331842 694048 226549 224874 668842 680964 250443 -30840
17071 -30840 -117445 160719 489106 176583 -231387 -375906 293476 319704 -7649 353889
17061 353889 172879 -33812 -1448 314907 632726 732391 718460 327535 124948 -185329
17051 -185329 -269614 -8319 116786 291724 -13054 -154092 -13703 -75837 184592 308393
17041 308393 -83041 -40969 -239596 -151263 -137956 -200338 -233048 -188864 -379079 -414485 -17327
17030 -17327 356224 162556 220245 104252 -15434 75437 496068 653340 308291 125730
17020 125730 31173 -51479 177220 243199 -186498 -293072 130078 129937 273836 318178 335425
17009 335425 101691 26057 -34495 42643 91890 324515 224144 277146 453964 482533 234477
16998 234477 -206136 -323134 -157415 -240024 -352873 -299263 -121778 114031 -64046 -448772
16988 -448772 -485250 -230402 -380492 -244758 -505025 -872152 -632546 -494504 -296034 24545
16978 24545 399153 470067 414700 404117 244481 -118971 -826920 -749083 -100158 382067
16968 382067 433719 281178 249419 201287 -23376 -383478 -481655 -120 107070 164595
16958 164595 -22078 -366105 -322232 -620992 -597593 -540007 98831 208509 523416 347973
16948 347973 62675 206758 565601 558404 269419 -71506 -417062 -859941 -588209 -16140
16938 -16140 162831 365943 100130 156377 141397 171726 -9336 4344 1072 150513 133761
16927 133761 31864 48157 40835 100781 -2500 -310474 -653636 -372267 141206 49348
16917 49348 -281320 -277745 53954 456892 666400 565115 894633 880713 407742 143667
16907 143667 147586 278740 290664 550400 727262 759454 617322 353023 82484 -311399
16897 -311399 -198307 107295 -23730 -33960 -22861 -321520 -358235 -181245 208938 625220
16887 625220 830596 699255 643417 643418 468321 678096 905857 779033 1106546 821324 404214
16876 404214 85020 362325 173627 -224017 -353695 -573393 -622739 -659620 -216387 204874
16866 204874 217266 104483 -108636 230446 83384 -138927 322176 117670 -218151 -256704
16856 -256704 72344 86155 -275971 -64321 18078 94615 103860 96775 68227 116328 255851
16845 255851 465328 270281 252931 38083 -141361 -110257 -254865 72821 56846 326198
16835 326198 390012 261389 108411 118327 -221536 -192943 265537 556922 469245 73254
16825 73254 -130446 -23187 14151 149495 169461 211736 -72938 50140 52630 -261799 -227027
16814 -227027 -261181 -323464 -113124 84567 146447 -138590 -16678 122438 -14983 302502
16804 302502 852541 766117 738990 314139 32031 -373451 -429943 -31443 6841 -521445
16794 -521445 -1142410 -770864 -629742 -584452 -178246 235367 358598 69566 -459421 -448774
16784 -448774 69964 167577 417438 828429 804544 256590 417364 549728 282670 105804
16774 105804 246208 156141 426883 266663 -72554 -774060 -875198 -427540 200185 236839
16764 236839 8847 237470 83958 -457370 -311995 105961 235287 110664 305926 482248
16754 482248 557724 564272 426395 431072 306919 352081 145874 -71548 -267705 -462003 -692463
16743 -692463 -856092 -332550 -129753 177385 117918 72144 -225663 10642 -273963 -89312
16733 -89312 56177 178463 555184 1016095 1132685 617726 71678 -73493 -261360 -675126
16723 -675126 -328798 288684 518209 589486 620298 602158 429426 367468 118631 -5841
16713 -5841 -133049 -409244 60649 206851 -99527 -644925 -439670 293347 316574 -16967
16703 -16967 -130885 125882 -12793 -288698 -348830 -401773 -663323 -605039 -764804 -625833
16693 -625833 -551434 -76771 237331 212866 195745 405456 705868 242947 -177873 548049
16683 548049 434606 175871 -163154 -25540 -23700 -522338 -413838 -488032 -348709 -58270
16673 -58270 -270310 -93130 -37518 -247133 -468892 -919017 -983948 -607733 -724424 -708187
16663 -708187 -466196 198233 414250 351734 359718 263463 -193140 -69619 371959 -153015
16653 -153015 54116 52582 303717 388740 579764 176575 -159416 -108894 -55988 120460
16643 120460 -37426 -82059 6935 212083 56644 -248953 -165641 82625 73675 -101165
16633 -101165 -411305 -460821 -217918 -345472 -478282 -647968 -641788 -719691 -963094 -800157
16623 -800157 -56442 10765 -309935 -117516 408722 340813 216399 -5511 84346 98296
16613 98296 -62896 295981 620894 634395 532408 181767 -26057 190485 308860 226630
16603 226630 222752 -80045 -605208 -1158138 -1210749 -1060709 -434681 -182174 157409 247630
16593 247630 537915 388717 153648 -522137 -656114 -41129 474652 479792 742775 701570
16583 701570 152240 -186124 84906 516108 246809 87484 339171 186895 210961 231816
16573 231816 -46021 -140788 113316 -129923 -98224 -165179 -423687 -345738 -206698 11256
16563 11256 492961 419988 201533 233839 31610 -491919 -445317 -256041 7697 -23510
16553 -23510 -467024 -354001 -612906 -531456 -489287 -358478 -425702 -166894 -233959 -464453
16543 -464453 -51059 315898 101651 165616 36667 -286084 -344601 -144006 -328446 -645707
16533 -645707 -289668 -72446 41774 -148839 -342520 -538796 -319554 -222864 -378508 -335739
16523 -335739 -321929 -204119 -634329 -640239 -311622 -399950 -597524 -317516 -96468 -4272
16513 -4272 -82493 370758 350431 134860 28405 -315911 -345052 296750 168124 -60252
16503 -60252 -150932 -350384 -174722 498794 228914 133908 699671 961322 640149 598812
16493 598812 575064 493526 623911 563297 361712 331628 545612 759207 392103 256928
16483 256928 210013 -72320 -432615 -271760 -11699 258607 530231 688978 240856 -208350
16473 -208350 -385375 -270087 -227102 -323952 12264 86797 242558 557912 519141 316220
16463 316220 148617 208166 242384 218192 55483 -174955 -223747 -207512 -100676 -356445
16453 -356445 -487640 -543851 -575879 -538538 -503732 -402489 -508427 -310698 260299 882727
16443 882727 540724 181497 -40373 64354 172464 244591 112087 311309 318358 418966
16433 418966 277400 -113559 450572 535276 357471 -54791 -195558 -204518 33888 75907
16423 75907 -439077 -946184 -680510 -305672 -382965 45944 -258160 -357104 -4315 -133004
16413 -133004 78039 32382 422292 581093 656535 823688 800687 111600 -425933 -229310
16403 -229310 -50197 -96494 60578 488742 433167 533581 475879 136387 -51337 -188224
16393 -188224 -54684 5376 396537 1066495 731504 -79465 -59682 331425 538922 341096
16383 341096 -109547 -178979 -26108 147694 116844 508566 991578 991660 636560 163971 -87192
16372 -87192 -124828 228733 197350 -331198 -408345 -35667 479932 428588 363299 26661 -45796
16361 -45796 -75336 -321724 -375556 -261881 -114845 284539 118763 28683 -88035 -446061
16351 -446061 -546679 -778176 -709955 -31396 229136 211480 307140 313233 452817 319844
16341 319844 257101 122383 144113 -379183 -313772 -177781 -107841 394862 682789 775627
16331 775627 637888 422356 82968 -177251 239287 383603 180831 341930 108841 -297953
16321 -297953 -485507 14906 455605 429452 114708 132865 -85310 -160314 -478608 -513654
16311 -513654 -310364 -85696 -11626 -646854 -553008 -52791 -212030 -183245 -306774 -617211
16301 -617211 -730869 -607922 -215524 -92160 -502710 -560791 -391386 -418202 -524826 -157956
16291 -157956 12463 -90887 -60448 232762 28517 -245086 -250031 -99416 -180460 -198322
16281 -198322 161706 -24101 144902 -106838 -63196 216362 235439 146872 -105727 -161489
16271 -161489 -278606 -421477 -220931 -175151 594613 949396 636170 442007 551541 734630
16261 734630 662732 355522 25542 -223631 -84355 229463 707182 766841 412356 -251413
16251 -251413 -31193 264606 248372 63130 303797 240050 313100 158506 -271313 -341344
16241 -341344 -215417 -113885 21108 24806 -111880 -556911 -952918 -865727 -405251 -171113
16231 -171113 -188744 161309 3627 -226412 -408471 -658434 -620544 -173120 -170845 -176051 -397233
16220 -397233 -1060231 -1340395 -1252829 -1406997 -1361035 -1424803 -1153220 -958058 -1255926 -560131
16210 -560131 7324 129595 -129431 -335988 -434748 -237061 -377232 -177894 -62542 -214737
16200 -214737 -549613 -463262 -181520 -538192 -473631 86341 188126 507902 535945 219744
16190 219744 -104322 -581997 -336 524631 558485 445389 440304 32919 -230735 -421444
16180 -421444 -408883 -487231 -364866 -506282 -464423 -423105 -279115 -316977 -68983 235548
16170 235548 642198 568039 333433 -94571 -115245 -290056 -145429 373378 295594 137436
16160 137436 -182311 54293 239651 498341 826181 719644 673059 277934 -141022 151530
16150 151530 180778 290794 557369 791929 734270 -224259 -549957 -652413 -886077 -738813
16140 -738813 -542373 -551351 -584570 -360281 -273033 -123221 -43048 -251802 -512537 -238641
16130 -238641 263460 86993 -36931 -92421 411122 669293 444708 347360 44467 -322247
16120 -322247 -85468 82420 395597 80614 -135540 55646 -121447 -351886 60653 350236
16110 350236 96936 561000 413313 -146853 -235603 123484 738250 883633 718550 500550
16100 500550 -47677 -405354 -470953 -15446 -254262 -869244 -665813 -430023 -333029 -503746
16090 -503746 -26762 -94120 -531491 -207484 -264077 129550 445068 378985 375559 67814
16080 67814 179823 167908 -166374 -295377 -143216 -97093 12888 27619 36425 -26676 -151239
16069 -151239 -358526 -426154 -474530 -67036 347821 348317 144866 41115 -67829 69296
16059 69296 70651 -178671 -159914 -122894 143636 94526 -197148 -1154 -301300 -364983 -152951
16048 -152951 131118 125972 -286712 -392838 -563659 -612893 -699443 -372774 -37245 -86203
16038 -86203 -83495 -173107 -165320 -401263 -456815 -593419 -888643 -860882 -460263 -25004 -206195
16027 -206195 -214018 -94131 -290757 -127728 -377988 -554652 -590721 -324593 -60769 196760
16017 196760 -3493 287352 331037 -161772 -417523 -104263 23873 -140541 -54274 -119056
16007 -119056 -257317 -156711 277555 260370 269887 313909 -48626 209149 291287 28167
15997 28167 -254091 -153061 -561686 -845771 -617275 -638681 -624703 -807849 -1056335 -811167
15987 -811167 -696058 -225302 326430 265706 -97294 367649 606057 310202 491443 724140
15977 724140 708646 259258 -18516 31593 217898 862 56850 -62504 -250676 -463091
15967 -463091 -306494 384701 670038 635087 613885 321172 241528 -417280 -435526 -6302
15957 -6302 325002 109914 -114819 -199044 -293212 -283607 -394339 -315050 -71577 -276960 -431112
15946 -431112 58035 243933 49133 -344020 -305836 -174864 -100373 -91128 -32572 121915
15936 121915 425407 89428 22041 -125734 -168766 -81620 81064 317684 348389 264484
15926 264484 -57056 -253608 143657 245553 414712 -14504 -358115 -231627 -84689 -272908
15916 -272908 -12376 379634 335826 403472 702858 551120 289657 78342 183890 2417
15906 2417 118698 520601 514976 310841 420616 691023 429777 88414 808052 681779
15896 681779 444473 332756 182804 45181 349786 594545 544406 363999 245842 -85857
15886 -85857 -170652 -295771 -464562 -499877 -424337 176705 581203 362099 14332 135015
15876 135015 256500 530761 494875 43530 -128436 65476 -342970 -339087 -63098 58114
15866 58114 -102432 -126452 6836 155976 -86962 241530 557597 439853 679131 844508
15856 844508 633410 415339 396745 718796 657750 -42481 -173377 -184080 -148838 -165493
15846 -165493 114247 298015 307486 196895 206925 57797 1919 -207867 -84893 103451
15836 103451 -14626 -44350 57779 199710 261266 814765 528535 42418 -48833 -236745
15826 -236745 -7401 155492 114428 -161301 22567 -254193 -302286 7914 -129950 -190647
15816 -190647 245922 319290 242819 303922 -270280 -490741 -353269 314089 152795 -302
15806 -302 -472518 -449444 172731 370481 258565 499070 283867 -229050 -332403 -312357
15796 -312357 -568815 -707607 -550572 -425668 -635518 -715144 -616805 -293885 215011 188528
15786 188528 216584 254899 210993 -75467 46818 621771 461859 315523 -72561 -165295
15776 -165295 -321804 -409980 -222653 -206639 -8198 4975 -326254 -344141 -62178 75949
15766 75949 313294 277971 268358 348332 420456 672209 767194 842136 875536 678707 483640
15755 483640 278777 523464 292054 -18892 -168492 -167792 -48895 -6997 232027 647103
15745 647103 743850 569336 194021 -180665 193890 554526 489030 364560 55290 -331069
15735 -331069 -576430 -436542 -42032 -429823 -551852 -408541 -301600 -94108 196574 202447
15725 202447 -257666 -725230 -872465 -851937 -484930 -168814 -345242 -261152 102122 521317
15715 521317 425901 212710 -373147 -523543 -581433 -798041 -513846 29083 24187 -28768
15705 -28768 -30342 52545 147289 325740 856929 984169 761126 444153 317128 97381
15695 97381 -14915 -100696 -229318 -56777 109367 -2007 -219500 -289857 -468460 -644665
15685 -644665 -537150 -963799 -934384 -675326 -410496 31270 245243 -140562 27232 205353
15675 205353 -220881 -140950 83938 107109 -84929 -47474 -193221 -240040 -250118 -285087 -544838
15664 -544838 -827477 -283085 25164 56129 -180281 -323004 -75072 -108428 -684425 -1262833
15654 -1262833 -966750 -237616 112559 166139 -65698 -389976 -665368 -659770 -761019 -459183
15644 -459183 106821 402581 605260 230947 -173172 -330831 -611974 -713091 -536847 -144744
15634 -144744 -46585 23925 -79320 -51070 -295188 -492441 -202347 -84703 87233 200690
15624 200690 53652 -114662 -173141 -323746 -140653 -326583 -280679 -135070 215876 644898
15614 644898 216587 12754 374630 416317 -61614 158893 115140 -39352 132507 292628
15604 292628 146898 495603 513171 460990 488344 262884 482227 602357 94710 -387797
15594 -387797 -377898 -108194 -326421 -467068 62470 300231 301745 333904 138256 82709 456604
15583 456604 552737 -2156 -427630 -102879 -198630 -440453 -192154 -149340 -643427 -703076
15573 -703076 -567151 -367285 -31822 268907 678859 932912 1031081 447631 103100 262712
15563 262712 -65491 -265376 -354034 -274980 -212975 -428011 -516617 -107212 173630 661592
15553 661592 806658 548206 306080 252360 371719 552295 622888 719585 754000 857082
15543 857082 695477 410542 133166 -72402 220396 -36628 -473182 -298432 -518844 -285860
15533 -285860 -766979 -1083065 -267088 315054 214108 -22727 -10191 36442 469779 290809
15523 290809 139653 306728 358459 -17225 -381695 -425624 -251740 -66027 98992 48727
15513 48727 257963 182747 51730 197494 -14418 34516 -295373 -647048 -585353 -76816
15503 -76816 108420 -517046 -809924 -660677 -947109 -1001811 -1021320 -888092 -148394 -189637
15493 -189637 -549216 -214102 210853 258162 422953 293131 179488 110099 -377098 -184969
15483 -184969 -269930 -271715 -83287 67255 -150151 -296246 -617379 -775576 -500635 -412576
15473 -412576 -574623 -204152 -118587 -138048 -118679 17879 -125132 -133949 -174925 183912 341458
15462 341458 305624 218777 339893 459692 221858 352590 730073 276511 268526 86316
15452 86316 325128 232996 2509 32160 -156062 -333016 -556443 -543011 -848224 -846165 -684838
15441 -684838 -440978 104211 329710 381686 400114 41528 -206626 -86154 -21199 436496
15431 436496 429609 82384 -139828 62802 129521 112110 495846 230944 -256885 -241213
15421 -241213 -120675 -235973 -342108 -246722 -71651 -87355 150123 293658 -10527 -229556
15411 -229556 -147240 -507218 -413945 -531352 -441124 -38661 -266303 -451463 -626156 -214779
15401 -214779 30973 217240 267067 561287 465615 36229 -374668 -363130 -111862 -257859
15391 -257859 -400613 -569266 -90469 137712 -236683 -215832 -294688 -238330 -334505 -541614
15381 -541614 -563946 -282912 199443 728479 431132 245695 275289 403559 -21408 115643
15371 115643 486631 434764 225277 33173 110308 432413 631423 657557 495600 73352
15361 73352 309627 503838 528068 35519 -562750 -982932 -442590 -402386 -194543 -116718
15351 -116718 -185164 92787 85327 -203688 -491684 -722159 -671217 -277804 -169230 -340464
15341 -340464 -460651 -322627 -484265 -714075 -835362 -873227 -534155 -563176 -499494 -216769
15331 -216769 -300299 -629588 -711165 -570014 -569518 39318 286316 272103 -8859 -450475 -547517
15320 -547517 85546 357151 427366 -12641 69897 177613 256596 195109 137868 181869 287706
15309 287706 230800 -152886 -123337 -111057 -70958 -76458 157631 -11941 99627 204995 42766
15298 42766 -61691 51701 323088 581244 403328 277125 -96099 -357661 -797062 -641117
15288 -641117 -198164 -26903 -19811 -23349 -310961 -683574 -830655 -61373 30655 -605911
15278 -605911 -1018250 -871752 -785813 -580723 -483320 -327429 -199603 -263667 -44332 -70018
15268 -70018 -352357 -555090 -375739 -167453 -472916 -317207 -74570 321458 102506 -164814
15258 -164814 -81019 35770 239030 -72692 -240575 -147992 -211314 -255489 -646438 -645525 -200843
15247 -200843 145539 202797 -75694 -293437 -48075 5707 -498974 -667156 -263975 168363
15237 168363 100087 -286535 -720534 -264161 -152469 -17803 405071 521830 276211 -206866
15227 -206866 -112935 268129 352249 227563 145950 -48854 -485806 -610377 -190062 -228400
15217 -228400 -616495 -280892 129153 243891 53828 -102838 -177210 245388 402936 388254
15207 388254 213670 117542 -100703 -72914 18238 627377 659456 526467 634859 286219
15197 286219 22197 -41846 78962 199609 99282 388052 606057 451824 -174472 -208141
15187 -208141 274368 489666 66 -103807 -194885 -415481 -366325 -454968 -457936 -307665
15177 -307665 -224707 -397126 -417691 -224222 341715 240238 -634995 -817401 -435958 146403
15167 146403 543499 449649 225735 -171354 -251919 -536887 -26977 507044 678632 466342
15157 466342 161130 242312 442284 540029 564568 459909 628017 304978 134142 -299656
15147 -299656 -389115 -183068 -265172 -438856 -277413 -282510 -275634 -101843 -662854 -674929 -409679
15136 -409679 -285130 55060 238579 200034 280538 -197529 -446573 -450575 -485994 -153267
15126 -153267 171058 -55483 -11373 -98622 -41791 -106748 -348806 -354689 -95674 149771 243579
15115 243579 383734 416020 289191 391535 327709 -20752 -143633 -244218 -425661 -333815
15105 -333815 -154882 84847 -37671 -399004 -342933 -304989 -569345 -676467 -767255 -789950
15095 -789950 -646398 -684750 -791553 -620320 -478783 -495695 -492860 -329189 48174 297113
15085 297113 -113026 -192831 56910 -47855 -213063 -163784 -126518 -16820 -274777 -325681
15075 -325681 179709 -76085 -118922 234807 608232 307570 316280 155382 -185332 -668307
15065 -668307 -691972 -701401 -274760 396087 276321 270499 338221 528803 614515 372646 238111
15054 238111 104955 192144 -38300 198573 482692 561044 391059 332256 138444 -102620
15044 -102620 -69142 198922 328605 382072 102585 -84386 -146677 122269 -207122 -180890
15034 -180890 -500079 -568383 -572302 -414364 -510224 -337807 -134767 -200257 -162793 -356807 -650932
15023 -650932 -552810 -174901 -89739 -182407 -642766 -557605 12508 186877 517507 342716
15013 342716 302 -200926 -660402 -544173 313292 529238 584123 51774 -418345 -714134
15003 -714134 -788617 -963377 -706178 -668656 -523392 -369897 -248905 -160314 -14696 -97235
14993 -97235 -103315 149833 53649 -209076 -185359 351254 264530 193223 490843 479909 342718
14982 342718 355374 242992 229773 338237 172965 59656 38231 284618 71631 -403738
14972 -403738 -689564 -542711 -390133 -188918 28532 -236477 -336222 -88913 102732 -50430
14962 -50430 -81334 -143346 -257543 -285549 -118048 -235108 -551175 -644091 -351999 -380752 -492596
14951 -492596 -520595 -480075 -573635 -360179 -477586 -894913 -544852 -509956 -742391 -319304
14941 -319304 119076 -20777 -2095 31811 -122480 184415 350608 323865 -130149 -395762
14931 -395762 -263268 46277 379384 485810 -36738 -487546 -627151 -115986 -51745 -420397
14921 -420397 -158602 -320430 -322632 -561813 -994009 -751969 -477702 -310505 -175204 -251076
14911 -251076 -381887 -302430 -271298 -205054 19921 393908 703389 573024 752576 300982
14901 300982 391036 554403 570813 378705 166567 -138675 48816 -212347 -249476 55532
14891 55532 198860 -100759 -30190 326829 150931 37593 -62166 -521642 -835227 -810805
14881 -810805 -716014 -613736 -738379 95932 225952 22911 135844 -260672 -350017 -134179
14871 -134179 -175790 -130605 -159357 152395 103202 -56451 240098 492085 432258 551933
14861 551933 353924 -94768 -122737 -349563 -490928 -486091 -101901 159327 80406 -435754
14851 -435754 -325287 -316 302082 256244 44753 94536 170414 -76476 -284078 -68940
14841 -68940 -406777 -534046 -386331 -719250 -526207 -248847 -437671 -453761 56363 271936
14831 271936 -103453 -383478 -328061 -119141 113647 25954 -373039 -727341 -690492 -631012
14821 -631012 -677154 -442157 -228644 -509887 -368345 -452564 -404717 -293932 -165158 -18760
14811 -18760 69958 157856 -37688 -216547 -329624 -531198 -525664 -208348 -132154 138147 277598
14800 277598 61073 80876 -60123 41751 242827 42901 -411874 -382536 -366184 -340567
14790 -340567 -359325 -324686 -508671 -466055 -477083 -704358 -228870 198786 399725 60863
14780 60863 -13155 133962 116437 438570 522069 668119 775154 602331 290885 329399
14770 329399 654343 691477 375521 407918 175745 -132442 -375847 -165898 -297266 -291556
14760 -291556 -164636 51341 47470 148044 556698 405132 -29578 -11564 189293 5753
14750 5753 -176725 -65390 -114362 -356051 -823820 -647736 -827861 -797191 -445459 -322797
14740 -322797 16646 -965 -12167 -188337 -260703 -32813 -124170 -258518 -468773 -400253
14730 -400253 -335441 -331654 -36673 115872 52546 112717 154868 238078 61174 -305661 -289387
14719 -289387 -450169 -370952 -62335 -91300 -344399 -637821 -573367 -559259 -495768 -375292
14709 -375292 -89414 1595 109137 310993 -53482 -405315 -596541 -527402 -295158 -398109
14699 -398109 -322814 271439 480908 459278 107319 293155 520270 605440 740336 927819
14689 927819 1083908 410382 91300 -354308 -525520 -327471 -402658 -306651 -86599 52324
14679 52324 -556649 -601000 -669232 -477578 -842547 -1097650 -976843 -910369 -558795 -440982
14669 -440982 42275 354087 242829 -19654 -362501 -608347 -258395 46197 -56081 -159123
14659 -159123 -221767 -328450 -259814 -144357 -200656 -372162 -687580 -595425 -477180 -363316
14649 -363316 -270371 -63821 448248 345218 483473 535934 620041 4791 -399064 -379045
14639 -379045 -150376 44968 -131854 -104613 -351695 -439045 -532060 -375912 -395908 -453395
14629 -453395 -543928 -390256 150245 14763 -260677 -413499 -778007 -761010 -580592 -208108
14619 -208108 -38143 -262855 -206544 -41571 158499 -49538 -185460 -347047 -177575 258474
14609 258474 183934 210884 112924 29057 -226500 -580169 -939956 -1161858 -877828 -580808
14599 -580808 -462263 -59256 -127083 -99375 -57720 260171 606350 566275 622096 310217
14589 310217 187646 39461 -420324 -583000 -552763 -802328 -563576 -269423 -223538 268697
14579 268697 308909 -40608 206466 243037 201399 308607 166690 -71749 152846 491975
14569 491975 367270 70710 -186208 -178942 37145 -337020 -647914 -589152 -41382 164402
14559 164402 -189377 322805 690704 301507 27932 -195230 -960745 -1361631 -1011007 -727225
14549 -727225 -437197 -279629 -437193 -114956 148278 77237 -105689 -376736 -146980 13619
14539 13619 -194385 -359024 -322808 -23110 14070 110096 312568 159850 288969 186230
14529 186230 -10365 1264 -431835 -745571 -744071 -799061 -768941 -129851 143812 259659
14519 259659 579199 232219 243179 450363 311062 140015 -43262 -202014 -275117 -531705
14509 -531705 -364615 -248543 -128964 -318529 -185236 80312 268479 -242893 -233303 -64722
14499 -64722 -56210 205191 590432 718733 161252 -293143 -760599 -545762 162865 15552
14489 15552 -195644 -330223 -219686 -49526 39720 35170 -109886 -475370 -758856 -868806
14479 -868806 -192029 276747 -10741 -175308 109358 176120 60162 277267 430727 335291
14469 335291 84217 245504 154611 59997 87756 -62121 -18664 -15752 214094 371782 -216583
14458 -216583 -117298 -105597 -101975 -66386 -170030 -284357 -681441 -817735 -559568 -234741
14448 -234741 358631 526683 186461 33495 -132657 -296436 -400254 -460098 -272334 122479
14438 122479 454160 17010 -232470 276477 101450 -571168 -542448 -608647 -413513 -33079
14428 -33079 145897 684577 -18949 -578707 -613926 -752831 -547101 -136396 -136165 15568
14418 15568 -461606 -975772 -964195 -661766 -648192 -94118 -193759 -238585 -248248 -171187 350057
14407 350057 959357 554802 -36192 -689981 -634122 -674620 -465055 -359957 -241251 -411632
14397 -411632 -599589 -150775 -101106 -150052 -234636 -298002 6988 -3156 8987 74506 -106357
14386 -106357 -232396 25014 -165327 -564976 -559091 -542987 -350251 -128644 -188113 -468399
14376 -468399 -488596 -944644 -708444 -254910 95910 205958 132723 -40815 7847 358618
14366 358618 274928 -143635 -534440 -404298 -312466 -75866 108857 164459 67110 228937
14356 228937 -34042 -350212 -317998 -429177 -304148 -475524 -487635 -456525 -509045 -273231
14346 -273231 101445 70603 -277717 -227027 -325479 -674004 -601520 -312291 -329646 -155163
14336 -155163 219717 121813 108605 -406715 -621083 -708250 -489108 -423392 -762839 -842320
14326 -842320 -628248 -504721 -384397 17169 -59399 -82586 -55766 115180 337612 208322
14316 208322 -24077 -187191 -89673 -139520 -535550 -768231 -945273 -829255 -540201 -23808
14306 -23808 -127541 -148078 75444 -346195 -501824 -209647 -354113 -535201 -632933 -526300
14296 -526300 -473945 -95387 305906 229724 27021 -53579 -223930 -634990 -467447 -312042
14286 -312042 -220177 -188550 95499 268725 -63545 -546994 -267918 -201799 -335221 -516121
14276 -516121 -60617 549776 574339 477225 -235045 -567035 -201768 -240779 -281742 33498
14266 33498 385753 271660 -213813 -171015 -10289 102093 460433 464735 488659 298313
14256 298313 271848 -105348 12486 295562 403054 269195 108083 316663 223259 20391
14246 20391 -243586 -524211 -439754 -365626 -383578 -391099 120697 359346 340647 96777 -457573
14235 -457573 -463635 -32120 -223790 -144821 286019 467175 303189 381625 78358 -78325
14225 -78325 274891 29846 -74465 -428519 -758486 -494895 -449779 -299299 -185843 -142085
14215 -142085 -245347 5462 344931 142160 -167821 -198823 -394067 -268967 -231663 -262034
14205 -262034 -611016 -333077 114542 206407 -197166 -112260 -138937 -225703 -283529 -281846 -317803
14194 -317803 -246737 -643385 -1309930 -1001617 -261384 -114092 -382296 -375178 -67340 -363836
14184 -363836 -919881 -546779 -168238 -317919 -499478 -308812 -562938 -716299 -570200 -292779
14174 -292779 -103204 -87416 -341770 -380249 -543282 -872680 -630568 -556469 -183392 -55476
14164 -55476 24294 -266768 -310581 -68555 -6968 -314677 -567602 -446602 -446218 -356540 -163070
14153 -163070 -323086 -247738 197247 296032 -331593 -404607 -18238 87314 135664 189492
14143 189492 -203117 16032 327075 62280 -53919 386011 603685 401145 222978 180517
14133 180517 108812 -175814 -441349 -504497 -251003 -139870 -253913 -381252 -225208 -65864
14123 -65864 181313 -30863 -348866 -105790 -207380 95709 297380 160405 106759 168102
14113 168102 182646 91424 24729 -698296 -858622 -419482 -16983 467664 399240 147437
14103 147437 -36014 174486 629545 327442 -169294 21226 -17003 -202802 -78700 630
14093 630 33579 22713 247373 466913 -90951 -365795 -336459 -197715 -40404 -8324 68300
14082 68300 -387012 -774018 -551482 -638875 -606066 -281010 61932 -138913 -180636 263998
14072 263998 229806 217109 99656 107822 -167964 -347404 -288350 -312875 -399576 -118105 -163582
14061 -163582 3020 65204 145605 -118252 -308691 -308640 -289483 -184318 -218423 -363327 -126215
14050 -126215 303287 220439 311992 694949 749140 584658 214718 -232779 -353100 -390262
14040 -390262 -141619 46446 236715 20896 -469989 -746952 -611528 -489542 -351830 -95686
14030 -95686 -55146 -10895 139258 181904 533700 244030 69840 285338 309648 672873
14020 672873 626484 75703 106178 329862 435239 311754 342403 539184 405310 669717
14010 669717 521213 334880 66861 -308495 -405871 -418253 -171519 3216 -26984 -15578
14000 -15578 -229785 -142081 174780 273614 203901 406473 452523 59684 -454416 -567873
13990 -567873 -1054491 -789376 -874718 -1149582 -1211663 -857133 -486014 -761942 -758480 -419068
13980 -419068 -418199 -844831 -1051178 -726396 -606960 -515470 -565764 -816300 -867397 -575062 -672429
13969 -672429 -763444 -1040315 -978009 -720183 -480259 -67402 -8877 89209 -232347 8573
13959 8573 226047 241914 59227 -290487 -361346 -2029 64373 182967 316400 328724 -171150
13948 -171150 -471058 -456323 -711192 -1088692 -1116743 -1113515 -823455 -511101 -505528 -449988 -321805
13937 -321805 -142091 -119133 -260915 -198621 -228105 -298999 -646960 -555682 -542072 -380773 -456694
13926 -456694 -597443 65270 332457 -145469 -383919 -593897 -743401 -48070 234535 362816
13916 362816 38419 -211279 -6322 113997 -163049 122197 80790 -16370 389136 498156
13906 498156 125526 40869 221468 56453 59891 95470 183296 261508 369513 899290 1137238
13895 1137238 648638 277338 -235925 61713 222930 -15961 -290151 -119476 -56912 364121
13885 364121 702491 605614 551687 226436 -57269 241579 185674 -8519 -81330 -318
13875 -318 29966 196249 322652 499069 264098 178253 188063 -178365 -824183 -565360 355720
13864 355720 431211 -99288 -374253 -434203 -569495 -395418 3742 -183254 -133101 81070
13854 81070 86645 206681 -117415 -181009 15162 -68906 317754 748737 396804 3299
13844 3299 -106009 -362959 -85088 341991 368716 479219 339403 25406 106702 520606
13834 520606 880516 1035124 1001617 748273 694588 522499 240894 73900 539612 614727
13824 614727 257648 53104 -179882 -146411 -468118 -463312 -200659 -59802 -122578 -123814 98992
13813 98992 -117364 -496398 -658073 -484877 -212661 6486 309615 174700 -68025 39194
13803 39194 45902 -143169 120880 124762 66634 -97642 -341028 -318127 23987 193130 434312
13792 434312 150344 -110350 -362382 -373080 -450741 -402836 -352034 -142880 -94856 -412048
13782 -412048 -464723 -626385 -979166 -956785 -235394 -272311 105926 1067384 1328435 696793
13772 696793 259477 229755 246182 -178355 -673832 -512496 -712189 -773459 -584559 -408078
13762 -408078 -395582 -284203 -194727 -147158 -207223 -282571 44428 281662 161386 43831
13752 43831 -182335 -305851 -397495 -475813 -112260 -47290 -444493 -667801 -290834 -107833
13742 -107833 -282939 -343527 -352222 -270581 -394180 -279918 219552 463738 447927 564122
13732 564122 148822 -240476 -283121 140295 342861 442990 264688 19216 -33672 39087
13722 39087 274096 287318 367826 451840 384659 606877 174926 2800 509062 725541
13712 725541 655190 574831 339927 -330321 -531657 -75889 449102 348360 88845 -104424
13702 -104424 -71679 -68444 73109 368068 12721 -106112 -225009 43013 -22533 -187080
13692 -187080 -143763 288303 307322 414529 706265 758937 478899 310118 311791 104220
13682 104220 37555 175692 410439 124396 269006 573408 457747 -76892 -182204 27288
13672 27288 17862 -195053 -1067 16817 -254958 -573587 -496722 -544111 -160740 -73535 -215026
13661 -215026 -536974 -869685 -951891 -1036871 -933679 -1143269 -1112444 -935787 -487339 -310710
13651 -310710 423742 755680 228600 -256765 -44300 -242497 109657 238108 54513 -58982
13641 -58982 -55791 255753 400471 43174 -274501 -212356 -17575 256177 571202 613974
13631 613974 565148 558071 347184 -91690 -102339 -420053 -167190 -255354 75602 143791 69913
13620 69913 273831 407415 362930 460362 370811 147242 -205145 -342189 -472338 -659175
13610 -659175 -616511 -596978 -427202 -394404 -79977 -267135 -537421 -291893 -338360 -393662
13600 -393662 -275809 -124348 -457966 -301330 -110527 -231379 -62388 -115474 -344827 -801990
13590 -801990 -950916 -1172019 -887315 -404696 -86356 -444257 -451881 -74638 141427 299386
13580 299386 69510 5570 -152999 -320865 -30685 439702 153758 -29914 75607 104281
13570 104281 405470 14736 -154560 -356989 -360909 -17355 385665 649543 523756 228073
13560 228073 -186290 -230476 -58295 120964 217264 -167429 -414768 -153344 -137463 -154722
13550 -154722 -13426 -45627 133940 607787 263185 175788 247460 171043 -145299 -248381
13540 -248381 -68442 269172 34335 87732 80713 -5984 -433449 -698567 -572669 -703983
13530 -703983 -554689 -727820 -771959 -625939 -556057 -417355 -17055 -78527 -171318 -38179
13520 -38179 -96408 -172370 -465667 -851860 -958459 -830899 -332177 -301000 -115669 328925
13510 328925 505954 487812 96269 5077 330458 420451 372530 73256 -266026 -247498
13500 -247498 -228948 -270543 -264903 -162174 39710 230744 62785 -94450 95458 528702
13490 528702 743561 308358 61462 -174287 -436512 -477831 -503254 -590748 -632575 -620066
13480 -620066 -493101 -732756 -398235 98366 166421 -397923 -555005 -341254 -213635 -133725
13470 -133725 117331 -6054 -429498 -60421 219192 296431 569246 233707 -20275 -243685
13460 -243685 -499683 -517213 -250213 211787 -123030 -717903 -399811 72103 -5574 -73120
13450 -73120 194151 288041 172195 294333 625296 652174 17073 -308692 13343 166032
13440 166032 -236572 94215 302942 37991 -222495 63872 216385 37229 -367557 -11473
13430 -11473 281000 471154 531465 446769 611685 779154 642934 40211 -215776 -618842
13420 -618842 -535543 -625040 -457547 -315331 -146467 -178305 246821 397926 -7554 -86809
13410 -86809 172787 188421 -70517 -122808 111769 107780 -207407 -196706 -784289 -659462 -604205
13399 -604205 -499410 -38129 51782 -44021 -41716 210956 200095 182795 654114 652357 39642
13388 39642 -32640 362073 457803 271078 36791 238288 288677 229517 144317 -149380 -191129
13377 -191129 -193460 12317 -151606 40562 199967 331355 273233 252140 242503 61902 -118980
13366 -118980 -110366 -122257 -320393 -353868 -387130 -317973 -478374 -352274 -314403 -434269 -409636
13355 -409636 -272832 -369627 -108662 -132661 -230322 -143276 -148484 -547455 -560921 -23637 -250088
13344 -250088 -278169 -610739 -916081 -854130 -666679 -417847 -571221 -517101 65070 -27491
13334 -27491 78148 546844 -225763 -478417 -506244 -774025 -914188 -475919 -324725 -36724
13324 -36724 -370122 -529044 -426874 -134310 -100482 -23860 -189110 -311661 -128958 -215077
13314 -215077 -477040 -598911 -370259 -18876 -186798 -125297 -99553 -104824 -114420 -37098 -230739
13303 -230739 -153478 -43916 -154612 106174 312437 534126 243318 -102302 -470412 -664697
13293 -664697 -591706 -194883 35327 -457817 -406390 -19729 175843 446081 784368 649820
13283 649820 587397 110093 -19070 -5916 -307067 2495 567059 117185 75120 325873
13273 325873 664602 906789 460332 -217731 -315677 -333829 -564958 -614555 -151416 225576
13263 225576 -231276 -381134 -500835 -754211 -651002 -320682 -129851 86471 184664 375154
13253 375154 390354 -45769 -259222 -224809 -210966 -459364 2384 313217 332329 175033
13243 175033 -248799 -255602 -408413 -361570 -380714 -369201 -216635 -370528 -688486 -597923 -343099
13232 -343099 21073 50460 316396 -87686 -579770 -477183 -570893 -491101 -419056 -29426
13222 -29426 82109 -132686 -191019 -246967 -415374 -510711 -678970 -599571 -200150 21165
13212 21165 96817 46379 158280 67770 -208498 -132749 -195479 -415143 -495630 -1499 216341
13201 216341 -148438 -407288 -365980 -415038 -213592 38301 372834 -75756 -739085 -1088731
13191 -1088731 -969954 -596387 -183022 -149196 102304 292340 284143 38012 59596 455158
13181 455158 472905 125365 -138496 276140 324787 225806 -11553 -19073 197595 -125577
13171 -125577 -650148 -532809 -260651 -246532 -289847 -211757 -60585 -255539 -153981 227364
13161 227364 57637 14141 14311 53098 179039 113062 -81532 180775 -298741 -387293 -372739
13150 -372739 -74476 -155056 -246396 -296721 157074 214844 71246 111694 -94323 -90725 163520
13139 163520 445795 445216 381078 314484 110130 355120 76351 -267228 -160863 254636
13129 254636 -147327 -521254 -396311 -698296 -848167 -736495 -713045 -519750 -430739 -589376
13119 -589376 -620027 -744754 -934466 -700645 -370362 -244123 -571330 -866027 -487140 -272932
13109 -272932 75402 408963 574147 136520 -238583 -296415 -163781 6067 -406981 -378022
13099 -378022 -649724 -630245 -569504 -66467 222173 139131 -370056 -808211 -913415 -877566
13089 -877566 -843200 -651501 -594861 -518584 -661363 -750541 -454913 -349098 -118365 -228893
13079 -228893 -449785 -59006 -6870 130945 156148 -48668 180048 279686 52424 -196846
13069 -196846 -270538 299412 551646 453135 349072 -36013 -252209 -286089 -430051 -259365
13059 -259365 -214929 -160769 -301940 -382410 -319773 165154 103987 361101 310390 -106147 -669528
13048 -669528 -470592 -335595 -155181 203142 128981 -268363 -789233 -642011 -607848 -746048
13038 -746048 -290489 156520 420925 40474 -166319 -106271 77289 53841 -315894 -157784
13028 -157784 190096 150687 -407306 -425263 -126487 46652 -198902 -309576 -247972 -298578
13018 -298578 -411219 -263438 -439658 -640972 -438443 248281 250725 228417 562454 459486
13008 459486 236882 80661 -44842 -66034 307184 230284 -73125 -352035 -20257 224124
12998 224124 -160523 -251826 196937 337395 -9528 -216680 -243773 -244891 -240214 -226657 133218
12987 133218 109164 44258 -355774 60883 413343 735802 536952 547558 717062 599992
12977 599992 123658 -201652 -183058 -580142 -822472 -738704 -248802 -277461 -406589 -114411
12967 -114411 -78565 -160471 162725 319885 289914 203445 -16744 169773 -14331 303062
12957 303062 388395 314302 -89371 221758 465001 522926 399218 -26705 -397057 -385962
12947 -385962 -419936 -370116 -732186 -789150 -432306 -370021 -235673 -573480 -609273 -94778
12937 -94778 424506 609043 357577 59814 127202 269498 -53563 -222471 -102755 -138814
12927 -138814 -61403 -325431 -878211 -666690 -455335 -26412 92592 381661 239923 277487
12917 277487 -65014 -588285 -651387 -124436 224390 464232 719617 1025698 943627 412500
12907 412500 -306664 -129489 -72215 75991 367101 480725 181444 77251 -68755 -216253
12897 -216253 -281618 -469697 -448403 -745370 -600665 -606245 -772011 -907402 -581191 -17676
12887 -17676 851770 696999 240913 -723050 -640170 157855 791737 262857 -295791 -774070
12877 -774070 -657472 -247007 -102971 -124291 115064 69934 -90163 381158 296518 329245
12867 329245 128405 -85865 178491 70578 -95849 4277 -171637 -257085 -40472 486046
12857 486046 634222 260218 69008 -141262 -363521 -306735 -163356 -274937 -298551 -257861
12847 -257861 -34531 -211426 -136604 -189519 -929721 -441848 -266548 -61248 253765 256949
12837 256949 471070 208824 -9229 -407275 -533971 -275861 -209043 -91095 -24902 159339
12827 159339 -33753 -127111 -203680 -425551 -345630 -32796 460 -110717 -90975 -540760
12817 -540760 -792135 -790448 -574244 -536528 -578490 -413832 -163484 -88727 160696 364378
12807 364378 416167 126247 -436328 -525208 -316812 -470766 -187755 200949 336517 19375
12797 19375 -3906 325207 325655 25339 -239224 -443030 -152137 29738 27246 -76310 -280088
12786 -280088 -608975 -565781 -102141 194669 214071 92505 -92910 -609743 -1068421 -1021810
12776 -1021810 -699207 -352610 -11386 153821 337948 111309 -241282 39822 95378 -72298
12766 -72298 -105960 -341276 -438868 -469643 -620406 -674413 -415080 -45633 -358079 -614365
12756 -614365 -426606 -382677 -214544 -241917 -587931 -672262 -466201 -279582 -289642 -404517
12746 -404517 -825055 -549518 48373 250182 168538 364617 446098 534286 803493 706824
12736 706824 641754 667608 336884 247777 369989 431886 -44807 -308704 190347 223772
12726 223772 -357905 -244969 -208914 -192758 -137612 -292234 -441256 -141772 444036 763810
12716 763810 689008 263504 210153 -161835 -536458 -350711 -116367 107264 98452 145057
12706 145057 -60326 -302161 -232932 -215343 -127855 -63337 291430 352195 239869 232003 -295991
12695 -295991 -320750 -208827 48489 506702 800977 804453 817373 760618 578210 487296 499530
12684 499530 347919 -118381 -133174 296446 394007 552667 706680 778794 691462 111784
12674 111784 -504771 -357560 -337826 -541247 -780271 -522229 -106929 -223863 -297877 -442330
12664 -442330 -591467 -210169 -27281 -260097 -322402 232585 490975 115341 30208 -225311
12654 -225311 -236812 -120692 -251465 -248369 -36727 96762 -394657 -453929 -51866 -197940
12644 -197940 -480555 -590596 -161264 302044 554301 352370 -108651 -9124 149852 -508128
12634 -508128 -926290 -976193 -1209046 -1213732 -398227 -288730 -625553 -625057 -609484 -468412 -354865
12623 -354865 -23381 453270 379601 -113131 -121500 -972 -316907 -579710 -291508 -34680
12613 -34680 -136587 -182924 -158248 -147011 -75209 -159636 -76463 226491 310329 453793 261885
12602 261885 -332017 -444026 -450294 -193305 -607425 -833051 -658909 -777064 -644947 -475180
12592 -475180 -502114 -450552 104833 335869 417087 578117 652290 253921 -74258 -405246
12582 -405246 -459844 -104855 396258 57558 -97292 -420360 -876151 -642729 -425110 -13683
12572 -13683 671372 906316 992640 776424 387662 223316 421164 714709 699838 349881
12562 349881 24653 108160 245431 667670 438187 296487 200315 39079 133268 347379
12552 347379 431264 223981 6659 -234388 -356311 -535498 -678606 -486959 23194 43887
12542 43887 -95881 -131692 -52968 319418 364423 170430 154124 170083 -15954 -187706 -350213
12531 -350213 -716407 -506235 -113891 369863 410528 408903 696270 842558 873174 965365
12521 965365 1095021 497796 -361599 -609203 -541698 -446231 -357067 -24226 -365419 -633500
12511 -633500 -595164 -829062 -462023 -74727 -253661 -656075 -814622 -891676 -704336 -659983
12501 -659983 -951750 -588821 87908 365016 60183 -272701 161148 416604 65746 -254535
12491 -254535 -619986 -116351 199923 341307 524314 455119 239645 -95845 -197608 -388070
12481 -388070 -641961 -370171 -305560 -124651 212142 384606 500565 538518 358097 325071
12471 325071 275179 277897 81155 103603 376118 665788 563560 693022 814924 933753
12461 933753 737541 411800 175051 -3725 -374728 -423235 -595100 -800365 -678427 -94974
12451 -94974 427512 289666 187902 -360814 -792552 -685596 -383515 -168670 -226704 -394682
12441 -394682 -137606 -80591 97375 422720 680753 655653 909367 712889 458769 676084
12431 676084 690474 724851 287157 -64871 180494 -62245 -168305 382766 755977 616242
12421 616242 156151 -100641 -359558 -451109 -600919 -1104742 -989698 -501982 105048 309313
12411 309313 307353 41636 -228351 -336715 -436741 -922198 -1002936 -249097 -221576 -315472
12401 -315472 161346 -418332 -692749 -708264 -427498 -250247 42155 -2723 79270 103649
12391 103649 -120119 -251350 80144 394942 -41834 -264936 32288 9520 -132258 -146941
12381 -146941 82184 99606 -115069 5966 50688 197359 350886 122156 52750 176967
12371 176967 439190 169686 -55222 130154 78345 -310674 -168769 -172655 -71886 206925
12361 206925 73647 206224 319784 365104 70752 -220973 -18163 -303908 -640301 -529483
12351 -529483 138467 790630 660308 174923 -57255 32025 -497687 -513978 48727 583954
12341 583954 903456 836421 873347 643437 393628 179710 316197 259226 311000 350899
12331 350899 232571 -53545 -221507 -7419 -201305 -329967 -454962 -544925 -246617 39645
12321 39645 -152754 -604050 -491068 -276072 -217507 162641 137500 -260292 -311546 -9581
12311 -9581 -140078 -497411 -540638 -123869 -173241 -71016 -139635 -156807 -211594 -268214 -378616
12300 -378616 -298349 -290980 -474760 -251930 -257326 -67142 98353 -52742 -175649 -420293
12290 -420293 -204953 -133749 -659136 -996638 -982430 -321595 4450 -240587 -18660 414509
12280 414509 510717 540336 158288 237797 93006 175092 270564 463189 440050 524575 604167
12269 604167 570473 451432 200503 -53012 -281503 -696442 -713925 -380632 -84529 130522
12259 130522 474454 392951 5277 -353188 -345275 -22665 569460 342164 184606 244915
12249 244915 -244771 -250646 -268112 -264506 17049 209027 614804 471180 -833 -91857 -138850
12238 -138850 -26658 249840 258848 -196899 -119064 97554 -372796 -513060 -319240 -201206
12228 -201206 -227058 -233981 -154536 141108 -97608 -473625 -324516 87722 471432 200427
12218 200427 69605 -341722 17583 235615 103882 132058 247937 177922 395095 36027
12208 36027 -44415 -149078 -87903 32993 291816 98964 184915 516365 907487 445944
12198 445944 -138698 -550340 -438666 -259613 -314717 -84744 -8557 -267105 -413770 -602049
12188 -602049 -938124 -730180 -261729 -171087 -81748 132861 146938 9949 147398 194426
12178 194426 90275 -14110 58982 355771 233775 240864 92449 269855 454426 126165
12168 126165 -414205 -317356 56620 -2944 -78694 216754 81551 -291885 -300706 -243394 -195301
12157 -195301 266585 716750 656141 464002 404137 886998 891669 690905 463310 -278333
12147 -278333 -155793 -111747 446502 893493 461107 -209519 -464363 -345211 -126243 81195
12137 81195 -21588 -167123 -508131 -563128 -582614 -626079 7340 161743 -553395 -139952
12127 -139952 -93286 -672860 -275637 -149023 220227 4090 -325616 -78763 213128 539326
12117 539326 426907 -66854 -241769 -185531 -324778 -366148 -306110 -377261 -592893 -858483
12107 -858483 -821122 -830105 -393831 -271184 -109047 325096 514772 596860 437347 337300
12097 337300 226080 -159928 -326514 -155544 -169462 148672 322335 319898 341240 510028
12087 510028 457038 151639 -227140 -269230 23051 362112 -20717 -28218 39521 -674241
12077 -674241 -655168 -514306 -211054 2431 -431448 -365761 -505388 -575270 -403740 31325
12067 31325 419423 254715 110004 16194 -115490 -409222 -370686 -486246 -773805 -660293
12057 -660293 -616794 -636377 -504399 -377717 -182988 211116 203122 270660 373407 295238 623593
12046 623593 179947 156273 395719 -21774 -152906 -57257 -273277 -198333 -259766 -239079
12036 -239079 -145332 -76156 -332902 -414496 -312175 -485498 -339171 -330953 -511051 -340900
12026 -340900 32038 -3777 -87229 121742 8271 -170838 41459 -252400 -617706 -867035
12016 -867035 -657231 -580281 -447053 -660386 -432640 -113226 -123065 11509 7646 -363895
12006 -363895 -649657 -381326 105669 670111 553866 49292 -62651 169443 79836 439077
11996 439077 400751 -208210 -244698 74988 273754 138580 178202 95442 -64637 -259426
11986 -259426 -124522 -440496 -414768 -272131 -496747 -617181 -227630 -17211 390783 243078
11976 243078 -228556 -183792 -239028 -176194 -225435 -256314 142033 467282 74597 -102399
11966 -102399 -137875 -196590 -242562 -220312 -88016 229806 230046 455941 479998 340896 154942
11955 154942 166441 125953 247353 181492 -201632 -136295 -41311 -241009 -31330 233701
11945 233701 554061 149585 -250958 -246071 26405 191758 412700 321442 -10188 -722033
11935 -722033 -788767 -640723 -913900 -710987 -513798 -520803 -573960 -514823 -198829 309906
11925 309906 511140 551209 523379 452547 577170 513097 212905 -117857 -136531 108866
11915 108866 167697 -235068 -160753 -322413 -596048 -493237 -349314 -107480 9359 483453
11905 483453 561367 184014 -69572 -358847 -612320 -312710 66160 372795 420229 391460
11895 391460 97270 42710 -14981 -381081 -284635 -88888 -169300 -296782 41355 23683
11885 23683 137696 267270 371812 160006 -39109 34703 -246229 -256521 -175809 -111160
11875 -111160 -775821 -623584 -127548 8096 -2704 312535 84149 11217 82852 471808
11865 471808 807077 442023 -229908 -430465 -515457 -369451 -246303 -422427 -168792 418406
11855 418406 386825 134379 309164 -1817 -119144 -464790 -691631 -691114 -545981 -402156
11845 -402156 -476757 -196924 -104634 -91702 269904 462093 405711 592522 520025 514329 689373
11834 689373 259983 -397955 -240075 241438 876548 725348 393794 119614 78859 437256
11824 437256 7410 -420073 -898725 -1287524 -957630 -396918 -47648 117952 -271299 -542987
11814 -542987 -128930 595678 784435 590174 366159 336190 381047 152499 -74691 -528059
11804 -528059 -16290 177056 7103 295892 321104 563458 477020 221092 -18857 -85928
11794 -85928 -163256 148047 214150 -109664 -105170 2335 -70185 -340593 -478659 -587786 -296735
11783 -296735 210129 115645 -108101 -147599 -301273 -413864 -314304 -147764 108097 300370
11773 300370 -52411 -76988 -69630 -105865 -172414 -27450 -321867 -82840 -25695 -221410 48010
11762 48010 387120 465159 377865 -134363 -404479 -312988 61767 29086 -235845 -401888
11752 -401888 -504456 -177251 -43960 -11137 10370 -232689 -188092 -386283 -597382 -741492
11742 -741492 -455024 -481460 92435 214446 263009 731810 667763 332975 216725 326302
11732 326302 414763 208584 238218 326547 86553 -138443 68030 578086 549371 111900
11722 111900 84574 380194 239734 100829 418635 386451 387806 652645 836523 735608
11712 735608 558579 54913 9168 656045 531774 15355 -363354 -44376 168658 44214
11702 44214 295786 327112 184981 -51610 -180501 -53578 67049 286937 445008 423596
11692 423596 325257 17246 -211565 356202 290541 287327 195550 -307366 -476550 -353187
11682 -353187 -62572 124343 191911 138410 405141 446135 620799 697328 693220 942173 975076
11671 975076 552049 494317 648044 579709 202497 244792 -24956 -338815 -514895 -549751
11661 -549751 -129045 -5636 -222877 -182014 -261574 -448326 -848028 -837748 -367304 -197820
11651 -197820 -210891 -196116 -361363 -438291 -450944 -205506 -221753 -361512 -389408 -514712 -243934
11640 -243934 -12456 337234 336973 195586 320256 44819 -594797 -853271 -387852 -71287
11630 -71287 -398084 -150863 210361 607728 542280 508794 575436 606246 688153 815587 698847
11619 698847 -10956 -271403 -115114 -319214 -76835 133755 -186109 65541 184301 433628
11609 433628 1677 -171141 -185971 -57661 -112378 -53068 207095 257673 27214 -370824
11599 -370824 -159474 305161 2097 -531308 -381351 -617484 -681694 -899810 -436949 -498447
11589 -498447 -516673 -229266 221438 374822 259898 -4408 107582 101160 190397 574537
11579 574537 267312 -171360 -145200 188739 156926 108318 496307 181235 -81855 -90801
11569 -90801 -12770 109789 -64570 -248147 126199 376552 310034 305484 127406 147182 -363833
11558 -363833 -314844 -113611 -251996 -161139 -236978 -553647 -386220 -341952 57325 298531
11548 298531 13047 -183640 -399540 -375304 -689106 -761243 -173752 63661 -325823 -21904
11538 -21904 320179 76529 -227284 220848 -23994 -183919 1513 453870 643695 352241
11528 352241 499482 331797 264821 231556 565869 411344 -112787 -400980 -275955 -247368
11518 -247368 -244788 26799 -109777 -320913 -630862 -668072 -387080 -333602 -340954 -299138 -724815
11507 -724815 -519169 -523494 -710104 -531415 -361068 -122999 -342858 -59320 -129482 -461336
11497 -461336 -491204 -253615 -112442 -371038 -392789 -169453 -199670 -563794 -654082 -516013
11487 -516013 -470214 -557144 -350549 -231642 -169200 37126 109922 255609 86687 8498
11477 8498 330801 337362 167085 102185 -160136 -133619 42004 367182 625312 826473 358719
11466 358719 -179971 -396605 -378336 -170118 -385386 -323606 -238259 -149637 107580 214720
11456 214720 444656 436804 -91923 -486402 -60258 -135231 -127315 -262103 -291668 21437 -21149
11445 -21149 377035 343255 14932 164590 69796 -233507 22492 286912 -19340 -374801
11435 -374801 -240977 -93969 -347913 -19178 644860 510761 214000 227429 120103 310312
11425 310312 279523 384937 -4728 -79668 150581 56922 -24567 222964 235294 235297 -90567
11414 -90567 -385643 -558901 -83041 330065 456507 353769 242269 67086 303892 391092
11404 391092 303659 426153 283443 250859 410933 93610 -232317 -326528 -629997 -438111
11394 -438111 -459167 -639655 -796148 -861443 -998031 -836533 -779790 -527080 -609171 -857647
11384 -857647 -831058 21407 -308 -38773 -35690 73637 -5744 -171825 -670793 -779109 -1112651
11373 -1112651 -1149456 -461614 -140886 -94285 199703 205588 -291932 -206508 -481499 -562562
11363 -562562 -400062 62123 758962 844380 635766 49251 -112153 157413 37031 -5426
11353 -5426 60336 342987 430631 388056 447282 610819 477477 42740 -25400 -6248 -518132
11342 -518132 22322 644182 479907 396478 20667 -362289 -29487 395248 293552 197849
11332 197849 -10699 -75019 13189 4286 100327 79283 183768 108043 86712 754840 974515
11321 974515 608709 625206 668804 547370 401131 333526 214249 267790 476347 797338
11311 797338 723466 234672 -143467 -136767 -160814 -138298 51633 302643 192609 -207157
11301 -207157 -116835 -449617 -205102 605768 785924 673625 151597 -92904 -27041 -100458
11291 -100458 -173690 320661 446642 412023 160479 -212558 -427270 -472972 -142360 114188
11281 114188 88910 -114892 -259149 -308850 -63442 41450 -22611 54437 243206 -39227
11271 -39227 123457 199527 -4779 -76095 38503 181853 187274 136795 198523 -96773 -239597
11260 -239597 -87135 453774 701504 247073 -144421 -433599 -777619 -614540 -466971 -540916
11250 -540916 -419066 -193042 203235 309498 -66342 -181358 -336016 -401807 -428795 -263569
11240 -263569 -186577 -346284 -419723 -97676 -436364 -139594 -144053 -126881 -166763 232003 468644
11229 468644 318891 240620 331191 704180 602439 558391 84935 -188404 -313841 -306783
11219 -306783 -25047 337418 491332 111604 183329 559170 784591 888282 538549 -187287
11209 -187287 -447427 52615 308982 174104 353903 16560 -190123 -156665 -345453 -573308
11199 -573308 -662928 -404173 -417191 -696498 -548352 -527578 -328318 -486665 -696297 -18800
11189 -18800 144707 419728 1062811 980908 424432 46020 95987 111745 -124941 -57905
11179 -57905 156350 166233 21567 89453 -149632 214327 616276 392822 -199887 -458778
11169 -458778 -599263 -293259 -528921 -242420 262367 500850 183515 255747 135516 -313559
11159 -313559 -603627 -575318 -606371 -493738 -582572 -479882 -39943 88522 -37026 -21775
11149 -21775 221019 635983 455054 -285291 -835558 -823006 -660685 -618146 -24583 45967
11139 45967 312765 839835 911365 653611 436297 107752 -653322 -468891 -211363 -424273
11129 -424273 -511793 -762118 -680763 -423453 -241366 -134526 -81493 -345675 -91979 -28535
11119 -28535 39076 419703 443768 7607 -339951 -445441 -175937 21118 155115 68597
11109 68597 57504 -33987 -50229 261540 564045 428987 137219 289043 657005 360369
11099 360369 240707 17513 58536 292619 246835 228503 -131711 -293084 -473319 -637936
11089 -637936 -715289 -704677 -587574 -508464 -448478 -482132 -498187 -308613 267780 444796 451325
11078 451325 209744 -7845 -307770 -732202 -897118 -1066020 -769336 -499550 -243871 -88210
11068 -88210 12199 199554 123785 -367411 -154441 192768 365303 157987 40231 -310155
11058 -310155 -411210 -288742 30092 -3702 -110685 -151829 -375221 -175806 -33527 -9170
11048 -9170 -308104 -355260 -347090 -691802 -917957 -443307 -665970 -741149 -603496 -608427 -382667
11037 -382667 -548883 -265122 32175 476355 310310 173357 61346 39444 -199383 -336265
11027 -336265 110629 312979 376148 410447 360874 252535 82901 16570 -145784 -539418
11017 -539418 -616827 -565930 -551850 -256594 465384 299577 -118630 -267254 161866 77254
11007 77254 -13829 -492923 -165455 135004 92885 -79217 -279637 -180269 -742580 -419807
10997 -419807 209095 257773 344418 326847 395274 249150 -154394 -35202 -134164 -260710
10987 -260710 48746 297185 97219 -228342 87740 34277 -20753 273798 40978 -186034
10977 -186034 -16863 -103470 -46376 -208298 123479 234605 -283337 -546743 188144 642068
10967 642068 765083 598714 -73238 316596 156908 -165243 -277036 -439216 -712612 -772212
10957 -772212 -674096 -379658 -99973 204778 -95072 -1031 -248655 -188466 -513156 -528723
10947 -528723 -107012 -288120 -361084 -98603 13229 52673 -33164 -119640 45149 -152675
10937 -152675 -256711 219985 389678 297959 670250 825641 314007 522176 371610 278551
10927 278551 449199 565208 483821 130318 -40265 -52996 -38532 -146952 -326177 -565770
10917 -565770 -627206 -373742 -153612 115454 502548 918685 901008 659491 -49637 -638435
10907 -638435 -722766 -256980 -96887 -279806 -320461 -384623 -292385 180014 302460 57799
10897 57799 -38760 312713 194388 46258 -360474 -608812 -152973 -353531 -212728 262566
10887 262566 504474 512205 -122662 -98182 5032 58949 127735 617122 510600 310511
10877 310511 296677 200260 161127 -43263 -220634 -196980 -297944 188439 -366643 -1055597
10867 -1055597 -829074 -1031624 -928211 -770825 -650654 -468898 -211327 113978 414939
10858 414939 379625 229705 165533 217065 129586 68385 28778 -94824 52977 518264 399895
10847 399895 222271 -91776 303445 407201 368410 275258 86182 318324 467763 374987
10837 374987 342275 118494 12885 191220 544237 865821 807334 681561 432005 -40216
10827 -40216 -451105 -189070 -275524 -281491 -101407 7720 266886 591892 346847 53016
10817 53016 -125872 -305516 -463531 -765227 -516620 -137806 420725 426595 -72358 -336719
10807 -336719 193629 472145 541959 638939 1062744 429060 134586 646 84649 86195
10797 86195 86850 68731 136643 251091 36309 -232958 73152 -282713 -185296 -262994 -354315
10786 -354315 -182058 41184 635880 604393 267411 145883 -117520 -257279 -393498 -483265
10776 -483265 -624514 -739026 -785042 -400568 -55868 296046 110255 133929 132914 292086
10766 292086 558489 698735 459978 189543 41635 -99145 -419066 -765804 -544156 -775805
10756 -775805 -443155 -7852 -102861 -30777 -67902 171816 -641002 -956180 -678349 -35273
10746 -35273 25928 38340 -56070 -45709 -217552 -287432 3149 -174121 -556518 -668075 -844541
10735 -844541 -750246 -709091 -461596 -579219 -630112 -831835 -762530 -797534 -641183 -507111
10725 -507111 -205014 305172 -76710 -181929 145342 493030 370944 63409 -84877 -317489
10715 -317489 -416835 -39162 49599 70553 516531 436709 408794 79648 40027 161481 103841
10704 103841 369418 115861 160305 8322 -18563 -144294 46444 291156 123725 -108495
10694 -108495 163857 351818 459542 889455 799112 700029 875294 762805 213891 -127694
10684 -127694 215095 538687 837799 1144934 233690 -449112 -401285 -272610 -237325 -374641
10674 -374641 -514420 -455008 -555742 -725887 -461042 -230800 276266 434646 319068 240415
10664 240415 627232 549782 56268 -260119 -341971 -205835 -1638 -185011 -334862 -71664
10654 -71664 466329 397593 112171 -198716 -479887 -526665 -203166 378684 306002 109428
10644 109428 67033 -13808 177132 -77392 -560797 -860795 -1022641 -258404 301365 163406
10634 163406 64951 -255118 -556265 -451035 -242736 -153679 -20851 39137 100655 -146403
10624 -146403 382993 463166 252024 546024 495764 167280 201851 402069 371595 250877
10614 250877 38618 91976 151724 354950 480612 633615 482391 179814 163050 485323
10604 485323 454618 455749 103074 -234645 -291208 -5778 406767 609389 734892 334263
10594 334263 -221289 -365983 -175751 -50176 -310838 -160225 -19950 461408 473633 -73528
10584 -73528 -573470 -273253 -150008 122201 8856 -105996 -129082 -183073 15233 -22057
10574 -22057 225211 187188 118308 571173 24587 -235462 -165060 -156879 -315597 -409227 -904666
10563 -904666 -653404 -211431 -73090 39784 184621 313458 168791 -72569 -229184 -181979
10553 -181979 -175126 -341039 -205375 53412 20133 -109844 -161384 -214125 -205966 -323218 -375911
10542 -375911 -286944 144696 342922 -33692 -331867 -252692 -258383 -173678 -404996 -272606
10532 -272606 205005 230101 158262 238873 41381 -69636 -133934 -344913 -631153 -525671
10522 -525671 -423666 -118883 -59915 -449584 -365397 -140047 315826 361169 245426 57570
10512 57570 -462200 -632395 -382386 -14877 304758 278943 285543 646849 754937 512132
10502 512132 -8899 -165746 221864 241917 455617 831549 1219266 523369 -55228 -32214
10492 -32214 135682 9359 -318647 -368838 -233881 -237918 -303515 -4254 233935 686118
10482 686118 1000757 954640 87262 226210 712296 984958 836315 624871 431880 650864
10472 650864 744077 781279 625524 315260 429161 284925 518206 404827 -9705 -347020
10462 -347020 -4985 335733 246374 284876 112836 -21037 -298331 -254358 -56917 190415
10452 190415 311032 69501 36377 23680 37173 92860 145061 98333 -159469 438482 517573
10441 517573 177552 555325 469325 56568 -674734 -417716 -298741 10435 430268 385989
10431 385989 -24791 412055 425170 191310 396129 347084 241243 -176871 -428524 -425878
10421 -425878 -354789 -388500 -226301 -123727 -2744 -246517 -257991 -130207 -140719 -112546
10411 -112546 -169147 -181597 -274477 -230507 -122957 -324229 -355761 -120235 209207 60558
10401 60558 429810 645054 129075 133824 716093 841711 721508 376539 358243 261765
10391 261765 262281 47015 -425330 -593165 -220001 -12315 -58853 -30123 -83433 -189840 -67496
10380 -67496 -197273 -381504 81872 298557 397299 444279 351277 579791 172408 208482
10370 208482 726861 453105 8574 -77536 -199754 81689 -151469 32677 -421862 -843479
10360 -843479 -142989 243511 303735 258532 362062 406607 581729 585744 -101992 -118158 -119606
10349 -119606 -12310 78378 11049 -182285 -287966 -72380 194131 -629852 -884329 -501659
10339 -501659 -298548 -167828 -127740 18226 47066 213763 114859 -28899 481205 341480
10329 341480 209740 316157 203868 698060 1027743 950569 407274 182444 -222900 -258546
10319 -258546 -116050 -163892 -100099 -476027 -379574 -27388 -166433 -189656 65220 606983
10309 606983 612843 155325 172825 380784 662786 414148 80688 209458 97045 324816
10299 324816 701485 462401 274354 158044 95645 -175584 -336376 -157780 -205419 141520
10289 141520 -58032 190305 244206 232824 290936 52593 -81598 187899 342079 687876
10279 687876 704237 748207 446719 402881 453669 500221 65045 -62858 -39338 105856 -106137
10268 -106137 -440330 -1060899 -820480 -223306 -113370 114607 141993 446324 631561 374310
10258 374310 478992 639694 562097 500817 270194 404591 449861 -133397 -240772 -200697
10248 -200697 43731 271013 394696 617062 268748 172232 395339 376876 139632 116322
10238 116322 52657 -57523 -198891 -329213 -501230 -563785 31305 312465 -250327 -457323
10228 -457323 -513979 -244701 -234595 -278957 -9220 322331 -133085 -680605 -1088229 -916406
10218 -916406 -673745 -331687 146455 660595 757781 514409 213420 285573 278130 55150
10208 55150 -146277 -243771 -270922 -166561 155426 333888 113816 -441178 -560686 -634771
10198 -634771 -695963 -521732 -312379 361890 614376 406990 741584 885598 588171 316932
10188 316932 188170 402156 616552 224194 62664 156525 284937 68373 -248618 -500982
10178 -500982 -486865 -348588 -415737 -355341 -455153 -799459 -562954 -316664 335155 610989
10168 610989 741730 688356 561476 213866 233657 804196 746925 454393 256768 191530
10158 191530 558476 934399 501297 -302454 -559821 -285954 75332 217520 243125 145788
10148 145788 125942 358413 324261 223713 43800 -547483 -516483 -214576 196329 -111026
10138 -111026 -375762 -133216 323481 830515 1061933 642833 580778 768178 1011468 1075953
10128 1075953 1133640 1209645 479068 -14227 263222 281434 146962 231783 412447 657756
10118 657756 765541 509670 393768 611335 590166 75068 -391478 -109887 57369 34791
10108 34791 -474363 -756670 -597698 -580718 -259798 -40923 237600 15129 246879 129829
10098 129829 -23617 1169 -52566 275912 143278 170348 654619 311348 -61464 67795
10088 67795 101924 95438 321947 60685 -119755 -122489 -348564 -403043 -188782 166726 198458
10077 198458 19929 -201013 -14922 -93927 -361324 -354106 -451108 -230536 -25932 387764
10067 387764 -43677 -318539 -112512 -41441 -419232 -480850 -61608 286121 432954 703911
10057 703911 567970 479295 240924 161635 648553 816888 778770 779921 545778 675887
10047 675887 569831 549802 387843 260195 286825 398301 432445 726567 764103 785777
10037 785777 754665 582336 48989 -222814 -456453 -386378 -58955 129366 -96985 -84985
10027 -84985 298442 282439 36062 -30446 -98755 -228857 -265016 -652408 -106285 121989
10017 121989 -33315 -263754 -402239 -622097 -396131 -207879 -277413 -610663 -434855 -364575
10007 -364575 -180594 26075 -148989 -230740 -77849 160759 -177628 -174175 -56636 227043
9997 227043 619005 957352 1325650 1126717 673244 51651 -760631 -779761 -435007 -164881
9987 -164881 -91258 -64454 88306 8238 32918 -486189 -512021 -442074 -304567 -206278 -116778
9976 -116778 -65153 -263251 -470096 -335390 -209344 116847 199630 293067 633984 401159
9966 401159 221725 334995 449066 200899 212315 104400 80782 739390 965262 828919
9956 828919 634324 310106 315496 463490 235922 156528 115357 262536 388001 115983
9946 115983 -294140 -475388 62322 5811 -317572 -382050 -44566 562059 780742 387971
9936 387971 -18927 -359011 -303605 -164650 -196547 136973 281393 448925 379487 -105008
9926 -105008 -416565 230887 310580 474061 442442 342034 271880 574619 470058 107530
9916 107530 -147988 -240683 -36938 -332359 -668055 -397188 -409195 -403221 107374 195548 -395712
9905 -395712 -237893 -26368 -199047 -410605 -305513 -56576 201236 615636 437774 693088
9895 693088 698707 733727 476742 435949 495900 261888 200441 416867 332540 497050 740408
9884 740408 790950 978064 574520 315802 280484 437130 372114 401584 72607 -334995
9874 -334995 3581 37632 342119 649847 729297 502715 322594 134722 180437 361200
9864 361200 -17303 -588566 -333685 -92595 -172008 -332451 24286 381720 532105 646105
9854 646105 491210 68721 186817 359448 273695 360270 263575 338242 40031 -273649
9844 -273649 -84848 335370 395049 118033 197651 335142 -258910 -538526 -433551 -313343
9834 -313343 -395720 -144447 -127595 -265 579896 468128 369277 400906 -7766 104304
9824 104304 351347 300078 177206 442527 632074 220597 136855 25396 611034 840471
9814 840471 572464 298942 386517 454552 195381 433101 857430 427610 158670 401748
9804 401748 743142 285374 -89562 590095 742417 581784 792956 1248819 1073675 647536
9794 647536 55747 -286230 -273377 66108 409151 229779 315973 469704 70606 153223
9784 153223 620883 517350 10575 -35758 24341 -8494 10168 36276 268105 650083 751322
9773 751322 177443 -402244 -857915 -542257 -44019 42098 321215 536884 347543 282116
9763 282116 281108 190347 -47696 -7126 349846 329485 202700 216850 -30483 171078 384666
9752 384666 487428 792800 668279 497609 436702 793770 841879 568727 821281 705455
9742 705455 -58647 -603942 -785560 -383234 -78294 75611 429891 623506 548947 447752
9732 447752 439156 234101 305334 645336 811216 568534 380631 333848 220024 308738 441882
9721 441882 410106 895605 1323746 1068662 1253237 1595762 1450519 1484063 1519903 1405740
9711 1405740 643715 206891 -111120 82503 153644 129512 348737 419517 774110 979027
9701 979027 733569 832497 843068 762804 353978 94460 189461 780779 696015 546233 606463
9690 606463 481063 673326 650080 813559 873161 538920 306395 225226 224848 -7258 1274
9679 1274 -31455 4671 -141983 -250392 157549 250439 158431 159403 178279 213285 367612 386802
9667 386802 806721 688955 717996 689402 396856 216106 104201 401848 591284 422437
9657 422437 569799 729727 768936 858188 971993 1038244 790074 373228 46496 -31319
9647 -31319 423893 542909 433466 426970 307116 141283 -65900 30910 346236 354029 509641
9636 509641 485089 472164 514150 450838 476398 973939 1040864 876487 972583 965000 683265
9625 683265 968229 628770 216973 191686 65024 -154654 77499 551131 1081480 1356610
9615 1356610 1532369 1185421 801728 486098 438597 712528 813174 924225 778566 547647
9605 547647 269900 206870 411479 673230 1057899 873740 941652 605519 642712 688735
9595 688735 603387 758675 793030 667661 861847 546640 282941 66090 157067 430791
9585 430791 494466 13397 29894 502523 787554 535698 315225 755294 1248550 1511992
9575 1511992 1445926 1304274 1548269 1757091 2029967 1936808 1650471 1554524 1355418 1234588
9565 1234588 1135913 860268 553195 390110 798549 896425 660738 709493 789804 998671
9555 998671 705644 995688 1441220 1623531 1693468 972650 607182 758134 679440 724520
9545 724520 805778 1247421 1564088 1416936 1229423 1151861 1122372 1239449 1335154 748501
9535 748501 333872 374864 621641 719142 992638 871376 774527 797351 516321 537743 646845
9524 646845 951860 799582 554110 656507 938188 911683 1013268 1311014 1298489 990223
9514 990223 867102 809857 475004 556140 786219 835839 1499194 1444445 954774 659885
9504 659885 529161 737675 986606 1329033 1504017 1468763 1137443 1101191 1107984 1005959
9494 1005959 1422813 1168763 736209 480957 451354 113747 124433 477903 769199 1148079
9484 1148079 927275 929900 1094011 791995 411971 540652 786559 954485 763641 706518
9474 706518 430699 195228 132754 577606 1098162 1311651 1429738 1403841 1550276 1422493
9464 1422493 1609877 1480495 1440849 1409148 1761116 1640080 2044559 1765087 1139008 918979
9454 918979 923933 1064881 1552896 1930734 1920732 2070597 1470693 1047271 1375024 1842130
9444 1842130 1913636 1854743 1460860 1900496 1940995 1653727 1701385 1127765 981250 1316747
9434 1316747 1724154 1649890 1382404 1317229 1870245 1676074 1972919 1935846 2128664 2258130
9424 2258130 1770666 1139578 984522 773640 607762 1139651 1612694 1906927 1956759 1723123
9414 1723123 1138479 1391261 1313625 1281095 1641045 1940554 2097410 1619550 1311075 1658855
9404 1658855 1783126 1751820 1770968 1831228 1866562 1800854 2008550 2198918 2759295 2614947
9394 2614947 2399124 2326731 2527430 2581626 2341529 2105376 2173900 2478639 2697717 2525109
9384 2525109 2694823 2687957 2406223 2543458 2664634 2185400 1695352 1716146 1897914 1874143
9374 1874143 2269943 2558055 2415068 2159408 2252833 2585058 2486472 2124138 2271887 2575840
9364 2575840 2792499 2912686 2815451 3272681 2938982 2626897 2809221 3106200 3459880 3288082
9354 3288082 3504706 3449034 2977346 2955834 3149243 3009310 3278221 3580927 3505012 3459575
9344 3459575 3116128 2982903 3247509 3602806 3752434 3731136 3407283 3422258 3468933 3405049
9334 3405049 3810207 3605396 3376073 3238849 3529834 3511471 3655909 3854072 3625053 3686971
9324 3686971 4132940 4541844 4594269 4067486 4022273 3950765 4193542 4455137 4274820 4013840
9314 4013840 3780190 3739687 3991736 4122579 4222617 4127522 4306815 4394706 4462409 3898637
9304 3898637 3904018 4577647 5257923 5468096 5585205 5159838 5057435 4886311 4528801 4498102
9294 4498102 4427197 4318287 4183230 4795360 4577491 4079894 4479291 4571209 4918780 5056345
9284 5056345 5266763 5066513 5122669 5531727 5481907 5900581 5841227 5891961 6036194 6149846
9274 6149846 6588962 6629885 6705626 6632167 6730932 6615815 6597662 6725054 6721078 6974561 7068748
9263 7068748 7293776 7054173 7297058 7804382 8278799 8371348 8145192 7769727 7295581 7151643
9253 7151643 7124334 7121603 7171192 7293921 7351834 7488283 7513905 8019179 8412725 8107761 8465318
9242 8465318 8626960 8754004 8944322 8642079 8704157 9054434 9439326 9339529 8884274 8935984
9232 8935984 8990711 9127955 9339172 9905839 10359554 10457090 10319311 9886174 9656669 10274013
9222 10274013 10660688 10345771 10464540 10839302 10459361 10540017 11049782 11347522 11701041 11784578
9212 11784578 11621395 11889401 11803418 11664881 11984761 12541847 13082236 13167106 12958899 12974595
$$ [...]
##END NTUPLES=NMR SPECTRUM
##END=
