##TITLE=Analysis number 323799
Compound Code sb 00348
Book Reference b
Project Code adrs
Chemist Name ian speare
##JCAMPDX= 6.0         $$ Bruker NMR JCAMP-DX V2.0
##DATA TYPE= NMR SPECTRUM
##DATA CLASS= NTUPLES
##ORIGIN= Bruker BioSpin GmbH
##OWNER= nmr
$$ XWIN-NMR		Version 3.5
$$ Tue Nov  7 17:40:58 2006 GMT Standard Time (UT+0h)  MAYBRIDGE\nmr@NMR_250MHZ
##.OBSERVE FREQUENCY= 250.131544655141
##.OBSERVE NUCLEUS= ^1H
##.ACQUISITION MODE= SIMULTANEOUS (DQD)
##.ACQUISITION SCHEME= undefined
##.AVERAGES= 16
##.DIGITISER RES= 18
##SPECTROMETER/DATA SYSTEM= dpx250
##.PULSE SEQUENCE= zg30
##.SOLVENT NAME= CDCl3
##.SHIFT REFERENCE= (INTERNAL, CDCl3, 0, 16.522)
##AUDIT TRAIL= $$ (NUMBER, WHEN, WHO, WHERE, WHAT)
$$ ##TITLE= Audit trail, XWIN-NMR		Version 3.5
$$ ##JCAMPDX= 5.01
$$ ##ORIGIN= Bruker BioSpin GmbH
$$ ##OWNER= nmr
$$ C:\u/data/dgb/nmr/ADRS/2330/pdata/1/auditp.txt
$$ ##AUDIT TRAIL=  $$ (NUMBER, WHEN, WHO, WHERE, WHAT)
(   1,<2006-11-07 17:40:22.92 +000>,<MAYBRIDGE\nmr>,<NMR_250MHZ>,
      <created by zg, POWCHK disabled, PULCHK disabled
       configuration hash MD5:
       49 4B E0 1D 92 C2 6B 37 9F E6 65 BC 52 41 86 1D
       data hash MD5: 64K
       AF 77 5B 34 8C F4 CC 4C 36 7A 77 B0 8A 1A 11 0F>)
(   2,<2006-11-07 17:40:39.93 +000>,<MAYBRIDGE\nmr>,<NMR_250MHZ>,
      <Start of raw data processing
       ef LB = 0.3 FT_mod = 6 PKNL = 1 SI = 32K 
       data hash MD5: 32K
       FA D7 3E 27 F0 2D E1 BA CD 94 73 86 68 56 6E A1>)
(   3,<2006-11-07 17:40:44.32 +000>,<MAYBRIDGE\nmr>,<NMR_250MHZ>,
      <apk 
       data hash MD5: 32K
       7A 41 D0 C9 40 14 7F FA 89 59 9A 6B 87 88 70 A8>)
(   4,<2006-11-07 17:40:45.86 +000>,<MAYBRIDGE\nmr>,<NMR_250MHZ>,
      <abs ABSG = 5 
       data hash MD5: 32K
       2D F8 95 E0 66 02 87 1C 79 86 2F 87 C8 21 B0 CF>)
$$ ##END=
$$ 
$$ hash MD5
$$ E4 30 F6 87 A2 84 8D 26 5B 14 B2 ED FE 3E 02 A6
##$RELAX= 
##$RELAX= 
##$RELAX= 
##$RELAX= 
##$RELAX= 
##$RELAX= 
##$RELAX= 
$$ Bruker specific parameters
$$ --------------------------
##$DU= <C:\u>
##$EXPNO= 2330
##$NAME= <ADRS>
##$PROCNO= 1
##$TYPE= <nmr>
##$USER= <dgb>
##$AMP= (0..31)
100 100 100 100 100 100 100 100 100 100 100 100 100 100 100 100 100 100 
100 100 100 100 100 100 100 100 100 100 100 100 100 100 
##$AQSEQ= 0
##$AQ_mod= 3
##$AUNM= <au_zg>
##$AUTOPOS= <28 >
##$BF1= 250.13
##$BF2= 250.13
##$BF3= 250.13
##$BF4= 250.13
##$BF5= 500.13
##$BF6= 500.13
##$BF7= 500.13
##$BF8= 500.13
##$BYTORDA= 1
##$CFDGTYP= 0
##$CFRGTYP= 5
##$CHEMSTR= <none>
##$CNST= (0..31)
1 1 145 1 1 1 1 1 1 1 1 1 1 1 1 1 1 1 1 1 1 1 1 1 1 1 1 1 1 1 1 1 
##$CPDPRG= <>
##$CPDPRG1= <>
##$CPDPRG2= <>
##$CPDPRG3= <>
##$CPDPRG4= <mlev>
##$CPDPRG5= <mlev>
##$CPDPRG6= <mlev>
##$CPDPRG7= <mlev>
##$CPDPRG8= <mlev>
##$CPDPRGB= <>
##$CPDPRGT= <>
##$D= (0..31)
0 1 0 0 0 0 0 0 0 0.06 0 0 0 0 0 0 0.0002 0 0 0 0 0 0 0 0 0 0 0 0 0 0 
0 
##$DATE= 1162921220
##$DBL= (0..7)
120 120 120 120 120 120 120 120 
##$DBP= (0..7)
150 150 150 150 150 150 150 150 
##$DBP07= 0
##$DBPNAM0= <>
##$DBPNAM1= <>
$$ [...]
##$SUBNAM7= <"">
##$SUBNAM8= <"">
##$SUBNAM9= <"">
##$SW= 20.6930455092707
##$SWIBOX= (0..15)
0 0 3 0 0 0 0 0 0 0 0 0 0 0 0 0 
##$SW_h= 5175.983436853
##$TD= 65536
##$TD0= 1
##$TE= 683.16
##$TE2= 300
##$TE3= 300
##$TEG= 300
##$TL= (0..7)
0 120 120 120 120 120 120 120 
##$TP= (0..7)
150 150 150 150 150 150 150 150 
##$TP07= 0
##$TPNAME0= <>
##$TPNAME1= <>
##$TPNAME2= <>
##$TPNAME3= <>
##$TPNAME4= <>
##$TPNAME5= <>
##$TPNAME6= <>
##$TPNAME7= <>
##$TPOAL= (0..7)
0.5 0.5 0.5 0.5 0.5 0.5 0.5 0.5 
##$TPOFFS= (0..7)
0 0 0 0 0 0 0 0 
##$TUNHIN= 0
##$TUNHOUT= 0
##$TUNXOUT= 0
##$USERA1= <user>
##$USERA2= <user>
##$USERA3= <user>
##$USERA4= <user>
##$USERA5= <user>
##$V9= 5
##$VALIST= <valist>
##$VCLIST= <CCCCCCCCCCCCCCC>
##$VD= 0
##$VDLIST= <DDDDDDDDDDDDDDD>
##$VPLIST= <PPPPPPPPPPPPPPP>
##$VTLIST= <TTTTTTTTTTTTTTT>
##$WBST= 1024
##$WBSW= 4
##$XGAIN= (0..3)
0 0 0 0 
##$XL= 0
##$YL= 0
##$YMAX_a= 533484
##$YMIN_a= -485276
##$ZGOPTNS= <>
##$ZL1= 120
##$ZL2= 120
##$ZL3= 120
##$ZL4= 120
##$ABSF1= 16.522
##$ABSF2= -4.171173
##$ABSG= 5
##$ABSL= 3
##$ALPHA= 0
##$AQORDER= 0
##$ASSFAC= 0
##$ASSFACI= 0
##$ASSFACX= 0
##$ASSWID= 0
##$AUNMP= <proc_1d>
##$AZFE= 0.1
##$AZFW= 0.1
##$BCFW= 0
##$BC_mod= 0
##$BYTORDP= 0
##$COROFFS= 0
##$CY= 12.5
##$DATMOD= 1
##$DC= 0
##$DFILT= <>
##$DTYPP= 0
##$F1P= 14.0000005364418
##$F2P= -0.99999901652339
##$FCOR= 0.5
##$FTSIZE= 32768
##$FT_mod= 6
##$GAMMA= 0
##$GB= 0
##$INTBC= 1
##$INTSCL= 1
##$ISEN= 128
##$LB= 0.3
##$LEV0= 0
##$LPBIN= 0
##$MAXI= 10000
##$MC2= 0
##$MEAN= 0
##$ME_mod= 0
##$MI= 0
##$NCOEF= 0
##$NC_proc= -2
##$NLEV= 6
##$NOISF1= 0
##$NOISF2= 0
##$NSP= 0
##$NTH_PI= 0
##$NZP= 0
##$OFFSET= 16.522
##$PC= 1
##$PHC0= -41.57633
##$PHC1= 4.912241
##$PH_mod= 1
##$PKNL= yes
##$PPARMOD= 0
##$PSCAL= 4
##$PSIGN= 0
##$REVERSE= no
##$SF= 250.13
##$SI= 32768
##$SIGF1= 0
##$SIGF2= 0
##$SINO= 400
##$SIOLD= 32768
##$SREGLST= <1H.CDCl3>
##$SSB= 0
##$STSI= 32768
##$STSR= 0
##$SW_p= 5175.98343685301
##$SYMM= 0
##$S_DEV= 0
##$TDeff= 65536
##$TDoff= 0
##$TI= <Analysis number 999999
Compound Code 99
Book Reference 9
Project Code 9>
##$TILT= no
##$TM1= 0
##$TM2= 0
##$TOPLEV= 0
##$USERP1= <user>
##$USERP2= <user>
##$USERP3= <user>
##$USERP4= <user>
##$USERP5= <user>
##$WDW= 1
##$XDIM= 32768
##$YMAX_p= 383623448
##$YMIN_p= -82205
$$ End of Bruker specific parameters
$$ ---------------------------------
##NTUPLES= NMR SPECTRUM
##VAR_NAME=  FREQUENCY,     SPECTRUM/REAL,   SPECTRUM/IMAG
##SYMBOL=    X,             R,               I
##VAR_TYPE=  INDEPENDENT,   DEPENDENT,       DEPENDENT
##VAR_FORM=  AFFN,          ASDF,            ASDF
##VAR_DIM=   32768,         32768,           32768
##UNITS=     HZ,            ARBITRARY UNITS, ARBITRARY UNITS
##FACTOR=    0.157963299565203, 1,           1
##FIRST=     4132.6476996994, 0,             0
##LAST=      -1043.33573715361, 0,           0
##MIN=       -1043.33573715361, -82205,      0
##MAX=       4132.6476996994, 383623448,     0
$$ Real data points
##PAGE= N=1
##DATA TABLE= (X++(R..R)), XYDATA
$$ [...]
$$ plain form
18997 -27754 -11793 -4512 4294 6088 1408 -9946 -30155 -36006 -36468 -58409 -41076 -11986 -14899
18984 -14899 -24448 -34480 -28136 -473 -1022 18540 30272 10133 3713 5767 -5573 -20894 -16890
18971 -16890 -2434 -731 -22514 -35520 -29366 -15146 12750 -675 -12982 -16878 -8077 18823
18959 18823 5822 -13108 -16350 -29917 -19888 -32465 -31978 -35867 -10515 6800 7614 8573 13969
18946 13969 9960 -1722 -3013 -4508 25817 50474 56901 53907 31654 17898 13810 -984 -27932
18933 -27932 -12996 5196 15871 2631 1501 5736 -77 6005 -362 -8143 6907 -11499 -33091
18920 -33091 -50797 -56050 -46385 -33256 2809 8798 11088 -22654 -45575 -34620 -32363 -18785 14792
18907 14792 11815 3158 -16518 -16134 -13201 -10007 9457 1604 -13051 -37226 -13055 -3588 -16451
$$ packed form
18997b7754J5961P281Q806J794m680j1354k0209n851m62k1941J7333K9090k913
18984a4899r549j0032O344K7663n49J9562J1732k0139o420K054j1340j5321M004
18971a6890J4456J703k1783j3006O154J4220K7896j3425j2307l896Q801K6900
18959A8823j3001j8930l242j3567J0029j2577M87l889K5352J7315Q14R59N396
18946A3969m009j1682j291j495L0325K4657O427k994k2253j3756m088j4794k6948
18933b7932J4936J8192J0675j3240j130M235n813O082o367p781J5050j8406k1592
18920c3091j7706n253R665J3129L6065N989K290l3742k2921J0955K257J3578L3577
18907A4792k977q657j9676L84K933L194J9464p853j4655k4175K4171R467j2863
$$ plain form
18894 -16451 -18212 -17558 -12458 1835 28206 39338 52643 49183 14315 394 11230 1542 -14365
18881 -14365 -3884 20415 6694 -6946 -8297 -18510 -38586 -46590 -43063 -24312 -18698 -29629
18869 -29629 -35092 -22730 -20795 -10066 -4452 -5568 6208 16082 14251 20449 11377 -1744 12283
18856 12283 22904 17958 17067 10396 7978 7503 5229 -5482 -865 14091 10390 -11410 -18463 -2580
18842 -2580 -8046 -13246 -17935 -19372 -15696 -18772 -18471 -7620 -4794 -17241 -10407 16266 9490 3519
18828 3519 8878 -7676 -26553 -31038 -8994 465 5810 2471 -19121 -23019 -23250 -26365 -26885 -17213
18814 -17213 5619 8867 4265 3998 14008 22047 34618 16250 -32392 -27068 5126 41826 59033
18801 59033 25440 -6817 -21101 -23975 -20033 -28977 -35159 -44753 -27244 -15252 -11309 3630 -7206
$$ packed form
18894a6451j761O54N100J4293K6371J1132J3305l460l4868j3921J0836r688j5907
18881a4365J0481K4299j3721j3640j351j0213k0076q004L527J8751N614j0931
18869b9629n463J2362J935J0729N614j116J1776R874j831O198r072j3121J4027
18856A2283J0621m946q91o671k418m75k274j0711M617J4956l701k1800p053J5883
18842b580n466n200m689j437L676l076L01J0851K826j2447O834K6673o776n971
18828C519N359j6554j8877m485K2044R459N345l339k1592l898k31l115n20R672
18814a7213K2832L248m602k67J0010Q039J2571j8368m8642N324L2194L6700J7207
18801E9033l3593l2257j4284k874L942q944o182r594J7509J1992L943J4939j0836
$$ plain form
18788 -7206 -2487 32 -17786 -18767 -11165 -8766 -1711 15898 11643 9193 -2102 -7307 -11955 -7842
18774 -7842 7234 25969 44841 63146 97995 119155 115609 94863 84451 67721 25541 34919
18762 34919 37688 21764 27350 29298 28535 29170 40071 42773 40753 27355 17493 5608 12280 18896
18748 18896 2436 10756 30480 18952 -13171 -6111 -1445 -11647 -6319 -5975 -12627 -26134 -37008
18735 -37008 -34323 -27203 -9770 15567 26128 8067 3254 5182 2511 3889 866 3891 13342
18722 13342 30150 42935 25406 12210 19706 24000 11745 -519 24137 30200 27990 36537 20735
18709 20735 -318 -2137 -8013 -12994 -9306 -19122 -12630 -4442 -19882 -24714 -24259 -24894 -15173 -28708
18695 -28708 -11808 -4587 -3997 -18908 -51331 -47809 -40966 -29192 -17851 -3374 -21374 -40189 -25075
$$ packed form
18788g206M719K519j7818r81P602K399P055J7609m255k450j1295n205m648M113
18774g842J5076J8735J8872J8305L4849K1160l546k0746j0412j6730m2180R378
18762C4919K769j5924N586J948p63O35J0901K702k020j3398r862j1885O672O616
18748A8896j6460Q320J9724j1528l2123P060M666j0202N328L44o652j3507j0874
18735c7008K685P120J7433K5337J0561j8061m813J928k671J378l023L025R451
18722A3342J6808J2785j7529j3196P496M294j2255j2264K4656O063k210Q547j5802
18709B0735k1053j819n876m981L688r816O492Q188j5440m832M55o35R721j3535
18695b8708J6900P221N90j4911l2423L522O843J1774J1341J4477j8000j8815J5114
$$ plain form
18682 -25075 -4525 -2601 -9591 -15381 544 -6389 -15331 -4034 -7281 -4287 25952 21434 8488
18669 8488 5792 14129 32978 47904 39726 19802 14259 20365 37490 12455 -22794 -22202 -19679
18656 -19679 -34645 -7058 19626 15087 9554 10632 1331 -6587 4975 -4374 -1719 5997 -3985
18643 -3985 4390 -884 -7776 -5557 -9044 -17126 -22578 -35476 -26072 -6332 -3054 -3656 -8963 -3445
18629 -3445 -13143 -6634 -6226 -20177 -761 11253 7215 4455 9242 3228 12246 1055 -12663 910
18615 910 19469 17641 24007 28876 17908 2997 4054 8559 8151 -163 -13446 -1586 12484 24631
18601 24631 23749 28780 20215 15129 16731 13917 8868 31337 20490 -18802 -27467 -33356 -31977 -29070
18587 -29070 -5989 -6848 -26654 -26678 -12037 -8722 -18176 -3934 1600 -7745 14810 26084 8820
$$ packed form
18682b5075K0550J924o990n790J5925o933q942J1297l247K994L0239m518j2946
18669H488k696Q337J8849J4926q178j9924n543O106J7125k5035l5249N92K523
18656a9679j4966K7587K6684m539n533J078r301p918J1562r349K655P716r982
18643c985Q375n274o892K219l487q082n452j2898R404J9740L278o02n307N518
18629c445r698O509M08j3951J9416J2014m038k760M787o014R018j1191j3718J3573
18615I10J8559j828O366M869j0968j4911J057M505m08q314j3283J1860J4070J2147
18601B4631q82N031q565n086J602k814n049K2469j0847l9292q665n889J379K907
18587b9070K3081q59j9806k4J4641L315r454J4242N534r345K2555J1274j7264
$$ plain form
18574 8820 -12199 -1166 1484 -5964 -3911 19457 5956 3053 -1685 -9399 12841 16694 858
18561 858 -10173 15984 43058 33153 26250 -5898 -22644 2046 24625 39743 27373 3415
18549 3415 -3852 -9543 -20885 -17379 -23903 -22819 -7018 -179 2706 1676 -13774 -18353 -2912 21458
18535 21458 2335 -30925 -32540 -32230 -20403 -9294 -5668 -2167 3299 -4852 -5892 -1203 6532 9413
18521 9413 2724 -1210 -14432 -17321 -17788 -18885 -35415 -43474 -29737 -21860 9805 24871 29563 12291
18507 12291 -1981 7098 9711 -10103 -21753 -4811 14277 11817 11983 -8807 -29347 -30771 -20776
18494 -20776 -20685 -11234 12234 20760 35084 -1832 -8955 1198 4984 -1500 -1217 1367 10691 -3994
18480 -3994 -8020 -5016 -9023 -11844 -11144 -14798 3103 18589 -1201 -18098 389 9729 14030 26488
$$ packed form
18574H820k1019J1033K650p448K053K3368j3501k903m738p714K2240L853j5836
18561H58j1031K6157K7074r905o903l2148j6746K4690K2579J5118j2370k3958
18549C415p267n691j1342L506o524J084J5801O839K885j030j5450m579J5441K4370
18535B1458j9123l3260j615L10J1827J1109L626L501N466q151j040M689P735K881
18521I413o689l934j3222k889m67j097j6530q059J3737P877L1665J5066M692j7272
18507A2291j4272R079K613j9814j1650J6942J9088k460J66k0790k0540j424R995
18494b0776R1R451K3468Q526J4324l6916p123J0153L786o484K83K584R324j4685
18480c994m026L004m007k821P00l654J7901J5486j9790j6897J8487R340M301J2458
$$ plain form
18466 26488 44067 49797 57299 37502 6280 21971 23361 -3266 -14711 -25060 -15588 -2169
18454 -2169 1454 5493 -5143 -13690 -745 24557 16925 8095 -11632 810 -10540 -17176 -22415
18441 -22415 -19137 -6906 6846 1390 -5669 -1033 3776 21627 36373 43095 8779 3287 23002
18428 23002 21873 7936 22489 24478 56098 85123 116853 159935 190696 230920 283084 308154
18416 308154 287713 257773 231151 209752 191915 185986 199239 232588 263828 305974 340642 338623
18404 338623 314178 281296 235001 164818 116879 107498 103757 88684 110712 112611 79251 82075
18392 82075 87712 76673 84677 81716 84151 68678 50053 37698 30501 50396 58728 70299 76545
18379 76545 69652 69455 60209 36855 18695 26404 34010 20096 25310 28050 32630 13250 -13295
$$ packed form
18466B6488J7579N730P502j9797l1222J5691J390k6627j1445j0349R472J3419
18454b169L623M039j0636q547J2945K5302p632q830j9727J2442j1350o636n239
18441b2415L278J2231J3752n456p059M636M809J7851J4746O722l4316n492J9715
18428B3002j129j3937J4553J989L1620K9025L1730M3082L0761M0224N2164K5070
18416C08154k0441k9940k6622k1399j7837n929J3253L3349L1240M2146L4668k019
18404C38623k4445l2882m6295p0183m7939r381l741j5073K2028J899l3360K824
18392H2075N637j1039Q004k961K435j5473j8625j2355p197J9895Q332J1571O246
18379G6545o893j97r246k3354j8160P709P606j3914N214K740M580j9380k6545
$$ plain form
18366 -13295 -1010 23147 40641 59580 51835 52309 49044 24236 18539 11071 -6238 5592 11344
18353 11344 17819 15004 32170 36982 29157 15011 28329 39985 56407 67509 37108 24694
18341 24694 31539 43018 61581 43932 30911 39046 28737 38936 43769 32507 15615 11248
18329 11248 27762 21157 18727 36565 23786 38496 23985 12614 19968 20018 20149 18174 46228
18316 46228 50217 41509 25428 36750 55678 52227 35650 31018 32137 32402 43178 49687 29314
18303 29314 23065 20555 11936 3581 17835 32932 47329 32235 30365 63040 67708 39995 18718
18290 18718 20493 26384 29715 30144 14265 -11258 -9156 1049 8218 624 -14948 -14062 6386 -1724
18276 -1724 -656 19659 38096 29367 29992 27311 26164 19533 19611 24366 27266 27527 13844 15777 13752
$$ packed form
18366a3295J2285K4157J7494J8939p745M74l265k4808n697p468j7309J1830N752
18353A1344O475k815J7166M812p825j4146J3318J1656J6422J1102l0401j2414
18341B4694O845J1479J8563j7649j3021Q135j0309J0199M833j1262j6892m367
18329A1248J6514o605k430J7838j2779J4710j4511j1371P354N0J31j975K8054
18316D6228L989q708j6081J1322J8928l451j6577m632J119K65J0776O509k0373
18303B9314o249k510q619q355J4254J5097J4397j5094j870L2675M668k7713k1277
18290A8718J775N891L331M29j5879k5523K102J0205P169p594j5572Q86K0448q110
18276a724J068K0315J8437q729O25k681j147o631P8M755K900K61j3683J933k025
$$ plain form
18261 13752 865 2271 -4589 2462 4152 -2958 -8441 -943 -8470 -15352 4612 4374 16564 -4052
18247 -4052 -7542 2281 8485 22390 17992 20493 3057 -22137 -9696 5099 1694 -3637 -7400
18234 -7400 -2296 -4544 -1751 3089 -13256 -14376 -2516 15848 26468 27564 33677 32702 34538 36839
18220 36839 44749 47832 54688 51786 28591 22261 32644 26389 24706 30343 19011 11311 9742 9844
18206 9844 14357 5681 8458 11233 19790 29278 10779 16093 48378 50490 43053 31043 10861 -10583
18192 -10583 7689 22085 38437 39227 51751 52079 55953 32333 42774 71942 80052 79209 68916
18179 68916 46998 30416 20252 15859 23499 40182 36275 48755 86057 124311 149484 207220
18167 207220 258100 300935 322080 309681 276899 220633 174069 166121 186818 217403 261919 261706
$$ packed form
18261A3752j2887J406o860P051J690p110n483P498p527o882J9964k38J2190k0616
18247d052l490R823O204J3905m398K501j7436k5194J2441J4795l405n331l763
18234g400N104k248K793M840j6345j120J1860J8364J0620J096O113r75J836K301
18220C6839P910L083O856k902k3195o330J0383o255j683N637j1332p700j569J02
18206I844M513q676K777K775Q557R488j8499N314L2285K112p437j2010k0182k1444
18192a0583J8272J4396J6352P90J2524L28L874k3620J0441K9168Q110q43j0293
18179F8916k1918j6582j0164m393P640J6683l907J2480L7302L8254K5173N7736
18167B07220N0880M2835K1145j2399l2782n6266m6564p948K0697L0585M4516k13
$$ plain form
18155 261706 251350 192363 153223 128484 106983 90623 87095 81687 73766 88012 95416 103400
18143 103400 117374 140402 148736 150204 146918 150796 166596 156959 179250 187819 191224 207901 240126
18130 240126 256552 255557 266255 294206 348646 419729 490739 568272 667999 800808 984662
18119 984662 1228079 1578544 2078760 2862041 4121284 6240586 9747758 14906030 20429121
18110 20429121 23117234 23104921 21174066 14966549 9453054 6508563 4939794 4011282
18102 4011282 3409320 3009116 2717380 2489682 2280006 2108289 1961489 1818795 1696240
18093 1696240 1586796 1488874 1392535 1288576 1203325 1133527 1076755 1007439 936732 864134 792829
18082 792829 740651 705518 673280 633155 620925 606961 571987 573505 560861 536862 533257 494091
$$ packed form
18155B61706j0356n8987l9140k4739k1501j6360l528n408p921J4246P404P984
18143A03400J3974K3028Q334J468l286L878J5800r637K2291Q569L405J6677L2225
18130B40126J6426r95J0698K7951N4440P1083P1010P7533R9727J32809J83854
18119I84662K43417L50465N00216P83281J259243K119302L507172N158272N523091
18110B0429121K688113j2313j930855o207517n513495k944491j568769r28512
18102D011282o01962m00204k91736k27698k09676j71717j46800j42694j22555
18093A696240j09444r7922r6339j03959q5251o9798n6772o9316p0707p2598p1305
18082G92829n2178l5133l2238m0125j2230j3964l4974J518j2644k3999l605l9166
$$ plain form
18070 494091 467738 432817 398001 403351 397122 377150 339382 317378 345872 323344 264681 229387
18058 229387 206949 213073 214485 190664 195922 209901 227105 221723 223012 209758 223019 238985
18046 238985 230962 206135 186376 211320 223419 221160 214034 213705 199006 197040 212484 228123 233063
18033 233063 225408 220120 220198 228114 234445 216195 202974 203004 201120 198902 187290 182299 177068 185873
18019 185873 185102 177229 166050 163658 162119 163491 160322 142695 119177 120758 111962 112185 97327 117738
18005 117738 103496 77440 69785 75286 72271 67364 50140 40785 52324 63348 74054 85582
17993 85582 90254 94374 115309 89691 99601 136589 138152 100318 80828 89374 101746 106437 105380
17980 105380 127121 153555 135319 136216 149002 162157 170639 188577 168724 155830 152850 170293
$$ packed form
18070D94091k6353l4921l4816N350o229j9972l7768k2004K8494k2528n8663l5294
18058B29387k2438O124J412k3821N258J3979J7204n382J289j3254J3261J5966
18046B38985q023k4827j9759K4944J2099k259p126l29j4699j966J5444J5639M940
18033B33063p655n288P8P916O331j8250j3221L0j884k218j1612m991n231Q805
18019A85873p71p873j1179k392j539J372l169j7627k3518J581q796K23j4858K0411
18005A17738j4242k6056p655N501l015m907j7224r355J1539J1024J0706J1528
17993H5582M672M120K0935k5618R910L6988J563l7834j9490Q546J2372M691j057
17980A05380K1741K6434j8236Q97J2786J3155Q482J7938j9853j2894k980J7443
$$ plain form
17968 170293 185137 188755 201810 195548 185042 189477 206048 203050 207256 219465 244856 243829 220617
17955 220617 233586 247536 250742 284540 309543 331502 352188 367083 372323 409801 431781 443909
17943 443909 439372 447102 455702 497192 549891 578653 617070 703472 814102 934284 1055047
17932 1055047 1182782 1312119 1444689 1604193 1781046 1949565 2092589 2190574 2283059 2398690
17922 2398690 2597159 2863912 3154779 3445975 3777913 4155282 4653514 5351491 6302483
17913 6302483 7591226 9396925 11983574 15774154 21467477 30236864 43726893 62959222
17905 62959222 86110197 107006310 118579174 117826464 104367241 81501774 58550610
17898 58550610 42138089 32139685 26082490 22113183 19290214 17170420 15527172 14206429
$$ packed form
17968A70293J4844L618J3055o262j0506M435J6571k998M206J2209K5391j027k3212
17955B20617J2969J3950L206L3798K5003K1959K0686J4895N240L7478K1980J2128
17943D43909m537P730Q600M1490N2699K8762L8417Q6402J10630J20182J20763
17932A055047J27735J29337J32570J59504J76853J68519J43024R7985R2485J15631
17922B398690J98469K66753K90867K91196L31938L77369M98232O97977R50992
17913F302483J288743J805699K586649L790580N693323Q769387J3490029J9232329
17905F2959222K3150975K0896113J1572864p52710j3459223k2865467k2951164
17898E8550610j6412521r998404o057195l969307k822969k119794j643248j320743
$$ plain form
17890 14206429 13137798 12262158 11521209 10911889 10369571 9782124 9159803 8506285 7914976
17881 7914976 7410511 6938713 6481786 6045066 5620622 5212035 4873013 4583857 4298083
17872 4298083 4024255 3779809 3576813 3412246 3255751 3097926 2948710 2801554 2671052
17863 2671052 2560630 2441975 2334801 2213460 2127375 2052083 1977271 1920390 1856637 1777625
17853 1777625 1719496 1687146 1639498 1600993 1547714 1482704 1401346 1345252 1311503 1275511 1241569
17842 1241569 1208911 1182880 1141518 1127621 1114096 1112093 1103090 1077796 1037779 1022692 1013243 988383
17830 988383 988701 1006838 1007486 1029049 1032181 1015616 991364 973272 937124 917886 875088 822255
17818 822255 787780 748110 714103 677681 631469 578554 529178 515246 493106 455955 457868 449003
$$ packed form
17890A4206429j068631q75640p40949o09320n42318n87447o22321o53518n91309
17881G914976n04465m71798m56927m36720m24444m08587l39022k89156k85774
17872D298083k73828k44446k02996j64567j56495j57825j49216j47156j30502
17863B671052j10422j18655j07174j21341q6085p5292p4812n6881o3753p9012
17853A777625n8129l2350m7648l8505n3279o5010q1358n6094l3749l5992l3942
17842A241569l2658k6031m1362j3897j3525k003r003k5294m0017j5087r449k4860
17830I88383L18J8137O48K1563L132j6565k4252j8092l6148j9238m2798n2833
17818H22255l4475l9670l4007l6422m6212n2915m9376j3932k2140l7151J913q865
$$ plain form
17806 449003 438622 391562 358246 317097 298181 296872 290339 253347 221992 201451 195659 201391
17794 201391 202658 168686 140217 120637 123812 133701 127207 121136 110065 119197 139631 144214 139801
17781 139801 129623 136519 125644 102376 105560 102346 112444 103535 102390 92471 89504 83722 79614
17768 79614 96829 108571 111376 94915 76183 78053 80353 69280 65628 51434 54744 67731 70755
17755 70755 84399 105594 134191 150042 157038 164513 139630 123441 116148 114130 105224 91376 78336
17742 78336 65908 83271 93103 74060 71958 83342 66531 53193 48247 40759 40814 31203 29546
17729 29546 35503 47342 61097 77611 69264 58192 58412 66137 67869 81879 87064 63571 51565
17716 51565 50180 59739 74563 73427 47501 34082 10105 10512 21979 34643 56371 60683 62107
$$ packed form
17806D49003j0381m7060l3316m1149j8916j309o533l6992l1355k0541n792N732
17794B01391J267l3972k8469j9580L175R889o494o071j1071R132K0434M583m413
17781A39801j0178O896j0875k3268L184l214J0098q909j145r919k967n782m108
17768G9614J7215J1742K805j6461j8732J870K300j1073l652j4194L310J2987L024
17755G0755J3644K1195K8597J5851O996P475k4883j6189p293k018q906j3848j3040
17742G8336j2428J7363R832j9043k102J1384j6811j3338m946p488N5r611j657
17729B9546N957J1839J3755J6514q347j1072K20P725J732J4010N185k3493j2006
17716E1565j385R559J4824j136k5926j3419k3977M07J1467J2664K1728M312J424
$$ plain form
17703 62107 64418 65526 53741 52619 60096 63928 61079 52943 46779 42999 40117 56121 64610 66197
17689 66197 66946 50725 72162 82702 73174 50582 38862 10501 6338 34103 42171 54167 75336
17676 75336 58959 44813 30926 19612 17854 16012 37129 44899 35251 38630 29137 13632 15453
17663 15453 3892 18641 32610 35142 24632 -2696 -11401 7925 17924 15726 28664 19456 22514
17650 22514 15941 -12 -9548 14114 17408 10208 -5302 -2052 23476 10255 14271 22204 34454
17637 34454 32907 29438 13504 11655 24071 12208 -127 11931 26525 22630 14745 7919 2638
17624 2638 16076 -2371 1790 -649 -21114 -22087 3385 21620 4257 -13303 -5502 3727 1552
17611 1552 -9604 311 5255 17273 16506 -11587 -19834 -4409 18791 26116 29450 58575 52702
$$ packed form
17703F2107K311J108j1785j122P477L832k849q136o164l780k882J6004Q489J587
17689F6197P49j6221K1437J0540r528k2592j1720k8361m163K7765Q068J1996K1169
17676G5336j6377j4146j3887j1314j758j842K1117P770r648L379r493j5505J821
17663A5453j1561J4749J3969K532j0510k7328q705J9326R999k198J2938r208L058
17650B2514o573j5953r536K3662L294p200j5510L250K5528j3221M016P933J2250
17637C4454j547l469j5934j849J2416j1863j2335J2058J4594l895p885o826n281
17624B638J3438j8447M161k439k0465r73K5472J8235j7363j7560P801R229k175
17611A552j1156R915M944J2018p67k8093q247J5425K3200P325L334K9125n873
$$ plain form
17598 52702 32852 23092 886 -15577 9530 90 -9593 -8207 7497 14111 4426 -9179 -9871
17585 -9871 -9000 11421 15838 -8190 -21675 -1637 16465 6727 -5279 -28254 -23998 -13613 -19137
17572 -19137 1524 6406 8628 14041 -8595 1164 16560 14919 11847 27454 14863 4831 17498
17559 17498 22248 14662 -7886 -7142 21935 27609 8617 2626 -3469 -8147 -2219 13329 162
17546 162 1531 -9947 -14465 -11303 -17036 -25814 -16918 -21985 -45294 -43366 7524 18832 4093 -1480
17532 -1480 -9006 -8739 -1991 20863 14154 -1049 5459 -4151 -6158 -9690 -8429 1643 24602 44237
17518 44237 16580 9013 -8669 -19699 -13757 -10701 -16222 -33840 -40561 -34911 -26997 -21865 -25299
17505 -25299 -14174 -10553 -7775 -21844 -59320 -63459 -40635 -16797 1324 3387 8136 8388 2570
$$ packed form
17598E2702j9850r760k2206j6463K5107r440r683J386J5704O614r685j3605o92
17585i871Q71K0421M417k4028j3485K0038J8102r738j2006k2975M256J0385n524
17572a9137K0661M882K222N413k2636R759J5396j641l072J5607j2591j0032J2667
17559A7498M750p586k2548P44K9077N674j8992n991o095m678N928J5548j3167
17546A62J369j1478m518L162n733q778Q896n067k3309J928N0890J1308j4739n573
17532a480p526K67O748K2854o709j5203O508r610k007l532J261J0072K2959J9635
17518D4237k7657p567j7682j1030N942L056n521j7618o721N650P914N132l434
17505b5299J1125L621K778j4069l7476m139K2824K3838J8121K063M749K52n818
$$ plain form
17492 2570 -5367 -14007 -20970 -7873 3096 -4523 -17037 -19827 -7373 9566 22915 7723 -14783
17479 -14783 -12871 -7713 -7376 -697 16930 49404 58045 41533 35111 20338 8618 6142 10765
17466 10765 11668 15682 31121 27344 9768 14012 6797 -7958 -15855 8479 10403 -2850 -7798
17453 -7798 11605 5289 30662 49190 27535 28868 19084 8675 33686 80923 119443 115490 96458
17440 96458 76681 44985 31311 18886 2087 1688 6127 -1753 -12480 -13108 11198 18813 9922
17427 9922 -12958 -658 10913 1446 5471 2007 16370 22694 7050 26030 33030 35761 34192
17414 34192 31239 39053 50932 35653 21407 15539 13788 20601 3327 -8754 12691 42330 67758
17401 67758 78003 97860 126468 172140 211187 255727 300505 310210 299687 278146 219688 175994
$$ packed form
17492B570p937q640o963J3097J0969p619j2514k790J2454J6939J3349j5192k2506
17479a4783J912N158L37O679J7627L2474Q641j6512o422j4773j1720k476M623
17466A0765R03M014J5439l777j7576M244p215j4755p897K4334J924j3253m948
17453g798J9403o316K5373J8528k1655J333r784j0409K5011M7237L8520l953j9032
17440I6458j9777l1696j3674j2425j6799l99M439p880j0727o28K4306P615q891
17427I922k2880J2300J1571r467M025l464J4363O324j5644J8980P000K731j569
17414C4192k953P814J1879j5279j4246n868j751O813j7274j2081K1445K9639K5428
17401F7758J0245J9857K8608M5672L9047M4540M4778R705j0523k1541n8458m3694
$$ plain form
17389 175994 186811 211568 237904 286089 303866 311462 311158 295759 238747 175060 140784 123972
17377 123972 129725 130805 107758 99145 80834 53388 36279 43221 55881 68182 81786 79265
17365 79265 66448 65927 50275 19761 4597 21798 39461 38818 29687 20134 50808 67662 56653
17352 56653 52996 49268 34306 22725 7782 -6255 340 27848 43240 23307 1897 5142
17340 5142 7501 14387 33792 26532 -1580 -35263 -23467 -19439 -24259 -29765 -36016 -42673 -24653
17327 -24653 -21255 -15215 -8864 -9501 -5120 36121 44138 19655 14604 -5631 -244 4122 -26111 -40429
17313 -40429 -26040 -5333 6969 -2339 -5 6496 14726 15625 26544 22016 467 -5585 2744
17300 2744 3512 20816 32349 276 -19600 -25268 -16419 -6182 -9130 -11130 -16531 -310 18781
$$ packed form
17389A75994J0817K4757K6336M8185J7777P596l04j5399n7012o3687l4276j6812
17377A23972N753J080k3047q613j8311k7446j7109O942J2660J2301J3604k521
17365G9265j2817n21j5652l0514j5164J7201J7663o43r131r553L0674J6854j1009
17352E6653l657l728j4962j1581j4943j4037O595K7508J5392j9933k1410L245
17340E142K359O886J9405p260k8112l3683J1796M028m820n506o251o657J8020
17327b4653L398O040O351o37M381M1241Q017k4483n051k0235N387M366l0233j4318
17313d0429J4389K0707J2302r308K334O501Q230Q99J0919m528k1549o052Q329
17300B744P68J7304J1533l2073j9876n668Q849J0237k948k000n401J6221J9091
$$ plain form
17287 18781 10002 4001 -1983 -10023 -26424 -15837 -6340 1646 -15680 -26520 -27261 -4338 6473
17274 6473 -11864 -11492 -7654 -23624 -48077 -39146 -24899 6792 31969 22493 12410 -16558 -24500
17261 -24500 -19685 -19705 -10613 -2090 -7105 -8380 -32608 -45778 -52775 -44040 -9547 6939 9445 -2301
17247 -2301 -6890 -1424 5000 -9548 -36374 -31313 -23555 -16926 -12301 17367 19897 -8463 -20095
17234 -20095 15071 5882 -32425 -37889 -26945 -22522 -26452 -13770 7523 2615 -16268 -6548 12306
17221 12306 21828 23223 18470 -90 18046 12587 -2441 6334 19083 17229 -13627 -23469 -32831
17208 -32831 -25358 -17366 -21782 -22803 -5336 9150 -13357 -20761 -22898 -31355 -26047 -24030 -20061 -32008
17194 -32008 -12162 -4675 -5129 17438 18467 17294 19577 9463 2440 -11446 -25434 -13977 -1241
$$ packed form
17287A8781q779o001n984q040j6401J0587R497P986j7326j0840p41K2923J0811
17274F473j8337L72L838j5970k4453Q931J4247L1691K5177r476j0083k8968p942
17261b4500M815k0R092Q523n015j275k4228j3170o997Q735L4493J6486K506j1746
17247b301m589N466O424j4548k6826N061P758O629M625K9668K530k8360j1632
17234b0095L5166r189l8307n464J0944M423l930J2682K1293m908j8883R720J8854
17221A2306R522J395m753j8560J8136n459j5028Q775J2749j854l0856r842r362
17208c2831P473P992m416j021J7467J4486k2507p404k137q457N308K017L969j1947
17194c2008J9846P487m54K2567J029j173K283j0114p023j3886j3988J1457J2736
$$ plain form
17181 -1241 12818 22137 12096 -16959 -27065 -35897 -8335 1910 -5747 -9019 -6031 -5840 -21657
17168 -21657 -30462 -32570 -43411 -40642 -21381 580 7469 1624 -2315 -21236 -28133 -30212 -18130
17155 -18130 -19648 -25016 -10482 -26693 -46455 -26444 4854 2635 -4187 -5416 1092 2135 -12061
17142 -12061 -15039 -30115 -32026 -29741 -27943 -7109 17121 24481 16727 2842 14928 8960 -911
17129 -911 4904 -8193 -15904 2580 -3919 -7220 -667 10940 12802 -5710 -15628 3045 10024 10199
17115 10199 12386 -13495 -34181 -25398 -5138 6260 610 -23769 -36318 -27174 -15687 -6787 10034
17102 10034 26584 6866 1725 1605 -4654 13463 32361 50705 44616 14931 -15402 -18604 -29475
17089 -29475 -21602 -26163 -35881 -37646 -38089 -33682 -18437 -20348 -25645 -804 3374 6795 203 -1432
$$ packed form
17181a241J4059R319j0041k9055j0106q832K7562J0245p657l272K988J91j5817
17168b1657q805k108j0841K769J9261K1961O889n845l939j8921o897k079J2082
17155a8130j518n368J4534j6211j9762K0011L1298k219o822j229O508J043j4196
17142a2061k978j5076j911K285J798K0834K4230P360p754j3885J2086n968r871
17129i11N815j3097p711J8484o499l301O553J1607J862j8512r918J8673O979J75
17115A0199K187k5881k0686Q783K0260J1398n650k4379j2549R144J1487Q900J6821
17102A0034J6550j9718n141j20o259J8117J8898J8344o089k9685l0333l202j0871
17089b9475P873m561r718j765m43M407J5245j911n297K4841M178L421o592j635
$$ plain form
17075 -1432 14 -1838 -4235 -4699 -8909 1699 9549 -12004 -23737 -22512 -17683 -16406 -20950 -24898
17061 -24898 -19083 -22663 -14302 -16178 -9800 -2306 8885 -5811 3566 19281 -3385 5214 1460
17048 1460 -4649 -3523 14120 8314 2685 4897 19058 13224 -417 8298 2152 20490 29719 19190
17034 19190 4215 9475 26713 25340 -10088 -21871 -14086 7735 15513 25458 18905 5537 17704
17021 17704 1808 15385 31765 27679 27595 31400 18482 2801 -7914 -10357 6813 22730 35910
17008 35910 11385 -12877 -6400 -2663 2471 -829 -3456 895 -10920 -16015 -2410 36357 37607
16995 37607 46408 41024 14554 8523 17963 6226 -8817 -14079 -37117 -42711 -34046 -9019 22080
16982 22080 16650 630 -16766 -26486 -33344 -20948 -21572 -37 -1060 5231 25992 29641 15370
$$ packed form
17075a432J446j852k397m64m210J0608P850k1553j1733J225M829J277m544l948
17061b4898N815l580Q361j876O378P494J1191j4696R377J5715k2666Q599l754
17048A460o109J126J7643n806n629K212J4161n834j3641Q715o146J8338R229j0529
17034A9190j4975N260J7238j373l5428j1783P785K1821P778R945o553j3368J2167
17021A7704j5896J3577J6380m086q4L805j2918j5681j0715k443J7170J5917J3180
17008C5910k4525k4262O477L737N134l300k627M351j1815n095J3605L8767J250
16995C7607Q801n384k6470o031R440j1737j5043n262k3038n594Q665K5027L1099
16982B2080n430j6020j7396r720o858J2396o24K1535j023O291K0761L649j4271
$$ plain form
16969 15370 -1104 -10280 -5263 22562 7080 -13173 -4205 14472 11952 20825 -1715 7543 16050
16956 16050 13218 -2993 -14947 -14596 -16499 -26667 -17657 2392 -2256 -8729 -20892 -18006 -18213 -15758
16942 -15758 -737 -1471 -23788 -26116 -15938 -9439 -11875 -21571 -7467 -3309 -20275 -22463 -19284
16929 -19284 -14002 -3150 -14263 -16421 -12049 -12817 4812 2752 -11742 -13352 -2805 9139 8876
16916 8876 18747 13231 6337 -2263 4559 -2167 -19554 -17121 -1227 9378 10028 -17468 -25390 -19556
16902 -19556 -1501 12081 18070 36637 30718 1926 12963 19197 112 3862 15812 32698
16890 32698 24750 15389 -7286 -8294 -202 6642 11186 7982 -17341 -13860 -3544 1619 17319
16877 17319 23552 28490 22131 7013 7465 5031 -12498 6907 22427 16137 12115 -18837 -34718
$$ packed form
16969A5370j6474r176N017K7825j5482k0253Q968J8677k520Q873k2540R258Q507
16956A6050k832j6211j1954L51j903j0168R010K0049m648o473j2163K886k07K455
16942a5758J5021p34k2317k328J0178O499k436r696J4104M158j6966k188L179
16929a9284N282J0852j1113k158M372p68J7629k060j4494j610J0547J1944k63
16916H876R871n516o894q600O822o726j7387K433J5894J0605O50k7496p922N834
16902a9556J8055J3582N989J8567n919k8792J1037O234j9085L750J1950J6886
16890C2698p948r361k2675j008Q092O844M544l204k5323L481J0316N163J5700
16877A7319O233M938o359j5118M52k434j7529J9405J5520o290m022l0952j5881
$$ plain form
16864 -34718 -6531 9346 23007 3122 -12641 -16982 -3109 12003 10916 24764 10086 -4697
16852 -4697 -29783 -16779 -11495 -12214 13021 4517 900 18263 18252 22153 40028 33339 18969 4228
16838 4228 -5268 -20275 -12067 -13056 -32461 -48525 -32657 -14648 -3670 828 -1160 -7899 -10789
16825 -10789 -17735 -7377 -16530 -23391 -34984 -32049 -11296 -11092 -14615 -7792 -2254 -13653 -12065 -8818
16811 -8818 -12601 -28527 -42130 -52919 -51629 -44141 -15657 -10040 2760 15735 7557 1491 -10600
16798 -10600 1059 7944 5902 1203 17138 30510 22644 2161 -3696 2169 13791 7427 7551
16785 7551 4159 -6435 -2656 12710 -1874 -7227 -10055 -7226 -9019 3967 -4485 -3267 5220 16320
16771 16320 10733 -6607 -8304 -12639 -18352 -38174 -46907 -36484 -38791 -30385 -27123 -21055 -29489 -41601
$$ packed form
16864c4718K8187J5877J3661j9885j5763m341J3873J5112j087J3848j4678j4783
16852d697k5086J3004N284p19K5235q504l617J7363j1L901J7875o689j4370j4741
16838D228r496j5007Q208r89j9405j6064J5868J8009J0978M498j988o739k890
16825a0789o946J0358r153o861j1593K935K0753K04l523O823N538j1399J588L247
16811h818l783j5926j3603j0789J290P488K8484N617J2800J2975q178o066j2091
16798a0600J1659O885k042m699J5935J3372p866k0483n857N865J1622o364J24
16785G551l392j0594L779J5366j4584n353k828K829j793J2986q452J218Q487J1100
16771A6320n587j7340j697m335n713j9822q733J0423k307Q406L262O068q434j2112
$$ plain form
16757 -41601 -29392 -16594 -2776 10584 7929 -2099 11573 -5985 -30455 -3839 7433 6569
16745 6569 -3115 -982 10677 -14921 -39136 -31761 -10822 11743 16156 13511 6900 16032 -1587
16732 -1587 -22669 -5449 14222 22710 24879 21902 15342 9467 -9850 -7685 8226 24497 13688
16719 13688 -10127 -16052 -13491 -19642 -23205 -14873 -8095 7312 8916 16451 7777 9165 13674 -1729
16705 -1729 9621 10720 17164 -787 -8929 1091 -7629 -18621 -17988 -15145 -35521 -27164 1155
16692 1155 21191 28614 8522 5877 12651 748 -7315 1826 13208 19261 36029 26204 19823
16679 19823 17656 -310 -10872 -19393 -15535 -14152 14579 13667 -23814 -40555 -17390 5069 8943
16666 8943 -1805 -10038 -17129 -19395 -2704 -13133 -23264 -35890 -50877 -55256 -45920 -33428 -18769
$$ packed form
16757d1601J2209J2798J3818J3360k655j0028J3672j7558k4470K6616J1272q64
16745F569r684K133J1659k5598k4215P375K0939K2565M413k645o611R132j7619
16732a587k1082J7220J9671Q488K169k977o560n875j9317K165J5911J6271j0809
16719A3688k3815n925K561o151l563Q332O778J5407J604P535q674J388M509j5403
16705a729J1350J099O444j7951q142J0020q720j0992O33K843k0376Q357K8319
16692A155K0036P423k0092k645O774j1903q063R141J1382O053J6768r825o381
16679A9823k167j7966j0562q521L858J383K8731r12l7481j6741K3165K2459L874
16666H943j0748q233p091k266J6691j0429j0131j2626j4987m379R336J2492J4659
$$ plain form
16653 -18769 -11145 -11287 -17140 -18683 -8325 -9569 -11442 -10427 7877 532 -9821 -1331 12997 940
16639 940 -25536 -22909 -24134 -19513 -29251 -21638 -7999 -14763 -24395 -27218 -20815 -4940 8323 571
16625 571 -16098 -17127 -8294 -6214 -18259 -27617 -19263 -27154 -17208 -10083 -8821 -4590 -2678 17415
16611 17415 7020 6587 16301 -7391 -20795 -14459 -37369 -26907 -21628 -24477 -19728 -16747 -17240 -15658
16597 -15658 -37946 -36515 -16724 -7028 1292 -11072 -26243 -21825 -25730 -42196 -34029 -36511 -65105
16584 -65105 -82205 -55240 -29516 -30030 -21957 -2284 4004 18386 39761 39824 17472 3926 17173
16571 17173 26596 41123 33950 18696 31039 27267 13382 1758 5828 8016 12373 5752 10637
16558 10637 12064 -8438 -28184 -20092 4828 9535 -6110 -15665 -4814 2867 -5957 -18477 -28291
$$ packed form
16653a8769P624j42n853j543J0358j244j873J015J8304p345j0353Q490J4328j2057
16639I40k6476K627j225M621r738P613J3639o764r632k823O403J5875J3263p752
16625E71j6669j029Q833K080j2045r358Q354p891R946P125J262M231J912K0093
16611A7415j0395m33R714k3692j3404O336k2910J0462N279k849M749K981m93J582
16597a5658k2288J431J9791R696Q320j2364j5171M418l905j6466Q167k482k8594
16584f5105j7100K6965K5724n14Q073J9673O288J4382K1375O3k2352j3546J3247
16571A7173R423J4527p173j5254J2343l772j3885j1624M070K188M357o621M885
16558A0637J427k0502j9746Q092K4920M707j5645r555J0851P681q824j2520r814
$$ plain form
16545 -28291 -22600 -7835 -333 -11953 -31530 -37887 -22127 -16197 -22446 -28144 -29621 -17321 -6746
16532 -6746 -21603 -36495 -54545 -59855 -31854 -11435 -29858 -21963 -12291 -18201 -6622 -3612 2163
16519 2163 -22450 -29382 -21229 -18382 -4319 -8311 -5194 12757 19397 15951 15802 33299 24291 -3638
16505 -3638 -3426 1829 8173 5482 5992 -14354 3470 17285 -4903 -19781 -21595 -29748 -27434 -28424
16491 -28424 -18506 -24169 -28225 -31512 -44588 -32114 -32002 -37064 -21554 -28750 -18285 -14385 -15713 -8239
16477 -8239 -11753 -34170 -20675 -20701 -25855 -21134 -27282 -37378 -36071 -14098 7103 8696 -9834 -17703
16463 -17703 -7684 -16294 -15481 -22775 -13279 13359 62480 56229 40343 32838 31194 39530 55797
16450 55797 40964 31537 28283 35616 28654 7973 10660 16861 -4461 -11236 -9213 -2390 5250 7922
$$ packed form
16545b8291N691J4765P502j1620j9577o357J5760N930o249n698j477J2300J0575
16532f746j4857j4892j8050n310K8001K0419j8423P895R672n910J1579L010N775
16519B163k4613o932Q153K847J4063l992L117J7951O640l446j49J7497r008k7929
16505c638K12N255O344k691N10k0346J7824J3815k2188j4878j814q153K314r90
16491b8424R918n663m056l287j3076J2474J12n062J5510p196J0465L900j328P474
16477h239l514k2417J3495k6n154M721o148j0096J307K1973K1201J593j8530p869
16463a7703J0019q610Q13p294R496K6638M9121o251j5886p505j644Q336J6267
16450E5797j4833r427l254P333o962k0681K687O201k1322o775K023O823P640K672
$$ plain form
16436 7922 -1922 -5544 6317 23563 29083 36208 22521 33195 38805 27213 14865 1553 5726
16423 5726 -3013 -12248 -1036 -10513 6344 10822 12997 7793 -1149 -25873 -12903 324 -8526
16410 -8526 -8657 -4088 -23547 -30384 -18603 1145 -10952 -17776 -16817 -15922 -4959 -2035 2751 -22292
16396 -22292 -5458 6889 848 -6423 -22595 -26838 -916 3315 -9783 -28090 -23085 -15123 -1767
16383 -1767 -15534 -11385 11717 10010 -13284 -18219 2959 25726 30793 30148 33297 8849 -9539
16370 -9539 4084 11727 17000 -2524 -14556 -4565 5111 19773 37471 42388 30914 26757 18066
16357 18066 10473 -2417 -4247 18395 24627 25986 30417 22415 40321 52724 45664 42229 37084
16344 37084 36482 48218 36552 -1870 -52124 -66487 -30369 -1879 -22927 -17104 -11811 -5481 -19126
$$ packed form
16436G922r844l622J1861J7246N520P125j3687J0674N610j1592j2348j3312M173
16423E726q739r235J1212r477J6857M478K175n204q942k4724J2970J3227q850
16410h526j31M569j9459o837J1781J9748j2097o824R59Q95J0963K924M786k5043
16396b2292J6834J2347o041p271j6172m243K5922M231j3098j8307N005P962J3356
16383a767j3767M149K3102j707k3294m935K1178K2767N067o45L149k4448j8388
16370i539J3623P643N273j9524j2032R991R676J4662J7698M917j1474m157q691
16357A8066p593j2890j830K2642O232J359M431q002J7906J2403p060l435n145
16344C7084o02J1736j1666l8422n0254j4363L6118K8490k1048N823N293O330j3645
$$ plain form
16331 -19126 -39636 -27018 -6307 16946 24334 11003 -2470 -7049 -11086 -2247 13257 23670
16319 23670 42256 42382 26577 4160 -22763 -10716 -955 -4028 -1708 4830 -5067 -2398 -1045
16306 -1045 -12725 -15438 -3564 -12127 -17076 -32014 -31639 -37967 -22385 -8735 -4581 -6353 -7543 14500
16292 14500 9249 -2181 10518 14197 26742 35256 38688 25037 1930 -6594 -4017 -12461 -8244
16279 -8244 -1242 -1228 5274 8904 -1929 -8247 -12666 -11160 13826 -680 -15024 -9297 -904 -5667
16265 -5667 -6107 -7987 -3486 1610 -1660 -1497 -5193 3355 2912 16941 31975 32797 27807 41277 53794
16250 53794 33620 7067 23895 39430 26475 16835 16931 21557 28477 17874 4600 -3580 -4719
16237 -4719 -92 11083 -2605 -15982 6418 -786 54 5762 -1559 -13308 -237 -7107 3471
$$ packed form
16331a9126k0510J2618K0711K3253P388j3331j3473m579m037Q839J5504J0413
16319B3670J8586J26j5805k2417k6923J2047R761l073K320O538r897K669J353
16306a045j1680k713J1874q563m949j4938L75o328J5582J3650M154j772j190K2043
16292A4500n251j1430J2699L679J2545Q514L432j3651k3107q524K577q444M217
16279h244P002J4O502L630j0833o318m419J506K4986j4506j4344N727Q393m763
16265e667m40j880M501N096l270J63l696Q548m43J4029J5034Q22m990J3470J2517
16250E3794k0174k6553J6828J5535j2955r640R6M626O920j0603j3274q180j139
16237d719M627J1175j3688j3377K2400p204Q40N708p321j1749J3071o870J0578
$$ plain form
16224 3471 21227 16347 14205 12178 14582 -4314 -2315 -12222 -24558 -14246 -919 8586 10763
16211 10763 21938 2631 -3727 1157 26277 29629 27958 34800 26615 17455 5978 -10714 -34651
16198 -34651 -20613 -7890 255 -983 -6445 -22914 -18510 -39282 -24874 -18149 -15274 -13249 -8110
16185 -8110 10838 10334 -15541 -17277 -17894 -21108 -10234 -1262 -148 -14533 -4892 -12502 -17817 -2721
16171 -2721 11907 21378 15643 -491 8875 -4545 -19110 -9432 -1099 15320 29568 31760 16798
16158 16798 9134 477 -19588 -27494 -37039 -37833 -32829 -40740 -36984 -23191 -21098 -30105 -23910 -11492
16144 -11492 -13487 -2125 397 9264 14518 11220 1254 -12371 -32178 -4057 5736 -17380 -11146
16131 -11146 -10492 -9119 -14343 -10904 2936 10364 6731 -10869 -25988 -33853 -27110 -18127 -33628 -34711
$$ packed form
16224C471J7756m880k142k027K404j8896J999r907j2336J0312J3327R505K177
16211A0763J1175j9307o358M884K5120L352j671O842q185r160j1477j6692k3937
16198c4651J4038J2723Q145j238n462j6469M404k0772J4408O725K875K025N139
16185h110J8948n04k5875j736o17l214J0874Q972J114j4385R641p610n315J5096
16171b721J4628R471n735j6134R366j3420j4565R678Q333J6419J4248K192j4962
16158A6798p664q657k0065p906r545p94N004p911L756J3793K093r007O195J2418
16144a1492j995J1362K522Q867N254l298r966j3625j9807K8121R793k3116O234
16131a1146O54J373n224L439J3840P428l633j7600j5119p865O743Q983j5501j083
$$ plain form
16117 -34711 -27479 -16489 -18405 -29669 -26540 -20008 -31580 -18474 -9113 3635 10406 4831 -4234
16104 -4234 -9872 -27787 -15995 -13733 -23390 -20006 -16333 -22505 813 7491 -10150 -17564 -23573 -18
16090 -18 13450 -2395 -6454 10651 17451 15516 15712 1335 -21085 -22689 3935 36884 31562 16413
16076 16413 -14028 -7334 -1131 -5032 9822 17510 26299 7500 -1364 -20442 -18250 -13465 -33070
16063 -33070 -22468 -19417 -19962 -3536 -6838 -12849 -17721 -21337 -13031 12516 23333 19445 5133
16050 5133 -4398 -14515 -17207 -7673 22426 13391 -4126 -7606 -14905 -13192 520 24865 47896
16037 47896 37376 30401 20348 -909 4706 3721 12559 7361 -1384 -5973 -24526 -42130 -36376
16024 -36376 -31776 -11280 -15122 -22026 -19174 -16696 -29791 -38380 -44057 -24285 -16791 -48333 -65547
$$ packed form
16117c4711P232J0990j916j1264L129O532j1572J3106R361J2748O771n575r065
16104d234n638j7915J1792K262r657L384L673o172K3318O678j7641p414o009K3555
16090a8J3468j5845m059J7105O800j935J96j4377k2420j604K6624L2949n322j5149
16076A6413l0441O694O203l901J4854P688Q789j8799q864j9078K192M785j9605
16063c3070J0602L051n45J6426l302o011m872l616Q306K5547J0817l888j4312
16050E133r531j0117k692R534L0099r035j7517l480p299J713J3712K4345K3031
16037D7896j0520o975j0053k1257N615r85Q838n198q745m589j8553j7604N754
16024c6376M600K0496l842o904K852K478j3095q589n677J9772P494l1542j7214
$$ plain form
16011 -65547 -44375 -7197 -924 -12315 -7976 12675 -5015 560 4268 1357 17521 10765 -3231
15998 -3231 -1455 15919 13542 8179 2528 -11484 -17134 9721 10345 -9860 -27663 -41782 -41567 -44207
15984 -44207 -36780 -7781 -945 -19500 -28609 -14989 -3030 -19745 3299 5044 -2043 -13501 -10216
15971 -10216 -2757 -10641 -27163 -8529 -4015 -3449 -9425 -25196 -29191 -20391 -19799 -14535 -21783 -9069
15957 -9069 -16814 -7382 -11155 -10052 -15016 -5181 9536 15334 9450 -7687 -13652 -6920 -7994 -19999
15943 -19999 -25279 -34160 -32194 -45674 -39761 -15396 13458 2129 14119 22335 13243 20414 967
15930 967 -24446 -34517 -9511 7495 7484 5752 -17309 -17205 2137 -15545 -24605 7530 11183 7897
15916 7897 -6052 -24884 -22157 -953 -6299 -13293 -10043 -7461 12474 17557 20446 25321 31813 36088
$$ packed form
16011f5547K1172L7178O273j1391M339K0651j7690N575L708k911J6164o756j3996
15998c231J776J7374k377n363n651j4012n650K6855O24k0205j7803j4119K15k640
15984d4207P427K8999O836j8555r109J3620J1959j6715K3044J745p087j1458L285
15971a0216P459p884j6522J8634M514N66n976j5771l995Q800N92N264p248J2714
15957i069p745R432l773J103m964R835J4717N798n884j7137n965O732j074j2005
15943a9999n280q881J966j3480N913K4365K8854j1329J1990Q216r092P171j9447
15930I67k5413j0071K5006J7006j1j732k3061J04J9342j7682r060L2135L653l286
15916G897j3949j8832K727K1204n346o994L250K582J9935N083K889M875O492M275
$$ plain form
15902 36088 23639 31064 33976 19509 -165 -13207 -1864 -2029 -18485 -47104 -41270 -27782 -15590
15889 -15590 -16756 -16460 -4658 -8527 -28732 -34733 -3590 12189 10951 9997 4504 -9826 25317
15876 25317 43205 20862 16006 8380 3835 -15363 -16612 -9268 -11560 -26089 -38759 -51216 -54023
15863 -54023 -25605 -15616 -9710 -1998 -4385 -959 -130 5394 -15061 -22633 -28803 -30488 -59260 -51730
15849 -51730 -37178 -29636 -26286 -16150 -12403 -12312 -22158 -16046 -20058 -28946 -13217 16080 6058 -7486
15835 -7486 -4215 8356 27033 33609 38806 35470 42404 19053 10868 14638 18294 19225 18774 -17542
15821 -17542 -22849 -12893 13662 19742 9662 -2385 -10603 -32059 -27094 -13233 1003 144 -793
15808 -793 -10219 -13083 -11336 -19293 -29617 -22099 -34275 -55245 -50384 -25422 -31437 -21964 -20199 -16108
$$ packed form
15902C6088j2449P425K912j4467j9674j3042J1343j65j6456k8619N834J3488J2192
15889a5590j166K96J1802l869k0205o001L1143J5779j238r54n493j4330L5143
15876B5317J7888k2343m856p626m545j9198j249P344k292j4529j2670j2457k807
15863e4023K8418R989N906P712k387L426Q29N524k0455p572o170j685k8772P530
15849e1730J4552P542L350J0136L747R1r846O112m012q888J5729K9297j0022j3544
15835g486L271J2571J8677O576N197l336O934k3351q185L770L656R31m51l6316
15821a7542n307R956K6555O080j0080j2047q218k1456M965J3861J4236q59r37
15808g93r426k864J747p957j0324P518j2176k0970M861K4962o015R473J765M091
$$ plain form
15794 -16108 -5621 -14458 -37257 -35051 -36044 -35803 -24869 -23094 -19957 -14941 -29252 -52141 -31198
15781 -31198 -14842 -6197 16006 23441 14847 3020 1311 9551 2646 -6551 5975 3443 7930
15768 7930 13869 -3169 -15091 -6766 -22607 -34285 -25800 -17966 -14872 -4148 2178 -4956 -15639
15755 -15639 -1893 9453 17940 24687 37226 45939 32647 12460 -22737 -19282 -11560 4776 22415
15742 22415 30123 8866 9976 18807 11487 2188 542 -21901 -51435 -47826 -32527 -19707 5413
15729 5413 21634 8882 7819 1584 -8872 2052 2017 5542 12411 10875 5461 17866 15387 13851
15715 13851 6691 -9484 -23624 -29051 -16567 -4043 844 -863 1600 11629 7370 12000 24615
15702 24615 12486 69 13769 17477 -1324 -1990 -4088 -7680 -12752 -13432 -23514 -31096 -12895
$$ packed form
15794a6108J0487q837k2799K206r93K41J0934J775L137N016j4311k2889K0943
15781c1198J6356Q645K2203P435q594j1827j709Q240o905r197J2526k532M487
15768G930N939j7038j1922Q325j5841j1678Q485P834L094J0724O326p134j0683
15755a5639J3746J1346Q487O747J2539Q713j3292k0187l5197L455P722J6336J7639
15742B2415P708k1257J110Q831p320r299j646k2443k9534L609J5299J2820K5120
15729E413J6221j2752j063o235j0456J0924l5L525O869j536n414J2405k479j536
15715A3851p160j6175j4140n427J2484J2524M887j707K463J0029m259M630J2615
15702B4615j2129j2417J3700L708j8801o66k098l592n072o80j0082p582J8201
$$ plain form
15689 -12895 -9633 -26365 -32484 -48373 -39487 -36038 -38437 -14187 -11332 -15780 -9239 -19195 708
15676 708 12499 24009 27025 11772 14274 17736 5580 1782 22504 6869 1521 4280 -4889
15663 -4889 -7844 -1564 3712 -12765 -11558 10300 16326 13381 5373 5700 13313 -1317 -18749 -12834
15649 -12834 -3318 15955 14185 1144 -9361 -24421 -36220 -32229 -47097 -61950 -42366 -9824
15637 -9824 -16733 -33030 -38164 -31696 -34761 -42269 -44910 -16915 6571 3249 6229 8555 488 -8321
15623 -8321 -25697 -19917 -3511 -3882 -1106 -11947 -5148 -910 14534 17483 -17589 -38017 -17754
15610 -17754 15619 13015 17753 14187 6553 -658 -6407 -9713 11880 18925 23485 5984 -3159 -27597
15596 -27597 -28013 -17360 -30784 -63347 -78071 -57024 -44541 -20695 -15921 -16518 -21174 -24001 -8985
$$ packed form
15689a2895L262j6732o119j5889Q886L449k399K4250K855m448O541r956J9903
15676G08J1791J1510L016j5253K502L462j2156l798K0722j5635n348K759r169
15663d889k955O280N276j6477J207K1858O026k945q008L27P613j4630j7432N915
15649a2834R516J9273j770j3041j0505j5060j1799L991j4868j4853J9584L2542
15637i824o909j6297n134O468l065p508k641K7995K3486l322K980K326q067q809
15623h321j7376N780J6406l71K776j0841O799M238J5444K949l5072k0428K0263
15610a7754L3373k604M738l566p634p211n749l306K1593P045M560j7501r143k4438
15596b7597m16J0653j3424l2563j4724K1047J2483K3846M774n97m656k827J5016
$$ plain form
15583 -8985 -7267 1830 9786 8534 1922 6933 13905 22853 19222 3136 -1030 -7642 585 -10616
15569 -10616 -11753 5256 10032 -2408 10251 11260 19794 22837 7679 -5177 -2811 -401 -13625
15556 -13625 -12192 -25500 -25288 -15997 -9197 4352 -3267 3777 19120 30498 15278 13812 -3847
15543 -3847 -97 31329 34294 11523 -19173 -21353 -14612 -4623 -11493 -19515 2712 11543 4616 4744
15529 4744 12340 17892 2119 5983 25677 8167 -212 2837 8460 15267 -1106 -7633 -22619
15516 -22619 -24666 -12180 5267 22196 45214 34243 25278 15279 6231 -12923 -32545 -52639
15504 -52639 -61284 -37864 -13733 -12852 9273 17473 17478 7753 -6713 -13850 -3273 9544 7992 10252
15490 10252 9493 -9594 -24778 -22028 -10482 -1773 -12891 -8509 -16066 -7754 -1796 -8515 2654
$$ packed form
15583h985J718R097P956j252o612N011O972Q948l631j6086m166o612Q227j1201
15569a0616j137J7009M776j2440J2659J009Q534L043j5158j2856K366K410j3224
15556a3625J433j3308K12R291O800J3549p619P044J5343J1378j5220j466j7659
15543c847L750L1426K965k2771l0696k180O741R989o870q022K2227Q831o927J28
15529D744P596N552j5773L864J9694j7510q379L049N623O807j6373o527j4986
15516b2619k047J2486J7447J6929K3018j0971q965r999r048j9154j9622k0094
15504e2639q645K3420K4131Q81K2125Q200Nr725j4466p137J0577J2817j552K260
15490A0252p59j9087j5184K750J1546Q709j1118M382p557Q312N958o719J1169
$$ plain form
15477 2654 15371 6751 -6889 1321 8344 -1029 -3797 -452 5779 -1153 -6994 -6069 -19428 -12297
15463 -12297 -1781 19885 8868 17466 16424 4778 3595 15330 26189 20675 15142 5240 -16489
15450 -16489 -26963 -16382 241 2303 4756 6537 12254 6150 -611 -6512 14470 5583 -5310
15437 -5310 12895 15335 16514 -19326 -23767 -27717 -9506 3228 -5608 -23747 -15622 -4882 -2393
15424 -2393 9007 25162 15483 17825 19094 15668 -10105 9430 5672 -2106 10040 -7764 -5955
15411 -5955 16584 30083 21761 17343 26879 32331 28234 13397 11933 7667 -17514 -31685 -18080
15398 -18080 -10965 -16244 -32054 -14593 -878 -834 -19001 -3704 11720 8888 -10075 -17740 17438
15385 17438 18236 20178 9984 9164 30916 35985 7874 -7507 1956 13810 6019 -4534 -11707
$$ packed form
15477B654J2717q620j3640Q210P023r373k768L345O231o932n841R25j3359P131
15463a2297J0516K1666j1017Q598j042j1646j183J1735J0859n514n533r902k1729
15450a6489j0474J0581J6623K062K453J781N717o104o761n901K0982q887j0893
15437e310J8205K440J179l5840m441l950J8211J2734q836j8139Q125J0740K489
15424b393J1400J6155r679K342J269l426k5773J9535l758p778J2146j7804J809
15411e955K2539J3499q322m418R536N452m097j4837j464m266k5181j4171J3605
15398a8080P115n279j5810J7461J3715M4j8167J5297J5424k832j8963p665L5178
15385A7438P98J942j0194q20K1752N069k8111j5381R463J1854p791j0553p173
$$ plain form
15372 -11707 -15225 -17795 -7858 -20050 -26667 -37374 -35724 -29590 -34630 -42605 -28616 -14340 -12819
15359 -12819 -3901 -21776 -25338 -22349 -21842 -27772 -32054 -34559 -7373 -13439 -26473 -16655 -1120 12540
15345 12540 12771 -7359 -19148 -18138 -19710 -12355 7083 -7336 -1936 -279 -17161 -9207 -3382
15332 -3382 -10525 -8242 -9648 -12653 -749 -12804 -10211 -19589 -24996 -13635 -4816 -11831 -9554 -14485
15318 -14485 -17088 -19378 -19754 5923 2662 -7911 12264 15004 4775 -2741 23413 61622 57323
15305 57323 9642 -8871 -29237 -31103 -27610 -24491 -26233 -22011 -25152 -41015 -43958 -27791 -1259
15292 -1259 -2656 5052 -1331 -4619 -227 -4047 -27251 -33502 -16789 4381 9809 -9411 -7960 20322
15278 20322 33609 27059 14225 -8077 -12281 -15809 -34336 -35552 -21052 15264 29644 21896 38184
$$ packed form
15372a1707l518k570R937j2192o617j0707J650O134n040p975J3989J4276J521
15359a2819Q918j7875l562K989N07n930m282k505K7186o066j3034R818J5535J3660
15345A2540K31k0130j1789J010j572P355J9438j4419N400J657j6882P954N825
15332c382p143K283j406l005J1904j2055K593r378n407J1361Q819p015K277m931
15318a4485k603k290l76K5677l261j0573K0175K740j0229p516K6154L8209m299
15305E7323m7681j8513k0366j866L493L119j742M222l141j5863k943J6167K6532
15292a259j397P708o383l288M392l820k3204o251J6713K1170N428j9220J451K8282
15278B0322J3287o550j2834k2302m204l528j8527j216J4500L6316J4380p748J6288
$$ plain form
15265 38184 39583 12717 -8381 -6804 7707 4322 -12081 -17212 1128 13130 14448 7944 3555
15252 3555 -1616 -6887 -26335 -24477 -19949 -18731 -3413 3975 -11836 -33519 -19390 -11623 -4390
15239 -4390 -21584 -26374 -30811 -9928 9954 -6537 -22045 -30063 -19627 -11276 -16664 -31881 -33931
15226 -33931 -17312 -5175 -9177 -18404 -32167 -28157 -19629 -21533 -26100 -20837 -20254 -10639 -20127 -32157
15212 -32157 -29312 -7412 18118 519 -11234 -22553 -39720 -36246 -13549 2905 -254 -14093
15200 -14093 -16461 -12478 -1491 1606 24129 19011 11340 4421 11171 23958 21059 -7064 -23586
15187 -23586 -23051 -12526 -6260 -16844 -21530 -8040 -4419 -21370 -37851 -29449 -22663 -17069 -6028
15174 -6028 -5035 3835 18811 16785 -2939 -14799 -6185 5640 3740 21533 19583 12023 13380 25057
$$ packed form
15265C8184J399k6866k1098J577J4511l385j6403n131J8340J2002J318o504m389
15252C555n171n271j9448J858M528J218J5318P388j5811k1683J4129P767P233
15239d390j7194m790m437K0883J9882j6491j5508q018J0436Q351n388j5217k050
15226c3931J6619J2137m002r227j3763M010Q528j904m567N263N83R615r488j2030
15212c2157K845K1900K5530j7599j1753j1319j7167L474K2697J6454l159j3839
15200a4093k368L983J0987L097K2523n118p671o919O750J2787k899k8123j6522
15187b3586N35J0525O266j0584m686J3490L621j6951j6481Q402O786N594J1041
15174f028R93Q870J4976k026j9724j1860Q614J1825j900J7793j950p560J357J1677
$$ plain form
15160 25057 32933 19992 408 -1076 11094 25976 43597 32201 22128 16975 17093 4953 -21378
15147 -21378 -26682 -31006 -23700 -11898 -11470 -15150 -4551 17482 3922 -17817 -15241 6605 9451
15134 9451 14093 -13842 -28771 -31074 -13874 22846 47206 29535 7741 8653 35336 39180 21126
15121 21126 20361 35231 38452 43219 35240 23497 34086 13815 -20700 -33398 -32848 -3923 -14685
15108 -14685 -26629 -8468 3155 11556 18859 -2562 -565 3905 12726 12091 11411 13462 2796 -7556
15094 -7556 6371 17186 7502 -10188 -15887 -17943 -48963 -27810 -424 13554 13393 23684 23232
15081 23232 6894 -10532 -14168 -5954 -12551 -27279 -6833 848 -6356 -15125 -12418 -545 -1139
15068 -1139 -21098 -22349 -6083 11145 14537 5170 -12683 -28878 -6293 8262 25864 13335
$$ packed form
15160B5057P876j2941j9584j484J2170J4882J7621j1396j0073n153J18j2140k6331
15147b1378n304m324P306J1802M28l680J0599K2033j3560k1739K576K1846K846
15134I451M642k7935j4929k303J7200L6720K4360j7671k1794R12K6683L844j8054
15121B1126p65J4870L221M767p979j1743J0589k0271l4515j2698N50K8925j0762
15108a4685j1944J8161J1623Q401P303k1421J997M470Q821o35o80K051j0666j0352
15094g556J3927J0815r684j7690n699k056l1020K1153K7386J3978j61J0291m52
15081B3232j6338j7426l636Q214o597j4728K0446P681p204q769K707J1873n94
15068a139j9959j251J6266J7228L392r367j7853j6195K2585J4555J7602j2529
$$ plain form
15056 13335 3611 -14711 -31442 -18093 -4138 -5090 1382 897 16004 15507 9981 16054 -6885 -14788
15042 -14788 -19532 -18896 -19577 -3725 -2542 -10622 -4928 9831 16602 11769 21046 17166 3889 -14725
15028 -14725 -4516 -10799 -7824 -9352 -17527 -8074 -6118 -31425 -39419 -31086 -5128 -16349 -31946
15015 -31946 -12878 778 -1676 -4225 -13598 -20343 -26350 -32501 -24379 -23034 2994 11096 882
15002 882 -9405 -25408 -41447 -33092 -21563 -25067 -12652 -4038 19341 35817 31996 20863 8109
14989 8109 6240 -10851 -1457 -7780 -28495 -26270 -14052 -2690 4134 -2467 -4676 -21940 -22596 -25782
14975 -25782 -25179 -36078 -23822 -6887 4715 -8535 -4486 3895 12385 25275 19974 25985 44629
14962 44629 62594 74720 73558 36195 7398 -6339 -13130 -4607 3713 2590 4094 15902 13775
$$ packed form
15056A3335r724j8322j6731J3349J3955r52O472m85J5107m97n526O073k2939p903
15042a4788m744O36o81J5852J183q080N694J4759O771m833R277l880j3277j8614
15028a4725J0209o283K975j528q175R453J956k5307p994Q333K5958j1221j5597
15015c1946J9068J3656k454k549r373o745o007o151Q122J345K6028Q102j0214
15002H82j0287j6003j6039Q355J1529l504J2415Q614K3379J6476l821j1133j2754
14989H109j869j7091R394o323k0715K225J2218J1362O824o601k209j7264o56l186
14975b5782O03j0899J2256J6935J1602j3250M049Q381Q490J2890n301O011J8644
14962D4629J7965J2126j162l7363k8797j3737o791Q523Q320j123J504J1808k127
$$ plain form
14949 13775 10776 18389 -3323 -15096 -19075 -25712 -27781 -1811 17511 -2236 -14474 -9559 17104
14936 17104 13462 -19551 -13476 6089 16721 -4974 -23215 -35359 -36133 -18920 7617 33498
14924 33498 11176 -2146 -17470 -9648 5822 24879 13476 -14518 -42140 -27962 -1373 22170
14912 22170 20510 7035 -4338 -390 9085 14165 6433 2478 1876 4708 6087 7693 9653 7039
14898 7039 10133 -6811 -13454 -27152 -37553 -40853 -14719 -4917 6737 17495 27464 22729 14984
14885 14984 10551 3055 -5269 -18481 -19355 -26922 -28644 -4482 22625 28684 16223 8019 15364 27620
14871 27620 24578 15897 9714 26667 31181 29677 26499 8299 -7292 -4648 9106 22701 14736
14858 14736 18962 1806 -3488 5777 2996 -11502 -25972 -19738 -17844 -12964 -3720 1076 9879 731
$$ packed form
14949A3775k999P613k1712j1773l979o637k069K5970J9322j9747j2238M915K6663
14936A7104l642l3013O075J9565J0632k1695j8241j2144p74J7213K6537K5881
14924C3498k2322j3322j5324P822J5470J9057j1403k7994k7622J4178K6589K3543
14912B2170j660j3475j1373L948R475N080p732l955o02K832J379J606J960k614
14898G039L094j6944o643j3698j0401l300K6134R802J1654J0758R969m735p745
14885A4984m433p496q324j3212q74p567j722K4162K7107O059j2461q204P345J2256
14871B7620l042q681o183J6953M514j504l178j8200j5591K644J3754J3595p965
14858A4736M226j7156n294R265k781j4498j4470O234J894M880R244M796Q803r148
$$ plain form
14844 731 -8855 -10163 -7035 8891 20371 48052 29905 18433 20454 12900 -5634 -18639 -2325
14831 -2325 13515 22930 31154 38162 21344 10859 12580 3557 16603 17036 9756 11000 5318 2124
14817 2124 13784 3324 370 -1017 -25865 -16894 -36912 -21231 -13701 -21199 -7279 -10756 -18261
14804 -18261 -22797 -15529 -7617 -3151 3072 -1983 -11427 12045 -673 -8413 -13113 -3418 -16486 -29905
14790 -29905 -8099 -10446 -11499 -8137 12274 7852 -4723 19831 33956 20197 -1084 8858 12512
14777 12512 15497 18846 10898 1285 9291 24547 26784 13113 14378 9310 -1601 5237 15422
14764 15422 28407 43296 36874 32427 12009 -2846 3703 -3821 880 -8498 -5528 16520 35055
14751 35055 31653 22586 14663 -1001 -24225 -17993 -12669 -9528 -7743 -10378 -22701 -24108 4585
$$ packed form
14844G31r586j308L128J5926J1480K7681j8147j1472K021p554j8534j3005J6314
14831b325J5840R415Q224P008j6818j0485J721r023J3046M33p280J244n682l194
14817B124J1660j0460k954j387k4848Q971k0018J5681P530p498J3920l477p505
14804a8261m536P268P912M466O223n055r444K3472j2718p740m700R695j3068j3419
14790b9905K1806k347j053L362K0411m422j2575K4554J4125j3759k1281R942L654
14777A2512K985L349p948r613Q006J5256K237j3671J265n068j0911O838J0185
14764A5422J2985J4889o422m447k0418j4855O549p524M701r378K970K2048J8535
14751C5055l402r067p923j5664k3224O232N324L141J785k635j2323j407K8693
$$ plain form
14738 4585 3311 12134 17611 23 -1327 -2957 12905 -1090 -31160 -26906 -8061 12401 15481
14725 15481 21526 9053 -25129 -12908 10854 -1771 -7017 -37668 -16126 10397 20807 -7028
14713 -7028 -18839 -20311 -29131 -25523 -22738 -37480 -24366 -18859 -15967 -12731 1624 -14708 -15352 -20371
14699 -20371 -11627 2464 3070 7216 3908 1028 -5053 682 -1459 5246 15180 20843 28098 33729
14685 33729 20794 -2487 -20907 -29038 -29456 -29023 -16890 -16923 239 28918 23960 19560 11394 -18463
14671 -18463 2212 1501 -2779 -2618 1265 13296 6386 -7663 -13902 -3323 -3077 10360 9028 -16354
14657 -16354 -25613 -55211 -59035 -10418 -1666 -16457 -12423 -6304 -2772 958 -25752 -44974 -31838
14644 -31838 -14552 -10984 -8865 1523 -1580 5343 9489 -9411 -20740 -37592 -30011 -41089 -25911
$$ packed form
14738D585j274Q823N477j7588j350j630J5862j3995l0070M254J8845K0462L080
14725A5481O045j2473l4182J2221K3762j2625n246l0651K1542K6523J0410k7835
14713g028j1811j472q820L608K785j4742J3114N507K892L236J4355j6332o44n019
14699b0371Q744J4091O06M146l308k880o081N735k141O705R934N663P255N631
14685C3729j2935k3281j8420q131m18M33J2133l3J7162K8679m958m400q166k9857
14671a8463K0675p11m280J61L883J2031o910j4049o239J0579K46J3437j332k5382
14657a6354r259k9598l824M8617Q752j4791M034O119L532L730k6710j9222J3136
14644c1838J7286L568K119J0388l103O923M146j8900j1329j6852P581j1078J5178
$$ plain form
14631 -25911 -22472 -20732 -19411 3316 14418 16931 -2983 4716 -1765 -9437 3442 16468 11071
14618 11071 8591 29015 26221 6310 16585 10669 19141 13164 32173 28006 17425 9905 7343
14605 7343 1244 -7094 -13595 -12527 5639 29843 20706 -1056 -1629 418 18672 14555 3778 -7012
14591 -7012 -36873 -55281 -42769 -8285 -7777 -826 -2812 21542 27864 24140 15135 6692 -3983
14578 -3983 -3864 11497 9741 4400 647 6724 9932 17464 8595 -18679 -8377 260 -4151 11569
14564 11569 15184 22570 28968 30144 21510 30115 49505 59762 32222 14601 34082 27930 18815
14551 18815 11390 -941 18379 37841 20627 12716 29453 37180 14697 24480 23746 3788 12024
14538 12024 17638 3989 -8548 -16105 193 9694 -5246 8151 -5666 -11480 -24359 -15026 -18877
$$ packed form
14631b5911L439J740J321K2727J1102K513j9914P699o481p672J2879J3026n397
14618A1071k480K0424k794j9911J0275n916Q472n977J9009m167j0581p520k562
14605G343o099q338o501J068J8166K4204r137k1762n73K047J8254m117j0777j0790
14591g012k9861j8408J2512L4484N08O951j986K4354O322l724r005q443j0675
14578c983J19J5361j756n341l753O077L208P532q869k7274J0302Q637m411J5720
14564A1569L615P386O398J176q634Q605J9390J0257k7540j7621J9481o152r115
14551A8815p425j2331J9320J9462j7214p911J6737P727k2483R783p34j9958Q236
14538A2024N614j3649j2537p557J6298R501j4940J3397j3817n814j2879R333l851
$$ plain form
14525 -18877 -10407 5028 18847 17354 3750 -10105 -8040 8612 13470 15567 6765 -8281 -13114
14512 -13114 -14269 -1531 -5792 -16746 -26122 -8863 -10220 -16083 -7060 -6439 -1897 1588 8529 -344
14498 -344 -17567 -19225 -14654 1332 3797 -14159 -17675 2309 20059 23766 39764 27950 6959
14485 6959 13759 5726 -13555 -9962 -2310 6929 28063 2884 -14232 -10386 -6805 -11531 -26231
14472 -26231 -20288 -974 12727 27118 -8552 -11507 -8624 -6779 4635 11882 -2473 -1726 -16664
14459 -16664 -25761 -34377 -50737 -43058 -17527 2829 4424 4997 -7327 -8300 -11490 -2306 13197 20198
14445 20198 9669 -2224 -10027 -10664 -681 6578 20690 22403 -5124 -1664 8938 20057 9501
14432 9501 -2080 9087 15224 5371 9158 -8857 -10153 13984 11161 -15195 -19347 -26467 -21992
$$ packed form
14525a8877Q470J5435J3819j493j3604j3855K065J6652M858K097q802j5046m833
14512a3114j155J2738m261j0954r376J7259j357n863R023O21M542L485O941q873
14498c44j7223j658M571J5986K465j7956l516J9984J7750L707J5998j1814k0991
14485F959O800q033j9281L593P652R239K1134k5179j7116L846L581m726j4700
14472b6231N943J9314J3701J4391l5670k955K883J845J1414P247j4355P47j4938
14459a6664r097q616j6360P679K5531K0356J595N73j2324r73l190R184J5503P001
14445B0198j0529j1893p803o37R983P259J4112J713k7527L460J0602J1119j0556
14432I501j1581J1167O137r853L787j8015j296K4137k823k6356m152p120M475
$$ plain form
14419 -21992 -34067 -27244 -3402 9876 13530 1224 -27230 -28936 -17754 -33793 -31935 -32194 -5042
14406 -5042 8924 8932 1143 9586 -4608 -9555 -25459 -40596 -20430 1260 10271 10350 1464 11861
14392 11861 6588 -615 -10300 11352 45946 35685 4213 -527 890 -10590 -14906 -3646 6825
14379 6825 7763 14917 14385 5571 9806 29569 35924 37298 22431 12396 23573 22531 -4363 -5577
14365 -5577 10652 26922 59492 46333 27535 18056 3285 -11064 -21368 -24918 -27239 -23361 -14029
14352 -14029 -2484 -2974 -6980 -6844 -7610 2925 11509 11332 8183 9746 -5677 -20999 -7051 4928
14338 4928 1816 15339 18744 -7039 -34744 -17624 -9720 -5811 -7803 9542 12627 -8394 -16852
14325 -16852 -27386 -17383 -14195 -30238 -51747 -47521 -32025 -14789 -11503 -21124 -37759 -11547
$$ packed form
14419b1992j2075O823K3842J3278L654j2306k8454j706J1182j6039J858k59K7152
14406e042J3966Qp789Q443j4194m947j5904j5137K0166K1690R011P9q886J0397
14392A1861n273p203r685K1652L4594j0261l1472m740J417j1480m316J1260J0471
14379F825R38P154n32q814M235J9763O355J374j4867j0035J1177j042k6894j214
14365e577J6229J6270L2570j3159j8798r479j4771j4349j0304l550k321L878R332
14352a4029J1545m90m006J36p66J0535Q584j77l149J563j5423j5322J3948J1979
14338D928l112J3523L405k5783k7705J7120P904L909j992J7345L085k1021q458
14325a6852j0534J0003L188j6043k1509M226J5496J7236L286r621j6635K6212
$$ plain form
14313 -11547 6275 1155 11938 19351 15593 6359 12557 30045 31281 20304 22291 23914 34066
14300 34066 44043 35425 37704 38280 40973 46050 40882 27906 14489 22690 6831 -6982 -17138
14287 -17138 -32836 -38127 -12601 7319 5996 -4181 -1762 5328 12209 33842 15327 7869 1501
14274 1501 -3851 -8441 -22756 -22426 4248 -6461 -18399 -10637 -941 -3953 -6790 -18534 -29191
14261 -29191 -37425 -24293 -21926 -19856 -29764 -22679 -12978 -4510 23607 33195 12074 -1175 -12233
14248 -12233 -22321 -29278 -13283 -12544 -22985 -17245 -19157 -31704 -20471 -4460 -3357 -27040 -28221
14235 -28221 -34883 -32928 -8652 10137 21984 2364 -5042 5508 20685 26943 9254 -14888
14223 -14888 -26264 -32989 581 35877 46200 32578 7710 -4073 -10727 -8606 3855 28759
$$ packed form
14313a1547J7822n120J0783P413l758r234O198J7488J236j0977J987J623J0152
14300C4066R977q618K279N76K693N077n168j2976j3417Q201j5859j3813j0156
14287a7138j5698n291K5526J9920j323j0177K419P090O881K1633j8515p458o368
14274A501n352m590j4315L30K6674j0709j1938P762R696l012k837j1744j0657
14261b9191q234J3132K367K070r908P085R701Q468K8117R588k1121j3249j1058
14248a2233j0088o957J5995P39j0441N740j912j2547J1233J6011J103k3683j181
14235b8221o662J955K4276J8789J1847j9620p406J0550J5177O258j7689k4142
14223a4888j1376o725L3570L5296J0323j3622k4868j1783o654K121J2461K4904
$$ plain form
14211 28759 6477 -18799 1879 854 14632 12911 -6444 574 14628 21327 22597 18474 10012
14198 10012 -4071 -4912 17539 11176 3422 3419 15355 15048 285 5231 -1746 -1392 24290 23534 8955
14183 8955 19132 29845 6331 2211 -10233 -15357 -17938 -26630 -20720 -15326 -10482 -7545 -9895 -2567
14169 -2567 -2587 -3136 -1501 2970 -4001 -18061 -5769 17661 21255 28070 35906 27047 21988 3096
14155 3096 12660 39980 28774 33658 37982 10409 910 30364 21213 -1902 -12473 -8630 8465
14142 8465 8873 28481 10737 -12302 -18455 -380 -676 -7875 4003 20200 5864 5961 21549 21408
14128 21408 -13721 -29570 -39256 -32769 -30995 -9407 -12609 -14579 -15271 3761 30460 33403 7892
14115 7892 7926 8288 4230 6695 26541 5088 -9479 -14141 -18945 -32560 -35942 -16447 1341 1464
$$ packed form
14211B8759k2282k5276K0678j025J3778j721j9355P018J4054O699J270m123q462
14198A0012j4083q41K2451o363p754lJ1936l07j4763M946o977L54K5682p56j4579
14183H955J0177J0713k3514m120j2444n124k581q692N910N394M844K937k350P328
14169b567k0n49J635M471o971j4060J2292K3430L594O815P836q859n059j8892
14155C096R564K7320j1206M884M324k7573r499K9454r151k3115j0571L843J7095
14142H465M08J9608j7744k3039o153J8075k96p199J1878J6197j4336R7J5588j41
14128B1408l5129j5849r686O487J774K1588l202j970o92J9032K6699K943k5511
14115G892L4L62m058K465J9846k1453j4567m662m804j3615l382J9495J7788J23
$$ plain form
14101 1464 16043 -1152 2559 16714 28541 23159 9764 93 10025 13608 31877 41333 33948
14088 33948 26868 25433 9713 8705 6291 2163 16459 12277 13718 10599 13051 15390 19705 8077
14074 8077 13493 14550 26773 26585 19111 14827 9533 20120 5783 239 37793 40599 8837 719
14060 719 18645 8901 -5572 3998 20464 7256 11714 5487 11845 20431 11159 -8742 -203 3754
14046 3754 21495 18587 -1607 -2529 -2936 -7850 -4103 16897 42558 31026 21429 13306 13666 20714
14032 20714 24518 21755 26027 20793 30258 16449 -3950 2654 23028 27093 17730 6638 5808 -689
14018 -689 -1586 3052 -897 -1776 20936 17635 28959 28566 36328 57351 57018 41248 31314 22522 23946
14003 23946 22394 10274 -19689 -22385 -23370 -11353 -6431 -22918 -19558 -6175 19224 40266 20677
$$ packed form
14101A464J4579j7195L711J4155J1827n382j3395r671R932L583J8269R456p385
14088C3948p080j435j5720j008k414m128J4296m182J441l119K452K339M315j1628
14074H077N416J057J2223j88p474m284n294J0587j4337n544L7554K806l1762q118
14060G19J7926r744j4473R570J6466j3208M458o227O358Q586r272j9901Q539L957
14046C754J7741k908k0194r22m07m914L747K1000K5661j1532r597q123L60P048
14032B0714L804k763M272n234R465j3809k0399O604K0374M065r363j1092q30o497
14018f89q97M638l949q79K2712l301J1324l93P762K1023l33j5770r934q792J424
14003B3946j552j2120k9963k696r85J2017M922j6487L360J3383K5399K1042j9589
$$ plain form
13990 20677 -9034 -9362 -16814 -8212 -4937 -27234 -45799 -36911 -23680 3092 7507 9698 22171
13977 22171 19354 29426 20377 441 4164 18710 24401 6179 -10261 -841 1250 10226 42481
13964 42481 41862 31340 30620 22144 -3182 -30360 -26888 5035 2915 5565 14382 21142 28814 53536
13950 53536 42440 25381 29959 21376 11842 30706 39785 37031 33565 25419 20381 5411 7807
13937 7807 26721 30418 28954 20996 19040 27544 21443 8392 2763 -5665 -3266 14767 29111 16195
13923 16195 19936 16832 8493 -6821 1416 -2532 -9869 -21398 -2105 -12074 -18387 535 6753
13910 6753 23142 14102 -9960 -24791 -17928 -7576 -5305 -24601 -24519 11185 38890 41743 37026
13897 37026 19401 24138 24185 19347 -20467 -14833 6488 45283 49720 27089 20692 14351 10637 -2833
$$ packed form
13990B0677k9711l28p452Q602L275k2297j8565Q888J3231K6772M415K191J2473
13977B2171k817J0072r049j9936L723J4546N691j8222j6440R420K091Q976L2255
13964D2481o19j0522p20q476k5326k7178L472L1923k120K650Q817O760P672K4722
13950E3536j1096j7059M578q583r534J8864R079k754l466q146n038j4970K396
13937G807J8914L697j464p958j956Q504o101j3051n629q428K399J8033J4344j2916
13923A6195L741l104q339j5314Q237l948p337j1529J9293r969o313J8922O218
13910F753J6389r040k4062j4831O863J0352K271j9296Q2L5704K7705K853m717
13897C7026j7625M737M7m838l9814N634K1321L8795M437k2631o397o341l714j3470
$$ plain form
13883 -2833 1247 -4824 1185 5041 12757 14291 12853 18964 14504 13878 1444 -15403 -13343 -23460
13869 -23460 -32887 -30934 -31690 -13413 13532 29912 22683 14726 7663 9077 -6293 -33124 -48023
13856 -48023 -26816 -34645 -31287 3640 30364 39896 29511 26425 18687 14493 14537 24146 9323 4139
13842 4139 14094 26972 31577 33119 11433 -2884 -1528 15281 32414 21477 11159 -6087 -4833
13829 -4833 -14918 -19621 4442 -4395 314 -16148 -15338 -14579 -13125 -7886 18106 14628 -60 11818
13815 11818 26647 19246 8455 7844 13064 12970 16219 7467 16305 9487 2379 10508 19997 8467
13801 8467 10844 17564 7463 -17427 -17846 -16867 -15335 -29621 -43943 -29436 -7411 13089 5265
13788 5265 -4339 -1816 -7020 -11634 -15944 -28463 -4589 -12011 -10259 -8802 -3839 11288 13300 11712
$$ packed form
13883b833M080o071O009L856P716J534j438O111m460o26j2434j6847K060j0117
13869b3460r427J953p56J8277K6945J6380p229p957p063J414j5370k6831j4899
13856d8023K1207p829L358L4927K6724R532j0385l086p738m194M4R609j4823n184
13842D139R955J2878M605J542k1686j4317J356J6809J7133j0937j0318j7246J254
13829d833j0085m703K4063q837M709j6462Q10P59J454N239K5992l478j4688J1878
13815A1818J4829p401j0791o11N220r4L249q752Q838o818p108Q129R489j1530
13801H467K377O720j0101k4890m19R79J532j4286j4322J4507K2025K0500p824
13788E265r604K523n204m614m310j2519K3874p422J752J457M963J5127K012j588
$$ plain form
13774 11712 -1368 14258 31034 7779 -20615 -21952 -11278 -4582 -17902 9906 8362 -2220
13762 -2220 952 557 2545 26062 26365 -1056 -4069 5585 24505 15112 -8214 -16172 1348 20808
13748 20808 12160 -9881 8036 16598 8602 4034 3052 -22520 -31985 -12065 3411 22550 10867
13735 10867 8662 1446 -3731 20209 28081 4625 -16741 -164 3365 14024 12304 2427 11051
13722 11051 28161 36015 36829 30342 15092 17768 20314 28455 33594 23704 19057 17955 -5444 -2015
13708 -2015 -6587 -16778 -29060 -25683 6265 27652 21598 13370 -6446 -16289 -16516 2325 16581
13695 16581 53647 70956 49081 16554 9392 8532 5527 -13483 -30958 3695 24153 21709 13595
13682 13595 -9622 -18159 -33 -384 1127 15266 9498 16616 16923 14097 11921 19855 29873 18097
$$ packed form
13774A1712j3080J5626J6776k3255k8394j337J0674O696j3320K7808j544j0582
13762b220L172l95J988K3517L03k7421l013R654J8920r393k3326p958J7520J9460
13748B0808q648k2041J7917Q562p996m568r82k5572r465J9920J5476J9139j1683
13735A0867k205p216n177K3940P872k3456k1366J6577L529J0659j720r877Q624
13722A1051J7110P854Q14o487j5250K676K546Q141N139r890m647j102k3399L429
13708b015m572j0191j2282L377L1948K1387o054q228j9816r843k27J8841J4256
13695A6581L7066J7309k1875l2527p162q60l005j9010j7475L4653K0458k444q114
13682A3595k3217q537J8126l51J511J4139n768P118L07k826k176P934J0018j1776
$$ plain form
13668 18097 -4835 -16249 -13369 -11170 -5827 -35822 -35772 -19236 -14885 -6612 2520 1950 10093 4080
13654 4080 -11500 -5137 8748 22021 19761 34845 38237 22583 21366 38331 44926 49357 47867
13641 47867 20893 2890 1534 16467 26795 18427 5742 21161 23443 14131 29076 23433 5598
13628 5598 15457 570 11777 17762 21366 23650 31746 24839 8145 6269 16930 27432 27864 20630
13614 20630 22595 20164 8091 12906 28463 43839 20655 -3679 -8007 -5290 1433 13546 24268
13601 24268 22711 2265 9416 27829 32899 40739 56566 41759 26203 19254 23384 15048 11913
13588 11913 23478 26264 9097 -18143 -16682 -16287 -19743 -23564 -21879 -5821 28293 48776 54042
13575 54042 46347 33775 9300 12150 17575 -455 -2359 18729 44003 79145 70147 41934 28774
$$ packed form
13668A8097k2932j1414K880K199N343k9995N0J6536M351Q273R132n70Q143o013
13654D080j5580O363J3885J3273k260J5084L392j5654j217J6965O595M431j490
13641D7867k6974j8003j356J4933J0328q368j2685J5419K282r312J4945n643j7835
13628E598R859j4887J1207N985L604K284Q096o907j6694j876J0661J0502M32p234
13614B0630J965k431j2073M815J5557J5376k3184k4334m328K717O723J2113J0722
13601B4268j557k0446P151J8413N070P840J5827j4807j5556o949M130q336l135
13588A1913J1565K786j7167k7240J461L95l456l821J685J6058L4114K0483N266
13575E4042p695j2572k4475K850N425j8030j904K1088K5274L5142q998k8213j3160
$$ plain form
13562 28774 19281 42829 57931 35620 32988 39223 13631 -4451 -14930 -10643 -4029 -10106 -6218
13549 -6218 587 -3295 20792 26602 25254 29239 33014 16955 32233 25731 32413 20486 4124
13536 4124 5014 3094 3305 19971 33632 38889 28418 11526 -135 -13324 1067 8147 4380
13523 4380 18992 16225 8330 17545 9260 1491 -18711 -3985 23286 38632 56758 58751 60708
13510 60708 38254 50574 67665 36909 18156 29095 29665 17708 31664 21159 15533 854
13498 854 -8357 -7205 11851 30471 29202 17094 -2117 9377 36404 43588 36466 24338 21685
13485 21685 39625 13641 8401 6769 15356 24998 30445 30284 39095 52938 56356 64279 62717 63996
13471 63996 61733 47869 28947 34191 33120 21392 27112 32484 20147 20134 17613 8483 15228 26034
$$ packed form
13562B8774r493K3548J5102k2311k632O235k5592j8082j0479M287O614o077L888
13549f218O805l882K4087N810j348L985L775j6059J5278o502O682j1927j6362
13536D124Q90j920K11J6666J3661N257j0471j6892j1661j3189J4391P080l767
13523D380J4612k767p895R215q285p769k0202J4726K7271J5346J8126J993J957
13510F0708k2454J2320J7091l0756j8753J0939N70j1957J3956j0505n626j4679
13498H54r211J152J9056J8620j269j2108j9211J1494K7027P184p122j2128k653
13485B1685J7940k5984n240j632Q587R642N447j61Q811J3843L418P923j562J279
13471F3996k263j3864j8922N244j071j1728N720N372j2337j3k521r130O745J0806
$$ plain form
13457 26034 26973 23308 36636 43788 45818 35601 25194 30626 43551 44631 35400 41159 41074 53057
13443 53057 36224 34096 35672 32280 62333 48352 20964 28873 30368 29306 7450 -12631 -10801
13430 -10801 28603 47677 44809 38314 36110 12440 19836 32622 33643 49707 54412 55936 55951 55783
13416 55783 41856 24184 27426 21743 12028 19483 19702 35888 41243 52207 51766 23124 11488
13403 11488 20433 26421 18296 20076 29383 43486 55306 53537 67176 40599 29067 30745 13704
13390 13704 3445 23051 33751 32727 39762 41280 59895 49345 26299 33286 21474 22443 36249
13377 36249 35253 29263 33004 39673 31883 7910 -9582 -9761 -1232 21255 26744 37280 46495 57364
13363 57364 57801 55856 63357 59474 25544 20225 18762 14029 13600 4884 19039 44727 45087 40797
$$ packed form
13457B6034R39l665J3328P152K030j0217j0407N432J2925J080r231N759q5J1983
13443E3057j6833k128J576l392L0053j3981k7388P909J495j062k1856k0081J830
13430a0801L9404J9074k868o495k204k3670P396J2786J021J6064M705J524J5j68
13416E5783j3927j7672L242n683r715P455K19J6186N355J0964m41k8642j1636
13403A1488Q945N988q125J780R307J4103J1820j769J3639k6577j1532J678j7041
13390A3704j0259J9606J0700j024P035J518J8615j0550k3046O987j1812R69J3806
13377C6249r96n990L741O669p790k3973j7492j79Q529K2487N489J0536R215J0869
13363E7364M37j945P501l883l3930n319j463m733m29q716J4155K5688L60m290
$$ plain form
13349 40797 53017 67168 73604 68877 75652 59339 40952 49730 73501 87266 89911 93123 97947
13336 97947 85620 77160 68188 50185 46413 53428 39725 39854 55619 67226 62062 29278 5377
13323 5377 25973 49840 67002 81577 83623 76807 100176 130033 166078 206506 253781 340281
13311 340281 451766 644160 897389 1110581 1167404 1152391 1044200 805027 621861 569023
13301 569023 612516 718438 929157 1214774 1538070 1824296 1970425 1949106 1753178 1389790
13291 1389790 1044278 790044 631751 549477 477533 424939 393796 359062 337856 317069 305468
13280 305468 291068 276774 237694 227382 237350 232442 201153 198671 195713 184278 161644 149865
13268 149865 167930 177114 165434 146546 132702 140276 137091 120812 118190 106457 81864 64289
$$ packed form
13349D0797J2220J4151O436m727O775j6313j8387Q778K3771J3765K645L212M824
13336I7947j2327q460q972j8003l772P015j3703J29J5765J1607n164l2784k3901
13323E377K0596K3867J7162J4575K046o816K3369K9857L6045M0428M7275Q6500
13311C40281J11485J92394K53229K13192N6823j5013j08191k39173j83166n2838
13301E69023M3493J05922K10719K85617L23296K86226J46129k1319j95928l63388
13291A389790l45512k54234j58293q2274p1944n2594l1143l4734k1206k0787j1601
13280C05468j4400j4294l9080j0312R968m908l1289k482k958j1435k2634j1779
13268A49865J8065R184j1680j8888j3844P574l185j6279k622j1733k4593j7575
$$ plain form
13256 64289 88944 105889 102556 100960 95314 91968 107058 111053 103732 97769 83869 73010 63829
13243 63829 52394 63979 86872 99300 91749 72097 73122 96763 104524 101887 88154 64086
13231 64086 67210 68172 74742 91606 97822 98372 86168 77702 97300 97427 103501 106136 95788 100846
13217 100846 92397 89829 105974 103025 95928 100631 83956 70880 73328 75985 72197 61255 34433
13204 34433 37282 50425 59038 56885 62938 84014 75972 78444 91452 105355 111294 96635 97662
13191 97662 103870 63020 69821 94289 93213 83374 57827 28207 26572 46203 57689 58651 86359
13178 86359 98039 105336 99085 103535 106407 74874 54359 61852 61878 66908 83866 111433 107056 91720
13164 91720 98156 103379 115679 97326 110525 127065 129610 111295 111242 100469 63668 34129 37785
$$ packed form
13256F4289K4655J6945l333j596n646l346J5090L995p321n963j3900j0859r181
13243F3829j1435J1585K2893J2428p551j9652J025K3641P761k637j3733k4068
13231F4086L124R62O570J6864O216N50j2204q466J9598J27O074K635j0348N058
13217A00846q449k568J6145k949p097M703j6675j3076K448K657l788j0942k6822
13204C4433K849J3143Q613k153O053K1076q042K472J3008J3903N939j4659J027
13191I7662O208m0850O801K4468j076r839k5547k9620j635J9631J1486R62K7708
13178H6359J1680P297o251M450K872l1533k0515P493K6N030J6958K7567m377j5336
13164I1720O436N223J2300j8353J3199J6540K545j8315n3j0773l6801k9539L656
$$ plain form
13151 37785 66534 74916 59347 43991 36749 37550 32753 25510 20425 36371 41449 44724 41063 21719
13137 21719 17935 -3552 3870 36231 55308 68051 51880 55649 61056 80506 72980 70167 84523
13124 84523 105555 87118 73860 72173 70489 58880 52026 64798 62300 67998 86827 85935 86361
13111 86361 68205 60970 75039 69694 124192 233338 354072 375579 334588 290911 243143 216412
13099 216412 186339 197331 280261 420287 560363 591661 536102 455062 387651 318346 256840
13088 256840 213032 164227 145064 124856 122695 127087 133683 130511 132895 135187 131574 122088 119397
13075 119397 106302 104100 87648 73094 71767 59866 73810 92807 106015 118674 97457 78352
13063 78352 74965 82878 94009 85166 96659 115772 107510 106554 109035 104707 116495 132347 120638
$$ packed form
13151C7785K8749Q382j5569j5356p242Q01m797p243n085J5946N078L275l661j9344
13137B1719l784k1487P422L2361J9077J2743j6171L769N407J9450p526k813J4356
13124H4523K1032j8437j3258j687j684j1609o854J2772k498N698J8829q92M26
13111H6361j8156p235J4069n345N4498J09146J20734K1507m0991m3677m7768k6731
13099B16412l0073J0992Q2930J40026J40076L1298n5559q1040o7411o9305o1506
13088B56840m3808m8805j9163k0208k161M392O596l172K384K292l613r486k691
13075A19397j3095k202j6452j4554j327j1901J3944J8997J3208J2659k1217j9105
13063G8352l387P913J1131q843J1493J9113q262r56K481m328J1788J5852j1709
$$ plain form
13050 120638 116339 130466 143982 171196 187005 189062 177334 177714 168877 185255 204822 195803 175302
13037 175302 160260 165152 161672 165284 189612 200384 192463 184814 182706 162017 171563 192456 199416
13024 199416 210205 222697 210759 206648 204542 195021 190536 167542 149164 143593 127533 118874 127626
13011 127626 143420 161838 149867 124888 98503 77106 43377 14223 4898 7348 28911 82336
12999 82336 110849 100900 81343 34406 -1799 -31369 -51401 -41870 -29737 28772 101003 146890
12987 146890 187517 206718 206843 209307 225484 245161 267748 263191 253495 258745 276702 279468 276581
12974 276581 281833 284582 290929 313859 309494 313190 342424 355434 376311 401382 379303 343485
12962 343485 343445 352579 397520 443228 439061 437644 424664 437368 435128 416509 402539 390074 413107
$$ packed form
13050A20638m299J4127J3516K7214J5809K057j1728L80q837J6378J9567r019k0501
13037A75302j5042M892l480L612K4328J0772p921p649k108k0689R546K0893O960
13024A99416J0789J2492j1938m111k106r521m485k2994j8378n571j6060q659Q752
13011A27626J5794J8418j1971k4979k6385k1397l3729k9154r325K450K1563N3425
12999H2336K8513r949j9557m6937l6205k9570k0032R531J2133N8509P2231M5887
12987A46890M0627J9201J25K464J6177J9677K2587m557r696N250J7957K766k887
12974B76581N252K749O347K2930m365L696K9234J3010K0877K5071k2079l5818
12962C43485m0R134M4941M5708m167j417j2980J2704k240j8619j3970j2465K3033
$$ plain form
12949 413107 425759 429313 431563 418960 413082 413105 425043 443914 450237 446683 425071 442089 477790
12936 477790 483108 476407 490645 528076 582217 634844 659810 673572 679990 665944 668290 673307
12924 673307 681389 700752 691975 693327 714832 736216 756533 764285 785587 833435 874620 920742
12912 920742 971619 982688 965779 957207 994916 1030165 1061635 1100738 1186148 1284216 1385832
12901 1385832 1462171 1513049 1514332 1533424 1571779 1599796 1630367 1657927 1664101 1701981 1752147 1812677
12889 1812677 1897692 1980597 2059319 2169311 2257567 2360607 2486762 2605829 2720525 2834181
12879 2834181 2933479 3082843 3259846 3449057 3685198 3979246 4306428 4617539 4963382 5387453
12869 5387453 5872129 6454288 7210406 8176106 9362751 10799567 12464126 14270372 16477622
$$ packed form
12949D13107J2652L554K250j2603n878K3J1938J8871O323l554k1612J7018L5701
12936D77790N318o701J4238L7431N4141N2627K4966J3762O418j4046K346N017
12924F73307Q082J9363q777J352K1505K1384K0317P752K1302M7848M1185M6122
12912I20742N0877J1069j6909q572L7709L5249L1470L9103Q5410R8068J01616
12901A385832P6339N0878J283J9092L8355K8017L0571K7560O174L7880N0166O0530
12889A812677Q5015Q2905P8722J09992Q8256J03040J26155J19067J14696J13656
12879B834181R9298J49364J77003J89211K36141K94048L27182L11111L45843M24071
12869E387453M84676N82159P56118R65700J186645J436816J664559J806246K207250
$$ plain form
12860 16477622 19286767 22921123 28194304 36191702 48510743 68082047 98843881 142910017
12852 142910017 191475812 220657239 227182156 219952418 182425826 148892992 144298121
12845 144298121 165212448 209554686 272678026 337161765 377795758 383623448 352814957
12838 352814957 286573209 211553857 155320402 119921396 97791986 83255043 73163856
12831 73163856 65791461 60101774 55448765 51387206 47668771 44209748 40961307 37994122
12823 37994122 35306070 32823797 30502591 28336029 26342651 24575028 23034568 21661427
12815 21661427 20407172 19269780 18222580 17254974 16368242 15536066 14794830 14163322 13589416
12806 13589416 13051818 12554781 12086274 11668005 11279398 10944115 10677721 10479268 10295731
$$ packed form
12860A6477622K809145L634356N273181P997398J2319041J9571304L0761834M4066136
12852A42910017M8565795K9181427O524917p229738l7526592l3532834m594871
12845A44298121K0914327M4342238O3123340O4483739M0633993N827690l0808491
12838C52814957o6241748p5019352n6233455l5399006k2129410j4536943j0091187
12831G3163856p372395n689687m653009m061559l718435l459023l248441k967185
12823C7994122k688052k482273k321206k166562j993378j767623j540460j373141
12815B1661427j254255j137392j047200r67606q86732q32176p41236o31508n73906
12806A3589416n37598m97037m68507m18269l88607l35283k66394j98453j83537
$$ plain form
12797 10295731 10078207 9759144 9381581 8987481 8585664 8191431 7838379 7466002 7095510
12788 7095510 6839807 6622901 6424176 6244638 6062339 5883553 5686997 5509169 5351365
12779 5351365 5227595 5143174 5122577 5089683 5046525 4986804 4927240 4868178 4785282 4704463 4621537
12768 4621537 4524296 4424337 4356180 4315507 4266390 4228411 4164755 4057495 3909932 3747454 3551206
12757 3551206 3371780 3206276 3042090 2861358 2697889 2559588 2399428 2246517 2109298
12748 2109298 1982131 1852512 1735776 1624459 1539771 1458260 1396873 1328568 1279722 1243629
12738 1243629 1193746 1133372 1103581 1076093 1028878 981251 913146 869921 843013 817587 774448
12727 774448 709158 679510 672573 656996 637447 624855 621384 589080 587830 580132 546380 536286
$$ packed form
12797A0295731k17524l19063l77563l94100m01817l94233l53052l72377l70492
12788G095510k55703k16906j98725j79538j82299j78786j96556j77828j57804
12779E351365j23770q4421k0597l2894m3158n9721n9564n9062q2896q0819q2926
12768D621537r7241r9959o8157m0673m9117l7979o3656j07260j47563j62478j96248
12757C551206j79426j65504j64186j80732j63469j38301j60160j52911j37219
12748B109298j27167j29619j16736j11317q4688q1511o1387o8305m8846l6093
12738A243629m9883o0374k9791k7488m7215m7627o8105m3225k6908k5426m3139
12727G74448o5290k9648o937j5577j9549j2592l471l2304j250p698l3752j0094
$$ plain form
12715 536286 550740 564831 558947 552476 537008 516557 514446 484622 468537 471853 503168 547788
12703 547788 613186 678489 742525 800057 826295 804844 746113 662324 585833 563247 588956
12692 588956 620297 647710 670104 665653 653334 652539 600854 541999 480776 459556 468936 449240
12680 449240 436455 427213 432545 422985 392378 346252 314934 313623 307972 331455 364544 402253
12668 402253 405747 398505 364333 319586 311425 280462 267501 256767 232063 224501 229948 207364
12656 207364 193457 194925 207958 183373 177457 192875 212111 207096 204464 187219 174088 169976
12644 169976 170445 179181 187081 184053 181817 189914 189693 186844 180889 163455 160760 175079 186388 195855
12630 195855 201848 195789 187352 162454 139119 142143 166949 183466 188505 174228 158853 159864 153638
$$ packed form
12715E36286J4454J4091n884o471j5468k0451k111k9824j6085L316L1315M4620
12703E47788O5398O5303O4036N7532K6238k1451n8731q3789p6491k2586K5709
12692E88956L1341K7413K2394m451j2319p95n1685n8855o1223k1220R380j9696
12680D49240j2785r242N332r560l0607m6126l1318j311n651K3483L3089L7709
12668D02253L494p242l4172m4747q161l0963j2961j0734k4704p562N447k2584
12656B07364j3907J468J3033k4585n916J5418J9236n015k632j7245j3131m112
12644A69976M69Q736P900l028k236Q097k21k849n955j7434k695J4319J1309R467
12630A95855N993o059q437k4898k3335L024K4806J6517N039j4277j5375J011o226
$$ plain form
12617 153638 151752 141015 146193 141805 141046 133479 123012 132847 141138 145072 159074 186642 235956
12604 235956 264493 273118 264291 233344 189263 153782 148089 129843 103694 103870 109715 95750 94850
12591 94850 100024 84949 93180 109135 110095 115104 116654 85250 84971 107869 96611 92934 84463 100157
12577 100157 126445 119061 105687 101689 91638 83044 86536 66792 47420 51664 41502 40553 53564
12564 53564 67262 54459 74681 84383 71439 67902 71141 48471 51218 74513 78180 70459 73333
12551 73333 55128 85805 100319 76470 62816 66792 83285 76014 53801 54179 63035 71011 74696
12538 74696 78101 80360 92757 68979 43603 30316 10976 22291 19741 35713 37712 21704
12526 21704 8010 1580 5021 17545 39322 24616 8680 14889 13194 15414 21688 18516 10218
$$ packed form
12617A53638j886j0737N178m388p59p567j0467R835Q291L934J4002K7568M9314
12604B35956K8537Q625q827l0947m4081l5481n693j8246k6149J76N845j3965r00
12591I4850N174j5075Q231J5955R60N009J550l1404k79K2898j1258l677q471J5694
12577A00157K6288p384j3374l998j0051q594L492j9744j9372M244j0162r49J3011
12564E3564J3698j2803K0222R702j2944l537L239k2670K747K3295L667p721K874
12551G3333j8205L0677J4514k3849j3654L976J6493p271k2213L78Q856P976L685
12538G4696L405K259J2397k3778k5376j3287j9340J1315k550J5972J999j6008
12526B1704j3694o430L441J2524K1777j4706j5936O209j695K220O274l172q298
$$ plain form
12513 10218 17700 13832 25657 37980 14667 -1211 -16929 1912 3751 -8193 -226 20808
12501 20808 23668 20339 22167 39353 58812 63597 47501 19943 22003 25064 29721 26556 22836
12488 22836 23817 24169 15859 34988 47315 58281 37133 -13095 -20789 1564 19440 11010 20219
12475 20219 32837 32446 32787 38209 53055 34876 16606 4791 -4818 14523 32826 42209 32767
12462 32767 44267 34055 15776 4434 4088 17220 21105 21401 42107 64014 54514 43196 50417
12449 50417 47267 42237 26104 5042 10901 15650 15189 23720 21978 15834 -1399 -12436 1730
12436 1730 24390 7690 -16097 -17814 -32780 -23518 -8213 -6770 2575 1306 23434 3681 -21710
12423 -21710 -23600 -16718 15549 9744 7106 -2102 5736 10937 20070 25211 20116 29902 42602 41737
$$ packed form
12513A0218P482l868J1825J2323k3313j5878j5718J8841J839j1944P967K1034
12501B0808K860l329J828J7186J9459M785j6096k7558K060L061M657l165l720
12488B2836R81L52q310J9129J2327J0966k1148n0228p694K2353J7876q430R209
12475B0219J2618l91L41N422J4846j8179j8270j1815r609J9341J8303R383r442
12462C2767J1500j0212j8279j1342l46J3132L885K96K0706K1907r500j1318P221
12449E0417l150n030j6133k1062N859M749m61Q531j742o144j7233j1037J4166
12436A730K2660j6700k3787j717j4966R262J5305J443R345j269K2128j9753k5391
12423b1710j890O882L2267n805k638r208P838N201R133N141n095R786J2700q65
$$ plain form
12409 41737 27582 21614 35415 50602 56599 60052 63633 67024 69652 60006 59386 57163 81645 126292
12395 126292 151077 187607 227268 267961 335196 455679 661527 944606 1164499 1266696
12385 1266696 1303095 1210016 1131244 1243654 1495535 1777215 1955978 1980331 1823404 1518117
12375 1518117 1154975 862597 688309 583672 501282 430194 364964 320052 286650 274399
12365 274399 247156 237118 235585 222015 200947 178617 178694 178740 179596 177723 126989 85318 73856
12352 73856 82720 88857 106946 96345 82583 76867 93702 83241 97465 111200 103799 88108
12340 88108 79686 70489 67820 69680 83415 75648 82528 73074 38282 26147 33264 52089 55882
12327 55882 52547 42476 42599 54342 46289 34810 42505 42155 43245 29785 29059 21585 17676 19379
$$ packed form
12409D1737j4155n968J3801J5187N997L453L581L391K628r646o20k223K4482M4647
12395A26292K4785L6530L9661M0693O7235J20483K05848K83079K19893J02197
12385A266696L6399r3079p8772J12410K51881K81680J78763K4353j56927l05287
12375A518117l63142k92378j74288j04637q2390p1088o5230m4912l3402j2251
12365B74399k7243j0038j533j3570k1068k2330P7M6Q56j873n0734m1671j1462
12352G3856Q864O137J8089j0601j3762n716J6835j0461J4224J3735p401j5691
12340H8108q422r197k669J860J3735p767O880r454l4792j2135P117J8825L793
12327E5882l335j0071J23J1743q053j1479P695l50J090j3460p26p474l909J703
$$ plain form
12313 19379 11579 25616 17084 21131 36422 30124 16733 10658 29158 25350 4472 7026 12252
12300 12252 43324 44054 34734 38326 48989 41358 27034 40674 53015 43562 28098 31918 33658
12287 33658 27860 15033 22064 14882 16252 16769 12312 -1925 11676 19126 9674 20034 21704 25880
12273 25880 29054 28295 -5864 -27323 8741 29496 25082 23874 25926 32175 54340 43054 19036
12260 19036 15201 31557 41841 46156 35153 25910 19465 11008 58 10121 18131 401 2906
12247 2906 10899 20168 38792 22764 13314 13698 1478 4350 -451 -6713 -24701 -23287 -20956 -11894
12233 -11894 -11748 -644 -8286 -20170 -20098 -29462 -37114 -29441 -19123 9644 13640 6886 19900 -1757
12219 -1757 -22566 -6959 8000 18129 15468 20706 28803 10391 11498 16913 28653 27918 18051
$$ packed form
12313A9379p800J4037q532M047J5291o298j3391o075J8500l808k0878K554N226
12300A2252L1072P30r320L592J0663p631j4324J3640J2341r453j5464L820J740
12287C3658n798j2827P031p182J370N17m457j4237J3601P450r452J0360J670M176
12273B5880L174p59l4159k1459L6064K0755m414j208K052O249K2165j1286k4018
12260A9036l835J6356J0284M315j1003r243o445q457j0950J0063Q010j7730K505
12247B906P993R269J8624j6028r450L84j2220K872m801o262j7988J414K331R062
12233a1894J46J1104p642j1884P2r364p652P673J0318K8767L996o754J3014k1657
12219a757k0809J5607J4959J0129k661N238Q097j8412J107N415J1740p35r867
$$ plain form
12206 18051 4280 5115 20582 25153 17172 -430 332 2263 8545 9341 -3600 5433 27205 18114
12192 18114 -8360 -32878 -5454 -2454 -10083 9474 40768 35029 26515 26806 13222 -4745 -8524
12179 -8524 -6922 2679 11170 -3861 -18463 -13597 -21154 -30417 -12298 7720 31509 49436 33049
12166 33049 22780 -14636 -36418 -34113 -17641 -19260 -4758 1239 3388 -11424 367 -2401 2269
12153 2269 17656 3803 -434 -9715 2579 3833 -10628 -14794 2165 1455 8006 -1228 10314
12140 10314 24107 47036 32457 11113 9924 21194 15530 10327 16799 23648 27817 2801 -16254
12127 -16254 -24538 -33964 8515 37716 19126 -1325 8189 24537 9778 5168 -1456 -7425 -8360
12114 -8360 -2344 6710 11076 11768 28782 24319 -8908 -2943 7008 9037 11230 -2048 -6999 6543
$$ packed form
12206A8051j3771Q35J5467M571p981j7602P62J931O282P96j2941R033K1772r091
12192A8114k6474k4518K7424L000p629J9557L1294n739q514K91j3584j7967l779
12179h524J602R601Q491j5031j4602M866p557r263J8119K0018K3789J7927j6387
12166C3049j0269l7416k1782K305J6472j619J4502N997K149j4812J1791k768M670
12153B269J5387j3853m237r281J2294J254j4461m166J6959p10O551r234J1542
12140A0314J3793K2929j4579k1344j189J1270n664n203O472O849M169k5016j9055
12127a6254q284r426M2479K9201j8590k0451R514J6348j4759m610o624n969r35
12114h360O016R054M366O92J7014m463l3227N965R951K029K193j3278m951J3542
$$ plain form
12100 6543 12992 22212 31990 43797 28892 15038 11544 13776 -6214 14146 33160 33283 27740
12087 27740 23254 35339 29686 17512 9697 1217 7379 14089 -3587 -14104 -6633 6411 386
12074 386 8970 4455 10892 17135 22569 1541 -14983 -11535 5847 9515 1849 -8653 1252 13099
12060 13099 8965 16716 -6846 -20594 4037 -4899 -20641 -17113 -4114 5249 -8000 -36 2170
12047 2170 13261 17430 20506 12979 18097 24225 39431 43286 37193 15712 -1090 2975 7287 -11440
12033 -11440 -15799 -16422 -2357 -1383 8275 22724 18658 7872 -536 -14783 -3606 5442 1474 -18618
12019 -18618 -27381 -18023 747 13808 9395 899 13974 35193 41301 32513 28790 29579 24901 21374
12005 21374 4369 877 -2788 8084 32601 49605 57332 48766 56157 49284 29752 -1392 -6688
$$ packed form
12100F543O449R220R778J1807j4905j3854l494K232j9990K0360J9014J23n543
12087B7740m486J2085n653j2174p815q480O162O710j7676j0517P471J3044o025
12074C86Q584m515O437O243N434k1028j6524L448J7382L668p666j0502R905J1847
12060A3099m134P751k3562j3748K4631q936j5742L528J2999R363j3249P964K206
12047B170J1091M169L076p527N118O128J5206L855o093k1481j6802M065M312j8727
12033a1440m359o23J4065R74R658J4449m066j0786q408j4247J1177R048l968k0092
12019a8618q763R358J8770J3061m413q496J3075K1219O108q788l723P89m678l527
12005B1374j7005l492l665J0872K4517J7004P727q566P391o873j9532l1144n296
$$ plain form
11992 -6688 -2205 8828 23957 10225 -10086 -2097 4862 -5450 9489 13308 15387 458 3975
11979 3975 11852 4105 9981 10012 -13475 -15449 -13210 11999 41106 51700 41833 34507 31277 28501
11965 28501 16354 12103 2004 -12446 -8974 -5196 3634 -4886 -37033 -36821 -18625 -28025 -6762
11952 -6762 14252 12713 -12448 -4951 815 27597 28485 -7428 -6229 -925 15119 13996 6729 3441
11938 3441 -7508 -21739 -6660 -8658 -17652 -2536 -17021 -14693 698 12567 9709 1741 -4416
11925 -4416 46 951 -19106 -5582 22577 25945 13718 10437 14378 4048 22625 14748 17785
11912 17785 35403 22437 5910 23352 22328 177 -26812 -17436 13421 0 -2346 -9085
11900 -9085 -19304 -40621 -29248 -34734 -31058 -34480 -28929 -23224 -27819 -24767 -16489 -32625 -19315
$$ packed form
11992f688M483J1033J5129j3732k0311P989O959j0312J4939L819K079j4929L517
11979C975P877p747N876L1k3487j974K239K5209K9107J0594r867p326l230k776
11965B8501j2147m251j0099j4450L472L778Q830q520l2147K12J8196r400K1263
11952f762K1014j539k5161P497N766K6782Q88l5913J199N304J6044j123p267l288
11938C441j0949j4231J5079j998q994J5116j4485K328J5391J1869k858p968o157
11925d416M462R05k0057J3524K8159L368j2227l281L941j0330J8577p877L037
11912A7785J7618j2966j6527J7442j024k2151k6989R376L0857j3421k346o739
11900i085j0219k1317J1373n486L676l422N551N705m595L052Q278j6136J3310
$$ plain form
11887 -19315 -6098 2457 2337 22067 45405 59540 38520 17850 5414 -5311 -3091 -12376 -15572
11874 -15572 -21897 -19193 -12247 14387 7478 -13276 -22688 -17580 -9790 -21446 -30058 -24197 -22646 -27708
11860 -27708 -21504 -6269 6703 27831 23398 6550 9129 2606 -9156 -10863 -11452 -16896 -16735 -31172
11846 -31172 -27735 -9964 20093 18757 12284 23241 10686 -4975 -7877 -8899 -3285 -5863 -9405
11833 -9405 -13209 -14285 -11188 -6817 11605 35179 26234 31962 27430 19449 2344 -19623 -16520 -16637
11819 -16637 -14832 -17383 -22665 -12587 4560 4943 4037 36932 12747 -2954 -3278 -8154 -5499 8023
11805 8023 27092 35998 46219 31664 -3007 -6797 -3525 15117 30031 19932 12788 31705 30288
11792 30288 18695 -1973 -28386 -43316 -28557 -25904 -19148 -14825 -7887 6141 11285 4695 8879
$$ packed form
11887a9315J3217Q555j20J9730K3338J4135k1020k0670j2436j0725K220r285l196
11874a5572o325K704O946K6634o909k0754r412N108P790j1656q612N861J551n062
11860b7708O204J5235J2972K1128m433j6848K579o523j1762j707n89n444J61j4437
11846c1172L437J7771L0057j336o473J0957j2555j5661k902j022N614k578l542
11833i405l804j076L097M371J8422K3574q945N728m532p981j7105k1967L103j17
11819a6637J805k551n282J0078J7147L83r06L2895k4185j5701l24m876K655J3522
11805H023J9069Q906J0221j4555l4671l790L272J8642J4914j0099p144J8917j417
11792C0288j1593k0668k6413j4930J4759K653O756M323O938J4028N144o590M184
$$ plain form
11779 8879 17464 20693 21215 31662 25895 -5301 -20980 -9385 11912 27932 13482 12019 11148
11766 11148 21624 29670 30132 27076 16263 18051 26081 22982 11826 3115 -12408 -7370 -2646 -5077
11752 -5077 -561 5797 10709 4631 6148 5251 -951 -5135 474 11045 19588 -3769 -10742 1708
11738 1708 -4635 -19194 -28973 -27329 -22104 -10835 -3051 7110 3999 2421 10594 16212 3413 -9472
11724 -9472 -8597 -5096 -19492 -30689 -21631 -21378 -13649 -13531 -30745 -28736 -35418 -10335 -950 -14727
11710 -14727 6227 14572 -9025 -13004 -28609 -10892 -3319 -10758 -10347 -1044 9706 -7475 -19554
11697 -19554 -17029 -20156 7678 8259 -17368 -23771 -3409 935 -7066 -6371 -7471 5150 15805 7874
11683 7874 2733 -8036 -11576 -23294 -36351 -23711 -18693 -23121 -3578 15822 12470 5094 -15398
$$ packed form
11779H879Q585L229N22J0447n767l1196j5679J1595K1297J6020j4450j463q71
11766A1148J0476Q046M62l056j0813J788Q030l099j1156q711j5523N038M724k431
11752e077M516O358M912o078J517q97o202m184N609J0571Q543k3357o973J2450
11738A708o343j4559r779J644N225J1269P784J0161l111j578Q173N618j2799j2885
11724i472Q75L501j4396j1197R058K53P729J18j7214K009o682K5083R385j3777
11710a4727K0954Q345k3597l979j5605J7717P573p439M11R303J0750j7181j2079
11697a9554K525l127K7834N81k5627o403K0362M344q001O95j100J2621J0655p931
11683G874n141j0769l540j1718j3057J2640N018m428J9543J9400l352p376k0492
$$ plain form
11670 -15398 -3525 623 7814 2871 17899 37916 24641 11338 7758 22721 15974 7170 11604
11657 11604 22833 32030 18151 -1252 -3011 -24822 -34465 -51230 -46521 -30509 -19479 -7305
11645 -7305 -28682 -48313 -31270 -34072 -20415 -1330 4422 4254 -2344 -22033 -13398 1259 13925
11632 13925 5177 3289 1190 -1539 -4989 -14153 -12614 4633 15474 16681 39714 27802 2021
11619 2021 -18239 -26460 -10061 11127 -4293 -33027 -33850 -39464 -31306 -29355 -21194 -22996 -33927
11606 -33927 -8458 -5802 -18784 -16805 -789 -5131 -4849 15936 20000 2906 -7021 1321 18678
11593 18678 20580 7472 -9875 -4590 9175 18260 21468 12551 29455 24226 1347 -18528 -33031
11580 -33031 -24332 -18760 -33952 -41991 -20882 3573 -14252 -29204 -29059 -22762 -28616 -15048 -4285
$$ packed form
11670a5398J1873M148P191m943J5028K0017j3275j3303l580J4963o747q804M434
11657A1604J1229R197j3879j9403j759k1811r643j6765M709J6012J1030J2174
11645g305k1377j9631J7043k802J3657J9085N752j68o598j9689Q635J4657J2666
11632A3925q748j888k099k729l450r164J539J7247J0841J207K3033j1912k5781
11619B021k0260q221J6399K1188j5420k8734q23n614Q158J951Q161j802j0931
11606c3927K5469K656j2982J979J6016m342K82K0785M064j7094r927Q342J7357
11593A8678J902j3108j7347N285J3765R085L208q917J6904n229k2879j9875j4503
11580c3031Q699N572j5192q039K1109K4455j7825j4952J45O297n854J3568J0763
$$ plain form
11567 -4285 1931 3308 9449 506 2725 4895 7076 3586 -14102 -22122 -15499 16454 35049 41291
11553 41291 43030 34589 22425 740 -5466 -21850 -26215 -745 9978 11437 5211 -10448 11932
11540 11932 26768 19159 1237 10220 14959 -2778 -5890 -5355 -7159 -3211 -11017 -18036 -10632 1714
11526 1714 -10463 -46014 -35643 -4601 2262 -16105 -24071 -21369 -2057 13498 11179 -953 -15102
11513 -15102 -5222 -3023 -8101 -9972 -26870 -17895 -1800 -18064 -13114 -3744 -15369 -31339 -7517
11500 -7517 -18893 -19589 3718 15457 23201 3556 4283 31711 36578 5920 -10733 -31975 -32526
11487 -32526 3922 12663 14365 -7982 -3162 12755 5960 5337 -2024 -1318 -9652 7041 11405 3491
11473 3491 14076 30685 29275 10896 33723 54712 22675 -8283 -9882 2235 92 -3968 -18251
$$ packed form
11567d285O216J377O141q943K219K170K181l490j7688q020O623L1953J8595O242
11553D1291J739q441j2164k1685o206j6384m365K5470J0723J459o226j5659K2380
11540A1932J4836p609j7922Q983M739j7737l112N35j804L948p806p019P404J2346
11526A714j2177l5551J0371L1042O863j8367p966K702J9312J5555k319j2132j4149
11513a5102R880K199n078j871j6898Q975J6095j6264M950R370j1625j5970K3822
11500g517j1376o96K3307J1739P744j9645P27K7428M867l0658j6653k1242n51
11487c2526L6448Q741J702k2347M820J5917o795o23p361P06q334J6693M364p914
11473C491J0585J6609j410j8379K2827K0989l2037l0958j599J2117k143m060j4283
$$ plain form
11460 -18251 -25113 -33464 -24272 -8477 -219 -1456 1742 7404 -2209 4299 16506 7971 4342 7870
11446 7870 -969 -7813 -2748 18296 23478 11651 1177 3876 10434 12165 32948 25305 12731
11433 12731 10868 18788 2673 10532 15731 25529 38120 43551 16935 -21821 -42461 -15806 -5715
11420 -5715 -18105 -29642 -203 3721 932 -4629 -2299 -6560 -2217 19399 18528 5133 4406 11950
11406 11950 12028 28949 17502 -4568 -18472 -27109 -21619 -6120 2127 8827 16474 14914 -2804
11393 -2804 -15480 -27828 -15557 -13817 69 14787 14416 23980 15397 7501 -3164 -19794 -21305
11380 -21305 -7493 7490 17296 -8035 -46683 -22359 -8487 -19719 -8087 -13038 -17452 -15338
11368 -15338 -34121 -45079 -31089 -21126 -16340 -10283 -2216 -16348 3937 5800 -15973 -19989 -19206
$$ packed form
11460a8251o862q351R192J5795Q258j237L198N662r613O508J2207q535l629L528
11446G870q839o844N065K1044N182j1827j0474K699O558J731K0783p643j2574
11433A2731j863P920j6115P859N199R798J2591N431k6616l8756k0640K6655J0091
11420e715j2390j1537K9439L924k789n561K330m261M343K1616q71j3395p27P544
11406A1950P8J6921j1447k2070j3904q637N490J5499Q247O700P647j560j7718
11393b804j2676j2348J2271J740J3886J4718l71R564q583p896j0665j6630j511
11380b1305J3812J4983R806k5331l8648K4324J3872j1232J1632m951m414K114
11368a5338j8783j0958J3990R963M786O057Q067j4132K0285J863k1773m016P83
$$ plain form
11355 -19206 -6883 15 -1339 -8810 -13910 -13998 -12584 1303 -4064 -10562 -16757 -21639 -9400 4445
11341 4445 2683 -7882 -10124 1652 18633 22809 14534 3269 -5302 -9600 -7037 -29 -15109
11328 -15109 -13406 -10922 825 -6997 -34127 -24393 -5339 -13720 -27922 -19984 1858 -1216 11621
11315 11621 9519 -2283 -7631 -18631 -11877 -12388 4010 22402 20761 5036 21474 17183 2438
11302 2438 -11049 -7929 -16005 -9127 -11669 -10880 -5776 -222 -6910 -15348 -2547 -5394 5869 -12720
11288 -12720 -1427 14329 15838 -12844 -18062 -22079 -23469 -24453 -35923 -18478 -18651 -29481 -38791
11275 -38791 -56804 -49674 -47894 -55477 -51533 -39135 -31927 -24424 -15705 -17960 3916 2595 4946 8529
11261 8529 -7393 -14836 -30249 -41453 -46221 -48730 -39937 -28237 -19714 -4480 10322 -10362 -24157
$$ packed form
11355a9206J2323O898j354p471n100q8J414J3887n367o498o195m882J2239J3845
11341D445j762j0565k242J1776J6981M176q275j1265q571m298K563P008j5080
11328a5109J703K484J1747p822k7130R734J9054q381j4202P938K1842l074J2837
11315A1621k102j1802n348j1000O754n11J6398J8392j641j5725J6438m291j4745
11302B438j3487L120q076O878k542P89N104N554o688q438J2801k847J1263j8589
11288a2720J1293J5756J509k8682n218m017j390r84j1470J7445j73j0830r310
11275c8791j8013P130J780p583L944J2398P208P503Q719k255K1876j321K351L583
11261H529j5922p443j5413j1204m768k509Q793J1700Q523J5234J4802k0684j3795
$$ plain form
11248 -24157 -12188 -4673 -16476 -22163 -17586 -6491 3734 4836 9783 621 11836 12128 14298
11235 14298 7728 -11140 -20540 -21637 -6629 -6555 -6471 -35091 -26484 -4388 5428 18872 24283 15697
11221 15697 9398 29324 22235 3251 -10494 -25383 -13486 -12328 -19498 -28324 -27375 -20754 -9737
11208 -9737 -23357 -18232 -13873 807 14847 -905 -21657 -20712 -6673 -1314 -11376 -19853 -9012
11195 -9012 2348 9964 -10695 -6277 -12686 -16871 -6144 118 -9322 -15809 -12515 -3714 -10598 -15053
11181 -15053 -8248 -3165 -13301 -3479 13256 29897 20966 5119 9095 18606 16864 22911 10449
11168 10449 -82 -1581 7654 13012 17270 9747 -9484 2028 25875 19924 -3605 -27788 -32681
11155 -32681 -29888 -15660 1064 8392 -6623 -4416 25493 34068 18879 18080 2525 3471 19944
$$ packed form
11248b4157J1969P515j1803n687M577J1095J0225J102M947r162J1215K92K170
11235A4298o570j8868r400j097J5008P4Q4k8620Q607K2096R816J3444N411q586
11221A5697o299J9926p089j8984j3745j4889J1897J158p170q826R49O621J1017
11208i737j3620N125M359J4680J4040j5752k0752R45J4039N359j0062q477J0841
11195i012J1360P616k0659M418o409m185J0727O262r440o487L294Q801o884m455
11181a5053O805N083j0136R822J6735J6641q931j5847L976R511j742O047j2462
11168A0449j0531j499R235N358M258p523j9231J1512K3847n951k3529k4183m893
11155c2681K793J4228J6724P328j5015K207K9909Q575j5189p99j5555R46J6473
$$ plain form
11142 19944 16385 19960 -8194 -44901 -53967 -38185 -12868 -2435 -1214 -1818 11331 10463 -14217
11129 -14217 -33545 -8959 -3862 -13129 -20823 -28436 -46721 -26032 -16626 1263 -2032 2073 10215
11116 10215 5930 -12014 -3985 -2613 -29436 -23938 -15665 -26760 -4042 23502 35568 37514 28931
11103 28931 13702 30953 26927 35660 32042 38040 26353 29466 6904 -25641 -18197 4596 75
11090 75 3808 5556 16428 14518 15343 12823 11925 3812 1560 15172 25919 21984 11095 -7689
11076 -7689 -19514 -6964 -12435 -18211 -32027 -29373 -29987 -34892 -33463 -22308 -11771 -15473 -18259 -26758
11062 -26758 -30313 -26314 -26336 -20230 -27153 -32341 -32710 -24484 -607 10473 -4262 -15864 -4344 7601
11048 7601 7163 -7935 -2793 15745 19390 20881 20168 22661 29087 20156 14719 6374 -14896 -20985
$$ packed form
11142A9944l559L575k8154l6707r066J5782K5317J0433J221o04J3149q68k4680
11129a4217j9328K4586N097r267p694p613j8285K0689R406J7889l295M105Q142
11116A0215m285j7944Q029J372k6823N498Q273j1095K2718K7544J2066J946q583
11103B8931j5229J7251m026Q733l618N998j1687L113k2562l2545P444K2793m521
11090G5L733J748J0872j910Q25k520q98q113k252J3612J0747l935j0889j8784
11076g689j1825J2550n471n776j3816K654o14m905J429J1155J0537l702k786q499
11062b6758l555L999k2O106o923n188l69Q226K3877J1080j4735j1602J1520J1945
11048G601m38j5098N142J8538L645J491p13K493O426q931n437q345k1270o089
$$ plain form
11034 -20985 -17218 -30144 -24891 -20892 -30427 -27638 -4921 -4738 8849 30230 29832 23893 12171 -14963
11020 -14963 -20253 -12227 -9654 -7278 -18452 -27172 -16473 -7978 588 6903 -24054 -30849 -18914
11007 -18914 311 -4672 -7664 1043 8006 18327 15495 15972 10827 1152 -15133 4010 26478
10994 26478 36067 44221 31021 4662 -4029 -23400 -27533 7154 32725 30207 7392 4477 -3384
10981 -3384 1108 12569 -5912 -12205 -915 -1303 18860 17713 -444 -3851 -12713 -24506 -33560
10968 -33560 -18037 4681 22846 19557 1316 10951 4211 -18988 -13398 -6372 2465 -21885 -25162
10955 -25162 -23658 -20258 -9618 -17852 -31564 -12664 2 -1864 -17864 -16852 -13108 -7580 -13232
10942 -13232 -22396 -16239 -6935 2952 2185 -9761 -9455 -13986 2797 1705 -5035 -18317 -17605 1827
$$ packed form
11034b0985L767j2926N253L999r535K789K2717J83J3587K1381l98n939j1722k7134
11020a4963n290Q026K573K376j1174q720J0699Q495Q566O315l0957o795J1935
11007a8914J9225m983k992Q707O963J0321k832M77n145r675j6285J9143K2468
10994B6478R589Q154j3200k6359q691j9371m133L4687K5571k518k2815k915p861
10981c384M492J1461j8481o293J1290l88K0163j147j8157l407q862j1793r054
10968c3560J5523K2718J8165l289j8241R635o740k3199N590P026Q837k4350l277
10955b5162J504L400J0640q234j3712J8900J2666j866j6000J012L744N528n652
10942a3232r164O157R304R887p67j1946L06m531J6783j092o740j3282P12J9432
$$ plain form
10928 1827 16015 9932 13285 15757 2688 1057 -337 -3416 -15896 -22271 -19669 -7494 13110
10915 13110 20763 13582 -5989 -18771 -27291 -22201 -2035 -1520 -19568 -16165 -3861 -33797 -35692
10902 -35692 -16783 -12094 -13618 -13099 -26715 -17705 -13173 -33209 -41666 -16324 -15412 -7887 5194 -656
10888 -656 -11431 -28170 -22482 -16007 -20103 -27583 -14182 4276 7705 -2657 -25742 -15100 -7563
10875 -7563 -1546 -2628 -16537 -21973 -17000 -10800 7486 11430 11542 15382 1053 2047 2174 18042
10861 18042 22755 22927 21929 4439 -621 -3391 -41770 -29449 8511 13563 8553 8965 -15307 -26503
10847 -26503 -10349 -15003 -31936 -34276 -11955 16093 33011 33297 19396 25596 27795 31895 25158
10834 25158 28437 12884 -1634 -24657 -24559 22306 35653 37978 15734 -13925 -17180 -8743 4821
$$ packed form
10928A827J4188o083L353K472j3069j631j394l079j2480o375K602J2175K0604
10915A3110P653p181j9571j2782q520N090K0166N15j8048L403J2304k9936j895
10902c5692J8909M689j524N19j3616R010M532k0036q457K5342R12P525J3081n850
10888f56j0775j6739N688O475m096p480J3401J8458L429j0362k3085J0642P537
10875g563O017j082j3909n436M973O200J8286L944J12L840j4329R94J27J5868
10861A8042M713J72r98j7490n060k770l8379J2321L7960N052n010M12k4272j1196
10847b6503J6154m654j6933k340K2321K8048J6918K86j3901O200K199M100o737
10834B5158L279j5553j4518k3023R8M6865J3347K325k2244k9659l255Q437J3564
$$ plain form
10821 4821 2244 -2820 -7781 -31104 -42637 -22955 2217 4568 -580 -12584 -9280 -6722 10889
10808 10889 20578 11441 5168 3828 -13211 -16499 -1167 9378 4360 16949 11571 14711 -24968
10795 -24968 -27858 -6416 -1220 -4955 8482 -2892 -6773 -11196 -5273 -2836 6201 5922 11493 7735
10781 7735 -7530 -15822 8773 36212 27498 15762 23002 7866 -2031 4658 20764 17662 11052
10768 11052 25481 31640 6777 -12271 -14717 -13160 -23408 -37551 -26656 -14365 -6547 -1446 6596
10755 6596 8548 -6130 -25586 -14901 -3653 -5838 -15155 -21376 -13109 8541 20307 13815 18773
10742 18773 30614 27233 28010 3922 -1867 3427 12091 23066 20311 3199 10175 -3770 -7564
10729 -7564 747 14195 42081 38093 41196 28559 28898 4905 -28250 -16726 -7653 -13277 -4075
$$ packed form
10821D821k577n064m961k3323j1533J9682K5172K351n148j2004L304K558J7611
10808A0889R689r137o273j340j7039l288J5332J0545n018J2589n378L140l9679
10795b4968k890K1442N196l735J3437j1374l881m423N923K437R037k79N571l758
10781G735j5265q292K4595K7439q714j1736P240j5136r897O689J6106l102o610
10768A1052J4429O159k4863j9048k446J557j0248j4143J0895J2291P818N101Q042
10755F596J952j4678j9456J0685J1248k185r317o221Q267K1650J1766o492M958
10742A8773J1841l381P77k4088n789N294Q664J0975k755j7112O976j3945l794
10729g564Q311J3448K7886l988L103j2637L39k3993l3155J1524R073n624R202
$$ plain form
10716 -4075 -2474 1592 5786 3646 -7505 15719 15698 21420 18987 16192 2910 1888 5332 -7539
10702 -7539 -4182 8616 2808 22770 25072 13751 15183 17519 -1231 2909 11714 16492 -2521
10689 -2521 -22452 -22019 -18399 -3998 -8000 -13099 13800 27150 26108 12887 5214 5138 -25315 -58521
10675 -58521 -38471 -278 21105 30257 27311 12005 28034 25920 3440 18334 3163 -15473
10663 -15473 -29331 -29267 -37470 -35001 -33188 -52609 -36637 -7745 5869 4045 7161 12646 10859 -4851
10649 -4851 -8935 -8097 -17135 1159 -10171 -25815 -14463 -1853 9239 2088 -14470 -20173 -875
10636 -875 689 24038 32706 13588 -17306 -6155 4808 27458 47682 29291 5231 10656 9368
10623 9368 -15523 -15735 -2733 13436 5167 -2811 -7901 3398 16416 15194 17249 474 444 3789
$$ packed form
10716d075J601M066M194k140j1151K3224k1N722k433k795j3282j022L444j2871
10702g539L357J2798n808J9962K302j1321J432K336j8750M140Q805M778j9013
10689b521j9931M33L620J4401m002n099K6899J3350j042j3221p673p6l0453l3206
10675e8521K0050L8193K1383R152k946j5306J6029k114k2480J4894j5171j8636
10663a5473j3858O4q203K469J813j9421J5972K8892J3614j824L116N485j787j5710
10649d851m084Q38r038J8294j1330j5644J1352J2610J1092p151j6558n703J9298
10636h75J564K3349Q668j9118l0894J1151J0963K2650K0224j8391k4060N425j288
10623I368k4891k12J3002J6169q269p978n090J1299J3018j222K055j6775l0L345
$$ plain form
10609 3789 -8518 9028 24075 17291 14904 -1465 16550 32735 12131 -6419 -5931 -9895 -1858
10596 -1858 -4424 -2277 -3598 -14794 -30749 -19664 -8775 -11032 -9656 2185 8214 20878 25234
10583 25234 10038 -7144 -8425 -21758 -13746 -16102 -8801 -3854 19185 18094 7385 14728 30397
10570 30397 31577 35757 16397 6423 14156 35465 38478 20931 13295 1412 1550 11267 908
10557 908 12105 24040 -3615 -5884 18407 3046 -17358 -11621 -10327 -330 -11455 -12325 -6256
10544 -6256 16423 -1332 211 8983 -4139 -27986 -24197 -25287 -17066 -2314 7057 -636 -22308
10531 -22308 -40491 -40974 -31005 -12935 -12140 -9041 5681 22862 39493 49147 33028 33207 15601
10518 15601 5015 -4167 -12371 -38642 -31555 -36654 -19821 -20529 -10255 2307 22678 35365 31386
$$ packed form
10609C789j2307J7546J5047o784k387j6369J8015J6185k0604j8550M88l964Q037
10596a858k566K147j321j1196j5955J1085J0889k257J376J1841O029J2664M356
10583B5234j5196j7182j281j3333Q012k356P301M947K3039j091j0709P343J5669
10570C0397J180M180j9360r974P733K1309L013j7547p636j1883J38R717j0359
10557I08J1197J1935k7655k269K4291j5361k0404N737J294R997j1125q70O069
10544f256K2679j7755J543Q772j3122k3847L789j090Q221J4752R371p693k1672
10531b2308j8183m83R969J8070P95L099J4722J7181J6631R654j6119J79j7606
10518A5601j0586r182q204k6271P087n099J6833p08J0274J2562K0371J2687l979
$$ plain form
10505 31386 21991 17219 6779 8572 847 -4949 -6991 -8850 -21683 -26847 -6992 -6352 -24695 -10737
10491 -10737 10714 4916 -14474 -31948 -37716 -25158 -9276 -1025 11159 10270 17011 17494 12026
10478 12026 7890 -10941 -19768 -9734 -9740 -23005 -20838 -25217 -22004 -10958 -4610 -625 16361 9747
10464 9747 -41 -16029 -17845 9178 12402 -7671 -21001 -36732 -52614 -47790 -35534 -35359 -22216
10451 -22216 -18845 -20061 -15970 -20470 -16958 -20453 -33523 -51553 -39994 -23425 -6260 7246 8654
10438 8654 -1777 -12536 -2361 8449 7847 12653 13468 -4661 -27220 -24071 -23338 -32499 -28035 -11899
10424 -11899 3521 12027 28224 27619 49421 43241 30511 44268 47152 33585 18175 -2789 -3561
10411 -3561 -9185 6926 24168 22115 9288 3759 10961 20956 25957 20047 12371 4844 -5983 -17626
$$ packed form
10505C1386r395m772j0440J793p725n796k042j859j2833n164J9855O40j8343J3958
10491a0737K1451n798j9390j7474n768J2558J5882Q251J2184q89O741M83n468
10478A2026m136j8831q827J0034oj3265K167m379L213J1046O348L985J6986o614
10464I747r788j5988j816K7023L224k0073j3330j5731j5882M824J2256J75J3143
10451b2216L371j216M091m500L512l495j3070j8030J1559J6569J7165J3506J408
10438H654j0431j0759J0175J0810o02M806Q15j8129k2559L149P33r161M464J6136
10424a1899J5420Q506J6197o05K1802o180j2730J3757K884j3567j5410k0964p72
10411c561n624J6111J7242k053j2827n529P202R995N001n910p676p527j0827j1643
$$ plain form
10397 -17626 -53968 -41677 -18137 -18435 -14352 427 24082 34232 22271 14928 10340 16399 27578
10384 27578 18058 15655 21219 28697 15621 -7136 -26210 -37710 -14611 1755 9841 10508 17111
10371 17111 8954 12287 -4298 -23045 -30027 -36340 -36393 -18397 -9516 -28527 -31993 -14717 3805
10358 3805 13537 20937 25561 29682 8706 -9023 8381 9844 20272 14752 5795 17708 21601
10345 21601 20324 2311 3347 8340 -2934 454 -7148 -6160 10452 4510 -7088 -6444 -8880 -12322
10331 -12322 -22752 -8444 3876 19651 13742 -2025 -11035 -4161 14172 3998 7935 21210
10319 21210 33263 45734 31355 3618 -27399 -30855 -39538 -46005 -39937 -23613 -15786 -24863 -1851
10306 -1851 -13630 -37637 -46457 -30653 -30205 -28766 9478 15186 5211 -2808 -7799 -3355 -18460 -15256
$$ packed form
10397a7626l6342J2291K3540k98M083J4779K3655J0150j1961p343m588O059J1179
10384B7578r520k403N564P478j3076k2757j9074j1500K3099J6366Q086O67O603
10371A7111q157L333j6585j8747o982o313n3J7996Q881j9011l466J7276J8522
10358C805R732P400M624M121k0976j7729J7404J463J0428n520q957J1913L893
10345B1601j277j8013J036M993j1274L388p602R88J6612n942j1598O44k436l442
10331a2322j0430J4308J2320J5775n909j5767r010O874J8333j0174L937J3275
10319B1210J2053J2471j4379k7737l1017l456q683o467O068J6324P827r077K3012
10306a851j1779k4007q820J5804M48J439L8244N708r975q019m991M444j5105L204
$$ plain form
10292 -15256 -24444 -40550 -9072 -4557 -21211 -12292 -802 -1618 26964 23502 20266 14297 8556
10279 8556 -1188 6112 4957 -9427 -8633 -18546 -24385 -19340 -5917 -4423 1822 22419 24917 32298
10265 32298 26217 -3905 -14019 -16242 -26912 -36796 -24428 -15449 -3324 7539 3087 12143 5739
10252 5739 10790 6497 5706 18041 17116 24009 20737 15349 18349 42062 58121 35341 -12315 -39040
10238 -39040 -13906 -11382 -12321 -9724 -27420 -35744 -18967 -8666 -12510 -11566 -8363 -4808 -19025 -19590
10224 -19590 -31132 -43792 -64258 -57642 -28310 9465 16467 1969 -22439 -23015 -27249 6573 16520
10211 16520 -15560 -27811 -16906 1728 6256 -653 -25226 -14665 -14634 -2485 1927 -6872 -14084
10198 -14084 -7930 -2251 4306 -18327 -13700 -13223 -16602 -13641 -32708 -20997 -6963 8318 2472
$$ packed form
10292a5256r188j6106L1478M515j6654Q919J1490q16K8582l462l236n969n741
10279H556r744P300j155j4384P94r913n839N045J3423J494O245K0597K498P381
10265C2298o081l0122j0114k223j0670r884J2368Q979J2125J0863m452R056o404
10252E739N051m293p91J2335r25O893l272n388L000K3713J6059k2780m7656k6725
10238c9040K5134K524r39K597j7696q324J6777J0301l844R44L203L555j4217n65
10224a9590j1542j2660k0466O616K9332L7775P002j4498k4408n76m234L3822R947
10211A6520l2080j2251J0905J8634M528o909k4573J0561L1J2149M412q799p212
10198a4084O154N679O557k2633M627M77l379K961j9067J1711J4034J5281n846
$$ plain form
10185 2472 3790 14076 13017 -26563 -43004 -35547 -26308 -12412 7728 12615 7007 296 1890
10172 1890 3704 9676 1369 -11942 6973 6948 10687 3112 3984 27923 38556 41310 39297 13173
10158 13173 922 -18811 -5653 -6039 -10526 -17004 -17385 -7778 -11517 -8998 -11624 -2884 11941 11844
10144 11844 6394 14024 -830 -23359 -27537 -32360 -31756 -38128 -23154 -27507 -32777 -28844 -38211 -26054
10130 -26054 -14261 -14676 10848 35182 21959 -13115 -15889 -9362 11008 31371 17142 -3282
10118 -3282 -13854 -7605 -760 1474 -8395 -11195 3902 3925 12619 15743 11284 14086 19325 2869
10104 2869 -17417 9193 20277 9997 7665 3304 -4572 -4505 -11025 -2563 13902 24859 33795 34273
10090 34273 7774 10965 15323 -8044 -31833 -17017 13169 3620 5363 5700 -13064 -10418 -10868
$$ packed form
10185B472J318J0286j059l9580j6441P457R239J3896K0140M887n608o711J594
10172A890J814N972q307j3311J8915k5L739p575Q72K3939J0633K754k013k6124
10158A3173j2251j9733J3158l86m487o478l81R607l739K519k626Q740J4825r7
10144A1844n450P630j4854k2529m178m823O04o372J4974m353n270L933r367J2157
10130b6054J1793m15K5524K4334j3223l5074k774O527K0370K0363j4229k0424
10118c282j0572O249O845K234r869k800J5097K3Q694L124m459K802N239j6456
10104B869k0286K6610J1084j0280k332m361p876O7o520Q462J6465J0957Q936M78
10090C4273k6499L191M358k3367k3789J4816L0186r549J743L37j8764K646m50
$$ plain form
10077 -10868 -6075 -17810 -12019 -18499 -21499 -14183 -3711 -13547 -9184 17829 31382 6293 5353
10064 5353 -2403 -11111 7648 6358 13540 25706 22202 -8526 -21859 -9944 -955 -10708 -317
10051 -317 22239 11667 14764 19014 22048 -13193 -34524 -28357 -5997 -1946 -4060 11118 19794
10038 19794 23716 9734 -1379 10325 20262 19993 7388 -870 15847 25895 24722 25144 22113
10025 22113 4864 6563 -1059 -4640 -4565 -370 -3061 -12979 -9861 9481 18289 15780 13419 8195
10011 8195 9708 6587 30202 43636 12578 2715 2747 5065 -2923 -8688 -19308 -4583 15913 24827
9997 24827 13082 11526 11199 -5665 -8439 2518 3346 -17248 -8792 -12356 -18131 -6819 7085 28118
9983 28118 45380 52006 24915 3043 2149 17799 32646 30046 13082 131 -3195 11775 16259
$$ packed form
10077a0868M793j1735N791o480l000P316J0472r836M363K7013J3553k5089r40
10064E353p756q708J8759j290P182J2166l504l0728j3333J1915Q989r753J0391
10051c17K2556j0572L097M250L034l5241k1331O167K2360M051k114J5178Q676
10038A9794L922j3982j1113J1704R937k69j2605q258J6717J0048j173M22l031
10025B2113j7249J699p622l581P5M195k691r918L118J9342Q808k509k361n224
10011H195J513l121K3615J3434l1058r863L2K318p988n765j0620J4725K0496Q914
9997B4827j1745j556l27j6864k774J0957Q28k0594Q456l564n775J1312J3904K1033
9983B8118J7262O626k7091k1872q94J5650J4847k600j6964j2951l326J4970M484
$$ plain form
9970 16259 21188 26713 30602 14255 5862 7769 -12314 -5529 15495 17691 4416 -7662 -5905
9957 -5905 -10434 -15820 -7163 14315 39646 40072 13813 -5932 -5490 1186 18607 33387 10449 10138
9943 10138 1148 1580 17014 16542 -8668 -8026 -8210 -2981 -4534 -3541 -3385 13508 1773 -10479 -15176
9928 -15176 -14531 -7734 -7279 -5323 5127 -7563 -22948 -18255 -16141 -534 22364 38985 25503
9915 25503 16119 17051 11761 9174 1979 -5915 1183 9333 -3270 -18361 -12653 7001 4215 -13912
9901 -13912 -6867 -10897 -4191 -111 -3173 -4480 -8452 -6070 -3212 604 -3707 5856 15298 16846 9866
9886 9866 -3091 -8607 -9665 -3429 412 2115 1408 11966 9366 -4632 10530 -8121 -28448 -4845
9872 -4845 -5522 -10549 -17319 -23028 -26157 -5092 -8520 -20699 -24832 -17329 -16262 -13309 -18007 -9533 -1020
$$ packed form
9970A6259M929N525L889j6347q393J907k0083O785K1024K196j3275j2078J757
9957e905m529n386Q657K1478K5331M26k6259j9745M42O676J7421J4780k2938l11
9943A0138q990M32J5434m72k5210O42j84N229j553R93J56J6893j1735j2252m697
9928a5176O45O797M55J956J0450j2690j5385M693K114J5607K2898J6621j3482
9915B5503r384R32n290k587p195p894P098Q150j2603j5091N708J9654k786j8127
9901a3912P045m030O706M080l062j307l972K382K858L816m311R563R442J548o980
9886I866j2957n516j058O236L841J703p07J0558k600j3998J5162j8651k0327K3603
9872d845o77n027o770n709l129K1065l428j2179m133P503J067K953m698Q474Q513
$$ plain form
9857 -1020 6047 15700 13233 4 -686 12804 13151 15470 38800 42797 22358 6069 11115 15988
9843 15988 -2221 -25097 -34955 -12187 -22778 -30739 -33239 -31871 -3729 9441 2728 9800 -2188
9830 -2188 -1879 -4921 -10278 -6472 -4434 -23930 -19318 5059 4538 -2652 5581 4934 18224 30987 34124
9815 34124 38638 24791 -311 -10387 -9907 -22308 -31852 -31926 -15368 8021 2489 5284 -15547 -25216
9801 -25216 -19447 -6541 15771 20841 9104 16350 5187 -7369 -35690 -45520 -42795 -41004 -58664
9788 -58664 -54949 -35250 -20156 -2731 4693 -5168 -3339 -15232 -3578 19431 15755 2972 -16915
9775 -16915 -48844 -40146 -13516 8707 8395 -8626 -5622 7196 27270 32114 32173 8287 8469 -3365
9761 -3365 -6853 4429 10785 -455 5558 10512 -2190 -21843 -14212 7582 3837 -14860 -21367
$$ packed form
9857a020P067R653k467j3229o90J3490L47K319K3330L997k0439j6289N046M873
9843A5988j8209k2876r858K2768j0591p961k500J368K8142J3170o713P072j1988
9830b188L09l042n357L806K038j9496M612K4377n21p190Q233o47J3290J2763L137
9815C4124M514j3847k5102j0076M80j2401r544p4J6558K3389n532K795k0831r669
9801b5216N769J2906K2312N070j1737P246j1163j2556k8321r830K725J791j7660
9788e8664L715J9699J5094J7425P424r861J829j1893J1654K3009l676j2783j9887
9775a6915l1929Q698K6630K2223l12j7021L004J2818K0074M844N9k3886J82j1834
9761c365l488J1282O356j1240O013M954j2702j9653P631K1794l745j8697o507
$$ plain form
9748 -21367 3084 8872 15836 21430 38715 43659 44859 35996 14261 7856 -4770 -8396 5407
9735 5407 10353 1561 -5743 507 -10724 -22657 -36494 -10940 8352 26453 28808 14821 -73
9722 -73 4786 5493 -5952 4104 11859 4664 -8111 -7098 -11357 -26741 -22889 -1564 -2781 -7521
9708 -7521 -13984 -29643 -13358 6853 14131 847 -23245 -7623 -12145 -28115 -23111 -29241 -31038
9695 -31038 -29968 -17307 7449 39127 43544 24189 7543 -8842 -11130 -15829 2914 31709 47530
9682 47530 28549 -13301 -10416 4342 15669 22914 23722 8190 -82 4695 12643 20208 15134 7732
9668 7732 2557 1114 16108 19547 22122 46940 38652 14618 -808 -19050 -13849 89 -11020
9655 -11020 -14800 2255 23300 43396 45505 50671 69745 54475 11804 18333 31551 18711 11724
$$ packed form
9748b1367K4451N788O964N594J7285M944J200q863k1735o405j2626l626J3803
9735E407M946q792p304O250j1231j1933j3837K5554J9292J8101K355j3987j4894
9722g3M859P07j1445J0056P755p195j2775J013m259j5384L852K1325j217m740
9708g521o463j5659J6285K0211P278j3284k4092J5622m522j5970N004o130j797
9695c1038J070J2661K4756L1678M417j9355j6646j6385k288m699J8743K8795J5821
9682D7530j8981m1850K885J4758J1327P245Q08j5532q272M777P948P565n074p402
9668G732n175j443J4994L439K575K4818q288k4034j5426j8242N201J3938j1109
9655a1020l780J7055K1045K0096K109N166J9074j5270m2671O529J3218j2840o987
$$ plain form
9642 11724 8269 -7791 -9354 -1443 16465 9800 -5512 -32513 -37581 -30975 -18162 -9320 8321
9629 8321 28536 23752 21240 16910 -4910 6930 -1076 -15298 -18022 -7609 -9066 -15958 -13282 -9189
9615 -9189 -14827 -10708 -10685 -7717 -9310 -8803 -14303 -42212 -41224 -23092 -17517 -12984 -25648 -17351 -9131
9600 -9131 12182 9393 10016 4331 -6876 -8217 -6396 -5249 -15462 -27204 -19449 -20394 -24159 -10408
9586 -10408 -5902 11792 190 5289 -9414 -11339 -10110 -8672 -69 -2767 20524 12952 -1326
9573 -1326 7896 -5579 -2596 22664 25415 13597 1714 7236 -10669 -22196 -11532 -7813 7811
9560 7811 -2851 -1759 -468 29656 21506 19769 29781 13249 -181 5930 -7303 1152 25871
9547 25871 31851 38681 17266 25078 14283 -5322 -17977 2736 11899 -2193 2544 40 -20174
$$ packed form
9642A1724l455j6060j563P911J7908o665j5312k7001n068O606J2813Q842J7641
9629H321K0215m784k512m330k1820J1840q006j4222k724J0413j457o892K676M093
9615i189n638M119K3K968j593N07n500k7909R88J8132N575M533j2664Q297Q220
9600i131K1313k789O23n685j1207j341J821J147j0213j1742P755r45l765J3751
9586a0408M506J7694j1602N099j4703j925J229J438Q603k698K3291p572j4278
9573a326R222j3475K983K5260K751j1818j1883N522j7905j1527J0664L719J5624
9560G811j0662J092J291L0124q150j737J0012j6532j3430O111j3233Q455K4719
9547B5871N980O830k1415P812j0795j9605j2655K0713R163j4092M737k504k0214
$$ plain form
9534 -20174 -16488 -1591 7020 -4880 -14851 -15698 -19008 -7088 2284 24706 34599 37772 40500 51614
9520 51614 45684 17609 -4958 -20631 -36227 -27614 -20246 -25750 -21504 -14713 -31513 -22393 -7654
9507 -7654 -2554 -12148 -1657 -3531 -22008 -14643 -4165 -5148 3265 5265 -7080 -26840 -12873 -5013
9493 -5013 -5537 6883 -1093 2490 24045 36720 27501 11816 8495 982 -35742 -14888 9231
9480 9231 -786 14376 31101 33371 13332 2043 -15752 -22555 -9949 -25200 -30952 -31112 -12162
9467 -12162 -39527 -32826 -13451 5199 17348 14415 17288 13289 -9593 -21514 -5943 21286 16864
9454 16864 -1625 -13955 -23385 -30930 -37091 -23562 -8756 -13193 -22726 -42687 -17543 -10136 -7596
9441 -7596 -12205 -16818 6455 -5417 -25254 -11579 16550 18745 28107 38275 55589 75049 54494
$$ packed form
9534b0174L686J4897Q611j1900r971q47l310J1920R372K2422R893L173K728J1114
9520E1614n930k8075k2567j5673j5596Q613P368n504M246O791j6800R120J4739
9507g654N100r594J0491j874j8477P365J0478r83Q413K000j2345j9760J3967P860
9493e013n24J2420p976L583K1555J2675r219j5685l321p513l6724K0854K4119
9480I231j0017J5162J6725K270k0039j1289j7795o803J2606j5251n752j60J8950
9467a2162k7365O701J9375J8650J2149k933K873l999k2882j1921J5571K7229m422
9454A6864j8489j2330r430p545o161J3529J4806m437r533j9961K5144P407K540
9441g596m609m613K3273j1872j9837J3675K8129K195R362J0168J7314J9460k0555
$$ plain form
9428 54494 30173 22561 -495 -28228 -26289 -27311 -16220 -1721 -7484 -16089 4170 11278 6036
9415 6036 4178 -3241 -675 10261 -11676 -28928 -21640 -6781 12256 -11610 -23944 -14635 -26025
9402 -26025 839 28492 40367 47061 50549 49751 40005 23626 3356 5350 26821 35988 38671
9389 38671 33533 29578 15008 11319 1053 -5716 -4701 13169 35205 21460 16027 8762 10800
9376 10800 15750 17385 20400 35555 39469 13576 5869 -24541 -41462 -19501 990 1762 15686
9363 15686 7031 321 3951 -1962 -10693 -5296 16725 29589 29658 31063 15837 17771 18211 10407 -1274
9348 -1274 -10936 -11165 -9362 -11835 -18249 -25556 -20537 -11147 13077 -39 -20590 -2585 4823 35045
9334 35045 54128 47455 32909 31400 29442 43912 49413 9069 -5618 -9332 13784 41839 39769
$$ packed form
9428E4494k4321p612k3056k7733J939j022J1091J4499n763q605K0259P108n242
9415F036j858p419K566J0936k1937j7252P288J4859J9037k3866j2334R309j1390
9402b6025K6864K7653J1875O694L488p98r746j6379k0270J994K1471R167K683
9389C8671n138l955j4570l689j0266o769J015J7870K2036j3745n433p265K038
9376A0800M950J635L015J5155L914k5893p707l0410j6921K1961K0491P72J3924
9363A5686q655o710L630n913q731N397K2021J2864O9J405j5226J934M40p804j1681
9348a274r662k29J803k473o414p307N019R390K4224j3116k0551J8005P408L0222
9334C5045J9083o673j4546j509j958J4470N501m0344j4687l714K3116K8055k070
$$ plain form
9321 39769 19145 -12321 16330 25021 11885 -1320 -13967 -5923 2379 -21285 -21132 -16874 -8652
9308 -8652 -5787 -2044 17602 21024 14612 8172 16096 18025 16908 20206 18374 12955 13964 11300 8706
9293 8706 19014 26555 18564 22045 38562 52875 26322 14071 16927 16041 13252 6460 -25602 -18131
9279 -18131 6261 15047 13174 13002 32013 15392 12670 16647 24278 22442 29180 23810 1958 -2090
9265 -2090 10630 7260 1862 -7734 6897 10254 20333 39090 69115 68377 34689 -878 23238
9252 23238 50896 53266 51260 43065 30183 19266 20116 12670 18149 523 7220 19542 31441
9239 31441 54795 65402 56788 26994 25558 38625 50075 54712 29410 43966 62485 59568 33591
9226 33591 35780 56398 54070 67604 75231 88683 80175 44415 39627 59368 42624 25654 31732
$$ packed form
9321C9769k0624l1466K8651Q691j3136j3205j2647Q044Q302k3664J53M258Q222
9308h652K865L743J9646L422o412o440P924J929j117L298j832n419J009k664k594
9293H706J0308P541p991L481J6517J4313k6553j2251K856q86k789o792l2062P471
9279a8131K4392Q786j873j72J9011j6621k722L977P631j836O738n370k1852m048
9265b090J2720l370n398r596J4631L357J0079J8757L0025p38l3688l5567K4116
9252B3238K7658K370k006q195j2882j0917Q50p446N479j7626O697J2322J1899
9239C1441K3354J0607q614k9794j436J3067J1450M637k5302J4556J8519k917k5977
9226C3591K189K0618k328J3534P627J3452q508l5760m788J9741j6744j6970O078
$$ plain form
9213 31732 35756 32297 46493 65368 90791 95534 83928 68693 74354 88401 89928 93650 110689
9200 110689 130503 127919 105206 97500 122860 128774 104651 94774 85232 102052 112574 93337 92536
9187 92536 115105 119674 110952 125118 128683 125157 138144 149927 165919 167466 169842 172448 179410
9174 179410 195006 222151 257843 264684 276909 315249 347101 354152 363932 438102 500960 552126
9162 552126 633571 737211 841756 957987 1132837 1349645 1629442 1983127 2495169 3250439
9152 3250439 4325589 5968971 8509411 12248623 17009093 21360257 23473727 23264953
9144 23264953 20560376 15443223 10912102 8027582 6236684 5084759 4314297 3782003
9136 3782003 3384394 3075100 2794603 2547949 2328946 2180995 2036151 1933833 1819587 1686529
$$ packed form
9213C1732M024l459J4196J8875K5423M743j1606j5235N661J4047J527L722J7039
9200A10689J9814k584k2713p706K5360N914k4123r877r542J6820J0522j9237q01
9187I2536K2569M569q722J4166L565l526J2987J1783J5992J547K376K606O962
9174A79410J5596K7145L5692O841J2225L8340L1852P051R780P4170O2858N1166
9162E52126Q1445J03640J04545J16231J74850K16808K79797L53685N12042P55270
9152C250439J075150J643382K540440L739212M760470M351164K113470k08774
9144B3264953k704577n117153m531121k884520j790898j151925p70462n32294
9136C782003l97609l09294k80497k46654k19003j47951j44844j02318j14246j33058
$$ plain form
9126 1686529 1549629 1439883 1332884 1253214 1159422 1090077 1040959 989182 924998 860612 833074
9115 833074 801324 759443 736255 718108 689592 636209 609482 570639 526892 509296 498115 473657
9103 473657 461161 451871 420102 402020 390239 391242 362950 338392 341243 324460 297698 278850
9091 278850 269977 267220 275054 271961 287228 274167 246942 236077 214971 201972 193045 193797 186936
9078 186936 196474 200554 201582 205683 210753 209446 203644 196809 230334 245903 251725 242154 217516 216988
9064 216988 189076 189950 180859 163478 150068 149187 147992 147177 141872 119553 111394 109026 95821 77602
9050 77602 71309 60626 37388 37447 31182 31828 43104 47554 34931 26049 30873 34707 46616 41695
9036 41695 46735 48761 41479 44845 20036 12903 14223 25085 34201 43697 51055 27856 982 -15454
$$ packed form
9126A686529j36900j09746j06999p9670r3792o9345m9118n1777o4184o4386k7538
9115H33074l1750m1881k3188j8147k8516n3383k6727l8843m3747j7596j1181k4458
9103D73657j2496r290l1769j8082j1781J003k8292k4558K851j6783k6762j8848
9091B78850q873k757P834l093J5267j3061k7225j0865k1106j2999q927P52o861
9078A86936R538M080J028M101N070j307n802o835L3525J5569N822r571k4638n28
9064B16988k7912Q74r091j7381j3410q81j195q15n305k2319q159k368j3205j8219
9050G7602o293j0683k3238N9o265O46J1276M450j2623q882M824L834J1909m921
9036D1695N040K026p282L366k4809p133J320J0862R116R496P358k3199k6874j6436
$$ plain form
9022 -15454 712 26487 42596 42311 47843 44394 30450 34009 25026 27747 23247 6594 6023 23026
9008 23026 30416 11962 -2320 7725 30749 27619 28488 38038 29694 51888 66706 41463 46521
8995 46521 55270 45543 19073 14626 -7874 -17932 -2017 6063 1411 16193 16223 30477 28561 21803
8981 21803 5131 -24287 -24494 -15376 -7006 2693 -10050 3018 21937 21841 6398 600 7467 -242
8967 -242 8115 3023 -13132 -6031 -2533 -9742 -8455 -9655 -11799 7376 22392 21611 26288 20226 1835
8952 1835 -24091 -1383 25680 25870 22013 19873 -12215 -31486 -38010 -37715 -32432 -17720 6228 27314
8938 27314 24598 29438 17832 5449 15242 132 -5859 -7372 -4304 20158 23858 23043 27944 18039
8924 18039 19420 5542 -10745 -7224 -605 40 14936 -1621 -10014 207 -18582 -25222 -9662
$$ packed form
9022a5454J6166K5775J6109k85N532l449j3944L559q983K721m500j6653n71J7003
9008B3026P390j8454j4282J0045K3024l130Q69R550q344K2194J4818k5243N058
8995D6521Q749r727k6470m447k2500j0058J5915Q080m652J4782L0J4254j916o758
8981B1803j6672k9418k07R118Q370R699j2743J3068J8919r6j5443n798O867p709
8967b42Q357n092j6155P101L498p209J287j200k144J9175J5016p81M677o062j8391
8952A835k5926K2708K7063J90l857k140l2088j9271o524K95N283J4712K3948K1086
8938B7314k716M840j1606j2383R793j5110n991j513L068K4462L700q15M901r905
8924A8039J381j3878j6287L521O619O45J4896j6557q393J0221j8789o640J5560
$$ plain form
8911 -9662 -13186 -28301 -34151 -24748 -5614 11722 38040 32374 -11805 -9387 9849 -1368 -20623
8898 -20623 -14851 -4794 15411 20124 2173 1601 -2424 9572 11696 10606 7839 9235 18986 12553
8884 12553 4604 -2536 -9438 -7392 2632 -3523 -8960 4422 5354 17069 39122 45193 26658 11183
8870 11183 -4519 -23962 -23750 -6709 -13218 -11270 -705 -5571 -8424 -15425 -22718 -26021 -8070 4010
8856 4010 15852 14350 15306 9405 -3109 -11715 6061 34932 42672 22723 8499 18411 30788
8843 30788 15574 9026 12995 10319 13563 -3845 4893 29465 35951 5537 -6309 4848 3282
8830 3282 -1337 -676 -12271 3279 24335 29692 15349 19231 -1949 -9976 6124 10028 12763 8069
8816 8069 1591 -10815 -18876 2318 8823 -8303 11814 28514 7393 11708 36136 40756 36972
$$ packed form
8911i662l524j5115n850R403J9134J7336K6318n666m4179K418J9236j1217j9255
8898b0623N772J0057K0205M713j7951n72m025J1996K124j090k767J396R751o433
8884A2553p949p140o902K046J0024o155n437J3382R32J1715K2053O071j8535j5475
8870A1183j5702j9443K12J7041o509J948J0565m866k853p001p293l303J7951J2080
8856D010J1842j502R56n901j2514q606J7776K8871P740j9949j4224R912J2377
8843C0788j5214o548L969k676L244j7408Q738K4572O486l0414j1846J1157j566
8830C282m619O61j1595J5550K1056N357j4343L882k1180q027J6100L904K735m694
8816H069o478j2406q061K1194O505j7126K0117J6700k1121M315K4428M620l784
$$ plain form
8803 36972 30855 1056 6026 25269 17928 22558 21424 30523 28120 9851 8141 -4220 -19038
8790 -19038 -10808 -2204 19584 15123 6619 28452 16260 -6090 -4972 -4731 -6750 -6437 13767 21109
8776 21109 6921 -30300 -17441 29976 32733 4385 -1651 16239 14909 6339 -6090 -17813 -4885
8763 -4885 3601 5719 -2603 826 15482 10637 -3006 8842 34184 19059 4175 -2021 -11161
8750 -11161 -3569 -4845 -10821 -10439 -5862 -570 4727 18552 22361 16672 -3750 -8150 -7569 -19348
8736 -19348 -21057 -7754 18920 30424 26732 29246 29628 22084 6678 -4859 12966 29372 15104
8723 15104 7446 -1034 -7859 -21771 -20685 -16037 -3249 -5579 -13422 -4806 3317 35261 56551 61727
8709 61727 39439 42317 43518 31184 10579 -750 -21698 -34009 -20992 5494 -6133 -8325
$$ packed form
8803C6972o117k9799M970J9243p341M630j134R099k403j8269j710j2361j4818
8790a9038Q230Q604K1788m461q504K1833j2192k2350J118K41k019L13K0204P342
8776B1109j4188l7221J2859M7417K757k8348o036J7890j330q570j2429j1723J2928
8763d885Q486K118q322L429J4656m845j3643J1848K5342j5125j4884o196r140
8750a1161P592j276n976L82M577N292N297J3825L809n689k0422m400N81j1779
8736a9348j709J3303K6674J1504l692K514L82p544j5406j1537J7825J6406j4268
8723A5104p658q480o825j3912J086M648J2788k330p843Q616Q123L1944K1290N176
8709F1727k2288K878J201j2334k0605j1329k0948j2311J3017K6486j1627k192
$$ plain form
8697 -8325 5608 10533 11950 25749 14853 -17471 -16798 -24440 -11643 -23870 -24976 -1467 6101
8684 6101 -1240 295 15621 14937 22312 18907 2206 7298 6959 7595 2326 -3660 9964 25827 33915
8669 33915 34552 -15317 -32872 -14754 -17595 -24097 -42622 -32774 -8815 -13158 -14166 -12684 -6575 -1162
8655 -1162 -1393 -7145 9191 -4297 -6288 1442 -4900 -8906 18399 16815 4851 -1311 -19226 -12912
8641 -12912 -17003 1871 30036 36122 37420 22900 21716 24448 43385 63631 61420 50456 24830
8628 24830 24857 21595 13597 14720 13717 28203 35930 12973 1604 1630 18180 36053 33030 42390
8614 42390 62874 45534 40197 26221 12817 -7690 -27810 -35457 -29305 -10792 3154 15507
8602 15507 4259 -4627 -14710 -11388 9507 14513 26110 25631 39737 41612 59198 85627 85906
$$ packed form
8697h325J3933M925J417J3799j0896l2324O73p642J2797j2227j106K3509P568
8684F101p341J535J5326o84P375l405j6701N092l39O36n269n986J3624J5863Q088
8669C3915O37m9869j7555J8118k841o502j8525R848K3959m343j008J482O109N413
8655a162k31n752J6336j3488j991P730o342m006K7305j584j1964o162j7915O314
8641a2912m091J8874K8165O086J298j4520j184K732J8937K0246k211j0964k5626
8628B4830K7l262p998J123j003J4486P727k2957j1369K6J6550J7873l023R360
8614D2390K0484j7340n337j3976j3404k0507k0120p647O152J8513J3946J2353
8602A5507j1248q886j0083L322K0895N006J1597m79J4106J875J7586K6429K79
$$ plain form
8589 85906 72936 65313 71525 66653 63134 55725 77960 95815 82127 71413 49063 51356 60567
8576 60567 56991 41068 49791 48701 12273 -2250 -21839 -26953 -22671 -773 7245 11492 4081
8563 4081 23474 35364 29646 26845 18796 7726 23510 27972 24095 4726 6240 21923 34198
8550 34198 28840 23009 11883 11793 17643 13642 3878 -4302 -3476 -2080 -8390 -14056 -18237 -23826 -99
8535 -99 12314 23270 2932 -43551 -34656 10957 30078 35971 28853 10991 17797 30174 40492
8522 40492 45900 19407 -4469 -10927 1383 -622 -2690 14739 28998 18211 14020 11167 4340
8509 4340 10594 11371 3967 16566 15264 -1687 9676 22194 16320 -6130 -17104 -780 4563
8496 4563 -5113 -10702 -17664 -42381 -32751 -13865 1758 25718 39322 24625 4751 11460 -8112
$$ packed form
8589H5906j2970p623O212m872l519p409K2235J7855j3688j0714k2350K293R211
8576F0567l576j5923Q723j090l6428j4523j9589n114M282K1898Q018M247p411
8563D081J9393J1890n718k801q049j1070J5784M462l877j9369J514J5683J2275
8550C4198n358n831j1126r0N850m001r764q180Q26J396o310n666m181n589K3727
8535i9J2413J0956k0338m6483Q895M5613J9121N893p118j7862O806J2377J0318
8522D0492N408k6493k3876o458J2310k005k068J7429J4259j0787m191k853o827
8509D340O254P77p404J2599j302j6951J1363J2518n874k2450j0974J6324N343
8496D563r676n589o962k4717R630J8886J5623K3960J3604j4697j9874O709j9572
$$ plain form
8483 -8112 -3323 -1914 -21295 -28708 -6946 7295 12980 -11806 -10836 -10452 90 27514 36077 27052
8469 27052 36109 20027 20266 27191 19364 -959 -23222 -29759 -34198 -23289 -14265 10675 14035 -805
8455 -805 -24469 -28357 3411 6150 -11839 -7431 19099 18394 18795 42549 48616 30274 30265 46966 56472
8440 56472 51008 26796 9247 -16287 -32124 -56387 -46801 -26442 -21572 -48114 -58099 -48804 -26626
8427 -26626 578 6333 -391 -365 -26922 -19915 12032 27650 12103 2023 -10452 -25451 -15315
8414 -15315 -22826 -29785 -25064 -3298 -3666 -11585 8776 10694 -3046 -7058 -13162 -16438 -29011 -2591
8400 -2591 -9047 -29945 -15905 -3787 10802 941 -5128 -4148 4336 4656 19104 30551 29365 30751
8386 30751 31218 33771 36518 35507 34470 21759 1399 7966 6860 -8109 12915 23653 15075 13502
$$ packed form
8483h112M789J409j9381p413K1762J4241N685k4786R70L84J0542K7424Q563r025
8469B7052R057j6082K39O925p827k0323k2263o537m439J0909R024K4940L360j4840
8455h05k3664l888L1768K739j7989M408K6530p05M01K3754O067j8342rJ6701R506
8440E6472n464k4212j7549k5534j5837k4263R586K0359M870k6542r985R295K2178
8427b6626K7204N755o724K6k6557P007L1947J5618j5547j0080j2475j4999J0136
8414a5315p511o959M721K1766l68p919K0361J918j3740m012o104l276j2573K6420
8400b591o456k0898J4040J2118J4589r861o069R80Q484L20J4448J1447j186J386
8386C0751M67K553K747j011j037j2711k0360O567j106j4969K1024J0738q578j573
$$ plain form
8372 13502 12538 5613 -1891 8233 21093 6427 -3817 2619 17025 130 1477 24710 28181
8359 28181 19431 18227 26052 10210 17717 6706 -11557 2908 26599 41614 21726 13231 17463
8346 17463 13380 18843 3281 263 1972 -12608 -7839 -1704 17370 13465 3373 13839 11286
8333 11286 6517 17624 21409 8985 -8872 -14791 -13355 -7772 -8824 -6348 4670 20715 18313
8320 18313 17247 18275 28102 23673 21221 21205 -7349 2965 10997 -9665 2735 4662 4186 420
8306 420 -11170 -17947 -36784 -47356 -36805 -33775 -19437 -11577 -10169 -18121 -13963 -2583 23430
8293 23430 30207 19164 21110 6267 848 7941 19886 2096 -22416 -10213 -12518 -15857 2842
8280 2842 20604 23430 15344 9864 1266 -4153 -10197 -15377 -11362 6273 12941 -4436 -1119 -2312
$$ packed form
8372A3502r64o925p504J0124J2860j4666j0244O436J4406j6895J347K3233L471
8359B8181q750j204P825j5842P507j1011j8263J4465K3691J5015j9888q495M232
8346A7463m083N463j5562l018J709j4580M769O135J9074l905j0092J0466k553
8333A1286m769J1107L785j2424j7857n919J436N583j052K476J1018J6045k402
8320A8313j066J028R827m429k452j6k8554J0314Q032k0662J2400J927m76l766
8306D20j1590o777j8837j0572J0551L030J4338P860J408p952M158J1380K6013
8293B3430O777j1043J946j4843n419P093J1945j7790k4512J2203k305l339J8699
8280B842J7762K826q086n480q598n419o044n180M015J7635O668j7377L317j193
$$ plain form
8266 -2312 -13077 -37276 -20886 -8922 -7895 16700 19883 10648 21391 4472 -1192 3512 -7061
8253 -7061 -20518 -3715 12963 2102 -12861 -22132 -25918 -15250 -6040 -2096 -11705 -13827 -4960
8240 -4960 6811 -9824 -20719 -25064 -38015 -44199 -21307 -4980 -16752 -10457 -20141 -33791 -30429
8227 -30429 -18465 -2668 15818 37479 25282 25260 33396 19210 -6315 -30807 -35094 -1182 8426
8214 8426 23276 42012 47606 29763 10117 30974 27388 32107 23289 26160 39221 34175 29342
8201 29342 6872 13213 27221 6102 1206 10867 17222 34670 26969 949 -14412 -11244 -23757
8188 -23757 -20174 2182 8401 10882 22511 16855 -1623 -5511 2794 9603 4100 -2336 -4645 -9849
8174 -9849 -8080 1892 10747 -1161 -6801 -4890 1570 -918 -250 23718 23582 5042 -11453 -11592 -7846
$$ packed form
8266b312j0765k4199J6390J1964J027K4595L183r235J0743j6919n664M704j0573
8253g061j3457J6803J6678j0861j4963r271l786J0668R210L944r609k122Q867
8240d960J1771j6635j0895m345j2951o184K2892J6327j1772O295r684j3650L362
8227c0429J1964J5797J8486K1661j2197k2Q136j4186k5525k4492m287L3912R608
8214H426J4850J8736N594j7843j9646K0857l586M719q818K871J3061n046m833
8201B9342k2470O341J4008k1119m896R661O355J7448p701k6020j5361L168j2513
8188b3757L583K2356O219K481J1629n656j8478l888Q305O809n503o436k309n204
8174i849J769R972Q855j1908n640J911O460k488O68K3968j36j8540j6495j39L746
$$ plain form
8159 -7846 -10332 -4735 -14723 -12867 -33171 -29540 -15647 -18993 -11752 6747 18206 13921 -4540 1127
8145 1127 -9854 -13849 -12767 18278 25797 17295 2914 1275 -1244 -9078 -398 24067 10767 -13993
8131 -13993 -12782 -4094 -9873 -18287 -31681 -31277 -3653 19831 19068 1440 -16716 -18021 -22688 -9361
8117 -9361 20884 8533 -138 6680 2999 6814 -15504 -21090 -16977 -932 -27357 -46842 -45866 -39265
8103 -39265 -24757 -8211 -15537 -9637 10530 20509 32426 34598 29068 40937 31845 11936 13391
8090 13391 14060 -992 6888 -5817 -18652 -2085 2320 -958 -12395 -27311 -29088 -8207 26549
8077 26549 26342 23627 13550 -2180 15291 28941 20800 -3652 -3920 14156 12408 2270 1182
8064 1182 4640 24793 12434 -5251 5461 22662 10253 7807 21824 41273 12551 -11661
$$ packed form
8159g846k486N597r988J856k0304L631J3893l346P241J8499J1459m285j8461N667
8145A127j0981l995J082L1045P519q502j4381j639k519p834Q680K4465j3300k4760
8131a3993J211Q688n779q414j3394M04K7624K3484p63j7628j8156j305m667J3327
8117i361L0245j2351q671O818l681L815k2318n586M113J6045k6425j9485R76O601
8103c9265J4508J6546p326N900K0167R979J1917K172n530J1869r092j9909J455
8090A3391O69j5052P880j2705j2835J6567M405l278j1437j4916j777K0881L4756
8077B6549k07k715j0077j5730J7471J3650q141k4452k68J8076j748j0138j088
8064A182L458K0153j2359j7685J0712J7201j2409k446J4017J9449k8722k4212
$$ plain form
8052 -11661 -27235 -23184 -26263 -19773 4481 34787 19264 -10189 -25436 17261 16764 17596 15335
8039 15335 21021 23397 20017 32918 33192 40956 33834 16006 5651 10094 9491 30406 47592 60218
8025 60218 36414 -2736 -11726 -8837 185 -16366 -22625 -18336 -29138 -32258 -41362 -51290 -56735 -51351
8011 -51351 -50748 -39134 -14732 -4723 5283 8733 3747 -3074 7265 15807 40317 55095 55176 27581
7997 27581 19563 32162 62684 58186 38658 30769 30691 36147 32336 4493 -17797 -17286 -10225 -10900
7983 -10900 12691 4335 -10150 -13865 -16895 -9553 -12184 7547 16702 18185 15260 6349 4466 17203
7969 17203 26569 26335 19307 26655 50006 45537 56754 65651 60564 33308 30608 23873 -963 -5487
7955 -5487 10268 15822 17060 10120 -2064 -925 3319 14232 31548 37715 40360 35794 40815 45339
$$ packed form
8052a1661j5574M051l079O490K4254L0306j5523k9453j5247M2697m97Q32k261
8039A5335N686K376l380J2901K74P764p122j7828j0355M443o03K0915J7186J2626
8025F0218k3804l9150q990K889R022j6551o259M289j0802l120r104r928n445N384
8011e1351O03J1614K4402J0009J0006L450m986o821J0339Q542K4510J4778Q1k7595
7997B7581q018J2599L0522m498j9528p889p8N456l811k7843k2290N11P061o75
7983a0900K3591q356j4485l715l030P342k631J9731R155J483k925q911j883J2737
7969A7203R366k34p028P348K3351m469J1217Q897n087k7256k700o735k4836m524
7955e487J5755N554J238o940j2184J139M244J0913J7316O167K645m566N021M524
$$ plain form
7941 45339 45225 20193 -13480 -9723 -16836 -27916 -16318 24628 38926 34875 29394 24048 30863
7928 30863 33065 30150 43763 61108 62503 55305 49515 46769 60413 69617 58417 36537 51868
7915 51868 53915 43581 41395 37541 24277 18589 22130 14433 28390 37958 44638 35778 31752 51942
7901 51942 21584 -9360 -19161 -14955 994 -2412 -7705 1183 13594 19996 12351 10020 31354
7888 31354 18569 13425 19376 44416 61069 42793 19151 -7362 -8267 559 23545 5319 -15039
7875 -15039 -22352 -18936 -10539 -3241 5256 1363 9633 22206 28334 18423 38711 45934 35705 16538
7861 16538 -12057 -3096 13596 19830 15490 4662 -358 5702 1318 -3674 -11502 -12674 -9528 -21629
7847 -21629 -19959 -7593 4165 13642 13305 16143 11576 3957 19280 8558 107 14177 36652
$$ packed form
7941D5339j14k5032l3673L757p113j1080J1598M0946J4298m051n481n346O815
7928C0863K202k915J3613J7345J395p198n790k746J3644R204j1200k1880J5331
7915E1868K047j0334k186l854j3264n688L541p697J3957R568O680q860m026K0190
7901E1942l0358l0944r801M206J5949l406n293Q888J2411O402p645k331K1334
7888C1354j2785n144N951K5040J6653j8276k3642k6513r05Q826K2986j8226k0358
7875a5039p313L416Q397P298Q497l893Q270J2573O128r911K0288P223j0229j9167
7861A6538k8595Q961J6692O234m340j0828n020O060m384m992p828j172L146j2101
7847b1629J670J2366J1758R477l37K838m567p619J5323j0722q451J4070K2475
$$ plain form
7834 36652 43712 44952 44607 27334 1009 2547 32605 33619 26477 26082 17267 28480 38340 33262
7820 33262 19173 8326 -16808 -34485 -40882 -55792 -50972 -42430 -32789 -22844 -10226 6685 -978
7807 -978 -3103 -4321 -9509 -11814 3188 4039 3408 6143 -490 20477 43941 32595 7784 -2979
7793 -2979 -14379 -24129 -4939 2890 226 -1652 -31939 -32098 -27418 -23511 -25187 -16523 123 8416
7779 8416 10831 27241 25364 15372 2778 -13414 -23871 -21370 -38090 -44970 -30818 -41956 -17857
7766 -17857 -15193 -8760 16993 12957 -13655 -28640 -13247 -7772 -10585 -7644 -8541 -20362 -13460 -17238
7752 -17238 -50394 -52769 -34539 -35264 -10839 10837 10526 15557 31971 18714 517 6061 11803
7739 11803 -5054 -18582 -5102 -1287 -6269 -7307 -18455 -19255 -14227 -14081 -11740 -4949 3798 2296
$$ packed form
7834C6652P060J240l45j7273k6325J538L0058J014p142l95q815J1213R860n078
7820C3262j4089j0847k5134j7677o397j4910M820Q542R641R945J2618J6911p663
7807i78k125j218n188k305J5002Q51o31K735o633K0967K3464j1346k4811j0763
7793b979j1400r750J9190P829k664j878l0287j59M680L907j676Q664J6646Q293
7779H416K415J6410j877r992j2594j6192j0457K501j6720o880J4152j1138K4099
7766a7857K664O433K5753m036k6612j4985J5393N475k813K941q97j1821O902l778
7752a7238l3156k375J8230p25K4425K1676l11N031J6414j3257j8197N544N742
7739A1803j6857j3528J3480L815m982j038j1148q00N028J46K341O791Q747j502
$$ plain form
7725 2296 14304 -6786 -16566 -22415 -15054 -8399 11245 14969 11915 24194 34961 43511 31395
7712 31395 22858 -19186 -34499 -19563 4257 18746 1246 -13279 -30363 -14563 9383 4001
7700 4001 -2965 -4155 8919 -5201 -10777 -6904 6668 -6198 -14530 -15580 -19537 -40044 -41179 -31856
7686 -31856 -8595 -12363 -17934 7819 4440 19185 21522 30551 32160 36364 34092 8312 -13224
7673 -13224 -9681 -17301 51 2866 -8462 -7939 2147 7762 -10319 2912 1798 4159 8259 8958
7659 8958 -20907 -15354 -2410 9738 10153 11591 19892 29829 12946 9141 20159 5136 -30381
7646 -30381 -18369 -13330 -12232 -27794 -19604 -12543 -5443 -4072 -6452 -14026 -600 24976 15090 -2567
7632 -2567 -33324 -49026 -27177 1244 760 -10156 -18801 -17644 3009 12923 11778 7100 -5147
$$ packed form
7725B296J2008k1090r780n849P361O655J9644L724l054J2279J0767Q550j2116
7712C1395q537m2044j5313J4936K3820J4489j7500j4525j7084J5800K3946n382
7700D001o966j190J3074j4120n576L873J3572j2866q332j050l957k0507j135R323
7686c1856K3261l768n571K5753l379J4745K337R029J609M204k272k5780k1536
7673a3224L543p620J7352K815j1328N23J0086N615j8081J3231j114K361M100O99
7659H958k9865N553J2944J2148M15J438Q301R937j6883l805J1018j5023l5517
7646c0381J2012N039J098j5562Q190P061P100J371k380p574J3426K5576r886j7657
7632b567l0757j5702K1849K8421m84j0916q645J157K0653R914j145m678j2247
$$ plain form
7619 -5147 -21640 -14436 -22936 -23718 -9788 1822 5676 16163 9994 13821 8215 365 1215 2440
7605 2440 692 8128 111 -16593 7179 7797 5051 -1482 -20060 -8996 -8749 -19950 -8612 185
7591 185 10414 12384 -16746 -23370 -2762 24181 24381 16796 -5401 -21057 -28163 -22471 -14871 -25509
7577 -25509 -29535 -50171 -52083 -54687 -18900 -12028 -18168 -28682 -33175 -38053 -26527 -14340 -23183
7564 -23183 -23175 -19217 -24836 -27267 -22257 -37101 -43472 -26727 -17206 -35251 -34093 -31275 -41254 -12505
7550 -12505 10353 -13366 -16661 -13183 -18349 -2199 -16588 -18891 9059 20744 12781 26316 41108
7537 41108 34496 11725 -3672 2514 16061 30309 25070 24685 24875 11591 6456 14469 25315 17011
7523 17011 -401 -5454 2870 -2975 8951 -2507 -18749 -24759 -25123 -31216 -12988 6940 13281
$$ packed form
7619e147j6493P204q500p82J3930J1610L854J0487o169L827n606p850Q50J225
7605B440j748P436q017j6704K3772O18k746o533j8578J1064K47j1201J1338Q797
7591A85J0229J970k9130o624K0608K6943K00p585k2197j5656p106N692P600j0638
7577b5509m026k0636j912k604L5787O872o140j0514m493m878J1526J2187q843
7564b3183QL958n619k431N010j4844o371J6745R521j8045J158K818r979K8749
7550a2505K2858k3719l295L478n166J6150j4389k303K7950J1685p963J3535J4792
7537D1108o612k2771j5397O186J3547J4248n239l85J90j3284n135Q013J0846q304
7523A7011j7412n053Q324n845J1926j1458j6242o010l64o093J8228J9928O341
$$ plain form
7510 13281 20078 5026 -10436 -7022 -15797 -3760 -4127 -31262 -25227 -22194 -26162 -55385 -69636
7497 -69636 -45346 -25079 -15250 -19932 -21793 -3109 6811 -7607 -15470 -12855 -33763 -41637 -44874
7484 -44874 -41686 -30884 -11944 -11797 -31324 -36667 -39742 -17130 -10411 -3281 16357 26351 28016 4481
7470 4481 -35360 -36143 -30236 -48282 -17610 -8237 -9159 2450 25498 27960 32300 43449 30211 17575
7456 17575 27306 37931 34719 22984 19797 21080 6420 -27849 -31528 -33376 -26562 1151 23359
7443 23359 31640 312 -25544 -12237 12199 -592 -15868 -18770 13017 25405 4723 -6130
7431 -6130 -1089 -812 -25308 -29602 -27547 -22720 -8566 -5969 -13712 -5037 -5071 -12334 -3613 4053 -16618
7416 -16618 -19635 12965 18717 42451 40915 9948 7690 9396 11016 -476 14335 28066 24969
$$ packed form
7510A3281O797j5052j5462L414q775J2037l67k7135O035L033l968k9223j4251
7497f9636K4290K0267R829m682j861J8684R920j4418p863K615k0908p874l237
7484d4874L188J0802J8940J47j9527n343l075K2612O719P130J9638R994J665k3535
7470D481l9841p83N907j8046L0672R373r22J1609K3048K462M340J1149j3238j2636
7456A7575R731J0625l212j1735l187J283j4660l4269l679j848O814K7713K2208
7443B3359Q281l1328k5856J3307K4436j2791j5276k902L1787J2388k0682j0853
7431f130N041K77k4496m294K055M827J4154K597p743Q675l4p263Q721P666k0671
7416a6618l017L2600N752K3734j536l0967k258J706J620j1492J4811J3731l097
$$ plain form
7403 24969 4425 -3972 1779 -13160 -16637 133 22645 23612 21296 23745 3476 7469 14952 7095
7389 7095 13382 17868 13581 10063 24802 15990 304 -19455 -47050 -30069 -1491 10790 6305
7376 6305 -8964 -21701 -8632 5055 2267 1931 17488 20243 15437 4318 11089 15320 31800
7363 31800 11955 -4292 -21354 -34839 -32432 -32446 -31052 -5586 5422 -3453 3998 12441 31310
7350 31310 19452 6273 9267 17451 -7039 136 21159 4067 -9223 6744 2408 2626 8567
7337 8567 10285 10796 9895 3012 3097 -722 -4567 511 -415 5041 30130 20109 -1149 -4445 10236
7322 10236 28662 34849 24837 6868 3209 4968 4892 20334 12446 -4098 -16338 -12843 -15564 -15632
7308 -15632 -7222 5556 -2121 -11471 -19405 -9922 12578 11580 -4805 -4459 -1892 -24239 -19898 -28423
$$ packed form
7403B4969k0544q397N751j4939l477J6770K2512R67k316K449k0269L993P483p857
7389G095O287M486m287l518J4739q812j5686j9759k7595J6981K8578J2281m485
7376F305j5269j2737J3069J3687k788l36J5557K755m806j1119O771M231J6480
7363C1800j9845j6247j7062j3485K407j4J394K5466J1008q875P451Q443J8869
7350C1310j1858j3179K994Q184k4490P175K1023j7092j3290J5967m336K18N941
7337H567J718N11r01o883Q5l819l845N078r26N456K5089j0021k1258l296J4681
7322A0236J8426O187j0012j7969l659J759p6J5442p888j6544j2240L495k721o8
7308a5632Q410J2778p677r350p934R483K2500r98j6385L46K567k2347M341q525
$$ plain form
7294 -28423 -9498 1826 1341 3609 -5987 -10131 4846 8285 -9753 -8630 -19333 -23804 -21175 -957
7280 -957 -9226 -20344 -20036 -14444 3713 8808 17101 34404 12549 -20129 -9819 4586 20332
7267 20332 25627 32129 31096 23153 31184 28831 12365 13106 -3093 -120 6081 -4254 -19145 -21035
7253 -21035 -19754 3629 -924 -11194 958 8437 15102 7622 -377 -13440 -17546 -3122 16703
7240 16703 20356 16780 12022 421 4103 -7648 1021 7095 11698 -1719 -25442 -26308 -23623 -28802
7226 -28802 -13295 -15562 -19149 -11913 -6274 -4809 2722 10937 1812 -26690 -30726 -25130 -22123 -17571
7212 -17571 -1500 -2291 3959 22007 27344 24460 27437 44196 37471 26137 25163 30976 23953 14065
7198 14065 -6062 -551 12705 1114 7323 3260 1912 -15504 -40888 -28639 -9507 4814 34328
$$ packed form
7294b8423J8925J1324m85K268r596m144J4977L439j8038J123j0703m471K629K0218
7280i57q269j1118L08N592J8157N095Q293J7303k1855l2678J0310J4405J5746
7267B0332N295O502j033p943Q031k353j6466P41j6199K973O201j0335j4891j890
7253b1035J281K3383m553j0270J2152P479O665p480p999j3063m106J4424J9825
7240A6703L653l576m758j1601L682j1751Q669O074M603j3417k3723q66K685n179
7226b8802J5507k267l587P236N639J465P531Q215r125k8502m036N596L007M552
7212a7571J6071p91O250J8048N337k884K977J6759o725j1334r74N813p023r888
7198A4065k0127N511J3256j1591O209m063j348j7416k5384J2249J9132J4321K9514
$$ plain form
7185 34328 39781 24140 27965 15187 5391 3263 1584 -25899 -24442 9199 25141 28529 4093
7172 4093 27612 34510 29561 6117 -1668 5170 864 11002 16794 6353 -20588 -29288 1988
7159 1988 15434 10392 -6787 2061 6985 3534 8721 13851 13108 2590 -6981 -2470 11154 10323
7145 10323 17516 4066 -3579 -1840 4528 12267 1043 15662 19893 -4011 -22741 -22625 -4534
7132 -4534 21052 24289 7445 8531 11901 -8054 1970 27568 33634 8069 1721 5487 15295
7119 15295 35600 28722 12474 4187 -10112 -20696 -17074 -7562 644 784 -1060 15664 6361 -11542
7105 -11542 -13406 -17141 -15014 -9054 -900 -5256 15645 18828 -7438 -9974 4347 8587 4012 9441
7091 9441 6647 4519 15579 17830 11641 -122 -62 -11966 -7155 -781 -14674 -12747 -8866 1024
$$ packed form
7185C4328N453j5641L825j2778r796k128j679k7483J457L3641J5942L388k4436
7172D093K3519O898m949k3444p785O838m306J0138N792j0441k6941q700L1276
7159A988J3446n042j7179Q848M924l451N187N130p43j0518r571M511J3624q31
7145A0323P193j3450p645J739O368P739j1224J4619M231k3904j8730J16J8091
7132d534K5586L237j6844J086L370j9955J0024K5598O066k5565o348L766R808
7119A5295K0305o878j6248q287j4299j0584L622R512Q206J40j844J6724r303j7903
7105a1542j864l735K127N960Q154m356K0901L183k6266k536J4321M240m575N429
7091I441k794k128J1060K251o189j1763O0j1904M811O374j3893J927L881R890
$$ plain form
7077 1024 930 -23670 -32212 -39360 -21016 -2095 -9991 -22836 -18667 -16487 -4782 -2103 -5029 -9681
7063 -9681 -18075 -23560 -7890 1663 -9293 -1674 -9773 4997 18129 19053 26936 19944 10499 19154
7049 19154 9029 9377 7834 2830 -6220 -10425 2393 6112 -9522 -34459 -41816 -20974 -27597 -26450
7035 -26450 -19120 -20281 -13040 -286 6429 15590 15602 14945 14586 22314 15669 1221 -21384 -21562 -15646
7020 -15646 -26431 -6465 -3675 -6364 -5293 -4159 3963 33873 42448 3012 -6938 -595 -9011 -2060
7006 -2060 21590 37852 27670 1365 -14045 -36043 -39548 -45699 -41033 -6975 10947 24816 -5722
6993 -5722 -21124 -6692 8905 21554 6630 -5209 -25258 -17818 -15734 -5785 3418 -2896 8077
6980 8077 5004 -8233 6307 2529 -21625 -18952 -22198 -5643 3635 -1645 -7403 -5896 5633 32279
$$ packed form
7077A024r4k4600q542p148J8344J8921p896j2845M169K180J1705K679k926m652
7063i681q394n485J5670R553j0956P619q099J4770J3132R24P883o992r445Q655
7049A9154j0125L48j543n004r050m205J2818L719j5634k4937p357K0842o623J147
7035b6450P330j161P241J2754O715R161J2o57l59P728o645j4448k2605j78N916
7020a5646j0785J9966K790k689J071J134Q122K9910Q575l9436r950O343q416O951
7006b060K3650J6262j0182k6305j5410k1998l505o151M666L4058J7922J3869l0538
6993e722j5402J4432J5597J2649j4924j1839k0049P440K084R949R203o314J0973
6980H077l073j3237J4540l778k4154K673l246J6555R278n280n758J507J1529K6646
$$ plain form
6966 32279 39386 21011 2801 -3021 12729 13435 16076 12426 7273 -16593 -4139 19559 1437
6953 1437 -17681 -37550 -37161 -40185 -46052 -27577 -4730 -1505 11264 2149 -29117 -40582 -39663 -33997
6939 -33997 -33464 -18482 4762 34238 35049 36193 41352 23266 -1588 -3804 3838 20366 500
6926 500 -13127 -19028 -10770 10938 26610 21887 9808 12696 13129 804 -4417 -3027 -9331 -36826
6912 -36826 -49712 -29836 11462 14935 9828 14307 5049 -2 1512 7569 17780 16400 -2862
6899 -2862 -34609 -45208 -51227 -52896 -42815 -14487 -11309 -38061 -8284 11045 8205 30700 43128
6886 43128 21418 19726 23296 15763 1649 -11421 -13697 -10895 2987 12641 9816 11342 6370 -4136
6872 -4136 7111 35195 28476 7608 -2475 17076 16516 2677 -8940 -1070 10821 4311 -3221
$$ packed form
6966C2279P107j8375j8210n822J5750P06K641l650n153k3866J2454K3698j8122
6953A437j9118j9869L89l024n867J8475K2847L225J2769r115l1266j1465R19N666
6939c3997N33J4982K3244K9476Q11J144N159j8086k4854k216P642J6528j9866
6926E00j3627n901Q258K1708J5672m723j2079K888M33j2325n221J390o304k7495
6912c6826j2886J9876M1298L473n107M479r258n051J514O057J0211j380j9262
6899b862l1747j0599o019j669J0081K8328L178k6752K9777J9329k840K2495J2428
6886D3128k1710j692L570p533j4114j3070k276K802J3882R654k825J526m972j0506
6872d136J1247K8084o719k0868j0083J9551n60j3839j1617P870J1891o510p532
$$ plain form
6859 -3221 -9175 -21611 -14964 -9046 -10051 -19667 -23118 -38203 -46345 -60673 -54697 -35557 -26967 -48433
6845 -48433 -44358 -13311 12503 21657 41300 46044 33163 26610 38444 38462 8419 8302 3462 1066
6831 1066 -3402 -9841 -25259 -20404 -19800 -24757 -24402 -37793 -20488 11783 13945 2441 -6156 -30302
6817 -30302 -41031 -11753 8476 27825 22214 -12954 -27296 -40158 -40580 -26071 -13777 -26710
6805 -26710 -32241 -36896 -24487 -41716 -36922 -35343 -48627 -25689 -14804 -17346 -9625 8780 -697
6792 -697 -12085 -26592 -31422 -21027 -32630 -43365 -30385 -40601 -61919 -49330 -43012 -45296 -39902
6779 -39902 -25310 7076 22289 21858 29654 -196 -21263 -29942 -43148 -33388 -19957 -11758 -107
6766 -107 10955 19942 3310 -15927 -23841 -21109 -19252 -6702 14630 31390 9902 -388 -6884
$$ packed form
6859c221n954j2436O647N918j005r616l451j5085q142j4328N976J9140Q590k1466
6845d8433M075L1047K5814R154J9643M744j2881o553J1834J8l0043j17m840k396
6831A066m468o439j5418M855O04m957L55j3391J7305L2271K162j1504q597k4146
6817c0302j0729K9278K0229J9349n611l5168j4342j2862m22J4509J2294j2933
6805b6710n531m655J2409j7229M794J579j3284K2938J0885k542P721J8405r477
6792f97j1388j4507m830J0395j1603j0735J2980j0216k1318J2589O318k284N394
6779c9902J4592L2386J5213m31P796k9850k1067q679j3206R760J3431Q199J1651
6766a07J1062Q987j6632j9237p914K732J857J2550K1332J6760k1488j0290o496
$$ plain form
6753 -6884 -22899 -12850 10952 27096 5222 -5085 -607 -7782 7874 4979 3513 1767 22043
6740 22043 20901 -3698 7623 20805 29624 1393 -10109 -14047 -16186 -27970 -59687 -53074 -37800
6727 -37800 -35842 -17028 -26524 -42940 -57356 -20542 32615 21216 3573 -14709 -15783 -10119 -13308
6714 -13308 -8193 -634 4467 8647 24404 31595 26336 27456 12643 4003 6298 -3205 -7439 4350
6700 4350 15134 21254 -1232 -13679 -13987 5136 37959 42269 22496 4473 -11877 -20162 -4203
6687 -4203 -4351 -492 6148 -523 3062 7315 -4965 -3395 -16229 -31407 -52627 -49946 -43404 -43902
6673 -43902 -40267 -24703 -19185 -996 9353 -8385 -11067 -23402 -15156 -2500 3139 6649 3201
6660 3201 8352 18941 31886 31943 11933 14189 24141 27152 15939 7897 -3185 -12702 -2221 2158
$$ packed form
6753f884j6015J0049K3802J6144k1874j0307M478p175J5656k895j466j746K0276
6740B2043j142k4599J1321J3182Q819k8231j1502l938k139j1784l1717O613J5274
6727c7800J958J8814r496j6416j4416L6814N3157j1399j7643j8282j074N664l189
6714a3308N115P559N101M180J5757P191n259J120j4813q640K295r503m234J1789
6700D350J0784O120k2486j2447l08J9123L2823M310j9773j8023j6350q285J5959
6687d203j48L859O640o671L585M253j2280J570j2834j5178k1220K681O542m98
6673d3902L635J5564N518J8189J0349j7738k682j2335Q246J2656N639L510l448
6660C201N151J0589J2945N7k0010K256R952L011j1213q042j1082r517J0481M379
$$ plain form
6646 2158 -10971 13055 16734 24133 23588 13795 5178 -4035 -9210 -2775 31049 41062 32436 46476
6632 46476 35737 8947 -13341 -8859 8346 14512 -8246 -19182 1067 9733 -3270 -30292
6620 -30292 -19326 -15801 -16395 -7904 -4617 -4831 12498 -16878 -22137 -4337 2084 -19394 -15502 -6475
6606 -6475 -1400 -7655 11451 30262 13761 23075 23447 30668 17020 -5124 -13687 -12535 -13872 -34807
6592 -34807 -18421 11614 13564 -2470 -4538 3955 -4641 -1683 13162 40066 35369 32955 12745
6579 12745 -3563 14352 29648 30727 16637 4159 -5151 -14089 -15282 -20861 -6530 -9742 -18765
6566 -18765 -20514 1648 -11829 -22699 -25093 -27020 -26443 -20110 -9793 -7183 -13560 -32482 -21455
6553 -21455 -11183 -13160 -15012 -20551 -26691 -40035 -52542 -54468 -26749 -11869 -7131 -1103 16290
$$ packed form
6646B158j3129K4026L679P399n45r793q617r213n175O435L3824J0013q626J4040
6632D6476j0739k6790k2288M482J7205O166k2758j0936K0249Q666j3003k7022
6620c0292J0966L525n94Q491L287k14J7329k9376n259J7800O421k1478L892R027
6606f475N075o255J9106J8811j6501R314L72P221j3648k2144q563J152j337k0935
6592c4807J6386L0035J950j6034k068Q493q596K958J4845K6904m697k414k0210
6579A2745j6308J7915J5296J079j4090j2478r310q938j193n579J4331l212r023
6566a8765j749K2162j3477j0870k394j927N77O333J0317K610o377j8922J1027
6553b1455J0272j977j852n539o140j3344j2507j926K7719J4880M738O028J7393
$$ [...]
##END NTUPLES=NMR SPECTRUM
##END=
