##TITLE=Analysis number 323814
Compound Code sb 00524
Project Code adrs
Chemist Name ian speare
##JCAMPDX= 6.0         $$ Bruker NMR JCAMP-DX V2.0
##DATA TYPE= NMR SPECTRUM
##DATA CLASS= NTUPLES
##ORIGIN= Bruker BioSpin GmbH
##OWNER= nmr
$$ XWIN-NMR		Version 3.5
$$ Wed Nov  8 16:24:01 2006 GMT Standard Time (UT+0h)  MAYBRIDGE\nmr@NMR_250MHZ
##.OBSERVE FREQUENCY= 250.131544655141
##.OBSERVE NUCLEUS= ^1H
##.ACQUISITION MODE= SIMULTANEOUS (DQD)
##.ACQUISITION SCHEME= undefined
##.AVERAGES= 16
##.DIGITISER RES= 18
##SPECTROMETER/DATA SYSTEM= dpx250
##.PULSE SEQUENCE= zg30
##.SOLVENT NAME= DMSO
##.SHIFT REFERENCE= (INTERNAL, DMSO, 0, 16.522)
##AUDIT TRAIL= $$ (NUMBER, WHEN, WHO, WHERE, WHAT)
$$ ##TITLE= Audit trail, XWIN-NMR		Version 3.5
$$ ##JCAMPDX= 5.01
$$ ##ORIGIN= Bruker BioSpin GmbH
$$ ##OWNER= nmr
$$ C:\u/data/dgb/nmr/ADRS/2480/pdata/1/auditp.txt
$$ ##AUDIT TRAIL=  $$ (NUMBER, WHEN, WHO, WHERE, WHAT)
(   1,<2006-11-08 16:23:27.30 +000>,<MAYBRIDGE\nmr>,<NMR_250MHZ>,
      <created by zg, POWCHK disabled, PULCHK disabled
       configuration hash MD5:
       49 4B E0 1D 92 C2 6B 37 9F E6 65 BC 52 41 86 1D
       data hash MD5: 64K
       6A 1D 72 23 38 68 3C 66 05 2A EB AB F8 73 71 BD>)
(   2,<2006-11-08 16:23:48.36 +000>,<MAYBRIDGE\nmr>,<NMR_250MHZ>,
      <Start of raw data processing
       ef LB = 0.3 FT_mod = 6 PKNL = 1 SI = 32K 
       data hash MD5: 32K
       C8 2A 07 29 C6 81 B7 E8 BD 88 62 86 F7 7E 9A 31>)
(   3,<2006-11-08 16:23:52.85 +000>,<MAYBRIDGE\nmr>,<NMR_250MHZ>,
      <apk 
       data hash MD5: 32K
       B0 D3 71 51 A8 42 FF D5 B1 21 E2 18 A2 83 F2 24>)
(   4,<2006-11-08 16:23:53.63 +000>,<MAYBRIDGE\nmr>,<NMR_250MHZ>,
      <abs ABSG = 5 
       data hash MD5: 32K
       4E 2A 51 5F 6F A5 D4 95 D1 C0 3D D9 75 DB F0 01>)
$$ ##END=
$$ 
$$ hash MD5
$$ 58 2F 8E 1A E8 5F 66 07 0C 6D C7 4C DB 3A EA 04
##$RELAX= 
##$RELAX= 
##$RELAX= 
##$RELAX= 
##$RELAX= 
##$RELAX= 
##$RELAX= 
$$ Bruker specific parameters
$$ --------------------------
##$DU= <C:\u>
##$EXPNO= 2480
##$NAME= <ADRS>
##$PROCNO= 1
##$TYPE= <nmr>
##$USER= <dgb>
##$AMP= (0..31)
100 100 100 100 100 100 100 100 100 100 100 100 100 100 100 100 100 100 
100 100 100 100 100 100 100 100 100 100 100 100 100 100 
##$AQSEQ= 0
##$AQ_mod= 3
##$AUNM= <au_zg>
##$AUTOPOS= <46 >
##$BF1= 250.13
##$BF2= 250.13
##$BF3= 250.13
##$BF4= 250.13
##$BF5= 500.13
##$BF6= 500.13
##$BF7= 500.13
##$BF8= 500.13
##$BYTORDA= 1
##$CFDGTYP= 0
##$CFRGTYP= 5
##$CHEMSTR= <none>
##$CNST= (0..31)
1 1 145 1 1 1 1 1 1 1 1 1 1 1 1 1 1 1 1 1 1 1 1 1 1 1 1 1 1 1 1 1 
##$CPDPRG= <>
##$CPDPRG1= <>
##$CPDPRG2= <>
##$CPDPRG3= <>
##$CPDPRG4= <mlev>
##$CPDPRG5= <mlev>
##$CPDPRG6= <mlev>
##$CPDPRG7= <mlev>
##$CPDPRG8= <mlev>
##$CPDPRGB= <>
##$CPDPRGT= <>
##$D= (0..31)
0 1 0 0 0 0 0 0 0 0.06 0 0 0 0 0 0 0.0002 0 0 0 0 0 0 0 0 0 0 0 0 0 0 
0 
##$DATE= 1163003005
##$DBL= (0..7)
120 120 120 120 120 120 120 120 
##$DBP= (0..7)
150 150 150 150 150 150 150 150 
##$DBP07= 0
##$DBPNAM0= <>
##$DBPNAM1= <>
##$DBPNAM2= <>
$$ [...]
##$SUBNAM7= <"">
##$SUBNAM8= <"">
##$SUBNAM9= <"">
##$SW= 20.6930455092707
##$SWIBOX= (0..15)
0 0 3 0 0 0 0 0 0 0 0 0 0 0 0 0 
##$SW_h= 5175.983436853
##$TD= 65536
##$TD0= 1
##$TE= 683.16
##$TE2= 300
##$TE3= 300
##$TEG= 300
##$TL= (0..7)
0 120 120 120 120 120 120 120 
##$TP= (0..7)
150 150 150 150 150 150 150 150 
##$TP07= 0
##$TPNAME0= <>
##$TPNAME1= <>
##$TPNAME2= <>
##$TPNAME3= <>
##$TPNAME4= <>
##$TPNAME5= <>
##$TPNAME6= <>
##$TPNAME7= <>
##$TPOAL= (0..7)
0.5 0.5 0.5 0.5 0.5 0.5 0.5 0.5 
##$TPOFFS= (0..7)
0 0 0 0 0 0 0 0 
##$TUNHIN= 0
##$TUNHOUT= 0
##$TUNXOUT= 0
##$USERA1= <user>
##$USERA2= <user>
##$USERA3= <user>
##$USERA4= <user>
##$USERA5= <user>
##$V9= 5
##$VALIST= <valist>
##$VCLIST= <CCCCCCCCCCCCCCC>
##$VD= 0
##$VDLIST= <DDDDDDDDDDDDDDD>
##$VPLIST= <PPPPPPPPPPPPPPP>
##$VTLIST= <TTTTTTTTTTTTTTT>
##$WBST= 1024
##$WBSW= 4
##$XGAIN= (0..3)
0 0 0 0 
##$XL= 0
##$YL= 0
##$YMAX_a= 344182
##$YMIN_a= -214537
##$ZGOPTNS= <>
##$ZL1= 120
##$ZL2= 120
##$ZL3= 120
##$ZL4= 120
##$ABSF1= 16.522
##$ABSF2= -4.171173
##$ABSG= 5
##$ABSL= 3
##$ALPHA= 0
##$AQORDER= 0
##$ASSFAC= 0
##$ASSFACI= 0
##$ASSFACX= 0
##$ASSWID= 0
##$AUNMP= <proc_1d>
##$AZFE= 0.1
##$AZFW= 0.1
##$BCFW= 0
##$BC_mod= 0
##$BYTORDP= 0
##$COROFFS= 0
##$CY= 12.5
##$DATMOD= 1
##$DC= 0
##$DFILT= <>
##$DTYPP= 0
##$F1P= 14.0000005364418
##$F2P= -0.99999901652339
##$FCOR= 0.5
##$FTSIZE= 32768
##$FT_mod= 6
##$GAMMA= 0
##$GB= 0
##$INTBC= 1
##$INTSCL= 1
##$ISEN= 128
##$LB= 0.3
##$LEV0= 0
##$LPBIN= 0
##$MAXI= 10000
##$MC2= 0
##$MEAN= 0
##$ME_mod= 0
##$MI= 0
##$NCOEF= 0
##$NC_proc= -5
##$NLEV= 6
##$NOISF1= 0
##$NOISF2= 0
##$NSP= 0
##$NTH_PI= 0
##$NZP= 0
##$OFFSET= 16.522
##$PC= 1
##$PHC0= -55.07275
##$PHC1= 9.849521
##$PH_mod= 1
##$PKNL= yes
##$PPARMOD= 0
##$PSCAL= 4
##$PSIGN= 0
##$REVERSE= no
##$SF= 250.13
##$SI= 32768
##$SIGF1= 0
##$SIGF2= 0
##$SINO= 400
##$SIOLD= 32768
##$SREGLST= <1H.DMSO>
##$SSB= 0
##$STSI= 32768
##$STSR= 0
##$SW_p= 5175.98343685301
##$SYMM= 0
##$S_DEV= 0
##$TDeff= 65536
##$TDoff= 0
##$TI= <Analysis number 999999
Compound Code 99
Book Reference 9
Project Code 9>
##$TILT= no
##$TM1= 0
##$TM2= 0
##$TOPLEV= 0
##$USERP1= <user>
##$USERP2= <user>
##$USERP3= <user>
##$USERP4= <user>
##$USERP5= <user>
##$WDW= 1
##$XDIM= 32768
##$YMAX_p= 478229425
##$YMIN_p= -1268219
$$ End of Bruker specific parameters
$$ ---------------------------------
##NTUPLES= NMR SPECTRUM
##VAR_NAME=  FREQUENCY,     SPECTRUM/REAL,   SPECTRUM/IMAG
##SYMBOL=    X,             R,               I
##VAR_TYPE=  INDEPENDENT,   DEPENDENT,       DEPENDENT
##VAR_FORM=  AFFN,          ASDF,            ASDF
##VAR_DIM=   32768,         32768,           32768
##UNITS=     HZ,            ARBITRARY UNITS, ARBITRARY UNITS
##FACTOR=    0.157963299565203, 1,           1
##FIRST=     4132.6476996994, 0,             0
##LAST=      -1043.33573715361, 0,           0
##MIN=       -1043.33573715361, -1268219,    0
##MAX=       4132.6476996994, 478229425,     0
$$ Real data points
##PAGE= N=1
##DATA TABLE= (X++(R..R)), XYDATA
$$ [...]
21449i5522k01008j15159n7426J50306J44446J20041k4379l72352l68787p6898
21439h96738J54116k12661J09274J39650r0766O4457J68263p7478Q9230K68051
21429b84602J01089l45360k40534L8308K29197j2998R9589K12686J62222M1020
21419F17l52611k74548K786K65424j65367k151n3248M6200M8466J47894L62518
21408B5980n3916l21434l47254J59027L1319j11025p3784K87651P2297R7074P6799
21397a57266n9628k05901K3265R8522R4379L69536O3825k42515O7341O0437k66070
21386a54075k44790j985j79514o9656N1387p277n6896J81434P9220m5254L15220
21375a32186J57569k36749k68912K4089J95072J62412M2949j15462j3255j85988
$$ y = [-95522, -296530, -411689, -469115, -318809, -174363, -54322, -78701, -451053, -819840, -896738, -742622, -955283, -846009, -706359, -797125, -732668, -564405, -641883, -552653, -284602, -183513, -528873, -769407, -731099, -501902, -514900, -415311, -202625, -40403, 617, -351994, -626542, -623756, -358332, -523699, -525850, -579098, -532898, -484432, -336538, 25980, -27936, -349370, -696624, -537597, -506278, -617303, -691087, -403436, -331139, -234065, -157266, -216894, -422795, -399530, -301008, -206629, 162907, 226732, -15783, 51558, 111995, -154075, -398865, -400850, -580364, -650020, -598633, -605910, -662806, -481372, -402152, -447406, -132186, 25383, -211366, -480278, -456189, -261117, -98705, -55756, -171218, -184473, -370461]
21365c70461J27134k03755J1934K55035o8040J61838J36479o6370k51621J19359
21355a48468J6794k08118l7601L79464L1507J1703m0010j25658o618k14689k38619
21344e80313Q3343L04813K00911o2719N5400n7133M8267j61907j07547K01680
21334g5205k52219k29220J44345J37368k6083L69881k47092L397J69961j42737
21324a47604p9041J59837Q7987l26318m78833J39552K07480J76955n3733j82587
21314d96305Q2975J17483r4763M1135j1238j26878K8282R0970Q3072l5908L1180
21303b89995m6629O3525P3127J11987O1644j53484k05111k93091J43068M30045
21293a04914J31257k07384k33483j7962r8578O3371j55897J7326K23207K67326
$$ y = [-370461, -243327, -447082, -435148, -180113, -248153, -86315, 50164, -16206, -267827, -148468, -131674, -339792, -377393, 2071, 33578, 45281, 5271, -120387, -127005, -341694, -580313, -496970, -192157, 8754, -53965, 1435, -55698, -7431, -169338, -276885, -75205, -327424, -556644, -412299, -274931, -301014, 68867, -178225, -174828, -4867, -147604, -226645, -66808, 21179, -305139, -783972, -644420, -436940, -259985, -313718, -496305, -413330, -295847, -390610, -349475, -360713, -487591, -459309, -368339, -285267, -321175, -289995, -336624, -273099, -199972, -87985, -26341, -179825, -384936, -678027, -534959, -104914, 26343, -181041, -414524, -432486, -531064, -467693, -623590, -606264, -383057, -115731]
21283a15731K32999M4800q3075k05807j39618j20724n1016J2857K41342o0330
21273b44303n7374n1625P0868J82478p1887j67677q3515j19037R5670N0550K7846
21262c68006m2171J86220m2773J23539n424k05182k4987l875q4562k15987j26804
21251h10012j18287k03988J55371J69895J31508K74573K60833k74750k55505R5332
21241e75030L74411J65190j69453j7948N9004P456k08844l48899J94148M20717
21231i9248n957k52313q4527M8445Q4399L269n6725k39630j26484L45230j21947
21220e05488j14062j65251K82570J12892j18884O4808k391o2867K0140J84247
21210c04286n2197j38272J232K44726K40409q4800j96203J56621J283k61619j43362
$$ y = [-115731, 117268, 162068, 78993, -126814, -266432, -387156, -438172, -425315, -183973, -244303, -301677, -353302, -282434, -99956, -171843, -339520, -423035, -542072, -446402, -395852, -368006, -410177, -223957, -266730, -143191, -148615, -353797, -378784, -382659, -467221, -683208, -810012, -928299, -1132287, -976916, -807021, -675513, -400940, -140107, -414857, -670362, -575030, -200619, -35429, -204882, -222830, -163826, -156370, -365214, -714113, -519965, -99248, -105205, -357518, -442045, -393600, -309201, -305932, -362657, -602287, -728771, -383541, -505488, -619550, -784801, -502231, -389339, -508223, -443415, -445806, -508673, -488533, -304286, -356483, -494755, -493523, -248797, -8388, -93188, -289391, -132770, -131487, -393106, -536468]
21199e36468j12738J37984J78244J9642L2407j40921n5230r9533L438J39682j01673
21188e35166J06360K86648J63869k15117k27244J04931J34317m155k03156J73622
21178b15091K1505n1669o9825R2958j31989k393j07873J63528o1939p9704J24158
21167c18334Q3827K44245l04574m55366l389K12479L14762P3703k23816j13725
21157d90188j11929O1731K04064o2434k39901L67607L40335L41650o7805q5597
21147B57533q9662j78851n8045j06400o9994o9554P364o0366J48478R7233J49915
21136B7651j59381k22011J632J81340r3342J43334M9764k38454q0241j77800j10623
21125f78131O7637J98625J90955j49869k9447r208m1348P3690o7032n9334O4938
$$ y = [-536468, -649206, -511222, -332978, -313336, -280929, -421850, -477080, -576613, -573175, -433493, -535166, -428806, -142158, 21711, -193406, -420650, -315719, -181402, -185557, -388713, -215091, -193586, -245255, -315080, -222122, -354111, -356504, -464377, -300849, -362788, -442492, -318334, -234507, 9738, -294836, -750202, -753591, -541112, -226350, -152647, -376463, -490188, -602117, -540386, -336322, -398756, -638657, -271050, 69285, 410935, 343130, 257533, 167871, -10980, -69025, -175425, -245419, -314973, -307609, -367975, -219497, -122264, 27651, -131730, -353741, -352109, -170769, -264111, -120777, -71013, -309467, -389708, -567508, -678131, -610494, -411869, -220914, -370783, -400230, -409438, -450786, -377096, -444128, -503462, -438524]
21114d38524j03488L6550K4561J21626J00299j48818j06317o2310K30747J54591
21104a91083O0056k22258j78978K22230J89731L4865j78401R2122R2384J66143
21094H6811L35673j05260l31842l34780J5744J00150j68836J8185N1950q9708
21084d21913l21096l45746m6041L10050o725M37066K6245l683L8270Q098n5805
21073c81280J98115J84847j59347j88405j78553L35133O4966j0707r9289o7400
21063c01920l271l7817J54921p4976j39391j22423j41524j62673K92508J74343
21053c62223l32333P4423L17111J05776j18380j76080N5486M9721K16703o1214
21043b31010l9544l7843L0224J71903l2154N208l4203j01221j37754P9805L01938
$$ y = [-438524, -542012, -505462, -480901, -359275, -258976, -407794, -514111, -576421, -345674, -191083, -131027, -353285, -532263, -310033, -120302, -85437, -263838, -171716, -79332, 86811, 422484, 317224, -14618, -349398, -333654, -233504, -402340, -384155, -332205, -421913, -743009, -1088755, -1134796, -824746, -831471, -394405, -368160, -371843, -333573, -325475, -381280, -183165, 1682, -157665, -346070, -524623, -189490, -124524, -135231, -234520, -301920, -305191, -343008, -188087, -263063, -402454, -524877, -666401, -829074, -536566, -362223, -694556, -620133, -303022, -197246, -315626, -491706, -436220, -386499, -169796, -231010, -270554, -308397, -278173, -106270, -138424, -133216, -167419, -268640, -406394, -326589, -24651]
21032b4651M3460k14913q8537L76276K645l51184k25241j50176J48418L36918
21022a46985J79419k81770k53493J24552J40600N8087j47314L6726J51110k2280
21012a61348R8090J9356j84962j33882R4132M4063K1577O0438k90653p9824j14838
21001f27851n8502o2633J29697J84982J00730q3862j13728l01056R7541L92190
20991c42492J77135j06400j90023J40743J02034J7574O9240j80373Q6726K1589
20981b04247M1900m6986k9937j68J13465j40247r5756J08279L3852k75070m0143
20970e35058r1486k34593k16039O026M8918K77910N8341N7838k6781P2153J84362
20959c98409p2904Q5247J7649J82459k3256K9316L6749k45645k0871L7132K42259
$$ y = [-24651, 18809, -196104, -284641, 91635, 94280, -256904, -482145, -632321, -483903, -146985, 32434, -249336, -502829, -378277, -237677, -179590, -326904, -290178, -139068, -161348, -63258, -43902, -228864, -362746, -268614, -224551, -202974, -142536, -433189, -513013, -627851, -686353, -748986, -619289, -434307, -333577, -417439, -531167, -832223, -734682, -342492, -165357, -271757, -461780, -321037, -219003, -201429, -132189, -312562, -225836, -204247, -162347, -209333, -239270, -239438, -125973, -266220, -361976, -253697, -219845, -494915, -535058, -626544, -861137, -1077176, -1071150, -1022232, -744322, -685981, -628143, -654924, -582771, -398409, -471313, -386066, -368417, -185958, -209214, -179898, -143149, -388794, -409665, -372533, -130274]
20948a30274K6802J78012J94639j17870l59975k14959N5325l4672k03795L41547
20938b65220K39006J7686J28093k2104j00375p8257p8061K5108r8841k48949J36381
20927c45533J82144J79991r6366q3148P6641j61458j33388p3110j63062k6577
20917f43866N57748o9708l51461J26218L8612J21139R7592j05865J39098K98919
20907B08426K86825o4928m70042j27140k3925j04084m2768q0838j81537l1371
20897f31382P3396j35969J30548J33489p6463O5139j66125k36382K39906J8319
20887e85524k53620L66190J66673n2837k02686j86250P3516j07525J29405K96025
20877c56633M25627q3788j46413j49080j71566j81811n7863K29798J21295J66921
$$ y = [-130274, -103472, 74540, 269179, 151309, -208666, -423625, -368300, -402972, -606767, -265220, -26214, -8528, 119565, 97461, -2914, -81171, -159232, -134124, -232965, -481914, -345533, -163389, 16602, -79764, -162912, -86271, -247729, -381117, -454227, -617289, -643866, -86118, -155826, -507287, -381069, -342457, -221318, -123726, -229591, -90493, 208426, 495251, 430323, -39719, -166859, -190784, -294868, -337636, -418474, -600011, -631382, -557986, -693955, -563407, -429918, -506381, -441242, -607367, -843749, -603843, -585524, -839144, -472954, -306281, -359118, -561804, -748054, -674538, -782063, -652658, -356633, 68994, -14794, -161207, -310287, -481853, -663664, -721527, -491729, -370434, -203513]
20867b03513K0015J2554Q5242p8116j28465j85493J06100m2716J60673j30818
20857c84537K07323k7031j63287j8262J79460j43084L5245j30016k02432K6800
20847f19821J52480J91256j36066K1209K0854R3106o002l71833j18032J31253
20837f41596K60964M63981J55143l34039q7884r6683k27792P9563o0298j37478
20827f26119J07615n6812N2100J45409l1364k60316j94605o6878K41196K54531
20817d35243J70896n2497L5156K74064j38797j82579O9464J89576J03384M8075
20807H1499k07115O0670K57555O4646j47445k1634k40025j63506o8389J68000
20797b15744L18497k54984k19529j59719N2516R2643J21186Q3892J2798k3680
$$ y = [-203513, -183498, -170944, -85702, -163818, -292283, -477776, -371676, -414392, -253719, -384537, -177214, -204245, -367532, -385794, -206334, -349418, -314173, -444189, -646621, -619821, -467341, -276085, -412151, -390942, -370088, -276982, -282984, -654817, -772849, -641596, -380632, 83349, 238492, -95547, -183431, -280114, -507906, -428343, -488641, -626119, -518504, -575316, -523216, -377807, -409171, -669487, -864092, -930970, -689774, -435243, -264347, -316844, -281688, -7624, -146421, -329000, -259536, -69960, 33424, 81499, -125616, -64946, 192609, 257255, 109810, 88176, -151849, -315355, -383744, -215744, 102753, -152231, -371760, -531479, -478963, -386320, -265134, -181242, -168444, -192124]
20787a92124K2537j33865k1777M3537J4004K4712N8856k81004J21228r4883j37940
20776e76719P3991m3769p9685k50897J39799K7312n4967L1919J97007m1892j02526
20765f80427J09423K69754R2259j03286j34813J56577m0491o3811N604J61739
20755b27472o159R392J73984J58609K47279J53505j13823k96237l83427l51810
20745f36159k51299J64784K27639r5888o7128r5293Q3303R0493q9015P4124K37167
20734c57272J31267k42762k82632K0670M8916j66300R2766J12098Q3407K10600
20724c49242l6135k11909L573K59663o9370j27916l21592O0490L80296J85783
20714b26359n4914Q1021j03622R380J02342m8928j12295o5715P1932L29549q687
$$ y = [-192124, -169587, -303452, -325229, -281692, -267688, -242976, -184120, -465124, -343896, -438779, -576719, -502728, -546497, -626182, -877079, -737280, -709968, -764935, -733016, -536009, -577901, -680427, -571004, -301250, -208991, -312277, -447090, -290513, -331004, -394815, -389211, -227472, -233631, -224239, -50255, 108354, 355633, 509138, 395315, 99078, -284349, -636159, -887458, -722674, -495035, -590923, -658051, -753344, -670041, -579548, -668563, -594439, -357272, -226005, -468767, -751399, -730729, -681813, -848113, -755347, -643249, -559842, -349242, -385377, -597286, -593713, -334050, -403420, -531336, -852928, -792438, -412142, -226359, -281273, -200252, -303874, -294494, -192152, -241080, -353375, -419090, -347158, -17609, -26296]
20703b6296J27247K60809q8291j23528k49350j58971K92266M8177O4535K34028
20693C80626n8375J6778p8152j34142j76500l38025o102J71007o3728R1220J46937
20682d8456k43475K47610p012j23590k2154J14334j14014J0023K64714j72925
20672i4945p0572l1947K11661k09566q4822M79784k9797j11997L67861L247o02724
20661a73817j45746J20978l8243j43754R3716L1536O3134N902l2508m0868L2600
20650b27070n8573J50063J10525k38581l4119K2130J75710o0267k30275k11796
20640f02253J6799K13819J28270k51772R8244m4615o792J22504K3976J90112Q5013
20629b6695l8285p2427Q1393J0811r1718k63585j39152J39327K00363q4673J50648
$$ y = [-26296, 100951, 361760, 273469, 149941, -99409, -258380, 33886, 82063, 146598, 380626, 322251, 339029, 260877, 126735, -49765, -387790, -393892, -222885, -286613, -195393, -48456, -291931, -44321, -51333, -174923, -197077, -82743, -196757, -186734, 77980, -94945, -165517, -197464, 14197, -195369, -280191, 199593, 169796, 57799, 425660, 428907, -173817, -319563, -198585, -236828, -380582, -286866, -255330, -192196, -186294, -218802, -259670, -227070, -285643, -135580, -25055, -263636, -297755, -275625, -99915, -160182, -390457, -602253, -585454, -371635, -243365, -495137, -396893, -441508, -448300, -325796, -301820, -111708, -26695, -64980, -137407, -56014, -45203, -136921, -400506, -539658, -400331, -199968, -284641, -133993]
20618a33993K87282J23498j71386j61057j48204k13899n4216M0177J57088j51316
20608d26026l39816O7773L21221J28991j4624j00535J55406k4754K92427K22531
20598B82594K906N1377l59697l80086Q3743J23227n1420P6461K16978r3136K6218
20587b0835j58560j33291j84322j21839K61748m6890k76933K0489K11490Q9064
20577c59879J04098M5406R8437Q2982J037R0059P95k34363J47339j85914r8598
20566c08601p1768Q1718p7199k8202L8274k61575L0723J94051L44767l26178J32475
20555b51515K03917k08332j7183Q6698n8665J4050j89778J87507M28018J15700
20545C10417N6284n4603k9194M2627k43709k55468o2573j89028n4011k49680J59913
$$ y = [-133993, 153289, 276787, 105401, -55656, -203860, -417759, -471975, -431798, -274710, -426026, -765842, -698069, -376848, -247857, -262481, -363016, -207610, -232364, 60063, 282594, 285500, 336877, -22820, -402906, -319163, -195936, -247356, -170895, 46083, -47053, -20835, -179395, -312686, -497008, -618847, -357099, -403989, -680922, -660433, -448943, -359879, -255781, -210375, -111938, -28956, -27919, 62140, 62935, -171428, -24089, -210003, -308601, -380369, -298651, -375850, -404052, -365778, -627353, -596630, -402579, -57812, -383990, -251515, -47598, -255930, -273113, -186415, -245080, -231030, -420808, -233301, 194717, 310417, 366701, 312098, 282904, 325531, 81822, -173646, -236219, -425247, -479258, -728938, -569025]
20534e69025q2254K00622k2615J7715m5427N6646l50787P6928K14882K38947k09047
20523d73415j14749j47246O607R9853j90984L15542J32802j64116Q8484J19448
20513c27774O9195m9524L642k51541n9629j9466j3888K35379J08935l3145K82768
20502e5048K10203J22297r2607k1877K2254J1479k78487l28859J1222N6391L9798
20491c03234P0122k1627P1589j2077k3904N6710k47809k24432N7243K43J880j4157
20479e89453J35069r0298m12623J30299J54102K88802o4722k34439J37437J95240
20469c50586m2299j4768N077k65608j20874l3407K03563j80j40402j34589N73723
20458c20350R8066j85134J69118K57157J17727k82672M0795k9086j3577Q69J58093
$$ y = [-569025, -651279, -450657, -473272, -455557, -500984, -444338, -795125, -718197, -503315, -264368, -473415, -588164, -735410, -728803, -628950, -819934, -504392, -371590, -535706, -447222, -327774, -258579, -308103, -304461, -556002, -615631, -635097, -648985, -413606, -304671, -337816, -55048, 155155, 277452, 184845, 162968, 185222, 196701, -81786, -410645, -399423, -343032, -303234, -233112, -254739, -183150, -195227, -219131, -162421, -410230, -634662, -577419, -577176, -575296, -589453, -454384, -544682, -957305, -827006, -672904, -384102, -448824, -683263, -545826, -350586, -392885, -407653, -402576, -668184, -789058, -822465, -618902, -619082, -759484, -894073, -320350, -222284, -407418, -238300, 18857, 136584, -146088, -105293, -134379, -147956, -147087, 11006]
20447A1006K24134j78201j33973j26017j5426n4453m6528k48103J97074Q5044
20437b85443M5708p6280K37179K76118l84861l53227M7967L28097K23004J3629
20427G1891k61257j52746Q6556j15771j07425q0934J18306l4327j71028K7532
20417f19203M6046L4037J65602N8051q6760o4060o0130j41657r366O2778J49927
20406d64735K020p8595k57244k1229L1783L20804R9703J61461L05543Q1547j72444
20395H614k92309o0716j14598k75719K9179Q2439Q8097k8895K0526q2450q5417
20384g11249K24154n4398J14609L58106k38151k51324o4659J07216j8212p925
20374e41833M6002J34699J30306k1156j2730j12104R4691j88340R0437O5955J76079
$$ y = [11006, 235140, 56939, -77034, -203051, -218477, -272930, -319458, -567561, -370487, -285443, -239735, -316015, -78836, 197282, -187579, -540806, -492839, -164742, 58262, 71891, -189366, -342112, -255556, -371327, -478752, -559686, -441380, -475707, -646735, -619203, -573157, -539120, -373518, -315467, -402227, -466287, -526417, -668074, -677440, -614662, -464735, -462715, -541310, -798554, -819783, -788000, -467196, -367493, -206032, 99511, 181058, 8614, -283695, -344411, -459009, -734728, -705549, -623110, -535013, -563908, -543382, -625832, -711249, -487095, -541493, -426884, -68778, -306929, -558253, -622912, -515696, -533908, -541833, -495831, -361132, -230826, -251982, -264712, -376816, -282125, -470465, -380028, -314073, -137994]
20363a37994n3279j5144j86764K22416j19617l01197q7546p6884M6683j17726
20353h27052J59106k6722r2325N9851Q8504J16051R9994j69921l1052J33667j95572
20342f85471q2510R3834L8702j55675J47140L02312N097k26247J24048N5482n2824
20331d36112j36560m1106K95161J64383K4645J14138j45487k48504r6235j01817
20321f07494J42854j55391j38696k24558J51786J21726J54548L21718J75512j05231
20311a63226l1991j4642m160K30654o2449O4676P0942J5244n9944l60790n2984
20300c68670N8615L00782J2591k23319k60360m61283r0826M3893L37043K81676
20290c69858j46140j5777j25162k6745k12318K13360M17851k24996J03798N2743
$$ y = [-137994, -191273, -206417, -393181, -170765, -290382, -591579, -679125, -756009, -709326, -827052, -667946, -694668, -786993, -727142, -638638, -522587, -422593, -592514, -623566, -489899, -685471, -767981, -674147, -635445, -791120, -643980, -341668, -336571, -562818, -438770, -383288, -436112, -572672, -613778, -318617, -154234, -129589, -15451, -160938, -409442, -505677, -607494, -464640, -620031, -758727, -983285, -831499, -709773, -555225, -233507, -57995, -163226, -195217, -209859, -214019, 16635, -45814, 18862, 89804, 105048, 45104, -315686, -368670, -310055, -9273, 3318, -220001, -480361, -941644, -1032470, -988577, -651534, -369858, -515998, -531775, -656937, -683682, -896000, -682640, -264789, -489785, -385987, -333244]
20280c33244l08393k72418R0502J62651K97974j57450p0767R0856K83079J58703
20270e8507j97245l9095j14593J03881r8581k99411J49218R7512N2831K24203
20260a79787j19451J94485L46713j20111j25412k93553l35601Q4716Q046j80650
20250g20605j35134J36432n0554K11290N3621k85785l9381J10521O73867K08612
20240A62884l05457j41913q5794r0624k69557l9642J93743J68208l3389k76522
20230g18063j93486k6003Q3777K46520L11819K47450j4484k60399q3430o7164
20220d73463R8148K36968r9054l37150o9765n6210L41867O7808j7778j1312p3260
20209c93201r3613N5171M8293J52197l96145k40013O6644L1584J31576M69465
$$ y = [-333244, -641637, -914055, -823553, -660902, -362928, -520378, -591145, -500289, -217210, -58507, -255752, -294847, -409440, -305559, -404140, -703551, -554333, -456821, -403990, -179787, -299238, -104753, 241960, 121849, -3563, -297116, -632717, -548001, -539955, -720605, -855739, -719307, -769861, -558571, -504950, -790735, -830116, -719595, -45728, 162884, -142573, -284486, -370280, -460904, -730461, -770103, -576360, -408152, -441541, -718063, -911549, -937552, -853775, -607255, -295436, -47986, -62470, -322869, -406299, -473463, -375315, -138347, -237401, -574551, -644316, -700526, -358659, -290851, -308629, -319941, -393201, -486814, -431643, -383350, -231153, -627298, -867311, -800667, -769083, -637507, -168042]
20199a68042J57416k7947j58420m19344j63764L63883R0181r0968K29510k02324
20189c89819j46693j76595P1689m6312K07806J10589j79912j28677J26404n5895
20179f07415p3805K47643j449j86083n7404K65002J16320K1156j49784o1118L5
20168d86902J08659q520j61442K64739l0415j50141n0830j50328j97773K57175
20158f05778K71568J41886k7614o9568r1679j19812p0137j17693l20374Q2671
20148i26530M16566J25J8609L22973N2387J20533j70362k5973J014k21019r6455
20137e08132K10113K0048q0597J57334J04995J3087j0770m9826j7156r4815m7142
20126c02861K06394L0176j84923m00426k78021N3498M34978Q4437O6993o45p3700
$$ y = [-168042, -10626, -38573, -196993, -616337, -780101, -416218, -326037, -417005, -187495, -389819, -536512, -713107, -641418, -687730, -479924, -369335, -549247, -677924, -551520, -607415, -681220, -433577, -435026, -621109, -678513, -413511, -297191, -276035, -425819, -486937, -486902, -378243, -386763, -548205, -283466, -313881, -464022, -514852, -665180, -862953, -605778, -334210, -192324, -219938, -289506, -381185, -500997, -571134, -688827, -1009201, -926530, -509964, -509839, -491230, -168257, -115870, 4663, -165699, -191672, -190658, -411677, -508132, -298019, -277971, -358568, -201234, -96239, -83152, -93922, -143748, -160904, -255719, -302861, -96467, -66291, -251214, -651640, -929661, -876163, -441185, -356748, -289755, -290400, -364100]
20115c64100O1099K94m4937N2747J3882N9530j51456J6260J40658O4225l57887
20104e09685k48155K16562L05085j37321Q2162L0721J40365j58064l96813k69378
20094i44521K39389J88998J5639l3214l6026O429J03242K23669j93864j9456J3635
20083d36080P7939L31477j13602j67259P4832K65032j46224j85718J60282J47390
20073H069P3604k82858j57434J2823J17478J32940N2123J84603p5343l13005j82637
20062d29637R5616o5303L5691P2592Q9869j55623r0941j35154l3429M97L9995
20051e75827J74999O9433k54467j23863p490J60582n777j26030J31047J97336
20041c60057J38121R077j10785K61176K63606j82754j8200n9010L3088J75244
$$ y = [-364100, -303001, -302707, -347644, -294897, -281015, -221485, -372941, -356681, -216023, -151798, -509685, -757840, -541278, -236193, -373514, -291352, -260631, -120266, -278330, -675143, -944521, -705132, -516134, -500495, -533709, -569735, -563306, -460064, -236395, -430259, -449715, -436080, -358141, -26664, -140266, -307525, -232693, 32339, -113885, -299603, -139321, 8069, 81673, -201185, -358619, -345796, -228318, -95378, -43255, 141348, 66005, -247000, -429637, -334021, -399324, -363633, -291041, -201172, -356795, -447736, -582890, -616319, -615822, -575827, -400828, -331395, -585862, -709725, -717215, -556633, -562410, -688440, -557393, -360057, -221936, -212859, -323644, -62468, 201138, 18384, 184, -58826, -25738, 149506]
20031A49506P8864k70340m29597m74159K0294M61300J19289K6934J27890M7645
20021a42374R1129j33890L99L3255j47598j37019k47911l7038J75075o37j70563
20010g17172l2369o5751J99092J82298k3106m3143Q0598J31030o1227j03629k4244
19999d77623K2811J15933J60054j51594J3084l4984l90950j13579K41201J13724
19989e01923O0427j02274K3587r198j73510J24557J35079K7739o8672l2203J84846
19978c31545K44674j05271J70057J38144m4709k68566q7575J55826j44014N8825
19968b14154M8296k8444p5743o5603l37361N1681J43963K9624N0794n5790j13210
19957e65947k9979J01709Q5055Q4812M8880J37531P6376l560l17428p1241R8192
$$ y = [149506, 228370, -41970, -471567, -945726, -925432, -464132, -344843, -317909, -190019, -142374, -51245, -185135, -184736, -151481, -299079, -436098, -684009, -721047, -545972, -546609, -717172, -749541, -815292, -616200, -433902, -457008, -500151, -419553, -288523, -349750, -453379, -477623, -454812, -338879, -178825, -330419, -317335, -352319, -743269, -856848, -615647, -501923, -441496, -543770, -520183, -529381, -702891, -578334, -443255, -415516, -484188, -516391, -331545, -86871, -192142, -22085, 116059, 71350, -197216, -284791, -128965, -272979, -214154, -165858, -194302, -270045, -335648, -673009, -621328, -477365, -447741, -396947, -452737, -565947, -595926, -494217, -409162, -324350, -275470, -137939, -61563, -65123, -382551, -453792, -355600]
19946c55600L0184m0258j0852j55088O064J23482J38455R2820j43173o4682r8985
19935d77633n6238K34504K66591M1834l87615k8048K34580K80090l02837k91827
19925d86599N0338n9954k1955k7468J48555K26286k05756N400J02751J52542J54193
19914C8333l64874m0858j33375L7644K6253L3009K0372j83980Q2915N6920J84026
19903b43615j10066k17480J19037J30764K70912J26268j84066K8305J42007k79782
19893b17716l03432K36474J02253n6060j72046M1566M13542K52878k29883j01698
19883c4122k0610k8547J29446k92625l4186l86404Q561L23873J69283L3501r5741
19872b27571k27511J80814k43558j39437m9431M4589K98778J38633P238j2606
$$ y = [-355600, -325416, -365674, -376526, -531614, -525550, -402068, -263613, -170793, -313966, -378648, -477633, -533871, -299367, -32776, 9058, -378557, -406605, -172025, 108065, -194772, -486599, -436261, -496215, -518170, -545638, -397083, -170797, -376553, -371153, -268402, -115860, 38333, -326541, -367399, -500774, -463130, -436877, -403868, -383496, -567476, -484561, -427641, -243615, -353681, -571161, -452124, -321360, -50448, 75820, -108246, -79941, 62066, -217716, -521148, -284674, -182421, -238481, -410527, -368961, 44581, 297459, 67576, -34122, -54732, -83279, 46167, -246458, -280644, -667048, -658487, -334614, -165331, -131830, -227571, -455082, -274268, -517826, -657263, -706694, -662105, -363327, -224694, -217456, -230062]
19862b30062l16087k70076p1200K85211J5016o7171j66200J25232J42564j74411
19852g27184r8045K94095K59892L7808k78693j02697K02153j64246O5538L20464
19842a90915L8372m20563j29182J78923j82295l5665L31154J03680L33255K41841
19832B68605J75879k90841m88133N903M7164o7410J31676J28255J20939k40533
19822b08496l25690k46461O4949J78333j00939k80116j12932K55323J38957M06015
19812b31057K36929j71662m4171J39676k35042j55913J37647J00511K20789m2496
19802d4789l17600j38011j18097j38247m3686m266K47112K20600j12494q279j04837
19791e62594j25691M05491K18699j47344l52392L8239M76913K42309j26405j00797
$$ y = [-230062, -546149, -816225, -887425, -602214, -587198, -654369, -820569, -695337, -552773, -727184, -825229, -531134, -271242, -233434, -512127, -614824, -412671, -576917, -511379, -190915, -152543, -573106, -702288, -523365, -705660, -741325, -410171, -306491, 26764, 268605, 444484, 153643, -334490, -328587, -281423, -348833, -217157, -88902, 32037, -208496, -534186, -780647, -715698, -537365, -638304, -918420, -1031352, -776029, -637072, -231057, 5872, -165790, -209961, -70285, -305327, -461240, -323593, -223082, -2293, -44789, -362389, -500400, -618497, -756744, -800430, -804696, -557584, -336984, -449478, -457757, -562594, -688285, -282794, -64095, -211439, -563831, -525592, -48679, 193630, 67225, -33572]
19781c3572J14847j79420N4776k25241k87297J97497J39515r5243L8459J31112
19771a44567n8361k48881J8197o3145J5184l2926O2298k9252j5857Q8591L50455
19760e8264m570q2233J18324K76093q444j84419l52690r076j8770j09783R5615
19749c38217o8355k43579K83008K84886j02263j74261n824K0763k12068q1024
19739f36934j01826K41493L63339n3218k65357j15956J74747K17891J1243k58217
19729d22795n8357Q4806j40986n3643O2598o7851k27930j26955J48057r9198l65965
19718a268219J38578L84587J13138M3087R2467J05488K16875J564k32460M0122
19708c64773j220p9902R5671N8101Q5564k61184q5273J29218K7130j35500r2296
$$ y = [-33572, 81275, -98145, -43369, -268610, -555907, -358410, -218895, -314138, -275679, -144567, -202928, -451809, -433612, -496757, -481573, -514499, -452201, -481453, -497310, -408719, -58264, -62834, -145067, -26743, 249350, 240906, 56487, -296203, -305279, -324049, -433832, -338217, -406572, -650151, -367143, -82257, -184520, -358781, -364605, -343842, -555910, -636934, -738760, -497267, -133928, -187146, -452503, -568459, -393712, -175821, -164578, -422795, -481152, -396346, -537332, -590975, -528377, -596228, -824158, -951113, -803056, -902254, -1268219, -1129641, -745054, -631916, -588829, -496362, -390874, -173999, -172435, -404895, -364773, -365993, -445895, -350224, -292123, -206559, -467743, -553016, -423798, -396668, -532168, -624464]
19697f24464J58090l115M3911J89240m9129j98214q5999Q9368L5461m8369J05833
19686c87387o2465J07431j0335J69298o2404k26369Q6804j45825l3406P4044K50640
19675b39974n9489j54078j09184L66028L49767P9932k26072k09201k26302K1232
19665d07341m5986N4570o9162j22450K24859J99584j45860j61573J77154j7419
19655c13624j68936J6348J93215K06175m6131j63565k56679j81745n7200k67512
19645a039654j07737J00050K74973J78948o8621K37777L83145J56473j95236j06156
19635a86038M0893N4237Q8476j04343l47903Q5953K8504q6342p5425K0956N2532
19624d28500M2377L80503O5800P3797J83719J69713m6700n04211k68243P1595
$$ y = [-624464, -466374, -469489, -425578, -236338, -285467, -483681, -569680, -480312, -444851, -493220, -387387, -449852, -342421, -352756, -183458, -245862, -472231, -385427, -531252, -564658, -490614, -239974, -299463, -453541, -562725, -196697, 153070, 233002, 6930, -202271, -428573, -407341, -453327, -398757, -467919, -590369, -365510, -165926, -311786, -473359, -296205, -313624, -482560, -466212, -272997, -66822, -112953, -276518, -533197, -714942, -772142, -1039654, -1147391, -1047341, -772368, -593420, -662041, -424264, -41119, 115354, -79882, -186038, -145145, -90908, -2432, -106775, -454678, -368725, -340221, -426563, -501988, -481032, -428500, -386123, -5620, 60180, 133977, 317696, 487409, 440709, -63502, -331745, -260150]
19614b60150j35668j96704K14087Q8480N947R0792j91952j69317L47794j68661
19604c75352k940K15019j6511O5764j55399k42184k45110R1045K05271J54542
19594c05855Q269p3414k82052J96089J05212O2930j0577j53109o2984Q4607J3506
19583d17378J528Q7378K20640L8578j77034l30718k11437j96889N38865L04841
19573a41626j71371k04397J53554L8536J48477M3933O6856l06628q9070L87869
19563g3867K57483l1042l02531K3724k99013j65681M45120P7298k46763k12940
19553e28212j51365K19700J50262O4779k99427k02323J69571J62048L05873l27577
19543d36671m4734K48322R5780k87385l6636J92677K18949K64972j84453K7210
$$ y = [-260150, -395818, -592522, -378435, -289955, -284008, -193216, -385168, -554485, -206691, -375352, -378292, -163273, -179784, -114020, -269419, -511603, -756713, -665668, -460397, -305855, -297586, -371000, -653052, -456963, -351751, -288821, -299398, -452507, -515491, -430884, -417378, -415850, -328472, -107832, -69254, -246288, -577006, -788443, -985332, -446467, -141626, -312997, -517394, -363840, -325304, -176827, -132894, -66038, -372666, -461736, -73867, 183616, 152574, -149957, -126233, -425246, -590927, -145807, -68509, -315272, -528212, -679577, -459877, -309615, -244836, -544263, -746586, -577015, -414967, -109094, -436671, -481405, -233083, -137303, -424688, -461324, -268647, -49698, 215274, 30821, 58031]
19533E8031o0104l3690l4183k86679o1880K6033K14329j7160O6115K6982k00881
19522c03087L8628J86802K85912j06190j08207O7600o876J76210l96108O750K1096
19511a37470j76171J70538J42337Q2036l29382j67922J24651J40385m8456p9813
19501b79267l09107N0211M9445j08006j2760j72311L86041K24025m5224O0888
19491a56065Q6361j8561R6315L5047k46518j12547K8697k4768M744j09011J15588
19480c00718j6605j47732m44293q1517L34102Q6506p8204m4005J17993J62410
19470d12063L38999j25753l07055k2323O0586K40190R3516j33661m0228Q3295
19460b24497N4567J43556J00979Q9381P604j84220j1007o220j0697j6704j1989
$$ y = [58031, -2073, -35763, -69946, -356625, -418505, -392472, -178143, -195303, -129188, -102206, -303087, -264459, -77657, 208255, 102065, -6142, 61458, 54582, 230792, -165316, -158566, -137470, -313641, -143103, -766, 81270, -248112, -416034, -291383, -150998, -199454, -279267, -588374, -538163, -488718, -596724, -609484, -781795, -395754, -171729, -216953, -156065, -69704, -88265, 8050, 43097, -203421, -315968, -287271, -312039, -307295, -416306, -300718, -317323, -465055, -909348, -990865, -656763, -570257, -648461, -692466, -574473, -412063, -73064, -198817, -505872, -528195, -467609, -227419, -133903, -267564, -307792, -224497, -169930, -26374, 74605, 163986, 171590, -12630, -23637, -29857, -40554, -57258, -69247]
19449f9247K44881m32011k15737r1033m5746K53567R3727K75690K42154l363l77868
19438a24986K1542o7150Q7001K46876k00740j74482j32198K069j59857O1952J14906
19427c25067J55268n0252J73933J55718J14569r1610j47265n9795j21506l10452
19417e06459M6140P8459K59965Q0558J7021Q2293n8314k60220L3639k6781r7695
19406c51394K17032M00433k00499j61541m6192k31011l93460N0079J36107p0696
19396f51142J46010J55995M18507n9313k83846J7130P6543N693k0949K89479K15521
19385C09628k90794k15957J20429J12254q9656j24345m1878J00483k290j33335
19375b55461J48939N0927j21654k21051J89855J36827k17289J59674Q7720p7010
$$ y = [-69247, 175634, -256377, -472114, -563147, -608893, -355326, -261599, 14091, 256245, 252882, -124986, -103444, -170594, -83593, 163283, -37457, -211939, -344137, -342068, -501925, -439973, -325067, -169799, -220051, -46118, 109600, 224169, 132559, -14706, -74501, -196007, -506459, -460319, -381860, -121895, -41337, -24316, 57977, -337, -260557, -226918, -253699, -351394, -134362, 266071, 65572, -95969, -142161, -373172, -766632, -716553, -580446, -651142, -505132, -349137, 69370, 10057, -273789, -256659, -180116, -174423, -195372, 94107, 309628, 18834, -197123, -76694, 35560, -54096, -178441, -220319, -119836, -122126, -255461, -106522, -55595, -177249, -398300, -208445, -71618, -288907, -129233, -41513, -118523]
19365a18523p6078J32630j17800q895J36686k3934J68535k59185k90530N7791
19355c99303P4033N8544L3479J36948j54891r5738j27018q1417j46355K59094
19345d42624K85360q0395q7855o8788J94166r4196p1763l8874r5590o4813J46027
19334d19345M41731n2501k65638k6878K528l6796j40565j58414J27584K63951
19324b64343Q8313k81921J24606J51451O2329m4728k22178m7666J30836L0574
19314b72727J61087n953P1q1923j54397j60924j27045o6424l4538q4633K92838
19303e34568L82705J40402j91534r2963R6091m5660r0967k9070o8005k9494K32179
19292b30884j14479L3107K86307L43023j4432J23299m66228p8804J15017K7639
$$ y = [-118523, -194601, -61971, -179771, -188666, -51980, -75914, 92621, -166564, -457094, -399303, -325270, -266726, -233247, -96299, -251190, -346928, -473946, -555363, -701718, -442624, -157264, -237659, -325514, -394302, -200136, -294332, -366095, -404969, -500559, -565372, -419345, 22386, -30115, -295753, -322631, -320103, -356899, -497464, -655878, -528294, -264343, -176030, -457951, -333345, -181894, -119565, -164293, -386471, -434137, -303301, -272727, -111640, -117593, -117522, -199445, -353842, -514766, -641811, -708235, -742773, -827406, -534568, -151863, -11461, -202995, -295958, -199867, -245527, -336494, -365564, -433569, -463063, -230884, -345363, -312256, -25949, 317074, 302642, 425941, -40287, -119091, -4074, 23565]
19282B3565p2576P6748J2019O2944k13334k0121j61167j38966M9696O8479j08259
19271d20972k0797K8335K01977K56090J30773P8066n7635k03760k40049j18295
19261c66267J40247j47847P1715R6211q6122K33393J17955j80034R1353j03756
19251a33152k8207p737J97215n9743j14857K0303o3934j98500n0273J31751j22123
19240d29257Q0069J8089K15818j25934j42661m8083L6064L6523j13989J14144
19230c59217J39859J28452L7161j26168k4663P8810j92351j63361O0190J41834
19220b79454j8024J9626J2981R6906K78932j3702j24777j29454j53913j24469
19210d35348J64472J69706J96414q2340p1763o0535n8286K06198l2304j05838
$$ y = [23565, -49011, 27737, 39756, 102700, -110634, -130755, -291922, -430888, -381192, -312713, -420972, -441769, -413434, -211457, 44633, 175406, 253472, 195837, -7923, -247972, -366267, -226020, -373867, -302152, -205941, -292063, -58670, 59285, -120749, -29396, -133152, -161359, -169096, 28119, -31624, -146481, -126178, -190112, -388612, -438885, -307134, -429257, -349188, -331099, -115281, -241215, -383876, -431959, -395895, -359372, -473361, -359217, -219358, -90906, -53745, -179913, -204576, -125766, -318117, -481478, -421288, -279454, -297478, -277852, -264871, -167965, 110967, 97265, -27512, -156966, -310879, -435348, -270876, -101170, 95244, 12904, -58859, -119394, -177680, 28518, -3786, -109624]
19200a09624l084L93858K21116J38834j20130k18242n657J24107k01457j98101
19190B1620K2899j50610J9497J46943N5153l10699j81607l7025j26265K48645
19180b91449L45929o6858j92964m90264j54688M01811R0681l0383k0494j42707
19170e51386K12270n1136k38098L0607k24483O4400R1040J32908Q9333k3311R1225
19159c76631L52144J73478K6514J56108K94507k07320L6010j47162m62637j74996
19149c29985K22734j03700j13893O0947K42787J89160m52457l77454M4038J65518
19139d52305L70957Q2279R62m1651j21744k10821j37996j07997K67305R2964m7517
19128c05564j5016J93514P1004L2267K9893k5932k88872O2320K83036M1913R9092
$$ y = [-109624, -112708, 281150, 502266, 641100, 520970, 302728, 297071, 421178, 219721, 21620, 44519, -106091, -86594, 60349, 115502, -195197, -376804, -413829, -540094, -291449, 54480, -12378, -205342, -695606, -850294, -448483, -357802, -388185, -408679, -551386, -339116, -390252, -628350, -597743, -822226, -757826, -666786, -533878, -444545, -467856, -376631, -24487, 148991, 175505, 331613, 626120, 418800, 454810, 307648, -154989, -329985, -107251, -210951, -324844, -263897, -21110, 168050, -284407, -661861, -617823, -452305, -81348, 931, 1893, -39758, -161502, -372323, -510319, -618316, -351011, -258047, -305564, -320580, -127066, -56062, -23795, 6098, -19834, -308706, -246386, 36650, 78563, 177655]
19117A77655P5630k98300l57349M4942K31523J47307J22877l58476q5107J00149
19107a99149O136q965n9689O5330L44661Q5235J12766J82693j32572j25600l7687
19096B33159n5491k97968j16075l6650R8286K12934k89978O409K79356O3633J89754
19085B87369j85440k05921K71609M4648q5375o1293j44391j87878k46071l0965
19075e43708K36986J50219L27060Q8544j84550J12357J46174J79073j88589m23653
19065a00087j29273J67672P6601q9565j63210K0862M8794O2234j75477j73169
19055d54618k8852J13043j4603L98954l3675j35168J19788k0131j39471K49503
19045E4770n4542o1887J24878J06922l88403k99962P6872k10474j815O0407o0140
$$ y = [177655, 253285, -45015, -402364, -357422, -125899, 21408, 144285, -214191, -299298, -199149, -193013, -201978, -261667, -196337, 148324, 233559, 346325, 529018, 396446, 270846, 233159, 177668, -120300, -236375, -273025, -174739, 38195, -251783, -245374, 33982, 97615, 287369, 101929, -103992, 167617, 212265, 126890, 65597, -78794, -266672, -512743, -543708, -306722, -156503, 170557, 259101, 74551, 186908, 333082, 512155, 323566, -100087, -229360, -61688, 14913, -74652, -237862, -217000, -168206, -105972, -281449, -454618, -483470, -370427, -385030, 13924, -19751, -154919, -35131, -55262, -194733, 54770, 228, -61659, 63219, 170141, -218262, -518224, -441352, -651826, -653641, -593234, -653374]
19034f53374J24476J20675J88965L46553N7771j77930m7025Q6157j03775p7132
19024a34639j48264O15J23462L42928J88893k92483k36580j58947j54053O0349
19014d08719J41201J49361K01561j14822k83070k03184J89435J55827l06015J35682
19004c42743j09430k3337p912r6340J9615K88946L19696J05607k76021o5659Q621
18993a78957N5258o0491j50203k6659J49264J17742n0762R5464N767k18176l7987
18982b99740k8010k6777R2658j48389j33658k33407K02741J12964K7350R662J39478
18971b85128j28089m8813j49978J79444J76351J06236L47549k42425l61654l1422
18961d37929j16185l2472J66645K38466l8364k32117P5933M7582Q0839O789j44919
$$ y = [-653374, -528898, -408223, -219258, 127295, 185066, 7136, -39889, 46268, -57507, -134639, -282903, -282288, -158826, 184102, 372995, 80512, -156068, -315015, -469068, -408719, -267518, -118157, 83404, -31418, -314488, -517672, -328237, -172410, -478425, -342743, -452173, -475510, -483422, -579762, -560147, -271201, 48495, 154102, -121919, -187578, -178957, -123699, -184190, -334393, -361052, -211788, -94046, -144808, -49344, -43577, -261753, -299740, -327750, -354527, -261869, -410258, -543916, -777323, -574582, -461618, -434268, -424606, -285128, -413217, -462030, -612008, -432564, -256213, -149977, 197572, -44853, -406507, -437929, -554114, -586586, -419941, -181475, -219839, -451956, -376023, -328441, -247602, -240813, -385732]
18950c85732l10596j44508K04891J27518L27893L28261M3357j59155j82394R0282
18940f0183l6207P3176Q2155J61921J99813k44201n06115m17634o32P8849R5219
18929e73839M797K00718P5977n9017o301L54096N7621j31448l86649J61203L40086
18918C7244J35926k69162l75363j84883K5792K99918R2000j40177j09302J46664
18908c41343j1867o3924J55434J66856P9924N2630K8058l47131j97961K95954
18898a83370K40590J01806k60050j29006O7693j93508J99149l5354p8516n5188
18888c25754J62761L50229k29294J4649M5039k11258j30730r992K82740J44137
18878I2527J70001J24215j20547k56334p0127J03755R414j60432j21272P0745
$$ y = [-385732, -696328, -840836, -635945, -508427, -180534, 147727, 191084, 31929, -150465, -60183, -96390, -23214, 58941, 220862, 420675, 176474, -329641, -747275, -747907, -669058, -573839, -569042, -368324, -292347, -351364, -357665, -3569, 54052, -77396, -464045, -302842, 37244, 173170, -95992, -471355, -656238, -630446, -330528, -238528, -378705, -488007, -341343, -353210, -417134, -261700, -94844, -14920, 37710, 65768, -281363, -479324, -183370, 57220, 159026, -101024, -230030, -162337, -355845, -156696, -192050, -270566, -325754, -162993, 187236, -42058, -27409, 17630, -193628, -324358, -334350, -51610, 92527, 262528, 386743, 266196, 9862, -60265, 43490, 52904, -107528, -228800, -158055]
18868a58055J16838J65747k56324q5765M7936K15694Q5179k73097j50044J66211
18858a25680k75356N5556K58081k294p6108K17278J6085j39796l7990j78983o3572
18847c52779m6451O9258m4976j72738Q0171k2530K81867J3271K09544K58209o5218
18836B07628j18932k03821l86975j03958K21943p8261o4855m9616K45455O2945
18826b68447K65222M7213l49695j56962J34819O2924K02512J72924J64740q3953
18816A91297M755J10576j25012J7944m1458l27491o5030J25159k56933k19998
18806e86191J81395K36012O0929j24408J24041J76307K7535n3471l87537k20326
18796e65714J80871J90263m8520p3907r8483p8287j13162J56951M4503j2683K1287
$$ y = [-158055, -41217, 124530, -131794, -217559, -169623, 46071, 131250, -141847, -291891, -125680, -401036, -345480, -87399, -89693, -165801, 51477, 67562, -72234, -110224, -289207, -352779, -399230, -329972, -374948, -547686, -467515, -490045, -208178, -194907, 14637, 272846, 207628, 88696, -115125, -502100, -606058, -384115, -462376, -527231, -576847, -331392, -268447, -3225, 43988, -305707, -462669, -327850, -264926, -62414, 110510, 275250, 191297, 196052, 306628, 181616, 199560, 158102, -169389, -234419, -109260, -366193, -586191, -404796, -168784, -107855, -232263, -108222, 68085, 95620, 42149, -345388, -565714, -384843, -194580, -243100, -317007, -415490, -493777, -606939, -449988, -405485, -418168, -396881]
18785c96881K32713J20360k12721O5541j04675p4622k31215k8311R7849K04263
18775c27699j05607k82683L52061K28263k0379j98897J5643K37160Q7578j18427
18765a32987J59902q5208L0988j30400O8393N1757l7421j84851Q8583K9659L45785
18754B04200N989j9186n03694k77060k39107J76379O9183O7977o9637K15699J27295
18743b41962N6437m62q2614j80051j11741J94594K8086j77931l8130J36366L21160
18732i6248O4786q5385j99651R8686K29181L37618J85351N827j26733k69207O6051
18721B10276K2894q1137j34423p1578J2812J86926m1318M9922j65699j84884Q676
18710a87533J17092o7427O259K37679k7734n6248l50139k2590K70214M3049j43523
$$ y = [-396881, -164168, -43808, -256529, -190988, -295663, -370285, -601500, -629811, -531962, -327699, -433306, -715989, -363928, -135665, -156044, -354941, -339298, -102138, -14560, -132987, 26915, -58293, -27305, -157705, -89312, -37555, -74976, -259827, -171244, -141585, 204200, 210189, 191003, -312691, -589751, -828858, -652479, -583296, -515319, -584956, -369257, -241962, -185525, -185987, -268601, -448652, -560393, -365799, -337713, -515644, -553774, -417408, -96248, -31462, -116847, -316498, -217812, 11369, 348987, 534338, 540165, 413432, 144225, 210276, 233170, 152033, 17610, -53968, -41156, 145770, 104452, 154374, -11325, -196209, -187533, -70441, -137868, -131609, 106070, 78336, 22088, -328051, -350641, -80427, -37378, -180901]
18699a80901q4663J04288k21637Q5648K37426k60724m44032K54699K39367J78537
18689i1992P2166R6922O3664P0257Q3245k01056k14778k45291L13773K14783J4052
18678A75745j13494j43760k45104L62565J84139j61289Q193J85344n2445j56363
18668D3531N7256j2135J18422J00126k18492k07800l18640R0435J26670J10018
18658a10609J71231J79648L6229L6226P544p1726j39630k22315k90406j38053
18648e41861q0455J5861M64423K67726j62692j39587n9455K26144J69037J14408
18638B73549j29422l24810j17632k50045k85957j73293J18280K6902K75822M88236
18628i8370R6545r9848M41475J23533m99685P637Q2996R2599k20075O0337o1035
$$ y = [-180901, -265564, -161276, -382913, -297265, -59839, -320563, -764595, -509896, -270529, -91992, -19826, 77096, 140760, 211017, 294262, 93206, -121572, -366863, -53090, 161693, 175745, 62251, -81509, -326613, 35952, 220091, 58802, 66995, 252339, 199894, 43531, 100787, 88652, 207074, 307200, 88708, -119092, -437732, -347297, -220627, -110609, 60622, 240270, 276499, 312725, 320269, 248543, 108913, -113402, -403808, -541861, -622316, -606455, -142032, 125694, -36998, -176585, -236040, -9896, 159141, 273549, 144127, -180683, -298315, -548360, -834317, -1007610, -889330, -862428, -586606, -98370, -1825, -101673, 339802, 463335, -36350, -28713, 54283, 146882, -73193, -12856, -73891]
18617g3891P2500R5801J96771J13905j27301k13906J05465Q4036j04472l03546
18607a54638N7381J40480Q9776l11123n231P6490K0497J67311r836k2793k58024
18596b09710l73358R5190K76544Q3064k7600K45396k19188k04625M3080J48083
18586a43124q4349l4883j3335o0284o2466M6186J75864N4248J76275Q743N5609
18575A18484O4099l1681J15496k40616k38492r5619J1461Q3421N6191m6467o0994
18564b64717j04627K65604j10387M5630J49684q7343k17330M2627J38971J40850
18554a038n9954Q6332J64817n6526J04516K7872m00863L00442N4525j65602M7270
18543A01791q8025k30911j38808J12007P9193O1663j25543L4693l10941m6440
$$ y = [-73891, -1391, 94410, 291181, 405086, 277785, 63879, 169344, 253380, 148908, -154638, -97257, 43223, 132999, -178124, -183355, -106865, -86368, 80943, 71107, 48314, -209710, -583068, -487878, -211334, -128270, -155870, 89526, -129662, -334287, -291207, -143124, -227473, -262356, -275691, -335975, -398441, -352255, -176391, -122143, 54132, 62875, 118484, 182583, 150902, 266398, 25782, -212710, -308329, -296868, -213447, -157256, -203723, -264717, -369344, -103740, -214127, -168497, -18813, -106156, -323486, -280859, -141888, -1038, -60992, 25340, 190157, 133631, 238147, 266019, -134844, 165598, 220123, 54521, 101791, 13766, -217145, -355953, -243946, -164753, -103090, -228633, -193940, -504881, -551321]
18533e51321J20514N1150J16508J45657L4877j02967O0480o1679K12596J09946
18523A35761j16575j17177J01089q6015k31241k85248K4496J59220J54129M37400
18513A75839J20358q7137J88937l5620J09064k05021k20954o0985k69505j82152
18503d67176j7024Q0406J17599m805m155k6317j6835L71618K82895j00207k66970
18492e0971j00275k5653J47931J52499l12606k60867J66106N6256j29079K2369
18482c34290J08175L40392j25908j36414n3076j23811J25586K08422J05523r4620
18472A9979j11144j67893k2417K03990J12914o2128O9210q6788l85662j33151
18462e63090K16118Q9110o3274l5906K45727J33709o6931p1681l0833J9923K85398
$$ y = [-551321, -430807, -379657, -263149, -117492, -82615, -185582, -125102, -186781, 25815, 135761, 19186, -97991, 3098, -82917, -314158, -599406, -574910, -415690, -261561, 175839, 296197, 209060, 397997, 362377, 471441, 266420, 45466, -15519, -285024, -467176, -484200, -403794, -286195, -291000, -295155, -321472, -338307, 33311, 316206, 215999, -50971, -151246, -176899, -28968, 123531, -189075, -449942, -283836, -227580, -356659, -334290, -226115, 114277, -11631, -148045, -201121, -324932, -199346, 9076, 114599, 19979, -91165, -259058, -281475, -77485, 35429, -26699, 42511, -44277, -429939, -563090, -346972, -257862, -321136, -357042, -111315, 22394, -44537, -116218, -147051, -127128, 158270]
18451A58270j43525r0911M8924J76063K08123j45942j9305q4348J6922k15737
18441i1466j87730j02026p1387J6665L84289K25772j03782m1672J01757j96250
18431f5830o1626K31513L65958k66k36178j25785Q0692N1894j781j90271j1817
18420C6503k64755q3389l5267R2606J35171L40551J60017l4204K72116j4013n11833
18409I3503k44289J2346o7598K31928M7754j08441k05555L2921K683M822j46232
18398c46158p0401K13489P8899K11186J52255K71870L7376j28128j38154Q1900
18388C64134J03830K13740K8879m10253k66148O5474L51373l96478l80013Q3933
18378b41529K3641J79514K8632k79453J37184K77094L20156M2442J03123j29975
$$ y = [158270, 14745, -76166, -27242, 148821, 356944, 211002, 191697, 107349, 124271, -91466, -279196, -381222, -452609, -435944, -51655, 174117, 70335, 28663, 130420, -65830, -127456, 104057, 470015, 469749, 233571, 107786, 188478, 240372, 238591, 48320, 36503, -228252, -311641, -346908, -254302, -119131, 221420, 381437, 347233, 619349, 605336, 93503, -150786, -138440, -206038, 25890, 73644, -34797, -240352, -207431, -204748, -199926, -346158, -416559, -203070, -124171, 87015, 239270, 511140, 548516, 420388, 282234, 364134, 467964, 681704, 710583, 300330, 34182, 99656, 451029, 54551, -325462, -241529, -217888, -38374, -9742, -289195, -152011, 125083, 445239, 487681, 590804, 460829]
18368D60829l4599j20390l52535K9947K50299k16948o8919J25548k44918j94168
18358c65854J87559L12068j12731j80822j42130J62433L75214M6865m5567j30109
18348A06926K14325R1371j93801R505J46321K69503J05911k63184m20257j34296
18338f7676j90155j64797j67116O2383M00381R5957J24556L9039O0769M1968Q713
18327B44022j46835J5870p8737j38668j89348K915P7914K44578o9586k34229j89463
18316d61567J07150N68322P0308j11385K07952J95213M1520l4679k51515o1198
18306B70121J11819j51633k78455K0801p8453j82540q7874J99110M9937k35913
18296c63080j35P9348j0996k8773L659l5290J24824O9094q5916K37984l5478l22944
$$ y = [460829, 426230, 305840, -46695, -16748, 233551, 16603, -52316, 73232, -171686, -365854, -178295, 133773, 21042, -159780, -301910, -139477, 235737, 282602, 237035, 106926, 321251, 412622, 218821, 228326, 374647, 644150, 750061, 486877, 66620, -67676, -257831, -422628, -589744, -527361, -126980, -31023, 93533, 132572, 193341, 235309, 244022, 97187, 113057, 34320, -104348, -293696, -290781, -212867, 31711, -37875, -272104, -461567, -354417, 213905, 284213, 172828, 380780, 575993, 617513, 582834, 331319, 270121, 381940, 230307, -48148, -27347, -105800, -288340, -376214, -177104, -127167, -363080, -363215, -283867, -294863, -323636, -319977, -355267, -230443, -161349, -247265, -9281, -44759, -367703]
18284c67703O5580p929K70173K24476R9291P9186J15035K7166j95772o2716R7040
18273C43827l2587m0797R0650J76329j91208k13955j53221J11126Q1911J2442
18263A84517J09818k2833n6437r3950k59539r3276r2431J70937J44607j0683J56765
18252A37495J0430j46786l9044J0077n4065j33126L9436j00385r9545M54223J78798
18241B57508O9158n4217j40556P8550j96627l5592J76372L8205l4424m7416p5605
18230C5356j84776q2296K83804j7721k85940p250k9730K7197K31067j56580m748
18219a91617O7287P2826L26133l7003O8453r0563k18752J18221L13070N2294j9561
18208D60788q7798k51185m3293K7973J7029J96472k20378l6566L0039j33722j71855
$$ y = [-367703, -302123, -310052, -39879, 184597, 283888, 363074, 478109, 505275, 309503, 246787, 343827, 311240, 270443, 361093, 537422, 346214, 132259, -20962, 90164, 172075, 184517, 294335, 271502, 215065, 121115, -138424, -231700, -324131, -153194, -8587, -19270, 137495, 147925, 1139, -37905, -27828, -81893, -215019, -175583, -275968, -375513, 78710, 257508, 326666, 272449, 131893, 210443, 13816, -21776, 154596, 192801, 158377, 110961, 35356, -149420, -231716, 52088, 34367, -251573, -258823, -288553, -261356, -30289, -186869, -191617, -124330, -51504, 274629, 237626, 306079, 215516, -3236, 114985, 428055, 480349, 460788, 372990, 121805, 78512, 106485, 123514, 319986, 99608, 63042, 93081, -40641, -212496]
18197b12496j08180K38888K67853L3941j1116m914k17188J2835k5541p8633j41203
18186b45754M2141j4334L97333K38556J84626j94731j54545k70773j4181j74147
18176b05809K02833J38172k1993m2202k8748P275J6914R8345j309J12737J88727
18165D64942K54193n0446k697J41572M0662l10625k45853O4845q3735J09320J2924
18154C95102j45327L4278J128J8781k23325l9591j41545O6201N9644J98799j08353
18143A15792l6833l3347K2087l8806l35755k74215R0838M38549J96895j78921
18133c3716k78148K02004K59196l04421n3729K13865K96105p2723m34860r2422
18123b98849L20708K31662n7068l2212K2583j3551j2034J53478q28q0138k02172
$$ y = [-212496, -320676, -81788, 186065, 220006, 208890, 203976, -13212, -377, -25918, -104551, -245754, -203613, -217947, 179386, 417942, 602568, 407837, 253292, -17481, -31662, -205809, -2976, 135196, 113203, 71001, 42253, 49528, 66442, 164787, 163478, 276215, 464942, 719135, 668689, 665992, 807564, 848226, 537601, 291748, 356593, 272858, 382178, 395102, 249775, 284053, 285181, 303962, 80637, 41046, -100499, -34298, 25346, 224145, 115792, 78959, 45612, 67699, 28893, -306862, -581077, -490239, -51690, 145205, -33716, -311864, -109860, 149336, -155085, -208814, 5051, 301156, 228433, -206427, -298849, 21859, 253521, 196453, 164241, 186824, 173273, 161239, 314717, 313889, 233751, 31579]
18112C1579r0829J68607J28210J4615m1226j36103j96789L0457J96037J43474
18102B48032r8628m29839L1481j661j12129O1981J05622l7430M2567k24445J00335
18091c14114K75990O0374P0481j69951j06214j61699R0997J15929k3791j3317
18081a75315K40657J10457k0900k10628P8835K93676M55115K11757l43077l53267
18071B87310k08876q6197K22500n2911m90740j09830L10961J57039j59413j37428
18061b67585L38095j30355J5417J08616L9182J27072M4641J4497K21112J26084
18051F36776R9688j23342k00481j54994j40545j02257l05238R455K85247J80902
18041A85211J62333N9294K43207k5943n1352j27528J4046L4479k4288o536j75172
$$ y = [31579, -59250, 109357, 237567, 252182, 210956, 74853, -121936, -91479, 104558, 248032, 149404, -280435, -248954, -250615, -362744, -300763, -195141, -232571, -190004, -414449, -314114, -38124, 22250, 92731, -77220, -183434, -345133, -254136, -138207, -161998, -175315, 65342, 175799, 154899, -55729, 23106, 316782, 771897, 983654, 640577, 287310, 78434, -7763, 214737, 161826, -328914, -438744, -127783, 29256, -130157, -267585, 70510, -59845, -44428, 64188, 103370, 230442, 275083, 289580, 510692, 636776, 736464, 613122, 412641, 257647, 117102, 14845, -290393, -280938, 4309, 185211, 347544, 406838, 650045, 624102, 572750, 445222, 459268, 493747, 469459, 462923, 287751]
18030B87751l501M3568J32486q7356l40964k11359M8730K6163k6350k8112J31542
18019b7402K19579K45830m7047n7127k81200J652J06368K47825K53996j97957
18009D64517m75908L28501k1331p0010r3886l28651j68910K21755K16256J77158
17999B49491j64154o0822l94846r5573J60402O5963M9369J12476k7238j88409
17989b93341O8767K1585K07548K034k02696J59452L15342O1879J07638J71433
17979F19641r4176j38508k82442k7011k37317M3559Q8379j51303K8805J31935
17969a8438q9789J63577R115k20182r9259J77243K58535l652L25484M9846l48269
17958B04211o0322J42310n3223K2331r3934O2294q870p0295l07519j41329O9104
$$ y = [287751, 284250, 327818, 460304, 372948, 31984, -179375, -130645, -104482, -130832, -158944, -27402, 192177, 438007, 390960, 333833, 52633, 54285, 160653, 408478, 662474, 464517, -11391, 317110, 295779, 225769, 131883, -196768, -365678, -143923, 72333, 249491, 85337, 24515, -370331, -465904, -305502, -239539, -190170, -77694, -104932, -293341, -224574, -202989, 4559, 6593, -196103, -36651, 278691, 340570, 448208, 619641, 525465, 386957, 104515, 77504, -159813, -116254, -27875, -179178, -150373, -18438, -108227, 55350, 64465, -155717, -254976, -77733, 180802, 177150, 502634, 552480, 204211, 143889, 286199, 232976, 255307, 161373, 223667, 214797, 144502, -163017, -304346, -235242]
17947b35242P0057J70885L44594J88595k13925k21763k52152k79577J98762K15215
17937a4551M08694Q7752o7483l69809j66957J28863Q4289L9041K2894L42656K05083
17926G00472j8151j91537j94422J91856n1845J38977j29339l64349J16899P0010
17916B68571j70151j43818m0789O4844j38423R994K32024R5937q1683L8071M0087
17905A74664J64288j40652k23337J48706k1447O217j4371K56520K26047q4610
17895D92025k6438k4347j37230k28065l2336K1426R0697j63566m7829Q3304j81379
17884a53738K65567M42773l333k16541j24621J54013K12200J35686l59399j94084
17874A58523J39242K15577k72708j63206J42355J23542n2887M2887j86306k0512
$$ y = [-235242, -165185, 5700, 350294, 538889, 324964, 103201, -148951, -428528, -229766, -14551, 394143, 481895, 414412, 44603, -122354, 6509, 90798, 129839, 152733, 495389, 700472, 682321, 490784, 296362, 488218, 436373, 575350, 446011, 81662, 198561, 268571, 98420, -45398, -86187, -21343, -159766, -149772, 82252, 178189, 96506, 134577, 174664, 338952, 198300, -25037, 123669, 102222, 108439, 94068, 350588, 576635, 492025, 465587, 441240, 304010, 75945, 43609, 65035, 155732, -7834, -55663, 27641, -153738, 111829, 554602, 551269, 334728, 210107, 364120, 576320, 712006, 352607, 158523, 297765, 513342, 240634, 77428, 219783, 343325, 290438, 333325, 147019, 126507]
17864A26507N4123M7078p0129j4206j30851m9085J2037J55216K51625j29766r4394
17853A58155R2022K95589j6396o2220M3190k13526R8821M50057j0952n5387J2921
17842G92274o8615j15964q780p6252m9326J21234N4326J30505L1201k26161m43657
17831A40785k06351J5259K21225R260M7888J35239J18614r7948j8111J26821K05976
17820F98657j78566l01317J41457J37291n2936k80400k26251k92347J20546J91780
17810d2086R9004N5992J60511J13678k60197N6206J98446R9471J5961l15643r7760
17799H3583J83665J78227K21977l79113l67727Q6832J58821q442J51107j6630
17789B92300k08391m9914J08911J66698j00329j32539k53172j5196R0884K26015
$$ y = [126507, 180630, 227708, 157579, 143373, 12522, -36563, -24526, 130690, 382315, 252549, 158155, 250177, 545766, 529370, 467150, 510340, 296814, 395635, 845692, 834740, 779353, 792274, 723659, 607695, 598915, 522663, 473337, 594571, 648897, 779402, 810603, 584442, 140785, -65566, -50307, 170918, 180178, 228066, 363305, 481919, 383971, 365860, 492681, 698657, 520091, 218774, 360231, 497522, 444586, 164186, -62065, -354412, -233866, -42086, 56918, 112910, 273421, 387099, 126902, 183108, 381554, 481025, 496986, 181343, 83583, 267248, 445475, 667452, 288339, -79388, 7444, 166265, 157823, 308930, 292300, 83909, 33995, 142906, 309604, 209275, 76736, -176436, -191632, -100748, 125267]
17779A25267j616r9675R4983j76583k7014K01166L642p6628j58435L2744J87738
17768A05589r1251o2994J33161J61110j19325p5597J23804L87075O702j78338
17758C89936k18364j50910J37907K41821j80844k71271J42562K7335m4958m7210
17748B6004L51790L4574k05803K7849q4284m12376o2251L59258J95303k37138
17738g074j54132L6808k29579j54256J97792M70247J66432J79824o7633j94806
17728B43623n5996j94271K09559K11641K81957m2938l37083k9480J48773r463
17718D26322j84570j28445L52640P1193j09731L7775l06810j20696J34601r4003
17708G8276m1282q7157j39167J21224K48225O1712j28814j7568J61843L21697
$$ y = [125267, 123651, 23976, 118959, -57624, -84638, 116528, 120170, 43542, -114893, -82149, 105589, 14338, -48656, 84505, 245615, 126290, 50693, 174497, 561572, 568274, 389936, 171572, 20662, 158569, 400390, 219546, -51725, 90837, 118172, 73214, 26004, 377794, 412368, 206565, 234414, 150130, -262246, -324497, 34761, 230064, -7074, -161206, -124398, -353977, -508233, -310441, 159806, 326238, 506062, 438429, 243623, 187627, -6644, 202915, 414556, 696513, 653575, 316492, 287012, 435785, 426322, 241752, 113307, 465947, 537140, 427409, 465184, 158374, 37678, 172279, 78276, 36994, -50163, -189330, -68106, 180119, 241831, 113017, 95449, 257292, 578989]
17698E78989K83481o2831M4855j57301l2614J19789k6679o2438n4160j72612p5346
17687C83133p8109n9076J19476k33733m6931P0297k54416J16929L94802L71620
17677G83992K60624J15119j19226m36329m21012p7578J33907K60880J19909j88558
17667D31728j51601P7514K84243L8999Q8145j74068k79894l9352M616l63099j72417
17656b55186M193K40091K74880L43778K50622k4688k51649m11611J10534p0336
17646B10628l42631J50196J87866J3736k72809j46667J59265K70038J20298p6756
17636B73164J26203j63583J18050r825r5105K55412J85368l26395m59960k61900
17626c58571n0334M1632J13581J29830J16479l8537r6186o0259J00335J37687
$$ y = [578989, 862470, 799639, 844494, 687193, 654579, 774368, 747689, 685251, 631091, 458479, 383133, 305024, 245948, 365424, 131691, 84760, 155057, -99359, 17570, 412372, 783992, 1044616, 1159735, 1040509, 604180, 183168, 105590, 239497, 500377, 620286, 431728, 280127, 357641, 641884, 680883, 769028, 594960, 315066, 275714, 280330, -82769, -255186, -250993, -10902, 263978, 607756, 858378, 833690, 582041, 170430, 280964, 210628, -132003, 18193, 206059, 219795, -53014, -199681, -40416, 229622, 349920, 273164, 399367, 235784, 353834, 344009, 248904, 504316, 689684, 363289, -96671, -358571, -408905, -367273, -253692, -123862, -7383, -45920, -142106, -202365, -102030, 35657]
17616C5657R0161O5186o0780j58294J43275J76123Q6971r4544p1741J20458o9395
17605B63077Q3281k66946j85216r0589P3710K24359K44698j9825k27869p7744
17595B0936J13692M0230J8712o3480k67558p047J07646K09893P8022j23746J78512
17584C05812K60972J88366K46358l21572l06841r1294p691j29265J71293K3081
17574C39219P4337J55068j18924O5860n7456M8949l4382j74273j26073J13126
17564B85451j92743p7404j09384j18975K4762K84082N0256q7852K9766J16448
17554B04407o9545l9033J02325J60726l3282J99971p6957l21732J24211M0207
17544B91298J2714R6295j52764m29885k69754N7668M20740M45248k36819k87633
$$ y = [35657, 125818, 191004, 130224, -28070, 115205, 291328, 378299, 283755, 212014, 332472, 263077, 346358, 79412, -105804, -196393, -122683, 101676, 346374, 326549, 98680, 20936, 134628, 174858, 193570, 130090, -137468, -144515, -36869, 173024, 251046, 127300, 305812, 566784, 755150, 1001508, 679936, 373095, 281801, 274110, 144845, 316138, 339219, 413556, 568624, 449700, 515560, 458104, 507053, 472671, 298398, 172325, 285451, 92708, 15304, -94080, -213055, -188293, 95789, 146045, 58193, 87959, 204407, 134862, 95829, 198154, 358880, 325598, 525569, 448612, 126880, 251091, 291298, 304012, 400307, 247543, -182342, -452096, -394428, 26312, 471560, 234741, -52892]
17534e2892P0100L44202M12122k06853m18063J64597J49651l34680o1776K35032
17524C01440M57910J07836j29116j43434J41220L89450l7923R3595K28458J28993
17514A538429j25207k62068k72188k10837l60054j22821K43129J21703k2102k2937
17504E05047j70653n8187K91252J17541N8222k31211k69824k81770p3965K19484
17494A05936p464j04188j3618M46326J72251l14513j39041K20296j51910r7216
17484A16859j16896r3532J95749O6460L6306l186Q8507J1215M3172k48749m0811
17473E5094J19596k19306K7769K58504L12769m7663j79354j53725j94504L56508
17463C35688L28027k00250J2063O6630k31147k9212J17580j43037n210o6471J91772
$$ y = [-52892, 17208, 361410, 773532, 566679, 148616, 313213, 462864, 128184, 66408, 301440, 759350, 867186, 738070, 594636, 735856, 1125306, 1087383, 1180978, 1409436, 1538429, 1413222, 1151154, 878966, 668129, 308075, 185254, 428383, 550086, 527984, 505047, 334394, 276207, 567459, 685000, 743222, 512011, 242187, -39583, -113548, 105936, 98472, -5716, -19334, 426992, 599243, 284730, 145689, 365985, 214075, 116859, -37, -93569, 102180, 168640, 204946, 201760, 290267, 301482, 344654, 95905, 55094, 174690, -44616, -16847, 241657, 554426, 506763, 327409, 173684, -20820, 335688, 663715, 463465, 475528, 542158, 311011, 281799, 399379, 256342, 251132, 184661, 376433]
17452C76433N07903K08548l69108l22587o6964R3694O9302J00470R5300m7984
17442F45007j05137j75465m3216j95398L5947N5790q8612J03438l06819j99905
17432b74370J80513M0532o1772m4932o3881K11675K28397m1329l41408k43K10985
17421D4167K47736p9743Q9005m4423j54428K4522K86015m6239p9540l9447j31649
17410A15976j8143J66853K11852K79907j05764l42917k52023j61457J42478K98508
17400C35270O1208J35922j06707r4010j31313o4032m1287r2804J7259L07113K18389
17389E45008m6795m13511r6386q7975l47377n3645K23365K24414k1846L25343
17379B50595L8312N1805j04838O6883r7231J16896k51892m45069L7551M68528
$$ y = [376433, 884336, 1092884, 723776, 401189, 334225, 427919, 497221, 597691, 692991, 645007, 539870, 364405, 321189, 125791, 161738, 217528, 128916, 232354, -74465, -274370, -93857, -53325, -115097, -160029, -223910, -12235, 216162, 174833, -166575, -166818, 44167, 291903, 212160, 301165, 256742, 102314, 126836, 412851, 366612, 287072, 247625, 115976, 97833, 264686, 476538, 756445, 650681, 307764, 55741, -105716, 36762, 335270, 396478, 532400, 425693, 331683, 200370, 136338, 95051, 2247, 19506, 326619, 545008, 498213, 84702, -11684, -99659, -447036, -500681, -277316, -52902, -74748, 250595, 288907, 340712, 235874, 302757, 205526, 322422, 70530, -374539, -336988, 131540]
17369A31540q71j42370k8968L8133M4893J02557j86448m1845n7248J67305J63982
17358A90660J62192J10656J58203j80171j02011j43460j86519o4021J99139L0990
17348A75658p6738K57847m347m8297k9134J29276l04223r3219J57857J81347J46080
17337D92107r4260j51141j73229J69988J98864Q8710P1919k08898Q3843M2838
17327E20741Q3518p5373l47550j32752R7956j69326o9518J42096J74250q6909
17317A37133J04155K55434J66911J63090J8341j16388j61410k15927L31263J21000
17307H03602j19315k18641M3301p0066l05662j7848K83205K60954L53999k41744
17297G71785j25342Q0199k63006l89621j98577J94146J08608Q7917o476p3726
$$ y = [131540, 130669, -11701, -40669, -2536, 42357, 144914, -41534, -83379, -140627, 26678, 190660, 352852, 463508, 621711, 441540, 339529, 196069, 9550, -54471, 144668, 175658, 98920, 356767, 352420, 304123, 274989, 404265, 100042, 6823, 164680, 346027, 492107, 397847, 246706, 73477, 243465, 442329, 531039, 602958, 394060, 477903, 520741, 604259, 528886, 181336, 48584, 146540, -22786, -92304, 49792, 224042, 137133, 241288, 496722, 663633, 826723, 845064, 728676, 567266, 351339, 682602, 803602, 684287, 465646, 508947, 438881, 133219, 115371, 398576, 659530, 1013529, 771785, 646443, 726642, 463636, 74015, -124562, 69584, 178192, 266109, 259633, 185907]
17287A85907p5728J94035L863Q5405K4583R0672q0193o5919J28576r1121j20025
17276B80055j50624J79621J59329k6490k14073J64211J89376j42939j17727j14604
17266B06135j25334r392L9851j23241q632K9181J54596K789J50788L82616R2016
17255G91373j20630j10785j793j52315j68274j59888J2023K13721M80927l5652
17245G48707j30318L4143q0992m1957k41722j97654P4627L32175M9761J06788
17235F53558j40553j32528J38127l7781k02614p1602Q3845k8579Q4505J38956
17225D85334N29609j6186j56832M8449k94076m31864n6165J06957O9595P1272
17215C56093J98078l7713q6598J29950M7102j34119k07091j24729J41089L41731
$$ y = [185907, 110179, 304214, 308077, 393482, 418065, 508737, 428544, 362625, 491201, 400080, 280055, 129431, 309052, 468381, 441891, 227818, 392029, 581405, 438466, 320739, 206135, 80801, 71409, 111260, -11981, -20613, 8568, 163164, 165953, 316741, 699357, 791373, 670743, 559958, 558165, 405850, 237576, 77688, 89711, 303432, 784359, 748707, 618389, 652532, 571540, 529583, 287861, 90207, 164834, 497009, 546770, 653558, 513005, 380477, 518604, 480823, 278209, 206607, 290452, 261873, 346378, 485334, 1014943, 998757, 841925, 890374, 596298, 164434, 108269, 215226, 284821, 356093, 554171, 516458, 429860, 559810, 606912, 472793, 265702, 140973, 282062, 623793]
17205F23793J60694J14026J82p6815r0398k30078k78978k1985K10805L0394j93553
17194B48087j11623J51987L74949O6880j75874M2411M5037j47989j90512J19864
17184D23217K37781o9757r5606p3151P8412P7354k06172J18599k1356J37114J71494
17173G77929j39475r2722J06462j88102L9010m9521L10430J77941k9150r9943
17163H12859J98997k2216m54783j83844J37058J40656J80412q8218J31490Q8149
17153I40560j85197j32336J97947J13677K51911J59053j9992K18997J45541K23907
17143A914068J56923K8112M3972K18050J61721K54576K9800q5593K48784K85220
17133C255633K28899M32541M76481K32909n9883o1131j54465k47486k12462L2168
$$ y = [623793, 784487, 898513, 898695, 821880, 731482, 501404, 222426, 200441, 411246, 441640, 248087, 136464, 288451, 663400, 730280, 554406, 596817, 641854, 493865, 303353, 423217, 660998, 591241, 495635, 422484, 500896, 578250, 372078, 490677, 469321, 606435, 777929, 638454, 545732, 652194, 464092, 503102, 453581, 764011, 941952, 912802, 812859, 1011856, 989640, 534857, 351013, 488071, 628727, 809139, 720921, 852411, 940560, 755363, 623027, 820974, 934651, 1186562, 1345615, 1325623, 1544620, 1690161, 1914068, 2070991, 2099103, 2143075, 2361125, 2522846, 2777422, 2807222, 2721629, 2970413, 3255633, 3484532, 3917073, 4393554, 4626463, 4566580, 4505449, 4350984, 4103498, 3891036, 3923204]
17123C923204o9327J77697L12410L60130K92557p8540k92966m62893k13390j33481
17113C815401l96592m05357j62505k04862l76044j75672O0253J52668k9912p2636
17103B204742l87866k65750r7386o2374j0709l45867j02693K3358j36381r9508
17093G19566J48947k10033j37964L59314K18569n04264j51126J94471L8832Q1526
17083G57838j01034J72995r1978J64992o2265J03308K9081J96559n8467j5297
17073A095732j69479N5912o2789J68191K47315J08330M4900j18024K1893J88830
17063A580811K7429J81702L04328k8145O4016J30236Q7125k13393j7591j15129
17053B001389l7380j6529J90273J46164n6234j38680j68031k21617q3544k38233
$$ y = [3923204, 3853877, 4031574, 4343984, 4704114, 4996671, 4918131, 4625165, 4162272, 3948882, 3815401, 3418809, 3013452, 2850947, 2646085, 2270041, 2094369, 2154622, 2307290, 2277378, 2204742, 1816876, 1551126, 1453740, 1391366, 1380657, 1034790, 932097, 955455, 819074, 719566, 868513, 658480, 520516, 879830, 1098399, 594135, 443009, 637480, 676312, 757838, 656804, 829799, 737821, 902813, 840548, 943856, 972937, 1169496, 1111029, 1095732, 926253, 982165, 919376, 1087567, 1334882, 1443212, 1488112, 1370088, 1391981, 1580811, 1608240, 1789942, 2094270, 2066125, 2130141, 2260377, 2347502, 2134109, 2116518, 2001389, 1964009, 1947480, 2137753, 2283917, 2227683, 2089003, 1920972, 1699355, 1615811, 1377578]
17043A377578l02733l39730J23724J14712J41425l625j73504l1589j87632k7413
17033F91213K55021J18004k22845K61531k0513j59546k4382n315K15377K71751
17023A380296R1921j00986j70044l27122k18897j54257J35511J81108L7992K7408
17013H82930K56886R8672q9625J82046j03809l63461k51723R8609M7135p3251
17003F84409J92808l3205j14328q756r34O7358l047J13956Q9312K49563j3791
16992A223345k86941j50093k63431l9877L25907P4507j66402J40572J26305j99596
16982G84296n4929m1225K14931J14737l25028j20344J32022k5683J07163j62091
16972F23849J26869J76141j3598L8996q7891m8558j21575J49374o6133k15679
$$ y = [1377578, 1074845, 735115, 858839, 973551, 1114976, 1111351, 937847, 906258, 718626, 691213, 946234, 1064238, 841393, 1102924, 1082411, 922865, 898483, 893168, 1108545, 1380296, 1472217, 1371231, 1201187, 874065, 655168, 500911, 636422, 817530, 855522, 882930, 1139816, 1238488, 1148863, 1330909, 1227100, 863639, 611916, 710525, 757660, 684409, 877217, 844012, 729684, 720928, 719994, 787352, 784305, 898261, 987573, 1237136, 1223345, 936404, 786311, 522880, 483003, 808910, 883417, 717015, 857587, 983892, 784296, 729367, 688142, 903073, 1017810, 692782, 572438, 704460, 678777, 785940, 623849, 750718, 926859, 913261, 952257, 864366, 815808, 694233, 843607, 777474, 561795]
16962E61795j26707j59830K33659N95574K1121j5453j56575k58166r0202k1771
16952E83445k3082j1283M7147j90888K10798Q0739L6078J2808n4356K32255p3720
16941H49941n8821r3456N4023K2834j45097J54146J11896j30980j1224J51285
16931I04547J5915j39915k21389j08507J20427J12804l2008J22211L02128j40953
16921I35260p4114O1470L42518M194j33806j08834k6046J59287j53983j14741
16911H91205L10377r3572j75989j92922J39090J56800j00103j22793k5020o515
16901G80558p3539J33406J21358k95135j8843J09570K10423q0147l12994n5115
16891E19542r1505K22440M8802O8662J3678j79136M07057n5377j71697j79808
$$ y = [561795, 435088, 275258, 508917, 1104491, 1125612, 1110159, 953584, 695418, 605216, 583445, 560363, 549080, 596227, 405339, 616137, 696876, 732954, 745762, 691406, 923661, 849941, 791120, 697664, 751687, 774521, 629424, 783570, 895466, 764486, 753262, 904547, 920462, 780547, 559158, 450651, 571078, 683882, 651874, 774085, 1076213, 935260, 861146, 922616, 1265134, 1269328, 1135522, 1026688, 1000642, 1159929, 1005946, 891205, 1201582, 1108010, 932021, 739099, 878189, 1034989, 934886, 812093, 787073, 780558, 707019, 840425, 961783, 666648, 647805, 757375, 967798, 887651, 574657, 519542, 428037, 650477, 699279, 767941, 781619, 602483, 1009540, 954163, 782466, 602658]
16881F02658j05087M1405r3222k9287J14940L13897K63342p9496j96748k34060
16871E98342R5595L74738m1685j15857O6253j57215k05330j54633M11947L99368
16861A271523l5333N8935j22277l03179p4339J24664P2384j66357r5119K66105
16851I97007J80239j53673J43583J21238j97153j02837K65516L24021Q5655l04265
16841A359331n9508j94577r0348K56861O4853P6917O2054k95544m60062n1572
16831F68405J46645J52441n4181Q0802J42222O7924O7091N5938o9357L0863k0209
16820A268584m0148k1192K39748p8943k48704n6781k8317K59442J07252R3578
16810A494519J56744m8857j66518P7175j45141N42Q7920j87388k90679M2144J83907
$$ y = [602658, 497571, 538976, 445754, 416467, 531407, 845304, 1108646, 1029150, 832402, 598342, 693937, 1068675, 1026990, 911133, 977386, 820171, 614841, 460208, 872155, 1271523, 1236190, 1295125, 1172848, 869669, 795330, 919994, 992378, 826021, 730902, 997007, 1177246, 1023573, 1167156, 1288394, 1091241, 988404, 1253920, 1577941, 1663596, 1359331, 1299823, 1105246, 1014898, 1271759, 1336612, 1413529, 1475583, 1180039, 719977, 668405, 815050, 967491, 913310, 994112, 1136334, 1204258, 1271349, 1327287, 1257930, 1288793, 1268584, 1228436, 1207244, 1446992, 1368049, 1119345, 1062564, 1034247, 1293689, 1400941, 1494519, 1651263, 1602406, 1435888, 1513063, 1367922, 1368464, 1456384, 1268996, 978317, 1020461, 1204368]
16799A204368P8190j01014K21538k87126p7563J21113j9165m0481L28941j81488
16789A247313k33943j33943O5513K22196K44996J18031K72169P9053p6204r6061
16779A709120J67837o743R8372n3580L1880q2853j72129m7697N5415N2266j88675
16768A563213j58377K91689J41177r426r1578l02953p2379J65939m172l44036
16758A179097m1296O1027M04813q574p6996P1225k39599l15491l5352L20150N8252
16747A377256R6210r880j65305R4389K37843l80216K38841K73496j36856p7895
16737A547883K01893k43784m0607R0318J30845J40361j17223j6771Q0764J64050
16727A937729j29k3998O9545j08810k12385O3154R0185P5954K2463k63542r6514
$$ y = [1204368, 1282558, 1181544, 1403082, 1115956, 1038393, 1159506, 1140341, 1099860, 1428801, 1247313, 1013370, 879427, 944940, 1167136, 1412132, 1530163, 1802332, 1881385, 1805181, 1709120, 1876957, 1870214, 1968586, 1915006, 1946886, 1864033, 1691904, 1644207, 1699622, 1751888, 1563213, 1404836, 1696525, 1837702, 1828276, 1736698, 1433745, 1361366, 1527305, 1523133, 1179097, 1137801, 1198828, 1603641, 1595067, 1518071, 1589296, 1349697, 1034206, 998854, 1319004, 1377256, 1473466, 1463586, 1298281, 1392670, 1630513, 1250297, 1489138, 1762634, 1625778, 1547883, 1749776, 1505992, 1465385, 1555703, 1686548, 1826909, 1709686, 1692915, 1773679, 1937729, 1937600, 1913602, 1983147, 1874337, 1661952, 1725106, 1815291, 1891245, 1913708, 1650166, 1553652]
16716A553652N298J23071P4513L08695K10090N9266j93113l725k6565J42469J28050
16705B381701j09314O6136n3207l57634l11330Q0851L32484J52939k90163J48241
16695B040704K36102l2283L4236j53212m3015L02795M5851N9217j05917r2929
16685B291549J18359R0449p7236k15685m8236K00185k91880m898k5394J42481
16675B179694K34546j04459p0459P0833J54962K41689l0204k08319J15089N2504
16665B635876K79687o6521m77279j55719j3004j71919J68610R3971J34705J7486
16655B445893J88251K78027J93453L0009M04111K30946k81765k89345j06544L49415
16645C442451L14894k19462k3216m1412j71941o4975J84405R617j0228K3528k16212
$$ y = [1553652, 1558950, 1682021, 1756534, 2065229, 2275319, 2334585, 2141472, 2137747, 2111182, 2253651, 2381701, 2272387, 2338523, 2285316, 1927682, 1616352, 1697203, 2029687, 2182626, 1892463, 2040704, 2276806, 2244523, 2278759, 2125547, 2082532, 2385327, 2431178, 2490395, 2384478, 2291549, 2409908, 2500357, 2423121, 2207436, 2159200, 2359385, 2067505, 2062607, 2037213, 2179694, 2414240, 2309781, 2239322, 2310155, 2465117, 2706806, 2676602, 2468283, 2583372, 2635876, 2915563, 2849042, 2371763, 2216044, 2203040, 2031121, 2199731, 2293702, 2428407, 2445893, 2634144, 2912171, 3105624, 3135633, 3539744, 3770690, 3488925, 3199580, 3093036, 3442451, 3757345, 3537883, 3514667, 3473255, 3301314, 3236339, 3420744, 3430361, 3420133, 3443661, 3227449]
16634C227449k48129J03561L86412N70459K00721k12485m61309K9076k9686j74710
16624C391359L8165j21191K87934K54049J36065m0924M4654K03938J71598K74524
16614D640171L0716j45374N2372K08913k7799L7480M86935M4648k4836j45254
16604E157972K6448J80675L04381Q2429P7441O8277l9424J32438O0482n4508J3729
16593F010340J51705K51157J6487m3720J67020K93053K62232K44232L25945L1610
16583G710061M331J28499J06074K0507L48393o5012J96303M57668M09884M02401
16573I719109N14580M14930J89866J97146L08140N17447M86625J11422K86883
16564A2746148O41515P67395P29299O96610M01623K80889O16006Q01647P15178
$$ y = [3227449, 2979320, 3082881, 3469293, 4039752, 4240473, 4027988, 3566679, 3595755, 3566069, 3391359, 3429524, 3308333, 3596267, 3850316, 3986381, 3945457, 3990111, 4194049, 4365647, 4640171, 4670887, 4525513, 4577885, 4786798, 4758999, 4796479, 5283414, 5328062, 5303226, 5157972, 5184420, 5365095, 5669476, 5751905, 5829346, 5897623, 5858199, 5990637, 6051119, 5996611, 6010340, 6162045, 6413202, 6429689, 6385969, 6552989, 6846042, 7108274, 7352506, 7678451, 7710061, 7714392, 7842891, 7948965, 7969472, 8317865, 8252853, 8449156, 8906824, 9316708, 9719109, 10233689, 10648619, 10838485, 11035631, 11343771, 11861218, 12347843, 12459265, 12746148, 13387663, 14155058, 14884357, 15580967, 15982590, 16263479, 16879485, 17681132, 18396310]
16555A8396310J038612J013047J293223J069671J161828J491371J626518J733976
16547B8824556J962770K234157K208604K651825K723657L388965M012237M480143
16539E2486914N370969O047289O978405Q122010R641748J1255267J3952371J7486615
16531A31341588K1938655K7486231L4510801M1901486M8298918N2038958N0114253
16524D07630890M0803809K5021083M773643j6396365l5179091m8714824n4821615
16517C23117530n3145407m6421124l8236734l0855481k4336460j9130073j4835623
16510I6156628j2562226j0445672q677460p231033o032454n244642m527974m366333
16502C7068834l605469k956405k530912k390063j877050j914665j995709j586854
$$ y = [18396310, 19434922, 20447969, 21741192, 22810863, 23972691, 25464062, 27090580, 28824556, 30787326, 33021483, 35230087, 37881912, 40605569, 43994534, 48006771, 52486914, 57857883, 63905172, 70883577, 79005587, 88647335, 99902602, 113854973, 131341588, 153280243, 180766474, 215277275, 257178761, 305477679, 357516637, 407630890, 448434699, 473455782, 478229425, 461833060, 426653969, 377939145, 323117530, 269972123, 223550999, 185314265, 154458784, 130122324, 110992251, 96156628, 83594402, 73148730, 64471270, 57240237, 51207783, 45963141, 41435167, 37068834, 33463365, 30506960, 27976048, 25585985, 23708935, 21794270, 19798561, 18211707]
16494A8211707j327443j230336r68656o51236p65832j090794r24416q81497m33486
16485I938011o29546o48664l98857m35962l92101m48678o30172n05754l90964
16476E457313R112j10157l04716N949p9568k20927l96288o47018r34Q5917k48449
16465C550234j91959J2308K5261l74239l54169j06401r7179o6449k07367k15107
16455A974933k44893m8120k1174k21951j72853n8212Q9171L0271j78638r2580
16445A055954L4753l2712J11154l99350n0944J17109j01650P1486p8436j43892
16435E83472Q0761O851j04718J37437J13J39701k4129n8024l6378k03702j4045
16424E07339q1859o1990j7291p4936N6771j65658n7350K93467J60323j88505m41653
$$ y = [18211707, 16884264, 15653928, 14685272, 14034036, 13268204, 12177410, 11252994, 10371497, 9938011, 9308465, 8659801, 8260944, 7824982, 7432881, 6984203, 6354031, 5848277, 5457313, 5466425, 5356268, 5051552, 5057501, 4977933, 4757006, 4360718, 3713700, 3712766, 3798683, 3550234, 3358275, 3370583, 3395844, 3021605, 2667436, 2561035, 2463856, 2397407, 2190040, 1974933, 1730040, 1681920, 1660746, 1438795, 1265942, 1207730, 1296901, 1327172, 1148534, 1055954, 1090707, 1057995, 1169149, 769799, 718855, 835964, 734314, 805800, 727364, 583472, 664233, 671084, 566366, 703803, 703916, 843617, 819488, 761464, 725086, 521384, 507339, 425480, 363490, 346199, 271263, 328034, 162376, 105026, 398493, 558816, 370311, -71342]
16413g1342q7545j7823J55687J95707Q4934M205J23945J15276j47563p675L3803
16402C81609r7743Q8795K08109j13388P6615L58967n0910j8418j59938j73747
16392D99951n1106M5565j27490p9937O459M6952k8578k80696l60040L29296L57765
16381C58141K8240j95507l43418M9944J45093J24061n2937j11184j88689M8054
16371a38202J17460M38885P7205k82751J74455r420k16275m36025O5126L29354
16361A19812k18782j65394J07610P8346R7424k82230j58627j2841l73220J74694
16351f33208J20332K98352l3618l5839J677L00062K84988J21847j79340j17023
16341A28230M8634k40606j80632K17669p4808P2862n4042N6473L2716k44897j5624
$$ y = [-71342, -158887, -176710, -21023, 174684, 259618, 263823, 387768, 503044, 355481, 347806, 381609, 283866, 372661, 580770, 467382, 543997, 902964, 852054, 833636, 673698, 499951, 448845, 494410, 366920, 286983, 293442, 340394, 311816, 31120, -328920, 376, 358141, 386381, 190874, -152544, -102600, 42493, 166554, 113617, 2433, -186256, -138202, -20742, 418143, 495348, 212597, 387052, 377632, 161357, -274668, -209542, 119812, -98970, -264364, -156754, -78408, 19016, -263214, -421841, -434682, -807902, -633208, -512876, -214524, -248142, -283981, -282304, 17758, 302746, 424593, 245253, 128230, 176864, -63742, -244374, -26705, -101513, -28651, -82693, -26220, 6496, -238401, -254025]
16330b54025L36749k08817J99699J74597m0526k20081R7350k27665K987P5616
16320f4116P4187l1052K68299Q5291m1354j47301m9433M2354n0543k90353J2772
16309a91249K2863J16339J56477M9281j33685Q8467k27990j95695K26327n6339
16299a45204k25701N8984J92558Q719K82352L7552k86402K403j46526l65303J20777
16288d65791J07121K43657P8187j71595J81190J65978Q9374K794k19784j11281
16278a00150N1608p9822K9282j56045j29448J71071n1250j5346J50937J57067
16268B7904K33453J6537l80135q9694J54810j42403R8350J81182J52719l22009
16258f9286q0120J83329n3606J06186J42161l2015j84298K5948L38135j24003
$$ y = [-254025, 82724, -126093, 73606, 248203, 207677, -12404, 84946, -142719, -139732, -64116, 10071, -20981, 247318, 332609, 291255, 143954, 94521, 136875, 86332, -204021, -191249, -168386, -52047, 104430, 153711, 20026, 108493, -119497, -315192, -88865, -145204, -370905, -311921, -119363, -110644, 171708, 209260, -77142, -74739, -221265, -586568, -465791, -358670, -115013, -36826, -208421, -27231, 138747, 228121, 230915, 11131, -100150, -48542, -128364, -99082, -255127, -384575, -213504, -264754, -280100, -129163, 27904, 261357, 277894, -102241, -191935, -37125, -179528, -81178, 100004, 252723, -69286, -149406, 33923, -19683, 86503, 228664, 196649, 12351, 38299, 376434, 252431]
16248B52431o2720k3463k05533j83790p9279N9872P4906k86015O5502R4441k04572
16237d98220j18646J09952K02465J69384P4923m711l6872P3949M6668N3823r793
16226F2922j0453k6762N0892J73474o1942J11457M0348N7116P0257p9441j05707
16215B82161o0319o0350O6094O3689j57572N8182k51673j25925J68580O7035K15120
16204B65022l04233o0634r5307j16323J62169J22110J56414K04876j69648k26161
16194f1715j08436j19380k62681J81655J74856K3408O7886L9347J04207L4417
16184G3564J10915J76969k02607k58781n1866J93985J58103p3525j31456l81115
16174c85814L11944J70639n9556r7951j7551p8785J9807o5914l29434M1773L06779
$$ y = [252431, 189711, 166248, -39285, -223075, -302354, -242482, -167576, -453591, -388089, -293648, -498220, -616866, -506914, -304449, -135065, -60142, -64853, -101725, -27776, 18892, 72715, 62922, 52469, 25707, 76599, 250073, 188131, 299588, 339936, 397052, 467309, 387868, 282161, 221842, 161492, 227586, 291275, 133703, 191885, -59788, -185713, -17133, 49902, 265022, -39211, -99845, -195152, -311475, -149306, -27196, 129218, 334094, 164446, -61715, -170151, -289531, -552212, -370557, -195701, -172293, -104407, -65060, 39147, 73564, 184479, 361448, 158841, -99940, -151806, 42179, 200282, 126757, -4699, -385814, -73870, 96769, 37213, -60738, -78289, -157074, -137267, -203181, -532615, -490842, -184063]
16163a84063K58977j08422r6570j00731K14683j3854J8020o5165K73740J11749
16153C08364J51473R9391k29880j06704L7223K9571J3836j26137j58281N4419
16143G3275l1268L25767M15434l7472k04113k04218j33692k04526j35482j44573
16133b80868J01699J55985J30174o2391k28n0964Q7064q1697Q760K00164k0042
16122A87656L31Q1369M0684k1456k9767k95843j70303q951K07697K28411k15174
16111D654K0006l7409n5463J53102l067m665J67693J21779n8000k50334j08860
16100e0564J08824J6736n7260N9853J22935L03122O3585J4422j64056q2670j98793
16089A36134l9735J395K90984J56870R4060N2221J89799o8791p6282l07942k71612
$$ y = [-184063, 74914, -33508, -130078, -230809, -16126, -29980, -11960, -77125, 196615, 308364, 459837, 559228, 329348, 222644, 259867, 289438, 303274, 177137, 18856, 73275, 42007, 367774, 783208, 745736, 541623, 337405, 203713, -813, -136295, -280868, -179169, -23184, 106990, 44599, 44371, -6593, 80471, -1226, 7534, 207698, 187656, 187987, 269356, 310040, 288584, 258817, -37026, -207329, -216280, -8583, 219828, 4654, 24660, -12749, -68212, 84890, 81823, 77158, 244851, 366630, 308630, 58296, -50564, 58260, 74996, 17736, 77589, 200524, 503646, 567231, 581653, 417597, 334927, 136134, 96399, 97794, 388778, 545648, 639708, 691929, 881728, 812937, 736655, 428713, 157101]
16078A57101k73882r4140Q1408j3075R0447K60933J4314m9085k74355L6816J83208
16067A19690N3860J36044L7654l8124k77083j73740K97864K81711j72399n4996
16057B10481J29021j65276R4601j65511p4804J97122k9945q932J47865J54260
16047D88882q2335r6059j5282j14959N4782J96853J99809l1408J03134m0579j98111
16036D64727m5330m2567Q5467r9850o3679j0196m7123k05298L3193k6174J07106
16025A50276J18601R2374n5065K80212j41088k17604J02032J67455k0993j10084
16015C66116j32099M8767r2789K86522M30946K11846o061k36067j82409k891N00980
16004A192861M98789M24358K66521J32k67179L0079K99149K03560K65583R4395
$$ y = [157101, -116781, -210921, -129513, -142588, -52141, 208792, 223106, 174021, -100334, -63518, 119690, 173550, 309594, 347248, 309124, 32041, -141699, 156165, 437876, 265477, 210481, 339502, 174226, 268827, 103316, 28512, 225634, 195689, 186757, 334622, 488882, 406547, 310488, 295206, 180247, 235029, 431882, 631691, 600283, 703417, 662838, 464727, 419397, 376830, 462297, 362447, 298768, 288572, 241449, 36151, 69344, 43170, 150276, 268877, 361251, 306186, 586398, 445310, 227706, 329738, 497193, 476200, 366116, 234017, 282784, 189995, 476517, 907463, 1119309, 1113248, 877181, 694772, 691881, 1192861, 1691650, 2116008, 2382529, 2382661, 2115482, 2145561, 2444710, 2648270, 2913853, 3008248]
15994C008248K3325M477Q5673O34275J94204R2121k78300l07309k89374j76999
15984B990341j04356k20166k96877l36935l04633j06766l33616j02047L08780
15975A493725l6614k85218j27825j78186k42302K5074j73604j16228P7309O5456
15965E01587O9688m3644O2454J89719j7744k51479q640N197k51031j0786J89829
15954D35150N03494Q8968j69412p1546j0293j52418l26227j19257K0724K7252
15944B26435J22812L08059N1500j35963j96211L70979L15580K79364K38293L75646
15934A956494K9554l6447j38612O933n5185J25839r1938l8926J00936J59035m56997
15923A560686P8969K46478N3803j2864k06504k72743m09608k06866j00495j88780
$$ y = [3008248, 3031573, 3036050, 3121723, 3755998, 3950202, 4042323, 3764023, 3456714, 3167340, 2990341, 2885985, 2665819, 2368942, 2032007, 1727374, 1620608, 1286992, 1184945, 1493725, 1457111, 1171893, 1044068, 865882, 623580, 648654, 475050, 358822, 436131, 501587, 571275, 527631, 590085, 779804, 762060, 510581, 501941, 507138, 256107, 245321, 435150, 938644, 1027612, 858200, 786654, 776361, 623943, 297716, 178459, 199183, 226435, 349247, 657306, 708806, 572843, 376632, 747611, 1063191, 1342555, 1580848, 1956494, 1986048, 1949601, 1810989, 1817922, 1762737, 1888576, 1796638, 1757712, 1858648, 2017683, 1560686, 1639655, 1886133, 1939936, 1927072, 1720568, 1447825, 1038217, 831351, 730856, 542076]
15913E42076k66060J72669K51341K1795Q1961j26259j79031L3391J49355j26652
15903E54586j20994o3596L1274J40684J64082q8950j50170p9431p480J73560J05685
15892F59250j18921J31720q4743j15779L7326J57297k11167j12041L42325k8427
15882F56840l32387j38724k0573R6707J26154l6601j03786k22663K49712j66247
15872A08432r0754J65481K16437M9043K7027N7651J24976j09036k28869m3991
15862B76397J0031k24898l2090J34102K82116m6578j48586K85586J03937j19816
15852E20201R0487K83423r8327Q6616K26988J41062k44137k9564M3324q2759k49803
15841F87511l91735R025r5073O946J29190j6158j13457J66062J84947Q1127j02263
$$ y = [542076, 276016, 448685, 700026, 721821, 803782, 677523, 498492, 531883, 681238, 554586, 433592, 369996, 401270, 541954, 706036, 617086, 466916, 387485, 380005, 553565, 659250, 540329, 672049, 587306, 471527, 508853, 666150, 454983, 342942, 685267, 656840, 324453, 185729, 165156, 261863, 388017, 351416, 247630, 24967, 274679, 108432, 17678, 183159, 399596, 448639, 475666, 533317, 658293, 549257, 320388, 276397, 286428, 61530, 29440, 163542, 445658, 399080, 250494, 536080, 640017, 520201, 610688, 894111, 795784, 882400, 1109388, 1250450, 1006313, 976749, 1020073, 937314, 687511, 295776, 304801, 209728, 216674, 345864, 329706, 216249, 382311, 567258, 648385, 546122]
15830E46122j78396l0730l44589j57517j8695N63878J15097K64176J87750k30989
15820G16107n8831j9671j68351j65252j7499J29421Q2091j61174n6298Q5104j60950
15809B04697j14506L95445o5278j21672j47353J13448K95462K6039n4063K9683
15799E61902j86178K66660K22544j32797o9701k36442J05373K29401L18969K51048
15789A330779p5022n28204m10404k57129m7652K71521P4853j46311K77709Q9755
15779E79895j24679k25692R0410K13864L08913J24847K9636L1636j92134q7016
15769G49680J21827K8617m24423k66771j02423q5593L5725J40061K4499M36121
15759F57320K45787R1938j18499j33269l59503l09607J82031L08369l5236q2771
$$ y = [546122, 367726, 336996, -7593, -165110, -183805, 380073, 495170, 759346, 947096, 716107, 657276, 637605, 469254, 304002, 286503, 415924, 498015, 336841, 280543, 365647, 204697, 90191, 485636, 420358, 298686, 151333, 264781, 560243, 586282, 532219, 561902, 375724, 642384, 864928, 732131, 662430, 425988, 531361, 760762, 1079731, 1330779, 1255757, 727553, 317149, 60020, 12368, 283889, 358742, 212431, 490140, 579895, 455216, 229524, 319934, 533798, 842711, 967558, 997194, 1028830, 836696, 749680, 871507, 900124, 475701, 208930, 106507, 20914, 56639, 196700, 221199, 657320, 903107, 995045, 876546, 743277, 383774, 74167, 256198, 564567, 529331, 446560]
15749D46560j1259o3490J47028J8262j50596J46295N9002k01846j06297R5063
15739C78722K06373R3588j55230K09888K5283j35818J0757m7824K5492m1705J669
15728E71195j33429r3581j46684J05855J90519K81587N5772p5345K05010j54611
15718H06288j96028M7213Q7085j16602N9894J5511j68556o8808k64548K18087
15708D19536N5645p4182q4402m0644J0164K16199N8100o367k73J48567L47559
15697A049902j62369l23995j4625R1315j63046J62936Q8542j63132O5782J69823
15687H01133Q0233J20569k08642n6685J45225j51048k6761j59811K9599J7951
15677E91763M2967R5947k04506K59079L20826P8124l73137j78307J64928J71944
$$ y = [446560, 435301, 371811, 518839, 537101, 386505, 532800, 591802, 389956, 283659, 378722, 585095, 678683, 523453, 733341, 758624, 622806, 633563, 585739, 611231, 569526, 571195, 437766, 344185, 197501, 303356, 493875, 775462, 831234, 755889, 960899, 806288, 610260, 657473, 744558, 627956, 687850, 703361, 534805, 465997, 201449, 419536, 475181, 400999, 316597, 275953, 286117, 502316, 560416, 554049, 553776, 702343, 1049902, 887533, 563538, 548913, 640228, 477182, 640118, 728660, 565528, 631310, 801133, 881366, 1001935, 793293, 736608, 881833, 730785, 704024, 544213, 573812, 591763, 634730, 730677, 526171, 785250, 1106076, 1184200, 811063, 632756, 797684, 969628]
15667I69628k1805l54926m8899j11273q4109o0058L50065Q590l12285k02133J79486
15656C12281O5162K1948J56232j16144p4239O7595J68556O2385J59321L9340q8120
15645G74317k50226k1774R0975K00084J56769m4043P9849M1953j94714k99456
15635E33734J00185J95036N483j54358k66566J01196j78777k0653L4277J75723
15625E25280K89841l4741l67001k62551p3120J69368j44979J15096M89P3729M04713
15614F96124J41123q1873K2248k09801k60523m9112K46794J73946j27606k56802
15604B94518K6689j4975k43125j58133K83698Q9420N7613K51759J13759M2060
15594G43283k3935J6488J9766O9967j6774l12119L9445J39001J3689l17678R0329
$$ y = [969628, 947823, 592897, 543998, 432725, 348616, 288558, 638623, 647213, 334928, 132795, 312281, 377443, 399391, 555623, 439479, 365240, 432835, 601391, 663776, 823097, 862437, 774317, 524091, 502317, 593292, 793376, 950145, 906102, 985951, 1027904, 833190, 533734, 633919, 828955, 834438, 680080, 413514, 514710, 335933, 315280, 349557, 525280, 815121, 780380, 413379, 150828, 77708, 247076, 102097, 217193, 217682, 291411, 696124, 837247, 755374, 777622, 567821, 307298, 258186, 504980, 678926, 551320, 294518, 321207, 306232, 63107, -95026, 188672, 278092, 335705, 587464, 701223, 743283, 719348, 735836, 755602, 825569, 808795, 496676, 536121, 675122, 688811, 371133, 461462]
15583D61462J92041R9337J10929R5686J06771l33928O9344J85899k55221l05236
15573D27084j91193N4194M5754J8969N99533J88950j47862j67300o4383k5585
15563G38161J17485j19162j61413J08060K0997J4705l71168j84987J12354J94435
15553D69467M32953J21320j56217j44041j34952O274J5821j04355Q7721K04159
15543G98150j84632k39082K22010L01005J76236l57606j83896J12720K31912K31811
15533A108628J34541L298k70612j78891j34576p3739o164L42620k5779K3431j0446
15522I12311O1445l25116r9301P3278k7822j42287M657j45574p768J36846K44270
15511F84939n1353j03052j57914j11773K97785M03817K04178J06784k90565j53653
$$ y = [461462, 653503, 752840, 863769, 959455, 1066226, 732298, 801642, 987541, 732320, 427084, 235891, 290085, 335839, 354808, 954341, 1143291, 995429, 828129, 763746, 738161, 855646, 736484, 575071, 683131, 704128, 718833, 347665, 162678, 275032, 469467, 902420, 1023740, 867523, 723482, 588530, 594804, 610625, 506270, 593991, 798150, 613518, 374436, 596446, 897451, 1073687, 716081, 532185, 644905, 876817, 1108628, 1243169, 1246467, 975855, 796964, 662388, 588649, 582485, 925105, 899326, 922757, 912311, 973756, 648640, 549339, 622617, 594795, 452508, 457165, 311591, 303823, 440669, 684939, 633586, 530534, 372620, 260847, 558632, 962449, 1166627, 1273411, 982846, 829193]
15501H29193j11673q5916J22673L4880k66182k48741R9301m8867J51416J46376
15491F22460j1419R5155q7926J0714J02078L0091J91846j27720j98261n612J32599
15480G54005j64416l8762J65087M8872J20171l38275o2979L20998L6796p2823
15470G68674k12094J22699j20505o7543j12813Q0021K82197K44573J16710J2674
15460A114593p7010j79145k10272k58054J53974R2444k49259J61434K23161R1269
15450H63135j43320P6563N8244L3169j06592j65866m2044M6335l07938r3662J77331
15439C95355K90281K88842K49712l6373J79905J60123l17860m52074m46823P6349
15429C87437K54522q010J36758J00772l895K8951l1149K43724J34657p5935j21184
$$ y = [829193, 717520, 631604, 754277, 789157, 522975, 274234, 373535, 324668, 476084, 622460, 611041, 706196, 618270, 628984, 731062, 761153, 952999, 825279, 627018, 621406, 754005, 589589, 550827, 715914, 764786, 884957, 546682, 483703, 804701, 841497, 768674, 556580, 679279, 558774, 491231, 378418, 458439, 740636, 985209, 1101919, 1114593, 1037583, 858438, 648166, 390112, 544086, 636530, 387271, 548705, 771866, 863135, 719815, 796378, 854622, 887791, 781199, 615333, 573289, 619624, 311686, 218024, 395355, 685636, 974478, 1224190, 1187817, 1367722, 1527845, 1209985, 757911, 311088, 387437, 641959, 633949, 770707, 871479, 867584, 896535, 865386, 1109110, 1243767, 1167832, 1046648]
15418A046648j60210J84739j6160N7327l4460j93821m2696j07246k31007l13L97191
15407H99992K48055q4495j70004k51400K4981J3192J34958L4148k63511n216J95267
15396G75967J32685m7615q9054L3167j32018J66716p06n1138P4979L2468n597
15385H89854j99152j64439J03017Q6728J32643J4612J38424j22389o5821K52420
15375A065897L12j93065k0541K22941J12170k90741m00140j77436M54287L49425
15365A123109k35876M2445O0336k16753L8345J26890r6881Q5856j29856k40733
15355E56882j47111K23283J80407Q2103j05293k16997R8853J64007J56506K02753
15345A195393k19760k01856P5514j79865p8073k8377J60722J94788L894k49951
$$ y = [1046648, 886438, 1071177, 1055017, 1112344, 1077884, 884063, 841367, 734121, 503114, 502801, 899992, 1148047, 1063552, 893548, 642148, 667129, 680321, 815279, 849427, 585916, 580700, 775967, 908652, 861037, 771983, 805150, 673132, 839848, 839142, 788004, 862983, 895451, 889854, 690702, 526263, 629280, 716008, 848651, 863263, 1001687, 879298, 813477, 1065897, 1066209, 873144, 852603, 1075544, 1187714, 896973, 496833, 319397, 773684, 1123109, 887233, 929678, 990014, 773261, 811606, 938496, 841615, 927471, 797615, 556882, 409771, 633054, 813461, 895564, 790271, 573274, 672127, 836134, 992640, 1195393, 975633, 773777, 849291, 669426, 591353, 562976, 723698, 918486, 922380, 672429]
15335F72429J25096J45145K2529m8538R9140R6630K19768n1024j03000k28737
15325I49438n4198M8802o2496r9454N1028o2770k43863M5500J62140O9381k46782
15314E56726n6056K11401J2840J03665K71530K19458j33034j48507k23450k49964
15304E64609j88559j91413m3702N124K16038N67654K10171l89810j09564J30885
15294G71433k882m4034j8479j52477K99831N0247l0897p9467q4803P2460K25933
15283A006865J6070q3837L0704n9054J27690l545k44551N1807k412Q3892J81149
15272A104778j827j09859j28112K03155j8106m6684q2545P3675K50515k05774
15262A039216m89382q8152O2494K72585J83618J05970J05354m8994j29506m04758
$$ y = [672429, 797525, 942670, 965199, 916661, 1015801, 1112431, 1332199, 1281175, 1178175, 949438, 895240, 944042, 881546, 782092, 833120, 770350, 526487, 571987, 734127, 803508, 556726, 500670, 712071, 724911, 828576, 1100106, 1319564, 1186530, 1038023, 814573, 564609, 376050, 184637, 140935, 146059, 362097, 929751, 1139922, 750112, 640548, 771433, 768551, 724517, 706038, 553561, 853392, 903639, 872742, 793275, 708472, 780932, 1006865, 1022935, 939098, 969802, 910748, 1038438, 1034893, 790342, 842149, 839737, 923629, 1104778, 1102951, 993092, 864980, 1068135, 1050029, 1003345, 920800, 994475, 1244990, 1039216, 549834, 461682, 524176, 796761, 980379, 1086349, 1191703, 1142709, 1013203, 608445]
15252F08445j07318N9878K02749K4628K51886l04386k26662j72187J2980L12081
15242F62094K63364j80238J63815K00392j18189q0911j31827K20051M3731j99885
15232H42397K18915M2372k16378R9895P1199l5286J00778P7587p5230J16388L2904
15221A275541M9217l2182j22152m6465k04721k12541J2984J49346L48292K58322
15211A475641j05550p0447J41961m9483j79473J90678j46309j5873j6939K6072
15201A250278j1185l4959m88598M380O4246J9127R5386J34034r9861n4701n192
15190H72955J205P7272j27460k67968K09089L51468n1138m5961P4672N9732K63217
15179A417083P6499k43269j86157r6463q6347L04672J93316J04083k46497j9209
$$ y = [608445, 501127, 561005, 763754, 788382, 1040268, 735882, 509220, 337033, 350013, 662094, 925458, 745220, 909035, 1109427, 991238, 910327, 778500, 998551, 1042282, 842397, 1061312, 1103684, 887306, 987201, 1058400, 1023114, 1123892, 1201479, 1126249, 1242637, 1275541, 1324758, 1292576, 1170424, 1123959, 919238, 706697, 719681, 869027, 1217319, 1475641, 1370091, 1299644, 1441605, 1392122, 1212649, 1403327, 1257018, 1241145, 1224206, 1250278, 1239093, 1204134, 715536, 719916, 784162, 803289, 898675, 1032709, 932848, 878147, 872955, 874160, 951432, 823972, 556004, 765093, 1116561, 1065423, 1019462, 1094134, 1153866, 1417083, 1493582, 1250313, 1064156, 967693, 881346, 1186018, 1379334, 1483417, 1236920, 1217711]
15169A217711K36212P7588m51302k70546k5518K6310J29071R4366N072p9737q3067
15158H76160M5492L79631K90870M5031J41835j70682m00830l59573J90k6589j1001
15147H10534R3451j01412k28098O5706J49257J38770q9096l6934J09683O7105
15137I78966K76606m8861K7767k27064k46544j1480K82326L19308k0498k54428
15127A076098n9422k91731J91779K74790M917p3343O0388j72964Q0041M29091
15117A519644j15223k60927n56L63336n0511j27936q4369l08431k6195o439j43139
15106G59254K56837L7233Q9323m339J80970K07448k1232p7540o5611j21469j67973
15095A072901j76692k9366K07802m2704j19919J80604L77198K81093j08218l9351
$$ y = [1217711, 1453923, 1531511, 1080209, 809663, 784145, 810455, 939526, 1033892, 1038964, 959227, 876160, 921652, 1301283, 1592153, 1637184, 1779019, 1608337, 1207507, 847934, 848124, 821535, 810534, 903985, 802573, 574475, 640181, 789438, 928208, 839112, 802178, 911861, 978966, 1255572, 1206711, 1234478, 1007414, 760870, 749390, 1031716, 1351024, 1330526, 1076098, 1016676, 724945, 916724, 1191514, 1196431, 1123088, 1183476, 1010512, 1090553, 1519644, 1404421, 1143494, 1142938, 1506274, 1455763, 1327827, 1243458, 935027, 908832, 902393, 759254, 1016091, 1053324, 1142647, 1138308, 1319278, 1526726, 1505494, 1427954, 1362343, 1240874, 1072901, 896209, 866843, 1074645, 1031941, 912022, 1092626, 1469824, 1750917, 1642699, 1603348]
15085A603348j45743k86792k5526n9447k04550K54441R4767j83177j15593N5917
15075I87645j01601j94932m0950j41036M9611K84024J27962J56596j33308O2767
15065A056778J12990o9024L3671J99428k98423k49799J14229Q9346P8510m6005
15055A021701L53939J88074r7504l21897J85596j2348l4430L2358k68295j78960
15045H68234p0652K63467J72558l67426m58677q4710J94403K72716Q8416L09469
15035A187798M2833j01800k7199r0295l4247J57361R8235k0916P8656k29118j58896
15024I02412P0671K02366q5338k50373k7369n5769J84695R9750M2575N4089J59795
15013A297504J1590l46648k44320J68250K18626j8852N0440R6693j5866M179j48786
$$ y = [1603348, 1457605, 1170813, 1145287, 1085840, 881290, 1135731, 1230498, 1047321, 931728, 987645, 886044, 691112, 650162, 509126, 558737, 842761, 970723, 1127319, 994011, 1056778, 1169768, 1100744, 1134415, 1333843, 1035420, 785621, 899850, 989196, 1067706, 1021701, 1375640, 1563714, 1466210, 1144313, 1329909, 1317561, 1283131, 1315489, 1047194, 868234, 797582, 1061049, 1233607, 866181, 407504, 322794, 517197, 789913, 878329, 1187798, 1230631, 1128831, 1101632, 1011337, 977090, 1134451, 1232686, 1211770, 1290426, 1061308, 902412, 973083, 1175449, 1090111, 839738, 812369, 756600, 941295, 1041045, 1083620, 1137709, 1297504, 1309094, 962446, 718126, 886376, 1105002, 1086150, 1136590, 1233283, 1217417, 1221596, 1072810]
15002A072810j03450K33230O2198j49339J034L30078k0557J19621l09120l1597
14992A204908P0347m3639k6171P4075k06194L07749L52828n8630j46701K0876
14982A549448k86892k75199J0634m1856j1106L24193m7066n63108k46060L31293
14972G44281L45295L07230M0978j96168P1530m5302j51510l4113o6032n3861K38817
14961A201145K04819L3317l0308j02424K25514k11233l47944J50993j23579Q2409
14951A082709L014j44596M01984J01608o5864j71721j07567j67681J47651J71175
14941A250712n5204Q9676Q9408q8819m27547k19119J19938K63764R2942J61137
14931A276888j27925j96935p1372J75311k00990J9593K17795Q6957j06298J58325
$$ y = [1072810, 969360, 1202590, 1264788, 1115449, 1116483, 1446561, 1426004, 1545625, 1236505, 1204908, 1275255, 1231616, 1205445, 1279520, 1073326, 1381075, 1733903, 1675273, 1528572, 1549448, 1262556, 987357, 997991, 956135, 945029, 1269222, 1222156, 659048, 412988, 744281, 1089576, 1396806, 1437784, 1241616, 1313146, 1267844, 1116334, 1082221, 1016189, 962328, 1201145, 1405964, 1439281, 1408973, 1306549, 1532063, 1320830, 972886, 1123879, 1000300, 1082709, 1085723, 941127, 1343111, 1444719, 1378855, 1207134, 1099567, 931886, 1079537, 1250712, 1195508, 1285184, 1374592, 1285773, 858226, 639107, 759045, 1022809, 1115751, 1276888, 1148963, 952028, 880656, 1055967, 854977, 874570, 1092365, 1179322, 1073024, 1231349]
14921A231349K45314J04368k50541k93502J91114k364p8603J53530k76987L9542
14911A063220P3692K75221J5628j29285k05220K101k7283p6754J0789J46969J82764
14900A331842L15046j28654r1028Q2337J8138j5954j54622p7939J75094J79651
14890A633911J0752k08125k03032o9174J29409R1637j23639L33051K74039o7801
14880A801028l9416j90653l79930j2639J61311K62675N2152j62049j48547j43629
14870A200303Q8411K91174J74169j13309K0003j3904J03794K7414k49058K25790
14860A754787l9055l10597J33044K74310p18k14666j10148n5498J07409m8204
14850A490664n11679j74344J37808L57286J73010j51679q2508M8281R1322K4597
$$ y = [1231349, 1476663, 1581031, 1330490, 1036988, 1228102, 1225738, 1147135, 1300665, 1023678, 1063220, 1136912, 1412133, 1427761, 1298476, 1093256, 1095357, 1068074, 991320, 1002109, 1149078, 1331842, 1646888, 1518234, 1427206, 1509543, 1527681, 1511727, 1357105, 1279166, 1454260, 1633911, 1644663, 1436538, 1233506, 1164332, 1293741, 1385378, 1261739, 1594790, 1868829, 1801028, 1761612, 1570959, 1191029, 1178390, 1339701, 1602376, 1654528, 1492479, 1343932, 1200303, 1288714, 1579888, 1754057, 1640748, 1660751, 1646847, 1750641, 1778055, 1528997, 1754787, 1715732, 1405135, 1538179, 1812489, 1811771, 1597105, 1486957, 1431459, 1538868, 1490664, 978985, 804641, 942449, 1299735, 1472745, 1321066, 1238558, 1286839, 1378161, 1402758]
14840A402758q6316K47481J22519k62255J40548J60015j81322J79475M3733l62478
14830A404158m5954K55580k86951j45398Q7502j00607J46479J99320K6669l2767
14820A508031j27110J20221P3577J29080l4174k17556o9912q6537M4848L05000
14810A645468j12021j94886q6987Q8789J37162J19302N0031m5437M0572J38112
14800A780105J25138k24222l82366j23437j47716J55096J90872J44762L3848l0006
14790A522074L3584j12346l28104J40923L56073Q718j13286J895j12846j0740
14780A385945j9300p1859r7410K7483P5096J28568R7695p8283j08751J32799p8402
14769A393581P8384R4261l6711j66222P66l8026N7370j2216o112j9481m8529J28132
$$ y = [1402758, 1316442, 1563923, 1686442, 1424187, 1564735, 1724750, 1543428, 1722903, 1766636, 1404158, 1358204, 1613784, 1326833, 1181435, 1268937, 1168330, 1314809, 1514129, 1540798, 1508031, 1380921, 1501142, 1574719, 1703799, 1669625, 1452069, 1382157, 1295620, 1340468, 1645468, 1533447, 1338561, 1251574, 1340363, 1477525, 1596827, 1646858, 1601421, 1641993, 1780105, 1905243, 1681021, 1298655, 1175218, 1027502, 1182598, 1373470, 1518232, 1552080, 1522074, 1555658, 1443312, 1115208, 1256131, 1612204, 1620922, 1507636, 1509531, 1396685, 1385945, 1366645, 1294786, 1197376, 1224859, 1299955, 1428523, 1526218, 1447935, 1339184, 1471983, 1393581, 1471965, 1566226, 1529515, 1363293, 1364059, 1326033, 1383403, 1371187, 1365075, 1345594, 1297065, 1425197]
14757A425197k9647j86036J28988N9411j64269N5226R0282J05916K6421o3384
14747A448105J7115K76967J76721k558j35170k63826n6279K69934J58430r9395
14737A790044j09747M6722J02202j01500m47871m2338K43381j60164k03563K14163
14727A331329K13532J09525j71009K3961q4419L61487K8885o2664M8668l1926
14717A767369k47449J78155k6917k67642J12467J42506k4063J03648N6217k72408
14707A521883J8584N0308P8063j68048j26890j1085K62420L75371R2735k20584
14697A872757l35456j70828M4459N1435j5713r2555J54286K8634p4309L3860J34064
14686A630634j87493j05382j08776n0417K03959L45316M9838j41686l4782N2386
$$ y = [1425197, 1395550, 1209514, 1338502, 1397913, 1233644, 1288870, 1379152, 1485068, 1511489, 1448105, 1465220, 1742187, 1918908, 1916350, 1781180, 1517354, 1461075, 1731009, 1889439, 1790044, 1680297, 1727019, 1829221, 1727721, 1279850, 1237512, 1480893, 1320729, 1117166, 1331329, 1544861, 1654386, 1483377, 1507338, 1422919, 1784406, 1813291, 1750627, 1799295, 1767369, 1519920, 1698075, 1671158, 1403516, 1515983, 1658489, 1634426, 1738074, 1794291, 1521883, 1540467, 1590775, 1668838, 1500790, 1373900, 1362815, 1625235, 2000606, 2093341, 1872757, 1537301, 1366473, 1410932, 1462367, 1446654, 1354099, 1508385, 1537019, 1462710, 1496570, 1630634, 1443141, 1337759, 1228983, 1178566, 1382525, 1727841, 1777679, 1635993, 1601211, 1653597]
14676A653597M7807k3142K66691r534N4950k83315m19142j86651K10579J74645
14666A486485R7216J42034J32492j15388k7422J07341j07930j64115n4833K83894
14656A779774r345J5841j43244R2615K7481j03356m843J01884p8057r3157n3895
14645A531698k94716P4262K34809K9942J31063j1071o9219M114J34793j5405k70894
14634A479376O9198L7775O6607k7797l1238p4521J22927J1212j51989J2281J875
14623A515706k10739l05918L08963L13682K43272L7367o7143L7153j65312N6484
14613A763515K49839r5993k14224j52442l4086j430Q5878q2247l79275O1867O5349
14602A266751N1266k8463L42663J82184o7888r9186K3328K04804K19140k28715
$$ y = [1653597, 1701404, 1678262, 1944953, 1935419, 1990369, 1707054, 1287912, 1101261, 1311840, 1486485, 1583701, 1725735, 1858227, 1742839, 1715417, 1822758, 1714828, 1550713, 1495880, 1779774, 1770429, 1786270, 1643026, 1735641, 1763122, 1659766, 1654923, 1756807, 1678750, 1585593, 1531698, 1236982, 1311244, 1546053, 1575995, 1707058, 1695987, 1626768, 1630882, 1765675, 1750270, 1479376, 1548574, 1586349, 1652956, 1625159, 1593921, 1519400, 1642327, 1653539, 1501550, 1513831, 1515706, 1304967, 999049, 1308012, 1621694, 1864966, 1902333, 1835190, 1872343, 1707031, 1763515, 2013354, 1917361, 1703137, 1550695, 1516609, 1515179, 1601057, 1518810, 1139535, 1201402, 1266751, 1318017, 1289554, 1632217, 1814401, 1746513, 1647327, 1670655, 1875459, 2094599, 1865884]
14592A865884l00840l68322l17583j9027J94745M8267q1224J35602J83698Q7068
14582A428268J02456m0884J43236K77444J62134r5712l6842k1586j40216k39523
14572A538775P7217K37353q6870N0411j23710P898O7235q8975M7140K46779K26144
14561B199397k52276j53328O2560r9072l10358n3311J53083L94128K57469O7535
14551B265827j80236N4978k9597n7998m3754l76913J34215J84991K92287j50325
14541B093475m89266O8253K13847R3563J58793j2082j42819j50968j42799l40813
14531A349184J32465M80129K40773J15039P8212N4067j13378l19679l62677k43748
14521A410387K90260n6780p3448q3301m9428Q0793J48320j04826j34322K66669
$$ y = [1865884, 1565044, 1196722, 879139, 860112, 1054857, 1103124, 1021900, 1157502, 1341200, 1428268, 1530724, 1489840, 1633076, 1910520, 2072654, 1976942, 1940100, 1918514, 1778298, 1538775, 1615992, 1853345, 1766475, 1816886, 1693176, 1701074, 1768309, 1679334, 1726474, 1973253, 2199397, 1947121, 1793793, 1856353, 1757281, 1446923, 1393612, 1546695, 1940823, 2198292, 2265827, 2085591, 2140569, 2110972, 2052974, 2009220, 1632307, 1766522, 1951513, 2243800, 2093475, 1604209, 1672462, 1886309, 1979872, 2138665, 2126583, 1983764, 1832796, 1689997, 1349184, 1481649, 1961778, 2202551, 2317590, 2395802, 2449869, 2336491, 2016812, 1654135, 1410387, 1700647, 1643867, 1570419, 1487118, 1437690, 1518483, 1666803, 1561977, 1427655, 1694324]
14511A694324K4670J53872j26418j36734K42484K70399k76784j12881Q1354J94867
14501B009153K47747l01239l15683l7741J6445Q9503L5156m2828k0029J6183L17282
14490B013949J65214l10978K1861p6252k7278l5657r9442j85707o7976J57289
14480A555023o5170P3604J31708P0399M5676k01173L93390k4851k09217j94716
14470A574673R8211J2005j9793R3980o1p623r8244N2426L80517p2552k61054l1772
14458A720713k48681L459M72427K63037J49826j13876k71609k22665r7710K52282
14448A907203k68852J34844K97031j09232j44289N790j92216Q529l00939J31900
14438A469769k9215L82964K92719k4838q8746N6426J61037j21691j37519n1578
$$ y = [1694324, 1718994, 1872866, 1746448, 1609714, 1852198, 2122597, 1845813, 1732932, 1814286, 2009153, 2256900, 1955661, 1639978, 1602237, 1618682, 1708185, 1743341, 1700513, 1680484, 1696667, 2013949, 2179163, 1868185, 1890046, 1813794, 1786516, 1750859, 1651417, 1465710, 1397734, 1555023, 1489853, 1563457, 1695165, 1765564, 1811240, 1610067, 2003457, 1978606, 1769389, 1574673, 1672884, 1684889, 1665096, 1759076, 1759015, 1751392, 1653148, 1705574, 2086091, 2013539, 1752485, 1720713, 1472032, 1475491, 1947918, 2210955, 2360781, 2246905, 1975296, 1752631, 1654921, 1907203, 1638351, 1773195, 2070226, 1960994, 1816705, 1822495, 1630279, 1638808, 1337869, 1469769, 1440554, 1823518, 2116237, 2091399, 2002653, 2059079, 2220116, 2098425, 1960906, 1909328]
14428A909328M2750K206n0460J09482N4742n4967p9953j37221K78371J36887J17960
14417B329125r7204p4138o4036J51275q7855j44447J8012o1010j62184J71386
14407A978924M8467Q5198Q9647k40041j13336K37224J66977k5285l24853P6855
14397A979777q3959L7219o6501J26730N2575m44870j48714K69792K97034m5453
14387A973630l52102r0784K95532J76441j6349r6039L04999j06691j9401K28594
14377B297830J28341J47754n8470j20710O9637J55520l7053q6157j13075R9799
14367B483416p4845k96235J03195k5259j50122o4102k6980J83482J02282k03668
14357B031164q5729L95737P0848P2378k80790k23913J71175O0161k03912J68699
$$ y = [1909328, 1952078, 1954284, 1903824, 2013306, 2068048, 2013081, 1933128, 1795907, 2074278, 2211165, 2329125, 2231921, 2157783, 2093747, 2245022, 2157167, 2012720, 2030732, 1969722, 1807538, 1978924, 2027391, 2112589, 2202236, 1962195, 1848859, 2086083, 2253060, 2227775, 1902922, 1979777, 1895818, 1933037, 1866536, 1993266, 2045841, 1600971, 1452257, 1722049, 2019083, 1973630, 1621528, 1530744, 1826276, 2002717, 1986368, 1890329, 2195328, 2088637, 2069236, 2297830, 2426171, 2573925, 2515455, 2394745, 2464382, 2619902, 2582849, 2496692, 2383617, 2483416, 2408571, 2112336, 2215531, 2190272, 2040150, 1976048, 1949068, 2132550, 2234832, 2031164, 1945435, 2341172, 2412020, 2484398, 2203608, 1979695, 2150870, 2211031, 2007119, 2175818]
14347B175818K49959m9372J945j09851l97269q1481N94408K76556K2147m2740
14337B640120k88775J70623J13071j29005k65972M9243J39302k45738q4412j22206
14327A976251k0154L76213L6294l3825k67527K05615J21337j2984j85979m55393
14317A739848l0285k4328J01535K42585q0128r5340J92850M3637k39133L6734
14307A887975J02543n9410J91830j84137J85769j40149j10360M0648L65182R4062
14297B373953k62929p6356m2713J435p6208Q6138k7931L35294q3070m12766J66821
14286A981668O8275M3611R4967l05963k10108L12622L27203K9006l2091r6667
14276B212523j92012P0841J26684q6734p2559q0197o7287j03364J75682K06429
$$ y = [2175818, 2425777, 2376405, 2378350, 2268499, 1871230, 1789749, 2384157, 2660713, 2682860, 2640120, 2351345, 2521968, 2635039, 2506034, 2240062, 2289305, 2428607, 2182869, 2098457, 1976251, 1956097, 2332310, 2368604, 2334779, 2067252, 2272867, 2394204, 2381220, 2195241, 1739848, 1709563, 1685235, 1786770, 2029355, 1949227, 1853887, 2046737, 2090374, 1851241, 1887975, 1990518, 1931108, 2122938, 1938801, 2124570, 1984421, 1874061, 1914709, 2279891, 2373953, 2111024, 2034668, 1991955, 1993390, 1917182, 2003320, 1975389, 2310683, 2227613, 1814847, 1981668, 2049943, 2093554, 2188521, 1882558, 1672450, 1985072, 2312275, 2341281, 2309190, 2212523, 2020511, 2091352, 2218036, 2131302, 2058743, 1978546, 1911259, 1807895, 1983577, 2190006]
14266B190006J21425k24306l06503j26848K61714L02949J86123p9686j87494l12989
14256A824391r1599Q6118Q8617o4651J58051J37221L3669o1287j51780j84808
14246A773942R8784N8176P4024J41142o3151P7720Q301J86300L5409j8672j30231
14235B241744j89948p5925J08089j49334P960j3648k19842q9340L09584K75524
14225B204864l2690J68974Q2275k44414k59708l7839n8158K78826J4227j85720
14215A930637O4611k11158j29301q8614n3703n6162j774k664K21158K45075p1693
14204A846412p6934J9171J41985n114O2691M19174J15193k62232J7015o0476Q6943
14193B303828J6092R830k97077J03271J60841J87694J13644j31216j39246M9469
$$ y = [2190006, 2311431, 2087125, 1780622, 1653774, 1915488, 2218437, 2404560, 2324874, 2137380, 1824391, 1732792, 1818910, 1907527, 1842876, 2000927, 2138148, 2171817, 2110530, 1958750, 1773942, 1872726, 1930902, 2004926, 2146068, 2082917, 2160637, 2168938, 2355238, 2390647, 2371975, 2241744, 2051796, 1975871, 2083960, 1934626, 1942586, 1928938, 1709096, 1619756, 1929340, 2204864, 2172174, 2341148, 2423423, 2179009, 1919301, 1881462, 1823304, 2102130, 2116357, 1930637, 1995248, 1784090, 1654789, 1566175, 1512472, 1456310, 1454536, 1451872, 1673030, 1918105, 1846412, 1769478, 1788649, 1930634, 1925520, 1988211, 2407385, 2522578, 2260346, 2277361, 2216885, 2303828, 2319920, 2329750, 2032673, 2135944, 2296785, 2484479, 2598123, 2466907, 2327661, 2377130]
14183B377130J69967m9520p4432k90581k56633q3353L2734J65459J87316J91395
14173B369482r0650J81155k26291j39725j05988P0218J69276O7662n0899J76438
14163B420678q1886m1365j59860j92704J97743J76930j13222K77000K99383N8595
14153B841292j77147k39786K12969l6141j35379j45286k83923j72759J13174J66502
14143B143516k0609l45J73178r0890J77055K15304O9756J17921k50070m46362
14133B088454j33466J51490j53412k03476K83943K43941R677l9J25663K35656
14123B648431J94147q8108j97735j14902j38955p0744L04485l3244J05581J72400
14113B781356K10245n2720J9678m2041k35635M8182j50747k7609Q8165M2900J32896
$$ y = [2377130, 2547097, 2497577, 2423145, 2132564, 1875931, 1792578, 1825312, 1990771, 2178087, 2369482, 2278832, 2459987, 2233696, 2093971, 1987983, 2058201, 2227477, 2295139, 2244240, 2420678, 2338792, 2297427, 2137567, 1944863, 2142606, 2319536, 2206314, 2483314, 2782697, 2841292, 2664145, 2424359, 2637328, 2601187, 2465808, 2320522, 2036599, 1863840, 1977014, 2143516, 2122907, 2122562, 2295740, 2204850, 2381905, 2597209, 2666965, 2784886, 2534816, 2088454, 1954988, 2106478, 1953066, 1749590, 2033533, 2277474, 2287151, 2287112, 2412775, 2648431, 2842578, 2754470, 2556735, 2441833, 2302878, 2232134, 2536619, 2503375, 2608956, 2781356, 2991601, 2938881, 2958559, 2916518, 2680883, 2729065, 2578318, 2550709, 2638874, 2681774, 2814670]
14102B814670r724q7330l46153j73019M78775J17834l37457k49226j75568L7448
14092B070250K95253J8285J38408J13446l84618j49553l03338J0433K27996J04143
14082B140705J35702K614K54972K23325k11425q9202Q536j21270j09302j20974
14072B113681K3072N0545L59825K78450l38683j44163j8320K20170P5628J10139
14062B730344J58986r1150p7513p3141j04108K04928L44295r9200q1153J63458
14052C075746k05732l01969k33213k67985J35022K68500j63354M1224m214Q9329
14042B433354P8027o8192j82367j6877k6293J54269O4618n8679k1354J70043K21031
14031B747580m9234j71942j46640J72522L20445J7059Q998k10247j13307Q4681
$$ y = [2814670, 2804946, 2717616, 2371463, 2198444, 2677219, 2795053, 2457596, 2208370, 2032802, 2070250, 2365503, 2383788, 2522196, 2635642, 2251024, 2101471, 1798133, 1808566, 2036562, 2140705, 2276407, 2279021, 2533993, 2757318, 2545893, 2456691, 2465227, 2343957, 2234655, 2113681, 2136753, 2187298, 2547123, 2825573, 2486890, 2342727, 2324407, 2544577, 2620205, 2730344, 2889330, 2798180, 2720667, 2647526, 2543418, 2748346, 3092641, 2993441, 2912288, 3075746, 2870014, 2568045, 2334832, 2066847, 2201869, 2470369, 2307015, 2348239, 2344025, 2433354, 2511381, 2443189, 2260822, 2243945, 2217652, 2371921, 2436539, 2377860, 2356506, 2526549, 2747580, 2698346, 2526404, 2379764, 2552286, 2872731, 2889790, 2898788, 2688541, 2575234, 2659915]
14021B659915j14293N1031K05497j82481j02925Q3008M2249j70470J05586Q9494
14011B666611Q1702o3123p513j28340J45757R3399j11557l1012k74507K3491O8346
14000B463254J76525o8311k2592J12684J83211j12443K36745j39672J05833M229
13990B939463l27100j45117k6638N6572L43068L75555j57685j43914j48733l16979
13980B448492k03341K871K45549L25101J00884j28636m45956Q9530L42680J57788
13970B934962O7187k71871k98644p6977j69068J52927P8181J71469L04990R3983
13960B987139k41325j5477Q5154J04922k82718j91798J82560J64159j1365P1705
13950B852956L75605L1965N3275j33749l40036L9718j12926J18669J14803J08761
$$ y = [2659915, 2545622, 2596653, 2802150, 2619669, 2516744, 2599752, 2642001, 2471531, 2577117, 2666611, 2748313, 2685190, 2677677, 2549337, 2695094, 2788493, 2676936, 2645924, 2371417, 2394908, 2463254, 2639779, 2571468, 2548876, 2661560, 2844771, 2732328, 2969073, 2829401, 2935234, 2939463, 2612363, 2467246, 2440608, 2497180, 2840248, 3215803, 3058118, 2914204, 2765471, 2448492, 2245151, 2248022, 2493571, 2818672, 2919556, 2790920, 2344964, 2434494, 2777174, 2934962, 3002149, 2730278, 2431634, 2354657, 2185589, 2338516, 2416697, 2588166, 2893156, 2987139, 2745814, 2730337, 2815491, 2920413, 2637695, 2445897, 2628457, 2792616, 2781251, 2852956, 3228561, 3260526, 3313801, 3180052, 2840016, 2879734, 2766808, 2885477, 3000280, 3109041]
13940C109041R7366j62888j00062o6914q8834k13824k40152j55002M6790P7511
13930B303032N4419j25134q0172K21987L32167j56842r5349j31283K51576N60482
13920C134883J51555l73804j92773K40535L5195R2102l6072j51757j41391j2468
13910B746005J53791m7903j6333J74295L6818j17099k0106j86430r8828L55628
13900B979838R5399Q3474j58222K95113K6326o7453m4773j66009j3110j20349
13890B910234J81594L00314p4430p9931J68451j97123j91163j32590j71141J05068
13880B819283R5830K34617K83283N1285j75087R8752j00308l52176J14928Q795
13870C079202M5173K7607j17733k24712J7595J6540J29716O615m4226Q5340j40579
$$ y = [3109041, 3206407, 3043519, 2943457, 2876543, 2787709, 2573885, 2333733, 2178731, 2225521, 2303032, 2357451, 2232317, 2152145, 2374132, 2706299, 2549457, 2454108, 2322825, 2574401, 3134883, 3286438, 2912634, 2719861, 2960396, 2995591, 3087693, 3051621, 2899864, 2758473, 2746005, 2899796, 2851893, 2835560, 3009855, 3046673, 2929574, 2909468, 2723038, 2624210, 2979838, 3075237, 3158711, 3000489, 3295602, 3321928, 3254475, 3209702, 3043693, 3030583, 2910234, 3091828, 3392142, 3317712, 3237781, 3406232, 3209109, 3017946, 2885356, 2714215, 2819283, 2915113, 3149730, 3433013, 3484298, 3309211, 3407963, 3307655, 2955479, 3070407, 3079202, 3124375, 3151982, 3034249, 2809537, 2827132, 2843672, 2973388, 2980003, 2935777, 3021117, 2880538]
13859B880538j50222J72552k72858l5409J39347J08397k14502K42958J37313j75833
13849B832281J30820J18971M1845k80460J55570N1046k8435J43050J02716k32592
13839C034812k83319m1202r0670K61731J68975O5754J68838J37156j38164k37430
13829C046481k49191J50701k5262p9348R3691k326L7812J80717J88958j11696
13819C230537m7557J1214r0421K5319j3985J83493p8783k58510R4467J27324q4518
13808C098580J97181K61802k06421j72930j89986k5979J19322j01459r258Q4787
13798C055639K08034J16929n3458k43921j7744L51190J95706R2885j43642j4521
13788C547097j91372m6573j26373P3159L323j76143p0726J37810J3356L5609j87467
$$ y = [2880538, 2730316, 2902868, 2630010, 2594601, 2733948, 2842345, 2627843, 2870801, 3008114, 2832281, 2963101, 3082072, 3123917, 2843457, 2999027, 3050073, 3021638, 3164688, 3267404, 3034812, 2751493, 2710291, 2619621, 2881352, 3050327, 3116081, 3284919, 3422075, 3283911, 3046481, 2797290, 2947991, 2922729, 2843381, 2937072, 2934746, 2972558, 3153275, 3342233, 3230537, 3182980, 3194194, 3103773, 3129092, 3115107, 3298600, 3219817, 2961307, 3055774, 3183098, 3098580, 3295761, 3557563, 3351142, 3178212, 2988226, 2962247, 3081569, 2980110, 2970852, 3055639, 3263673, 3380602, 3327144, 3083223, 3065479, 3416669, 3612375, 3705260, 3561618, 3547097, 3355725, 3309152, 3182779, 3255938, 3259261, 3083118, 3012392, 3150202, 3163558, 3199167, 3011700]
13777C011700l9936Q1253J29330n2403j06521J18011P1328m3258k53337j76392
13767B739775k8595K81037J18905J29305K51124J09136j07432n8003j46995k0744
13757C267513K56085j84991m9474k41461j60858j45189J46312K20984J69424q1771
13747C196574P0921K58940K07096j91807m4906R0870r8910n4656J9510j38384
13737C315248k19506n779M24374K35272j09368o1805p8367L2060o1794O1643r068
13726C522910O6625K3197j62857l40460J7284K01125j04630o9159j12981P2613
13716C113667L2075J60318M4856j10317j66759R6106K30821O5761j33769P5324
13706C408083j33992K55567J63735j51416J736K9497k55789j49215j04727n9196
$$ y = [3011700, 2971764, 3053017, 3182347, 3129944, 3023423, 3141434, 3212762, 3169504, 2916167, 2739775, 2711180, 2992217, 3111122, 3240427, 3491551, 3600687, 3493255, 3435252, 3288257, 3267513, 3523598, 3338607, 3289133, 3047672, 2886814, 2741625, 2887937, 3108921, 3278345, 3196574, 3267495, 3526435, 3733531, 3541724, 3496818, 3587688, 3488778, 3434122, 3453632, 3315248, 3095742, 3089963, 3514337, 3749609, 3640241, 3578436, 3500069, 3532129, 3470335, 3531978, 3522910, 3589535, 3612732, 3449875, 3109415, 3126699, 3327824, 3223194, 3154035, 3041054, 3113667, 3145742, 3306060, 3350916, 3240599, 3073840, 3169946, 3400767, 3466528, 3332759, 3408083, 3274091, 3529658, 3693393, 3541977, 3543713, 3573210, 3317421, 3168206, 3063479, 3004283]
13696C004283Q3606j37L33202K470j47303n7324J3090q288L0457J57717K7701
13685C439474R4966k72030O9193K49228R2180J03980J41042K4921j94842j17713
13675C630399j28343j18566o9226K18644j0952j98916J62927J0204O3398r2217
13665C467352q1176Q5314p8081J78308J67567P6924j12249j90448J08464j43233
13655C478742J08871J70809J18387k48985J22848M97388j4104m08918l26675K4146
13645C522509m398M5095J87918j1734l85530K27952O4571J66269k037Q210k51292
13634C567533R178J26653k51942j35482M8244K27210K46185Q9055K05218J2156
13624D144008k86803j35536p5794j70417Q1837J36752j56670L08674Q6547l80406
$$ y = [3004283, 3087889, 3087752, 3420954, 3423424, 3276121, 3218797, 3231887, 3223599, 3254056, 3411773, 3439474, 3534440, 3262410, 3331603, 3580831, 3673011, 3776991, 3918033, 3942954, 3748112, 3630399, 3502056, 3383490, 3314264, 3532908, 3521956, 3323040, 3485967, 3496171, 3559569, 3467352, 3386176, 3471490, 3393409, 3571717, 3739284, 3816208, 3703959, 3513511, 3621975, 3478742, 3587613, 3758422, 3876809, 3627824, 3750672, 4248060, 4233956, 3825038, 3498363, 3522509, 3518111, 3563206, 3751124, 3739390, 3353860, 3581812, 3646383, 3812652, 3810615, 3818825, 3567533, 3576711, 3703364, 3451422, 3315940, 3364184, 3591394, 3837579, 3926634, 4131852, 4144008, 3857205, 3721669, 3645875, 3475458, 3557295, 3694047, 3537377, 3846051, 3932598, 3552192]
13614C552192k03816J91249o2489j38910J68325L42353R4596k94438j18618J70244
13604C700688K27943Q9860L0482m98106k72769J35357K47232P9352j88366o6546
13594C485127J20408K69331K25931k25810j81609J31046P7332j85326L51624N4778
13584D122832k62427J27171O7381l21478j22583j71184j35694K40545k33516R4970
13574C406017J8304J2284m7001M2368J63987j73113j98512P928O2574J74262J96838
13563C665936K27245k0495M1290J38649J62546J51555r1787J24870k18335m30579
13553C750895j61832o432K32902K21083J01070j99112k08449k18835j60075k223
13543C348992M18377P9667j66864o1743L25082P3513J49382j56793q7852j83492
$$ y = [3552192, 3348376, 3539625, 3477136, 3338226, 3506551, 3848904, 3943500, 3649062, 3530444, 3700688, 3928631, 4018491, 4048973, 3550867, 3278098, 3413455, 3660687, 3740039, 3551673, 3485127, 3605535, 3874866, 4100797, 3874987, 3693378, 3824424, 3901756, 3716430, 4068054, 4122832, 3860405, 3987576, 4054957, 3733479, 3610896, 3439712, 3304018, 3544563, 3311047, 3406017, 3424321, 3436605, 3389604, 3431972, 3595959, 3422846, 3224334, 3232262, 3294836, 3469098, 3665936, 3893181, 3872686, 3913976, 4052625, 4215171, 4366726, 4274939, 4399809, 4181474, 3750895, 3589063, 3582631, 3815533, 4036616, 4137686, 3938574, 3730125, 3511290, 3351215, 3348992, 3767369, 3847036, 3680172, 3618429, 3943511, 4017024, 4166406, 4009613, 3921761, 3738269]
13533C738269J93557J21618n8969J06381J12615O9528l35991l11160j56429K65211
13523C744630L18176L458k9622O2034L8356j47340j70781J59072o4114M480J77548
13512D095897n1120q2307R6655k04548k05818J10322J80370J57723r6898K7423
13502D027699j68275p4222J74984J75051l18463j79826m0488M1887J76295j84379
13492C630263K45095K04684l3786L6968K6916j14722J09062M1665p0224J73636
13482D249557j68880j31088O4443R1865Q4733J99752k12376p6872J4236J1986
13472D127356r3613p7052J281J81091J31385k87696p0090L87322j59455l78550
13462C761979N2564J18017J12565O5036j45740o8934J49829J93304k36451k50569
$$ y = [3738269, 3931826, 4053444, 3994475, 4100856, 4213471, 4282999, 3947008, 3635848, 3479419, 3744630, 4062806, 4066264, 4036642, 4098676, 4137032, 3989692, 3818911, 3977983, 3913869, 3918349, 4095897, 4044777, 3962470, 4059125, 3854577, 3648759, 3759081, 3939451, 4097174, 4000276, 4027699, 3859424, 3785202, 3960186, 4135237, 3816774, 3636948, 3596460, 3638347, 3814642, 3630263, 3875358, 4080042, 4046256, 4083224, 4110140, 3995418, 4104480, 4146145, 4075921, 4249557, 4080677, 3949589, 4014032, 4105897, 4190630, 4390382, 4178006, 4101134, 4115370, 4127356, 4033743, 3956691, 3957972, 4139063, 4270448, 3982752, 3912662, 4299984, 4140529, 3761979, 3814543, 3932560, 4045125, 4110161, 3964421, 3895487, 4045316, 4238620, 4002169, 3751600]
13452C751600J12187J28697L1027J67673J13335K0764K16007K00961J14463k13797
13442D642917k42923j51625j9536J0443J81064K9990j36303K7401L48831j67058
13432D523201l96026P77Q6063M0085P6882J06220j03014J49699q7764p2211K8307
13421D352219l7667J74111j48539j90627N5411M5436J58362N1707L16827J55728
13411D932968l47870k03422j1913N5882r4006J17580P4690j03680j85879q3717
13401D150633N8970L49083L59982j1391l74517M1999R3251K1463p9681J69032
13391D778824J18615k80756k86779J50853K77374j20956k31287k42813K76283
13382D439358J3844K3563k53708K82883l8417j79759J9739J75901j15557k48519
$$ y = [3751600, 3863787, 3992484, 4023511, 4191184, 4304519, 4325283, 4541290, 4742251, 4856714, 4642917, 4399994, 4248369, 4228833, 4239276, 4420340, 4450330, 4314027, 4341428, 4690259, 4523201, 4127175, 4127952, 4214015, 4254100, 4330982, 4437202, 4334188, 4483887, 4396123, 4323912, 4352219, 4314552, 4488663, 4340124, 4149497, 4204908, 4250344, 4408706, 4460413, 4777240, 4932968, 4585098, 4381676, 4369763, 4425645, 4331639, 4449219, 4523909, 4420229, 4234350, 4150633, 4209603, 4558686, 4918668, 4907277, 4532760, 4574759, 4668010, 4689473, 4609792, 4778824, 4897439, 4616683, 4329904, 4480757, 4758131, 4637175, 4405888, 4163075, 4439358, 4453202, 4476765, 4223057, 4505940, 4467523, 4287764, 4307503, 4483404, 4367847, 4119328]
13372D119328Q9519q358J24162j38078L4962L8845N8028M8713q4197l5206O1984
13361D309702J25308J02940R7593k58r0017n0568J86318P0932K7358j95921m0866
13350D542521j04617N9949Q1940N1866J13590P6348k67336k91610K12417J60424
13340D635492J92262L31315N9289Q4022J29219m00462m27609j35188j76153k85587
13330D006600P8135K71799J46542j38141l6924O5685J77231R1125R2603j69299
13320D585356r9306J3510J23575K61985J99521r0114k37353l39993j08665K18960
13310D527476M75660Q3339l13868l22239N3784J98425k6869k4895j80645k74684
13300D195484j78181K91969L00563M0884l7363q824P0018J41565P7599j49900
$$ y = [4119328, 4208847, 4200489, 4324651, 4186573, 4221535, 4260380, 4318408, 4367121, 4282924, 4247718, 4309702, 4435010, 4537950, 4635543, 4635285, 4545268, 4494700, 4681018, 4751950, 4779308, 4583387, 4542521, 4437904, 4497853, 4579793, 4631659, 4745249, 4821597, 4554261, 4262651, 4475068, 4635492, 4827754, 5159069, 5218358, 5302380, 5431599, 5031137, 4603528, 4468340, 4292187, 4006600, 4084735, 4356534, 4503076, 4364935, 4328011, 4393696, 4570927, 4662052, 4754655, 4585356, 4486050, 4499560, 4623135, 4885120, 5084641, 4994527, 4757174, 4417181, 4308516, 4527476, 5003136, 5086475, 4772607, 4450368, 4504152, 4702577, 4675708, 4650813, 4470168, 4195484, 4017303, 4309272, 4609835, 4650719, 4613356, 4604532, 4674550, 4816115, 4893714, 4743814]
13290D743814k02326M9659J44666M9799J38993l6496N284K3548k58863Q5489Q7462
13279D831029j26373j6576J29695q783l49333o9129J74081p0194J71239O35651
13269E301307J47453k32907j78328k17693k13953L4849N7613k1352J11662m4949
13259D743702J08650M0773K6283k785J75964k4502m3705J95407o5515j36734j61464
13248D856074O399m0481L29257q9573n54955k71909L6364M32215N6837j11115
13238D649113K52695L31734j6195J2784r3263L0146Q6822j89901k99858k35616
13228D528461n292K92215M5608J61213M80778J8973L952j45172R3918m4529j80378
13217E249747R4800J12402l25426j58691M3789R7026l4966j71170M067O821J19160
$$ y = [4743814, 4541488, 4591147, 4735813, 4785612, 4924605, 4888109, 4893393, 4916941, 4658078, 4743567, 4831029, 4704656, 4688080, 4817775, 4808992, 4459659, 4390530, 4564611, 4494417, 4665656, 5301307, 5448760, 5215853, 5037525, 4819832, 4605879, 4640728, 4698341, 4676989, 4788651, 4743702, 4852352, 4893125, 4919408, 4916623, 5092587, 5068085, 5024380, 5219787, 5154272, 5017538, 4856074, 4862473, 4821992, 5151249, 5061676, 4506721, 4234812, 4271176, 4703391, 4760228, 4649113, 4901808, 5233542, 5217347, 5230131, 5136868, 5167014, 5253836, 5063935, 4764077, 4528461, 4523169, 4815384, 4860992, 5022205, 5502983, 5521956, 5525908, 5380736, 5474654, 5430125, 5249747, 5344547, 5456949, 5131523, 4972832, 5016621, 5113647, 5078681, 4907511, 4911578, 4918399, 5037559]
13206E037559j69259J92440K38594K73428j20291l61793P2961m8996K199L8144
13196E154986Q4305j00699J2580P1522N3983k57747L771R95K37489J27884r8874
13185E290195j11265Q4793n217j11044M9963j19470J0763O0400K44682O4698K5189
13174E483687q2879j08460j39411m3915J37206j52576p2518K61799J57776M8921
13164E489630M5000j34317J17499j59842l09713K23665M97914j54386M9742j6577
13154E648615l08875j53187K03768J10136J26478P1446n918k34507J0393m32717
13144E035632l58718K36579J08489K45262K77511j38467K56K81521K33665m6811
13134E874919l14683j4241j72296k02127J41276P5297O2336M8214K4857r9155
$$ y = [5037559, 4868300, 5060740, 5299334, 5572762, 5452471, 5090678, 5163639, 5114643, 5116842, 5154986, 5239291, 5138592, 5151172, 5222694, 5276677, 5018930, 5022701, 5023696, 5261185, 5389069, 5290195, 5178930, 5263723, 5258506, 5147462, 5197425, 5077955, 5088718, 5149118, 5393800, 5458498, 5483687, 5400808, 5292348, 5152937, 5109022, 5246228, 5093652, 5021134, 5282933, 5440709, 5489630, 5534630, 5400313, 5517812, 5357970, 5048257, 5271922, 5769836, 5615450, 5665192, 5648615, 5339740, 5186553, 5390321, 5500457, 5626935, 5698381, 5692463, 5457956, 5468349, 5035632, 4676914, 4913493, 5021982, 5267244, 5544755, 5406288, 5406544, 5688065, 5921730, 5874919, 5560236, 5545995, 5373699, 5171572, 5312848, 5388145, 5450481, 5498695, 5523552, 5424397]
13124E424397j83304J01578O7339k89609p4512K84018K33j48459m0921K0116N6191
13113E217067J16509J01406O3517m96n0520m8300n1024J64730o8572J46142K95406
13102E885865j78724k09611L83883L96804k03481j15296l8991k03313j90816j37910
13092E388410j22250q007J42255J03164J25564K62459J95500m2185m9865o0393
13082E934652K2286p9485k71043j90392p6384J21995m8610j01939J23478o2888
13072E371670k50226j9636L36428L1619n1862q3551K65804K02927m0022K28750
13062E991901J63859k00067n32956R119K34576j28651k43874k57198J26710L89406
13052E552825J27978j69860K06813m8546N740J63887P4453j2050L2473J06312
$$ y = [5424397, 5241093, 5342671, 5410010, 5120401, 5045889, 5329907, 5330140, 5181681, 5140760, 5160876, 5217067, 5333576, 5434982, 5498499, 5498003, 5447483, 5399183, 5348159, 5512889, 5444317, 5590459, 5885865, 5707141, 5497530, 5881413, 6278217, 6074736, 5959440, 5920449, 5717136, 5526320, 5388410, 5266160, 5258153, 5400408, 5503572, 5629136, 5891595, 6087095, 6044910, 5995045, 5934652, 5956938, 5877453, 5606410, 5416018, 5339634, 5461629, 5413019, 5311080, 5434558, 5371670, 5121444, 5101808, 5438236, 5469855, 5417993, 5334442, 5600246, 5803173, 5763151, 5991901, 6155760, 5955693, 5422737, 5431856, 5666432, 5537781, 5293907, 5036709, 5163419, 5552825, 5680803, 5510943, 5717756, 5669210, 5674950, 5838837, 5913290, 5901240, 5933713, 6040025]
13042F040025k61184r3801k47715M7343J40548J37138n0156j68822j52504K99413
13032E690285M9482j07513J46623J78263j13736L12247J69262k78223k17073j7926
13022E811691J38543N4421J35241L8006J61109m2667k39005Q4956L5830m2365
13012F135760J09205L00289p2113n0026k88679k21408j00174J46994j57041l7961
13002E764846K17405n1449L2553k0571m3807r5812J79759j63322j08618K28267
12992E939251N7346J79708M3193l74092j17390K61618Q2581K3260j35952O8380
12982F027903O1054k37846j30280M28810K78167j63135N6369j60008j88522P8706
12972F051218L4614R8121M2093j2198R3426k60216N8732P578J10612J59803r6969
$$ y = [6040025, 5778841, 5685040, 5437325, 5484668, 5625216, 5762354, 5712198, 5543376, 5390872, 5690285, 5739767, 5632254, 5778877, 5957140, 5843404, 6155651, 6324913, 6046690, 5829617, 5811691, 5950234, 6004655, 6139896, 6177902, 6339011, 6296344, 6057339, 6142295, 6178125, 6135760, 6244965, 6545254, 6473141, 6423115, 6134436, 5913028, 5812854, 5959848, 5802807, 5764846, 5982251, 5930802, 5963355, 5942784, 5898977, 5803165, 5982924, 5819602, 5710984, 5939251, 5996597, 6176305, 6219498, 5845406, 5728016, 5989634, 6072215, 6095475, 5959523, 6027903, 6088957, 5851111, 5720831, 6149641, 6427808, 6264673, 6321042, 6161034, 5972512, 6051218, 6085832, 6183953, 6226046, 6213848, 6307274, 6047058, 6105790, 6113368, 6223980, 6383783, 6286814]
12961F286814j10105J2492j73840J47085q8714N2442o5692l00495L4962n9391
12951E735558n4014K58878K31854M8658j33793n801j43804j48249J60783K62761
12941F212831L59481j4754j44263l7031j64293l08629p5368K54960J51078o1760
12931F172252p1727q1396J02134L76182K67149j56157l71578j17642K92026R1201
12921F502444L4025P2818L2151K9069J62509J9685O3005k35926l90948j89015
12911F099817Q5064J74088L6525K07946m4584K09049j04381j10245k20522k04076
12901F128681L5150J06918j84722j17753K18498L2512J96465Q4581O3916j56334
12891F407912k2997J49744j17551k83220j69749J95980j12554K77194j9711m2521
$$ y = [6286814, 6176709, 6189201, 6015361, 6162446, 6073732, 6126174, 6060482, 5759987, 5794949, 5735558, 5681544, 5940422, 6172276, 6220934, 6087141, 6081340, 5937536, 5789287, 5950070, 6212831, 6572312, 6557558, 6413295, 6376264, 6211971, 5903342, 5827974, 6082934, 6234012, 6172252, 6100525, 6019129, 6121263, 6497445, 6764594, 6608437, 6236859, 6119217, 6411243, 6502444, 6536469, 6609287, 6641438, 6670507, 6833016, 6852701, 6915706, 6679780, 6288832, 6099817, 6184881, 6358969, 6395494, 6603440, 6558856, 6767905, 6663524, 6553279, 6332757, 6128681, 6163831, 6270749, 6086027, 5968274, 6186772, 6219284, 6415749, 6500330, 6564246, 6407912, 6384915, 6534659, 6417108, 6133888, 5964139, 6160119, 6047565, 6324759, 6305048, 6262527]
12881F262527j1410K04259J16470k5465p0660j01839Q8979M5134p5438K6700r7758
12870F361499p3332k0771o8259J40724K09438N0608O3974M6796l3508j94736k99270
12859F183163l29027J12925J52203J53580J19539j40986k39452N7890L6875K66207
12849F372917J00957k56438q8136J56300K76754J97376o8907k80390K15690P8617
12839F704740k1470j57756l4428J8467R6954j39086n3931k06624j74263Q1978
12829F114581r5643j72768K22824M09341M9422r367M63950j54997l08957j2817
12819F505569j01164P6171O2934j86992K9411K12710K140j80241N1682J17313
12809F589533L5964P6897j9105j35940q1911P282J24444J51409J42168j62188
$$ y = [6262527, 6251117, 6455376, 6571846, 6546381, 6475721, 6373882, 6462861, 6507995, 6432557, 6459257, 6361499, 6288167, 6267396, 6199137, 6339861, 6549299, 6599907, 6663881, 6710677, 6677169, 6482433, 6183163, 5854136, 5967061, 6119264, 6272844, 6392383, 6251397, 6011945, 6069835, 6106710, 6372917, 6473874, 6217436, 6129300, 6285600, 6562354, 6759730, 6690823, 6410433, 6626123, 6704740, 6683270, 6525514, 6491086, 6509553, 6606507, 6467421, 6413490, 6206866, 6032603, 6114581, 6018938, 5846170, 6068994, 6478335, 6527757, 6518390, 6982340, 6827343, 6518386, 6505569, 6404405, 6480576, 6543510, 6356518, 6385929, 6598639, 6600779, 6420538, 6472220, 6589533, 6625497, 6702394, 6683289, 6547349, 6465438, 6472720, 6597164, 6748573, 6890741, 6728553]
12799F728553j9047N8670K39769j8082o00245M5027J78479j30917J21272M92790
12789G096269r9952m70667o491J45947O4527o4500K35259J16832o0393l3266j73503
12778F750062M12147q6292n7323J61935l3217M4976L4241o2217p0306l15493O841
12767F785354l70534N4924R0889R7348J5433l1602j42421J38970J23655P3828
12757F835844J6550N5889J92547K65593q5604j53663j34065j58285j58747l05359
12747F370700M96158K06839k21352K6557K15587L4922l73405K7355J43483p2572
12737F854272m2607m0269p785P7829J7226r285J5136O5753R8641J23326J65511
12726G317748J49236j89926m77070k52675L58083L43937L283j05068J15079J69211
$$ y = [6728553, 6709506, 6768176, 7007945, 6989863, 6389618, 6434645, 6613124, 6482207, 6603479, 7096269, 6996317, 6525650, 6519159, 6665106, 6729633, 6665133, 6900392, 7017224, 6956831, 6923565, 6750062, 7162209, 7075917, 7018594, 7180529, 7147312, 7192288, 7226529, 7164312, 7094006, 6778513, 6785354, 6414820, 6469744, 6560633, 6657981, 6673414, 6641812, 6499391, 6638361, 6762016, 6835844, 6852394, 6908283, 7100830, 7366423, 7280819, 7127156, 6993091, 6834806, 6676059, 6370700, 6866858, 7073697, 6852345, 6878902, 7094489, 7129411, 6756006, 6783361, 6926844, 6854272, 6811665, 6771396, 6763611, 6841440, 6858666, 6849381, 6864517, 6930270, 7028911, 7152237, 7317748, 7466984, 7277058, 6799988, 6547313, 6905396, 7249333, 7252616, 7147548, 7262627, 7431838]
12716G431838l27036R0940K22722k36164k15933p2929Q5455k34103r0947J44071
12706F797914J15914O9945P6693j38740J07404Q7145K7753k51149j80170Q7100
12696F799809K09935J21574J4066J80619j7562R8413n2190q3881J57645N8725
12686G487153K63801k00848j83170k06991j52871l41343K30301J09633J6238K2619
12676G044522R2954J33614k9556k04487o1352J05523j31054J33509q2746K3993
12666G024920O3204K74422R6083p8159l3253j05558J77320K06207n1345J51130
12656G724971k89532n3735J9536k49032J18380j37833Q2784l13892P2643K07634
12646G181924N5108j89166J98402K57509J16271O674k15715r3509k52691q8942
$$ y = [7431838, 7104802, 7195742, 7418464, 7182300, 6966367, 6893438, 6978893, 6744790, 6653843, 6797914, 6913828, 6983773, 7060466, 6921726, 7029130, 7116275, 7144028, 6892879, 6712709, 6799809, 7009744, 7131318, 7145384, 7326003, 7308441, 7406854, 7354664, 7270783, 7428428, 7487153, 7750954, 7550106, 7366936, 7159945, 7007074, 6665731, 6896032, 7005665, 7021903, 7044522, 7137476, 7271090, 7241534, 7037047, 6975695, 7081218, 6950164, 7083673, 7000927, 7024920, 7088124, 7362546, 7458629, 7380470, 7347217, 7241659, 7418979, 7625186, 7573841, 7724971, 7435439, 7381704, 7401240, 7152208, 7270588, 7132755, 7215539, 6901647, 6974290, 7181924, 7237032, 7047866, 7246268, 7503777, 7620048, 7626722, 7411007, 7317498, 7064807, 6975865]
12636F975865K92628J14380n9932q3313J57630M157m5813M2307R9226R1194k0474
12625G567855J42807O775J49845k5002j20327K3838k96176j12780K27365J18386
12615G682586J7715j54117K42242k35866m42886j6896L28641L09351j33045l27304
12605G270421L36010J44608o3714m9097P6943j26047m4001k92271R8384L44849
12595G696085j40444m4443j77582m8621p2207O1927k05750J28521L16493l4105
12585G479874j26202L977J61835j15775q3697R748K87137K16633k48499j88809
12575G396222l8309j33737K4778J30866K31058O0387k87090O937K63688P924j03619
12564G559105m0530j40461j84770p4335k2144R7394O7550j29126o6549k9030K65588
$$ y = [6975865, 7268493, 7382873, 7322941, 7239628, 7397258, 7401415, 7355602, 7397909, 7497135, 7588329, 7567855, 7710662, 7717437, 7867282, 7842280, 7721953, 7745791, 7449615, 7336835, 7564200, 7682586, 7700301, 7546184, 7788426, 7552560, 7109674, 7092778, 7421419, 7730770, 7597725, 7270421, 7606431, 7751039, 7687325, 7638228, 7715171, 7589124, 7545123, 7252852, 7351236, 7696085, 7555641, 7511198, 7333616, 7284995, 7212788, 7274715, 7068965, 7197486, 7513979, 7479874, 7353672, 7357649, 7519484, 7403709, 7320012, 7329760, 7616897, 7833530, 7585031, 7396222, 7357913, 7224176, 7248954, 7379820, 7610878, 7671265, 7384175, 7391112, 7654800, 7662724, 7559105, 7518575, 7378114, 7193344, 7119009, 7096865, 7194259, 7261809, 7132683, 7066134, 7037104, 7302692]
12553G302692L43925J97827K7615J1168j51564L9129j57130J03904K10490J9667
12543G947723k40500j41513j64152O927n351l6960L6680R8338M5348K4229p292
12532G563477O8898P1726J1723l10287k4909K74962N647j21054m3427l05015j17514
12521G074227M6098K41260L98592J76742l7269j43999k48487q7562j10912q5615
12511G223075L8627J63103o4514K04882J57533J50236K55824J82611O9143j96541
12501H183979J0137j65721j04329l8633l4937m60306k66300J09613J30397J9914
12491G383814n5029J38396J81214K39747J52538m5428J2469K00935j78136m47229
12481G583291q8669q3993o6301j51561J90633K34671O060k51584o1808J65880
$$ y = [7302692, 7646617, 7844444, 7872059, 7883227, 7731663, 7770792, 7613662, 7717566, 7928056, 7947723, 7707223, 7565710, 7401558, 7408485, 7403134, 7366174, 7402854, 7501192, 7546540, 7570769, 7563477, 7632375, 7704101, 7715824, 7405537, 7380628, 7655590, 7661237, 7540183, 7496756, 7191741, 7074227, 7120325, 7361585, 7760177, 7936919, 7899650, 7755651, 7507164, 7419602, 7308690, 7223075, 7261702, 7424805, 7360291, 7565173, 7722706, 7872942, 8128766, 8311377, 8380520, 8183979, 8194116, 8028395, 7924066, 7885433, 7850496, 7390190, 7123890, 7233503, 7363900, 7383814, 7328785, 7467181, 7648395, 7888142, 8040680, 7995252, 8007721, 8208656, 8030520, 7583291, 7494622, 7410629, 7344328, 7192767, 7383400, 7618071, 7624131, 7372547, 7310739, 7476619]
12471G476619J39561j24304j38350q1571J0845L15764L79038K0229N7469N1965
12461H107265k57202j96488J19721j71283j4942K22735q8301k45562J55131L25029
12451G956103R7230k54041J4298J1457k27477j41662J5037J55088K41984j40042
12441G727975q361L25654P6019k2124j9423J46898J81722l59886l73787j37203
12431G537484j04605M61421L3483J07752K78446j08671l18383J39687p3642o7193
12421G885779R8767O7088Q1323j22961j46701Q907K0134o0449O793J45610J39900
12410H124190P7881j10916O5345o9807k20796j33774J07989k5047j54600J34618
12400G795083Q45R0779J01729j6998m29581J23431J04342K73201r5554J40408
$$ y = [7476619, 7616180, 7491876, 7353526, 7271955, 7282800, 7598564, 7977602, 7997831, 8055300, 8107265, 7850063, 7653575, 7773296, 7602013, 7587071, 7809806, 7721505, 7475943, 7631074, 7956103, 8053333, 7799292, 7813590, 7825047, 7597570, 7455908, 7470945, 7626033, 7868017, 7727975, 7719614, 8045268, 8121287, 8099163, 8079740, 8226638, 8408360, 8048474, 7674687, 7537484, 7432879, 7894300, 7927783, 8035535, 8313981, 8205310, 7886927, 8026614, 7952972, 7885779, 7984546, 8051634, 8132957, 8009996, 7863295, 7872202, 7892336, 7831887, 7838680, 7984290, 8124190, 8202071, 8091155, 8156500, 8086693, 7865897, 7732123, 7840112, 7815065, 7660465, 7795083, 7795928, 7886707, 7988436, 7971438, 7541857, 7665288, 7769630, 8042831, 7947277, 8087685]
12390H087685J00112j23576J91774J10130P6488j77480j15014j22928Q6796M000
12380H117987m9548K17657J0591k45236k1226L28490L4769L0063j51696m31161
12370G840690K6014M0429l1158L638N1681L3598r783L2534K8576N9864J47700
12359H223783m82922o1012p002Q1203J8236K02010j60133q8223K72119O2439J1869
12348H072367j5126P045r6816j83993q6826J52096M0941l7417R133R0087N1277
12337H002768P695k29235j18220j2630J11369J51201k82004R7139L63817J64402
12327H256302M7599r9762L72832j57465m00520j75267Q58j03156k60456J06475
12317G587440K06492O2464L50491P5744l1618j26184o5696m21002k18560o2861
$$ y = [8087685, 8187797, 8064221, 8255995, 8366125, 8442613, 8265133, 8150119, 8027191, 8113987, 8117987, 8068439, 8286096, 8296687, 8051451, 8030225, 8358715, 8393484, 8423547, 8271851, 7840690, 7866704, 7907133, 7875975, 7879613, 7931294, 7964892, 7955109, 7987643, 8016219, 8076083, 8223783, 7740861, 7679849, 7672847, 7754050, 7772286, 7974296, 7814163, 7725940, 7998059, 8060498, 8072367, 8057241, 8064286, 7967470, 7783477, 7696651, 7848747, 7889688, 7852271, 7861404, 7951491, 8002768, 8010463, 7781228, 7663008, 7650378, 7761747, 7912948, 7630944, 7728083, 8091900, 8256302, 8303901, 8204139, 8576971, 8419506, 8018986, 7843719, 7844577, 7741421, 7480965, 7587440, 7793932, 7856396, 8206887, 8282631, 8251013, 8124829, 8059133, 7638131, 7419571, 7356710]
12307G356710J86235J26137K13830M3268O3502K46841J59855j99880l55835o7201
12297G773462J05029j3827M0302Q6015K33501L10645j48790k58319L15806n1154
12287H392670j42568l05844l3918j41418K00994P9970k3410p774K2100L4564R5043
12276H170409k21579J3825p4443L6210Q0711N4322j03356j142o9955j788K4435
12265G907649J15232K08555K10417J4137k74636k66169L68693M01113j63793k96402
12255H224796k95346l3603P6140K78981J95293j94824J413m3235l07288M5809
12245G948136L56583r895l68980J91269R1709j39957l1537l9154k57063k75762
12235G465349L423K59758o0507l4129k87265k2567J87320L23684J92309K24971
$$ y = [7356710, 7542945, 7669082, 7882912, 7926180, 7989682, 8236523, 8396378, 8196498, 7840663, 7773462, 7878491, 7864664, 7904966, 7990981, 8224482, 8535127, 8386337, 8128018, 8443824, 8392670, 8250102, 7944258, 7910340, 7768922, 7969916, 8049886, 8026476, 8018702, 8040802, 8075366, 8170409, 7948830, 7962655, 7888212, 7924422, 8005133, 8059455, 7956099, 7954957, 7885002, 7883214, 7907649, 8022881, 8231436, 8441853, 8455990, 8181354, 7915185, 8283878, 8684991, 8521198, 8224796, 7929450, 7895847, 7971987, 8250968, 8446261, 8251437, 8252850, 8209615, 7902327, 7948136, 8304719, 8294824, 7925844, 8117113, 8208822, 8068865, 8037328, 7998174, 7741111, 7465349, 7468772, 7728530, 7668023, 7633894, 7346629, 7324062, 7511382, 7835066, 8027375, 8252346]
12225H252346m6483j43228o5008k76810p4614K62891K14871J5156o6152p8978
12215G993991o4639J41075m1884l33624J6918K1249j71933k69108m2278J24789
12205G374556K01052K91426L87896O0983j28802R3459K92349p1697l5121n9944
12195H406157l0826m8361k01496K55709N8863J18150r2465J3520K63983R8224
12185H841458L8228R8835j93210k1365M5778j16435J75654k15449m3324J26478
12175H736648K71137J52632q5966K4120L41847K71051J79906K52065M85642P82691
12165A1411773P64704R58063R37604J046437Q29770O02890K92597m6705l50309
12156A6446824n64459o05111p09272k20555K72245M18401O18787K74387K74097
$$ y = [8252346, 8205863, 8062635, 7997627, 7720817, 7646203, 7909094, 8123965, 8139121, 8072969, 7993991, 7929352, 8070427, 8028543, 7694919, 7711837, 7733086, 7561153, 7292045, 7249767, 7374556, 7575608, 7867034, 8254930, 8315913, 8187111, 8280570, 8572919, 8501222, 8466101, 8406157, 8375331, 8326970, 8125474, 8381183, 8440046, 8558196, 8465731, 8479251, 8743234, 8841458, 8879686, 8978521, 8785311, 8763946, 8809724, 8693289, 8868943, 8653494, 8610170, 8736648, 9007785, 9160417, 9074451, 9098571, 9440418, 9711469, 9891375, 10143440, 10629082, 11411773, 12176477, 13134540, 14072144, 15118581, 15948351, 16551241, 16843838, 16797133, 16446824, 15882365, 15277254, 14567982, 14347427, 14619672, 15038073, 15656860, 15931247, 16205344]
12147A6205344K08124l98846l67779m59121j039488j019931r66617j064447o64892
12138A0432347o25765n26796j9245r0453j73587j45066l19979k93354P2996R8183
12128H409281Q3749J32724J88574J27463q6555l34021K5428p9049j32340J754
12118H337008l5401j90523k34434P0742q1618k46191j35368K6473K97557J99945
12108H008190M6865k58561j87824j00701K0972j47790J84571Q330p4122L33174
12098G833104J53175N7311j13420j78423J11509J09221j49130p5691L37771K12847
12088H298274k48143j44809n2855o6099l5248q7838k7326o0511q0941K93522k0120
12077G767906P5325L07846j07852l06388k81523O9569k19214j23079j39212K41685
$$ y = [16205344, 16413468, 16014622, 15646843, 15187722, 14148234, 13128303, 12161686, 11097239, 10432347, 9806582, 9279786, 9260541, 9170088, 8996501, 8851435, 8531456, 8238102, 8311098, 8409281, 8493030, 8625754, 8814328, 8941791, 8855236, 8521215, 8546643, 8467594, 8335254, 8337008, 8301607, 8111084, 7876650, 7947392, 7865774, 7619583, 7484215, 7510688, 7808245, 8008190, 8055055, 7796494, 7608670, 7507969, 7528941, 7381151, 7565722, 7574052, 7499930, 7833104, 7986279, 8043590, 7930170, 7751747, 7863256, 7972477, 7823347, 7747656, 8085427, 8298274, 8050131, 7905322, 7852467, 7786368, 7751120, 7663282, 7635956, 7575445, 7494504, 7788026, 7767906, 7843231, 8151077, 8043225, 7736837, 7455314, 7524883, 7305669, 7182590, 7043378, 7285063]
12067G285063Q7308J71838m872j19570k44096j86223r3884K96493K18133L21158
12057G731348j17698j00072l6455K560K02022K75062l93904q4665q8893k32781
12047G156524K59974J87150j529j22022K5817N1008J29224Q8966j93891l8825
12037G542396j33510J01501J03951N1842k7390m5459j81714q9509J89685j13027
12027G398766l9899j08215j18416J69222J30458K28341J4044j92790Q4227j7476
12017G548262j19150p048j44171J203Q9357L6562k44179m0221J55934M0376j87710
12006G129215J82317P4632r6166P2946J07617M8527o9314R7449m5496j43962j90450
11995G167315J78106j16774j11272o3128j81625k08787L9013N7802J69743L33339
$$ y = [7285063, 7372371, 7544209, 7539337, 7419767, 7175671, 6989448, 6895564, 7192057, 7410190, 7731348, 7613650, 7513578, 7477123, 7479683, 7681705, 7956767, 7562863, 7478198, 7389305, 7156524, 7416498, 7603648, 7602119, 7480097, 7505914, 7556922, 7686146, 7775112, 7581221, 7542396, 7408886, 7510387, 7614338, 7666180, 7638790, 7593331, 7411617, 7322108, 7511793, 7398766, 7358867, 7250652, 7132236, 7301458, 7431916, 7660257, 7674301, 7481511, 7565738, 7548262, 7429112, 7422064, 7277893, 7279096, 7368453, 7405015, 7160836, 7120615, 7276549, 7316925, 7129215, 7311532, 7386164, 7289998, 7362944, 7470561, 7519088, 7449774, 7547223, 7501727, 7357765, 7167315, 7345421, 7228647, 7117375, 7054247, 6872622, 6663835, 6702848, 6760650, 6930393, 7263732]
11985G263732L9356j74797J25138n6206k29171j92008K91238K31065l41223l27360
11975F629764J08841L52600J74381j2576M7946O9974J9636j02128l7649N3279
11965G304068K9961J5114j33552q8641J78811J87656r416j14274k09346j28320
11955G032061K70931j86372j02140p5m7647j49619p2638J41267L90748q6804j18877
11944G070835j6014k6666R2620J76093J92462J0692l06389k14066J54803J29033
11934G263403k11583k17682k03920j73815K09125l4223K76524P5352j66267L8050
11924F854964J01548K9644M0921Q7741O0998m7658j72646l50999j87376R133M4697
11913F470967o4461j26006J53907J33284L7916J59402K00536J14634k8046L2557
$$ y = [7263732, 7303088, 7128291, 7253429, 7197223, 6968052, 6776044, 7067282, 7298347, 6957124, 6629764, 6738605, 7091205, 7265586, 7253010, 7300956, 7370930, 7390566, 7288438, 7250789, 7304068, 7334029, 7349143, 7215591, 7126950, 7305761, 7493417, 7484001, 7369727, 7160381, 7032061, 7302992, 7116620, 7014480, 7014405, 6966758, 6817139, 6744501, 6885768, 7276516, 7189712, 7070835, 7054821, 7028155, 7120775, 7296868, 7489330, 7500022, 7193633, 6979567, 7134370, 7263403, 7051820, 6834138, 6630218, 6456403, 6665528, 6631305, 6907829, 6983181, 6816914, 6854964, 6956512, 6986156, 7027077, 7114818, 7175816, 7128158, 6955512, 6604513, 6417137, 6426270, 6470967, 6406506, 6280500, 6434407, 6567691, 6605607, 6765009, 6965545, 7080179, 7052133, 7084690]
11903G084690j75891k94171J07916L55944j8899j39930K7361Q2473Q4402j63588
11893F950307J67499j1227j41488n7577k23887j177K10852P1900j20462L4225
11883F878965k39616k16036J81667j96628j30441P5865J63706K70260K49505j42363
11873F894884m6429l87696J3610J26474p9155O1562l3456l06236o3860M7415K52094
11862F479207J72966L10362j30269R3578n6805k45398L8720O1673j361K05474
11852F928147j48928m53188L53635k3330r0044L0066M7349J27571M7219q5567
11842F732930j39353L176j30869j94681J56595j31517j00439J70885K12602j8169
11832F561160Q3305j91449q0049J45673J01059j93981k07559q3202P4882Q084
$$ y = [7084690, 6908799, 6614628, 6722544, 7078488, 7059589, 6919659, 6947020, 7029493, 7113895, 6950307, 7117806, 7106579, 6965091, 6907514, 6683627, 6682450, 6893302, 6965202, 6844740, 6878965, 6639349, 6423313, 6604980, 6408352, 6277911, 6353776, 6517482, 6787742, 7037247, 6894884, 6848455, 6460759, 6474369, 6600843, 6521688, 6583250, 6549794, 6243558, 6179698, 6227113, 6479207, 6652173, 6962535, 6832266, 6925844, 6869039, 6623641, 6662361, 6724034, 6722673, 6928147, 6779219, 6326031, 6679666, 6656336, 6566292, 6596358, 6643707, 6771278, 6818497, 6732930, 6593577, 6596753, 6465884, 6271203, 6427798, 6296281, 6195842, 6366727, 6579329, 6561160, 6644465, 6453016, 6372967, 6518640, 6619699, 6425718, 6218159, 6134957, 6209839, 6217923]
11822F217923J94299M6563j18349n3029M5731n1166J19358J45690N4872J4050
11812F615942k56670J37521l5512o3177j28285K6703K7200K48081J019J15621
11802F688443k81211j06178M7308J75999K12254k28058m04313J58786K01184j47035
11792F317179k06308j87323J17106K21977K45677j45573j25462J35016j12875
11783F259414k79896j66420J83942K96001M2857j9142j249l07092J15376J76818
11773F300609R859k04232m04650j16928N6992K2738j79961K41979K43011J79249
11763F148666J12940p9192J03477P9015j29955j50949j78699k14764j23326K6379
11753E593592K53897j45188j7998j90037J37096J25116K5380K09323O933J8441
$$ y = [6217923, 6412222, 6458785, 6340436, 6287407, 6333138, 6281972, 6401330, 6547020, 6601892, 6615942, 6359272, 6496793, 6461281, 6398104, 6269819, 6296522, 6323722, 6571803, 6572822, 6688443, 6407232, 6301054, 6348362, 6524361, 6736615, 6508557, 6104244, 6263030, 6464214, 6317179, 6110871, 5923548, 6040654, 6262631, 6508308, 6362735, 6237273, 6372289, 6259414, 5979518, 5813098, 5997040, 6293041, 6335898, 6316756, 6315507, 6008415, 6123791, 6300609, 6310468, 6106236, 5701586, 5584658, 5641650, 5664388, 5484427, 5726406, 5969417, 6148666, 6261606, 6182414, 6285891, 6364906, 6234951, 6084002, 5905303, 5690539, 5567213, 5593592, 5847489, 5702301, 5684303, 5494266, 5631362, 5756478, 5781858, 5991181, 5998114, 6016555]
11743F016555J62431n2629l41043j83101k3741J36320K37114K21968J92098j67395
11733F198577k04865k03699K90682m763p378J03681o5020k20131R5312L17055
11723F299451k08123J36897P195P4444J66635k7998k03136n0245R046K36875L13737
11712F754778l31980q2929k97260l87438o4376L7878J391J06543L39028J37037
11702F212672k18113j33518K43946P9407J33604q9103M8063J33617k37214k20693
11692E952668K3940L1780j61738j28882K70001j11042j18369L4310n45r3075k0936
11681E678112P549L2435R390L8550L87351J27399l74549m80528j00914J76656
11671E501451L3891j07758p841l5567j60298K43789L18725r1029j90005j89098
$$ y = [6016555, 6178986, 6126357, 5785314, 5602213, 5578472, 5714792, 5951906, 6173874, 6365972, 6198577, 5993712, 5790013, 6080695, 6075932, 6068554, 6172235, 6107215, 5887084, 5982396, 6299451, 6091328, 6228225, 6235420, 6309864, 6476499, 6448501, 6245365, 6195120, 6204166, 6441041, 6754778, 6422798, 6339869, 6042609, 5655171, 5590795, 5628673, 5630064, 5736607, 6075635, 6212672, 5994559, 5861041, 6104987, 6184394, 6317998, 6228895, 6276958, 6410575, 6173361, 5952668, 5976608, 6008388, 5846650, 5717768, 5987769, 5876727, 5758358, 5792668, 5792123, 5699048, 5678112, 5685661, 5718096, 5727486, 5766036, 6153387, 6280786, 5906237, 5425709, 5324795, 5501451, 5535342, 5427584, 5419743, 5384176, 5223878, 5467667, 5786392, 5695363, 5505358, 5316260]
11661E316260j75172Q268K06594l8293m7672n5331R952N3333K25942K05503p5857
11650E633527L0119r5885q4603j65258q6190L22654J30737J47772m4173j92653
$$ y = [5316260, 5141088, 5149356, 5355950, 5317657, 5269985, 5214654, 5224606, 5277939, 5503881, 5709384, 5633527, 5663646, 5567761, 5483158, 5317900, 5231710, 5554364, 5685101, 5832873, 5788700, 5596047]
$$ [...]
##END NTUPLES=NMR SPECTRUM
##END=
