##TITLE=Analysis number 323813
Compound Code sb 00545
Project Code adrs
Chemist Name ian speare
##JCAMPDX= 6.0         $$ Bruker NMR JCAMP-DX V2.0
##DATA TYPE= NMR SPECTRUM
##DATA CLASS= NTUPLES
##ORIGIN= Bruker BioSpin GmbH
##OWNER= nmr
$$ XWIN-NMR		Version 3.5
$$ Wed Nov  8 16:16:17 2006 GMT Standard Time (UT+0h)  MAYBRIDGE\nmr@NMR_250MHZ
##.OBSERVE FREQUENCY= 250.131544655141
##.OBSERVE NUCLEUS= ^1H
##.ACQUISITION MODE= SIMULTANEOUS (DQD)
##.ACQUISITION SCHEME= undefined
##.AVERAGES= 16
##.DIGITISER RES= 18
##SPECTROMETER/DATA SYSTEM= dpx250
##.PULSE SEQUENCE= zg30
##.SOLVENT NAME= CDCl3
##.SHIFT REFERENCE= (INTERNAL, CDCl3, 0, 16.522)
##AUDIT TRAIL= $$ (NUMBER, WHEN, WHO, WHERE, WHAT)
$$ ##TITLE= Audit trail, XWIN-NMR		Version 3.5
$$ ##JCAMPDX= 5.01
$$ ##ORIGIN= Bruker BioSpin GmbH
$$ ##OWNER= nmr
$$ C:\u/data/dgb/nmr/ADRS/2470/pdata/1/auditp.txt
$$ ##AUDIT TRAIL=  $$ (NUMBER, WHEN, WHO, WHERE, WHAT)
(   1,<2006-11-08 16:15:55.43 +000>,<MAYBRIDGE\nmr>,<NMR_250MHZ>,
      <created by zg, POWCHK disabled, PULCHK disabled
       configuration hash MD5:
       49 4B E0 1D 92 C2 6B 37 9F E6 65 BC 52 41 86 1D
       data hash MD5: 64K
       D8 E7 ED 2F 2F 9A 6B 03 87 DB 6C 28 B2 5E 8A 9D>)
(   2,<2006-11-08 16:16:08.25 +000>,<MAYBRIDGE\nmr>,<NMR_250MHZ>,
      <Start of raw data processing
       ef LB = 0.3 FT_mod = 6 PKNL = 1 SI = 32K 
       data hash MD5: 32K
       A7 34 E2 1C A8 46 8B 54 CC C5 76 A9 64 4B 62 3C>)
(   3,<2006-11-08 16:16:10.07 +000>,<MAYBRIDGE\nmr>,<NMR_250MHZ>,
      <apk 
       data hash MD5: 32K
       83 39 AF 6F 97 62 56 1F C4 6B E0 41 B2 C4 9E F2>)
(   4,<2006-11-08 16:16:10.88 +000>,<MAYBRIDGE\nmr>,<NMR_250MHZ>,
      <abs ABSG = 5 
       data hash MD5: 32K
       42 13 41 A3 C5 C7 8F 68 56 3E DD AC EB 74 27 DD>)
$$ ##END=
$$ 
$$ hash MD5
$$ F8 B4 06 44 AA AE 3C 1F 91 BB EC C7 9C B5 55 43
##$RELAX= 
##$RELAX= 
##$RELAX= 
##$RELAX= 
##$RELAX= 
##$RELAX= 
##$RELAX= 
$$ Bruker specific parameters
$$ --------------------------
##$DU= <C:\u>
##$EXPNO= 2470
##$NAME= <ADRS>
##$PROCNO= 1
##$TYPE= <nmr>
##$USER= <dgb>
##$AMP= (0..31)
100 100 100 100 100 100 100 100 100 100 100 100 100 100 100 100 100 100 
100 100 100 100 100 100 100 100 100 100 100 100 100 100 
##$AQSEQ= 0
##$AQ_mod= 3
##$AUNM= <au_zg>
##$AUTOPOS= <45 >
##$BF1= 250.13
##$BF2= 250.13
##$BF3= 250.13
##$BF4= 250.13
##$BF5= 500.13
##$BF6= 500.13
##$BF7= 500.13
##$BF8= 500.13
##$BYTORDA= 1
##$CFDGTYP= 0
##$CFRGTYP= 5
##$CHEMSTR= <none>
##$CNST= (0..31)
1 1 145 1 1 1 1 1 1 1 1 1 1 1 1 1 1 1 1 1 1 1 1 1 1 1 1 1 1 1 1 1 
##$CPDPRG= <>
##$CPDPRG1= <>
##$CPDPRG2= <>
##$CPDPRG3= <>
##$CPDPRG4= <mlev>
##$CPDPRG5= <mlev>
##$CPDPRG6= <mlev>
##$CPDPRG7= <mlev>
##$CPDPRG8= <mlev>
##$CPDPRGB= <>
##$CPDPRGT= <>
##$D= (0..31)
0 1 0 0 0 0 0 0 0 0.06 0 0 0 0 0 0 0.0002 0 0 0 0 0 0 0 0 0 0 0 0 0 0 
0 
##$DATE= 1163002554
##$DBL= (0..7)
120 120 120 120 120 120 120 120 
##$DBP= (0..7)
150 150 150 150 150 150 150 150 
##$DBP07= 0
##$DBPNAM0= <>
##$DBPNAM1= <>
##$DBPNAM2= <>
$$ [...]
##$SUBNAM7= <"">
##$SUBNAM8= <"">
##$SUBNAM9= <"">
##$SW= 20.6930455092707
##$SWIBOX= (0..15)
0 0 3 0 0 0 0 0 0 0 0 0 0 0 0 0 
##$SW_h= 5175.983436853
##$TD= 65536
##$TD0= 1
##$TE= 683.16
##$TE2= 300
##$TE3= 300
##$TEG= 300
##$TL= (0..7)
0 120 120 120 120 120 120 120 
##$TP= (0..7)
150 150 150 150 150 150 150 150 
##$TP07= 0
##$TPNAME0= <>
##$TPNAME1= <>
##$TPNAME2= <>
##$TPNAME3= <>
##$TPNAME4= <>
##$TPNAME5= <>
##$TPNAME6= <>
##$TPNAME7= <>
##$TPOAL= (0..7)
0.5 0.5 0.5 0.5 0.5 0.5 0.5 0.5 
##$TPOFFS= (0..7)
0 0 0 0 0 0 0 0 
##$TUNHIN= 0
##$TUNHOUT= 0
##$TUNXOUT= 0
##$USERA1= <user>
##$USERA2= <user>
##$USERA3= <user>
##$USERA4= <user>
##$USERA5= <user>
##$V9= 5
##$VALIST= <valist>
##$VCLIST= <CCCCCCCCCCCCCCC>
##$VD= 0
##$VDLIST= <DDDDDDDDDDDDDDD>
##$VPLIST= <PPPPPPPPPPPPPPP>
##$VTLIST= <TTTTTTTTTTTTTTT>
##$WBST= 1024
##$WBSW= 4
##$XGAIN= (0..3)
0 0 0 0 
##$XL= 0
##$YL= 0
##$YMAX_a= 500923
##$YMIN_a= -326767
##$ZGOPTNS= <>
##$ZL1= 120
##$ZL2= 120
##$ZL3= 120
##$ZL4= 120
##$ABSF1= 16.522
##$ABSF2= -4.171173
##$ABSG= 5
##$ABSL= 3
##$ALPHA= 0
##$AQORDER= 0
##$ASSFAC= 0
##$ASSFACI= 0
##$ASSFACX= 0
##$ASSWID= 0
##$AUNMP= <proc_1d>
##$AZFE= 0.1
##$AZFW= 0.1
##$BCFW= 0
##$BC_mod= 0
##$BYTORDP= 0
##$COROFFS= 0
##$CY= 12.5
##$DATMOD= 1
##$DC= 0
##$DFILT= <>
##$DTYPP= 0
##$F1P= 14.0000005364418
##$F2P= -0.99999901652339
##$FCOR= 0.5
##$FTSIZE= 32768
##$FT_mod= 6
##$GAMMA= 0
##$GB= 0
##$INTBC= 1
##$INTSCL= 1
##$ISEN= 128
##$LB= 0.3
##$LEV0= 0
##$LPBIN= 0
##$MAXI= 10000
##$MC2= 0
##$MEAN= 0
##$ME_mod= 0
##$MI= 0
##$NCOEF= 0
##$NC_proc= -4
##$NLEV= 6
##$NOISF1= 0
##$NOISF2= 0
##$NSP= 0
##$NTH_PI= 0
##$NZP= 0
##$OFFSET= 16.522
##$PC= 1
##$PHC0= -25.15086
##$PHC1= -43.48763
##$PH_mod= 1
##$PKNL= yes
##$PPARMOD= 0
##$PSCAL= 4
##$PSIGN= 0
##$REVERSE= no
##$SF= 250.13
##$SI= 32768
##$SIGF1= 0
##$SIGF2= 0
##$SINO= 400
##$SIOLD= 32768
##$SREGLST= <1H.CDCl3>
##$SSB= 0
##$STSI= 32768
##$STSR= 0
##$SW_p= 5175.98343685301
##$SYMM= 0
##$S_DEV= 0
##$TDeff= 65536
##$TDoff= 0
##$TI= <Analysis number 999999
Compound Code 99
Book Reference 9
Project Code 9>
##$TILT= no
##$TM1= 0
##$TM2= 0
##$TOPLEV= 0
##$USERP1= <user>
##$USERP2= <user>
##$USERP3= <user>
##$USERP4= <user>
##$USERP5= <user>
##$WDW= 1
##$XDIM= 32768
##$YMAX_p= 347822599
##$YMIN_p= -335541
$$ End of Bruker specific parameters
$$ ---------------------------------
##NTUPLES= NMR SPECTRUM
##VAR_NAME=  FREQUENCY,     SPECTRUM/REAL,   SPECTRUM/IMAG
##SYMBOL=    X,             R,               I
##VAR_TYPE=  INDEPENDENT,   DEPENDENT,       DEPENDENT
##VAR_FORM=  AFFN,          ASDF,            ASDF
##VAR_DIM=   32768,         32768,           32768
##UNITS=     HZ,            ARBITRARY UNITS, ARBITRARY UNITS
##FACTOR=    0.157963299565203, 1,           1
##FIRST=     4132.6476996994, 0,             0
##LAST=      -1043.33573715361, 0,           0
##MIN=       -1043.33573715361, -335541,     0
##MAX=       4132.6476996994, 347822599,     0
$$ Real data points
##PAGE= N=1
##DATA TABLE= (X++(R..R)), XYDATA
$$ [...]
$$ plain form
22983 41880 11274 -15775 -36517 -79166 -92015 -79273 -58246 -72265 -45425 -53133 -53603 -9874
22971 -9874 15834 25412 1074 -25967 -17713 70234 139300 94006 32944 27197 20286 -16797 -72192
22958 -72192 -25909 -22052 -43652 -46933 -33455 -27804 -45178 -45387 39963 30171 31085 -20531 -11228
22945 -11228 -65542 -54374 8673 27766 -35102 -71964 -21421 27650 -14318 -56297 -5317 -15239
22933 -15239 -34134 -9797 21135 31824 -29247 -42919 -2122 19428 45192 34396 -53273 -116149
22921 -116149 -101854 -64315 -2658 19385 3423 -18284 7197 19863 -6231 -18852 -60772
22910 -60772 -44370 -48382 -10736 32969 45832 65325 53772 -29691 -91484 -73826 -98123 -89190
22898 -89190 -48134 -66523 -88098 -71212 13996 60527 34990 -37906 -37185 -57534 -25494 13725
$$ packed form
22983D1880l0606k7049k0742m2649j2849J2742K1027j4019K6840p708m70M3729
22971i874K5708R578k4338k7041Q254Q7947O9066m5294o1062n747o911l7083n5395
22958g2192M6283L857k1600l281J3478N651j7374k09Q5350r792R14n1616R303
22945a1228n4314J1168O3047J9093o2868l6862N0543M9071m1968m1979N0980r922
22933a5239j8895K4337L0932J0689o1071j3672M0797K1550K5764j0796q7669o2876
22921a16149J4295L7539O1657K2043j5962k1707K5481J2666k6094j2621m1920
22910f0772J6402m012L7646M3705J2863J9493j1553q3463o1793J7658k4297Q933
22898h9190M1056j8389k1575J6886Q5208M6531k5537p2896P21k0349L2040L9219
$$ plain form
22886 13725 42092 99009 79375 10162 -12135 -24902 -41547 31024 80002 77863 81582 5059
22874 5059 -31075 -28557 -5763 -12518 -34296 -55120 -75013 -47812 -73880 -98017 -64736 -60814
22862 -60814 -88435 -83372 -64458 -44466 -644 52677 56689 68508 67652 11879 -8401 -32666
22850 -32666 -12520 -42679 -52690 11754 28347 9130 4418 -26482 -22224 -57469 -109761 -39861
22838 -39861 -15300 40789 44285 14008 794 34009 98710 106833 41838 10029 -17026 -26208
22826 -26208 44557 54626 22227 35832 11310 33152 102067 130612 122601 58069 78720 34522
22814 34522 -5341 -62834 -68622 -89241 -95999 -56639 -64638 -69366 -95735 -80165 -70764 -4474 -9097
22801 -9097 -36881 -94185 -78461 -62041 -77303 -77486 -43768 -42883 -48088 -24783 10131 41816 15343
$$ packed form
22886A3725K8367N6917j9634o9213k2297j2767j6645P2571M8978k139L719p6523
22874E059l6134K518K2794o755k1778k0824j9893K7201k6068k4137L3281L922
22862f0814k7621N063J8914J9992M3822N3321M012J1819q56n5773k0280k4265
22850c2666K0146l0159j0011O4444J6593j9217m712l0900M258l5245n2292O9900
22838c9861K4561N6089L496l0277j3214L3215O4701Q123o4995l1809k7055r182
22826b6208P0765J0069l2399J3605k4522K1842O8915K8545q011o4532K0651m4198
22814C4522l9863n7493n788k0619o758L9360p999m728k6369J5570R401O6290m623
22801i097k7784n7304J5724J6420j5262j83L3718Q85n205K3305L4914L1685k6473
$$ plain form
22788 15343 -15825 -54438 -78128 -69766 -80645 -38285 -4888 -2928 7314 20404 38347 49989
22776 49989 79251 94315 107284 13281 -20894 -63695 -63726 -34631 -30199 -44648 -54646 -25511 -43752
22763 -43752 -79869 -74291 -171063 -190657 -165237 -145325 -36196 7558 -3197 -20818 -58072 -64452
22751 -64452 -70064 -17891 -35148 -42077 -50818 -71782 -114115 -74077 -30269 -19831 27129 -13628
22739 -13628 -1463 94781 62095 -76104 -86431 -48559 -4027 9348 -11960 -48763 -41640 11524
22727 11524 46531 44580 49003 7296 -7366 39738 21233 19101 -2563 -54569 -65365 -21208
22715 -21208 7755 21968 -13018 -69822 -17698 61799 93977 65441 56367 -17463 -65700 -42865
22703 -42865 -26204 -13054 -13167 -8923 -32866 18791 58030 59317 67374 94163 35787 -31529 -85037
$$ packed form
22788A5343l1168l8613k3690Q362j0879M2360L3397J960J0242J3090J7943J1642
22776D9989K9262J5064J2969r4003l4175m2801l1K9095M432j4449r998K9135j8241
22763d3752l6117N578r6772j9594K5420J9912J09129M3754j0755j7621l7254o380
22751f4452n612N2173j7257o929q741k0964m2333M0038M3808J0438M6960m0757
22739a3628J2165R6244l2686j38199j0327L7872M4532J3375k1308l6803P123N3164
22727A1524L5007j951M423m1707j4662M7104j8505k132k1664n2006j0796M4157
22715b1208K8963J4213l4986n6804N2124P9497L2178k8536r074p3830m8237K2835
22703d2865J6661J3150j13M244k3943N1657L9239J287Q057K6789n8376o7316n3508
$$ plain form
22690 -85037 -7728 28899 5758 -17073 -16918 -41216 -15726 46114 1937 -40874 63333 141262
22678 141262 22203 -9838 3444 -28387 -4807 21663 10421 -7893 31223 5490 -1357
22667 -1357 -2104 -4869 12025 57395 35812 27108 1917 -7123 -57179 -108203 -70995 -29891 -27382
22654 -27382 -1907 7381 5783 -28957 -1629 6783 4482 16535 33341 12419 -47445 -37508 -6646
22641 -6646 -11978 -17956 -12132 -4779 -20547 -15354 36263 41808 33755 43667 17322 28307 42873
22628 42873 56631 37807 36396 77594 62470 21845 13129 -43590 -50784 -7798 28125 -32104
22616 -32104 -48216 -34876 -65095 -3826 26590 -3759 4402 5794 -25613 22371 -28646 -61588
22604 -61588 -12202 -13388 13790 55446 67389 25136 -8394 -25291 -58361 -51897 -16593 13478
$$ packed form
22690h5037P7309L6627k3141k2831J55k4298K5490O1840m4177m2811J04207P7929
22678A41262j19059l2041J3282l1831K3580K6470j1242j8314L9116k5733o847
22667a357p47k765J6894M5370k1583q704k5191r040n0056n1024L7208M1104K509
22654b7382K5475R288j598l4740K7328Q412k301J2053J6806k0922n9864R937L0862
22641f646n332n978N824P353j5768N193N1617N545q053R912k6345J0985J4566
22628D2873J3758j8824j411M1198j5124m0625q716n6719p194M2986L5923o0229
22616c2104j6112J3340l0219O1269L0416l0349Q161J392l1407M7984n1017l2942
22604f1588M9386j186K7178M1656J1943m2253l3530j6897l3070O464L5304L0071
$$ plain form
22592 13478 7727 1632 19241 17420 -54330 -104850 -102874 -63484 -83831 -116512 -124483 -153956 -117680
22579 -117680 -68399 -42727 -102262 -89339 -62790 -57167 -38601 -48581 -27929 -23630 -66510 -26109
22567 -26109 -45461 -78179 -100754 -36454 47374 53399 -17123 -41018 -13670 -12050 -1775 -3392
22555 -3392 -20602 -29550 11507 22330 12083 31091 14816 10006 21690 -29353 -75464 -83158
22543 -83158 -157620 -169087 -109341 -26809 20666 42677 33915 29700 20700 13144 -14633 -54506
22531 -54506 -90758 -93410 -98642 -119163 -47258 -11522 -16283 -22553 -36152 -28217 -12243 -57059 -88216
22518 -88216 -79857 -9577 -38856 1419 38411 34400 -3464 -22683 -12722 20723 7360 -4006
22506 -4006 27409 119778 40763 -12963 -63096 -38166 -34835 -33670 -67094 -90972 -53478 1208
$$ packed form
22592A3478n751o095J7609j821p1750n0520J976L9390k0347l2681p971k9473L6276
22579a17680M9281K5672n9535J2923K6549N623J8566r980K0652M299m2880M0401
22567b6109j9352l2718k2575O4300Q3828O025p0522k3895K7348J620J0275j617
22555c392j7210q948M1057J0823j0247J9008j6275m810J1684n1043m6111p694
22543h3158p4462j1467N9746Q2532M7475K2011q762m215r000p556k7777l9873
22531e4506l6252k652n232k0521P1905L5736m761o270j3599P935J5974m4816l1157
22518h8216Q359P0280k9279M0275L6992m011l7864j9219R961L3445j3363j1366
22506d006L1415R2369p9015n3726n0133K4930L331J165l3424k3878L7494N4686
$$ plain form
22494 1208 -36387 -8791 8321 -5978 1077 27849 3348 12345 64017 22502 29147 -1915
22482 -1915 -21936 30171 60632 83224 66893 74715 33645 39382 4453 -47540 -81630 -87895
22470 -87895 -52663 -63041 -98488 -107126 -69034 -92340 -81878 -48095 -52533 12214 30240 -49361
22458 -49361 -85128 -93890 -26286 -440 -11897 -5205 -68571 -111678 -111045 -160903 -139645 -73768
22446 -73768 -13496 -41815 -92191 -79145 -101075 -96336 -83381 -33739 6942 -32861 -55473 -52794
22434 -52794 19080 10943 -20834 -25311 13251 72286 68044 52046 18750 -31704 -65861 -59981
22422 -59981 -42060 -67415 -40989 -30946 -27879 -6643 29472 -12343 -27794 -68998 40267 61882
22410 61882 -44512 -55271 -39560 -45747 -34445 -72869 -89713 -48387 52855 23417 -59784
$$ packed form
22494A208l7595K7596J7112j4299P055K6772k4501Q997N1672m1515O645l1062
22482a915k0021N2107L0461K2592j6331P822m1070N737l4929n1993l4090o265
22470h7895L5232j0378l5447q638L8092k3306J0462L3783m438O4747J8026p9601
22458d9361l5767q762O7604K5846j1457O692o3366m3107O33m9858K1258O5877
22446g3768O0272k8319n0376J3046k1930M739J2955M9642M0681l9803k2612K679
22434e2794P1874q137l1777m477L8562N9035m242j5998l3296n0454l4157N880
22422e9981J7921k5355K6426J0043L067K1236L6115m1815j5451m1204J09265K1615
22410F1882j06394j0759J5711o187J1302l8424j6844M1326J01242k9438q3201
$$ plain form
22399 -59784 -90783 -66222 -42899 -14277 -34363 -22868 -15547 -19718 9049 36397 39185 12355
22387 12355 31199 70301 46049 65321 89382 48883 43870 57415 58790 74538 44946 21049
22375 21049 -39590 -50787 -45735 -18056 -3568 2495 -43828 -75947 -43981 -17307 -49198 -111889
22363 -111889 -61421 -84887 -101275 -83932 -15161 -4627 -31275 -20395 68943 138594 71141
22352 71141 -5449 -54482 -34626 -24751 -79228 -58162 -54759 -36639 -57601 -82382 -65082 -7606
22340 -7606 24312 40707 65038 122743 193699 205195 139320 103725 34778 -50047 9654 29233
22328 29233 -19839 -82393 -62520 -66308 -89894 9018 -12873 9679 20072 -2569 5384 -18398
22316 -18398 -74291 -47705 26872 90618 107820 54304 37303 5748 -30219 15768 39414 69741
$$ packed form
22399e9784l0999K4561K3323K8622k0086J1495P321m171K8767K7348K788k6830
22387A2355J8844L9102k4252J9272K4061m0499n013J3545J375J5748k9592k3897
22375B1049o0639j1197N052K7679J4488O063m6323l2119L1966K6674l1891o2691
22363a11889N0468k3466j6388J7343O8771J0534k6648J0880Q9338O9651o7453
22352G1141p6590m9033J9856R875n4477K1066L403J8120k0962k4781J7300N7476
22340g606L1918J6395K4331N7705P0956J1496o5875l5595o8947q4825N9701J9579
22328B9233m9072o2554J9873l788k3586R8912k1891K2552J0393k2641P953k3782
22316a8398n5893K6586P4577O3746J7202n3516j7001l1555l5967M5987K3646L0327
$$ plain form
22304 69741 28661 12768 8751 -782 34185 40387 48416 6554 -63486 -117503 -128640 -110357
22292 -110357 -117549 -119650 -71524 -68476 -9654 14879 6023 -56919 -26177 20513 38833 25259
22280 25259 28288 91525 46422 -24839 -40051 -20720 30580 19615 -9890 29770 58922 34264
22268 34264 12713 11641 9893 -2067 -99749 -91303 -110858 -111129 -14518 38548 49836 59061 40921
22255 40921 8091 17118 15171 37677 23047 -53800 -67651 -63803 -24930 -33069 -63992 -121831
22243 -121831 -132046 -24350 19464 -1136 -26775 -42694 -12485 -2251 10493 32124 123773
22232 123773 152062 135902 81458 40411 29066 -7479 -10360 46314 87285 82296 23418 45329
22220 45329 10441 -55445 -82746 -67569 -75505 -22536 37198 96646 119220 121546 116149 50562
$$ packed form
22304F9741m1080j5893m017r533L4967O202Q029m1862p0040n4017j1137J8283
22292a10357p192k101M8126L048N8822K4533q856o2942L0742M6690J8320j3574
22280B5259L029O3237m5103p1261j5212J9331N1300j0965k9505L9660K9152k4658
22268C4264k1551j072j748j1960r7682Q446j9555k71R6611N3066J1288R225j8140
22255D0921l2830R027j947K2506j4630p6847j3851L848L8873q139l0923n7839
22243a21831j0215J07696M3814k0600k5639j5919L0209J0234J2744K1631R1649
22232A23773K8289j6160n4444m1047j1345l6545k881N6674M0971m989n8878K1911
22220D5329l4888o5886k7301J5177p936N2969N9734N9448K2574K326n397o5587
$$ plain form
22208 50562 22102 23006 40110 -41300 -60629 -43047 -66466 -31230 5266 -21201 -10694 -10630 892
22195 892 -48348 -101403 -59496 -19189 1090 13145 27894 -15084 -7871 17923 71577 63786
22183 63786 -56433 -45393 19363 38953 71474 86633 64011 68347 92918 69214 92483 44713
22171 44713 30333 25439 36563 99023 55279 67419 76292 44435 15633 41840 22207 -7563
22159 -7563 -54611 -34181 -5689 46408 114609 159351 128437 112508 133372 49894 32909 19262
22147 19262 -35848 -41718 -19205 -50085 -82696 -34619 18528 15040 -44997 -26175 -13272 -30196
22135 -30196 -24634 -71840 -67780 -19439 -41165 -65194 -53088 -41757 -33174 -61134 -58776 -37709
22123 -37709 -26760 -33536 8894 -4569 12278 50049 40762 7062 -15478 -100672 -136876 -51727
$$ packed form
22208E0562k8460R04J7104q1410j9329J7582k3419L5236L6496k6467J0507O4J1522
22195H92m9240n3055M1907M0307K0279J2055J4749m2978P213K5794N3654p791
22183F3786j20219J1040O4756J9590L2521J5159k2622M336K4571k3704K3269m7770
22171D4713j4380m894J1124O2460m3744J2140Q873l1857k8802K6207j9633k9770
22159g563m7048K0430K8492N2097O8201M4742l0914j5929K0864q3478j6985j3647
22147A9262n5110n870K2513l0880l2611M8077N3147l488o0037J8822J2903j6924
22135c0196N562m7206M060M8341k1726k4029J2106J1331Q583k7960K358K1067
22123c7709J0949o776M2430j3463J6847L7771r287l3700k2540q5194l6204Q5149
$$ plain form
22111 -51727 -34648 -62926 -58907 11295 1036 -35684 -43786 6053 6507 -16803 -62526 -66371 23840
22098 23840 18263 -78233 -79170 -43247 -83605 -27110 36976 -2219 -4527 -28634 -59596 -85785
22086 -85785 -105233 -79314 -79499 -46745 23692 47981 15688 -95294 -127818 -52462 -9756 8835
22074 8835 -27396 -59332 -75954 -45373 -36682 -42038 -47888 -29283 -31735 -85702 -116381 -131299 -168886
22061 -168886 -148721 -100792 -85806 -72926 -41459 -35782 -43245 -72749 -88346 -61486 -28633 6424
22049 6424 -6239 -61633 -54107 -4141 48307 53142 62630 51694 48421 69780 -24168 -53524 -45260
22036 -45260 -40975 -5392 12571 18730 47646 59558 79079 88518 62048 605 -81993 -64908
22024 -64908 -117541 -127570 -115481 -73703 -17988 29250 20833 -38648 -102012 -138704 -78332 -73756
$$ packed form
22111e1727J7079k8278M019P0202j0259l6720q102M9839M54k3310m5723l845R0211
22098B3840n577r6496r37L5923m0358N6495O4086l9195k308k4107l0962k6189
22086h5785j9448K5919j85L2754P0437K4289l2293j10982l2524P5356M2706J8591
22074H835l6231l1936j6622L0581Q691n356n850J8605k452n3967l0679j4918l7587
22061a68886K0165M7929J4986J2880L1467N677p463k9504j5597K6860L2853L5057
22049F424j2663n5394P526M9966N2448M835R488j0936l273K1359r3948k9356Q264
22036d5260M285L5583J7963O159K8916J1912J9521R439k6470o1443q2598J7085
22024f4908n2633j0029J2089M1778N5715M7238q417n9481o3364l6692O0372M576
$$ plain form
22012 -73756 -51900 -29176 -46564 -92471 -87564 -94320 -30713 1185 -989 -26492 6956 73180
22000 73180 119121 78489 38976 -20668 -97929 -100598 -94306 -42496 -16186 -652 -2638 -18143
21988 -18143 -24884 -60366 -58473 -34789 -71436 -33647 -34886 -82553 -28779 -2812 -77932 -79360
21976 -79360 -48146 -16718 -22922 -682 -23015 -12341 10768 27303 66413 30852 -27488 -41493
21964 -41493 -6759 66438 51281 -21635 -60924 -59317 23034 69025 39259 37201 44944 10198
21952 10198 18709 41882 46045 18558 51066 104058 91758 29820 12719 -12337 10385 6254
21940 6254 12902 -35528 212 92019 56825 -38899 -29323 4545 394 -14253 -14325 3430 -51539
21927 -51539 -107807 -112990 -100579 -118647 -122411 -163200 -142463 -68262 27624 92898 63614 45935
$$ packed form
22012g3756K1856K2724j7388m5907M907o756O3607L1898k174k5503L3448O6224
22000G3180M5941m0632l9513n9644p7261k669O292N1810K6310J5534j986j5505
21988a8143o741l5482J893K3684l6647L7789j239m7667N3774K5967p5120j428
21976g9360L1214L1428o204K2240k2333J0674K3109J6535L9110l5561n8340j4005
21964d1493L4734P3197j5157p2916l9289J607Q2351M5991k9766k058P743l4746
21952A0198Q511K3173M163k7487L2508N2992j2300o1938j7101k5056K2722m131
21940F254O648m8430L5740R1807l5194r5724R576L3868m151j4647p2J7755n4969
21927e1539n6268n183J2411j8068l764m0789K0737P4201R5886O5274k9284j7679
$$ plain form
21915 45935 -29729 -108152 -34522 5522 19836 -31127 -94365 -54993 14260 915 -10189 -49514
21903 -49514 -118794 -107698 -95343 -93442 -63638 -91182 -125695 -80501 -55493 -87435 -175897 -181148
21891 -181148 -119088 -97011 -73678 -7261 38010 35712 9390 -67376 -70170 -58070 -68910 -118868
21879 -118868 -132079 -112892 -101298 -88956 -44596 -28823 -62173 -116881 -44167 14125 34631
21868 34631 56525 81180 35152 11589 24710 11180 -6739 -17562 24905 17934 -7694 -50107
21856 -50107 -87067 -92153 -65212 -101233 -81357 -44253 -37168 -33806 -45289 -31146 -12231 -82003
21844 -82003 -125032 -130005 -126890 -92844 -50834 -100259 -201175 -112467 -9382 15662 7595 8805
21832 8805 28623 -15312 -77055 -96167 -87651 -93319 -39833 14641 -236 -14891 -41418 -60787
$$ packed form
21915D5935p5664p8423P3630M0044J4314n0963o3238L9372O9253j3345j1104l9325
21903d9514o9280J1096J2355J901K9804k7544l4513M5194K5008l1942q8462n251
21891a81148O2060K2077K3333O6417M5271k298k6322p6766k794J2100j0840m9958
21879a18868j3211J9187J1594J2342M4360J5773l3350n4708P2714N8292K0506
21868C4631K1894K4655m6028k3563J3121j3530j7919j0823M2467o971k5628m2413
21856e0107l6960n086K6941l6021J9876L7104P085L362j1483J4143J8915o9772
21844h2003m3029m973L115L4046M2010m9425j00916Q8708J03085K5044q067J210
21832H805J9818m3935o1743j9112Q516n668N3486N4474j4877j4655k6527j9369
$$ plain form
21820 -60787 15921 26448 -25881 -79209 -81008 -53525 -12840 -32663 -63173 -97722 -109393 -108933
21808 -108933 -83515 -64700 -28407 -61618 -93512 -81078 -81553 -93359 -113705 -88391 -14804 43139
21796 43139 106106 110298 57770 29315 25984 57912 13360 14014 35767 17040 5939 7876 -32666
21783 -32666 -14388 -5109 -8345 10349 -9092 -35514 -80913 -105527 -62772 7252 55840 43617
21771 43617 -28150 -44625 -11482 13949 10758 -11646 -58441 -64885 -64211 -37342 -2175 33992
21759 33992 93187 97153 30510 -25451 -7181 -1786 -3117 14304 -9387 -39566 -45577 16536
21747 16536 25806 -11773 -5985 -31434 -15630 23644 10323 -6789 85035 116287 14625 -64267
21735 -64267 -77544 -34907 88273 123297 93716 -4486 -33390 14962 20172 4949 20952 -30849
$$ packed form
21820f0787P6708J0527n2329n3328j799K7483M0685j9823l0510l4549j1671M60
21808a08933K5418J8815L6293l3211l1894J2434m75j1806k0346K5314P3587N7943
21796D3139O2967M192n2528k8455l331L1928m4552O54K1753j8727j1101J937m0542
21783c2666J8278R279l236J8694j9441k6422m5399k4614M2755P0024M8588j2223
21771D3617p1767j6475L3143K5431l191k2404m6795o444O74K6869L5167L6167
21759C3992N9195L966o6643n5961J8270N395j331J7421k3691l0179o011O2113
21747A6536R270l7579N788k5449J5804L9274j3321j7112R1824L1252j01662p8892
21735f4267j3277M2637J23180L5024k9581r8202k8904M8352N210j5223J6003n1801
$$ plain form
21723 -30849 -57507 -5173 33833 36373 71159 52460 40135 61750 97447 72483 76713 127481
21711 127481 101961 75978 101744 86103 22900 44232 86722 13699 -38342 -41451 44406 91910
21699 91910 38706 27314 -3269 -8810 4742 -21183 -5058 20575 28547 51019 46298 3786
21687 3786 -8298 -32870 -38612 -7397 -13569 8614 -3866 76737 65501 73222 62931 -26145
21675 -26145 -58278 -57239 -26509 5486 -24297 -47804 -51743 -15669 21900 38799 9907 -24840
21663 -24840 -67704 -43488 6995 11021 -16380 -10076 9680 23549 36496 14622 -25458 -31345
21651 -31345 10184 60582 75069 51499 20514 41932 19029 -2426 36793 34377 -25305 -54483
21639 -54483 -3101 32028 45256 44067 -34470 -69946 -58015 -9400 20278 -35460 -71915 -49158
$$ packed form
21723c0849k6658N2334L9006K540L4786j8699j2325K1615L5697k4964M230N0768
21711A27481k5520k5983K5766j5641o3203K1332M2490p3023n2041l109Q5857M7504
21699I1910n3204j1392l0583n541J3552k5925J6125K5633P972K2472m721m2512
21687C786j2084k4572n742L1215o172K2183j2480Q0603j1236P721j0291q9076
21675b6145l2133J039L0730L1995k9783k3507l939L6074L7569J6899k8892l4747
21663b4840m2864K4216N0483M026k7401O304J9756J3869J2947k1874m0080n887
21651c1345M1529N0398J4487k3570l0985K1418k2903k1455L9219k416n9682k9178
21639e4483N1382L5129J3228j189p8537l5476J1931M8615K9678n5738l6455K2757
$$ plain form
21627 -49158 -41292 -56336 -59719 -103890 -116942 -70022 -73942 -45069 -10838 -68831 -108279 -81262
21615 -81262 -116428 -78097 -76154 -89601 -97417 -72408 -12187 36020 24669 21760 54738 12565
21603 12565 -26460 -116174 -121750 -78305 -66043 -94031 -99273 -101819 -87484 -76649 -1493 -63403
21591 -63403 -44572 -10760 -44647 -38032 30976 61439 -43394 -65305 -76171 -93232 -49833 -87925
21579 -87925 -62382 -3488 11106 3972 9520 -26858 -63321 -101679 -121374 -91227 -13862 9996
21567 9996 32678 51003 71342 -9207 -31566 -37603 -518 22577 5361 -49173 -65945 -48251
21555 -48251 -73953 -71647 -50673 -21636 -25717 -103699 -132977 -105631 -82535 -42115 -41074 -36004
21543 -36004 -63095 -97387 -53354 -22792 -90232 -98483 -80288 -120388 -117365 -60813 -8851 35759
$$ packed form
21627d9158P866j5044l383m4171j3052M6920l920K8873L4231n7993l9448K7017
21615h1262l5166L8331J943j3447p816K5009O0221M8207j1351k909L2978m2173
21603A2565l9025q9714n576M3445J2262k7988n242k546J4335J0835P5156o1910
21591f3403J8831L3812l3887O615O9008L0463j04833k1911j0866j7061M3399l8092
21579h7925K5543N8894J4594p134N548l6378l6463l8358j9695L0147P7365K3858
21567I996K2682J8325K0339q0549k2359o037L7085K3095j7216n4534j6772J7694
21555d8251k5702K306K0974K9037m081p7982k9278K7346K3096M0420J041N070
21543c6004k7091l4292M4033L0562o7440q251J8195m0100L023N6552N1962M4610
$$ plain form
21531 35759 16208 12889 46374 7464 20553 86269 143183 123976 117498 21719 7716 49795
21519 49795 17239 14472 4166 -1724 -40560 -89088 -5802 -42472 -100523 -42934 -17194 19278
21507 19278 -24830 -67038 -87023 -57891 -96740 -92305 -65630 -86434 -92731 -70767 -60486 -34685
21495 -34685 78088 95811 61490 -7701 3863 3011 -51216 -43924 -36303 -33677 -26082 -20308 -6320
21482 -6320 -57989 -68082 -84828 -53745 4340 51808 -14038 -59309 -46930 -47041 -18883 -15106
21470 -15106 -46884 -58198 21195 67642 25311 -24698 2668 27964 77928 61142 -2129 13997
21458 13997 82304 107757 29335 -19811 -78702 -94361 -64549 1134 44595 88766 62435 40883
21446 40883 -47925 -53719 -91362 -121416 -52669 24353 19356 -29859 -36396 -44104 -47377 -7559 71789
$$ packed form
21531C5759j9551l319L3485l8910J3089O5716N6914j9207o478r5779j4003M2079
21519D9795l2556k767j0306n890l8836m8528Q3286l6670n8051N7589K5740L6472
21507A9278m4108m2208j9985K9132l8849M435K6675k0804o297K1964J0281K5801
21495c4685J12773J7723l4321o9191J1564q52n4227P292P621K626P595N774J3988
21482f320n1669j0093j6746L1083N8085M7468o5846m5271J2379j11K8158L777
21470a5106l1778j1314P9393M6447m2331n0009K7366K5296M9964j6786o3271J6126
21458A3997O8307K5453p8422m9146n8891j5659K9812O5683M3461M4171k6331k1552
21446D0883q8808n794l7643l0054O8747P7022m997m9215o537p708l273L9818P9348
$$ plain form
21433 71789 94933 50845 10761 6221 12257 -28680 -37870 253 39597 66844 26430 31863
21421 31863 43531 18944 63743 84986 87103 45484 -21282 24080 96188 129613 115318 87766
21409 87766 71137 95277 96711 46218 -20188 -19427 -5932 8505 8382 -21188 2325 8059 33235
21396 33235 52671 -14081 -73414 -33713 43574 23544 -15275 -18615 -9203 3874 4871 6501 -13419
21383 -13419 -50753 -52002 -56303 -22629 -35614 -33766 -21214 -2588 78205 95525 74285 91673
21371 91673 112642 95751 34684 17583 64815 82680 38366 8290 6111 6347 49206 141152
21359 141152 115218 65103 -20857 -42223 -38014 -36732 -30406 -50222 -86715 -18782 20172 4955
21347 4955 12738 -13781 -4629 76734 49657 8996 -38121 -73492 -33420 -16565 -29332 47440
$$ packed form
21433G1789K3144m4088m0084m540O036m0937r190L8123L9344K7247m0414N433
21421C1863J1668k4587M4799K1243K117m1619o6766M5362P2108L3425j4295k7552
21409H7766j6629K4140J434n0493o6406P61J3495J4437j23k9570K3513N734K5176
21396C3235J9436o6752n9333L9701P7287k0030l8819l340R412J3077R97J630j9920
21383a3419l7334j249m301L3674j2985J848J2552J8626Q0793J7320k1240J7388
21371I1673K0969j6891o1067j7101M7232J7865m4314l0076k179K36M2859R1946
21359A41152k5934n0115q5960k1366M209J282O326j9816l6493O7933L8954j5217
21347D955P783k6519R152Q1363k7077m0661m7117l5371M0072J6855j2767P6772
$$ plain form
21335 47440 4435 21488 49173 -16240 -61160 -64835 -66154 -17417 -13374 -63460 -91097 -108691
21323 -108691 -146164 -119235 -64816 27599 17416 32279 4063 4747 -7442 -21457 -45431 -70013
21311 -70013 -67768 -17409 -6986 -3480 -7840 -51152 -93583 -48640 4521 -9296 -18618 -9859 -7772
21298 -7772 -19967 -42614 -63046 -103794 -154027 -200654 -194802 -110047 -75036 -73030 18711 73067
21286 73067 73274 30142 28650 52858 76207 36406 60607 11196 -35128 -52525 -21896 -82200
21274 -82200 -80697 -11701 -31600 -16547 -40085 3744 -5857 17452 -28554 -42931 -39897 -111750
21262 -111750 -115402 -67609 -7178 -80005 -106550 -155341 -134528 -88289 -50277 -28458 -14775 13098
21250 13098 -447 -12808 -39564 26151 40385 54116 -10678 -71211 -117591 -116626 -55659 -38067
$$ packed form
21335D7440m3005J7053K7685o5413m4920l675j319M8737M043n0086k7637j7594
21323a08691l7473K6929N4419R2415j0183J4863k8216O84j2189j4015k3974k4582
21311g0013K245N0359J0423L506m360m3312m2431M4943N3161j3817r322Q759K087
21298g772j2195k2647k0432m0748n0233m6627N852Q4755L5011K006R1741N4356
21286G3067K07m3132j492K4208K3349l9801K4201m9411m6324j7397L0629o0304
21274h2200J503O8996j9899J5053k3538M3829r601K3309m6006j4377L034p1853
21262a11750l652M7793O0431p2827k6545m8791K0813M6239L8012K1819J3683K7873
21250A3098j3545j2361k6756O5715J4234J3731o4794o0533m6380R65O0967J7592
$$ plain form
21238 -38067 -50171 -66556 -32315 -4107 27957 -16066 -105142 -126105 -131724 -119137 -98323 -57588
21226 -57588 -63523 -60549 -76439 -42873 -44400 -54495 -22763 -10707 10838 14362 8418 3536 21678
21213 21678 -40585 -75210 -54341 -16328 -5144 20722 958 -22300 -16900 -51179 -62705 -57702
21201 -57702 -23880 -53318 -98997 -80823 -83727 -93001 -70879 -2100 32200 -1385 -41205 -107617
21189 -107617 -87278 17541 7030 -25475 36043 13895 -51780 -98994 -98087 -101841 -68696 -26870
21177 -26870 -37719 -26776 -1184 9108 -10120 -74687 -85216 -52606 -28743 32632 66203 16714
21165 16714 27396 33110 -5654 6034 -18597 -34129 -57262 -91774 -59802 9898 -6328 -47392
21153 -47392 1817 2944 -10614 15769 -16029 -38951 -32515 -22072 -50615 -27721 -4679 -41467
$$ packed form
21238c8067j2104j6385L4241K8208L2064m4023q9076k0963n619J2587K0814M0735
21226e7588n935K974j5890L3566j527j0095L1732J2056K1545L524n944m882J8142
21213B1678o2263l4625K0869L8013J1184K5866j9764k3258N400l4279j1526N003
21201e7702L3822k9438m5679J8174k904r274K2122O8779L4300l3585l9820o6412
21189a07617K0339J04819j0511l2505O1518k2148o5675m7214R07l754L3145M1826
21177b6870j0849J0943K5592J0292j9228o4567j0529L2610K3863O1375L3571m9489
21165A6714J0682N714l8764J1688k4631j5532k3133l4512L1972O9700j6226m1064
21153d7392M9209J127j3558K6383l1798k2922O436J0443k8543K2894K3042l6788
$$ plain form
21141 -41467 -30662 -19692 -20852 -23461 -5758 40204 2013 13166 24446 -23207 -47047 -22119
21129 -22119 -33966 -30816 -9851 -60098 -75772 -95675 -110508 -89459 -8072 25781 29939 -57447
21117 -57447 -86212 -40430 44863 55653 61894 3444 -71581 -31529 -19521 -52502 -46142 -8698
21105 -8698 -34173 -61145 -91333 -66536 -108959 -122454 -104237 -79931 -76000 -63544 -69297 -47719
21093 -47719 -44801 -53619 -26445 -12599 31375 -1628 -17257 -42718 -46735 -39321 -49977 -34070
21081 -34070 -1420 -47757 -72720 -22772 38409 51075 -30311 -67536 -73820 -72521 -181 -3747
21069 -3747 -83166 -132757 -105726 -61455 -21460 -15218 -74276 -94490 -50845 27874 64230 38768
21057 38768 28350 -49579 -93414 -112313 -122177 -128973 -88329 -56045 -39236 -10595 -5313 -27591
$$ packed form
21141d1467J0805J0970j160k609J7703M5962l8191J1153J1280m7653k3840K4928
21129b2119j1847L150K0965n0247j5674j9903j4833K1049Q1387L3853M158q7386
21117e7447k8765M5782Q5293J0790O241n8450p5025M0052J2008l2981O360L7444
21105h698k5475k6972l0188K4797m2423j3495J8217K4306L931J2456n753K1578
21093d7719K918q818K7174J3846M3974l3003j5629k5461m017P414j0656J5907
21081c4070L2650m6337k4963M9948O1181J2666q1386l7225o284J299P2340l566
21069c747p9419m9591K7031M4271L9995O242n9058k0214M3645P8719L6356k5462
21057C8768j0418p7929m3835j8899r864o796M0644L2284J6809K8641N282k2278
$$ plain form
21045 -27591 -40685 -42975 -109584 -85883 -54061 -122070 -83967 3554 -8961 -69675 -91725 -76212
21033 -76212 -82494 -77916 -68909 -88252 -158976 -190255 -140059 -126899 -150569 -124646 -117787 -7227
21021 -7227 44457 -40402 -107883 -93348 -49463 40724 -19893 -43132 -68679 -153102 -74685 -42981
21009 -42981 -93768 -89679 -114026 -141635 -162932 -196421 -184777 -132231 -121306 -121452 -68792 -16582
20997 -16582 -56976 -86074 -52042 -102462 -157256 -148486 -140020 -132449 -98237 -67249 -35758 -23668
20985 -23668 -53805 -39563 -9005 35763 79234 94171 44629 -87239 -120837 -143526 -131570
20974 -131570 -127177 -77255 -42329 36682 69311 16817 -33817 -33850 -32148 17882 24823 68420 38490
20961 38490 -1050 15116 6266 -23481 -37912 -64043 -29024 -38907 -57886 -75302 -105276 -128871
$$ packed form
21045b7591j3094k290o6609K3701L1822o8009L8103Q7521j2515o0714k2050J5513
21033g6212o282M578R007j9343p0724l1279N0196J3160k3670K5923O859J10560
21021g227N1684q4859o7481J4535M3885R0187o0617k3239k5547q4423P8417L1704
21009d2981n0787M089k4347k7609k1297l3489J1644N2546J0925j46N2660N2210
20997a6582m0394k9098L4032n0420n4794Q770Q466P571L4212L0988L1491J2090
20985b3668l0137J4242L0558M4768M3471J4937m9542j31868l3598k2689J1956
20974a31570M393M9922L4926P9011L2629n2494n0634l3J702N0030O941M3597k9930
20961C8490l9540J6166q850k9747j4431k6131L5019r883j8979j7416k9974k3595
$$ plain form
20949 -128871 -105618 -32316 -29510 -87809 -40706 -29586 -60284 -35971 28871 46812 76784 98530
20937 98530 111485 78700 4059 -71321 -44560 855 24749 44912 18524 5361 -18016 -6317
20925 -6317 -54174 -110930 -116106 -136479 -107795 -78797 -73897 -49359 -38336 -27706 -33227 18527
20913 18527 59928 70037 30213 -59007 -18838 -39658 -80060 -147308 -128084 -102082 -90312 -81935
20901 -81935 -45939 14744 2636 -30838 -66649 -63748 -34749 -31215 -55318 -19913 -68445 -4902
20889 -4902 31979 38623 52113 15965 -16599 -7499 30277 29661 -31114 -104805 -119611 -97807 -56728
20876 -56728 58264 68865 -17157 -52824 -50362 -9122 29912 1626 -29214 -7742 1017 -1175
20864 -1175 -93398 -123797 -76011 -85622 -90370 11081 -13087 -57024 7798 37814 848 -11605
$$ packed form
20949a28871K3253P3302K806n8299M7103J1120l0698K4313O4842J7941K9972K1746
20937I8530J2955l2785p4641p5380K6761M5415K3894K0163k6388j3163k3377J1699
20925f317m7857n6756n176k0373K8684K8998M900K4538J1023J0630n521N1754
20913A8527M1401J0109l9824q9220M0169k0820m0402o7248J9224K6002J1770Q377
20901h1935L5996O0683j2108l3474l5811K901K8999L534k4103L5405m8532O3543
20889d902L6881O644J3490l6148l2564R100L7776o16o0775p3691j4806K1804M1079
20876e6728J14992J0601q6022l5667K462M1240L9034k8286l0840K1472Q759k192
20864a175r2223l0399M7786r611m748J01451k4168m3937O4822L0016l6966j2453
$$ plain form
20852 -11605 -14984 -62428 -61143 -53653 -13173 -7176 5933 -37814 -79368 -77720 -81836 -73388 -44704
20839 -44704 -24585 -37921 -21027 -19099 -12653 42483 39370 -28247 -19554 11985 85803 98452
20827 98452 133400 126536 82994 36173 8175 5131 31292 -28678 -45700 19590 44872 29880
20815 29880 37613 -2703 -68600 -72058 -51852 -69377 -88092 -159903 -167745 -113978 -78669 -73075
20803 -73075 -95449 -118352 -149421 -180414 -186839 -131167 -18454 27487 -36905 -37822 -41941 -70039
20791 -70039 -50295 47002 74975 46213 1707 -25540 8444 7752 -45162 -25343 -15042 45232
20779 45232 89902 22944 -49455 -47487 -18370 25722 -17892 -72454 -76975 -44603 -2268 13789
20767 13789 34394 20467 -7020 -47755 -79811 -95903 -133914 -157686 -121732 -48549 -58683 -61389
$$ packed form
20852a1605l379m7444J285P490M0480N997J3109m3747m1554J648m116Q448K8684
20839d4704K0119j3336J6894J928O446N5136l113o7617Q693L1539P3818J2649
20827I8452L4948o864m3542m6821k7998l044K6161n9970j7022O5290K5282j4992
20815B9880P733m0316o5897l458K0206j7525j8715p1811p842N3767L5309N594
20803g3075k2374k2903l1069l0993o425N5672J12713M5941o4392r17m119k8098
20791g0039J9744R7297K7973k8762m4506k7247L3984o92n2914J9819J0301O0274
20779D5232M4670o6958p2399J968K9117M4092m3614n4562m521L2372M2335J6057
20767A3789K0605j3927k7487m0735l2056j6092l8011k3772L5954P3183j0134k706
$$ plain form
20755 -61389 -30114 -59132 -30326 20520 33957 5171 -13887 -36868 -99651 -145296 -94055 -11909
20743 -11909 -20323 -41234 -22595 -33920 -107998 -138368 -66614 5405 48103 35033 37542 -32122
20731 -32122 -96555 -94449 -66208 -15122 25291 5260 -10436 22341 68504 -113 -26517 623
20719 623 -10539 -26571 -56382 -53847 -36475 -14878 -47600 -53550 -9917 79295 77477 8970 -57981
20706 -57981 -27785 -32681 -7465 31815 27155 -16220 -40905 -86979 -72067 17917 77703 51792
20694 51792 60528 11129 -42126 -77254 -82161 -54757 -99888 -98948 -75280 -93698 -92537 -82912 -97514
20681 -97514 -62063 -28827 -75592 -58467 -33596 -70164 -86225 -45937 23418 -22878 -57495 -77166
20669 -77166 -23385 25195 -26479 -37053 -49003 -3634 11270 20472 15393 -24086 -52588 -57057
$$ packed form
20755f1389L1275k9018K8806N0846J3437k8786j9058k2981o2783m5645N1241Q2146
20743a1909q414k0911J8639j1325p4078l0370P1754P2019M2698j3070K509o9664
20731c2122o4433K106K8241N1086M0413k0031j5696L2777M6163o8617k6404K7140
20719F23j1162j6032k9811K535J7372K1597l2722n950M3633Q9212j818o8507o6951
20706e7981L0196m896K5216L9280m660m3375k4685m6074J4912Q9984N9786k5911
20694E1792Q736m9399n3255l5128m907K7404m5131R40K3668j8418J161R625j4602
20681i7514L5451L3236m6765J7125K4871l6568j6061M0288O9355m6296l4617j9671
20669g7166N3781M8580n1674j0574j1950M5369J4904R202n079l9479k8502m469
$$ plain form
20657 -57057 -94619 -46059 -66010 -61578 -50841 -137338 -148793 -77064 -45040 -83970 -89238 -80010
20645 -80010 -94135 -95028 -28497 14868 -24354 -81415 -86281 -55660 -46461 -47156 25319 57394 106676
20632 106676 96494 38187 -36828 -63439 -57235 -22306 11730 11453 -11923 -24386 29903 -39570
20620 -39570 -110918 -128263 -49633 -49834 1894 1234 35894 56485 28465 6081 -10770 -38147
20608 -38147 -111808 -161156 -167988 -130210 -71448 8053 44910 10321 -21676 -41817 -10512 -66240
20596 -66240 -77085 -28370 -67978 -141388 -139900 -134129 -131843 -103756 -103123 -79470 -37967 29747 55303
20583 55303 -18434 -102845 -68992 -38580 -38313 -18752 40523 21486 60285 23728 -10449 -61452
20571 -61452 -109376 -63814 -58204 -35203 -63453 -73222 -94647 -107932 -81088 -3442 47102 10444
$$ packed form
20657e7057l7562M8560j9951M432J0737q6497j1455P1729L2024l8930n268R228
20645h0010j4125q93O6531M3365l9222n7061m866L0621R199o95P2475L2075M9282
20632A06676j0182n8307p5015k6611O204L4929L4036k77k3376j2463N4289o9473
20620c9570p1348j7345P8630k01N1728o60L4660K0591k8020k2384j6851k7377
20608c8147p3661m9348o832L7778N8762P9501L6857l4589l1997k0141L1305n5728
20596f6240j0845M8715l9608p3410J488N771K286K8087O33K3653M1503O7714K5556
20583E5303p3737q4411L3853L0412K67J9561N9275j9037L8799l6557l4177n1003
20571f1452m7924M5562N610K3001k8250r769k1425j3285K6844P7646N0544l6658
$$ plain form
20559 10444 -16025 30585 38905 8029 -35693 -40256 -37151 -43696 8298 -13741 -24415 10756
20547 10756 -38869 -128461 -93006 -94338 -68797 -55817 -25433 11789 2771 -51281 -120044 -116491
20535 -116491 -110322 -72745 -60450 -137469 -203123 -182245 -167244 -173347 -92958 17556 92140 21301
20523 21301 -25149 -122905 -63117 -23313 -24786 -35726 21119 48014 21292 3825 -33162 -48761
20511 -48761 -36125 -42973 -48733 -15945 -14407 -42084 12483 14816 -34713 -24739 4534 -15852 -42668
20498 -42668 -54315 -49401 -28950 -53999 -20971 2280 19998 55831 21531 -49475 -102876 -166009
20486 -166009 -76098 -45431 -59041 -69741 -78110 -35409 -13490 -103904 -162902 -152417 -112374 -79803
20474 -79803 -52772 -74234 -95691 -64375 -18411 12733 29259 30467 3562 -11265 -9926 -24465
$$ packed form
20559A0444k6469M6610Q320l0876m3722m563L105o545N1994k2039j0674L5171
20547A0756m9625q9592L5455j332K5541J2980L0384L7222r018n4052o8763L553
20535a16491O169L7577J2295p7019o5654K0878J5001o103Q0389J10514P4584p0839
20523B1301m6450r7756N9788L9804j473j0940N6845K6895k6722j7467l6987j5599
20511d8761J2636o848n760L2788J538k7677N4567K333m9529R974K9273k0386k6816
20498d2668j1647M914K0451k5049L3028K3251J7718L5833l4300p1006n3401o3133
20486a66009Q9911L0667j3610j0700q369M2701K1919r0414n8998J0485M0043L2571
20474g9803K7031k1462k1457L1316M5964L1144J6526J208k6905j4827J339j4539
$$ plain form
20462 -24465 -37115 1002 4259 -71757 -122493 -131269 -101294 -49541 -47654 -15927 24378 1532
20450 1532 1496 84301 81463 46390 37683 -6126 -52062 -42266 -69296 -76743 -77806 -71154 -43906 -11628
20436 -11628 -57351 -52564 -60718 -41784 -24942 -54383 -90230 -83963 -37647 -63718 -61328 -73319
20424 -73319 -73781 43183 123513 102022 91424 12123 -98283 -110260 -104496 -88839 -135548 -128014
20412 -128014 -115016 -81162 -68359 -63629 -36619 -37572 -29360 -63380 -89435 -116175 -60060 -36510
20400 -36510 -17372 8112 9307 11325 1485 -47932 -50285 -10369 -44304 -87765 -71312 -22734
20388 -22734 -5455 24785 -20323 -102573 -103835 -46829 -48843 -112997 -160490 -65075 -71575 -118655
20376 -118655 -129245 -134057 -15419 -15285 -46496 -60106 -106933 -99079 -109129 -123803 -77344 -50152
$$ packed form
20462b4465j2650L8117L257p6016n0736q776K9975N1753J887L1727M0305k2846
20450A532l6Q2805k838l5073q707m3809m5936R796k7030p447j063O652K7248L2278
20436a1628m5723M787q154J8934J6842k9441l5847O267M6316k6071K390j1991
20424g3319m62J16964Q0330k1491j0598p9301j10406j1977N764J5657m6709P534
20412a28014J2998L3854J2803M730K7010r53Q212l4020k6055k6740N6115K3550
20400c6510J9138K5484J195K018r840m9417k353L9916l3935m3461J6453M8578
20388b2734J7279L0240m5108q2250j262N7006k014o4154m7493R5415o500m7080
20376a18655j0590m812J18638J34l1211j3610m6827P854j0050j4674M6459K7192
$$ plain form
20364 -50152 -49719 -17219 29467 9242 -13275 -10225 -44168 -12717 -61311 -132925 -132594 -89061 -24376
20351 -24376 -11108 -30469 4212 33948 18745 -47040 -74371 -116420 -109651 -103118 -116207 -112597
20339 -112597 -92866 -76197 5486 44880 12864 33020 95017 79963 35312 29008 -9044 -54135
20327 -54135 -66257 -77553 -27093 36282 31390 -549 17678 67149 122493 101454 76990 49637
20315 49637 -307 37713 43810 -38990 -123792 -124215 -56264 -2960 -39266 -79564 -91511 -62343
20303 -62343 -22790 34165 96465 101058 75086 17456 -45830 -113698 -112077 -114957 -65983 -21119
20291 -21119 17553 23050 -18617 -9241 -33442 -7159 -68416 -99978 -72046 -66933 15030 9901
20279 9901 -36657 -24962 8765 57085 46028 17621 43116 63799 -12877 -106768 -150701 -173541
$$ packed form
20364e0152M33L2500M6686k0225k2517L050l3943L1451m8594p1614L31M3533O4685
20351b4376J3268j9361L4681K9736j5203o5785k7331m2049O769O533j3089L610
20339a12597J9731J6669Q1683L9394l2016K0156O1997j5054m4651o304l8052m5091
20327e4135j2122j1296N0460O3375m892l1939J8227M9471N5344k1039k4464k7353
20315D9637m9944L8020O097q2800q4802m23O7951N3304l6306m0298j1947K9168
20303f2343L9553N6955O2300M593k5972n7630o3286o7868J621k880M8974M4864
20291b1119L8672N497m1667R376k4201K6283o1257l1562K7932N113Q1963n129
20279I901m6558J1695L3727M8320j1057k8407K5495K0683p6676r3891m3933k2840
$$ plain form
20267 -173541 -93304 -34088 -19673 -75993 -71988 -39640 -59187 -74033 -5299 10803 33281 73054
20255 73054 109755 63536 31401 22094 6123 -3028 -45995 -69709 -52160 -72299 -88466 -43484
20243 -43484 -28085 -83466 -114634 -101141 -95823 -94044 -110685 -94068 -98394 -44925 -19260 -40794
20231 -40794 -48672 -66071 -76485 -89724 -71751 -49245 -6627 -24099 -2992 -38892 -59721 -67971
20219 -67971 -109341 -63729 16344 -28255 -72743 -52403 -31861 -51347 -30518 48193 123973 83455
20207 83455 113358 102771 17769 -26909 -19015 4312 53927 48141 -6503 8871 90320 173548
20195 173548 203343 149812 149510 189718 206437 170737 140261 82639 21013 85441 35915 -14111
20183 -14111 25334 30110 71983 114544 79862 10741 -6035 19554 82016 79168 72605 37282
$$ packed form
20267a73541Q0237N9216J4415n6320M005L2348j9547j4846O8734J6102K2478L9773
20255G3054L6701m6219l2135r307j5971r151m2967k3714J7549k0139j6167M4982
20243d3484J5399n5381l1168J3493N318J779j6641J6617m326N3469K5665k1534
20231d0794p878j7399j0414j3239J7973K2506M2618j7472K1107l5900k0829q250
20219f7971m1370M5612Q0073m4599m4488K0340K0542j9486K0829P8711P5780m0518
20207H3455K9903j0587q5002m4678P894K3327M9615n786n4644J5374Q1449Q3228
20195A73548K9795n3531l02M0208J6719l5700l0476n7622o1626O4428m9526n0026
20183a4111L9445M776M1873M2561l4682o9121j6776K5589O2462k848o563l5323
$$ plain form
20171 37282 59133 37938 12432 14354 59167 24998 -13650 -25535 -14107 29166 6837 -37574
20159 -37574 -116659 -101736 -1111 58875 35806 -8141 -35870 38199 45179 -30101 -66980 -71227
20147 -71227 -2444 27415 25575 44735 59992 58635 47809 58166 44136 51345 60416 40217
20135 40217 76491 55172 32203 19914 54642 42614 -18165 -23973 -3930 31790 58026 94803
20123 94803 180266 278856 377430 382959 337149 278163 240329 280356 237573 183549 107212 70064
20111 70064 83062 80842 27314 40268 91477 81775 61877 67223 51614 59611 105733 95639
20099 95639 120871 149312 78536 20287 98807 115241 142084 113697 94402 69369 59135 54461
20087 54461 78668 67022 31814 27940 30917 52421 57535 57343 49754 -20621 -20840 18443 2813
$$ packed form
20171C7282K1851k1195k5506J922M4813l4169l8648j1885J1428M3273k2329m4411
20159c7574p9085J4923J00625N9986k3069m3947k7729P4069O980p5280l6879m247
20147g1227O8783K9859j840J9160J5257j357j0826J0357j4030P209R071k0199
20135D0217L6274k1319k2969j2289L4728j2028o0779n808K0043L5720K6236L6777
20123I4803Q5463R8590R8574N529m5810n8986l7834M0027m2783n4024p6337l7148
20111G0064J2998k220n3528J2954N1209r702j9898N346j5609P997M6122j0094
20099I5639K5232K8441p0776n8249P8520J6434K6843k8387j9295k5033j0234m674
20087E4461K4207j1646l5208l874K977K1504N114j92p589p0375k19L9283j5630
$$ plain form
20074 2813 -71526 -68201 -41630 0 13159 9810 25548 -15808 -34851 -43254 -35676 -74497 -104985
20061 -104985 -116524 -35349 18838 23611 -22648 -38790 -112705 -100360 -41411 -22512 23719 44526
20049 44526 11688 32739 -29775 -79472 -89923 -30448 -13084 5249 3617 10930 21958 -24028
20037 -24028 2139 5127 28241 -50031 -54888 -30916 -18710 -33963 -86503 -141775 -84278 24806
20025 24806 22675 -2728 -55886 -61965 -78787 -71079 -47769 -81973 -90862 -101135 -97707 -56897 -58129
20012 -58129 -49520 -25108 -40414 -73300 -75836 -5041 61977 34200 15890 50835 70504 74626
20000 74626 38591 -9011 8264 27267 24134 21820 14351 36930 30762 -13590 -41348 -14658
19988 -14658 18585 15201 -17538 -17459 25439 -3561 -35745 -23455 -40302 -58369 -39491 -84118
$$ packed form
20074B813p4339L325K6571M1630J3159l349J5738m1356j9043q403P578l8821l0488
20061a04985j1539Q1175N4187M773m6259j6142p3915J2345N8949J8899M6231K0807
20049D4526l2838K1051o2514m9697j0451N9475J7364J8333j632P313J1028m5986
20037b4028K6167K988K3114p8272m857K3972J2206j5253n2540n5272N7497J09084
20025B4806k131k5403n3158o079j6822P708K3310l4204q889j0273L428M0810j232
20012e8129Q609K4412j5306l2886k536P0795O7018k7777j8310L4945J9669M122
20000G4626l6035m7602J7275J9003l133k314p469K2579o168m4352k7758K6690
19988a4658L3243l384l2739P9M2898k9000l2184J2290j6847j8067J8878m4627
$$ plain form
19976 -84118 -89371 -88643 -110685 -74584 -55233 -40512 -25740 -72833 -102292 -95155 -85353 -129910 -147601
19963 -147601 -97132 -78104 -58243 -34801 28 30104 24950 -46972 -86015 -70584 -44359 -41883
19951 -41883 -42622 -70571 -91750 -155790 -174354 -131731 -103128 -77319 -85978 -52848 -63938 -45734
19939 -45734 -63126 -84354 -9954 -9189 -31995 -19930 -2281 1459 -22158 -81446 -94090 -34952
19927 -34952 -31287 -1261 479 -47115 -15778 26129 44896 60522 70086 -9779 8327 73338
19915 73338 54568 36732 -21788 18119 47404 40755 32384 18075 -13944 -50787 -100477 -95046
19903 -95046 -49176 2637 -668 -14215 -3895 6988 15868 47741 13112 -465 -22564 -76204
19891 -76204 -56907 -90732 -61859 -102347 -108627 -116046 -167089 -124088 -97214 -32712 39434 -32503
$$ packed form
19976h4118n253P28k2042L6101J9351J4721J4772m7093k9459P137R802m4557j7691
19963a47601N0469J9028J9861K3442L4829L0076n154p1922l9043J5431K6225K476
19951d1883p39k7949k1179o4040j8564M2623K8603K5809q659L3130j1090J8204
19939d5734j7392k1228P4400P65k2806J2065J7649L740k3617n9288j2644N9138
19927c4952L665L0026J740m7594L1337M1907J8767J5626R564p9865J8106O5011
19915G3338j8770j7836n8520L9907K9285o649q371j4309l2019l6843m9690N431
19903i5046M5870N1813l305j3547J0320J0883Q880L1873l4629j3577k2099n3640
19891g6204J9297l3825K8873m0488o280p419n1043M3001K6874O4502P2146p1937
$$ plain form
19879 -32503 -49620 -106292 -110927 -53730 -7461 -3056 -9757 11795 52384 79284 82761 41642
19867 41642 27173 8576 -27380 33715 42695 29275 -53996 -86087 -73123 -35779 -57382 -59637
19855 -59637 -53204 -15223 21190 24347 -23454 -9353 -7433 29884 51084 61814 48285 47427 108071
19842 108071 171368 197531 124993 177021 220630 221112 267172 305780 299285 294664 287879 299878
19830 299878 310227 324337 287199 307598 345966 365902 418536 427241 354053 316375 269571 200191
19818 200191 183834 172992 142354 120102 135407 183278 155500 103918 115730 123523 64317 53600
19806 53600 6421 32234 14405 49434 73131 131906 151163 136907 109012 83085 -7808 -71062
19794 -71062 -61938 -25402 14391 9896 76487 156130 139558 103258 71849 85875 28317 -29177
$$ packed form
19879c2503j7117n6672m635N7197M6269M405o701K1552M0589K6900L477m1119
19867D1642j4469j8597l5956O1095Q980j3420q3271l2091J2964L7344k1603k255
19855e9637O433L7981L6413L157m7801J4101J920L7317K1200J0730j3529q58O0644
19842A08071O3297K6163p2538N2028M3609M82M6060L8608o495m621o785J1999
19830B99878J0349J4110l7138K0399L8368J9936N2634Q705p3188l7678m6804o9380
19818B00191j6357j0842l0638k2252J5305M7871k7778n1582J1812P793n9206j0717
19806E3600m7179K5813j7829L5029K3697N8775J9257j4256k7895k5927r0893o3254
19794g1062R124L6536L9793m495O6591P9643j6572l6300l1409J4026n7558n7494
$$ plain form
19782 -29177 -35087 -47776 -38482 8506 -14962 -53243 -116700 -67111 6388 6063 -53880 -10393
19770 -10393 43702 9586 6815 39847 60468 43617 39655 15872 -29576 -105259 -87162 15414
19758 15414 32986 -12677 22438 53940 51554 32929 -11695 -24516 -6837 -12347 -22067 7376
19746 7376 83167 97623 84710 27914 45216 25001 -5374 10475 48236 -18207 -79792 -75327
19734 -75327 -91570 -24183 -21961 -38477 -24722 -32724 -71930 -111651 -96354 -58842 -20011 2381
19722 2381 666 -35197 -61237 -36037 -17534 -37180 -31834 -24187 -35772 -46133 1450 36069
19710 36069 8159 29893 41288 19220 -32135 -29805 -19058 -40582 -23520 19575 24161 52883
19698 52883 70368 2553 -41504 -71138 -61120 -4958 3148 -16581 25162 58768 27629 -7680
$$ packed form
19782b9177n910j2689R294M6988k3468l8281o3457M9589P3499l25n9943M3487
19770a0393N4095l4116k771L3032K0621j6851l962k3783m5448p5683J8097J02576
19758A5414J7572m5663L5115L1502k386j8625m4624j2821J7679n510r720K9443
19746G376P5791J4456j2913n6796J7302k0215l0375J5849L7761o6443o1585M465
19734g5327j6243O7387K222j6516J3755q002l9206l9721J5297L7512L8831K2392
19722B381j715l5863k6040K5200J8503j9646N346P647j1585j0361M7583L4619
19710C6069k7910K1734J1395k2068n1355K330J0747k1524J7062M3095M586K8722
19698E2883J7485o7815m4057k9634J0018N6162Q106j9729M1743L3606l1139l5309
$$ plain form
19686 -7680 -16782 -36630 -30263 -27822 867 -16760 -15438 -24480 -13527 -26781 -40185 -56380 -16285
19673 -16285 24301 -10059 -31093 -57703 -80512 -85653 -60885 -65993 -31296 -54924 -106403 -114139
19661 -114139 -62463 -29597 -78573 -78968 -69040 -69356 -74209 -74306 -110981 -72119 6296 -35350 -40179
19648 -40179 7322 2067 -39244 -34032 8636 35823 20662 4884 22027 -81965 -151048 -124252
19636 -124252 -80440 -51066 5663 31751 736 -79970 -164733 -170868 -114561 -42017 -49153 -71973
19624 -71973 -52218 -31814 21230 73604 10220 18177 6371 -21276 -4083 10716 -15496 -53958
19612 -53958 -70357 -43788 64695 135197 108605 85194 31379 -25171 -36626 -37560 -73609 -67072
19600 -67072 -59783 -36067 8863 58456 14537 -69039 -64810 -53087 -23186 -33636 16098 -35758
$$ packed form
19686g680r102j9848O367K441K8689j7627J322r042J0953j3254j3404j6195M0095
19673a6285M0586l4360k1034k6610k2809n141K4768n108L4697k3628n1479p736
19661a14139N1676L2866m8976l95R928l16m853r7l6675L8862P8415m1646m829
19648d0179M7501n255m1311N212M2668K7187j5161j5778J7143j03992o9083K6796
19636a24252M3812K9374N6729K6088l1015q0706q4763o135N6307P2544p136k2820
19624g1973J9755K0404N3044N2374o3384P957j1806k7647J7193J4799k6212l8462
19612e3958j6399K6569J08483P0502k6592k3411n3815n6550j1455r34l6049O537
19600f7072P289K3716M4930M9593m3919q3576M229J1723K9901j0450M9734n1856
$$ plain form
19588 -35758 -84661 -59562 -80871 -111659 -144048 -121433 -124274 -150144 -79589 -33272 -64024 -95180
19576 -95180 -34340 12925 -60561 -63710 -49897 -24923 1674 28078 -2262 27074 -3586 -25156
19564 -25156 23178 14567 -2111 3018 -81435 -123958 -35187 23892 4944 40454 -11013 -19635
19552 -19635 3644 76686 102820 37753 -14250 -17060 -19313 -28681 -33724 -49744 -51225 -67238 -88866
19539 -88866 -84677 -68334 -46323 -7249 -36789 -81515 -69825 -25213 -83955 -118980 -77431 -59938
19527 -59938 -27397 -51084 1446 60676 34642 -18956 -18152 19691 -39018 -39406 -33629 -16752 -36007
19514 -36007 -32552 -38714 1088 -56699 -45641 -35846 -40926 -88498 -56232 -69634 -75035 -60182 -38983
19501 -38983 -41909 -24129 -28511 -35228 -48841 -66510 12950 41638 7320 -88149 -106103 -85770
$$ packed form
19588c5758m8903K5099k1309l0788l2389K2615k841k5870P0555M6317l0752l1156
19576i5180O0840M7265p3486l149J3813K4974K6597K6404l0340K9336l0660k1570
19564b5156M8334q611j6678N129q4453m2523Q8771N9079j8948L5510n1467q622
19552a9635K3279P3042K6134o5067n2003k810k253r368n043j6020j481j6013k1628
19539h8866M189J6343K2011L9074k9540m4726J1690M4612n8742l5025M1549J7493
19527e9938L2541k3687N2530N9230k6034n3598Q04L7843n8709l88N777J6877j9255
19514c6007L455o162L9802n7787J1058R795n080m7572L2266j3402n401J4853K1199
19501c8983k926J7780m382o717j3613j7669P9460K8688l4318r5469j7954K0333
$$ plain form
19489 -85770 -56288 -28639 -24643 -103250 -96606 -68081 -41684 -53074 -81671 -80888 -73841 -100857 -111673
19476 -111673 -47982 -13902 -25172 -56807 -5287 13161 45162 35323 -7495 -10258 -27619 -87727
19464 -87727 -43195 -815 -7252 64027 11479 -51418 -46910 -31884 -59973 -75890 -51920 -6677
19452 -6677 -77153 -115450 -102915 -94896 -30819 -75031 -105555 -66608 -38830 -82240 -100977 -87999
19440 -87999 -53143 -60444 37196 49854 313 -78323 -93165 -55787 -25460 -56314 -104385 -84589
19428 -84589 -47456 -62177 -134347 -100964 -72332 -67712 -65254 -87397 -98258 -72588 14685 5929
19416 5929 33814 60780 21096 -32102 -85121 -48236 -18657 -39322 -44968 -49384 -3904 4348
19404 4348 41536 41487 25774 42582 26088 -11750 -12331 -34354 -51351 -57829 -45612 56996 80927
$$ packed form
19489h5770K9482K7649L996p8607O644K8525K6397j1390k8597P83P047k7016j0816
19476a11673O3691L4080j1270l1635N1520J8448L2001r839m2818k763j7361o0108
19464h7727M4532M2380o437P1279n2548o2897M508J5026k8089j5917K3970M5243
19452f677p0476l8297J2535Q019O4077m4212l0524L8947K7778m3410j8737J2978
19440h7999L4856p301R7640J2658m9541p8636j4842L7378L0327l0854m8071J9796
19428h4589L7133j4721p2170L3383K8632M620K458k2143j0861K5670Q7273q756
19416E929K7885K6966l9684n3198n3019L6885K9579k0665n646m416M5480Q252
19404D348L7188m9j5713J6808j6494l7838n81k2023j6997o478J2217J02608K3931
$$ plain form
19391 80927 131769 79904 28971 -24803 -52803 -4779 25316 48452 89024 82077 77802 94754
19379 94754 37209 78360 70283 104812 111395 105536 124010 123794 85251 52528 411 -27407 -81687
19366 -81687 -111907 -42744 -23689 -24138 -78318 -89763 -65244 -43728 -24605 25148 18248 14431
19354 14431 64625 121469 91811 49229 -29156 -57188 -38418 -433 -58274 -62616 -10952 -58145
19342 -58145 -45209 34676 115697 93244 121291 30558 -41041 -48168 -7921 -6764 -15770 -40879
19330 -40879 -10694 -7646 -16107 16417 -67898 -107217 -66261 -28898 -37658 -117278 -82359 -86248
19318 -86248 -132272 -132920 -81405 -95523 -96249 -58097 -30785 -33340 -1449 -7179 -16716 -3956 -11785
19305 -11785 -49936 -45701 -64783 -126596 -64838 -30505 10161 18736 22826 48213 36138 61052
$$ packed form
19391H0927N0842n1865n0933n3774k8000M8024L0095K3136M0572o947m275J6952
19379I4754n7545M1151q077L4529O583n859J8474k16l8543l2723n2117k7818n4280
19366h1687l0220O9163J9055m49n4180j1445K4519K1516J9123M9753o900l817
19354A4431N0194N6844k9658m2582p8385k8032J8770L7985n7841m342N1664m7193
19342e8145J2936P9885Q1021k2453K8047r0733p1599p127M0247J157r006k5109
19330d0879L0185L048q461L2524q4315l9319M0956L7363q760p9620L4919l889
19318h6248m6024o48N1515j4118p26L8152K7312k555L1891n730r537J2760p829
19305a1785l8151M235j9082o1813O1758L4333M0666Q575M090K5387j2075K4914
$$ plain form
19293 61052 94674 85557 36688 56100 35895 36243 35533 4460 -41203 2587 18455 45892 46719
19280 46719 95041 66447 12807 54191 46653 13735 29309 40291 -8130 41539 102489 152601
19268 152601 146271 141599 94741 38098 16916 53087 68649 -15579 -129576 -130839 -125011 -125968
19256 -125968 -109026 -40555 -38453 -60809 -55416 -81302 -62934 -82088 -83927 -62389 -52950 -46109
19244 -46109 -53167 -98936 -123077 -122326 -63144 19124 82321 141025 134243 121298 100157 90787 91867
19231 91867 136723 127662 150516 91531 33110 48729 65699 72791 13976 45286 115145 187419
19219 187419 361127 586377 859143 1233869 1640783 1868265 2061788 2159597 1961727 1608722
19209 1608722 1272566 1037353 870447 796655 718064 649556 681033 742039 738921 802927 853177
$$ packed form
19293F1052L3622r117m8869J9412k0205L48p10l1073m5663M3790J5868K7437Q27
19280D6719M8322k8594n3640M1384p538l2918J5574J0982m8421M9669O0950N0112
19268A52601o330m672m6858n6643k1182L6171J5562q4228j13997j263N828r57
19256a25968J6942O8471K102k2356N393k5886J8368j9154j839K1538R439O841
19244d6109p058m5769k4141P51N9182Q2268O3197N8704o782j2945k1141r370J080
19231I1867M4856r061K2854n8985n8421J5619J6970P092n8815L1310O9859P2274
19219A87419J73708K25250K72766L74726M06914K27482J93523R7809j97870l53005
19209A608722l36156k35213j66906p3792p8591o8508L1477O1006l118O4006N0250
$$ plain form
19198 853177 821004 744665 659428 597333 602816 543465 512583 452169 465795 485949 519922 586602
19186 586602 672675 852817 1098074 1462354 1737738 2050948 2232096 2259404 2083951 1790327
19176 1790327 1541228 1276347 1065365 1002411 1043024 1129116 1250199 1384148 1437268 1371716
19166 1371716 1313126 1229300 1063137 993319 1036021 1249895 1503907 1760190 2052818 2403699
19156 2403699 2623404 2606040 2378291 1996220 1547689 1122286 874478 748525 645340 555324
19146 555324 523335 502475 535791 562896 581884 674417 781309 847877 944574 1010013 989796
19135 989796 934029 876682 815210 823886 872972 993879 1151449 1417533 1701149 1963902 2303128
19124 2303128 2572335 2684279 2680520 2495052 2084950 1590488 1232201 933063 787684 667474
$$ packed form
19198H53177l2173p6339q5237o2095N483n9351l0882o0414J3626K0154L3973O6680
19186E86602Q6073J80142K45257L64280K75384L13210J81148K7308j75453k93624
19176A790327k49099k64881k10982o2954M0613Q6092J21083J33949N3120o5552
19166A371716n8590q3826j66163o9818M2702K13874K54012K56283K92628L50881
19156B403699K19705j7364k27749l82071m48531m25403k47808j25953j03185r0016
19146E55324l1989k0860L3316K7105J8988R2533J06892O6568R6697O5439k0217
19135I89796n5767n7347o1472Q676M9086J20907J57570K66084K83616K62753L39226
19124B303128K69207J11944l759j85468m10102m94462l58287k99138j45379j20210
$$ plain form
19114 667474 564234 519534 481119 477583 404584 339570 304150 314221 303032 276804 306973
19103 306973 371148 357100 353822 364943 334870 256866 293327 373827 385549 362686 429643 397622
19091 397622 311245 247698 236804 208057 176461 163854 208284 239827 241790 278050 291944 310390
19079 310390 298773 238273 297978 296988 214355 246724 324064 327934 411514 473116 450197 421154
19067 421154 414045 419063 456914 566160 638861 681963 680799 728449 647519 555208 381858 309358
19055 309358 334545 334415 320670 367771 414456 399845 440666 451559 387932 348356 342381 322395
19043 322395 247772 203214 275577 350956 405349 430949 438660 416487 420843 339955 212541 161740
19031 161740 188997 129509 61067 98704 107628 110818 159649 202453 175866 264035 281058 254018
$$ packed form
19114F67474j03240m4700l8415l536p2999o5014l5420J0071j1189k6228L0169
19103C06973O4175j4048l278J1121l0073p8004L6461Q0500J1722k2863O6957l2021
19091C97622q6377o3547j0894k8747l1596j2607M4430L1543J963L6260J3894J8446
19079C10390j1617o0500N9705r90q2633L2369P7340L870Q3580O1602k2919k9043
19067D21154p109N018L7851J09246P2701M3102j164M7650q0930r2311j73350p2500
19055C09358K5187j30j3745M7101M6685j4611M0821J0893o3627l9576n975j9986
19043C22395p4623m4558P2363P5379N4393K5600P711k2173M356q0888j27414n0801
19031A61740K7257n9488o8442L7637Q924L190M8831M2804k6587Q8169J7023k7040
$$ plain form
19019 254018 195022 180097 173363 242296 282147 258503 276536 285792 296972 332585 397910 467066
19007 467066 594310 687708 751564 759625 703183 490211 347748 323832 320574 215237 167580
18996 167580 193556 189487 106086 49190 69961 94797 51905 42183 84695 94871 83287 118015
18984 118015 78431 60413 110302 83245 51427 12310 1405 42089 46449 35901 80891 48424
18972 48424 50960 37922 -41471 16777 15727 97103 156949 124000 54326 39439 45278 25755
18960 25755 23486 39408 25196 61820 65933 19315 22079 30461 10640 19850 56314 103730 127308
18947 127308 84868 36333 9424 15945 59513 128826 54434 4109 28848 98877 86530 129326
18935 129326 122219 85649 102070 60371 -15568 -1165 6660 44272 50046 673 -48766 3411
$$ packed form
19019B54018n8996j4925o734O8933L9851k3644J8033R256J1180L5613O5325O9156
19007D67066J27244R3398O3856Q061n6442k12972j42463k3916l258j05337m7657
18996A67580K5976m069q3401n6896K0771K4836m2892r722M2512J0176j1584L4728
18984A18015l9584j8018M9889k7057l1818l9117j0905M0684M360j0548M4990l2467
18972D8424K536j3038p9393N8248j050Q1376N9846l2949o9674j4887N839j9523
18960B5755k269J5922j4212L6624M113m6618K764Q382j9821R210L6464M7416K3578
18947A27308m2440m8535k6909O521M3568O9313p4392n0325K4739P0029j2347M2796
18935A29326p107l6570J6421m1699p5939J4403P825L7612N774m9373m9439N2177
$$ plain form
18923 3411 34555 48457 64912 60690 71506 89687 120178 133223 112515 53608 86131 97503
18911 97503 133184 106186 19559 -13860 -2383 3124 -44234 -21415 40784 90461 84812 77079
18899 77079 62412 61957 132474 181667 166789 115304 133935 124035 123111 103381 88854 90502 94422
18886 94422 90696 68528 79370 124421 118612 115355 142034 115897 49991 12746 15904 29253
18874 29253 9684 -5710 -8329 60961 97837 88105 128891 170172 151197 124189 49263 51009
18862 51009 88356 98503 67682 3593 24925 59070 43290 44539 13355 33555 66572 82939
18850 82939 72819 104308 83038 6504 -24282 -34898 48693 87296 57806 34245 62384 118659
18838 118659 125523 80870 71536 52346 68255 50331 19540 76542 95408 79121 73235 60912
$$ packed form
18923C411L1144J3902J6455m222J0816J8181L0491J3045k0708n8907L2523J1372
18911I7503L5681k6998q6627l3419J1477N507m7358K2819O2199M9677n649p733
18899G7079j4667m55P0517M9193j4878n1485J8631r900r24j9730j4527J648L920
18886I4422l726k2168J0842M5051n809l257K6679k6137o5906l7245L158J3349
18874B9253j9569j5394k619O9290L6876r732M0786M1281j8975k7008p4926J746
18862E1009L7347J0147l0821o4089K1332L4145j5780J249l1184K0200L3017J6367
18850H2939j0120L1489k1270p6534l0786j0616Q3591L8603k9490k3561K8139N6275
18838A18659O864m4653r334j9190J5909j7924l0791N7002J8866j6287n886j2323
$$ plain form
18826 60912 116551 91223 52669 61080 92015 91883 61471 39450 57714 43054 66665 58990
18814 58990 50076 64405 85706 105625 72517 26150 17809 46196 81992 66021 52590 49917
18802 49917 34636 45088 131859 166874 165915 71273 18321 21248 57562 72036 35845 44334
18790 44334 57901 25851 9282 -4393 -38199 -37633 -20045 -27708 6603 28064 63807 77902
18778 77902 97892 103936 107412 165030 165535 229848 292993 369108 465133 554124 607367 631482
18766 631482 585775 427244 335129 279536 241210 222841 164717 130472 118748 103938 92432
18755 92432 127580 114109 130201 148301 123220 75234 71796 61420 104500 81204 141855 144367
18743 144367 161504 146176 134592 119365 148993 194714 220936 228934 276069 277188 212084 169662
$$ packed form
18826F0912N5639k5328l8554Q411L0935j32l0412k2021J8264j4660K3611p675
18814E8990q914J4329K1301J9919l3108m6367q341K8387L5796j5971j3431k673
18802D9917j5281J0452Q6771L5015r59r4642n2952K927L6314J4474l6191Q489
18790D4334J3567l2050j6569j3675l3806N66J7588p663L4311K1461L5743J4095
18778G7902J9990O044L476N7618N05O4313O3145P6115R6025Q8991N3243K4115
18766F31482m5707j58531r2115n5593l8326j8369n8124l4245j1724j4810j1506
18755I2432L5148j3471J6092J8100k5081m7986l438j0376M3080k3296O0651K512
18743A44367J7137j5328j1584j5227K9628M5721K6222P998M7135J119o5104m2422
$$ plain form
18731 169662 101911 28856 25173 136123 167289 190745 206491 132782 143120 186010 181613 167018
18719 167018 195632 161473 117123 105890 99948 69888 86766 133782 157159 181813 191207 195456
18707 195456 205048 133847 85250 56674 41945 40311 59010 27352 14146 84489 138693 108436
18695 108436 34503 45292 116944 170136 192620 225153 159012 117988 140996 135728 189435 188865
18683 188865 219176 245614 295495 301871 269022 235078 267371 291404 260519 189446 153213 108792
18671 108792 99678 81270 64792 44598 55714 126401 113768 111492 153110 122523 24433 -52323
18659 -52323 -10542 32021 53122 118639 128178 89843 62870 62887 107430 129371 96683 154307
18647 154307 220497 229201 163195 134418 98912 84600 116015 116987 64033 -45319 -94990 -122921
$$ packed form
18731A69662o7751p3055l683J10950L1166K3456J5746p3709J0338M2890m397j4595
18719A67018K8614l4159m4350j1233n942l0060J6878M7016K3377K4654R394M249
18707A95456R592p1201m8597k8576j4729j634J8699l1658j3206P0343N4204l0257
18695A08436p3933J0789P1652N3192K2484L2533o6141m1024K3008n268N3707n70
18683A88865L0311K6438M9881O376l2849l3944L2293K4033l0885p1073l6233m4421
18671A08792r114j8408j6478k0194J1116P0687j2633k276M1618l0587r8090p6756
18659e2323M1781M2563K1101O5517R539l8335k6973J7M4543K1941l2688N7624
18647A54307O6190Q704o6006k8777l5506j4312L1415R72n2954j09352m9671k7931
$$ plain form
18635 -122921 -86890 -33890 -4995 -13207 -7269 -21276 -40190 -34747 49613 97031 103818 96479
18623 96479 55156 85445 54602 96090 108542 60436 77003 106632 154399 138276 144862 161992
18611 161992 167857 160557 183522 137949 28351 -12003 70966 116943 113449 86519 67499 56546
18599 56546 109894 142094 144453 106993 51385 26181 56331 17016 -19981 31267 86746 75709
18587 75709 76691 43618 51909 133609 157209 135692 142212 183703 216250 181029 205261 197911 183916
18574 183916 161276 196067 150087 200133 248017 205285 130823 113415 148669 193594 155129
18563 155129 72148 20970 64917 61452 41898 51715 25559 2347 -32650 29833 173624 225646
18551 225646 196301 168804 128656 153965 93570 83919 67439 76312 96635 141056 214112 173935
$$ packed form
18635a22921L6031N3000K8895q212N938j4007j8914N443Q4360M7418O787p339
18623I6479m1323L0289l0843M1488J2452m8106J6567K9629M7767j6123O586J7130
18611A61992N865p300K2965m5573j09598m0354Q2969M5977l494k6930j9020j0953
18599E6546N3348L2200K359l7460n5608k5204L0150l9315l6997N1248N5479j1037
18587G5709R82l3073Q291Q1700K3600k1517O520M1491L2547l5221K4232p350j3995
18574A83916k2640L4791m5980N0046M7884m2732p4462j7408L5254M4925l8465
18563A55129q2981n1178M3947l465j9554R817k6156k3212l4997O2483J43791N2022
18551B25646k9345k7497m0148K5309o0395r651j6480Q873K0323M4421P3056m0177
$$ plain form
18539 173935 183301 239428 279730 320324 346039 306145 254040 265861 231208 138666 92216 119131
18527 119131 163050 167681 134645 169280 190728 237645 241554 227413 194817 171323 206514 274981
18515 274981 323936 291150 210567 200032 227383 289981 375482 434494 469721 441825 412963
18504 412963 417172 387190 353464 330081 303863 288326 283128 235505 230743 255381 168604 184947
18492 184947 247838 316564 349071 354930 389785 327904 299329 267395 267600 326179 371943 409428
18480 409428 496922 538901 560706 619374 624624 584111 520375 434707 349222 348313 308586 289382
18468 289382 282341 279784 277317 279390 196339 217149 312477 361324 363952 323160 354178 368896
18456 368896 342475 288485 389531 438149 477804 567048 596470 563091 627417 659118 707633
$$ packed form
18539A73935R366N6127M0302M0594K5715l9894n2105J1821l4653r2542m6450K6915
18527A19131M3919M631l3036L4635K1448M6917L909j4141l2596k3494L5191O8467
18515B74981M8955l2786q0583j0535K7351O2598Q5501N9012L5227k7896k8862
18504D12963M209k9982l3726k3383k6218j5537n198m7623m762K4638q6777J6343
18492A84947O2891O8726L2507N859L4855o1881k8575l1934K05N8579M5764L7485
18480D09428Q7494M1979K1805N8668N250m0513o3736q5668q5485r09l9727j9204
18468B89382p041k557k467K073q3051K0810R5328M8847K628m0792L1018J4718
18456C68896k6421n3990J01046M8618L9655Q9244K9422l3379O4326L1701M8515
$$ plain form
18445 707633 709009 598566 472016 326708 229375 189709 232080 252749 241437 225840 200270
18434 200270 193037 221726 223191 238486 200312 238230 263854 307609 346351 362048 378952 353286
18422 353286 281690 251342 237955 224858 286199 239358 160877 130355 184432 175803 144528 169050
18410 169050 242293 283702 268547 205207 168511 184356 222966 184365 167786 170259 178047 169382
18398 169382 198738 263796 313441 352763 386998 365281 308826 274171 273478 296488 277159 234290
18386 234290 178486 134446 97744 91841 129464 148972 150053 117812 102043 118907 163332 130361
18374 130361 160444 142088 133815 124833 179054 247571 250749 253356 249348 207755 217377 282660 335776
18361 335776 327999 340544 294706 255505 235148 202066 120973 148123 212405 201853 164787 194466
$$ packed form
18445G07633J376j10443j26550j45308r7333l9666M2371K0669j1312j5597k5570
18434B00270p233K8689J465J5295l8174L7918K5624M3755L8742J5697J6904k5666
18422C53286p1596l0348j3387j3097O1341m6841p8481l0522N4077q629l1275K4522
18410A69050P3243M1409j5155o3340l6696J5845L8610l8601j6579K473P788q665
18398A69382K9356O5058M9645L9322L4235k1717n6455l4655o93K3010j9329m2869
18386B34290n5804m4040l6702n903L7623J9508J081l2241j5769J6864M4425l2971
18374A30361L0083j8356q273q982N4221O8517L178K607m008m1593R622O5283N3116
18361C35776p777J2545m5838l9201k0357l3082q1093K7150O4282j0552l7066K9679
$$ plain form
18349 194466 195888 223164 238086 230291 222278 204907 173480 119488 162399 199352 200043 244348
18337 244348 243101 246763 244194 167007 128072 179018 230716 239786 197174 176220 186409 166866
18325 166866 202071 164184 149108 172362 208790 234764 232966 217411 192251 178773 223018 165498
18313 165498 105861 69251 95542 155971 220795 227036 209011 171388 137324 104685 131576 130736
18301 130736 112834 123237 165080 171588 195714 188618 181252 127878 80729 37661 52444 110542
18289 110542 145135 154351 179112 164617 189145 216483 234790 247073 215320 185987 166686 149130
18277 149130 179205 132605 62621 92844 181843 203085 131577 143532 138962 144860 204063 217589
18265 217589 175022 176553 179152 177531 233088 184549 160619 158393 203890 251630 267212 247696
$$ packed form
18349A94466J422K7276J4922p795q013j7371l1427n3992M2911L6953O91M4305
18337B44348j247L662k569p7187l8935N0946N1698R070m2612k0954J0189j9543
18325A66866L5205l7887j5076K3254L6428K5974j798j5555k5160j3478M4245n7520
18313A65498n9637l6610K6291O0429O4824O241j8025l7623l4064l2639K6891q40
18301A30736j7902J0403M1843O508K4126p096p366n3374m7149m3068J4783N8098
18289A10542L4593R216K4761j4495K4528K7338J8307J2283l1753k9333j9301j7556
18277A49130L0075m6600o9984L0223Q8999K1242p1508J1955m570N898N9203J3526
18265B17589m2567J531K599j621N5557m8539k3930k226M5497M7740J5582j9516
$$ plain form
18253 247696 228581 234394 210369 219803 255601 281092 285283 311096 288924 267654 254208 213732
18241 213732 203471 219773 228859 246124 243077 199494 273806 335349 330510 354852 334410 295471
18229 295471 283875 315764 310943 325392 297177 268516 222186 192189 201506 180890 187247 258932
18217 258932 277353 275205 265640 257494 234275 199255 255476 265238 326773 382230 400125 403752
18205 403752 394154 418838 439449 391083 347879 370587 350210 365133 390706 379338 361679 318204
18193 318204 305727 392288 404263 397256 388391 385437 397637 397304 278207 208682 271012 257586
18181 257586 290716 337103 367726 408284 419032 403821 414156 411161 426935 438174 418952 392054
18169 392054 402933 438598 517792 519656 526687 547729 496687 455208 486830 486398 460821 432993
$$ packed form
18253B47696j9115N813k4025R434L5798K5491M191K5813k2172k1270j3446m0476
18241B13732j0261J6302R086J7265l047m3583P4312O1543m839K4342k0442l8939
18229B95471j1596L1889m821J4449k8215k8661m6330k9997R317k0616O357P1685
18217B58932J8421k148r565q146k3219l5020N6221R762O1535N5457J7895L627
18205D03752r598K4684K0611m8366m3204K2708k0377J4923K5573j1368j7659m3475
18193C18204j2477Q6561J1975p007q865k954J2200l33j19097o9525O2330j3426
18181B57586L3130M6387L0623M0558J0748j5211J0335k995J5774J1239j9222k6898
18169C92054J0879L5665P9194J864P031K1042n1042m1479L1622m32k5577k7828
$$ plain form
18157 432993 461722 543096 600389 553422 500923 509924 576423 611037 654988 760596 713884
18146 713884 655660 636390 618498 657659 703337 676329 712988 732580 741811 741744 772558 756239
18134 756239 763178 775925 797914 804918 869514 1060311 1201382 1318489 1462439 1598404 1818556
18123 1818556 2126518 2486500 2862255 3384403 4131881 5163132 6571017 8842169 12630642
18114 12630642 19034358 29926782 46549908 64638530 76232475 81006741 79966982
18107 79966982 61345003 37319066 23111395 15853329 11806259 9308593 7699418 6693616
18099 6693616 6023619 5663131 5432794 5157740 4809856 4425456 4022121 3647851 3360297
18090 3360297 3154758 2921845 2688740 2569592 2429294 2252221 2090150 2008059 1908785 1799422
$$ packed form
18157D32993K8729Q1374N7293m6967n2499R001O6499L4614M3951J05608m6712
18146G13884n8224j9270j7892L9161M5678k7008L6659J9592R231o7L0814j6319
18134G56239O939J2747K1989P004O4596J90797J41071J17107J43950J35965K20152
18123A818556L07962L59982L75755N22148P47478J031251J407885K271152L788473
18114A2630642O403716J0892424J6623126J8088622J1593945M774266j039759
18107G9966982j8621979k4025937j4207671p258066m047070k497666j609175j005802
18099F693616o69997l60488k30337k75054l47884l84400m03335l74270k87554
18090C360297k05539k32913k33105j19148j40298j77073j62071q2091r9274j09363
$$ plain form
18080 1799422 1685641 1607084 1563914 1593930 1667059 1736446 1848622 2088377 2440303 2898922
18070 2898922 3302760 3539373 3573290 3439261 3048993 2628603 2269963 2006330 1910514 1879511
18060 1879511 1866222 1883484 2007100 2178278 2189782 2184068 2118487 2011334 1848001 1656104
18050 1656104 1561518 1480880 1342159 1258667 1325206 1326233 1304622 1362228 1377136 1262617 1231894
18039 1231894 1238273 1290798 1337211 1384745 1438808 1446655 1444307 1429732 1444753 1484707 1440693 1495562
18027 1495562 1753487 1990031 2183146 2327441 2450830 2579373 2775124 3194615 3811833
18018 3811833 4392686 4878173 5210847 5329073 5193180 4939058 4690346 4320770 3867982
18009 3867982 3327455 2780816 2353326 2080962 1936699 1928056 1909610 1908433 1873011 1773094 1717914
$$ packed form
18080A799422j13781p8557m3170L0016P3129O9387J12176K39755L51926M58619
18070B898922M03838K36613L3917j34029l90268m20390l58640k63633r5816l1003
18060A879511j3289J7262J23616J71178J1504n714o5581j07153j63333j91897
18050A656104r4586q0638j38721q3492O6539J027k1611N7606J4908j14519l0723
18039A231894O379N2525M6413M7534N4063P847k348j4575J5021L9954m4014N4869
18027A495562K57925K36544J93115J44295J23389J28543J95751M19491O17218
18018C811833N80853M85487L32674J18226j35893k54122k48712l69576m52788
18009C867982n40527n46639m27490k72364j44263q643j8446j177l5422r9917n5180
$$ plain form
17998 1717914 1666384 1600341 1523233 1458343 1407428 1390454 1483701 1577368 1633252 1704840 1710601
17987 1710601 1619757 1631924 1576628 1555051 1526580 1540156 1623960 1731400 1755957 1846130 1976947
17976 1976947 2038465 2132912 2179306 2181876 2173305 2154048 2224287 2254895 2324324 2411668 2571880
17965 2571880 2680728 2827010 2959592 3181865 3445419 3606015 3598108 3396150 3100200 2697220
17955 2697220 2259134 1904798 1715908 1540720 1353622 1209311 1150391 1194012 1226526 1180875
17945 1180875 1212409 1241371 1316892 1334269 1339718 1314594 1265952 1215811 1191528 1157892 1116734
17934 1116734 1182481 1206502 1213883 1221413 1223753 1180784 1197386 1278309 1310024 1400951 1486048 1524579
17922 1524579 1446802 1312770 1202179 1132004 1133193 1197362 1284210 1467937 1743954 1983576
$$ packed form
17998A717914n1530o6043p7108o4890n0915j6974R3247R3667N5884P1588N761
17987A710601r0844J2167n5296k1577k8471J3576Q3804J07440K4557R0173J30817
17976A976947O1518R4447M6394K570q571j9257P0239L0608O9429Q7344J60212
17965B571880J08848J46282J32582K22273K63554J60596p907k01958k95950m02980
17955B697220m38086l54336j88890j75188j87098j44311n8920M3621L2514m5651
17945A180875L1534K8962P5521J7377N449k5124m8642n0141k4283l3636m1158
17934A116734O5747K4021P381P530K340m2969J6602Q0923L1715R0927Q5097L8531
17922A524579p7777j34032j10591p0175J189O4169Q6848J83727K76017K39622
$$ plain form
17912 1983576 2194319 2354331 2329570 2220388 2082927 1794568 1468897 1267296 1100283 1030476
17902 1030476 1007049 977940 951598 901303 853817 829561 828558 767308 784993 780355 805613 864570
17890 864570 949118 978762 897692 844512 864377 896125 835663 853309 870666 888028 875708
17879 875708 884907 921018 943163 972130 1110386 1190373 1258416 1402166 1594666 1713618 1772114
17868 1772114 1782790 1642215 1490688 1394423 1310770 1191815 1176462 1191694 1211568 1152114 1108872
17857 1108872 1113526 1079342 995172 949521 955477 900333 849653 892311 974542 1027806 1000651 942096
17845 942096 902367 866320 853710 889780 1027128 1114617 1171812 1168332 1197557 1181724 1192995
17834 1192995 1184759 1110721 1010239 976929 1044769 1040689 1040282 1026212 1068905 1115209 1138197 1154403
$$ packed form
17912A983576K10743J60012k4761j09182j37461k88359l25671k01601j67013o9807
17902A030476k3427k9109k6342n0295m7486k4256j003o1250J7685m638K5258N8957
17890H64570Q4548K9644q1070n3180J9865L1748o0462J7646J7357J7362j2320
17879H75708R199L6111K2145K8967J38256P9987O8043J43750J92500J18952N8496
17868A772114J0676j40575j51527r6265q3653j18955j5353J5232J9874n9454m3242
17857A108872M654l4184q4170m5651N956n5144n0680M2658Q2231N3264k7155n8555
17845I42096l9729l6047j2610L6070J37348Q7489N7195l480K9225j5833J1271
17834A192995q236p4038j00482l3310O7840m080m07j4070M2693M6304K2988J6206
$$ plain form
17822 1154403 1133641 1189047 1267333 1367744 1444084 1477512 1529788 1507813 1446681 1407709 1380674
17811 1380674 1352484 1335044 1347740 1417481 1591338 1685109 1660581 1638913 1600337 1484748 1325420
17800 1325420 1126819 1076525 1070359 1109727 1151755 1218220 1256310 1341626 1361687 1354851 1384538
17789 1384538 1379451 1377722 1426167 1414754 1392052 1364683 1339142 1266265 1298437 1285975 1276410 1305623
17777 1305623 1350320 1446035 1511478 1520115 1518723 1562000 1618354 1609423 1590649 1664483 1728413 1646135
17765 1646135 1539386 1564238 1603917 1669265 1711341 1739065 1686570 1648959 1628321 1641724 1712767
17754 1712767 1717897 1664819 1714452 1789840 1804682 1827185 1808527 1831967 1776632 1626433 1461270
17743 1461270 1383899 1366808 1371697 1368114 1447272 1487638 1496539 1496337 1474971 1476266 1494086 1498798 1513725
$$ packed form
17822A154403k0762N5406P8286J00411P6340L3428N2276k1975o1132l8972k7035
17811A380674k8190j7440J2696O9741J73857R3771k4528k1668l8576j15589j59328
17800A325420j98601n0294o166L9368M2028O6465L8090Q5316K0061o836K9687
17789A384538n087j729M8445j1413k2702k7369k5541p2877L2172j2462r565K9213
17777A305623M4697R5715O5443Q637j392M3277N6354q931j8774P3834O3930q2278
17765A646135j06749K4852L9679O5348M2076K7724n2495l7611k0638J3403P1043
17754A712767N130n3078M9633P5388J4842K2503j8658K3440n5335j50199j65163
17743A461270p7371j7091M889l583P9158M0366Q901k02k1366J295J7820M712J4927
$$ plain form
17730 1513725 1549911 1591128 1619152 1726999 1828888 1960005 2139890 2204819 2237773 2252471
17720 2252471 2138055 1930552 1771063 1722676 1724362 1737473 1764001 1802484 1741360 1663240 1596206
17709 1596206 1501224 1408249 1285538 1246578 1228447 1231239 1279612 1296988 1317400 1316745 1423647
17698 1423647 1481068 1526607 1591475 1568006 1475279 1402466 1368658 1309043 1214063 1154305 1162311
17687 1162311 1199311 1266816 1335577 1412997 1486787 1543905 1503813 1380837 1316240 1309747 1349432
17676 1349432 1379335 1385889 1405721 1418416 1443378 1502508 1646654 1826982 1975671 2061339 2119192
17665 2119192 2039853 1981863 1891362 1784080 1726217 1719605 1663023 1644092 1637481 1648466 1629145
17654 1629145 1563263 1585937 1589124 1565593 1486647 1420680 1371477 1359466 1378397 1480267 1528609
$$ packed form
17730A513725L6186M1217K8024J07847J01889J31117J79885O4929L2954J4698
17720B252471j14416k07503j59489m8387J686J3111K6528L8483o1124p8120o7034
17709A596206r4982r2975j22711l8960j8131K792M8373J7376K0412o55J06902
17698A423647N7421M5539O4868k3469r2727p2813l3808n9615r4980n9758Q006
17687A162311L7000O7505O8761P7420P3790N7118m0092j22976o4597o493L9685
17676A349432K9903O554J9832J2695K4962N9130J44146J80328J48689Q5668N7853
17665B119192p9339n7990r0501j07282n7863o612n6582j8931o611J0985j9321
17654A629145o5882K2674L187k3531p8946o5967m9203j2011J8931J01870M8342
$$ plain form
17643 1528609 1473970 1407912 1334804 1273645 1241030 1235831 1284028 1304811 1345633 1339961 1313783 1347356
17631 1347356 1363870 1312636 1284065 1303091 1290853 1347205 1446375 1523307 1550459 1527128 1540457
17620 1540457 1566015 1612786 1659786 1687756 1680418 1516585 1479148 1451357 1440097 1425722 1440989
17609 1440989 1478512 1561125 1646960 1698371 1814331 1927901 2015011 2088355 2098045 2118975 2139223
17598 2139223 2123009 2072669 2177797 2211913 2197478 2283696 2381368 2385332 2288091 2218438 2192061
17587 2192061 2082903 1964764 1927720 1994171 2032499 2045636 2086632 2111961 2214856 2333400
17577 2333400 2435891 2573396 2674883 2772966 2861026 2838817 2799726 2817744 2761154 2683871 2725429
17566 2725429 2839684 2973312 3145208 3265689 3315047 3324417 3342959 3447222 3637040 3920245
$$ packed form
17643A528609n4639o6058p3108o1159l2615n199M8197K0783M0822n672k6178L3573
17631A347356J6514n1234k8571J9026j2238N6352R9170P6932K7152k3331J3329
17620A540457K5558M6771M7000K7970p338j63833l7437k7791j1260j4375J5267
17609A440989L7523Q2613Q5835N1411J15960J13570Q7110P3344R690K0930K0248
17598B139223j6214n0340J05128L4116j4435Q6218R7672L964r7241o9653k6377
17587B192061j09158j18139l7044O6451L8328J3137M0996K5329J02895J18544
17577B333400J02491J37505J01487R8083Q8060k2209l9091J8018n6590p7283M1558
17566B725429J14255J33628J71896J20481M9358R370J8542J04263J89818K83205
$$ plain form
17556 3920245 4383406 5099363 6114592 7652202 9690341 11932331 13730684 14624237 14793129
17547 14793129 13540596 11232289 9587821 8789149 8560841 8606907 8944822 9397556 9891739
17538 9891739 10538415 11438588 12789515 14872144 18038952 22928892 30694160 43358754
17530 43358754 63556934 91556107 120857153 144070681 160711846 162304735 138467254
17523 138467254 110666081 85607126 61737952 45845506 37181399 32927883 31719618
17516 31719618 33390251 38285443 45940592 53730558 58504333 59744814 56719765 46731753
17508 46731753 35036121 27049022 22344740 19573888 17883122 16920152 16655005 16990215
17500 16990215 17872512 19242189 21095899 23091044 24670999 25561899 25890530 24970198 23406944
$$ packed form
17556C920245M63161P15957J015229J537610K038139K241990J798353Q93553J68892
17547A4793129j252533k308307j644468p98672k28308M6066L37915M52734M94183
17538I891739O46676R00173J350927K082629L166808M889940P765268J2664594
17530D3358754K0198180K7999173K9301046K3213528J6641165J592889k3837481
17523A38467254k7801173k5058955k3869174j5892446q664107m253516j208265
17516C1719618J670633M895192P655149P789966M773775J240481l025049r988012
17508D6731753j1695632p987099m704282k770852j690766r62970k65147L35210
17500A6990215Q82297J369677J853710J995145J579955Q90900L28631r20332j563254
$$ plain form
17491 23406944 23310468 25380274 29945517 37610350 48322316 59414208 67349854 71559082
17483 71559082 71530055 64147127 55104830 51408699 53906053 62631679 79538487 108039329
17475 108039329 150146213 201579315 255647465 308763823 345908270 347822599 322500928
17468 322500928 280072421 223063200 158143857 110634112 83998570 70197121 64360412
17461 64360412 64454477 68788824 74200538 77203530 77157083 72929349 61897989 49448798
17453 49448798 40881651 36135171 33981671 33900745 35406106 37119706 37961019 37936376 35963608
17444 35963608 31365735 26987653 24193586 22391854 21188688 20489166 20615287 21695592
17436 21695592 24168716 28661817 36036351 46243872 56665404 63771653 66835047 65086724
$$ packed form
17491B3406944r6476K069806M565243P664833J0711966J1091892P935646M209228
17483G1559082k9027p382928r042297l696131K497354Q725626J6906808K8500842
17475A08039329M2106884N1433102N4068150N3116358L7144447J914329k5321671
17468C22500928m2428507n7009221o4919343m7509745k6635542j3801449n836709
17461F4360412R4065M334347N411714L002992m6447m227734j1031360j2449191
17453D9448798q567147m746480k153500q0926J505361J713600Q41313k4643j972768
17444C5963608m597873m378082k794067j801732j203166o99522J26121J080305
17436B1695592K473124M493101P374534J0207521J0421532P106249L063394j748323
$$ plain form
17428 65086724 55558941 44129490 37240723 34773687 35700058 39939262 48331160 62983022
17420 62983022 86333511 118575221 156204757 193215208 219048530 219926306 201068119
17413 201068119 166077639 115959710 76794430 54341456 41711399 34027688 29040186
17406 29040186 25702141 23461954 22021233 21065696 20185692 19213905 18355959 17866429 17928200
17397 17928200 18833531 20856493 23593449 25880256 26901186 26768843 24332960 19347471
17389 19347471 15076526 12397462 10586830 9274316 8256470 7493468 6947560 6470751
17381 6470751 6141282 5821230 5506968 5236708 5029573 4846893 4618629 4422187 4168252
17372 4168252 3952021 3705511 3536581 3379229 3309913 3217803 3167346 3167376 3121649 3092898 3056226
$$ packed form
17428F5086724r527783j1429451o888767k467036R26371M239204Q391898J4651862
17420F2983022K3350489L2241710L7629536L7010451K5833322Q77776j8858187
17413B01068119l4990480n0117929l9165280k2452974j2630057p683711m987502
17406B9040186l338045k240187j440721r55537q80004r71787q57946m89530O1771
17397A7928200R05331K022962K736956K286807J020930j32343k435883m985489
17389A9347471m270945k679064j810632j312514j017846p63002n45908m76809
17381F470751l29469l20052l14262k70260k07135j82680k28264j96442k53935
17372D168252k16231k46510j68930j57352o9316r2110n0457L0m5727k8751l6672
$$ plain form
17361 3056226 3021339 2957066 2841276 2646991 2478428 2308035 2195818 2166924 2137780 2078402
17351 2078402 2050766 2048535 2085749 2081330 2072243 2118927 2124369 2118926 2028618 1919873 1848711 1836303
17339 1836303 1843037 1873182 1885910 1816909 1799337 1769694 1714400 1673273 1646144 1555379 1518572
17328 1518572 1448296 1394308 1352370 1311911 1261143 1256947 1298505 1284816 1264725 1290321 1260425
17317 1260425 1186441 1140469 1111766 1092452 1069458 1026356 987387 1015026 1087884 1155362 1124173
17306 1124173 1158942 1163738 1186587 1136684 1128460 1143943 1026001 999876 977430 984475 1041931 1055192
17294 1055192 1105144 1168328 1191748 1125769 1068626 1074509 1095415 1047215 960939 964885 908126 874278
17282 874278 933386 996834 1044609 1069648 1119857 1141236 1072335 1024049 1031847 957700 909500 925148
$$ packed form
17361C056226l4887o4273j15790j94285j68563j70393j12217k8894k9144n9378
17351B078402k7636k231L7214m419r087M6684N442n443r0308j08745p1162j2408
17339A836303O734L0145J2728o9001j7572k9643n5294m1127k7129r0765l6807
17328A518572p0276n3988m1938m0459n0768m196M1558j3689k0091K5596k9896
17317A260425p3984m5972k8703j9314k2994m3102l8969K7639P2858O7478l1189
17306A124173L4769M796K2849m9903q224J5483j17942k6125k2446P045N7456J3261
17294A055192M9952O3184K3420o5979n7143N883K0906m8200q6276L946n6759l3848
17282H74278N9108O3448M7775K5039N0209K1379o8901m8286P798p4147m8200J5648
$$ plain form
17270 925148 856920 885882 945864 974613 1033437 1058278 1086834 1152372 1181004 1169103 1112920
17259 1112920 1083375 1040148 1029286 999333 1019992 1004770 946797 958058 967614 1033226 1007991
17248 1007991 937409 907983 909313 918259 936583 931098 983812 1082796 1154767 1198778 1226775 1220635
17236 1220635 1222145 1200969 1225903 1317678 1280781 1232027 1231674 1282816 1346116 1348894 1394399 1442003
17224 1442003 1444444 1389228 1335635 1370049 1361726 1340697 1372671 1365202 1337659 1375161 1439316 1540836
17212 1540836 1599032 1620648 1586385 1551712 1569793 1574366 1634167 1651517 1680050 1631504 1652031
17201 1652031 1718678 1752437 1762474 1757876 1796770 1828613 1848725 1964451 2082338 2113260 2095482
17190 2095482 2085711 2114277 2171198 2193149 2182910 2229887 2297252 2353259 2437077 2538906 2609534
$$ packed form
17270I25148o8228K8962N9982K8749N8824K4841K8556O5538K8632j1901n6183
17259A112920k9545m3227j0862k9953K0659j5222n7973J1261R556O5612k5235
17248A007991p0582k9426J330Q946J8324n485N2714R8984P1971M4011K7997o140
17236A220635J510k1176K4934R1775l6897m8754l53N1142O3300K778M5505M7604
17224A442003K441n5216n3593L4414q323k1029L1974p469k7543L7502O4155J01520
17212A540836N8196K1616l4263l4673J8081M573N9801J7350K8533m8546K0527
17201A652031O6647L3759J0037m598L8894L1843K0112J15726J17887L0922j7778
17190B095482r771K8566N6921K1951j0239M6977O7365N6007Q3818J01829P0628
$$ plain form
17179 2609534 2688107 2848548 3043453 3247730 3429237 3603054 3976113 4424940 4789624 5228748
17169 5228748 5718565 6056705 6219520 6487855 6988750 7851616 9433299 11990612 15507114
17160 15507114 19024397 21330616 22423674 21875275 18506597 14654361 12442254 11479544
17152 11479544 11302097 11502441 12043502 12991070 14310997 16110435 18490104 21819159 26578460
17143 26578460 33522666 43823322 59844790 84902462 120283700 160118467 193893562
17136 193893562 217543598 224039820 199483619 162797482 128258405 98062566 78545006
17129 78545006 67134987 58808407 52046545 49324449 51419731 57641245 66089983 73225422
17121 73225422 76549768 76297068 70225523 58807127 49946129 46527334 47747616 53304776
$$ packed form
17179B609534P8573J60441J94905K04277J81507J73817L73059M48827L64684M39124
17169E228748M89817L38140J62815K68335N00895Q62866J581683K557313L516502
17160A5507114L517283K306219J093058n48399l368678l852236k212107r62710
17152A1479544j77447K00344N41061R47568J319927J799438K379669L329055M759301
17143B6578460O944206J0300656J6021468K5057672L5381238L9834767L3775095
17136A93893562K3650036O496222k4556201l6686137l4539077l0195839j9517560
17129G8545006j1410019q326580o761862k722096K095282O221514Q448738P135439
17121G3225422L324346k52700o071545j1418396q860998l418795J220282N557160
$$ plain form
17113 53304776 64281532 83358847 113389214 152040468 189132807 216603890 231637038
17106 231637038 219184953 180919088 141434644 104649819 78238631 63790699 57153557
17099 57153557 56073027 60170361 69859791 84476368 100422278 112923445 118921280 115589904
17091 115589904 102087146 82738808 65716830 56135032 53176681 55678038 64109862
17084 64109862 79177228 100230154 124606935 150050571 169646079 170802819 158937277
17077 158937277 139288551 104850815 73673405 55295331 45431174 40386049 38670348
17070 38670348 39947212 44506412 51903172 59786446 65018452 66910692 64988561 56761550
17062 56761550 47000969 41467261 40476270 43101164 48848686 57898718 71740574 90641669
$$ packed form
17113E3304776J0976756J9077315L0030367L8651254L7092339K7471083J5033148
17106B31637038j2452085l8265865l9484444l6784825k6411188j4447932o637142
17099E7153557j080530M097334R689430J4616577J5945910J2501167N997835l331376
17091A15589904j3502758j9348338j7021978r581798k958351K501357Q431824
17084F4109862J5067366K1052926K4376781K5443636J9595508J156740j1865542
17077A58937277j9648726l4437736l1177410j8378074r864157n045125j715701
17070C8670348J276864M559200P396760P883274N232006J892240j922131q227011
17062E6761550r760581n533708r90991K624894N747522R050032J3841856J8901095
$$ plain form
17054 90641669 112081711 134481494 156056558 165297952 156737619 141413792 113460986
17047 113460986 78057218 53440642 39332395 30937561 25553423 21996266 19593686
17040 19593686 17917617 16824515 15896085 14901534 13938671 13113241 12494398 12338789 12729582
17031 12729582 13695520 15067823 16194987 16634379 16278242 14781845 11957035 9529119
17023 9529119 8129396 7347103 6825516 6569901 6336579 5970392 5603059 5388732 5147499
17014 5147499 4801704 4457114 4119183 3767654 3496137 3333038 3227888 3114382 3017546 3017053
17004 3017053 2936198 2825592 2727815 2652895 2575529 2532402 2495863 2464826 2457419 2385423 2236326
16993 2236326 2049885 1871079 1780410 1689381 1600676 1503491 1443013 1376652 1276522 1160876
$$ packed form
17054I0641669K1440042K2399783K1575064R241394q560333j5323827k7952806
17047A13460986l5403768k4616576j4108247q394834n384138l557157k402580
17040A9593686j676069j093102r28430r94551r62863q25430o18843j55609L90793
17031A2729582R65938J372303J127164M39392l56137j496397k824810k427916
17023I529119j399723p82293n21587k55615k33322l66187l67333k14327k41233
17014E147499l45795l44590l37931l51529k71517j63099j05150j13506r6836m93
17004C017053q0855j10606r7777p4920p7366m3127l6539l1037p407p1996j49097
16993B236326j86441j78806r0669r1029q8705r7185o0478o6361j00130j15646
$$ plain form
16983 1160876 1086056 1046391 995522 941036 959230 938459 893507 868467 867171 894826 871370
16972 871370 860457 851547 902225 1039267 1143293 1096892 1078076 1025026 957582 991334 1010621
16961 1010621 1058929 1115719 1087971 907188 798911 842281 896724 918821 912914 977241 1002919
16950 1002919 950544 871032 823961 820562 809144 835213 855069 823507 816016 845678 802715 727217
16938 727217 652857 618926 585642 587402 513966 435996 440028 437914 376427 299342 226208 135077
16926 135077 134266 136190 67668 23840 26450 25237 57258 95795 111999 205761 194926 162241
16914 162241 200117 200966 189438 135197 115318 69242 43690 57010 63111 145845 137920 124068
16902 124068 145035 141186 119383 121362 90356 29015 69013 56093 66030 94732 124297 85697
$$ packed form
16983A160876p4820l9665n0869n4486J8194k0771m4952k5040j296K7655k3456
16972H71370j0913q910N0678J37042J04026m6401j8816n3050o7444L3752J9287
16961A010621M8308N6790k7748j80783j08277M3370N4443K2097n907O4327K5678
16950A002919n2375p9512m7071l399j1418K6069J9856l1562p491K9662m2963p5498
16938G27217p4360l3931l3284J760p3436p7970M032k114o1487p7085p3134r1131
16926A35077q11J924o8522m3828K610j213L2021L8537J6204R3762j0835l2685
16914A62241L7876Q49j1528n4241j9879m6076k5552J3320O101Q2734p925j3852
16902A24068K0967l849k1803J979l1006o1341L9998j2920R937K8702K9565l8600
$$ plain form
16890 85697 61431 73429 79216 69728 104946 146432 157302 198121 148236 34911 -15108 -36959
16878 -36959 -14799 7047 6200 13426 14345 24430 -46159 -62153 -38124 -144584 -229836 -235130 -183415
16865 -183415 -144118 -163226 -168777 -188899 -176929 -178675 -176834 -138676 -104580 -108006 -101115 -29244
16853 -29244 28548 -36423 -38873 -53946 -56626 -57014 -112326 -100480 -125866 -160490 -132406 -71909
16841 -71909 -95796 -39993 7305 54985 93416 80606 16267 63191 106699 117214 112971 78650
16829 78650 42817 -4532 -3191 -859 -12478 -62404 -74191 -39288 35782 2208 -17241 5757
16817 5757 51443 -11453 -71760 -75834 -90258 -25731 -19466 -8786 -27033 -113433 -179276 -161069
16805 -161069 -113497 -20694 14847 -33969 -37947 -49405 -65194 -35149 -37601 -74797 -93592 -172863
$$ packed form
16890H5697k4266J1998N787r488L5218M1486J0870M0819m9885j13325n0019k1851
16878c6959K2160K1846q47P226R19J0085p0589j5994K4029j06460q5252n294N1715
16865a83415L9297j9108n551k0122J1970j746J841L8158L4096l426O891P1871
16853b9244N7792o4971k450j5073k680l88n5312J1846k5386l4624K8084O0497
16841g1909k3887N5803M7298M7680L8431j2810o4339M6924M3508J0515m243l4321
16829G8650l5833m7349J341K332j1619m9926j1787L4903P5070l3574j9449K2998
16817E757M5686o2896o0307m074j4424O4527O265J0680j8247q6400o5843J8207
16805a61069M7572R2803L5541m8816l978j1458j5789L0045k452l7196j8795p9271
$$ plain form
16793 -172863 -227680 -280694 -240078 -179597 -153753 -125425 -111551 -76195 -94123 -106916 -144268
16782 -144268 -206501 -219630 -210050 -150181 -114657 -110609 -115379 -107648 -135904 -165314 -150997 -102253
16770 -102253 -95981 -105064 -64120 -97346 -129478 -186630 -198800 -157546 -199165 -160896 -139378 -112344
16758 -112344 -126650 -110648 -81041 -39213 46931 79715 46526 -58142 -92928 -102505 -105304 -127914
16746 -127914 -117903 -98758 -63615 -43087 -10695 28880 57612 49450 -21096 -30676 -32727 -97549
16734 -97549 -137977 -148413 -122218 -125903 -117531 -118984 -111601 -105597 -121575 -94127 -78103 -81891 -100861
16721 -100861 -105890 -130956 -129839 -138183 -168915 -145603 -97247 -77321 -45161 -28525 -58710 -164386
16709 -164386 -176133 -146301 -116613 -117358 -124000 -107962 -94808 -89070 -137657 -170740 -135864 -114021
$$ packed form
16793a72863n4817n3014M0616O0481K5844K8328J3874L5356j7928j2793l7352
16782a44268o2233j3129R580N9869L5524M048m770P731k8256k9410J4317M8744
16770a02253O272r083M0944l3226l2132n7152j2170M1254m1619L8269K1518K7034
16758a12344j4306J6002K9607M1828Q6144L2784l3189j04668l4786r577k799k2610
16746a27914J0011J9145L5143K0528L2392L9575K8732q162p0546r580k051o4822
16734i7549m0428j0436K6195l685Q372j453P383O004j5978K7448J6024l788j8970
16721a00861n029k5066J117q344l0732K3312M8356J9926L2160J6636l0185j05676
16709a64386j1747K9832K9688p45o642J6038J3154N738m8587l3083L4876K1843
$$ plain form
16697 -114021 -96406 -120459 -135589 -149179 -180293 -162196 -123726 -86326 -54116 -46361 -42983 -42663
16685 -42663 -42362 -45862 -27482 -26717 -39237 -45714 -105325 -111829 -17515 -8160 -30322 -44633 -40459
16672 -40459 -46183 -31540 -72691 -91529 -32855 -19082 -18743 -33365 -46334 3155 130564 166597
16660 166597 213352 373760 570059 664862 626194 591490 597627 653284 718281 601169 400508
16649 400508 306805 251075 234801 251252 337657 351630 374973 285264 171234 105064 158810
16638 158810 242595 348297 402213 390148 395079 379247 338180 287224 349486 360220 391456
16627 391456 390311 406901 379249 362796 324167 283937 237701 198549 235607 356725 414055
16616 414055 469765 542797 562774 499650 424816 405917 379434 387886 396751 384527 364525 354086
$$ packed form
16697a14021J7615k4053j5130j3590l1114J8097L8470L7400L2210P755L378L20
16685d2663L01l500J8380P65j2520o477n9611o504R4314R355k2162j4311M174
16672d0459n724J4643m1151j8838N8674J3773L39j4622j2969M9489J27409L6033
16660A66597M6755J60408J96299R4803l8668l4704O137N5657O4997j17112k00661
16649D00508r3703n5730j6274J6451Q6405J3973K3343q9709j14030o6170N3746
16638A58810Q3785J05702N3916j2065M931j5832m1067n0956O2262J0734L1236
16627C91456j145J6590k7652j6453l8629m0230m6236l9152L7058J21118N7330
16616D14055N5710P3032J9977o3124p4834j8899k6483Q452Q865j2224k0002j0439
$$ plain form
16604 354086 280380 219527 216920 232201 243979 320963 434923 486289 470485 456324 466765
16593 466765 401663 263109 224267 242450 283884 391877 372349 400108 445527 478827 488323
16582 488323 446235 434395 384423 284822 229793 234844 249177 213804 180531 183310 225619 230856
16570 230856 284304 376576 433968 501541 471131 457163 413293 293874 298555 304608 351475 421487
16558 421487 450915 369301 341006 381951 310475 233387 205764 184362 163925 115334 65053
16547 65053 45819 44493 83927 127713 101292 89085 180683 215590 197437 191290 157072 112120
16535 112120 94265 90797 105195 133209 134460 93847 46293 -30256 -13950 -36439 -62975 -39707
16523 -39707 -125933 -171403 -129919 -128468 -129536 -129063 -103376 -29469 -79135 -149648 -123700 -76025
$$ packed form
16604C54086p3706o0853k607J5281J1778P6984J13960N1366j5804j4161J0441
16593D66765o5102j38554l8842J8183M1434J07993j9528K7759M5419L3300R496
16582D88323m2088j1840m9972r9601n5029N051J4333l5373l3273K779M2309N237
16570B30856N3448R2272N7392O7573l0410j3968m3870j19419M681O053M6867P0012
16558D21487K9428q1614k8295M0945p1476p7088k7623k1402k0437m8591n0281
16547F5053j9234j326L9434M3786k6421j2207R1598L4907j8153o147l4218m4952
16535A12120j7855l468J4398K8014J251m0613m7554p6549J6306k2489k6536K3268
16523c9707q6226m5470M1484J451j068M73K5687P3907m9666p0513K5948M7675
$$ plain form
16511 -76025 -98740 -44854 -40013 -55660 -54806 -30684 -6209 -30543 -51750 -65865 -53444 -8541
16499 -8541 -30885 -12055 -67680 -87533 -134847 -109039 -85003 -84874 -111934 -120526 -162878 -165211 -184077
16486 -184077 -174551 -123619 -75322 -61304 -71425 -136658 -182783 -214134 -226912 -177379 -168661 -108845
16474 -108845 -35775 -48562 -80117 -114200 -139705 -153809 -116824 -88524 -89401 -103034 -87446 -130957
16462 -130957 -156852 -175482 -213753 -244430 -172149 -128101 -133758 -131898 -143607 -152932 -151914 -216543
16450 -216543 -247986 -193040 -199260 -160851 -151316 -124887 -123370 -116786 -96780 -112010 -125452 -137949
16438 -137949 -95158 -55761 -102577 -152586 -106318 -131445 -80593 -69304 -28634 -13499 -25810
16427 -25810 -60495 -91931 -129315 -141399 -177959 -208107 -233686 -172496 -82038 -84268 -66092 -49335
$$ packed form
16511g6025k2715N3886M841j5647Q54K4122K4475k4334k1207j4115J2421M4903
16499h541k2344J8830n5625j9853m7314K5808K4036J29k7060q592m2352k333j8866
16486a84077R526N0932M8297J4018j0121o5233m6125l1351j2778M9533Q718N9816
16474a08845P3070j2787l1555l4083k5505j4104L6985K8300q77j3633J5588m3511
16462a30957k5895j8630l8271l0677P2281M4048n657J860j1709r325J018o4629
16450b16543l1443N4946o220L8409R535K6429J517O584K0006j5230j3442j2497
16438a37949M2791L9397m6816n0009M6268k5127N0852J1289M0670J5135j2311
16427b5810l4685l1436l7384j2084l6560l0148k5579O1190R0458k230J8176J6757
$$ plain form
16415 -49335 -88701 -128249 -145244 -153796 -116865 -137753 -179258 -199689 -201418 -232752 -244315 -172008
16403 -172008 -99641 -93236 -140137 -153215 -120185 -122052 -128222 -90552 -120923 -206599 -214452 -198206
16391 -198206 -165710 -140462 -179034 -175982 -136814 -122602 -108972 -76303 -30800 -56565 -80288 -77588
16379 -77588 -35335 -38246 -92356 -30083 46793 -7680 -115481 -160403 -149558 -133087 -185862 -209337
16367 -209337 -225650 -183389 -112721 -117346 -93811 -99332 -137769 -213422 -230293 -159375 -113588 -103720
16355 -103720 -117995 -136047 -145174 -120380 -163204 -122986 -124986 -80509 -5118 -78392 -113153 -120875
16343 -120875 -96781 -121383 -131318 -52313 -65820 -82986 -37715 -17867 -41245 -74912 -95921 -133299
16331 -133299 -142145 -180708 -164628 -151142 -238225 -256437 -265595 -269176 -242768 -168781 -113692 -65288
$$ packed form
16415d9335l9366l9548j6995q552L6931k0888m1505k0431j729l1334j1563P2307
16403a72008P2367O405m6901j3078L3030j867o170L7670l0371q5676p853J6246
16391a98206L2496K5248l8572L052L9168J4212J3630L2669M5503k5765k3723K700
16379g7588M2253k911n4110O2273P6876n4473j07801m4922J0845J6471n2775k3475
16367b09337j6313M2261P0668m625K3535n521l8437p5653j6871P0918M5787R868
16355a03720j4275j8052r127K4794m2824M0218k000M4477P5391p3274l4761p722
16343a20875K4094k4602r935P9005j3507j7166M5271J9848k3378l3667k1009l7378
16331a33299q846l8563J6080J3486q7083j8212r158l581K6408P3987N5089M8404
$$ plain form
16319 -65288 -31474 -69343 -91507 -66984 -60411 -99698 -120062 -151158 -115804 -122780 -119355 -167660
16307 -167660 -161983 -120442 -85523 -157239 -194455 -189555 -139451 -135247 -109522 -71314 -72689 -103718
16295 -103718 -121957 -171019 -134148 -46508 1023 -15216 -56069 -51495 -66048 -110031 -154371 -177094
16283 -177094 -182381 -138727 -165484 -156609 -83148 -9788 -26408 -70066 -85525 -115689 -92527 -110927
16271 -110927 -114005 -70185 -147462 -174234 -209249 -210789 -174421 -172760 -136330 -93060 -98086 -129576
16259 -129576 -172421 -200963 -142729 -92244 -117139 -149854 -121641 -31617 12163 4234 -4263 -60011
16247 -60011 -128512 -160972 -148553 -118778 -163170 -166999 -140467 -135114 -126694 -129307 -87811 -38008
16235 -38008 -23410 -46530 -93629 -86388 -71615 -97410 -132421 -165787 -217108 -158595 -154373 -205544
$$ packed form
16319f5288L3814l7869k2164K4523O573l9287k0364l1096L5354o976L425m8305
16307a67660N677M1541L4919p1716l7216M900N0104M204K5725L8208j375l1029
16295a03718j8239m9062L6871Q7640M7531j6239m0853M574j4553m3983m4340k2723
16283a77094n287M3654k6757Q875P3461P3360j6620m3658j5459l0164K3162j8400
16271a10927l078M3820p7277k6772l5015j540L6368J661L6430M3270n026l1490
16259a29576m2845k8542N8234N0485k4895l2715K8213R0024M3780p929q497n5748
16247f0011o8501l2460J2419K9775m4392l829K6532N353Q420k613M1496M9803
16235c8008J4598k3120m7099P241J4773k5795l5011l3366n1321N8513M222n1171
$$ plain form
16223 -205544 -170903 -145759 -159455 -143517 -146864 -160742 -238222 -283922 -242933 -231399 -176185 -95155
16211 -95155 -27645 -52257 -89523 -103396 -83243 -72733 -58707 -738 41401 85118 122392 116338
16199 116338 36109 -25370 -33708 4303 -8273 -70601 -87398 -74506 -57436 -83135 -109250 -125509
16187 -125509 -113250 -102818 -105014 -82589 -63565 -101416 -62850 -92742 -175497 -128772 -5798
16176 -5798 23052 -27843 -158848 -201926 -154736 -101754 -80872 -148851 -150854 -185327 -152982 -74027
16164 -74027 -84601 -115179 -107529 -136441 -130983 -149438 -127455 -142908 -167860 -178447 -116562 -72418
16152 -72418 -67147 -101566 -152321 -132489 -177306 -191782 -160607 -93527 -45007 -83369 -133901 -84915
16140 -84915 -123378 -145957 -132135 -134674 -169705 -116547 -27809 -127029 -206460 -200612 -134785 -86132
$$ packed form
16223b05544L4641K5144j3696J5938l347j3878p7480m5700M0989J1534N5214Q1030
16211i5155O7510k4612l7266j3873K0153J0510J4026N7969M2139M3717L7274o054
16199A16338q0229o1479q338L8011j2576o2328j6797J2892J7070k5699k6115j6259
16187a25509J2259J0432k196K2425J9024l7851L8566k9892q2755M6725J22974
16176e798K8850n0895j31005m3078M7190N2982K0882o7979k003l4473L2345P8955
16164g4027j0574l0578P650k8912N458j8455K1983j5453k4952j0587O1885M4144
16152g2418N271l4419n0755J9832m4817j4476L1175O7080M8520l8362n0532M8986
16140h4915l8463k2579J3822k539l5031N3158Q8738r9220p9431N848O5827M8653
$$ plain form
16128 -86132 -77868 -89240 -23612 120690 231354 316481 351834 380244 350576 283871 143305
16117 143305 29662 -11031 -77532 -88109 -57087 -24026 19430 -12932 31339 -30151 -38444
16106 -38444 7284 69805 58995 36496 -4875 44132 171315 243727 251320 247734 281138 305630
16094 305630 214985 127164 129562 147436 97848 -27720 -23865 -24571 -11689 21583 12604 -49396
16082 -49396 -69042 -46513 -44153 -1056 52018 79370 97804 83983 21231 -64211 -97673 -105605
16070 -105605 -116000 -157449 -102354 -48566 -49086 14752 42329 -23471 15944 48620 16370 -16372
16058 -16372 -67810 -17306 165 -9513 41424 67389 14091 -1715 -12554 -37045 -58293 -51301
16046 -51301 7878 -135 23014 21635 -81432 -151159 -117874 -68746 -35780 -2211 69891 68824
$$ packed form
16128h6132Q264j1372O5628J44302J10664Q5127L5353K8410k9668o6705j40566
16117A43305j13643m0693o6501j0577L1022L3061M3456l2362M4271o1490q293
16106c8444M5728O2521j0810k2499m1371M9007J27183P2412P593l586L3404K4492
16094C05630r0645q7821K398J7874m9588j25568L855p06J2882L3272q979o2000
16082d9396j9646K2529K360M3097N3074K7352J8434j3821o2752q5442l3462p932
16070a05605j0395m1449N5095N3788n20O3838K7577o5800L9415L2676l2250l2742
16058a6372n1438N0504J7471r678N0937K5965n3298j5806j0839k4491k1248O992
16046e1301N9179q013K3149j379j03067o9727L3285M9128L2966L3569P2102j067
$$ plain form
16034 68824 66698 31221 -33405 -86116 -123947 -96799 -68122 -78396 -70100 4439 2532 -14544
16022 -14544 -22107 -34884 -82322 -85457 -36829 -34487 -8535 -12553 -27260 -37889 -22932 -26023 -40256
16009 -40256 -36755 -98123 -98110 -83345 -76933 -108389 -55790 -70096 -15073 29357 -10364 -96765 -129413
15996 -129413 -171676 -192191 -166605 -102840 -89597 -103915 -68293 -29204 -32690 29199 -6751 -21889
15984 -21889 -22459 -51598 -126596 -160715 -180091 -180585 -157188 -113693 -131676 -135992 -101817 -60851 -112753
15971 -112753 -142775 -162078 -153108 -104186 -116868 -81950 1006 4545 -9418 -14864 14612 13893
15959 13893 -26180 -54743 5710 -25646 -17314 -15293 -18905 -15333 -1503 16792 -62515 -31533
15947 -31533 -28459 -53084 -122707 -154494 -126632 -147530 -122984 -139222 -153009 -195444 -223085 -191326
$$ packed form
16034F8824k126l5477o4626n2711l7831K7148K8677j0274Q296P4539j907j7076
16022a4544p563j2777m7438l135M8628K342K5952m018j4707j0629J4957l091j4233
16009d0256L501o1368J3J4765O412l1456N2599j4306N5023M4430l9721q6401l2648
15996a29413m2263k0515K5586O3765J3243j4318L5622L9089l486O1889l5950j5138
15984b1889n70k9139p4998l4119j9376m94K3397M3495j7983m316L4175M0966n1902
15971a12753l0022j9303Q970M8922j2682L4918Q2956L539j3963n446K9476p19
15959A3893m0073k8563O0453l1356Q332K021l612L572J3830J8295p9307L0982
15947c1533L074k4625o9623l1787K7862k0898K4546j6238j3787m2435k7641L1759
$$ plain form
15935 -191326 -151149 -104836 -92582 -101683 -101370 -57061 -25811 -7417 13671 17019 -27476 -91143
15923 -91143 -188677 -149306 -178563 -213462 -240836 -214462 -153611 -139649 -132338 -126302 -116036 -96615
15911 -96615 -118284 -153511 -155906 -85242 -69641 -36485 10247 -51638 -66378 -49401 -54123 -156403
15899 -156403 -268319 -281332 -220202 -121418 -95259 -102540 -113136 -140054 -159557 -161790 -85672 -32414
15887 -32414 -21636 12356 31133 42961 46668 -46727 -63612 -57272 -73950 -145658 -174696 -128079
15875 -128079 -112372 -74213 -66493 -82010 -25624 -49306 -98410 -77860 -35036 -42930 -60702 -54260
15863 -54260 -105006 -138578 -141480 -112743 -105582 -94840 -10917 -38349 -76676 -12923 -44529 -54147
15851 -54147 -8036 22122 32045 -51390 -125191 -144863 -155258 -167402 -111055 -97651 -160332 -181194
$$ packed form
15935a91326M0177M6313J2254r101L13M4309L1250J8394K1088L348m4495o3667
15923i1143r7534L9371k9257l4899k7374K6374O0851J3962P311O036J0266J9421
15911i6615k1669l5227k395P0664J5601L3156M6732o1885j4740J6977m722j02280
15899a56403j11916j3013O1130R8784K6159p281j0596k6918j9503k233P6118N3258
15887c2414J0778L3992J8777J1828L707r3395j6885O340j6678p1708k9038M6617
15875a28079J5707L8159P720j5517N6386k3682m9104K0550M2824p894j7772O442
15863e4260n0746l3572k902K8737P161J0742Q3923k7432l8327O3753l1606r618
15851e4147M6111L0158R923q3435p3801j9672j0395j2144N6347J3404o2681k0862
$$ plain form
15839 -181194 -151417 -172254 -156188 -86356 -36051 3322 -12499 -71836 -95463 -128412 -133246 -140861
15827 -140861 -142006 -163484 -124641 -100004 -114194 -156851 -131690 -77268 -90920 -98665 -99083 -54853
15815 -54853 -60807 -140028 -115807 -138268 -84658 -74857 -97508 -78215 -79049 -139758 -92201 -3339
15803 -3339 -26095 -72259 -104920 -80435 -98321 -189754 -184759 -204512 -187177 -98655 -98299 -132679
15791 -132679 -167479 -171419 -164332 -82868 -1500 -8206 -14477 -53617 -71064 -18192 -63944 -75595
15779 -75595 -40532 -3539 3499 14098 -41625 -74004 -91702 -21032 -43095 -92027 -118282 -89096
15767 -89096 -108726 -91716 -86557 -79097 -92555 -147560 -208175 -213251 -184115 -177583 -130806 -180152
15755 -180152 -195909 -214829 -157640 -92377 -110448 -165454 -175796 -143151 -99213 -90937 -59171 -67854
$$ packed form
15839a81194K9777k0837J6066O9832N0305L9373j5821n9337k3627l2949m834p615
15827a40861j145k1478L8843K4637j4190m2657K5161N4422j3652p745m18M4230
15815e4853n954p9221K4221k2461N3610R801k2651J9293q34o0709M7557Q8862
15803c339k2756m6164l2661K4485j7886r1433M995j9753J7335Q8522L56l4380
15791a32679l4800l940P087Q1464Q1368o706o271l9140j7447N2872m5752j1651
15779g5595L5063L6993P038J0599n5723l2379j7698P0670k2063m8932k6255K9186
15767h9096j9630J7010N159P460j3458n5005o0615n076K9136O532M6777m9346
15755a80152j5757j8920N7189O5263j8071n5006j0342L2645M3938Q276L1766q683
$$ plain form
15743 -67854 -113804 -136313 -135617 -89431 -102715 -67504 -29717 26505 53884 7069 -32368 -79055
15731 -79055 -67709 -107153 -173981 -164497 -165070 -124487 -74347 -42189 -68204 -62815 -18943 -45506
15719 -45506 -85514 -92102 -67147 -147961 -173055 -144411 -108756 -110230 -121469 -81492 -99012 -77850
15707 -77850 -46062 -62512 -59001 -19624 -6244 -4187 -55929 -80737 -66487 -106515 -131061 -99856
15695 -99856 -68823 -29594 -41082 -69338 -37474 -86197 -148625 -106215 -89298 -82443 -94860 -144946
15683 -144946 -157061 -134049 -102261 -77599 -89270 -83508 -78605 -113408 -141155 -130996 -97043 -76573
15671 -76573 -99155 -109746 -18054 -823 20762 -23511 -87636 -72293 -49311 -22602 -17799 -9125
15659 -9125 -64356 -114707 -99577 -110154 -97481 -75413 -123434 -154615 -119448 -102250 -130362 -106300
$$ packed form
15743f7854m5950k2509O96M6186j3284L5211L7787N6222K7379m6815l9437m6687
15731g9055J1346l9444o6828R484n73M0583N0140L2158k6015N389M3872k6563
15719d5506m0008o588K4955q0814k5094K8644L5655j474j1239L9977j7520K1162
15707g7850L1788j6450L511L9377J3380K057n1742k4808J4250m0028k4546L1205
15695i9856L1033L9229j1488k8256L1864m8723o2428M2410J6917O855j2417n0086
15683a44946j2115K3012L1788K4662j1671N762M903l4803k7747J0159L3953K0470
15671g6573k2582j0591R1692J7231K1585m4273o4125J5343K2982K6709M803Q674
15659i125n5231n0351J5130j0577J2673K2068m8021l1181L5167J7198k8112K4062
$$ plain form
15647 -106300 -75819 -120779 -139827 -99101 -87373 -78404 -109859 -132618 -146464 -125891 -108363 -120974
15635 -120974 -195376 -235947 -187802 -134597 -128195 -113667 -120863 -130746 -124626 -109756 -29686 17822
15623 17822 -21845 -63593 -103036 -92463 -80672 -80954 -125053 -116524 -45945 32337 41545 -12000
15611 -12000 -35497 -20847 -21721 -37400 -74073 -99455 -82420 -78068 -58399 29908 29409 -39937 -53558
15598 -53558 -71405 -96003 -69184 -102787 -102768 -125751 -78499 -58283 -83261 -44683 -44402 23054 10634
15585 10634 -35998 -50779 -106291 -139049 -122200 -139937 -173120 -168729 -134595 -94457 -85437 -81966
15573 -81966 -33462 -23651 -104849 -138394 -121465 -61065 -36519 -79338 -82494 -109463 -134902 -87277
15561 -87277 -57055 -52310 -92800 -138649 -87453 -72177 -97240 -108127 -81890 -11978 61193 94483
$$ packed form
15647a06300L0481m4960j9048M0726J1728Q969l1455k2759j3846K0573J7528j2611
15635a20974p4402m0571M8145N3205O402J4528p196r883O120J4870Q0070M7508
15623A7822l9667m1748l9443J0573J1791k82m4099Q529P0579P8282R208n3545
15611a2000k3497J4650q74j5679l6673k5382J7035M352J9669Q8307m99o9346j3621
15598e3558j7847k4598K6819l3603J9k2983M7252K0216k4978L8578K81O7456j2420
15585A0634m6632j4781n5512l2758J6849j7737l3183M391L4134M0138R020L471
15573h1966M8504R811q1198l3545J6929O0400K4546m2819l156k6969k5439M7625
15561h7277L0222M745m0490m5849N1196J5276k5063j0887K6237O9912P3171L3290
$$ plain form
15549 94483 95688 93854 50899 32763 -19580 -37371 -52115 -35525 -5607 -5765 27446 35318 45539
15536 45539 -10581 -25374 54678 -9661 -91520 -180719 -173588 -134704 -52793 -22547 -12034 -35099
15524 -35099 -45938 -33437 -74538 -102297 -86036 -82916 -37782 -36587 -27655 -82069 -96321 -88689
15512 -88689 -132923 -153885 -110045 -98659 -107973 -141061 -56802 -40351 -38390 -127633 -145598 -62349
15500 -62349 -86791 -85367 -42442 -40547 -137300 -102550 -12119 2056 4991 30028 29194 33493 23361
15487 23361 -54603 -31318 -3012 -11463 -28481 2726 -22209 -83894 -70885 -3333 22006 50576
15475 50576 29153 15144 9147 -26341 -59912 -35803 -1612 5171 -16044 -75153 -121047 -87841
15463 -87841 -85853 -131434 -123523 -168458 -142337 -78403 -4705 -7276 -10178 -21162 -26542 -54618 -56708
$$ packed form
15549I4483J205j834m2955j8136n2343j7791j4744J6590K9918j58L3211P872J0221
15536D5539n6120j4793Q0052o4339q1859q9199P131L8884Q1911L0246J0513k3065
15524c5099j0839J2501m1101k7759J6261L120M5134J195Q932n4414j4252P632
15512h8689m4234k0962M3840J1386r314l3088Q4259J6451J961q9243j7965Q3249
15500f2349k4442J424M2925J895r6753L4750R0431J4175K935K5037q34M299j0132
15487B3361p7964K3285K8306q451j7018L1207k4935o1685J3009O7552K5339K8570
15475E0576k1423j4009n997l5488l3571K4109L4191O783k1215n9109m5894L3206
15463h7841J988m5581P911m4935K6121O3934P3698k571k902j0984n380k8076k090
$$ plain form
15450 -56708 -86988 -85088 -92220 -115365 -137353 -46215 -17543 -69547 -85953 -89451 -119265 -174426
15438 -174426 -187342 -212304 -250941 -193124 -138912 -98912 -67392 -80928 -66311 -58183 -105927 -161739
15426 -161739 -156997 -132239 -90598 -98616 -64327 6894 4641 -25633 -57516 -133840 -127524 -75637
15414 -75637 -57291 -11875 41270 91071 56117 -32555 -68997 -88560 -82441 -61436 -95354 -48386
15402 -48386 -21948 15448 2085 -67908 -98789 -103330 -59791 -41105 -43998 31916 45925 -28944
15390 -28944 -4075 30671 53771 42094 16371 10905 -7996 83101 157608 162132 72894 -18299
15378 -18299 -31270 10709 -70959 -107545 -98980 -63890 -46055 -29023 -70185 -79766 -71492 -111809
15366 -111809 -122587 -49359 -28254 -16150 2274 10611 -1684 -42175 -31942 10186 72630 90145
$$ packed form
15450e6708l0280J900p132k3145k1988R1138K8672n2004j6406l498k9814n5161
15438a74426j2916k4962l8637N7817N4212M0000L1520j3536J4617Q128m7744n5812
15426a61739M742K4758M1641q018L4289P1221k253l0274l1883p6324O316N1887
15414g5637J8346M5416N3145M9801l4954q8672l6442j9563O119K1005l3918M6968
15402d8386K6438L7396j3363o9993l0881m541M3539J8686k893P5914J4009p4869
15390b8944K4869L4746K3100j1677k5723n466j8901R1097P4507M524q9238r1193
15378a8299j2971M1979q1668l6586Q565L5090J7835J7032m1162r581Q274m0317
15366a11809j0778P3228K1105J2104J8424Q337j2295m0491J0233M2128O2444J7515
$$ plain form
15354 90145 73602 32975 31636 29886 6198 22058 54755 28313 23358 18583 3747 5175 -8650
15341 -8650 -58707 -101555 -106996 -36458 -62430 -33537 -35861 -29816 -2469 233 27615 15225 -13251
15328 -13251 -74243 -56653 -24365 -64167 -58350 -80441 -81469 -87258 -85894 -102642 -74041 -56361
15316 -56361 -62425 -44412 -16590 5242 52501 39085 31855 -19744 -55160 -92682 -116214 -13166
15304 -13166 66126 17257 -22843 -51747 -24208 -3614 -12752 -37264 -30704 -20072 -34332 -101881
15292 -101881 -178411 -158646 -75103 -52589 -10373 18283 24271 -6034 -43966 -23572 -29584 -83786
15280 -83786 -100255 -96668 -39232 -80765 -75266 -64976 -122604 -82584 -59775 -69505 -104395 -125785
15268 -125785 -109808 -57516 12488 86010 21674 -55202 -80375 -19182 8123 -19439 -99481
$$ packed form
15354I0145j6543m0627j339j750k3688J5860L2697k6442m955m775j4836J428j3825
15341h650n0057m2848n441P0538k5972K8893k324O045K7347K702K7382j2390k8476
15328a3251o0992J7590L2288l9802N817k2091j028n789J364j6748K8601J7680
15316e6361o064J8013K7822K1832M7259j3416p230n1599l5416l7522k3532J03048
15304a3166P9292m8869m0100k8904K7539K0594r138k4512O560J0632j4260o7549
15292a01881p6530J9765Q3543K2514M2216K8656N988l0305l7932K0394o012n4202
15280h3786j6469L587N7436m1533N499J0290n7628M0020K2809r730l4890k1390
15268a25785J5977N2292P0004P3522o4336p6876k5173O1193K7305k7562q0042
$$ plain form
15257 -99481 -67126 -68105 -89107 -57987 -49162 -60441 -79390 -112427 -91812 -74890 -57482 -79102
15245 -79102 -109639 -90615 -66324 -39650 -34548 -54426 -19135 41369 16925 -16377 -48878 -10717
15233 -10717 -7176 5154 8458 -16706 -43074 9385 52373 2926 -30910 16441 24996 -11534
15221 -11534 -7737 43211 55583 29891 -30991 -124857 -100682 -49758 -3260 -45746 -133643 -177630
15209 -177630 -166374 -115449 -30988 -13263 -42631 -30793 48342 79612 39983 -41238 -93762
15198 -93762 -93093 -84435 -68138 -78551 -59283 -39680 -20313 -7352 39819 48524 33678 31263 -50868
15185 -50868 -86507 -78337 -62015 -95200 -62938 -65625 -107412 -100884 -60227 -82361 -129998 -130176 -116291
15172 -116291 -117765 -117266 -179273 -128842 -121833 -134400 -140398 -126669 -103387 -77832 -51410 -50072 -14035
$$ packed form
15257i9481L2355r79k1002L1120Q825j1279j8949l3037K0615J6922J7408k1620
15245g9102l0537J9024K4291K6674N102j9878L5291O0504k4444l3302l2501L8161
15233a0717L541J2330L304k5164k6368N2459M2988m9447l3836M7351Q555l6530
15221a1534L797N0948J2372k5692o0882r3866K4175N0924M6498m2486q7897m3987
15209a77630J1256N0925Q4461J7725k9368J1838P9135L1270l9629q1221n2524
15198i3762O69Q658J6297j0413J9268J9603J9367J2961M7171Q705j4846k415q2131
15185e0868l5639Q170J6322l3185L2262k687m1787O528M0657k2134m7637j78J3885
15172a16291j474M99o2007N0431P009j2567n998J3729K3282K5555K6422J338L6037
$$ plain form
15159 -14035 50772 50842 2735 -16434 37675 -10751 39280 102315 95658 64466 28018 15183
15147 15183 -1490 -9938 43394 38673 2754 -35259 -43443 -60300 -27882 26592 34330 43312 69774
15134 69774 85285 91527 115481 74845 30250 24674 46038 61866 68376 22418 -44009 -93041
15122 -93041 -79184 -53405 -59924 -102701 -88742 -61365 -3292 -7258 849 41992 37285 -7668
15110 -7668 -68751 -75007 -6669 23628 -19370 -11522 12258 30154 50401 29049 28779 16109 -32281
15097 -32281 -34654 -35012 -62864 -21745 83633 133625 103770 56626 26999 -55556 -51539 -4173
15085 -4173 4780 -38754 -48374 -55009 1265 33961 -36803 -59939 33783 93614 92680 61416 -36981
15072 -36981 -80761 -35848 -13493 21424 49322 65174 122797 71295 -10182 -14611 18523 -55785
$$ packed form
15159a4035O4807P0m8107j9169N4109m8426N0031O3035o657l1192l6448j2835
15147A5183j6673q448N3332m721l5919l8013q184j6857L2418N4474P738Q982K6462
15134F9774J5511O242K3954m0636m4595n576K1364J5828O510m5958o6427m9032
15122i3041J3857K5779o519m2777J3959K7377N8073l966Q107M1143m707m4953
15110g668o1083o256O8338L0297m2998P848K3780J7896K0247k1352k70j2670m8390
15097c2281k373l58k7852M1119J05378M9992k9855m7144k9627q2555M017M7366
15085d173Q953m3534r620o635N6274L2696p0764k3136R3722N9831r34l1264r8397
15072c6981m3780M4913K2355L4917K7898J5852N7623n1502q1477m429L3134p4308
$$ plain form
15060 -55785 -112757 -103065 -49167 8981 -11128 -12303 44366 62409 45120 -25 -44561 -28477
15048 -28477 -6985 -86693 -155253 -183825 -178077 -219916 -185398 -182773 -217316 -164826 -94349 -91697
15036 -91697 -132898 -112431 -34414 1754 -68653 -39325 14907 12091 19388 80765 93355 94546
15024 94546 86036 -959 -18660 11002 -17977 -16401 -1390 -28326 19557 111111 184108 168496
15012 168496 105724 120781 83915 38129 7200 -71643 -87748 -82748 -87635 -75958 -58642 24113
15000 24113 28593 48834 25779 -13572 -53484 -64682 -88839 -43549 17992 9231 21111 28299
14988 28299 -19298 -35487 -14134 8458 53321 45630 26927 -871 -29071 -13890 28408 67019
14976 67019 -10253 -34267 31900 46924 60242 14382 5307 24051 27562 43559 1386 -27485
$$ packed form
15060e5785n6972R692N3898N8148k0109j175N6669J8043j7289m5145m4536J6084
15048b8477K1492p9708o8560k8572N748m1839L4518K625l4543N2490P0477K652
15036i1697m1201K0467P8017L6168p0407K9328N4232k816P297O1377J2590J191
15024I4546q510q6995j7701K9662k8979J576J5011k6936M7883R1554P2997j5612
15012A68496o2772J5057l6866m5786l0929p8843j6105N000m887J1677J7316Q2755
15000B4113M480K0241k3055l9351l9912j1198k4157M5290O1541q761J1880P188
14988B8299m7597j6189K1353K2592M4863p691j8703k7798k8200J5181M2298L8611
14976F7019p7272k4014O6167J5024J3318m5860r075J8744L511J5997m2173k8871
$$ plain form
14964 -27485 -47455 -69552 -94690 -48208 -4716 54172 37236 46079 50308 -8867 -75057 -78600
14952 -78600 -89856 -76891 -65613 -32165 -68261 -57420 -19585 33321 26872 15820 33232 -31338
14940 -31338 -43591 1613 -60511 -62615 -47635 -34878 -76920 -87546 -9772 39181 -3238 -86877
14928 -86877 -51062 -22435 -14091 -17979 -64862 -84940 -73289 -52326 -43744 -36119 40734 65555
14916 65555 40674 79413 105377 91731 50328 1125 -51183 -15623 24709 15413 31648 45203
14904 45203 43501 55745 59522 47084 68364 103749 86292 67224 53794 22181 33861 3119
14892 3119 -47553 -20025 -47246 -27781 -25163 -26407 -14873 -12668 36540 40206 25879 67892 70170
14879 70170 103247 66200 -721 -30945 -41999 -26183 -52565 -39379 -27109 -8167 9675 27527
$$ packed form
14964b7485j9970k2097k5138M6482M3492N8888j6936Q843M229n9175o6190l543
14952g8600j1256J2965J1278L3448l6096J0841L7835N2906o449j1052J7412o4570
14940c1338j2253M5204o2124k104J4980J2757m2042j0626P7774M8953m2419q3639
14928h6877L5815K8627Q344l888m6883k0078J1651K0963Q582P625P6853K4821
14916F5555k4881L8739K5964j3646m1403m9203n2308L5560M0332r296J6235J3555
14904D5203j702J2244L777j2438K1280L5385j7457j9068j3430l1613J1680l0742
14892C119n0672K7528k7221J9465K618j244J1534K205M9208L666j4327M2013K278
14879G0170L3077l7047o6921l0224j1054J5816k6382J3186J2270J8942J7842J7852
$$ plain form
14867 27527 32367 57527 49058 49390 4622 1970 -9213 -68089 -24913 1866 22091 8532 34411
14854 34411 79798 87984 95251 154156 208475 221434 310439 361360 408978 381637 282894 196514
14842 196514 140340 70327 26891 10678 24759 98014 138415 93424 93134 850 -27953 -22880
14830 -22880 19969 34510 3970 -7020 -47590 -49575 -21138 -22016 -29825 -446 -22676 20510
14818 20510 42693 17853 13355 -1663 -7902 1650 45124 67993 69654 25312 3174 59859
14806 59859 91267 86996 103253 48795 -41532 -110818 -120243 -70416 -16066 -34664 42545 115703
14794 115703 118393 61625 30538 9296 -10238 -24802 -32388 -38597 -41812 -2246 36020 38096
14782 38096 53303 46002 -18008 -65952 -72848 -75262 -16153 44255 10264 -17353 -52639 25343
$$ packed form
14867B7527M840K5160q469L32m4768k652j1183n8876M3176K6779K0225j3559K5879
14854C4411M5387Q186P267N8905N4319J2959Q9005N0921M7618k7341r8743q6380
14842A96514n6174p0013m3436j6213J4081P3255M0401m4991k90r2284k8803N073
14830b2880M2849J4541l0540j0990m0570j985K8437q78p809K9379k2230M3186
14818B0510K2183k4840m498j5018o239R552M3474K2869J661m4342k2138N6685
14806E9859L1408m271J6257n4458r0327o9286r425M9827N4350j8598P7209P3158
14794A15703K690n6768l1087k1242j9534j4564p586o209l215L9566L8266K076
14782C8096J5207p301o4010m7944o896k414N9109O0408l3991k7617l5286P7982
$$ plain form
14770 25343 67350 119678 96225 41921 -56054 -81480 -69632 -36462 12630 -14230 -34593 21339
14758 21339 9500 -63211 -45384 -31546 -50845 -28712 -2391 -32296 -44706 -44384 -73064 -38238
14746 -38238 19347 16773 -23054 -56433 -41488 15173 404 -32946 -35893 8099 32698 39092
14734 39092 75882 105843 11534 11469 73273 55567 106996 114386 60812 26488 10163 22490
14722 22490 76813 59686 58728 35671 15801 75863 32701 12803 53811 36834 20408 -23283
14710 -23283 -44015 -12951 -390 19004 26473 64304 51096 77303 16596 -23032 -59993 41721
14698 41721 94412 90473 79015 28076 -9907 10291 -33796 -51495 -38505 -8110 9781 11738
14686 11738 -22959 -29724 -70143 -10726 53997 113961 104824 59176 -8266 -2091 23497 25087
$$ packed form
14770B5343M2007N2328k3453n4304r7975k5426J1848L3170M9092k6860k0363N5932
14758B1339j1839p2711J7827J3838j9299K2133K6321k9905j2410L22k8680L4826
14746c8238N7585k574l9827l3379J4945N6661j4769l3350k947M3992K4599O394
14734C9092L6790K9961r4309o5O1804j7706N1429P390n3574l4324j6325J2327
14722B2490N4323j7127r58k3057j9870O0062m3162j9898M1008j6977j6426m3691
14710b3283k0732L1064J2561J9394P469L7831j3208K6207o0707l9628l6961J01714
14698D1721N2691l939j1458n0939l7983K0198m4087j7699J2990L0395J7891J957
14686A1738l4697o765m0419N9417O4723N9964r137m5648o7442O175K5588J590
$$ plain form
14674 25087 30092 10665 13636 53143 105268 49712 24868 21129 98875 165552 133375 111838
14662 111838 113309 68722 47930 4835 6629 -1478 -30340 41649 91878 105634 136043 77932
14650 77932 35811 4466 51229 59349 95343 83587 95007 90233 11101 -16059 4107 22795
14638 22795 11501 40953 87696 140751 92591 97683 99906 79930 100644 124169 112979 34824
14626 34824 1011 59547 73291 99826 58753 46464 79337 142742 116419 99233 49483 87835
14614 87835 140160 102941 86045 21974 21238 11218 -71684 2277 45124 36861 40709 39722 -19165
14601 -19165 -21199 3886 25817 42352 76820 35103 59473 137119 147511 109905 107774 120578
14589 120578 96184 107515 146672 176162 234208 286222 319932 317791 328203 404117 378807 315978
$$ packed form
14674B5087N005j9427K971L9507N2125n5556k4844l739P7746O6677l2177k1537
14662A11838J471m4587k0792m3095J794q107k8862P1989N0229J3756L0409n8111
14650G7932m2121l1345M6763Q120L5994j1756J1420m774p9132k7160K0166J8688
14638B2795j1294K9452M6743N3055m8160N092K223j9976K0714K3525j1190p8155
14626C4824l3813N8536J3744K6535m1073j2289L2873O3405k6323j7186m9750L8352
14614H7835N2325l7219j6896o4071p36j0020q2902P3961M2847q263L848r87n8887
14601a9165k034K5085K1931J6535L4468m1717K4370P7646J0392l7606k131J2804
14589A20578k4394J1331L9157K9490N8046N2014L3710k141J0412P5914k5310o2829
$$ plain form
14577 315978 256728 246584 194162 136724 127391 96522 31194 -4243 5828 -20715 15179 42435
14565 42435 66520 28013 21243 64285 81493 50774 9256 30745 77174 96454 103954 113117
14553 113117 87833 53259 63429 106856 101427 45072 31021 43403 62378 13043 36506 71857
14541 71857 56262 25311 47860 82356 83355 76495 70616 63730 51121 30495 24672 49000 88385
14528 88385 145220 130556 112004 120220 59845 -3788 -46702 18622 115333 97365 51584 54571
14516 54571 77292 143797 140770 73597 42189 33080 41142 -12980 -24193 34882 2371 -27552
14504 -27552 21111 86813 130024 150363 172916 178337 213436 215222 155351 118049 90094 70376
14492 70376 61635 46256 43405 54988 100644 67223 50303 46212 52917 90527 140945 146744 78759
$$ packed form
14577C15978n9250j0144n2422n7438r333l0869o5328l5437J0071k6543L5894K7256
14565D2435K4085l8507o770M3042J7208l0719m1518K1489M6429J9280P500R163
14553A13117k5284l4574J0170M3427n429n6355j4051J2382J8975m9335K3463L5351
14541G1857j5595l0951K2549L4496R99o860n879o886j2609k0626n823K4328L9385
14528H8385N6835j4664j8552Q216o0375o3633m2914O5324R6711j7968m5781K987
14516E4571K2721O6505l027o7173l1408r109Q062n4122j1213N9075l2511k9923
14504b7552M8663O5702M3211K0339K2553N421L5099J786n9871l7302k7955j9718
14492G0376q741j5379k851J1583M5656l3421j6920m091O705L7610N0418N799o7985
$$ plain form
14479 78759 25781 44831 40735 105987 82237 48158 58193 64510 74994 38175 14182 -11855
14467 -11855 -1674 4746 53670 119927 140708 97500 20938 50554 46159 16300 48205 64423
14455 64423 39574 -13298 -27786 4596 82667 93743 23970 -7354 3009 61529 79214 52473
14443 52473 4041 10380 -13466 37847 101552 122449 118097 139394 176669 138366 80110 106234
14431 106234 88317 53389 68796 66789 28663 61808 122628 93830 96239 105221 87378 66114
14419 66114 67988 81426 73617 105186 192135 157698 73052 21936 67850 13729 18568 33322
14407 33322 1143 27585 80219 71897 91649 96776 64702 82664 86492 106352 80301 69464
14395 69464 6831 23627 34379 -21997 -72463 -10971 77571 90217 126967 77917 40191 63564
$$ packed form
14479G8759n2978J9050m096O5252k3750l4079J0035O317J0484l6819k3993k6037
14467a1855J0181O420M8924O6257K0781m3208p6562K9616m395k9859L1905J6218
14455F4423k4849n2872j4488L2382P8071J1076o9773l1324J0363N8520J7685k6741
14443E2473m8432O339k3846N1313O3705K0897m352K1297L7275l8303n8256K6124
14431A06234j7917l4928J5407k007l8126L3145O0820k8798K409Q982j7843k1264
14419F6114J874J3438p809L1569Q6949l4437q4646n1116M5914n4121M839J4754
14407C3322l2179K6442N2634q322J9752N127l2074J7962L828J9860k6051j0837
14395F9464o2633J6796J0752n6376n0466O1492Q8542J2646L6750m9050l7726K3373
$$ plain form
14383 63564 73228 21766 37546 61938 114320 85371 51371 49607 93926 107473 106474 8624
14371 8624 -64773 -36534 55973 167043 212115 204750 248562 232965 147035 142550 149360 188094
14359 188094 170288 101006 84362 122241 137921 134818 63558 61394 109031 145527 171207 196882
14347 196882 181764 129858 81078 95666 120060 127176 116179 109835 55377 13704 20205 22026
14335 22026 11339 48396 133298 172028 213627 153444 94889 117597 114798 46580 23887 49752
14323 49752 75069 106709 119341 103956 86879 28478 46723 67880 86260 85412 36804 9354
14311 9354 67334 110438 155571 177135 227520 182046 166474 147519 77680 99655 127612 94418
14299 94418 57952 51758 85222 87938 119852 138315 90669 95925 126967 102376 20092 -920
$$ packed form
14383F3564R664n1462J5780K4392N2382k8949l4000j764M4319J3547r99r7850
14371H624p3397K8239R2507J11070M5072p365M3812j5597q5930m485O810L8734
14359A88094j7806o9282j6644L7879J5680l103p1260k164M7637L6496K5680K5675
14347A96882j5118n1906m8780J4588K4394P116j0997o344n4458m1673O501J821
14335B2026j0687L7057Q4902L8730M1599o0183n8555K2708k799o8218k2693K5865
14323D9752K5317L1640J2632j5385j7077n8401J8245K1157J8380q48m8608k7450
14311I354N7980M3104M5133K1564N0385m5474j5572j8955o9839K1975K7957l3194
14299I4418l6466o194L3464K716L1914J8463m7646N256L1042k4591q2284k1012
$$ plain form
14287 -920 32914 94219 53962 13122 -55499 -14536 13751 24038 60216 69698 114390 170012
14275 170012 169242 129433 159498 171659 138416 73147 95287 102889 106191 96179 98598 103300 88781
14262 88781 109470 167195 145630 150819 155384 118280 92076 128333 146052 175962 161634 104062
14250 104062 60712 91889 98205 46490 28310 -34836 -65419 4282 70062 109902 114172 149946
14238 149946 150938 162368 191345 178400 167173 151105 76542 74119 112533 129284 142591 128434
14226 128434 102405 62974 26995 84120 131688 136699 106190 73617 107654 159256 220274 221977
14214 221977 190122 148103 133183 110449 132593 152920 174422 212535 230950 224558 207107 208384
14202 208384 121987 65008 43059 137371 251861 285834 216464 136750 194803 240117 179041
$$ packed form
14287i20L3834O1305m0257m0840o8621M0963K8287J0287L6178R482M4692N5622
14275A70012p70l9809L0065J2161l3243o5269K2140P602L302j0012K419M702j4519
14262H8781K0689N7725k1565N189M565l7104k6204L6257J7719K9910j4328n7572
14250A04062m3350L1177O316n1715j8180o3146l0583O9701O5780L9840M270L5774
14238A49946R92J1430K8977j2945j1227j6068p4563k423L8414J6751J3307j4157
14226A28434k6029l9431l5979N7125M7568N011l0509l2573L4037N1602O1018J703
14214B21977l1855m2019j4920k2734K2144K0327K1502L8113J8415o392j7451J277
14202B08384q6397n6979k1949R4312J14490L3973o9370p9714N8053M5314o1076
$$ plain form
14191 179041 159527 164403 164871 139941 103637 125659 145575 129686 130088 137763 161259 138102 84235
14178 84235 68253 90682 123483 138984 87770 73130 94518 109144 104611 139616 114627 55696
14166 55696 90512 126406 168870 139898 146726 115648 106903 73680 121669 146469 118721 66953
14154 66953 9518 28954 81756 110091 185794 201622 127853 92198 82324 42874 24283 63858
14142 63858 96399 137955 166208 126107 78540 67633 40698 -4210 35662 90399 40355 7569
14130 7569 -40680 -16740 53317 175951 227413 153582 114769 193043 161294 155442 210908 205934
14118 205934 195098 163313 94285 71154 35059 -3978 29362 96235 74453 83980 133048 183441
14106 183441 216110 172247 158547 163510 166949 193009 131868 193455 265220 147320 126838 177863
$$ packed form
14191A79041j9514M876M68k4930l6304K2022J9916j5889M02P675K3496k3157n3867
14178H4235j5982K2429L2801J5501n1214j4640K1388J4626m533L5005k4989n8931
14166E5696L4816L5894M2464k8972O828l1078q745l3223M7989K4800k7748n1768
14154F6953n7435J9436N2802K8335P5703J5828p3769l5655r874l9450j8591L9575
14142F3858L2541M1556K8253m0101m7567j0907k6935m4908L9872N4737n0044l2786
14130G569m8249K3940P0057J22634N1462p3831l8813P8274l1749n852N5466m974
14118B05934j0836l1785o9028k3131l6095l9037L3340O6873k1782R527M9068N0393
14106A83441L2669m3863j3700M963L439K6060o1141O1587P1765j17900k0482N1025
$$ plain form
14094 177863 110627 33652 49624 82394 153019 179772 178250 153811 118086 144686 139002 140210
14082 140210 111184 113291 120658 152426 244119 287276 265222 211979 236440 230956 213796 199075
14070 199075 143894 110795 122845 52635 -6167 7160 51470 91106 115390 72952 86365
14059 86365 93337 111417 63226 9165 89740 120296 99903 85507 103943 91137 83035 121238
14047 121238 113819 147490 147335 165848 171315 191922 184742 180443 145115 113612 104606 71781 79407
14034 79407 77134 75582 91709 92589 89207 108050 102549 88153 110386 127121 143761 186627 159029
14021 159029 70442 116015 149605 167202 225013 195000 124403 164250 193546 177184 155846
14010 155846 73415 91181 152357 184575 145598 153997 145359 152961 152493 83830 5888 60649
$$ packed form
14094A77863o7236p6975J5972L2770P0625K6753j522k4439l5725K6600n684J208
14082A40210k9026K107P367L1768R1693M3157k2054n3243K4461n484j7160j4721
14070A99075n5181l3099J2050p0210n8802J3327M4310L9636K4284m2438J3413
14059H6365O972J8080m8191n4061Q0575L0556k0393j4396J8436j2806q102L8203
14047A21238p419L3671j55J8513N467K0607p180m299l5328l1503r006l2825P626
14034G9407k273j552J6127Q80l382J8843n501j4396K2233J6735J6640M2866k7598
14021A59029q8587M5573L3590J7597N7811l0013p0597L9847K9296j6362k1338
14010A55846q2431J7766O1176L2218l8977Q399q638P602m68o8663p7942N4761
$$ plain form
13998 60649 165170 123076 86144 112768 134546 138434 167447 191988 235519 233276 195997 159889
13986 159889 156077 142183 221373 238126 221381 218898 195895 223206 249554 235834 184987 135627
13974 135627 132550 157228 261852 208941 227275 204877 185779 174332 134137 143407 186499 245455
13962 245455 234950 282658 317637 251640 189658 191418 193076 169367 176742 214874 231858 249250
13950 249250 272009 207383 169120 129701 103336 198813 241623 281167 248983 229432 221470 176696
13938 176696 176080 217136 224008 196775 149612 101259 104510 188344 250604 225593 247559 219348
13926 219348 188897 188304 162720 140878 204261 205471 174115 176700 213810 231634 231982 213668 192289
13913 192289 183210 210902 179695 173861 175051 177957 182655 149966 104232 126190 117327 162646 174527
$$ packed form
13998F0649J04521m2094l6932K6624K1778L888K9013K4541M3531k243l7279l6108
13986A59889l812j3894P9190J6753j6745k483k3003K7311K6348j3720n0847m9360
13974A35627l077K4678J04624n2911J8334k2398j9098j1447m0195R270M3092N8956
13962B45455j0505M7708L4979o5997o1982J760J658k3709P375L8132J6984J7392
13950B49250K2759o4626l8263l9419k6365R5477M2810L9544l2184j9551p962m4774
13938A76696o16M1056O872k7233m7163m8353L251Q3834O2260k5011K1966k8211
13926B19348l0451n93k5584k1842O3383J210l1356K585L7110J7824L48j8314k1379
13913A92289r079K7692l1207n834J190K906M698l2689m5734K1958q863M5319J1881
$$ plain form
13900 174527 199652 172944 160859 168842 163112 146180 137376 194523 267871 321664 315650 274275
13888 274275 240086 199846 183891 245175 254382 235739 249494 208243 240340 246602 235557 173842
13876 173842 153607 164844 180167 224801 209747 178802 196499 202034 251713 213394 185564 229901
13864 229901 275878 280167 194682 192704 243181 272357 253978 237184 222545 215276 236874 203639
13852 203639 168073 207726 199965 138311 170579 201330 172281 151206 138427 114618 133603 176839
13840 176839 212588 299525 281390 234075 260593 237940 257700 239916 182878 149506 160702
13829 160702 170891 200105 198556 206704 184402 182105 239651 226379 201948 218379 215249 190117
13817 190117 154034 168746 199465 155032 190395 264263 237566 218796 178132 152217 142219 181415
$$ packed form
13900A74527K5125k6708j2085P983n730j6932q804N7147P3348N3793o014m1375
13888B74275l4189m0240j5955O1284R207j8643J3755m1251L2097O262j1045o1715
13876A73842k0235J1237J5323M4634j5054l0945J7697N535M9679l8319k7830M4337
13864B29901M5977M289q5485j978N0477K9176j8379j6794j4639p269K1598l3235
13852B03639l5566L9653p761o1654L2268L0751k9049k1075j2779k3809J8985M3236
13840A76839L5749Q6937j8135m7315K6518k2653J9760j7784n7038l3372J1196
13829A60702J0189K9214j549Q148k2302k297N7546j3272k4431J6431l130k5132
13817A90117l6083J4712L0719m4433L5363P3868k6697j8770m0664k5915r998L9196
$$ plain form
13805 181415 234904 228569 235019 208305 215716 248923 225414 229232 216891 199003 192876 231732
13793 231732 214914 221712 263620 247457 250601 289157 278044 257174 259752 227536 179113 245511
13781 245511 276700 229410 186390 241779 280838 262849 190887 152112 236879 294962 249476
13770 249476 255983 276284 277890 250087 281001 268266 263411 239235 225625 267731 290790 260256
13758 260256 251158 291374 286037 231057 262272 354354 400106 308960 230150 268948 305153 353123
13746 353123 361706 332401 253486 215662 262414 286860 296422 301661 306266 257081 234634 243558
13734 243558 271852 207081 180498 275258 311904 345926 369017 357734 319560 287146 236890
13723 236890 231407 301127 276211 255869 248393 225284 136256 146990 194531 226158 271311 269945
$$ packed form
13805A81415N3489o335O450k6714P411L3207k3509L818j2341j7888o127L8856
13793B31732j6818O798M1908j6163L144L8556j1113k0870K578l2216m8423O6398
13781B45511L1189m7290m3020N5389L9059j7989p1962l8775Q4767N8083m5486
13770B49476O507K0301J606k7803L0914j2735m855k4176j3610M2106K3059l0534
13758B60256r098M0216n337n4980L1215R2082M5752r1146p8810L8798L6205M7970
13746C53123Q583k9305p8915l7824M6752K4446R562N239M605m9185k2447Q924
13734B43558K8294o4771k6583R4760L6646L4022K3091j1283l8174l2414n0256
13723B36890n483O9720k4916k0342p476k3109q9028J0734M7541L1627M5153j366
$$ plain form
13711 269945 254293 301376 326547 296745 256393 254568 318142 349916 320887 317783 345086 339810
13699 339810 322799 321056 278584 296162 276605 165778 212067 240896 311856 346004 321467
13688 321467 303622 258606 222472 272932 312512 315734 302181 279765 291807 253043 276411 311645
13676 311645 285606 220960 218534 237276 300440 279102 218524 201615 187555 201450 268328 298635
13664 298635 343868 354278 342747 306829 240605 268184 264980 263511 215367 237871 284050 323722
13652 323722 427807 421192 412103 335055 329723 316580 299366 272859 287721 290666 279000 282063
13640 282063 210578 195206 254551 262323 265460 243441 260510 241590 259488 267339 266520 251660
13628 251660 239256 273863 346116 386196 388362 323901 229525 255145 262780 252494 227008 287790
$$ packed form
13711B69945j5652M7083K5171k9802m0352j825O3574L1774k9029l104K7303n276
13699C39810j7011j743m2472J7578j9557j10827M6289K8829P0960L4148k4537
13688C21467j7845m5016l6134N0460L9580L222j3553k2416J2042l8764K3368L5234
13676C11645k6039o4646k426J8742O3164k1338o0578j6909j4060J3895O6878L0307
13664B98635M5233J0410j1531l5918o6224K7579l204j469m8144K2504M6179L9672
13652C23722J04085o615r089p7048n332j3143j7214k6507J4862K945j1666L063
13640B82063p1485j5372N9345P772L137k2019J7069j8920J7898P851q19j4860
13628B51660j2404L4607P2253M0080K166o4461r4376K5620P635j0286k5486O0782
$$ plain form
13616 287790 368088 389289 330907 263240 272700 326444 343122 293414 289815 307903 266744 259201
13604 259201 259489 210511 184943 249259 312044 304315 324240 403222 411951 373899 321749 396801
13592 396801 421302 345589 350888 361080 328836 299675 267507 299646 356398 394958 387483 390758
13580 390758 355494 325493 360514 358478 306912 342331 415049 439948 429437 367315 392221 440702
13568 440702 399340 374051 457755 458581 508798 511008 506666 479848 432581 337209 314155 330739
13556 330739 339025 357880 413183 404131 350981 296920 318721 392759 381462 378597 349469 348375
13544 348375 432861 457851 403303 379867 406963 409671 423003 400990 367796 375203 335011 319008
13532 319008 339652 337465 319373 302177 346175 399955 414001 486965 461371 390973 383284 386451
$$ packed form
13616B87790Q0298K1201n8382o7667R460N3744J6678m9708l599J8088m1159p543
13604B59201K88m8978k5568O4316O2785p729J9925P8982Q729l8052n2150P5052
13592C96801K4501p5713N299J0192l2244k9161l2168L2139N6752L8560p475L275
13580C90758l5264l0001L5021k036n1566L5419P2718K4899j0511o2122K4906M8481
13568D40702m1362k5289Q3704Q26N0217K210m342k6818m7267r5372k3054J6584
13556C30739Q286J8855N5303r052n3150n4061K1801P4038j1297k865k9128j094
13544C48375Q4486K4990n4548k3436K7096K708J3332k2013l3194P407m0192j6003
13532C19008K0644k187j8092j7196M3998N3780J4046P2964k5594p0398p689L167
$$ plain form
13520 386451 355918 357244 349218 350898 357382 384545 293638 314025 363969 342451 375799 378223
13508 378223 351230 343243 406179 436473 416763 379922 408289 377730 379539 406365 389473 383636
13496 383636 345153 354189 350183 381958 435226 416501 367128 344134 307279 296263 269815 316686
13484 316686 385872 414682 401578 386421 349430 371407 345937 330817 333878 341732 387281 424926
13472 424926 441535 437434 450756 404493 454773 497225 474505 454478 406997 310407 350418 360526
13460 360526 342268 385902 407541 421516 340998 379292 417335 459913 459036 451907 457354 420969
13448 420969 414846 407873 406232 370123 412553 440551 516944 526059 529392 415217 373248 452528
13436 452528 456517 380182 359755 433087 462758 458359 388044 347850 365414 439637 504362 520223
$$ packed form
13520C86451l0533J326q026J680O484K7163r0907K0387M9944k1518L3348K424
13508C78223k6993p987O2936L0294j9710l6841K8367l0559J809K6826j6892n837
13496C83636l8483R036m006L1775N3268j8725m9373k2994l6855j1016k6448M6871
13484C16686O9186K8810j3104j5157l6991K1977k5470j5120L061P854M5549L7645
13472D24926J6609m101J3322m6263N0280M2452k2720k0027m7481r6590M0011J0108
13460C60526j8258M3634K1639J3975q0518L8294L8043M2578q77p129N447l6385
13448D20969o123o973j641l6109M2430K7998P6393R115L333j14175m1969P9280
13436D52528L989p6335k0427P3332K9671m399p0315m0194J7564P4223O4725J5861
$$ plain form
13424 520223 496711 483882 446168 352138 434708 487500 411472 357638 315403 321133 332186 332181
13412 332181 374798 410917 501529 497748 449396 462857 483203 467525 443336 423978 401319 443824
13400 443824 461385 472518 442146 497938 507987 479964 441427 440093 442576 479262 493659 442206
13388 442206 453332 510664 517995 463375 461384 517123 521378 526937 466066 401513 387015 348683
13376 348683 318773 355360 425514 453716 452243 466304 433187 383199 427213 445836 453056 490963
13364 490963 483226 502129 573380 547665 537306 568094 607054 573812 569009 623749 626618 591719
13352 591719 572482 521305 481458 492761 533103 532963 541234 564213 536356 531909 577576 592720
13340 592720 556711 533026 546926 515092 522573 531927 496962 460387 454216 381368 348290 391485
$$ packed form
13424E20223k3512j2829l7714r4030Q2570N2792p6028n3834m2235N730J1053n
13412C32181M2617L6119R0612l781m8352J3461K0346j5678k4189j9358k2659M2505
13400D43824J7561J1133l0372N5792J0049k8023l8537j334K483L6686J4397n1453
13388D42206J1126N7332P331n4620j991N5739M255N559o0871o4553j4498l8332
13376C48683k9910L6587P0154K8202j473J4061l3117m9988M4014J8623P220L7907
13364D90963p737J8903P1251k5715j0359L0788L8960l3242m803N4740K869l4899
13352E91719j9237n1177l9847J1303M0342j40Q271K2979k7857m447M5667J5144
13340E92720l6009k3685J3900l1834P481R354l4965l6575o171p2848l3078M3195
$$ plain form
13328 391485 428682 409614 461851 567766 574580 486678 472809 530465 614164 587458 544094
13317 544094 515769 520959 562061 511951 517377 557400 552624 494672 489708 551875 601602 562410
13305 562410 513641 540488 537137 538388 524501 520215 576361 594992 566769 508125 514683 589498
13293 589498 551780 532463 538421 572215 541081 560999 580270 619863 553151 502871 501654 470559
13281 470559 465439 496440 505881 558845 602189 594462 587023 522942 543763 594327 598659 581426
13269 581426 556513 619714 624402 652753 637829 635162 650593 677854 663212 671774 720867 722747
13257 722747 709049 680930 633651 621741 608831 597861 588992 593845 639958 611663 582469 611518
13245 611518 662984 680068 643162 615393 653779 700560 703658 700637 716578 679801 660440 697176
$$ packed form
13328C91485L7197j9068N2237J05915O814q7902j3869N7656Q3699k6706m3364
13317E44094k8325N190M1102n0110N426M0023m776n7952m964O2167M9727l9192
13305E62410m8769K6847l351J251j3887m286N6146J8631k8223n8644O558P4815
13293E89498l7718j9317N958L3794l1134J9918J9271L9593o6712n0280j217l1095
13281D70559n120L1001R441N2964M3344p727p439o4081K0821N0564M332j7233
13269E81426k4913O3201M688K8351j4924k667J5431K7261j4642Q562M9093J880
13257G22747j3698k8119m7279j1910j2910j0970q869M853M6113k8295k9194K9049
13245F11518N1466J7084l6906k7769L8386M6781L098l021J5941l6777j9361L6736
$$ plain form
13233 697176 663257 626277 627696 662210 670411 713859 717640 702946 701101 731745 725304 707961
13221 707961 643552 592417 560724 574771 573190 572939 588372 621125 640223 684497 703365 638240
13209 638240 631279 632618 679319 679053 651111 630740 594511 641090 683411 711139 796619 819010
13197 819010 794424 779947 712193 661059 692982 688327 695632 689721 650431 704568 708909 709265 720853
13184 720853 769551 774886 731743 694743 706839 683125 676134 696812 700610 754527 793631 774415
13172 774415 706436 646035 673652 715169 717816 692553 680159 725528 690334 638139 631476 618308
13160 618308 660978 716193 696951 718878 693662 646301 609449 638141 717386 697682 692277 700310
13148 700310 756050 742085 735496 764611 738124 764261 790529 759263 770481 725476 699990 673460
$$ packed form
13233F97176l3919l6980J419L4514Q201M3448L781j4694j845L0644o441j7343
13221G07961o4409n1135l1693J4047j581k51J5433L2753J9098M4274J8868o5125
13209F38240o961J339M6701k66k7942k0371l6229M6579M2321K7728Q5480K2391
13197H19010k4586j4477o7754n1134L1923m655P305n911l9290N4137M341L56J1588
13184G20853M8698N335m3143l7000J2096k3714o991K0678L798N3917L9104j9216
13172G74415o7979o0401K7617M1517K647k5263j2394M5369l5194n2195o663j3168
13160F18308M2670N5215j9242K1927k5216m7361l6852K8692P9245j9704n405Q033
13148G00310N5740j3965o589K9115k6487K6137K6268l1266J1218m5005k5486k6530
$$ plain form
13136 673460 723083 753418 778177 693218 705224 725964 726158 791948 827966 839743 839843 815302
13124 815302 789227 765628 726747 752213 763165 769446 732902 679331 684781 695728 724422 749938
13112 749938 704622 742764 764600 775251 748763 721693 743154 765364 739492 727987 765566
13101 765566 778079 750785 718324 743811 866779 849715 792216 782263 795024 800585 800503 746287
13089 746287 745075 737770 756032 769703 789052 817207 834903 842370 867216 873135 868329 881867
13077 881867 870381 871094 853483 805543 806960 831449 830561 848242 858252 901282 901637 856681 841814
13064 841814 841445 832654 782501 831611 862859 790541 714910 740628 825634 888276 895250 873035
13052 873035 867258 879095 928728 891039 859325 865225 840382 881086 902802 840842 822007 807412
$$ packed form
13136F73460M9623L0335K4759q4959J2006K0740J94O5790L6018J1777J00k4541
13124H15302k6075k3599l8881K5466J0952O281l6544n3571N450J0947K8694K5516
13112G49938m5316L8142K1836J0651k6488k7070K1461K2210k5872j1505L7579
13101G65566J2513k7294l2461K5487J22968j7064n7499r953J2761N561q2n4216
13089G46287j212p305J8262J3671J9349K8155J7696P467K4846N919m806J3538
13077H81867j1486P13j7611m7940J417K4489q88J7681J0010M3030L55m4956j4867
13064H41814l69q791n0153M9110L1248p2318p5631K5718Q5006O2642O974k2215
13052H73035n777J1837M9633l7689l1714N900k4843M0704K1716o1960j8835j4595
$$ plain form
13040 807412 797969 886959 963486 964392 885228 874672 853238 869431 896968 873923 930385 937260
13028 937260 965210 1000455 946477 901279 927050 995122 1070636 1083701 1074824 1004543 998837 1033489
13016 1033489 1031687 1011379 1002088 1035193 1027042 1029709 1002305 1011898 1065717 1159757 1168346 1070624
13004 1070624 1004969 989913 1037484 1043996 994277 974401 1020518 1029486 1013162 997602 1009996 1030540
12992 1030540 1028066 1105381 1078639 1061143 1093376 1034096 985874 961737 977029 995160 1054043
12981 1054043 1023795 1051875 1017612 999117 1018869 1095092 1132586 1173439 1178074 1117176 1068162
12970 1068162 1100328 1129674 1120794 1046343 1061355 1077550 1052338 1109897 1093946 1059899 1068253 1103178
12958 1103178 1054276 1036308 1038481 1068050 1089136 1164817 1136996 1065810 1074151 1108255 1087530 1136614
$$ packed form
13040H07412r443Q8990P6527R06p9164j0556k1434J6193K7537k3045N6462O875
13028I37260K7950L5245n3978m5198K5771O8072P5514J3065q877p0281n706L4652
13016A033489j802k0308r291L3105q151K667k7404R593N3819R4040Q589r7722
13004A070624o5655j5056M7571O512m9719j9876M6117Q968j6324j5560J2394K0544
12992A030540k474P7315k6742j7496L2233n9280m8222k4137J5292J8131N8883
12981A054043l0248K8080l4263j8495J9752P6223L7494M0853M635o0898m9014
12970A068162L2166K9346q880p4451J5012J6195k5212N7559j5951l4047Q354L4925
12958A103178m8902j7968K173K9569K1086P5681k7821p1186Q341L4104k0725M9084
$$ plain form
12946 1136614 1196102 1180268 1133578 1136455 1116016 1089839 1093315 1171620 1187568 1206323 1204723 1196268
12934 1196268 1153828 1118271 1153708 1135767 1135878 1161865 1180265 1230283 1247198 1230958 1237158 1270838
12922 1270838 1246570 1219444 1263537 1299411 1284864 1275323 1261695 1289974 1333107 1325184 1257721 1261912
12910 1261912 1252802 1238101 1252087 1234476 1288315 1324450 1325688 1300002 1230648 1200339 1204402 1199980
12898 1199980 1185174 1215474 1241238 1275319 1280543 1301466 1319785 1285071 1213904 1205379 1245504 1262651
12886 1262651 1302145 1251111 1249243 1301873 1383026 1438828 1396402 1372541 1322723 1333970 1289834
12875 1289834 1315137 1348419 1376458 1382979 1407454 1387176 1424535 1410584 1381201 1375813 1412872 1437655
12863 1437655 1376789 1358805 1352895 1353783 1372904 1368953 1308344 1293593 1345987 1421524 1414073 1437312
$$ packed form
12946A136614N9488j5834m6690K877k0439k6177L476P8305J5948J8755j600q455
12934A196268m2440l5557L5437j7941J11K5987J8400N0018J6915j6240O200L3680
12922A270838k4268k7126M4093L5874j4547r541j3628K8279M3133p923o7463M191
12910A261912r110j4701J3986j7611N3839L6135J238k5686o9354l0309M063m422
12898A199980j4806L0300K5764L4081N224K0923J8319l4714p1167q525M0125J7147
12886A262651L9494n1034j868N2630Q1153N5802m2426k3861m9818J1247m4136
12875A289834K5303L3282K8039O521K4475k0278L7359j3951k9383n388L7059K4783
12863A437655o0866j7984n910Q88J9121l951o0609j4751N2394P5537p451K3239
$$ plain form
12851 1437312 1484019 1482368 1465635 1439650 1446143 1450444 1439059 1441463 1457690 1508595 1511475 1481989
12839 1481989 1517260 1497466 1459565 1500741 1514154 1491048 1492656 1590766 1565039 1560956 1600528 1638650
12827 1638650 1632433 1642846 1647720 1576060 1562008 1612861 1625559 1684660 1707806 1690790 1641541 1618855
12815 1618855 1556474 1518623 1570213 1630264 1674374 1677608 1691882 1697240 1712554 1685015 1669332 1612235
12803 1612235 1597563 1674992 1683726 1684075 1692107 1729224 1739182 1739870 1754169 1736421 1797874 1799447 1733463
12790 1733463 1699242 1733219 1774929 1756486 1749690 1753202 1759328 1740036 1686224 1687191 1745421 1765917
12778 1765917 1787243 1831987 1844491 1854049 1834818 1792622 1822623 1826497 1892833 1885675 1811869 1822800
12766 1822800 1890323 1913032 1927863 1979211 2024994 2037634 2007977 2034346 1970123 1928659 1959603
$$ packed form
12851A437312M6707j651j6733k5985O493M301j1385K404J6227N0905K880k9486
12839A481989L5271j9794l7901M1176J3413k3106J608R8110k5727m083L9572L8122
12827A638650o217J0413M874p1660j4052N0853J2698N9101K3146j7016m9249k2686
12815A618855o2381l7851N1590O0051M4110L234J4274N358J5314k7539j5683n7097
12803A612235j4672P7429Q734L49Q032L7117R958O88J4299j7748O1453J573o5984
12790A733463l4221L3977M1710j8443o796L512O126j9292n3812R67N8230K0496
12778A765917K1326M4744J2504R558j9231m2196L0001L874O6336p158p3806J0931
12766A822800O7523K2709J4831N1348M5783J2640k9657K6369o4223m1464L0944
$$ plain form
12755 1959603 2067442 2099003 2079944 2128910 2160419 2171304 2237670 2318936 2381920 2348196 2333665
12744 2333665 2306003 2296314 2291926 2289418 2267257 2232860 2202913 2172006 2114163 2087516 2116229 2084034
12732 2084034 2055275 2081421 2059641 2037589 2081998 2138543 2144370 2149049 2161827 2158746 2149902 2147978
12720 2147978 2162208 2163698 2133989 2083931 2100037 2139139 2149558 2183159 2218350 2226343 2251998 2322427
12708 2322427 2310017 2309299 2340526 2347180 2357816 2313195 2304786 2325512 2361067 2399795 2357527 2341658
12696 2341658 2328274 2356356 2397677 2354295 2395543 2437787 2467649 2450644 2437727 2426155 2392228
12685 2392228 2339536 2336660 2424233 2506668 2561105 2613662 2543235 2515041 2486578 2476432 2540889
12674 2540889 2519592 2568424 2582347 2602304 2602214 2569693 2575187 2572807 2587763 2644525 2690518 2696279
$$ packed form
12755A959603J07839L1561j9059M8966L1509J0885O6366Q1266O2984l3724j4531
12744B333665k7662r689m388k508k2161l4397k9947l0907n7843k6647K8713l2195
12732B084034k8759K6146k1780k2052M4409N6545N827M679J2778l081q844j924
12720B147978J4230J490k9709n0058J6106L9102J0419L3601L5191P993K5655P0429
12708B322427j2410p18L1227O654J0636m4621q409K0726L5555L8728m2268j5869
12696B341658j3384K8082M1321m3382M1248M2244K9862j7005j2917j1572l3927
12685B392228n2692k876Q7573Q2435N4437N2557p0427k8194k8463j0146O4457
12674B540889k1297M8832J3923J9957r0l2521N494k380J4956N6762M5993N761
$$ plain form
12662 2696279 2658344 2603990 2611597 2640651 2665344 2666185 2646257 2589830 2576942 2661797 2677185 2656353
12650 2656353 2661748 2691113 2755314 2748039 2716778 2715421 2728617 2778241 2871766 2815714 2790203 2825942
12638 2825942 2856947 2906081 2870497 2894712 2891082 2898482 2913334 2879293 2901457 2912774 2941986 2954648
12626 2954648 2969787 2945509 2944861 2909963 2934210 3046387 3050511 3021591 2973396 3021723 3061537 3061972
12614 3061972 3127304 3125841 3108573 3112593 3188091 3191742 3134618 3196031 3227473 3242443 3247373 3210257
12602 3210257 3225844 3293470 3268791 3281654 3298327 3378376 3387024 3358442 3325486 3380004 3400442
12591 3400442 3426875 3426485 3385855 3392831 3477090 3477197 3491522 3470127 3540319 3566801 3540901 3550488
12579 3550488 3593643 3707884 3761200 3714441 3668311 3684463 3737502 3782152 3861241 3886578 3847563
$$ packed form
12662B696279l7935n4354P607K9054K4693Q41j9928n6427j2888Q4855J5388k0832
12650B656353N395K9365O4201p275l1261j357J3196M9624R3525n6052k5511L5739
12638B825942L1005M9134l5584K4215l630P400J4852l4041K2164J1317K9212J2662
12626B954648J5139k4278o48l4898K4247J12177M124k8920m8195M8327L9814M35
12614C061972O5332j463j7268M020P5498L651n7124O1413L1442J4970M930l7116
12602C210257J5587O7626k4679J2863J6673Q0049Q648k8582l2956N4518K0438
12591C400442K6433l90m0630O976Q4259J07J4325k1395P0192K6482k5900R587
12579C550488M3155J14241N3316m6759m6130J6152N3039M4650P9089K5337l9015
$$ plain form
12568 3847563 3852005 3865007 3807064 3805659 3838956 3900056 3909768 3864864 3868959 3910375 3931313 3895681
12556 3895681 3930034 3989151 4039415 3995282 3988700 4010113 4048042 4061770 4104437 4187401 4189781 4153082
12544 4153082 4212564 4252406 4305650 4335657 4300592 4232236 4283506 4326153 4321876 4359008 4426510
12533 4426510 4474444 4501290 4545790 4590417 4567651 4534265 4573436 4658504 4638862 4657650 4614620
12522 4614620 4640989 4672466 4720037 4756120 4783989 4784935 4789396 4772485 4762487 4768176 4833243 4883417
12510 4883417 4934137 4890628 4920567 4957209 5000242 5009049 5004819 5009178 5025363 5110570 5176846 5233337
12498 5233337 5236673 5279564 5296525 5328204 5357171 5404875 5480572 5443595 5405243 5467377 5570477
12487 5570477 5579871 5603737 5624136 5661399 5712797 5659857 5681576 5761401 5799815 5836102 5865324
$$ packed form
12568C847563M442J3002n7943j405L3297O1100R712m4904M095M1416K0938l5632
12556C895681L4353N9117N0264m4133o582K1413L7929J3728M2667Q2964K380l6699
12544D153082N9482L9842N3244L0007l5065o8356N1270M2647m277L7132O7502
12533D426510M7934K6846M4500M4627k2766l3386L9171Q5068j9642J8788m3030
12522D614620K6369L1477M7571L6083K7869R46M461j6911r998N689O5067N0174
12510D883417N0720m3509K9939L6642M3033Q807m230M359J6185Q5207O6276N6491
12498E233337L336M2891J6961L1679K8967M7704P5697l6977l8352O2134J03100
12487E570477R394K3866K0399L7263N1398n2940K1719P9825L8414L6287K9222
$$ plain form
12476 5865324 5837624 5879132 5837230 5791113 5842332 5904292 6060414 6117812 6100963 6148769 6161796
12465 6161796 6170250 6210679 6235517 6241746 6271114 6300320 6308090 6389352 6509623 6535127 6562839 6537091
12453 6537091 6580043 6624980 6621688 6637086 6667844 6739702 6753780 6786028 6771003 6842188 6906112
12442 6906112 6964052 7001543 6989059 6975280 6997903 7005637 7082860 7200844 7217381 7246573 7382202
12431 7382202 7415286 7392333 7437486 7520295 7537130 7592428 7677794 7753550 7787850 7811179 7836953
12420 7836953 7846339 7951432 7997212 8016322 7996026 8075135 8104911 8174802 8321378 8370454 8376478
12409 8376478 8399375 8418303 8514568 8541324 8533967 8579481 8705925 8768310 8802562 8794964 8812540
12398 8812540 8964341 9077385 9135244 9124843 9113592 9126281 9188324 9269674 9322085 9395531 9450939
$$ packed form
12476E865324k7700M1508m1902m6117N1219O1960J56122N7398j6849M7806J3027
12465F161796Q454M0429K4838O229K9368K9206P770Q1262J20271K5504K7712k5748
12453F537091M2952M4937l292J5398L0758P1858J4078L2248j5025P1185O3924
12442F906112N7940L7491j2484j3779K2623P734P7223J17984J6537K9192J35629
12431G382202L3084k2953M5153Q2809J6835N5298Q5366P5756L4300K3329K5774
12420G836953R386J05093M5780J9110k0296P9109K9776O9891J46576M9076O024
12409H376478K2897J8928R6265K6756p357M5514J26444O2385L4252p598J7576
12398H812540J51801J13044N7859j0401j1251J2689O2043Q1350N2411P3446N5408
$$ plain form
12387 9450939 9520311 9603958 9687435 9755712 9821974 9870572 9927883 10020381 10064580 10068862 10119027
12376 10119027 10195330 10278464 10346221 10409792 10532406 10498308 10502571 10544589 10614324 10735259 10843371
12365 10843371 10888500 10941913 11020520 11130843 11250644 11360901 11445961 11482444 11505111 11599562
12355 11599562 11678030 11713271 11796512 11934109 11977298 11976174 12041604 12147592 12232717 12291307 12380289
12344 12380289 12480120 12541769 12643531 12730165 12815641 12879393 12987141 13040523 13091540 13218442
12334 13218442 13348504 13436765 13485134 13631945 13715532 13796646 13819654 13823882 13888849 13971965 14032851
12323 14032851 14135520 14250477 14292636 14353712 14455920 14560277 14645878 14774141 14847897 14980493
12313 14980493 15171612 15284600 15420230 15498982 15536060 15619243 15713787 15847713 15947767 15998363
$$ packed form
12387I450939O9372Q3647Q3477O8277O6262M8598N7311R2498M4199M282N0165
12376A0119027P6303Q3134O7757O3571J22614l4098M263M2018O9735J20935J08112
12365A0843371M5129N3413P8607J10323J19801J10257Q5060L6483K2667R4451
12355A1599562P8468L5241Q3241J37597M3189j124O5430J05988Q5125N8590Q8982
12344A2380289R9831O1649J01762Q6634Q5476O3752J07748N3382N1017J26902
12334A3218442J30062Q8261M8369J46811Q3587Q1114K3008M228O4967Q3116O0886
12323A4032851J02669J14957M2159O1076J02208J04357Q5601J28263P3756J32596
12313A4980493J91119J12988J35630P8752L7078Q3183R4544J33926J00054N0596
$$ plain form
12303 15998363 16039894 16185931 16280368 16299786 16390113 16493572 16539066 16672921 16816080 16915865
12293 16915865 17031569 17102665 17207695 17372823 17469114 17507461 17588048 17680785 17817986 17918542
12283 17918542 17958505 18047265 18225037 18358517 18404633 18422617 18525249 18608190 18762632 18884729
12273 18884729 19022472 19159337 19194659 19249375 19407455 19449986 19498487 19590310 19651632 19855331
12263 19855331 20019497 20149149 20239416 20385172 20495526 20538407 20608181 20721733 20818503 20903189
12253 20903189 20948677 21059617 21176744 21232061 21311281 21405186 21508210 21614171 21711316 21807764
12243 21807764 21894614 21904578 21961652 22103289 22237193 22257489 22302155 22438879 22540281 22602612
12233 22602612 22611507 22700696 22774325 22839213 22917441 22914048 22974075 23089252 23186012 23211533 23253996
$$ packed form
12303A5998363M1531J46037R4437J9418R0327J03459M5494J33855J43159R9785
12293A6915865J15704P1096J05030J65128R6291L8347Q0587R2737J37201J00556
12283A7918542L9963Q8760J77772J33480M6116J7984J02632Q2941J54442J22097
12273A8884729J37743J36865L5322N4716J58080M2531M8501R1823O1322K03699
12263A9855331J64166J29652R0267J45756J10354M2881O9774J13552R6770Q4686
12253B0903189M5488J10940J17127N5317P9220R3905J03024J05961R7145R6448
12243B1807764Q6850R964N7074J41637J33904K0296M4666J36724J01402O2331
12233B2602612Q895Q9189P3629O4888P8228l393O0027J15177R6760K5521M2463
$$ plain form
12222 23253996 23260212 23233393 23240251 23323583 23460566 23541138 23557637 23560857 23607608 23624486 23610477
12211 23610477 23652359 23687055 23721760 23820858 23869481 23828481 23840981 23883765 23937559 23939845 23930056
12200 23930056 23952533 23990145 23998548 23968671 23934129 23962546 24034158 23978605 23953999 24015996 24040357
12189 24040357 23970341 23895129 23883001 23850225 23846128 23848158 23823457 23764982 23730535 23728361 23673880 23616862
12177 23616862 23590854 23552645 23537172 23495307 23444681 23362259 23283632 23193099 23207895 23237137 23213419
12166 23213419 23152782 23053636 22988887 22929309 22809438 22696435 22562495 22479095 22457818 22360078
12156 22360078 22298005 22295368 22213890 22110125 21999318 21884848 21818901 21763334 21692804 21600972 21552360
12145 21552360 21451289 21306777 21170027 21042332 20969370 20916128 20852468 20744675 20631975 20551621
$$ packed form
12222B3253996O216k6819O858Q3332J36983Q0572J6499L220M6751J6878j4009
12211B3610477M1882L4696L4705R9098M8623m1000J2500M2784N3794K286r789
12200B3930056K2477L7612Q403k9877l4542K8417P1612n5553k4606O1997K4361
12189B4040357p0016p5212j2128l2776m097K030k4701n8475l4447k174n4481n7018
12177B3616862k6008l8209j5473m1865n0626q2422p8627r0533J4796K9242k3718
12166B3213419o0637r9146o4749n9578j19871j13003j33940q3400k1277r7740
12156B2360078o2073k637q1478j03765j10807j14470o5947n5567p0530r1832m8612
12145B1552360j01071j44512j36750j27695p2962n3242o3660j07793j12700q0354
$$ plain form
12135 20551621 20446910 20364753 20303125 20168170 20042825 20005855 19989676 19929345 19838589 19697694
12125 19697694 19600678 19523570 19389484 19246190 19105693 18966805 18831282 18762187 18701473 18560629
12115 18560629 18475367 18351025 18227288 18163619 18041343 17893841 17820040 17788955 17686770 17471910
12105 17471910 17269060 17206660 17121579 17031799 16871583 16768549 16670098 16620832 16480542 16316665
12095 16316665 16208131 16158287 16133199 16082853 15900341 15827174 15729594 15571487 15463390 15341462
12085 15341462 15204937 15108140 15015586 14935828 14835255 14774113 14711176 14600981 14449090 14320746
12075 14320746 14193189 14142234 14060955 13946078 13811930 13705792 13580440 13445210 13351442 13253141
$$ packed form
12135B0551621j04711q2157o1628j34955j25345l6970j6179o0331r0756j40895
12125A9697694r7016p7108j34086j43294j40497j38888j35523o9095o0714j40844
12115A8560629q5262j24342j23737o3669j22276j47502p3801l1085j02185k14860
12105A7471910k02850o2400q5081q9780j60216j03034r8451m9266j40290j63877
12095A6316665j08534m9844k5088n0346j82512p3167r7580j58107j08097j21928
12085A5341462j36525r6797r2554p9758j00573o1142o2937j10195j51891j28344
12075A4320746j27557n0955q1279j14877j34148j06138j25352j35230r3768r8301
$$ [...]
##END NTUPLES=NMR SPECTRUM
##END=
