##TITLE=Analysis number 323810
Compound Code sb 00572
Project Code adrs
Chemist Name ian speare
##JCAMPDX= 6.0         $$ Bruker NMR JCAMP-DX V2.0
##DATA TYPE= NMR SPECTRUM
##DATA CLASS= NTUPLES
##ORIGIN= Bruker BioSpin GmbH
##OWNER= nmr
$$ XWIN-NMR		Version 3.5
$$ Wed Nov  8 15:53:25 2006 GMT Standard Time (UT+0h)  MAYBRIDGE\nmr@NMR_250MHZ
##.OBSERVE FREQUENCY= 250.131544655141
##.OBSERVE NUCLEUS= ^1H
##.ACQUISITION MODE= SIMULTANEOUS (DQD)
##.ACQUISITION SCHEME= undefined
##.AVERAGES= 16
##.DIGITISER RES= 18
##SPECTROMETER/DATA SYSTEM= dpx250
##.PULSE SEQUENCE= zg30
##.SOLVENT NAME= DMSO
##.SHIFT REFERENCE= (INTERNAL, DMSO, 0, 16.522)
##AUDIT TRAIL= $$ (NUMBER, WHEN, WHO, WHERE, WHAT)
$$ ##TITLE= Audit trail, XWIN-NMR		Version 3.5
$$ ##JCAMPDX= 5.01
$$ ##ORIGIN= Bruker BioSpin GmbH
$$ ##OWNER= nmr
$$ C:\u/data/dgb/nmr/ADRS/2450/pdata/1/auditp.txt
$$ ##AUDIT TRAIL=  $$ (NUMBER, WHEN, WHO, WHERE, WHAT)
(   1,<2006-11-08 15:52:58.07 +000>,<MAYBRIDGE\nmr>,<NMR_250MHZ>,
      <created by zg, POWCHK disabled, PULCHK disabled
       configuration hash MD5:
       49 4B E0 1D 92 C2 6B 37 9F E6 65 BC 52 41 86 1D
       data hash MD5: 64K
       5B AC EF E0 CD C5 8A 7D 01 B4 AE BC 34 AA 2B 75>)
(   2,<2006-11-08 15:53:14.04 +000>,<MAYBRIDGE\nmr>,<NMR_250MHZ>,
      <Start of raw data processing
       ef LB = 0.3 FT_mod = 6 PKNL = 1 SI = 32K 
       data hash MD5: 32K
       85 02 76 D0 62 C7 A7 33 35 05 E2 5E 51 EC B8 21>)
(   3,<2006-11-08 15:53:15.94 +000>,<MAYBRIDGE\nmr>,<NMR_250MHZ>,
      <apk 
       data hash MD5: 32K
       F7 9A C7 D2 E5 B4 A4 AB 68 1A 6B D4 CC FE 55 73>)
(   4,<2006-11-08 15:53:16.88 +000>,<MAYBRIDGE\nmr>,<NMR_250MHZ>,
      <abs ABSG = 5 
       data hash MD5: 32K
       80 49 C5 9C 45 7D 66 E5 A4 44 36 52 EA 49 B3 DF>)
$$ ##END=
$$ 
$$ hash MD5
$$ 93 AA 4B 77 35 D8 21 F9 A1 CA 15 3A FD DF 98 D6
##$RELAX= 
##$RELAX= 
##$RELAX= 
##$RELAX= 
##$RELAX= 
##$RELAX= 
##$RELAX= 
$$ Bruker specific parameters
$$ --------------------------
##$DU= <C:\u>
##$EXPNO= 2450
##$NAME= <ADRS>
##$PROCNO= 1
##$TYPE= <nmr>
##$USER= <dgb>
##$AMP= (0..31)
100 100 100 100 100 100 100 100 100 100 100 100 100 100 100 100 100 100 
100 100 100 100 100 100 100 100 100 100 100 100 100 100 
##$AQSEQ= 0
##$AQ_mod= 3
##$AUNM= <au_zg>
##$AUTOPOS= <42 >
##$BF1= 250.13
##$BF2= 250.13
##$BF3= 250.13
##$BF4= 250.13
##$BF5= 500.13
##$BF6= 500.13
##$BF7= 500.13
##$BF8= 500.13
##$BYTORDA= 1
##$CFDGTYP= 0
##$CFRGTYP= 5
##$CHEMSTR= <none>
##$CNST= (0..31)
1 1 145 1 1 1 1 1 1 1 1 1 1 1 1 1 1 1 1 1 1 1 1 1 1 1 1 1 1 1 1 1 
##$CPDPRG= <>
##$CPDPRG1= <>
##$CPDPRG2= <>
##$CPDPRG3= <>
##$CPDPRG4= <mlev>
##$CPDPRG5= <mlev>
##$CPDPRG6= <mlev>
##$CPDPRG7= <mlev>
##$CPDPRG8= <mlev>
##$CPDPRGB= <>
##$CPDPRGT= <>
##$D= (0..31)
0 1 0 0 0 0 0 0 0 0.06 0 0 0 0 0 0 0.0002 0 0 0 0 0 0 0 0 0 0 0 0 0 0 
0 
##$DATE= 1163001176
##$DBL= (0..7)
120 120 120 120 120 120 120 120 
##$DBP= (0..7)
150 150 150 150 150 150 150 150 
##$DBP07= 0
##$DBPNAM0= <>
##$DBPNAM1= <>
##$DBPNAM2= <>
$$ [...]
##$SUBNAM7= <"">
##$SUBNAM8= <"">
##$SUBNAM9= <"">
##$SW= 20.6930455092707
##$SWIBOX= (0..15)
0 0 3 0 0 0 0 0 0 0 0 0 0 0 0 0 
##$SW_h= 5175.983436853
##$TD= 65536
##$TD0= 1
##$TE= 683.16
##$TE2= 300
##$TE3= 300
##$TEG= 300
##$TL= (0..7)
0 120 120 120 120 120 120 120 
##$TP= (0..7)
150 150 150 150 150 150 150 150 
##$TP07= 0
##$TPNAME0= <>
##$TPNAME1= <>
##$TPNAME2= <>
##$TPNAME3= <>
##$TPNAME4= <>
##$TPNAME5= <>
##$TPNAME6= <>
##$TPNAME7= <>
##$TPOAL= (0..7)
0.5 0.5 0.5 0.5 0.5 0.5 0.5 0.5 
##$TPOFFS= (0..7)
0 0 0 0 0 0 0 0 
##$TUNHIN= 0
##$TUNHOUT= 0
##$TUNXOUT= 0
##$USERA1= <user>
##$USERA2= <user>
##$USERA3= <user>
##$USERA4= <user>
##$USERA5= <user>
##$V9= 5
##$VALIST= <valist>
##$VCLIST= <CCCCCCCCCCCCCCC>
##$VD= 0
##$VDLIST= <DDDDDDDDDDDDDDD>
##$VPLIST= <PPPPPPPPPPPPPPP>
##$VTLIST= <TTTTTTTTTTTTTTT>
##$WBST= 1024
##$WBSW= 4
##$XGAIN= (0..3)
0 0 0 0 
##$XL= 0
##$YL= 0
##$YMAX_a= 415545
##$YMIN_a= -312974
##$ZGOPTNS= <>
##$ZL1= 120
##$ZL2= 120
##$ZL3= 120
##$ZL4= 120
##$ABSF1= 16.522
##$ABSF2= -4.171173
##$ABSG= 5
##$ABSL= 3
##$ALPHA= 0
##$AQORDER= 0
##$ASSFAC= 0
##$ASSFACI= 0
##$ASSFACX= 0
##$ASSWID= 0
##$AUNMP= <proc_1d>
##$AZFE= 0.1
##$AZFW= 0.1
##$BCFW= 0
##$BC_mod= 0
##$BYTORDP= 0
##$COROFFS= 0
##$CY= 12.5
##$DATMOD= 1
##$DC= 0
##$DFILT= <>
##$DTYPP= 0
##$F1P= 14.0000005364418
##$F2P= -0.99999901652339
##$FCOR= 0.5
##$FTSIZE= 32768
##$FT_mod= 6
##$GAMMA= 0
##$GB= 0
##$INTBC= 1
##$INTSCL= 1
##$ISEN= 128
##$LB= 0.3
##$LEV0= 0
##$LPBIN= 0
##$MAXI= 10000
##$MC2= 0
##$MEAN= 0
##$ME_mod= 0
##$MI= 0
##$NCOEF= 0
##$NC_proc= -4
##$NLEV= 6
##$NOISF1= 0
##$NOISF2= 0
##$NSP= 0
##$NTH_PI= 0
##$NZP= 0
##$OFFSET= 16.522
##$PC= 1
##$PHC0= -45.99699
##$PHC1= -3.250984
##$PH_mod= 1
##$PKNL= yes
##$PPARMOD= 0
##$PSCAL= 4
##$PSIGN= 0
##$REVERSE= no
##$SF= 250.13
##$SI= 32768
##$SIGF1= 0
##$SIGF2= 0
##$SINO= 400
##$SIOLD= 32768
##$SREGLST= <1H.DMSO>
##$SSB= 0
##$STSI= 32768
##$STSR= 0
##$SW_p= 5175.98343685301
##$SYMM= 0
##$S_DEV= 0
##$TDeff= 65536
##$TDoff= 0
##$TI= <Analysis number 999999
Compound Code 99
Book Reference 9
Project Code 9>
##$TILT= no
##$TM1= 0
##$TM2= 0
##$TOPLEV= 0
##$USERP1= <user>
##$USERP2= <user>
##$USERP3= <user>
##$USERP4= <user>
##$USERP5= <user>
##$WDW= 1
##$XDIM= 32768
##$YMAX_p= 591084886
##$YMIN_p= -398354
$$ End of Bruker specific parameters
$$ ---------------------------------
##NTUPLES= NMR SPECTRUM
##VAR_NAME=  FREQUENCY,     SPECTRUM/REAL,   SPECTRUM/IMAG
##SYMBOL=    X,             R,               I
##VAR_TYPE=  INDEPENDENT,   DEPENDENT,       DEPENDENT
##VAR_FORM=  AFFN,          ASDF,            ASDF
##VAR_DIM=   32768,         32768,           32768
##UNITS=     HZ,            ARBITRARY UNITS, ARBITRARY UNITS
##FACTOR=    0.157963299565203, 1,           1
##FIRST=     4132.6476996994, 0,             0
##LAST=      -1043.33573715361, 0,           0
##MIN=       -1043.33573715361, -398354,     0
##MAX=       4132.6476996994, 591084886,     0
$$ Real data points
##PAGE= N=1
##DATA TABLE= (X++(R..R)), XYDATA
$$ [...]
16392h9036j06221n5388m308J12579M4640J3140N6807n0381n6596J8546L6361
$$ -89036 -195257 -250645 -254953 -142374 -97734 -84594 -27787 -78168 -134764 -116218 -79857
16381g9857j2277J30428M5429q353n7759M6778M9368j0772k6155j09816L6438
$$ -79857 -92134 38294 83723 75370 17611 64389 113757 102985 76830 -32986 3452
16370C452l9360r5304m340J4997Q9331K5771J9335J9365j05689j8650N0068M1845
$$ 3452 -35908 -131212 -135552 -120555 -31224 -5453 13882 33247 -72442 -91092 -41024 821
16358H21k9261r4077j7005Q0950O9657Q561j7462o1453L0293R8353l1337n7697
$$ 821 -28440 -122517 -139522 -58572 11085 19646 2184 -59269 -28976 69377 38040 -19657
16346a9657q6821J08573P2284m9534l5581J63M829o835K4543O982j8461k4522
$$ -19657 -106478 2095 74379 24845 -10736 -10573 -5744 -12579 11964 18946 485 -24037
16334b4037q2063n904K3739l4852p9473p8353O9211Q3475J52996j8991r9582L398
$$ -24037 -106100 -112004 -88265 -123117 -202590 -280943 -211732 -128257 24739 5748 -93834 -90436
16322i0436l9911k703l4702l2057L248J27404J36864J07371n6965j17171Q261
$$ -90436 -130347 -133050 -167752 -199809 -196561 -69157 67707 175078 118113 942 9203
16311I203K6224n7503J2062J2625R2017L712l3410j10555n9337m1507K5596m0815
$$ 9203 35427 -22076 -10014 2611 94628 98340 64930 -45625 -104962 -146469 -120873 -161688
16299a61688o817P2976N374L5626J5380K8692J1490N0037P346L1263j9471m2133
$$ -161688 -168505 -95529 -90155 -54529 -39149 -10457 1033 51070 58416 89679 70208 28075
16287B8075L7787O826J1995q8824K7118J0563m8084k6202J615L1394m611L1239
$$ 28075 65862 72688 84683 -4141 22977 33540 -14544 -40746 -39131 -7737 -12348 18891
16275A8891R0281k0242m2907j4868m4442q1393M453P0537K6084J8306M3129k4625
$$ 18891 109172 88930 46023 31155 -13287 -94680 -90227 -19690 6394 24700 67829 43204
16263D3204P775L7123k943p09O5563O4630r2529k6381o5281p9600N2480N3321
$$ 43204 50979 88102 85159 84450 150013 214643 122114 95733 30452 -49148 3332 56653
16251E6653K7796R200p4371N4394o1890l3538N5134J6553K970J17027p7997r4124
$$ 56653 84449 93649 19278 73672 11782 -21756 33378 49931 52901 169928 91931 -2193
16239b193j3752M1753k2647j14110q4901L0096M9918R4722L9586l6530j26259
$$ -2193 -15945 25808 3161 -110949 -195850 -165754 -115836 -21114 18472 -18058 -144317
16228a44317l0278k6293R6878P1277J37226o905J7724o7231k04377l2635m400
$$ -144317 -174595 -200888 -104010 -32733 104493 97588 115312 48081 -156296 -188931 -193331
16217a93331k2645Q2187O7320J04629j0346j8301k7259P0461m76J156L7608p9995
$$ -193331 -215976 -133789 -66469 38160 27814 9513 -17746 52715 52239 53395 91003 11008
16205A1008j0915n924n2865J25169M6158J8416J6891p4103q2614K4718J6402N9558
$$ 11008 93 -5831 -58696 66473 112631 131047 147938 73835 -8779 15939 32341 91899
16193I1899m7347n6172L3267K6998j4274M432m5387n0803J20754Q2931l6335Q593
$$ 91899 44552 -11620 21647 48645 34371 38803 -6584 -57387 63367 146298 109963 118556
16181A18556r4059l4560J1927n7146n1295n9470K4545M2061N1327k2315j33353
$$ 118556 24497 -10063 1864 -55282 -106577 -166047 -141502 -99441 -48114 -70429 -203782
16170b03782k6226J05276Q6158J968j8319Q1422N2404Q345q029r5935j5588O2657
$$ -203782 -230008 -124732 -38574 -36606 -54925 26497 78901 87246 79217 -16718 -32306 30351
16158C0351p04P8757J5630R969j6122k4283J0032Q3429l4273o4598n1286l4283
$$ 30351 29647 108404 124034 134003 117881 93598 103630 187059 152786 88188 36902 2619
16146B619m9670J8542o589P1944L9485R397o9625j07724l9474J02905k0677j18997
$$ 2619 -47051 -28509 -35098 36846 76331 85728 16103 -91621 -131095 -28190 -48867 -167864
16134a67864j39042l5927J76929J80636P0645j3871r8821p0103J16038L2768m3550
$$ -167864 -306906 -342833 -165904 14732 85377 71506 -27315 -97418 18620 51388 7838
16123G838j8534n3168j08850J52112J36665N669r0987q6238l5052k9996J29422
$$ 7838 -10696 -63864 -172714 -20602 116063 121732 30745 -55493 -90545 -120541 8881
16112H881K8679M7011P7116j9332n9739o0706j25322n0260P0340J37872K4291
$$ 8881 37560 84571 161687 142355 82616 21910 -103412 -153672 -83332 54540 78831
16101G8831p4709M0290m4058M9937m079L1110O0657n2243j17114m3977p609P5487
$$ 78831 4122 44412 354 50291 46212 77322 137979 85736 -31378 -75355 -82964 -7477
16089g477Q178k6101J14746K7537K2608O139L8216L565J06678O9914k01690j92457
$$ -7477 701 -25400 89346 116883 139491 145630 183846 187411 294089 364003 162313 -30144
16077c0144l1820K6586Q2828P0521O4485Q98L382n9638K327l4740q804m597j43
$$ -30144 -61964 -35378 47450 117971 182456 183354 186736 127098 129425 94685 85881 81284 81141
16064H1141l5748L6661N3902K6231j11211k5438L4027k265l4846o810K7380j7034
$$ 81141 45393 82054 135956 162187 50976 25538 59565 57300 22454 15644 43024 25990
16052B5990n8952m0841p4189N6305Q595M5365r1008j0763P0029N0815N0854K9359
$$ 25990 -32962 -73803 -147992 -91687 -83092 -37727 -128735 -139498 -69469 -18654 32200 61559
16040F1559j18077o930M0644o7016m7687M2796K3677P4193K2116l2187m3945Q178
$$ 61559 -56518 -63448 -22804 -89820 -137507 -94711 -71034 3159 25275 -6912 -50857 -42679
16028d2679M177J17458P3857n5414l5204O3261n0350p3723N4504J29989M418n1134
$$ -42679 -38502 78956 152813 97399 62195 125456 75106 1383 55887 185876 190294 139160
16016A39160r272J38124n8553n7224r6101p2765L8172p874o1040K6403k6650l1104
$$ 139160 129888 268012 209459 152235 56134 -16631 21541 13667 -47373 -20970 -47620 -78724
16004g8724Q2338j2841j0674p8307J4855j3233m1059O0166O2100K6456j5864R6523
$$ -78724 3614 -9227 -19901 -98208 -83353 -96586 -137645 -77479 -15379 11077 -4787 91736
15992I1736N5821J7601j7928r0435N7249R1723M921n9434K6190L7994l7689J9935
$$ 91736 147557 165158 147230 56795 114044 205767 210688 151254 177444 215438 177749 197684
15980A97684q0725j02922l8354o88O6520L6118p3821K0815K3352R0594O1648k0258
$$ 197684 116959 14037 -24317 -25005 41515 77633 3812 24627 47979 138573 200221 179963
15968A79963K9249n8051j435L406l6406m5819Q57l2807l0189q910q3265J28944
$$ 179963 209212 151161 149726 153132 116726 70907 71764 38957 8768 -142 -83407 45537
15956D5537J16580J232p9139p0197k5227O740J3057P4198M141j12537j22436k4394
$$ 45537 162117 163349 84210 14013 -11214 -4474 8583 82781 86922 -25615 -148051 -172445
15944a72445P2824J19580O4897M2394o1733o2056R40l3722l9586K2419M9004n918
$$ -172445 -99621 19959 84856 127250 65517 3461 4401 -29321 -68907 -46488 2516 -3402
15932c402N082j8955L4833P9385J4167l3491q0030P509L3659K3223L1524O3442
$$ -3402 1680 -17275 17558 96943 111110 77619 -2411 5098 38757 61980 93504 156946
15920A56946m2519q7828o4830M8390R2686m264j12615m7800L2886R8036R3689
$$ 156946 114427 26599 -38231 10159 102845 98581 -14034 -61834 -28948 69088 162777
15909A62777j4138m4476P918J4395j23209r245l9670J9673K0762M7017P4816J4871
$$ 162777 148639 104163 112081 126476 3267 -5978 -45648 -25975 -5213 41804 116620 131491
15897A31491K7129j3758P5980p0155j10277K7812l8796j45529p3670J40306O6600
$$ 131491 158620 144862 220842 150687 40410 68222 29426 -116103 -189773 -49467 17133
15886A7133M2055k2116j4864j6195j111M8611J05593l3850j26881j2557J27797
$$ 17133 59188 37072 22208 6013 4902 53513 159106 125256 -1625 -14182 113615
15875A13615J43913K6864j9039p1110p9168n8875K8914j6143l6816l6126p1020
$$ 113615 257528 284392 265353 194243 115075 56200 85114 68971 32155 -3971 -74991
15864g4991P94K8509k1795Q153k4054m8920J3347J0374K4396L4130J7065j3534
$$ -74991 -74197 -45688 -67483 -59330 -83384 -132304 -118957 -108583 -84187 -50057 -32992 -46526
15852d6526o299J37738r7737r9174N2887P5563n8029K1427P41q4942l6103J00731
$$ -46526 -52825 84913 -12824 -111998 -59111 16452 -41577 -20150 -19409 -104351 -140454 -39723
15840c9723O6624k9874k0063J897p2460k6757J48734K9958q50l2651m3435K8245
$$ -39723 26901 -2973 -23036 -21139 -93599 -120356 28378 58336 57486 24835 -18600 9645
15828I645q005K3458j7741P7367j9889j18879l567j1441L7138O630J1042O9539
$$ 9645 1640 25098 7357 84724 64835 -54044 -57611 -69052 -31914 -25284 -14242 55297
15816E5297M3352J4328Q273m9892j01947k0780m0757l8307K0435J36074J1636
$$ 55297 98649 112977 121250 71358 -30589 -51369 -92126 -130433 -109998 26076 37712
15805C7712k9525p2254M4309O3697j8957P1009m9870q3725R553L8685N3094Q7205
$$ 37712 8187 -64067 -19758 43939 24982 95991 46121 -37604 -28051 10634 63728 150933
15793A50933n6408j09501J6910j5633J4691l4255l1841m2725j3942K1607R7688
$$ 150933 94525 -14976 1934 -13699 992 -33263 -65104 -107829 -121771 -100164 -2476
15782b476J16451M9403J7296J4728l260l7975j51047j20127n9400m3287k9685
$$ -2476 113975 163378 180674 195402 192142 154167 3120 -117007 -176407 -219694 -249379
15771b49379Q2636J63286J66611o1702l1823j6648L0923o9034k9828l9362R3517
$$ -249379 -166743 -3457 163154 101452 69629 52981 83904 14870 -14958 -54320 39197
15760C9197Q6714J3730k0821m4056n3859p9221J1603K4289O7612p5554l9461k4499
$$ 39197 125911 139641 118820 74764 20905 -58316 -46713 -22424 45188 -30366 -69827 -94326
15748i4326K2396N3845J49957K2544o1274m8496M1566O3631P6707j23217j15108
$$ -94326 -71930 -18085 131872 154416 93142 44646 86212 149843 226550 103333 -11775
15737a1775P975N9782M9923K280L4843k5008q9015K9033j04372j07903P5176O6440
$$ -11775 -3800 55982 105905 108185 143028 118020 29005 58038 -46334 -154237 -79061 -12621
15725a2621K7803o5580P2214N5936J3808k6960N7223J198J2196L7012Q90r26j8824
$$ -12621 15182 -50398 21816 77752 91560 64600 121823 123021 135217 172229 173119 172193 153369
15712A53369j16633n4695K2526O8362n031o9024M8777K9087j27630j6372N6024
$$ 153369 36736 -17959 4567 72929 67898 -1126 47651 76738 -50892 -67264 -11240
15701a1240J9600l4659K6991J74939n4615k6792K2280p9349k6121L115N0076q2870
$$ -11240 8360 -26299 692 175631 121016 94224 116504 37155 11034 14149 64225 -18645
15689a8645r5902J07670j5453l9434P4218Q3926k6589j26177j9688R5212O916
$$ -18645 -114547 -6877 -22330 -61764 12454 96380 69791 -56386 -76074 19138 26054
15678B6054l9468R8474K9023R3143M2440o2785n8435o8563K0877M7553k3237J4573
$$ 26054 -13414 85060 114083 207226 249666 186881 128446 59883 80760 128313 105076 119649
15666A19649n8089j67572o5082j919K2426J11327K0958O3163K7886j14418o7613
$$ 119649 61560 -106012 -171094 -173013 -150587 -39260 -18302 44861 72747 -41671 -109284
15655a09284m9594m0029O4866J6446j3962Q7466K8369Q22k8464J13574L4208j02264
$$ -109284 -158878 -198907 -134041 -117595 -131557 -44091 -15722 -14900 -43364 70210 104418 2154
15643B154r8931l3729k873L3663J54212M7591j29727j44176j1661p6873P0872
$$ 2154 -96777 -130506 -133379 -99716 54496 102087 -27640 -171816 -183477 -260350 -189478
15632a89478N5428N7317J52813J31308q4518j25079o7269P4144J30695J3014m7346
$$ -189478 -134050 -76733 76080 207388 122870 -2209 -69478 4666 135361 148375 101029
15621A01029m7400p1856q0942Q4627k3258m5799K951K263Q5304L3929n8395j21810
$$ 101029 53629 -18227 -99169 -14542 -37800 -83599 -80648 -78385 6919 40848 -17547 -139357
15609a39357j4127o2351Q612R9585P4490o636k7936O1011L0215m4812m7139p8393
$$ -139357 -153484 -215835 -207223 -107638 -33148 -39784 -67720 -6709 23506 -21306 -68445 -146838
15597a46838p5250J7188M1894K4664Q1737Q0643N0305l1119J9224o598j30755
$$ -146838 -222088 -204900 -163006 -138342 -56605 24038 74343 43224 62448 55850 -74905
15586g4905r236K3452K4431J29573P8861j05911q4783p740P7442M9955K5331l0005
$$ -74905 -84141 -60689 -36258 93315 172176 66265 -18518 -26258 51184 101139 126470 96465
15574I6465m1163L16p079O5937R7851M6969l5848l8876k0118n736o2419Q6599
$$ 96465 55302 55618 48539 114476 212327 259296 223448 184572 164454 158718 96299 182898
15562A82898Q0951l3860p7847l4189m1764r6181o799k9866K2897L6662n0165q6076
$$ 182898 263849 229989 152142 117953 76189 -19992 -26791 -56657 -33760 2902 -47263 -133339
15550a33339J12653K6214J5053m2045n0444K1400J01720k3505j4417r509q6814
$$ -133339 -20686 5528 20581 -21464 -71908 -50508 51212 27707 13290 3781 -83033
15539h3033K3767J34450N7168r6253Q1457O8736K198k6678n4333J2474M6107j9025
$$ -83033 -59266 75184 132352 36099 117556 186292 188490 161812 107479 119953 166060 147035
15527A47035J8962N2840J1480m7982r2844j18618l432O6851R078q6089q587K7836
$$ 147035 165997 218837 230317 182335 89491 -29127 -32559 34292 43370 -42719 -51306 -23470
15515b3470j1850n0054K4417J940o9365K7084J19454L5729o7161k1209K2012j8866
$$ -23470 -35320 -85374 -60957 -59017 -128382 -101298 18156 53885 -13276 -34485 -12473 -31339
15503c1339o9049O2630M165j37471j4018Q0036K2736j9298N3560M3831P2999K4327
$$ -31339 -100388 -37758 -33593 -171064 -185082 -105046 -82310 -101608 -48048 -4217 68782 93109
15491I3109o8438m3782K6209N5345N0613p1519k2623J39009K3167q1402k5366
$$ 93109 24671 -19111 7098 62443 113056 41537 18914 157923 181090 99688 74322
15480G4322J9983Q1976J7801p8118n8383k8263M2144L3475r1798n8054o6552Q255
$$ 74322 94305 176281 194082 115964 57581 29318 71462 104937 13139 -44915 -111467 -103212
15468a03212L4150L7652L5269m0207o363l5719Q6208N0983J4531P6792j6248j54463
$$ -103212 -69062 -31410 3859 -36348 -42711 -78430 7778 58761 73292 150084 133836 -20627
15456b0627M081J42313O7027o7542n5666j06169p6291J19491R9396p1487j56247
$$ -20627 -16546 125767 192794 125252 69586 -36583 -112874 6617 106013 34526 -121721
15445a21721K569p115o3690J4970M0416L2243Q5884Q4512l1452j8506m053k2455
$$ -121721 -119152 -126267 -189957 -174987 -134571 -102328 -16444 68068 36616 18110 14057 -8398
15433h398m3472L0630j3622J21370j7013o6028O0319J32458L5127R311r9855m737
$$ -8398 -51870 -21240 -34862 86508 69495 3467 63786 196244 231371 240682 140827 136090
15421A36090P4867o2162p1846m4140p1080P6221P7765P6701M264n2806k3191n7367
$$ 136090 210957 148795 76949 32809 -38271 37950 115715 192416 196680 143874 120683 63316
15409F3316j3290k0744J6954p6415p9901K08M0215Q0863K9189M843M1123j7446
$$ 63316 50026 29282 46236 -30179 -110080 -109872 -69657 11206 40395 45238 86361 68915
15397F8915m4391j1709k2413p1294o956K4823K3293l7701K8270J8185o2614Q6865
$$ 68915 24524 12815 -9598 -80892 -87848 -63025 -39732 -77433 -49163 -30978 -93592 -6727
15385f727j9465k5745L8297R2413M3611j74118j07197N1432J7172K681K8367n0503
$$ -6727 -26192 -51937 -13640 78773 122384 -51734 -158931 -107499 -90327 -87646 -59279 -109782
15373a09782N9393P6475O3324n6503k6321N905l6236r3273j4627q205J48650L1679
$$ -109782 -50389 26086 89410 32907 6586 12491 -23745 -117018 -131645 -139850 8800 40479
15361D0479L8142k5471p5437O122r497N0011L6960j24686k7224J3483j9511j2507
$$ 40479 78621 53150 -22287 -16165 -25662 24349 61309 -63377 -90601 -77118 -96629 -109136
15349a09136j2886R8761O7416P2389m1148p6092l9614q7871J09921J33844J1541
$$ -109136 -122022 -23261 44155 116544 75396 -696 -40310 -128181 -18260 115584 127125
15338A27125l6690n0575n5489P8548M2768O4157o0709m0313J17928Q7767P2682
$$ 127125 90435 39860 -15629 62919 105687 169844 109135 68822 186750 274517 347199
15327C47199p0048q6155p9636n5122m2475p6496O2639j2765q7188O9845P4532
$$ 347199 277151 190996 111360 56238 13763 -62733 -94 -12859 -100047 -30202 44330
15316D4330M640l2839K520J6436J47026L9555q1939k7601L8915q374m7922j7749
$$ 44330 48970 16131 18651 35087 182113 221668 139729 112128 151043 142669 94747 76998
15304G6998R9971p41l6624L4004Q567l7179m0660J177k4213O081P8623k4193l3078
$$ 76998 176969 176228 139604 173608 182175 144996 104336 105513 81300 87381 166004 141811 108733
15291A08733N7657O7663j63019j6285j8183j10697k8897K9876M1703O3274O1453
$$ 108733 166390 234053 71034 54749 36566 -74131 -103028 -73152 -31449 31825 93278
15280I3278q243j23332j5718J00091P2235L3050k3390N5800L2906Q2510j17903
$$ 93278 85035 -38297 -54015 46076 118311 151361 127971 183771 216677 299187 181284
15269A81284j42424j9941k525j0806j830o8100p29L0156N1563j447J5191N7849
$$ 181284 38860 18919 16394 5588 3758 -64342 -65071 -34915 16648 15201 30392 88241
15257H8241L2754l0804J4757M4606n1880J9969L8889n3635j42576p8575R0078
$$ 88241 120995 90191 104948 149554 97674 117643 156532 102897 -39679 -118254 -28176
15246b8176O2287K11M2589k404n3542l6653o4087K604N2599r384q369L4883K9698
$$ -28176 34111 34322 76911 74507 20965 -15688 -79775 -77171 -24572 -33956 -42325 -7442 22256
15233B2256n4671k941K7921l8592O7101O8168q102l5935Q0340P3953K7351o673
$$ 22256 -32415 -35356 -7435 -46027 21074 89242 81140 45205 125545 199498 226849 220176
15221B20176K4276j8656M8182n0471j18367m5640n5793r6550k4338J06060O1793
$$ 220176 244452 225796 273978 223507 105140 59500 3707 -92843 -117181 -11121 50672
15210E0672j17369J676R143J34539k0171m6324l7971M9703l2159q2849l1481o1877
$$ 50672 -66697 -65021 -55878 78661 58490 12166 -25805 23898 -8261 -91110 -122591 -184468
15198a84468M307J03077J12180k2613l7119J0959n8103O8247j8853q1P4087p143
$$ -184468 -180161 -77084 35096 12483 -24636 -13677 -71780 -3533 -22386 -22467 51620 44477
15186D4477N523r3881L2585K5454k4597l3700j104l0634p0693m6553M547K603
$$ 44477 50000 -43881 -11296 14158 -10439 -44139 -45243 -75877 -146570 -193123 -188576 -185973
15174a85973L5616K8232l7845k8692P2187J0041p2758N0645O5210N6171k265M2664
$$ -185973 -150357 -122125 -159970 -188662 -116475 -106434 -179192 -128547 -63337 -7166 -9431 33233
15162C3233J0662o1719l6248l1715J60031K6669m7247L7329j22247L4957J5125
$$ 33233 43895 -17824 -54072 -85787 74244 100913 53666 90995 -31252 3705 18830
15151A8830J3553K0240N1790l3516j19250J8552J75p1192J42943L364m4480P118
$$ 18830 32383 52623 104413 70897 -48353 -29801 -29626 -100818 42125 45489 1009 8127
15139H127l1854Q16j523l9348k9724M875K9525M4986p8903K6139J43160M9030
$$ 8127 -23727 -22911 -24434 -63782 -93506 -88631 -59106 -14120 -93023 -66884 76276 125306
15127A25306K153q5106r5940P911J8783M0005l4079l7647p016Q1361M1439L24
$$ 125306 127459 42353 -53587 -45676 -26893 13112 -20967 -58614 -65630 15731 57170 57494
15115E7494q4211o490p63l6990P4448M8658K8999J9448k28014j91244J27770Q8576
$$ 57494 -26717 -33207 -33970 -70960 3488 52146 81145 100593 -127421 -318665 -190895 -102319
15103a02319P3701N1571M0098M1353k725j6700j0660o598o963N2526J07093K8909
$$ -102319 -28618 22953 63051 104404 101679 84979 74319 67721 60758 113284 220377 249286
15091B49286l9780Q7037M1402j40146o3242j51699j1579M8276J1715l2445p5294
$$ 249286 209506 296543 337945 197799 134557 -17142 -28721 19555 31270 -1175 -76469
15080g6469R8106N843N9403J7134N3426k5067p3961n8776O6100J21360l2531q7013
$$ -76469 21637 27480 86883 104017 157443 132376 58415 -361 65739 187099 154568 67555
15068F7555n61j7727j889N3632Q7890o0098k1293q8984L0908J01164O4563J5620
$$ 67555 66994 49267 47378 101010 188900 128802 107509 18525 49433 150597 215160 230780
15056B30780j19549j84407O010J50269Q5570O6424O6574j74266j11041J15675
$$ 230780 111231 -73176 -67166 83103 168673 235097 301671 127405 16364 132039
15046A32039j6416M1678m0161o2494N3545N5515J9772k5813o5041k7569p490L5637
$$ 132039 115623 157301 117140 54646 108191 163706 183478 157665 92624 65055 57565 93202
15034I3202m5317N0433k456k1830R173m7115j5934j7116j19746l1291j164K1381
$$ 93202 47885 98318 95862 74032 83205 36090 20156 3040 -116706 -147997 -149161 -127780
15022a27780J04195j2313m9039l5232O9962J58515K5083m3853l298j51761n7906
$$ -127780 -23585 -35898 -84937 -120169 -50207 108308 133391 89538 86240 -65521 -123427
15011a23427J38817k5039K6506K3056q8400r9119l4943j7434J16284J17955m0952
$$ -123427 15390 -9649 16857 39913 -48487 -147606 -182549 -199983 -83699 34256 -6696
15000f696k0832p3342m1157p719L0907k6416N8987N7232J9225k6532M4879M4002
$$ -6696 -27528 -100870 -142027 -149746 -118839 -145255 -86268 -29036 -9811 -36343 8536 52538
14988E2538M1006j1676j0789m2410J5535k0814j6312J03458M3667M2515q7992
$$ 52538 93544 81868 71079 28669 44204 23390 7078 110536 154203 196718 108726
14977A08726n6357m8263n8021m5386N8498L6405R8686N7036m6183j36077j18921
$$ 108726 52369 4106 -53915 -99301 -40803 -4398 94288 151324 105141 -30936 -149857
14966a49857L8186l89J58274K607r264n5752m0496N4984Q4311N5660p1925J9541
$$ -149857 -111671 -112060 46214 48821 39557 -16195 -56691 -1707 82604 138264 66339 85880
14954H5880J06575l1667R2320j11267p0362M0201O469p690p6625k8151o9767j7683
$$ 85880 192455 160788 253108 141841 71479 111680 118149 110459 33834 5683 -64084 -81767
14942h1767p39L7316R0447R3147j1847j8450m2420l696r33q9144q381J11026O9504
$$ -81767 -82506 -45190 45257 138404 126557 108107 65687 61991 61058 -28086 -36467 74559 144063
14929A44063n505K9060N9933L9093p5498j19242l1960K783M5978m1564L6090N3829
$$ 144063 138558 167618 227551 266644 191146 71904 39944 42727 88705 47141 83231 137060
14917A37060O4963K3852K208O7585o7120j15929m8187O789j01541L0896J47594
$$ 137060 202023 225875 228083 295668 228548 112619 64432 71221 -30320 576 148170
14906A48170R0692K4037j98761q3643M5520L1394j00949J8448K116r5872O3257
$$ 148170 238862 262899 64138 -19505 26015 57409 -43540 -25092 -22976 -118848 -55591
14895e5591M8634J43634O909k5310j803k0537L226N442K737l4403j8445R7586
$$ -55591 -6957 136677 143586 118276 116473 95936 99162 104604 107341 72938 54493 152079
14883A52079L1034q2200m9150J00523n5887r9027O5590P5518j8894j6355m6562
$$ 152079 183113 100913 51763 152286 96399 -2628 62962 138480 119586 103231 56669
14872E6669Q7266J42557j02451j00702k8090j12739J31753K6375l3476j2508n7744
$$ 56669 143935 286492 184041 83339 55249 -57490 74263 100638 67162 54654 -3090
14861c090p0792P3323M4849M9936P9232K0292j4669r1688j03119j04463l8825
$$ -3090 -73882 -559 44290 94226 173458 193750 179081 87393 -15726 -120189 -159014
14850a59014N0259M7755j2115M8652L9487n4125k4374O154K7264o1442Q8273R8754
$$ -159014 -108755 -61000 -73115 -24463 15024 -39101 -63475 -57321 -30057 -91499 -3226 95528
14838I5528J803n6470L1169J8694q2482J8076P109K803L5825J7091o4533j6868
$$ 95528 97331 40861 72030 90724 8242 26318 33427 36230 72055 89146 24613 7745
14826G745K0649m2231k5047k071p1810l1657P7539K8864o7058J8599M3444j4888
$$ 7745 28394 -13837 -38884 -40955 -112765 -144422 -66883 -38019 -105077 -86478 -43034 -57922
14814e7922K1986R208L5186N0009l073m3940j3297P2218O7550J1437m3768r2609
$$ -57922 -35936 -26728 8458 58467 55394 11454 -1843 70375 137925 149362 105594 12985
14802A2985q5866r231n372k077K0058N8962J7766k6834j0897K7538p655k5249
$$ 12985 -72881 -82112 -87484 -89561 -69503 -10541 7225 -19609 -30506 -2968 -10623 -35872
14790c5872o8638J0053J38076P1790p1993m7006o6556R435j8633O4759M5137K3566
$$ -35872 -104510 -94457 43619 115409 43416 -3590 -70146 -60711 -79344 -14585 30552 54118
14778E4118M8354n3728J4119k0563n008Q5127M0652m1255l8865K1481O1857q604
$$ 54118 102472 48744 62863 42300 37292 122419 163071 121816 82951 104432 166289 157685
14766A57685r4475m3534M4725Q9776l4357j405j3457N1958n7856j08179l1020
$$ 157685 63210 19676 64401 154177 119820 118415 104958 156916 99060 -9119 -40139
14755d0139j922N6968J02371o4420p8952n2746K8522j4934j8699o946M8120m271
$$ -40139 -42061 14907 117278 52858 -26094 -78840 -50318 -65252 -83951 -90897 -42777 -47048
14743d7048k5675N4228P9308N778L38K231p910r2572l0471o25N3583Q0833n6585
$$ -47048 -72723 -18495 60813 66591 66929 69160 61250 -31322 -61793 -62418 -8835 71998 15413
14730A5413L0248P0209P4311O0597j00762r0288m6869J16626j8598o4100j6595
$$ 15413 45661 115870 190181 250778 150016 59728 12859 129485 110887 46787 30192
14719C0192j0458j8988q0147L9507J7544L8544J20821J7022O8794J2088r6357
$$ 30192 19734 746 -79401 -39894 -22350 16194 137015 154037 222831 234919 138562
14708A38562r2860n8722O1810M1380L71j7234m0365l5997k0084q6959o7223M9933
$$ 138562 45702 -13020 48790 90170 90541 73307 32942 -3055 -23139 -110098 -177321 -127388
14696a27388J07094N5147K5845N935j9171j2432n9101q1421R522L9596o5648l730
$$ -127388 -20294 34853 60698 66633 47462 35030 -24071 -105492 -95970 -56374 -122022 -125752
14684a25752M5681j859P5635J20531j1188j08015l6404j3845O9150J2792o031
$$ -125752 -80071 -81930 -6295 114236 103048 -4967 -41371 -55216 13934 26726 20695
14673B0695J0506o4250K6631N2868Q8899m494j43976j00959o195m2531O9058N5382
$$ 20695 31201 -33049 -6418 46450 135349 130855 -13121 -114080 -120275 -162806 -93748 -38366
14661c8366K5636Q4406L2598j5687J6828J9403r6497J3286M9752K7577o8892n7675
$$ -38366 -12730 71676 104274 88587 105415 124818 28321 41607 91359 118936 50044 -7631
14649g631L9292Q0805j7556J899l4504p1129M7457J18602J01545k8571j34390
$$ -7631 31661 112466 94910 96809 62305 -8824 38633 157235 258780 230209 95819
14638I5819q6289L1319l2578R6190j3448n3809J4563N8314P2578K347n6232p8315
$$ 95819 9530 40849 8271 104461 91013 37204 51767 110081 182659 185006 128774 50459
14626E0459J8483j01383N560L9424L8021p6328K9914Q4063j39643j57303j9920
$$ 50459 68942 -32441 -26881 12543 50564 -25764 4150 88213 -51430 -208733 -228653
14615b28653l2593J14112J15322J19963O2687j22000Q512k337K8461m209l1182
$$ -228653 -261246 -147134 -31812 88151 150838 28838 37350 35013 63474 59265 28083
14604B8083O1407j3654l9731j7934J128N144l933L4776j4367P7251J5927l8407
$$ 28083 89490 75836 36105 18171 19299 24443 20510 55286 40919 118170 134097 95690
14592I5690o5194p4157J7786j4517L6826L800J1274O6499j5659n82M15o4458k8250
$$ 95690 30496 -43661 -25875 -40392 -3566 234 11508 78007 62348 61766 62181 -2277 -30527
14579c0527J557J39636L5742r5749m2418o2774R4811P0292O6906p6498L0188l3192
$$ -30527 -28970 110666 146408 50659 8241 -54533 40278 110570 177476 100978 131166 97974
14567I7974L4257l6286q7728m7960p0877R970O4920J3759J03031J04423j14510
$$ 97974 132231 95945 8217 -39743 -110620 -100650 -35730 -21971 81060 185483 70973
14556G0973o5396L6531Q3930q538l6607J4991M1816P8523r5429m3317k6183O4412
$$ 70973 5577 42108 126038 117500 80893 95884 137700 216223 120794 77477 51294 115706
14544A15706q897o1504R922p3924p0523M2499R0255P0783q638o3922K8254j539
$$ 115706 106809 45305 55227 -18697 -89220 -46721 43534 114317 105679 41757 70011 68472
14532F8472j28797k9113N264K4308J4520L4167o342K132J08198J08677j3906j01849
$$ 68472 -60325 -89438 -84174 -59866 -45346 -11179 -17521 -15389 92809 201486 187580 85731
14520H5731P107N8255Q0281j08619m9848K1115o6719o5597m2007Q0994Q5629M0993
$$ 85731 92838 151093 231374 122755 72907 94022 27303 -38294 -80301 693 86322 127315
14508A27315L3175K329M1272P1925O2072o7888j46675m5684K936j15611j3804
$$ 127315 160490 162819 204091 276016 338088 270200 123525 77841 80777 -34834 -48638
14497d8638N6983m5472P6271q633q2962K2583O9787k8877n4355q31N255M6024
$$ -48638 8345 -37127 39144 30511 -52451 -29868 39919 11042 -43313 -44144 -38889 7135
14485G135J07015M0411p1919q5212j4722m4513p084N6336N4291L3552K3806m0397
$$ 7135 114150 154561 82642 -2570 -17292 -61805 -68889 -12553 41738 75290 99096 58699
14473E8699n4680j00631j8699M0306o2716O8425l1315n1061O5975L0855O3316
$$ 58699 4019 -96612 -115311 -75005 -137721 -69296 -100611 -151672 -85697 -54842 8474
14462H474J18864M8292l789m6213j13266N6967p2128j5722J26691n8273M025K675
$$ 8474 127338 175630 171841 125628 12362 69329 -2799 -18521 108170 49897 53922 56597
14450E6597O288J0910M0322j3981L492m1193N1811J02188j3151m9782Q079N7990
$$ 56597 62885 73795 114117 100136 103628 62435 114246 216434 203283 153501 161580 219570
14438B19570o8912l531q0704q4042L8248j954R3578k3986l6553p0058k2701O4894
$$ 219570 150658 147127 66423 -17619 20629 18675 112253 88267 51714 -18344 -41045 23849
14426B3849l0759k1254Q01Q6572J68519M7949O4962O7947j71100j44307k7664
$$ 23849 -6910 -28164 -27363 59209 227728 275677 340639 408586 237486 93179 65515
14415F5515n0616n2240R9011L5793K1412L1279J8252K1708K1487n5993p6736N7546
$$ 65515 14899 -37341 61670 97463 118875 150154 168406 190114 211601 155608 78872 136418
14403A36418k9264q5764N464n876j9724q3588q1701R5506J37547k0075m7140j5721
$$ 136418 107154 21390 26854 20978 1254 -82334 -164035 -68529 69018 48943 1803 -13918
14391a3918N4755J06006R142j14770m8573J0198K1598M0895P7531l2454j9886
$$ -13918 40837 146843 155985 41215 -7358 2840 24438 65333 142864 110410 90524
14380I0524p126P5204P4649r5024p9290K000J19830r3444p9576R577j5286m3614
$$ 90524 83398 158602 233251 138227 58937 60937 180767 87323 7747 17324 2038 -41576
14368d1576J796R6269M4051r7963o5761J02711j4794j6318R550j4889N4002O6580
$$ -41576 -39780 56489 100540 2577 -63184 39527 24733 8415 17965 3076 57078 123658
14356A23658n2056m3876K3415l086m9477m7436L0082L9035J0161n2146R2914k8402
$$ 123658 71602 27726 51141 48055 -1422 -48858 -18776 20259 30420 -21726 71188 42786
14344D2786n3958M9363K3939j36844k4449J13838O1012Q5995K6428Q4818o2046
$$ 42786 -11172 38191 62130 -74714 -99163 14675 75687 161682 188110 272928 210882
14333B10882r3688K8621o934O0450j9271j05828o3807P219m4403j16471r509K3823
$$ 210882 117194 145815 138881 199331 180060 74232 10425 17644 -26759 -143230 -152739 -128916
14321a28916J11734K7393M0603R6044N7176m5838p4483m1687j06614j6537M3077
$$ -128916 -17182 10211 50814 146858 204034 158196 83713 42026 -64588 -81125 -38048
14310c8048O8949P7350j930J5244r8627L0236Q7913N8960o090q5801L5193l2510
$$ -38048 30901 108251 106321 121565 22938 53174 141087 200047 193957 108156 143349 110839
14298A10839m6253q5599L2662O9182K9010J2485r6728o475J13285j1287j38554
$$ 110839 64586 -21013 11649 80831 109841 122326 25598 19123 132408 121121 -17433
14287a7433n2994K5259q689r3019l157Q9227R3969M1313Q6545m4887J1047k4491
$$ -17433 -70427 -45168 -53857 -146876 -150033 -60806 33163 74476 161021 116134 127181 102690
14275A02690k9475j31523j09966P1330R6130q26m9631N8667p234p6662J33401
$$ 102690 73215 -58308 -168274 -96944 -814 -1640 -51271 7396 162 -76500 56901
14264E6901Q7711j3886q9310n9390R4254Q6324j0490J1356n2440l032l7843o8505
$$ 56901 144612 130726 41416 -17974 76280 162604 152114 163470 111030 107998 70155 1650
14252A650j3352L0811l5638l9594m4294N0537K12156J00950j52612J147j3644
$$ 1650 -11702 19109 -16529 -56123 -100417 -49880 162276 263226 110614 111761 98117
14241I8117j41378O6261P0656m2582q8453M725O539l6052n8891N311l218L4591
$$ 98117 -43261 23000 93656 51074 -37379 -32654 -26115 -62167 -121058 -115747 -118965 -84374
14229h4374R6990R7707j38559p2078N5930L7316O9860m2016L9460m4244l1561
$$ -84374 12616 110323 -28236 -100314 -44384 -7068 62792 20776 60236 15992 -15569
14218a5569j4687O9n5634J5965P0639K6947j2014O8705N0806q0929j5226M9496
$$ -15569 -30256 -30187 -85821 -69856 783 27730 15716 84421 135227 54298 39072 88568
14206H8568J23481m4180r2318K2417j6741L1425L7801m9302k688q4438J3954n25
$$ 88568 212049 167869 75551 97968 81227 112652 150453 101151 98463 14025 27979 27454
14194B7454O2500J11521p896n3700J9539r9821m6752J4600N7802K1598P9134m7606
$$ 27454 89954 201475 193579 139879 159418 59597 12845 27445 85247 106845 185979 138373
14182A38373L9566j8671q5820j39464K3056k1898K0238N5370Q677R3145N3394
$$ 138373 177939 159268 73448 -66016 -42960 -64858 -44620 10750 19427 112572 165966
14171A65966N5411o9337r5253j09596k4085J41143o1013q8016L0875O7703Q9586
$$ 165966 221377 152040 56787 -52809 -76894 64249 3236 -84780 -53905 13798 103384
14160A03384K72n864J8390p449J293R952O293L1000l9073R7054k3677j53093m9391
$$ 103384 103656 97792 116182 108733 110026 119978 126271 157271 118198 215252 191575 38482 -10909
14147a0909J3080l0814l8162K9413Q7140k0843j3852R7673p888r414L2166o5490
$$ -10909 2171 -28643 -66805 -37392 49748 28905 15053 112726 104838 95424 127590 62100
14135F2100l4878J21997k6439j12114R230N654O2107N7500P202J0216J14953o1964
$$ 62100 27222 149219 122780 10666 19896 25550 87657 145157 152359 162575 277528 215564
14123B15564j404j48790J7017J8722l3010n3079N5352Q4691j05471j43503O706
$$ 215564 214160 65370 82387 101109 68099 15020 70372 155063 49592 -93911 -87205
14112h7205Q7045J7707o1061o9301R1604J26187K3152R48J900n3461o3216J8771
$$ -87205 -160 17547 -43514 -112815 -21211 104976 128128 129076 130976 77515 14299 33070
14100C3070L9851O94j0353j4044n107O7890J9066l8043K8358J22704N7286j19726
$$ 33070 72921 73615 63262 49218 44111 112001 131067 93024 121382 244086 301372 181646
14088A81646j89406j50737J50387R441q8466P4868P0939J6808M4824k5804P400
$$ 181646 -7760 -158497 -8110 1331 -87135 -12267 58672 75480 120304 94500 101900
14077A01900j4091j34250j03022K7186K7878O1101M827Q3955J23235J30146M5428
$$ 101900 87809 -46441 -149463 -122277 -94399 -33298 -28471 55484 178719 308865 354293
14066C54293j30894q5625r6805m5498O421m9979Q07M0860N9772O3473j6517J125
$$ 354293 223399 137774 40969 -4529 1892 -48087 -47280 -6420 53352 116825 100308 101433
14054A01433J12905R868m6317r7250J1767J51996J96020m7262k8724j8212p5702
$$ 101433 214338 224206 177889 80639 92406 244402 440422 393160 364436 346224 270522
14043B70522k8425n2908M080m6150n9594n0263O979J78391o4642l0939M0326O6993
$$ 270522 242097 189189 193269 147119 87525 37262 44241 222632 157990 127051 167377 234370
14031B34370m4642q9973K3479O179J7853K0805K0812k2236p1081N3749O609m9487
$$ 234370 189728 99755 123234 129413 147266 168071 188883 166647 95566 149315 155924 106437
14019A06437J0399j163O732L0331m8952p4033L060J0290p5629j8516M0595M3014
$$ 106437 116836 115673 122405 152736 103784 29751 32811 43101 -32528 -51044 -10449 32565
14007C2565M9244q1144p9087J88269Q5757R188o9231P007L7237M2258L3328k4026
$$ 32565 81809 665 -78422 109847 195604 204792 135561 142568 179805 222063 255391 231365
13995B31365j50740j41424M5877J22937J1931m8969K6538K1810k686q296l8478
$$ 231365 80625 -60799 -14922 108015 119946 70977 97515 119325 116639 108343 69865
13984F9865l5671j4311o2358K5837N6793J205p2614j47891p083j8540K0275J31671
$$ 69865 34194 19883 -42475 -16638 40155 41360 -31254 -179145 -186228 -204768 -184493 -52822
13972e2822l3611J9543P7820M8318K3214j08956k8354O4754J34622l6716j07014
$$ -52822 -86433 -66890 10930 59248 82462 -26494 -54848 9906 144528 107812 798
13961G98o0642L1338Q4005L2678O7249J7992j3186o534j5888l2884o5707L945
$$ 798 -59844 -28506 55499 88177 155426 173418 160232 153698 137810 104926 39219 43164
13949D3164m3083q1481N938R1008j8778j3228J06336r316k5315j49198m3638J5875
$$ 43164 81 -81400 -75462 15546 -3232 -16460 89876 80560 55245 -93953 -137591 -121716
13937a21716Q4607j130J8879Q050O176O0929o6037o8221N2709M2680O3819Q4349
$$ -121716 -37109 -38239 -19360 -11310 -5134 55795 -10242 -78463 -25754 16926 80745 165094
13925A65094k6065o9673o9810N1872j9589p7543K6950K2750P8796P514L7124m5133
$$ 165094 139029 69356 -454 51418 31829 -45714 -18764 3986 82782 90296 127420 82287
13913H2287J0061L5104J7056L2318N999n9523k4222L0225L817R6K335J1820o6121
$$ 82287 92348 127452 144508 176826 182825 123302 99080 129305 133122 133218 135553 147373 81252
13900H1252L903P0331k0780l522R120p0648l5342p765n3234O5197Q2987N8409
$$ 81252 85155 155486 134706 131184 140304 69656 34314 26549 -26685 38512 121499 179908
13888A79908K5224l0604m1768n638k2316o3053K676L1804J14007o1775o8387J7909
$$ 179908 205132 174528 132760 127122 104806 41753 44429 76233 190240 128465 60078 77987
13876G7987L0714J7942O579j31235M672l8062R0210P4506M055L4725m7583q4247
$$ 77987 108701 126643 133222 1987 6659 -31403 58807 133313 137368 172093 124510 40263
13864D0263m9498p324O3133J55365J3200o6335l2751m3668p137K2431N702J0743
$$ 40263 -9235 -16559 46574 201939 215139 148804 116053 72385 65248 87679 93381 104124
13852A04124M5155L6027p0951o9335k7458j07295J01559N4702R9561M4152L1582
$$ 104124 149279 185306 114355 45020 17562 -89733 11826 66528 166089 210241 241823
13841B41823r1242j00902k7597J5333Q0597p502j5979j3698J7248k1721m487k4479
$$ 241823 150581 49679 22082 37415 118012 110510 94531 80833 98081 76360 71873 47394
13829D7394N0363j7659j15892K9467K4575k2844K7348o889j0650Q3298l2589o9547
$$ 47394 97757 80098 -35794 -6327 18248 -4596 22752 15863 5213 88511 55922 -13625
13817a3625L4552L4965j5854J982K5615J2539j8571N2178M6572J2384r9943l8041
$$ -13625 20927 55892 40038 42020 67635 80174 61603 113781 160353 172737 72794 34753
13805C4753j50228n7463N8786M2628R9256R4442m6081M0956N5766N1102M68L1975
$$ 34753 -115475 -172938 -114152 -71524 27732 122174 76093 117049 172815 223917 224385 256360
13793B56360K9469j37388k32244k8302Q7116o749j710N9285J35462Q79p7772J2970
$$ 256360 285829 148441 -83803 -112105 -24989 -31738 -33448 25837 161299 162178 84406 97376
13781I7376r7723J1979R9339Q4793m0793l2473r319M2886n6912J3154J1973L3191
$$ 97376 -347 11632 110971 195764 154971 122498 113179 156065 99153 112307 124280 157471
13769A57471J09086N9682j36489k5295l4094m611j8282n6504n0251J63663M7057
$$ 157471 266557 326239 189750 164455 130361 125750 107468 50964 713 164376 211433
13758B11433o877Q7957K8604q1749j20630j14621n5623J4343M7008m5469N0757
$$ 211433 204556 292513 321117 239368 118738 4117 -51506 -37163 9845 -35624 15133
13747A5133O2676K0222N0141Q5687k4852R378q104p7790n081r2342k3692J75897
$$ 15133 77809 98031 148172 233859 209007 218385 210281 132491 127410 35068 11376 187273
13735A87273J09917j2449j11917r7349M127N116j10089j06768N457L5928O3610
$$ 187273 297190 284741 172824 75475 79602 84718 -25371 -132139 -126682 -90754 -27144
13724b7144P2239j6653O537L8128o9499J2311N5943J8819p2395K0443N8480n49
$$ -27144 45095 28442 34979 73107 3608 15919 71862 90681 18286 38729 97209 96660
13712I6660q6363L1632J23134J06045j6880l9335p9556L3642n0980l1117n5879
$$ 96660 10297 41929 165063 271108 254228 214893 135337 168979 117999 86882 31003
13701C1003k7545m2107J5050K9284O2634M7509J9548L8806j5878p1241L1125Q0652
$$ 31003 3458 -38649 -23599 5685 68319 115828 135376 174182 158304 87063 118188 198840
13689A98840J2103m8836p4854j01620N7449N4563N0816Q143l9982L8655J2310
$$ 198840 210943 162107 87253 -14367 43082 97645 148461 156604 116622 155277 167587
13678A67587P358r2447o4909J14838N7621K5676L780L5655j2818l6172K4898j61861
$$ 167587 174945 82498 17589 132427 190048 215724 219504 255159 242341 206169 231067 69206
13666F9206o8844R8184Q0396n1773j0234k1691m6426K4365M0043J14667k6988
$$ 69206 362 98546 178942 127169 116935 95244 48818 73183 113226 227893 200905
13655B00905j28504j7424J19339L5877K167N8129N6214l0999l3730p0773j16805
$$ 200905 72401 54977 174316 210193 212360 270489 326703 295704 261974 191201 74396
13644G4396n8029K9290K0753P6222k6516J597l9517q4526O3849J16787K3288M8301
$$ 74396 16367 45657 66410 142632 116116 117713 78196 -6330 57519 174306 197594 245895
13632B45895q548l9259m6243J4866n5468o2298L2433K1757R8840J9840M200j3544
$$ 245895 237347 198088 151845 166711 111243 48945 81378 103135 201975 221815 226015 212471
13620B12471j20558l4206j07102L9062M9404M5679N0274J92J30543M7579o8460
$$ 212471 91913 57707 -49395 -10333 39071 84750 135024 135216 265759 313338 244878
13609B44878r5491J2672P2335l3187k9264j1065n8844o0816j11682K0149R0365
$$ 244878 149387 162059 234394 201207 171943 160878 102034 41218 -70464 -50315 40050
13598D0050J42756O528l8172m7208K2863R7942l001n4858n5683k14J1158M5075
$$ 40050 182806 189334 151162 103954 126817 224759 221758 166900 111217 111003 122161 167236
13586A67236k8609o5699K8843L3978q7143p528K8692L5940O7805o094l4670N7245
$$ 167236 138627 72928 101771 135749 48606 41078 69770 105710 173515 167421 132751 189996
13574A89996j4523k502o6565Q6561K0874j3475n8428K3171N3181o5987r090k9225
$$ 189996 175473 172971 106406 192967 213841 200366 141938 165109 218290 152303 143213 113988
13562A13988l8834N6603P2433o9505O1569M9334l1688n9499o1895K8703j8145
$$ 113988 75154 131757 204190 134685 196254 245588 213900 154401 92506 121209 103064
13551A03064j35623N7731M9899M7106K9458n0770R28J39321Q3757n4457j8975
$$ 103064 -32559 25172 75071 122177 151635 100865 101793 241114 324871 270414 251439
13540B51439J5778q9039j09998Q9356J4143o8576n7140q6050k6802M5073P0750
$$ 251439 267217 178178 68180 157536 171679 103103 45963 -40087 -66889 -21816 48934
13529D8934J11381K4044K7917k2622p7559j5881R4823o3831l4001r445M3591l9205
$$ 48934 160315 184359 212276 189654 112095 96214 191037 127206 93205 83760 127351 88146
13517H8146l252J32059J0647m6070r870q3224k7849O8492Q4330K291l9865j0199
$$ 88146 84894 216953 227600 181530 171660 88436 60587 129079 213409 215700 175835 165636
13505A65636J0439J45331M2852n8043q4935k8603l028O458R7950P9830q9194j08195
$$ 165636 176075 321406 364258 306215 221280 192677 189649 196107 294057 373887 284693 176498
13493A76498o6954o6141K4935J5950J5852O7126J47506M6108l0474j1047L4808
$$ 176498 109544 43403 68338 84288 100140 167266 314772 360880 330406 319359 354167
13482C54167q3001j22576M0860L2055o322L281L4253m4991j01485J4052j0756
$$ 354167 271166 148590 189450 221505 215183 218464 252717 207726 106241 120293 109537
13471A09537n2907K5321P0107J9203M3627M5825m2363p8257k8837L4912L6326
$$ 109537 56630 81951 152058 171261 214888 260713 218350 140093 111256 146168 182494
13460A82494p2601l0344N3391M0680J07432M3348n4714j10723k3191P0987Q830
$$ 182494 109893 79549 132940 173620 281052 324400 269686 158963 135772 206759 215589
13449B15589j3705K4196L016K2336L3889K3619k7778n0189j41954p3595O126K9668
$$ 215589 201884 226080 229096 251432 285321 308940 281162 230973 89019 15424 21550 51218
13437E1218J77745Q855m808m5642r445J7641L6766Q5262L3267L2065l6113q9835
$$ 51218 228963 237818 233010 187368 177923 195564 232330 317592 350859 382924 346811 256976
13425B56976m3325j8417j1892q7043K4692K5855J0330P7944Q036m089q1781M9661
$$ 256976 213651 195234 183342 96299 120991 146846 157176 235120 243156 239067 157286 206947
13413B06947L9904m7676L9244L7355m30P9061N6827n4255j07163j31539l13P9575
$$ 206947 246851 199175 238419 275774 275344 354405 411232 356977 249814 118275 117962 197537
13401A97537N2120p2066q7357j23945n4445K6973k678m5514O4683Q952j726n3548
$$ 197537 249657 177591 90234 -33711 -88156 -61183 -63861 -109375 -44692 -35740 -37466 -91014
13389i1014M5461R5882J07571P9261N8328l3314r7126q5822l4339K7514M8889
$$ -91014 -45553 50329 157900 237161 295489 262175 165049 79227 44888 72402 121291
13378A21291J1419N6504J8954j7238N1421k2197j8048o6307p6010L5946K0161
$$ 121291 132710 189214 208168 190930 242351 220154 202106 135799 59789 95735 115896
13367A15896L2527K2684J29150R9601m0762m0742k7766n2834j66846M6477M8779
$$ 115896 148423 171107 300257 399858 359096 318354 290588 237754 70908 117385 166164
13356A66164L7565L6242R839q6146K2491l0331p5833l1711Q6874j4589k7741P0307
$$ 166164 203729 239971 249810 163664 186155 155824 79991 48280 135154 120565 92824 163131
13344A63131P6997m3273o0091k0102p8279P1971M285l3652O2625Q4237j3294j01765
$$ 163131 240128 196855 136764 116662 38383 110354 114639 80987 143612 227849 214555 112790
13332A12790r9723J1615L5702K1816L7543j14127k9198k8335M7515O2920J17465
$$ 112790 13067 24682 60384 82200 119743 5616 -23582 -51917 -4402 58518 175983
13321A75983N2758p6359J5516l6790m7929J12162Q0327L1776k4290n1912p5096
$$ 175983 228741 152382 167898 131108 83179 195341 275668 307444 283154 231242 156146
13310A56146q3642p9253K4832R0454L6889J6880k8257L770p1899R7735Q2060n0980
$$ 156146 72504 -6749 18083 108537 145426 162306 134049 137819 65920 163655 245715 194735
13298A94735L5252l1416m3257O2413M463m6309o6267j9805Q751r835J34591l6409
$$ 194735 229987 198571 155314 217727 222190 175881 109614 89809 98560 88725 223316 186907
13286A86907M812l3993j4661j3475j2437K4104k4833O6667L6178j8539J01346
$$ 186907 191719 157726 143065 129590 117153 141257 116424 183091 219269 200730 302076
13275C02076j0187m8670m872q3314j2440J13319o4849j5428n2395O3957Q858j6611
$$ 302076 291889 243219 238347 155033 142593 255912 191063 175635 123240 187197 196055 179444
13263A79444k9884k5368O2057j897j24258l2601l878R1415J9509j3234M2155M6434
$$ 179444 149560 124192 186249 184352 60094 27493 23615 115030 134539 121305 163460 209894
13251B09894p3757k02113n7201J307L640Q6089J51451M8443q2624K0322m511J9856
$$ 209894 136137 -65976 -123177 -121870 -118230 -32141 119310 167753 85129 105451 100940 120796
13239A20796J2622J85746L3548j14979K9136l5343j5141k4716m7144J7457L5914
$$ 120796 133418 319164 352712 237733 266869 231526 216385 191669 144525 161982 197896
13228A97896o2205m3130L0362L9129J42206L6425p5357K7678r9198q9589J0372
$$ 197896 135691 92561 122923 162052 304258 340683 265326 293004 193806 104217 114589
13217A14589R1798L2696N8403O883j05907m9092l2929o4274M8516J21692O0460
$$ 114589 206387 239083 297486 304369 198462 149370 116441 52167 100683 222375 282835
13206B82835r3304j06752j575N0852Q8358L784r7668L5631P4180P9016K056j26500
$$ 282835 189531 82779 81204 132056 220414 224198 126530 162161 236341 315357 317413 190913
13194A90913k1577M5672k2658J5924R5115j2730K3319L3264j6333o5145k7472
$$ 190913 169336 215008 192350 208274 303389 290659 313978 347242 330909 265764 238292
13183B38292q6116o458J03516L7658J0162m9668k9345K4026K6580K5603M5283
$$ 238292 152176 145718 249234 286892 297054 247386 218041 242067 268647 294250 339533
13172C39533r8992m9887N1878K5596k3654k3914q1305K1150N1687R2302j0477
$$ 339533 240541 190654 242532 268128 244474 220560 139255 160405 212092 304394 293917
13161B93917q154p3349n6768J5776j15770k3618J6400J66497L3621O688K2879
$$ 293917 285763 212414 155646 171422 55652 32034 48434 214931 248552 255240 278119
13150B78119k8866n1254J20402L9293k0884J1732l5007j8770n7257j9052R4269
$$ 278119 249253 197999 318401 357694 336810 348542 313535 294765 237508 218456 312725
13139C12725O0915K0460j22976j1186J6251r643r428m0328M6675J2416o2878m301
$$ 312725 373640 394100 271124 259938 276189 266546 257118 216790 263465 275881 213003 208702
13127B08702j5620j06470k5702J59795J22164L6879l2246M6455j0764k521k2560
$$ 208702 193082 86612 60910 220705 342869 379748 347502 393957 383193 380672 358112
13116C58112O6543J01944j2593j47903j70335q5818Q2455L6693l723q224J5245
$$ 358112 424655 526599 514006 366103 195768 109950 192405 229098 225375 217151 232396
13105B32396L256Q1031p2916q2023N5669m8477m2503j30536l4510L3336J05313
$$ 232396 235652 316683 243767 161744 217413 168936 126433 -4103 -38613 -5277 100036
13094A00036K1510j0288L2079m5773L6115K4015P3393p8992r4451M220O4560M4416
$$ 100036 121546 111258 143337 97564 133679 157694 231087 152095 57644 61864 126424 170840
13082A70840M1363j61831j0196J32725q5106n6836J75342J21911J2870J6961N9548
$$ 170840 212203 50372 40176 172901 87795 30959 206301 328212 341082 358043 417591
13071D17591j1086l239K010j12171n2119J02155K3569m7289j852K7101K7734k5988
$$ 417591 406505 403266 405276 293105 240986 343141 366710 319421 317569 344670 372404 346416
13059C46416k0218l844o8555j15718J23826R8073P6578m459l2712r593n6752n0555
$$ 346416 326198 322354 253799 138081 261907 359980 436558 432099 399387 389794 333042 282487
13047B82487q745L296p467j1962K3422K4205L6714K7872j11168L7203o3823j0268
$$ 282487 273742 277038 269571 257609 281031 305236 341950 369822 258654 295857 232034 221766
13035B21766K2686L9370O5098p8229M1266J01200J6118j60510L9966P1699J9297
$$ 221766 244452 283822 348920 270691 311957 413157 429275 268765 308731 380430 399727
13024C99727l773j7693k3613j11177L3090q6633M594M6245l4503m9972L5955K6989
$$ 399727 395954 378261 354648 243471 276561 189928 194522 240767 206264 156292 192247 219236
13012B19236O9369K3777n658j4002K6297j03156j22839M0513O1318n2075p2434
$$ 219236 288605 312382 306724 292722 319019 215863 93024 133537 194855 142780 70346
13001G0346L9348M6966n7606p4900J1220R4745N1300O9405R7632j7104p0674j57046
$$ 70346 109694 156660 99054 24154 35374 130119 181419 250824 348456 331352 260678 103632
12989A03632P5018R9437m860L2133n2116k8155k491j3400p7301l4646k8037j764
$$ 103632 178650 278087 273227 305360 253244 225089 222598 209198 131897 97251 69214 67450
12977F7450J26392K6412j0312k1309n1057n352j1214J16893J05348j26561n6207
$$ 67450 193842 220254 209942 188633 137576 132224 121010 237903 343251 216690 160483
12966A60483Q1882L7505K4910L9000k8825p6181r2468m6356J0758Q5303Q9547
$$ 160483 242365 279870 304780 343780 314955 238774 146306 99950 110708 196011 285558
12955B85558n026j1038k528J3336k8058l8705o0025m982N0914R0195m5192j24026
$$ 285558 280532 269494 266966 280302 252244 213539 153514 148532 199446 289641 244449 120423
12943A20423N308Q069R0719P3202J8905p7781j4876R0260P7212n516q9763j43807
$$ 120423 125731 133800 224519 297721 316626 238845 223969 314229 391441 385925 296162 152355
12931A52355N1270M8167k7296j977k3774M6162n9639n471J0870n8349o6866J13491
$$ 152355 203625 251792 224496 222519 198745 244907 185268 179797 190667 132318 65452 178943
12919A78943J20845O3585J1424r5438r3811M0779j9215p2021J4213R887O5856
$$ 178943 299788 363373 374797 279359 185548 226327 207112 135091 149304 159191 225047
12908B25047p965j9292M07m2615j38952l03J19694J35102J2392L2444O0517j16728
$$ 225047 217082 197790 198197 155582 16630 16327 136021 271123 283515 315959 376476 259748
12896B59748M0137j6819L1146J2531k9557l4705j9242m5126Q2332p965l8458J2769
$$ 259748 299885 283066 314212 326743 297186 262481 243239 198113 280445 272480 234022 246791
12884B46791p1705J04341Q5151J8446K8814P1961j18499j39362l3088K063O8805
$$ 246791 175086 279427 364578 383024 411838 483799 365300 225938 192850 194913 263718
12873B63718L9742k7203p2507j8153l4092J8889M8334m061N0449j2819l7724Q1792
$$ 263718 303460 276257 203750 185597 151505 170394 218728 214667 265116 252297 214573 296365
12861B96365J07065l3537j32778j6831J5210m2703K6934L2323m1516L0241n917
$$ 296365 403430 369893 237115 220284 235494 192791 219725 252048 210532 240773 234856
12850B34856J29965J4400l1751j546J4436m7802N0854K8048k8788K2467j39005
$$ 234856 364821 379221 347470 345924 360360 312558 363412 391460 362672 385139 246134
12839B46134o9082N8873j9561o63L4336K066L0640M4375L5935q7915r2616O1616
$$ 246134 177052 235925 216364 215701 250037 252103 282743 327118 363053 275138 182522 244138
12827B44138M2181J27949N0824m7714n9980n496j53686q4996m1838J5585N5030
$$ 244138 286319 414268 465092 417378 357398 351902 198216 113220 71382 86967 141997
12816A41997Q2650L1210Q2800M903k3183J3364O2842J1347m4489Q79j07629j4227
$$ 141997 224647 255857 338657 343560 320377 333741 396583 407930 363441 364320 256691 242464
12804B42464Q9296Q7785k655l7186j29596p2091l6823O0250N2861J26457R7341
$$ 242464 331760 419545 416890 379704 250108 178017 141194 201444 254305 380762 478103
12793D78103q1570l3693N4828K9391k1219o1144k0923m3106r6842O3356P4337
$$ 478103 396533 362840 417668 447059 425840 364696 343773 300667 203825 267181 341518
12782C41518q078R83J23455J01886K4252k9353m2360P3444o8427p6524l4404M6298
$$ 341518 333440 334423 457878 559764 584016 554663 512303 585747 517320 440796 406392 452690
12770D52690M777k7075O6238r9729j44180r58K4809J8666L7769P795J34196N9514
$$ 452690 457467 430392 496630 396901 252721 251763 276572 295238 333007 340802 474998 534512
12758E34512j44551o8108n531K2324M1937j3855M2679o1804R0958j4260o1613
$$ 534512 389961 321853 316322 338646 380583 366728 409407 347603 438561 424301 362688
12747C62688N1819l6947J0943l3654n2123J21022O7368j10382j18547o8818J51370
$$ 362688 414507 377560 388503 354849 302726 423748 491116 380734 262187 193369 344739
12736C44739P7217o1418L977k2494j06942l6263J31870L7373O6714K5495o2934
$$ 344739 421956 360538 364515 342021 235079 198816 330686 368059 434773 460268 397334
12725C97334P8746K1814j11972n3354M2303N7409K6775n5316N5670p7318j065
$$ 397334 476080 497894 385922 332568 374871 432280 459055 403739 459409 382091 381026
12714C81026k1770l2749L8377R1122k1120m1099p9304r5874p1839O7639O4444
$$ 381026 359256 326507 364884 456006 434886 393787 314483 218609 146770 214409 278853
12703B78853L3847k9519M3484J0450J2645L1485m2305M3199K6078j77002j3750
$$ 278853 312700 283181 326665 337115 349760 381245 338940 382139 408217 231215 217465
12692B17465K2119q5538J77580J03924O376p4667l2550L8356P1939M7548p990
$$ 217465 239584 154046 331626 435550 441926 367259 334709 373065 445004 492552 484562
12681D84562n2652l0944l8753J0781K8845Q953l4181J9985o5104K512J24896P8152
$$ 484562 431910 400966 362213 372994 401839 410792 376611 396596 331492 334004 458900 537052
12669E37052l9781j18941Q1858L2784k3906P5884l7419J3427o7465r2678k8499
$$ 537052 497271 378330 460188 492972 469066 544950 507531 520958 453493 360815 332316
12658C32316o4636j6078m6256J12545P9264l215J82792Q3822p1941m7206k207
$$ 332316 267680 251602 205346 317891 397155 393940 576732 660554 588613 541407 539200
12647E39200k6772R5744L2311m1420j20819j52238l9451P7124L4887R5125j2357
$$ 539200 512428 608172 640483 599063 478244 326006 286555 363679 398566 493691 481334
12636D81334l466J8206L7186M8834K5243J4083r9401K5609J6072j65260r3546
$$ 481334 477868 496074 533260 582094 607337 621420 522019 547628 563700 398440 304894
12625C04894Q3407R2096Q990Q2347R169p6016k6516O8733O9700k4162J79m6629
$$ 304894 388301 480397 489387 571734 580903 504887 478371 547104 616804 592642 592821 546192
12613E46192J8503L757J8708K1430k7415N49L0773q1225j7599k9789j33088j5846
$$ 546192 564695 568452 587160 608590 581175 581724 612497 531272 513673 483884 350796 334950
12601C34950P7727O7919k906P0583r1097j31545l5091J7710P9067l0743j3714
$$ 334950 412677 480596 477690 548273 457176 325631 290540 308250 387317 356574 342860
12590C42860j0414o2868P1522J25323m9411L7416J35391L8722q808m4134k2665
$$ 342860 332446 269578 341100 466423 417012 454428 589819 628541 619733 575599 552934
12579E52934N4862l6225r815o082n3274L7742K3399q7068Q1748j2210L3862M4619
$$ 552934 607796 571571 561756 555674 502400 540142 563541 476473 558221 546011 579873 624492
12567F24492R901R831n8746o1139j3724j2047J20028N1385J02688o1617j49577
$$ 624492 634393 644224 585478 524339 510615 498568 618596 669981 772669 711052 561475
12556E61475n3928L9038O1364N8635j0273p5447n0525J15829j5254k8679n9402
$$ 561475 507547 546585 607949 666584 656311 580864 530339 646168 630914 602235 542833
12545E42833l6967k1068J995Q109L6231o7880O8692K3523J368R723m3099l4579
$$ 542833 505866 484798 486793 494902 531133 463253 531945 555468 556836 566559 523460 488881
12533D88881K6877K9265J6537J36551L7528L6508l1837j7950J39002L9868r6420
$$ 488881 515758 545023 561560 698111 735639 772147 740310 722360 861362 901230 804810
12522H04810j40923l0875P5190P1267l7651n14l5196q5936l0406r9661M2742O6754
$$ 804810 663887 633012 708202 779469 741818 741304 706108 620172 589766 490105 532847 599601
12510E99601M5868n6853N0044J0264p8995K5626R2468o51M7346J0569J967O387
$$ 599601 645469 588616 638660 648924 569929 595555 688023 687372 734718 745287 747254 753641
12498G53641k7158r617r0274m9742l6005O7089N4746n5557p7555P9320R5562N1366
$$ 753641 726483 716866 626592 576850 540845 607934 662680 607123 529568 608888 704450 755816
12486G55816n549j25726l9865l3699M9760P8279m732o5J5746Q7083p5224P9557
$$ 755816 750267 624541 584676 550977 600737 679016 674284 674219 689965 777048 701824 781381
12474G81381l1000m9802j8353m1573r9343k8939R3111O7416L9173j8962o3461
$$ 781381 750381 700579 682226 640653 541310 512371 605482 672898 712071 693109 629648
12463F29648m2997l8248J04394M1254p7569K4227J68803O5212q743m9838k1322
$$ 629648 586651 548403 652797 694051 616482 640709 809512 874724 865981 816143 794821
12452G94821J6745r5267p073m8039p3099Q6810L1992j47201P402N6892M0850M3671
$$ 794821 811566 716299 709226 661187 588088 674898 706890 559689 567091 623983 664833 708504
12440G08504o123n0726N6212J14252K5031j36307n6327P2750J11845N6064q487
$$ 708504 702381 651655 707867 822119 847150 710843 654516 727266 839111 895175 886688
12429H86688N677m6485n8143l4889K0978K4470Q545L2338L0823R0162J9862q2685
$$ 886688 892365 845880 787737 752848 773826 798296 806841 839179 870002 960164 980026 897341
12417H97341q7613J4929n924L9665J4159o6067N3014J9727J679j8435j09814k01454
$$ 897341 809728 824657 818733 858398 872557 806490 859504 879231 880910 862475 752661 551207
12405E51207L1473J97596J59560K281m7257n2557P0664J20640L4457K9087n7170
$$ 551207 582680 780276 939836 942117 894860 842303 912967 1033607 1068064 1097151 1039981
12394A039981M7049l4458J8316K1078j7990o4376k6907O1271N5443j755r3589
$$ 1039981 1087030 1052572 1070888 1091966 1073976 1009600 982693 1043964 1099407 1097652 1004063
12383A004063o0020n1172l1003J01409Q7617r6235m8686k2489M3676O7811R618
$$ 1004063 944043 892871 861868 963277 1050894 954659 905973 883484 927160 994971 1004589
12372A004589K8381j0863r681O8110m3262m0917j6253J6675l1433K8313J2523
$$ 1004589 1032970 1022107 1012426 1080536 1037274 996357 980104 996779 965346 993659 1006182
12361A006182N670P0183j6823J6919L0535l599L9934j4989J4427L4753m2376j45543
$$ 1006182 1011852 1082035 1065212 1082131 1112666 1109067 1149001 1134012 1148439 1183192 1140816 995273
12349I95273n2527o5878Q7758Q5092K7086J14135j0261n7518N1732M5980j47117
$$ 995273 942746 876868 964626 1049718 1076804 1190939 1180678 1123160 1174892 1220872 1073755
12338A073755o4480Q6796L9391r1861j2649m0715n047R8650Q3738N7837m9191
$$ 1073755 1009275 1096071 1135462 1043601 1030952 990237 985190 1083840 1167578 1225415 1176224
12327A176224l4006J57857J8514j05604j45629M2611L643o3563J5399Q1086o2715
$$ 1176224 1142218 1300075 1318589 1212985 1067356 1109967 1113610 1050047 1065446 1146532 1083817
12316A083817L5768L7765J2870O9818P176m5819Q9681L0761j04151m0726j0228
$$ 1083817 1119585 1157350 1170220 1240038 1247214 1201395 1291076 1321837 1217686 1176960 1166732
12305A166732L6581Q857k5772q58Q0745J47872k3885p4554l7704p5603p7596K6460
$$ 1166732 1203313 1212170 1186398 1185540 1266285 1414157 1390272 1315718 1278014 1202411 1124815 1151275
12293A151275L4110J36423K1967J635K7083J1721K5882l058q934o8608p9848P4620
$$ 1151275 1185385 1321808 1343775 1345410 1372493 1384214 1410096 1407038 1398104 1329496 1249648 1324268
12281A324268N6291l7618J4027O4752J99124L5336j36455N3352K553J5566L4887
$$ 1324268 1380559 1342941 1356968 1421720 1620844 1656180 1519725 1573077 1575630 1591196 1626083
12270A626083N4815K1825q7469l0624J15559Q7626L4834p8587j57025l4651L1591
$$ 1626083 1680898 1702723 1615254 1584630 1700189 1787815 1822649 1744062 1587037 1552386 1583977
12259A583977P7744O4062L1199n7186j8414r1338o7395J05246O0065k3753J49043
$$ 1583977 1661721 1725783 1756982 1699796 1681382 1590044 1522649 1627895 1687960 1664207 1813250
12248A813250J1369n1644J2525o7100K8300M8989p829p6323m1206M2551J01413
$$ 1813250 1824619 1772975 1785500 1718400 1746700 1795689 1787860 1711537 1670331 1712882 1814295
12237A814295k5929l6617N81J24215Q4464k9549m263j16735j52347K2845M5963
$$ 1814295 1788366 1751749 1752330 1876545 1961009 1931460 1927197 1810462 1658115 1680960 1726923
12226A726923P9623K434r656l4990P4131R6573R674O4959L4322m475j5594P812
$$ 1726923 1806546 1808980 1799324 1764334 1838465 1935038 1944712 2009671 2043993 2039518 2023924 2031736
12214B031736p9722l4820O6261J19985l3705p7571k0313R4909m6026Q6590R6592
$$ 2031736 1952014 1917194 1983455 2103440 2069735 1992164 1971851 2066760 2020734 2107324 2203916
12203B203916P6082j297N366K3916j6817L2892J03227j7334l1653N1379q992K2783
$$ 2203916 2279998 2278701 2284067 2307983 2291166 2324058 2427285 2409951 2378298 2429677 2420685 2443468
12191B443468K6322p6161K6063Q5604J3455o8849m227K354K9660J22952J8270
$$ 2443468 2469790 2393629 2419692 2505296 2518751 2449902 2445675 2448029 2477689 2600641 2618911
12180B618911m9646N5497J94085n169j56395r9335j6720J55099Q0235j9154O3977
$$ 2618911 2569265 2624762 2818847 2813678 2657283 2557948 2541228 2696327 2776562 2757408 2821385
12169B821385J5811K9880M574L648N9067L1057J7299k5288J9600J9104M5466J32453
$$ 2821385 2837196 2867076 2871650 2875298 2934365 2965422 2982721 2957433 2977033 2996137 3041603 3174056
12157C174056M2673j20825m1419P2417r494k8742O3856M8597L4514m1922P2336
$$ 3174056 3216729 3095904 3054485 3126902 3117408 3088666 3152522 3201119 3235633 3193711 3266047
12146C266047J23046Q5287P9250M5704j11160p3425Q0786P9707M2119j08768K9146
$$ 3266047 3389093 3474380 3553630 3599334 3488174 3414749 3495535 3575242 3617361 3508593 3537739
12135C537739J02969J0993L2697L9227J1809J02136Q3387K9991J3308K9591R4653
$$ 3537739 3640708 3651701 3684398 3723625 3735434 3837570 3920957 3950948 3964256 3993847 4088500
12124D088500n430l2872P2049J01384M5635M6935J1361N7866K195m2289N2757
$$ 4088500 4083070 4050198 4122247 4223631 4269266 4316201 4327562 4385428 4387623 4345334 4398091
12113D398091N5551P6937J12747P0003M2135J29494j5839q9357P2148N4619j6259
$$ 4398091 4453642 4530579 4643326 4713329 4755464 4884958 4869119 4779762 4851910 4906529 4890270
12102D890270M6777J92582K31132O9801l2279N1447Q2003J2377O4470L6319l3273
$$ 4890270 4937047 5129629 5360761 5430562 5398283 5449730 5531733 5544110 5608580 5644899 5611626
12091E611626K2344J14145P4147P4716N5187R5827J33949J75163q4363n2981J04998
$$ 5611626 5633970 5748115 5822262 5896978 5952165 6047992 6181941 6357104 6272741 6219760 6324758
12080F324758J00914J71792J62214J58172k2182J18061M3888J07613K193P7105
$$ 6324758 6425672 6597464 6759678 6917850 6895668 7013729 7057617 7165230 7167423 7244528
12070G244528J32647Q6962Q2167R831M2678J15432J57860J12179J20188J66039
$$ 7244528 7377175 7464137 7546304 7556135 7598813 7714245 7872105 7984284 8104472 8270511
12060H270511J89832J32720O1143K5389J02935J46242K26569J78172J47943J71347
$$ 8270511 8460343 8593063 8654206 8679595 8782530 8928772 9155341 9333513 9481456 9652803
12050I652803P9505J75621J24757R0013J24279J75277J50606J26598J61802K65848
$$ 9652803 9732308 9907929 10032686 10122699 10246978 10422255 10572861 10699459 10861261 11127109
12040A1127109K31212K02647K17690J77554J73509K25858K24996K08187K80107
$$ 11127109 11358321 11560968 11778658 11956212 12129721 12355579 12580575 12788762 13068869
12031A3068869J48018L3018K32161K87720L30147K66806J91001K44385K83942
$$ 13068869 13216887 13249905 13482066 13769786 14099933 14366739 14557740 14802125 15086067
12022A5086067K01961K32420L10206M35843L17291L13300L52055L67803K87193
$$ 15086067 15288028 15520448 15830654 16266497 16583788 16897088 17249143 17616946 17904139
12013A7904139M47573M37657K84438K95873L29378L66786L73442M62128M29789
$$ 17904139 18351712 18789369 19073807 19369680 19699058 20065844 20439286 20901414 21331203
12004B1331203M58604N16743N46475M16420N87214O12650M24038M25267N54583
$$ 21331203 21789807 22306550 22853025 23269445 23856659 24469309 24893347 25318614 25873197
11995B5873197O78922P43139O83950O30780N75502O17093O61842P10713Q33938
$$ 25873197 26552119 27295258 27979208 28609988 29185490 29802583 30464425 31175138 32009076
11986C2009076P78217P61880P58902P65437P20122P97615Q78352R65446R08052
$$ 32009076 32787293 33549173 34308075 35073512 35793634 36591249 37469601 38435047 39343099
11977C9343099Q15113R25932J068606R79492J036291R67241J040695J013918J095561
$$ 39343099 40158212 41084144 42152750 43132242 44168533 45135774 46176469 47190387 48285948
11968D8285948J159441R81491J056465J213025J068179J040005J167858J247236
$$ 48285948 49445389 50426880 51483345 52696370 53764549 54804554 55972412 57219648
11960E7219648J159242J104667R96881R99309J073608J029599R00010R65591R09291
$$ 57219648 58378890 59483557 60480438 61479747 62553355 63582954 64482964 65448555 66357846
11951F6357846Q32103R03472Q15555O84329O26229M94496M75429M16029K96094
$$ 66357846 67189949 68093421 68908976 69593305 70219534 70714030 71189459 71605488 71901582
11942G1901582K61229K12570J90161R4817r5491j22477j79970l55582l87908l97058
$$ 71901582 72162811 72375381 72565542 72660359 72564868 72442391 72262421 71906839 71518931 71121873
11932G1121873m86447o17647o52739o68067r46980q61409q76255q96101r71894
$$ 71121873 70635426 70017779 69365040 68696973 67749993 66888584 66012329 65116228 64144334
11923F4144334j070039j115649j068194r19377j131908j186746j052240j122613
$$ 64144334 63074295 61958646 60890452 59971075 58839167 57652421 56600181 55477568
11915E5477568j085639j121433j096611j047523j083988j174397j073373r85126
$$ 55477568 54391929 53270496 52173885 51126362 50042374 48867977 47794604 46809478
11907D6809478j069179j023720j145420r86855r88034r38814r19719j005144r81677
$$ 46809478 45740299 44716579 43571159 42584304 41596270 40657456 39737737 38732593 37750916
11898C7750916q85755q27872r20500q32740q01119o92763p41406p53180p51849
$$ 37750916 36865161 36037289 35116789 34284049 33482930 32790167 32048761 31295581 30543732
11889C0543732o84624o51950o40673p07276p31492n99421o02489n95689n47821
$$ 30543732 29859108 29207158 28566485 27859209 27127717 26528296 25925807 25330118 24782297
11880B4782297n16421m69810m68404n39938n73670m42576m96440m99489m53642
$$ 24782297 24265876 23796066 23327662 22787724 22214054 21771478 21275038 20775549 20321907
11871B0321907m17092m41698m70515m86642l76226l08518k64191l23499k92798
$$ 20321907 19904815 19463117 18992602 18505960 18129734 17821216 17557025 17233526 16940728
11862A6940728l73856m67378m13289k06772k21085k88943k35642j87190k58802
$$ 16940728 16566872 16099494 15686205 15479433 15258348 14969405 14733763 14546573 14287771
11853A4287771l17017k43514k76945k93617j76363k46001k97818k42296j87943
$$ 14287771 13970754 13727240 13450295 13156678 12980315 12734314 12436496 12194200 12006257
11844A2006257k46444k39938k76224j10170j35177j48509j61531j35360k45409
$$ 12006257 11759813 11519875 11243651 11133481 10998304 10849795 10688264 10552904 10307495
11835A0307495k40404k10427j71331j45357j93948j90388r1230j51258j40604
$$ 10307495 10067091 9856664 9685333 9539976 9346028 9155640 9064410 8913152 8772548
11826H772548r4641j45323r7106j20647j06703r2785j51235j32862j44714j46418
$$ 8772548 8677907 8532584 8435478 8314831 8208128 8115343 7964108 7831246 7686532 7540114
11816G540114j83672n6416J6109j14285j25701j23120j79918j81439j20538l7993
$$ 7540114 7356442 7300026 7316135 7201850 7076149 6953029 6773111 6591672 6471134 6433141
11806F433141k3298r6152m3840q4775o3707k18095q5921k466m2200M0886k0692
$$ 6433141 6409843 6313691 6269851 6185076 6121369 5903274 5817353 5814887 5772687 5813573 5792881
11795E792881j70078j73539j03952j37216n5347q7801j11325q3002j3837j2857
$$ 5792881 5622803 5449264 5345312 5208096 5152749 5064948 4953623 4870621 4856784 4843927
11785D843927n7381M0912J8286r8872k1772r7528l0914L0283n1346p4223o1983
$$ 4843927 4786546 4827458 4845744 4746872 4725100 4627572 4596658 4626941 4575595 4501372 4439389
11774D439389p3807m3750p8237j47357j18248o8107n3462p5182n5159n7437J1115
$$ 4439389 4365582 4321832 4243595 4096238 3977990 3909883 3856421 3781239 3726080 3668643 3679758
11763C679758l8723p9737l2806Q547o4495m3434l809j7372L0606m4835m6154J4521
$$ 3679758 3641035 3561298 3528492 3537039 3472544 3429110 3425301 3407929 3438535 3393700 3347546 3362067
11751C362067Q0070j19248j63584J5393O855o3216J3007k9245j14436m6842R547
$$ 3362067 3442137 3322889 3159305 3174698 3181553 3118337 3131344 3102099 2987663 2940821 2950368
11740B950368p251k9682n3727j3528n3164K8219m7923J1141N325k3988k8280r108
$$ 2950368 2943117 2913435 2859708 2846180 2793016 2821235 2773312 2784453 2789778 2765790 2737510 2728402
11728B728402j22205n8522n4650j15469Q5543R150j7279n4762M606k9038k6647
$$ 2728402 2606197 2547675 2493025 2377556 2463099 2472249 2454970 2400208 2404814 2375776 2349129
11717B349129l9830J9256K3230m4271J0172N4655M2014q1827k0086j8345j25871
$$ 2349129 2309299 2328555 2351785 2307514 2317686 2372341 2414355 2332528 2312442 2294097 2168226
11706B168226p8388P8045P8997Q03o953l113j0321J391p9526p5847q0801m2845
$$ 2168226 2089838 2167883 2246880 2247683 2240730 2237617 2227296 2228687 2149161 2073314 1992513 1949668
11694A949668o1206o4238j8150L8956L7840q031J7338J709l7102J689j3647O1467
$$ 1949668 1888462 1824224 1806074 1845030 1882870 1874839 1892177 1893886 1856784 1858473 1844826 1906293
11682A906293K6180j644j06749j09981o3722M2252N8961k1326l0409o4613j02565
$$ 1906293 1932473 1930829 1824080 1714099 1650377 1692629 1751590 1730264 1699855 1635242 1532677
11671A532677M0090J11654q434q2148L7998P9004q436K4750j3586j7969k176R7304
$$ 1532677 1572767 1684421 1675987 1593839 1631837 1710841 1702405 1727155 1713569 1695600 1693424 1790728
11659A790728p0461l5524j1909j39116n9767n2884N0470J8978j22849j00930J5804
$$ 1790728 1720267 1684743 1672834 1533718 1473951 1421067 1471537 1490515 1367666 1266736 1282540
11648A282540M4544J9603r7066Q1371P4698L6609j27080R701p6960n3826J8891
$$ 1282540 1327084 1346687 1249621 1330992 1405690 1442299 1315219 1324920 1247960 1194134 1213025
11637A213025M8154J14579k667k6629n4007p2511o3679j4956J1258P1023L5315
$$ 1213025 1261179 1375758 1373091 1346462 1292455 1219944 1156265 1141309 1152567 1223590 1258905
11626A258905q3138o4845l9549K4568Q3891q550O4156j0267q5436l4163N17J16175
$$ 1258905 1175767 1110922 1071373 1095941 1179832 1171282 1235438 1225171 1139735 1105572 1106089 1222264
11614A222264J34335N292j44927r601l3288j35234q599J16671j0743l1763r052
$$ 1222264 1356599 1361891 1216964 1207363 1174075 1038841 1030242 1146913 1136170 1104407 1095355
11603A095355J4731r782l333M3789L742q1170r8980r776p1103L9533L3539Q9159
$$ 1095355 1110086 1100304 1096971 1140760 1144502 1063332 964352 954576 883473 923006 956545 1045704
11591A045704N2945K7339k9033j5521k0327p4052k5426k5290P3721m4166o3142
$$ 1045704 1098649 1125988 1096955 1081434 1061107 987055 961629 936339 1010060 965894 902752
11580I02752m419N2165O298N9820K0553p1081n9068L5865j7482m2674n4549J3162
$$ 902752 898333 950498 956796 1016616 1037169 966088 907020 942885 925403 882729 828180 841342
11568H41342J7297M2305O1802J4926l9288l5430q355P5644m2001m1763p2647l9400
$$ 841342 858639 900944 962746 977672 938384 902954 894599 970243 928242 886479 813832 774432
11556G74432k1441l8378M263L833J37611P3487n6735m984K5282l8776K8714Q0675
$$ 774432 752991 714613 718876 722709 860320 933807 877072 872088 897370 858594 887308 967983
11544I67983p6401r6279k0339Q505N4164n2425p629p6583K5516L151k108k9304
$$ 967983 891582 795303 774964 783469 837633 785208 777579 700996 726512 729663 727555 698251
11532F98251j0956O1512M0113j6165K6486p6577L840J3246R128p6102m4546R1361
$$ 698251 687295 748807 788920 772755 799241 722664 726504 739750 748878 672776 628230 719591
11520G19591J30951o1390k9283J1981j3631L1519K741K893o152J4071J1316O6144
$$ 719591 850542 789152 759869 771850 758219 789738 792479 795372 789220 803291 814607 880751
11508H80751l7062q3416n5083J8533P8573R084m5852o4615j09616n4228M8619
$$ 880751 843689 760273 705190 723723 802296 811380 765528 700913 591297 537069 585688
11497E85688K968Q4330j8399m2346J5907N8783Q3706m1788q8545k8697O0790Q6341
$$ 585688 588656 672986 654587 612241 628148 686931 770637 728849 640304 611607 672397 758738
11485G58738r411l1323k6553m3729o2690K1368J05108N1508O4026n9594l4206
$$ 758738 749327 718004 691451 647722 585032 606400 711508 763016 827042 767448 733242
11474G33242m3589L1223N5674r446j344K0470n9329o820R21l7954J8562Q450j689
$$ 733242 689653 720876 776550 767104 765760 786230 726901 720081 721002 683048 701610 710060 708371
11461G08371Q6160j853j01293L0411P9516J3828k8651k8589j0794j04357o2793
$$ 708371 794531 792678 691385 721796 801312 815140 786489 757900 747106 642749 579956
11450E79956O0638J11234j6603l8878K2355k3449J5667R2204o8008M5999P2030
$$ 579956 640594 751828 735225 696347 718702 695253 710920 803124 735116 781115 853145
11439H53145J7287m0911l3279q0767o7681Q3496k8008j8905m850J36116N2611
$$ 853145 870432 829521 796242 715475 647794 731290 703282 684377 679527 815643 868254
11428H68254j04984L235Q9027L809k2302K8709Q4455J73412J47492J47765J86055
$$ 868254 763270 766505 855532 859341 837039 865748 950203 1123615 1271107 1418872 1604927
11417A604927K29105L67776M35220M58528J64779J42669N4550l960k80544m01548
$$ 1604927 1834032 2201808 2637028 3095556 3260335 3403004 3457554 3453594 3173050 2771502
11407B771502m38699l75793k89455k48417j53338m6042m2679n4797j03482j25375
$$ 2771502 2332803 1957010 1667555 1419138 1265800 1219758 1177079 1122282 1018800 893425
11397H93425N4831r441j42716k9001J8612J13285L2907o605n6123l9931N726l6819
$$ 893425 948256 938815 796099 767098 785710 898995 931902 925297 869174 829243 834969 798150
11385G98150J0400K7018j43j3435j6890j13262j42372J1218l2834l5220N7377
$$ 798150 808550 835568 835425 821990 805100 691838 549466 560684 527850 492630 550007
11374E50007J07084j7156N7122O5649m8415j736J4566n1232j06865j45562L936
$$ 550007 657091 639935 697057 762706 714291 712555 727121 675889 569024 423462 427398
11363D27398J49719O8081M3023N3111K1361R995O3187k5405j6849K4496j9830
$$ 427398 577117 645198 688221 741332 762693 772688 835875 810470 793621 818117 798287
11352G98287o1045r0727J7400K4341q3841r7981N7089N9086Q5913l57O8550k7078
$$ 798287 737242 646515 663915 688256 604415 506434 563523 622609 708522 708165 776715 749637
11340G49637n249m8106j85546q3680N6762M4016k807K5603J14358l7792q9529
$$ 749637 744388 696282 510736 427056 483818 527834 525027 550630 664988 627196 537667
11329E37667j0140j9111k2434J38662k141k9015N2834P1263l5722o6576J9371
$$ 537667 527527 508416 485982 624644 622503 593488 646322 717585 681863 615287 634658
11318F34658N0947j9082K85K1302O9391p3552p5123o1288M9557n770K425q0805
$$ 634658 685605 666523 666808 688110 757501 683949 608826 547538 597095 591325 593750 512945
11306E12945l5878r8171m3941J14145J53458l8845O948m6784Q078j5087k2562
$$ 512945 477067 378896 334955 449100 602558 563713 570661 523877 531955 516868 494306
11295D94306k7683N2621Q5698M9489q6037O9009n0515j00722O0056O2946j4116
$$ 494306 466623 519244 604942 654431 568394 637403 586888 486166 546222 609168 595052
11284E95052m1785J6561K7822P616L331l8968j5242N8960j4690K2760j42436L25
$$ 595052 553267 569828 597650 605266 608597 569629 554387 613347 598657 621417 478981 479306
11272D79306J80454M3938j4470n4494p3074R9573l0677J4281q1558k36K7042O1720
$$ 479306 659760 703698 689228 634734 561660 661233 630556 644837 563279 563043 590085 651805
11260F51805N3189p0624n0698M4334O6698J61788M3603R7750O0135N9083P0613
$$ 651805 704994 634370 583672 628006 694704 856492 900095 997845 1057980 1117063 1187676
11249A187676K6894m7122q8652j7374n9017j19222k3284K0392Q629j26346o4132
$$ 1187676 1214570 1167448 1078796 1061422 1002405 883183 859899 880291 888920 762574 698442
11238F98442J5157J3861l3342J7396k4408q0333K9376j4865P1828K5603n5810
$$ 698442 713599 727460 694118 711514 687106 606773 636149 621284 693112 718715 662905
11227F62905P9763K1625M8806m436M3575k715R855r7461k9242K1841j06838J41198
$$ 662905 742668 764293 813099 808663 852238 849523 859378 761917 732675 754516 647678 788876
11215G88876J59698J06912l8258j18154J9137P6842K7991j0746j07222j73300
$$ 788876 948574 1055486 1017228 899074 918211 995053 1023044 1012298 905076 731776
11205G31776j4987l6878M0230J04502Q9360L9491n279M0575r84r0316N7404q5897
$$ 731776 716789 679911 720141 824643 914003 953494 948215 988790 987806 897490 954894 868997
11193H68997j14726K6735N621j317k2767P0662J6754j5710L1616j27377M0099
$$ 868997 754271 781006 786627 785310 762543 833205 849959 834249 865865 738488 778587
11182G78587M9089K1290O471n942l7232q243M2905J1195j5010k44l9210J24374
$$ 778587 827676 848966 855437 849495 812263 804020 846925 858120 843110 842866 803656 928030
11170I28030M7146j21207k4288Q2221l0926Q660J29217P1544k2372M4862M4912
$$ 928030 975176 853969 829681 911902 880976 889636 1018853 1090397 1068025 1112887 1157799
11159A157799j6805m924L2742L3776K0452L0236m730j06745l3433J4109N5749
$$ 1157799 1140994 1136070 1168812 1202588 1223040 1253276 1248546 1141801 1108368 1122477 1178226
11148A178226M2985P6769q1323r5537l2077J00686J02879J5801M5334o2321m008
$$ 1178226 1221211 1297980 1216657 1121120 1089043 1189729 1292608 1308409 1353743 1291422 1287414
11137A287414J5251m6472R286j3228r3068m6595J49989Q2610J0931P9886P4795
$$ 1287414 1302665 1256193 1265479 1252251 1159183 1112588 1262577 1345187 1356118 1436004 1510799
11126A510799O7856N7099N3134L5638l9434Q9369O7110m9621l6889K2562J489
$$ 1510799 1578655 1635754 1688888 1724526 1685092 1774461 1841571 1791950 1755061 1777623 1779112
11115A779112q3493k1594R9393j917Q178J6217K3331L6432o0616n1979k990n217
$$ 1779112 1695619 1674025 1773418 1771501 1779679 1795896 1819227 1855659 1795043 1743064 1740074 1734857
11103A734857l2861j9531P1582j8822m1307N8498J42605J15037J06005n4345n9575
$$ 1734857 1701996 1682465 1754047 1735225 1693918 1752416 1895021 2010058 2116063 2061718 2002143
11092B002143P8988R9564N536k1179n0l0209R4131J04077O4269L4199n8143L5165
$$ 2002143 2081131 2180695 2186231 2165052 2165002 2134793 2228924 2333001 2397270 2431469 2373326 2408491
11080B408491J27773J09611j0280l8527k5479P9630J08608P9704N3764O2116J71731
$$ 2408491 2536264 2645875 2635595 2597068 2571589 2651219 2759827 2839531 2893295 2955411 3127142
11069C127142K32849O5347q8030r6551J06658R3943J50848J14693k7264N09O8125
$$ 3127142 3359991 3425338 3337308 3240757 3347415 3441358 3592206 3706899 3679635 3680144 3748269
11058C748269J97574J79286J72335J15142N0737j4573O0456J33544J10560K55154
$$ 3748269 3945843 4125129 4297464 4412606 4463343 4448770 4509226 4642770 4753330 5008484
11048E008484L16086J94483J82587J46164J49023K51525L38511L27056L39421
$$ 5008484 5324570 5519053 5701640 5847804 5996827 6248352 6586863 6913919 7253340
11039G253340K40221L05235M07922L91936L31892L62674M99415N95197N83412
$$ 7253340 7493561 7798796 8206718 8598654 8930546 9293220 9792635 10387832 10971244
11030A0971244P37373P16012P76678R53501J005707J180655J416425J526458J545855
$$ 10971244 11708617 12424629 13201307 14154808 15160515 16341170 17757595 19284053 20829908
11021B0829908J655751J715738J832296J784776J965704K123101K841829L543728
$$ 20829908 22485659 24201397 26033693 27818469 29784173 31907274 34749103 38292831
11013C8292831M284290N529905P022286Q745097J1145259J4412055J8714823K5129467
$$ 38292831 42577121 48107026 55129312 63874409 75019668 89431723 108146546 133276013
11005A33276013L4118919M6208817O1378080P7588164Q8501409Q1499538N0622771
$$ 133276013 167394932 213603749 274981829 352569993 441071402 522570940 573193711
10998E73193711J7891175o807048l8839942q1718808j01378571q7134054o4643522
$$ 573193711 591084886 584277838 545437896 463719088 362340517 275206463 210562941
10991B10562941m6215000l3135877k4168678j7926911j3734058j0806661q594524
$$ 210562941 164347941 131212064 107043386 89116475 75382417 64575756 55981232
10984E5981232o918513n556663m513148l840087l156860k523783k031542j623157
$$ 55981232 49062719 43506056 38992908 35152821 31995961 29472178 27440636 25817479
10976B5817479j607538j450444j421272j353706j487824j557120j649548j262285
$$ 25817479 24209941 22759497 21338225 19984519 18496695 16939575 15290027 14027742
10968A4027742j136424r09954o63776n31018n27771n50364m74922l26311m15085
$$ 14027742 12891318 11981364 11317588 10786570 10258799 9708435 9233513 8907202 8492117
10959H492117l29947k28756j85601l13416l51042l42403k58457q6747j62763j95893
$$ 8492117 8162170 7933414 7747813 7434397 7083355 6740952 6482495 6395748 6232985 6037092
10949F037092r306j82754l03186l23824k11531k72490k66679l18535j92728j50954
$$ 6037092 6027786 5845032 5541846 5218022 5006491 4734001 4467322 4148787 3956059 3805105
10939C805105j26365j25203K2791k5863l8866j55929k18066j05029N36r0472j17575
$$ 3805105 3678740 3553537 3576328 3550465 3511599 3355670 3137604 3032575 3033111 2942639 2825064
10928B825064j82332j49697k00926l6892j23499j00537k9359j11421j20701j3366
$$ 2825064 2642732 2493035 2292109 2255217 2131718 2031181 2001822 1890401 1769700 1756334
10918A756334J8525J4444j41387r2063m0887p4023k6524l3349n8591K4017o3422
$$ 1756334 1774859 1789303 1647916 1555853 1514966 1440943 1414419 1381070 1322479 1346496 1283074
10907A283074p7895K7246R2037M143j21053o6393K9236n0391j9914m558j1166
$$ 1283074 1205179 1232425 1324462 1328605 1207552 1141159 1170395 1120004 1100090 1095532 1084366
10896A084366m9535k7384L1914o2896M8425q9250j65953L1397R3639j6014L6387
$$ 1084366 1034831 1007447 1039361 976465 1024890 935640 769687 801084 894723 878709 915096
10885I15096M2448l2213j50255K5266o1979p1084k2858N5450j14095j04780J30132
$$ 915096 957544 925331 775076 800342 738363 667279 644421 699871 585776 480996 611128
10874F11128P5374Q7481J06607Q2318J20584N9284j5032j52150j35393l8483O2410
$$ 611128 686502 773983 880590 962908 1083492 1142776 1127744 975594 840201 801718 864128
10863H64128j4555n6834j27660j62810J1314j6132o7883j714j6623J6638k6376
$$ 864128 849573 792739 665079 502269 513583 497451 429568 427854 411231 427869 401493
10852D01493M360o0833r7476M4802J02778K3920q7145K9083M3014j6774q4714
$$ 401493 405853 345020 247544 292346 395124 419044 331899 360982 403996 387222 302508
10841C02508J8937o3981o8435q1069P5596J13878k2832R271K9517n4647J2921
$$ 302508 321445 257464 189029 107960 183556 297434 274602 283873 313390 258743 271664
10830B71664J6792L6030Q0942j4704m5599J5369Q550l8927n0844m1878l3295o5779
$$ 271664 288456 324486 405428 390724 345125 360494 369044 330117 279273 237395 204100 138321
10818A38321J1320k6921M1753j7360Q2357K07484R9153j35019L8475N0356q1995
$$ 138321 149641 122720 164473 147113 229470 436954 536107 401088 439563 489919 407924
10807D07924j52294o0939J5286O7742j0080j6082k5922J8905L7046m5457q9448
$$ 407924 255630 194691 209977 277719 267639 251557 225635 244540 281586 236129 146681
10796A46681J02042J054j00401r7908P3199O7356Q8199m0328J0800j19323n5083
$$ 146681 248723 249777 149376 51468 124667 192023 280222 239894 250694 131371 76288
10785G6288P9872K5363m6504Q252L0886K3991r555k2450P6777j5767L2879J03208
$$ 76288 156160 181523 135019 143271 174157 198148 188593 166143 242920 227153 260032 363240
10773C63240p86k3449P040k0186l1617R97j4564k13417m0193J17272J27935P5657
$$ 363240 362454 339005 346045 325859 294242 295239 280675 67258 27065 144337 272272 347929
10761C47929J6447p8779N3729N7236K8606q3092n7040m6413n4226M2904l3068
$$ 347929 364376 285597 339326 396562 425168 342076 285036 238623 184397 227301 194233
10750A94233m8915p243N4842O1997k0750n2709O4875k2311O2424k6973P765J07277
$$ 194233 145318 138075 192917 254914 234164 181455 246330 224019 286443 259470 267235 374512
10738C74512P7242J2390j1191l4116k5385l7537P18N4612R7985o7114L9902O0953
$$ 374512 451754 464144 452953 418837 393452 355915 356633 411245 509230 442116 482018 542971
10726E42971N5385m2092j25394L4622J20046J4193O877k438q2301q5714R8100
$$ 542971 598356 556264 430870 465492 585538 599731 606608 604170 521869 436155 534255
10715E34255J8953l6086L4212L5522p9996j2765N8465P3970N5664K2288M9886
$$ 534255 553208 517122 551334 586856 506860 494095 552560 626530 682194 704482 754368
10704G54368l893m6968k6000l9550J7341N0810M1958P6200L3032n2638p0623j8716
$$ 754368 750475 703507 677507 637957 655298 706108 748066 824266 857298 804660 734037 715321
10692G15321P4486O0341J1875j32151j02244J08383M7694j9281o0308l5473J62359
$$ 715321 789807 850148 862023 729872 627628 736011 783705 764424 704116 668643 831002
10681H31002J4668p0896J9914J17600J15217M9657j5538n0989k1534P2265N7456
$$ 831002 845670 774774 794688 912288 1027505 1077162 1061624 1010635 989101 1061366 1118822
10670A118822o3077r7371L4921J12950J03075Q3295J25744J14407j536j34973
$$ 1118822 1055745 958374 993295 1106245 1209320 1292615 1418359 1532766 1531230 1396257
10660A396257j12199L0072R3268K391L4653P9235P7634n0748Q8212J50117O5668
$$ 1396257 1284058 1314130 1407398 1409789 1444442 1523677 1601311 1550563 1638775 1788892 1854560
10649A854560Q8753M1753N0770M0232R4457J16820J82005J42062J38011R3766
$$ 1854560 1943313 1985066 2035836 2076068 2170525 2287345 2469350 2611412 2749423 2843189
10639B843189J73668K41241K63967L22908L21286M03407M25919M71093M51060
$$ 2843189 3016857 3258098 3522065 3844973 4166259 4569666 4995585 5466678 5917738
10630E917738N05589O74345R51007J147623J506285J953732K420810L188306L866895
$$ 5917738 6423327 7097672 8048679 9196302 10702587 12656319 15077129 18265435 22132330
10621B2132330M500266M790372M698369L894087K909900K028638J066568M85010
$$ 22132330 26632596 31422968 36121337 40015424 42925324 44953962 46020530 46505540
10613D6505540O70399J736715L609868N709344P594850Q423544P704202N806833
$$ 46505540 47175939 48912654 52522522 58231866 65826716 74250260 81954462 87761295
10605H7761295L560247R07286j576127l139204l047173q99166K418237N878328
$$ 87761295 91321542 92228828 90652701 87513497 84466324 83567158 85985395 91863723
10597I1863723Q405231R299708P779251M621154J009933k840524o855140r480036
$$ 91863723 100268954 109568662 117347913 121969067 122979000 120138476 113283336 103803300
10589A03803300r541892p026012l450945p289K587608L413897K519708M25226
$$ 103803300 94261408 87235396 83784451 83777162 86364770 89778667 92298375 92723601
10581I2723601j903625m371886p056594q861196q516579o834556m649529k624639
$$ 92723601 90819976 86448090 79391496 70530300 62013721 55179165 50529636 47904997
10573D7904997j204311o66972q94578j702443k681116l554422m573303n100161
$$ 47904997 46700686 46033714 45139136 43436693 40755577 37201155 32627852 27527691
10565B7527691m890321m170389l221093k416649j926615j582144j253810r36135
$$ 27527691 22637370 18466981 15245888 12829239 10902624 9320480 8066670 7130535
10557G130535p01385n10114m99318n75795m66171m12080j83669j56542k16389
$$ 7130535 6429150 5919036 5419718 4843923 4377752 3965672 3782003 3625461 3409072
10548C409072j97409k63637k54953k53289j75362j55952n3720q1259j09169j20466
$$ 3409072 3211663 2948026 2693073 2439784 2264422 2108470 2054750 1973491 1864322 1743856
10538A743856K4891j55347r3445L2439j0111j08320m5959j16357j01117p6907
$$ 1743856 1768747 1613400 1519955 1552394 1542283 1433963 1388004 1271647 1170530 1093623
10528A093623o8775k6251p2189o8973o5905r9217R783Q6139l1505o3918R2444
$$ 1093623 1024848 998597 926408 857435 791530 692313 702096 788235 756730 692812 785256
10517G85256J0473J0965q9615j07923l7835o3391q7483k1575J05204n5793j46360
$$ 785256 795729 806694 717079 609156 571321 507930 420447 398872 504076 448283 301923
10506C01923j27419j8449O9558L3137p7183N055O3739K6661n5591Q405m4678q5156
$$ 301923 174504 156055 225613 258750 181567 186622 250361 277022 221431 229836 185158 100002
10494A00002j9613o1707o6987K977M685M0923J0953P0681K6342J684O003o9683
$$ 100002 80389 18682 -48305 -45328 -40643 280 11233 81914 108256 109940 115943 46260
10482D6260j4030L4628o4371m6215J11276N2150L9217q9947m3120L6522J02984
$$ 46260 32230 66858 2487 -43728 67548 119698 158915 68968 25848 62370 165354
10471A65354o3575r1503K0790J1165j8896j051J784j17296o4672O3906J25773
$$ 165354 101779 10276 31066 42231 23335 22284 24068 -93228 -157900 -93994 31779
10460C1779L9135k9634q5825J5987n8904r1435J3068Q1595j4907r6833K2925J01759
$$ 31779 70914 41280 -44545 -28558 -87462 -178897 -165829 -84234 -99141 -195974 -173049 -71290
10448g1290M9306q3296m8865n2402l69m7871l4664O1636R1276K4936j9218j0676
$$ -71290 -21984 -105280 -154145 -206547 -206916 -254787 -289451 -227815 -136539 -111603 -130821 -141497
10436a41497O7189O7951O3847J658j76661l2959q2727n8721J8495Q507K9311m4979
$$ -141497 -74308 -6357 57490 59148 -117513 -150472 -233199 -291920 -273425 -264918 -235607 -280586
10424b80586Q5812l207l4233m2927O2452J54191J1746j46561j7017k9377R617
$$ -280586 -194774 -197981 -232214 -275141 -212689 -58498 -46752 -193313 -210330 -239707 -230090
10413b30090Q36k8730J6380O0060K8512L3034J8657M064j46365m1785O486P7872
$$ -230090 -229254 -257984 -241604 -181544 -153032 -119998 -101341 -97277 -243642 -285427 -278941 -201069
10401b01069O6013j9090O170N5096M0533j06105R51m665q2317o5392N2996J09115
$$ -201069 -135056 -154146 -147976 -92880 -52347 -158452 -157501 -162166 -244483 -309875 -256879 -147764
10389a47764k6074L0063K1795j02062q3812n2425L797Q2346O8101p6945r5750
$$ -147764 -173838 -143775 -121980 -224042 -307854 -360279 -356482 -274136 -206035 -282980 -378730
10378c78730K0543M0310M5209J9019K5208L5725Q5350R7541j40276j55974j0880
$$ -378730 -358187 -317877 -272668 -253649 -228441 -192716 -107366 -9825 -150101 -306075 -316955
10367c16955o2203j9196M5491J8525K1956N4164L2946J9283M8003j9614k3854
$$ -316955 -379158 -398354 -352863 -334338 -312382 -258218 -225272 -205989 -157986 -177600 -201454
10356b01454j04849M6577R5724O3397q0632L3307l080K4343n5238o3854L8197
$$ -201454 -306303 -259726 -164002 -100605 -181237 -147930 -151010 -126667 -181905 -245759 -207562
10345b07562K8016k2512q0079J15921K2880l3201M4690k6083j17993J2505J63580
$$ -207562 -179546 -202058 -282137 -166216 -143336 -176537 -131847 -157930 -275923 -263418 -99838
10334i9838J17422r6797j27760k3179P1716N2663J983l679k9341p3764J8261m5431
$$ -99838 17584 -79213 -206973 -230152 -158436 -105773 -103790 -107469 -136810 -210574 -192313 -237744
10322b37744n4017m8309n933J04205J022J11441k3620N018k7121J2849J5234p4015
$$ -237744 -291761 -340070 -346003 -241798 -240776 -129335 -152955 -147937 -175058 -162209 -146975 -220990
10310b20990n029M3101Q2465M3980k1191k1424L6727K3238M4235k5232n5926m2096
$$ -220990 -226019 -182918 -100453 -56473 -77664 -99088 -62361 -39123 5112 -20120 -76046 -118142
10298a18142J00497L0578l965P1349O5508L667j40976n1321Q2273J52149r656
$$ -118142 -17645 12933 8968 80317 145825 149492 8516 -42805 39468 191617 181961
10287A81961J4570Q893N2000o0643M1650J19168J56981L30022K82995L28392M82865
$$ 181961 196531 205424 257424 196781 238431 357599 514580 844602 1127597 1455989 1938854
10276A938854N76351N21774M89485L69306K47236J33097P7723j32592k23007l27935
$$ 1938854 2515205 3036979 3526464 3895770 4143006 4276103 4353826 4221234 3998227 3670292
10266C670292m12766m64007m88092m66042m35053l31002k45325k19288k46780
$$ 3670292 3257526 2793519 2305427 1839385 1404332 1073330 828005 608717 361937
10257C61937j59391l9210j3604m2060j5406j57707q4309k2017P1514J24295l3745
$$ 361937 202546 163336 149732 107672 92266 -65441 -149750 -171767 -100253 24042 -9703
10246i703J5049j14123k5416K7361m8834K7790K5396m2356l7271L0120N2670L0096
$$ -9703 5346 -108777 -134193 -106832 -155666 -127876 -102480 -144836 -182107 -151987 -99317 -69221
10234f9221p397j32552j8618n8015Q332J00914R9073q27M1163q6914m5678m2003
$$ -69221 -76618 -209170 -227788 -285803 -277471 -176557 -77484 -78311 -37148 -124062 -169740 -211743
10222b11743J659K8886O0145Q1885j7573j63211k7033J11293P8798K9943L3590
$$ -211743 -210084 -181198 -121053 -39168 -56741 -219952 -246985 -135692 -56894 -26951 6639
10211F639q7299q3073n6474j9873r0537L4416m104m894Q6431N3747m3k253l2976
$$ 6639 -80660 -163733 -220207 -240080 -330617 -296201 -300305 -305199 -218768 -165021 -165064 -167317 -200293
10198b00293L0717j7391J0843J10152M1826Q7466j05531p5455P2598j5107l4638
$$ -200293 -169576 -186967 -176124 -65972 -24146 63320 -42211 -117666 -45068 -60175 -94813
10187i4813J50916J06969K4028q6853p0352K1954L5572n04Q5134J4660n077n6831
$$ -94813 56103 163072 187100 100247 29895 51849 87421 86917 172051 186711 181634 124803
10175A24803r5004L4284J22403M6652J8468N2366r668N9895j8041q6251N5682
$$ 124803 29799 64083 186486 233138 251606 303972 294304 354199 336158 249907 305589
10164C05589O5526m1814L7688l4103l7904J21661O8424K2756N1734k5953N630
$$ 305589 371115 329301 366989 332886 294982 416643 485067 507823 559557 533604 539234
10153E39234R550o4603q0893m3206j325R4957M6670j78814j02620j5066Q248K6425
$$ 539234 548784 484181 403288 360082 358757 453714 500384 321570 218950 203884 212132 238557
10141B38557N5992p3930j80315N2341O6244m799l2234p9534r3026n1347j8856
$$ 238557 294549 220619 40304 92645 158889 154090 121856 42322 -50704 -102051 -120907
10130a20907L7198N2188j8844m4896M4283N579l3793M6686J8063n0976o7739o1060
$$ -120907 -83709 -31521 -50365 -95261 -50978 -45399 -79192 -32506 -14443 -65419 -133158 -194218
10118a94218R3623J35293L9852o7482p549J2330m2859q3257l5940j8876J5091
$$ -194218 -100595 34698 74550 7068 -481 11849 -31010 -114267 -150207 -169083 -153992
10107a53992k4387r3778L7651k824r5560l0949Q7114J41424K9525O3527L2803
$$ -153992 -178379 -272157 -234506 -237330 -332890 -363839 -276725 -135301 -105776 -42249 -9446
10096i446P751K7299l7787l1926o3585j13758M3780R4319L1986Q861R43K1999
$$ -9446 -1695 25604 -12183 -44109 -107694 -221452 -177672 -83353 -51367 -42506 -41563 -19564
10084a9564j8942j04205l6763K8420k629K0104J7671n5295n5277j6437P7378J01415
$$ -19564 -38506 -142711 -179474 -151054 -153683 -133579 -115908 -171203 -226480 -242917 -165539 -64124
10072f4124N657N4639R7741j7766n4949J6586k1137l657J0496j05099k4056K6726
$$ -64124 -58467 -3828 93913 76147 21198 37784 16647 12990 23486 -81613 -105669 -78943
10060g8943M5537l6914o9269l3475J13796O2664n4778j00533j7783L6104n4914
$$ -78943 -33406 -70320 -139589 -173064 -59268 3396 -51382 -151915 -169698 -133594 -188508
10049a88508n6241k6762N5949J10564n9880m5167k8658l2735J01124J49480N691
$$ -188508 -244749 -271511 -215562 -104998 -164878 -210045 -238703 -271438 -170314 -20834 -15143
10038a5143j24952k3269p087M1062P33o4718j7905n0414M1391Q0419L9074m7576
$$ -15143 -140095 -163364 -170451 -129389 -128656 -193374 -211279 -261693 -220302 -139883 -100809 -148385
10026a48385L0264J07781l4855p4940l6226J5022k6658j378N4930R1086j6023
$$ -148385 -118121 -10340 -45195 -120135 -156361 -141339 -167997 -169375 -114445 -23359 -39382
10015c9382j4254K7720o4057m551l6126J1320O8827M7074L5380L7773P3638r0057
$$ -39382 -53636 -25916 -89973 -94524 -130650 -119330 -50503 -3429 31951 69724 143362 53305
10003E3305r9386n0621j5958J5956l3879K668J891Q7934q530l3615l9215k2330
$$ 53305 -46081 -96702 -112660 -96704 -130583 -127915 -126024 -38090 -46620 -80235 -119450 -141780
9991a41780j1705O7549M1062P326l0351n7649j39584q8426J03907P9997J08010
$$ -141780 -153485 -85936 -44874 -37548 -67899 -125548 -265132 -353558 -249651 -169654 -61644
9980f1644P7923Q0635l2055q2776j10148r0994Q3643p5927j17956n6624m176Q7059
$$ -61644 16279 96914 64859 -17917 -128065 -219059 -135416 -211343 -329299 -385923 -390099 -303040
9968c03040J64132J03239J2634m8606k4313L3591r503p8406O216k691j05876j9357
$$ -303040 -138908 -35669 -23035 -71641 -95954 -62363 -71866 -150272 -144056 -146747 -252623 -271980
9956b71980q3409M114J12418O2881Q4898N897P4932l7175r0425k0589O1166q1732
$$ -271980 -355389 -351275 -238857 -175976 -91078 -85181 -10249 -47424 -137849 -158438 -97272 -179004
9944a79004K7349l821n2677K2463P0521R3339M2934m0415M9413P3593p7157j07123
$$ -179004 -151655 -155476 -208153 -185690 -115169 -21830 21104 -19311 30102 103695 26538 -80585
9932h0585n4379p1968j2030l0904P3489R810K3841M7380j7067N7083Q0646j49882
$$ -80585 -134964 -206932 -218962 -249866 -176377 -166567 -142726 -95346 -112413 -55330 25316 -124566
9920a24566j88371K2266N5935J29673N8035l7873k4049L876R7046l3106J5054
$$ -124566 -312937 -290671 -234736 -105063 -47028 -84901 -108950 -105074 -8028 -41134 -26080
9909b6080k6417l6352K9821o5411j39144O6272J39958J870j55719K4103J04863
$$ -26080 -52497 -88849 -59028 -124439 -263583 -197311 -57353 -55483 -211202 -187099 -82236
9898h2236n5173k3059J15844j2277q0301K4968M774Q2539O7293k9327q1499m1915
$$ -82236 -137409 -160468 -44624 -56901 -137202 -112234 -107460 -24921 42372 13045 -68454 -110369
9886a10369j8136J834L57K5193m7981N169j02469p060J180J739P8903J98542J08698
$$ -110369 -128505 -126671 -126314 -101121 -149102 -143933 -246402 -253462 -252282 -250543 -171640 26902 135600
9873A35600q4745j31646J4666k4174K2219J77646j2853j39502o6505j4113N7176
$$ 135600 50855 -80791 -66125 -90299 -68080 109566 96713 -42789 -109294 -123407 -66231
9862f6231n7971J9015M6255k7410l3173N0830N0504K4673r8472q4892o4290n9598
$$ -66231 -124202 -105187 -58932 -86342 -119515 -68685 -18181 6492 -91980 -176872 -241162 -300760
9850c00760R6101J15334R3933M2224J10991m9583j3634n3293r6403M5646k1415
$$ -300760 -204659 -89325 4608 46832 157823 108240 94606 41313 -55090 -9444 -30859
9839c0859j16056j3646m359n571k4041m3961Q075N9044J841n6150p9458J5286
$$ -30859 -146915 -160561 -164920 -170491 -194532 -238493 -230418 -171374 -169533 -225683 -305141 -289855
9827b89855O4055M57K5752k343J17732L7850M737O7102n579k5856M1395r2778
$$ -289855 -225800 -225343 -199591 -201934 -84202 -46352 -41615 25487 19908 -5948 35447 -57331
9815e7331O7592k1866J2054M270l9376q576o4227p6228J35425J15763L4655m3954
$$ -57331 10261 -11605 449 4719 -34657 -43233 -107460 -183688 -48263 67500 102155 58201
9803E8201K0405N0291N1615p1453q0774o0652J6287O7364q7677l0710j4509K2570
$$ 58201 78606 128897 180512 109059 28285 -32367 -16080 51284 -36393 -67103 -81612 -59042
9791e9042N8066l4120J05104J97800j23568j04358J5603J24487j40947o4043N0786
$$ -59042 -976 -35096 70008 267808 144240 39882 55485 179972 39025 -25018 25768
9780B5768j364q5079q987O3513N480j15880M6354O1485j2386J13041K7249l968
$$ 25768 24404 -60675 -69662 -6149 -669 -116549 -70195 -8710 -21096 91945 119194 115226
9768A15226j4189m3949j39721k7249M8853N8039M2922o0236j01193j9147K0639
$$ 115226 101037 57088 -82633 -109882 -61029 -2990 39932 -20304 -121497 -140644 -120005
9757a20005N0186j8095j4217K2945l8639o4898j0021N6881P1503m9204K7229N3507
$$ -120005 -69819 -87914 -102131 -79186 -117825 -182723 -192744 -135863 -64360 -113564 -86335 -32828
9745c2828M1045m682O3999J18023n0748q1566p3761m4423M8279O5146O1011j50039
$$ -32828 8217 3535 67534 185557 134809 53243 -20518 -64941 -16662 48484 109495 -40544
9733d0544L0438n0198o0925m5520K5472R4332j0527o0351j02005j009R5997j437
$$ -40544 -10106 -60304 -121229 -166749 -141277 -46945 -57472 -117823 -219828 -220837 -124840 -126277
9721a26277l6500o7038K7085O6954R8045Q2205N439k06246n98P4694P9366l8795
$$ -126277 -162777 -229815 -202730 -135776 -37731 44474 49913 -156333 -156931 -82237 -2871 -41666
9709d1666p9074K0911j3074o4751j06065q8465Q4622J19492J06140K1922m393
$$ -41666 -120740 -99829 -112903 -177654 -283719 -372184 -287562 -168070 -61930 -40008 -44401
9698d4401p5007n3636J04182P4126m0666l2403J1193O7137J5797o773J7355p3029
$$ -44401 -119408 -173044 -68862 5264 -35402 -67805 -56612 10525 26322 19549 36904 -36125
9686c6125j08375p0025j6187J3541k8383l3934J03021P0464Q3864m690J5208n3597
$$ -36125 -144500 -214525 -230712 -217171 -245554 -279488 -176467 -106003 -22139 -26829 -11621 -65218
9674f5218K0249m9225j1607l2264l5991j5873N6213k8768P997l3485R669J41767
$$ -65218 -44969 -94194 -105801 -138065 -174056 -189929 -133716 -162484 -154487 -187972 -178303 -36536
9662c6536j1787n1010j6837l5768l0451J97438J60876l727M9477O9497K6107j03602
$$ -36536 -48323 -99333 -116170 -151938 -182389 15049 175925 172198 221675 291172 317279 213677
9650B13677o6991j18554l6655J7621j5640l0051L7055m4296K6736J03859o5994
$$ 213677 146686 28132 -8523 9098 -6542 -36593 462 -43834 -17098 86761 20767
9639B0767j7306m9773q8855j8990J0824N002L2968K3246j5242k8605n8844N9333
$$ 20767 3461 -46312 -135167 -154157 -143333 -138331 -105363 -82117 -97359 -125964 -184808 -125475
9627a25475Q7392j22368Q701L1813r3953O171P3641J14242P4817k5579n9517q8761
$$ -125475 -38083 -160451 -151750 -119937 -213890 -207719 -134078 -19836 54981 29402 -30115 -118876
9615a18876j6965J1472k6535Q3273j8944J0884L1713K6757j3872j3292r3030n0541
$$ -118876 -135841 -124369 -150904 -67631 -86575 -75691 -43978 -17221 -31093 -44385 -137415 -187956
9603a87956p9182n0738Q3652K9954L8414L4645J09190O4980j06801j3659k3040
$$ -187956 -267138 -317876 -234224 -204270 -165856 -131211 -22021 42959 -63842 -77501 -100541
9592a00541l7948J9360M7022l8071j1769L4563P1020p6242L1818k9208N1663o627
$$ -100541 -138489 -119129 -72107 -110178 -121947 -87384 -16364 -92606 -60788 -89996 -38333 -44960
9580d4960M103K8877n8574j38885r340J03805J0643j4740R948N2641J08345N6123
$$ -44960 -40857 -11980 -70554 -209439 -218779 -114974 -104331 -119071 -109123 -56482 51863 107986
9568A07986l705j8228N4950j25124q8980l0416K3508o5411O3177J50582m5123
$$ 107986 104281 86053 141003 15879 -73101 -103517 -80009 -145420 -82243 68339 23216
9557B3216j07266l6174O165N6134o757J4252m1977k9777P9718K0050O0066O3416
$$ 23216 -84050 -120224 -114059 -57925 -64682 -50430 -92407 -122184 -42466 -22416 37650 101066
9545A01066j9004l6377m1862l9216n2736j2129l0494l7064J2835n54m971p1791
$$ 101066 82062 45685 3823 -35393 -88129 -100258 -130752 -167816 -154981 -155535 -160506 -232297
9533b32297J04739O5410N257O6487L7534n5882l4307K8212j0345J9750l1278p4774
$$ -232297 -127558 -62148 -56891 9596 47130 -8752 -43059 -14847 -25192 -5442 -36720 -111494
9521a11494j6452N7129j67350Q8912R301j9380O1027J0463p6009m3812l8588l7422
$$ -111494 -127946 -70817 -238167 -149255 -139954 -159334 -98307 -87844 -163853 -207665 -246253 -283675
9509b83675J10189r612K8222J13489R8420L352p1403m8451l4314p8615n8360O8825
$$ -283675 -173486 -183098 -154876 -41387 57033 60385 -11018 -59469 -93783 -172398 -230758 -161933
9497a61933K9049N9276Q6392P8639p6255n9934k0703p6983j42079l2691J9671
$$ -161933 -132884 -73608 12784 91423 15168 -44766 -65469 -142452 -284531 -317222 -297551
9486b97551J04174M7248J11986O7291P8056J2244l0259o9568j16236Q105k6341
$$ -297551 -193377 -146129 -34143 33148 111204 123448 93189 23621 -92615 -84510 -110851
9475a10851O8895J79605R911j2171r6129j40877J5184k7891n7698Q271K402o642
$$ -110851 -41956 137649 147560 135389 39260 -101617 -86433 -114324 -172022 -163751 -161349 -167991
9463a67991P475L5047Q0201l0962n4334N7547L7832J04936m6372l5112o4946l9829
$$ -167991 -160516 -125469 -45268 -76230 -130564 -73017 -35185 69751 23379 -11733 -76679 -116508
9451a16508J730J9143j0417P1267n6845r2530J431j3481K1178J049o0595K541
$$ -116508 -114778 -95635 -106052 -34785 -91630 -184160 -182729 -196210 -175032 -173983 -234578 -232037
9439b32037K3013Q6489K8204j0548L7535p301j941k7845L50L1000N0720m3408
$$ -232037 -209024 -122535 -94331 -104879 -67344 -74645 -76586 -104431 -104081 -73081 -22361 -65769
9427f5769J3083M6198p3715j19010K8442Q6720L3926j479l3938p9421p2919J115
$$ -65769 -52686 -6488 -80203 -199213 -170771 -84051 -50125 -51604 -85542 -164963 -237882 -236767
9415b36767K2352O9633q9923K5411Q1415R6488q7226m1529N6205K9934Q885K2079
$$ -236767 -214415 -144782 -234705 -209294 -127879 -31391 -118617 -160146 -103941 -74007 -65122 -43043
9403d3043m33L3440m4969l9324K8699P5989O7979l6582l8771k0824k807o7191
$$ -43043 -43476 -10036 -55005 -94329 -65630 10359 78338 41756 2985 -17839 -20646 -87837
9391h7837r068J9407L7362l1416m6196P8420L8976l1431p5033O4453K2745o9423
$$ -87837 -96905 -77498 -40136 -71552 -117748 -39328 -352 -31783 -106816 -42363 -19618 -89041
9379h9041l4179M3303r593j1537L5270n8950L6803L817j7906l7267N4066n9395
$$ -89041 -123220 -79917 -89510 -101047 -65777 -124727 -87924 -84107 -102013 -139280 -85214 -144609
9367a44609L4192q009m1099m6951J6427J6849K0307l6089M5602k7608L3908Q6444
$$ -144609 -110417 -118426 -159525 -206476 -190049 -173200 -152893 -188982 -143380 -170988 -137080 -50636
9355e0636N5521K2601n7233m2841j9713l9000j6925N9958J6166l9859O2680R6293
$$ -50636 4885 27486 -29747 -72588 -92301 -131301 -148226 -88268 -72102 -111961 -49281 47012
9343D7012J5528m9198l7686N9980m8785L0704q969k5825K5380M4441m2383N4498
$$ 47012 62540 13342 -24344 35636 -13149 17555 8586 -17239 8141 52582 10199 64697
9331F4697n7330n5597L059n2538k7906q1246l1721P0110O5071J9548P613R2159
$$ 64697 7367 -48230 -45171 -97709 -125615 -206861 -238582 -168472 -103401 -83853 -76240 15919
9319A5919P4208p0555j32125n3569k8751J07435R7485J2638J9905K7353N259l0174
$$ 15919 90127 19572 -112553 -166122 -194873 -87438 10047 22685 42590 69943 75202 45028
9307D5028n7213j07343j16380m0405j8122J11282J08042M0992L2894k7503l0752
$$ 45028 -12185 -119528 -235908 -276313 -294435 -183153 -75111 -34119 -1225 -28728 -59480
9296e9480L4931j7006j20559J9582J09271q407n12K8825q7121j0171J0095L9228
$$ -59480 -24549 -41555 -162114 -142532 -33261 -41668 -42180 -13355 -100476 -110647 -100552 -61324
9284f1324L9674l1427p9645K646L6784o795L5487K5371N371R4092K3927l5790
$$ -61324 -21650 -53077 -132722 -130076 -93292 -100087 -64600 -39229 -33858 60234 84161 48371
9272D8371o7885n73j9810j1985j301P3593M1712j13132L6579o64l3508K0236o0021
$$ 48371 -19514 -20087 -39897 -51882 -53183 20410 62122 -51010 -14431 -15095 -48603 -28367 -88388
9259h8388O8508M858K6164m7723j24108n5498L1903O4366n2987Q022o8874l5070
$$ -88388 -19880 -15022 11142 -36581 -160689 -216187 -184284 -119918 -172905 -164883 -233757 -268827
9247b68827R4085K1613p8849m9081L9410N6206J5975o37N175n8381J7975J34847
$$ -268827 -174742 -153129 -231978 -281059 -241649 -185443 -169468 -170105 -164930 -223311 -205336 -70489
9235g0489M934j4414q1254L0304R0670K2592k2335o0296l34P4375m7262p0242
$$ -70489 -65555 -79969 -161223 -130919 -40249 -17657 -39992 -100288 -100622 -26247 -73509 -143751
9223a43751O7699J34285k573l7755j21369n9681M4635J218K7855Q3859k4018k4983
$$ -143751 -76052 58233 55660 17905 -103464 -163145 -118510 -117292 -89437 -5578 -29596 -54579
9211e4579n1938l738L3458J06570K4126O4543n3765j28060m6683N3355J5167P84
$$ -54579 -106517 -110255 -76797 29773 53899 118442 64677 -63383 -110066 -56711 -41544 -40760
9199d0760O7515o058p8852L436O5094L1919J0930J607Q992j9570n1730J2309o6466
$$ -40760 26755 20697 -58155 -54719 10375 42294 53224 54831 63823 44253 -7477 4832 -61634
9186f1634M2659j56367o3766N7993J24522R209K752Q860k881Q1527J3410M3277
$$ -61634 -18975 -175342 -239108 -181115 -56593 -47384 -44632 -35772 -38653 42874 56284 99561
9174I9561p7243P5122N9919O687j69323R184k1031L3032m8393j8993K4528r010
$$ 99561 22318 97440 157359 164046 -5277 3907 -17124 15908 -32485 -51478 -26950 -35960
9162c5960o1895q795J3057k8628L9027k7967j07405M6994J09573N4545N8831q7534
$$ -35960 -97855 -106650 -93593 -122221 -83194 -111161 -218566 -171572 -61999 -7454 51377 -36157
9150c6157p4488q8410l7544Q4694J24652J13116J3201j8335j42970L7505J2682
$$ -36157 -110645 -199055 -236599 -151905 -27253 85863 99064 80729 -62241 -24736 -12054
9139a2054j7268L1002L6804L8824J8938j51444n9444N7102Q1588J2663m4584k4226
$$ -12054 -29322 1680 38484 77308 96246 -55198 -114642 -57540 24048 36711 -7873 -32099
9127c2099k2497L4224m8197q2601l499J21871K2921M5262M3199l3399m3303p0930
$$ -32099 -54596 -20372 -68569 -151170 -154669 -32798 -9877 35385 78584 45185 1882 -69048
9115f9048L4474l0394r906P1613p7051o8425k1108L126N459O1599n930J9831L5120
$$ -69048 -34574 -64968 -74874 -3261 -80312 -148737 -169845 -166719 -161260 -99661 -105591 -85760 -50640
9102e0640o3623l9712j7150j2383k1386N6597P046q7959L5637M8937j4392O0856
$$ -50640 -114263 -153975 -171125 -183508 -204894 -148297 -141251 -229210 -193573 -144636 -159028 -98172
9090i8172R4059J29515j4214n4846n3164j9484j8579j1617J8957K7549n45L9227
$$ -98172 -4113 125402 111188 56342 3178 -16306 -34885 -46502 -27545 4 -541 38686
9078C8686j9315q2531n124R5731n718m3132k9801k2433p3213m7430J8955L1591
$$ 38686 19371 -63160 -68284 27447 21729 -21403 -51204 -73637 -146850 -194280 -175325 -143734
9066a43734j7227j5897O1916J29786K0360n6817j7090p227o1016q4506o0353L9840
$$ -143734 -160961 -176858 -114942 14844 35204 -21613 -38703 -45930 -106946 -191452 -251805 -211965
9054b11965P0277J36872L0271p3457M6579o207l4088J6289o3650q078l1899j3403
$$ -211965 -141688 -4816 25455 -48002 -1423 -7630 -41718 -25429 -89079 -97157 -129056 -142459
9042a42459J7477P9799n7007M4315J4762N136n1864n840l2467o200M3379J8335
$$ -142459 -124982 -45183 -102190 -57875 -43113 -37977 -89841 -95681 -128148 -134348 -90969 -72634
9030g2634L9602J9921J2929J00616j28071k11845Q806J47552N7477k6673l1502
$$ -72634 -33032 -13111 -182 100434 -27637 -239482 -230676 -83124 -25647 -52320 -83822
9019h3822p572O7483J20373K5036j675n5785m4614k3252k9498o2269m822J31890
$$ -83822 -91394 -23911 96462 121498 119823 64038 19424 -3828 -33326 -95595 -100417 31473
9007C1473P3587r1598l643P445r4861m1880j7789k040R2076N4009L7945J3282
$$ 31473 105060 13462 9819 17264 -77597 -119477 -137266 -139306 -47230 6779 44724 58006
8995E8006j157j1659k6547p6985P126L2138p8794l8839j03937Q1812K5854k687
$$ 58006 56849 45190 18643 -58342 -51216 -19078 -97872 -136711 -240648 -158836 -132982 -135669
8983a35669K87j020J11313O4533L7648k9511M622l5492n6301n6707q3404Q9370
$$ -135669 -135382 -136402 -25089 39444 77092 47581 52203 16711 -39590 -96297 -179701 -90331
8971i0331R262O174N9591k2666j09151J3185j6905J50433m451J3129L0404m1247
$$ -90331 -81069 -74895 -15304 -37970 -147121 -133936 -150841 -408 -4859 8270 38674 -2573
8959b573q550p3961J10700P1328j35755k265l5668j9551Q3160P3280j0632j5012
$$ -2573 -11123 -85084 25616 96944 -38811 -41076 -76744 -96295 -13135 60145 49513 34501
8947C4501J5640L2863K8466n5768o6430j35092L5850J16729N9866p9732l1470
$$ 34501 50141 83004 111470 55702 -10728 -145820 -109970 6759 66625 -13107 -44577
8936d4577K606M2948m5198K8857M8752m9497Q830p5110l5838M6094N2975j7908
$$ -44577 -41971 977 -44221 -15364 33388 -16109 -7279 -82389 -118227 -72133 -19158 -37066
8924c7066r679o5286r0878N6921N4141K5021m9064q1494O0715K3381R8666M0681
$$ -37066 -46745 -112031 -202909 -145988 -91847 -66826 -115890 -197384 -136669 -113288 -14622 26059
8912B6059R6767L6381q7974k5539k4691N690R820L026O356o9411q6142m7986N157
$$ 26059 122826 159207 71233 45694 21003 26693 36513 39539 45895 -23516 -109658 -157644 -152487
8899a52487J49011l900r2804q5391p7416L0096J4299Q4657O7177j0821l4897R3753
$$ -152487 -3476 -7376 -100180 -185571 -262987 -232891 -218592 -133935 -66758 -77579 -112476 -18723
8887a8723n982m3920P0710q5744j7308Q7029Q2779p2416o7303j4814K5936k9544
$$ -18723 -24705 -68625 2085 -83659 -100967 -13938 68841 -3575 -70878 -85692 -59756 -89300
8875h9300P0128O788p4262J3244P3606j24234j7907R9559n9110J1140M6164J11714
$$ -89300 -19172 -12384 -86646 -73402 204 -124030 -141937 -42378 -101488 -90348 -44184 67530
8863F7530l5689K7878J10979k3077n5138j9371l4184o8729m751m4095j0890r788
$$ 67530 31841 59719 170698 147621 92483 73112 38928 -29801 -34552 -78647 -89537 -99325
8851i9325m9304o6306n022J05533M4561n3663j5995L4706m9354l1573L6176M6023
$$ -99325 -148629 -214935 -219957 -114424 -69863 -123526 -139521 -104815 -154169 -185742 -149566 -103543
8839a03543N0928M1226r7774M2046n6874p1964o5202M3129O3110M8705K060J2544
$$ -103543 -52615 -11389 -109163 -67117 -123991 -195955 -261157 -218028 -154918 -106213 -104153 -91609
8827i1609L9138M5294n1934M1891m6072o33O8756l5824l3124J17280K3510l4122
$$ -91609 -52471 -7177 -59111 -17220 -63292 -63925 4831 -30993 -64117 53163 76673 42551
8815D2551o5240j89632O811J25785L6272M8257J3475P7338l8208R640l6309J02262
$$ 42551 -22689 -212321 -205510 -79725 -43453 4804 18279 95617 57409 67049 30740 133002
8803A33002N133j53448l3959J5186K0948M8991R9213J26983o8532j02610p7958
$$ 133002 138135 -15313 -49272 -34086 -13138 35853 135066 262049 193517 90907 12949
8792A2949p1059l5351M6756p684j08812k326J38665J85124l2790l7348r481p0526
$$ 12949 -58110 -93461 -46705 -54389 -163201 -165527 -26862 158262 125472 88124 78643 8117
8780H117r0136L5819R2594N2106j21458r1159o3814P103J245M2245L8096r352
$$ 8117 -82019 -46200 46394 98500 -22958 -114117 -177931 -170828 -169583 -127338 -89242 -98594
8768i8594m728L27K3865m7615l7843j3989k5276P8120L5275N5686N2522j5750
$$ -98594 -103322 -102995 -79130 -126745 -164588 -178577 -203853 -125733 -90458 -34772 17750 2000
8756B000l3127k1295J2069P5302k1447p4962n7674p1020L4916J79372R565q8717
$$ 2000 -31127 -52422 -40353 34949 13502 -61460 -119134 -190154 -155238 24134 33699 -55018
8744e5018l0680k2779m259R8950k5086l2113j0811m4557j3457O7780j8956N454
$$ -55018 -85698 -108477 -112736 -13786 -38872 -70985 -81796 -126353 -139810 -72030 -90986 -85532
8732h5532p2633n9382J9341P3448n789J9567N3775K0480m2035J8304l4095j2196
$$ -85532 -158165 -217547 -198206 -124758 -130547 -110980 -57205 -36725 -78760 -60456 -94551 -106747
8720a06747L3414m7556P5849N8412J1414n3779J1004L932q8319J05153K547m8872
$$ -106747 -73333 -120889 -45040 13372 24786 -28993 -17989 -14057 -102376 2777 5324 -43548
8708d3548O4159q9000J7925m7051p337l614K793M5263J04281J3840j117r346j38423
$$ -43548 20611 -68389 -50464 -97515 -104852 -108466 -105673 -60410 43871 57711 56594 47248 -91175
8695i1175l597m9056K7828J07288J21029N7210m8608o7497r4911r6379K2159K6529
$$ -91175 -94772 -143828 -116000 -8712 112317 169527 120919 53422 -41489 -137868 -115709 -89180
8683h9180M2223J12441J12158j00544m5883M6554P8127K362o7783r4164J3538
$$ -89180 -46957 65484 177642 77098 31215 77769 155896 158258 90475 -3689 9849
8672I849L827k3008l5949j1622N2629J00538J0917k536j76690j02695M4361J22567
$$ 9849 13676 -9332 -45281 -56903 -4274 96264 107181 104645 -72045 -174740 -130379 -7812
8660g812q1639k5093P5125j3153M2873L6504O7931N8793j6493o4690r0381R0891
$$ -7812 -89451 -114544 -39419 -52572 -9699 26805 94736 153529 137036 72346 -18035 72856
8648G2856O4013m7132j01710p0557p1274J7297L7788P674R1682K0831L550L4267
$$ 72856 136869 89737 -11973 -82530 -153804 -136507 -98719 -91045 637 21468 25018 59285
8636E9285J4484M7767j56160m9707O2839l0026q480P6266l9476m0584R663J2827
$$ 59285 73769 121536 -34624 -84331 -21492 -51518 -59998 16268 -23208 -63792 -54129 -41302
8624d1302N209J3349o054p3452N0689Q127J7093J02548K4945K3545K7527o8024
$$ -41302 -36093 -22744 -28798 -102250 -51561 -43434 -26341 76207 101152 124697 152224 84200
8612H4200K8548M4648p7480j4130k3127o8412m934N0047Q070O7584M4171J01296
$$ 84200 112748 157396 79916 65786 42659 -25753 -30687 19360 27430 95014 139185 240481
8600B40481p482m6881k1834K604n7960L3783L4253q9525M6486O565J5525j1291
$$ 240481 232999 186118 164284 166888 108928 142711 176964 87439 133925 140490 156015 144724
8588A44724L0858Q3252n552M0921p787r2349k0546O9612M2138K3519q1258j53560
$$ 144724 175582 258834 253282 294203 286416 194067 173521 243133 285271 308790 227532 73972
8576G3972n4972L1465J52676Q2516n6776j02421r2317j4783p2955m0377R5256
$$ 73972 19000 50465 203141 285657 228881 126460 34143 19360 -53595 -93972 1284
8565A284N488Q0005m0762m9363o9070L5698K6456p8495l0007N1391O7021Q317
$$ 1284 6772 86777 46015 -3348 -72418 -36720 -10264 -88759 -118766 -67375 -354 7963
8553G963m2894P5684R8398O7639K6123q6623o8793J14238r0550j28926j5160l2916
$$ 7963 -34931 40753 139151 206790 232913 146290 77497 191735 101185 -27741 -42901 -75817
8541g5817M9799j9546m7831k349J3368k919p635o3469P942R4630P8466N2027j1441
$$ -75817 -26018 -45564 -93395 -95744 -82376 -85295 -92930 -156399 -148457 -53827 24639 76666 65225
8528F5225l2134j48483K6080N9492O2177Q0577j001j50433n1827k8128M6018J57885
$$ 65225 33091 -115392 -89312 -29820 32357 112934 111933 -38500 -90327 -118455 -72437 85448
8516H5448p5519j41080p442N7536L4812J0224M5986J11241q0268n4657j08185
$$ 85448 9929 -131151 -138593 -81057 -46245 -36021 9965 121206 40938 -13719 -121904
8505a21904o492j9172O136p8036p0661M2875J14178N4099r672M728M0946L4037
$$ -121904 -128396 -147568 -141432 -219468 -290129 -247254 -133076 -78977 -88649 -83921 -42975 -8938
8493h938J838q192M5740m0840J5290N3231j22329j0917J10194J8177K5632L3769
$$ -8938 -7100 -15292 30448 -10392 4898 58129 -64200 -75117 35077 53254 78886 112655
8481A12655p7770q5614p119m3128O3181L0913n1754j3496k5682O0664l71o0319
$$ 112655 34885 -50729 -57848 -100976 -37795 -6882 -58636 -72132 -97814 -37150 -37521 -97840
8469i7840K5274J14483J30612q1900j02197J18254R0095J7625q1461j67138O9402
$$ -97840 -72566 41917 172529 90629 -11568 106686 196781 214406 132945 -34193 35209
8458C5209M5234j6143O9750J1998M523j18393j18742l3533P4829J27301K1410
$$ 35209 80443 64300 134050 146048 150571 32178 -86564 -120097 -45268 82033 103443
8447A03443K6921J58562J3559k6645j16384q5189k0270l7396l9154P890M3944
$$ 103443 130364 288926 302485 275840 159456 74267 53997 16601 -22553 -14663 29281
8436B9281M5986l9529Q065l8392k2883O6949L1117j4084q965L7176j32588p1026
$$ 29281 75267 35738 43803 5411 -17472 49477 80594 66510 57545 94721 -37867 -108893
8424a08893P9583K6146o9881R273J065N3703M6404J12248N9404L4810m932m1430
$$ -108893 -29310 -3164 -73045 -63772 -62707 -9004 37400 149648 209052 243862 238930 197500
8412A97500j13980j30365L2761M2401J9026J9214K0410J7591j9180p5222N9467
$$ 197500 83520 -46845 -14084 28317 47343 66557 86967 104558 85378 10156 69623
8401F9623K1409o6758r1825P437L5789K3589j4800J3699m6541j08701M7304R2274
$$ 69623 91032 24274 -67551 -60114 -24325 -736 -15536 -1837 -48378 -157079 -109775 -17501
8389a7501Q5845o594M0439l8889k1789m4595L7283M8660J1823p3040j46010j02857
$$ -17501 68344 61750 102189 63300 41511 -3084 34199 82859 94682 21642 -124368 -227225
8377b27225R1060N0621l6730q4597M9549p41R7640j02579q2081O4002J09844K8648
$$ -227225 -136165 -85544 -122274 -206871 -157322 -158063 -60423 -163002 -245083 -181081 -71237 -42589
8365d2589l9895j3848L9852m9056J3539P1880J08932J438l4073M599K3389o4576
$$ -42589 -82484 -96332 -56480 -105536 -91997 -20117 88815 90253 56180 60779 84168 19592
8353A9592j14066l2150m0714q0100O1900k2363P2821L9024p184n4781l6835J35054
$$ 19592 -94474 -126624 -167338 -247438 -185538 -207901 -135080 -96056 -103240 -158021 -194856 -59802
8341e9802K6485o4118r0187N2580L0416j02R7537P2645j25833o8456M2010j6463
$$ -59802 -33317 -97435 -187622 -135042 -104626 -104728 -7191 65454 -60379 -128835 -86825 -103288
8329a03288M9612j6021k5833L9373k4370J8900N7874K7404K0491j6124m3944o0489
$$ -103288 -53676 -69697 -95530 -56157 -80527 -61627 -3753 23651 44142 28018 -15926 -76415
8317g6415N3886k0257N542J4119P541K4361j456P0664L1700L3191n7774q1381
$$ -76415 -22529 -42786 -37244 -23125 -15584 8777 7321 77985 109685 142876 85102 3721
8305C721n0967P5589q287l0265K9633p0159p2940J6810r644j5226J46675n7346
$$ 3721 -47246 28343 20056 -10209 19424 -50735 -123675 -106865 -116509 -131735 14940 -42406
8293d2406K0913J7836o9758J7434N5313k475M4062O2244n3200j35354r8753n760
$$ -42406 -21493 -3657 -73415 -55981 -668 -3143 40919 103163 49963 -85391 -184144 -189904
8281a89904J3127j15815J05994R6261J28930j4334q5862P1952q0570k6225q2182
$$ -189904 -176777 -292592 -186598 -90337 38593 24259 -61603 10349 -70221 -96446 -178628
8270a78628o5353r2092Q263J12326P8980R7162J19636Q7989q435l4680m5162p1789
$$ -178628 -243981 -336073 -327810 -215484 -136504 -39342 80294 168283 159848 125168 80006 8217
8258H217j7354j3831j6237q6628j771K066J1629J37921K7957j09696n0491N896
$$ 8217 -9137 -22968 -39205 -125833 -127604 -125538 -113909 24012 51969 -57727 -108218 -102322
8246a02322J0137j9487m5519j6131k84J56776J28599o5938j61349l989K0982m0955
$$ -102322 -92185 -111672 -157191 -173322 -173606 -16830 111769 45831 -115518 -119507 -98525 -139480
8234a39480k2659o890K5339n527M3455L3838J7740l7365M6503K2990r5650O7371
$$ -139480 -162139 -169029 -143690 -149217 -105762 -71924 -54184 -91549 -45046 -22056 -117706 -50335
8222e0335K2321o2720q7045L4647R890J4859m4072R3369M4431p194o6534n3030
$$ -50335 -28014 -90734 -177779 -143132 -133242 -118383 -162455 -69086 -24655 -31849 -98383 -151413
8210a51413R7424n3602J6607M6006m834L4901r5244O1799J13103k1144l3585n5058
$$ -151413 -53989 -107591 -90984 -44978 -49812 -14911 -110155 -48356 64747 43603 10018 -45040
8198d5040Q736M7639r4515m8418N9509J08921Q4650j03832k2096l7314L1969N2866
$$ -45040 -36304 11335 -83180 -131598 -72089 36832 121482 17650 -4446 -41760 -9791 43075
8186D3075J8018j12076k4888J17195M471r58j04104k3443P5437L9818q4476k4459
$$ 43075 61093 -50983 -75871 41324 45795 44837 -59267 -82710 -7273 32545 -51931 -76390
8174g6390J32840N5377m6295k0609M0730N2276m2797Q4553Q3994o4753j11995
$$ -76390 56450 111827 65532 44923 85653 137929 95132 179685 263679 198926 86931
8163H6931l9584n0356l2448j1557l2299K0403J8641O4705o0214o248r5381k7284
$$ 86931 47347 -3009 -35457 -47014 -79313 -58910 -40269 24436 -35778 -42026 -137407 -164691
8151a64691p363l9961k4188O0773R010l6133R3185J2875J7464o0274R06J14657
$$ -164691 -172054 -212015 -236203 -175430 -166420 -202553 -109368 -96493 -79029 -139303 -138397 -23740
8139b3740M8547L5002l2017k37326P9637J64772J1702k5620j09698j35955r527
$$ -23740 24807 59809 27792 -209534 -129897 34875 46577 20957 -88741 -224696 -234223
8128b34223M5505N4730P2288M3975l2761l5338n5203N9413J11062n8007o6011
$$ -234223 -188718 -133988 -61700 -17725 -50486 -85824 -141027 -81614 29448 -28559 -94570
8117i4570q2047N1927N5908L4257L2930K3479L2579K7418l5562o5353n0823M3376
$$ -94570 -176617 -124690 -68782 -34525 -1595 21884 54463 81881 46319 -19034 -69857 -26481
8105b6481p5920k8220N0827q730P3079K6894J5718m8845p5334j4037Q6208P8337
$$ -26481 -102401 -130621 -79794 -88524 -15445 11449 27167 -21678 -97012 -111049 -24841 53496
8093E3496P7257j6002j41193j32206P9652k7545r976J6779m4533o6830q7233L8261
$$ 53496 130753 114751 -26442 -158648 -78996 -106541 -116517 -99738 -144271 -211101 -298334 -260073
8081b60073P9731M3567M6713O490p333N0690O0688N5586o1805K0183p2480q0861
$$ -260073 -180342 -136775 -90062 -83572 -90905 -40215 20473 76059 14254 34437 -38043 -118904
8069a18904K9496q100N6703P3098m4227r4716N649K9481k5134p9782n7946P1712
$$ -118904 -89408 -97508 -40805 32293 -11934 -106650 -101001 -71520 -96654 -176436 -234382 -162670
8057a62670P2049L1275m3144o3297J7096K7637O9378k5084k2483P9870L3984o8177
$$ -162670 -90621 -59346 -102490 -165787 -148691 -121054 -51676 -76760 -99243 -19373 14611 -53566
8045e3566q5930P8223k556p7688J2912K2408O2387N8421k9694J41852n3457q0570
$$ -53566 -139496 -61273 -63829 -141517 -128605 -106197 -43810 14611 -15083 126769 73312 -7258
8033g258N6311j6405r7269o0596K7393K7588L0164L3147M647N1023J8994L4803
$$ -7258 49053 32648 -64621 -125217 -97824 -70236 -40072 -6925 -2278 48745 67739 102542
8021A02542K6346Q4434j9185o1044j45810N0957N8256j6310k0674r9199l8143
$$ 102542 128888 213322 194137 133093 -12717 38240 96496 80186 59512 -39687 -77830
8010g7830j4862O4787J23582m5764j13433l0550m4978M9548j0881k5874j268M2237
$$ -77830 -92692 -27905 95677 49913 -63520 -94070 -139048 -89500 -100381 -126255 -127523 -85286
7998h5286J9241O5366J08935j7256r0041R760N2156N157q711L6701m7687K0295
$$ -85286 -66045 -679 108256 91000 959 10719 62875 68032 59321 96022 48335 68630
7986F8630N5887o1160p0575M7185j1321o0959m8050L8230K3750q0276l7387m1113
$$ 68630 124517 63357 -7218 39967 28646 -32313 -80363 -42133 -18383 -98659 -136046 -177159
7974a77159q3888J48566J66688m46J8314k8402l8697m0658K103K8493j5218p371
$$ -177159 -261047 -112481 54207 53761 72075 43673 4976 -35682 -33579 -5086 -20304 -27675
7962b7675p301n9962O0159O8661K9191L0051j04596P2219n0474K0727p2383P392
$$ -27675 -34976 -94938 -34779 33882 63073 93124 -11472 60747 10273 31000 -41383 -33991
7950c3991J8204l8032J8995N8257k9554j25808n4659Q2676L4109K9739J0739J00619
$$ -33991 -15787 -53819 -34824 23433 -6121 -131929 -186588 -103912 -69803 -40064 -29325 71294
7938G1294L2134n6499K0112M4109k70l3067M2253M5493M8133o3595n7982q3331
$$ 71294 103428 46929 67041 111150 110880 77813 120066 165559 213692 150097 92115 8784
7926H784j7800N5361j0106J21953l7219o9698o5338L8079n513K7803M232k6977
$$ 8784 -9016 46345 36239 158192 120973 51275 -14063 24016 18503 46306 50538 23561
7914B3561Q1378R9683p1618o4025m7787o9650l5533J6987K08J00079j5152m9526
$$ 23561 104939 204622 133004 68979 21192 -48458 -83991 -67004 -66796 33283 18131 -31395
7902c1395J0034j05483j07993K02097M5216o3961l1879n6835m2287m0869R442
$$ -31395 -21361 -126844 -234837 -32740 12476 -51485 -83364 -140199 -182486 -223355 -213913
7891b13913M6630J41424Q2437o1475n3719O7776L5686m260k880q448L1530l5946
$$ -213913 -167283 -25859 56578 -4897 -58616 9160 44846 40586 37706 29258 60788 24842
7879B4842j03083J0210n5414J9686M0109P9545L1361J0710r0269l4488M4027j1701
$$ 24842 -78241 -68031 -123445 -103759 -63650 15895 47256 57966 -32303 -66791 -22764 -34465
7867c4465J14606P1832p9062M2817o441N3490m4680o3268j5853R8261O9304n7969
$$ -34465 80141 151973 72911 115728 109287 162777 118097 54829 38976 137237 206541 148572
7855A48572p0186o2300j5978K2489P0048J1412J2744p2718n5171m8824k5277n1063
$$ 148572 78386 16086 108 22597 92645 104057 116801 44083 -11088 -59912 -85189 -136252
7843a36252K3498Q2926m1936o2752J7447o484O6237L7404O3768N3863J26359l0747
$$ -136252 -112754 -29828 -71764 -134516 -117069 -123553 -57316 -19912 43856 97719 224078 193331
7831A93331j53779k721Q2531O8804j00437k8464m7026K8971n1179M5602K1707
$$ 193331 39552 36831 119362 188166 87729 59265 12239 41210 -9969 35633 57340
7820E7340n5845O7280j02445r1107N6356m9756j8006M4121N201p5678N5761J47828
$$ 57340 1495 68775 -33670 -124777 -68421 -118177 -136183 -92062 -86861 -162539 -106778 41050
7808D1050n2626L126n7053p8295m8843O2384J2892Q3731M4253Q1701n0410p7497
$$ 41050 -11576 -8450 -65503 -143798 -192641 -130257 -117365 -33634 10619 92320 41910 -35587
7796c5587q312M2761o3109K7593l9437n2981M7703O7431j470J0782O4377n4205
$$ -35587 -43899 -1138 -64247 -36654 -76091 -129072 -81369 -13938 -15408 -4626 59751 5546
7784E546p801O3424N651j776j55913o9886L2923Q4773L8271L3576J4961m6755
$$ 5546 -2255 61169 66820 65044 -90869 -160755 -127832 -43059 -4788 28788 43749 -3006
7772c006K6473K5800k1420R2149n6906j00817n4735J7497k5866J0747N0089L6579
$$ -3006 23467 49267 27847 119996 63090 -37727 -92462 -74965 -100831 -90084 -39995 -3416
7760c416J6778m598o952r1244k3924M4772o6046k267R5759J36388M2911j3337
$$ -3416 13362 8764 1812 -89432 -113356 -68584 -134630 -136897 -41138 95250 138161 124824
7748A24824j20927j04296M4632k2901J1264m0583L8058j8441R291Q6919L4200
$$ 124824 3897 -100399 -55767 -78668 -67404 -107987 -69929 -88370 -79079 7840 42040
7737D2040O7292J8569r871o2232j21342R3136J26271k1886j8581j7604l4125l2437
$$ 42040 109332 127901 118030 55798 -65544 27592 153863 131977 113396 95792 61667 29230
7725B9230j47142Q323J18275M5275k0359N0415j4788m140j04507o2404q6481P7936
$$ 29230 -117912 -109589 8686 53961 33602 84017 69229 65089 -39418 -101822 -188303 -110367
7713a10367N7711J9809J12145N4799l7692L7086p2305k5560k0742Q871l3169q3042
$$ -110367 -52656 -32847 79298 134097 96405 133491 61186 35626 14884 23755 -9414 -92456
7701i2456r5109n0883p257J6233P0453k1100K8123j4672j4621J5955J09483J9225
$$ -92456 -187565 -238448 -245705 -229472 -159019 -180119 -151996 -166668 -181289 -165334 -55851 -36626
7689c6626j0756P9226m968k077K1206M8240k5512q8575l973j3687R812j03135
$$ -36626 -47382 31844 26876 24799 46005 94245 68733 -19842 -23815 -37502 -27690 -130825
7677a30825K2546J32224N5093N6422M023j34019m7874O2126P6877O5420J0408
$$ -130825 -108279 23945 79038 135460 139483 5464 -42410 19716 96593 162013 172421
7666A72421o5096L3794J8631K785j3773j62353r9662L003O3779M2632R2141j39
$$ 172421 107325 141119 159750 162535 148762 -13591 -113253 -110250 -46471 -3839 88302 88163
7654H8163n6467j5711j4561J17755j4949r1845M6037K5358j1675o3865n7666J6244
$$ 88163 31696 15985 1424 119179 104230 12385 58422 83780 72105 8240 -49426 -33182
7642c3182K1661L1420j30262l5009j5372O5696N9742K5077L2596r1160j61526
$$ -33182 -11521 19899 -110363 -145372 -160744 -95048 -35306 -10229 22367 -68793 -230319
7631b30319j04544M9745P4365R5178K4947n99p6328J5311K0574l6668k6680Q9639
$$ -230319 -334863 -285118 -210753 -115575 -90628 -91227 -167555 -152244 -131670 -168338 -195018 -105379
7619a05379O8356M348N113p836q6165m8068K3953O1675k2411N321O9053P4119
$$ -105379 -37023 -32675 -27562 -35398 -121563 -169631 -145678 -84003 -106414 -101093 -32040 42079
7607D2079P828o1019n3047k0213l7231j5587m2908K09126O2920q8790k2696o0794
$$ 42079 49907 -11112 -64159 -84372 -121603 -137190 -180098 29028 91948 3158 -19538 -80332
7595h0332J25814O7683m1316n3257K6859k1494l6309J0347J14614N4451m1365
$$ -80332 45482 113165 71849 18592 45451 23957 -12352 -2005 112609 167060 125695
7584A25695j04550o2962L1530J5802m3234P5922J6350n9679k503N0043O548j22121
$$ 125695 21145 -41817 -10287 5515 -37719 38203 54553 -5126 -7629 42414 48962 -73159
7572g3159m735m9869M6487J01506O9209R9368q5429k8299K0604l2418p9032n0903
$$ -73159 -77894 -127763 -81276 20230 89439 188807 103378 75079 95683 63265 -15767 -66670
7560f6670o927J12026L2467l6542j6276q0368J5666J1074J1459j2281j224L9067
$$ -66670 -73597 38429 70896 34354 18078 -62290 -46624 -35550 -24091 -36372 -37596 1471
7548A471r8707M8389O2269o605m682k1415k4599l2636L7799k3703l1501n8199
$$ 1471 -97236 -48847 13422 6817 2135 -19280 -43879 -76515 -38716 -62419 -93920 -152119
7536a52119K233o819p8236k4238k5680N6128N7072M7378P218P7196M2606L7452
$$ -152119 -149886 -156705 -234941 -259179 -284859 -228731 -171659 -124281 -117063 -39867 2739 40191
7524D0191k8782J3886J9185K0427j1449j1896J5035j32520j36676O3115Q7956
$$ 40191 11409 25295 44480 64907 53458 41562 56597 -75923 -212599 -149484 -61528
7513f1528L9162K081R839J12152O3319k0394q5259j30534n2047n7576O821L7185
$$ -61528 -22366 -20285 -10446 101706 165025 144631 59372 -71162 -123209 -180785 -173964 -136779
7501a36779p2169r6558M5875j973O7585L0316q709j06715r992L1465L0624K0660
$$ -136779 -208948 -305506 -259631 -261604 -194019 -163703 -172412 -279127 -289119 -257654 -227030 -206370
7489b06370K4737J9731M3419J39781N3300j2028p7074j71259l3668N6253Q7373
$$ -206370 -181633 -161902 -118483 21298 74598 62570 -14504 -185763 -219431 -163178 -75805
7478g5805j7419l0419k5990k4926O9549N8209M022K6949J3936r543L462J22811
$$ -75805 -93224 -123643 -149633 -174559 -105010 -46801 -42779 -15830 -1894 -11437 -7975 114836
7466A14836o1544j2414j39008n6316M8791J12448M8570K4244p6254j30220L6428
$$ 114836 53292 40878 -98130 -154446 -105655 6793 55363 79607 3353 -126867 -90439
7455i0439R0947L0266J3549M217N3286m7750j86247O4821J07194j06470k2067
$$ -90439 508 30774 44323 48540 101826 54076 -132171 -67350 39844 -66626 -88693
7444h8693O6218n086k5448M592M3010P4226Q2705O5704q3163p4773m8016J8767
$$ -88693 -22475 -27561 -53009 -48417 -5407 68819 151524 217228 134065 59292 11276 30043
7432C0043J4532m1333m1834q3356J15412M6405n814n1713q9418O2208J37177m502
$$ 30043 44575 3242 -38592 -121948 -6536 39869 34055 -17658 -107076 -44868 92309 87807
7420H7807m5722Q6654L4990j21947j7427N2242l1132q2613j4142P7157Q051m6538
$$ 87807 42085 128739 163729 41782 24355 76597 45465 -37148 -51290 25867 33918 -12620
7408a2620p9233j9320n4761M7355L0863L6452k3767o4753p0926K2607M7828O5919
$$ -12620 -91853 -111173 -165934 -118579 -87716 -51264 -75031 -139784 -210710 -188103 -140275 -74356
7396g4356L3642m4673k7915N2957L3442J8954p222K022J07979Q0670r9280p8304
$$ -74356 -40714 -85387 -113302 -60345 -26903 -7949 -15171 -13149 94830 175500 76220 -2084
7384b084n699L1732N9450O9555J36785j09382j01166m9102N4817L0963n1939q3227
$$ -2084 -7783 23949 83399 152954 289739 180357 79191 30089 84906 115869 63930 -19297
7372a9297l9264K911L5907P8244r2629q2768m3331j3012O3255J02510J8628k0346
$$ -19297 -58561 -55650 -19743 58501 -34128 -116896 -160227 -173239 -109984 -7474 11154 -9192
7360i192l9412K1376Q2414O4911K1920o0448k1601J7511k1436p0025j8425M7514
$$ -9192 -48604 -27228 55186 120097 142017 81569 59968 77479 56043 -13982 -32407 15107
7348A5107l1895j5594j6357Q331N0123r820o2488J17403N1766j65425q2896j8057
$$ 15107 -16788 -32382 -48739 -40408 9715 -105 -62593 54810 106576 -58849 -141745 -159802
7336a59802n7207M526R8862O9570K2782l9011m5346J7058L240J7847q894k8039
$$ -159802 -217009 -212483 -113621 -44051 -21269 -60280 -105626 -88568 -85328 -67481 -76375 -104414
7324a04414M9852j6361o4842O7417J13304P3682r8739j8489L7098Q0921Q56K2000
$$ -104414 -54562 -70923 -135765 -68348 44956 118638 19899 1410 38508 119429 120285 142285
7312A42285n2470j16084o5030M2844O7267L9614J27931K3869j11932j47031j12126
$$ 142285 89815 -26269 -91299 -48455 18812 58426 186357 210226 98294 -48737 -160863
7301a60863M4879M2851q0662O279K5158J5863J35201Q6620K9690o578o0577o5916
$$ -160863 -115984 -73133 -153795 -147516 -122358 -106495 28706 115326 145016 138438 77861 11945
7289A1945K940k3950p6470r803l4802M2670Q2389N5171l6601R035J3731M0871
$$ 11945 14885 -9065 -85535 -95338 -130140 -87470 -5081 50090 13489 22524 36255 77126
7277G7126P385M0371q6496l956j9348N3424M3121j6141o8373J6511m7584P5888
$$ 77126 84511 124882 38386 34430 15082 68506 111627 95486 27113 43624 -3960 71928
7265G1928k5987j15623p3215O2870N2513m9337l3706p0938P8195J30052P1984
$$ 71928 45941 -69682 -142897 -80027 -27514 -76851 -110557 -181495 -103300 26752 98736
7254I8736J07500o0528j17732K1645N7021J4155j5272q0542l218o617l1831n771
$$ 98736 206236 145708 27976 49621 106642 120797 105525 24983 21765 15148 -16683 -22454
7242b2454k0403l6098r937O0761L0436o2915K6246n3256j4185R1557N8006L3130
$$ -22454 -42857 -78955 -88892 -28131 2305 -60610 -34364 -87620 -101805 -10248 47758 80888
7230H0888l2958p125j3364N9955L225j6533K1359l3169L3313M8310K356j00240
$$ 80888 47930 40805 27441 87396 90621 74088 95447 62278 95591 143901 146257 46017
7218D6017n0272L9330k3971o4457q3821j8789R0698L3554M2787J15893p731m0978
$$ 46017 -4255 35075 11104 -53353 -137174 -155963 -65265 -31711 11076 126969 119238 78260
7206G8260l9678M8702J9950j8430q0616n9632j15685Q8488O1659K9369P1802k5101
$$ 78260 38582 87284 107234 88804 8188 -51444 -167129 -78641 -16982 12387 84189 59088
7194E9088q0257L608J3005J02654O5388j7042j15670n4992j00402m40N7143k487
$$ 59088 -21169 -17561 -4556 98098 163486 146444 30774 -24218 -124620 -125060 -67917 -70404
7182g0404o2885N9472J1412L3482k6632q5391J5413R2508O7764n7605j44994K6964
$$ -70404 -133289 -73817 -62405 -28923 -55555 -140946 -125533 -33025 34739 -22866 -167860 -140896
7170a40896J85783K6913p2290M979j13053r729J43434J6071O119o764K9817j1397
$$ -140896 44887 71800 -490 4489 -108564 -118293 25141 41212 47331 40567 70384 58987
7158E8987l0653q2451n0357P7496m6030p0403Q7148R3914M3461m7734l2401K0891
$$ 58987 28334 -54117 -104474 -26978 -73008 -143411 -56263 37651 81112 33378 977 21868
7146B1868l3507o184J6264o8789P4231M9487l0706m3260K726O1503M5204l2636
$$ 21868 -11639 -17823 -1559 -70348 3883 53370 22664 -20596 -17870 43633 88837 56201
7134E6201K1359j9358m9055j59114r932Q2883J08575P1160l6735Q135Q1965j05945
$$ 56201 77560 58202 9147 -149967 -159899 -77016 31559 102719 65984 74119 156084 50139
7122E0139j13669k2694R6049J05091j6088J0650n5192Q9563P1755p2790r2726
$$ 50139 -63530 -86224 9825 114916 98828 109478 54286 143849 215604 142814 50088
7111E0088n2881r990K7461k6287k8782n5101J04484J21170l7230N8046L4196n7266
$$ 50088 -2793 -12783 14678 -11609 -40391 -95492 8992 130162 92932 150978 185174 127908
7099A27908r2593N455k1513n0688n8343M7788R9944O0233L1933m1315J1394l979
$$ 127908 35315 40770 19257 -31431 -89774 -41986 57958 118191 150124 108809 120203 116224
7087A16224m8615m5643L0923m8991m8186m6893n3308O1882P1271P9538O8384J4291
$$ 116224 67609 21966 52889 3898 -44288 -91181 -144489 -82607 -11336 68202 136586 150877
7075A50877o8994p4659L3318J38598j8257r5462k6080p891p5934l9464L6755l4646
$$ 150877 81883 7224 40542 179140 160883 65421 39341 31450 -44484 -83948 -47193 -81839
7063h1839q4317M2360o4667P845Q0278K8956p0928j1841k9973P9740N8487M6436
$$ -81839 -166156 -123796 -188463 -180618 -100340 -71384 -142312 -154153 -184126 -104386 -45899 537
7051E37J2937n7037r1538N3895O6201p8371O8569N4101J7215n347n3071n2648
$$ 537 13474 -43563 -135101 -81206 -15005 -93376 -24807 29294 46509 41162 -11909 -64557
7039f4557j7360j02740n5281o4817J15798J77548Q7469J19337M4745o5850m1816
$$ -64557 -81917 -184657 -239938 -304755 -188957 -11409 76060 195397 240142 174292 132476
7028A32476O8735p0012j7693j8587J5204L3267L0521o8181j14119n2022m2971
$$ 132476 201211 131199 113506 94919 110123 143390 173911 105730 -8389 -60411 -103382
7017a03382L8497M0740l6528r3183j9069K13358R1285m072L6889p4385j06875
$$ -103382 -64885 -24145 -60673 -153856 -172925 40433 131718 127646 164535 90150 -16725
7006a6725j5258J7765J01386j5052R0562K9178n3133L8430O9749L7652j15481
$$ -16725 -31983 -14218 87168 72116 162678 191856 138723 177153 246902 284554 169073
6995A69073j12026j03822l5744j35966l0788J01885J32662L2795K6876J6651J5641
$$ 169073 57047 -46775 -82519 -218485 -249273 -147388 -14726 18069 44945 61596 77237
6984G7237K3683N0266k3938k3497q2703p0460k9147o7004N757N5954j765K0400
$$ 77237 100920 151186 127248 103751 21048 -49412 -78559 -145563 -139806 -83852 -85617 -65217
6972f5217J5465R3242Q248n882M4578n4768J1968Q28n9404Q092K3749q9391j72541
$$ -65217 -49752 43490 51738 45856 90434 35666 47634 48462 -10942 -2850 20899 -68492 -241033
6959b41033M3459J39556L5839J7329L5427k8932L5301n0152M7539j08873K7459
$$ -241033 -197574 -58018 -22179 -4850 30577 1645 36946 -13206 34333 -74540 -47081
6948d7081J24861J7346j2284L0430j22850p1337R3692r2363K9414n471q643j00578
$$ -47081 77780 95126 82842 113272 -9578 -80915 12777 -79586 -50172 -55643 -64286 -164864
6936a64864p1898P3191L1808J23852M8178p7836l1956j6586q286N5242N2070p22
$$ -164864 -236762 -163571 -131763 -7911 40267 -37569 -69525 -86111 -94397 -39155 12915 12193
6924A2193J1962J8054N4271J0040k6591n10o870L6958m2263r7488R777m270k6585
$$ 12193 24155 42209 96480 106520 79929 79419 72549 109507 67244 -30244 -20467 -24737 -51322
6911e1322j7325J18775O9008p4632j2292Q5963l846j20048L9234P5374l5036o9076
$$ -51322 -68647 50128 119136 44504 32212 118175 114329 -5719 33515 108889 73853 4777
6899D777M1435K5272j60676J0220J88858m4723P0544P9668n7237j10673Q690K5270
$$ 4777 46212 71484 -89192 -78972 109886 65163 135707 215375 158138 47465 56155 81425
6887H1425Q2024M77q5728pj662j27697j8103R2575K2437n1722n6010k5344N3064
$$ 81425 163449 163926 78198 78191 76529 -51168 -69271 23304 45741 -5981 -61991 -87335 -34271
6874c4271O7546l4586O2522L9340m387o7336o6322k1965M4041Q580j4528P3321
$$ -34271 33275 -1311 61211 100551 96164 28828 -37494 -59459 -15418 -6838 -21366 51955
6862E1955L3561k29j52027m2704L782M0847o0321j105O5440L7191M8732P2137
$$ 51955 85516 85287 -66740 -109444 -105662 -64815 -125136 -126241 -60801 -23610 25122 97259
6850I7259O7190k2786j46617o0613k0863L0666K0695n2940n6422R9022O7522K7375
$$ 97259 164449 141663 -4954 -65567 -86430 -55764 -35069 -88009 -144431 -45409 22113 49488
6838D9488n1306L0561K1357o1433j2562J8004M8890k2326j55670r1562J07678
$$ 49488 -1818 28743 50100 -11333 -23895 -5891 42999 20673 -134997 -226559 -118881
6827a18881J44391M3994M2845O0769q3921N0498O6035p0572j21660N11m714j870
$$ -118881 25510 69504 112349 173118 89197 139695 205730 135158 13498 14009 9295 7425
6815G425P8314j31232M3337J47101q807j9595m8970l2538J82041j29m0120n3578
$$ 7425 85739 -45493 -2156 144945 136138 116543 67573 35035 217076 216947 176827 123249
6803A23249l3446q5901k4795N8124N3698n4045K9262l1639m7910J02542k1193
$$ 123249 89803 3902 -20893 37231 90929 36884 66146 34507 -13403 89139 67946
6792F7946N2135O8330j3173j24150m2004O1391M902l5212N2131L280j04591q9913
$$ 67946 120081 188411 175238 51088 9084 70475 75377 40165 92296 95576 -9015 -98928
6780i8928L5549J16405O6893m2398j08507j00727N6034J0544p141J27157L2098
$$ -98928 -63379 53026 119919 77521 -30986 -131713 -75679 -65135 -72276 54881 86979
6769H6979O8237J4655p9274J0191O9386N0715p5653n2230l2707J1900K6408J03598
$$ 86979 155216 169871 90597 100788 170174 220889 145236 93006 60299 72199 98607 202205
6757B02205k1252r8812j1497m7256j0678P0902j457l0940k5126J829N8065P4886
$$ 202205 180953 82141 70644 23388 12710 83612 82155 51215 26089 27918 85983 160869
6745A60869j51260J2546r0501n2638J16393J20650M6191Q300m1524l9979m1787
$$ 160869 9609 22155 -68346 -120984 -4591 116059 162250 170550 129026 89047 47260
6734D7260j7698O4125N3606l254j08486k3608J3586L9192k5812N4982l1482o7369
$$ 47260 29562 93687 147293 144039 35553 11945 25531 64723 38911 93893 62411 -4958
6722d958j7977N0856j6011K926L0432k7827J035q1468n4797M0655J18474M5203
$$ -4958 -22935 27921 11910 14836 45268 17441 18476 -62992 -117789 -77134 41340 86543
6710H6543l347o3013K6407O731Q8689Q25j61102j2056O5180L7142l0627j53493
$$ 86543 83196 20183 46590 53321 142010 142835 -18267 -30323 34857 71999 41372 -112121
6698a12121q786J39312Q6119q1543n2753j339o8239l2307Q293j37109o6779O5068
$$ -112121 -120907 18405 104524 22981 -29772 -31111 -99350 -131657 -123364 -260473 -327252 -262184
6686b62184L2261L7143N7998J29975J09727j4504n6226n0188j25029L9825J01249
$$ -262184 -229923 -192780 -134782 -4807 104920 90416 34190 -15998 -141027 -101202 47
6675D7m475p2960r490K9383K7284o3670M3355J27216M0174o2397N749j5864m1189
$$ 47 -4428 -77388 -86878 -57495 -30211 -93881 -50526 76690 116864 54467 60216 44352 3163
6662C163n3064k170j0254K2605k9135Q331M0626J13741m8725l7751q1113J040
$$ 3163 -49901 -52071 -62325 -39720 -68855 -60524 -19898 93843 45118 7367 -73746 -72706
6650g2706J38740N8380J5039j02741j0361o169l1542p8316j7487N7206R606j51883
$$ -72706 66034 124414 139453 36712 26351 20182 -11360 -89676 -107163 -49957 -40351 -192234
6638a92234O4577J40023M2698l3894K774K8647Q9553P366l7279j8352l4384j0798
$$ -192234 -127657 12366 55064 21170 23944 52591 142144 149510 112231 93879 59495 48697
6626D8697m8292O0051j299p2872K7446N7280J2095k9784j4928r3588k5632l2581
$$ 48697 405 60456 59157 -13715 13731 71011 83106 53322 38394 -55194 -80826 -113407
6614a13407O5323M4687Q8561j4243p4394j26937L8079L9290L9574J05869P6528
$$ -113407 -48084 -3397 85164 70921 -3473 -130410 -92331 -53041 -13467 92402 168930
6603A68930l6639j51348q1108J6836M8233j363K2317j9212j1980m8995k3416P5253
$$ 168930 132291 -19057 -100165 -83329 -35096 -36459 -14142 -33354 -45334 -94329 -117745 -42492
6591d2492Q1490N9566L3961N2166m070m3362k4095o6607r8135m4282J4551Q224
$$ -42492 38998 98564 132525 184691 180621 137259 113164 46557 -51578 -95860 -81309 -73085
6579g3085L0644K3408L2683J1682m9733J4699K5904K7766K7574m8834J227k2290
$$ -73085 -42441 -19033 13650 25332 -24401 -9702 16202 43968 71542 22708 23935 1645
6567A645k2939j49675m760J6907Q4147J64064J47976J2569j22864k4103n2491
$$ 1645 -21294 -170969 -175729 -158822 -74675 89389 237365 249934 127070 102967 50476
6556E0476o5697J9099r0384k93N86N0086j3868M6774R4028o5341n650J6578l8786
$$ 50476 -15221 3878 -86506 -86799 -86213 -36127 -49995 -3221 90807 25466 19816 36394 -2392
6543b392n4267l7728P0503J02903O8361l8942L8238k0136q4707m8670M8449o8918
$$ -2392 -56659 -94387 -23884 79019 147380 108438 146676 126540 41833 -6837 41612 -27306
6531b7306M4187P173j9269M5725N2224P1870j0162K0690K1546k9386m7298n5344
$$ -27306 16881 24054 4785 50510 102734 174604 164442 185132 206678 177292 129994 74650
6519G4650m3491N6119p670l2099K411M9991m7676k4979K1698K6324N1463l5374
$$ 74650 31159 87278 79608 47509 49920 99911 52235 27256 48954 75278 126741 91367
6507I1367M804j1818N9481P255p3814n6079m6208l4471q5105l5196l196K2467
$$ 91367 96171 84353 143834 151089 77275 21196 -25012 -59483 -144588 -179784 -182980 -160513
6495a60513O3915R041Q096P9284R4472o8581K2560L8006K9052l1324p8572q8413
$$ -160513 -96598 -87557 -79461 -177 94295 25714 48274 86280 115332 84008 5436 -82977
6483h2977l3932M1378J5214l305J2795J1373M8215j58690N605J64482K5714o1351
$$ -82977 -116909 -75531 -60317 -63622 -50827 -39454 8761 -149929 -144324 20158 45872 -15479
6471a5479q9069r8546n8699O0608k6227l1011J00273J10139J3043Q3826J30081
$$ -15479 -104548 -203094 -261793 -201185 -227412 -258423 -158150 -48011 -34968 48858 178939
6460A78939l532j3820j09475n2530J894l8447K3828p5430k634N6469Q5680J3256
$$ 178939 175407 161587 52112 -418 1476 -36971 -13143 -88573 -91207 -34738 50942 64198
6448F4198k549Q1053n7714P4841Q9164k6395k2399m3075p3893k493J6189r2613
$$ 64198 61649 142702 84988 159829 248993 222598 200199 157124 83231 80738 96927 4314
6436D314k1462m1653M8324K2413k246M9325Q373q9276o5820M6029k8790p4654
$$ 4314 -17148 -58801 -10477 11936 9690 59015 67388 -21888 -87708 -41679 -70469 -145123
6424a45123N2164j3480J6935J49442m1028o3995Q2587j4285n6104j021l6329L5177
$$ -145123 -92959 -106439 -89504 59938 18910 -45085 37502 23217 -32887 -33908 -70237 -35060
6412c5060k0322R7648Q1107p2936p3073n6859L0192R33K3974L3571P3369o2226
$$ -35060 -55382 42266 123373 50437 -22636 -79495 -49303 -48370 -24396 9175 82544 20318
6400B0318l3902K7185N3637L2158L185Q886j17150n9915K2261o8635J7955k216
$$ 20318 -13584 13601 67238 99396 102581 111467 -5683 -65598 -43337 -111972 -94017 -96233
6388i6233l3062P5871K3009o0449J8812J33238J76437J13743j02198j77965m6896
$$ -96233 -129295 -53424 -30415 -90864 -72052 61186 237623 351366 249168 71203 24307
6377B4307O477L373j7083k6510r68q07J8255K2817K4967L3540N114k2437L3753
$$ 24307 30784 34157 17074 -9436 -10404 -11211 7044 29861 54828 88368 93482 71045 104798
6364A04798M7634o2558R328k1416m5080J5312L7804m3914k2211Q201J8782K0293
$$ 104798 152432 89874 99202 77786 32706 48018 85822 41908 19697 27898 46680 66973
6352F6973J3960J32972m2358k14413J6825L8810j1138k7102l2438m4002P0808
$$ 66973 80933 213905 171547 -42866 -26041 12769 1631 -25471 -57909 -101911 -31103
6341c1103N6013n194p231N3563N38o2923j8945R1984R270K8757K6555l2871j7234
$$ -31103 24910 19716 12485 66048 66586 3663 -15282 76702 85972 114729 141284 108413 91179
6328I1179j8216P2588J1111j34249m7055J06678m8263M3509k5308r5285k3638
$$ 91179 72963 145551 156662 22413 -24642 82036 33773 77282 51974 -43311 -66949
6317f6949P8893j0468l889K8045l4757j0939J7370l185J232Q431L0797p3792j3895
$$ -66949 11944 1476 -2413 25632 -9125 -20064 -2694 -5879 -4647 3784 34581 -39211 -53106
6304e3106K8586K7062R573k9210J4575N5815o3099j2918k3323N7792m3378o7910
$$ -53106 -24520 2542 12115 -17095 -2520 53295 -9804 -22722 -46045 11747 -31631 -99541
6292i9541K5525O5735J08421m384j02110l0688J10161Q3621m1101j3197l6164
$$ -99541 -74016 -8281 100140 95756 -6354 -37042 73119 156740 115639 102442 66278
6281F6278n7900P5200R5576P2290n4477p8443l3608J0747J9219k4114m5955o4509
$$ 66278 8378 83578 179154 251444 196967 118524 84916 95663 114882 90768 44813 -19696
6269a9696j7539o7223o5160J04832N5741n0754J105J44522p2026k0223J05582
$$ -19696 -37235 -104458 -169618 -64786 -9045 -59799 -58694 85828 13802 -6421 99161
6258I9161R9191L2203k5413j55240q0946Q1266Q3536o8523n6327l5857J36238
$$ 99161 198352 230555 205142 49902 -31044 50222 133758 65235 8908 -26949 109289
6247A09289K0187o9802J3203m8896N0487P1673O502j21846o9523K2407L0315J8939
$$ 109289 129476 59674 72877 23981 74468 146141 152643 30797 -38726 -16319 13996 32935
6235C2935j5666L8763n8053J5018n0358L341K645r6810k7979r6534P4171M3249
$$ 32935 17269 56032 -2021 12997 -37361 -34020 -31375 -128185 -156164 -252698 -178527 -135278
6223a35278N8237r8354k5461P4009J47854P5340l1627M0616M4199n1963J2972
$$ -135278 -77041 -175395 -200856 -126847 21007 96347 64720 105336 149535 97572 110544
6212A10544n8291j00661n0759L2656M8498Q7699q868k1982R5250L5000k1280j2827
$$ 110544 52253 -48408 -99167 -66511 -18013 69686 60818 38836 134086 169086 147806 134979
6200A34979m0313L3894j8651M1456J2865l457p2592l7300M138N5891O1732M5606
$$ 134979 94666 128560 109909 151365 164230 160773 88181 50881 55019 110910 172642 218248
6188B18248j12671m8989L3186K3526P3517j5241j3361l0890m2608q5342l2749
$$ 218248 105577 56588 89774 113300 186817 171576 158215 127325 84717 -625 -33374
6177c3374M3873N2468P401m6490j9183m8862p3527j8637K9903N1328j1823J5843
$$ -33374 10499 62967 70368 23878 4695 -44167 -117694 -136331 -106428 -55100 -66923 -51080
6165e1080L7779K6640k687N5958L0302J35591J310q8545n9070k4609L6398K5751
$$ -51080 -13301 13339 10652 66610 96912 232503 233813 145268 86198 61589 97987 123738
6153A23738j06617j045r9532Q202J31172K538q3231O9890j6236n5302m0493n308
$$ 123738 17121 16076 -83456 -75254 55918 58456 -24775 45115 28879 -26423 -66916 -72224
6141g2224K2994P0530L9236j4412r855N6214J54698J5150m2377m9446n9674q8534
$$ -72224 -49230 21300 60536 46124 36269 92483 247181 262331 219954 170508 110834 22300
6129B2300l2697j2634N702L0689J8687J7767l2129K0902k2055P0477M2630N8909
$$ 22300 -10397 -23031 -17329 13360 32047 49814 17685 38587 16532 87009 129639 188548
6117A88548l342q5379j0939L1762n5340q991k236o2264o7346O3929M4928N93m6932
$$ 188548 185206 99827 88888 120650 65310 56319 54083 -8181 -75527 -11598 33330 33923 -13009
6104a3009l467K3612Q3602q2353j2606P7030J3272L3900m4161k0462m9632k5050
$$ -13009 -16476 7136 90738 8385 -4221 72809 86081 119981 75820 55358 5726 -19324
6092a9324m5961L657O9646N4028k6557r9147J2674J09855l4189j22374M4495l6038
$$ -19324 -65285 -61628 8018 62046 35489 -63658 -50984 58871 24682 -97692 -53197 -89235
6080h9235R924J10109J500n8888J36953M7426j72129r2821J8820K053Q5826P6422
$$ -89235 -79311 30798 32298 -26590 110363 157789 -14340 -107161 -88341 -86288 -462 75960
6068G5960K9649o4279p8128p8561N7429q1438j04349j0697o6332k5386K9055K8151
$$ 75960 105609 41330 -36798 -115359 -57930 -139368 -243717 -254414 -320746 -346132 -317077 -288926
6056b88926P9734O0695J07700m2293j13561J4494Q4377O0716L1180P0816q1686
$$ -288926 -209192 -148497 -40797 -83090 -196651 -182157 -97780 -37064 -5884 64932 -16754
6045a6754r7691K7857l4070M1157L0578L231o2690N331j24961P9425N4941q1164
$$ -16754 -114445 -86588 -120658 -79501 -48923 -45692 -108382 -103051 -228012 -148587 -93646 -174810
6033a74810K297l5551J19623L2232L1957M0512O8800O8497j12207k5307k8075
$$ -174810 -172513 -208064 -88441 -56209 -24252 16260 85060 153557 41350 16043 -12032
6022a2032m2051K2184q0569M4009n4953p2126M2450K8343M958r3828L5279M2543
$$ -12032 -54083 -31899 -112468 -68459 -123412 -195538 -153088 -124745 -119787 -213615 -178336 -135793
6010a35793J15075Q4718K7665k3904m6355J3280o7947K0671J6540L0099o6660
$$ -135793 -20718 64000 91665 67761 21406 34686 -33261 -12590 3950 34049 -32611
5999c2611L2183J5733P882j8032O642N9966K0072k9759j8245p5995j2390O0049
$$ -32611 -428 15305 23187 5155 11797 71763 91835 62076 43831 -32164 -44554 15495
5987A5495N0044k1172o3592m2670J3211k9502Q1755N7233n5614J0855j9300k7485
$$ 15495 65539 44367 -19225 -61895 -48684 -78186 3569 60802 5188 16043 -3257 -30742
5975c0742j06496l1167J35723K0849k040n2357P808O1772K5091N0338K171L6290
$$ -30742 -137238 -168405 -32682 -11833 -13873 -66230 -58422 3350 28441 78779 80950 117240
5963A17240j7398m870j9723P3n7112o3789J569Q1083J24115q2890M7613R2217
$$ 117240 99842 94972 75249 75322 18210 -45579 -44010 37073 161188 78298 125911 218128
5951B18128j61909p1166p368R826o742l9100M4454l4986J881J29607P4232n8805
$$ 218128 56219 -14947 -22315 -12489 -19231 -58331 -13877 -48863 -46982 82625 156857 98052
5939I8052m1065l762j23354j15132L7646O1306l0423r292M3560K6201L1845l7288
$$ 98052 56987 53225 -70129 -185261 -147615 -86309 -116732 -126024 -82464 -56263 -24418 -61706
5927f1706q168J4021R0954P128r9250J0814k1980P7992k6848l0303L426K8112
$$ -61706 -69874 -55853 35101 42229 -57021 -46207 -68187 9805 -17043 -47346 -43920 -15808
5915a5808J632j4291J783l497M6595n991K3545N3743p9362j4445k6310p9353k1641
$$ -15808 -14176 -28467 -26684 -30181 16414 10423 33968 87711 8349 -6096 -32406 -111759 -133400
5902a33400m0557N2763P4653L6795J758j1006J66516j0442m5960n769j4704O7359
$$ -133400 -173957 -121194 -46541 -9746 -7988 -18994 147522 137080 91120 85351 70647 138006
5890A38006J6058q7995j48853L0344J10104J4752m1887L3968m4533j3834o6541
$$ 138006 154064 66069 -82784 -52440 57664 72416 30529 64497 19964 6130 -60411
5879f0411K3926O1633J34905N8499j01763j20089n1135p10o2928J8181J05122
$$ -60411 -36485 25148 160053 218552 116789 -3300 -54435 -55145 -118073 -99892 5230
5868E230Q1695k8777j31975j12672R242J35436K1060R057M4140k6765m6413j6749
$$ 5230 86925 58148 -73827 -186499 -177257 -41821 -20761 -11704 32436 5671 -40742 -57491
5856e7491l5578l2441K8995J19657J7568K6770J6209m793j59983j30834J08105
$$ -57491 -93069 -125510 -96515 23142 40710 67480 83689 78896 -81087 -211921 -103816
5845a03816J05774N2287Q3964q7740N034Q577j23533r4299K7483K7037J04935
$$ -103816 1958 54245 138209 50469 55503 64080 -59453 -153752 -126269 -99232 5703
5834E703R4010K4065n9771l0788o3935J82601J36054j07994j44304K015k1326
$$ 5703 99713 123778 64007 33219 -30716 151885 287939 179945 35641 37656 16330
5823A6330k3837N4001N1033k2927n1107n2461K5576M6630k0924l8327l1689q4383
$$ 16330 -7507 46494 97527 74600 23493 -28968 -3392 43238 22314 -16013 -47702 -132085
5811a32085k2798P4554O9904R4923Q6302o5487N6906j00214j00610K9290J796
$$ -132085 -154883 -80329 -10425 84498 170800 105313 162219 62005 -38605 -9315 -7519
5800g519r4509K8046k971N0047P1335K9330L9680J1587k1801j4758j35051o0564
$$ -7519 -102028 -73982 -76953 -26906 44429 73759 113439 125026 103225 88467 -46584 -107148
5788a07148M4858j4331J5323L4380M1185n2060j38435m2590q016J00979M5531
$$ -107148 -62290 -76621 -61298 -26918 14267 -37793 -176228 -218818 -226834 -125855 -80324
5777h0324j4131L7966N0777j9194M0589J04698K4117r5648k4817M7871q5189o1651
$$ -80324 -94455 -56489 -5712 -24906 15683 120381 144498 48850 24033 71904 -13285 -74936
5765g4936N7802P668K9585Q7779K5121N4389M8250l9801o840L372j327p7952n9308
$$ -74936 -17134 -9466 20119 107898 133019 187408 235658 195857 189017 192389 191062 113110 53802
5752E3802k9329M131J4878P424j2869J6998L668j13037l2232P0455j00388o5754
$$ 53802 24473 28604 43482 50906 38037 55035 58703 -54334 -86566 -16111 -116499 -182253
5740a82253J00771O4286n0493K8058M1191j05064k4405J57906K2388L1494K004
$$ -182253 -81482 -17196 -67689 -39631 1560 -103504 -127909 29997 52385 83879 85883
5729H5883j6603j7777O3751N8122n1414k6884j0449J6397M712k3536l05j7089
$$ 85883 69280 51503 115254 173376 121962 95078 84629 101026 105738 82202 81897 64808
5717F4808l4097L5110l5427J06391n8751j9933N3139J7591q1215j03853P4247
$$ 64808 30711 65821 30394 136785 78034 58101 111240 128831 47616 -56237 18010
5706A8010Q5637K7622j4530j08680p272m8738m9951P669N510J10728J32396R6330
$$ 18010 103647 131269 116739 8059 787 -47951 -97902 -90233 -84723 26005 158401 254731
5694B54731l3268m7613o6371L0765K4795N2401m8219j40622j7989L9657p5889
$$ 254731 221463 173850 107479 138244 163039 215440 167221 26599 8610 48267 -27622
5683b7622o2482j3628L1719R8064K7263j1130k2988O3034r2471o6055R070o1795
$$ -27622 -90104 -103732 -72013 26051 53314 42184 19196 82230 -10241 -76296 -67226 -129021
5671a29021l1537J9225R1362n3708o2333K9206k8665m3981K7089j6981K066P8497
$$ -129021 -160558 -141333 -49971 -103679 -166012 -136806 -165471 -209452 -182363 -199344 -197278 -118781
5659a18781j1885Q0469J25641n80k8769J4130o9726R37k570o9057R482L0060J69528
$$ -118781 -130666 -50197 75444 74864 46095 60225 -9501 -8564 -11134 -80191 -70709 -40649 128879
5646A28879l68p2165j25587L2384L4662K6764K5219p813N1769l7952q8621j4973
$$ 128879 128511 56346 -69241 -36857 -2195 24569 49788 41975 93744 55792 -32829 -47802
5634d7802L1898L9832l4407n1152l4222J29585r277L3390L810o6018j4180J53
$$ -47802 -15904 23928 -10479 -61631 -95853 33732 24455 57845 61655 -4363 -18543 -18390
5622a8390J1765J5529n9622p6779P8003k3779r004j6503J8434k5304j4768N139
$$ -18390 -6625 8904 -50718 -127497 -49494 -73273 -82277 -98780 -80346 -105650 -120418 -115279
5610a15279K2806L3307j4094j3820j6408O2424Q2274O9284R5663P1637j60937
$$ -115279 -92473 -59166 -73260 -87080 -103488 -41064 41210 110494 206157 277794 116857
5599A16857j48927r4687Q3507J86163K8561q9023l7470R2671j2397j8995R169
$$ 116857 -32070 -126757 -43250 142913 171474 82451 44981 137652 125255 106260 115429
5588A15429L3133K432j1017l4750j44754n125P5883P759r2536N875J1586P157
$$ 115429 148562 150994 139977 105227 -39527 -44652 31231 38990 -53546 -47671 -36085 -28928
5576b8928J795n0028p1939L2746M8469o3170L2027K4210N978n0110K8938l4217
$$ -28928 -27133 -77161 -149100 -116354 -67885 -131055 -99028 -74818 -68840 -118950 -90012 -124229
5564a24229q626N7447Q116k559N2633K7776K6919Q892j01553k9344n6808J7004
$$ -124229 -132855 -75408 -67292 -69851 -17218 10558 37477 46369 -55184 -84528 -141336 -124332
5552a24332Q7296K8288k7335L2956J2749K4189N7399Q5469J12481o4452o3835
$$ -124332 -37036 -8748 -36083 -3127 9622 33811 91210 176679 289160 224708 160873
5541A60873L0138n4563j3938q3848L002m0152J09613l1333m0140K7921k0363J5903
$$ 160873 191011 136448 122510 38662 41664 1512 111125 79792 39652 67573 47210 63113
5529F3113n5861j17832j4758o1579M4946J03657o818K9382n652j0649M0272j7506
$$ 63113 7252 -110580 -125338 -186917 -141971 -38314 -45132 -15750 -21402 -32051 8221 -9285
5517i285p3462M3107O0982j7946j3166L0864J07222J02071P7802j18981j02787
$$ -9285 -82747 -39640 21342 3396 -9770 21094 128316 230387 308189 189208 86421
5506H6421O8012m95m9318n9027r8947O2996R3285L3747l4435o0503n0976K6671
$$ 86421 154433 153938 104620 45593 -53354 9642 102927 136674 102239 41736 -9240 17431
5494A7431j7227n8062l1638n281n2941M5897J43839J19378j3264k5919j04365
$$ 17431 204 -57858 -89496 -94777 -147718 -101821 42018 161396 148132 122213 17848
5483A7848j28887R57l4899K8327J11253l1385M081L9745M5502j04671k6235L0964
$$ 17848 -111039 -110082 -144981 -116654 -5401 -36786 -32705 7040 52542 -52129 -78364 -47400
$$ [...]
##END NTUPLES=NMR SPECTRUM
##END=
