##TITLE=Analysis number 324593
Compound Code sb 00740
Project Code adrs
Chemist Name ians
##JCAMPDX= 6.0         $$ Bruker NMR JCAMP-DX V2.0
##DATA TYPE= NMR SPECTRUM
##DATA CLASS= NTUPLES
##ORIGIN= Bruker BioSpin GmbH
##OWNER= nmr
$$ XWIN-NMR		Version 3.5
$$ Mon Nov 27 14:24:47 2006 GMT Standard Time (UT+0h)  MAYBRIDGE\nmr@NMR_250MHZ
##.OBSERVE FREQUENCY= 250.131544655141
##.OBSERVE NUCLEUS= ^1H
##.ACQUISITION MODE= SIMULTANEOUS (DQD)
##.ACQUISITION SCHEME= undefined
##.AVERAGES= 16
##.DIGITISER RES= 18
##SPECTROMETER/DATA SYSTEM= dpx250
##.PULSE SEQUENCE= zg30
##.SOLVENT NAME= CDCl3
##.SHIFT REFERENCE= (INTERNAL, CDCl3, 0, 16.522)
##AUDIT TRAIL= $$ (NUMBER, WHEN, WHO, WHERE, WHAT)
$$ ##TITLE= Audit trail, XWIN-NMR		Version 3.5
$$ ##JCAMPDX= 5.01
$$ ##ORIGIN= Bruker BioSpin GmbH
$$ ##OWNER= nmr
$$ C:\u/data/dgb/nmr/ADRS/1180/pdata/1/auditp.txt
$$ ##AUDIT TRAIL=  $$ (NUMBER, WHEN, WHO, WHERE, WHAT)
(   1,<2006-11-27 14:24:25.15 +000>,<MAYBRIDGE\nmr>,<NMR_250MHZ>,
      <created by zg, POWCHK disabled, PULCHK disabled
       configuration hash MD5:
       49 4B E0 1D 92 C2 6B 37 9F E6 65 BC 52 41 86 1D
       data hash MD5: 64K
       A8 E9 CA F7 76 F7 04 6A 9F 1B 9D F7 67 6E 08 5B>)
(   2,<2006-11-27 14:24:38.53 +000>,<MAYBRIDGE\nmr>,<NMR_250MHZ>,
      <Start of raw data processing
       ef LB = 0.3 FT_mod = 6 PKNL = 1 SI = 32K 
       data hash MD5: 32K
       4E F6 22 BA 72 96 45 23 CF A5 08 6E B7 E8 A2 BD>)
(   3,<2006-11-27 14:24:40.55 +000>,<MAYBRIDGE\nmr>,<NMR_250MHZ>,
      <apk 
       data hash MD5: 32K
       DF CD A8 56 42 AA 37 EB 64 E5 69 9F 67 03 31 35>)
(   4,<2006-11-27 14:24:41.36 +000>,<MAYBRIDGE\nmr>,<NMR_250MHZ>,
      <abs ABSG = 5 
       data hash MD5: 32K
       4B D0 61 0F 63 2E A0 29 5B 18 E2 F9 A4 01 25 10>)
$$ ##END=
$$ 
$$ hash MD5
$$ 79 47 F5 D8 3B EE B0 A8 E5 8A AF B9 EE D9 CE F4
##$RELAX= 
##$RELAX= 
##$RELAX= 
##$RELAX= 
##$RELAX= 
##$RELAX= 
##$RELAX= 
$$ Bruker specific parameters
$$ --------------------------
##$DU= <C:\u>
##$EXPNO= 1180
##$NAME= <ADRS>
##$PROCNO= 1
##$TYPE= <nmr>
##$USER= <dgb>
##$AMP= (0..31)
100 100 100 100 100 100 100 100 100 100 100 100 100 100 100 100 100 100 
100 100 100 100 100 100 100 100 100 100 100 100 100 100 
##$AQSEQ= 0
##$AQ_mod= 3
##$AUNM= <au_zg>
##$AUTOPOS= <2 >
##$BF1= 250.13
##$BF2= 250.13
##$BF3= 250.13
##$BF4= 250.13
##$BF5= 500.13
##$BF6= 500.13
##$BF7= 500.13
##$BF8= 500.13
##$BYTORDA= 1
##$CFDGTYP= 0
##$CFRGTYP= 5
##$CHEMSTR= <none>
##$CNST= (0..31)
1 1 145 1 1 1 1 1 1 1 1 1 1 1 1 1 1 1 1 1 1 1 1 1 1 1 1 1 1 1 1 1 
##$CPDPRG= <>
##$CPDPRG1= <>
##$CPDPRG2= <>
##$CPDPRG3= <>
##$CPDPRG4= <mlev>
##$CPDPRG5= <mlev>
##$CPDPRG6= <mlev>
##$CPDPRG7= <mlev>
##$CPDPRG8= <mlev>
##$CPDPRGB= <>
##$CPDPRGT= <>
##$D= (0..31)
0 1 0 0 0 0 0 0 0 0.06 0 0 0 0 0 0 0.0002 0 0 0 0 0 0 0 0 0 0 0 0 0 0 
0 
##$DATE= 1164637463
##$DBL= (0..7)
120 120 120 120 120 120 120 120 
##$DBP= (0..7)
150 150 150 150 150 150 150 150 
##$DBP07= 0
##$DBPNAM0= <>
##$DBPNAM1= <>
##$DBPNAM2= <>
##$DBPNAM3= <>
$$ [...]
##$SUBNAM7= <"">
##$SUBNAM8= <"">
##$SUBNAM9= <"">
##$SW= 20.6930455092707
##$SWIBOX= (0..15)
0 0 3 0 0 0 0 0 0 0 0 0 0 0 0 0 
##$SW_h= 5175.983436853
##$TD= 65536
##$TD0= 1
##$TE= 294.16
##$TE2= 300
##$TE3= 300
##$TEG= 300
##$TL= (0..7)
0 120 120 120 120 120 120 120 
##$TP= (0..7)
150 150 150 150 150 150 150 150 
##$TP07= 0
##$TPNAME0= <>
##$TPNAME1= <>
##$TPNAME2= <>
##$TPNAME3= <>
##$TPNAME4= <>
##$TPNAME5= <>
##$TPNAME6= <>
##$TPNAME7= <>
##$TPOAL= (0..7)
0.5 0.5 0.5 0.5 0.5 0.5 0.5 0.5 
##$TPOFFS= (0..7)
0 0 0 0 0 0 0 0 
##$TUNHIN= 0
##$TUNHOUT= 0
##$TUNXOUT= 0
##$USERA1= <user>
##$USERA2= <user>
##$USERA3= <user>
##$USERA4= <user>
##$USERA5= <user>
##$V9= 5
##$VALIST= <valist>
##$VCLIST= <CCCCCCCCCCCCCCC>
##$VD= 0
##$VDLIST= <DDDDDDDDDDDDDDD>
##$VPLIST= <PPPPPPPPPPPPPPP>
##$VTLIST= <TTTTTTTTTTTTTTT>
##$WBST= 1024
##$WBSW= 4
##$XGAIN= (0..3)
0 0 0 0 
##$XL= 0
##$YL= 0
##$YMAX_a= 499824
##$YMIN_a= -571549
##$ZGOPTNS= <>
##$ZL1= 120
##$ZL2= 120
##$ZL3= 120
##$ZL4= 120
##$ABSF1= 16.522
##$ABSF2= -4.171173
##$ABSG= 5
##$ABSL= 3
##$ALPHA= 0
##$AQORDER= 0
##$ASSFAC= 0
##$ASSFACI= 0
##$ASSFACX= 0
##$ASSWID= 0
##$AUNMP= <proc_1d>
##$AZFE= 0.1
##$AZFW= 0.1
##$BCFW= 0
##$BC_mod= 0
##$BYTORDP= 0
##$COROFFS= 0
##$CY= 12.5
##$DATMOD= 1
##$DC= 0
##$DFILT= <>
##$DTYPP= 0
##$F1P= 14.0000005364418
##$F2P= -0.99999901652339
##$FCOR= 0.5
##$FTSIZE= 32768
##$FT_mod= 6
##$GAMMA= 0
##$GB= 0
##$INTBC= 1
##$INTSCL= 1
##$ISEN= 128
##$LB= 0.3
##$LEV0= 0
##$LPBIN= 0
##$MAXI= 10000
##$MC2= 0
##$MEAN= 0
##$ME_mod= 0
##$MI= 0
##$NCOEF= 0
##$NC_proc= -4
##$NLEV= 6
##$NOISF1= 0
##$NOISF2= 0
##$NSP= 0
##$NTH_PI= 0
##$NZP= 0
##$OFFSET= 16.522
##$PC= 1
##$PHC0= 223.6834
##$PHC1= -0.3642591
##$PH_mod= 1
##$PKNL= yes
##$PPARMOD= 0
##$PSCAL= 4
##$PSIGN= 0
##$REVERSE= no
##$SF= 250.13
##$SI= 32768
##$SIGF1= 0
##$SIGF2= 0
##$SINO= 400
##$SIOLD= 32768
##$SREGLST= <1H.CDCl3>
##$SSB= 0
##$STSI= 32768
##$STSR= 0
##$SW_p= 5175.98343685301
##$SYMM= 0
##$S_DEV= 0
##$TDeff= 65536
##$TDoff= 0
##$TI= <Analysis number 999999
Compound Code 99
Book Reference 9
Project Code 9>
##$TILT= no
##$TM1= 0
##$TM2= 0
##$TOPLEV= 0
##$USERP1= <user>
##$USERP2= <user>
##$USERP3= <user>
##$USERP4= <user>
##$USERP5= <user>
##$WDW= 1
##$XDIM= 32768
##$YMAX_p= 483256510
##$YMIN_p= -458822
$$ End of Bruker specific parameters
$$ ---------------------------------
##NTUPLES= NMR SPECTRUM
##VAR_NAME=  FREQUENCY,     SPECTRUM/REAL,   SPECTRUM/IMAG
##SYMBOL=    X,             R,               I
##VAR_TYPE=  INDEPENDENT,   DEPENDENT,       DEPENDENT
##VAR_FORM=  AFFN,          ASDF,            ASDF
##VAR_DIM=   32768,         32768,           32768
##UNITS=     HZ,            ARBITRARY UNITS, ARBITRARY UNITS
##FACTOR=    0.157963299565203, 1,           1
##FIRST=     4132.6476996994, 0,             0
##LAST=      -1043.33573715361, 0,           0
##MIN=       -1043.33573715361, -458822,     0
##MAX=       4132.6476996994, 483256510,     0
$$ Real data points
##PAGE= N=1
##DATA TABLE= (X++(R..R)), XYDATA
$$ [...]
24601A1145j645k7731j4701O879J3674L066l9620P883L8143J2992j7998M822o105
24588i196n391L8428J0593l7692J7297N596J8052j8626J8352k0357r674j1397
24576d015k2958J1384M9098o776k4499m087K6278o750K725J118J676j870r396
24563A1928j6613O731J9617N484j482k7204o14n636M150m619j8177q470J5397
24550a9508J2255j1921l961j5672J6486J528l0209m0510O420M1128p866K6668
24538b5162N2253J613l3117K2591L218m580J559j7796J640O320r817l956J6387
24525A1153O191j2473j1345n273k5701o473J4082N716K496J4851k4088j8821j2231
24512f1916j9936j21J5529J2409k1288J768J9008k437P365j50R073L6545L6185
$$ plain form
24601 11145 9500 -18231 -32932 -26053 -12379 -9313 -48933 -41050 -2907 10085 -7913 -3091 -9196
24588 -9196 -14587 23841 34434 -3258 14039 19635 37687 19061 37413 17056 7382 -4015
24576 -4015 -26973 -15589 33509 26733 2234 -1853 24425 17675 20400 21518 23194 21324 11928
24563 11928 -4685 2046 21663 27147 25665 -1539 -2153 -7789 -3639 -8258 -26435 -34905 -19508
24550 -19508 -7253 -19174 -23135 -38807 -22321 -20793 -51002 -91512 -85092 -43964 -51830 -25162
24538 -25162 27091 28704 -4413 18178 21396 16816 18375 579 2219 8539 -1278 -5234 11153
24525 11153 17344 4871 -6474 -11747 -37448 -43921 -29839 -24123 -21627 -6776 -30864 -49685 -61916
24512 -61916 -81852 -81973 -66444 -54035 -75323 -73555 -54547 -56984 -49619 -49769 -40696 -4151 32034
24499C2034m103K660l2581j7552J8888K3636J1047l7554l1690O442M1961j212
24487A1976k6646j358j0785J3184K2126K3299R298l4675K8511K5309k4525K251
24475C7965J4466L267k7325j7792j3574Q673n461J8171R941M932k1226k4610n0169
24462f2742K2399M3500n015l238K1880j3500j0001K7727R329n63r960k2545j8948
24449b1677J4205m806k2663L5603J9326R354r712q783r709p529j1945N113j6868
24436c0091J2988J3772J6012l1310m142K1649J7102k4252j3159J6089J9022j408
24424A2272N587K8840m5148n1005l1136N115L6328L3072K8871J0616l9585k3589
24412b9762l8081l4555M2798j190p915k746O494K5778K8152l1279j3326K8303
$$ plain form
24499 32034 27931 30591 -1990 -19542 -654 22982 34029 -3525 -35215 -28773 13188 11976
24487 11976 -14670 -16028 -26813 -13629 8497 31796 41094 6419 34930 60239 35714 37965
24475 37965 52431 55698 28373 10581 -2993 5680 219 18390 28331 33263 12037 -12573 -62742
24462 -62742 -40343 3157 -1858 -5096 16784 3284 -6717 21010 30339 29776 19816 -2729 -21677
24449 -21677 -7472 -12278 -34941 662 19988 29342 19630 10847 1138 -6391 -18336 -13223 -30091
24436 -30091 -17103 -3331 12681 -18629 -22771 -1122 15980 -8272 -21431 -5342 13680 12272
24424 12272 17859 46699 1551 -49454 -80590 -75475 -39147 -6075 22796 33412 -6173 -29762
24412 -29762 -67843 -102398 -59600 -60790 -68705 -71451 -64957 -39179 -11027 -42306 -55632 -27329
24400b7329K5335J1807k0770k0232l633k220L7522J141k3571n6130j4490N474
24388h7096N0599L9411m088L4318J7689J908m2018j2059j0769O87l2836J7249
24376b7005N1652J725l2278P235J1317k6526L574O502k8502o424L1455K1335K4852
24363C8912m754k922Q112n431l4449j3981L7294n231m0801P293J2079k3141K4325
24350b695j4667p320k550L2846O358J4320n410l5336j1197K734K7687q523m050
24337g803k8000L513j1687p454k354K3741N7614J2402r019l3876K8185o786j7383
24324A093K0440L1684l1946m0738m9351k1393k7058K9466L0544L0692r806r836
24312d6209J9231O829j6440k24K1125n987l8050J0573K6741j4524K2512J711M315
$$ plain form
24400 -27329 -1994 9813 -10957 -31189 -34822 -37042 480 1621 -21950 -78080 -92570 -87096
24388 -87096 -36497 2914 -1174 33144 50833 52741 10723 -1336 -12105 -11418 -44254 -27005
24376 -27005 24647 26372 -5906 1329 12646 -13880 -10306 -3804 -32306 -38730 -7275 14060 38912
24363 38912 34158 31236 39348 33917 -532 -14513 22781 17550 -23251 -15958 -3879 -27020 -2695
24350 -2695 -17362 -24682 -27232 5614 11972 26292 20882 -14454 -25651 -22917 4770 -3753 -7803
24337 -7803 -35803 -32290 -43977 -51431 -53785 -30044 27570 39972 30953 -2923 25262 18476 1093
24324 1093 21533 53217 21271 -19467 -68818 -90211 -117269 -87803 -57259 -26567 -36373 -46209
24312 -46209 -26978 -20149 -36589 -36813 -15688 -21675 -59725 -49152 -22411 -36935 -14423 -12712 -8397
24299h397P080q21k1948j4598R663J0600N336J1460j7398o5304R492L8601L6813
24286E79l1956l1079K6831n898K7033R0j5139M0276J2471J352j7719k5863l0380
24273d9402O55R642j2324K1505K6604J7213m9574Q248N9189P324o6533j9193O0655
24260A4009J1108j7137m880j577q79q29l725n269M466R449j0765j4001L0253L8743
24246D8966k382k8313M212J9970j8790j3506R246J2867j518j6625r306J8303J0975
24233C4099j7074j0578j8482l574k8897j5448N4798K2753j621l274P705J5996
24221C6403l1150m8882m719L6121R857P408j2982K7404k3710O799K2149J2648
24209C7346k1992j0710J1190j0883J6752r160j4088n125k5163J730m857L7831
$$ plain form
24299 -8397 -1317 -2138 -24086 -38684 -29021 -18421 -13085 -1625 -19023 -84327 -74835 -36234 579
24286 579 -31377 -62456 -35625 -41523 -14490 -14400 -29539 10737 23208 24560 6841 -19022 -49402
24273 -49402 -48747 -39105 -51429 -29924 -3320 13893 -35681 -27433 31756 39080 -27453 -46646 14009
24260 14009 25117 7980 3100 1523 644 -185 -3910 -9179 -4713 4736 -6029 -20030 10223 48966
24246 48966 46584 18271 22483 42453 23663 10157 19403 32270 30752 14127 4821 23124 34099
24233 34099 17025 6447 -12035 -15609 -44506 -59954 -5156 17597 15976 12702 20407 36403
24221 36403 5253 -43629 -48348 -12227 -2370 5038 -7944 19460 -4250 2549 24698 37346
24209 37346 15354 4644 15834 4951 21703 12543 -1545 -6670 -31833 -30103 -34960 2871
24197B871L1519k8095m8238k3052k1517R059Q795P408O5720j9657j4755M7971
24185A8029K5188J4068k7144o537k9446J5198J7740k131m2145J9837K4294n208
24173B1743k1488j9076K513k7663K2088K2473k606j9918j659N2568K4751k8887
24161B4839p206l0601k1666j707P882L0954m550l4066j5075j826K0419K1410j0454
24148b1647j2363k191K0506N6152j7504m2600j7009J6170J9818q135n982J0287
24136d498L9247J6070k2927j6306k6558j1325N0162L1216j7371j9510p850L0200
24124D0550J5509k0332n811M7239R324j4940j0645k7539m3971j1480L8720o85
24112A5939k6376J9290J6582l1010r751K2861R654O863j1708k3516K5361M9860
$$ plain form
24197 2871 34390 6295 -41943 -64995 -86512 -77453 -68658 -61250 4470 -15187 -29942 18029
24185 18029 43217 57285 30141 23604 -5842 9356 27096 24965 -17180 2657 26951 21743
24173 21743 255 -18821 -16308 -43971 -21883 590 -2016 -21934 -23593 28975 53726 24839
24161 24839 17633 -12968 -34634 -36341 -28459 2495 -2055 -36121 -51196 -53022 -32603 -11193 -21647
24148 -21647 -34010 -36201 -15695 40457 22953 -19647 -36656 -20486 -668 -8803 -14785 -4498
24136 -4498 34749 50819 27892 11586 -14972 -26297 23865 55081 37710 18200 10350 40550
24124 40550 56059 35727 29916 77155 86479 71539 60894 33355 -10616 -22096 16624 15939
24112 15939 -10437 8853 25435 -5575 -15326 7535 17189 24052 12344 -11172 14189 64049
24100F4049K1535j2117j4692q977m4095l7062j8803P600n994n158k2000j3692
24088h9406L0689N6269K6406j9258k2076l9166n914k9929J4416j027K5027L5933
24076a8036K0329J848j5394O794R477p55J0272l05k9120R943j396Q752j2589n767
24062a5947L1516J6923q978K0609J4912k4137j9138p340J8140L5473J0087l4651
24050C7469r842k0020j1194m947M3745K4839l5299m7150J4930J4061J4290o496
24038A4386R049O21L761m0090p0675l0471L0857K6148M7800L2782j9519k8060
24026b3411o429J6092J9718k458l446L1118l987L571J8071O27n671j6649k9587
24013b441j2722J7173r865j8406L3688K1094J0354J3753o612r359l9582j7797
$$ plain form
24100 64049 85584 73467 58775 49798 5703 -31359 -50162 -42562 -48556 -53714 -75714 -89406
24088 -89406 -58717 -2448 23958 4700 -17376 -56542 -62456 -92385 -77969 -78996 -53969 -18036
24076 -18036 2293 4141 -11253 -4459 5018 4263 14535 14230 -14890 -4947 -6343 2409 -10180 -15947
24062 -15947 15569 32492 23514 44123 59035 34898 15760 8420 26560 62033 72120 37469
24050 37469 27627 7607 -3587 -8534 35211 60050 24751 -22399 -7469 6592 20882 14386
24038 14386 23435 24056 27817 -12273 -82948 -113419 -82562 -56414 -8614 24168 4649 -23411
24026 -23411 -29840 -13748 5970 3512 66 31184 27197 30768 48839 49466 43795 27146 -2441
24013 -2441 -15163 2010 -7855 -26261 7427 28521 38875 52628 46016 36657 -2925 -20722
24001b0722j8673k0132L9763J9379k4898Q98J0495m6323L9508K5543K7813K3857
23989E6508j1464k2917m8322k7948M8181N8100J2808k7373l446o128l3618m5278
23977e0897m5135K7123K8437N212l1455j4511o467j3020M985L7449M5078L4231
23965B1030J3780k8797k3685K4826J5149J8730l8360k6343j7945J1585K8276J7409
23953A5655j1602J8366K6239k0757j1279P207l616k9374k0950K405q857J9886
23941a6677O5005J0514m0081j0668P908j9192O122L202J4164p930l4389j0640
23929c2662r375l225J2817k752q697j9177n502K1774J032O340J7392K4258J6741
23916A8964J1867L745P303j2524O178o20O319K3555k9536k0267K1302o18m2432
$$ plain form
24001 -20722 -39395 -59527 -19764 -385 -25283 -24385 -13890 -60213 -20705 4838 32651 56508
23989 56508 45044 22127 -26195 -54143 -5962 52138 64946 37573 34127 27999 -5619 -50897
23977 -50897 -96032 -68909 -40472 -35260 -66715 -81226 -87693 -100713 -95728 -58279 -13201 21030
23965 21030 34810 6013 -17672 7154 22303 41033 2673 -23670 -41615 -30030 -1754 15655
23953 15655 4053 22419 48658 27901 16622 23829 20213 -9161 -30111 -27706 -36563 -16677
23941 -16677 48328 58842 18761 8093 16001 -3191 2931 6133 20297 12367 -22022 -32662
23929 -32662 -42037 -45262 -32445 -35197 -43894 -63071 -68573 -46799 -45767 -39427 -22035 2223 18964
23916 18964 30831 34576 41879 29355 35533 34913 41232 64787 35251 14984 36286 35668 -6764
23903f764K468J3086j7468K7887k521k3973j532J5472k1898q967K4186K6586J6295
23890D2857n8762L972K5077k3665Q581M758J5678k1311k0225K7572K9730j5660
23878A8602j8933L0499J9101k5695l9657O568K1725K0740J107j6071K2811P882
23866D8679K4920j6231m228m4130M380J4208j9827l8866j4461M5277K9540j0065
23854A9196J511J5475j7761J2745J0050r472k2928k7095m4699J9888L5444J2572
23842D926L9353K0645j8792j5065j2703K767J2976k1785k1767l2712k9172L0862
23830d0467L2745K3026p603j5817j1427O009J041K0147j3791l8442k4285M310
23818f4554L2349K8793L6955O775j8504m4458K0553M8273N515k0940J391k3148
$$ plain form
23903 -6764 -4296 8790 -8678 19209 16688 -7285 -8817 6655 -15243 -24210 -24 26562 42857
23890 42857 -15905 -11933 13144 -10521 -1940 2818 18496 -2815 -23040 4532 34262 18602
23878 18602 -331 30168 49269 23574 -16083 -9515 12210 32950 34057 17986 40797 48679
23866 48679 73599 57368 53140 9010 13390 27598 7771 -31095 -45556 -279 29261 19196
23854 19196 20707 36182 18421 31166 41216 31744 8816 -18279 -62978 -43090 -7646 4926
23842 4926 44279 64924 46132 31067 18364 21131 34107 12322 -9445 -42157 -71329 -40467
23830 -40467 -7722 15304 7701 -8116 -19543 -13534 -12493 7654 -6137 -44579 -68864 -64554
23818 -64554 -32205 -3412 33543 40318 21814 -22644 -2091 46182 51697 30757 32148 9000
23806I000J2925J8277r988p2M624n358M1054R154m0493j3332r588j2070k1078
23793a6945q797K6575J2523j5853l160M1015o98p059k0939L7886J453o0809n65
23780a5373O567K7571j0604l7422J6604K3078J7691Q183q961r480l5072j2889
23768c0107L9234L0472j5376J2278k2488k3176R528J899k249l4298J0217k3122
23756d7188j3435Q234M2832J0052L861j1125L2854K6383m1453l2778J3925L3085
23744B5247L7246K841l3496o4813J7713o017J6988o10l9826J1766M1606J7726
23732B6371J1129j8592m976j0013K2904J4256k3490j8823J0602j1872m3297j6245
23720f2046r830o958R695m597J8011K9255j6368Q753J5537M526o805J9646R762
$$ plain form
23806 9000 21925 40202 30214 30142 34766 29408 70462 79616 39123 25791 16203 4133 -16945
23793 -16945 -25742 833 13356 -2497 -5657 35358 34660 27601 6662 44548 46001 -14808 -15373
23780 -15373 -8806 18765 8161 -29261 -12657 10421 28112 36295 27334 17854 -17218 -30107
23768 -30107 9127 39599 24223 36501 14013 -9163 365 2264 15 -34283 -24066 -47188
23756 -47188 -60623 -52389 -9557 495 4356 -6769 26085 52468 11015 -21763 -7838 25247
23744 25247 62493 65334 31838 -32975 -15262 -21279 -4291 -4901 -44727 -32961 8645 26371
23732 26371 37500 18908 13932 3919 26823 41079 17589 -1234 9368 -2504 -45801 -62046
23720 -62046 -71876 -78834 -69139 -73736 -55725 -26470 -42838 -34085 -18548 -14022 -20827 -1181 8581
23707H581j1635j403j6183j1959k3R92M3439M871m5205k2288K2961K9179K0215
23694B1542M7690o676m604j0993l7211J2476K8933j5680j7185j2685l2012j2586
23682c8991k2644K81K9573J0831o717O116l0346J0143J1737L402L0083J2436J6122
23669C2026p169k2566l6736J2627P717M869K3130q483J0179k9127K3329J0475
23657B0271q361j8930j0881k538J1616k0667J4850M3972K0076q793J5213j2827
23645D3001j1499J7210k3073j4435m756k3996j215M620m4094l58J4915J5632K793
23632b5255r007p274K7675N1933M2803j4436j3443J5224l1335n5779j4487J0282
23620b3099n506J5140J7892k0633l301N814J1322k020K5681J4882Q018J137k6060
$$ plain form
23707 8581 -3054 -4457 -20640 -32599 -32622 -31630 11809 16680 -28525 -50813 -27852 1327 21542
23694 21542 69232 62556 57952 46959 9748 22224 51157 35477 18292 5607 -26405 -38991
23682 -38991 -61635 -61354 -31781 -20950 -27667 -21551 -51897 -41754 -30017 -26615 3468 15904 32026
23669 32026 24857 2291 -34445 -21818 -14101 -9232 13898 5415 15594 -13533 9796 20271
23657 20271 11910 -7020 -17901 -20439 -8823 -29490 -14640 29332 49408 40615 55828 43001
23645 43001 31502 48712 25639 11204 6448 -17548 -18763 -14143 -58237 -58595 -43680 -28048 -25255
23632 -25255 -34262 -41536 -13861 38072 80875 66439 52996 68220 36885 -18894 -33381 -23099
23620 -23099 -28605 -13465 4427 -16206 -19507 -13693 -2371 -4391 21290 36172 44190 45327 19267
23607A9267Q956k4258J9933K6076j1429j2168L8247j836q9548l7847K6270L4332
23595d005j6223k451j5836j4215r446P766n734P737J9317J0172n900J9940L4723
23582B5845L0072j0483j5827l001L828R607k0415K490k4663k3559J7786j4922
23570b3242j1632l4648k7966J2649M2339N0444l538j4632L295J9884M0520J1291
23558F4764q368j2253l7022k411m7187j6110J8120j3436j5600K7722J2984l0016
23546e8813R391n550p640M0943K3001o066l0250J0029j4993J333J9589k2967J4070
23533b7923K2043K897o552k3791j6967j4465K6833Q945k1039K9903M3989J5603
23521C9476J7929K2576P693j9256j1895j6362o32k6449m7762k334j9514J2658
$$ plain form
23607 19267 28223 3965 23898 49974 38545 26377 64624 62788 -26760 -64607 -38337 -4005
23595 -4005 -20228 -22679 -38515 -52730 -62176 -54410 -60144 -52407 -33090 -22918 -28818 -8878 25845
23582 25845 55917 45434 29607 26606 30434 40041 19626 22116 -2547 -26106 -8320 -23242
23570 -23242 -34874 -69522 -97488 -84839 -42500 7944 4406 -10226 -6931 12953 53473 64764
23558 64764 56396 44143 7121 4710 -42477 -58587 -40467 -53903 -69503 -41781 -28797 -58813
23546 -58813 -49422 -54972 -62612 -21669 1332 -4734 -34984 -24955 -39948 -38615 -19026 -41993 -27923
23533 -27923 -5880 -2983 -9535 -33326 -50293 -64758 -37925 -28980 -50019 -20116 23873 39476
23521 39476 57405 79981 87674 68418 56523 40161 39529 13080 -34682 -37016 -56530 -43872
23509d3872L7759j4398l9705J5667j0305M9306N3063j768n4498l1602J5986l2187
23497e6554l3649L8050L9816O473K9905m008K13l1660j5917J9972J367K846J2708
23484I562o411R783M4447l940j8391l6387k82L9600K2656p122m2614J767k6843
23471a4175k4946r936K3024J1100j6409k582L7536P458k8999K2224l8575o468
23459d0748J963K5237K614m8616j2983L117p146o385k143k5491M94K8159J2569
23446f9359k369J4352R924k282K3023Q573P667K0474o603m0162J3933k216m374
23433b9419j2618l978m346J7564J6265K097l4332k2944J2253k1751j7082K3256
23421g5035L6418L4058J9093O891k0673j0491J148O554j1058J3054m645k5405
$$ plain form
23509 -43872 -6113 -20511 -60216 -44549 -54854 -5548 47515 45747 -8751 -40353 -24367 -56554
23497 -56554 -90203 -52153 -12337 -5864 24041 20033 20246 -11414 -27331 -7359 -5992 -3146 9562
23484 9562 3151 12934 57381 53441 35050 -1337 -1619 37981 60637 53515 10901 12668 -14175
23471 -14175 -39121 -49057 -26033 -14933 -31342 -33924 3612 11070 -17929 4295 -34280 -40748
23459 -40748 -38785 -13548 -10934 -59550 -72533 -69416 -76562 -82947 -85090 -110581 -110087 -81928 -69359
23446 -69359 -71728 -57376 -47452 -49734 -26711 -18138 -10471 10003 3400 -36762 -22829 -25045 -29419
23433 -29419 -42037 -46015 -50361 -32797 -16532 -14435 -48767 -71711 -59458 -81209 -98291 -75035
23421 -75035 -38617 -4559 14534 21425 752 -9739 -8591 -2037 -13095 -41 -4686 -30091
23409c0091J8521J9431k1696k4586J5808l822k6364R429M7994R805m0460k5309
23397e1340j580K605J1103Q778R429J2547L0798K7777l2250k4248r291O394M4261
23384C4983J1816K0094k4046k2887N768R829N0221l5134m0281J0309q16m0629
23372b0773j874L463Q395j6761p23j1711N053P922L777L373J0292K3446K0996
23359C4875k2638m0679R68j2949K8336M7051o0621n696P213m260k056K8743K6513
23346B4800k7886k4683L3846k7497k6293j6385K5292J6398o97j8505q097J629
23334d8078m64J7915k0569m5632J1111J4087L753O6005L0676l4657j2187m1363
23322e9403M0306L6037K7467j4767r874K2632K133K5703J5561P942n5859j9680
$$ plain form
23409 -30091 -11570 7861 -13835 -38421 -22613 -26435 -52799 -43370 4624 14429 -26031 -51340
23397 -51340 -52920 -50315 -39212 -30434 -21005 -8458 22340 50117 17867 -6381 -15672 -9278 34983
23384 34983 46799 66893 42847 19960 25728 35557 85778 50644 10363 20672 19856 -20773
23372 -20773 -22647 -19184 -10789 -27550 -28273 -39984 -34931 -27009 -23232 -19859 -9567 13879 34875
23359 34875 12237 -28442 -27474 -40423 -12087 34964 -25657 -31353 -24140 -28400 -30456 -1713 24800
23346 24800 -3086 -27769 6077 -21420 -47713 -64098 -38806 -22408 -23105 -41610 -49707 -48078
23334 -48078 -48542 -30627 -51196 -96828 -85717 -71630 -67877 -1872 28804 -5853 -18040 -59403
23322 -59403 -19097 16940 44407 29640 19766 42398 44531 70234 85795 93737 37878 18198
23310A8198L2879Q844j9632l4813k9005l677K8497K1092l8641l1828j7297M656
23298f0727J2833j3377k5873q459J4349L3276L8327M4721l1363n252j8246k3997
23286d3788P932M884N140K173K5083k2297j9084L982K5349J7929J353K1870k7298
23273C228l6887K9083P35L456J0974K2574o598k9875J3716L3085r99k9004q444
23260E044J4211J4714L5297k665n0655r758J1678K4355Q544N476k1440L418l0368
23247G851m5754K5742L906j9316m6K8305p30J6257N329k7682j0258J2313k0568
23234b4651L337M6633m18j5495k7548k0912l3177j4210K1542K0145K9649J5317
23222B12J0192q259J1834J7775o043n995k4230m0536J9765m884J6811J9927m0796
$$ plain form
23310 18198 51077 59921 40289 5476 -23529 -27206 1291 22383 -16258 -48086 -65383 -60727
23298 -60727 -47894 -61271 -87144 -95603 -81254 -47978 -9651 35070 3707 -1545 -19791 -43788
23286 -43788 -35856 -30972 -25832 -23659 1424 -20873 -39957 -35975 -10626 7303 8656 30526 3228
23273 3228 -33659 -4576 -3841 -385 10589 33163 26565 -3310 10406 43491 42492 13488 5044
23260 5044 19255 33969 69266 66601 15946 6188 17866 42221 50765 56241 34801 38219 7851
23247 7851 -37903 -12161 -8255 -27571 -27617 688 -42 16215 21544 -6138 -16396 -4083 -24651
23234 -24651 -21314 25319 24901 9406 -18142 -39054 -72231 -86441 -64899 -44754 -15105 212
23222 212 10404 2145 13979 31754 25711 19716 -4514 -45050 -25285 -30169 -13358 6569 -34227
23209c4227n451l537K3570L6277L3551N969m5711k6994O103M0216j7569q86P307
23196A8618k9356K5225L2179K0455j9349l6252o0110j5362M3363J0180J7090J5568
23184B2249j9960k6103L0849J0626o765k576j9285K5148M2715k5920j8741k834
23172I403j5066m2114m6267K3881M0490l595N210K2664J6470k2121J157j456J0917
23159d27K1440j2858j0539j9663J3591p919K0252L0766J2226j0129j5986k6829
23147f075K4528k2768k6517J6481N6230L2533l7523l1628p790J5206J2912q419
23135A7170J6311j6171j7617q538o851o087K2918K2602j9036j4239j244j6906
23123b7688l2038M0503L9027K2835m0509K666k5703j4808j9244J912J3464K1017
$$ plain form
23209 -34227 -39678 -43215 -19645 16632 50183 56152 10441 -16553 -10450 29766 12197 11311 18618
23196 18618 -10738 14487 46666 67121 47772 11520 -48590 -63952 -20589 -10409 6681 22249
23184 22249 2289 -23814 7035 17661 10896 8320 -10965 14183 56898 30978 12237 9403
23172 9403 -5663 -47777 -94044 -70163 -29673 -33268 -28058 -5394 11076 -11045 -9888 -11344 -427
23159 -427 21013 8155 -2384 -22047 -8456 -16375 3877 34643 46869 36740 20754 -6075
23147 -6075 18453 -4315 -30832 -14351 41879 74412 36889 5261 -2529 12677 25589 17170
23135 17170 33481 17310 -307 -8845 -15696 -21783 1135 23737 4701 -9538 -10782 -27688
23123 -27688 -59726 -19223 19804 42639 2130 4796 -20907 -35715 -54959 -53047 -39583 -18566
23111a8566J0209j0255j9986j7676J6438J0677P022P927m398M576l6156k2448
23099g2636K234L422J5536J2539q579k751J9654J0749R160j8062k8095J3007K708
23086d1114L3897J7320l5769r551L0142j6145M5084J7433k6602m7397n574O416
23074c1860Q988l469r515j1932j5020L6330M6910j5957l8014O655K800k69j4092
23061c8445K1151K4718L19p793Q044j8458K4325K1451O084k1529N31l0314k581
23048a2497J2935L6352l7538o3231L769L833K5567k098q070L2077J3433K0853
23036B5385L9925k5792k8909l5306j6784J6480J3238n119L496M4831j6763q317
23024F365l436j3168l188k114J8135K8814J0059j5046J7922J9478Q475L46o1072
$$ plain form
23111 -18566 -8357 -18612 -38598 -56274 -39836 -29159 -22137 -14210 -18608 -14032 -50188 -72636
23099 -72636 -70402 -66980 -51444 -38905 -47484 -50235 -30581 -19832 -10672 -28734 -56829 -43822 -41114
23086 -41114 -7217 10103 -25666 -35217 -5075 -21220 23864 41297 14695 -32702 -38276 -31860
23074 -31860 -22872 -26341 -35856 -47788 -62808 -26478 20432 4475 -33539 -26884 -24084 -24353 -38445
23061 -38445 -17294 7424 7743 -50 7994 -10464 13861 35312 41396 19867 20398 -9916 -12497
23048 -12497 438 36790 -748 -63979 -60210 -56377 -30810 -32908 -40978 -8901 4532 25385
23036 25385 65310 39518 10609 -24697 -41481 -25001 -11763 -16882 -13386 31445 14682 6365
23024 6365 2929 -10239 -13427 -15541 2594 31408 41467 26421 44343 63821 72296 72642 11570
23011A1570k6529k8140K8206J7203K9878o130J5903k1956q645r261R278Q049m4125
22998b4699j5668K5462r131j9693k9858K6265M8754j1764j9178l852L1053P5327
22986G3018l9750J491J7735l1287k3935K0250p72Q684j1875l9953L1190O292j3351
22973b263k069L380j7223r871m206J4224p796J6960p337j1238j9509J1379N489
22960c0080L421M0221q886j5526p350k5302J6704K1119m0615M900K771l7N323
22947c3337J1833k2257K5636L408K3729o51K5137Q192l6634l3738K7217N572j2347
22934h240j9802L1614J5450J3660q934l1550L8897j3276k7094J3266j2354j7083
22922b5446o788K1909J8941L033m0130K4225K7648J9915l6146l1658j4955j5671
$$ plain form
23011 11570 -14959 -43099 -14893 2310 32188 26058 41961 20005 11360 2099 11377 19426 -24699
22998 -24699 -40367 -14905 -24036 -43729 -73587 -47322 1432 -10332 -29510 -33362 -2309 73018
22986 73018 33268 34759 52494 21207 -2728 17522 16750 25434 13559 -26394 4796 11088 -2263
22973 -2263 -4332 -952 -18175 -28046 -32252 -18028 -25824 -8864 -16201 -27439 -46948 -35569 -30080
22960 -30080 -26659 13562 4676 -10850 -18200 -43502 -26798 -5679 -46294 -41394 -38623 -38660 -33337
22947 -33337 -21504 -43761 -18125 -14717 9012 8361 33498 41690 5056 -28682 -1465 4107 -8240
22934 -8240 -28042 3572 19022 32682 23748 -7802 31095 17819 -9275 3991 -8363 -25446
22922 -25446 -32234 -10325 8616 11649 -28481 -4256 23392 43307 7161 -24497 -39452 -55123
22910e5123n529j236l902J1519J7627k777P915L2390O976l4295j9407M37k0801
22897f6206R322J4522k2196R290K4243k831k462J3463K0435K2161o411J3849J0699
22884C7878l0175k2367K9651J62L5701j1394n7261l7830j7944J6475J7337q392
22872d8159m0054L6839M3010J6944Q277m3354M71L8581o295K4633K9540q535j9428
22859C2470l9175j5448j1051N678j8906l1126L1359N7969m206j9665K1971K5118
22847C4988K9960k7193j4375p79j4922K1314J970o684l458k1198j9699q617l5583
22834f4276K769K8069K3959R11O519J7574j2624K4290K9372j86o2915m8620J1987
22821d3171P248m7472m571J6046j4383K6390P126L82L3553L0623p483L6489J4721
$$ plain form
22910 -55123 -60652 -61888 -65790 -54271 -36644 -39421 -31506 884 7860 -26435 -45842 -45405 -66206
22897 -66206 -56884 -42362 -64558 -55268 -31025 -33856 -36318 -22855 -2420 19741 13330 27179 37878
22884 37878 7703 -14664 14987 15149 50850 39456 -17805 -55635 -73579 -57104 -39767 -48159
22872 -48159 -88213 -51374 -8364 8580 16857 -26497 -26026 12555 6260 30893 60433 51898 32470
22859 32470 -6705 -22153 -33204 -27526 -46432 -77558 -46199 11770 7564 -12101 9870 34988
22847 34988 64948 37755 23380 22601 7679 28993 30963 24279 20821 -377 -20076 -28693 -64276
22834 -64276 -61507 -33438 -9479 -8568 -2049 15525 2901 27191 56563 56377 -6538 -55158 -43171
22821 -43171 -35923 -83395 -87966 -71920 -86303 -59913 -52787 -52405 -18852 11771 4288 40777 55498
22808E5498l6359J642J6745L455k8941k2212k6350P171k638J8722K0073j8913
22796a2107k7869M9828K7636l0959j1756j3526M067k624K9330J9297k176l4884
22784e743l1798m2776L4603P1345J0655j530k1208m0933l557M6386k8988m9708
22772f3252j236K4964N2080q747j3126L9212J8603l4510j4698q350K9108K7541
22760D7589k2923m6902J1410J2819K5697j0687j4876R55K423K2004J2638R73K4747
22747F5867l3490o166j2117K264J253J0342k341K4501l0061m843k227k822j1452
22734a292K4680k2007k6536j9458J100J8972N3633K2143j5061J1742m2874J4345
22722A9387K9229r246j5872q287j4234J3682J3717O785L6141j0516l7773k1785
$$ plain form
22808 55498 19139 20781 37526 40981 12040 -10172 -36522 -29351 -31989 -13267 6806 -12107
22796 -12107 -39976 9852 37488 6529 -5227 -18753 -14686 -17310 12020 31317 29141 -5743
22784 -5743 -37541 -80317 -45714 25631 36286 34756 13548 -27385 -30942 15444 -13544 -63252
22772 -63252 -64488 -39524 12556 3809 -9317 29895 48498 13988 -710 -9060 20048 47589
22760 47589 24666 -22236 -10826 1993 27690 17003 2127 3082 5505 27509 40147 41120 65867
22747 65867 32377 26211 14094 16358 17611 27953 25612 50113 20052 15209 12982 10160 -1292
22734 -1292 23388 1381 -25155 -44613 -43513 -24541 29092 51235 36174 47916 5042 19387
22722 19387 48616 39370 23498 15211 977 14659 28376 35161 71302 60786 23013 1228
22710A228j0622P258K7498j0906m1107p206K6414L1539K0478k4773l1332l6902
22698d8433k9656L8523J758K5184J8484k6210k1675r741m81J2485O8142L7859
22686F6239n981j9710m045N042k9636R052n519K3270K696k9479j0154M1714K2908
22673F6397j9121J1107l5158j5252K315J246k4738k204J2293l0204k23Q565P374
22660a7603j2840k3912k8943K6980M2887N138J0513l926m39j265l7070k1081L8590
22647b2971J1523j1254K114j2851J081L5997N509k9376M0927J9340n669q300K1248
22634D7318J5971j8380l5090j8783Q1L8457J2681J7682K5639l0549m1606j0801
22622B620N991M666Q85j2623J9779k8247k4148O717L4337K7594K6807n1802m2019
$$ plain form
22710 1228 -9394 -2136 25362 14456 -26651 -33857 -7443 24096 44574 19801 -11531 -48433
22698 -48433 -78089 -39566 -37808 -12624 5860 -20350 -42025 -51766 -52247 -39762 28380 66239
22686 66239 60258 40548 36503 41545 11909 20961 15442 38712 41408 11929 1775 43489 66397
22673 66397 47276 58383 23225 7973 10288 11534 -13204 -15408 -3115 -33319 -33542 -24977 -17603
22660 -17603 -30443 -54355 -83298 -56318 -13431 -8293 2220 -1706 -2145 -3410 -40480 -61561 -22971
22647 -22971 -11448 -22702 -20588 -33439 -32358 3639 9148 -20228 20699 40039 34370 26070 47318
22634 47318 63289 44909 9819 -8964 -8883 29574 42255 59937 85576 55027 13421 2620
22622 2620 8611 13277 14162 1539 21318 -6929 -31077 -24360 9977 37571 64378 12576 -29443
22609b9443n113J3341M4828j0332j4906k5693O164J3742o284Q425j9503K098K4934
22596B258r065n377M3316P577K772P340j2380p267j7156r258k2602J0200j8026
22583b7668K526K3385K3025j3464l1894j251L6401k4117j5663j6099j9157l3390
22571i7366J2198N6343J3479J5870j3728j4396J9897J303q3K3873k5j2158j5288
22558a0081l6310K3833M494J1982Q616j0109j8533L512O4644P257l5087k5027
22546a0809j8176p498m288J6637O147L9505K1279K73L4642m3308l4970J5200J7568
22533C2202L8281P417n5394O38j954j0989j0820l3877j8776K3839J3716p672l1389
22520e4778J163Q542J8747J3997J1690p766k8517r033R985j0001N282J5790M6192
$$ plain form
22609 -29443 -34556 -21215 23613 13281 -1625 -27318 -21154 -7412 -13696 -5271 -24774 -22676 2258
22596 2258 -6807 -12184 31132 38709 41481 48821 36441 29174 12018 2760 -19842 -9642 -27668
22583 -27668 -25142 -1757 21268 7804 -24090 -25341 11060 -13057 -28720 -44819 -63976 -97366
22571 -97366 -85168 -28825 -15346 524 -13204 -27600 -7703 -6400 -6483 17390 17365 5207 -10081
22558 -10081 -46391 -22558 -18064 -6082 2534 -7575 -26108 -22596 42048 49305 14218 -10809
22546 -10809 -28985 -36483 -40771 -24134 -17987 21518 42797 43070 77712 34404 -566 14634 32202
22533 32202 70483 77900 22506 23144 21190 10201 -619 -34496 -53272 -29433 -15717 -23389 -54778
22520 -54778 -53615 -45073 -26326 -12329 -639 -8405 -36922 -45955 -35970 -45971 -40689 -24899 21293
22507B1293J8551j3444l1259J982j9933r14L3464M2722j6288m0495K0828l573
22495A2934j0762k74j2647j4097j3012J242j3844r719K0874O984r660n325k1832
22482f9138P037J8555R529K5277J8956q389l0385l3619j7600J6717j5140K3337
22470e4863j2098J7534M095L692m048K647J0704J9446K7160L023L2837j6540j5298
22457A8291J136J1541l985j3307m4504J2542L4706k1173l4339M2333L7368l5511
22445E098m1786J244Q514J243J6578J178j0803l5547p622m938J262K9965K0344
22432a5270J4226l701O851K6941q946n2489J7024J7037L714J9530M3602n638m7914
22419A4967j4930j9691l3897k8633n442K0745K8813J5400j4288M3395m397p592
$$ plain form
22507 21293 39844 26400 -4859 -2877 -22810 -23724 9740 52462 36174 -4321 16507 12934
22495 12934 2172 1898 -10749 -24846 -37858 -36616 -50460 -60179 -39305 -32321 -41981 -47306 -69138
22482 -69138 -62101 -43546 -34017 -8740 10216 1827 -28558 -62177 -79777 -63060 -78200 -54863
22470 -54863 -66961 -49427 -45332 -41640 -45688 -43041 -32337 -12891 14269 17292 50129 33589 18291
22457 18291 19427 30968 26983 13676 -30828 -18286 16420 -4753 -39092 3241 40609 5098
22445 5098 -36688 -35444 -26930 -25687 -9109 -7931 -18734 -54281 -61903 -66841 -65579 -35614 -15270
22432 -15270 -1044 -4745 2106 29047 20101 -32388 -15364 1673 5387 24917 68519 62881 14967
22419 14967 37 -19654 -53551 -82184 -87626 -66881 -38068 -22668 -36956 6439 2042 -5550
22407e550J5625k0028l6831k6405q849J582j0218k9838K5263J7170j6303L1351
22395f3031L5583M4981N132r925o855L323J9112K4303L584O555j2934j1539j8011
22382B0278j2772o565j3410r993O6259j4188l9619k603l2980L9338O179j7943
22370a8019k6418N447J3831m039m3517J0999J5706K2801j3831J8904L0438K8107
22358D0409j6588k3846k7739L007K5995K3241J9533l4178l0358J1081K2303j1885
22346I75j642J3637L3621O635l153j3328l9787j5389Q060K1364L407o779L5731
22333D3352J7489j4873l3492j1937j0927j7702j7350K715O635J2178J6091p471
22321a5292N2k9630o21K1020K7223k7472j059J7358n0009l6801O074K9452k750
$$ plain form
22407 -5550 10075 -9953 -46784 -73189 -82038 -80456 -90674 -120512 -95249 -78079 -94382 -63031
22395 -63031 -27448 17533 22665 12740 5885 9208 28320 52623 56207 62762 49828 38289 20278
22382 20278 7506 941 -12469 -22462 43797 29609 -10010 -12613 -45593 -6255 -76 -18019
22370 -18019 -44437 -38990 -25159 -29198 -72715 -61716 -46010 -23209 -37040 -18136 12302 40409
22358 40409 23821 -25 -27764 -24757 1238 24479 44012 9834 -20524 -9443 12860 975
22346 975 -667 12970 46591 53226 50073 36745 -3042 -18431 -10371 10993 14400 7621 43352
22333 43352 60841 45968 12476 539 -10388 -28090 -45440 -42725 -36090 -23912 -7821 -15292
22321 -15292 -15240 -44870 -45491 -24471 2752 -24720 -25779 -8421 -58430 -95231 -89157 -59705 -62455
22308f2455J1644L1173K586N844k1746M2606l697j8758k262K763K361j901k7534
22295c9376J4146n659J2683p89k6656j0185J1185j107M9370J8904j2124M1153
22283E1545k104l5740n0212M46K4948K977k6715k2053J6255J9871K2130k1785
22271b0437j883J8912M814M3038n500O840n980j9444J0905j0822r742l4205K0189
22258c315R887q067l5948R320M8286J5726k9993k5814p003M5725p102l3694K4955
22245B963J5453J3575q060l4776m100L2718j0172m9718O696K5752r19J9840K538
22232A1790l4310n207N084M5290j2442P68p087k6179K4883L2308p982j5957L5997
22219D6956l8066n553m762n225J3403l545l1422j1251K8036K3104j7213j9269
$$ plain form
22308 -62455 -50811 -19638 -17052 -11208 -32954 9652 5955 -12803 -15065 -12302 -9941 -11842 -39376
22295 -39376 -25230 -30889 -18206 -18995 -45651 -55836 -44651 -45758 3612 22516 10392 51545
22283 51545 49441 13701 -36511 -36065 -11117 -8140 -34855 -56908 -40653 -20782 1348 -20437
22271 -20437 -22320 -3408 1406 44444 38944 45784 39804 20360 31265 20443 10701 -23504 -3315
22258 -3315 6572 -1495 -37443 -28123 20163 35889 5896 -19918 -26921 18804 11702 -21992 2963
22245 2963 18416 31991 23931 -10845 -14945 17773 7601 -42117 -35421 -9669 -10588 9252 11790
22232 11790 -22520 -27727 -22643 22647 10205 10973 3886 -22293 2590 34898 26916 10959 46956
22219 46956 8890 3337 -1425 -6650 6753 3208 -28214 -39465 -11429 11675 -5538 -24807
22207b4807M991k8707J0777J1944P031j8782R269K1332j728k1933Q160P960K9752
22194A5259L8741k0280k9252J106M495p68l903p573k1065K3660L576r290J0818
22181E524j0655p913j3446N86k5880k7310O1824L4733L095Q218N885J7865m609
22168D7917j2833k9334j356r912k0739J0411K481L9801o356m5731l3520L9911
22156a9260O502n856j5798l0287j1604r582J3225K3909L8776J923o508o226l323
22143b4109M966j7368R859K7231j490j017R960m0620m0060K1988J0083o16K1703
22130a9490m32r663j0404K8273k1538l3129l40Q515j0439J711J8584K1916K238
22117b4198j998J2318K4043J7108k4916l7942J6998K1844O75J257L7672J7107
$$ plain form
22207 -24807 -19816 -48523 -37746 -25802 -18771 -37553 -28284 -6952 -8680 -30613 -22453 -14493 15259
22194 15259 54000 33720 4468 5574 10069 9301 5398 -2175 -23240 420 3996 -5294 5524
22181 5524 -5131 -13044 -26490 -25904 -51784 -79094 -17270 17463 20558 28776 34661 52526 47917
22168 47917 35084 5750 4394 -5518 -26257 -15846 -13365 26436 20080 -25651 -59171 -19260
22156 -19260 -12758 -18614 -34412 -64699 -76303 -85885 -72660 -48751 -9975 -8052 -14560 -20786 -24109
22143 -24109 -19143 -36511 -26652 579 -911 -1928 8032 -32588 -72648 -50660 -40577 -41193 -19490
22130 -19490 -19922 -29585 -39989 -11716 -33254 -66383 -66723 -58208 -68647 -66936 -48352 -26436 -24198
22117 -24198 -26196 -13878 10165 27273 2357 -35585 -18587 3257 3932 5189 42861 59968
22105E9968m1996l11J8427j6145j8119r450k0607o647M151J3851K7181L5630k0868
22092B5065j9139m1858q148J6703j981j0677J7093L6443J3419J608l5680n3925
22080f1077j7488K8402M2519M2232m848J7438k6859l6086j2286l0321K796N783
22068d9795m710l925L9957L6723k87k9258L544K13P058K3895O719j7719l1820
22055a9405n060m969J742M6342q08j8247p435K4045k7130O729r487k412j8044
22042c4139l6282J0386J071K0618K6064K3430r677k3694k4549k2271M347J2416
22030e2280K6204K8159J1846j7272j9301j1643n763O256J5028o625R308K1236
22018E153j9990j7242k7364L0003P996J4949J267k7035P352r472J5742N839q414
$$ plain form
22105 59968 17972 17661 36088 19943 1824 -7626 -28233 -34880 -30729 -16878 10303 45933 25065
22092 25065 5926 -35932 -44080 -27377 -29358 -40035 -22942 13501 26920 28528 -7152 -61077
22080 -61077 -78565 -50163 -7644 34588 29740 47178 20319 -15767 -28053 -58374 -55578 -49795
22068 -49795 -54505 -58430 -18473 18250 17963 -11295 -7751 -7538 -480 23415 30134 12415 -19405
22055 -19405 -24465 -29434 -27692 18650 17842 -405 -7840 16205 -10925 -4196 -13683 -16095 -34139
22042 -34139 -70421 -60035 -58964 -38346 -12282 11148 1471 -22223 -46772 -69043 -64696 -52280
22030 -52280 -26076 2083 13929 -3343 -22644 -34287 -40050 -33794 -18766 -25391 -16083 5153
22018 5153 -14837 -32079 -59443 -29440 -21444 -6495 -5228 -32263 -24911 -34383 -18641 -12802 -21216
22005b1216j4073K4288J9746j8667k453j8966j5518L6312O8963j3649k7056K17
21993A7928k428o160K259k9736j7191j3968k7891K7987L8938L1444N9957M5884
21981A27023j8798k2382o9525k0808j3037j0878r430K4641J1121P461L3421q991
21969B9818J0577J5261q910J114j6892k6517k7423L133N049j1546K1204N5642
21957E0510J7439l5030k9705J5644l2112P32J8200j259P751k9008m8628j2148
21945g7614K3878M5727k869N128n1820j7617m311m624j3005J4032O1191K5416
21933C512N668j5769J5862M0432j5695m0093p61k6670P817L4037L7458k6140l9157
21920a9499l6584k1806L4943K5866Q043l1q866J4252L5275j416k4854q077Q685
$$ plain form
22005 -21216 -35289 -11001 8745 -9922 -12375 -31341 -46859 -10547 58416 44767 17711 17928
21993 17928 15500 9340 11599 -18137 -35328 -49296 -77187 -49200 -10262 21182 81139 127023
21981 127023 108225 85843 16318 -4490 -17527 -28405 -37835 -13194 -2073 5388 38809 29818
21969 29818 40395 55656 46746 47860 30968 4451 -22972 -19839 -14790 -26336 -5132 50510
21957 50510 67949 32919 3214 18858 -13254 -12522 5678 4419 12170 -16838 -65466 -77614
21945 -77614 -53736 -8009 -10878 -5750 -57570 -75187 -79498 -84122 -97127 -83095 -21904 3512
21933 3512 9180 -6589 9273 49705 34010 -6083 -6844 -33514 -25697 8340 45798 19658 -19499
21920 -19499 -56083 -77889 -42946 -17080 -9037 -9068 -17934 -3682 31593 30177 5323 -2754 5931
21907E931l7479J0003L3617J5751K4553L157L177l7484p202R737j5091K0429j7047
21894A2052r041k2289K8022J412j8523J1747J4139J7183j8430p823J0301J9953
21882C8703l1213n1845j8087K5128r743L5435M6239P659j4718J9553j0046m8386
21870a1321O063k9892J1232K0718k5196K7141J1243l4664q460J2827M783l313
21858a8839l858K9749j4973l6829J6344L2424n049K5905j0167j2427k0486K5826
21846G620M3538J7830m7759m5560M958J6450j1220K3877L3095O971o855j5292
21834B7653J3746Q699m3282q5227l7864M4284M8632L3688L1226r374k160j1772
21822A8249k1186J6733j2815j6583J9734j6324o445K2095J5545J5684l6600j4390
$$ plain form
21907 5931 -31548 -21545 12072 27823 52376 55533 58710 21226 14024 23761 8670 29099 12052
21894 12052 3011 -19278 8744 10156 -8367 3380 17519 34702 16272 8449 18750 38703
21882 38703 7490 -44355 -62442 -37314 -47057 -11622 34617 42276 27558 47111 37065 -11321
21870 -11321 -5258 -35150 -23918 -3200 -28396 -1255 9988 -24676 -33136 -20309 -15526 -18839
21858 -18839 -22697 7052 -7921 -44750 -28406 4018 -1031 24874 14707 2280 -18206 7620
21846 7620 51158 68988 21229 -24331 -19373 -2923 -14143 9734 42829 49800 42945 27653
21834 27653 41399 50098 6816 -78411 -116275 -71991 -23359 10329 41555 32181 30021 18249
21822 18249 -2937 13796 981 -15602 4132 -12192 -18637 3458 19003 34687 -1913 -16303
21810a6303K284J4854K3342j6695j1724j1456k1688O248L1628j577K6373M7725
21798G3011j085O878l4955o278r646j7830n592o049k1307k623M419k0256k1375
21785f2688K8160J9370J9158n162j14J4383J4885j6856k5356k4955K6844M8533
21773C6202k9124r821K0565o507m2300N612J8548K8194j8339j3958k0635M250
21761b7313N0491K3934k3689j7832k9919Q986L7573K1959k2919M013k4649k4429
21749b3794l333K647l0236k006M3649J0743j7483K6824j4937j2045L7165j8477
21737a283J175J6985J2124j6679j9189J7127j8327k6523J3307J9919K0885j26
21725A9395m1303j4469J1601M9787J9758j6709J2688n210l7507k3690K4298Q296
$$ plain form
21810 -16303 -14019 835 24177 7482 -4242 -15698 -37386 -31138 490 -1087 25286 73011
21798 73011 71926 78804 43849 37571 27925 10095 4503 -1546 -22853 -25476 -21057 -41313 -62688
21785 -62688 -34528 -15158 4000 -1162 -1276 13107 27992 11136 -14220 -39175 -12331 36202
21773 36202 7078 -2743 17822 11315 -30985 -25373 -6825 21369 3030 -10928 -31563 -27313
21761 -27313 23178 47112 23423 5591 -24328 -15342 22231 44190 21271 25284 635 -23794
21749 -23794 -27127 -24480 -54716 -56722 -13073 -2330 -19813 7011 -7926 -19971 17194 -1283
21737 -1283 -108 16877 29001 12322 -6867 10260 -8067 -34590 -21283 -1364 19521 19395
21725 19395 -21908 -36377 -24776 25011 44769 28060 40748 35538 -1969 -25659 -1361 6935
21713F935K108o988j5472j6111J7371L0935j4358L708k3000l2603J6464K6512
21701d499r171l6704k4588M9890L1597j0400J3885p788r404J0596L7373r409n6998
21688b5620Q563k904L6623N59o6821K9021M7283Q36j2009o620p342j4656k0199
21675c3286J7303K7854j9225J0706M9344p331n1543J9391K8990n389l8458k2414
21663b4058k589k512j9183J0265L904Q896J2839k486j2742l750L1825J0160K0026
21650C0595J1580k7413J6937L031R034j5417Q545M8877J8637n569l7291l2411
21638B9135l0555j824j8535j2279K7250k793j9252m5481O843L7494K9886L4921
21626C4810K8291j2333k3206l0368L107R221j1714K7402j3417k9847j402L1661
$$ plain form
21713 6935 9043 2055 -13417 -29528 -12157 18778 4420 8128 -14872 -47475 -31011 -4499
21701 -4499 -13670 -50374 -74962 -25072 6525 -3875 10010 2222 -7182 3414 40787 31378 -25620
21688 -25620 -17057 -19961 16662 17221 -49600 -20579 26704 27540 15531 8911 1569 -13087 -33286
21675 -33286 -15983 11871 -7354 3352 52696 45365 -6178 13213 42203 36814 -1644 -24058
21663 -24058 -26647 -29159 -48342 -38077 -34173 -25277 -12438 -14924 -27666 -31416 409 10569 30595
21650 30595 42175 14762 31699 34730 43764 28347 36892 85769 104406 98837 61546 29135
21638 29135 -1420 -3244 -21779 -34058 -6808 -9601 -28853 -74334 -67491 -29997 -111 34810
21626 34810 63101 50768 27562 -2806 301 9522 -2192 25210 11793 -18054 -19456 12205
21614A2205l9525j8632J3721j5487J1102P001M752J9383K3393o111k9327k2708
21602d0233J0471N5287l143J796l8803l889Q140L5059l1940R268K3477J9518k7484
21589A7524j1324J6954o695O663k4907n547J5533J5883l9424j9431Q787L6398
21577A0414Q623k0677J5116L2080k1039j3211l1712m4350K1828N584R82L2214
21565d148L5817j8315n802k6020K6215L3099k1474j6546J0297M14n238Q35k0928
21552a1794O501k9353k140K682j2178l197M945m2414O525K1588k188J7813P573
21539c5637K9234J8642Q279J5884m1900m3340L8426L1883m893l030l181J4597
21527B4964J8241k7493m9898j020J2809l781K0211k1362j0967n887J9874L1089
$$ plain form
21614 12205 -27320 -45952 -32231 -47718 -36616 -29615 -24863 -5480 17913 11802 -17525 -40233
21602 -40233 -29762 25525 22382 24178 -14625 -18514 -10374 24685 -7255 2013 25490 45008 17524
21589 17524 6200 23154 16459 23122 -1785 -7332 8201 24084 -15340 -34771 -25984 10414
21577 10414 19037 -1640 13476 45556 24517 11306 -20406 -64756 -42928 -37344 -36362 -4148
21565 -4148 31669 13354 7552 -18468 7747 40846 19372 2826 13123 13537 8299 9134 -11794
21552 -11794 -5293 -34646 -36786 -34104 -46282 -49479 -44534 -86948 -80423 -58835 -61023 -43210 -35637
21539 -35637 -6403 12239 20518 36402 -5498 -48838 -10412 21471 16578 13548 10367 24964
21527 24964 43205 15712 -34186 -35206 -22397 -26178 -5967 -27329 -38296 -44183 -24309 6780
21515F780J3772K862k1484M788L215j789j2631j1517P931Q89l0923k5988K9442
21502c4653N5455r924k8180M8967J2342k8154j4057o523J0220l427j6789k7937
21490d2660J7835L4463m6328r815k035J2776L497K4910K6083k0478K919L218L141
21477G526R192k9770J1491K1726j3867J0606j2565k3158K9267J1033k4611n1634
21465e4764p99p397K5332K8201L0932J5555K428k6867m9500n5780Q944M5591M2243
21452D119J1812k2208K2214N816m1235n612L587k7165j4344K93k917J9423l099
21439d9316K5402K4477J2962l88m3186j9137K3164J6781j2141J8731M583J5681
21427A7613m660l479J5085J36m576J885n3765l5346P199P517P815J0902L632j1135
$$ plain form
21515 6780 20552 23414 1930 6718 9933 8144 -4487 -16004 -8073 -7184 -38107 -64095 -34653
21502 -34653 20802 10878 -17302 31665 44007 15853 1796 -4727 5493 2066 -14723 -42660
21490 -42660 -24825 9638 -36690 -46505 -48540 -35764 -32267 -7357 18726 -1752 1167 4385 7526
21477 7526 16718 -13052 -1561 20165 6298 16904 4339 -18819 10448 21481 -3130 -54764
21465 -54764 -55563 -62960 -37628 -9427 21505 37060 39488 12621 -36879 -92659 -83715 -38124 4119
21452 4119 15931 -6277 15937 21753 -19482 -25094 -21507 -48672 -63016 -62723 -65640 -46217 -49316
21439 -49316 -23914 563 13525 13137 -30049 -49186 -26022 -9241 -21382 -2651 1932 17613
21427 17613 12953 9474 24559 24695 20119 22004 -31761 -67107 -59908 -52391 -44576 -33674 -30042 -41177
21413d1177n456k8096r79L7071L3102J7679M445j9439r576L875j7090J8232N932
21400a477k5583r121j0146q205j1634M3939L8032M531J326l749n039j1444j4992
21387a3562p804m7716R963K9412J6228j7055L229k4803q116J499K5198L6211l2578
21374b9894j3689J3807L2761J4694J346K994k1101K9735n201l4794l6901m800
21362e1043L9814N1367J4590m183j3104o3884k5830K791j8091M8278J0411J80
21350h704o060J9780n990j6544k5043K3828L1212J3892m1427k2342k5675j5460
21338g8533L5953J7242M684R209K4728j3743p1230p668L0300q091L5923K4078
21326B852J320o632o028J047j4557j5155R174j714L1312L0128J8443k3835k8281
$$ plain form
21413 -41177 -46633 -74729 -75708 -38637 -5535 12144 16589 -2850 -12426 -8551 -25641 -7409 -1477
21400 -1477 -27060 -36181 -46327 -54532 -66166 -22227 15805 20336 21662 17913 12874 1430 -13562
21387 -13562 -21366 -69082 -59119 -29707 -13479 -30534 -27305 -52108 -60224 -58725 -33527 2684 -29894
21374 -29894 -43583 -29776 2985 17679 19025 22019 918 30653 25452 -9342 -46243 -51043
21362 -51043 -11229 40138 54728 50545 37441 -26443 -52273 -49482 -67573 -19295 -8884 -8704
21350 -8704 -14764 5016 -974 -17518 -42561 -18733 12479 26371 -15056 -37398 -63073 -78533
21338 -78533 -42580 -25338 -20654 -11445 13283 -460 -71690 -79358 -49058 -57149 -21226 2852
21326 2852 4172 -2460 -8488 -7441 -21998 -37153 -27979 -29693 1619 31747 50190 26355 -1926
21313a926N010j5877o173K5262K7403J4882Q390k4505k8049J0793n004M476M69
21300A5151M687j2442p695k1884m1526N8980M8861J3130o027J404j2630k249P172
21287D4932n9745l8115K1453N715l691J9205n29J0565J2335L0199N861l3668j8550
21274d033J4944J573K2970k134k4744j2740K3260L0831j2355j9707N495L2389
21262E5749l9225j5535J3986K037J5491l2399j6066j6698o273L2574l5745j8448
21250f0552L4081K7702j2993p860J7135L2290J5145j4895l3129l5892L234N8436
21238B2702K8522j702r127J0157J3105j3741j2557j1263k1854k7174L5679K1975
21226C4722l5131l8617J3274K623J0150p739k9781j260K6541j4444j2136L1931
$$ plain form
21313 -1926 3084 -12793 -18966 6296 33699 48581 56971 32466 4417 15210 10206 14682 15151
21300 15151 19838 7396 -299 -22183 -63709 -4729 44132 57262 51235 52639 40009 37760 44932
21287 44932 -14813 -52928 -31475 -25760 -29451 -10246 -10775 -210 12125 42324 48185 14517 -4033
21274 -4033 10911 12484 35454 33320 8576 -4164 19096 49927 37572 17865 23360 55749
21262 55749 16524 989 14975 17012 32503 104 -15962 -32660 -38933 -6359 -42104 -60552
21250 -60552 -26471 1231 -11762 -19622 -2487 29803 44948 30053 -3076 -38968 -35734 22702
21238 22702 51224 49522 40395 50552 63657 49916 37359 26096 4242 -22932 12747 34722
21226 34722 -409 -39026 -25752 -23129 -12979 -20718 -50499 -51759 -25218 -39662 -51798 -19867
21214a9867O192J3982K313j1028N199k1976k0383K2892K1853k8298l1073M402
21202e5792l930K8435M2728j3604J1527j633l2551j3302L2793m251n376K021J9444
21189F509j9576j4870K8549J5615l325k4193J2125O3933m8094m7565j766l5531
21177f8189K1333L5878l2653M224J4573J8410j212o424K1705N860m2292K2953
21165e834L0641j386P566J8408j4343j1773r058j7372K6534Q49k55L7856R664
21152G1497k1932j5845L1465n98K770j4859K977p35j1640L5990r089l1805j6654
21139B1542k9320K8755L348j4603J0311O33j4055j1033J2403j717M553j4835M156
21126A38O149m823o92k004P314k5185K597P950L0760o225m236l0772k0847j7165
$$ plain form
21214 -19867 -13675 307 2620 -8408 -3209 -25185 -45568 -22676 -823 -29121 -60194 -55792
21202 -55792 -59722 -31287 11441 -2163 9364 7731 -24820 -38122 -5329 -9580 -14956 -12935 6509
21189 6509 -13067 -27937 612 16227 12902 -11291 834 64767 16673 -30892 -32658 -68189
21177 -68189 -46856 -10978 -43631 -39407 -24834 -6424 -7636 -14060 7645 13505 -28787 -5834
21165 -5834 24807 23421 30987 49395 35052 23279 14221 -3151 23383 24232 23977 61833 71497
21152 71497 49565 33720 65185 64587 67357 52498 55475 54740 43100 79090 70001 38196 21542
21139 21542 -7778 20977 24325 9722 20033 20666 6611 -4422 7981 6264 10817 -4018 138
21126 138 6287 1464 772 -1232 6082 -19103 -16506 -8556 22204 15979 11743 -19029 -39876 -57041
21112e7041M2246L20k759K7188M5560l120m236n2915j6858J3095q694o026J7662
21099e578P186n384n2k7001o285J5933K5877J8650Q025R471o105K45m206j041
21085B9735l1970M507O887Q955K4942O461K3793K80o719q744l5487p357J0907
21072B6190J0026j327l7304p3924l2471O225N790J2532L132L928O993O370K6910
21059c6930n101j8077k0279K2369J3283K4622J5433J95J059Q326L2670K5230j772
21046F1028m4634j0798J0622Q567J4863k8760m4106j8686L525j3094M262L4624
21034b2587K9199l164j1415N802k999j4982m674j5809l2940J4809M0466N8835
21022D0541j3721l8553J1826N375k3201j1344J282j0581j6531J2210J3549K0473
$$ plain form
21112 -57041 -14795 -14475 -17234 9954 55514 52394 48158 -4757 -21615 -8520 -17214 -23240 -5578
21099 -5578 1608 -3776 -3828 -30829 -37114 -21181 4696 23346 31371 40842 34737 34982 30776 29735
21085 29735 -2235 2272 9159 18114 43056 49517 73310 73590 66871 58127 22640 15283 26190
21072 26190 36216 34889 -2415 -76339 -108810 -102585 -96795 -84263 -81131 -77203 -70210 -63840 -36930
21059 -36930 -42031 -60108 -80387 -58018 -44735 -20113 -4680 -4485 -3426 4900 37570 62800 61028
21046 61028 16394 5596 16218 24785 39648 10888 -33218 -51904 -48379 -61473 -57211 -22587
21034 -22587 6612 3448 -7967 -2165 -5164 -20146 -24820 -40629 -73569 -58760 -18294 40541
21022 40541 26820 -11733 93 5468 -17733 -29077 -27795 -38376 -54907 -42697 -29148 -8675
21010h675j0893N124K2540M3470l0445l7513j6334K8874j048M597n188m4006k131
20997e1628L1418J1713Q112k8440p718P528k701p910K123j340J5303L6191Q651
20984B1302j2446N654K6426j9849r766P713k758l0573j4853m875J0524k8196K934
20971d8763K8174J6837K7687L6547K7741j4584k5526j1995j5933J1314j330k2115
20959H054J550J2129j4873k0722k4447j8981q563K1837K8836L5719K950L0839
20947E4328l0319k0336l3130l677N092j8972J4692K5430Q363J3340L1312J8846
20935F4969N251n596Q773j4526k1915J5948K2344l8906j0530l0161l2982q31n089
20922d3251r067N6950J3188K2424l1661m856n416N691L352k2771k9549j2382J8900
$$ plain form
21010 -8675 -19568 -14444 8096 51566 21121 -16392 -32726 -3852 -4900 -303 -5491 -49497 -51628
20997 -51628 -20210 -8497 -385 -28825 -36543 -29015 -31716 -39626 -37503 -38843 -23540 12651 21302
20984 21302 8856 14510 40936 21087 11321 19034 16276 -14297 -29150 -34025 -23501 -51697 -48763
20971 -48763 -20589 -3752 23935 60482 88223 73639 48113 36118 20185 31499 30169 8054
20959 8054 9604 21733 6860 -13862 -38309 -57290 -65853 -44016 -15180 20539 23489 54328
20947 54328 24009 3673 -29457 -33134 -28042 -47014 -32322 -6892 1471 14811 46123 64969
20935 64969 70220 64624 73397 58871 36956 52904 75248 36342 25812 -4349 -37331 -38162 -43251
20922 -43251 -52318 4632 17820 40244 8583 3727 -1689 4002 7354 -15417 -44966 -57348 -38448
20909c8448j6526l1598j2647K0288O8626L3518P632k1140K1679K9608l512l298
20897E4182R515j5416j365m68L1875j4065n4611j0010j6448n300J8950J6332j677
20884A1494K5092L723K0547K9128p385l4270j9232O53j0618J5994q872p752K2868
20871D1370J0236j074j3813j9515l2152N119q689m3183J3423N913P595K2118j2830
20858b5482q269J5825L9722k4585K1959K4985P583l9247R711N7469R329l2319
20846E6681k9270K84J286J5405k0056o4614j9301n629j630j2312J6636L5088K3106
20833d326K9509L0432k5030l5585J548M3747l79J7774j4860m8889R450J6853k4320
20820d076k655K1807L2682r146k5435m0784J295j244P414L0138K4534K766p169
$$ plain form
20909 -38448 -54974 -86572 -99219 -78931 -10305 23213 30845 9705 31384 60992 57480 54182
20897 54182 63697 48281 46916 46448 78323 64258 9647 -363 -16811 -22111 -3161 13171 11494
20884 11494 36586 40309 60856 89984 82599 48329 29097 29750 19132 35126 26254 18502 41370
20871 41370 51606 50532 36719 17204 -14948 -9829 -18518 -61701 -48278 -42365 -34770 -12652 -25482
20858 -25482 -33751 -17926 21796 -2789 19170 44155 51738 12491 22202 79671 89000 56681
20846 56681 27411 27695 28981 44386 24330 -40284 -59585 -65214 -66844 -79156 -62520 -27432 -4326
20833 -4326 25183 55615 30585 -5000 -3452 40295 39916 57690 42830 -6059 3391 20244 -4076
20820 -4076 -6731 15076 47758 38612 13177 -27607 -26312 -27556 -20142 9996 34530 37296 30127
20807C0127j8459n5510k4676K4755r106L7540M4930M4799l1046j7653K0761J1178
20795E7640k2030l2753k0885j114J7367K6742K7942L0782l861j1473q941K043
20783F1459m9476n7462m155J9746J9432O724R998j7791j3098k3477M0600l8099
20771d5599k1175R018J1171J3181N7679L3904l950L749J9371q845m7356k1246
20759i8k885p040l9065J4038L6686J2961j4359q697k0800M043L7809p509l4506
20746b9422q687j947K5533K369k3925j9859L6367L7055j8705n2928J5631P4556
20734C6038j4401J7355N651n5381l239J2525o802o528L9839R538K3635J8201l5728
20721D0703j3448n247k7544J985J0003R312j0524K6215K3416n0882m9997L8102
$$ plain form
20807 30127 11668 -43842 -68518 -43763 -52869 -15329 29601 74400 43354 25701 46462 57640
20795 57640 35610 2857 -18028 -19142 -1775 24967 52909 83691 79830 68357 59416 61459
20783 61459 11983 -45479 -49634 -29888 -10456 -3732 6266 -11525 -24623 -48100 -7500 -45599
20771 -45599 -66774 -57756 -46585 -33404 24275 58179 54229 57978 77349 68504 21148 -98
20759 -98 -2983 -10023 -49088 -35050 1636 14597 238 -8459 -29259 -25216 12593 5084 -29422
20746 -29422 -38109 -40056 -14523 -12154 -36079 -55938 -19571 17484 -1221 -54149 -38518 36038
20734 36038 21637 38992 44643 -10738 -13977 -1452 -8254 -14782 25057 34595 58230 76431 40703
20721 40703 27255 22008 -5536 -3551 6452 15764 5240 31455 54871 3989 -46008 -7906
20709g906L7478O123J077j9668n0729j2240K7677j1199P872M5339J9407j5556
20697B7675j1947L9573j2800l6725j9245J0417j0922j2324Q400N5L3389j6388
20685h42k2309K2296M401L524J2489K6325P032p125k3217K9376J2128N543r083
20672F0538N35n1725k246K0012k2056k0204J1048R883j6408j884J5137M6889K013
20659E1532P485J0571K777j9882o6942N20L294Q261J3842p599N8299K1544O838
20646I0540l1467j5759K5363J1280k8723m740r765J3725p586o514m700N392j7519
20633A9527k4051j2511L8367J4361R774r647m0128J3000j0878J5732K3899O893
20621D4338n654j2545Q814R723j902n329j745n660p915k4122J7284J2669J7717
$$ plain form
20709 -7906 29572 35695 36772 17104 -33625 -45865 -18188 -29387 -21515 23824 43231 27675
20697 27675 15728 55301 42501 5776 -13469 -3052 -13974 -26298 -17898 -17843 15546 -842
20685 -842 -23151 -855 3546 7070 19559 45884 52916 45791 22574 51950 64078 69621 60538
20672 60538 61073 9348 7102 27114 5058 -15146 -4098 5785 -10623 -12507 2630 49519 51532
20659 51532 59017 69588 72365 52483 -14459 -13939 -10645 -2384 11458 3859 62158 83702 90540
20646 90540 59073 43314 68677 79957 51234 46494 36729 50454 42868 36354 31654 37046 19527
20633 19527 -4524 -17035 21332 35693 45467 35820 -4308 8692 -2186 13546 37445 44338
20621 44338 38684 26139 34953 44676 42774 37445 35700 30040 22125 -1997 15287 27956 45673
20608D5673P756m6578j9218N7079Q040l0464l6744k3462J8457K3493J9266m3298
20596b0000m1972n162L4851M8488L556l0709J4092R998O537n5758J3803J4357
20584g919J9658N2177J82l5842k2416L8136k400o5338k1611J2062K9490J7510
20572A3689j1796m512L0681R328k3239n886m153J0502n846J0577Q532m8866l3780
20559e4769L0670M5613N584M596k1810l3183N985k191j1774Q830L8901J8737J8217
20546E3406J7671m6910m0280R774j7509j074L3431J5831l6414o4199j247P4709
20534b811L8111j5720K0114r236q903R308N090q493j4704L9632P523n554j9379
20521C4978j1083n773k3917k2400K6057R642l6175n1736J9444M5698J2744n551
$$ plain form
20608 45673 53429 6851 -12367 44712 52752 22288 -14456 -37918 -19461 4032 23298 -20000
20596 -20000 -61972 -67134 -32283 16205 19761 -10948 3144 13142 19679 -36079 -22276 -7919
20584 -7919 11739 63916 64098 28256 5840 43976 41576 -23762 -45373 -33311 -3821 13689
20572 13689 1893 -2619 28062 37390 14151 8265 4112 14614 8768 19345 27877 -20989 -54769
20559 -54769 -24099 21514 27098 31694 9884 -23299 -17314 -19505 -31279 -22449 16452 35189 53406
20546 53406 71077 24167 -16113 -6339 -23848 -24922 8509 24340 -12074 -76273 -77520 -2811
20534 -2811 35300 19580 39694 30458 21555 30863 35953 27460 12756 52388 59911 54357 34978
20521 34978 23895 18122 -5795 -28195 -2138 7504 -28671 -80407 -60963 -15265 -2521 -8072
20509h072J1354K5070O885j6593M021M728K3907J1160O346p721P877J7231m00
20496H5793j6859j6992j3420k6637k1149J4296R109l3853N9671K9997N246J9398
20484I4600l1860k5117Q503K9956K5021l3607q900l50O096n4466j8795J6672q265
20471e12K1180J333j4537J4258J3455j5082J8545K6901K3565l0357m4879k3950
20459a0080n655N1113m767j3249J7028J9280J4026L1781k4363m243j5185o5159
20447i473l0756Q548J7813m525j1949l1551J2699M6874M2909j7581k9583r300
20435a5875M122P342J3085L2440J2084K9232n5651j1833k9788m1632M754R229
20423d2491M3905J3351L1649j4088j3704k6205m8472R721n727l0843K0353L8031
$$ plain form
20509 -8072 3282 28352 35237 18644 22665 27393 51300 62460 68806 61085 68962 86193 85793
20496 85793 68934 51942 38522 11885 -9264 5032 14141 -19712 39959 69956 75202 94600
20484 94600 62740 37623 46126 76082 101103 67496 58596 58246 64342 9876 -8919 7753 -512
20471 -512 20668 22001 7464 21722 35177 20095 38640 65541 89106 58749 13870 -10080
20459 -10080 -15735 35378 30611 17362 34390 53670 67696 99477 75114 70871 55686 -9473
20447 -9473 -40229 -31681 -13868 -18393 -30342 -61893 -49194 -2320 40589 23008 -6575 -15875
20435 -15875 -11753 -4411 8674 41114 53198 82430 26779 14946 -14842 -56474 -51720 -42491
20423 -42491 1414 14765 46414 32326 18622 -7583 -56055 -46334 -52061 -82904 -62551 -24520
20411b4520L1189k1196j2697j4343K709J6249N6953j32j4847m4374q324J4672
20399a8661j7696K7497J2026N109L4973Q516j4648J661n8n8585k101Q832m76p96
20385a4407r332o536l273n98L8512M3004K1831j5166k5099J4875k8704L343L4388
20372E2838j5193R451n354n278j1024M9864J4982k0112j2505L270J0701j0759
20360F0881l1514n7451p526R283L1284K5039R811K9772l5237j3820j442j093J6747
20347C4734K5785l7011k4493K008J9879m026K9294J099l8132k1537N126J2698
20335E424j7474k6419L504l528l0464Q605M3461K1645O2288L0542l4466m1170
20323B1948j4174k3550L0081k3515r210R4977M1687n4856m4980L1917L9850o3497
$$ plain form
20411 -24520 6669 -14527 -27224 -41567 -38858 -22609 34344 34212 19365 -25009 -33333 -18661
20399 -18661 -36357 -8860 3166 8275 43248 51764 37116 38777 38719 -19866 -21967 -13135 -13611 -14407
20385 -14407 -23739 -30275 -33548 -34146 4366 47370 69201 54035 28936 43811 15107 18450 52838
20372 52838 37645 47096 41742 36464 25440 75304 90286 70174 57669 60939 71640 60881
20360 60881 29367 -28084 -35610 -26327 4957 29996 39807 69579 34342 20522 19080 17987 34734
20347 34734 60519 23508 -985 1023 20902 16876 46170 47269 9137 -12400 -7274 5424
20335 5424 -12050 -38469 -34965 -38493 -68957 -60352 -16891 4754 67042 97584 63118 21948
20323 21948 7774 -15776 14305 -9210 -18420 76557 118244 63388 18408 50325 90175 26678
20311B6678j7808K9794K9244j5363j9702K4049N8334q351j9397j5784k2794k803
20299D6097m4720j0852L5035N788L3345j2233Q75P781l1509N566j9822p991k2755
20286a5395m656N4150M7225o427n0352k0441L2366L1143m6187k9101Q410Q950
20274I685J2084K622L9218m2217j0189K5011P105K2406o979o3607k0098L1131
20262F172L8373r08l8744j8411J7937j2724Q6j5873N619J3299k4888M9647K3891
20249D3476l7575k5047k3882L2036L7138N3356K619l4817j4389M369N96l519J5095
20236D9456k916k6038J125m0064o998L3388J4852k4364j3423J5971K2948k101
20224B1836J8851M4459K5221l7166j258l3951m8411k909L4515J3194M928o476
$$ plain form
20311 26678 8870 38664 67908 52545 32843 56892 115226 106875 87478 71694 48900 46097
20299 46097 1377 -9475 25560 31348 64693 52460 53335 61116 29607 35173 15351 7360 -15395
20286 -15395 -20051 34099 81324 74897 24545 4104 36470 67613 21426 -7675 735 9685
20274 9685 21769 24391 63609 21392 11203 36214 43319 65725 58746 -4861 -24959 6172
20262 6172 44545 43637 4893 -13518 4419 -8305 -8219 -24092 -18473 -5174 -30062 19585 43476
20249 43476 5901 -19146 -43028 -10992 26146 79502 82121 47304 32915 37284 37880 34361 49456
20236 49456 46540 20502 21627 -18437 -25435 7953 22805 -1559 -14982 989 23937 21836
20224 21836 40687 85146 110367 73201 71943 37992 -10419 -13328 21187 34381 39309 32833
20212C2833j125M971P965K0474n594k4858m3111o918K3079J2863j643O956l0929
20199e037O442N4258N285j5979L7007p276J58J4479J3004l2773j8849j7960R08
20186C3667j8144K0428Q299K6743L1112L2335J2199j9472j4131P194o543N069
20174A18756l4711k3752j1903J8573K8313r946m324N603K6184K3935k7861m5189
20162F3678k901M981j5386m3900J0583j1079J482K0554o612k1516J4690K1262
20150C5836j6o382j2489j8734j2670k3943L0620J4990L1715K2818l2688l8620
20138i563K1155L6542L2563k5887o2137J6939K7409P031M613l8122K953l366J03
20125A0233k1436J2791L6321j746j9215J7144J4557k3948m6075k5584K0142K8561
$$ plain form
20212 32833 31708 36679 44644 65118 59524 34666 -8445 -15363 7716 20579 18936 25892 -5037
20199 -5037 1405 55663 60948 44969 81976 74700 74858 89337 102341 69568 50719 32759 33667
20186 33667 15523 35951 44250 70993 102105 134440 146639 127167 113036 120230 113687 118756
20174 118756 84045 60293 48390 66963 95276 85330 81006 86609 112793 136728 108867 63678
20162 63678 60777 65758 50372 6472 17055 5976 7458 28012 21400 -116 14574 35836
20150 35836 35820 29438 16949 -1785 -14455 -38398 -7778 7212 38927 61745 29057 -9563
20138 -9563 11592 48134 80697 54810 -7327 9612 37021 44052 48665 10543 13496 10130 10233
20125 10233 -11203 1588 37909 36163 16948 34092 48649 24701 -21374 -46958 -26816 1745
20113A745N2924M4336j9336j2752K262J3174k2932m4568m9953J0299O297J4952
20101c552M0035j1199O587k4336Q936J3392q440k8363k885K7916n553o709R251
20088A5080J1068K2322K5505j8636m8948J248L6258N9262R749P812P497o8864
20076E9353l6639K7191J1951K525k0542J1171j1934m7658o876m4946j349L4462
20064b3291L6169L0075l9951m84M2109r09n0277k248M9077J4729J5394J4588k6547
20051E8434o0781o113M516J8231L2864M817k3321O463M3206j0738n836k2976k6321
20038A2445L757k566j0763j3591R062M7633K6969K7977p452l1523P917l8540k5647
20025E678j9903J9096N1234J0303q222j7589j7052j2914N342L6410L3476k295
$$ plain form
20113 1745 54669 99005 79669 66917 69179 82353 59421 14853 -35100 -24801 -18504 -3552
20101 -3552 36483 25284 31871 7535 16471 29863 21423 -6940 -9825 18091 12538 5829 15080
20088 15080 26148 48470 73975 55339 6391 7639 43897 103159 112908 120720 128217 59353
20076 59353 22714 49905 61856 64381 43839 55010 43076 -4582 -11458 -56404 -57753 -23291
20064 -23291 12878 42953 3002 2518 44627 43718 -6559 -8807 40270 54999 70393 84981 58434
20051 58434 -2347 -8460 -3944 14287 47151 51968 28647 35110 78316 67578 61742 38766 12445
20038 12445 16202 13636 2873 -10718 -1656 45977 72946 100923 93471 61948 69865 31325 5678
20025 5678 -14225 4871 56105 66408 58186 40597 23545 10631 15973 52383 85859 83564
20013H3564K119m5262m029O778J967j2126j931J9868J9259P853j0962k0259k4403
20000B2436J2247L5807J8158n0184p6466J2956P1468J4780m037k1867k4497l95
19988A0406j2020r103j980j8746o355k0819K8916J5411K6082M1436r878m761Q325
19975D6914K5162M047J78o9730j7533J0545K4263p848m6562m4535O644K4765K2897
19962b0793M322J2956J2756Q276R223j1210J3686l178N993K2452k012k5048m4591
19949a7168j043N0691O387Q868j4897r105P336k1918q11J520J0909K8718L988
19936E3475l7228o080J5376j7023L916K1911L4984J8296J1758l0635n9188j6758
19924g196N381m288O621J3996q087L828L4931K6002k4030K434k6437j1368J1804
$$ plain form
20013 83564 85683 40421 36392 43170 45137 33011 31080 50948 70207 78060 67098 46839 22436
20000 22436 34683 70490 88648 38464 -38002 -25046 46422 61202 57165 35298 10801 10406
19988 10406 -1614 -10717 -12697 -31443 -37798 -58617 -29701 -14290 11792 53228 43350 38589 46914
19975 46914 72076 76123 76301 6571 -10962 -417 23846 15998 -30564 -75099 -68455 -43690 -20793
19962 -20793 -16471 -3515 9241 17517 26740 15530 29216 26038 32031 54483 52471 27423 -17168
19949 -17168 -18211 32480 38867 47735 32838 23733 31069 9151 8340 9860 20769 49487 53475
19936 53475 16247 10167 25543 8520 12436 34347 69331 87627 99385 68750 9562 -7196
19924 -7196 -1815 -6103 518 14514 6427 10255 45186 71188 47158 49592 23155 11787 23591
19911B3591k8635K5329L2231K3203K8949j4650R549j1038l5645P928j4661j7594
19899B8557j6086j1787K7324J3317L293k7024l904M9192K1422k5597j5026j8346
19887B5335n912J6520K9117o354O486K5428M859l0419J2581k917j4969j5593j4747
19874B9415j431J8981j1919J6575J23J5087J1577J7265l340k4338j3097J0926
19862F5824r72J6567j0196j1522J8282K9537j2893l8039j5603k8777k5712J9728
19850F224L6354L1773r722K0447L1383l4966M406n653m235L1442N629j791j2845
19837I8446o031l3758N252J2302l8027j0775J2556J0084L3616M0151j023O139
19825A28932l950K2819j7446n6633k5764o594J4134L8880K390m6490J7140j5341
$$ plain form
19911 23591 -5044 20285 52516 75719 104668 90018 99567 88529 52884 60812 46151 28557
19899 28557 12471 684 28008 41325 44618 17594 13690 62882 84304 58707 43681 25335
19887 25335 19423 35943 65060 58706 65192 90620 95479 65060 77641 74724 59755 44162 29415
19874 29415 27984 46965 35046 51621 51744 66831 78408 95673 92333 67995 54898 65824
19862 65824 64852 81419 71223 59701 77983 107520 94627 56588 40985 12208 -13504 6224
19850 6224 42578 74351 64629 85076 116459 81493 85899 80246 76011 107453 113082 111291 98446
19837 98446 92415 58657 63909 76211 38184 27409 39965 50049 83665 123816 122793 128932
19825 128932 124982 147801 130355 73722 47958 41364 55498 94378 96768 50278 67418 52077
19813E2077J9431L623k6172m5065j4032J8077J0709J6185K4528k7199k0511l415
19801H236j980K1605k0550n729R380k3218n483L1728M9642O186k4383P051j4616
19788C7869j5226L0117Q879J4030J3721m7686m5145J2108N8585m752o0209n799
19776c508j2956M4623N8582K5657k3583m0787j7554m997m129J4082m927J3690
19764D4193j1776J1142m6222K582N2300J2121L6926J8517l229l2984p906l282
19752G2382j872L5337n745p504r255k596k9860M508J1778L0896J6138N319l123
19739A16403k8081K950N298L2694j2492l8137p300j3537J8513m3358l979J1847
19727D0821J6784K387k4886o63M5777p89k4082k9875k2937R127K3490O087k0488
$$ plain form
19813 52077 71508 75131 48959 3894 -10138 7939 18648 34833 59361 32162 11651 8236
19801 8236 6256 27861 7311 1582 10962 -12256 -17739 13989 63631 69817 45434 52485 37869
19788 37869 22643 52760 61639 75669 89390 41704 -3441 8667 67252 62500 2291 -3508
19776 -3508 -16464 28159 86741 112398 88815 48028 30474 25477 21348 35430 30503 44193
19764 44193 32417 43559 -2663 -81 52219 64340 101266 119783 116554 83570 75664 72382
19752 72382 70510 105847 100102 92598 83343 80747 50887 55395 67173 98069 114207 119526 116403
19739 116403 88322 91272 96570 129264 116772 78635 71335 57798 76311 32953 28974 40821
19727 40821 57605 59992 35106 34443 80220 79431 55349 25474 2537 11664 35154 41241 20753
19714B0753k017j0624P345K9716K3877j9602J7159K6751J4621m2441j2584K1057
19702G4011r337k1047r654K5936j0777J2020J535p581Q517o667J8851K2563J7349
19689A15719j3879m8967o7074k5107L6896P1083J5332j8683J8282J561L963k0161
19677F8965M472J1139R974k329j1312n3425o1147N3673M6441O488J3023j2704
19665G3258l332k0017K374M3191k4892m2492m0186N33M1905K0811m239m326K999
19652D5587k684N816N815J3278K4327J7963l3395L0018l573J2263J9203k3588
19640A11030n1831K6544r761j1660k3989J2115k042J1878o761L1806J4091L546
19628A04966j1603j7328r179j7355k3235J6422Q654K7397j0982l5340J996L3366
$$ plain form
19714 20753 18736 8112 15457 45173 69050 49448 66607 93358 107979 65538 52954 74011
19702 74011 64674 43627 33973 59909 49132 61152 62687 55106 63623 56956 75807 98370 115719
19689 115719 101840 52873 -14201 -39308 -2412 68671 84003 65320 83602 85163 89126 68965
19677 68965 73437 84576 94550 92221 80909 27484 -33663 20010 66451 72939 85962 73258
19665 73258 69926 49909 52283 95474 70582 28090 -12096 -11563 30342 51153 46914 42588 45587
19652 45587 42903 48719 54534 67812 92139 110102 76707 106725 103152 115415 134618 111030
19640 111030 59199 85743 75982 64322 40333 52448 50406 62284 55523 87329 101420 104966
19628 104966 93363 76035 66856 49501 26266 42688 51342 78739 67757 32417 34413 67779
19616F7779J0273j9492k263L8543p98J3548k5610Q296J0919m2993k2387k9162
19604F653j3158M554L0228L0915L369j6402k5464n373l09K3665J823M5116O1719
19591A47336j676m2723n264O756l4362K0999O740q227K049l7764K3942L0566J1420
19578A19792J3398k5142l4100J3275K5457K6520k4308n4498J5054L0399J4436
19567A20283r917p1518l7073L9358k295j440j1280J0556k0407n18J7126J6504
19555D9379K4590J5468O119K8323J7061o0373m7808K9973j375j9834P24K1340
19543F3587j1046k650J5491j7374J6786J9028J7319J8252j2315J4067P211n2378
19531G5978j3210K827j470R947p459k4034J6825K0155P857j9410j3965J9468o673
$$ plain form
19616 67779 78052 58560 56297 94840 94042 107590 81980 90276 101195 58202 35815 6653
19604 6653 -6505 -1951 28277 59192 62561 46159 20695 15322 15013 38678 40501 85617 147336
19591 147336 145660 102937 97673 104429 70067 91066 97806 89579 91628 53864 77806 108372 119792
19578 119792 133190 108048 73948 87223 112680 139200 114892 60394 75448 105847 120283
19567 120283 110366 38848 1775 41133 38838 37398 26118 36674 16267 15749 32875 49379
19555 49379 73969 89437 95556 123879 140940 80567 32759 62732 61357 41523 42247 63587
19543 63587 52541 49891 65382 48008 64794 83822 101141 119393 107078 121145 128356 75978
19531 75978 62768 65595 64125 74072 66613 42579 59404 79559 87416 68006 54041 73509 66836
19518F6836J4067M8121k306j2164j8265j8279q61J8545l303k5676j5711j0151
19506D0853j183M731J5081Q817J9500L8808N499j3982k9965J361L805q549L4190
19493A18966j6190j2183l3987L5430j0600Q8L8890J769k7708l0334J9166k1740
19481F1567k6389m31k3312n878K8237m136J619K3302k0280J306N6472L4417j9740
19468A06754k6723k6922J0852L2024K2074K514j017m4405K2312j4236N598N7204
19456A46029J763k9646J9218K2797K5164k8140k6416o270j7915K9049R453K6389
19444A71475j1572k7989m8266k287J6135o217k3992K0225p640J5191K6216q539
19432A12740l7393k2267N148L493R692K7421j0100j7997K4487j6736N0500M8r158
$$ plain form
19518 66836 80903 129024 126718 114554 96289 78010 77149 95694 92391 66715 51004 40853
19506 40853 39670 44401 59482 68299 87799 126607 132106 118124 88159 89520 93325 84776 118966
19493 118966 102776 90593 56606 92036 81436 81524 120414 122183 94475 64141 83307 61567
19481 61567 35178 34747 11435 5557 33794 29658 31277 54579 34299 35605 92077 126494 106754
19468 106754 80031 53109 63961 95985 118059 120573 119556 75151 97463 83227 88825 146029
19456 146029 147792 118146 137364 160161 185325 157185 130769 124499 106584 135633 145086 171475
19444 171475 159903 131914 83648 81361 97496 91279 67287 87512 79872 95063 121279 112740
19432 112740 75347 53080 58228 61721 71413 98834 88734 70737 95224 78488 128988 129036 119878
19419A19878J3823k0176j1206k7055k602M9788J0367P951J8608P386k0174n7045
19407H9543r039j270K1980L3013J3854M026k227j3887m0787k1021K2540P328o326
19394I7727R321k4638j0119M3390P5573l598k5448R002l9451o918N535k4352k2137
19381H3887J5173R103J8868J0467q799k5978K0185K7737n112Q55K1738m352m2047
19368A21725k292N3297q321m2926j4587M4982l3002m8208J4103j1774j606k8443
19356D2948k13K5551L8951j3346j6583K200k1565J563K876M2913N9936K414j4507
19343A53138k1550j0116k8380r791M8007K9831J5917K0726j3426j7342K621n0066
19331A19569l5591l4548k009p739n999K3676J3977N7010L7321L788j0250J4194
$$ plain form
19419 119878 133701 113525 102319 75264 72662 122450 132817 140768 159376 166762 146588 89543
19407 89543 80504 79234 101214 134227 148081 152107 149880 135993 95206 74185 96725 104053 97727
19394 97727 107048 82410 72291 115681 191254 187656 162208 171210 131759 124841 130376 106024 83887
19381 83887 99060 108163 127031 137498 128699 102721 122906 150643 145531 146386 168124 163772 121725
19368 121725 119433 172730 164409 121483 106896 151878 118876 70668 84771 72997 71391 42948
19356 42948 42735 68286 107237 93891 77308 79508 57943 59506 62382 105295 165231 167645 153138
19343 153138 131588 121472 93092 83301 131308 161139 177056 197782 184356 167014 169635 119569
19331 119569 83978 49430 47421 39682 33683 57359 71336 128346 165667 169455 159205 173399
19319A73399k2848k1394m309n2003k5307K8359K2414O434j6740j1949P419J258
19307H4733R010K8746k6482M6187O1546j8723J2207N527m5055n4355K7820K9421
19295A60582L449J4281K4030n033p866L0196j9689j6634J8140J9631q751J8238
19283B30574J5383k8314m5539J0395N7367R4181Q1049J28995J80186Q8267K8680
19272H41224N3020m1447n2037L201k2865p2867k4731Q9005R7293O3946k9246r839
19260H94657l5824r5572j887J4200j14819j59125p3826n9854o5828k2006j2658
19249B67458q293O111K0338j1739j1537J3961Q113K9131M9046K5592J5245P0937
19237D74363J42968K82453L13081J18505q7759p6860j28525j48244o2892M3888
$$ plain form
19319 173399 150551 129157 124848 72845 47538 75897 98311 104745 88005 76056 83475 84733
19307 84733 93743 122489 96007 142194 203740 185017 197224 202751 157696 103341 131161 160582
19295 160582 164031 178312 202342 197309 189443 219639 199950 183316 201456 221087 212336 230574
19283 230574 245957 217643 172104 182499 239866 334047 415096 544091 724277 812544 841224
19272 841224 894244 852797 800760 803961 781096 708229 683498 772503 869796 933742 904496 894657
19260 894657 858833 763261 761374 775574 660755 501630 427804 367950 302122 280116 267458
19249 267458 259165 265276 285614 273875 262338 276299 284412 313543 362589 388181 403426 474363
19237 474363 617331 899784 1212865 1331370 1243611 1166751 1038226 889982 827090 870978
19227H70978J82378K24747K58365L40976K23399j01412j59070j97405l29233k00090
19217A113633J4439J54303J89805N5659j51954j26124j77769j05165k5354j06959
19207H34514j47184q4364K4614O3993R378j14327r4707m2158m9667l6025r500
19196C54567R941k2647n07k156N9945P5013K6589P0485K21848K98144K01989Q
19184A293219n5488q890l0791o7679o1636r4711n0020Q7411J98777K16345O6110
19173A492647j16530n1949m2141n4070p254o6316q5182j05723j67706j74963j14021
19162E06792l6011l7351N965J1168L9558P1082J05926L2826j24163j19311p2271
19151C84210m6082l0784k4648l0884J6310k239m024j135k5839j7906J7643M8867
$$ plain form
19227 870978 1053356 1278103 1536468 1877444 2100843 1999431 1840361 1642956 1313723 1113633
19217 1113633 1128072 1282375 1472180 1527839 1375885 1249761 1071992 966827 941473 834514
19207 834514 687330 602966 627580 691573 700951 586624 491917 449759 400092 364067 354567
19196 354567 364508 341861 341354 339198 399143 474156 500745 571230 793078 1091222 1293211 1293219
19184 1293219 1237731 1228841 1198050 1130371 1068735 974024 924004 1011415 1210192 1426537 1492647
19173 1492647 1376117 1324168 1282027 1227957 1220703 1154387 1069205 963482 795776 620813 506792
19162 506792 470781 433430 439395 450563 490121 561203 667129 699955 575792 456481 384210
19151 384210 338128 307344 282696 251812 268122 265883 261859 260724 234885 216979 234622 283489
19139B83489M672q11K9636K7973M6988R8953R7135O2931j02489j13942o9818m296
19127C60421o2J3420K8353M8893J06588R5112R722r4114j44657r3570j1576P435
19115C25965j5211k9524j0820p913l6831J0450M667m0394m6612J4071L0331L5745
19103B33924K7956k2696n2511j2056K5624R869P78j043M889m228k2375K5202K6630
19090B39963J3147o056P160p78j6406L43N766k4937k2639K130K9657L3803J7041
19077B78194K2167J7442J5364j7967k3034k7031r547K5949L919R860J0903k0841
19065B85378j83J8293l6073m8729J9686O4955N9244K5839P5387P3678K2143p5699
19053D83919j35596n1618n4844k1810k9140K7233J8353M9828L6860l1420o4753
$$ plain form
19139 283489 288161 287350 316986 344959 391947 490900 588035 650966 548477 434535 364717 360421
19127 360421 360359 373779 402132 451025 557613 652725 662447 568333 423676 330106 318530 325965
19115 325965 310754 281230 270410 262497 225666 236116 240783 200389 153777 167848 198179 233924
19103 233924 261880 239184 186673 174617 200241 210110 210888 209845 214734 210506 188131 213333 239963
19090 239963 253110 247054 254214 253436 237030 237373 243139 218202 195563 197693 227350 261153 278194
19077 278194 300361 317803 333167 315200 292166 265135 255588 281537 285456 295316 306219 285378
19065 285378 285195 303488 267415 218686 238372 303327 362571 388410 463797 537475 559618 483919
19053 483919 348323 296705 241861 220051 190911 218144 236497 286325 323185 291765 227012
19042B27012n770Q405j1084k7527P328K6626K3408O0194O980m6987q466M4641
19030C04760j553k3747n076L4209M2229j8188m3633L9442N3483M9281L6764O5811
19018E33782L8081j9650k7810k2184k7993P894o433r254L6628J28205J23423O7028
19006H21717l4689k8044j10123j30010o1402M110N9019N1568K1170J0811m1927
18995E62200q8152o8097l0337k1230l488L3176P5996j1189m6290m3557j2671L0249
18983C76610q791l3883P341K5154J5496J1702J5256l633N8049P3904L2470l5432
18971E34243m2257n5083K0286P4982L8414j856n6846m1265L6814N5887O3604j861
18959F25062m2892n2504n5594J4171j8717n5582N7868R7686P2968M3360K6069
$$ plain form
19042 227012 221242 229647 218563 191036 198364 224990 248398 308592 315572 268585 260119 304760
19030 304760 303207 279460 274384 308593 350822 332634 289001 328443 381926 431207 467971 533782
19018 533782 571863 552213 524403 502219 474226 482120 475687 466433 503061 631266 754689 821717
19006 821717 787028 758984 648861 518851 457449 461559 520578 572146 593316 604127 562200
18995 562200 474048 405951 375614 354384 350896 384072 460068 448879 402589 359032 346361 376610
18983 376610 367819 333936 341277 366431 381927 393629 408885 405252 463301 537205 569675 534243
18971 534243 491986 436903 457189 532171 570585 568729 511883 470618 507432 563319 626923 625062
18959 625062 582170 529666 474072 488243 469526 413944 471812 569498 642466 685826 711895
18948G11895j4266j14407j34959n3668j9139R484P747L2666r205r452k3442m8655
18936C34599q772L887N619J7715j8734J5495j4081j0401K9580M9097M2846J3939
18924D60789n8882q2639k0262K6236M7776J6147M4378M9870M3644M9402j2369
18913E64090m3191j5813J7252L59n7898o2962N137M3960L3480J2775L1642N7121
18901E85952J3744Q917m5330m7670p2032m6338j3728O1578J888M4943L3775n0557
18889D75142k5461j1253q448n0088n5454L4415P3320K1727R736o810n029J3364
18877D65161k996M044K7840Q8791K0555j7338L3053O862r641l2377n1674o86k6060
18864E05534j8989j1201j482J4393J0538L9181K411j8363J7301r818O939q467
$$ plain form
18948 711895 697629 583222 448263 394595 375456 384940 392687 425353 416148 406696 383254 334599
18936 334599 325827 329714 335333 353048 334314 349809 335728 325327 354907 404004 446850 460789
18924 460789 401907 319268 299006 325242 373018 389165 433543 483413 527057 576459 564090
18913 564090 520899 505086 522338 522697 464799 401837 406974 450934 484414 497189 528831 585952
18901 585952 599696 608613 563283 515613 443581 397243 383515 445093 446981 491924 525699 475142
18889 475142 449681 438428 429980 379892 324438 358853 432173 453900 463636 456826 451797 465161
18877 465161 462165 466209 494049 582840 603395 586057 619110 625972 616331 583954 532280 531594 505534
18864 505534 486545 475344 473862 488255 498793 537974 540385 522022 539323 529505 536444 527977
18852E27977j8733L3834K6703M8608j2754n8875m2326k3712J5089J09935K0214
18841F25960k2335m039k233O836K9699j538j3251K8175L3479k0749k7216J8468
18829F51256J2797O432N8708P4869N6061k0585k4043m1415l3140K7123N3399N2080
18817H73542J3391M0019L2252L3323r4636p5710J1130K1335K4701o3846k8437
18806G87064J4501L6643L0719P647R558L7387N6574R2412K6844n4101J7398N5368
18794A118014Q0809P4163N6953N1189N5116N9068o064Q6099J26995J56490K74602
18783B133434L44243L86226L83618M01506M18434K04507q4741l01243k46268j56607
18773C483109l4381J56530L44535M53541M36446N73113O27791K94148o6028j27378
$$ plain form
18852 527977 509244 543078 569781 618389 605635 546760 504434 480722 495811 605746 625960
18841 625960 603625 599586 597353 604189 633888 632350 619099 647274 680753 660004 632788 651256
18829 651256 664053 670485 729193 804062 860123 839538 815495 774080 740940 768063 821462 873542
18817 873542 886933 926952 959204 992527 897891 822181 833311 854646 879347 815501 787064
18806 787064 801565 838208 868927 876574 886132 923519 980093 1072505 1099349 1045248 1062646 1118014
18794 1118014 1198823 1272986 1329939 1381128 1436244 1495312 1489248 1575347 1702342 1858832 2133434
18783 2133434 2477677 2863903 3247521 3649027 4067461 4271968 4187227 3885984 3639716 3483109
18773 3483109 3448728 3605258 3949793 4403334 4839780 5412893 6040684 6334832 6268804 6141426
18763F141426l3965K14975N88761R71043J311113J865638K321571K200970J326862
18754A6908394J876211L706690O205535J0860434K0050900L7220808O3057378
18747A59886350Q6016096N7720152j8665548o5096604p6692237m8537953k3958856
18740G0671400j0334799j77348J0520852K0985494K3354002k968780l2607031
18733G9443790k6755243j4291595p687965m381236k449583j241225n86354k11731
18725B1838858K41719J139361K935325N393448O544377J388217m445761k652633
18717C2382911n75675R90815L506466P060452J2515318K3109970M0749364O1914864
18709A81654485O3364547K7858283r471103n9434430n9914163k8582388m191543
$$ plain form
18763 6141426 6107461 6322436 6911197 7882240 9193353 11058991 13380562 15581532 16908394
18754 16908394 18784605 22491295 28696830 39557264 59608164 96828972 159886350
18747 159886350 245902446 303622598 284957050 219860446 143168209 94630256 70671400
18740 70671400 60336601 60159253 70680105 91665599 115019601 112050821 79443790
18733 79443790 52688547 38396952 30708987 26327751 23878168 22636943 22050589 21838858
18725 21838858 22080577 23219938 26155263 31548711 38093088 39481305 35035544 32382911
18717 32382911 31807236 32798051 36304517 43364969 55880287 78990257 119739621 181654485
18709 181654485 245019032 272877315 263406212 203971782 144057619 115475231 111283688
18702A11283688J7661584M6128083Q3694119J15315970R2070305J7102761l3457154
18695D49799356r3354572j15355091p4529360l6072235j0579095J0927576L1474119
18688A62310698M0657930P628443m7631252n1657636l0960583j8477786j1249464
18681E0620350o549531m001975k094426O0844J991983K707994L040763K159422
18673D7935424l130535l746204M44166L980528O948570J2053652K2420761L8051305
18665A24957667N1348498M0351240J7188561j1733270l6048503p967216K9246679
18658B07343656M0711437J0612422m0584299m3001998r020441P338387M140203
18651A77539367J5340628J2916158j3834081m425608P736970k2805068m5951916
$$ plain form
18702 111283688 128945272 175073355 258767474 374083444 466153749 483256510 449799356
18695 449799356 356444784 241089693 166560333 130488098 119909003 130836579 162310698
18688 162310698 202968628 210597071 162965819 111308183 80347600 61869814 50620350
18681 50620350 44070819 40068844 37974418 38035262 40027245 42735239 45776002 47935424
18673 47935424 44804889 41058685 41502851 45483379 52431949 64485601 86906362 124957667
18665 124957667 176306165 216657405 233845966 222112696 186064193 178096977 207343656
18658 207343656 248055093 258667515 218083216 175081218 166060777 173399164 177539367
18651 177539367 192879995 205796153 191962072 187536464 195273434 172468366 126516450
18644A26516450l7090694j9473925n800639N120867J3377900J1365465j2303776
18637H1711648k5088597j6733157r115077n443030l635663k226043j093748l78123
18629A7998210l20148p13342o54324k53471r6902L97312J342053K485676M542533
18620B4727597Q392233J5637400K6321579L5029547K2256075k3565608l8737873
18613G0060950k3507411j1675138o124354l094832L3989M086468R596239J5567498
18605E4943409J6003917l295840k1899968j6768608q732314m798263l148129k266474
18597A0037730j582041j096792r31209q03032o17375m93591m64243l53944k71238
18588C424265k22760j95454j39395n3464L1277M8869J15437R3820j73675k30602
$$ plain form
18644 126516450 89425756 69951831 64151192 69272059 82649959 94015424 81711648
18637 81711648 56623051 39889894 30774817 25331787 21696124 19470081 18376333 17998210
18629 17998210 17678062 16964720 16310396 16056925 15960023 16357335 17699388 20185064 24727597
18620 24727597 33119830 48757230 75078809 110108356 132364431 108798823 70060950
18613 70060950 46553539 34878401 28754047 25659215 25693204 29779672 39375911 54943409
18605 54943409 70947326 67651486 45751518 28982910 20250596 15452333 12304204 10037730
18597 10037730 8455689 7358897 6427688 5624656 5007281 4513690 4049447 3695503 3424265
18588 3424265 3201505 3006051 2866656 2813192 2844469 2893338 3008775 3102595 2928920 2698318
18578B698318q4405j10971j86355j52684o7128N9898K63755L87034L61121j3048
18568C155535m24460m79728l13406j02119R3547K74438L61482O9039l49584m25187
18558A859557l05375j56770j55673j26357p4309p1713n4604l647J8159L5121J4190
18547I78579n6906q0361n3489j7234M8326j2752k2725k4569J326J2567L1866O9938
18535H74566k984l7380p533j5642p438o673m3990n8096j8252O433l039M535l6985
18522F47522q274m307j0369P900M980N0870R4706J19322O2379l9853r9595r3961
18510G31320n5414n369R834J5610L6226O2384L7192r3051j24301o7295J6954N3880
18498F17970l8934m8613K901J1751J4114L5366o642L7137J0052m024l0007K0777
$$ plain form
18578 2698318 2613913 2502942 2316587 2163903 2096775 2156673 2420428 2807462 3168583 3155535
18568 3155535 2731075 2251347 1937941 1835822 1929369 2203807 2565289 2634328 2284744 1859557
18558 1859557 1554182 1397412 1241739 1115382 1041073 969360 914756 911109 929268 964389 978579
18547 978579 921673 841312 787823 770589 818915 806163 783438 758869 760195 772762 804628 874566
18535 874566 871582 834202 826669 811027 803589 796916 752926 694830 676578 683011 679972 684507 647522
18522 647522 639248 634941 624572 632472 637452 688322 783028 902350 964729 924876 825281 731320
18510 731320 675906 670537 680371 695981 732207 794591 831783 738732 614431 547136 564090 617970
18498 617970 579036 530423 533324 545075 559189 594555 587913 625050 635102 631078 601071 621848
18486F21848N053n2251l4023p364L2988J13202N1110o563q5571r5057o4535m6585
18474D32252j3145K9768r718l8031j7097J2805k759m3814l5214j4371l302L0548
18462C27922M5084J2276n502M0996K4350m4707m6757K0956K0546J547M4137M6242
18450D87090k1752m7637n7110L5383P2319Q2097N1621Q496k5438J3652l127p9039
18438E16555j50770q7318M1572R2340R3521J04759J35652J01624m4912j69656
18428F33367j59665j11195j6522M2268K0358L7237Q7n245J473M1162M3688N5311
18416E82324j6981o7993q7277q1297M010L7284O1333M2774j2653j7437k702k4208
18404D17177j9455l0877k3899p5528j27053q7044K1726J52680O6690j9208l5093
$$ plain form
18486 621848 626901 574650 540627 533263 566251 679453 730563 724000 638429 543372 478837 432252
18474 432252 419107 448875 439157 401126 384029 396834 394075 350261 315047 300676 297374 327922
18462 327922 373006 385282 379780 420776 445126 400419 353662 374618 395164 396711 440848 487090
18450 487090 465338 417701 360591 395974 468293 550390 602011 610507 585069 598721 595594 516555
18438 516555 365785 278467 320039 412379 505900 610659 746311 847935 803023 633367
18428 633367 473702 362507 345985 388253 408611 445848 445935 440690 442163 483325 527013 582324
18416 582324 565343 497350 410073 328776 332786 370070 431403 474177 461524 444087 441385 417177
18404 417177 397722 366845 342946 267418 140365 53321 75047 227727 294417 275209 240116
18393B40116r660j21k3741q7419j10125n3486m0295O5279J67977J82370J60676
18382D91571Q5182o9812j39027j22646l0426O6450Q6286J09950Q1554o3353r5281
18371D00448l0620p487k4579m261J7891o83J6156M3190P7971R1915M6383P9705
18359G06029P3567j1018r5729j58649j14833n4149M4523O6303m4645j19718j07089
18348A84592m3460k1184L36l3184k7074q324L738j5309j3293j2443m8098K2459
18336a1244Q3201O2134N6747P7336M2264m2123j6093j7309J7838O6328M3892m3135
18324C19836L4438M049k5224k3281j8089j2947l171p232K1667K2626M6006K6530
18312C85208L9141j1609n1143l5945l6956K7835P5607K8405J11059J24510R0081
$$ plain form
18393 240116 230456 230335 206594 119175 9050 -44436 -84731 -19452 148525 330895 491571
18382 491571 576753 506941 367914 245268 214842 281292 367578 477528 559082 495729 400448
18371 400448 369828 362341 337762 333501 351392 350709 366865 410055 488026 579941 626324 706029
18359 706029 779596 768578 672849 514200 399367 345218 389741 456044 411399 291681 184592
18348 184592 141132 119948 120284 87100 60026 51702 55440 40131 26838 14395 -33703 -11244
18336 -11244 71957 134091 190838 268174 310438 268315 252222 234913 252751 319079 362971 319836
18324 319836 354274 358323 333099 309818 291729 278782 275611 268379 290046 312672 358678 385208
18312 385208 424349 412740 361597 325652 288696 316531 392138 420543 531602 656112 746193
18301G46193M0313m2678p0225k5705k0032l8371j7369m7608n5785p4540o0501
18290C33692p887J6354o302k8003l055N5981J5076J3533M0047J3811m052k0791
18278D18404J444l7297n3620r136K7499L3242o973m3422j2906o716L0475M3846
18266C84840J9279M9581r791n312j0547R466P6659L0278M8474J8408K0042O5404
18254F96781J6564K8557K3993K5633O694Q895j4244k4120K960o555j3357K3491
18242G75292M6249K8899m7529j7782R535m602M8323N2657J8934J8456J8502j5572
18230I31362k7817P8748J43990N6914n5303q1414p4860R465O3660K5492j9732
18219A050505r548K2779N1594N7321O9413J02400J39124J67361J99414K17122
$$ plain form
18301 746193 786506 743828 673603 647898 627866 589495 572126 524518 468733 394193 333692
18290 333692 325805 342159 335857 307854 304799 360780 375856 389389 429436 443247 439195 418404
18278 418404 419848 382551 328931 319795 347294 380536 373563 330141 317235 310519 340994 384840
18266 384840 404119 453700 443909 438597 428050 437516 514175 544453 592927 611335 631377 696781
18254 696781 713345 741902 765895 791528 798222 807117 792873 768753 771713 765158 751801 775292
18242 775292 821541 850440 802911 785129 794664 790062 838385 891042 909976 928432 946934 931362
18230 931362 903545 982293 1126283 1183197 1127894 1046480 971620 981085 1044745 1070237 1050505
18219 1050505 1040957 1063736 1115330 1172651 1242064 1344464 1483588 1650949 1850363 2067485
18209B067485L52025M00291K11060p2717l1191K61723N27599N21346K38393j99557
18199D276457l79998k48391L4910L62041N28293L63139O9214K6730J13265K53050
18189E398710M91561P32896J018560J423333K147086L194222M376540O267805
18181B5050713J0325487J8761779L2674204M8905907M6746712n79619m1978938
18174A39906245k9598258J746229L0195380N0188490L2034259l3671757o7337725
18167A23462863m6760435k4291881j3128933q036216n402353l478299k348933
18160B0015813j714504j200605j069344j187321j168912p28155J13375Q48795
18152A3909142Q11858j00953n97691j63839M29620M13856K35963l6597n1671l62185
$$ plain form
18209 2067485 2419510 2819801 3030861 2958144 2926953 3188676 3716275 4237621 4476014 4276457
18199 4276457 3896459 3648068 3682978 4045019 4573312 4936451 5005665 5032395 5145660 5398710
18189 5398710 5890271 6623167 7641727 9065060 11212146 14406368 18782908 25050713
18181 25050713 35376200 54137979 86812183 135718090 182464802 181885183 139906245
18174 139906245 110307987 112054216 142249596 192438086 224472345 190800588 123462863
18167 123462863 76702428 52410547 39281614 31245398 25843045 22364746 20015813
18160 20015813 18301309 17100704 16031360 14844039 13675127 12946972 13060347 13909142
18152 13909142 14721000 14620047 14022356 13858517 14288137 14701993 14937956 14901359 14849688 14487503
18142A4487503m93184J27564J053325J671109K283353L584009N511929Q572906
18134C6798514J4144175K4510168L9955248N2539490L4412860q196330p100697
18127A87063428J8514705J1988413m871361K2699056P0770421Q0841170j4342097
18120C72663735j14329562r8785696n2708501k6658539j4245857q328913l704089
18113E3902578J312534P724775J8464815L4640501N0595586L3491827J0763658
18106B10896274J8152747k6659509n5306600k9594961m091990P526827J0346350
18099A31269138O636111j4493009j7754918j3758359k1482107j8192259r666853
18092D2557744m079473j18631L601714P137696O103966m331681q696241l278929
$$ plain form
18142 14487503 13994319 14121883 15175208 16846317 19129670 22713679 28225608 36798514
18134 36798514 50942689 75452857 115408105 167947595 202360455 194164125 187063428
18127 187063428 205578133 217566546 212695185 235394241 306164662 387005832 372663735
18120 372663735 258334173 159548477 106839976 80181437 65935580 57606667 53902578
18113 53902578 55215112 62939887 81404702 116045203 166640789 200132616 210896274
18106 210896274 229049021 202389512 147082912 117487951 113395961 120922788 131269138
18099 131269138 137905249 123412240 105657322 91898963 70416856 52224597 42557744
18092 42557744 38478271 38359640 41961354 49099050 55203016 50871335 42175094 38896165
18084C8896165L367503J1153512K1764553L3904053L2531481j908290l1556771
18077A08152206k2276921P85894K1559549L6237204K3219950k4226050m8978914
18070I4472918l3656960j7006095q833198m849128k845497j672488n41293N89548
18062B5657807J945603M398090P857873J0610720P662995r75024m54953P230303
18054F3933414J4483784J8318990K3085031M5344274P6795714P6905044o920923
18047C11945328q0029856n4416467n476358K9293694L5974887k431401n0362911
18040A84496916m7775001l3796004k6995968j5015903n655865k973759p224373
18033D5060043q704312n911403l642027j507405J286015M466897O261557J207257
$$ plain form
18084 38896165 42263668 53417180 75181733 109085786 141617267 139708977 108152206
18077 108152206 85875285 86661179 108220728 144457932 167677882 143451832 94472918
18070 94472918 60815958 43809863 34976665 30127537 27282040 25609552 25068259 25657807
18062 25657807 27603410 32001500 39859373 50470093 58133088 57158064 56703111 63933414
18054 63933414 78417198 96736188 119821219 165165493 241961207 318866251 311945328
18047 311945328 231915472 177499005 172022647 201316341 237291228 234859827 184496916
18040 184496916 136721915 102925911 75929943 60914040 55258175 52284416 45060043
18033 45060043 36355731 30444328 26802301 25294896 26580911 31047808 37309365 38516622
18025C8516622p755845q275424n394320l243357j981361j177470o02193k71793
18017I814859l26218k41546j72935k76322j07073L54504R68016J578390K230713
18008A3822388L347125M814703M258594p2725j294254K041201M703984K974735
18000C4595751l056616l983401l94222L907985J0349656K1072834L4842112M1340154
17992A38674253J0036150l8424648l5461477j3215008L432822J7463533K6456257
17985A08961882J3227896j6740091l2386452k6937058j5111802q140883m797246
17978A8076246l039488j906103j533205j586015j522367j165761q51171n45485
17970E926651j73833n6958k69364n82628p12499n65798l59070k09658j48261o2552
$$ plain form
18025 38516622 30760777 22485353 17091033 13847676 11866315 10688845 10086652 9814859
18017 9814859 9488641 9247095 9074160 8797838 8690765 9045269 10013285 11591675 13822388
18008 13822388 17169513 21984216 26242810 26170085 24875831 26917032 31621016 34595751
18000 34595751 31539135 27555734 27161512 31069497 41419153 62491987 97334099 138674253
17992 138674253 148710403 110285755 74824278 61609270 65042092 82505625 108961882
17985 108961882 122189778 105449687 73063235 46126177 31014375 22873492 18076246
17978 18076246 15036758 13130655 11597450 10011435 8489068 7323307 6472136 5926651
17970 5926651 5752818 5695860 5426496 4843868 4131369 3565571 3206501 2996843 2848582 2786030
17960B786030j68214k30584k23266k01369j52140j74997j27510j15064q7494j09034
17950A196358q1204l5538l9546n9438m0559O04o3020r3748k805O5455M880k3616
17938H27823p3998l9569N378R499k582p866l9563j07691n1482Q685j5977m7045
17926D65612p020Q106M0505L6919L7867J8040K9947l5814m3860o361n501K5684
17914E64124l6054n5442m2713l0567J4327j3686K310J0783k7375p4072k3129J015
17902B89521J6931J2281l5806l3202l2049j7844j7020k5931L2642M1997J0289
17891B41809J0262O955j2793q20m362L1341m999k356J7362k4730k3499j5307J0949
17878B29812L9186j222J0929k9802n7409m9647k0647l854J4699m0766p0573k4516
$$ plain form
17960 2786030 2617816 2387232 2163966 1962597 1810457 1635460 1507950 1392886 1305392 1196358
17950 1196358 1115154 1079616 1040070 980632 940073 940677 877657 783909 781104 846559 851439 827823
17938 827823 753825 714256 719634 729133 726551 718685 679122 571431 519949 528634 512657 465612
17926 465612 458592 466698 507203 544122 581989 600029 629976 594162 550302 543941 538440 564124
17914 564124 528070 472628 429915 399348 413675 399989 402299 413082 385707 311635 288506 289521
17902 289521 306452 318733 282927 249725 217676 199832 182812 156881 189523 231520 241809
17891 241809 252071 259026 246233 245413 241051 272392 267393 265037 282399 257669 234170 218863 229812
17878 229812 268998 267776 278705 248903 191494 141847 121200 117346 132045 91279 20706 -3810
17866c810M8988L0744k1570j6720o5207n1351O0413P8632N0604j067j9443N889
17854I6102K2841L4663J1070j6399o546j2659q912n4324j5658j7640K0288k437
17842E0389k8531Q836N730l008J7579L6773M0677J9769j7553l3273J4644M1093
17830A53125r858J0089j7938L2330k1472k5268p440l1304m1750l4476j296l8033
17818c3291m1952j3736O720m3690j38703j63642l0528R4927P9325R2323R6304
17807i5943J8225J0362J6616N7857O186j4455n9909j01862k4264p119j0839N8285
17795a46860J1483j2379K9657L2936j8975o4229J6810M9468q953M249L5314m7052
17783a18531l4854J8777J2960K1030M6844K1194L2153J0830J6078K5626j3437
$$ plain form
17866 -3810 45178 75922 54352 37632 -27575 -78926 -18513 60119 110723 109656 90213 96102
17854 96102 118943 153606 164676 148277 141731 129072 120160 65836 50178 32538 52826 50389
17842 50389 21858 30694 36424 33416 50995 87768 128445 148214 130661 97388 112032 153125
17830 153125 143267 153356 135418 167748 146276 121008 113568 82264 40514 6038 4742 -33291
17818 -33291 -75243 -88979 -82259 -125949 -264652 -428294 -458822 -363895 -284570 -192247 -95943
17807 -95943 -77718 -67356 -50740 7117 13303 -1152 -61061 -162923 -187187 -194306 -205145 -146860
17795 -146860 -135377 -147756 -118099 -85163 -104138 -168367 -151557 -102089 -111042 -106793 -71479 -118531
17783 -118531 -153385 -134608 -121648 -100618 -53774 -32580 -427 10403 26481 52107 38670
17772C8670q322o5893l2304J1782L4219j5984j4209n2816q5436R005N0432N8809
17760g2047K6226J385N7591J0511j3856J4846k3891J4657L7050k6606j6955k569
17748F342k0492p1602n1140J0862K6377J713n6551j10879j08169q635J14224Q6076
17736a81874m789m7551l7951k5646K7731N3576P2830P5322N5043J2642p9820l5236
17724a15723J2202J6075K5255K1064k1745m9681j1841J101P933K6727J2736J1904
17712f3993q078l4722J4937j57K522J5393M1660J8368R064j5396k397k9444j8619
17699g0862K8424J3087J1297k330J0171l2653j1562J2980N4406K4150r664Q967
17687C6411K9495l5637p2627m6193m840N8260P001o731l902k5852n2744l0634
$$ plain form
17772 38670 30348 -35545 -67849 -56067 -21848 -37832 -52041 -104857 -190293 -181288 -130856 -72047
17760 -72047 -45821 -44436 13155 23666 9810 24656 765 15422 52472 25866 8911 6342
17748 6342 -14150 -85752 -136892 -126030 -99653 -97940 -154491 -265370 -373539 -382174 -267950 -181874
17736 -181874 -186663 -234214 -272165 -297811 -270080 -216504 -143674 -68352 -13309 -667 -80487 -115723
17724 -115723 -103521 -87446 -62191 -41127 -62872 -112553 -124394 -123293 -115360 -88633 -75897 -63993
17712 -63993 -72071 -106793 -91856 -92013 -89491 -74098 -32438 -14070 -5006 -20402 -22799 -52243 -70862
17699 -70862 -42438 -29351 -18054 -20384 -10213 -42866 -54428 -41448 12958 37108 27444 36411
17687 36411 65906 30269 -42358 -88551 -93391 -35131 -28130 -34861 -38763 -64615 -117359 -147993
17675a47993J9610N0775J8333L4660J9675q130j4246l4866j1501k9419L0884K9684
17663d2534N4250l302K594L9M0725J2554J610J9178K4622Q1696J23435J61707
17651D76574K05418J71682m2742k21535j16340M8636J31498K28457J54211j02687
17641I33172k75858k19315j38847j08736p3j3656K1246O993k4201j0120j7410
17630A53195o6099o9182k2749J4684J3920J1146l4695L410P9022O3037Q2813J6257
17618B44759m4052l221K6535M468o1324l1130o645J2723K8014M2431Q5954O5234
17606C63746M7341J34859K70178L76846K94644J60365j2570r3207j54558J4301
17596A401945K68946L06788j6725l92720m03405l57670k49159j34793j00122l5709
$$ plain form
17675 -147993 -128383 -77608 -59275 -24615 -4940 -13070 -27316 -62182 -73683 -103102 -72218 -42534
17663 -42534 11716 8414 11008 11047 51772 64326 65936 85114 109736 191432 314867 476574
17651 476574 681992 853674 810932 589397 473057 521693 653191 881648 1035859 933172
17641 933172 657314 437999 299152 190416 190343 176687 197933 204926 180725 170605 153195
17630 153195 87096 17914 -4835 9849 23769 34915 220 3630 82652 145689 228502 244759
17618 244759 200707 197486 224021 228489 167165 136035 129390 142113 170127 212558 298512 363746
17606 363746 411087 545946 816124 1192970 1487614 1647979 1635409 1542202 1387644 1401945
17596 1401945 1670891 1977679 1960954 1568234 1164829 807159 558000 423207 323085 287376
17586B87376M1728P5828m2276o5321k0218J0688K8064Q5797J10344J36891O6408
17575G15309l7735n1517Q6762K28214K17584R0419j30318k32796j40097r7712
17565F48113n4341J8165L3063n4338j22139p4137j1556k8971j6830M1680J86535
17554E65244K67909J93205j6213j88109j39021j0184J35280K62815K04854o6988
17544A208792l03057k64625j67292o3182l982n5175j2008J7733l0465q2394q7357
17533A56988k6062K6650J2726j0914M541M4324N7770J31607K27871J85784R2604
17522I03889J08508K51201K83243Q9222k09512j80885r2438j3789J15403J72205
17512A427047n6629l86136l46487j97052q4752L3079N8664K4532J806k4853q4822
$$ plain form
17586 287376 329104 404932 362656 297335 277117 287805 315869 401666 512010 648901 715309
17575 715309 677574 626057 712819 941033 1158617 1249036 1118718 885922 745825 648113
17565 648113 593772 611937 645000 590662 468523 394386 382830 353859 337029 378709 565244
17554 565244 833153 1026358 1010145 822036 683015 672831 808111 1070926 1275780 1208792
17544 1208792 905735 641110 473818 410636 406654 351479 339471 357204 326739 244345 156988
17533 156988 130926 157576 170302 159388 163929 208253 266023 397630 625501 811285 903889
17522 903889 1012397 1263598 1546841 1636063 1426551 1245666 1153228 1139439 1254842 1427047
17512 1427047 1370418 984282 637795 440743 355991 389070 447734 472266 474072 449219 364397
17501C64397p8732L903M5515K4934j05083j17846q1063J7619N2388O2986L0821
17490B19839n9033j8313K9764j2594n0823m6773k6726L8861K4832j2091K6488
17479A13431M7871K402R7750J53763J82340K15741J56725q7040j58199o0222Q3393
17468G47955J83518K81773J48312j14727j45107k6175K8414o6670j39863j65106
17458G32324p9271M7405M9834r1276r4537l2261O408r5972j31123r1988o8505
17447A51038m3674M0617N1091R3251J54398K04110l8735k28775j81448p4280l3598
17436I3995l156J206L1688K2431L3956J9178k8240k2455J2237R4810J03124k797
17424C55977n9970n2954K1055R9314K04202K44279K010j80805j98384o0025N6184
$$ plain form
17501 364397 285665 289568 335083 360017 254934 137088 56025 73644 126032 189018 219839
17490 219839 160806 142493 172257 159663 108840 62067 35341 74202 99034 86943 113431
17479 113431 161302 163704 261454 415217 597557 813298 970023 882983 724784 664562 747955
17468 747955 931473 1213246 1361558 1246831 1101724 1075549 1103963 1037293 897430 732324
17458 732324 653053 700458 750292 659016 564479 532218 538626 442654 311531 219543 151038
17447 151038 107364 147981 199072 292323 446721 650831 612096 383321 201873 127593 93995
17436 93995 90839 92045 123733 146164 180120 199298 171058 148603 160840 255650 358774 355977
17424 355977 296007 243053 264108 363422 567624 811903 813913 633108 434724 374699 430883
17413D30883J24185R2979o5818k37391j54965n1315P370J1298k4685l3070l1204
17402F8267k6787N1815L210k4955J5802O1253L0893J2542l7539m1930n2583k9771
17390C0217l8397k004P189J3258K8128J8913K0280J1342L2348l9454o9141l8857
17378b6178j4114J0652M770O78q23J5866K1662l1945n192j029q484p355L1557
17365i935R662m493k7308k4997N0708J7670l9093k7733P912K2329j0182k1607
17353e7067r686p675l294K8303q076k5717K0482Q7597Q2078M763m9481l4598L1280
17340E8909J166j2681l3055m4150K8255L9351O1752L8843k1069j5041j1659l5547
17328E5074K1781J1349j6554q289k5011j8272n4580K4247r94J9991j2183m3006
$$ plain form
17413 430883 555068 648047 582229 344838 189873 138558 145928 157226 132541 99471 68267
17402 68267 41480 93295 96505 71550 87352 148605 179498 192040 154501 112571 59988 30217
17390 30217 -8180 -10184 -2995 10263 38391 57304 77584 88926 121274 81820 12679 -26178
17378 -26178 -40292 -29640 -24870 -24192 -25015 -9149 12513 -19432 -24624 -25653 -34137 -41492 -9935
17365 -9935 -273 -4766 -32074 -57071 -6363 11307 -27786 -55519 -47607 -25278 -35460 -57067
17353 -57067 -66753 -74428 -77722 -49419 -57495 -83212 -62730 24867 106945 111708 62227 27629 58909
17340 58909 60075 47394 14339 -29811 -1556 37795 99547 138390 117321 102280 90621 55074
17328 55074 76855 88204 71650 63361 38350 20078 -34502 -10255 -11249 8742 -3441 -46447
17316d6447j8577L5508l1115k1522J4144p870J4819P056K2029m5416j2014N9410
17304b9995l750m1014l039Q311J4662m426L0074p548j781J4642q223j7088M1628
17291g547M4914Q830L432j5926L5593J8160l1102l9146o747j6037K970l8852k9324
17278g0782K0063K8465K0159k5775k4770J9045M410k9587J6678J4958j5837J8577
17266b4396N515M4507J3503l8601m011r380p041N3213K2982m6430p490j250j4221
17253a3100m3599j7772K8701L606P288J6320N2019K1654K4305k1645n713l5923
17241A6141N942p081j4464R716L6157J6336n8712l2338K163L7051L2637J6549
17229F0097n2485l0748L2K072J4040r056j232O337j1256o502J5518p842K3044
$$ plain form
17316 -46447 -65024 -29516 -60631 -82153 -68009 -75879 -61060 -54004 -31975 -77391 -89405 -29995
17304 -29995 -33745 -74759 -77798 -69487 -54825 -59251 -29177 -36725 -38506 -23864 -32087 -49175 -7547
17291 -7547 37367 46197 49629 33703 69296 87456 56354 17208 10461 -5576 -2606 -41458 -70782
17278 -70782 -50719 -22254 -2095 -27870 -52640 -33595 -29185 -58772 -42094 -27136 -42973 -24396
17266 -24396 -18881 25626 39129 528 -3483 -12863 -19904 33309 56291 9861 2371 1121 -13100
17253 -13100 -56699 -74471 -45770 -42164 -34876 -18556 33463 55117 79422 57777 52064 16141
17241 16141 22083 15002 538 10254 46411 62747 4035 -28303 -26140 10911 43548 60097
17229 60097 7612 -23136 -23104 -21032 -6992 -16048 -17280 -10943 -22199 -28701 -13183 -21025 2019
17216B019l307P344N7435J1865j1775k5546K7060l976l1825k6718m798q888M3287
17203C2177L0287M896K2296l1221k9250o620M5289M1938J9073j8886k9883j3176
17191F6920k747k1009k629L4152N059L622Q520l4164n7709K1182K9179J6455j3174
17178E3657p4388n8912l962L521K6425M5519K6072L8456j1962k7628j4687n392
17166c281j8734K41L7853M5783k1971N113L021l8421J0179L1768J2577J7364J6767
17153I8259K4438K3097j9100j4526l2092n9455l2243K0665O655j0896k9742k4978
17141d9918K934O392N6526q363k2062l8324L1099J8415M045p17K3917r432k193
17128A2319K0557j2949m6354k5043j3924P247o421k0557j0990L9400K3443P214
$$ plain form
17216 2019 -1288 6056 63491 75356 63581 38035 65095 61119 29294 2576 -2222 -11110 32177
17203 32177 62464 67360 89656 58435 29185 22565 67854 109792 128865 109979 80096 66920
17191 66920 64173 43164 40535 74687 79746 83368 91888 57724 15 21197 50376 66831 53657
17178 53657 -20731 -79643 -83605 -80084 -53659 -8140 17932 56388 44426 16798 2111 -3281
17166 -3281 -22015 -21774 16079 61862 39891 45004 48025 9604 19783 51551 64128 81492 98259
17153 98259 122697 145794 126694 112168 80076 20621 -11622 9043 15698 4802 -24940 -49918
17141 -49918 -46984 -40592 15934 7571 -14491 -52815 -21716 -3301 744 27 23944 14512 12319
17128 12319 32876 19927 -26427 -51470 -65394 -58147 -64568 -85125 -96115 -56715 -33272 -26058
17116b6058o110q700M0214K0135m2197L647M0220m7424k5343P881L4424N137J1060
17103F886O248l8256j6656k7673j8244P368L2578J8484o456m1009L009L391o373
17090g6703J3662K203k4556M6586M5050J5295m1862j641J5918j0595J2354j971
17078f260k4804j9225K6443K5397j5036M723n289M425O988M53j7106o8498l2170
17065a19959J6030L3094N070Q437J3893l679J5884M765M746k380J2694r202l1814
17052e2421j5402J1838m291j1129q052M2435N10j0791K8142J7522j3647j0205
17040b5491R586K0576L0052j4434l8927l2587k5189J1044K5560L5961j4082l5134
17028e3065K9816K3j8837l5278j8883Q361n07p279l0728q618N4780O6381J7181
$$ plain form
17116 -26058 -32168 -40868 -654 19481 -22716 -19069 21151 -26273 -51616 -43735 -9311 -4174 6886
17103 6886 13134 -25122 -41778 -69451 -87695 -80327 -47749 -29265 -35721 -76730 -73721 -70330 -76703
17090 -76703 -63041 -60838 -85394 -38808 6242 21537 -20325 -21966 -6048 -16643 -4289 -6260
17078 -6260 -31064 -50289 -23846 1551 -13485 -8762 -14051 -9626 -2638 -2185 -19291 -87789 -119959
17065 -119959 -103929 -70835 -65765 -57328 -43435 -47114 -31230 -26465 -21719 -24099 -11405 -20607 -52421
17052 -52421 -67823 -55985 -60276 -71405 -79457 -37022 -36512 -47303 -19161 -1639 -15286 -25491
17040 -25491 -15905 4671 34723 20289 -18638 -51225 -76414 -65370 -39810 -3849 -17931 -53065
17028 -53065 -23249 -23226 -42063 -77341 -96224 -87863 -88370 -95649 -126377 -134995 -80215 -13834 3347
17015C347K368P130o457k7999k0224J6132j3911K144L9773L2394j2128K1066l3152
17002A0483n2278O145j319k7229k9461J3877M9602M1107n178j3309M005k6558
16990c0113p932K1912m444n2353k1590J6235J0498n295j918L0556L1733p896o738
16977b7345j0741J3272M435N301J1986j6828m666l0234L7277L4553j6089r909
16965h988j0980k3409J3799j2663J5553n20k7150j6213O635R996j0761l3238O998
16952i0941P808m85m5143L485L8745O9125L1982j2707m5904k8127K3522L841R295
16939c5504j2965k968K6107j8194j3749K2518P461j5073k0023k6973J038n171
16927i3496K2044j7946l5462R927M0662J0592Q210K5763j0382p21k7289Q424j7426
$$ plain form
17015 3347 5715 12845 6388 -21611 -41835 -25703 -39614 -37470 2303 34697 22569 43635 10483
17002 10483 -41795 -35650 -36969 -64198 -93659 -79782 -30180 10927 5749 -7560 -3555 -30113
16990 -30113 -38045 -16133 -20577 -72930 -94520 -78285 -67787 -73082 -75000 -44444 -12711 -20607 -27345
16977 -27345 -38086 -24814 -20379 -15078 -3092 -19920 -24586 -54820 -17543 17010 921 -8988
16965 -8988 -19968 -43377 -29578 -42241 -26688 -27208 -54358 -70571 -63936 -53940 -64701 -97939 -90941
16952 -90941 -83133 -83618 -128761 -125276 -86531 -17406 14576 1869 -44035 -72162 -48640 -44799 -35504
16939 -35504 -48469 -51437 -25330 -43524 -57273 -34755 -27294 -42367 -62390 -89363 -88325 -93496
16927 -93496 -71452 -89398 -124860 -114933 -74271 -63679 -55469 -29706 -40088 -40809 -68098 -59674 -77100
16914g7100l0823M4989K5985J3816l3836j7456K7119L3854p977j6595m2444k0253
16902a00721J4738J1384p175K8148O064j203m649j1403L543j0306k6791J4218
16890h4153j1335p798P062k354J524L1283M5531K5134k621k2592j0993K7004m064
16877h372O293M1927j5625l1336l6715j6296K375M7269j4882j9379K4191J2459
16865h091R627o045K449J3941j3497l6582j1607L950L8657J1740j0343j4200k852
16852b2853j1319m9832p62J9743K1567k7258L2337L8844l41k4361K172n7902j8314
16839i8279O4798O4825k9465k172J3070k5583n28J3523P034L3488j366J2705L559
16826E5609m4150j6450k0940j5096j3129j4316L7693L169k8984L8259M2351k4818
$$ plain form
16914 -77100 -107923 -62934 -36949 -23133 -56969 -74425 -47306 -13452 -21429 -38024 -80468 -100721
16902 -100721 -85983 -74599 -81774 -53626 -47562 -48765 -53414 -64817 -61274 -71580 -98371 -84153
16890 -84153 -95488 -103286 -96224 -98578 -97054 -65771 -20240 4894 2273 -20319 -31312 -4308 -8372
16877 -8372 -2079 39848 24223 -7113 -43828 -60124 -57749 -10480 -25362 -44741 -20550 -8091
16865 -8091 1536 -4509 -2060 11881 -1616 -38198 -49805 -45855 -7198 4542 -5801 -20001 -22853
16852 -22853 -34172 -84004 -84766 -65023 -43456 -70714 -38377 467 126 -24235 -22063 -79965 -98279
16839 -98279 -33481 31344 1879 -293 12777 -12806 -13334 189 7223 40711 39345 52050 55609
16826 55609 11459 -4991 -25931 -41027 -54156 -68472 -30779 -27610 -56594 -18335 24016 -802
16814h02j5763K018k0110j1752R660J500K4037j0362l2579Q736J2623K611J8357
16801a1826j938j3265M397K6406k9863k8550j3412J2483K986K0056k2276J6554
16789c8248K896J7247J5785m5870J7726L5079k7989K1169K1567p227k6399j2985
16777b7249k515l480j166m9302O599M1061o721q049K0372k0723o207L5576j949
16764b3753J0849K3715k6653q573l694j1593K882j839J8656k443L6129k7401j6971
16751c0689J4107m855R676l5129j66j6904N62K8908J0520j6340k9507L3143J007
16738c5667J2276k451J3473J5098j9585K1827k2378j5503J838k0943j8922J4913
16726e6024R054j2718K0338L0154M1311j7505m4697r078k6672j8571M469q470
$$ plain form
16814 -802 -16565 -14547 -34657 -46409 -36749 -35249 -11212 -21574 -54153 -45417 -32794 -30183 -11826
16801 -11826 -13764 -27029 -22632 3774 -26089 -54639 -68051 -55568 -52582 -32526 -54802 -38248
16789 -38248 -35352 -18105 -2320 -48190 -30464 4615 -23374 -2205 19362 12135 -14264 -27249
16777 -27249 -29764 -33244 -34410 -83712 -77113 -36052 -42773 -50822 -30450 -51173 -57380 -21804 -23753
16764 -23753 -12904 10811 -15842 -24415 -28109 -39702 -36820 -38659 -20003 -22446 13683 -13718 -30689
16751 -30689 -16582 -21437 -11761 -46890 -47056 -63960 -63398 -34490 -23970 -40310 -69817 -36674 -35667
16738 -35667 -23391 -25842 -12369 2729 -16856 4971 -17407 -32910 -31072 -52015 -70937 -56024
16726 -56024 -46970 -59688 -39350 -9196 32115 14610 -30087 -39165 -65837 -84408 -79939 -88409
16714h8409N5890L4558n3413m8828k326J6496Q212J1377K523J2211J1262j9029
16702e9476J3341k3424l0898p280J4172L7210K7131K084j5311R725J6092Q759
16690g875P764q193M34L822l5689m3539j7828k541M5771k945l224j3058Q679O6351
16676b071J0901j6182r736n317j454L2246j494k452Q770n860j1925k2088L4654
16663G992K9657J5323j7958n901l2321o2460L828M640K4137j294j4158n6462K2704
16650h2273K8547j581J4334l0259o551N3907N304k559k5136j0340J3225L2600
16638a0782l96k613O839k1996K809r511q182j8161L4510l2591j4805O2698J039
16625a1142j8109j8161O455J6784J0450k1500j8112m4793M925P2634K1079j9278
$$ plain form
16714 -88409 -32519 2039 -51374 -100202 -102528 -86032 -77820 -66443 -63920 -51709 -40447 -59476
16702 -59476 -46135 -69559 -100457 -107737 -93565 -56355 -29224 -27140 -42451 -32726 -16634 -7875
16690 -7875 -111 -8304 -7870 -4048 -39737 -83276 -101104 -103645 -57874 -60819 -64043 -77101 -68422 -2071
16676 -2071 8830 -7352 -17088 -22405 -23859 8387 6893 4441 13211 7351 -4574 -26662 7992
16663 7992 37649 52972 35014 29113 -3208 -65668 -61840 -57200 -33063 -34357 -48515 -104977 -82273
16650 -82273 -53726 -55307 -40973 -71232 -77783 -23876 -18572 -21131 -46267 -56607 -43382 -10782
16638 -10782 -11178 -13791 -6952 -28948 -26139 -35650 -43832 -61993 -27483 -60074 -74879 -12181 -11142
16625 -11142 -29251 -47412 -40957 -24173 -13723 -35223 -53335 -98128 -93203 -20569 510 -18768
16613a8768j8565K2337K6038L9175R765l0999l4103j1211M853l178o49j6784r046
16600d1135o293M339L977J7134J0254j454O829o738J1566l9166j4645M0290J1569
16587c473J8332K2159l7814M363J4851j3794j8822J2116p508j9697j9128J8407
16575c0008j5712l5228o492J8421j4531M9864N6838k2651j1237m3854J772J6224
16563c6594K3760l3851n028K3367l956j2900q025J6290L9133j702m0293R211J4397
16550a6191M7852r684l8250m2836j4874M9532j1213L6883Q179L0922L201l3213
16538A0308j1501R693k7166q104N327j3637k1844J033j2955M2440J1942K1322
16526F858k293j5424L6716R36j1755m622k7709l1791k6954N594K7122J3950J1234
$$ plain form
16613 -18768 -37333 -14996 11042 50217 59982 28983 -5120 -16331 -11478 -14656 -15305 -32089 -41135
16600 -41135 -47428 -43089 -39112 -21978 -11724 -13178 -6349 -13087 -1521 -40687 -55332 -15042 -3473
16587 -3473 14859 37018 -796 3567 18418 4624 -14198 -2082 -9590 -29287 -48415 -30008
16575 -30008 -45720 -80948 -87440 -69019 -83550 -33686 23152 501 -10736 -54590 -52818 -36594
16563 -36594 -12834 -46685 -51713 -28346 -32302 -45202 -53227 -36937 2196 494 -39799 -30588 -16191
16550 -16191 31661 21977 -16273 -59109 -73983 -24451 -35664 1219 9398 40320 43521 10308
16538 10308 -1193 8500 -18666 -26770 -21443 -35080 -56924 -55891 -68846 -26406 -14464 6858
16526 6858 4565 -10859 25857 26793 15038 10416 -17293 -49084 -76038 -70444 -43322 -29372 -18138
16513a8138K3872J3807M603j1147K315J681n0979l8215N9525K866m0103m483Q406
16500d5990r06K7177k6299j6387j6809K3348Q073J189P157M371K3873J7750M393
16487A0940L878k637L381q899q565k5021j0186m179J5009j2222K0829k0032j0334
16474d8038K4681K066o152m6775k642J6020M7747J8599k0559m1840m1899O000
16462i2792L8494K5844p651R048J0306J3866l1706J4809J29l859J3483J5587K4507
16449C0065K5081j2473p2481k4513P43l659J3564P521L0090j6826k869k3520r783
16436e9060L2224K2879O958j5662j7093k0891n271J2647J9616L69l0035j8555
16424g1874k9808q436K88J5905J3331O66J098j345K8212M6475L124j8392K0949
$$ plain form
16513 -18138 5734 19541 24144 12997 15312 16993 -33986 -72201 -12676 -9810 -49913 -54396 -45990
16500 -45990 -46896 -19719 -46018 -62405 -79214 -55866 -47793 -46604 -39447 -35076 -11203 6547 10940
16487 10940 14818 12181 15562 6663 -1902 -26923 -37109 -41288 -26279 -38501 -17672 -37704 -48038
16474 -48038 -23357 -21291 -27443 -74218 -76860 -60840 -13093 5506 -15053 -56893 -98792 -92792
16462 -92792 -54298 -28454 -36105 -27057 -16751 -2885 -34591 -19782 -19653 -23512 -10029 5558 30065
16449 30065 55146 42673 -29808 -54321 -53578 -57237 -43673 -36152 -6062 -22888 -25757 -49277 -59060
16436 -59060 -26836 -3957 3001 -12661 -29754 -50645 -55916 -43269 -23653 -23284 -53319 -71874
16424 -71874 -101682 -110118 -109830 -93925 -80594 -79928 -78830 -80175 -51963 -5488 -2364 -20756 193
16411A93k5552k5354n898k168K3358L133P821L0638L1544k6846k9857J002M91
16398a7495O186k7903q675m515j4326J8812K9402L4819j6194n1629P640M03j0961
16385e4436p978K5747N932n125j166k278M7322K8094n227p141k878R011k4960
16372D917j3398k2887J096K4067j9934M251N4146J4511j1282j3917k1527k4803
16360b4760K9671K0513k7785m8589p955J8724M8151j0066k389J6968K5119J7578
16348E5180R438j4348k3013K681J0842p527j0133j2242n243m2795j9565J7684
16336c9041Q024K201L049K7610k3040n1071L986K4791M3496J0241K0808l377j8276
16323I401l1330m867J7908J3973J0135J8591J8332l6480j886p253j3828j8170
$$ plain form
16411 193 -25359 -50713 -56611 -58779 -35421 -32288 -24467 6171 37715 10869 -18988 -17986 -17495
16398 -17495 -11309 -39212 -47887 -52402 -66728 -47916 -18514 16305 111 -51518 -43878 -43475 -54436
16385 -54436 -62414 -36667 -30735 -35860 -37026 -39304 8018 36112 30885 23744 20866 29877 4917
16372 4917 -8481 -31368 -30272 -6205 -26139 -21888 32258 46769 35487 21570 43 -24760
16360 -24760 4911 25424 -2361 -50950 -58905 -40181 7970 -2096 -4485 12483 37602 55180
16348 55180 64618 50270 27257 29938 40780 33253 23120 10878 5635 -37160 -56725 -39041
16336 -39041 -31017 -28816 -25767 1843 -21197 -72268 -68282 -43491 5 10246 31054 27677 9401
16323 9401 -21929 -26796 -8888 5085 15220 33811 52143 15663 13777 6524 -7304 -25474
16311b5474O36k7531k729J2789k1669j7274m576J3009L5803K6597J4710l1870
16299b7579k2563j4727j5996J6183M117L7067j6563o364M0540P353L288j272j9284
16286a5800k8728K0625J1233j7415j1820o100L6804K5742j455k5394N480j5930
16274b2758K7803J6515J1293M80K8589k5713l3192q201q920m909l4297n731R595
16261d9446K1283N15K385j4134L6481L044n3022J985K4247O513J2543r562k6344
16248d3512k334L7259K6679j3091J0143k8164J9179J0019M8862q585m8213J3525
16236B1767O921O977J1242Q57r281j0637k1613N840J8038j3089k7591n238j6202
16223c2009M044j0072o708K6178J1065l995O267J3262j5204m897P071K4837N100
$$ plain form
16311 -25474 -24838 -52369 -55098 -42309 -63978 -81252 -85828 -72819 -37016 -10419 4291 -27579
16299 -27579 -50142 -64869 -80865 -64682 -60565 -23498 -40061 -46425 -5885 1468 4756 3484 -15800
16286 -15800 -44528 -23903 -12670 -30085 -41905 -48005 -11201 14541 13086 -12308 -6828 -22758
16274 -22758 5045 21560 32853 33333 61922 36209 3017 -5184 -14104 -19013 -53310 -59041 -49446
16261 -49446 -28163 -27648 -25263 -39397 -2916 128 -52894 -50909 -26662 -20149 -7606 -17168 -43512
16248 -43512 -45846 -8587 18092 5001 15144 -13020 6159 16178 65040 56455 8242 21767
16236 21767 28688 35665 46907 47764 38483 27846 6233 12073 30111 17022 -10569 -15807 -32009
16223 -32009 -27965 -38037 -44745 -18567 -7502 -11497 -5230 8032 -7172 -12069 -4998 19839 24939
16210B4939n58j0666m954k2240n998P148m75j0037k9568j6229k8630P116J9070
16197g1082O370J2827r130K2086L4432k1858k0479o713K9349K0150k8156m435
16185c6639J0894K1073j3293k8366k2072K4704K6559O816J1937J0617k52l3320
16173b1342k7884J4493M695j4521K1657J3469m7931k360N1815R870l6986k4450
16161e9475J2483r658K8786L630q969P04N2720J9200m8869k0128L6636J2132j1503
16148G689k8383j848N928J002P438p420j055n712n2058j0490K9494L0675J6397
16135h343J3941R257n0877j0941J3452J8259M6382J3815k3124j5826j1602J5620
16123A0013m79K0299l0480k7597m86R837N137j8538q219L6092o806l3398m3337
$$ plain form
16210 24939 24381 13715 8761 -13479 -19477 -12329 -12804 -22841 -52409 -68638 -97268 -90152 -71082
16197 -71082 -64712 -51885 -61015 -38929 -4497 -26355 -46834 -53547 -24198 -4048 -32204 -36639
16185 -36639 -25745 -4672 -17965 -46331 -68403 -43699 -17140 -10324 1613 12230 11978 -21342
16173 -21342 -49226 -34733 -30038 -44559 -22902 -9433 -57364 -59724 -7909 1961 -35025 -59475
16161 -59475 -46992 -56650 -27864 -24234 -33203 -32499 20221 39421 -9448 -29576 7060 19192 7689
16148 7689 -20694 -22542 -16614 -15612 -8174 -15594 -16649 -22361 -74419 -84909 -55415 -24740 -8343
16135 -8343 5598 14855 -36022 -46963 -33511 -15252 31130 44945 21821 5995 -5607 10013
16123 10013 9534 29833 -647 -28244 -28730 -18893 -13756 -32294 -40513 -4421 -11227 -44625 -87962
16110h7962K4941K9825J8235l5808l134K919j1470j8480M021N110N096l953O773
16097f3887J9958L1791K3471J3216k688M533l2197k7001J2830J3462n435m3075
16085e5022N581L8690K5727L2818N265J0414J4836j4502k0256k9085J8370K8481
16073F1317m692P332M642l2518J0517k4183k1946m2353k4535o43P649l776L8347
16060b4842K8611L55P185J6321j2513p218J7102L4686N352n814k9388m1262K06
16047a1219l894k11m2032J8246L4323L530J8279L805j1880m2173m7097k414J063
16034h1674J1714l7576K5362M6896O1042p36l7289J2489K2890l7768j8456N3909
16022B0803k6605p3432j7377N0310K8503J6473K8655l2827k5262N75L1430j769
$$ plain form
16110 -87962 -63021 -33196 -14961 -50769 -53903 -50984 -62454 -80934 -76913 -71803 -66707 -70660 -63887
16097 -63887 -43929 -12138 11333 24549 21861 26394 -5803 -32804 -19974 -6512 -11947 -55022
16085 -55022 -49441 -10751 14976 47794 53059 63473 78309 63807 43551 14466 32836 61317
16073 61317 56625 63957 68599 36081 46598 22415 469 -41884 -66419 -67062 -59413 -63189 -24842
16060 -24842 3769 4124 11309 27630 15117 7899 25001 59687 65039 59225 29837 -11425 -11219
16047 -11219 -15113 -15324 -57356 -39110 -4787 -1257 17022 20827 8947 -33226 -80323 -82737 -81674
16034 -81674 -69960 -107536 -82174 -35278 25764 25028 -12261 228 23118 -14650 -33106 20803
16022 20803 -5802 -79234 -96611 -46301 -17798 -1325 27330 -5497 -30759 -30184 1246 -523
16010e23j094q395k307p556K1970j928k300q173k5082q333J6110J3529K1195K7886
15996C4999J4340k269R253k6810o1911j93J8655l6200n802K1511J9220M0074K1009
15983D5876p009l9987j4630K3315J7174N178m4439l0630K1752k0469M831M84L1295
15970g259L2490j490j5642Q874j5978K6791J8503j9024j4542k9446O809J7333
15958G419j79m686L547K736K311j9867k3319L6392L6639j4318j2643n527J6901
15945B5406k6372m5010o56L6454k6545j3451K8719j933j5692K0976j5630o451
15933d0185K5664J2108j3624j8942j5646O397j6275r571K2365P3149p188k4766
15921f514q367K3708l185k9720P459j886k3347k5038j205J7993R996K5496L0063
$$ plain form
16010 -523 -1617 -10012 -12319 -19875 2095 167 -2133 -10306 -35388 -43721 -27611 -14082 7113 34999
15996 34999 49339 47070 56323 29513 -32398 -32591 -13936 -50136 -55938 -34427 -15207 24867 45876
15983 45876 38867 -1120 -15750 7565 24739 29917 -14522 -45152 -23400 -43869 -39038 -38554 -7259
15970 -7259 25231 23741 8099 16973 995 27786 46289 27265 12723 -16723 -9914 7419
15958 7419 7240 2554 6101 8837 11148 -8719 -32038 4354 40993 26675 14032 8505 25406
15945 25406 -966 -45976 -46632 -10178 -36723 -50174 -21455 -23388 -39080 -18104 -33734 -40185
15933 -40185 -14521 -2413 -16037 -34979 -50625 -44228 -60503 -70074 -47709 25440 18252 -6514
15921 -6514 -14881 8827 5642 -24078 -16619 -18505 -41852 -66890 -68095 -50102 -40106 -14610 15453
15908A5453k3340j9294j8929m34M5345L6286l8299m7011K7860L6341K7360l5946
15896E392P964M7150k2172l1338L285l4548o58M602K9144M806j4768K2501J1313
15883C2673M391j1269j0246P882j558m8045k6164l4735j9291L5065L6421J5947
15871a8929j5973K4043r036k5343M504L3747J7662o414k9159K6825N731l642K0059
15858B4075J4939j4751k2907k7899K2221R32N225L7735K4919k0538m6965l6588
15846c9602J0893n049Q644j115K8094n25K099k0572J3358l8601k190L8604o21
15833f583l2190K1870J3110J855L865K9987k408r144q350k693j4517l6264k3129
15820f4591N868L2340J8216P964K541L1652j7456j4672k0684j4131K8076P080
$$ plain form
15908 15453 -7887 -27181 -46110 -46544 -1199 35087 -3212 -50223 -22363 13978 41338 5392
15896 5392 13356 60506 38334 6996 10281 -24267 -24925 -20323 8821 13627 -1141 21360 32673
15883 32673 37064 25795 15549 23431 21873 -26172 -52336 -87071 -106362 -71297 -34876 -18929
15871 -18929 -34902 -10859 -19895 -45238 -40734 -6987 10675 4261 -24898 1927 7658 4016 24075
15858 24075 39014 24263 1356 -26543 -4322 -3390 1835 39570 64489 43951 -3014 -39602
15846 -39602 -28709 -33758 -25114 -26229 1865 1340 3439 -17133 -3775 -42376 -44566 -5962 -6583
15833 -6583 -38773 -16903 -3793 -1938 1927 31914 29506 20362 12012 9319 -5198 -41462 -64591
15820 -64591 -58723 -26383 -8167 -203 2338 33990 16534 1862 -18822 -32953 -4877 2203
15808B203j3323j7887K815p154K7405J8510j0952l2931j3564L6869k1623j8594
15796d8226J8779L926K0593O498j639j8674k4883J7649j4623p484J5192r033n4140
15783i6065J862M8537J2088j3738J6704q068J1300J7849J5729J3355j8663k2903
15771b2013J5185k2331J587L2455j9136l11N60K3241M1078k1112m9833K7072K5525
15758C1967L6221P941n6477l2517j351J5254k543k801j6839l655j448J0689M9645
15745C4086n961O557J4686r292j5565L007L6076P481J5902K2589l7120l2238k4177
15732A6031m030j3120q297J7458J9926K9122o09j4797j0982p377R091k4838j0658
15719c080K2305R804K3203n331o034k7487j5215m264m4705k6674K3455K7687J1495
$$ plain form
15808 2203 -11120 -29007 -26192 -33346 -5941 12569 1617 -31314 -44878 -8009 -29632 -48226
15796 -48226 -29447 -25521 -4928 1570 -69 -18743 -43626 -25977 -40600 -48084 -32892 -41925 -96065
15783 -96065 -94203 -45666 -33578 -47316 -30612 -38680 -27380 -9531 6198 19553 890 -22013
15771 -22013 -6828 -29159 -27572 4883 -14253 -14564 -14004 9237 50315 29203 -20630 6442 31967
15758 31967 68188 76129 19652 -12865 -14216 1038 -1505 -4306 -21145 -24800 -26248 -15559 34086
15745 34086 28125 34682 49368 40076 24511 27518 63594 71075 86977 109566 72446 40208 16031
15732 16031 12001 -1119 -9416 8042 27968 57090 56481 41684 30702 23325 32416 7578 -3080
15719 -3080 19225 29029 52232 46901 40867 13380 -1835 -6099 -50804 -77478 -54023 -26336 -14841
15706a4841j5253J2458L8276L2447j7698m1508K0573M5337k5497j2432k4533N996
15694C325q347k8657k492K0012N3103L116m5969L9374M9806k461k2368j6615O127
15681D7954j2777r707J1786k3837k2918j7485p746J5697j5476j9588j4670K3047
15669d5720J574J8330k391P227K0097l0693j117J8502J910J7898K0727J6557m4733
15656a832j3584J5052P822n67n466J3004l2244l8035J3478K3625M5940J4781l1625
15643A0349k8173k6097K0172J3032L135j3681K5662J3408O173j4197j2285K0057
15631A7555k2091L417j4808J5451L5635m2969j3988m3077m2231O027M474K3018
15619g3587L8101Q801J0265J8699l6807K3520M1914l1508j8446j2406J2316M1475
$$ plain form
15706 -14841 -30094 -17636 20640 53087 35389 -6119 14454 59791 34294 21862 -2671 3325
15694 3325 -5022 -33679 -36171 -16159 36944 40060 -5909 33465 83271 80810 58442 41827 47954
15681 47954 35177 25470 37256 13419 -9499 -26984 -34730 -19033 -34509 -54097 -68767 -45720
15669 -45720 -44146 -25816 -28207 -20980 -883 -31576 -32693 -14191 -12281 5617 26344 42901 -1832
15656 -1832 -15416 -364 7458 6891 1425 14429 -17815 -55850 -42372 -18747 27193 41974 10349
15643 10349 -17824 -43921 -23749 -10717 -7582 -21263 4399 17807 23980 9783 -2502 17555
15631 17555 -4536 -1119 -15927 -476 35159 -7810 -21798 -64875 -107106 -101079 -96605 -73587
15619 -73587 -35486 -26685 -16420 2279 -34528 -11008 30906 -602 -19048 -31454 -19138 22337
15607B2337Q652K20j8448J9155K3403l9185q205L1674J2138k9568l4210Q374J1814
15594H151q506m3242l4671R191M5797Q940O994j8063j9548o529P676j5623j7594
15581g7027J478N8323j9297q987N2073J2158j4108m7690k2137o339K050O323J9818
15568d3362L754k3916J4568J9927L5311j3963J6908O871j2948K114K7796p22K5132
15555E7470J624l3128j6069J4231m868Q662R522j556j2533q930p979o549K473
15542B370m0643J9725J5307m079j22R385Q127J4669J167J174j5043m4784r928
15529d2675M4907K1629J5279n000m9061j7885L6278M4214j3649l3500l5643P302
15517b7804M478J8595O488j3218j9935m8170q027J6567L718K3412J2570J8090
$$ plain form
15607 22337 30989 31209 12761 31916 55319 16134 7929 39603 51741 22173 -12037 -3663 8151
15594 8151 -355 -43597 -78268 -69077 -23280 -14340 -7346 -25409 -44957 -51486 -43810 -59433 -77027
15581 -77027 -75549 -17226 -36523 -45510 6563 18721 4613 -43077 -65214 -71553 -69503 -63180 -43362
15568 -43362 -39608 -63524 -48956 -29029 6282 -7681 9227 16098 3150 5264 33060 32338 57470
15555 57470 59094 25966 9897 24128 19260 27922 37444 35888 23355 14425 6446 -103 2370
15542 2370 -38273 -18548 -3241 -7320 -7442 1943 10070 24739 25906 27080 12037 -32747 -42675
15529 -42675 2232 23861 39140 34140 -14921 -32806 3472 47686 34037 537 -35106 -27804
15517 -27804 -23326 -4731 1757 -11461 -31396 -79566 -87593 -71026 -67308 -43896 -31326 -13236
15505a3236l043k1070j165n2P4J0355J7804n110K314l2492l5199J9032J0302r711
15491f1197N5882j9869l4014M766n327L6218M3379n7310j8187j4814K5566N4710
15479I803m386j3686m149p890k9266J3081J2889q662P8J8060J4584l3083q633
15466d1260o584k4145K705M0843N4849O796l4158L0241o312P964j1716M814j4774
15453I263R022j3694k6418l2702k9925M0572L3132k712K0477K4710j5750j1178
15441D797l0600J9424L2918j1153j4086L741j5132Q698L400l990M2485l1325J0508
15428A9685m569J2071n682j2901j1048j0173K3721P149m317r626l2800l8705o671
15415g3866K6630J6149k3737R744L1882k2916J6305p229J7676O568j0617l0661
$$ plain form
15505 -13236 -16279 -37349 -38514 -38566 -38492 -28137 -10333 -15443 -13129 -45621 -80820 -61788 -51486 -61197
15491 -61197 -5315 -25184 -59198 -54432 -59759 -23541 19838 -37472 -55659 -70473 -44907 9803
15479 9803 5417 -8269 -12418 -20308 -49574 -36493 -23604 -32266 -32188 -14128 456 -32627 -41260
15466 -41260 -47844 -71989 -69284 -28441 26408 33204 -954 29287 22975 30939 19223 24037 9263
15453 9263 18285 4591 -21827 -54529 -84454 -43882 -10750 -13462 7015 31725 15975 4797
15441 4797 -25803 -6379 26539 15386 1300 5041 -10091 -1393 2007 -1983 40502 9177 19685
15428 19685 15116 27187 21505 8604 -2444 -12617 11104 18253 13936 4310 -28490 -67195 -73866
15415 -73866 -47236 -31087 -54824 -45080 -13198 -36114 -19809 -27038 -9362 -2794 -13411 -44072
15403d4072J2590K8120J7506M716j9736P083J2702J8046P53k9342n388K657k92
15390E343K7999n925m750j343j6192m65J1117J6513j3404p214k4861l1129J3835
15377c0476K9758J744M4413K7823R572o032L532k5722k0154l296L0180J6439l3244
15364D4537l7703j6436P778N4937K3461j6606j5044K0089j6856k8975Q657M5951
15352G3790j0063l0704l282R667n9499k303M4834M9907k4533j6667k880K8240
15340E6507J3470k0048m2238L778K8927r133j7769P058k0364m904K3238p668q978
15327A876o074k9929j8966K8882L0528O885k7304M282L1153K6526k0960l3605
15315f706k0177j0451k4441j1569J9890J9336k541K9341k3736l8233J636J6516
$$ plain form
15403 -44072 -31482 -3362 14144 18860 -876 6207 18909 36955 37708 8366 2978 5635 5343
15390 5343 33342 27417 22667 21324 5132 4667 15784 32297 18893 11679 -13182 -44311 -30476
15377 -30476 -718 1026 45439 73262 82834 76802 80334 54612 34458 31162 61342 77781 44537
15364 44537 6834 -9602 -1824 53113 76574 59968 44924 65013 48157 19182 27839 73790
15352 73790 63727 33023 29741 39408 -20091 -22394 22440 72347 47814 31147 28267 56507
15340 56507 69977 49929 7691 11469 40396 31263 13494 20552 188 -4716 18522 10854 1876
15327 1876 -4198 -34127 -53093 -24211 6317 13202 -14102 -9820 21333 47859 26899 -6706
15315 -6706 -26883 -37334 -61775 -73344 -53454 -34118 -36659 -7318 -31054 -69287 -67651 -51135
15303e1135L7847L2038j0297j8479m771K6768K3791n933r839L775k9160l0613
15291c6008m0038l084o858O1222K0825m0562Q659q425j9900L0810j5048K9153
15279a9254M3879j1361M0737K0473k8741j9624k5719J0517N163k0725p283K7110
15267A5172j4167k9871Q116J8641j8554M234M603j5678o379k694Q143Q788K4175
15254D529J4571J7876P073j3761R796k2542k8566k6155p37K9025J9289L9266J0825
15241F0489l087m4284j3124N483L286j6616K1038K0845M2522Q472n1686l3930
15229e92q34m5361k470P246o466M4870K1912J2155j1262J1626k695l6070J689
15216f252j1487L8436J575K2265J7454l8417l5119K2538J5423k619m0811l3172
$$ plain form
15303 -51135 -13288 18750 8453 -10026 -14797 11971 35762 29829 19990 23765 -5395 -36008
15291 -36008 -76046 -79130 -85988 -24766 -3941 -44503 -35844 -44269 -64169 -33359 -48407 -19254
15279 -19254 24625 13264 54001 74474 45733 26109 390 10907 16070 -4655 -11938 15172
15267 15172 1005 -28866 -20750 -2109 -20663 -16429 -11826 -27504 -33883 -36577 -28434 -19646 4529
15254 4529 19100 36976 44049 30288 40084 17542 -11024 -37179 -37916 -8891 10398 49664 60489
15241 60489 57402 13118 -6 5477 8763 -7853 13185 34030 76552 85024 33338 -592
15229 -592 -1426 -46787 -49257 -42011 -48477 -3607 18305 30460 19198 30824 28129 -7941 -6252
15216 -6252 -17739 20697 22272 44537 61991 23574 -11545 10993 26416 23797 -17014 -50186
15204e0186r885K2581K4078J1363l939j8040K397L5272K5709m3005Q152L0634
15192C5131j6567k8385j6205n8202J5845K7206L5675L0321j2050l742L6463K1146
15180F6636j6281m3310l1408k536J5834k020j3531J801j0104n758K895K5464N400
15167f918p492J7003J5191k4007Q81M0887p173o0682q753L0961k607o0581r539
15154h2829L4623M0382K7514k9632O370m985K390J9409k530l58P803J8859r868
15141B7148k6322l3339k2816K5389L5474M1954Q624j8177j7965j8422o452J2376
15129G472P022n446r432j944J361k4921l8524o538Q491N2853O0237l3092K1247
15116C8786L0629J6793k8558j9771j742m397l141l140K2245J3714J9919J1924
$$ plain form
15204 -50186 -60071 -37490 -13412 -2049 -5988 -24028 -21631 13641 39350 -3655 4497 35131
15192 35131 18564 -9821 -26026 -84228 -68383 -41177 -5502 24819 12769 9027 45490 66636
15180 66636 50355 7045 -24363 -26899 -11065 -13085 -26616 -24815 -34919 -40677 -37782 -12318 -6918
15167 -6918 -14410 2593 17784 -6223 -5342 35545 28372 -32310 -41063 -10102 -12709 -73290 -82829
15154 -82829 -48206 -7824 19690 -9942 -3572 -8557 -6167 13242 10712 10354 18157 37016 27148
15141 27148 826 -32513 -55329 -29940 5534 47488 56112 37935 19970 1548 -4904 7472
15129 7472 14494 9048 -384 -2328 -967 -25888 -64412 -70950 -62459 -9606 50631 17539 38786
15116 38786 69415 86208 57650 37879 36137 31740 28599 25459 47704 61418 81337 93261
15104I3261j0590j7943m0131K6119N386l331l1982m9570K635L7016L3379J99j8118
15091B6330k9997o21N039K037O8989K7237j2090m3831J679J0806j6696k2568j1168
15078E146n50K641P228j6902J5857m034j4701K784N446L3980K3141j0454j313
15065D8269j5690j4317J9220N83l0362k6718j9783l3626j511M10J1971L8891J4083
15052h580j0585L3209p005Q071k2478k5547J2595M0468J9175L989J9612j9294
15040D3630k5701k8952N562K1046j4062n784l2675K5508M6946J1694m167K3741
15028F6786J2809j0605l8492k9335M2650N147k6546R221N114j9180l8903j8048
15016c9382j839j7736M6169J2161j5937N752J7468K196J3845j3462m4887l4785
$$ plain form
15104 93261 82671 64728 24597 50716 56102 52771 20789 -28781 -26146 10870 44249 44448 26330
15091 26330 -3667 -4288 751 2788 71777 99014 86924 43093 44772 55578 38882 16314 5146
15078 5146 4596 7237 14465 -2437 13420 9386 -5315 -2531 2915 36895 60036 49582 48269
15065 48269 32579 18262 37482 38065 7703 -19015 -38798 -72424 -73935 -73525 -61554 -22663 -8580
15052 -8580 -19165 14044 7039 15110 -7368 -32915 -20320 20148 39323 43312 62924 43630
15040 43630 17929 -11023 -5461 15585 1523 -4261 -36936 -11428 35518 47212 43045 66786
15028 66786 79595 68990 30498 1163 43813 48960 22414 31635 36749 17569 -21334 -39382
15016 -39382 -41221 -58957 -12788 -627 -16564 -10812 6656 8852 22697 9235 -35652 -70437
15004g0437R804M0890K0825J1563j888l809J8103L3832j5315o6768J0515n149
14992a7834r778P858K1914r075o526R224k4186K804M4833J5984j6097K2707j4529
14979B7299l7760J3664L1824R98K4726k648n2696j3510R744J1519J6316K733R319
14966D1528j1517j417j4610j1734k8604l3833L798R511J4295J8785K9364M8267
14954F3833j3312n4120l8049Q459K0004Q628J0596L229L090k2798j5842o014N0843
14941A8547O576j937k2362k4970k2681K8153M8383K4012j4255m7339k2791J7844
14929a2820O280K0312j5088j583K9217m9202k125M476l007n923J2869K0434m2092
14916c8252k5879M1344L4524j6516k930m2885j7756O406l205L1035j4587p148
$$ plain form
15004 -70437 -60633 -19743 1082 12645 10757 6948 25051 58883 43568 -23200 -12685 -17834
14992 -17834 -27612 -19754 2160 -6915 -13441 -4217 -28403 -25599 19234 35218 19121 41828 27299
14979 27299 -10461 3203 35027 36025 60751 58103 5407 -8103 1641 13160 29476 32209 41528
14966 41528 30011 28594 13984 2250 -26354 -60187 -56389 -46878 -32583 -13798 15566 63833
14954 63833 50521 -3599 -41648 -33189 -13185 -4557 6039 9268 12358 -10440 -26282 -32296 18547
14941 18547 25123 23186 824 -24146 -46827 -18674 29709 53721 39466 -7873 -30664 -12820
14929 -12820 -6540 13772 -1316 -2899 26318 -22884 -25009 -20533 -23540 -29463 -16594 3840 -38252
14916 -38252 -64131 -22787 11737 -4779 -7709 -50594 -68350 -61944 -65149 -34114 -48701 -55849
14904e5849Q839J7662j6125Q815J3122r134k6537K6043L6936N499k7938k5601
14892d4268J2865N4958l258j4409j0901n933L3365K5107j378l5512l991M950j4448
14879b853l6544J8215J9868j603N7271K6516j275n9391l0295j5535P38L3683L7099
14866D5894L7688p14l4078j0891j4382Q110L7080K8480r755k8189O9644P443j6014
14853A20316l5065j096K1945l4748m6792J4630K774r69O9598N0245j1996K352
14841A51194K3353J0382k1867o6729J1300L8190K1305r590p973M2968P4548K1074
14829B88155L7738M7455M4112K8373N3020L766J2262L2022l6403j5479k2701m0769
14817D31551j2360j5593m6550k8432m0572m6874k8146j6046n142j9040l1671m9599
$$ plain form
14904 -55849 -47010 -29348 -45473 -36658 -23536 -32670 -59207 -33164 3772 9271 -18667 -44268
14892 -44268 -31403 23555 20297 5888 -5013 -10946 22419 47526 46148 10636 6645 11595 -2853
14879 -2853 -39397 -21182 -1314 -2917 54354 80870 79595 20204 -10091 -25626 -24888 8795 45894
14866 45894 83582 82868 48790 37899 23517 31627 68707 97187 87432 59243 128887 136330 120316
14853 120316 85251 84155 106100 71352 24560 39190 41964 40995 110593 160838 148842 151194
14841 151194 174547 184929 163062 96333 107633 145823 167128 157538 149565 192533 267081 288155
14829 288155 325893 373348 417460 445833 498853 502619 514881 546903 510500 495021 472320 431551
14817 431551 419191 403598 357048 328616 288044 241170 213024 196978 191836 172796 141125 91526
14805I1526l1017l294l4134j4313m537Q8253Q331m3485j1755p327O186J4739l1952
14792B7221J5293J2617k6954P269r294o816k869p012J3967j6295k4421k4831K2510
14779a9615L5510j6460p892m992J0097J7902j1762K5285m752L2600N87j4556k4219
14766A7733n962n271m2364Q004k570J3001n170K98j4792L442K5166M4889M4422
14753H0826r799j2474k2029k1928L6626Q877Q444K8527l1358p083l104J9284j8846
14740E5963J1659k1280m2110k0762R454J6282M106k132j8983N2159N654l0315
14728A9695k3036J0742J7408K03J378k437N951l2554k9783K747l4912j5296j1057
14715i0951l277K9888K2687L0432L3327K7255m534j2759j2720L394J7508M239
$$ plain form
14805 91526 60509 57215 23081 8768 4231 92484 100815 57330 45575 38248 44434 59173 27221
14792 27221 42514 55131 28177 35446 26152 19336 16467 9455 23422 7127 -17294 -42125 -19615
14779 -19615 15895 -565 -8457 -13449 -3352 14550 2788 28073 23321 55921 56508 41952 17733
14766 17733 11771 6500 -35864 -27860 -30430 -17429 -22599 -22301 -37093 -33651 -8485 36404 80826
14753 80826 71027 58553 36524 14596 51222 60099 68543 97070 65712 58629 55525 74809 55963
14740 55963 67622 46342 4232 -16530 -7076 9206 13312 11180 -7803 44356 50010 19695
14728 19695 -3341 7401 24809 25012 26390 23953 29904 -2650 -32433 -29686 -64598 -79894 -90951
14715 -90951 -94228 -64340 -41653 -11221 22106 49361 44827 32068 19348 22742 40250 44489
14703D4489J7009j0041k9700J907K3063R59j6659n766m0220o1086m211K1277J1634
14690d7345K754L3948j3472O389J6365j6027K4604K8988k0020K1049R252q675
14678C7810k2989k990p548l659L633o78k814o702J6511P720J3837J4069J1663
14665E7863k3121k9031j488j6495j4594j8914l0759K5328K1339j4442K4369k2711
14653d2656O693M8283K7621l4293k3806j3555Q755K7236j6326J2411L3670m4270
14641a0237o19J0415j0144P350J0134k0312j064J6900K6765K5651l5814l459J2176
14628B7742k0694m171K4366K2142O260J6398Q568l9604l1611j8946j0532M02N2591
14615C2911J9307K8869k1081m2132l3884J5033J9778o813j418o17j1969j4633
$$ plain form
14703 44489 61498 51457 21757 23664 46727 47686 31027 25261 -14959 -76045 -80256 -58979 -47345
14690 -47345 -44591 -10643 -24115 -17726 -1361 -17388 7216 36204 16184 37233 46485 37810
14678 37810 14821 11831 4283 624 4257 3579 765 -5937 10574 18294 32131 46200 57863
14665 57863 34742 5711 4223 -12272 -26866 -45780 -76539 -51211 -29872 -44314 -19945 -42656
14653 -42656 -35963 12320 39941 5648 -18158 -31713 -22958 4278 -12048 363 34033 -10237
14641 -10237 -10856 -441 -10585 -3235 6899 -13413 -14477 2423 29188 54839 19025 15566 27742
14628 27742 7048 2877 27243 49385 55645 72043 80611 41007 9396 -9550 -20082 -19680 32911
14615 32911 52218 81087 60006 17874 -16010 -977 18801 11988 10570 9953 -2016 -16649
14603a6649J97N0705K8132j9737j2091J9353j4030l0138M583J8553J0328M38j9975
14590A9669P62Q290q512J1338N635J83j3455N792o1313k9790K2672J4499k9310
14577e3540o994N3215k7869p383K8483J4151J580j0262j71O463j499J647L093
14564I14J1346K8811O552l942k5893j1565j8294q967J2583l2599P929J3322L7620
14551A7817P757q659l5719r457j4889k604K9507J1668o07J9767K3149m6188O347
14538b111k2727M82O6925J498l8030r091J3113J3231k006j5710j3839q561j4947
14525c1773O5436M591j2098j395k610J5354j7625m5112j7187j606j2864l4885
14513i1774R532J1627O2269K3517m9103j2179M1788M4694M3974j7284l7357J6852
$$ plain form
14603 -16649 -16452 34253 62385 42648 30557 49910 35880 5742 10325 28878 39206 39644 19669
14590 19669 20431 28721 20209 31547 37182 37365 23910 29702 -31611 -61401 -38729 -24230 -53540
14577 -53540 -60534 -7319 -35188 -42571 -14088 63 1643 -8619 -8790 -2327 -3826 -2179 914
14564 914 12260 41071 47623 43681 17788 6223 -12071 -21038 -8455 -41054 -33125 -19803 17817
14551 17817 25574 16915 -18804 -28261 -43150 -45754 -16247 -4579 -5186 14581 37730 -8458 -2111
14538 -2111 -24838 -24356 42569 44067 6037 -3054 10059 23290 21284 5574 -8265 -16826 -31773
14525 -31773 33663 38254 26156 24761 22151 37505 19880 -25232 -42419 -44025 -56889 -91774
14513 -91774 -82242 -70615 -8346 15171 -33932 -46111 -4323 40371 84345 67061 29704 46556
14501D6556o884l6732o434L983n702m1395o398N449M8643M9739l4344l1787Q016
14488g290L2648j5850j6590k733l1881k1352l885K9835k993q31N608K031j8595
14475e1878M9413J2063K2926m1965l1077M5489J8603l990k8697j9936K2601J4743
14463H295j4858j8779N138K9163K8832L0891j7313m2333j7158j4959J5511k8149
14451c5719J0982L4317p136J3542J0867j4407k5251l7257k4306L0848q392J063
14439e0849M8526K5132K7997O545l2529q650k5753m1656J9362L0674n308k0337
14427b6846k8360P823L0598J6932r385L926j1372r08R644K8913p740n845j1792
14414d412q703k9636K369L1008J4330j3017q666J6879K933N502J0953j6809j7875
$$ plain form
14501 46556 39672 2940 -3494 489 -5213 -46608 -53006 -47557 1086 50825 16481 -15306 -7290
14488 -7290 25358 9508 -7082 -9815 -41696 -63048 -66933 -37098 -40091 -40922 -35314 -33283 -51878
14475 -51878 -2465 9598 32524 -9441 -40518 4971 23574 19584 -9113 -29049 -6448 8295
14463 8295 -6563 -25342 -20204 8959 37791 68682 51369 9036 -8122 -23081 -7570 -35719
14451 -35719 -24737 9580 2444 15986 26853 12446 -12805 -50062 -74368 -43520 -51912 -50849
14439 -50849 -2323 22809 50806 57351 24822 16172 -9581 -51237 -31875 -1201 -6509 -26846
14427 -26846 -55206 -47383 -16785 147 -9238 -5312 -16684 -17592 -7948 20965 13225 7380 -4412
14414 -4412 -13115 -42751 -40382 -9374 4956 -8061 -16727 152 3085 8587 19540 2731 -15144
14401a5144j0270k2961k8892K7581M8122K9378J7008n0669l5453K5525r829l996
14389b9600K5724j6p943Q306M961k2317l870K7331K3229j4741p377j8571M788
14376a0096L237j3002J3061m219m546J5412J4193M458K5214r692k6844q947r603
14363a1374j8868J505L0698J7961l066j6843K8000N8337J2647l4604n3571p292
14351C530L132j2220j8543K7481P101o643k6550j2392J8425K6168J3375j8494
14339D370J7922J2680k2825K186J9889o748n98n1394l4709j0846L7679L2205j0186
14326a0375q586m4408L5324O2672J6445m358m736k8182p733K2138K2254l849k8176
14313A8430l8379j4739J4466K7129P177Q0k1589j6280p927j3434j1708R31L2126
$$ plain form
14401 -15144 -25414 -48375 -77267 -49686 -1564 27814 44822 -5847 -41300 -15775 -25604 -29600
14389 -29600 -3876 -3892 -11835 -3529 1432 -20885 -24755 2576 25805 11064 3687 -14884 -10096
14376 -10096 -6859 -19861 -6800 -11019 -15565 -153 14040 18498 43712 34020 7176 -1771 -11374
14363 -11374 -30242 -28737 1961 19922 16856 13 28013 86350 98997 64393 10822 3530
14351 3530 6662 -5558 -24101 3380 10481 3838 -22712 -35104 -16679 9489 22864 4370
14339 4370 22292 34972 12147 14333 34222 27474 26876 -24518 -59227 -70073 -32394 -189 -10375
14326 -10375 -18961 -63369 -28045 34627 51072 46714 41978 13796 6063 28201 50455 46606 18430
14313 18430 -19949 -34688 -20222 6907 14084 14164 -7425 -23705 -31632 -45066 -56774 -55843 -23717
14300b3717J5747K4585o8353n7832L5715M6786L8182L848k2849R680K7551J659
14288C1002k4391J1754p753j2945K9088K4644m0799k2506j3100k8347J0106N5434
14276A2187r552j9125j6815J9106M6012J5128J5001o710m4209j026J7245k5274
14264A968l3166j2421K4737K4364q547j0189j3572K90K3020k6065m2787N278O2417
14251d673N6961r914k9183k2819N836K1832J0541J8969j8214j9326q6732R89J7847
14238e7886J5930K1580L8275N353r461j3369L221J7956M790j2619k3004n376K3037
14225H427M5944K9590j8805j3123J8877M8514K0906l9934l0825l169J8979k304
14213H3077j8084l7094k6532P449J6374l480l7349j5102J6042P965J9795J6551
$$ plain form
14300 -23717 -7970 16615 -51738 -109570 -73855 -27069 11113 14961 -7888 1792 29343 31002
14288 31002 6611 18365 10612 -2333 26755 51399 10600 -11906 -25006 -53353 -43247 12187
14276 12187 2635 -16490 -33305 -14199 31813 46941 61942 55232 11023 9997 27242 1968
14264 1968 -31198 -43619 -18882 5482 -3065 -13254 -26826 -26536 -3516 -29581 -72368 -67090 -4673
14251 -4673 52288 42374 13191 -9628 -3792 18040 28581 47550 29336 10010 -76722 -75733 -57886
14238 -57886 -41956 -20376 17899 23252 13791 422 3643 21599 26389 13770 -9234 -14610 8427
14225 8427 54371 83961 65156 52033 70910 119424 140330 100396 69571 66402 85381 83077
14213 83077 64993 27899 1367 8816 25190 21710 -15639 -30741 -14699 -6734 13061 29612
14201B9612j5555l0799j906q426L4815J6926J7189j6665k1679K507k4478l3997
14189e2456K5752P712k1856J3245J2442J5962k2734j8795l6838K5233M5617L421
14177c295J2981K0159m122j1223J2635J2055J6344K2771J8691j4642n7670j7201
14165G483M7192K9279n5164p2043Q463M8091j6824l2694l1901k2617L1050N0423
14153i262l616K4888j670L2386K4983j5339K134J2965k5462k4669J0040q83q653
14140A7842j9667O864p040j8806K31L0638j7337k2555M857K5258j7657j4240J9917
14127a1695L5459J851j0604M562K7428J7855k3746l1639p084k1801K506M7603
14115C0695J8718k1032j857K9440M319k3921K3885j3626n1558K039L5643K1776
$$ plain form
14201 29612 14057 -16742 -18648 -27074 7741 24667 41856 25191 3512 6019 -18459 -52456
14189 -52456 -26704 -18992 -40848 -27603 -15161 801 -21933 -40728 -77566 -52333 -6716 -3295
14177 -3295 9686 29845 25723 14500 27135 39190 55534 78305 96996 82354 24684 7483
14165 7483 54675 83954 28790 -43253 -34790 13301 -3523 -36217 -68118 -90735 -59685 -9262
14153 -9262 -12878 12010 10340 42726 67709 52370 54504 67469 42007 17338 27378 26495 17842
14140 17842 -1825 5039 -2001 -20807 -20576 10062 -7275 -29830 -24973 285 -17372 -31612 -11695
14127 -11695 23764 25615 15011 19573 47001 64856 41110 9471 2387 -19414 -16908 30695
14115 30695 49413 28381 26524 55964 60283 36362 60247 46621 -4937 -2898 32745 54521
14103E4521K679n309J2j06j6559k4219m015N2612R875l5077J7464J1728N315n0801
14089A8120l5473L2845j4080N701l818k7476K7983Q324o260K4710M7586k4578
14077E3584L851J8081k6647j7896k7631K6978J9708k9308j2897O134j3465k0153
14065a9661J6444J9229J3498L820k7020Q219j771K5988j7106k2020k1695K4351
14053B276K3220j0236Q010J4871J7176J26j3096j9532l8540l211L2625N498k4049
14040d862k0707J1216K277m646M9579P25m3849L5399L9240k2074l3102k314k629
14027D253o32J2791l3186K598J754J0937k0405r816K3247Q834M601K8224J6563
14014D9763p842R325j1701j0502m877j1466l011k042J3905j9354O546K2624o038
$$ plain form
14103 54521 57200 51891 51903 51797 35238 11019 7004 59616 69491 34414 51878 63606 68921 18120
14089 18120 -17353 15492 1412 7113 3295 -24181 3802 12126 5866 30576 78162 53584
14077 53584 57435 75516 48869 30973 3342 30320 50028 20720 7823 13957 492 -19661
14065 -19661 -3217 16012 29510 33330 6310 14529 12758 38746 21640 -380 -22075 2276
14053 2276 25496 15260 23270 38141 55317 55443 42347 22815 -15725 -18936 13689 19187 -4862
14040 -4862 -25569 -14353 -12076 -16722 32857 33582 -10267 25132 64372 42298 9196 6882 4253
14027 4253 3621 16412 -16774 -14176 -12422 -1485 -21890 -31706 -8459 375 4976 33200 49763
14014 49763 41921 51246 39545 29043 24166 12700 9689 7647 21552 2198 8744 31368 25330
14001B5330l621M218j480o810n3561p874j0762K5937K9143R140K238K3370l8737
13988c469l1295K9702k271n242j6797j0175q813n3588L7455M1474L1825j9023
13976a0217l5940L8639K3576M0011j7729p515l6878l473l058L6353J8428q586
13964C3611K8776r217k7554L4212N822j7685l736J1424J1788L932j2859j8080
13952D0434j5351o702J4113k938j4740J4257j836j8058O902p921m1223J3095J1253
13939h715Q090K1144L6530q766k8287l7239j8721M188j3035R294L3659R317l237
13926D222J8131J1535K6178j3093q102K9182J5871l1327l4678J1464Q912k584
13914C5711J8591L638j6359J9542o188k2932R346j3600r604j4289l4199l1350
$$ plain form
14001 25330 21709 25927 24447 17637 -35924 -43798 -54560 -28623 520 9660 11898 35268 -3469
13988 -3469 -34764 -5062 -7333 -12575 -29372 -39547 -48360 -101948 -64493 -23019 8806 -10217
13976 -10217 -46157 -7518 16058 56069 38340 30825 -6053 -9526 -12584 23769 42197 33611
13964 33611 62387 53170 25616 59828 65650 47965 44229 55653 67441 71373 58514 40434
13952 40434 25083 18381 32494 29556 14816 29073 27237 9179 16081 8160 -33063 -19968 -8715
13939 -8715 -625 20519 57049 48283 19996 -17243 -35964 -31776 -44811 -35517 -1858 7459 4222
13926 4222 22353 33888 60066 46973 38871 68053 83924 52597 17919 29383 38295 35711
13914 35711 54302 57940 41581 61123 54935 32003 41349 27749 18145 3856 -30343 -61693
13902f1693R18J8801L3849K2383q617m4382n310M4951n552k6181k1186k6070j0579
13889h8668K0187J8954j4787p008L7667M8893J571k1033L9300M6776j3389l2942
13877C5521k9019j877p270J2098n483k8514M0554L7854k0178l7913j5281P038
13865a2470j2366Q186K2995K2953j7083k8881j3566L8645j2099j8238J3495Q283
13853a46o846Q759j3951k6514L3828L1061O146j0755P894J0709J1245j2605n367
13840C3458j3492J989K708l9520k1182M997j154J7857J69K5418L0821J2175l2299
13827B1945J8488R881J9831n744l6934j1617K7867j9619j396N0705J21m2272O484
13814C7740O856Q534J4546O582m9157j9234J4621j4537k679L9608J2424L4210
$$ plain form
13902 -61693 -60775 -41974 -8125 14258 5641 -38741 -44051 900 -4652 -30833 -52019 -78089 -88668
13889 -88668 -68481 -49527 -64314 -71322 -33655 15238 16809 -4224 35076 81852 68463 35521
13877 35521 6502 4625 -2645 9453 3970 -24544 16010 53864 33686 -4227 -19508 -12470
13865 -12470 -24836 -16650 6345 29298 12215 -16666 -30232 8413 -3686 -21924 -8429 -146
13853 -146 -6992 1767 -12184 -38698 -4870 26191 32337 21582 29476 40185 51430 38825 33458
13840 33458 19966 21955 24663 -14857 -36039 -31042 -32196 -14339 -14170 11248 42069 54244 21945
13827 21945 40433 50314 70145 64401 27467 15850 43717 24098 22702 73407 73528 31256 37740
13814 37740 44596 53130 67676 74258 25101 5867 20488 5951 3272 42880 55304 89514
13802H9514k7909k8029J9517L517J846j2898j1340k9039O248l8646n1578M771
13790g4026n508J9883M095J4961J1512j8652K096o324L4603O677K3229q732l342
13777D72k6675Q671J9738K6359k8303k9964j8480J821j729J1266J3109M816p59
13764a9658J224J8533J3900n879J4908K3591k5858q149M889o123J9670j7732k2876
13751i560J1012j4030l013J1340j9307k558q683L1072J5935J6570L4493N0828
13739A14099k4314P857l6538m6945k5085k1522j4155k0821j748P780k7956r53
13727i0301N9650J2155m9061k856J7236L6805K0698k0182k1870K795j3270m0679
13715h8880j801R694M6978K0017L1224j2693m3801j9691k150R614q82J5467J7259
$$ plain form
13802 89514 61605 33576 53093 56610 58456 45558 34218 5179 11427 -27219 -78797 -74026
13790 -74026 -79534 -59651 -55556 -40595 -29083 -47735 -45639 -51963 -17360 -10683 12546 3814 472
13777 472 -26203 -17532 2206 28565 262 -29702 -48182 -46361 -48090 -36824 -23715 -18899 -19658
13764 -19658 -18434 99 13999 8120 23028 46619 20761 12612 17501 11378 31048 13316 -9560
13751 -9560 1452 -12578 -15591 -4251 -23558 -26116 -34799 -3727 12208 28778 63271 114099
13739 114099 89785 97642 61104 14159 -10926 -32448 -46603 -67424 -69172 -61392 -89348 -90301
13727 -90301 -30651 -18496 -67557 -70413 -53177 -16372 4326 -15856 -37726 -34931 -48201 -88880
13715 -88880 -90681 -80987 -34009 -13992 17232 4539 -39262 -58953 -61103 -51489 -52371 -36904 -19645
13702a9645l6803J8743J0532J7412N6687K5297l2170o2139l3099K6856J8109M640
13690e580m0162j4207J3907j4462j2568L3377M6979N7702n360k6814J0954k0057
13678B3709Q974Q020n4688K7631P1091K0645n816J6869j6036m4132m1120j3366
13666A781q701k2167M5079j2540l0968K2988K5773K074l0358j9127J3482K0106
13654G422J1350N288q471k1432n7058j4174M9657O4883n398k2415K2692j0591
13642B1753l4837l266M9344r126j7613O026p574J9997J5323J2962o717K8433L7855
13629A12560m984n5454n7798j9387K1396J2064k3811Q969N2355K907l1568m0008
13617b2759L335P778M4892J9495k3721l9228l312R989j5310K9124K816J5974o175
$$ plain form
13702 -19645 -56448 -37705 -27173 -9761 46926 72223 40053 -22086 -55185 -28329 -10220 -5580
13690 -5580 -45742 -59949 -46042 -60504 -73072 -39695 7284 64986 59626 32812 43766 23709
13678 23709 32683 40703 -13985 13646 84737 105382 99566 116435 100399 56267 15147 1781
13666 1781 -6920 -29087 15992 3452 -27516 -4528 21245 23319 -7039 -26166 -12684 7422
13654 7422 18772 24060 15589 -5843 -62901 -77075 -27418 37465 32067 9652 32344 21753
13642 21753 -13084 -16350 32994 23868 6255 12281 4707 24704 40027 52989 46272 74705 112560
13629 112560 107576 52122 -5676 -25063 -3667 8397 -15414 -6445 45910 48817 17249 -22759
13617 -22759 -19424 -11646 33246 52741 29020 -10208 -13520 -3531 -18841 10283 13099 29073 22898
13604B2898k1977l0240j5461K2624L1171O126j8033R066J5077J2609J2883p170
13592C9573j6283m4242J6519k1470j2401k6125Q004N879J0242K2174J0913O158
13580a059m91j0580J5927P578q118q886K5559L2825m600l1214k5386j0028J3242
13567e231J0121l211L088J9978R038k314r340l2859J8841K0185k6746j2344J592
13554i202q022j3027O505J0956M3080J5962l3159k16L0250J861j9515j524M957
13541B8906L080J120l3291k2158J6241k0337j0832j2642R284J7512j9938l2669
13529g5724K0124m445j5149K0018M0980L376K966L9393O869J1484J859k5908k2293
13516C550k4431j0941k3309K4503L5046l2582l059L3986J6151O816n298j8007
$$ plain form
13604 22898 921 -29319 -44780 -22156 9015 15141 -2892 6174 21251 33860 46743 39573
13592 39573 23290 -20952 -4433 -25903 -38304 -64429 -56425 -50546 -40304 -18130 -7217 -1059
13580 -1059 -1550 -12130 3797 11375 3257 -5629 19930 52755 48155 16941 -8445 -18473 -5231
13567 -5231 4890 1679 4767 24745 33783 31469 22129 -10730 8111 28296 1550 -10794 -9202
13554 -9202 -17224 -30251 -23746 -12790 30290 46252 13093 12877 43127 44988 25473 23949 28906
13541 28906 31986 33106 -185 -22343 -6102 -26439 -37271 -49913 -40629 -23117 -43055 -75724
13529 -75724 -55600 -60045 -75194 -55176 -14196 -10820 -7854 31539 38408 49892 51751 25843 3550
13516 3550 -20881 -31822 -55131 -30628 4418 -28164 -31223 2763 18914 25730 20432 2425
13504B425m2683J3720J3915O472k637N1212J7288m7263Q965k78j688j7649J4865
13491A6664o16n0669p506K4229K4647L0876k3761k8351l2041k6504J4103J8541
13479d0388J8652J2523j8001l1463o905M0927J202J4663K2074K3799l4618j8199
13467a5734O469p928K3610J5169k216J8302j7785o376M1150J39k5208r263q029
13454A2300J7289j8048k1434l2816q853K9973J0407K6525l575k0343j3681j9378
13442d1634K8099L0549M0470K640j6024m4896r523k2534k0739L268K7692M5296
13430B2664p2j9840j1323M354n284r621J5642J4111J8275j8503m4180j1215J7859
13417b7133m707J5677O55J952k8102J9250J4243n941J4679K1378J3232l4874k420
$$ plain form
13504 2425 -40258 -26538 -12623 -6151 -8788 42424 59712 12449 21414 21136 19448 1799 16664
13491 16664 16048 -34621 -42127 -17898 6749 37625 13864 -14487 -46528 -73032 -58929 -40388
13479 -40388 -21736 -9213 -27214 -58677 -65582 -24655 -23453 -8790 13284 37083 2465 -15734
13467 -15734 -9265 -17193 6417 21586 19370 37672 19887 13511 54661 54800 29592 20329 12300
13454 12300 29589 11541 -9893 -42709 -51562 -21589 -11182 15343 11768 -8575 -22256 -41634
13442 -41634 -13535 17014 57484 60124 44100 -796 -10319 -32853 -53592 -50324 -22632 22664
13430 22664 22592 2752 -8571 -4217 -9501 -19122 -3480 10631 28906 10403 -33777 -44992 -27133
13417 -27133 -31840 -16163 -15508 -13556 -41658 -22408 -8165 -14106 573 21951 35183 309 -2111
13404b111J108j6201m869j8805p220j79j8533K2634K1181K3975O34K7436k8819
13391B31P111L8053k8521J5179K3855L3920j3600k0513o5889o0938k4575N2315
13379d3372P6347j3393k6804m3060J2910L5443m391j590k028N475K0696j8751
13367b518j8319J5436K9335j9060j4198J9734k5473m6655L1960K8767r467k226
13355a2684L1074k464j9745j7727J3991n983J2425N2289L8397m6380l9490N182
13343H885L414l9294j9189K6582N4695K0343l2424Q705j5164k0636J8264K6524
13331D0705m1814M76M4469l0807j1620K6980J5022l5198l3329J2050q995K4701
13319B640j4127R659M3228J3437Q265j6812p844J2244m3858O117J8794J3993J4290
$$ plain form
13404 -2111 -1003 -17204 -22073 -40878 -48098 -48277 -66810 -44176 -22995 980 1614 29050 231
13391 231 7342 45395 16874 32053 55908 89828 76228 55715 -10174 -71112 -95687 -43372
13379 -43372 32975 19582 -7222 -50282 -37372 -1929 -6320 -7910 -9938 -4463 16233 -2518
13367 -2518 -20837 -5401 23934 4874 -9324 10410 -15063 -61718 -29758 -991 -10458 -12684
13355 -12684 18390 15926 -3819 -21546 -7555 -13538 -1113 51176 89573 43193 3703 8885
13343 8885 12299 -26995 -46184 -19602 35093 55436 23012 31717 16553 -4083 14181 40705
13331 40705 -1109 -633 43836 13029 1409 28389 43411 8213 -25116 -13066 -22061 2640
13319 2640 -11487 -1828 41400 54837 63102 46290 38446 50690 6832 12949 31743 45736 60026
13306F0026K898k3564m5331m32K4205P794k5518k1156q947O905k0394l3154L296
13293g3372K1800K1800J3893K4153K7134k6429p421M324K0781M707n4033j1332
13281c3995K9484M371J1239K9133k0510l5723J5672J799L4656K7696M02o2090
13269B134Q798j0016J4887K331J797k9435o361m77K3306j4744J7358J0167O195
13256B5940J1493o539k2872O011J0767j6707q785l4475L4572L2910K538k9629
13244E224L079J5036m367k9844p477k661j995J0617P054P081k6629J7278M1568
13231C3964K0369p526j2202k8923j3606K3430K9798n247o4186k8280l572L6759
13219a9222K6521J187P063k3132o815K5060j3636j8295p466J4656k4595k722J1502
$$ plain form
13306 60026 62924 39360 -5971 -6403 17802 25596 78 -21078 -30025 -23120 -43514 -76668 -73372
13293 -73372 -51572 -29772 -15879 8274 35408 8979 1558 5882 26663 31370 -22663 -33995
13281 -33995 -4511 -140 11099 40232 19722 -16001 -329 1470 36126 63822 64224 2134
13269 2134 10932 916 15803 18134 19931 -9504 -15865 -16342 6964 -7780 9578 19745 25940
13256 25940 37433 30894 8022 14033 24800 8093 -692 -35167 -595 32315 34853 5224
13244 5224 8303 23339 18972 -10872 -18349 -21010 -23005 -12388 -5334 1747 -24882 -7604 33964
13231 33964 54333 46807 34605 5682 -7924 15506 45304 40057 -24129 -52409 -55981 -19222
13219 -19222 7299 8486 15549 -7583 -14398 10662 -2974 -21269 -28735 -14079 -38674 -41396 -29894
13206b9894K2599L3267n707k3183K1964j664P174q456l2409l207m630L1667L4329
13193D1850L723K7943Q652j1057j6911j2842j6651j1025k5840j0018j7978L003
13181c7151K346J3368Q544k744J0148R983j9311n055j7249j4808j9507M06J0273
13168f0757L4734M2451j0244k7718K0245L336m4064m562K1738M5428m756m786
13156A1045j8168j5488J5429m5572o5774k115M5382J8290k2207J0618R837O850
13144e1873j0853J9250J2485L2716L4613j991k0079k2843R310l589j0357P048
13132f163M5046r78k915p895j9522R558p628l1927M991K4566j2435P815N744k9960
13118b1703n8r909r961M0222M1340J0161k1123k5506k3605J4661K5012m0445j1705
$$ plain form
13206 -29894 -7295 25972 20265 -2918 19046 17382 24556 16100 -16309 -19516 -24146 7521 41850
13193 41850 45573 73516 82168 71111 54200 41358 24707 13682 -12158 -22176 -40154 -37151
13181 -37151 -34805 -21437 -12893 -15637 -5489 4494 -14817 -19872 -37121 -51929 -71436 -71030 -60757
13168 -60757 -26023 16428 6184 -21534 -1289 2047 -42017 -46579 -24841 20587 15831 11045
13156 11045 -7123 -22611 -7182 -52754 -118528 -120643 -75261 -56971 -79178 -68560 -58723 -51873
13144 -51873 -62726 -43476 -30991 1725 36338 34347 14268 -8575 735 -2854 -13211 -6163
13132 -6163 38883 37905 34990 27095 7573 17131 9503 -22424 -17433 7133 -5302 2513 8257 -21703
13118 -21703 -21761 -31670 -41631 -1409 39931 50092 28969 3463 -20142 -5481 19531 -20914 -32619
13105c2619J6229J2850L044K1543j5841M7969K2755r870m116m0475k4215j544
13093d290J5371k3074K561m9984J0091L2512L3405J0396L6816M0058n328o0337
13081C8197o4296m9352J6157J0312m97K6728L949J4894Q458m0515j619K4045n234
13068a8773L273L4719M954k8102k4214J761J3566K7357M5911j5571l6625o803
13056A453j1251J3226M3104n063l3793k6341J0379l489K1279J6235j9422l3135
13044b6818l7265K349J091J1475M8201R553j6151j1336k6192J7311L6625K740
13032A1583l0088o429K6068p419j6878j4049N577M816m7448j5055N1258J5863
13020b2201M1230L1508k9028j5292k856L1076O697k8908l2337J3345J3106L4009
$$ plain form
13105 -32619 -16390 -3540 -496 21047 5206 53175 75930 66060 61944 21469 -2746 -4290
13093 -4290 11081 -11993 -9432 -59416 -49325 -16813 16592 26988 63804 103862 98534 38197
13081 38197 -26099 -75451 -59294 -48982 -49479 -22751 -18802 -3908 4550 -35965 -37584 -13539 -18773
13068 -18773 -15500 19219 24173 -3929 -28143 -26382 -12816 14541 60452 44881 8256 1453
13056 1453 -9798 3428 46532 41469 7676 -18665 -8286 -11775 9504 25739 6317 -26818
13044 -26818 -64083 -61734 -60643 -49168 -967 8586 -7565 -18901 -45093 -27782 8843 11583
13032 11583 -18505 -24934 1134 -6285 -23163 -37212 -31635 -26819 -74267 -89322 -38064 -22201
13020 -22201 19029 50537 21509 6217 3361 34437 41134 12226 -20111 -6766 6340 40349
13008D0349k6142k9655J0295M8087P758k3918j5968L7992L4374j6292j6192j5063
12996C5625m0194p849K8653j9911O588K3543J3227N659r033k7234j6614K1269
12984A3729J3791j1954k8570l2536j5506j7377L3881p245J5663K3278J1068r36
$$ plain form
13008 40349 14207 -15448 -5153 42934 50692 26774 10806 48798 83172 66880 50688 35625
12996 35625 -4569 -12418 16235 -3676 2912 26455 39682 45341 36308 9074 -7540 13729
12984 13729 27520 15566 -13004 -45540 -61046 -78423 -44542 -51787 -36124 -12846 -1778 -2714
$$ [...]
##END NTUPLES=NMR SPECTRUM
##END=
