##TITLE=Analysis number 324595
Compound Code sb 00762
Project Code adrs
Chemist Name ians
##JCAMPDX= 6.0         $$ Bruker NMR JCAMP-DX V2.0
##DATA TYPE= NMR SPECTRUM
##DATA CLASS= NTUPLES
##ORIGIN= Bruker BioSpin GmbH
##OWNER= nmr
$$ XWIN-NMR		Version 3.5
$$ Mon Nov 27 14:40:49 2006 GMT Standard Time (UT+0h)  MAYBRIDGE\nmr@NMR_250MHZ
##.OBSERVE FREQUENCY= 250.131544655141
##.OBSERVE NUCLEUS= ^1H
##.ACQUISITION MODE= SIMULTANEOUS (DQD)
##.ACQUISITION SCHEME= undefined
##.AVERAGES= 16
##.DIGITISER RES= 18
##SPECTROMETER/DATA SYSTEM= dpx250
##.PULSE SEQUENCE= zg30
##.SOLVENT NAME= CDCl3
##.SHIFT REFERENCE= (INTERNAL, CDCl3, 0, 16.522)
##AUDIT TRAIL= $$ (NUMBER, WHEN, WHO, WHERE, WHAT)
$$ ##TITLE= Audit trail, XWIN-NMR		Version 3.5
$$ ##JCAMPDX= 5.01
$$ ##ORIGIN= Bruker BioSpin GmbH
$$ ##OWNER= nmr
$$ C:\u/data/dgb/nmr/ADRS/1200/pdata/1/auditp.txt
$$ ##AUDIT TRAIL=  $$ (NUMBER, WHEN, WHO, WHERE, WHAT)
(   1,<2006-11-27 14:40:03.86 +000>,<MAYBRIDGE\nmr>,<NMR_250MHZ>,
      <created by zg, POWCHK disabled, PULCHK disabled
       configuration hash MD5:
       49 4B E0 1D 92 C2 6B 37 9F E6 65 BC 52 41 86 1D
       data hash MD5: 64K
       7F 30 65 D4 DA BF 10 0A 0E 59 21 D6 3C 28 FC CA>)
(   2,<2006-11-27 14:40:23.48 +000>,<MAYBRIDGE\nmr>,<NMR_250MHZ>,
      <Start of raw data processing
       ef LB = 0.3 FT_mod = 6 PKNL = 1 SI = 32K 
       data hash MD5: 32K
       2A D5 E8 3D 65 95 40 E2 C8 41 6E A8 BD 82 CE 57>)
(   3,<2006-11-27 14:40:29.84 +000>,<MAYBRIDGE\nmr>,<NMR_250MHZ>,
      <apk 
       data hash MD5: 32K
       B6 D4 0E C8 7B 64 4C 52 A3 6F 7F 1C FE F1 46 7C>)
(   4,<2006-11-27 14:40:31.39 +000>,<MAYBRIDGE\nmr>,<NMR_250MHZ>,
      <abs ABSG = 5 
       data hash MD5: 32K
       5C 61 66 24 46 52 57 FE E8 3D 37 F2 5B FC BB 94>)
$$ ##END=
$$ 
$$ hash MD5
$$ 36 A8 D6 E8 BE C3 B4 B2 FD 76 3D 5B 78 6A 18 8F
##$RELAX= 
##$RELAX= 
##$RELAX= 
##$RELAX= 
##$RELAX= 
##$RELAX= 
##$RELAX= 
$$ Bruker specific parameters
$$ --------------------------
##$DU= <C:\u>
##$EXPNO= 1200
##$NAME= <ADRS>
##$PROCNO= 1
##$TYPE= <nmr>
##$USER= <dgb>
##$AMP= (0..31)
100 100 100 100 100 100 100 100 100 100 100 100 100 100 100 100 100 100 
100 100 100 100 100 100 100 100 100 100 100 100 100 100 
##$AQSEQ= 0
##$AQ_mod= 3
##$AUNM= <au_zg>
##$AUTOPOS= <4 >
##$BF1= 250.13
##$BF2= 250.13
##$BF3= 250.13
##$BF4= 250.13
##$BF5= 500.13
##$BF6= 500.13
##$BF7= 500.13
##$BF8= 500.13
##$BYTORDA= 1
##$CFDGTYP= 0
##$CFRGTYP= 5
##$CHEMSTR= <none>
##$CNST= (0..31)
1 1 145 1 1 1 1 1 1 1 1 1 1 1 1 1 1 1 1 1 1 1 1 1 1 1 1 1 1 1 1 1 
##$CPDPRG= <>
##$CPDPRG1= <>
##$CPDPRG2= <>
##$CPDPRG3= <>
##$CPDPRG4= <mlev>
##$CPDPRG5= <mlev>
##$CPDPRG6= <mlev>
##$CPDPRG7= <mlev>
##$CPDPRG8= <mlev>
##$CPDPRGB= <>
##$CPDPRGT= <>
##$D= (0..31)
0 1 0 0 0 0 0 0 0 0.06 0 0 0 0 0 0 0.0002 0 0 0 0 0 0 0 0 0 0 0 0 0 0 
0 
##$DATE= 1164638401
##$DBL= (0..7)
120 120 120 120 120 120 120 120 
##$DBP= (0..7)
150 150 150 150 150 150 150 150 
##$DBP07= 0
##$DBPNAM0= <>
##$DBPNAM1= <>
##$DBPNAM2= <>
##$DBPNAM3= <>
$$ [...]
##$SUBNAM7= <"">
##$SUBNAM8= <"">
##$SUBNAM9= <"">
##$SW= 20.6930455092707
##$SWIBOX= (0..15)
0 0 3 0 0 0 0 0 0 0 0 0 0 0 0 0 
##$SW_h= 5175.983436853
##$TD= 65536
##$TD0= 1
##$TE= 295.16
##$TE2= 300
##$TE3= 300
##$TEG= 300
##$TL= (0..7)
0 120 120 120 120 120 120 120 
##$TP= (0..7)
150 150 150 150 150 150 150 150 
##$TP07= 0
##$TPNAME0= <>
##$TPNAME1= <>
##$TPNAME2= <>
##$TPNAME3= <>
##$TPNAME4= <>
##$TPNAME5= <>
##$TPNAME6= <>
##$TPNAME7= <>
##$TPOAL= (0..7)
0.5 0.5 0.5 0.5 0.5 0.5 0.5 0.5 
##$TPOFFS= (0..7)
0 0 0 0 0 0 0 0 
##$TUNHIN= 0
##$TUNHOUT= 0
##$TUNXOUT= 0
##$USERA1= <user>
##$USERA2= <user>
##$USERA3= <user>
##$USERA4= <user>
##$USERA5= <user>
##$V9= 5
##$VALIST= <valist>
##$VCLIST= <CCCCCCCCCCCCCCC>
##$VD= 0
##$VDLIST= <DDDDDDDDDDDDDDD>
##$VPLIST= <PPPPPPPPPPPPPPP>
##$VTLIST= <TTTTTTTTTTTTTTT>
##$WBST= 1024
##$WBSW= 4
##$XGAIN= (0..3)
0 0 0 0 
##$XL= 0
##$YL= 0
##$YMAX_a= 560384
##$YMIN_a= -678749
##$ZGOPTNS= <>
##$ZL1= 120
##$ZL2= 120
##$ZL3= 120
##$ZL4= 120
##$ABSF1= 16.522
##$ABSF2= -4.171173
##$ABSG= 5
##$ABSL= 3
##$ALPHA= 0
##$AQORDER= 0
##$ASSFAC= 0
##$ASSFACI= 0
##$ASSFACX= 0
##$ASSWID= 0
##$AUNMP= <proc_1d>
##$AZFE= 0.1
##$AZFW= 0.1
##$BCFW= 0
##$BC_mod= 0
##$BYTORDP= 0
##$COROFFS= 0
##$CY= 12.5
##$DATMOD= 1
##$DC= 0
##$DFILT= <>
##$DTYPP= 0
##$F1P= 14.0000005364418
##$F2P= -0.99999901652339
##$FCOR= 0.5
##$FTSIZE= 32768
##$FT_mod= 6
##$GAMMA= 0
##$GB= 0
##$INTBC= 1
##$INTSCL= 1
##$ISEN= 128
##$LB= 0.3
##$LEV0= 0
##$LPBIN= 0
##$MAXI= 10000
##$MC2= 0
##$MEAN= 0
##$ME_mod= 0
##$MI= 0
##$NCOEF= 0
##$NC_proc= -4
##$NLEV= 6
##$NOISF1= 0
##$NOISF2= 0
##$NSP= 0
##$NTH_PI= 0
##$NZP= 0
##$OFFSET= 16.522
##$PC= 1
##$PHC0= 226.1034
##$PHC1= -4.538349
##$PH_mod= 1
##$PKNL= yes
##$PPARMOD= 0
##$PSCAL= 4
##$PSIGN= 0
##$REVERSE= no
##$SF= 250.13
##$SI= 32768
##$SIGF1= 0
##$SIGF2= 0
##$SINO= 400
##$SIOLD= 32768
##$SREGLST= <1H.CDCl3>
##$SSB= 0
##$STSI= 32768
##$STSR= 0
##$SW_p= 5175.98343685301
##$SYMM= 0
##$S_DEV= 0
##$TDeff= 65536
##$TDoff= 0
##$TI= <Analysis number 999999
Compound Code 99
Book Reference 9
Project Code 9>
##$TILT= no
##$TM1= 0
##$TM2= 0
##$TOPLEV= 0
##$USERP1= <user>
##$USERP2= <user>
##$USERP3= <user>
##$USERP4= <user>
##$USERP5= <user>
##$WDW= 1
##$XDIM= 32768
##$YMAX_p= 445265360
##$YMIN_p= -246081
$$ End of Bruker specific parameters
$$ ---------------------------------
##NTUPLES= NMR SPECTRUM
##VAR_NAME=  FREQUENCY,     SPECTRUM/REAL,   SPECTRUM/IMAG
##SYMBOL=    X,             R,               I
##VAR_TYPE=  INDEPENDENT,   DEPENDENT,       DEPENDENT
##VAR_FORM=  AFFN,          ASDF,            ASDF
##VAR_DIM=   32768,         32768,           32768
##UNITS=     HZ,            ARBITRARY UNITS, ARBITRARY UNITS
##FACTOR=    0.157963299565203, 1,           1
##FIRST=     4132.6476996994, 0,             0
##LAST=      -1043.33573715361, 0,           0
##MIN=       -1043.33573715361, -246081,     0
##MAX=       4132.6476996994, 445265360,     0
$$ Real data points
##PAGE= N=1
##DATA TABLE= (X++(R..R)), XYDATA
$$ [...]
24709b3927L74J879r132N259k5659P920R493K6296L179m103J7625K9293K267m02
$$ -23927 -23553 -21674 -30806 -25547 -51206 -43286 -33793 -7497 -4318 -8421 9204 38497 40764 40362
24695D0362j5701p227L041r342j1117K4258K08p07j428R655J0096j0910j2268
$$ 40362 24661 17434 20475 11133 16 24274 24482 23775 22347 32002 42098 31188 18920
24682A8920R682k2726m194Q838K0413O175j2575J5699k92l3614m1425n34M625
$$ 18920 28602 5876 1682 10520 30933 37108 24533 40232 39940 6326 -35099 -35633 -31008
24669c1008K0216N16k0121R024j0679M8085L5835k8967k6450j7216J8422l682
$$ -31008 -10792 -10276 -30397 -21373 -32052 16033 51868 22901 -3549 -20765 -2343 -6025
24657f025j8759o635Q129J3387J4052P902J0919N190r096k1692k6384j0094K7842
$$ -6025 -24784 -31419 -23290 -9903 4149 12051 22970 28160 19064 -2628 -29012 -39106 -11264
24644a1264L4774J000q574j2682p925J4668M510k6101O091J2476j131k3652q388
$$ -11264 23510 24510 15936 3254 -4671 9997 14507 -11594 -5503 6973 5842 -17810 -26198
24631b6198K3241J162k3569l881K0256j6347j1164J1426J3161K4357k6967m638
$$ -26198 -2957 -1795 -25364 -29245 -8989 -25336 -36500 -25074 -11913 12444 -14523 -19161
24619a9161L3131j2432k0862J651J9166o740Q061R269m985l927j3988M396K441
$$ -19161 13970 1538 -19324 -17673 1493 -5247 2814 12083 7098 3171 -10817 -6421 -3980
24606c980O067P846L4429k5654m1751j410J6425N960J7711k4972n547l4477j4085
$$ -3980 2087 9933 44362 18708 -23043 -24453 -8028 -2068 15643 -9329 -14876 -49353 -63438
24593f3438J8093L1643P455J8664J9971m463l4627p456J1444j8430j3903L2971
$$ -63438 -45345 -13702 -6247 12417 32388 27925 -6702 -14158 -2714 -21144 -35047 -2076
24581b076J4878m48j3535k8342j8419j8962J9895L4888J8366N506j3240k2064
$$ -2076 12802 12354 -1181 -29523 -47942 -66904 -47009 -12121 6245 11751 -1489 -23553
24569b3553M364J3213r458q325m0455j3564J5282l776J2106J7583K1634J5933
$$ -23553 -19189 -5976 -15434 -23759 -64214 -77778 -62496 -66272 -54166 -36583 -14949 984
24557I84r808r855k7386j0732J4335J5393K0735Q352K2093j6084k7379Q510J0100
$$ 984 -8824 -18679 -46065 -56797 -42462 -27069 -6334 2018 24111 8027 -19352 -10842 -742
24544g42j4351j7213J0953N098J5780Q530J6705j6070q91K262J0311n781O323
$$ -742 -15093 -32306 -21353 -16255 -475 8055 24760 8690 7799 10061 20372 14591 20914
24531B0914Q960j0467q855j0649K0213k1387J4097j0163k6051j0595J5549K7577
$$ 20914 29874 19407 10552 -97 20116 -1271 12826 2663 -23388 -33983 -18434 9143
24519I143K3516K2222j6291k7585k8157j3945J2770R327n722k8336o692J7129
$$ 9143 32659 54881 38590 11005 -17152 -31097 -18327 -9000 -14722 -43058 -49750 -32621
24507c2621L5382M095n119J3788k6688k5375K92r376R543j13K05J2982M122J8741
$$ -32621 2761 6856 1737 15525 -11163 -36538 -36246 -45622 -36079 -36192 -35987 -23005 -18883 -142
24493a42L2791K0978j1655k424J118K2345k3232l9915k2618K9179O264O028Q404
$$ -142 32649 53627 41972 39548 40666 63011 39779 -136 -22754 6425 12689 18717 27121
24480B7121m686j3184K575l880j1556O862J2486l780J8892n375l317J5769k8468
$$ 27121 22435 9251 11826 7946 -3610 3252 15738 11958 30850 25475 22158 37927 9459
24467I459J5901J2023r525J2273J729j2689k1937J272j5676j8361j1132L370J306
$$ 9459 25360 37383 27858 40131 41860 29171 7234 8506 -7170 -25531 -36663 -33293 -31987
24454c1987K1259K2423m151K8222l226j0568k830J508j0311j5997J1823J9475
$$ -31987 -10728 11695 7544 35766 32540 21972 19142 20650 10339 -5658 6165 25640
24442B5640o726j2078k320k3383j149l388p544K2356J584m329m797L6251J8515
$$ 25640 18914 6836 4516 -18867 -20016 -23404 -30948 -8592 -7008 -11337 -16134 20117 38632
24429C8632k2246L978J3387o497k2690k4065O438m098J1006j9702k2186j273J5809
$$ 38632 16386 20364 33751 27254 4564 -19501 -13063 -17161 -6155 -25857 -48043 -49316 -33507
24416c3507K5228J358N439M110m446Q904J6156J9837l468j2224l9808m0206L329
$$ -33507 -8279 -6921 -1482 2628 -1818 7086 23242 43079 39611 27387 -12421 -52627 -49298
24403d9298J3110o419J265K0846n767r699K128Q081K2408k8492j7010J0797J5316
$$ -49298 -36188 -42607 -41342 -20496 -26263 -35962 -33834 -25753 -3345 -31837 -48847 -38050 -22734
24390b2734Q85L607J1526o158O414J0445j1298J2008l987qk2009l925J8080J1716
$$ -22734 -21849 -18242 -6716 -12874 -6460 3985 -7313 4695 708 700 -21309 -25234 -7154 4562
24376D562J4962M944j9437j275J3117j8670J165n286M554P438k3499j9597o691
$$ 4562 19524 24468 5031 3756 16873 -1797 -632 -5918 -1364 6074 -17425 -37022 -43713
24363d3713L9390K8129j725l258j109o820j0787N040n097j2737P70N427J3248
$$ -43713 -4323 23806 22081 18823 17714 10894 107 5147 50 -12687 -11917 -6490 6758
24350F758j5978j322L6053j5975p694K5892j1680j9006k13j8359l26K5640K3688
$$ 6758 -9220 -10542 25511 9536 1842 27734 16054 -2952 -3165 -21524 -21850 3790 27478
24337B7478J6165q550k9068l3104J5178J096K832J0340r016j4608J4210K555j5079
$$ 27478 43643 35093 6025 -27079 -11901 -10805 -7973 2367 -6649 -21257 -7047 -4492 -19571
24324a9571J1478m020J1803L0318j0130l0510p252j1558L1368J8295j5128n7324
$$ -19571 -8093 -12113 -310 30008 19878 -10632 -17884 -29442 1926 20221 5093 -52231
24312e2231j9767J0400j7632J9982K8120M5859K6290j7127k5286O10N504K1060
$$ -52231 -71998 -61598 -79230 -59248 -31128 14731 41021 23894 -1392 -782 4722 25782
24300B5782j8203k0856o96J1173J2418j7237P139J2435n533l8634k599n235J6148
$$ 25782 7579 -13277 -13973 -2800 9618 -7619 -480 11955 6422 -32212 -34811 -40046 -23898
24287b3898K6323J2715J0496j5664m0474k9238J283J9954M1693J6640K541j4187
$$ -23898 2425 15140 25636 9972 -30502 -59740 -58457 -38503 3190 19830 22371 8184
24275H184q436j3446l2591j5092J3377J7583J3607J7825n55j0212O155Q814l663
$$ 8184 -252 -13698 -46289 -61381 -48004 -30421 -16814 1011 456 -9756 -3601 5213 1550
24262A550k5165M712J9290p287N533j1223k8997l5283J7767M3309l359l4057j7049
$$ 1550 -23615 -18903 387 -6900 -1367 -12590 -41587 -76870 -59103 -15794 -19153 -53210 -70259
24249g0259M4328N656k4358K7441K7823R898J1338J1274P706j8169q058K7153
$$ -70259 -25931 -20275 -44633 -17192 10631 20529 31867 43141 50847 32678 24620 51773
24237E1773k0126k3526Q834R810J3165j1878k3380j0563l9244k229R21j243M788
$$ 51773 31647 8121 16955 26765 39930 28052 4672 -5891 -45135 -47364 -46443 -47686 -42898
24224d2898q326J5750q684n400K5664J2554j721K771N253j1685q122J0617R626
$$ -42898 -51224 -35474 -44158 -49558 -23894 -11340 -13061 -10290 -5037 -16722 -24844 -14227 -4601
24211d601l141l7239J7095M4040J0669r754o836J2348K0399k895m7028L7494L381
$$ -4601 -7742 -44981 -27886 16154 26823 17069 10233 22581 42980 40085 -6943 30551 33932
24198C3932J1584j1568k5808L040K4042J2763N645j2552j5744L610j6773l6707
$$ 33932 45516 33948 8140 11180 35222 47985 53630 41078 25334 28944 12171 -24536
24186b4536j2141p946J6991m930k1219K6270O4517M2816J58K528j2924q841M1562
$$ -24536 -36677 -44623 -27632 -32562 -53781 -27511 37006 79822 79980 82508 69584 60743 102305
24173A02305K4412J6893q592K950K8127M0632K4073O2788O5243N9965N2329L2530
$$ 102305 126717 143610 135018 137968 166095 206727 230800 293588 358831 418796 471125 503655
24161E03655Q2896J11832J13967J25243J83986K68231M31965O15809P99114R53604
$$ 503655 586551 698383 812350 937593 1121579 1389810 1821775 2437584 3236698 4190302
24151D190302R55477O70260J09395m28326q55379j099604j055202p54521m94432
$$ 4190302 5145779 5816039 5925434 5497108 4641729 3542125 2486923 1732402 1237970
24142A237970l10104j92807j31228o9716p5409n4036m6470m2773l2390o0837k7499
$$ 1237970 927866 735059 603831 534115 458706 404670 358200 315427 283037 222200 194701
24131A94701m0979l4651k0352J3972J496m720n2092o759K1962K9542K640k0843
$$ 194701 153722 119071 98719 112691 114187 109467 57375 50616 72578 102120 104760 83917
24119H3917j8036k126j2288r942Q584Q108J25N276r182p352j9948j7308m563j505
$$ 83917 65881 63755 51467 41525 50109 58217 58342 63618 54436 47084 27136 9828 5265 3760
24105C760K3518p33o467J3556J5440l9492n4268n86P162J5220J1243L211j4664
$$ 3760 27278 26545 20078 33634 49074 9582 -44686 -45272 -38110 -22890 -11647 -8436 -23100
24092b3100J0382P923r257j814O814M768L188K035J2582o641Q414P04L643j2601
$$ -23100 -12718 -4795 -14052 -15866 -9052 -4284 -1096 939 13521 6880 15294 15998 19641 7040
24078G040J2424J7726j4681l579k7165j9394O393K2561R566o62q823j2438J7253
$$ 7040 19464 37190 22509 18930 -8235 -27629 -21236 1325 10891 10229 1406 -11032 6221
24065F221R095n158k535j2159J3237J9580m669k7377j3387j1175O383j0234j5906
$$ 6221 15316 10158 7623 -4536 8701 28281 23612 -3765 -17152 -28327 -21944 -32178 -48084
24052d8084K2135K701j9272q084M853M549p058K122J4729n133J578J5886J6522
$$ -48084 -25949 -23248 -42520 -50604 -45751 -41202 -48260 -46138 -31409 -36542 -34964 -19078 -2556
24039b556k6645l03q641J1639J4417O448P451R826m712o168O274k621m169J2163
$$ -2556 -29201 -29504 -38145 -26506 -12089 -5641 1810 11636 6924 756 7030 4409 240 12403
24025A2403j4102M279j2174J2279J8387N185j0189n345J1843p163j100j131k0522
$$ 12403 -1699 2580 -9594 2685 21072 26257 16068 10723 22566 15403 14303 13172 -7350
24012g350K0823P440j111k984j6547j2706L763j5980P976J6794O514R567L5077
$$ -7350 13473 20913 19802 16818 271 -12435 -8672 -24652 -16676 118 6632 16199 51276
23999E1276K1717j2974k6137o6752j4539K1259p752j0933p230j7503L1846M91
$$ 51276 72993 60019 33882 -32870 -47409 -26150 -33902 -44835 -52065 -69568 -37722 -37231
23987c7231J1326K9083j5653r176k238Q904J7242k6643k5916J5871J065m43K2116
$$ -37231 -25905 3178 -12475 -21651 -23889 -14985 2257 -24386 -50302 -34431 -33366 -33809 -11693
23974a1693J7671j785N269K4896K958r645j7600J199L83o703n692p633q114p624
$$ -11693 5978 4193 9462 34358 37316 27671 10071 11270 11653 4950 -742 -8375 -16489 -24113
23960b4113J0266M897K771p533j6609M843O11R018j6816J206K4445J2122n82p118
$$ -24113 -13847 -8950 -6179 -13712 -30321 -25478 -24867 -15849 -32665 -31459 -7014 5108 4526 -2592
23946b592l4478k17K1866l409O992J369K2935k7770p564r152M660m115K604M238
$$ -2592 -37070 -37287 -15421 -18830 -11838 -10469 12466 -15304 -22868 -32020 -27360 -31475 -28871 -24633
23932b4633j2668N756L7570k262o2543K697N409K0201J4484K1113o45J0334l1038
$$ -24633 -37301 -31545 6025 3763 -58780 -56083 -50674 -30473 -15989 5124 4479 14813 -16225
23919a6225l4310J9975k338m92Q799M056j4329o616K2020Q022J1559q552l1722
$$ -16225 -50535 -30560 -32898 -33390 -24591 -20535 -34864 -41480 -19460 -11438 121 -8431 -40153
23906d0153l6259J86L0089O771J4818J1669l1222k513j129k1076R258K8382J3485
$$ -40153 -76412 -76226 -46137 -39366 -24548 -12879 -44101 -46614 -47743 -68819 -59561 -31179 -17694
23893a7694J9569J4290j3902l1410J1257J4964K483j4183J3494N125o561J1945
$$ -17694 1875 16165 2263 -29147 -17890 -2926 -443 -14626 -1132 3993 -2568 9377
23881I377k3174j5944J0501K3498m785k4518n732L710p369J9944K312p95o032
$$ 9377 -13797 -29741 -19240 4258 -527 -25045 -30777 -27067 -34436 -14492 -12180 -12975 -19007
23868a9007L097Q940n319j6688j288K0692J0109j2266M191j5483K2421p9k9530
$$ -19007 -15910 -6970 -12289 -28977 -30265 -9573 536 -11730 -7539 -23022 -601 -680 -30210
23855c0210l110J9186J1645L847n062J8826J3553J3995Q961r033J514k3304l3017
$$ -30210 -33320 -14134 -2489 1358 -3704 15122 28675 42670 51631 42598 44112 20808 -12209
23842a2209k0948J0953J5873J7731j9927m154K3507K691K302j7701j8093m2936
$$ -12209 -33157 -22204 -6331 11400 -8527 -12681 10826 13517 15819 -1882 -19975 -62911
23830f2911k0779P022K0720N0387r311r098k425k2420j5932j398J2632P924j0026
$$ -62911 -83690 -76668 -55948 -5561 -14872 -23970 -26395 -48815 -64747 -66145 -53513 -45589 -55615
23817e5615J8809Q000j0505p844K6605K6679J1190k8383l0740N377M755m895J7109
$$ -55615 -36806 -28806 -39311 -47155 -20550 6129 17319 -11064 -41804 -36427 -31672 -36567 -19458
23804a9458K3975j9077m9478K6598L003q82P777L30n193L893J7550j0219q590
$$ -19458 4517 -14560 -64038 -37440 -34437 -35319 -27542 -27212 -32405 -28512 -10962 -21181 -29771
23791b9771j341M461K191l5327K2164J6964M286p705J436J573l0128J8627K0881
$$ -29771 -31112 -26651 -24460 -59787 -37623 -20659 -16373 -24078 -22642 -21069 -51197 -32570 -11689
23778a1689n239O750r835j4310K3195J307K5837j5507k3159j566L940q4R636L52
$$ -11689 -16928 -10178 -20013 -34323 -11128 -9821 16016 509 -22650 -24216 -20276 -20360 -10724 -10372
23764a0372n761J5934J2288o528j6623n372k0317m594K0134L2559K472m2077j6629
$$ -10372 -16133 -199 12089 5561 -11062 -16434 -36751 -41345 -21211 11348 13820 -28257 -44886
23751d4886K6036O710J1130k4899j2446J4224j0309M197J9223K1924j1292j1081
$$ -44886 -18850 -12140 -1010 -25909 -38355 -24131 -34440 -30243 -11020 10904 -388 -11469
23739a1469Q547J1915q150j9848j4981J3117M099j7218j0758k53J8358M081j5548
$$ -11469 -2922 8993 843 -19005 -33986 -20869 -16770 -33988 -44746 -44999 -26641 -22560 -38108
23726c8108J6350K5123j4270l3395L957L7600K3058J9370K6515l1664m5582l1073
$$ -38108 -21758 3365 -10905 -44300 -40343 -2743 20315 39685 66200 34536 -11046 -42119
23714d2119o3N114n680M635K2459J0325j4445j401k1836n598J8683J3931O991
$$ -42119 -42182 -37068 -42748 -38113 -15654 -5329 -19774 -21175 -43011 -48609 -29926 -15995 -9004
23701i004j6244O283L6760L0688l6965m4010J9218L4197k3878k4249k613L3394
$$ -9004 -25248 -18965 17795 48483 11518 -32492 -13274 20923 -2955 -27204 -29817 3577
23689C577J4927j2080K2262M177l8033K9192K9417k3097K281o253l6132j3112
$$ 3577 18504 6424 28686 32863 -5170 24022 53439 30342 32623 26370 -9762 -22874
23677b2874l758r201Q584J0918J7223J7168R90j0110p788K7282J1535m285l020
$$ -22874 -26632 -35833 -27249 -16331 892 18060 19050 8940 1152 28434 39969 35684 32664
23664C2664k1125j6410p827m362m672L249J7536N17j1859j5931J2975K3829j0653
$$ 32664 11539 -4871 -12698 -17060 -21732 -18483 -947 -430 -12289 -28220 -15245 8584 -2069
23651b069J6859j8538J4956J3294J354p601r868j4916K826k456J101j0232K7022
$$ -2069 14790 -3748 11208 24502 25856 18255 8387 -6529 -3703 -6159 -5058 -15290 11732
23638A1732J8318k1282l0728L0271o850n720K2481L61J4799R855k1826l1494o511
$$ 11732 30050 8768 -21960 8311 1461 -4259 18222 18583 33382 43237 21411 -10083 -16594
23625a6594J197q906r565m702J3259J6190M489n254J6504K0136L2117J8290m7896
$$ -16594 -15397 -24303 -33868 -38570 -25311 -9121 -4632 -9886 6618 26754 58871 77161 29265
23612B9265k7149k2431N873k079j4527j5011k1986J8361K7276P310n704O49j4655
$$ 29265 2116 -20315 -14442 -16521 -31048 -46059 -68045 -49684 -22408 -15098 -20802 -20153 -34808
23599c4808o744l802O048J2775L1184L886J687J2595m859l4942k6930J1564J6777
$$ -34808 -41552 -45354 -39306 -26531 4653 8539 10226 22821 17962 -16980 -43910 -32346 -15569
23586a5569p558j129K90n508L8339J5711j0685Q581K863p74j513j2072j140J0818
$$ -15569 -23127 -24256 -23966 -29474 8865 24576 13891 22472 25335 24561 23048 10976 9836 20654
23572B0654k988j1543k3238j1252J5872J2632j6094m225N159L180L2779j5195
$$ 20654 17666 6123 -17115 -28367 -12495 137 -15957 -20182 -15023 -11843 20936 5741
23560E741k5018K6817J4212J011j3611r635n992L489k6276k5483N072K6139q240
$$ 5741 -19277 7540 21752 22763 9152 -483 -6475 -2986 -29262 -54745 -49673 -23534 -31774
23547c1774J6230R812m94J605L32j1778j0554R064K8174k4865k6714o745K4548
$$ -31774 -15544 -5732 -6226 -4621 -4289 -16067 -26621 -17557 10617 -14248 -40962 -47707 -23159
23534b3159L8747M2473M4297M566j4292l12j5486k6319l3337k072n881k9319J0267
$$ -23159 15588 58061 102358 106924 92632 92320 76834 50515 17178 15106 9225 -20094 -9827
23521i827J3142j2104k926j0490J0028J084K1500K0038j6946j480K310J8392P918
$$ -9827 3315 -8789 -11715 -22205 -12177 -11093 10407 30445 13499 12019 14329 32721 40639
23508D0639J6315j1056j1549J2573L81J750m4951j5642L969K5605K590Q605j4964
$$ 40639 56954 45898 34349 46922 47303 49053 4102 -11540 -7571 18034 20624 29229 14265
23495A4265r88J532j8446j913O762J0407j8224j4685k4484m530R947K7947Q991
$$ 14265 13277 14809 -3637 -5550 1212 11619 -6605 -21290 -45774 -50304 -40357 -12410 -3419
23482c419p261l900K6835j658j2422j909p745Q763p87J413j9798j4358L1635J1893
$$ -3419 -10680 -14580 12255 10597 -1825 -3734 -11479 -2716 -3503 -2090 -21888 -36246 -4611 7282
23468G282j0537j8216j9079J4997L9741J1919o397j0968K457o156k9108j984r325
$$ 7282 -3255 -21471 -40550 -25553 14188 26107 19710 8742 11199 5043 -24065 -26049 -35374
23455c5374L7086K8255j3192J5145l062j1384J6211Q383j7951j1381Q327K9490
$$ -35374 1712 29967 16775 31920 28858 17474 33685 42068 24117 12736 21063 50553
23443E0553O251r167j0528j083J1617n481k0156m750P379j7198j2758Q301j1472
$$ 50553 56804 47637 37109 36026 47643 42162 22006 17256 24635 7437 -5321 2980 -8492
23430h492j5655N219J4012J9556O100j1725l1230k6389K0204K4729K316j3738
$$ -8492 -24147 -18928 -4916 14640 20740 9015 -22215 -48604 -28400 -3671 -1355 -15093
23418a5093n957k0055M477M0387k419m675q329j620n95Q840J5279J246k0543j3240
$$ -15093 -21050 -41105 -36628 3759 1340 -3335 -11664 -13284 -13879 -5039 10240 11486 -9057 -22297
23404b2297o843L8107M353l1561q8m336m4610m344L732J7188K0496K700p303K3295
$$ -22297 -29140 8967 13320 -18241 -18329 -22665 -67275 -71619 -67887 -50699 -30203 -27503 -34806 -11511
23390a1511K8661j3387o976J7193j1087k7395J494l5700k252K1478J0517k8803
$$ -11511 17150 3763 -3213 13980 2893 -24502 -23008 -58708 -60960 -39482 -28965 -57768
23378e7768j6132J4512J4719N792J9482J7874O533k9168K537q926Q064q791K0987
$$ -57768 -73900 -59388 -44669 -38877 -19395 -1521 5012 -24156 -21619 -30545 -22481 -31272 -10285
23365a0285L2179k0191k5929K5005k0044m606K4889J144j2912k0512P107K6962
$$ -10285 21894 1703 -24226 779 -19265 -23871 1018 2162 -10750 -31262 -24155 2807
23353B807p79P098Q403j2198J790m562q152m674k9323r490K7683K1244q155k157
$$ 2807 2028 9126 17529 5331 7121 2559 -5593 -10267 -39590 -49080 -21397 -153 -8308 -10465
23339a0465j984q761L7n365L338R427N58q201l66K5844p172j9879o604O138q109
$$ -10465 -12449 -21210 -21173 -26538 -23200 -13773 -13215 -21416 -21782 4062 -3110 -22989 -29593 -23455 -31564
23324c1564q312K6305L9698J3502L603k5141l1298P70J2841L59k2931j2440K6405
$$ -31564 -39876 -13571 26127 39629 43232 18091 -13207 -12437 404 763 -22168 -34608 -8203
23311h203q293P072M040o776j4321l077J1613M1748l371l2860k2912N423M2734
$$ -8203 -16496 -9424 -5384 -12160 -26481 -29558 -17945 23803 20432 -12428 -35340 -29917 12817
23298A2817L2973j1383l3482k6432j6706r794K975j2187J7643J9401j3138j9858
$$ 12817 45790 34407 925 -25507 -42213 -52007 -49032 -61219 -43576 -24175 -37313 -57171
23286e7171k1420l960K6703k274j5404K30L9193j3721j1672L5485K7678K3307
$$ -57171 -78591 -82551 -55848 -58122 -73526 -73296 -34103 -47824 -59496 -24011 3667 26974
23274B6974O689o562k3639j804J4144l194l4126k3031m292k3295m839J8075L5487
$$ 26974 33663 27101 3462 1658 15802 12608 -21518 -44549 -48841 -72136 -76975 -58900 -23413
23261b3413J4383n29J5373j1406n2318r676p723P370L6477J4035o319n887J3961
$$ -23413 -9030 -9559 5814 -5592 -57910 -67586 -75309 -67939 -31462 -17427 -23746 -29633 -15672
23248a5672J4647L7454j984p371j359J185j6378m663k986k0262j7275p769M129
$$ -15672 -1025 36429 34445 27074 25715 26900 10522 5859 2873 -17389 -34664 -42433 -38304
23235c8304j1278L0672K2024M83P272j0962n150j4227P155K756Q78j1325M26l70
$$ -38304 -49582 -18910 3114 3597 10869 -93 -5243 -19470 -12315 -9559 -8681 -20006 -19580 -19950
23221a9950J6117L1062Q952M934r692P292L567R499r061l6488j1146N63k436J3657
$$ -19950 -3833 27229 36181 41115 31423 38715 42282 51781 42720 6232 -4914 -4351 -6787 6870
23207F870J5094j0746j4008O733k113J7958J6170j7842j4395J3952P419l4061
$$ 6870 21964 11218 -2790 3943 1830 19788 35958 18116 3721 17673 25092 -8969
23195h969j5806R694J8265n80J7728J1051K166k7802j5431J4264o524k8880K799
$$ -8969 -24775 -15081 3184 2604 20332 31383 33549 5747 -9684 4580 -1944 -30824 -28025
23182b8025J2877J2675J0798J4226k814k3354l456p76k4257k3498J3592J4204
$$ -28025 -15148 -2473 8325 22551 19737 -3617 -7073 -7849 -32106 -55604 -42012 -27808
23170b7808k2953j1352L920J1683L5971r720j5059K0908J7820p206J7121j173
$$ -27808 -50761 -62113 -58193 -46510 -10539 -20259 -35318 -14410 3410 -3796 13325 12152
23158A2152j6081q752P63r808j6089K921J7824P986j5808o958K9483J6054l825
$$ 12152 -3929 -12681 -11918 -21726 -37815 -34894 -17070 -9084 -24892 -31850 -2367 13687 9862
23145I862j6499m07j3016k5708L255L2147J0018o298l5481J2762K8698K569k627
$$ 9862 -6637 -7044 -20060 -45768 -42513 -10366 -348 -6646 -42127 -29365 -667 1902 -725
23132g25k2327j5040J5054k0516l453L6117K1632m621j324j7634m920O792j0776
$$ -725 -23052 -38092 -23038 -43554 -47007 -10890 10742 6121 4797 -12837 -17757 -10965 -21741
23119b1741k123P92K137R370j9624o771j589K77K1602K0472m189l544m182l051
$$ -21741 -23864 -23072 -20935 -11565 -31189 -37960 -39549 -39272 -17670 2802 -1387 -4931 -9113 -12164
23105a2164n847P731J0614J128j1796L349J659n1059l2319L5281K1872K2119J5241
$$ -12164 -18011 -10280 334 1462 -10334 -6985 -5326 -56385 -88704 -53423 -31551 -9432 5809
23092E809o446k3838k7232K052K8363Q25j617o452r212j6067j1188N789L0109
$$ 5809 -637 -24475 -51707 -49655 -21292 -20467 -22084 -28536 -37748 -53815 -65003 -59214 -29105
23079b9105l997k4689k6094N232o040j099M4133K8586P528J0345j3349l134p703
$$ -29105 -33102 -57791 -83885 -78653 -84693 -85792 -41659 -13073 -5545 4800 -8549 -11683 -19386
23066a9386K651J8007R931q933n062J5910j2408k6200q688K0174o98K1307K853
$$ -19386 -16735 1272 11203 2270 -2792 13118 710 -25490 -34178 -14004 -14702 6605 9458
23053I458L858L759Q810l8666k2016q331P156K541l3740m996J5032K4917L8424
$$ 9458 13316 17075 25885 -12781 -34797 -43128 -35972 -33431 -67171 -72167 -57135 -32218 6206
23040F206k694j3659N982k359J0339p974j3089N016J3083l185M4659k0903l5096
$$ 6206 3512 -10147 -4165 -6524 3815 -4159 -17248 -12232 851 -2334 42325 21422 -13674
23027a3674k513j2403n18K694J7424p142k439L776J0113k6037J3573J5741j1563
$$ -13674 -16187 -28590 -29108 -26414 -8990 -16132 -18571 -14795 -4682 -30719 -17146 -1405 -12968
23014a2968j663K4164J6414r606Q899K3348n300j9764l0986K170m087J3144k530
$$ -12968 -14631 9533 25947 16341 25240 48588 43288 23524 -7462 -5292 -9379 3765 1235
23001A235N78N159o923j4758k830p281N105J0198R924q812K3731J2305o087M528
$$ 1235 1813 6972 49 -14709 -17539 -24820 -19715 -9517 407 -8405 15326 27631 21544 26072
22987B6072l970l2105k1205Q364J938j9671J3883P494J736L564Q841J3986j8316
$$ 26072 22102 -10003 -31208 -22844 -20906 -40577 -26694 -19200 -17464 -13900 -5059 8927 -9389
22974i389m535l6989k0011M170j578M7212L6354k5085k2948k405K2801q846q770
$$ -9389 -13924 -50913 -70924 -66754 -68332 -21120 15234 -9851 -32799 -35204 -12403 -21249 -30019
22961c0019O560j8354J6416J6984r376k723Q683K161m301k032j133r225l978K8822
$$ -30019 -23459 -41813 -25397 -8413 -17789 -20512 -11829 -9668 -13969 -16001 -17134 -26359 -30337 -1515
22947a515K75J0570K2518l232O017q935L705o479j0417k948M294r772j1995q985
$$ -1515 -1240 9330 31848 28616 34633 25698 29403 22924 12507 9559 13853 4081 -7914 -16899
22933a6899R01L1950O044J992j148k8368j3021N359k001j4297j5848l196P570
$$ -16899 -15998 15952 21996 23988 22840 -5528 -18549 -13190 -15191 -29488 -45336 -48532 -40962
22920d0962J1855P709J0686J1003m422P801J681p2P448l842N158k628j507j1976
$$ -40962 -29107 -21398 -10712 291 -4131 3670 5351 5279 12727 8885 14043 11415 9908 -2068
22906b068l0789K2029m473J702R533o628l373L155J2760n625k6017j1930k051
$$ -2068 -32857 -10828 -15301 -13599 -4066 -10694 -14067 -10912 1848 -3777 -29794 -41724 -43775
22893d3775J0895N516l0780J5728K3714L55j5656k7296L245K6911L2794J4203
$$ -43775 -32880 -27364 -58144 -42416 -18702 -18347 -34003 -61299 -58054 -31143 1651 15854
22881A5854j8872Q520J4129p109l2004R68K644K3300o830J0928l069j7929l3515
$$ 15854 -3018 5502 19631 12522 -19482 -18514 -15870 7430 600 11528 8459 -9470 -42985
22868d2985K6336J7977r927N99q882k0950j1919l440J9531J9698J5193J6037N497
$$ -42985 -16649 1328 -8599 -8000 -16882 -37832 -49751 -53191 -33660 -13962 1231 17268 22765
22855B2765J2337K1761K761M978j0292k0373j0384k604k851j5903P288k4333j4202
$$ 22765 35102 56863 59624 64602 54310 33937 23553 20949 18098 2195 9483 -14850 -29052
22842b9052L352l763K2236K3871k1627j261j5503J0995K1701K018j9808j1157
$$ -29052 -25700 -29463 -7227 16644 -4983 -6244 -21747 -10752 10949 12967 -6841 -17998
22830a7998J5402N090O165k5574j3320p358L30J1866m765K8510K5988J01j1070
$$ -17998 -2596 2494 8659 -16915 -30235 -37593 -37263 -25397 -30162 -1652 24336 24437 13367
22817A3367j6407J1576k4171n413J4935j9810j3958k365q16q146l569K8844L0901
$$ 13367 -3040 8536 -15635 -21048 -6113 -25923 -39881 -42246 -43062 -51208 -54777 -25933 4968
22804D968j3938j018L324k0424j8810l0106K1733J8888R72K168K8097Q81j0075
$$ 4968 -8970 -9988 -6664 -27088 -45898 -76004 -54271 -35383 -34411 -32243 -4146 -3265 -13340
22791a3340l9549R475J5902j1285j4369k8711L203K2501L5195J8474K670P779
$$ -13340 -52889 -43414 -27512 -38797 -53166 -81877 -78674 -56173 -20978 -2504 166 7945
22779G945N836j7193p666K3346Q287K5645L528l7746k3869j1449j4839k1776o845
$$ 7945 13781 -3412 -11078 12268 20555 46200 49728 11982 -11887 -23336 -38175 -59951 -66796
22766f6796K802K7420L3608J6495Q044m378K7465J0966r395j1756k0962j4951
$$ -66796 -63994 -36574 -2966 13529 21573 17195 44660 55626 46231 34475 13513 -1438
22754a438J6229j6912k4636j7603K2496K7370j0366o90K538p416k6544K7730J340
$$ -1438 14791 -2121 -26757 -44360 -21864 5506 -4860 -5550 -3012 -10428 -36972 -9242 -7902
22741g902p448J0646J7104l6266m769K1078Q365J8096k2596J1701q176J8798J567
$$ -7902 -15350 -4704 12400 -23866 -28635 -7557 808 18904 -3692 8009 -167 18631 20198
22728B0198l602L589q887j4082k2703k4428L1192J4334J1122j8023n764J2458
$$ 20198 16596 20185 11298 -2784 -25487 -49915 -18723 -4389 6733 -11290 -17054 -4596
22716d596K3572J4535n319p329j7997n272L61J1504j3378l272K04Q758J721J3826
$$ -4596 18976 33511 28192 20863 2866 -2406 -2045 9459 -3919 -7191 -6987 1771 3492 17318
22702A7318j6973k7822q631k2377J9381K0683J7852j7709k6449k0972Q556o315
$$ 17318 345 -27477 -36108 -58485 -39104 -18421 -569 -18278 -44727 -65699 -57143 -63458
22690f3458Q671P088M999K9682J741j9129j1152K005J7850R850l070j8536k2975
$$ -63458 -54787 -47699 -42700 -13018 -11277 -30406 -41558 -39553 -21703 -11853 -14923 -33459 -56434
22677e6434r180J9860L2042K3199l0554q276K2929j153K0784j2728P859J453l861
$$ -56434 -65614 -45754 -13712 9487 -21067 -29343 -6414 -7567 13217 489 8348 9801 5940
22664E940K518j6971j2947p661J755k3J0429K726J8108j8157j6557o76J0556J2515
$$ 5940 8458 -8513 -21460 -29121 -27366 -27389 -16960 -14234 3874 -14283 -30840 -31516 -20960 -8445
22650h445j9896l841Q140K74K3943L671q572K1406j483j3678j1369j1029K126
$$ -8445 -28341 -32182 -24042 -23768 175 3846 -4726 16680 15197 1519 -9850 -20879 -18753
22637a8753k3558L845J8595j0202J093K5409j7814q111j1718J6795J6387n211
$$ -18753 -42311 -38466 -19871 -30073 -28980 -3571 -21385 -29496 -41214 -24419 -8032 -13243
22625a3243K5991J5987l337j8512j4507J064j08j1430l524J1273J5997J70k3755
$$ -13243 12748 28735 25398 6886 -7621 -6557 -6665 -18095 -21619 -10346 5651 5821 -17934
22612a7934k9242Q017o397l7556j027M4876L3966q65J180j2402l419r129k0200
$$ -17934 -47176 -39159 -45556 -83112 -84139 -39263 -5297 -6162 -4982 -17384 -20803 -29932 -50132
22599e0132m843N649K1131K3085J6554k7749j9394p639O254q59J1214J1917Q535
$$ -50132 -54975 -49326 -28195 -5110 11444 -16305 -35699 -43338 -37084 -37943 -26729 -14812 -6277
22586f277j6120O950P937o405J3638K1376l208j1262o612k4907J302M043L907
$$ -6277 -22397 -15447 -7510 -13915 -277 21099 17891 6629 17 -24890 -23588 -19545 -15638
22573a5638J9915k0970P188K925j6100K3019j8512k592M99J5510K8096K204p544
$$ -15638 4277 -16693 -9505 -6580 -22680 339 -18173 -20765 -20266 -4756 23340 25544 18000
22560A8000n3445m2347J0345K0613n753P833J7736J7314k143k1440p956K7792
$$ 18000 -35445 -77792 -67447 -46834 -52587 -44754 -27018 -9704 -11847 -33287 -41243 -13451
22548a3451r551k8491L4892L5762J0303q143j1623j8544j5373q984J5413K0000
$$ -13451 -23002 -51493 -16601 19161 29464 21321 9698 -8846 -24219 -33203 -17790 2210
22536B210n265L378J6337j9716k3380N352K0699j6779K0156K8388p04m9091n722
$$ 2210 -3055 323 16660 -3056 -26436 -21084 -385 -17164 2992 31380 30676 -18415 -24137
22523b4137M46J2250N492j563k1789m480Q440J3847R411j2014n461l0373J2877
$$ -24137 -23691 -11441 -5949 -7512 -29301 -33781 -25341 -11494 -2083 -14097 -19558 -49931 -37054
22510c7054L3055J6965j4970l3743k6008j638O267L2636R802R654j2916P232K0596
$$ -37054 -3999 12966 -2004 -35747 -61755 -63393 -57126 -24490 -14688 -5034 -17950 -10718 9878
22497I878l537k0127J0909q77m87M678R0j080J0270J1640j6037j8532j1714P766
$$ 9878 6341 -13786 -2877 -3754 -4241 437 527 -553 9717 21357 5320 -13212 -24926 -17160
22483a7160k6788k8673L0755K5011K2589J8127k6298R906K5990k3864J077K3324
$$ -17160 -43948 -72621 -41866 -16855 5734 23861 -2437 7469 33459 9595 10672 33996
22471C3996k2338k1664J7205j4280n411j1478K844N693k776K9978J0022k7011
$$ 33996 11658 -10006 7199 -7081 -12492 -23970 -21126 -15433 -18209 11769 21791 -5220
22459e220k2682J7707Q800k501J3034J4935l806k2360j0434j3817J5081O093r092
$$ -5220 -27902 -10195 -1395 -3896 9138 24073 20267 -2093 -12527 -26344 -11263 -5170 -14262
22446a4262J12j6762j70p313J9780K2206r402j167O023O743q535J1118n526k0908
$$ -14262 -14150 -30912 -31082 -38395 -18615 3591 -5811 -6978 -955 5788 -2747 8371 2845 -18063
22432a8063k989R073j3266J284J5094j7537J509K4486J2896j1153o73n866P808
$$ -18063 -21052 -11979 -25245 -23961 -8867 -26404 -24895 -409 12487 1334 661 -5205 2603
22419B603k9424J1406K8898n83j7545J4206j925p25r54k3433j0759J5695J3884
$$ 2603 -26821 -15415 13483 12900 -4645 9561 7636 6911 5957 -17476 -28235 -12540 1344
22406A344J1002m564k6037N134j8513M842L6188p076j005j8693K0776N952o581
$$ 1344 12346 7782 -18255 -13121 -31634 -26792 9396 2320 1315 -17378 3398 9350 2769
22393B769o414p027o791J0309L0304L1221J2663k9451j7674o674k7034O588J51
$$ 2769 -3645 -10672 -17463 -7154 23150 54371 67034 37583 19909 13235 -13799 -7211 -7060
22380g060k263P963m0585N432K2906M470J1617j8628k5724j360R555L052k509
$$ -7060 -9323 -1360 -41945 -36513 -13607 -9137 2480 -16148 -41872 -43232 -33677 -30625 -33134
22367c3134J36Q778L9001K0476p250j6128k1090P796R728n102Q862k5379l6535
$$ -33134 -32998 -24220 14781 35257 28007 11879 -9211 -1415 8313 3211 12073 -13306 -49841
22354d9841m2m416K0646L8167p278j5191L4617K3533j3790l582J743K6806M83
$$ -49841 -49883 -54299 -33653 4514 -2764 -17955 16662 40195 26405 22823 24566 51372 51855
22341E1855M402p486n825k6180k370K1295J3971Q65j8337k2050j2665j5361m413
$$ 51855 56257 48771 42946 16766 14396 35691 49662 50527 32190 10140 -2525 -17886 -22299
22328b2299K9262M388k145L939J5127J9665l387l456j4440M570J7408N1064K3727
$$ -22299 6963 11351 9206 13145 28272 47937 44550 41094 26654 31224 48632 99696 123423
22315A23423L846K2263M9837M6824Q2498P3927O7053Q3103Q5476J08454J33610
$$ 123423 127269 149532 199369 246193 328691 402618 469671 552774 638250 746704 880314
22304H80314K13325K94439M64257O41803Q47148R69127R36760M49330k00380l05896
$$ 880314 1093639 1388078 1852335 2494138 3341286 4310413 5247173 5696503 5496123 5190227
22294E190227l61848p99340j188586r86221o05033l51406k12041j19898j10921
$$ 5190227 4828379 4029039 2840453 1854232 1249199 897793 685752 565854 454933
22285D54933p5296p4396l0667j4596l0368l1205m202j4411n3685l9402J1064J7262
$$ 454933 379637 305241 274574 259978 229610 198405 194203 179792 126107 86705 97769 115031
22273A15031k3135m0521n574J587j1244P375J6248P693j3019k6215l149L1294
$$ 115031 91896 51375 45801 47388 36144 43519 59767 67460 54441 28226 25077 56371
22261E6371J5394m0235j1168k5518j0527J7140K8030K2296J1845j2397k1070j1763
$$ 56371 71765 31530 20362 -5156 -15683 1457 29487 51783 63628 51231 30161 18398
22249A8398O096J995N139Q360n364j2156j7177p383q642O791q898L3121K9306
$$ 18398 24494 26489 31628 39988 34624 22468 5291 -2092 -10734 -3943 -12841 20280 49586
22236D9586j622l2489k2347j6397N700L4365J0150P15j3018k2861j6313J7053
$$ 49586 47964 15475 -6872 -23269 -17569 16796 26946 27661 14643 -8218 -24531 -7478
22224g478J1321J6043N423k9272j2367R92n109q787m62j3599J0398J4342j4158
$$ -7478 3843 19886 25309 -3963 -16330 -15338 -20447 -29234 -29696 -43295 -32897 -18555 -32713
22211c2713Q117K0549m422j1480J2704K011Q291R652l87j0542p251j7735R055
$$ -32713 -24596 -4047 -8469 -19949 -7245 -5234 3057 12709 12322 1780 -5471 -23206 -14151
22198a4151j9157J0118q273l6469J7256L1485R298q065K1387K8621o7j9704k0668
$$ -14151 -33308 -23190 -31463 -67932 -50676 -19191 -9893 -17958 3429 32050 31983 12279 -8389
22185h389j4554j6635n364M4794P711L890m1020P751L3588O383k7853j7838J7492
$$ -8389 -22943 -39578 -44942 -148 7563 11453 -29567 -21816 11772 18155 -9698 -27536 -10044
22172a0044p467j7568R216M430r389K3763l7449j0721L2079O705j5179L339r848
$$ -10044 -17511 -35079 -25863 -21433 -30822 -7059 -44508 -55229 -23150 -16445 -31624 -28285 -38133
22159c8133L437J755O828l631Q577O703o509j5336J7000M3723K4107k9508l6207
$$ -38133 -34696 -32941 -26113 -29744 -21167 -14464 -20973 -36309 -19309 24414 48521 19013 -17194
22146a7194O21K3881K93m8944k7129L1163N913O910K8345p035k2803L132j1745
$$ -17194 -16573 7308 7601 -41343 -68472 -37309 -31396 -24486 3859 -3176 -25979 -22847 -34592
22133c4592J6152K6847k3001j4310K4545J6887k5838j3763j312m203K6214Q770
$$ -34592 -18440 8407 -14594 -28904 -4359 12528 -13310 -27073 -28385 -32588 -6374 2396
22121B396j915J5920j6608j3118J3082J0173n307L375j547j562K912p094k2517
$$ 2396 481 16401 -207 -13325 -243 9930 4623 7998 6451 4889 7801 707 -21810
22108b1810K312K5081J9568k9778j9365J6140l518m215K0409k79r724J1666J9060
$$ -21810 -19498 5583 25151 -4627 -23992 -7852 -11370 -15585 4824 4545 -5179 6487 25547
22095B5547P757n526o116k91m5069j7907L124M2541K3989j6257l5306J2959J1415
$$ 25547 33304 27778 21662 21371 -23698 -41605 -38481 4060 28049 11792 -23514 -10555 860
22082H60K5142j8418j1468m149q143p275J1420J5097K3257J3669j7823M274l39
$$ 860 26002 7584 -3884 -8033 -16176 -23451 -12031 3066 26323 39992 22169 26443 26104
22069B6104l8142l701J7199j121O226j302J2286L700j5443j7228j2775L717k6528
$$ 26104 -12038 -15739 1460 339 6565 5263 17549 21249 5806 -11422 -24197 -20480 -47008
22056d7008j4890J560L911K5609N3800N023l6440p754J2206L2129j0317j2813
$$ -47008 -61898 -60338 -56427 -30818 22982 28005 -8435 -16189 -3983 28146 17829 5016
22044E016K7075Q112k3929o579L037l8361j5650P830J4761k874N611J0396J9601
$$ 5016 32091 40203 16274 9695 12732 -25629 -41279 -33449 -18688 -21562 -15951 -5555 14046
22031A4046P740k5978J5741J3229j3602j0382L2455K1680N737k6346m7799l1693
$$ 14046 21786 -4192 11549 24778 11176 794 33249 54929 60666 34320 -13479 -45172
22019d5172K0997J6811m701K208j3152J1761P999m144L57K3860o353j7143J3054
$$ -45172 -24175 -7364 -12065 -9857 -23009 -11248 -3249 -7393 -7036 16824 10471 -6672 6382
22006F382m6233j7039J5868J5691k033J8733J2506j3427J2405R112j1350j1788
$$ 6382 -39851 -56890 -41022 -25331 -27364 -8631 3875 -9552 2853 11965 615 -11173
21994a1173N787J377P085J4097k5105q239P317Q561J5982J5300k0363j8775L816
$$ -11173 -5386 -4009 3076 17173 -7932 -16171 -8854 -293 15689 30989 10626 -8149 -4333
21981d333K243L93J3044k1859J465J9829K2151O156l864k7242k7785j4383N9n208
$$ -4333 -2090 -1697 11347 -10512 -9047 10782 32933 39089 35225 7983 -19802 -34185 -34126 -39334
21967c9334K6360J5497N06j1153M929P962J0864J4794j966k1133R114j1151k1879
$$ -39334 -12974 2523 3029 -8124 -3195 4767 15631 30425 28459 7326 16440 5289 -16590
21954a6590J1856p651j3421j776J3262m367k9824K6418J6642N855j8968k9509
$$ -16590 -4734 -12385 -25806 -27582 -14320 -18687 -48511 -22093 -5451 404 -18564 -48073
21942d8073J0605Q502O718K3556P990j4294O324J811p769j5504j1217k3073j6515
$$ -48073 -37468 -28966 -22248 1308 9298 -4996 1328 3139 -4630 -20134 -31351 -54424 -70939
21929g0939K6276O071N10l857J0303J2372J6829m4316k4841L8774L1552O788j7713
$$ -70939 -44663 -38592 -38082 -41939 -31636 -19264 -2435 -46751 -71592 -32818 -1266 5522 -12191
21916a2191k4036o763J1466Q963M459j756O216K7813j7764j4846O464j6144l300
$$ -12191 -36227 -42990 -31524 -22561 -18102 -19858 -13642 14171 -3593 -18439 -11975 -28119 -31419
21903c1419K1805J9297M199k0290K5973j008K4679J390k9096m1874J614J4596
$$ -31419 -9614 9683 13882 -6408 19565 18557 43236 44626 15530 -26344 -24730 -10134
21891a0134J3223j3183j6306L157m967L2390M2770J9181j8371l0403p730K5750
$$ -10134 3089 -10094 -26400 -23243 -28210 4180 46950 66131 47760 17357 9627 35377
21879C5377J994p285l6604j7542o482O458o00L686J6085J1343L3497J9409J0432
$$ 35377 37371 30086 -6518 -24060 -30542 -24084 -24684 -20998 -4913 6430 39927 59336 69768
21866F9768k2677k0207n47l075j5619k3926j0562K489J6158K7450k830m5440M272
$$ 69768 47091 26884 26337 23262 7643 -16283 -26845 -24356 -8198 19252 16422 -29018 -24746
21853b4746j651j2721K1785K0714r869l622N62j1336R484K74k5795J8673K7650
$$ -24746 -26397 -39118 -17333 3381 -6488 -10110 -9548 -20884 -11400 -11126 -36921 -18248 9402
21840I402M633k0033K2737J2719j186n041P01N649l0949p286M502j2992K016K0349
$$ 9402 14035 -5998 16739 29458 28272 23231 23932 29581 -1368 -8654 -4152 -17144 -15128 5221
21826E221q783n655j5309K2554l116j4668j3909J3860k979J8411j6956p071J3880
$$ 5221 -3562 -9217 -24526 -1972 -5088 -19756 -33665 -19805 -22784 -4373 -21329 -28400 -14520
21813a4520R058k442j1102l0177K0515l651J6104L4188J117j187J2848p577J949
$$ -14520 -5462 -7904 -19006 -49183 -28668 -32319 -16215 17973 19090 17903 30751 23174 25123
21800B5123q825m553l7854O494K6900j6818k1239K5312J7289j7797L590J5256
$$ 25123 16298 11745 -26109 -19615 7285 -9533 -30772 -5460 11829 -5968 -2378 12878
21788A2878L0523j3832n5984k7643Q804L4631O01j6153k3686J1371M0270j2249
$$ 12878 43401 29569 -26415 -54058 -45254 -10623 -10022 -26175 -49861 -38490 1780 -10469
21776a0469k3744J6757N802K0442J4024j566M192j0531j2247K75r604r178L650
$$ -10469 -34213 -17456 -11654 8788 22812 21246 25438 14907 2660 2935 -6669 -15847 -12197
21763a2197j1523m197L8049R212j5697k0086l3642r247J2263j329J8983J772q722
$$ -12197 -23720 -27917 10132 19344 3647 -16439 -50081 -59328 -47065 -48394 -29411 -27639 -36361
21750c6361L5119j9682n721r401L2880J7534k2928j3978O154J3100L0689J0377
$$ -36361 -1242 -20924 -26645 -36046 -3166 14368 -8560 -22538 -16384 -3284 27405 37782
21738C7782q206O182O244j4397r177R41N994n378j8183k5487M009L8370J2550
$$ 37782 29576 35758 42002 27605 18428 19369 25363 19985 1802 -23685 -19676 18694 31244
21725C1244k7620k9406j6222j4646J4542J9763K1414o000j2102m044J494J395
$$ 31244 3624 -25782 -42004 -56650 -42108 -22345 -931 -6931 -19033 -23077 -21583 -20188
21713b0188p733K2355k965Q552r36L603N326m934M003r067j301j1821L209p43
$$ -20188 -27921 -5566 -8531 21 -915 2688 8014 3080 7083 -1984 -3285 -15106 -11897 -12640
21699a2640K026j5429j9734q574Q468J1491j6221j481K7153K5278q30j9234j9915
$$ -12640 -10614 -26043 -45777 -54351 -45883 -34392 -50613 -52094 -24941 337 -493 -19727 -39642
21686c9642M197M541Q833K7010M349j7032j7J1136q911k3074K539K1099k102K061
$$ -39642 -35445 -30904 -22071 4939 9288 -7744 -7761 3375 -5536 -28610 -26071 -4972 -7074 -5013
21672e013P870J0549j0135j932p880n76j0581J9768K0895j6312l0079M335K4681
$$ -5013 2857 13406 3271 1339 -6541 -7117 -17698 2070 22965 6653 -23426 -19091 5590
21659E590j7790l331j0149O883J7187J0519J246k4095J6630L3218j9275j9953
$$ 5590 -12200 -15531 -25680 -18797 -1610 8909 10155 -13940 2690 35908 16633 -3320
21647c320j7802N891m491l2804k567L3843J7642N532j576j771O633o479k7161
$$ -3320 -21122 -15231 -19722 -52526 -55093 -21250 -3608 1924 348 -1423 5210 -1269 -28430
21634b8430R967K7451L2561J8336k9262k0791j3515J9044k4011l1043K2789j0688
$$ -28430 -18463 8988 41549 59885 30623 9832 -3683 15361 -8650 -39693 -16904 -27592
21622b7592m808L429N684j2544j0647L2623R200j957q341R90r076q563j2554J3510
$$ -27592 -32400 -28971 -23287 -35831 -46478 -13855 -4655 -6612 -14953 -13963 -23039 -31602 -44156 -30646
21608c0646J417N226J0036K634R074K765r277M62j0518L6436l042M144J5343r630
$$ -30646 -29229 -24003 -13967 -11333 -2259 506 -8771 -8309 -18827 17609 14567 18711 34054 24424
21594B4424j6904M753M074J7570R86l4124m210J6365o417l584k1720q189K1816
$$ 24424 7520 12273 16347 33917 34903 779 -3431 12934 6517 2933 -18787 -26976 -5160
21581e160j2495j8534p430N453J1998j0221J4167r575K1308l302q803K3783l1002
$$ -5160 -17655 -36189 -43619 -38166 -26168 -36389 -22222 -31797 -10489 -13791 -22594 1189 -29813
21568b9813l446M970j6238j2429K6501K6399K407q638K2570k1482N23J5163j043
$$ -29813 -33259 -28289 -44527 -56956 -30455 -4056 -1649 -10287 12283 -9199 -8676 6487 5444
21555E444q919J9663J2121K594j3378k3915L290J2291k4287K240J9138R931n294
$$ 5444 -3475 16188 28309 30903 17525 -6390 -3100 9191 -15096 -12856 6282 16213 10919
21542A0919K613N665j8032o658K0337q873m340L910n444j7177P213q697q819L5097
$$ 10919 13532 19197 1165 -5493 14844 5971 1631 5541 97 -17080 -9867 -18564 -27383 7714
21528G714K648l717j4578M177p870l0281J0553L838K0977p080k9080j0336j1782
$$ 7714 10362 6645 -7933 -3756 -11626 -41907 -31354 -27516 -6539 -13619 -42699 -53035 -64817
21515f4817J4359P372q596J8372K6536j4162o979j2498J6187J7539R499j0732
$$ -64817 -50458 -43086 -51682 -33310 -6774 -20936 -27915 -40413 -24226 -6687 2812 -7920
21503g920J8116k858o70J778k4706o338n596J6837J953O346m830O025J1846L7942
$$ -7920 10196 7338 6668 8446 -16260 -22598 -28194 -11357 -9404 -3058 -7888 -1863 9983 47925
21489D7925j7020j3288j3372r72j4270l1631O096L299J3791J7477m66o223k4504
$$ 47925 30905 17617 4245 3273 -10997 -42628 -36532 -33233 -19442 -1965 -2431 -8654 -33158
21476c3158J3689J0944p415J2240J331l139m338n854j3647J0956K5090j0275j2548
$$ -33158 -19469 -8525 -15940 -3700 -2369 -5508 -9846 -15700 -29347 -18391 6699 -3576 -16124
21463a6124L0450l661l4681j376J4585R028J4272J1269k6889j8566K447K5503
$$ -16124 14326 10665 -24016 -25392 -10807 -1779 12493 23762 -3127 -21693 -19246 6257
21451F257k8423l209J1531j0051j0582k5743j6977k752J0295K8387R409k6337
$$ 6257 -22166 -25375 -13844 -23895 -34477 -60220 -77197 -79949 -69654 -41267 -31858 -58195
21439e8195K3300M5328K8067J2566R053l36n954j713k0283j5969k4996k9709j8233
$$ -58195 -34895 10433 38500 51066 60119 59783 53829 52116 31833 15864 -9132 -38841 -57074
21426e7074m347K1329K6417K1676K881o272q236j5474j6482r350J2623j4078J8894
$$ -57074 -61421 -40092 -13675 8001 10882 4610 -3626 -19100 -35582 -44932 -32309 -46387 -27493
21413b7493J9205j81L20j5209m3850J0205L1825K0319J0209K721J7274J5252K4351
$$ -27493 -8288 -8469 -8149 -23358 -67208 -57003 -25178 -4859 5350 8071 25345 40597 64948
21400F4948O520q335J3639q278k275M397j0479p874j3238O033O105J3352k0148
$$ 64948 71468 63133 76772 68494 66219 70616 60137 52263 39025 45058 51163 64515 44367
21387D4367j9249O147O64J5473j5317J9582j1523l2231j7807R377M499k160j5289
$$ 44367 25118 31265 31929 47402 32085 51667 40144 7913 -9894 -517 3982 1822 -13467
21374a3467k3216j1813J0558J1259k944r386Q187p634J501J1445j1291o490L6254
$$ -13467 -36683 -48496 -37938 -26679 -29623 -39009 -30822 -38456 -36955 -25510 -36801 -43291 -7037
21361g037J6053m077L3830J2038o859O474n607j8069j7401k219J8556J3153J468
$$ -7037 9016 4939 38769 50807 43948 50422 44815 26746 9345 7126 25682 38835 40303
21348D0303N079m3989j8992J0745K0860K0403j4537l549K5327l693j4227k0671
$$ 40303 45382 1393 -17599 -6854 14006 34409 19872 16323 41650 37957 23730 3059
21336C059J1469n070r958Q853O365J2631j7667k6464J479m012q725K104r84M255
$$ 3059 14528 9458 -500 8353 14718 27349 9682 -16782 -15303 -19315 -28040 -25936 -26920 -22665
21322b2665j0496K408r744L273O786o755j9004J0365K3815Q070r77J2813J7165
$$ -22665 -33161 -30753 -40497 -37224 -30438 -37193 -56197 -45832 -22017 -13947 -14924 -2111 15054
21309A5054M979j7167m400r354J819Q442Q31j7283j156L482O903O188l633K976
$$ 15054 20033 2866 -1534 -10888 -9069 -627 204 -17079 -18235 -14753 -7850 -1662 -5295 -2319
21295b319J0181N153r211o601o944P93K3931K7581k3220l2872m5021k822K0652
$$ -2319 7862 13015 3804 -2797 -9741 -8948 14983 42564 19344 -13528 -58549 -61371 -40719
21282d0719K3836j3933K0583L4385K0071j9949k6527P647K0044j9756k669N542
$$ -40719 -16883 -30816 -10233 24152 44223 24274 -2253 5394 25438 5682 3013 8555
21270H555p96m355n141j1296L782J8811J6289q824M275j2648k1124j7030j4224
$$ 8555 7759 3404 -1737 -13033 -9251 9560 25849 17025 21300 8652 -12472 -29502 -43726
21257d3726l442J3477J3716M436k7050L102O633j0395J7143R177n540n849J2936
$$ -43726 -47168 -33691 -19975 -15539 -42589 -39487 -32854 -43249 -26106 -16929 -22469 -28318 -15382
21244a5382l426J3458P592k3697J6715l59m377K6447J4989j5912q70r215m448
$$ -15382 -18808 -5350 2242 -21455 -4740 -5099 -9476 16971 31960 16048 15178 5963 1515
21231A515r603p27P427R977K5579J9070k9946j5648J1413P428j0529j0712k5214
$$ 1515 -8088 -8815 -1388 8589 34168 53238 23292 7644 19057 26485 15956 5244 -19970
21218a9970J8609L0472J562l4962m5863J013K7145K0664J4866l698K1042j4074
$$ -19970 -1361 29111 30673 -4289 -50152 -49139 -21994 -1330 13536 9838 30880 16806
21206A6806j875k0875n651Q847O753L0377j8647j7182R932k2042j6144Q865J9555
$$ 16806 14931 -5944 -11595 -2748 4005 34382 15735 -1447 8485 -13557 -29701 -20836 -1281
21193a281q147k2613k263J0946R604J2470l427j529m59Q514R567R573K212q779
$$ -1281 -9428 -32041 -34304 -23358 -13754 -1284 -4711 -6240 -6699 1815 11382 20955 23167 14388
21179A4388j256j3939k7159j8871K0112J8462k2238k409L4734J6400O839J0446
$$ 14388 13132 -807 -27966 -46837 -26725 -8263 -30501 -32910 1824 18224 25063 35509
21167C5509j1632l1139k1865j1346j8622J9436J6246L371r61R213j7259J241P256
$$ 35509 23877 -7262 -29127 -40473 -59095 -39659 -23413 -20042 -21003 -11790 -29049 -27808 -20552
21154b0552J2774j2750j3920J0697K5962N727k698m780J7474j7684j1184K2341
$$ -20552 -7778 -20528 -34448 -23751 2211 7938 5240 460 17934 250 -10934 11407
21142A1407K605q594n635p388L846k947j7007o120r247K1699q441O311O012J1053
$$ 11407 14012 5418 -217 -7605 -3759 -6706 -23713 -29833 -39080 -17381 -25822 -19511 -13499 -2446
21128b446j1388K820O834L0000j9745k5458j5704K785J1156k3134M078N813j3558
$$ -2446 -13834 -11014 -4180 25820 6075 -19383 -35087 -32302 -21146 -44280 -40202 -34389 -47947
21115d7947Q733R422L628J1700J273L6658n64j4882q584K218m0306j1823K0685
$$ -47947 -39214 -29792 -26164 -14464 -13191 23467 22903 8021 -563 1655 -38651 -50474 -29789
21102b9789l502L30J3433J2235o178q524j1486Q266L826p972Q662L750J5186M600
$$ -29789 -33291 -32961 -19528 -7293 -13471 -21995 -33481 -25215 -21389 -29361 -20699 -16949 -1763 2837
21088B837j1732p006J6847p814J128K440k029j5712J763J0689r570J9817j1381
$$ 2837 -8895 -15901 946 -6868 -5740 -3300 -5329 -21041 -19278 -8589 -18159 1658 -9723
21075i723j6801K0968K4558K7006j1154k5170j9576j7483K7211K9297j7814q549
$$ -9723 -26524 -5556 19002 46008 34854 9684 -9892 -27375 -164 29133 11319 2770
21063B770o416l3999j5853K7504M2021K1898j6796j2798J9937p080k4056p083
$$ 2770 -3646 -37645 -53498 -25994 16027 37925 21129 8331 28268 21188 -2868 -9951
21051i951J0705l1440m962k1369P757L3791l1094k4127n116N809L663N2484K9755
$$ -9951 754 -30686 -35648 -57017 -49260 -15469 -46563 -70690 -75806 -69997 -66334 -13850 15905
21038A5905J3069j178r297k9978m922L8586o377k0590j2612L019m456K0440k1041
$$ 15905 28974 27796 18499 -11479 -16401 22185 15808 -4782 -17394 -14375 -18831 1609 -19432
21025a9432k4131L613Q423J0741Q407m617L1705J5604p220J2387k016k0733j0600
$$ -19432 -43563 -39950 -31527 -20786 -12379 -16996 14709 30313 23093 35480 33464 12731 2131
21012B131q729K754k198l3670N835J9818R908k0106J0647M965K7826M701k6634
$$ 2131 -6598 -3844 -6042 -39712 -33877 -14059 -4151 -24257 -13610 -8645 19181 23882 -2752
20999b752l518J0997j933K3298o831K983Q002o191Q360k2036l2255j6846K338
$$ -2752 -6270 4727 2794 26092 19261 22244 30246 24055 32415 10379 -21876 -38722 -36384
20986c6384L2123r606j6485J2782L7446J8112j029j8497m023J5360j2986N562
$$ -36384 -4261 -13867 -30352 -17570 19876 37988 36959 18462 14439 29799 16813 22375
20974B2375K8902j9905m1521j0520N438q839n436l286P165o808K3671Q345j8287
$$ 22375 51277 31372 -10149 -20669 -15231 -24070 -29506 -32792 -25627 -32435 -8764 -419 -18706
20961a8706K180O802Q451J6018J27J3777J7885r8q197j8683n893R436M686k442
$$ -18706 -16526 -9724 -1273 14745 14872 28649 46534 46436 38239 19556 13663 23099 27785 25343
20947B5343j0927j9228j2922K8046L2943p128k2684j4585j5134q490K7723P261
$$ 25343 14416 -4812 -17734 10312 43255 36127 13443 -1142 -16276 -24766 2957 10218
20935A0218l7584k1764J8503L2229N343P722j0424l1551j3821M964O848k2960
$$ 10218 -27366 -49130 -30627 1602 6945 14667 4243 -27308 -41129 -36165 -29317 -52277
20923e2277l00K2456J1183J5638J344K550j2232k6639L404K2732M2721J7903l550
$$ -52277 -52577 -30121 -18938 -3300 -1956 594 -11638 -38277 -34873 -12141 30580 48483 44933
20910D4933j9739j9827Q720K2322r523q755j2745J8769r133j177p230k1178l720
$$ 44933 25194 5367 14087 36409 26886 18131 5386 24155 15022 13845 6615 -14563 -18283
20897a8283q061j2936r300Q690J2870P55l9408j488L2980k047J657J3778N856
$$ -18283 -26344 -39280 -48580 -39890 -27020 -26265 -65673 -67161 -34181 -36228 -34571 -20793 -14937
20884a4937J3818n009l560Q509P64K622j5873m03J2141j759K242J9844J09j3301
$$ -14937 -1119 -6128 -9688 -1179 -415 2207 -13666 -14069 -1928 -3687 -1445 18399 18508 5207
20870E207q953q498p345j0145j9910O826J9900J666k397j0484J9408O710j1491
$$ 5207 -3746 -12244 -19589 -29734 -49644 -42818 -22918 -21252 -23649 -34133 -14725 -8015 -19506
20857a9506j5971J580m199l2337J8731L6295j437r474K385N926j808l619J4823
$$ -19506 -35477 -33897 -38096 -70433 -51702 -15407 -16844 -26318 -23933 -18007 -19815 -23434 -8611
20844h611L852K6885J862j2022j5072l7611N794M140J2137J3578K7559K1420m1447
$$ -8611 -4759 22126 23988 11966 -3106 -40717 -34923 -30783 -18646 -5068 22491 43911 2464
20831B464j167r196j9132L2379J9660l860J4003L1211k0653j683j7727j1939J5435
$$ 2464 1297 -7899 -27031 5348 25008 21148 35151 66362 45709 44026 26299 14360 29795
20818B9795J7155j6056Q426J7358j0852r650j3891r436r905O240k8895j5377N830
$$ 29795 46950 30894 39320 56678 45826 36176 22285 12849 2944 9184 -19711 -35088 -29258
20805b9258L0531L8532N047j9663P652j863l1914j783l1100J4621K4476P765J1454
$$ -29258 1273 39805 44852 25189 32841 30978 -936 -2719 -33819 -19198 5278 13043 24497
20792B4497j564l4560k2636p979l128r335n810n832M7001J9738M379L3163J0476
$$ 24497 22933 -11627 -34263 -42242 -45370 -54705 -60515 -66347 -19346 392 4771 37934 48410
20779D8410r373j7681p494n959O92j9202R978J2242k604l1102k6870J3912K7655
$$ 48410 39037 21356 13862 7903 8595 -10607 -629 11613 9009 -22093 -48963 -35051 -7396
20766g396K2394j1024k9873J6613J9968K7425k9226j1206L328J2803K9471Q361
$$ -7396 14998 3974 -25899 -9286 10682 38107 8881 -2325 1003 13806 43277 51638
20754E1638j9619j2025j3607r584n523R709k5862M455J3663K6659R654J7594J9749
$$ 51638 32019 19994 6387 -3197 -8720 989 -24873 -20418 -6755 19904 29558 47152 66901
20741F6901j6980k3092m080j7515k5661j8209L2423J9258K2529r118l5489M675
$$ 66901 49921 26829 22749 5234 -20427 -38636 -6213 13045 35574 26456 -9033 -4358
20729d358O676k1940n696J6686j139O497J7081K8141J9929k3283l266J1374l4932
$$ -4358 2318 -19622 -25318 -8632 -9771 -3274 13807 41948 61877 38594 35328 46702 11770
20716A1770j0938J2816J0294m1818k5352J9216O305K464o23r026K178Q803N903
$$ 11770 832 13648 23942 -17876 -43228 -24012 -17707 -15243 -15866 -24892 -22714 -13911 -8008
20703h008r37J7866J316J5361R769j6227l3427K356K0530J0274m0743k4260q00
$$ -8008 -8945 8921 10237 25598 35367 19140 -14287 -11931 8599 18873 -21870 -46130 -46930
20690d6930J3730L5675Q635L985j3139j920n571q262k846J9421K1309l759M538
$$ -46930 -33200 2475 11110 15095 1956 36 -5535 -13797 -16643 2778 24087 20328 24866
20677B4866l7580k7329k1254J4916o678k542L2849l102p382J3805r565J335J363
$$ 24866 -12714 -40043 -61297 -46381 -53059 -55601 -22752 -25854 -33236 -19431 -28996 -27661 -26298
20664b6298j3716J5289K7335J5707Q170Q953j296l1920j9604K177n822K7383R96
$$ -26298 -40014 -24725 2610 18317 26487 35440 34144 2224 -17380 -15203 -21025 6358 7354
20651G354j7532k2217J7254j168q019Q532K2750O050j0450M392J337j0979o700
$$ 7354 -10178 -32395 -15141 -16309 -24328 -15796 6954 13004 2554 6946 8283 -2696 -9396
20638i396J5023m381m030j1676J0265q774j2730o657m607J4622m411m787j1372
$$ -9396 5627 1246 -2784 -14460 -4195 -12969 -25699 -32356 -36963 -22341 -26752 -31539 -42911
20625d2911J6215K3302k6278r272R772K8970M875q438l43n152J2421J7527o78
$$ -42911 -26696 -3394 -29672 -38944 -29172 -202 4673 -3765 -4108 -9260 3161 20688 20010
20612B0010K6k3763J1528j3582j6614j0441J9533L6330n435J939k5339j3426L730
$$ 20010 20036 -3727 7801 -5781 -22395 -32836 -13303 23027 17592 19531 -5808 -19234 -15504
20599a5504M452J7564O468r558J2440J3912j6871Q660R545k7131l3006l1818j4278
$$ -15504 -11052 6512 12980 3422 15862 29774 12903 21563 31108 3977 -29029 -60847 -75125
20586g5125J7491K2046K8844J7023J7667j6212M763l997j7344j4290j7326K9865
$$ -75125 -57634 -35588 -6744 10279 27946 11734 16497 12500 -4844 -19134 -36460 -6595
20574f595O487r049l781J6535k3261m902J0352M443K722M087k892O08J7736k193
$$ -6595 -108 -9157 -12938 3597 -19664 -24566 -14214 -9771 -7049 -2962 -5854 -5246 12490 10297
20560A0297K4793j5956l3231K6818J7808l521n672J5260K219j8703k6484j018
$$ 10297 35090 19134 -14097 12721 30529 27008 21336 36596 38815 20112 -6372 -7390
20548g390K2850J6846o455j5105J6093K3203L859L139R179j2926j9138j3738N401
$$ -7390 15460 32306 25851 10746 26839 50042 53901 57040 66219 53293 34155 20417 25818
20535B5818Q295p03o659R141N317n73M08l2813k7957r180O547J2263M2992J2584
$$ 25818 34113 33410 26751 35892 41209 40636 41044 8231 -19726 -28906 -22359 -10096 32896 45480
20521D5480j055j550K961k3872m3420R742L1626K9006K555j5081k3288l3540m43
$$ 45480 44425 42875 45836 21964 -21456 -11714 19912 48918 51473 36392 13104 -20436 -20879
20508b0879o558R852K5061J899j6675j0125K481Q910j6877k1088j131L248J2643
$$ -20879 -27437 -17585 7476 9375 -7300 -17425 -14944 -6034 -22911 -43999 -45130 -41882 -29239
20495b9239L7745Q465m840n060O494J1358j7520j9108K0971J4794Q042P53m977
$$ -29239 8506 16971 12131 7071 13565 24923 7403 -11705 9266 24060 32102 32855 27878
20482B7878q696j3854r994L688L998p655k998m563J4275J3606P964O049J2659
$$ 27878 19182 5328 -4666 -978 3020 -4635 -7633 -12196 2079 15685 23649 29698 42357
20469D2357k899n561N158j2607j5545K746j6638m7094j4698J9350K8668P945k0279
$$ 42357 39458 33897 39055 26448 10903 13649 -2989 -50083 -64781 -45431 -16763 -8818 -29097
20456b9097m881L4873r772R969M1874n668k8261k9528J2482qK4097J3710l2571
$$ -29097 -33978 895 -8877 1092 42966 37298 9037 -20491 -8009 -8017 16080 29790 -2781
20443b781R532j1552N744L625n371k0760l460k50K7527N611n051J7522P14O816
$$ -2781 6751 -4801 943 4568 -803 -21563 -25023 -25273 2254 7865 2814 20336 21050 27866
20429B7866J7132p892l6491j4671n907p153n495K7874L457j6492P446J2748m609
$$ 27866 44998 37106 615 -14056 -19963 -27116 -32611 -4737 -1280 -17772 -10326 2422 -2187
20416b187j9241J5243K9429J0766j5161l8373L613R826K018q918k2262j1284J3391
$$ -2187 -21428 -6185 23244 34010 18849 -19524 -15911 -6085 -4067 -12985 -35247 -46531 -33140
20403c3140p083M004K7456J1265K2068k394k0284O544l866j4460o182k989k829
$$ -33140 -40223 -36219 -8763 2502 24570 22176 1892 8436 4570 -9890 -16072 -19061 -21890
20390b1890R254J9401m98O710j7875q664j0854j1327K8976M2935J3336o124j1372
$$ -21890 -12636 6765 6267 12977 -4898 -13562 -24416 -35743 -6767 36168 49504 43380 32008
20377C2008k2144j1086L1393J4304l053O738K4373k3107p625k8679j5539K941
$$ 32008 9864 -1222 30171 44475 41422 48160 72533 49426 41801 13122 -2417 524
20365E24M753J3931j090k4924k6267j9620J633L4174k24L219l078p649J2043p640
$$ 524 5277 19208 18118 -6806 -33073 -52693 -51060 -16886 -17110 -13891 -16969 -24618 -12575 -20215
20351b0215K2555O487k9071J2753M0438n934J0077N808l125j4270k5780k2311
$$ -20215 2340 8827 -20244 -7491 32947 27013 37090 42898 39773 25503 -277 -22588
20339b2588K6668O130q185k2674k426P903N257K6973J1922M42q666j6389p133
$$ -22588 4080 10210 2025 -20649 -23075 -15172 -9915 17058 28980 29422 20756 4367 -2766
20326b766o56J7951L7120k08j004p191k3869k396J2043l911q049j2639o081J8834
$$ -2766 -3422 14529 51649 51441 50437 43246 19377 16981 29024 25113 17064 4425 -1656 17178
20312A7178K9214k3059j7737R941K997k907K238P297o32R58K944J1268p098j9555
$$ 17178 46392 23333 5596 15537 18534 15627 17865 25162 24530 25488 28432 39700 32602 13047
20298A3047J0951J8879J1915j0277K029J5472o105J1595j7090j9071j4197L676
$$ 13047 23998 42877 54792 44515 46544 62016 55911 67506 50416 31345 17148 20824
20286B0824J8200J4900j2986l6448k7980M602J5118L2J8765n556k715k486J5289
$$ 20824 39024 53924 40938 4490 -23490 -18888 -3770 -3738 15027 9471 6756 4270 19559
20273A9559j1551R076K4973o296Q368j595K913M696N398M736j4732j4285j5773
$$ 19559 8008 17084 42057 35761 44129 42534 45447 50143 55541 60277 45545 31260 15487
20260A5487N331o388j5330J5162n826k015J204j483J7680j4584J7651n978j5219
$$ 15487 20818 14430 -900 14262 8436 6421 7625 6142 23822 9238 26889 20911 5692
20247E692n733J4415K9265R401k5559N770R896q938R339l858m646l767N511J0006
$$ 5692 -41 14374 43639 53040 27481 33251 43147 34209 43548 39690 35044 31277 36788 46794
20233D6794q844l4852J0020M5469J1924j5878r675J2818n787j5291j9840L1640
$$ 46794 37950 3098 13118 58587 70511 54633 44958 57776 51989 36698 16858 48498
20221D8498J7348l571r392k4129k1854j708Q69K1389n451l622j920l0342o36Q800
$$ 48498 65846 62275 52883 28754 6900 5192 6061 27450 21999 18377 16457 -13885 -14521 -5721
20207e721Q52K0815Q059L649J0760n529k6764j5731J4770K2741K2306O331k4747
$$ -5721 -4869 15946 24005 27654 38414 32885 6121 -9610 5160 27901 50207 56538 31791
20194C1791J6951j3172m834K6706J5511k149l1878j7950r399k699l351O711P097
$$ 31791 48742 35570 30736 57442 72953 70804 38926 20976 11577 8878 5527 12238 19335
20181A9335J6749K0615J0009K7330J2802l3051j2664k238k1229J2432k3162k8278
$$ 19335 36084 56699 66708 94038 106840 73789 61125 58887 37658 50090 26928 -1350
20169a350K057J5407p505J8860J165L254J233n784J490K7671K8421k4080j8284
$$ -1350 707 16114 8609 27469 28634 31888 33121 27337 28827 56498 84919 60839 42555
20156D2555k3754p532l538O327K850M23k7042j4653L969K9942K0328K1233o563
$$ 42555 18801 11269 7731 14058 16908 17331 -9711 -24364 -20395 9547 29875 51108 44545
20143D4545Q303q372J3449R965q507n142j2384J074q389k0116P377R274k7791
$$ 44545 52848 44476 57925 67890 59383 54241 41857 42931 34542 14426 21803 31077 3286
20130C286j7365J0067j2704J0905K5510J0689R182j7609l3881j3367j4882Q282
$$ 3286 -14079 -4012 -16716 -5811 19699 30388 39570 21961 -11920 -25287 -40169 -31887
20118c1887L0216J9272r133j3723L449o031K0092J4552J7699J0621j1290k5156
$$ -31887 -1671 17601 8468 -5255 -1806 -7837 12255 26807 44506 55127 43837 18681
20106A8681j0155O628J4163K7521k128J6190J4960p909q435k2238j3906k3801
$$ 18681 8526 15154 29317 56838 54710 70900 85860 77951 69516 47278 33372 9571
20094I571j0994j1306p656K3933L5808n820j8481J1853r218R13K2313J0871K1028
$$ 9571 -1423 -12729 -20385 3548 39356 33536 15055 26908 17690 18603 40916 51787 72815
20081G2815K1395j8269m174J3833o339k3823m075J5370j7733J0717p180j5268
$$ 72815 94210 75941 71767 85600 79261 55438 51363 66733 49000 59717 52537 37269
20069C7269m42J2257K4764r190m41j448M318O889R81k8370J5638r543k7776N303
$$ 37269 36827 49084 73848 64658 64217 62769 67087 73976 74957 46587 62225 52682 24906 30209
20055C0209P805k3678l0367J7955q18J4344j120k548J6571m798J8068M989j9002
$$ 30209 38014 14336 -16031 1924 1106 15450 14330 11782 28353 23555 41623 46612 27610
20042B7610n130K472J8624k901k769p06O828J9980j8360k2709n271J8222Q327
$$ 27610 22480 24952 43576 40675 37906 37200 44028 64008 45648 22939 17668 35890 44217
20029D4217j5140k0436J1809M90R652l50O661m051k0181k6098K915N17m447J6064
$$ 44217 29077 8641 20450 20940 30592 30242 36903 32852 12671 -13427 -10512 -9995 -14442 1622
20015A622J943K248l559j7230K3989K1269l897m920r553L1901N678k9663J4366
$$ 1622 3565 5813 2254 -14976 9013 30282 26385 21465 11912 43813 49491 19828 34194
20002C4194K8123K2228l5848l0451k050K4192J0318L162q295k7351l3555K6411
$$ 34194 62317 84545 48697 18246 16196 40388 50706 53868 45573 18222 -15333 11078
19990A1078N6883L0777J7348j6637L1760J0380l058L548L593P114j0783j1674
$$ 11078 67961 98738 116086 99449 131209 141589 138531 142079 145672 152786 142003 130329
19978A30329l616K369J4243j0319o93k3069P582n482o263k2555j8445j8802J5970
$$ 130329 126713 129082 143325 133006 132313 109244 116826 111344 105081 82526 64081 45279 61249
19965F1249j7329p873R25o642L4740J1332j5099l7672K5119J5775m793k6907k2556
$$ 61249 43920 36047 36972 30330 65070 76402 61303 23631 48750 64525 59732 32825 10269
19952A0269R684J3834J6794l980j35k512J9070N312J0646J2230m0414k315J5178
$$ 10269 19953 33787 50581 46601 46466 43954 63024 68336 78982 91212 50798 48483 63661
19939F3661N585J8786J8915K0807M232J323J4909K3077R634j229k8027j2012k0735
$$ 63661 69246 88032 106947 127754 131986 133309 148218 171295 180929 179700 151673 139661 118926
19926A18926j1040P914R727J216p198K1918J5864j6099j8314j6970k7232m796
$$ 118926 107886 115800 125527 126743 119545 141463 157327 141228 122914 105944 78712 73916
19914G3916K486K7066N000k961j9285k1010j2090J398k0923l68M0997M5157Q916
$$ 73916 76402 103468 108468 105507 86222 65212 53122 54520 33597 33229 74226 119383 128299
19901A28299k6597p210k3297k4628Q283J8681Q199N894j2674n512P590Q088j999
$$ 128299 101702 94492 71195 46567 54850 73531 81730 87624 74950 69438 77028 85116 83117
19888H3117J4175p829k7830j1976J913j300O558m513N39m7p388Q746j952p180
$$ 83117 97292 89463 61633 49657 51570 50270 56828 52315 52854 52807 45419 54165 52213 45033
19874D5033k025j9307l0691j8555L402L2198J4868K7120J324r38J609l5043J7049
$$ 45033 43008 23701 -6990 -25545 -22143 10055 24923 52043 53367 52429 54038 18995 36044
19861C6044L0209J4169J7679o266j6054k002R707j2571n192j2406j8986J4723
$$ 36044 66253 80422 98101 91835 75781 73779 83486 70915 65723 53317 34331 49054
19849D9054j3726l2775o044k2829J8342L7744O075j5070J6424J7476j023j9449
$$ 49054 35328 2553 -3491 -26320 -7978 29766 35841 20771 37195 54671 53648 34199
19837C4199J4483J1191l713J8405J557j0611j6637N076p265R533R112Q282P13
$$ 34199 48682 59873 56160 74565 76122 65511 48874 53950 46685 56218 65330 73612 74325
19824G4325p544k0772J972J0816J6065J3597n463K421k1009Q849k47j5830J6345
$$ 74325 66781 46009 47981 58797 74862 88459 82996 85417 64408 73257 73010 57180 73525
19811G3525j9921k787L019L5022K1108r664k3353J0843j1977j6406q518o758J749
$$ 73525 53604 50817 53836 88858 109966 100302 76949 87792 75815 59409 50891 44133 45882
19798D5882J6634J0937J9527j4149n92j4432o17j2084r640K9756P969J1641j334
$$ 45882 62516 73453 92980 78831 78239 63807 63190 51106 41466 71222 79191 90832 89498
19785H9498m0931k8756K7156K3916K0825q388j9940O041N705J7105K030r753j567
$$ 89498 48567 19811 46967 70883 91708 83320 63380 69421 75126 92231 94261 84508 82941
19772H2941J514r6p714j5214N010K8009K5091o62k8423l0422J0692l2243j6326
$$ 82941 84455 84359 76645 61431 66441 94450 119541 118879 90456 60034 70726 38483 22157
19759B2157K2196m971j5188M0170J8867o989Q292m057L093j1772k7000q197J0151
$$ 22157 44353 39382 24194 64364 83231 76242 84534 80477 83570 71798 44798 36601 46752
19746D6752O069k561l251L4491L1766p768J0340K725L837J2449j0152Q448O475
$$ 46752 52821 50260 47009 81500 113266 105498 115838 118563 122400 134849 124697 133145 139620
19733A39620j0524j9808j2556O941K6508N163j6072j3675j4651p871q151j5135
$$ 139620 129096 109288 96732 103673 130181 135344 119272 105597 90946 83075 74924 59789
19721E9789j2755J2281K5585M090m47m1345q076K8681R570K134J5594j5064n000
$$ 59789 47034 59315 84900 88990 88543 47198 39122 67803 77373 79507 95101 80037 75037
19708G5037N406p96j5527l1145J9893K2568P236j8484j3273q278K9349J7217k801
$$ 75037 80443 79647 64120 32975 52868 75436 82672 64188 50915 42637 71986 89203 86402
19695H6402n499J4347R739n795l7468J0221J0094O427R959N733O2k2315k6044
$$ 86402 80903 95250 104989 99194 61726 71947 82041 88468 98427 104160 104222 81907 55863
19682E5863j5432N042K3803Q454K1588K3095o322k0763O605j8877k5296J8261
$$ 55863 40431 45473 69276 77730 99318 122413 116091 95328 101933 83056 57760 76021
19670G6021K2339Q074k4413m368J9365m641k3382Q548Q468k871K983k949Q257
$$ 76021 98360 106434 82021 77653 97018 92377 68995 77543 86011 83140 86123 83174 91431
19657I1431r208j733K85k5081J1700K7805K1821j3605j2038J4897J0457l6868
$$ 91431 82223 80490 80775 55694 67394 95199 117020 103415 91377 106274 116731 79863
19645G9863n696K0342m574j2339Q281R738m137k944j401lK4869j1408j0232J77
$$ 79863 74167 94509 89935 77596 85877 95615 91478 88534 87133 87130 111999 100591 90359 90536
19631I0536L266Q602j1281k585J8969N437k2959j1259J7927J4137k182j9611p583
$$ 90536 93802 102404 91123 88538 107507 112944 89985 78726 96653 110790 108608 88997 81414
19618H1414O0J3147Q182N577j3022j7888J1728J4245p420j4745m332K1018J4402
$$ 81414 81474 94621 102803 108380 95358 77470 89198 103443 96023 81278 76946 97964 112366
19605A12366k6875K902K8482P35j3903j2989j2565M517K2909j9827Q143K5527
$$ 112366 85491 88393 116875 117610 103707 90718 78153 82670 105579 85752 93895 119422
19593A19422O498m757q462q170j409J9054j2549m38K0130j5857j5594O392J2181
$$ 119422 125920 121163 112701 104531 103122 122176 109627 109189 129319 113462 97868 104260 116441
19580A16441O156O667N817k2r237j9441K571K6058J3641L3254J1252J9517P6699
$$ 116441 122597 129264 135081 135059 125822 106381 108952 135010 148651 181905 193157 212674 289373
19567B89373O5959Q0253M6451l3113k2143K8187L3734j303j6712J6408J481m6168
$$ 289373 355332 435585 482036 448923 426780 454967 488701 487398 470686 487094 488575 442407
19555D42407k7310k4320n4095o0192n6737n1261k2919j972k9435j7151Q855K2216
$$ 442407 415097 390777 336682 276490 219753 168492 145573 143601 114166 97015 105870 128086
19543A28086L388K4621J705o996l698l0008l4256J5584n31m021R322J3690j3526
$$ 128086 131474 156095 157800 150804 147106 117098 82842 98426 97895 93874 103196 116886 103360
19530A03360k3388P854J1381J2326j820L6034K3437n2308k6897K2263J6301j1444
$$ 103360 79972 87826 99207 111533 109713 145747 169184 116876 89979 112242 128543 117099
19518A17099m946k878J9437K6640N830R864K2561j8951j1464Q943K1296L3840
$$ 117099 112153 109275 128712 155352 161182 171046 193607 174656 163192 172135 193431 227271
19506B27271J0920j9892n8228j4469k4915n818M5110J1517l0435n749J1903K0311
$$ 227271 238191 218299 160071 145602 120687 114869 159979 171496 141061 135312 147215 167526
19494A67526Q260l066M7634L9405K0618O4721L4987K5585N4225J29498J31664
$$ 167526 175786 172720 220354 259759 280377 345098 380085 405670 459895 589393 721057
19483G21057J69997J85444J53405L9351p324l1970q2752k9198K2263M7274j9733
$$ 721057 891054 1076498 1229903 1269254 1261930 1229960 1147208 1118010 1140273 1187547 1167814
19472A167814r8742j39054j58980j87090j30421o0857n8254p4062m9692M441K6539
$$ 1167814 1069072 930018 771038 583948 453527 392670 334416 260354 210662 215103 241642
19461B41642j445J230J4371J9252j9059K778j4240j4866L377K456L482J5774j4613
$$ 241642 240197 241427 255798 275050 255991 258769 244529 229663 233040 235496 238978 254752 240139
19448B40139k8731r987k5788k2394j3768J095J0538J3731p648k7536l439R986
$$ 240139 211408 201421 175633 153239 139471 140566 151104 164835 157187 129651 126212 136198
19436A36198R106K0959n755j2275J8789j8202K193J347m67n496J1442J5603j2157
$$ 136198 145304 166263 160508 148233 167022 148820 151013 152360 151893 146397 157839 173442 161285
19423A61285l984M609O700L2016j0897k4171j8940K90J232J667q696K5010j2534
$$ 161285 157301 161910 168610 200626 189729 165558 146618 146908 148140 149807 141111 166121 153587
19410A53587J570P366J6382J3603J80l5971k3073j0667K2000M3310o963p085J1997
$$ 153587 155157 162523 178905 192508 192688 156717 133644 122977 144977 188287 181324 174239 186236
19397A86236K5416J3620q45q887j5038j4066J1082J6114j491j5317K9970K6966
$$ 186236 211652 225272 224427 215540 200502 186436 197518 213632 212141 196824 226794 253760
19385B53760J3547k4680Q063L2365K7278l657P526Q2Q156J1086L7088M9587N9197
$$ 253760 267307 242627 250690 283055 310333 306676 314202 314284 322440 333526 370614 420201 479398
19372D79398N1773Q4010J18044J63939K15295K73617K85098K10993O2460j54871
$$ 479398 531171 615181 733225 897164 1112459 1386076 1671174 1882167 1944627 1789756
19362A789756k49800k66813k44114j87519j09252J1552N4967J18850K08165K60904
$$ 1789756 1539956 1273143 1029029 841510 732258 743810 798777 917627 1125792 1386696
19352A386696K56235K33282P4321j47554k62643l13819l33755k46133j52845p4426
$$ 1386696 1642931 1876213 1950534 1802980 1540337 1226518 892763 646630 493785 419359
19342D19359m1530l3086l8998m4028m0851k2367J3313J7867j1305Q118K342l6462
$$ 419359 377829 344743 305745 261717 220866 198499 211812 229679 218374 226492 228834 192372
19330A92372Q82M287J2640J4201q93n007j375K222L6746j415m4173k7909p963
$$ 192372 193254 197541 210181 224382 223489 218482 217107 219329 256075 254660 210487 182578 174615
19317A74615Q423Q892n394L782J1510r09j950o921k388K6714K4819j4835N432
$$ 174615 183038 191930 186536 190318 201828 200919 198969 192048 189660 216374 241193 226358 231790
19304B31790R49k49o971j334j7555k5240J6958J2724m239m093J0998p376j9069
$$ 231790 232739 232490 225519 224185 206630 181390 198348 211072 206833 202740 213738 206362 187293
19291A87293M2476L0565k1023p800L6593J2725j7123L234J8066L6416J8696P177
$$ 187293 229769 260334 239311 231511 268104 280829 263706 266940 285006 321422 340118 347295
19279C47295K4295J4766L3546R6552J23090J51107J19218J18130M2892j24531
$$ 347295 371590 386356 419902 516454 639544 790651 909869 1027999 1070891 946360
19269I46360j76893j29209n2654k595k312J3589N3371K2258P55J894l3846o0645
$$ 946360 769467 640258 587604 585009 582697 596286 649657 671915 672670 674564 640718 580073
19257E80073n4420l784N5428O6278O6924O6301M8565K5786K2405L0068j7419j6349
$$ 580073 525653 521869 577297 643575 710499 776800 825365 851151 873556 903624 886205 869856
19245H69856P7582M1297k4382r560J0942L7033K3394j9732j7674r193k7540l7832
$$ 869856 947438 988735 964353 954793 965735 1002768 1026162 1006430 988756 979563 952023 914191
19233I14191m9184m5444J0289L7295l51p6938j06535j16699p6266m4829l8909
$$ 914191 865007 819563 829852 867147 866796 789858 683323 566624 490358 445529 406620
19222D06620j3447N724J3223K3996K0339L4274M8191N0051N5068O0408L0468r942
$$ 406620 393173 398897 412120 436116 456455 490729 538920 588971 644039 704447 734915 724973
19210G24973n1525m6367m4940m341K9593J9386O1685J13369J24786O6036N1970
$$ 724973 673448 627081 582141 577800 607393 626779 688464 801833 926619 992655 1044625
19199A044625O4221N6159L9080J1485n773k4883m8301o2060q7644q4191Q002O5265
$$ 1044625 1108846 1165005 1204085 1215570 1209797 1184914 1136613 1074553 986909 902718 910720 975985
19187I75985N6463j2869k2896m2152k3554o7322j07027j19505j33220r2060n4446
$$ 975985 1032448 1019579 996683 954531 930977 863655 756628 637123 503903 411843 357397
19176C57397l2880r451j7175p109O089j3056q657r363J080p539k252m318J5201
$$ 357397 324517 315066 297891 290782 296871 283815 275158 265795 266875 259336 257084 252766 267967
19163B67967j0057N293Q382J5101K0709j8850j9717L6442M800k3692p827j2811
$$ 267967 257910 263203 271585 286686 307395 288545 268828 305270 310070 286378 278551 265740
19151B65740j9336p121R51J958k5414K033j731L8389J0046l3631k2383J4708M664
$$ 265740 246404 239283 240234 242192 216778 218811 217080 255469 265515 231884 209501 224209 228873
19138B28873k7199l400L558K3798N0653K5360k6979k2200j0690j4774P314O2051
$$ 228873 201674 198274 201832 225630 276283 301643 274664 252464 241774 227000 234314 296365
19126B96365L1275k7664j7127K9089J1003P543K7943L9590P6458P3754O6340P6255
$$ 296365 327640 299976 282849 311938 322941 330484 358427 398017 474475 548229 614569 690824
19114F90824L4567M6441O5086O5391M1640j0549m3126l0382K9024O2254M2419
$$ 690824 725391 771832 836918 902309 943949 933400 890274 859892 888916 951170 993589
19103I93589M020j1968n1207j24661q2407K2160M2762J6084o3811j27326j06685
$$ 993589 997609 985641 934434 809773 727366 749526 792288 808372 744561 617235 510550
19092E10550n6786m5603l7622j8538j3726j8090k6179K3887P037k7415J748r57
$$ 510550 453764 408161 370539 352001 338275 320185 294006 317893 324930 297515 299263 298306
19080B98306J4651j1196O280J2648N9716L3225L5790M1056M8832N3745J8596l751
$$ 298306 312957 301761 308041 320689 380405 413630 449420 490476 539308 593053 611649 607898
19068F07898n733J1539M7071R1250O0246K1914k1240O776J1235K7147M7970L4318
$$ 607898 602165 613704 660775 752025 812271 834185 812945 819721 830956 858103 906073 940391
19056I40391K6917Q323Q942p804j0501n3664j04793j22268r5247n5597l3930m9049
$$ 940391 967308 975631 984573 976769 966268 912604 807811 685543 590296 534699 500769 451720
19044D51720q1049n9767o3454j9379K0155M7480N3589K7214K3765j7746k0591
$$ 451720 370671 310904 247450 228071 248226 295706 349295 376509 400274 382528 361937
19033C61937l0673k2516J4989N016K5130K1928J5361M0978N9886O5242J8524K0081
$$ 361937 331264 308748 323737 328753 353883 375811 391172 432150 492036 557278 575802 595883
19021E95883o059j1920o1327P232R515j161O863M32k8699l7493O770j66j099J2949
$$ 595883 589824 577904 516577 523809 533324 532163 539026 539458 510759 473266 480036 479870 478771 491720
19007D91720O592k3618n7131k3793k1386j2215J8991J5783J2006J4620L0144K8632
$$ 491720 498312 474694 417563 393770 372384 360169 379160 394943 406949 421569 451713 480345
18995D80345J5702K5427n603L274K6108L9716N9339N7773N7469M3384n016j1705
$$ 480345 496047 521474 515871 519145 545253 584969 644308 702081 759550 802934 797918 786213
18983G86213J487J1127o871j4041k8309p139l668M3204P306l804L2403K5556n530
$$ 786213 787700 798827 791956 777915 749606 742467 738799 782003 789309 785505 817908 843464 837934
18970H37934q296n7654m2519l0996n1094m595K769J1201K3809M8027n148l8873
$$ 837934 829638 771984 729465 698469 647375 642780 645549 656750 680559 728586 723438 684565
18958F84565j3683k2465m753K0814K5847p192R17J7765J5928j5591Q188k952l7864
$$ 684565 670882 648417 643664 664478 690325 683133 684050 701815 717743 702152 710340 707388 669524
18945F69524m3091j938Q456L0826K088q705m6884m9548l847M3617K4224J9733
$$ 669524 626433 624495 632951 663777 665865 657160 610276 560728 556881 600498 624722 644455
18933F44455M587q52R323K1980J8323j0888j6991j2943m0897l2856n673L3413
$$ 644455 649042 648190 657513 679493 697816 686928 669937 656994 616097 583241 577568 610981
18921F10981O1465L5920N599l6922k3223J802p047J2047M1584L8870j3462J1014
$$ 610981 672446 708366 713965 677043 653820 655622 648575 660622 702206 741076 727614 738628
18909G38628M041N135j3946P743m910O077J0857l097m6911k8689K2341j021j7721
$$ 738628 742669 747804 733858 741601 736691 742768 753625 750528 703617 674928 697269 696248 678527
18896F78527J9791q71j3455K3396J3224L7960J5851j1460j2243K351J6151j7967
$$ 678527 698318 697447 683992 707388 720612 758572 774423 762963 750720 753071 769222 751255
18884G51255m8518k6250L6740P0453N0388N3418J8966L126p254j6359j7347l8419
$$ 751255 702737 676487 713227 783680 834068 887486 906452 909578 902324 885965 868618 830199
18872H30199k4578R389K4794J5072R389L9418J0760p379j769k1711k562J5784
$$ 830199 805621 815010 839804 854876 864265 903683 914443 907064 905295 883584 881022 896806
18860H96806n235j3478j0298L6709L4133L6286L6510J6993n083j0336N0926O0756
$$ 896806 891571 878093 867795 904504 938637 974923 1011433 1028426 1023343 1013007 1063933 1124689
18848A124689J6932L6847K5702N7562L3402n418j4415R195K9598N0092L6565K9182
$$ 1124689 1141621 1178468 1204170 1261732 1295134 1289716 1275301 1284496 1314094 1364186 1400751 1429933
18836A429933K7217L6170L4532J2822L2195L1453J2533m315K3598P0527K2982
$$ 1429933 1457150 1493320 1527852 1540674 1572869 1604322 1616855 1612540 1636138 1706665 1729647
18825A729647M7863J5182K9800Q4455J04623N6417K6340m950q5213r7100r2319
$$ 1729647 1777510 1792692 1822492 1906947 2011570 2067987 2094327 2089377 2004164 1907064 1814745
18814A814745m8858K5761L3314L6116M0355L4963P40L655K5610M9430M6879O285
$$ 1814745 1765887 1791648 1824962 1861078 1901433 1936396 1937136 1940791 1966401 2015831 2062710 2068995
18802B068995J3557O0751N8403P4887Q9255J01640P4301N5224R9182Q2694Q9071
$$ 2068995 2082552 2143303 2201706 2276593 2365848 2467488 2541789 2597013 2696195 2778889 2867960
18791B867960J16942J66895K26176K48467L09176L06657K24160J20475J03356
$$ 2867960 2984902 3151797 3377973 3626440 3935616 4242273 4466433 4586908 4690264
18782D690264L9755m0368n4255j4331O7760J51838K94928L68395M06334N32595
$$ 4690264 4730019 4689651 4635396 4621065 4688825 4840663 5135591 5503986 5910320 6442915
18772F442915N77696M35054K37381O3370N288J15701K76849L71212M01960M50699
$$ 6442915 7020611 7455665 7693046 7756416 7761704 7877405 8154254 8525466 8927426 9378125
18762I378125N58812O72356Q04186R38418J080972J165732J202341J151045J171965
$$ 9378125 9936937 10609293 11413479 12351897 13432869 14598601 15800942 16951987 18123952
18753A8123952J235584J397668J720025K155373K692175L413715M344231N558572
$$ 18123952 19359536 20757204 22477229 24632602 27324777 30738492 35082723 40641295
18745D0641295P058648Q926496J1363905J4508510J8444893K3162715K7869898
$$ 40641295 47699943 56626439 67990344 82498854 100943747 124106462 151976360
18738A51976360L0902216L2038378L5163868M2483688N3163722N7363425L9773235
$$ 151976360 182878576 214916954 250080822 292564510 345728232 403091657 442864892
18731D42864892K400468k7141481m0865345m9121575n3418382m5995850k9789693
$$ 442864892 445265360 418123879 377258534 328136959 274718577 228722727 198933034
18724A98933034r319825J1437266K9510908M1821017M5114397L8759697J9196075
$$ 198933034 189613209 201050475 230561383 272382400 317496797 356256494 375452569
18717C75452569o900729l5576676n8429283o5105436o0117503m4538100k7969534
$$ 375452569 368551840 332975164 274545881 209440445 149322942 104784842 76815308
18710G6815308j6839480j0617593p001931m782383l309958k234797j284346l28299
$$ 76815308 59975828 49358235 42356304 37573921 34263963 32029166 30744820 30416521
18702C0416521N75696J415436K194089K885059L626061M593804O110536Q883222
$$ 30416521 30992217 32407653 34601742 37486801 41112862 45706666 51817202 60700424
18694F0700424J3206489J8860247K4557151K8112808K4910537J3586932j718704
$$ 60700424 73906913 92767160 117324311 145437119 170347656 183934588 182215884
18687A82215884j6761076k4609494k2379257j1719056Q65964J0232655J4579978
$$ 182215884 165454808 140845314 118466057 106747001 107612965 117845620 132425598
18680A32425598J1768424L663781l128964n043481m229563r178029j8631098k5126333
$$ 132425598 144194022 147857803 144728839 139685358 135455795 126277766 107646668 82520335
18672H2520335k3659580j6829840j0583726o657548m404370l048768k252142j780622
$$ 82520335 58860755 42030915 31447189 24789641 20385271 17336503 15084361 13303739
18664A3303739j583983j378341j076259p49405n61133l86368k51984j38499n0208
$$ 13303739 11719756 10341415 9265156 8515751 7954618 7568250 7316266 7177767 7127559
18655G127559n2111j05736j91010k40292j88567j31032j81722l51607n09227n43595
$$ 7127559 7075448 6969712 6778702 6538410 6349843 6218811 6037089 5685482 5176255 4632660
18645D632660m21934k51300j26321l9875l4074j8108K7358M4804M4427O4029N1470
$$ 4632660 4210726 3959426 3833105 3793230 3759156 3741048 3768406 3813210 3857637 3921666 3973136
18634C973136L7419P4563J54331K71926L47100L99318M61788O40246P89692Q59082
$$ 3973136 4010555 4085118 4239449 4511375 4858475 5257793 5719581 6359827 7149519 8008601
18624H008601O84052P6848n35572n42313j99704J19867L01671M89142P10512R33801
$$ 8008601 8692653 8769501 8233929 7691616 7491912 7611779 7913450 8402592 9113104 10046905
18614A0046905J163611J433098J800150K154440K555674L035375L582317M364924
$$ 10046905 11210516 12643614 14443764 16598204 19153878 22189253 25771570 30136494
18606C0136494N798397P971556J0144131J1128970J0043254O744025M803249P218482
$$ 30136494 35934891 43906447 54050578 65179548 75222802 81966827 86770076 93988558
18598I3988558J0193355Q868003M671330J045219J295986O337565R641898M213417
$$ 93988558 104181913 113049916 117721246 118766465 120062451 126400016 136041914 140255331
18590A40255331p650841j3862692j3040129p332337j864360k456311q082954j2616156
$$ 140255331 132604490 118741798 105701669 98369332 96504972 94048661 85965707 73349551
18582G3349551j6106322j5336873j0887150o690235m068608k565742j643653j052397
$$ 73349551 57243229 41906356 31019206 24328971 20260363 17694621 16050968 14998571
18574A4998571p35169n80834m61673k39917Q5898L68781O20390Q23854R82750
$$ 14998571 14263402 13682568 13220895 12980978 13066876 13435657 14056047 14879901 15862651
18565A5862651J242086J617712J967900K226687K604528L256814M334588O123224
$$ 15862651 17104737 18722449 20690349 22917036 25521564 28778378 33112966 39236190
18557C9236190Q434480J0685782J2036351J1727592P335856N62745J640018R625292
$$ 39236190 47670670 58356452 70392803 82120395 89456251 90018996 91659014 101284306
18549A01284306J7149259K0114836J6649868L819595o295049k661347M020278
$$ 101284306 118433565 138548401 155198269 159017864 152722815 150061468 154081746
18542A54081746L755697L490410M189801r07480q279253j4957757j9513757j8681212
$$ 154081746 157837443 161327853 165517654 164610174 156330921 141373164 121859407 103178195
18534A03178195j2092867o835603q087753j4727924j6531638j2425189p809988
$$ 103178195 91085328 84249725 76161972 61434048 44902410 32477221 24667233
18527B4667233m844314l138776k179413j643013j335921j102485q98586p07555
$$ 24667233 19822919 16684143 14504730 12861717 11525796 10423311 9524725 8817170
18519H817170n94608n08466m73676n06072n02905n62804o41851n61346m22709
$$ 8817170 8222562 7714096 7240420 6734348 6231443 5668639 5026788 4465442 4042733
18510D042733l04425k19947j89619j70723j33508j35198j62792j92713k00490
$$ 4042733 3738308 3518361 3328742 3158019 3024511 2889313 2726521 2533808 2333318
18501B333318j90047j09315o3089k0055L7450P4993J67023K26636L38355L78354
$$ 2333318 2143271 2033956 1970867 1950812 1988262 2063255 2230278 2456914 2795269 3173623
18491C173623L38741J75088m9893k22658j57415M3939J46609R9446m6235k60012
$$ 3173623 3512364 3687452 3637559 3414901 3257486 3301425 3448034 3547480 3501245 3241233
18481C241233l83384l31213j97498j43635j63302j30379j23726q8044r2763j02887
$$ 3241233 2857849 2526636 2329138 2185503 2022201 1891822 1768096 1680052 1587289 1484402
18471A484402o8989n1846k2264l4618p3370o8824n3415l3858p767q012n4520n2240
$$ 1484402 1415413 1363567 1341303 1306685 1233315 1164491 1111076 1077218 1069451 1061439 1006919 954679
18459I54679r314J018J3276K9962N1254M8793N9604R1558N5205j9652k5400o0255
$$ 954679 945365 946383 959659 989621 1040875 1089668 1149272 1240830 1296035 1276383 1250983 1190728
18447A190728n7444O645K0648K3503k8588j04119j41794r0752q3030n1966l3271
$$ 1190728 1133284 1139929 1160577 1184080 1155492 1051373 909579 818827 735797 683831 650560
18436F50560l2864q280Q751L5705K8000Q700k2621n295L8684N0992M6106Q9865
$$ 650560 617696 609416 618167 653872 681872 690572 667951 662656 701340 752332 798438 888303
18424H88303Q3661P0604O8717M1830N7623J7775k2238m6608l2562k4868o122J4317
$$ 888303 971964 1042568 1111285 1153115 1210738 1228513 1206275 1159667 1127105 1102237 1096115 1110432
18412A110432J2257M203K1477M1749J8451K4811J1123k0696j9389J919l2665m8066
$$ 1110432 1122689 1126892 1148369 1190118 1208569 1233380 1244503 1223807 1204418 1206337 1173672 1125606
18400A125606j6056l5229m1795n8548k6519j2850m9785r686M890P688l7826l8555
$$ 1125606 1109550 1074321 1032526 973978 947459 934609 884824 875138 880028 887716 849890 811335
18388H11335K0179J4965j9884J216J9778K1200N6108K4264M2778N1413P0365O7095
$$ 811335 831514 846479 826595 827811 847589 868789 924897 949161 991939 1043352 1113717 1180812
18376A180812J1057k3404K0625N646R983m339k004M4794J8271k84J5844k978Q889
$$ 1180812 1191869 1168465 1189090 1194736 1204719 1200380 1198376 1243170 1261441 1261157 1277001 1274023 1282912
18363A282912L848L2078K4008r827m782O9991P8072M5831K7684N928l8362m6443
$$ 1282912 1286760 1318838 1342846 1333019 1328237 1398228 1476300 1522131 1549815 1555743 1517381 1470938
18351A470938k3312r204Q654M8970L2171o5815n2331m3656Q444L5569N3414M5035
$$ 1470938 1447626 1438422 1447076 1496046 1528217 1462402 1410071 1366415 1374859 1410428 1463842 1508877
18339A508877o715j1543k0228l6038l2584J0812M9035M1450O7431R472m590j1972
$$ 1508877 1502162 1490619 1470391 1434353 1401769 1412581 1461616 1503066 1570497 1579969 1575379 1563407
18327A563407j8945n5435n1286k3354J8508K7908N1698M7691N8594L7396l924
$$ 1563407 1544462 1489027 1437741 1414387 1432895 1460803 1512501 1560192 1618786 1656182 1652258
18316A652258J9649M5011R8725J08504J27207J50549J59348J69914J87966J57921
$$ 1652258 1671907 1716918 1815643 1924147 2051354 2201903 2361251 2531165 2719131 2877052
18306B877052R6729L1165Q1846J21553J03972J29383J12267R8186M8882M8462
$$ 2877052 2973781 3004946 3086792 3208345 3312317 3441700 3553967 3652153 3701035 3749497
18296C749497N2480R0863J22441J48865K21832K62273L73249M05868M44518N34190
$$ 3749497 3801977 3892840 4015281 4164146 4385978 4648251 5021500 5427368 5871886 6406076
18286F406076O78778Q61491R97835J144821J414663J873863K599394L769769N433175
$$ 6406076 7084854 7946345 8944180 10089001 11503664 13377527 15976921 19746690 25179865
18277B5179865P474435R281406R920572P722462J876272l191551o474001p046715
$$ 25179865 32654300 41935706 51856278 59578740 61455012 58263461 51789460 44742745
18269D4742745l680935Q07789M414450O912522Q039052O309549Q47530m888150
$$ 44742745 41061810 41869599 46284049 53196571 61235623 67545172 68392702 63504552
18261F3504552r993080j3233645j1461663p498709m380362k575612j637132j094436
$$ 63504552 53511472 40277827 28816164 21317455 16937093 14361481 12724349 11629913
18253A1629913p82249n58365m22447k63714p2318J10733K48591M29438N57230
$$ 11629913 10847664 10289299 9866852 9603138 9530820 9641553 9890144 10319582 10876812
18244A0876812P41360R77637J206886J552559J927525K317762K678210L163547
$$ 10876812 11618172 12595809 13802695 15355254 17282779 19600541 22278751 25442298
18236B5442298L958604N245538P304247J0606699J5218541K0467648K4659387
$$ 25442298 29400902 34646440 41950687 52557386 67775927 88243575 112902962
18229A12902962K5596733J8680383M268604p377843j7128103k1709749j5462061
$$ 112902962 138499695 157180078 161448682 154070839 136942736 115232987 99770926
18222I9770926m661623N220564J2335326J5204699J0436281n90672q825231j5362794
$$ 99770926 95109303 100329867 112665193 127869892 138306173 137715501 128890270 113527476
18214A13527476j8574212j5888495j2348651j0097984j0115716j0269053q230018
$$ 113527476 94953264 79064769 66716118 56618134 46502418 36233365 28003347
18207B8003347n481049l435112k171506j416037r20189n55100k60467J3773K70985
$$ 28003347 22522298 19087186 16915680 15499643 14579454 14024354 13763887 13777660 14048645
18198A4048645N23226P02632P38390P34240P78744R77708J389780J900122K416726
$$ 14048645 14571871 15274503 16012893 16747133 17525877 18503585 19893365 21793487 24210213
18189B4210213L035481L787828M813938O439279R023707J2870351J7727037K2508343
$$ 24210213 27245694 31033522 35847460 42286739 51310446 64180797 81907834 104416177
18181A04416177K5263395K3564307J3492273K20704q554135j1826272l786049
$$ 104416177 129679572 153243879 166736152 166956856 158402721 146576449 142790400
18174A42790400J1090198K2618308K5735670J6655672o413163j8191258j0536918
$$ 142790400 153880598 176498906 202234576 218890248 212477085 194285827 183748909
18167A83748909l228158l372311k493717o42893K742571O498879J291899k0291812
$$ 183748909 180520751 177148440 174654723 174011830 176754401 183253280 184545179 164253367
18159A64253367l8824562l7478494k5780891j5416554r392625o352663m680773
$$ 164253367 125428805 87950311 62169420 46752866 37360241 31007578 26326805
18152B6326805l510524k561143j898253j402078j009891o11939k89237j09171
$$ 26326805 22816281 20255138 18356885 16954807 15944916 15332977 15043740 14934569
18144A4934569P313K3356R9175M60752R19475J311799J696366J996534K198832
$$ 14934569 14941882 14965238 15064413 15525165 16444640 17756439 19452805 21449339 23648171
18135B3648171K357187K781091L582961M843059O957963J0233575J4860086K0670229
$$ 23648171 26005358 28786449 32369410 37212469 44170432 54404007 69264093 89934322
18127H9934322K6197899K8905040K3828663R276407r750496k6911329k5449875
$$ 89934322 116132221 145037261 168865924 178142331 168391835 141480506 116030631
18120A16030631j0330886N465620J6708422K0791583J5416099l247673k8635501
$$ 116030631 105699745 111165365 127873787 148665370 164081469 160833796 132198295
18113A32198295l5634762k4340058j0562668j061397L378416L419542l693844
$$ 132198295 96563533 72223475 61660807 60599410 63977826 67397368 63703524
18106F3703524j4270570j5120183r948389n599701l313158k113175j453260j017123
$$ 63703524 49432954 34312771 24364382 18764681 15451523 13338348 11885088 10867965
18098A0867965p60644m83650k52998n1351J37427L97478O80425Q03798P02491
$$ 10867965 10107321 9623671 9370673 9319322 9456749 9854227 10534652 11338450 12040941
18089A2040941M63418L42244M12304O62469J338458K428225L913360O039378Q598661
$$ 12040941 12504359 12846603 13258907 13921376 15259834 17688059 21601419 27640797 36239458
18080C6239458J0526666J0431245P158452j724191j0306192r885983m509849P08736
$$ 36239458 46766124 57197369 64355821 62631630 52325438 42439455 37929606 38638342
18072C8638342M207731N261156K993098m537023j1793582j1350505p430529m371976
$$ 38638342 42846073 48107229 51100327 46563304 34769722 23419217 15988688 11616712
18064A1616712k675284j700285j167905q56265o46427n12742m23034l28553k33357
$$ 11616712 8941428 7241143 6073238 5216973 4570546 4057804 3634770 3306217 3072860
18055C072860j61505j44082j39374j61868j65622j26584j66928j87392q0202n0006
$$ 3072860 2911355 2767273 2627899 2466031 2300409 2173825 2006897 1819505 1739303 1689297
18045A689297j5292k8843r1363j52806j91889j40440r3991p8101p6921l7744j820
$$ 1689297 1674005 1645162 1553799 1400993 1209104 1068664 974673 896572 819651 781907 780087
18034G80087P598K8583j2236j8222L583l324K659J0615J9342L472q122K2600N7998
$$ 780087 787685 816268 804032 785810 789393 786069 788728 799343 818685 822157 814035 836635 894633
18021H94633M0773L594k3464k678M748L4370K3517J7261j4723j4357j7691k5643
$$ 894633 935406 939000 915536 912858 917606 951976 975493 992754 978031 963674 945983 920340
18009I20340j06145o4585m123N891n4268o3660m8115r040m7827k7572K943N694
$$ 920340 814195 749610 745487 751378 697110 633450 585335 576295 528468 500896 503839 509533
17997E09533K287M511q637m3110o1887l3109M722N4303J6752J8545J1895J7232
$$ 509533 511820 516331 507694 464584 402697 369588 374310 428613 445365 463910 475805 493037
17985D93037K1567j532k6745k4626J7835J4439J729m071l6034p899N184j2284
$$ 493037 514604 513072 486327 461701 479536 493975 495704 491633 455599 447700 452884 440600
17973D40600n7036n6362m1891k1804K3278J8788N139J5704J4034K550j0696J2416
$$ 440600 383564 327202 285311 263507 286785 305573 310712 326416 340450 343000 332304 344720
17961C44720l463K3002L7736K6264l383J458N8250P6855L9854N3527Q7160Q3526
$$ 344720 341257 364259 401995 428259 424876 426334 484584 561439 601293 654820 741980 825506
17949H25506J39554J95060J95536J88677Q1477p5869j20547l4110J09088J18691
$$ 825506 965060 1160120 1355656 1544333 1625810 1549941 1429394 1395284 1504372 1623063
17939A623063Q653j17246j84074j13464M7264J49663K09405J80814M1811j13824
$$ 1623063 1631716 1514470 1330396 1216932 1264196 1413859 1623264 1804078 1845889 1732065
17929A732065j55588l7579N6832O0822j539j33745k43613k47387j60725p6503
$$ 1732065 1576477 1538898 1595730 1656552 1655013 1521268 1277655 1030268 869543 793040
17919G93040m2359l4676k2721k6138m1670l7886j2236k9296R872M813k0953p078
$$ 793040 750681 716005 693284 667146 625476 587590 575354 546058 555930 560743 539790 532712
17907E32712L478J4008K3704Q806K5215N9829N7241L2415J3368m1063m0654J6011
$$ 532712 536190 550198 573902 582708 607923 667752 724993 757408 770776 729713 689059 705070
17895G05070L8390J6045j1774m4545n9238o8913n4990j8633N450J4443n673M7423
$$ 705070 743460 759505 747731 703186 643948 575035 520045 501412 506862 521305 515632 563055
17883E63055Q0882P0580J2843K9093M3722j3144n1646l5686J4133M3150N1038
$$ 563055 643937 714517 727360 756453 800175 787031 735385 699699 713832 756982 808020
17872H08020r17n2286o3619k4577l2028n1761k6461J850P922N824n791L3680L8896
$$ 808020 807103 754817 691198 666621 634593 582832 556371 558221 566143 571967 566176 599856 638752
17859F38752J8830K173J6505L7751Q9135R5706J11208Q3197K6355k3790m2529
$$ 638752 657582 659755 676260 714011 803146 898852 1010060 1093257 1119612 1095822 1053293
17848A053293O898M2785L1979j9978j23815j42512q8421n1444j9911o24M0109
$$ 1053293 1060191 1102976 1134955 1114977 991162 848650 760229 708785 688874 688250 728359
17837G28359L7316J6601O8406N3035o091p815L0651J0828L8232J0256m5859o5924
$$ 728359 765675 782276 850682 903717 897626 889811 920462 931290 969522 979778 933919 867995
17825H67995n3078l9506l668q733p1494q3238m0158j2729J6742L6975O5011M3435
$$ 867995 814917 775411 771743 763010 691516 608278 568120 555391 572133 609108 674119 717554
17813G17554L288K7813M3933M1107P3010R1821J44377J22871J38006J60293J46930
$$ 717554 720842 748655 792588 833695 906705 998526 1142903 1265774 1403780 1564073 1711003
17802A711003J66280K22478K62773J95196M1370j26944q4181M2894J40877J14069
$$ 1711003 1877283 2099761 2362534 2557730 2599100 2472156 2387975 2430869 2571746 2685815
17792B685815n0186k67285l19787k44127j44838j16816o3375k032M5863j5660
$$ 2685815 2635629 2368344 2048557 1804430 1659592 1542776 1479401 1477369 1523232 1507572
17782A507572p2187n4361o1027k1391K5598L3683K0440L3209P3084J16423J71923
$$ 1507572 1435385 1381024 1319997 1298606 1324204 1357887 1378327 1411536 1484620 1601043 1772966
17771A772966K15567K53861K24957J63252J03497J14380J42009O1631q2671p3042
$$ 1772966 1988533 2242394 2467351 2630603 2734100 2848480 2990489 3052120 2969449 2896407
17761B896407j6602j1847k5706m9878n4385L6336J53636K56260L70130M02295
$$ 2896407 2879805 2867958 2842252 2792374 2737989 2774325 2927961 3184221 3554351 3956646
17751C956646K84353J48612J02920P72k00275k80651l36631l74055k47780j64404
$$ 3956646 4240999 4389611 4492531 4493303 4293028 4012377 3675746 3301691 3053911 2889507
17741B889507j95284k54883k20954j55603q4634o1186p8892j07922k01099j45347
$$ 2889507 2694223 2439340 2218386 2062783 1978149 1916963 1838071 1730149 1529050 1383703
17731A383703r6932o3865r667Q199N1326P3185O6579P6532Q1352P7620N5451P7153
$$ 1383703 1286771 1222906 1213239 1221438 1272764 1345949 1412528 1489060 1570412 1648032 1703483 1780636
17719A780636R5764R4223J30423K03264K53128K83285K64206J95062J19859J54440
$$ 1780636 1876400 1970623 2101046 2304310 2557438 2840723 3104929 3299991 3419850 3574290
17709C574290J89484K07254K16893K37061J81147J06522j38295n07238p14128
$$ 3574290 3763774 3971028 4187921 4424982 4606129 4712651 4574356 4067118 3352990
17700C352990o08121l59527j34321k9686o4531j41698j80590j68247j07581n2059
$$ 3352990 2744869 2385342 2251021 2221335 2156804 2015106 1834516 1666269 1558688 1506629
17690A506629l5993q1699o9483m8143p372N048k7404m0803m3982p666M3275Q7476
$$ 1506629 1470636 1388937 1319454 1271311 1263939 1268987 1241583 1200780 1156798 1149132 1192407 1279883
17678A279883J23332J05687Q2687J08048J11665R7272P9169J06581J20977N1763
$$ 1279883 1403215 1508902 1591589 1699637 1811302 1908574 1987743 2094324 2215301 2267064
17668B267064m0602j03905p0091k6771P90N6023J7162p0246m7621q993l0358q4992
$$ 2267064 2226462 2122557 2052466 2025695 2026485 2082508 2099670 2029424 1981803 1972810 1942452 1857460
17656A857460r0754n2940k4848l352L7509l521o4472p0760r4603j50842j09851
$$ 1857460 1766706 1713766 1688918 1685566 1723075 1719554 1655082 1584322 1489719 1338877 1229026
17645A229026l8693k0042k3467j0272j1450o137M146L8395L6421p832o1750m2454
$$ 1229026 1190333 1170291 1146824 1136552 1125102 1118965 1123111 1161506 1197927 1190095 1128345 1085891
17633A085891K910M1755J9612J6667Q1964R8040J01899J28941J91416K04696J59211
$$ 1085891 1088801 1130556 1150168 1166835 1248799 1346839 1448738 1577679 1769095 1973791 2133002
17622B133002Q2698J1354L0031J5150o2021p0537j00142j09635j33644j57279
$$ 2133002 2215700 2227054 2257085 2272235 2210214 2139677 2039535 1929900 1796256 1638977
17612A638977j97674j97920j48588q8889l7975k6596k5840Q112J32J2018K3570
$$ 1638977 1441303 1243383 1094795 1005906 967931 941335 915495 923607 923739 935757 959327
17601I59327R291N073k9951l7947l9258l4132k3056m05N472M256j3593n6448l9718
$$ 959327 968618 973691 943740 905793 866535 832403 809347 808942 814414 818670 805077 748629 708911
17588G08911k2228p481q508n044R58j4874l4430J0659M6081N5599P0023P5672
$$ 708911 686683 679202 670694 665650 666608 651734 617304 627963 674044 729643 799666 875338
17576H75338N0498K1415L4646K2803j7197q192J3575J2403Q580l6868p8524n2175
$$ 875338 925836 947251 981897 1004700 987503 979311 992886 1005289 1013869 977001 898477 846302
17564H46302n9467n6702j8238K539l2836j9424K5578N1637L7081k1117L949L6125
$$ 846302 786835 730133 711895 714434 681598 662174 687752 739389 776470 755353 759302 795427
17552G95427m199l599N244K1975j8291m7679j9749m600j7651m1505m8926m6923
$$ 795427 791228 787629 792873 814848 796557 748878 729129 724529 706878 665373 616447 569524
17540E69524J4633K3988r315n4004j5128M869j142K4537j3541p159O016K2171
$$ 569524 584157 608145 598830 544826 529698 534567 533425 557962 544421 537262 543278 565449
17528E65449m40L587j5478J9361M413n313l473J9050K5279L2932M8489k9307l3129
$$ 565449 565009 568596 553118 572479 576892 571579 568106 587156 612435 645367 693856 664549 631420
17515F31420K0214M9064L4893J2298l8961j5316J9170L5666K9829l645m294j8322
$$ 631420 651634 700698 735591 747889 708928 693612 712782 748448 778277 774632 770338 752016
17503G52016k9131m3354M582O4328K4603o499j2138l3793n249J6576L0645ol2693
$$ 752016 722885 679531 684113 748441 773044 766545 754407 720614 715365 731941 762586 762580 729887
17490G29887l8288p981P830J830J4683O561j6053m745L0202J2223Q12J8823R050
$$ 729887 691599 683618 691448 693278 707961 714522 698469 693724 723926 736149 736961 755784 764834
17477G64834l631L8829M8425K2138P96j9101L1707J9309j938k2189J974K5510
$$ 764834 761203 800032 848457 870595 871391 852290 883997 903306 901368 879179 881153 906663
17465I06663L2669K1297M205Q890J1172K6171M9978L6156K6227M0406K1040K824
$$ 906663 939332 960629 964834 973724 984896 1011067 1061045 1097201 1123428 1163834 1184874 1187698
17453A187698L8486K0789J5927J0089N5806Q6586O4754K9836M2592O8370J01181
$$ 1187698 1226184 1246973 1262900 1272989 1328795 1415381 1480135 1509971 1552563 1620933 1722114
17442A722114J21669Q2443J3170o3815l0486O7756J15592Q8532Q9103O1196R6315
$$ 1722114 1843783 1926226 1939396 1875581 1845095 1912851 2028443 2116975 2206078 2267274 2363589
17431B363589J67826J70753J38803J48966J58329J65108K51291L81744L88765
$$ 2363589 2531415 2702168 2840971 2989937 3148266 3313374 3564665 3946409 4335174
17422D335174L36687J93005K7609P9482K80374M05731M18942L67219K43479K71479
$$ 4335174 4671861 4864866 4892475 4971957 5252331 5658062 6077004 6444223 6687702 6959181
17412F959181N00512P26818R42709J054271J024279J016278J268601J777535K354445
$$ 6959181 7459693 8186511 9129220 10183491 11207770 12224048 13492649 15270184 17624629
17403A7624629K853864L114713L168341L477193M228330N343968P203109J0051044
$$ 17624629 20478493 23593206 26761547 30238740 34467070 39811038 47014147 57065191
17395E7065191J4018923J9997560K8301206L6443089L9837973L3878451J1683938
$$ 57065191 71084114 91081674 119382880 155825969 195663942 229542393 241226331
17388B41226331j7195975k0592639j408996J5710764J8669510K762641k5628073
$$ 241226331 224030356 203437717 202028721 217739485 236408995 239171636 213543563
17381B13543563l6659144k0952889K255020J9785984K8237547K6118088O870736
$$ 213543563 176884419 155931530 158186550 177972534 206210081 232328169 239198905
17374B39198905k2243906k7186899p944812R966290J3750899j955087l4076623
$$ 239198905 216954999 189768100 181823288 191789578 205540477 203585390 169508767
17367A69508767n0064700m0696421k5219134j4647693q991155n901018m150412
$$ 169508767 119444067 78747646 53528512 38880819 29889664 23988646 19838234
17360A9838234l162280k335071j602981j050763p72341q24704r55081r01087p35961
$$ 19838234 16675954 14340883 12737902 11687139 10914798 10090094 9135013 8233926 7497965
17351G497965o41453n38898n26535n61333m98599m79163n01455m66015l23727
$$ 7497965 6856512 6317614 5791079 5229746 4731147 4251984 3750529 3284514 2960787
17342B960787j79907r2521l1282k581o5641j71638j69706j30113o8809m9655j04962
$$ 2960787 2780880 2688359 2657077 2654496 2588855 2417217 2247511 2117398 2048589 1998934 1893972
17331A893972k32298k90499k38009j63323j35110r4001m5457m8616l7222l4008
$$ 1893972 1661674 1371175 1133166 969843 834733 740732 695275 646659 609437 575429
17321E75429j7748p870k2100k5738o271l0691k2389q285k1684l3172n1460l2688
$$ 575429 557681 549811 527711 501973 495702 465011 442622 434337 412653 379481 328021 295333
17309B95333J2536j0427q440j5161k2178j3949k6490j42K4896L0136N200k7435
$$ 295333 307869 297442 289002 273841 251663 237714 211224 211082 235978 266114 271314 243879
17297B43879k8354k8318R367O294j6372l1520k2804j8482J7077Q128o964N305
$$ 243879 215525 187207 196574 202868 186496 154976 132172 113690 130767 138895 131931 137236
17285A37236k0487k9799j8130R691P356J3073K4316J4203J8801J8852o972k5147
$$ 137236 116749 86950 68820 78511 85867 98940 123256 137459 156260 175112 168140 142993
17273A42993m3154m256K2406K2223o642L316n3080m0077P035J0635k5200j1057
$$ 142993 99839 95583 117989 140212 133570 136886 83806 43729 50764 61399 36199 25142
17261B5142K0905j162p294J0208K3550L3559n000j2313j3509J1736K985K46j9867
$$ 25142 46047 44885 37591 47799 71349 104908 99908 87595 74086 85822 88807 89053 69186
17248F9186k277J5300j3931l6854k3633k446K9162J5249j8653k9230o660q344
$$ 69186 66909 82209 68278 31424 7791 5345 34507 49756 31103 1873 -4787 -13131
17236a3131J1717K1602l1124l5233J8921L5654J2466K1729l928r715j9409j5671
$$ -13131 -1414 20188 -10936 -46169 -27248 8406 20872 42601 38673 28958 9549 -6122
17224f122k2041L8666K4860Q880p353J0860n656N423k0431K7889P503Q901k0806
$$ -6122 -28163 10503 35363 44243 36890 47750 42094 47517 27086 54975 62478 71379 50573
17211E0573k2358P182L589k2735L807P911r513j3148J9767L458J1154k457j0953
$$ 50573 28215 35397 38986 16251 20058 27969 18456 5308 25075 28533 39687 37230 26277
17198B6277J1557l106m5298j2090m907j5760O643O096J075M865j3410j7556K438
$$ 26277 37834 34728 -10570 -22660 -27567 -43327 -36684 -30588 -29513 -24648 -38058 -55614 -53176
17185e3176L7658K8834p97K313q636P365J505J2437J6275R946l9317o0073k2542
$$ -53176 -15518 13316 12519 14832 6196 13561 15066 27503 43778 53724 14407 -45666 -68208
17172f8208J851J1288J0846j0826p623m101r032R769k205k1425k0059r316l0584
$$ -68208 -66357 -55069 -44223 -55049 -62672 -66773 -75805 -66036 -68241 -89666 -109725 -119041 -149625
17159a49625r701K8062o194P831N8021K0870l3620j2694M863J6845N669j3237
$$ -149625 -159326 -131264 -137458 -129627 -71606 -50736 -84356 -97050 -92187 -75342 -69673 -82910
17147h2910j4153L135J6112N050l6556j6347K00k190j0093j1687N416K2254l952
$$ -82910 -97063 -93928 -77816 -72766 -109322 -125669 -125469 -127659 -137752 -149439 -144023 -121769 -125721
17134a25721K2982J5470k6992Q832J7314m666K6709L089J5645J6075J2286K807
$$ -125721 -102739 -87269 -114261 -105429 -88115 -92781 -66072 -62983 -47338 -31263 -18977 -16170
17122a6170k1254l4897j9605K9353m533l259j69R27q163k0798L315J0916j49j2110
$$ -16170 -37424 -72321 -91926 -62573 -67106 -70365 -70534 -69607 -77770 -98568 -95253 -84337 -84486 -96596
17108i6596K4448r604J820K244J866m155M572l175k1851l0189l0705J9032K4049
$$ -96596 -72148 -81752 -79932 -77688 -75822 -79977 -75405 -78580 -100431 -130620 -161325 -142293 -118244
17095a18244r033k6824l3702l6145j527k0606P628L3180J4661L547k782J0635
$$ -118244 -127277 -154101 -187803 -223948 -225475 -246081 -238453 -205273 -190612 -187065 -189847 -179212
17083a79212J7028K2723M5418O4908k069n2370j6793J6762M7259J0981M519j2194
$$ -179212 -162184 -139461 -94043 -29135 -31204 -83574 -100367 -83605 -36346 -25365 -20846 -33040
17071c3040k0179j8589M948j224L4162N7026L0731J4292j9263P876J3251J5287
$$ -33040 -53219 -71808 -66860 -68084 -33922 23104 53835 68127 48864 56740 69991 85278
17059H5278K1o247o254J5024k0163J0272j9509k8869j4866J0500n414l5094k328
$$ 85278 85299 79052 72798 87822 67659 77931 58422 29553 14687 25187 19773 -15321 -17649
17046a7649k5632O332K1149j2074M146K40l2111j0051j572J1737j6076J9829j7688
$$ -17649 -43281 -36949 -15800 -27874 -23728 -23488 -55599 -65650 -67222 -55485 -71561 -51732 -69420
17033f9420j5140M1736j1180R549R847j1872k5476k2968l647K4765K6813L5221
$$ -69420 -84560 -42824 -54004 -44455 -34608 -46480 -71956 -94924 -98571 -73806 -46993 -11772
17021a1772p795q002J9908q36L449o039r57n80j2608j9286o533R548j113M611
$$ -11772 -19567 -27569 -7661 -8497 -5048 -11087 -12044 -12624 -25232 -44518 -51051 -41503 -42616 -38005
17007c8005L3940o510l0166l2869J7356L454l601K5034P163r160j6435l7768j4361
$$ -38005 -4065 -10575 -40741 -73610 -56254 -52800 -56401 -31367 -24204 -33364 -49799 -87567 -101928
16994a01928l172j659N342J5722J920o179j996J7774L6839M0023Q658k5898l0721
$$ -101928 -105100 -106759 -101417 -85695 -83775 -89954 -91950 -74176 -37337 2686 11344 -14554 -45275
16981d5275j659L832o169j7875K02K660L3503J8325l9213q168r927J786R379P134
$$ -45275 -46934 -43102 -49271 -67146 -66944 -64284 -30781 -12456 -51669 -59837 -69764 -67978 -58599 -51465
16967e1465p929k4561K958J0093K1173J1878j003n385j0403L401O514n311M774
$$ -51465 -59394 -83955 -80997 -70904 -49731 -37853 -38856 -44241 -54644 -51243 -44729 -50040 -45266
16954d5266P92J8028q833k0133L413j0214o904k62o437J1975j3846k5339N562
$$ -45266 -44474 -26446 -35279 -55412 -51999 -62213 -69117 -69379 -75816 -63841 -77687 -103026 -97464
16941i7464J8407q863O944J7916k3773k4372K0931M0262R56q943M392J3449k916
$$ -97464 -79057 -87920 -80976 -63060 -86833 -111205 -90274 -50012 -49056 -57999 -53607 -40158 -43074
16928d3074j4581J866J3133j641j3346n968M298m284J8045K2398l107k8118K0536
$$ -43074 -57655 -55789 -42656 -44297 -57643 -63611 -59313 -63597 -45552 -23154 -26261 -54379 -33843
16915c3843n291k5796j4111j980k0646q237L7020m271L639K6980j3153n683L687
$$ -33843 -39134 -64930 -79041 -81021 -101667 -109904 -72884 -77155 -73516 -46536 -59689 -65372 -61685
16902f1685J3568J7017J4543j8296O836r363k0224m625L016Q104J0134l900m660
$$ -61685 -48117 -31100 -16557 -34853 -28017 -37380 -57604 -62229 -59213 -51109 -40975 -44875 -49535
16889d9535k5825j1675K699J3137L0179Q789k8861K01j138l019L004k2287j2471
$$ -49535 -75360 -87035 -84336 -71199 -41020 -32231 -61092 -60891 -62029 -65048 -62044 -84331 -96802
16876i6802L3807J2995j0810k3664o825m239J1008l359L0216J3181k164R269J7067
$$ -96802 -62995 -50000 -60810 -84474 -91299 -95538 -84530 -87889 -57673 -44492 -46656 -37387 -20320
16863b0320k1649l0470J0115J1047j9264k743Q484L4367M0772j4274j8113j5800
$$ -20320 -41969 -72439 -62324 -51277 -70541 -73284 -64800 -30433 10339 -3935 -22048 -37848
16851c7848r249P658K9711j3160J7925J6257j3476k2334j393J3232P0077K2031
$$ -37848 -47097 -39439 -9728 -22888 -4963 11294 -2182 -24516 -25909 -12677 57400 79431
16839G9431K52j344M2362K5602M3099Q0132Q1208Q6706J35588J68651K02879J74759
$$ 79431 79683 78339 120701 146303 189402 269534 350742 437448 573036 741687 944566 1119325
16827A119325J51857Q985j36867q6529L8689P9987M9113o5459j55981j55962o7081
$$ 1119325 1271182 1280167 1143300 1056771 1095460 1175447 1224560 1159101 1003120 847158 780077
16816G80077M1116J23083J61512J05377l2190j34946q1112j0667O4227M6759q4376
$$ 780077 821193 944276 1105788 1211165 1178975 1044029 962917 952250 1016477 1063236 978860
16805I78860k61880k83233j68653p1941o0478o8831o1293j0911J7553J006q853
$$ 978860 716980 433747 265094 193153 132675 63844 2551 -8360 9193 10199 1346
16794A346l816j1156j4570j0222M284l47M055k5767r89j369K664J1226j3176k3578
$$ 1346 -2470 -13626 -28196 -38418 -34134 -34481 -30426 -56193 -57182 -58551 -55887 -44661 -57837 -81415
16780h1415k100O863q775K8367L771j1243j9579J6618K2169J5380Q084l8282k4483
$$ -81415 -83515 -76652 -85427 -57060 -53289 -64532 -84111 -67493 -45324 -29944 -21860 -60142 -84625
16767h4625k3019J4971M8161M104j0569j0217J3379J313k4290n173J4462k3758
$$ -84625 -107644 -92673 -44512 -40408 -50977 -61194 -47815 -46502 -70792 -75965 -61503 -85261
16755h5261m596K5541K1091J0847k330L977N873p975j4234J4470k1920k3904j565
$$ -85261 -89857 -64316 -43225 -32378 -34708 -30731 -24858 -32833 -47067 -32597 -54517 -78421 -79986
16742g9986L712J0939j5125R349M7334K1881q623n193m230N068M796J6486J0878
$$ -79986 -76274 -65335 -80460 -71111 -23777 -1896 -10519 -15712 -19942 -14874 -10078 6408 17286
16729A7286j6131k9548n954j0681m008J5549j9861p323J4829o589r02J3120j8444
$$ 17286 1155 -28393 -34347 -45028 -49036 -33487 -53348 -60671 -45842 -52431 -53333 -40213 -58657
16716e8657j2662J4705n170j7777J5296J6869L689k7971r976j344J2973j6458
$$ -58657 -71319 -56614 -61784 -79561 -64265 -47396 -43707 -71678 -81654 -82998 -70025 -86483
16704h6483k652M3044M4013j6379j0348k1698l333K0260j7354J246k0513j7288
$$ -86483 -89135 -46091 -2078 -18457 -28805 -50503 -53836 -33576 -50930 -49684 -70197 -87485
16692h7485k709j078J8407j296J0792K2454P623j6024j5088J262O954K0813J1010
$$ -87485 -90194 -91272 -72865 -74161 -63369 -40915 -33292 -49316 -64404 -63142 -56188 -35375 -24365
16679b4365j0048K011j5492j0435k5901j5769K2262K8680o79l0186M952L5759
$$ -24365 -34413 -32402 -47894 -58329 -84230 -99999 -77737 -49057 -49736 -79922 -74970 -39211
16667c9211j0376k0105k1164J3053J3919j0206J7115Q625K7164J0416n603O395
$$ -39211 -49587 -69692 -90856 -77803 -63884 -74090 -56975 -48350 -21186 -10770 -16373 -9978
16655i978j5066l3674l3298p360K676L7500J7821o669r520M445J7933O476K2951
$$ -9978 -25044 -58718 -92016 -99376 -96700 -59200 -41379 -48048 -57568 -53123 -35190 -28714 -5763
16642e763j0469l533O035K90J9039N475l7721k0270l6497k3300Q208J7836Q757
$$ -5763 -16232 -19765 -13730 -13440 5599 11074 -26647 -46917 -83414 -106714 -98506 -80670 -71913
16629g1913K6137J9181r415k5257m6016J304K5822M3431J4331k2326j9419o499
$$ -71913 -45776 -26595 -36010 -61267 -107283 -105979 -80157 -36726 -22395 -44721 -64140 -70639
16617g0639R582j5624j2087K2677r556J4592R695L023m487L8506J8171k7466k5678
$$ -70639 -61057 -76681 -88768 -66091 -75647 -61055 -51360 -48337 -52824 -14318 3853 -23613 -49291
16604d9291P443K8001j5221n06j5874j694j444r610J7687R513J8826k2600k1852
$$ -49291 -41848 -13847 -29068 -29574 -45448 -47142 -48586 -58196 -40509 -30996 -12170 -34770 -56622
16591e6622J1440L601K1000Q169l0387l8525l20j509L196J4017j5152o602O729
$$ -56622 -45182 -41581 -20581 -12412 -42799 -81324 -81644 -83153 -79957 -65940 -81092 -87694 -80965
16578h0965N106k7073p953J7205K7367L2686L08J277n734l444J2679k269K1915
$$ -80965 -75859 -102932 -110885 -93680 -66313 -33627 -33319 -32042 -37776 -41220 -28541 -30810 -8895
16565h895k7087k5803n779l547J6851n969j8634L2854K7601k435n743J795j1006
$$ -8895 -35982 -61785 -67564 -71111 -54260 -60229 -78863 -46009 -18408 -20843 -26586 -24791 -35797
16552c5797r584j673P275R855k1243k6215K5308R993L1985P894j107l091l4793
$$ -35797 -45381 -47054 -39779 -29924 -51167 -77382 -52074 -42081 -10096 -2202 -3309 -6400 -41193
16539d1193k4277k1558K3206K419Q358J0980j2992m8o172n547J1935K468k780
$$ -41193 -65470 -87028 -63822 -61403 -53045 -42065 -55057 -55105 -61277 -66824 -54889 -52421 -55201
16526e5201O360P713J3065q187r398M5396J9526O474M269k468o306M2019K38K526
$$ -55201 -48841 -41128 -28063 -36250 -45648 -252 19274 25748 30017 27549 21243 63262 63500 66026
16512F6026j7050j423K4867K653J0610j3416l46l6279j0157j9635k3270J2236
$$ 66026 48976 47553 72420 75073 85683 72267 71921 35642 25485 5850 -17420 -5184
16500e184k0071m3018m0149K951N9015L1304r745p296j3183j8137j2953J4201
$$ -5184 -25255 -68273 -108422 -105471 -46456 -15152 -24897 -32193 -45376 -63513 -76466 -62265
16488f2265K123j7422J8483J8797k2345j3400J1130J4758J7027N569L984l395
$$ -62265 -60142 -77564 -59081 -40284 -62629 -76029 -64899 -50141 -33114 -27545 -23561 -26956
16476b6956P763j8135M061M829J6781L4856j6468l2302J226k437L06j8937m1398
$$ -26956 -19193 -37328 -33267 -28438 -11657 23199 6731 -25571 -24345 -26782 -26476 -45413 -86811
16463h6811M2852N1967r145m0011j3082J7580J0953m190m964q594l848r999J4618
$$ -86811 -43959 8008 -1137 -41148 -54230 -36650 -25697 -29887 -34851 -43445 -47293 -57292 -42674
16450d2674M0272m188m5406m067K2011J1627K0400n179q287M691r35j3230j4456
$$ -42674 -2402 -6590 -51996 -56063 -34052 -22425 -2025 -7204 -15491 -10800 -11735 -24965 -39421
16437c9421k4220L389K3431K2791R119l4263k3247K8349J2539J16l541J7387M946
$$ -39421 -63641 -60252 -36821 -14030 -4911 -39174 -62421 -34072 -21533 -21417 -24958 -7571 -2625
16424b625j3342j9262J1220q369r669Q444Q23k4200o201K8746J6082Q22M999K9305
$$ -2625 -15967 -35229 -24009 -32378 -42047 -33603 -32780 -56980 -63181 -34435 -18353 -17531 -12532 16773
16410A6773p97R441K7553K0711K3071j3573k5108K1402N4388N1447l1377J545
$$ 16773 15976 25417 52970 73681 96752 83179 58071 79473 133861 185308 153931 155476
16398A55476j1362l5998l5028j1625l1456M896l197o603J0611j1901J4290K90
$$ 155476 144114 108116 73088 61463 30007 34903 31706 25103 35714 23813 38103 38393
16386C8393l2796j2807p326K4866L029n076L5166K2390j5294k0392o615K6903
$$ 38393 5597 -7210 -14536 10330 13359 8283 43449 65839 50545 30153 23538 50441
16374E0441K1303J3131J9788K2165K8030J7758J5069P376j4971j1320J998O25
$$ 50441 71744 84875 104663 126828 154858 172616 187685 195061 180090 168770 170768 171393
16362A71393r836k1077k739j0578j0430l4584k3908k0098L524r26j5859k2556
$$ 171393 161557 140480 137741 127163 116733 82149 58241 38143 41667 40741 24882 2326
16350B326j9859l749q699J7985M614n777K661L751j078K4498J0096j7262p667
$$ 2326 -17533 -21282 -29981 -11996 -7382 -13159 -10498 -6747 -7825 16673 26769 9507 1840
16337A840q381q362j7410j2379K1706K3574o203k4245L384J7723p456j427j505
$$ 1840 -6541 -14903 -32313 -44692 -22986 588 -5615 -29860 -26476 -8753 -16209 -17636 -19141
16324a9141P359R337L2270M9767J2389p745j2031J5205K2688M9166O9026M0577
$$ -19141 -11782 -2445 29825 79592 91981 84236 72205 87410 110098 159264 228290 268867
16312B68867M8402O2349Q0931L4965O8938P9476N5692R0437Q2527Q997J7133K2878
$$ 268867 317269 379618 460549 495514 564452 643928 699620 790057 872584 881581 898714 921592
16300I21592k4156m3825o5997r0476m3760n0427n9484o0498q8827n2382n6277
$$ 921592 897436 853611 787614 697138 653378 602951 543467 482969 394142 341760 285483
16289B85483o9425o2474m2578k5149l6840j5417m611j7093r0L165L214l3122j0895
$$ 285483 216058 153584 111006 85857 49017 33600 28989 11896 11806 14971 18185 -14937 -25832
16276b5832k8510K8566K8577K6169j4922j4071m390J6357j4090k1394j1053K7849
$$ -25832 -54342 -25776 2801 28970 14048 -23 -4413 11944 -2146 -23540 -34593 -6744
16264f744K3368R035j571O56K224L009L6051k7994l0821q570K7011l1610q809
$$ -6744 16624 25659 24088 24744 26968 29977 66028 38034 7213 -1357 25654 -5956 -14765
16251a4765K380Q716k9172r067o879J2411N728J6214j0030j1942K190M759p027
$$ -14765 -12385 -3669 -32841 -41908 -48787 -36376 -30648 -14434 -24464 -36406 -34216 -29457 -36484
16238c6484J2145j6721r666L1192K1056L031J5934n365m595o01j3444j0391j784
$$ -36484 -24339 -41060 -50726 -19534 1522 4553 20487 15122 10527 9926 -3518 -13909 -15693
16225a5693k2681J5505J4023K0981R47j0226J0668j1337p444k1846j2888k3129
$$ -15693 -38374 -22869 -8846 12135 13082 2856 13524 2187 -5257 -27103 -39991 -63120
16213f3120J9132K1567m987R687J6568j8386k9497K4591L4505J8314K0608J5315
$$ -63120 -43988 -22421 -27408 -17721 -1153 -19539 -49036 -24445 10060 28374 48982 64297
16201F4297j2450m1722j3668N850q209K1875J2196L216r269L25J5618L9276K7472
$$ 64297 51847 10125 -3543 2307 -5902 15973 28169 31385 22116 22441 38059 77335 104807
16188A04807Q64j2845J2928L9887L5680O2002P6020N7570Q9334R7263P3746K9757
$$ 104807 105671 92826 105754 145641 181321 243323 319343 376913 466247 563510 637256 667013
16176F67013L8707J5651l2854j22287r3454q8328q7857p4188o8763l9611j5781
$$ 667013 705720 721371 688517 566230 472776 384448 296591 222403 153640 114029 98248
16165I8248j1181k7121k0782j147L0543K1673J2919m716k1352j6883J3915L6348
$$ 98248 87067 59946 39164 38017 68560 90233 103152 98436 77084 60201 74116 110464
16153A10464o183k1350j0402J591K5315N928M5052L5064M1471J8306J2366L4008
$$ 110464 104281 82931 72529 74120 99435 105363 150415 185479 226950 245256 257622 291630
16141B91630L7627M5710P7581Q0240Q2838R4699P0321K0502j7502m9220o2729
$$ 291630 329257 374967 452548 532788 615626 710325 780646 801148 783646 734426 671697
16130F71697r6826j21497q1144r3477p8531m5877l5257k1531j3041l169L42N362
$$ 671697 574871 453374 372230 278753 200222 154345 119088 97557 84516 81347 81689 87051
16118H7051m008R490o678n74K4183Q658j6467J0026j4151p144j606n374k6427
$$ 87051 83043 92533 85855 85281 109464 118122 101655 111681 97530 90386 88780 83406 56979
16105E6979o338L311J0436L898O041J7920K1888M994k9712k9825k0892J1931K5934
$$ 56979 50641 53952 64388 68286 74327 92247 114135 119129 89417 59592 38700 50631 76565
16092G6565M719J3831l90K2713j5544j5995N187J7657P802K782j0985k6066R321
$$ 76565 81284 95115 94725 117438 101894 85899 91086 108743 116545 119327 108342 82276 91597
16079I1597J6583L55N688p669o92K4510J7981j588l328n0221k8739m858K2870
$$ 91597 108180 108535 114223 106554 105862 130372 148353 146765 143437 93216 64477 59619 82489
16066H2489j8223L280L453j9472j9103L761L580j8646O68P451K0551O080j4867
$$ 82489 64266 67546 70999 51527 32424 36185 39765 21119 21787 29238 49789 55869 41002
16053D1002j1110J9198J9091L5165J1829j6374r037J7872K0198L1681J8754j6745
$$ 41002 29892 49090 68181 103346 115175 98801 89764 107636 127834 159515 178269 161524
16041A61524j7014l4335l7506k5515l529l001J6875k815r412l723L5120J0463
$$ 161524 144510 110175 72669 47154 43625 40624 57499 54684 45272 41549 76669 87132
16029H7132O517j8427K2734m786j1195J3065R859o982J782j138j7561j5685J3776
$$ 87132 93649 75222 97956 93170 81975 95040 104899 97917 99699 98561 81000 65315 79091
16016G9091m410K3603K528J0878K5725K302j4233L996k2421j6464L3763M5488
$$ 79091 74681 98284 100812 111690 137415 139717 125484 129480 107059 90595 124358 169846
16004A69846J1943p649r835J5977r55J4267L7979K7866K0167J9492N003J8377
$$ 169846 181789 174140 164305 180282 179327 193594 231573 259439 279606 299098 304101 322478
15992C22478N3536L942l849N4029L4091M5619O71j7480m746r53L0494L4412O248
$$ 322478 376014 379956 376107 430136 464227 509846 510517 493037 488291 487338 517832 552244 558492
15979E58492j7317K3276J7956q139j2506l3492m3632j850j5561l0330p815l1139
$$ 558492 541175 564451 582407 574268 561762 528270 484638 482788 467227 436897 429082 397943
15967C97943l9392r86l068l0407l1407k4057l2074j5114r325k5609k1707o002
$$ 397943 358551 357565 354497 324090 292683 268626 236552 221438 212113 186504 164797 158795
15955A58795j4831O461O304k17k0813k2070M639J7432m949j9448L415k001j4439
$$ 158795 143964 150425 156729 156512 135699 113629 118268 135700 130751 111303 114718 112717 98278
15942I8278J1909k5877m634J9898k727l2086l1679J5136J2570n277k2822L909
$$ 98278 110187 84310 79676 99574 96847 64761 33082 48218 60788 55511 32689 36598
15930C6598Q594p5p852L008N786j1886K5513K669j2233j0992N157j6356r372N895
$$ 36598 45192 45117 37265 40273 46059 34173 59686 62355 50122 39130 44287 27931 18559 24454
15916B4454m660J1858J7307j9367j8235M8361L9561K50j9780l3272N213R526J3006
$$ 24454 19794 31652 48959 29592 11357 59718 99279 99529 79749 46477 51690 61216 74222
15903G4222k011j0342J3167j163k4503j5190J4888R973m797k8492j4796o560L3760
$$ 74222 72211 61869 75036 73873 49370 34180 49068 59041 54244 25752 10956 4396 38156
15890C8156J8662o991k541j1613R974K0098J5036Q992q382K3220M3326O697m4175
$$ 38156 56818 49827 47286 35673 45647 65745 80781 89773 81391 104611 147937 154634 110459
15877A10459k2859L462j48j3314R745L1460l9322n0677j0133J5367r397j2628
$$ 110459 87600 91062 90914 77600 87345 118805 79483 28806 18673 34040 24643 12015
15865A2015J7451K0270J7809L713j1382m655J1211r357O671N429k6167o902J7097
$$ 12015 29466 49736 67545 71258 59876 55221 66432 57075 63746 69175 43008 36106 53203
15852E3203J1690j0665l476j147n917J0775N398J3525j4458j0168j2629K5336
$$ 53203 64893 54228 50752 49605 43688 54463 59861 73386 58928 48760 36131 61467
15840F1467P760O497M597J2488j987P889j3987l9075N231J3005R58j556m783q709
$$ 61467 69227 75724 80321 92809 90822 98711 84724 45649 50880 63885 64843 63287 58504 49795
15826D9795n849l739J7277N118k206K0341J9245q828k2152J7433J7723J3336j5272
$$ 49795 43946 40207 57484 62602 60396 80737 99982 91154 69002 86435 104158 117494 102222
15813A02222l9908J1430j2364l0897j88O206K038l175J2053J0413Q89j5514k3894
$$ 102222 62314 73744 61380 30483 30295 36501 38539 35364 47417 57830 58719 43205 19311
15800A9311r779O746J9450J6476J3054J19l0909k2053J3507K8951j424k6038q771
$$ 19311 9532 16278 35728 52204 65258 65377 34468 12415 25922 54873 53449 27411 18640
15787A8640L0869J0406k772m843j1492j3901J3693J0875j4102L620m784j1970
$$ 18640 49509 59915 57143 52300 40808 26907 40600 51475 37373 40993 36209 24239
15775B4239L887L355r757p481j11l7932k4567j7151J0496Q747J9556J7373K6450
$$ 24239 28126 31481 21724 14243 14132 -23800 -48367 -65518 -55022 -46275 -26719 -9346 17104
15762A7104j1374k0394j221J4114R486J2928M156l511k851j7748M142K3559K4115
$$ 17104 5730 -14664 -15885 -1771 7715 20643 24799 21288 18437 689 4831 28390 52505
15749E2505n585j4085q02Q961r027K2519j3443k2794k98J9553k6536J4194J1782
$$ 52505 46920 32835 32033 40994 31967 54486 41043 18249 17951 37504 10968 25162 36944
15736C6944k8631r189J0072K6089J8398n549q654j6743k3218M214p851J930L1762
$$ 36944 8313 -876 9196 35285 53683 48134 39480 22737 -481 3733 -4118 -2188 29574
15723B9574P380j0654l684J1905J7514J63k7104j6337l312J4483L735k5982k4825
$$ 29574 36954 26300 22616 34521 52035 52198 25094 8757 5445 19928 23663 -2319 -27144
15710b7144K1165L1361L5320Q003j4691k1007j3008J5533K5587o777q25k194j5544
$$ -27144 -5979 25382 60702 68705 54014 33007 19999 35532 61119 54342 53517 51323 35779
15697C5779J9162j8521m363J2309J495k3515j3753k331p660k4580k2566o68M5219
$$ 35779 54941 36420 32057 44366 45861 22346 8593 6262 -1398 -25978 -48544 -49212 -3993
15684c993J2327k5630k3432o800K8153M63K4398K6729J472k6616q098n052o546
$$ -3993 8334 -17296 -40728 -47528 -19375 -18912 5486 32215 33687 7071 -1027 -6079 -12625
15671a2625M57J9921P896k3790J6314J0707j5618j2888K169L1078L604k1707n00
$$ -12625 -12168 7753 15649 -8141 8173 18880 3262 -9626 -7457 23621 27225 5518 5018
15658E018O06j732l386o708j3275J4515L8492J3999m3204l6422K073J9449L7678
$$ 5018 5624 3892 506 -6202 -19477 -4962 33530 47529 4325 -32097 -30024 -10575 27103
15645B7103P730j8821k3942N033K5298r714j1959m123N040j3248k637K3118m380
$$ 27103 34833 16012 -7930 -2897 22401 12687 728 -3395 1645 -11603 -14240 8878 4498
15632D498j6062l953r279J1620J9645J5441j0923k8061J5167J8084J6545k9577
$$ 4498 -11564 -15517 -24796 -13176 6469 21910 10987 -17074 -1907 16177 32722 3145
15620C145J4888k264j6949q151K071j8210j0954L7981J3594p205l736J1400J795
$$ 3145 18033 15769 -1180 -9331 -7260 -25470 -36424 1557 15151 7946 4210 15610 17405
15607A7405p188m2977k4889L348K7024L0288J5676K100l4061q864J1429P592j2464
$$ 17405 10217 -32760 -57649 -54301 -27277 3011 18687 20787 -13274 -22138 -10709 -3117 -15581
15594a5581J188P357j1406J5599j2152P77j44k1258p193K109j2001K9092K4028
$$ -15581 -14393 -7036 -18442 -2843 -14995 -14218 -14362 -35620 -42813 -40704 -52705 -23613 415
15581D15r292k0626L729J7696p792L463j037J2241K532j866J041l645q79J4586
$$ 415 -8877 -29503 -25774 -8078 -15870 -12407 -13444 -1203 1329 -537 504 -3141 -4020 10566
15567A0566Jm136N843J4566j608J0645k2204j4932J4965N165K777L2890J5186
$$ 10566 10567 6431 12274 26840 25232 35877 13673 -1259 13706 18871 21648 54538 69724
15554F9724l6014K277o294m497J9984P240j1337m776j863k9952j9730m24O409
$$ 69724 33710 35987 29693 25196 45180 52420 41083 36307 34444 4492 -15238 -15662 -9253
15541i253J5182j3142n638O358R879L0937j1322j2345J1870N130j5377k7454j0840
$$ -9253 5929 -7213 -12851 -6493 3386 34323 23001 10656 22526 27656 12279 -15175 -26015
15528b6015P273q614J0059M932N696k5344L256j0237j4578K8779L4207m197J6215
$$ -26015 -18742 -27356 -17297 -12365 -6669 -32013 -28757 -38994 -53572 -24793 9414 5217 21432
15515B1432J3881j2969o352j2063M370L5623J9721k4603o155k435m4995R901O11
$$ 21432 35313 22344 15992 3929 8299 43922 63643 39040 32885 30450 -14545 -4644 -4033
15502d033o892K6862K0327j3222J6672K9965n926R468J7364j1147l1498m6709
$$ -4033 -10925 15937 36264 23042 39714 69679 63753 73221 90585 79438 47940 1231
15490A231k5699P684Q504J3964J4672K2043J6499J960q08j4563l514j0403k2859
$$ 1231 -24468 -16784 -8280 5684 20356 42399 58898 60858 60050 45487 41973 31570 8711
15477H711q271L0176j7423p240j8230j9453Q321J9630O637J4156k7755l7151l663
$$ 8711 440 30616 13193 5953 -12277 -31730 -23409 -3779 2858 17014 -10741 -47892 -51555
15464e1555J7185L3183M2308J9118k7270j1546j589j1523J147k5247Q555R301
$$ -51555 -34370 -1187 41121 60239 32969 21423 19834 8311 9458 -15789 -7234 2067
15452B067L6209J0013J2962K633n951M312k7222l2223k3628J4374P517K7584l782
$$ 2067 38276 48289 61251 63884 57933 62245 35023 2800 -20828 -6454 1063 28647 24865
15439B4865O109j4216p049J5061p298r868l457j7113j9704L0412j018n923M8521
$$ 24865 30974 16758 9709 24770 17472 7604 4147 -12966 -32670 -2258 -3276 -9199 39322
15426C9322K7656O861K8456J750N350j4520k7369o015r030O000M0816j7288j5300
$$ 39322 66978 73839 102295 104045 109395 94875 67506 61491 52461 58461 99277 81989 66689
15413F6689n656l9579J3912K3007l5232l1727j3633j798K9293p43J1160M0296
$$ 66689 61033 21454 35366 58373 23141 -8586 -22219 -24017 5276 4533 15693 55989
15401E5989P192n705n60k8606J4915k1616M944J2010m581j4319r770J2729J7774
$$ 55989 63181 57476 56916 28310 43225 21609 26553 38563 33982 19663 9893 22622 40396
15388D0396j322k6352L435m144l626j0145j0257L88R974o28J8948k1061P486L3820
$$ 40396 39074 12722 16157 12013 8387 -1758 -12015 -11627 -1653 -2281 16667 -4394 3092 36912
15374C6912M139j7908L773K914j9219j468K4602O711q640m167k342M881j7075
$$ 36912 41051 23143 26916 29830 10611 9143 33745 40456 31816 27649 25307 30188 13113
15361A3113k7866J0435J4260J0374j6828m7279k601K8376J9584k7721l0984K7051
$$ 13113 -14753 -4318 9942 20316 3488 -43791 -46392 -18016 1568 -26153 -57137 -30086
15349c0086J0684j8651K682K7435K1145Q064l7376j1786K565K3155K2546K7348
$$ -30086 -19402 -38053 -35371 -7936 13209 21273 -16103 -27889 -25324 -2169 20377 47725
15337D7725k9220k8246l7580K5872L5943J4530j8717k6983k0181j5434K880J5161
$$ 47725 18505 -9741 -47321 -21449 14494 29024 10307 -16676 -36857 -52291 -49411 -34250
15325c4250J3392J6493j0993j4843J2855j8592k8228Q198J5601K4361K3335j5774
$$ -34250 -20858 -4365 -15358 -30201 -17346 -35938 -64166 -55968 -40367 -16006 7329 -8445
15313h445J9267m001P9r025k7100k35K7977n60Q277J501o830p092K910P857j722
$$ -8445 10822 6821 6900 -2125 -29225 -29460 -1483 -2043 6234 7735 905 -6187 -3277 4580 2858
15298B858J7726l2864o086P705k5609J7635L70j5611m464J1078L5543j5327Q876
$$ 2858 20584 -12280 -18366 -10661 -36270 -18635 -18265 -33876 -38340 -27262 8281 -7046 1830
15285A830J099Q795J4956k3253M479K400J4631k11k605J0052o37k2319j1850Q095
$$ 1830 2929 11724 26680 3427 7906 10306 24937 24726 22121 32173 31536 9217 -2633 5462
15271E462j9683R52L761K4414P24J5033L22m597j6303J0786p298k4244k0072J5072
$$ 5462 -14221 -13269 -9508 14906 15630 30663 30985 26388 10085 20871 13573 -10671 -30743 -15671
15257a5671J5636J2000k0169k5287J5605J1241J0949P247P687j0954j588K1728
$$ -15671 -35 11965 -8204 -33491 -17886 -6645 4304 11551 19238 8284 6696 28424
15245B8424J5300n889K629j4129l9067k3539q638L1597j1298o655M6859L1331
$$ 28424 43724 37835 40464 26335 -12732 -36271 -44909 -13312 -24610 -31265 15594 46925
15233D6925n876l0449J6674k6104n7191M245M5766J6863p096k947j6848P282K494
$$ 46925 41049 10600 27274 1170 -56021 -51776 -6010 10853 3757 810 -16038 -8756 -6262
15220f262J1058K0500N910j0658J1795J1502j2087Q626j4914k5915J172K7782
$$ -6262 4796 25296 31206 20548 32343 43845 31758 40384 25470 -445 727 28509
15208B8509J6669P786k209j6124q047j0198k4910m936J4645J6786K1402l023J4583
$$ 28509 45178 52964 50755 34631 26584 16386 -8524 -13460 1185 17971 39373 36350 50933
15195E0933r366k1190R01r728j4087J9459N779j579l19l049j2874M847K0223Q95
$$ 50933 41567 20377 21278 11550 -2537 16922 22701 21122 20803 17754 4880 9727 29950 30845
15181C0845j6467o785N76k926l0271k6639K4187L2039k1667l620L433k0891k4554
$$ 30845 14378 7593 8169 5243 -25028 -51667 -27480 4559 -17108 -20728 -17295 -38186 -62740
15168f2740l028J0293L7428J659J4974j0667j5411j1859n995K1935K7227q105
$$ -62740 -65768 -55475 -18047 -16388 -1414 -12081 -27492 -39351 -45346 -23411 3816 -4289
15156d289N32L262P772k276j2993M457N160j885J4296J8151K2626k752j9703j1355
$$ -4289 -3757 -495 7277 5001 -7992 -3535 1625 -260 14036 32187 54813 52061 32358 21003
15142B1003j0762M026J7084l141k676k1084k8497J1466J6774J4345K6310o820
$$ 21003 10241 14267 31351 28210 25534 4450 -24047 -12581 4193 18538 44848 38028
15130C8028p898K479J082j1622j113l2864K625J7249k872k0114j2997J6487k294
$$ 38028 30130 32609 33691 22069 20956 -11908 -9283 7966 5094 -15020 -28017 -11530 -13824
15117a3824j7808o416p805J7648L3347K1637M6494K9787k3378o542J4048r81k2574
$$ -13824 -31632 -38048 -45853 -28205 5142 26779 73273 103060 79682 73140 87188 86207 63633
15104F3633j7379L67J2549j9573l099n930M440J8679R957j4486j5307p738o725
$$ 63633 46254 46621 59170 39597 36498 30568 35008 53687 63644 49158 33851 26113 19388
15091A9388l315M000N902J2185J4888j6945m563k4005J9125k1849k5309L5061
$$ 19388 16073 20073 25975 38160 53048 36103 31540 7535 26660 4811 -20498 14563
15079A4563N3932K2818J5501j8407m8143k1281k747J1997J3739k3999j4470J3811
$$ 14563 68495 91313 106814 88407 40264 18983 16236 28233 41972 17973 3503 17314
15067A7314L1518L0049r016k8541J1479J3785j0070l0409r837J2937k18j370n524
$$ 17314 48832 78881 69865 41324 52803 66588 56518 26109 16272 29209 28991 27621 22097
15054B2097j1373L3890J0592o648j0938p698k5169J4433k367K4628O918q883J433
$$ 22097 10724 44614 55206 48558 37620 29922 4753 19186 16819 41447 48365 39482 40915
15041D0915j764n399J4458K1615O151M4720L1097L230k72k9700k2720m8867j6361
$$ 40915 39151 33752 48210 69825 75976 120696 151793 155023 154751 125051 102331 53464 37103
15028C7103M718J7497p428M059n074q393k7277K540n987j9093K3510J2127j9646
$$ 37103 41821 59318 51890 55949 50875 42482 15205 17745 11758 -7335 16175 28302 8656
15015H656K694J5742O71j3113P667r084R00K5296L1759J2618k0256k6124p236
$$ 8656 11350 27092 27763 14650 22317 13233 14133 39429 71188 83806 63550 37426 30190
15002C0190k5321p459K6738J3714K3787j196j181m594q641j5130p433q805N360
$$ 30190 4869 -2590 24148 37862 61649 60453 59272 54678 46037 30907 23474 14669 20029
14989B0029J2592K2699j500M1852L131j3503n95p868m407L0146Q614k8233l1737
$$ 20029 32621 55320 53820 95672 98803 85300 84705 76837 72430 102576 111190 82957 51220
14976E1220L4257l944j5998L556q529Q433M612J9937k519k6505N35J4544j4859
$$ 51220 85477 81533 65535 69091 60562 68995 73607 93544 91025 64520 65055 79599 64740
14963F4740j6298k1242m662j3012j246K0975K8622K1655J9309j0962j5677j3907
$$ 64740 48442 27200 22538 9526 8280 29255 57877 79532 98841 87879 72202 58295
14951E8295k769O534L1124O93l1374j3512q014J606O12J2623L042P902j5163J622
$$ 58295 55526 62060 93184 93877 62503 48991 40977 42583 43195 55818 58860 66762 51599 53221
14937E3221L106J76j7234J0266j1594N1078K710r798J5479j3062N581k336m4746
$$ 53221 56327 56503 39269 49535 37941 89019 91729 81931 97410 84348 89929 87593 42847
14924D2847j5113P616l2205J0029J1803K483L4480M0775J0511l0122j4951j6311
$$ 42847 27734 35350 3145 13174 24977 27460 61940 102715 113226 83104 68153 51842
14912E1842k7507k3106K2391K6252K2596Q50P949J83k894k0760J2296L692J7643
$$ 51842 24335 1229 23620 49872 72468 73318 81267 81450 78556 57796 70092 73784 91427
14899I1427J0290R639l2698l6065j056P150M395P337k64q204J6865n373q934L0368
$$ 91427 101717 111356 78658 42593 41537 48687 53082 60419 60155 51951 68816 63443 54509 84877
14885H4877L0064K049j6100N169Q144J3719j0034l7402p871J7628o684j4207K344
$$ 84877 114941 116990 100890 106059 114203 127922 117888 80486 72615 90243 83559 69352 71696
14872G1696J0220L5368n539k4460j6504q286j5393R893q313n710L039L4644N307
$$ 71696 81916 117284 111745 87285 70781 62495 47102 56995 48682 42972 46011 80655 85962
14859H5962j9449j7107J3193N1799p384j5008r806K2447k8479j2870j5878k3019
$$ 85962 66513 49406 62599 114398 107014 92006 82200 104647 76168 63298 47420 24401
14847B4401J4059n888k763n930k5190l202J5660j6688j9295L021o12O328L9259
$$ 24401 38460 32572 29809 23879 -1311 -4513 11147 -5541 -24836 -21815 -22427 -16099 23160
14834B3160j5086m968K903j5197r629K2268J0806J8899p445j5075O796O370J4832
$$ 23160 8074 3106 6009 -9188 -18817 3451 14257 33156 25711 10636 17432 23802 38634
14821C8634o720j3575J7132j9211J8158J7064M124K1334l828l4325k9572j0521
$$ 38634 31914 18339 35471 16260 34418 51482 55606 76940 73112 38787 9215 -1306
14809a306J7320J5370L7680n642j6912k5116k1009n028R83K7808J6104k979M162
$$ -1306 16014 31384 69064 63422 46510 21394 385 -4643 -3660 24148 40252 37273 41435
14796D1435R116q335j2277J0295K0342O676p600j351j5342J7357m494M163K529
$$ 41435 50551 42216 29939 40234 60576 67252 59652 58301 42959 60316 55822 59985 62514
14783F2514k1938q814r516k0709p292j009J1069O371K41j8960j1815J5275K2154
$$ 62514 40576 31762 22246 1537 -5755 -6764 4305 10676 10917 -8043 -19858 -4583 17571
14770A7571J0449J530p843j7496n722J5047Q948k1868K58K4380P211p599R845
$$ 17571 28020 29550 21707 4211 -1511 13536 22484 616 874 25254 32465 24866 34711
14757C4711J1015J3693l3557m1044J456J9927k6967L417N957j3144J49J395J2930
$$ 34711 45726 59419 25862 -15182 -13726 6201 -20766 -17349 -11392 -24536 -24387 -22992 -10062
14744a0062j9397K2591R215j1626K788j3455K3068J1366k905k0557q756P273r98
$$ -10062 -29459 -6868 2347 -9279 -6491 -19946 3122 14488 11583 -8974 -17730 -10457 -11455
14731a1455J2792J7894J1857r614P76J5028n572J8725r489k2444r119J3747R2
$$ -11455 1337 19231 31088 21474 22250 37278 31706 50431 40942 18498 9379 23126 23218
14718B3218j7050j8626J279q659k8264k5408P858L1967J4850J513M595j7606j850
$$ 23218 6168 -12458 -11179 -19838 -48102 -73510 -65652 -33685 -18835 -17322 -12727 -30333 -32183
14705c2183O383R537J1105n438k6901k5056K4672K4934l405K42M1939M1922j7035
$$ -32183 -25800 -16263 -5158 -10596 -37497 -62553 -37881 -12947 -16352 -16110 25829 67751 50716
14692E0716k1900J2130J0585K1735l0074j5766o171k1363j9164j4273J8946J9608
$$ 50716 28816 40946 51531 73266 43192 27426 21255 -108 -19272 -33545 -14599 5009
14680E009j5611o896J4628o142p395n388J7194K5509l692M148K2964L7367K0926
$$ 5009 -10602 -17498 -2870 -9012 -16407 -21795 -4601 20908 17216 21364 44328 81695 102621
14667A02621k1610l6536l3819N536J69Q917Q855m492l9583R736m79l705l746o131
$$ 102621 81011 44475 10656 16192 16361 25278 34133 29641 -9942 -206 -685 -4390 -8136 -14267
14653a4267p43j3648M1166L3107r46J3605j8073J003J83O138j2335Q216K6797
$$ -14267 -15010 -28658 12508 45615 44669 58274 40201 41204 41387 47525 35190 43406 70203
14640G0203q511L435J9201O158l0668N14K9939k2771k5815P868P677M839J3013
$$ 70203 61692 65127 84328 90486 59818 60332 90271 67500 41685 49553 57230 62069 75082
14627G5082l01N64K250k3371J0961j1527J6915J4359p169J7224J4962L657k7380
$$ 75082 74781 75345 77595 54224 65185 53658 70573 84932 77763 94987 109949 113606 86226
14614H6226M672j6291k1115M770J9866O434k9716k3915p193j4J5032k95j2952
$$ 86226 90898 74607 53492 58262 78128 84562 54846 30931 23738 23724 38756 38461 25509
14601B5509Q806J3521j7599p876N63K711J7173K0802k3185j7083j2737K3292J9827
$$ 25509 34315 47836 30237 22361 22924 25635 42808 63610 40425 23342 10605 33897 53724
14588E3724k9799l8090J5050J9315R631k060l2061J446N521K614j3903J071O485
$$ 53724 23925 -14165 885 20200 29831 27771 -4290 -2844 2677 5291 -8612 -7541 -1056
14575a056j0578k2119o913Q272L686J440R6J7263m973J2669P43O23j0030p202
$$ -1056 -11634 -33753 -40666 -32394 -28708 -27268 -27172 -9909 -14882 -2213 -1470 -847 -10877 -18079
14561a8079j637l878L2049K1924m51k902R892R067j6289Q800J3914q421M118k1898
$$ -18079 -19716 -23594 8455 30379 29928 27026 36918 45985 29696 38496 52410 43989 48107 26209
14547B6209j0289K6377j8571k9326Q711L0224Q346k0782k4380L184J1250m726
$$ 26209 15920 42297 23726 -5600 3111 33335 41681 20899 -3481 -297 10953 6227
14535F227L396p333j8660l681P774J0890J6481q3j2096m043j7341j3597k769K0368
$$ 6227 9623 2290 -16370 -20051 -12277 -1387 15094 15011 2915 -1128 -18469 -32066 -34835 -14467
14521a4467P277J2590L08j1127J252j778N409r69n075O211j0563l6491j381L9704
$$ -14467 -7190 5400 5708 -5419 -4167 -5945 -536 -1505 -6580 -369 -10932 -47423 -48804 -9100
14507i100K9297j103k7101k5235R623K248P249N319j3664K2863L983p232k531
$$ -9100 20197 19094 -8007 -33242 -23619 -21371 -14122 -8803 -22467 396 4379 -2853 -5384
14494e384O626k512j1118j6159K794J6645N2005J2998J4040r338P0p3p455M9438
$$ -5384 1242 -1270 -12388 -28547 -25753 -9108 42897 55895 69935 60597 60667 60594 53139 102577
14480A02577K7254j1615M2385J857K9605O9354M9273J11409K14575K23351K02943
$$ 102577 129831 118216 160601 162458 192063 261417 310690 422099 636674 860025 1062968
14469A062968P7947j36878l00372k69942j47526j29169p9889l3824m216Q925j3618
$$ 1062968 1140915 1004037 703665 433723 286197 157028 77139 43315 39099 48024 34406
14458C4406m072q677l408p885J1032J0455j8499j5129J771J1669K2677R827q220
$$ 34406 30334 21657 18249 10364 21396 31851 13352 -1777 -6 11663 34340 44167 35947
14445C5947J1739P001r504p678K7757R414J3030L0160L317p560k6528J6148O4993
$$ 35947 47686 54687 45183 37505 65262 74676 87706 117866 121183 113623 87095 103243 168236
14432A68236J11499J38033J64142J91443J83539J40037k6902k29425l17489k25750
$$ 168236 279735 417768 581910 773353 956892 1096929 1070027 840602 523113 297363
14422B97363j42581n6336m0695l2979j894K0187j1072J1137J3489n515j0725J0288
$$ 297363 154782 98446 57751 24772 22878 43065 31993 43130 56619 51104 40379 50667
14410E0667J1661R928m73n068l5606k8120q47J8340J8161K8640k6009O571R941
$$ 50667 62328 72256 71783 66715 31109 2989 2142 20482 38643 67283 41274 47845 57786
14397E7786J4988l4058k7070j1565J5696K089J0070J1483K3988k7394L229k0605
$$ 57786 72774 38716 11646 81 15777 17866 27936 39419 63407 36013 39242 18637
14385A8637k2147O142K2034M208m626q857r942O804K652n251M627J0821k407k7670
$$ 18637 -3510 2632 24666 28874 24248 15391 5449 12253 14905 9654 14281 25102 22695 -4975
14371d975k8383K7828L169k4474K503L4954R204m105J2576j8290n717J715J6683
$$ -4975 -33358 -5530 -2361 -26835 -24332 10622 19826 15721 28297 10007 4290 6005 22688
14358B2688j7349k3911k9085k793K1398K2178j4118m633K825j2674j1914m716
$$ 22688 5339 -18572 -47657 -50450 -29052 -6874 -20992 -25625 -22800 -35474 -47388 -52104
14346e2104J0725K7555N75R045L317j9919R588J3271m290J0126k4845L835P446
$$ -52104 -41379 -13824 -13249 -4204 -887 -20806 -11218 2053 -2237 7889 -16956 -13121 -5675
14333e675M337L703m020j7256o729o058j6673J0598O192j8499J8282J96J646M551
$$ -5675 -1338 2365 -1655 -18911 -25640 -31698 -48371 -37773 -31581 -50080 -31798 -31602 -29956 -25405
14319b5405J9679k3145l51q659l5547J1686L5367L3685J0125l1331q800O831p211
$$ -25405 -5726 -28871 -29222 -37881 -73428 -61742 -26375 7310 17435 -13896 -22696 -15865 -23076
14306b3076N818M874r525J9867N761r442j598R813J85m032j6917p230j1388K1833
$$ -23076 -17258 -12384 -21909 -2042 3719 -5723 -7321 2492 2677 -1355 -18272 -25502 -36890 -15057
14292a5057K526k7346k8963O961P75Q800P963J5788N774j7486l680N251M732J759
$$ -15057 -12531 -39877 -68840 -61879 -61104 -52304 -44341 -28553 -22779 -40265 -43945 -38694 -33962 -32203
14278c2203J067j3023O106K3355J3563L272l3932L658O987j161j1908N019K9498
$$ -32203 -31136 -44159 -38053 -14698 -1135 2137 -31795 -28137 -21150 -22311 -34219 -29200 298
14265B98p326j6844o758j4119l1406J9589K6930o508J0273J1882K1686K77l1254
$$ 298 -7028 -23872 -30630 -44749 -76155 -56566 -29636 -36144 -25871 -13989 7697 7974 -23280
14252b3280K5951K1258m209k4276j0761L502J97j0083K6740m991O735P81j2095
$$ -23280 2671 23929 19720 -4556 -15317 -11815 -11618 -21701 5039 48 6783 7564 -4531
14239d531K684J9798l1720k2086n70K6997K0351J3131r578j6168l310l345k008
$$ -4531 -1847 17951 -13769 -35855 -36425 -9428 10923 24054 14476 -1692 -5002 -8347 -10355
14226a0355J7653J708j2589m3679J6408J5464o112j5191K1103j1886k2360L069
$$ -10355 7298 9006 -3583 -47262 -30854 -15390 -21502 -36693 -15590 -27476 -49836 -46767
14214d6767K4669L1827l628j4821j2561Q530r077j0961J1888L1763j0189K405
$$ -46767 -22098 9729 6101 -8720 -21281 -12751 -21828 -32789 -20901 10862 673 3078
14202C078k919n983j3557l2286J2901K4663p456L0019L298k1564j414J831n651
$$ 3078 159 -5824 -19381 -51667 -38766 -14103 -21559 8460 11758 -9806 -11220 -9389 -15040
14189a5040J626p840j7877J4741r03j0575k0408J0239R426j152Q050R175k7095
$$ -15040 -13414 -21254 -39131 -24390 -25293 -35868 -56276 -46037 -36611 -37763 -29713 -20538 -47633
14176d7633J1349J1456R828o625n016j6600j1512L9634J9881K3541J1090j3443
$$ -47633 -36284 -24828 -15000 -21625 -26641 -43241 -54753 -15119 4762 28303 39393 25950
14164B5950n083L412j8886m6051j6905L6070J6543j8286P663Q872K700j6412J2591
$$ 25950 20867 24279 5393 -40658 -57563 -21493 -4950 -23236 -15573 -6701 -4001 -20413 -7822
14151g822J5132j1277p944k911o03K16R250j094j1358j0277j6403L0744j8136
$$ -7822 7310 -3967 -11911 -14822 -15425 -15209 -5959 -7053 -18411 -28688 -45091 -14347 -32483
14138c2483j7341K6814K5628J1607j5276R046J5405j6375j5106J6308M0587K0434
$$ -32483 -49824 -23010 2618 14225 -1051 7995 23400 7025 -8081 8227 48814 69248
14126F9248j971k0896j0555k65l528M269k3388r755J5648k8436m138P480L2390
$$ 69248 67277 46381 35826 35561 32033 36302 12914 3159 18807 -9629 -13767 -6287 26103
14113B6103K3419k6383M015j0140k8142n595L091N718j2033J717K918J6691o845
$$ 26103 49522 23139 27154 17014 -11128 -16723 -13632 -7914 -19947 -18230 -15312 1379 -5466
14100e466P333J2384k0173j8593P660K0497K0409j7130j8971M988j9727j8416
$$ -5466 1867 14251 -5922 -24515 -16855 3642 24051 6921 -12050 -7062 -26789 -45205
14088d5205K5531J149q605j2344M150J7012O361k8823k584k2639l6276m159O8461
$$ -45205 -19674 -18525 -27130 -39474 -35324 -18312 -11951 -40774 -43358 -65997 -102273 -106432 -37971
14075c7971K0592j4971l058k8646L236J4224O999j7116L906J167J0422J4001k5154
$$ -37971 -17379 -32350 -35408 -64054 -60818 -46594 -39595 -56711 -52805 -51638 -41216 -27215 -52369
14062e2369j5939Q866K4961k300K1675J4091k0338j2261J8039J02j7604J1637
$$ -52369 -68308 -59442 -34481 -36781 -15106 -1015 -21353 -33614 -15575 -15473 -33077 -21440
14050b1440j1677j3565k379m096P150J266K0951J1908O858M771k8567K867M285
$$ -21440 -33117 -46682 -49061 -53157 -46007 -44741 -23790 -11882 -5024 -253 -28820 -25953 -21668
14037b1668l286r180j4833K6613K5559j5424n599m688J807K2177J6906n454l7135
$$ -21668 -24954 -34134 -48967 -22354 3205 -12219 -17818 -22506 -20699 1478 18384 12930 -24205
14024b4205J2677J2116p995m347o469j5463r75k5542N067L8480m963j8355j8973
$$ -24205 -11528 588 -7407 -11754 -18223 -33686 -34661 -60203 -55136 -16656 -21619 -39974 -58947
14011e8947k4370o441R746P624J0733Q741k3420J404j761J2554J0902P915J8796
$$ -58947 -83317 -89758 -80012 -72388 -61655 -52914 -76334 -74930 -76691 -64137 -53235 -45320 -26524
13998b6524K2007q065k0267m862J0538N576j5106K775J3716O127Q025k109L4961
$$ -26524 -4517 -12582 -32849 -37711 -27173 -21597 -36703 -33928 -20212 -14085 -6060 -8169 26792
13985B6792r263k9470k6481K8286N014k226j0920o283m76j3398n626K4651L3840
$$ 26792 17529 -11941 -38422 -10136 -5122 -7348 -18268 -24551 -25027 -38425 -44051 -19400 14440
13972A4440m229j7962L870k8257l7712p39J6600L3896L7741j4985n455O736l9394
$$ 14440 10211 -7751 -3881 -32138 -69850 -70589 -53989 -20093 17648 2663 -2792 3944 -35450
13959c5450l088J4297J1472r500M65k2650J9081L0984r051J020m21o343K1191
$$ -35450 -38538 -24241 -12769 -22269 -21804 -44454 -25373 5611 -3440 -2420 -2841 -9184 12007
13946A2007K3275j3003k82q918j6847J2960J1518j6499k7219J701q247r733q789
$$ 12007 35282 22279 21997 13079 -3768 9192 20710 4211 -23008 -21307 -29554 -39287 -48076
13933d8076K5385J0275J762M492o311O522L0422L974k0758k0371j7729J7736M311
$$ -48076 -22691 -12416 -10654 -6162 -12473 -5951 24471 28445 7687 -12684 -30413 -12677 -8366
13920h366k6729n447K116n058j5452J957J6051K0015J3223j7931j5127L8173K3258
$$ -8366 -35095 -40542 -38426 -43484 -58936 -56979 -40928 -20913 -7690 -25621 -40748 -2575 20683
13907B0683j7232K56o881p143o903l354M2635L0651l5039l2309J1584M428j5306
$$ 20683 3451 3707 -3174 -10317 -17220 -20574 22061 52712 17673 -14636 -3052 1376 -13930
13894a3930j7302L0573o22k7784j5951L0444J8621l303j5667m4122Q333K3143
$$ -13930 -31232 -659 -1281 -29065 -45016 -14572 4049 746 -14921 -59043 -50710 -27567
13882b7567J0127k0019k032L1702l860J326J2159j6740j7072o676J2453J7871
$$ -27567 -17440 -37459 -39491 -7789 -11649 -10323 1836 -14904 -31976 -38652 -26199 -8328
13870h328O150l2774j331Q858j7711q149O736j7282j9191P83K9081K8975J5755
$$ -8328 -2178 -34952 -36283 -27425 -45136 -53285 -46549 -63831 -83022 -82239 -53158 -24183 -8428
13857h428J6595j2104k018j4418J0331J2582j3742p33l6465j6513K180M2300K981
$$ -8428 8167 -3937 -5955 -20373 -10042 2540 -11202 -11935 -48400 -64913 -62733 -20433 -17452
13844a7452j0476q783j3802j1043P637L752L1517q991l1147m77K4770K3516J1940
$$ -17452 -27928 -36711 -50513 -61556 -53919 -50167 -18650 -27641 -58788 -59265 -34495 -10979 961
13831I61L002k2061m324n166p75L5109K659j0541j920r284R947j0128j1675j4689
$$ 961 3963 -18098 -22422 -27588 -28363 6746 9405 -1136 -3056 -12340 -2393 -12521 -24196 -38885
13817c8885q762M80J0984K2864R725R700J108l3852l2944J6057J0356k55r41J3655
$$ -38885 -47647 -47167 -36183 -13319 -3594 6106 7214 -26638 -59582 -43525 -33169 -33424 -34365 -20710
13803b0710r465k1705L669L859k8815r78K230K3481L7439J5834J6391J1049r094
$$ -20710 -30175 -51880 -48211 -44352 -73167 -74145 -71915 -48434 -10995 4839 21230 32279 23185
13790B3185j6126K429J0199j8818P435j0297j5534l187K954P20j0232N773J0159
$$ 23185 7059 9488 19687 869 8304 -1993 -17527 -20714 -17760 -17040 -27272 -21499 -11340
13777a1340k5678M136M4682K4746j8982j7990l510J5764m1952r832K205j2577
$$ -11340 -37018 -32882 11800 36546 17564 -426 -3936 11828 -30124 -39956 -37751 -50328
13765e0328J7686N526J156j1185Q908Q95j0943j1372K2165j1116J8925K0622L837
$$ -50328 -32642 -27116 -25960 -37145 -28237 -27342 -38285 -49657 -27492 -38608 -19683 939 4776
13752D776j9307k1297J9396K4681j9735j4048J248J1720j1796r452j4935r63j7755
$$ 4776 -14531 -35828 -16432 8249 -11486 -25534 -24286 -12566 -24362 -33814 -48749 -49712 -67467
13739f7467J4016L6734j2723k5368K77J0793K2554r543j4879p845J5901K6185
$$ -67467 -53451 -16717 -29440 -54808 -54531 -43738 -21184 -30727 -45606 -53451 -37550 -11365
13727a1365O572R447j1881K9663J1434j484k0970j2306J9377K8555l2231m820
$$ -11365 -4793 4654 -7227 22436 33870 32386 11416 -890 18487 47042 14811 9991
13715I991P82J6624r221k2025j2137Q995J1297P077j7409k5601j0643J4117O988
$$ 9991 10773 27397 18176 -3849 -15986 -6991 4306 11383 -6026 -31627 -42270 -28153 -21165
13702b1165J1694r400L3356j4980k3277J2112J0605j7125N589L0930M901J0799
$$ -21165 -9471 -18871 14485 -495 -23772 -11660 -1055 -18180 -12591 18339 23240 34039
13690C4039n483m2663k2569j8632J5502K216j5024j1226J8957P702P1K2532k823
$$ 34039 28556 -14107 -36676 -55308 -39806 -37590 -52614 -63840 -44883 -37181 -37110 -14578 -17401
13677a7401o987n150J595n018j1368K1316L8996K535l6025J263J7682J4409j6138
$$ -17401 -24388 -29538 -27943 -32961 -44329 -23013 15983 18518 -17507 -16244 1438 15847 -291
13664b91l1459O32J606j4822J2568q848K9829Q896p393j5255K8872m614L1332
$$ -291 -31750 -31118 -29512 -44334 -31766 -40614 -10785 -1889 -9282 -24537 4335 -279 31053
13651C1053J4985m3415k9023J4484j8931M0423J2399j6846o580j1223J282O31
$$ 31053 46038 2623 -26400 -11916 -30847 9576 21975 5129 -1451 -12674 -11392 -10761
13639a0761R848k033K2794J5796m325j160j4859o149J1256r6k6569M375J5819
$$ -10761 -913 -2946 19848 35644 31319 30159 15300 9151 20407 20311 -6258 -1883 13936
13626A3936o487j3268j5457K0245J0283j8483o85j7379J1764J2031K2540j0447
$$ 13936 7449 -5819 -21276 -1031 9252 -9231 -9916 -27295 -15531 -3500 19040 8593
13614H593j933j8891j5433J3143k857r4l602o199j3995k5757L2095K3903j18J2393
$$ 8593 6660 -12231 -27664 -14521 -17378 -17472 -21074 -27273 -41268 -67025 -34930 -11027 -11145 1248
13600A248m581p668J934O772l479j4655J834o040n384J055o028N234K9301n066
$$ 1248 -3333 -11001 -9067 -2295 -5774 -20429 -18595 -24635 -30019 -28964 -34992 -29758 -457 -5523
13586e523Q199j290p001n263J4968K2652k730m2873k3622p605j537j2344j9635
$$ -5523 2676 1386 -5615 -10878 4090 26742 24012 -18861 -42483 -50088 -51625 -63969 -83604
13573h3604J7140L0816L4366k2768p980J1840J6660O737j9946k9402R311J3640
$$ -83604 -66464 -35648 -1282 -24050 -32030 -20190 -3530 3207 -16739 -46141 -36830 -23190
13561b3190K3146n422Q050J4037j9901j0561J826k7074O56j0290N890K4306j7412
$$ -23190 -44 -5466 2584 16621 -3280 -13841 -12015 -39089 -38433 -48723 -42833 -18527 -35939
13548c5939p549J4032J2310k8380j6535o640Q003L5389M350K3748l084p122j175
$$ -35939 -43488 -29456 -17146 -45526 -62061 -68701 -60698 -25309 -20959 2789 -295 -7417 -8592
13535h592j0783j6830J6594J2709K5365n583k7635j6028k128K4457P490M548M107
$$ -8592 -19375 -36205 -19611 -6902 18463 12880 -14755 -30783 -32911 -8454 -964 3584 7691
13522G691J4096K904K025j1731j5929k5357j5625J4042K7309j6772j3213J9738
$$ 7691 21787 24691 26716 14985 -944 -26301 -41926 -27884 -575 -17347 -30560 -10822
13510a0822M1979j4410l5809n309N288J0325o235j1477r50J0444o094n508J5321
$$ -10822 31157 16747 -19062 -24371 -19083 -8758 -14993 -26470 -27420 -16976 -23070 -28578 -13257
13497a3257n963J0960J6685j6689p27l094J602j8819Q735n591r408k087J1547
$$ -13257 -19220 -8260 8425 -8264 -8991 -12085 -10483 -29302 -20567 -26158 -35566 -37653 -26106
13484b6106J2228o192P613J6903R625l2716p732j4725q539J1806J0675K5741N223
$$ -26106 -13878 -20070 -12457 4446 14071 -18645 -26377 -41102 -49641 -37835 -27160 -1419 3804
13471C804R865P61l738J525K4555j3980P589Q163l3987k4066j534J6544k2406
$$ 3804 13669 14430 10692 12217 36772 22792 30381 38544 4557 -19509 -21043 -4499 -26905
13458b6905j1676n341J0357K3843M116m16O929l572j3807k0463L378K1476m256
$$ -26905 -38581 -43922 -33565 -9722 -5606 -6022 907 -2665 -16472 -36935 -33557 -12081 -16337
13445a6337M0866r216j8943l031r56N417o055j9264j0471k4541K7846J2775J5331
$$ -16337 24529 15313 -3630 -6661 -7617 -2200 -8255 -27519 -37990 -62531 -34685 -21910 -6579
13432f579n111J8684K4238q312l3562O81O31K026k646q991p965l0153k595j4829
$$ -6579 -11690 6994 31232 22920 -10642 -9961 -9330 -7304 -9950 -18941 -26906 -57059 -59654 -74483
13418g4483O322L706k976J9719K1354J4541J5365j2088j2729J7275O247k0022
$$ -74483 -68161 -64455 -67431 -47712 -26358 -11817 3548 -8540 -21269 -3994 2253 -17769
13406a7769k7470J5974L2218J247j3074q801J5670k830K3920N050k9715j7438
$$ -17769 -45239 -29265 2953 4200 -8874 -17675 -2005 -4835 19085 24135 -5580 -23018
13394b3018J5709P688k5136k1442N212Q293Q722j0871m5782J2280K5224K972l2630
$$ -23018 -7309 379 -24757 -46199 -40987 -32694 -23972 -34843 -80625 -68345 -43121 -40149 -72779
13381g2779J0349K4957J3420J2095M305k4734m5754O308L2651K0302K905J604
$$ -72779 -62430 -37473 -24053 -11958 -7653 -32387 -78141 -71833 -39182 -18880 -15975 -14371
13369a4371R182n197J1042Q484l523P503k761K0002j5394k8111J1447J2328k303
$$ -14371 -5189 -10386 656 9140 5617 13120 10359 30361 14967 -13144 -1697 10631 8328
13356H328P862R763m842j9647j7374j2178j6036k251p162K0713J3359J5259R366
$$ 8328 16190 25953 21111 1464 -15910 -28088 -44124 -46375 -53537 -32824 -19465 -4206 5160
13343E160p992l0283j9647J4976Q244m595j547P125J4938q991K811J320K352N568
$$ 5160 -2832 -33115 -52762 -37786 -29542 -34137 -35684 -28559 -13621 -22612 -19801 -18481 -16129 -10561
13329a0561o065k669N044J2013J0046K2635j1257l2622j4222R359J4288P804N705
$$ -10561 -16626 -19295 -14251 -2238 7808 30443 19186 -13436 -27658 -18299 -4011 3793 9498
13316I498M36j2762P839l6022K832K0735m142j3784L436q979j756O775N305j7158
$$ 9498 9934 -2828 5011 -31011 -28179 -7444 -11586 -25370 -21934 -30913 -32669 -25894 -20589 -37747
13302c7747J2300L950k2858J4709P624o425J7112K271m884k0207k4150r951K6600
$$ -37747 -25447 -21497 -44355 -29646 -22022 -28447 -11335 -9064 -13948 -34155 -58305 -68256 -41656
13289d1656J3534J4199q620P743L959j6897K460N908J0590J2504M093j0473j5034
$$ -41656 -28122 -13923 -22543 -14800 -10841 -27738 -25278 -19370 -8780 3724 7817 -2656 -17690
13276a7690L796n170l698j380p981o807M953Q681J3708R585J339n898P16J3584
$$ -17690 -13894 -19064 -22762 -24142 -32123 -38930 -33977 -25296 -11588 -2003 -664 -6562 -5846 7738
13262G738j797n516j5076O72J744J3818O191M559J4424R193N561p565j3496j8328
$$ 7738 5941 425 -14651 -13979 -12235 1583 7774 12333 26757 35950 41511 33946 20450 2122
13248B122O716P626K355Q382l561j3720j0989P980J28J4845O399m0876l599J9306
$$ 2122 8838 16464 18819 27201 23640 9920 -1069 6911 7039 21884 28283 -12593 -16192 3114
13234C114L0680L57j592R686k826P283J0362l317l209m859j2389j3105p215k3316
$$ 3114 33794 34151 32559 42245 39419 46702 57064 53747 50538 45679 33290 20185 12970 -10346
13220a0346j0101l6307j7463P201K7924J8074j941Q565O82K2352R438J4428P205
$$ -10346 -20447 -56754 -74217 -67016 -39092 -21018 -22959 -14394 -13712 8640 18078 32506 39711
13207C9711j9144k3154l8324m891k03l585J4608m091j3041j0842Q343P560J7226
$$ 39711 20567 -2587 -40911 -45802 -46005 -49590 -34982 -39073 -52114 -62956 -54613 -47053 -29827
13194b9827r3J2992J3995o637r966n0683j8714N359J5014K0965O611J1319M179
$$ -29827 -29920 -16928 -2933 -9570 -19536 -70219 -88933 -83574 -68560 -47595 -40984 -29665 -25486
13181b5486J9011j6488k4605k3655j3473Q827K3296J9691o143K016O831J7826
$$ -25486 -6475 -22963 -47568 -71223 -84696 -75869 -52573 -32882 -39025 -37009 -30178 -12352
13169a2352J4981J7374k8276j6663L958j5083J3512J3951j641J289o095O250J9074
$$ -12352 2629 20003 -8273 -24936 -20978 -36061 -22549 -8598 -10239 -8950 -15045 -8795 10279
13156A0279k3825k760j8348K0163J8847k2094k8687o977J829n415L6582L8272
$$ 10279 -13546 -16306 -34654 -14491 4356 -17738 -46425 -53402 -51573 -56988 -20406 17866
13144A7866J2646j3304j5284j1954J745j8269N174J7885J5267n165j671Q999o6
$$ 17866 30512 17208 1924 -10030 -8285 -26554 -21380 -3495 11772 6607 4936 13935 13869
13131A3869j0797M700k4415k0225J1492K342M413L444j3609K9911J6859O424P58
$$ 13869 3072 7772 -16643 -36868 -25376 -23034 -18621 -15177 -28786 1125 17984 24408 25166
$$ [...]
##END NTUPLES=NMR SPECTRUM
##END=
