##TITLE=Analysis number 324597
Compound Code sb 00777
Book Reference a
Project Code adrs
Chemist Name ians
##JCAMPDX= 6.0         $$ Bruker NMR JCAMP-DX V2.0
##DATA TYPE= NMR SPECTRUM
##DATA CLASS= NTUPLES
##ORIGIN= Bruker BioSpin GmbH
##OWNER= nmr
$$ XWIN-NMR		Version 3.5
$$ Mon Nov 27 14:56:32 2006 GMT Standard Time (UT+0h)  MAYBRIDGE\nmr@NMR_250MHZ
##.OBSERVE FREQUENCY= 250.131544655141
##.OBSERVE NUCLEUS= ^1H
##.ACQUISITION MODE= SIMULTANEOUS (DQD)
##.ACQUISITION SCHEME= undefined
##.AVERAGES= 16
##.DIGITISER RES= 18
##SPECTROMETER/DATA SYSTEM= dpx250
##.PULSE SEQUENCE= zg30
##.SOLVENT NAME= CDCl3
##.SHIFT REFERENCE= (INTERNAL, CDCl3, 0, 16.522)
##AUDIT TRAIL= $$ (NUMBER, WHEN, WHO, WHERE, WHAT)
$$ ##TITLE= Audit trail, XWIN-NMR		Version 3.5
$$ ##JCAMPDX= 5.01
$$ ##ORIGIN= Bruker BioSpin GmbH
$$ ##OWNER= nmr
$$ C:\u/data/dgb/nmr/ADRS/1220/pdata/1/auditp.txt
$$ ##AUDIT TRAIL=  $$ (NUMBER, WHEN, WHO, WHERE, WHAT)
(   1,<2006-11-27 14:56:06.42 +000>,<MAYBRIDGE\nmr>,<NMR_250MHZ>,
      <created by zg, POWCHK disabled, PULCHK disabled
       configuration hash MD5:
       49 4B E0 1D 92 C2 6B 37 9F E6 65 BC 52 41 86 1D
       data hash MD5: 64K
       C2 FA 3F 6F CB 4E 98 7F 4C 0F C7 CF 5D BE 6E AB>)
(   2,<2006-11-27 14:56:20.69 +000>,<MAYBRIDGE\nmr>,<NMR_250MHZ>,
      <Start of raw data processing
       ef LB = 0.3 FT_mod = 6 PKNL = 1 SI = 32K 
       data hash MD5: 32K
       34 89 01 04 60 E4 CE 56 42 3C D6 6C 21 FD 3B 8F>)
(   3,<2006-11-27 14:56:22.28 +000>,<MAYBRIDGE\nmr>,<NMR_250MHZ>,
      <apk 
       data hash MD5: 32K
       C1 66 09 53 18 0A FF C7 DF B1 17 83 BB EA 17 EE>)
(   4,<2006-11-27 14:56:23.05 +000>,<MAYBRIDGE\nmr>,<NMR_250MHZ>,
      <abs ABSG = 5 
       data hash MD5: 32K
       64 8A 30 E2 C3 3B A6 08 08 3B 38 65 A0 DD DF AA>)
$$ ##END=
$$ 
$$ hash MD5
$$ 86 44 35 3C B3 6A 62 F5 75 2A CD C1 DD 66 92 81
##$RELAX= 
##$RELAX= 
##$RELAX= 
##$RELAX= 
##$RELAX= 
##$RELAX= 
##$RELAX= 
$$ Bruker specific parameters
$$ --------------------------
##$DU= <C:\u>
##$EXPNO= 1220
##$NAME= <ADRS>
##$PROCNO= 1
##$TYPE= <nmr>
##$USER= <dgb>
##$AMP= (0..31)
100 100 100 100 100 100 100 100 100 100 100 100 100 100 100 100 100 100 
100 100 100 100 100 100 100 100 100 100 100 100 100 100 
##$AQSEQ= 0
##$AQ_mod= 3
##$AUNM= <au_zg>
##$AUTOPOS= <6 >
##$BF1= 250.13
##$BF2= 250.13
##$BF3= 250.13
##$BF4= 250.13
##$BF5= 500.13
##$BF6= 500.13
##$BF7= 500.13
##$BF8= 500.13
##$BYTORDA= 1
##$CFDGTYP= 0
##$CFRGTYP= 5
##$CHEMSTR= <none>
##$CNST= (0..31)
1 1 145 1 1 1 1 1 1 1 1 1 1 1 1 1 1 1 1 1 1 1 1 1 1 1 1 1 1 1 1 1 
##$CPDPRG= <>
##$CPDPRG1= <>
##$CPDPRG2= <>
##$CPDPRG3= <>
##$CPDPRG4= <mlev>
##$CPDPRG5= <mlev>
##$CPDPRG6= <mlev>
##$CPDPRG7= <mlev>
##$CPDPRG8= <mlev>
##$CPDPRGB= <>
##$CPDPRGT= <>
##$D= (0..31)
0 1 0 0 0 0 0 0 0 0.06 0 0 0 0 0 0 0.0002 0 0 0 0 0 0 0 0 0 0 0 0 0 0 
0 
##$DATE= 1164639365
##$DBL= (0..7)
120 120 120 120 120 120 120 120 
##$DBP= (0..7)
150 150 150 150 150 150 150 150 
##$DBP07= 0
##$DBPNAM0= <>
##$DBPNAM1= <>
$$ [...]
##$SUBNAM7= <"">
##$SUBNAM8= <"">
##$SUBNAM9= <"">
##$SW= 20.6930455092707
##$SWIBOX= (0..15)
0 0 3 0 0 0 0 0 0 0 0 0 0 0 0 0 
##$SW_h= 5175.983436853
##$TD= 65536
##$TD0= 1
##$TE= 295.16
##$TE2= 300
##$TE3= 300
##$TEG= 300
##$TL= (0..7)
0 120 120 120 120 120 120 120 
##$TP= (0..7)
150 150 150 150 150 150 150 150 
##$TP07= 0
##$TPNAME0= <>
##$TPNAME1= <>
##$TPNAME2= <>
##$TPNAME3= <>
##$TPNAME4= <>
##$TPNAME5= <>
##$TPNAME6= <>
##$TPNAME7= <>
##$TPOAL= (0..7)
0.5 0.5 0.5 0.5 0.5 0.5 0.5 0.5 
##$TPOFFS= (0..7)
0 0 0 0 0 0 0 0 
##$TUNHIN= 0
##$TUNHOUT= 0
##$TUNXOUT= 0
##$USERA1= <user>
##$USERA2= <user>
##$USERA3= <user>
##$USERA4= <user>
##$USERA5= <user>
##$V9= 5
##$VALIST= <valist>
##$VCLIST= <CCCCCCCCCCCCCCC>
##$VD= 0
##$VDLIST= <DDDDDDDDDDDDDDD>
##$VPLIST= <PPPPPPPPPPPPPPP>
##$VTLIST= <TTTTTTTTTTTTTTT>
##$WBST= 1024
##$WBSW= 4
##$XGAIN= (0..3)
0 0 0 0 
##$XL= 0
##$YL= 0
##$YMAX_a= 401666
##$YMIN_a= -484751
##$ZGOPTNS= <>
##$ZL1= 120
##$ZL2= 120
##$ZL3= 120
##$ZL4= 120
##$ABSF1= 16.522
##$ABSF2= -4.171173
##$ABSG= 5
##$ABSL= 3
##$ALPHA= 0
##$AQORDER= 0
##$ASSFAC= 0
##$ASSFACI= 0
##$ASSFACX= 0
##$ASSWID= 0
##$AUNMP= <proc_1d>
##$AZFE= 0.1
##$AZFW= 0.1
##$BCFW= 0
##$BC_mod= 0
##$BYTORDP= 0
##$COROFFS= 0
##$CY= 12.5
##$DATMOD= 1
##$DC= 0
##$DFILT= <>
##$DTYPP= 0
##$F1P= 14.0000005364418
##$F2P= -0.99999901652339
##$FCOR= 0.5
##$FTSIZE= 32768
##$FT_mod= 6
##$GAMMA= 0
##$GB= 0
##$INTBC= 1
##$INTSCL= 1
##$ISEN= 128
##$LB= 0.3
##$LEV0= 0
##$LPBIN= 0
##$MAXI= 10000
##$MC2= 0
##$MEAN= 0
##$ME_mod= 0
##$MI= 0
##$NCOEF= 0
##$NC_proc= -3
##$NLEV= 6
##$NOISF1= 0
##$NOISF2= 0
##$NSP= 0
##$NTH_PI= 0
##$NZP= 0
##$OFFSET= 16.522
##$PC= 1
##$PHC0= 224.3929
##$PHC1= 0.2173633
##$PH_mod= 1
##$PKNL= yes
##$PPARMOD= 0
##$PSCAL= 4
##$PSIGN= 0
##$REVERSE= no
##$SF= 250.13
##$SI= 32768
##$SIGF1= 0
##$SIGF2= 0
##$SINO= 400
##$SIOLD= 32768
##$SREGLST= <1H.CDCl3>
##$SSB= 0
##$STSI= 32768
##$STSR= 0
##$SW_p= 5175.98343685301
##$SYMM= 0
##$S_DEV= 0
##$TDeff= 65536
##$TDoff= 0
##$TI= <Analysis number 999999
Compound Code 99
Book Reference 9
Project Code 9>
##$TILT= no
##$TM1= 0
##$TM2= 0
##$TOPLEV= 0
##$USERP1= <user>
##$USERP2= <user>
##$USERP3= <user>
##$USERP4= <user>
##$USERP5= <user>
##$WDW= 1
##$XDIM= 32768
##$YMAX_p= 348773915
##$YMIN_p= -74630
$$ End of Bruker specific parameters
$$ ---------------------------------
##NTUPLES= NMR SPECTRUM
##VAR_NAME=  FREQUENCY,     SPECTRUM/REAL,   SPECTRUM/IMAG
##SYMBOL=    X,             R,               I
##VAR_TYPE=  INDEPENDENT,   DEPENDENT,       DEPENDENT
##VAR_FORM=  AFFN,          ASDF,            ASDF
##VAR_DIM=   32768,         32768,           32768
##UNITS=     HZ,            ARBITRARY UNITS, ARBITRARY UNITS
##FACTOR=    0.157963299565203, 1,           1
##FIRST=     4132.6476996994, 0,             0
##LAST=      -1043.33573715361, 0,           0
##MIN=       -1043.33573715361, -74630,      0
##MAX=       4132.6476996994, 348773915,     0
$$ Real data points
##PAGE= N=1
##DATA TABLE= (X++(R..R)), XYDATA
$$ [...]
20593C517n842j5812j3588j6109j101K6234L627k809p445q790K5323Q131m265
20580h929j3774j31J6621J1655j5484l7n22N919N931L717q530k967O529j223o658
20565g883r218O692M494r231M742O220J822n778L005J206n029p582n724J4923
20551g341J4665R311n815m586n193l842j999k0494P05J3594J3176J0327J892K334
20537A6734j300M306j836J824m74p474j5636P72J2695M650K602J139j0114K213
20523A0101l09k0026n224n029o41J3686L28k694N244l213J7234j93o587j959J0413
20508A1131K296j5114j7686j4312K156J4836M997M090O451m542q633L514J993
20495h823K678o679j3051L268K71N679K555O985M648K969n386q395K489J232J7856
$$ plain form
20593 3517 -2325 -18137 -31725 -47834 -48935 -22701 -19074 -21883 -29328 -38118 -12795 -4664 -8929
20580 -8929 -22703 -22834 -6213 5442 -10042 -10079 -10601 -4682 1249 4966 -3564 -6531 -2 -1225 -7883
20565 -7883 -17101 -10409 -5915 -15146 -10404 -4184 -2362 -8140 -5135 -3929 -8958 -16540 -22264 -7341
20551 -7341 7324 16635 10820 6234 1041 -2801 -4800 -25294 -24589 -10995 2181 12508 14400 16734
20537 16734 15434 19740 17904 19728 19254 11780 -3856 -3084 9611 14261 16863 18002 7888 10101
20523 10101 9792 -10234 -15458 -20487 -21128 -7442 -7114 -9808 -4564 -7777 9457 9264 2677 718 11131
20508 11131 13427 -1687 -19373 -33685 -31529 -16693 -11696 -7606 -1155 -5697 -14330 -10816 -8823
20495 -8823 -6145 -12824 -25875 -22607 -22336 -16657 -14102 -7117 -2469 500 -4886 -13281 -10792 -9560 8296
20480H296Q242o719j2053o307O121J0085q980J1855K1225K116n41r311K049j1393
20466A4685r292j097l594j0032p005o71N572k0431J466R346J7031N67L961J3305
20452A3811j067j990m742m41J943o815j6447J9022J5359J6774P439k528j1640
20439B8678k2690j6466j4255J0277J1683j24q583P225J1541n643J742P996O867
20426A8248J338Q237j450j0994k0430J8142Q623k875K908n622p954q271m507N155
20412E48N246k158N946J5794r044j5287r843N455o95k175N008Q704l197Q282j21
20397A2463j9078j0645P59Q418J3825K1425M609J828j7122j8473K467J1564m175
20384G865J731J751j41l355r858n546J1299m698j3189o259J931J80K780l748l279
$$ plain form
20480 8296 16538 9819 -2234 -8541 -2420 7665 -1315 10540 31765 33881 33340 24029 26078 14685
20466 14685 5393 4296 702 -9330 -16335 -17006 -11434 -31865 -30399 -21053 -4022 -3455 506 13811
20452 13811 12744 10754 6012 5571 7514 699 -15748 3274 18633 35407 42846 40318 28678
20439 28678 5988 -10478 -24733 -14456 -2773 -2897 -11480 -4255 7286 1643 3385 11381 18248
20426 18248 19586 27823 26373 15379 -5051 13091 21714 18839 21747 16125 8171 -100 -4607 548
20412 548 5794 3636 9582 25376 16332 1045 -8798 -3343 -4038 -6213 -1205 7499 4302 12584 12463
20397 12463 -6615 -17260 -16501 -8083 5742 27167 31776 33604 16482 -1991 476 12040 7865
20384 7865 9596 11347 11206 7851 -2007 -7553 3746 -952 -14141 -20400 -18469 -18289 -15509 -19257 -22536
20369b2536J1062O942m349n727Q15O332q430k773O30J1041J2230J6313Q445j8741
20355A1254j6807J7222R917r143j0118K128j3480j449j290m595L020j3865r051
20342c6257j037J4578R954j288l807m833m464J954P77K2969K3089j453j9576n440
20328d834R686M172R23j7421j3270O319J1193l534l144J3303O126k1949q39J9826
20314F557J0809M832k032o766j5941O11m765j6772O486N960L790q12Q287o469
20300f225p235p51N877j56K0Q679j85L386m511p243N08n372N583Q487j1108j244
20284a1490K68J388P205L64L100P057N813m162j0772K700k106o720P342K199k519
20269c33k919K564O213j7165j3680N359K693J1478J3119L946k827K932q601q282
$$ plain form
20369 -22536 -11474 -4532 -8881 -14608 -13793 -7461 -15891 -18664 -18034 -6993 5237 21550 29995 11254
20355 11254 -5553 11669 21586 12443 2325 4453 -9027 -10476 -11766 -16361 -13341 -27206 -36257
20342 -36257 -37294 -22716 -12762 -14050 -17857 -22690 -27154 -25200 -24423 -1454 21635 20182 606 -4834
20328 -4834 4852 9024 9947 -7474 -20744 -14425 -3232 -6766 -9910 3393 9519 -12430 -13269 6557
20314 6557 17366 22198 20166 13400 -2541 -1930 -6695 -23467 -16981 -11021 -7231 -8043 244 -6225
20300 -6225 -13460 -14211 -8334 -8490 -8470 209 24 3410 -1101 -8344 -7836 -13208 -7625 862 -10246 -11490
20284 -11490 -11222 -9834 -2629 -2265 835 7892 13705 9543 -1229 1471 -635 -7355 -13 2186 -333
20269 -333 -3252 -688 5525 -11640 -25320 -19961 -17268 -5790 7329 11275 8448 11380 2779 -5503
20255e503j2694m222J8427J229J082O73l665l224M228P790J607J4615m636m271
20241A1436N14j561j8948l387n49q1J1017M189j313j053j456q022j0677L331M989
20226a1571m090O231J867O90l028j1384o185l358O080l371R083R689N281m958
20212i024j0860J8418j092m503o018N462P885N929l973o803o949m128n38J9243
20198C049K3555k836j4262R11l319m799n245n848j0681P037J1454L038l233J4613
20184A3434J3990J8552l92j1030j0540j4066j0790n846J2420O497l021P134j6238
20171A04p803r681l487k475O709Q271O734O521l331l266K4J569j2642M133M997
20156c623L722N446j1R17R686o685j2583l206L086n560M40J0673p693p503O548
$$ plain form
20255 -5503 -18197 -22419 -3992 -2763 -1681 -1008 -4673 -7897 -3669 4121 5728 20343 15707 11436
20241 11436 11950 10389 -8559 -11946 -12495 -12576 -1559 2630 1317 264 -1192 -9214 -19891 -16560 -11571
20226 -11571 -15661 -9430 -7563 -6873 -9901 -21285 -27470 -30828 -24748 -28119 -19036 -9347 -4066 -9024
20212 -9024 -19884 -1466 -2558 -7061 -13079 -7617 268 6197 2224 -4579 -11528 -15656 -16194 3049
20198 3049 26604 23768 9506 10417 7098 2299 -2946 -8794 -19475 -12438 -984 2054 -1179 13434
20184 13434 27424 45976 45584 34554 24014 9948 -842 -6688 5732 12229 9208 16342 104
20171 104 -7699 -17380 -20867 -23342 -16633 -8362 -1628 4893 1562 -1704 -1680 -111 -12753 -8620 -3623
20156 -3623 99 5545 5534 6451 16137 9452 -3131 -6337 -3251 -8811 -8371 2302 -5391 -12894 -6346
20141f346J465n861L024J7094l32L185L167q560q108l8q773j9615M775J1857R389
20126c677m501J475p827M449J6507J5429J5471M374j2952q172P039j2660l140
20113A1815k101J55l585p273o551m695M041j496l346O899P786J558L646J2542
20099A9395R441q23j3655J240l12o390n027L0L169m564o483m858j0301j527J6397
20084d268J2161q229O675K900j1620j2150j675J3179r822m692J0127l18j173R064
20070A59J611q890N1J612j253k128J0511j1181r451J3071J611l690k927k641J8470
20055D935J210m626q567j1310m14l26n53R630O64j1732q7j798J511K2004R538
20040A0079m422M019L323n572l274j642N088J64j08j0517J1504m815j8729j1771
$$ plain form
20141 -6346 -4881 -10742 -7718 9376 9044 12229 15396 6836 -1272 -1310 -10083 -29698 -24923 -13066 -3677
20126 -3677 -8178 -6703 -14530 -10081 6426 21855 37326 41700 28748 20576 27615 14955 11815
20113 11815 9714 9869 6284 -989 -7540 -12235 -8194 -9690 -13036 -6137 1649 3207 6853 19395
20099 19395 28836 28013 14358 15598 15286 8896 3869 3899 7068 2504 -3979 -8837 -19138 -20665 -4268
20084 -4268 7893 -336 6339 9239 -2381 -14531 -16206 -3027 -12849 -17541 -7414 -7732 -8905 159
20070 159 1770 -7120 -7069 -5457 -6710 -8838 1673 -9508 -18959 -5888 -4277 -7967 -10894 -13535 4935
20055 4935 6145 1519 -7048 -18358 -18772 -19098 -19651 -10021 -9357 -21089 -21176 -22974 -21463 541 10079
20040 10079 5657 9676 12999 7427 4153 2511 7599 7763 7655 -2862 8642 3827 -14902 -26673
20026b6673N942Q015J3108L27J4233k491k434l525M304r07J255J2497P522r515
20012B1658j6920j1783J0974M453o113J1014M411m15k4011j142Q330n67n207Q842
19998C524J0280j2002J2573R451k331Q818j0538r030k614r869j94j0928o01J28
19984a3333p520Q950l023J4835J5541K520j1164o088K920p741o329K621j929O235
19970c505n208J1011M792O795K390p597j1498K692p428o85P926M747j6170j5238
19956b6976r104P120J2877R624N598o452m905J919k425r800J710R89m215O553
19942a7487Q639N410L853M11j0688J827Q532Q705L063n7R089j768j1264j6691
19928h426L288O032J359o898o59k381k816l701r870K038l864P05L100J2589P854
$$ plain form
20026 -26673 -20731 -12716 392 719 14952 12461 10027 6502 10806 9899 11154 23651 31173 21658
20012 21658 4738 -7045 3929 8382 2269 13283 17694 17279 -6732 -7874 456 -111 -5318 3524
19998 3524 13804 1802 14375 23826 21495 30313 19775 10745 8131 -1738 -1932 -12860 -13461 -13333
19984 -13333 -20853 -11903 -14926 -91 15450 17970 6806 718 3638 -4103 -10432 -7811 -9740 -3505
19970 -3505 -8713 2298 7090 13885 16275 8678 -2820 -128 -7556 -8241 -315 4432 -11738 -26976
19956 -26976 -36080 -28960 -16083 -6459 -861 -7313 -12218 -10299 -12724 -22524 -20814 -19825 -24040 -17487
19942 -17487 -8848 -3438 415 826 -9862 -8035 497 9202 12265 12208 21297 19529 8265 -8426
19928 -8426 -5138 894 2253 -4645 -5304 -7685 -10501 -14202 -24072 -22034 -25898 -25193 -22093 -9504 -1650
19913a650M957r740r976M547J925J0903M154O029r40j645J901j0863j71m347q703
19898a3619J1644L016r213l072o686J1853J0535O070M955n582j6955r89L357O725
19884B039L952J8370o205j3338J973K423j0369O134L14n245k810K760J7478j695
19870A5781k343K4320O336q656n23M177j2684J112K152j7651j0343r098k342p240
19856a7002r145P481J7960k556N555N801n224Q002Q594n06j6134n698l025K065
19842c832J1155P944Q312n708j4881p280L206L403N182K643M691j1376k540P665
19828H584P319J4202k382j9222m352M116j873J1r069Q594K5318j0469j4995n136
19814F46l495n833J91J3971J348n512K041J4953J349l075R74m175n946j577k591
$$ plain form
19913 -1650 3307 -6433 -16409 -11862 -9937 966 5120 11149 10209 8564 10465 -398 -569 -4916 -13619
19898 -13619 -1975 1041 -8172 -11244 -17930 -6077 4458 10528 15483 9901 -7054 -8043 -4686 2039
19884 2039 5991 24361 18156 4818 6791 9214 -1155 4979 5293 48 -2762 -2 17476 15781
19870 15781 13438 37758 44094 35438 34915 39092 26408 27520 29672 12021 1678 -7420 -9762 -17002
19856 -17002 -26147 -18666 -706 -3262 2293 8094 2870 10872 19466 18960 2826 -2872 -5897 -3832
19842 -3832 7323 15267 23579 17871 2990 -4290 -1084 2319 7501 10144 14835 3459 919 8584
19828 8584 15903 30105 27723 8501 4149 8265 6392 6403 -2666 5928 31246 20777 5782 646
19814 646 -2849 -8682 -8491 5480 6828 1316 3357 18310 19659 16584 17558 13383 7437 5860 3269
19799C269J4658K072j5844m522J199o995o156q77Q046L101L648l484R74r018Q609
19784a320L04O446J893O989Q396J835p893n329J848l628N701o599j2281j8626
19770b2264J9713K1631n985L477J5217j4880j4715K953r220n555Q52m570J010
19757a2336Q923R873k496K138L208p481j2018o151R27J515P497J3872Q98l321
19743E048Q923J8611N352j6714j3074o95L467n644O93L605m190K567q317l338
19729c706Q095o43L14k219J124J0887N135q244l405M043j562j6654j1330MM903
19714a3258P324O688J1349n861Q184j315l717j9411n788J0362J7701j265j0599
19701C94M443K355o019J064j26J0212l184o259k407Q598L344N023j1011o381J805
$$ plain form
19799 3269 17927 19999 4155 -367 832 -6163 -12319 -13196 -5150 -2049 1599 -1885 -911 -9929 -1320
19784 -1320 -1016 5430 7323 14312 22708 24543 16650 11321 13169 9541 15242 8643 -3638 -22264
19770 -22264 -2551 19080 13095 16572 31789 16909 2194 5147 -4073 -9628 -8776 -13346 -12336
19757 -12336 -3413 6460 3964 6102 9310 1829 -10189 -16340 -15413 -13898 -6401 7471 8369 5048
19743 5048 13971 32582 37934 21220 8146 7451 10918 5274 5967 9572 5382 7949 -368 -3706
19729 -3706 4389 3746 4060 1841 2965 13852 18987 10743 7338 11381 9819 -6835 -18165 -18161 -13258
19714 -13258 -5934 754 12103 6242 14426 13111 9394 -10017 -15805 -5443 12258 10993 394
19701 394 4837 7192 1173 2237 2111 12323 9139 2880 473 9071 12415 17438 6427 46 1851
19686A851J136R90K429j253m185N759j815m867J7485l72o560l804k01M203O650
19671A7446N520l743q852L810J0475l253L656l111j1477K748j616j4752J7388
19658A4239K596p029k59K629m002L414Q139o377p423J794l379N034L985n94r78
19643A1789n207m94N963K431K978r770O027J2926n868q712l281j5463J1596J843
19629F758M399L273j121j385j662J0651M275R086j2895k2860j2531J3524L346
19616B858k929M333r937L535Q911N151j0721l402K837j0127k135J8739P906O567
19602B1586K99O279P56j7320j2671K687K1814J0250n981j017l666k405J34q780
19588A1965J179P578M889l477r509m220M911J714o970l035J584J4350J177l721
$$ plain form
19686 1851 2987 3977 6406 5153 968 6727 4912 45 17530 17158 10598 6794 6593 10796 17446
19671 17446 22966 19223 10371 14181 24656 21403 25059 21948 10471 13219 11603 -3149 14239
19658 14239 16835 9806 9547 12176 8174 11588 19727 13350 5927 7721 4342 9376 13361 12767 11789
19643 11789 6582 6088 12051 14482 17460 7690 13717 26643 20775 12063 8782 -6681 4915 6758
19629 6758 11157 14430 13309 11924 10262 20913 25188 34274 21379 -1481 -14012 -488 2858
19616 2858 -71 4262 -5675 -2140 6771 11922 1201 -2201 636 -9491 -11626 7113 15019 21586
19602 21586 21885 28164 28920 11600 -1071 1616 23430 33680 27699 26682 23016 20611 20745 11965
19588 11965 13144 20722 25611 22134 12625 8405 13316 15030 8060 5025 6609 20959 22136 18415
19574A8415J0737m053r222M993J127j0654o34J1656O891k766p804j799m691o963
19560E233o895R60K036R18J6975k121r146K532q834j3441m651k154j1081M306
19546b5363M269N784k763J874j5639M717R859R759J0117o605q792p00Q985J0501
19532F003L427j1862l586P228j48o742q990j2310o674J2600K603J040J5784O353
19518D726K169j534j3623o811Q295Q954J6496L318j7312l606o558M84J1245Q007
19504A4250O031p689K831J698p005k655l878r738j36M859j0943l952M142J4778
19490B593J0961P803j944Q803j035n978j7260l584J2944J257k3165L612N647N153
19476E807K473J5455l944L618L616P61j5429j4194O917l188j331l822M703k962
$$ plain form
19574 18415 29152 25099 15877 20870 21997 11343 10709 22365 29256 26490 18686 16887 12196 5233
19560 5233 -1662 -702 1334 2252 19227 17106 7960 10492 1658 -11783 -16434 -18588 -29669 -25363
19546 -25363 -21094 -15310 -18073 -16199 -31838 -27121 -17262 -7503 2614 -3991 -12783 -13483 -4498 6003
19532 6003 9430 -2432 -6018 1210 1062 -5680 -14670 -26980 -33654 -21054 -18451 -17411 -1627 4726
19518 4726 6895 5361 -8262 -15073 -6778 2176 18672 21990 4678 1072 -5486 -5002 6243 14250
19504 14250 20281 12592 15423 17121 10116 7461 3583 -6155 -6291 -1432 -12375 -16327 -12185 2593
19490 2593 13554 21357 19413 28216 27181 21203 3943 359 13303 14560 -8605 -4993 654 5807
19476 5807 8280 23735 19791 23409 27025 27786 12357 -1837 5080 1892 561 -3261 1442 -1520
19462a520N310k080m228M726J897M329p244O407N179l378M517M078l655m517J414
19447A1235P635o694l20L302m907J0754j1277j4974K065q145p8j585Q001M666
19433c22j4596n287M874L190k58L3j2553Q732J2759O568K272j1444k850n452o236
19418b0570R866P711M07N781R797K439K843j9041o077j239P761K762q859L643
19404b776N042j063J482L895L383L118P593k164K63k134J4155r701l060J61J026
19389A9220k557P276p623j0179r02m84P124o508j4035k93O621K910N086L727L148
19374A2531p977r556j3581M803P357J8110K023r261j3815l784J0938R443m066
19361C165R74P79p890p275J481J93q24J3969k540j048Q021j339J315K071O140
$$ plain form
19462 -1520 3790 1710 -2518 2208 4105 8434 1190 7597 12776 9398 13915 17993 14338 9821 11235
19447 11235 18870 12176 11856 15158 10251 21005 9728 -5246 -3181 -11326 -11404 -12989 -4988 -322
19433 -322 -14918 -20205 -15331 -12141 -12399 -12366 -24919 -16187 -3428 3140 5412 -6032 -8882 -14334 -20570
19418 -20570 -10704 -2993 -2586 3195 12992 15431 18274 -767 -6844 -8083 -322 2440 -6419 -2776
19404 -2776 2266 1203 2685 6580 9963 13081 20674 18510 18773 16639 30794 21093 18033 18194 19220
19389 19220 16663 23939 16316 6137 5235 4751 11875 5367 -8668 -8961 -2340 570 5656 9383 12531
19374 12531 4554 -5002 -18583 -13780 -6423 11687 13710 4449 -9366 -13150 -2212 7231 3165
19361 3165 4139 4918 -2972 -10247 -8766 -8573 -9397 4572 2032 984 9005 7666 8981 11052 17192
19346A7192m42o869j4154o082J3321O15j0679m912j0385R939L818J5292J5169
19333B1823p678l718P540m456n878J207p532l594q616P677O468j3203Q071P467
19319E578P300K184j3189O237J0413j0944j9631l885J4050J0820L892L406L715
19306A9946j3725P692n971j405n351j3055k114J1389l841M411R046J6186O65k673
19292B1200o663r750m476L153j0722j0924j746J7217O50O642m86M664P43l244
19278F258Q284l255M71P942Q283l209M062n696K837J158l748j1242j793M856L178
19263A8386q666o000p879p248q399J4879J5175P665l663j379J0116n096m800l584
19249I507K952n380M85K916k370J0022J0227O780j5907j6025M539j486J119J251
$$ plain form
19346 17192 16750 9881 -4273 -10355 2966 3581 -7098 -12010 -22395 -12456 -8638 6654 21823
19333 21823 14145 10427 17967 13511 7633 8840 1308 -2286 -10902 -3225 3243 -9960 -1889 5578
19319 5578 12878 15062 1873 8110 18523 7579 -12052 -15937 -1887 8933 12825 16231 19946
19306 19946 6221 13913 7942 6537 1186 -11869 -13983 -2594 -6435 -2024 7022 23208 23873 21200
19292 21200 14537 4787 311 3464 -7258 -18182 -19928 -2711 -2061 4581 4095 8759 9502 6258
19278 6258 14542 11287 11758 19700 27983 24774 28836 23140 25977 27135 23387 12145 10352 15208 18386
19263 18386 9720 3720 -4159 -11407 -19806 -4927 10248 17913 14250 12871 22987 17891 13091 9507
19249 9507 12459 7079 7564 10480 8110 18132 28359 35139 19232 3207 7746 6260 7379 8630
19235H630Q037n99p841O053J2128N359j3234j00j5602p979J5011R541J168M196
19221B4768j1765m782q401J2251K8764O72o726j8464m848K308q136q661L508o803
19207f315l659J662J2653J2539j4370J514L873J6487K535P77n255j0251j9047
19194f857J761R476N102j1080r099M718L205p611q30L903n736N682J5502P612
19180A5748L380k342j0837j1619Q85R097P697J984r00m245n644j083M459R921
19166A6501O346k032J74m736n851j0940m338Q350N053P477J1307k783J3431N260
19152D3219o699j076J0427j2818j5175J2654L006j0223j8947J371N083J780n633
19139F969r240J0590Q901k326j593k109o344n067l666J0537J2413M365o211o64
$$ plain form
19235 8630 16667 16068 8227 14280 26408 31767 18533 18433 2831 -5148 9863 19404 20572 24768
19221 24768 13003 8221 -180 12071 40835 41507 34781 16317 11469 13777 5641 -3020 488 -6315
19207 -6315 -9974 -8312 4341 16880 2510 4024 7897 24384 26919 27696 22441 12190 -6857
19194 -6857 -5096 4380 9482 -1598 -10697 -5979 -2774 -10385 -11215 -7312 -13048 -7366 8136 15748
19180 15748 19128 16786 5949 -5670 -4785 4312 12009 13993 13093 8848 3204 2121 6580 16501
19166 16501 22847 20815 20989 16253 10402 -538 -4876 3474 8527 16004 27311 24528 37959 43219
19152 43219 36520 35444 45871 33053 17878 30532 33538 23315 4368 5739 10822 12602 6969
19139 6969 -2271 8319 17220 14894 13301 11192 4848 -219 -3885 6652 19065 23430 17219 16555
19125A6555j994r361J4748R498n323o448j8355P5J3756O506O147j2540j0171j524
19111A569J1706n877j0406P091P301n224q756l499m333n907J456R509R701J3267
19097A7598k764K961M052J1787P346o12k2888j7537o756J213l075J1686Q654l79
19083A1286L983J6155r335j3660N809n660N510j2644O874r57q840O364k995P772
19069I662M864N912N68r629L36J572N927k895q2O263r870K31p75l934o502N938
19053G586J0147l1j930J1129M198j0453q860J1328J4027N567m579q042j1666K04
19039A8625J886J820Q204r26R723J4721M428L794J0032J6878M7120N2104K5479
19026B13888j8309j9408j7195k6923l2137k5599k1074k423k40J0887p579q743
$$ plain form
19125 16555 14561 5200 19948 29446 24123 17675 -680 -605 13151 19657 25804 13264 3093 1569
19111 1569 13275 7398 -3008 4083 11384 6160 -2596 -6095 -10428 -16335 -14879 -5370 4331 17598
19097 17598 14834 17795 21847 33634 40980 40368 17480 -57 -6813 -5600 -8675 3011 11665 11286
19083 11286 15269 31424 22089 8429 14238 8578 14088 1444 8318 7361 -1479 4885 1890 9662
19069 9662 14526 20438 21006 11377 11713 13285 19212 16317 16235 22498 12628 12859 12084 8150 1648 7586
19053 7586 17733 17702 15772 26901 31099 20646 11786 23114 37141 42708 38129 30087 18421 18625
19039 18625 20511 22331 30535 29609 39332 54053 58481 62275 72307 89185 136305 188409 213888
19026 213888 195579 176171 158976 132053 99916 74317 53243 50820 50580 61467 53888 45145
19014D5145q12J7743K5805K9730K5783L8213M1150J9241P485l1987m2101m1356
19002A34039l3334k5002j9153q706p693p744k948k769L476N004m833k39L925l996
18988C0027j638p568N128o209J2053R273R822J1485J1757J5482M8171M6338K6667
18975B10788Q709P169j4621m0321k0388l0326k6929j0930j1629r043j4356l578
18963D4545Q655K2307K1194J8043J1513K2729L3860K5900Q744O17l4531l9549
18951A44027n0439l6019j9429l076l244M184j1245Q05P824p210j4093p101J0657
18938A5641j456q134n266R213K0018m254m181n646K601p996M756M267O30n210
18924A4983o635j9930j93P157O781M8n972j909K327J1090r384O406R44l14j1328
$$ plain form
19014 45145 44333 62076 87881 117611 143394 181607 222757 241998 249483 217496 175395 134039
19002 134039 100705 75703 56550 47844 40151 32407 29459 26690 30166 35170 30337 30098 34023 30027
18988 30027 28389 20821 25949 19740 31793 41066 50888 62373 74130 89612 137783 184121 210788
18975 210788 219497 226666 212045 171724 151336 121010 94081 83151 71522 62479 48123 44545
18963 44545 53200 75507 96701 114744 126257 148986 182846 208746 217490 218107 183576 144027
18951 144027 93588 57569 38140 35064 31820 36004 24759 25564 33388 26178 12085 4984 15641
18938 15641 14185 6051 785 9998 30016 25762 21581 15935 18536 10540 15296 19563 20193 14983
18924 14983 8348 -11582 -11775 -4618 2163 2211 -3761 -5670 -3343 7747 -1637 4769 5713 5399 -5929
18909e929N063j267J439k761J7578J1895l886n066N230J124J2858K083j6558j7590
18895D213l05J0087j672N48q664L000q939K17J3243m427J0009J8479k426j2231
18881B1132j2248j616L007O003Q932R33K498j0632m320P63J5323R140p014m020
18867B7881r308j1384q438J0027J2418K644n267j0853L343P177J615j258Q089
18854B6686O356j7181m443Q019L106j542O990M35l286M539j5449j140M97O261
18840A9848p23j4822j2370j818O038M839o353m150K4772J384j815Q352R416J417
18826C4015J2962K840R853r246r851q609j668n730j5882l352n33J0144K353o74
18812A6622K51P731K266p015j6749n978J080o151J4707O400Q089p430j057O759
$$ plain form
18909 -5929 -866 -2133 -694 -3455 14123 26018 22132 17066 22296 23420 36278 38361 21803 4213
18895 4213 3908 13995 12323 12871 4207 7207 -1732 -1515 11728 7301 17310 35789 33363 21132
18881 21132 8884 7268 10275 16278 25210 26143 28641 18009 13689 14452 29775 38915 31901 27881
18867 27881 18573 7189 -1249 8778 21196 23840 18573 7720 11063 18240 19855 18597 26686
18854 26686 33042 15861 11418 19437 22543 21001 27991 28426 25140 29679 14230 13090 13587 19848
18840 19848 19125 4303 -8067 -9885 -3847 992 -5361 -9511 15261 16645 14830 23182 32598 34015
18826 34015 46977 49817 59670 50424 40573 31964 30296 24566 8684 5332 4799 14943 17296 16622
18812 16622 16873 24604 26870 19855 3106 -2872 -1792 -7943 6764 13164 21253 13823 12766 19525
18798A9525p199p201N877M666m999l303m255m013J4467n129j2341P526J0736J9120
18784C3477N148J870l187J933K699k828j4055M222O329L169l951j421r16M931
18770C7420K662L1700N4897M9541O121l2760m7024l5840k8506j3083K403J7135
18758D4666l773j2954P36K0207j6549j3248j2633L61J0472M697p368o2L337M863
18744B2752N945m838j5113m119J5803K2515n569j1956p29k025J5502J8004p567
18731D8605j8772j3325q940j265k338J1033R435k523j317j0114o76O654N7n306
18717A1208O18J2459J2102n030q688L847j344k403J1793p197k1548O614P599l468
18703A6562L108N004J3032J0787J1214l000k114j203r620l284j3102n802N791
$$ plain form
18798 19525 12326 5125 11002 15668 10669 7366 3111 -902 13565 8436 -3905 3621 14357 33477
18784 33477 38625 40495 37308 39241 41940 39112 25057 29279 35608 38777 34826 33405 32489 37420
18770 37420 40082 71782 126679 176220 182341 149581 102557 66717 38211 25128 27531 44666
18758 44666 40893 27939 28675 48882 32333 19085 6452 6813 17285 21982 14614 14552 17889 22752
18744 22752 28697 23859 8746 4627 20430 42945 37376 25420 24691 22666 38168 56172 48605
18731 48605 29833 16508 7568 6303 3965 14998 24433 21910 20593 10479 9803 16457 16514 11208
18717 11208 11826 24285 36387 31357 22669 26516 25172 22769 34562 27365 5817 12431 20030 16562
18703 16562 19670 24674 37706 48493 59707 56707 54593 53390 43770 40486 27384 21582 27373
18690B7373R536n61p538N018r17P32j2634j7330N815J4590P934m092j8376l578
18676E972J5615n141k289L735p411R391L165j904J328N458K940p045r122j1439
18662C253j988m319J700O161J8952M104M561r47K793J654m148L123j1007o914
18648A6978M140J3929k531n231R207N47k514j2697K120O631M476L963o717r257
18634B3044j522K013N56J1387Q437N445j1010j6895L935l305o40j87O361L431
18620C1050o18j1534p543O277R608j0944m128J155J956K297J0570J2975M914p339
18606C8696l002m948J0272N132O084p319k28L814Q463j4602j4613j402J1026O66
18592C8039k619n198l767Q540M07M446O332j1003j3942q845R34R78K109L730J0991
$$ plain form
18690 27373 36909 36348 28810 33828 32911 33643 21009 3679 9494 24084 32018 27926 9550 5972
18676 5972 21587 16446 14157 17892 10481 19872 23037 21133 22461 27919 30859 23814 14692 3253
18662 3253 1265 -3054 -1354 4807 23759 27863 32424 31477 34270 35924 31776 34899 23892 16978
18648 16978 21118 35047 32516 27285 36492 37039 34525 21828 23948 30579 35055 39018 32301 23044
18634 23044 21522 23535 24091 35478 43915 49360 38350 21455 25390 22085 21445 21258 27619 31050
18620 31050 30432 18898 11355 17632 27240 16296 12168 13323 15279 17576 28146 41121 46035 38696
18606 38696 35694 30746 41018 46150 52234 44915 44687 48501 56964 42362 27749 26347 37373 38039
18592 38039 35420 30222 26455 34995 35402 39848 46180 35177 21235 12390 13324 14302 16411 20141 31132
18577C1132n005p99l165M837O943P402k441j0458j2908r473k361j1031J7257R682
18563A9612K645J4000J8838n017m275K665j372o652n860r53J1151O0l167j400
18549D0275M036J6l619k669J021L990j4121n3n100O891j819m287K429k899O794
18534C0885J930n252j7499r757R240M072M503L083p190r233m23J4645J2659J7022
18520D8685K143j396q231k14J6551J245q264K47Ll529k350M742R589q183j4437
18505C6601M557J6625L117r032l300M259N534m972o561Q059P244M920m836j0068
18491E2147K145Q790j009j6542r270O229p19j1389K029J684q720k935l844M243
18477B2839j514M228j266r783J82J3748L320L392k106j4605J703M327m497J3463
$$ plain form
18577 31132 26127 25328 22163 27000 33943 41345 38904 28446 15538 6065 3704 -7327 9930 19612
18563 19612 22257 36257 55095 50078 45803 48468 47096 40444 34584 33631 44782 44842 41675 40275
18549 40275 44311 44327 40708 38039 39060 43050 28929 28876 23776 30667 28848 24561 26990 24091 30885
18534 30885 32815 27563 10064 307 9547 13619 18122 21205 14015 4782 4359 19004 31663 48685
18520 48685 50828 49432 41201 40987 57538 58783 50519 50766 50769 47240 44890 49632 59221 51038 36601
18505 36601 41158 57783 60900 51868 48568 52827 58361 53389 46828 54887 62131 67051 62215 52147
18491 52147 54292 63082 62073 45531 36261 42490 41771 30382 32411 34095 25375 22440 18596 22839
18477 22839 21325 25553 24287 14504 14686 28434 31754 35146 33040 18435 20138 24465 19968 33431
18463C3431J085K071j0964L038J5614N356O825l673O766k023o529J0587j6169
18450D5415Q660J5610j1538M129L062O275j2045n197k3112O91J1234P387m46j6054
18436C4071N310J0024j3641k16L765N574j5472M012R057K069p833J337n869j359
18422C0829J0741q7j2713j795l204J4396J5014p900M827J214o260Q564R55o635
18408D7946N019O726P414L64k1494N495J2686K176K979m109n893r280l04O07r289
18393D1043k102m8J4020J2139q312o740L09k093J0478Q233j429j9674j8633K073
18379B9264J0460jj244J633l183J0764J5667M256L91m090N007r003j2510J1773
18365E9184O605j4389k869R284J0335J2593k395K483J4294L409j2733k3605P389
$$ plain form
18463 33431 34516 36587 25623 28661 44275 49631 56456 52783 59549 57526 50997 61584 45415
18450 45415 54075 69685 58147 62276 65338 71613 59568 54371 31259 31950 43184 50571 50125 34071
18436 34071 39381 49405 35764 35548 39313 44887 29415 33427 42484 44553 36720 38057 32188 30829
18422 30829 41570 41483 28770 26975 23771 38167 53181 45281 50108 51322 45062 53626 54581 47946
18408 47946 52965 59691 67105 67469 45975 51470 64156 66332 69311 65202 59309 50029 49725 50332 41043
18393 41043 38941 38893 52913 65052 56740 50000 50309 48216 58694 66927 65498 45824 27191 29264
18379 29264 39724 39723 38479 40112 36929 47693 63360 67616 68007 63917 68924 59921 47411 59184
18365 59184 65789 51400 48531 57815 68150 80743 78348 80831 95125 98534 85801 62196 69585
18352F9585j4647M304n01J2322J9417m159k3309k674n037p549o994J8148J0758
18339F9664J8314L5382L3736J1903j3228j4394k4849j3251j5553p173o271R256
18327H3536N29l455j2038j9067p602J4919J795K2074K2563K2726J5191n610l812
18314A31749j1621j6820l989m097k3139j4893L373j248J060m902j0429J2663P641
18301F5348N904q593p614k876R684J0702R911M089J3889L3436K2937J0789o349
18288A61257k0216j4800j9085j7936j197j556L966J9274K6258L3156L5121R916
18276B14158O49k0687k6537R072J9468N136r220k2507l0014k7307j2391r603o648
18263H3569M694K2276J9515k917K6019K5796K216j9369k2026l3680n162j2487
$$ plain form
18352 69585 54938 59242 58741 71063 90480 86321 63012 60338 55301 47752 40758 58906 69664
18339 69664 87978 123360 157096 168999 155771 141377 116528 103277 87724 80551 74280 83536
18327 83536 84065 80610 68572 49505 41903 56822 58617 80691 103254 125980 141171 135561 131749
18314 131749 120128 103308 99319 95222 72083 57190 60563 59315 60375 55473 45044 57707 65348
18301 65348 71252 62659 55045 52169 61853 72555 82466 86555 100444 133880 156817 167606 161257
18288 161257 141041 126241 107156 89220 88023 86467 90433 109707 135965 169121 204242 214158
18276 214158 214807 194120 167583 176655 196123 201259 192039 169532 139518 112211 99820 90217 83569
18263 83569 88263 110539 130054 127137 153156 178952 181168 161799 139773 106093 100931 88444
18251H8444p615k0027l183P965K455j969k255r778P230L45K76J1345J3507J4398
18237A01138o9J7730K0813J8811K6704K4109J1547k0831k7818k8790j2467j2746
18225A18131j8187r507p02n949J1011P796j7520R88K0663R981J7042K0879K0322
18212A74948K0604l459k2422l1549k5502k5417K963M335J76P438n213n223o574
18199H5105j861j0909J453L290n204O638P870j152r370j1095j125J3296Q181R896
18185I5013r123M684R209M548m587P668J0158J4800J7277L7537J9659J203j1157
18172A96889n375j395J6805N2010O2415L4071o080k9143m1215m9793j4658L804
18160B18335O668M4456N1762M8298N1372N6845K9397j1006m8767l3203L172K7037
$$ plain form
18251 88444 80829 60802 57619 65584 68039 66070 63815 54037 61267 61612 61888 73233 86740 101138
18237 101138 101069 118799 139612 158423 185127 209236 220783 199952 172134 143344 130877 118131
18225 118131 99944 90437 89735 83786 94797 102593 85073 86061 106724 116705 133747 154626 174948
18212 174948 195552 192093 169671 138122 112620 87203 90166 94501 94677 102115 96902 91679 85105
18199 85105 83244 72335 73788 77078 71874 78512 86382 85230 75860 64765 63640 76936 85117 95013
18185 95013 85890 90574 99783 104331 99744 107412 117570 132370 149647 187184 206843 208046 196889
18172 196889 191514 190119 206924 258934 321349 355420 349340 320197 278982 229189 214531 218335
18160 218335 225003 269459 321221 369519 420891 477736 507133 496127 447360 414157 417329 444366
18148D44366L4321J8189j6715n2082n7045l4059J3845K4879J4310J5887J1079
18137D16975M772k3040l7221k8592J683K811O527Q593J3017L1861M7667N6120
18125E01173O0534R5825J16458J01254J08551J18683J38115J93149L11150N34673
18115B279565Q63572J195130J782860K955983N008721Q362851Q778998j96138
18107C1031542o487476p943934o556712l514099j809119r74963n90540m18783
18099B735916l27312k77096k33481j84499j81889j80022j67518j52100q9136l1071
18089I11792J647j874l0709m1814p8301r8202q7925p5498n1456m5504j8288R706
18077C93574Q951k7828l6318k9661j1214O721K2877L8074L3477K3635N324j9831
$$ plain form
18148 444366 478687 496876 480161 428079 371034 336975 350820 375699 390009 405896 416975
18137 416975 421747 398707 361486 332894 334577 337388 343915 352508 365525 397386 445053 501173
18125 501173 561707 657532 773990 875244 983795 1102478 1240593 1433742 1744892 2279565
18115 2279565 3143137 4338267 6121127 9077110 14085831 22448682 31227680 31031542
18107 31031542 24544066 16600132 10043420 6529321 4720202 3745239 3154699 2735916
18099 2735916 2408604 2131508 1898027 1713528 1531639 1351617 1184099 1031999 942863 911792
18089 911792 913439 911565 880856 839042 760741 662539 574614 499116 447660 402156 383868 393574
18077 393574 402525 374697 338379 308718 297504 304225 327102 365176 398653 422288 427612 407781
18065D07781l2016k9288l6810j7803J8748K8361N0389N8700P9979Q0311N0466
18054F58818J5235l2436n2937p1683o8370l8765K403K8313K2679q103m7169m6009
18042C61976n3380k1130L611K7333M7956P1764K8598m3956n6730o7272m2125k0978
18030B35667j6331j5815j6514m33K1554J4645j4546j7007k9022j5883N602j5025
18018A36892M152L363n688J3073R37p786l607j4494j4746L052j1601l458J5795
18005A15884K1149J3557J8562J7564K9631M9059M8058L3277L0918j0125n4482
17994C13052o9474o0723k7053p601M44q636M320O141N143L570M500l317l560K491
17980A59297n855n939j9911k356J6769J1297K0444K6241K7210M0780N7429M2222
$$ plain form
18065 407781 375765 346477 309667 291864 310612 338973 389362 448062 528041 608352 658818
18054 658818 674053 641617 588680 516997 448627 409862 412265 440578 463257 455154 407985 361976
18042 361976 308596 287466 291077 318410 366366 438130 466728 422772 366042 298770 256645 235667
18030 235667 219336 203521 187007 186574 208128 222773 208227 191220 162198 146315 151917 136892
18018 136892 141044 144407 138719 151792 152729 144943 141336 126842 112096 115148 103547 100089 115884
18005 115884 137033 150590 169152 186716 216347 265406 313464 346741 377659 367534 313052
17994 313052 243578 182855 155802 148201 148645 140009 144329 150470 155613 159183 163683 160366 156806 159297
17980 159297 153442 147503 127592 125236 142005 153302 173746 199987 227197 267977 325406 367628
17968C67628K3243k3702m4934l7268n0803m0117k8170j2106r346r955l820n030
17956A25620j7055K258o085n636J3905R678n632l689R432J5260J3496l116J9508
17943A67944K1838L4489K5448K7915J8684m976l0585j8650m745l0109k4471j1991
17931A70791j1779q999Q830J2104q795j4297l255q332j8300L533J3159P341Q784
17918A50785J9254M086J3967O355J6682K4582L6331K6470J9439J5122J4489J6600
17906C64162K9339L677j9949l5696m1559m1952O485K0265L2343K4558J0226j1183
17894C40716r058o309J1724O301m271k386Q590J2224L0074J2217k1036k5570k1859
17881C31357l346J2007L4790L2400l526j9519j6846k837Q989K3331L3941K0705
$$ plain form
17968 367628 390871 367169 322235 284967 234164 194047 165877 153771 144425 134470 130650 125620
17956 125620 108565 110823 104738 99102 113007 122685 117053 113364 122796 138056 151552 148436 167944
17943 167944 189782 224271 249719 277634 296318 291342 260757 242107 237362 207253 182782 170791
17931 170791 159012 150013 158843 170947 162152 147855 144600 136268 117968 121501 134660 142001 150785
17918 150785 170039 174125 188092 194447 211129 235711 272042 298512 317951 333073 347562 364162
17906 364162 393501 397178 377229 341533 299974 258022 264507 284772 317115 341673 351899 340716
17894 340716 331658 325349 337073 343374 339103 336717 345307 357531 387605 399822 378786 353216 331357
17881 331357 328011 340018 374808 407208 403682 384163 367317 364480 373469 396800 430741 451446
17869D51446j1959l2304k8817k6180p66m009q549k376J5671M5521N4127M4207
17857D96012K0993o027P700O91j5187k4328k9505M346J9917N9196R3225M1243
17845F68276n950l9832o0027k9617J9863L992k0822l1345j8061j8150j4786K046
17833D55587k1276j8004m692L9481O8923J14699J19486K6845p3942r9846o0352
17822E46909K666N8774P6611L4129l3494q0137q6106n0469J1206O605k0435l4556
17810D31703l3838k3673j5262J2835q274k993J0281K3586L3855P0706Q5772M1881
17798F26579Q49n9218m5792l1385k954k527k8452l9197m0296k0311L645o565j8038
17785C36338k2557j3224j5214j5119k0457M476O210R882k803k592N673M115j213
$$ plain form
17869 451446 439487 407183 378366 352186 351420 347411 338862 336486 352157 397678 451805 496012
17857 496012 517005 510978 518678 519369 504182 479854 450349 454695 474612 533808 627033 668276
17845 668276 662326 622494 562467 532850 552713 556705 535883 504538 486477 468327 453541 455587
17833 455587 434311 416307 411615 451096 520019 634718 754204 781049 707107 607261 546909
17822 546909 549575 608349 684960 719089 685595 605458 519352 468883 480089 486694 466259 431703
17810 431703 397865 374192 358930 371765 363491 360498 370779 394365 428220 498926 584698 626579
17798 626579 627428 568210 522418 491033 488079 485552 457100 417903 377607 357296 360941 354376 336338
17785 336338 313781 300557 285343 270224 249767 254243 260453 270335 267532 264940 270613 274728 273515
17772B73515j3425j1783J905m690j7797L99M577Q576Q877K0192j825k5625p321
17759B35575K4529K4178J5245M022k768o218n813p096j5650q450P62K908K251
17746B63475K465J9718Q875O681K1463J9369J0697N866K0193j465k0609n652m720
17733C46356L391j1582j7859j1788Q00K416P362O196n13J2909J3954J1825L1424
17720C94891K6233L8898P92j9326O895j01q071j4402K289j9887o34L0628K1179
17707D59384J3535J875J2064K6996K2731K4576J7219J4903l679j445R258P576
17695F04993J8405J4916K2413K4655L6277M8327K4308K1294K7761N3589M6080
17684I43018M7124O1287O8119Q1252P8082J09988J67660K62933L35595L39590
$$ plain form
17772 273515 260090 248307 250212 245522 227725 228124 232701 241277 250154 270346 268521 242896 235575
17759 235575 260104 284282 299527 303549 300781 294563 288750 281654 266004 257554 258316 261224 263475
17746 263475 265940 285658 294533 301214 322677 342046 352743 358609 378802 377337 356728 351076 346356
17733 346356 349747 338165 320306 308518 309318 311734 319096 325292 324779 337688 351642 363467 394891
17720 394891 421124 460022 460814 441488 448383 448282 440211 425809 428098 408211 407577 438205 459384
17707 459384 472919 474794 486858 513854 536585 561161 578380 593283 589604 588159 597417 604993
17695 604993 623398 638314 660727 685382 721659 769986 794294 815588 843349 896938 943018
17684 943018 990142 1051429 1119548 1200800 1278882 1388870 1556530 1819463 2155058 2494648
17674B494648M13234O20286R69797J436186J499484L39353q79251j267513j128240
17665D497984o36157k33681M3865K12139K44455J91306J96098K05788L08967N04596
17655E535360P85465J233274J933920K908316M177530O516578J0405786J6677568
17647E0173797K3460525J8195200J754492n931031j4251954j7548828j4816408
17640D1035793j1524921p244152m184359k288553q93446L70876J731578L419541
17632B0422357N628458O882050L112345l466791o477937o717711m812351k822018
17624A1748402j553636p89143k77552J37460O16215J209484J533603P20412p34334
17615A2610911j277989j195132o14076j5702N50032J194260J845613K681204M066365
$$ plain form
17674 2494648 2907882 3528168 4497965 5934151 7433635 7772988 6893737 5626224 4497984
17665 4497984 3861827 3628146 3672011 3884150 4128605 4319911 4516009 4721797 5030764 5535360
17655 5535360 6320825 7554099 9488019 12396335 16573865 23090443 33496229 50173797
17647 50173797 73634322 91829522 93584014 87652983 73401029 55852201 41035793
17640 41035793 29510872 22266720 18082361 15793808 14900362 15271238 17002816 20422357
17632 20422357 26050815 32932865 36045210 32578419 26100482 19382771 14570420 11748402
17624 11748402 10194766 9405623 9128071 9265531 9881746 11091230 12624833 13345245 12610911
17615 12610911 11332922 10137790 9523714 9508012 10058044 11252304 13097917 15779121 19845486
17606A9845486O204463Q903379R223621L151807l369270n420727m124855k72058
17598C4141846M406462R957034J7523556K5741866K2815269R955185P886386Q535643
17590A40963247J3092249J4848572R553102p448902k9866080l5296487l0918380
17583G4927321j9922352r951411l709071O96042L455746J196771m682213p486999
17575C4523834p633486n748288l641326k198248j252346o48139k34711L72125
17567A3539415J256084K493270L366453J541240j719612l018325l021868j861177
17559A2575480o83009K38422R56346J870376L385110N630416Q352494Q529055
17551D0854690K093774m789847p428846o993079m342565j961665j66284J420481
$$ plain form
17606 19845486 26049949 34953328 44176949 47328756 43959486 38538759 34413904 34141846
17598 34141846 38548308 48505342 66028898 91770764 114586033 124541218 132427604 140963247
17590 140963247 154055496 168904068 178457170 171008268 141142188 105845701 74927321
17583 74927321 55004969 45053558 41344487 42040529 45496275 46693046 42010833 34523834
17575 34523834 26890348 21142060 17500734 15302486 14050140 13402001 13167290 13539415
17567 13539415 14795499 17288769 20655222 22196462 20476850 17458525 14436657 12575480
17559 12575480 11892471 12130893 13087239 14957615 18342725 23973141 32325635 40854690
17551 40854690 42948464 38158617 30729771 23736692 19394127 17432462 17266178 18686659
17543A8686659L112373N289940Q541161J3544067K1512474L0031910L0046436
17536A30765020K1596734J796405k4423509l3514777l1042885k1584699j2421415
17529C1170874p317345m830633l448832k565560j850547j295367r10727p00912
17521H250951m94874k93352j03728Q3946K95153P78990J632921K874298L415249
17512A6439554J023282k137323l302214l234473k110597j231395q00953o56140
17504C989741n77149m95160l91708k90016k19674j64154j16399j06047q3801p9481
17494A466152q2179q0871p5596m5684l2731J3604O0089P9611N5975k5621n8934
17483A273815p0069o1798j2977K3979J1337l8487r3520n8298l2170l0150k8753
$$ plain form
17543 18686659 21799032 27088972 35630133 49174200 70686674 100718584 130765020
17536 130765020 152361754 154158159 129734650 96219873 65176988 43592289 31170874
17529 31170874 23853529 19022896 15574064 13008504 11157957 9862590 8951863 8250951
17521 8250951 7756077 7462725 7358997 7442943 7738096 8517086 10150007 13024305 16439554
17512 16439554 17462836 15325513 12023299 8788826 6678229 5446834 4645881 3989741
17504 3989741 3412592 2917432 2525724 2235708 2016034 1851880 1735481 1629434 1545633 1466152
17494 1466152 1383973 1303102 1227506 1181822 1149091 1162695 1222784 1302395 1358370 1332749 1273815
17483 1273815 1203746 1141948 1128971 1152950 1164287 1125800 1032280 973982 941812 911662 882909
17472H82909j0710k0763k3584j5170n846K055J327k2401n1090m8782j3665j2217
17460F62063M441K0226J6168Q231K3568L8947Q063j2530q330r056k772K737o612
17447G45144K7519M1092O5604P6711Q5473M8409P807J0000N250k5780l2595l4765
17435A019869J492M8636J00431J43995J12419M6776J1350j7416N212M8370O9829
17424A590963L2793J5287M7278R7884J85272L13029L82312L23766K28886J87278
17414C404748K52701M67416P38485J120825J786915K848307L713944K020242j333532
17405A5020051k777482k957485j977460r96687l89717l9985J64097L09198M27824
17396F782354O03671Q72109J298404J865242K537098L572146N067335P129410
$$ plain form
17472 882909 872199 851436 827852 812682 806836 808891 810218 787817 736727 687945 674280 662063
17460 662063 666504 686730 702898 711129 734697 773644 781707 769177 760847 751791 749019 751756 745144
17447 745144 772663 813755 879359 956070 1041543 1089952 1097759 1107759 1113009 1087229 1054634 1019869
17435 1019869 1021361 1069997 1170428 1314423 1426842 1473618 1484968 1467552 1472764 1521134 1590963
17424 1590963 1623756 1639043 1686321 1784205 1969477 2282506 2664818 2988584 3217470 3404748
17414 3404748 3657449 4124865 4863350 5984175 7771090 10619397 14333341 16353583 15020051
17405 15020051 12242569 9285084 7307624 6310937 5921220 5881235 6045332 6354530 6782354
17396 6782354 7386025 8258134 9556538 11421780 13958878 17531024 22598359 29727769
17388B9727769J0820519J7247932K7602307L7170669K8785417O208209j1898137
17381A45664685k6895995k6797799k3092396j7751624j1971339p874605m474409
17374B6806518k040647l52230J200116L188520N768435Q277718O455467j093370
17366D8210527n842847o561951m034159l5651L630206P774238J3833423K3309680
17358H0283466L4545733L3291510J2293067q488314k6968986l2773112k6713707
17351F5469657j8561502j0639825n800200k980358q84444R37682L051580O188001
17343C6780591J0594837J4815379J1905692q82062j1473018j4638885j2265914
17336C4836620p364736l562690j041642Q90224L082273O036773J0055810J5137567
$$ plain form
17388 29727769 40548288 57796220 85398527 122569196 151354613 157562822 145664685
17381 145664685 118768690 91970891 68878495 51126871 39155532 31280927 26806518
17374 26806518 24765871 24413641 25613757 28802277 34570712 42848430 49303897 48210527
17366 48210527 42367680 35805729 31771570 31735919 35366125 43140363 56973786 80283466
17358 80283466 114829199 148120709 160413776 151925462 124956476 92183364 65469657
17351 65469657 46908155 36268330 30468130 27487772 26603328 27541010 30592590 36780591
17343 36780591 47375428 62190807 74096499 73214437 61741419 47102534 34836620
17336 34836620 27471884 23909194 22867552 23757776 26840049 32876822 42932632 58070199
17328E8070199J6335447J3125836J2243521r45698j6973264k0285508j8761161
17321D2809372j1827648o187561k837746m59739J669700M115211O558236N285323
17313C9125148j220155n680878o772695n239838k685917q63789N36702J885821
17305A9084399L576398O254684R961744J4308967J5877073J1938218J0593396
17298I1594879M806943j2430446j9598288j9986782j4880643q593042n015934
17291A5896687l147225k130330j575650j204166r74971q12191o73204n37639l80816
17282D460495k39353j04695k9080J26098L46055P19406J206178J143604j13768
17273G514940j136639j423982j192273p23610m25389k60991j77661j30290j49601
$$ plain form
17328 58070199 74405646 87531482 99775003 98829305 81856041 61570533 42809372
17321 42809372 30981724 24794163 21956417 21496678 23166378 27281589 33839825 39125148
17313 39125148 37904993 32224115 25451420 20211582 17525665 16661876 17198578 19084399
17305 19084399 22660797 28915481 38877225 53186192 69063265 81001483 91594879
17298 91594879 96401822 83971376 64373088 44386306 29505663 20912621 15896687
17291 15896687 12749462 10619132 9043482 7839316 6864345 6052154 5378950 4841311 4460495
17282 4460495 4221142 4116447 4087367 4213465 4559520 5278926 6485104 7628708 7514940
17273 7514940 6378301 4954319 3762046 3038436 2613047 2352056 2174395 2044105 1894504
17264A894504k12632k19616j67064j21915j04873o9051o6981p5345p5812o1894
17254G19321l7892m7540k7204r108k1999l712j1922m602m515j0636j5816l3700
17242D90675j7572j0219j5699k9275k2331j3410k2851R063L0324J6317O604j6551
17230D05075j2541r393l0046k4558j0909p773l179r25L028K480q260j7276l852
17217B81871j256j4243j8480j1084o853o128j5320k184n949p46J0318Q100J3299
17204B31345O919J8603J0663j3508r636j9664r716n723k1338j6738j4043j5309
17192A41855n011P5Q942K062L547j1458j8806k602Q404o04j1928J5907J6813o541
17178A40655P541J2495r344j277N447m778J565J3708j5121j1970k6000k9853k334
$$ plain form
17264 1894504 1681872 1462256 1295192 1173277 1068404 999353 932372 857027 781215 719321
17254 719321 681429 633889 606685 597577 575578 571866 559944 555342 550827 540191 524375 490675
17242 490675 473103 462884 447185 417910 395579 382169 359318 368381 398705 415022 421626 405075
17230 405075 392534 383141 353095 328537 317628 309855 306676 305751 308779 311259 302999 285723 281871
17217 281871 280615 266372 247892 236808 229955 223827 208507 206323 200374 199628 209946 218046 231345
17204 231345 238264 256867 267530 254022 244386 224722 215006 209283 187945 171207 157164 141855
17192 141855 136844 136919 145861 147923 151470 140012 121206 118604 127008 126404 114476 130383 147196 140655
17178 140655 148196 160691 151347 150070 155517 150739 152304 166012 150891 138921 112921 83068 80734
17165H0734J2861M456J0749O209O516K972k1749j1237K374o552o732m630J751
17152G7722j4237n679J4438N356J1166L1467L4076J9932l166p058k863K6808N0635
17139B38597K4697k7236j7731j4235J216L7220N2724O4991N0301k2747p3186o7322
17127B47289l4561j1195Q682J9472L6402L6918K7503K3394n992l8374k2070k0971
17115B66497j1449K1974O2735L0936k1542o2626p5550m8845j7550K0193L3377
17104A98150M0721L3148J3432l5282o1206n0921k0614k1727k582J1717L406k4025
17092H4217R351K6549L3684M0301M0056N0846K2295R016J3350K850M70K2529O1477
17079D16991N1891j8376o8767n3295k5998J6138L9264L0369J1147k67m479J4930
$$ plain form
17165 80734 93595 98051 108800 115009 121525 124497 102748 91511 93885 87333 80601 75971 77722
17152 77722 63485 57806 72244 77600 88766 120233 154309 174241 171075 164017 161154 187962 238597
17139 238597 263294 236058 218327 204092 205308 242528 295252 360243 410544 387797 314611 247289
17127 247289 212728 201533 210215 229687 266089 303007 330510 353904 347912 309538 287468 266497
17115 266497 255048 277022 339757 370693 349151 286525 210975 162130 144580 164773 198150
17104 198150 238871 272019 285451 250169 188963 138042 117428 95701 93119 104836 108242 84217
17092 84217 93568 120117 153801 194102 234158 285004 307299 316315 329665 332515 332985 355514 416991
17079 416991 468882 450506 381739 328444 302446 318584 357848 388217 399364 399097 394618 409548
17067D09548J8369k063k180K1821K9058M716M123P363k8932p2048o0992l2724
17055B96059P433K6869N0266J3198J5343j3428n6403p0230n8132l6111k6928j5293
17043A32643K065m026j1275k3466n785M51K519K3223R738J7030K5001K8886j5212
17030A81792j9421k3925j0433j2266n918r15K3678L1490L7572M0856L2176j8493
17018B56193m0815l6108q778r537j470K1802L2426K0717O531j9574m5091m3537
17006A32759k2543J828J8599L0055L0834L0241o248l7121l3852l2792j1685J332
16994A01407k324r90l860L874R629k456j7561k9551j8510j0793j7700O770K3371
16981D1306J1139j9693n12J0815j2135r639m849n192K786R39k884M577R338n770
$$ plain form
17067 409548 427917 425854 423674 445495 474553 479269 483392 490755 461823 389775 328783 296059
17055 296059 303492 330361 380627 393825 409168 395740 339337 269107 210975 174864 147936 132643
17043 132643 134708 130682 119407 95941 90156 90607 93126 116349 126087 143117 168118 197004 181792
17030 181792 162371 138446 128013 115747 109829 108914 132592 164082 201654 242510 274686 256193
17018 256193 215378 179270 170492 160955 159485 181287 213713 234430 240961 221387 176296 132759
17006 132759 110216 112044 130643 160698 191532 221773 215525 178404 144552 111760 100075 101407
16994 101407 99083 98093 94233 98107 107736 105280 87719 58168 39658 28865 11165 17935 41306
16981 41306 52445 32752 32240 43055 30920 21281 16432 11240 14026 14965 12081 16658 25996 20226
16967B0226K171j906P234L739m886n577j2251K832M46j0569Q230L540p026M449
16953A0652O907p101j425J033K759l703J444p473m603J6278O327Q84k605m243
16939A5131R749L862M934J0200r294j2166r035j3784M335K827j1987n257M769
16926e716Q767Q716J3764L538j2872m634L182J0335J1896K861J649o792L183j5784
16912B2093k0769n894Q94Q223L658Q892o93r409r976p725J0284Q489J6733L1781
16898E6581J8008J3427N185n093r579N788p369J3455L4258M2779L8764N5542O0824
16885C22570J11n6003o7515m9023j951J4045J5684N7311M4072J108j3043k4594
16873B42772j7151P421n446N146J1052J1630L8584K3187j2832l0806k7677j3117
$$ plain form
16967 20226 22397 20491 27725 31464 26578 21001 8750 11582 12028 1459 9689 13229 6203 10652
16953 10652 17559 10458 9033 10066 12825 9122 10566 3093 -1510 14768 21095 21979 19374 15131
16939 15131 24880 28742 33676 43876 34582 22416 13381 -403 3932 6759 -5228 -10485 -5716
16926 -5716 3051 11767 25531 29069 16197 11563 14745 25080 36976 39837 41486 34694 37877 22093
16912 22093 1324 -4570 -3676 4547 8205 17097 16404 6995 -2981 -10706 -422 8067 24800 56581
16898 56581 74589 88016 93201 88108 78529 84317 76948 90403 124661 167440 206204 261746 322570
16885 322570 322681 266678 199163 150140 148189 162234 177918 235229 279301 280409 267366 242772
16873 242772 225621 233042 227596 232742 243794 255424 294008 317195 304363 273557 245880 232763
16861B32763J0662N1295N2723p158l6897k8438j4502O011K8089L8574L8537N306
16849C76965m2367m0401l4691j9553l1412l2373k178N825K6725O5777P5427L0169
16837C77913m332j6567l3250m8645m3700k9492j2808N206M4006Q1694P5351J0018
16825D05394l4252o1989n2656k1820O208j4029l8617j9979j2687R41Q71o726N039
16812A55698J2953L1103O3249P5642N8327J7728m3693o1400m7912q214L1938O1053
16800C46472O1063r082o9477p1250n3052k4172R362l267k1025m0252j9587J3202
16788A18935m601k0574j4799j3220J8459K3203M9774N8534K7026k1666m9600m6414
16776A25057k6885q331J8066K4052j2918j5353l8150j8609J702p774q505m292
$$ plain form
16861 232763 243425 294720 347443 340285 303388 274950 260448 266459 294548 333122 371659 376965
16849 376965 334598 294197 259506 239953 208541 176168 173990 179815 206540 272317 347744 377913
16837 377913 373581 357014 323764 275119 231419 201927 189119 194325 238331 320025 395376 405394
16825 405394 371142 309153 256497 234677 240885 226856 188239 168260 155573 156514 157385 150659 155698
16812 155698 168651 199754 263003 338645 396972 414700 371007 309607 261695 253481 285419 346472
16800 346472 407535 398453 328976 257726 204674 180502 189864 186597 165572 125320 105733 118935
16788 118935 114334 93760 78961 65741 84200 107403 157177 215711 242737 221071 171471 125057
16776 125057 98172 89841 107907 131959 119041 103688 65538 46929 48631 40857 32352 28060
16764B8060j7608r564q120J985n632J0821O757J2642j7052k0378p165K6P79k995
16750b7444j244J6174L415j759J4119o01N278M75j036m343l058P458M564O383
16736A8381k2479j6300J2273K971n070n532q441q784O372O416J0111P594J0254
16723G766n761j3093r338j2232p163Q506K3637M406j2995n91N829n86j881J0148
16709c348k948r727m36K011K746j7816o589j624J7840J2810m984r406j2264j281
16695c5016q678J1273N100P093K266O018j0078J032L25J2681K908l895O89m725
16681a3007r950k820J4469R136j108j0302K232L041k583p896j192M234J0614k886
16667h018j705J0551p682n109p554Q779J5190m403j262o591R56N673j1555L665
$$ plain form
16764 28060 10452 888 -7232 -5247 -10879 -58 6699 19341 2289 -18089 -25254 -25228 -24449 -27444
16750 -27444 -28688 -12514 -9099 -10858 3261 2660 7938 8413 7377 3034 -24 7434 11998 18381
16736 18381 -4098 -20398 -8125 -5154 -10224 -15756 -24197 -32981 -26609 -20193 -10082 -2488 7766
16723 7766 2005 -11088 -20426 -32658 -39821 -31315 -7678 -3272 -16267 -16858 -11029 -11615 -13496 -3348
16709 -3348 -6296 -16023 -16459 -14448 -11702 -29518 -36107 -37731 -19891 -7081 -12065 -21471 -33735 -35016
16695 -35016 -43694 -32421 -27321 -20228 -17962 -11944 -22022 -20990 -20665 -7984 -5076 -8971 -8282 -13007
16681 -13007 -22957 -25777 -11308 -2172 -3280 -13582 -11350 -8309 -10892 -18788 -19980 -15746 -5132 -8018
16667 -8018 -9723 828 -6854 -11963 -19517 -10738 4452 49 -1213 -7804 -6848 -1175 -12730 -9065
16653i065J4291m838j6035o708Q83N421m609L668n5L765Q393L765k610o849L562
16638g021J814n962O517O651o911m694j4044N940J525N971O053N007L172j1323
16624g305r967m969l103N125M142O795J0773J1666J5469j2334j2623L881m057
16611C493l671j0311j2585r741N506P31N884J0353O570p160p413n481l556K3658
16597c723Jj4135Q835m851j516l467M488m735l509N005m632o199K799K0851J0646
16582E858q714j2443j580J0078q517p084N81r00J761K549j367N788L190J16p10
16567a1394J486k059k236n085O067R266J070K030o502r860q066J0122j0924M870
16553b1215K862P275K141K353J687j418l971M776J0787m324j1922O858N105J687
$$ plain form
16653 -9065 5226 388 -15647 -22355 -21472 -16051 -20660 -16992 -17047 -13282 -4889 -1124 -3734 -10583 -7021
16638 -7021 -5207 -11169 -4652 1999 -4912 -9606 -23650 -17710 -16185 -10214 -4161 846 4018 -7305
16624 -7305 -17272 -22241 -25344 -20219 -16077 -9282 1491 13157 28626 16292 3669 7550 3493
16611 3493 -178 -10489 -23074 -32815 -27309 -26578 -20694 -10341 -3771 -10931 -18344 -23825 -27381 -3723
16597 -3723 -3722 -17857 -9022 -13873 -15389 -18856 -14368 -19103 -22612 -17607 -22239 -28438 -25639 -4788 5858
16582 5858 -2856 -15299 -16879 -6801 -15318 -22402 -21821 -22721 -20960 -18411 -19778 -13990 -10800 -10684 -11394
16567 -11394 -9908 -11967 -14203 -19288 -13221 -3955 -2885 -855 -7357 -17217 -25283 -15161 -26085 -21215
16553 -21215 -18353 -11078 -8937 -6584 -4897 -6315 -10286 -5510 5277 953 -10969 -4111 994 2681
16539B681j4486L326o594L705J635j460o700M691j586m512J5753J3215l662j1338
16525e332Q065k273p225J5069J958p828r553p706o755q117l062j133K800L937
16511b7155N026n728J6009J4636O054r504l600p529M50J1869J0048P191j5388
16498B379j0227N969r275o618J930N236L462m561q095K728P708P439P644K190
16484G909m165M356o099j7417J533J2056N22o014l034j51l723L573k220M611L120
16469e143j2110N564J0168p163L69n936J18L468Q963P443r099p112P075J2952
16455I557k43o588p632N690M547R46l635m981O812j1469q406P005N502M157M061
16440E323Q111n816o735K937o045m602M500m381n019J0776L616J2137q822p561
$$ plain form
16539 2681 -11805 -8479 -15073 -11368 -9733 -11193 -17893 -13202 -14788 -19300 -3547 9668 6006 -5332
16525 -5332 2733 460 -6765 8304 10262 2434 -7119 -14825 -21580 -29697 -32759 -33892 -31092 -27155
16511 -27155 -22129 -27857 -11848 2788 8842 -662 -4262 -11791 -11341 528 10576 17767 2379
16498 2379 -7848 -1879 -11154 -17772 -15842 -10606 -7144 -11705 -19800 -17072 -9364 -1925 5719 7909
16484 7909 3744 8100 2001 -15416 -13883 -1827 -1305 -7319 -10353 -10504 -14227 -10654 -12874 -8263 -5143
16469 -5143 -17253 -11689 -1521 -8684 -8315 -14251 -14133 -10665 -1702 5741 -3358 -10470 -3395 9557
16455 9557 9314 2726 -4906 784 5331 6277 2642 -2339 4473 -6996 -15402 -8397 -2895 1262 5323
16440 5323 13434 7618 883 3820 -2225 -6827 -2327 -6708 -11727 -951 2665 14802 5980 -1581
16426a581j468L937p604q559K377J778O279j961J725O576p739R14J1711k081j954
16411B350r492j5467N418N475j378n031K862L79J266j107K004p396Q78L919m382
16396a9702l112K878L181K506j0727M712j801M136Q84j298J1001K5827r093p369
16382B023m46o767r784L175L348m492n691K018K708m941j4538P513K0166m632
16368a0340m007N789l570K481Q120l043q733j715Q372N074j356K128o25J24J4729
16353A3428K132j4905j1196l925K1718J0660l578k463j2816r716R240M121J919
16340D619k268P107J2450j966o872j2583j2469J623R449P81j2817J7502Q285k617
16326A0224j3105j2507j36o59m640P984J483p68n552o980J1685J1254J125j368
$$ plain form
16426 -1581 -3049 888 -6716 -15275 -12898 -11120 -4841 -6802 -5077 1499 -6240 -5326 6385 4304 2350
16411 2350 -7142 -22609 -17191 -11716 -13094 -18125 -15263 -14884 -13618 -14725 -12721 -20117 -19239 -15320 -19702
16396 -19702 -22814 -19936 -16755 -14249 -24976 -20264 -22065 -17929 -17045 -18343 -7342 18485 9392 2023
16382 2023 1577 -5190 -14974 -11799 -8451 -12943 -18634 -16616 -13908 -18849 -33387 -25874 -5708 -10340
16368 -10340 -14347 -8558 -12128 -9647 -1527 -4570 -13303 -15018 -6646 -1572 -2928 -800 -1425 -1301 13428
16353 13428 15560 655 -10541 -14466 7252 17912 14334 11871 -945 -10661 -1421 2700 4619
16340 4619 2351 9458 21908 19942 13070 487 -11982 -10359 -910 -129 -12946 4556 12841 10224
16326 10224 -2881 -15388 -15524 -16183 -20823 -12839 -11356 -12124 -17676 -24656 -12971 -1717 -592 -1960
16312a960R430J816p997l740M984n40p797j9795m252L117J3665L368o552N280
16298a0973R626J6250O965L879l535q185k691k669J207o973j1896O771l83J3494
16284A0887J708q986O303N700j9904j0108J3310J0641p89n409K839j409o532M393
16270B644J1355L392J475j4397j75J351m870j4578r748p337J0198J7921L40j805
16256d234j2387K743M438M606J648j96q800o666k538J1495M842n198M614L9K407
16241c187K3290r945j2334j912k93N076q139o806R86J3478Q745j3037o739P358
16227c459J538J108J7k351j464k118j0346J3793J0956j4472j7683j226K2681J1283
16213H257p209q557N178P589q63L067J1349J923N398r331j9541J017L435K437
$$ plain form
16312 -1960 7470 9286 1289 -2451 2533 1993 -5804 -25599 -29851 -26734 -13069 -9701 -16253 -10973
16298 -10973 -1347 14903 21868 25747 22212 14027 11336 8667 9874 2901 -8995 -2224 -2607 10887
16284 10887 12595 3609 9912 15612 -4292 -14400 -1090 9551 8762 3353 6192 4783 -1749 2644
16270 2644 13999 17391 18866 4469 4294 5645 775 -13803 -23551 -30888 -20690 -2769 -2429 -4234
16256 -4234 -16621 -13878 -9440 -4834 -3186 -3382 -12182 -18848 -21386 -9891 -5049 -10247 -5633 -5594 -3187
16241 -3187 20103 10158 -2176 -4088 -4381 695 -7444 -14250 -13264 214 8959 -4078 -10817 -3459
16227 -3459 -1921 -813 -796 -3147 -4611 -6729 -17075 -3282 7674 -6798 -24481 -25707 -3026 8257
16213 8257 1048 -7509 -2331 5258 4395 7462 18811 20734 26132 16801 -2740 -1723 1712 4149
16199D149O42p106p181n197R459j454j412O916o720n756N47L979O337p190o905
16184a6892q82J0956J3786N309L906n651n081k246N438K809J1015r836r594O919
16170I956n062q487J136J239j1899k215J972L18j209M371J3569M117o50n894m553
16155c291j158l832p19N623L830j193j3675J1128L007j0864M952j329K765k496
16141g252R129J9430J5884r204k7247j0715j2620J0706J1954J4860Q144L473k834
16128B3708j5462j0611L767j438l675N681j727m546n145L808l246m285N360O65
16114g146m747L27P618m300q872k323j1037j356L338j786J490m192J672J5037
16100a6277J4166l990L916M04j0994R471Q079J1822M377j3902R569P235q137j0419
$$ plain form
16199 4149 4791 -2315 -9496 -14693 -5234 -6688 -8100 -1184 -7904 -13660 -13113 -9134 -2797 -9987 -16892
16184 -16892 -17774 -6818 6968 12277 16183 10532 5451 3205 8643 11452 22467 12631 3037 9956
16170 9956 4894 -3593 -2457 -1218 -13117 -15332 -13360 -13042 -14251 -9880 3689 7806 7156 1262 -3291
16155 -3291 -4449 -8281 -9000 -3377 453 -740 -14415 -3287 -280 -11144 -6192 -7521 -4756 -7252
16141 -7252 1877 21307 37191 27987 740 -9975 -22595 -11889 65 14925 23069 26542 23708
16128 23708 8246 -2365 1402 -36 -3711 1970 243 -4303 -9448 -5640 -8886 -13171 -7811 -7146
16114 -7146 -11893 -11566 -3948 -8248 -17120 -19443 -30480 -31836 -28498 -30284 -28794 -32986 -31314 -16277
16100 -16277 -2111 -6101 -2185 -1781 -12775 -3304 4775 16597 20974 7072 16641 23876 15739 5320
16086E320p882j4073J2746M546n616o46J796j1983k091N978j8735r503J5380K896
16072b1867k21J7639l104n111l072Q996J018P532R254M377M692j4119j1575o828
16058a2389P504J4531j400p270M811j546n435n044P904q54K32Q678L173j775p242
16043C878m546l383J840r977L374R5K772K381J88J0283N57n527j887q759K111
16028f600r73p401Q364n781J0201N914M818K43k772o806j7003l213O478J245R567
16013c719j947p362r55J3133Q515j2147j4706J86M898J2397k524p008j357R760
15999b836J0963P265N464j6019o834J0298k71l067l870M748j2254M402l690n227
15985a0928J721O797J3342P529j7007j3061l8l783P584o317O346R799j962K767
$$ plain form
16086 5320 -2562 -16635 -3889 657 -4959 -5605 -3809 -15792 -17883 -11905 -30640 -40143 -24763 -21867
16072 -21867 -22088 -4449 -7553 -12664 -15736 -6740 -5722 1810 11064 15441 20133 6014 -5561 -12389
16058 -12389 -4885 9646 8246 976 5787 4241 -1194 -6238 1666 812 1044 9722 12895 11120 3878
16043 3878 -668 -4051 -2211 -12188 -8814 -8719 -5947 -3566 -3378 6905 7462 1935 48 -8711 -6600
16028 -6600 -7573 -14974 -6610 -12391 -2190 3724 8542 8785 6013 -793 -17796 -21009 -14531 -13286 -3719
16013 -3719 -5666 -13028 -13983 -850 7665 -4482 -19188 -19002 -14104 -1707 -4231 -11239 -12596 -2836
15999 -2836 8127 15392 20856 4837 -1997 8301 8030 4963 1093 5841 -6413 -2011 -5701 -10928
15985 -10928 -9207 -2410 10932 18461 1454 -11607 -11645 -15428 -7844 -14161 -7815 1984 22 2789
15971B789P504r473K0590Q508k0390j5081k636K959L277J1533l623k561J014j639
15957B771J7963l21k132j727o962K556M545j1727n745J0204o26J778Q409J1176
15943C0162j1640j0767r31k500q291k937P313J5360n473m252M852j0405j3568
15930a3077J2129Q480n792k91Q751L623J1614n621n84j4401j9995Q817Q544n780
15916c583r412J3713J0644r265j7509J0673J0499P781o589p211n857L577m547
15903g086Q713P509o634J034J1199k786j2740l100N186Q842O134J0007r151k0213
15889c086K932R636J645J170p110j104K801m3K0601r376j7234J899R581J266q056
15874E522j1820O77M973m801p588R767P402M429J585j3210n888N103O93j1383
$$ plain form
15971 2789 10293 820 21410 29918 9528 -5553 -8189 -5230 -1953 9580 5957 3396 4410 2771
15957 2771 20734 20413 18281 16554 9592 12148 16693 4966 -779 9425 8799 10577 18986 30162
15943 30162 18522 7755 6824 4324 -3967 -6904 409 15769 10296 6044 10896 491 -13077
15930 -13077 -948 7532 1740 1449 10200 13823 25437 19816 19232 4831 -15164 -6347 2197 -3583
15916 -3583 -12995 718 11362 2097 -15412 -4739 5760 13541 6952 -259 -6116 -2539 -7086
15903 -7086 1627 9136 2502 3536 14735 11949 -791 -3891 1295 10137 16271 26278 17127 -3086
15889 -3086 -154 9482 11127 12297 5187 4083 6884 6841 27442 18066 832 2731 12312 13578 5522
15874 5522 -6298 -5621 -648 -5449 -13037 -3270 4132 8561 10146 -3064 -8952 -3849 -3156 -14539
15860a4539K484J0894k963j836J682l293M108K493o664J1053K119L121L05j1014
15846b050J102p655J0234P304n642M82N064J2437O89K582m298m468k650J1354
15832B4485o905j3930m438n402r124k210R353J3780P117j2947l426L502m098L069
15818a174J6253p432j1861m35J2091R6L40Q200J984J288j346j3262o986l120M489
15803h75J3055M679p60k894j110L461J614r010j654L31n643N543Q520k926j5538
15788c207n517P427o231j566l218J484K60J0071P042q391n379M084N339O074J535
15773I807q684m989N701L608o022j737Q920k156J1611j341j2660m301O770k186
15759B341j319N049k663J6605j322j4091N272M874m510p98N589o255M506j1367
$$ plain form
15860 -14539 -12055 -1161 -4124 -5960 -4278 -7571 -3463 -970 -7634 3419 5538 8659 8964 -2050
15846 -2050 -948 -8603 1631 8935 3293 3775 8839 21276 21965 24547 20249 15781 13131 24485
15832 24485 17580 3650 -788 -6190 -15314 -17524 -8171 5609 12726 -221 -3647 -145 -4243 -1174
15818 -1174 15079 7647 -4214 -4649 7442 7538 7878 16078 18062 19350 18004 4742 -2244 -5364 -875
15803 -875 12180 16859 16099 13205 12095 15556 17170 8160 6506 6837 1194 6737 15257 12331 -3207
15788 -3207 -8724 -1297 -7528 -9094 -12312 -10828 -10568 -497 6545 -1846 -7225 -3141 2198 8272 9807
15773 9807 1123 -3866 1835 5443 -579 -2316 6604 4448 16059 14718 2058 -2243 4527 2341
15759 2341 1022 6071 3408 20013 18691 4600 9872 14746 10236 9438 15027 8772 13278 1911
15745A911P949M529M87j0264q55P311J4119m81K673L868L574r833r013q701k148
15730E126L044M197m253N95r107k399K882l550o751Q086k516p733K108R980J1263
15715A0972J1770O553Q39r23r752k3990L373J1560J3625k680J697J5113j1854
15702B6303M021j5834j2564K893Q273l589j0406n91J5724N889k440q884L068M075
15688A5938P38J248l815q739K698M26J4199k367m629n277r714r556L868J4633
15674I651N351P718j2609k0767m371r821J02P719J5093l691J414q499J197J2202
15660F89P152L985o772j4736O305J0122M947M948O781l51K348m445l278j0023
15646G672k763m527j041k091P203M296K348j901K872p688J307n862q720Q875P764
$$ plain form
15745 1911 9860 14389 14876 4612 3757 11068 25187 24706 27379 31247 34821 24988 15975 7274 5126
15730 5126 8170 12367 8114 8709 -398 -2797 85 -3465 -10216 -2130 -4646 -12379 -10271 -291 10972
15715 10972 22742 29295 30134 29211 19459 -4531 -1158 10402 24027 21347 23044 38157 26303
15702 26303 30324 14490 1926 4819 13092 9503 -903 -1494 14230 20119 17679 8795 11863 15938
15688 15938 16676 17924 14109 5370 8068 8494 22693 20326 15697 10420 706 -8850 -4982 9651
15674 9651 15002 22720 10111 -10656 -15027 -24848 -24746 -17027 -1934 -5625 -4211 -12710 -11513 689
15660 689 7841 11826 5054 -9682 -3377 6745 11692 16640 23421 23070 25418 20973 17695 7672
15646 7672 4909 382 -659 -2750 4453 8749 11097 9196 12068 4380 5687 -175 -8895 -20 7744
15631G744J924o223o3J0893M652J0440m514j7607o098o813J125K941Q973k721
15617D653r593J3307O417p112o57K528J381n555K773j986n845r62J9248P954k868
15602B3683K269n804Q127Q51n844o972j0643l228P372k678l146K478l614j384
15588A467J3306L890R61n635j0744q116O574P41J3172o25j2422j0142k124Q168
15574a529J2123K381j2154k6j187J2709O560Q959j22K369q372j0407p283k701
15560A320Q778q681O0O125J8680K1209j4640o359p70K15j0485R336j346j4409
15546I033j4130M94M059j4078J5305N104q256J2207j661j1307r36k43Q526K1025
15532B5142k365n945p469J174l21j0479K736K922Q07P52L530P265r417r693k640
$$ plain form
15631 7744 9668 3445 3382 14275 18927 29367 24853 7246 1148 -5665 -4540 -1599 7374 4653
15617 4653 -4940 8367 14784 7672 7015 9543 10924 5369 8142 6156 311 -651 18597 26551 23683
15602 23683 25952 20148 28275 29126 23282 16310 5667 2439 9811 7133 3987 6465 2851 1467
15588 1467 14773 18663 19624 13989 3245 -4871 1703 2444 15616 14991 2569 -7573 -9697 -1529
15574 -1529 10594 12975 821 795 -392 12317 18877 27836 27714 30083 21711 11304 4021 1320
15560 1320 10098 1417 1477 7602 26282 47491 32851 26492 25722 25937 15452 24788 23442 9033
15546 9033 -5097 -4603 -544 -14622 683 5787 -2469 9738 8077 -3230 -4166 -4409 4117 25142
15532 25142 22777 16832 9363 10537 10216 -263 2473 5395 6202 6954 10484 17749 8332 -1361 -4001
15517d001M44o055P781J0932Q070N871l362k590j5389n581R725J4034J389P276
15503B8544O131K791K400p11O164r082k4147j577M527j794N57n624p697j0766
15489a0284k703K542J3471N670K953j0332J1124P152j7510k945J0468M003J3097
15476B6706P104N134r500N111n365k0416j975J411J1064J6191J0143q565j0019
15463B7024J195N353p681k510N052n739j2032O589J3069j474n206J2007J0991
15450D6638j6808j3873p254J2377N446k128p64O791k421J721j2895n573J4111
15437B5368n972P67j3073p885Q630J4735M541k482J476J898j0804o889R13O554
15423A7777M775j2893r996J3388J26m995R779K681J7996l371o833O639n817o019
$$ plain form
15517 -4001 -3557 -9612 -1831 9101 17171 23042 19680 17090 1701 -3880 5845 19879 21268 28544
15503 28544 34675 37466 39866 39155 45319 36237 12090 10513 15040 13246 13803 8179 482 -10284
15489 -10284 -12987 -10445 3026 8696 11649 1317 12441 19593 2083 -862 9606 13609 26706
15476 26706 33810 38944 29444 34555 29190 8774 6799 8210 19274 35465 45608 37043 27024
15463 27024 28219 33572 25891 23381 28433 22694 10662 17251 30320 28846 23640 35647 46638
15450 46638 29830 15957 8703 21080 26526 24398 23634 30425 28004 29725 16830 11257 25368
15437 25368 19396 20163 7090 -795 7835 22570 27111 24629 26105 28003 17199 10310 11223 17777
15423 17777 22552 9659 -337 13051 13177 8182 17961 20642 38638 35267 28434 35073 29256 23237
15409B3237j3684J254N20P155J4319N648Q346n894j1176p802M107J930q905j9338
15395b83o666J0073O670m69j0103q6L190p482M297N567p25K318R703K401L977
15380B2382l615p630M958O053O837O985r715k639m533L782o10r902N748P073k127
15365B3047k932M565J11Q284Q672J987L79J141q049j2184j1116o825O328M755
15351A8163J3799P067l418j2286M453m958j8008N26K0193J7432j988j2274l059
15338B5642l910k590j655P627l65N75L252o412o072j1088L049O957M421N590j3481
15323A1540j1536q273N512J8575Q729j510N045q760j2713M14L927O186j1925N052
15309A0263J0960r37J0105R076L947j6265k155n719N671P628L82r087j1696l655
$$ plain form
15409 23237 9553 10807 11327 18482 32801 38449 46795 40901 29725 21923 26030 27960 19055 -283
15395 -283 -6949 3124 9794 9325 -778 -864 2326 -5156 -859 4708 3983 6301 16004 18405 22382
15380 22382 18767 11137 16095 22148 28985 35970 26255 23616 19083 22865 22255 12353 18101 25174 23047
15365 23047 20115 24680 24791 33075 41747 43734 44113 45254 37205 25021 13905 7080 13408 18163
15351 18163 31962 39029 35611 23325 27778 22820 4812 5338 25531 42963 40975 28701 25642
15338 25642 21732 19142 17487 25114 24749 25324 28576 22164 16092 5004 8053 15010 19431 25021 11540
15323 11540 4 -8269 -2757 15818 24547 23037 28082 19322 6609 7023 10950 17136 5211 10263
15309 10263 21223 20286 30391 39467 43414 27149 24994 19275 24946 32574 32956 23869 12173 8518
15295H518R709J678K421L397q42N947l253j1657o210J889k639O561K1224m940
15281C1803j2895k347j900o297O801N68L892j59Q03N932N811L871m526j0422K451
15266B3386R552r860Q091p45M374J1688p659j1197k8974K510J0019J2702K002
15253B5889L446q098j1291j0275J0716J4574J2826o906j0270r695J0589J8241
15241C9746n110l568j1933j9108j5356N761L350Q228J4520J868p987k724K03r10
15227F980M528J577o659O438O763J2j759j567q069O246n07p602J3010P396R684
15212C6471J0963j4320p865m078p201o219J1986Q758L12k793j838q625r410l592
15198B549n603J0100N149N661J4961J8336J1592j8015j8362K861Q221m845k273
$$ plain form
15295 8518 18227 19905 22326 25723 24881 30828 27575 15918 9708 11597 8958 15519 36743 31803
15281 31803 18908 16561 14661 8364 15165 15733 19625 19466 20269 26201 32012 35883 31357 20935 23386
15266 23386 32938 23078 31169 30424 34798 46486 38827 27630 -1344 1166 11185 23887 25889
15253 25889 29335 21237 9946 -329 10387 24961 37787 30881 20611 10916 21505 39746
15241 39746 34636 31068 19135 27 -15329 -9568 -6218 2010 16530 18398 10411 7687 7890 6980
15227 6980 11508 13085 6426 12864 19627 19639 17880 16313 8244 14490 13983 6381 19391 26787 36471
15212 36471 47434 33114 25249 21171 13970 7751 19737 28495 28807 26014 24176 15551 6141 2549
15198 2549 -3054 7046 12195 17856 32817 51153 62745 44730 26368 29229 37450 32605 30332
15185C0332J2605J1533k789m55n812K818J378J645j2810j8670j6710p235M837
15172F67J8633Q385M206o74r427P082O154r722o3q81j119O37o542o452M564J902
15156A7350N323P683Q818N330l613K246o524m257q51m92L167j4995K258M832j4740
15141A1535n192K0339J0111j4093J3630J0541J157p542k4021J983J2075L988k328
15128C2183J238q984l285J5542K450P892J3027p881m59M859n143o041J782N290
15114E2470M7o789K85j0457j1904N604k50Q318M261j2228j2311k658M124J1230
15100B9742K499j3292p384N951J562J0448J0282J821j1388j2700R657J1596K168
15087D0962j1572L414P474N229o655m809N913p683p598j2966J438M89J5420n362
$$ plain form
15185 30332 42937 54470 51681 51226 45414 48232 49610 51255 38445 19775 3065 -4170 667
15172 667 19300 27685 31891 31217 21790 28872 35026 25304 25241 24360 23241 23878 17336 10884 15448 17350
15156 17350 22673 30356 39174 44504 40891 43137 36613 32356 31505 31013 34180 19185 21443 26275 11535
15141 11535 6343 26682 36793 22700 36330 46871 48028 40486 16465 18448 30523 34511 32183
15128 32183 33421 24437 21152 36694 39144 47036 60063 52182 51723 56582 51439 45398 47180 52470
15114 52470 52517 45728 46013 35556 23652 29256 29006 37324 41585 29357 17046 14388 18512 29742
15100 29742 32241 18949 11565 17516 19078 29526 39808 41629 30241 17541 27198 38794 40962
15087 40962 29390 32804 40278 45507 38852 34043 39956 32273 24675 11709 13147 13636 29056 23694
15073B3694m178J771K088n956K606J9483P722J075K253j0415j7756J6923J1857
15060E1167q581k025L958j3993j2933j0728Q267K1953J1822q953o157j1207J40
15047B2730M920L048k489m974O864O376j4936m656M88R229J3640k076P446O181
15033E1791M988o767j1122j1260k666j5850j2282J803K3909J2214J564J779O219
15020D4320j3937j8479N28J661l494K649N813J1714K20O243L140M613m278o430
15006C4283k303J0798M770k0222k204P972j2516O62Q482Q258N327R619l612o196
14992D3118J0918J6824K827P359M227j7892n742M60P445J2102J0774L061q88j4707
14978G9886j8375j9775q486j1467q294j870k392N72P1N997O19J5022K416Q855
$$ plain form
15073 23694 19516 21287 23375 17419 20025 39508 47230 48305 50558 40143 22387 39310 51167
15060 51167 42586 40561 44519 30526 17593 6865 15132 37085 48907 39954 33797 22590 22730
15047 22730 27650 30698 28209 23235 30099 36475 21539 16883 17371 26600 40240 38164 45610 51791
15033 51791 56779 50012 38890 27630 24964 9114 -3168 -1365 22544 34758 36322 38101 44320
15020 44320 30383 11904 12432 14093 10599 13248 19061 30775 30995 37238 40378 44991 40713 34283
15006 34283 31980 42778 47548 27326 25122 33094 20578 21240 29722 37980 43307 52926 49314 43118
14992 43118 54036 70860 73687 81046 85273 67381 61639 62099 69544 81646 92420 95481 94593 79886
14978 79886 61511 41736 33250 21783 13489 11619 9227 9799 9870 15867 16486 31508 33924 42779
14964D2779P578Q425Q564j2878r982P937J056J1943J6666R35m063j0484j0457
14951E8019L353o928j6054l882K403j832R538P420J1401q659j988N633j912J2401
14937F8913j56L47j8528j4403O162q745k111J3298k68M902m206j997l233j1671
14923B8304J6319P188q275N163J1969l98j5917j9284R042J0775m880r308L9j0329
14909B0408n681O610M455J8970R823l131m915Q232J3971j017q075k401k995J3110
14895F7364J872r522M98o470n916j3119j2898r218j088J1824O488J4179J0110
14882E4104m455n534N526l889j3101P83L269J498J3389P541M157j3899j1732o232
14868C1425p491Q126J8720j953j1705P102R641j0032r751o440M579J1533P694
$$ plain form
14964 42779 50357 58782 67346 54468 44486 52423 53479 65422 82088 83023 78960 68476 58019
14951 58019 61372 54444 38390 34508 36911 35079 44617 52037 63438 54779 52791 58424 56512 68913
14937 68913 68757 69104 50576 36173 42335 33590 31479 44777 44509 49411 45205 43208 39975 28304
14923 28304 44623 51811 43536 48699 60668 60270 44353 25069 34111 44886 40006 30698 30737 20408
14909 20408 14727 21337 25792 44762 54585 51454 46539 54771 68742 67725 59650 57249 54254 67364
14895 67364 69236 59714 60212 53742 47826 34707 21809 12591 11503 23327 29815 43994 54104
14882 54104 49649 44115 49641 45752 32651 33434 36703 38201 51590 59131 63288 49389 37657 31425
14868 31425 23934 32060 50780 48827 37122 44224 53865 43833 34082 27642 32221 43754 51448
14855E1448j1945j2533P716J4183J200r910J4745J3445Q875J879O434J998j3368
14842G4167q847O008M074o25j1934r70J3636M525O330r279j4864q763j3476Q592
14828D8574K921j845k757J0690q943P688J1466k389j6325k192R498Q387k1276
14815D3497k4016O275j540j2741j790K991J7489L430j2266j6567J377J0977N998
14802B3114J1842L3517J8497Q033M256L534M296q172o984o756Q172L461n896N347
14788I6261j057k479n710l325j4722p182Q206l905N590p28O43J5222M19M95J0637
14773I8365j168q899R74l051M803M647J7722K6748J8351J4524J3347L910o658
14760A83615j8403j3937Q332J9709J9634P672P089K0147J1398M916N492N997q493
$$ plain form
14855 51448 39503 26970 34686 48869 50069 40159 54904 68349 77224 79103 85537 87535 74167
14842 74167 65320 71328 75402 74777 62843 61873 75509 80034 86364 77085 62221 53458 39982 48574
14828 48574 51495 49650 46893 57583 48640 56328 67794 65405 49080 46888 56386 64773 43497
14815 43497 19481 25756 24216 11475 9685 12676 30165 33595 21329 4762 6139 17116 23114
14802 23114 34956 68473 86970 95003 99259 102793 107089 98917 91933 85177 93349 96810 90914 96261
14788 96261 95204 92725 87015 83690 68968 61786 69992 66087 71677 70949 71592 86814 87233 87728 98365
14773 98365 97197 88298 89272 86221 91024 95671 113393 140141 158492 173016 186363 190273 183615
14760 183615 165212 151275 159607 179316 198950 206622 213711 233858 245256 250172 255664 261661 253168
14747B53168m955k7333k0620j8958l3745m0052l1379J47K119K2103J1729m63N567
14734A17328J4779J7865M405j1328r515j4386r937Q720o961k277n108O846J484
14721A11915J487n439j583J7275o66p101n231M286K683J0224R695P462J0227o962
14707A48272o725p774J3883J8386K063n643R682J2012n344k412k3651k5009j4590
14694A13150n445p307n034N802J2760J4494M701k2848k4510j0867J8121J1645
14682A04662O450J0528Q555J073m925r130k824o882J1046J2323J9332K5522L744
14669A79474J0296O796j5237k3401q258r147j9700j7420Q484L1505J0914k2362
14657A31944j3287n12J5976J6237J1350L8689M94m552J4338L087L782j670r130
$$ plain form
14747 253168 248213 220880 200260 181302 147557 107505 76126 76273 78392 100495 112224 111761 117328
14734 117328 132107 149972 154377 143049 133534 119148 109211 117931 110970 108693 103585 110431 111915
14721 111915 113402 107963 106380 123655 122989 115888 110657 114943 117626 127850 137545 145007 155234 148272
14707 148272 141547 133773 147656 166042 168105 162462 172144 184156 178812 176400 152749 127740 113150
14694 113150 107705 100398 95364 101166 113926 128420 133121 110273 85763 74896 93017 104662
14682 104662 111112 121640 130195 131268 126343 117213 114389 107507 118553 130876 150208 175730 179474
14669 179474 189770 196566 181329 157928 149670 140523 120823 103403 111887 143392 154306 131944
14657 131944 118657 118145 134121 150358 161708 200397 200891 196339 210677 213764 217546 215876 206746
14644B06746K466n003j625M778j0110n72Q74k043K3205M6556O0996M9150N6584
14631D32002M7223L1630j939j9549j0478o494m2424o5194m4239j3869L8957L9046
14619C84672J1553j0606j5615K757J6029k008k18J1272l779p951K855j182L910
14606C91689J111r542o239K262l963L390R133M635r728N22j0273p729O702J0359
14592C82329J3236K1236J9924N297k771J3189J1062o493p239k8698k2718K136
14580D00490N737M13J5526J7881K1620J2590J2392P727K2409L6012K5746K0241
14568E98784R049Q269J7500K0328J4082r08J6451K5484L1248L6326J4948L1824
14556H23385K5272K3814J9520K3344K0722K2542L1944M0724L7279L3469L5269
$$ plain form
14644 206746 209212 204209 202584 207362 197252 196680 197554 195511 218716 265272 326268 375418 432002
14631 432002 479225 510855 508916 489367 478889 472395 429971 364777 320538 306669 345626 384672
14619 384672 396225 385619 370004 372761 388790 386782 386564 397836 394057 386106 388961 387779 391689
14606 391689 392800 383258 377019 379281 375318 378708 387841 392476 382748 383270 372997 365268 371970 382329
14592 382329 395565 416801 436725 442022 439251 452440 463502 457009 449770 421072 398354 400490
14580 400490 406227 406640 422166 440047 461667 474257 486649 494376 516785 552797 578543 598784
14568 598784 607833 616102 633602 653930 668012 667104 683555 709039 740287 776613 791561 823385
14556 823385 848657 872471 891991 915335 936057 958599 990543 1031267 1068546 1102015 1137284
14545A137284M7530N2762N9971O7163M1520M8374P5074R8116J11326R6763P7210
14534A913093O5915O7007Q9474J09692J45853J79142K01725K25861K14175K23929
14524C435866L04410L60536L72646M18478M54876N05934O12028P83359R47967
14515H196100J110266J305490J611346K065844K673883L579454M989353P297677
14507C2829413J0781524J5553284K2653652L4168611N1391833P3055745P8348726
14500C18782788K9991127l7921339p0526138p4306923n4403262l3534501k0550279
14493E7531473j3205236r084034o634055m975759l806340k972621k376539j913260
14485A2563629j589664j312079j119998r62209q40171p33647o38232n17703m46809
$$ plain form
14545 1137284 1184814 1237576 1297547 1364710 1406230 1454604 1529678 1627794 1739120 1835883 1913093
14534 1913093 1979008 2046015 2135489 2245181 2391034 2570176 2771901 2997762 3211937 3435866
14524 3435866 3740276 4100812 4473458 4891936 5346812 5852746 6464774 7248133 8196100
14515 8196100 9306366 10611856 12223202 14289046 16962929 20542383 25531736 32829413
14507 32829413 43610937 59164221 81817873 115986484 167378317 240434062 318782788
14500 318782788 348773915 310852576 240326438 166019515 111616253 78081752 57531473
14493 57531473 44326237 35242203 28608148 23632389 19826049 16853428 14476889 12563629
14485 12563629 10973965 9661886 8541888 7579679 6739508 6005861 5367629 4849926 4403117
14476D403117l80328l42548l06357k75037k40035k08977k04097j97607k09111
14467B039020j85700j91969j63530j15172p6173n3564n6586n7931p3538o7252
14457I97605l4315n4878q8391n5201m2096l8486k1998q295j9822n9963n6265k2364
14445D95531j4337k804N713o849k4514m7004m4103l3503m7050k5622J150m04J7375
14432B73579l758j2127j5534o498p092N081O211N901m625j2305M399l131P64k1305
14418B09560j2123j4687k6013k5926k7335j2376j0065J883J8590q66L618J8044
14406A22304L055j8158k1460l4342j8118o550L877R150m437J326l226o905p119
14393A9397Q2R804K159L117n130m648j906J2241Q526L0141J1064j328j960n945
$$ plain form
14476 4403117 4022789 3680241 3373884 3098847 2858812 2649835 2445738 2248131 2039020
14467 2039020 1853320 1661351 1497821 1382649 1306476 1252912 1196326 1138395 1064857 997605
14457 997605 963290 908412 820021 764820 722724 684238 662240 653945 634123 574160 517895 495531
14445 495531 481194 478390 484103 477254 452740 405736 361633 328130 281080 255458 256608 256204 273579
14432 273579 269821 257694 242160 235662 228570 233651 239862 245763 241138 228833 233232 230101 230865 209560
14418 209560 197437 182750 156737 130811 103476 91100 81035 82918 101508 100642 104260 122304
14406 122304 125359 107201 85741 51399 33281 26731 30608 39758 35321 36647 33421 26516 19397
14393 19397 19479 29283 31442 34559 29429 24781 22875 35116 43642 73783 84847 83519 81559 75614
14379G5614R020K9221J9858N329l7320n0983j5779P814L976j8560p724L4471K1368
14366G6305j0572J1608J6864l825j3148j1827n936j0011p955l341q676L702j5161
14353A8027Q359n233q45P545K2967Q463J886J3926P54l844J403o283j7421k8909
14339B0795j8527L507N01j6476k706j9N762o236o981P418K431n831j368M023P143
14324f564N346J9929J9805J1471k253j6693j9330j019J1109K2415M002k1736l0856
14311d374j3301J0274P040K5132J6907J1808n814k1165m4029l1471k3625k012
14299g4630N615J2629K1453P202j4915N03J5460R233J649K1019J6886Q576K953
14286C3633k2650k0463O810J082j0151L219J4497J338j1071n783j864m934J885
$$ plain form
14379 75614 84634 113855 133713 139042 101722 50739 34960 42774 46750 28190 20466 54937 76305
14366 76305 65733 77341 94205 90380 77232 65405 59469 49458 41503 38162 29486 33188 18027
14353 18027 26386 21153 20308 27853 50820 59283 61169 75095 75849 72005 73408 67125 49704 20795
14339 20795 2268 5775 6276 -10200 -12906 -12925 -7163 -13399 -20380 -12962 -10531 -16362 -17730 -13707 -6564
14324 -6564 -1218 18711 38516 49987 47734 31041 11711 10692 21801 44216 48218 26482 -4374
14311 -4374 -17675 -7401 -361 24771 41678 53486 47672 26507 -17522 -48993 -72618 -74630
14299 -74630 -69015 -56386 -34933 -27731 -42646 -42143 -26683 -17450 -15801 5218 22104 30680 33633
14286 33633 10983 -9480 -2670 -1588 -11739 -8520 5977 7315 -3756 -9539 -11403 -16337 -14452
14273a4452o351J753M798p990o932j7489L330j077K2041J9237J8756N445N257
14260B6326Q793m699j7469j5669j7949L616l737p773k987j2825m067K692P232
14247c8516l095K663J7374R682N268m555N550R983L232m025K926k961k524P338
14233H340m791L672j8358j173r412l686r545J8708L265m565R203O726O310M824
14219I518o739j374O40J1055j9123L221R919j6711j0854O557p762O523l39L866
14205a1603Q125Q376j0286p828j4525p593N019K1839K7131K5369K3635J8171P53
14192H6583K341l1362j3365j4568j2960q076p095o630j2665m252J1257O484K936
14179a372o199q04k00L697K555J5799j1978P5L148j5228k460K417K271m23M603
$$ plain form
14273 -14452 -20803 -19050 -14252 -22242 -29174 -46663 -43333 -44410 -22369 -3132 15624 21069 26326
14260 26326 35119 30420 12951 -2718 -20667 -17051 -20788 -28561 -31548 -44373 -48440 -45748 -38516
14247 -38516 -41611 -38948 -21574 -11892 -6624 -11179 -5629 4354 7586 3561 6487 3526 1002 8340
14233 8340 3549 7221 -11137 -12310 -21722 -25408 -34953 -16245 -12980 -17545 -8342 -1616 4694 9518
14219 9518 2779 1405 2045 13100 -6023 -2802 7117 -9594 -20448 -13891 -21653 -15130 -15469 -11603
14205 -11603 -3478 4898 -5388 -13216 -27741 -35334 -30315 -8476 18655 44024 67659 85830 86583
14192 86583 88924 57562 44197 29629 16669 8593 1498 -5132 -17797 -22049 -10792 -4308 -1372
14179 -1372 -7571 -8375 -8575 -4878 -2323 13476 1498 1573 4721 -10507 -12967 -10550 -8279 -8702 -4099
14164d099j690j2324n580J0517K449l462L278j455J228M880O343l275l805O970
14150b5q066l830Q394m44k959p758J724J6313P451R366j426j2769j4236k935p628
14135a8828o816J0380J7172Q044r110r428j4145L121L933J1510J6719k703k7881
14122a8032q622K3169K794o42N557o08o683j1177M110N869l61J355M824M60J83
14107B196p95k323N184m930Q097j4261Q929J8098q105o341j969l880l822l232
14093g154L216o75L327o969l727p106n009j4152J0928J083o757L3L218K562j663
14078b8845N699M643l708L483P545q45J790q662j0096J0031j1894Q84n516M567
14064c0924L356q819N076p72o881P029N437J626J1498P501k56O39K150N099p628
$$ plain form
14164 -4099 -5789 -18113 -23693 -13176 -10727 -14189 -10911 -12366 -11138 -6258 85 -3190 -6995 -25
14150 -25 -8091 -11921 -3527 -3971 -6930 -14688 -12964 3349 10800 20166 18740 5971 -8265 -11200 -18828
14135 -18828 -25644 -15264 1908 9952 842 -8586 -22731 -19610 -15677 -4167 12552 9849 -18032
14122 -18032 -26654 -3485 -691 -1333 4224 3616 -3067 -14244 -10134 -4265 -4626 -3271 1553 2013 2196
14107 2196 1401 -922 4262 -668 7429 -6832 2097 20195 12090 5749 3780 -100 -3922 -7154
14093 -7154 -3938 -4613 -1286 -8255 -11982 -19088 -24097 -38249 -27321 -26238 -32995 -32962 -29744 -27182 -28845
14078 -28845 -23146 -18503 -22211 -18728 -11183 -12028 -10238 -18900 -28996 -18965 -30859 -29975 -35491 -30924
14064 -30924 -27568 -36387 -31311 -32083 -38964 -31935 -26498 -24872 -13374 -5873 -6129 -5490 -3340 1759 -5869
14049e869l122q961Q177n114l290J607P629M83M732M915m750J342L793Q938R472
14034A9982K832k0380j3731K702O603J5217k799j9043J044K259r107k8888j3404
14021e6713Q670r441J4q1M568K928j781J4121j6008p842R370J3095J0083J7703
14007a1314L444o813j0051k3468K774J0866J1425L759N704N140J986L886m398
13994g060m554j4945n057M843J862N293J98R703P087p699q943p773O262l796q970
13979c3549p31k41K277K450l099M196J6053k750j8592K388K0152J9173P777m793
13965A0711j5472j2433p565J4600j2149l429j1599Q79J8864P617j719J879o067
13952a5883J3143k03k550n804j0168n260r836m573m293N069P779P702J3210P189
$$ plain form
14049 -5869 -8991 -17952 -9775 -14889 -18179 -16572 -8943 -8460 -3728 1187 -3563 -2221 1572 10510 19982
14034 19982 22814 2434 -11297 -8595 -1992 13225 10426 -8617 -7573 -5314 -14421 -43309 -56713
14021 -56713 -48043 -57484 -57470 -57551 -52983 -50055 -51836 -37715 -53723 -61565 -52195 -39100 -29017 -11314
14007 -11314 -7870 -14683 -24734 -48202 -45428 -34562 -23137 -19378 -13674 -8534 -6548 -2662 -7060
13994 -7060 -11614 -26559 -31616 -26773 -24911 -19618 -19420 -9717 -2630 -10329 -19272 -27045 -20783 -24579 -33549
13979 -33549 -34280 -34521 -32244 -29794 -32893 -28697 -12644 -15394 -33986 -31598 -11446 7727 15504 10711
13965 10711 -4761 -17194 -24759 -10159 -22308 -25737 -37336 -36457 -17593 -9976 -11695 -9816 -15883
13952 -15883 -2740 -2943 -5493 -11297 -21465 -26725 -36561 -41134 -45427 -40358 -32579 -24877 -11667 -4478
13938d478j0781q932M432J208p402K837N448J3815m463o005q567M163K545R431
13924f749m514p068P883l28l291J0026M403j1986j4855O228M536R2l214m973o610
13909c0420R211o711L95M116P215j350K2162J8229q882j6917o275r9L860k603
13895h069m478o486J856N878k066j0976J2602R802p53L9n565n96N537o426j0971
13880b0672r514Q582J098O994r202R2R53J2752r76j1431k336q361l574O189J940
13865b7466J1074O540J2272J65o417m788k072O522k382l129j242J3136M878n621
13851A470n817q307r927K668l463J8609J5985L309j6490m996k869J2021q121q319
13837a4247k811P74J3887P143k603j1072j6238k937O344j30j995j947m400l615
$$ plain form
13938 -4478 -15259 -24191 -19759 -18551 -25953 -23116 -17668 -3853 -8316 -14321 -22888 -18725 -16180 -6749
13924 -6749 -11263 -18331 -10448 -10776 -14067 -4041 362 -11624 -26479 -20251 -15715 -15623 -18837 -23810 -30420
13909 -30420 -21209 -27920 -27525 -23409 -16194 -17544 4618 22847 13965 -2952 -9227 -9326 -5466 -8069
13895 -8069 -12547 -19033 -17177 -11299 -13365 -24341 -11739 -1937 -2690 -2651 -8216 -8812 -3275 -9701 -20672
13880 -20672 -30186 -21604 -20506 -13512 -22714 -22622 -21669 -8917 -9893 -21324 -23660 -32021 -35595 -29406 -27466
13865 -27466 -16392 -9852 2420 2585 -3832 -8620 -10692 -4170 -6552 -9681 -10923 2213 7091 1470
13851 1470 -4347 -12654 -22581 -19913 -23376 -4767 11218 14527 -1963 -6959 -9828 2193 -5928 -14247
13837 -14247 -17058 -16284 -2397 4746 2143 -8929 -25167 -28104 -21760 -21890 -23885 -25832 -30232 -33847
13823c3847k745L939J0567j362n523l851J1587R548N565O284p281n701R221M873
13809A274r026j4367M459k434J027J3589j5790p775l150J3291J3616J832l096
13796f550M241L100j6694o699J4373J663o056O036J510n037q223k2722J6116P39
13782b4203j459O090P494N370k986p196q14N71j849j0221j5181l940K500K7408
13768a8416J3124l679o546q759Q474P323N761m125r612k567O713J005J9933K1339
13754B9968j4693j8760m435r615J833q038N829K573p22o691l80K563j130N699
13740a5999J5405P063o420k0323o983J6669m48K937N255l193j6290N090J0045
13727g192J0955j1172n142J4103R992O193j694p166j5232k728J3696o84m920j2302
$$ plain form
13823 -33847 -36592 -32653 -22086 -23448 -28971 -32822 -21235 -11687 -6122 162 -7119 -12820 -3599 1274
13809 1274 -7752 -22119 -17660 -20094 -19067 -5478 -21268 -29043 -32193 -18902 -5286 -3454 -6550
13796 -6550 -2309 791 -15903 -22602 -8229 -6566 -12622 -6586 -5076 -10113 -18336 -41058 -24942 -24203
13782 -24203 -25662 -19572 -12078 -6708 -9694 -16890 -17704 -17133 -18982 -29203 -44384 -48324 -45824 -18416
13768 -18416 -5292 -8971 -15517 -24276 -15802 -8479 -2718 -6843 -16455 -19022 -12309 -11304 8629 29968
13754 29968 15275 -3485 -7920 -17535 -15702 -23740 -17911 -15338 -16060 -22751 -23131 -20568 -21698 -15999
13740 -15999 -594 6469 49 -20274 -27257 -10588 -11036 -8099 -2844 -6037 -22327 -17237 -7192
13727 -7192 3763 -7409 -12551 1552 11544 17737 16043 8877 -6355 -9083 4613 3929 -991 -13293
13713a3293k268P309K013K076J6393J364L509k028l766r865J528J13k344j1311
13699a0570Q477O157q35j2362j6694K493J2007n623j1091j5806k076M59P836J4886
13685b2742J596K143O28l224m280N258J4294J972K945k555P746O344o821J2867
13671A6171J667p476m129j2110j0715O249L549L865P725M075k1676k9670Q027
13658c4448J6694Q705L182L834N453o315K457M639J3296o960j1014r740k596M942
13644g871j621j1590n615j3377j126R014J0583M755L19M904k774j145l153l665
13630b2362K87M43j86p660j883J4226L030q554o878P676K18n962j0466o324N605
13615c8790J0162R275J5184N150m399q441K555N873n668r004j973j0248M475P861
$$ plain form
13713 -13293 -15561 -8252 -6239 -4163 12230 13594 17103 15075 11309 1444 2972 3085 741 -10570
13699 -10570 -2093 4064 3229 -9133 -25827 -23334 -11327 -16950 -28041 -43847 -45923 -45464 -37628 -22742
13685 -22742 -21146 -19003 -18375 -21599 -25879 -20621 -6327 -4355 -1410 -3965 3781 10125 3304 16171
13671 16171 17838 10362 6233 -5877 -16592 -10343 -6794 -2929 4796 8871 -12805 -42475 -34448
13658 -34448 -17754 -9049 -5867 -2033 3420 -2895 -438 4201 17497 10537 -477 -10217 -12813 -7871
13644 -7871 -9492 -21082 -26697 -40074 -41200 -32186 -21603 -16848 -16529 -11625 -14399 -15544 -18697 -22362
13630 -22362 -22075 -21632 -21818 -29478 -31361 -17135 -14105 -22659 -29537 -21861 -21643 -27605 -38071 -44395 -38790
13615 -38790 -28628 -19353 -4169 981 -3418 -11859 -9304 -3431 -9099 -18103 -20076 -30324 -25849 -17988
13601a7988J8276q872o980m432n799L658J3649N896n178M352Q520j4824l021R312
13587c431M624o818r041j2551K882J840K05J0276J2297L869N053n557q242m403
13573h997l89K852n029J988L570K87m820q978J5537K2903N56q794m270q065M448
13558B799j76M770N902J950j34j7051j1001j2576L328j182J13K266M915R82K696
13543a2399m278j056J1138K474K363j741n081r180P061K869j8840m914l166J5332
13529a9418J5538R55r572j2636Q153J7558j420K062r370l001J4608J421r435k953
13515g510P530N223Q734p37r53N098q392j4608l912K258o705p43p208j1760m504
13500c8189O420L07l71J2287Q255Q469p82L135m152r6j0184L34r557J0949N435
$$ plain form
13601 -17988 288 -8584 -15564 -19996 -25795 -22137 -8488 -2592 -7770 -3418 5102 -9722 -12743 -3431
13587 -3431 1193 -5625 -14666 -27217 -24335 -22495 -22290 -12014 283 4152 9205 3648 -4594 -8997
13573 -8997 -9386 -6534 -11563 -9575 -6005 -5718 -10538 -19516 -3979 18924 19480 10686 6416 -1649 2799
13558 2799 2623 7393 13295 15245 15111 -1940 -12941 -25517 -22189 -23371 -23258 -20992 -16077 -15095 -12399
13543 -12399 -16677 -17733 -6595 -4121 -1758 -3499 -8580 -17760 -10699 -7830 -26670 -31584 -34750 -19418
13529 -19418 -3880 -2925 -12497 -25133 -16980 578 -842 1220 -8150 -11151 3457 4878 -4557 -7510
13515 -7510 20 5243 13977 13240 12287 17385 8993 -5615 -9527 -7269 -13974 -14717 -21925 -33685 -38189
13500 -38189 -31769 -31462 -31833 -19546 -11291 -2822 -3604 -469 -4621 -4717 -14901 -14567 -24124 -13175 -7740
13485g740L14J5565O179q999q012j4506l347n434j170J1868L45j338J4720J4613
13471A3058J521j9151n370N21j2733J3116l517R763J1388n812m459j7570q42P957
13457a2130l509k696J0585O832l05p824l286O256L048k594J179j0249J1097j068
13443d664M974J6131P432k074n873j3697r231j0927R11j453L86P650j249j0826
13429b2510L094Q998k048p490N093P649L022j4515j7673j804J1770J0862L462
13416a2090J1129J3417o626o398O070j514q600j104J86o728j5285q976j648J991
13402c6176J3215J835J2063O005o906M840L815j612M2R374R706k0201j9516K301
13388b1215M48J3270p88m065O251N062N19Q87j863J199L35n770k605O249J8512
$$ plain form
13485 -7740 -7426 8139 14318 5319 -2693 -17199 -20546 -25980 -27150 -15282 -14937 -16275 -1555 13058
13471 13058 14579 -4572 -9942 -9421 -22154 -9038 -12555 -2792 8596 2784 -1675 -19245 -20087 -12130
13457 -12130 -15639 -18335 -7750 -918 -1223 -9047 -12333 -6077 -3029 -5623 -4444 -14693 -3596 -4664
13443 -4664 310 16441 23873 21799 15926 2229 -7002 -17929 -17018 -18471 -18085 -10435 -11684 -22510
13429 -22510 -19416 -10418 -12466 -19956 -14863 -7214 -4192 -18707 -36380 -38184 -26414 -15552 -12090
13416 -12090 -961 12456 5830 -568 5502 3988 -4612 -5716 -5530 -12258 -27543 -36519 -38167 -36176
13402 -36176 -22961 -21126 -9063 -3058 -9964 -5124 -1309 -2921 -2879 6495 16201 -4000 -23516 -21215
13388 -21215 -20767 -7497 -8285 -12350 -6099 -1037 -518 369 -1494 -295 40 -5730 -8335 -2086 16426
13373A6426k070j3873k1018l992P676J4921L021k06p266J6206J049n091K410j204
13359F989J4546m448M166k836j8837p741r60o281M911P675n83q705p116M546L022
13344a1652q067r230j97K487M119P320O266j0713j240J3229O486p158J1625l996
13330g21l158m285j386N516K410q001P793P352j3914N562j1932k216L421L155
13316a0404J2462n292M500O224r081j5464J212k014J0414n051K206L995n497j2297
13302b4087J2288J2271K506j7311m627J3164L068m290J284M721J0956L860j869
13289A1934l827O224p697j0272k418o237J1530M733j374m470p325o861L710K244
13275a0106J0938n527j5094l941Q968M678J3581M843o047O201P291J410j2887
$$ plain form
13373 16426 14356 483 -20535 -24527 -16851 -1930 1091 885 -6381 9825 10874 5783 8193 6989
13359 6989 21535 17087 21253 18417 -420 -8161 -9121 -15402 -10491 -2816 -3399 -12104 -19220 -14674 -11652
13344 -11652 -19719 -28949 -29146 -26659 -22540 -15220 -8954 -19667 -20907 -7678 -1192 -8350 3275 -721
13330 -721 -3879 -8164 -9550 -4034 -1624 -9625 -1832 5520 -8394 -2832 -14764 -16980 -13559 -10404
13316 -10404 2058 -3234 1266 7490 -1591 -17055 -15843 -17857 -7443 -12494 -10288 -6293 -11790 -24087
13302 -24087 -11799 472 2978 -14333 -18960 -5796 -2728 -7018 -5734 -1013 9943 13803 11934
13289 11934 8107 14331 6634 -3638 -6056 -12293 -763 3970 2596 -1874 -9199 -16060 -12350 -10106
13275 -10106 832 -4695 -19789 -23730 -14762 -10084 3497 8340 2293 8494 15785 17195 4308
13262D308r742p62Q966n992M001j9596o099J5149J1867m362n882m054r092n507
13248b6797J5654j227K939O485M529j493l423k775J719N080j0460j0951R000J8363
13234F643L733r019k1339K580Q470j1818m513K3456J0229j0479j0833k474j375
13221a6739k990M137p329J6902O918n034j545J0641J1642r028q685q241k569r84
13207a2904k05J0489L239k505j09J254J244o961P957J75Q140p638M763J752r899
13192a208L27n563k99j2620K461m535Q42m28L930P431m650K583K84m430O588K64
13176i023O463O920j0799j1806P017J9498j4657k6550J975J8700o006k246M959
13163a5555l890r349J247N165N831R517M705r590n658l551n48P494K1731J6117
$$ plain form
13262 4308 -5434 -6196 2770 -3222 779 -18817 -24916 -9767 2100 -2262 -8144 -12198 -21290 -26797
13248 -26797 -11143 -12370 -9431 -2946 1583 90 -3333 -6108 -4389 691 -9769 -20720 -11720 6643
13234 6643 10376 1357 -19982 -17402 -8932 -20750 -25263 -1807 8422 -2057 -12890 -15364 -16739
13221 -16739 -19729 -15592 -22921 -6019 899 -4135 -5680 4961 16603 7575 -1110 -9351 -11920 -12904
13207 -12904 -13109 -2620 619 -1886 -1995 -741 503 -6458 1499 1674 9814 2176 6939 8691 -1208
13192 -1208 -881 -6444 -6743 -19363 -16902 -21437 -20595 -21023 -17093 -9662 -14312 -11729 -11445 -15875 -9287 -9023
13176 -9023 -2560 4360 -6439 -18245 -11228 8270 -6387 -32937 -30962 -12262 -18268 -20514 -15555
13163 -15555 -19445 -28794 -27547 -22382 -16551 -7034 -2329 -11919 -17577 -21128 -21676 -14182 7549 23666
13149B3666j141j9233j4208r854j519k354L655J4934p039j1516j154K734L717
13136a9312O607J8399l989O025k956q689n04m640n399p23k414k853P07Q136j213
13121a2818l637P667O461l542k4941k559J3795L567P531J246j6452q9J2023N015
13107f733O462K3940k45M634m387j1074j3974k232l817J381k345n403j3162Q109
13093a8846M303M933M346J2974j4349j5119j358L002P358P861K551O555j843j317
13079A051n805Q953l345O001M299k044J615j248K5p705M158M044n554L104j3651
13064f102j0500M770M052n44R322j586J784J2231O572n170j2845N964M210k149
13050A0009j6952k541P070P63Q343l503p833j2890l444P764N818l562k237J3919
$$ plain form
13149 23666 22525 3292 -10916 -20770 -22289 -24643 -20988 -6054 -13093 -24609 -25763 -23029 -19312
13136 -19312 -12705 5694 1705 7730 4774 -3915 -4419 -9059 -14458 -15181 -17595 -20448 -19741 -11605 -12818
13121 -12818 -16455 -8788 -2327 -5869 -30810 -33369 -19574 -16007 -8476 -7230 -23682 -23771 -11748 -6733
13107 -6733 -271 23669 23424 28058 23671 12597 -1377 -3609 -7426 -6045 -8390 -13793 -26955 -18846
13093 -18846 -14543 -9610 -5264 7710 -6639 -21758 -23116 -20114 -12756 -4895 -2344 4211 2368 1051
13079 1051 -4754 4199 854 6855 11154 9110 10725 9477 9502 1797 5955 9999 4445 7549 -6102
13064 -6102 -16602 -11832 -7780 -8324 998 -588 1196 13427 19999 14829 1984 7948 12158 10009
13050 10009 -6943 -9484 -2414 -1651 6692 3189 -4644 -17534 -20978 -13214 -7396 -10958 -13195 724
13036G24R76J3187j2997k1660J7434J7210j995j2443N255R678o971k986K738n544
13022B606L452J1112Q552l416J144p141P056l787K090p989j4844n782r62m200
13008a2109M075r518J1476J184J6613R4l952J5762q438j9959n33M541J255J4283
12994A4774n613k939J065m346j5946j800j3469K217L480K626O287l592Q017Q030
12980a209L830m308J936j5496l652N726K2931J1837j1136j4979l084o132Q116
12967e620k343K792O46N590K597J769N278k980j0651K672J9096q566m955n114
12953B11o694J5231k680m282j2114q851m402N036M544J351j273K174O757Q731
12939C739M853N623n343J338R76j098N77m456R070O719l879N301j4291r225j5455
$$ plain form
13036 724 1700 14887 1890 -19770 -2336 14874 12879 436 5691 15369 8398 5412 8150 2606
13022 2606 6058 17170 25722 22306 23450 16309 23365 19578 21668 13679 -1165 -6947 -7909 -12109
13008 -12109 -8034 -17552 -6076 -4892 11721 11815 7863 23625 15187 -4772 -5305 -764 491 14774
12994 14774 9161 6222 7287 2941 -13005 -14805 -28274 -26057 -22577 -19951 -13664 -17256 -9239 -1209
12980 -1209 2621 -1687 249 -15247 -18899 -13173 9758 21595 10459 -4520 -7604 -13736 -5620
12967 -5620 -7963 -5171 -4525 1065 3662 5431 10709 7729 -2922 -250 18846 10280 5325 211
12953 211 -6483 8748 6068 1786 -10328 -19179 -23581 -18545 -14001 -12650 -13923 -11749 -4992 3739
12939 3739 8592 14215 8872 10210 11186 10088 10665 6209 15279 21998 18119 23420 9129 -96 -15551
12924a5551J0622J394Q13l982L45p822q427N366J0256m452n967J9667M971j2055
12910d822P203m602n179J314P616J3689L71l149Q842j1819j7191l66K476o057
12896a1674J202o227P606J4421j0008L530L44N101Q093o444M316N971q366k822
12882E043l068l790M386L201Q27j5357o603l681l433J3673J738m548j2328j0997
12868c4937k835N834J1261J2485K0435Q004k412j949m534q582P964P058J3865
12855C1657n894j6788j2807J1250Q546r283r280n198P335J2252j08p520p343r822
12841a3003J3870J0311R507l0014q706K1777J1152k832j255P680n635j4215j1789
12828a3152m481N062R874K863J3198O460o245j375j1506j2667l181n630N646r373
$$ plain form
12924 -15551 -4929 -3535 -2722 -6704 -6359 -14181 -22608 -17242 -6986 -11438 -17405 2262 7233 -4822
12910 -4822 2381 -2221 -7400 -6086 1530 15219 15590 12441 21283 9464 -7727 -8093 -5617 -11674
12896 -11674 -10472 -16699 -9093 5328 -4680 -1150 -806 4295 12388 5944 10260 16231 7865 5043
12882 5043 1975 -1815 2571 5772 6599 -8758 -15361 -19042 -22475 -8802 -7064 -11612 -23940 -34937
12868 -34937 -37772 -31938 -20677 -8192 12243 20247 17835 15886 11352 2770 10734 17792 31657
12855 31657 25763 8975 -3832 7418 15964 6681 -2599 -7797 -462 11790 11682 4162 -3181 -13003
12841 -13003 867 11178 20685 -9329 -18035 3742 14894 12062 10807 18487 12852 -1363 -13152
12828 -13152 -17633 -12571 -2697 166 13364 19824 13579 12204 698 -11969 -15150 -20780 -15134 -24507
12814b4507N324K506o849N594L828m858M18j5866Q600P636Q764m502l280q940
12800b6132J394m548Q935o0j502P028Q809Q853j6827o710J0578n091L055J0831
12786a387M249l112k5076n864J0302O484q780j275L392J1402J7157Q041m950j0038
12772E45N482J1882n684q887n236P072l772k353M200L205j3754N01m189P033J37
12757c818O48R342L800R47m571o219P98L8N507o980p563j729q931K234j3786J3737
12741a6546J7595J5915J2205p023j4633j5239o786M635N674J088M645K285j3566
12728i751r260M275M3o83J352J2755P678L431k03n330K79j0474j3364M561M792
12713i899O736j0167O303n542P02J3318O267k82j0989j5093L441K3918L968r140
$$ plain form
12814 -24507 -19183 -16677 -23526 -17932 -14104 -18962 -18544 -34410 -25810 -18174 -9410 -13912 -17192 -26132
12800 -26132 -24738 -29286 -20351 -20411 -21913 -14885 -6076 2777 -14050 -20760 -10182 -15273 -12218 -1387
12786 -1387 2862 -250 -25326 -31190 -20888 -14404 -23184 -24459 -21067 -9665 7492 15533 10583 545
12772 545 6027 17909 12225 3338 -1898 5174 1402 -951 3249 6454 -7300 -6799 -10988 -3955 -3818
12757 -3818 -3170 6172 9972 10919 6348 129 927 965 6472 -508 -8071 -9800 -18731 -16497 -30283 -16546
12741 -16546 1049 16964 29169 22146 7513 -7726 -14512 -9877 -4203 -3115 1530 3815 -9751
12728 -9751 -19011 -14736 -14693 -15376 -14024 -1269 6409 9840 9637 4307 4586 -5888 -19252 -14691 -9899
12713 -9899 -3163 -13330 -7027 -12569 -11867 1451 7718 7436 -3553 -18646 -15205 8713 12681 3541
12699C541n967R67K195J5955J3792l006p089M833p115j2316K315N019q106j2335
12685g317L340J1736r845p679M845L288l211K008P760l248m653l326J1741R460
12671A4899o101j1252m509j408O04j0394j814J5806J0765p373M704J0931K425
12658A7283N407P373m254o375j2549j3178l867R620J1313q488k459p938K338P846
12644B072K629l671j2372l709K881R538J2890p507j4280J538j2861L190J1758
12631g904O769l520k657o133Q362k929O833K760j1658K224R157K0686P261l150
12617B6101j570n129k5405R61Q762P08j3491j1190O984j158M81K0028O945l240
12603I787o315n575Q514J5404J6727N012k0093j457k939m97J052J072l330j9075
$$ plain form
12699 3541 -2426 -1459 736 16691 30483 27477 20388 25221 18106 5790 8105 13124 5018 -7317
12685 -7317 -3977 7759 -2086 -9765 -4920 -1632 -4843 -2835 4925 1677 -2976 -6302 5439 14899
12671 14899 8798 -2454 -6963 -8371 -7767 -18161 -19975 -4169 6596 -777 3927 14858 17283
12658 17283 22690 30063 25809 19434 6885 -6293 -10160 -540 10773 2285 -174 -8112 -5774 2072
12644 2072 4701 1030 -11342 -15051 -12170 -2632 10258 2751 -11529 -9991 -22852 -19662 -7904
12631 -7904 -1135 -4655 -7312 -13445 -5083 -8012 -1179 1581 -10077 -7853 1304 21990 29251 26101
12617 26101 24531 19402 -6003 -5042 3720 4428 -9063 -20253 -13269 -14427 -13946 6082 13027 9787
12603 9787 3472 -2103 6411 21815 38542 43554 23461 22004 19065 18568 19620 20692 17362 -1713
12589a713o405J1186K882Q564q520r638o730j7561j6996N389J3786J7049j792
12576a0499j3194p67L392J5806j0218N388R227k248O570M949q873j4332o19J409
12562a4009J7269J6408J312j1825O448O469j3587k4283J446Q208M296R286J143
12549H581m583m0K770o535j4259M161K8921K293j8087J1032R830M691m60j2079
12535A6236k3191j7366L246N401l357N754Q041j2533J368O095O495J1568O431
12522A4188n417j9169j1671M9l908P185Q53M335j687J1907R54r41o314K280n812
12507a3168K121K571J6238J2976K068r027j1529l368K62l433N37N318P165j0144
12493a413o373j770n2L081K151n019K6m447r863o798R097K812M326n43j1877l83
$$ plain form
12589 -1713 -8118 3068 5950 14514 5994 -3644 -10374 -27935 -44931 -39542 -25756 -8707 -10499
12576 -10499 -23693 -24460 -21068 -5262 -15480 -10092 -865 -3113 3457 8406 -467 -14799 -15418 -14009
12562 -14009 3260 19668 20980 9155 15603 22072 8485 -15798 -14352 -6144 -1848 7438 8581
12549 8581 3998 3958 6728 193 -14066 -9905 19016 21309 3222 14254 24084 28775 28315 16236
12535 16236 -6955 -24321 -21075 -15674 -19031 -13277 -5236 -17769 -16401 -10306 -3811 7757 14188
12522 14188 8771 -10398 -22069 -22020 -25928 -18743 -17890 -13555 -15242 -3335 -2381 -3322 -9636 -7356 -13168
12507 -13168 -11047 -8476 7762 20738 22806 13779 2250 -1118 -856 -4289 -3752 1566 8731 -1413
12493 -1413 -7786 -9556 -9608 -6527 -4376 -9395 -9369 -13816 -23679 -30477 -21380 -18568 -14242 -14785 -26662 -27045
12477b7045K711J5065j047p296O154j1101l426R790q00j1632o061K283J2598J4923
12463d884J4689N913k506r974j0704j032p51Q079n256j58J1827K20n818R773N987
12448A5405N655p909j1204L406M856p591j5836q096Q703L026J102P082J1831J0454
12434B0884m827p612J6204P322j2936o459R313j1360q174J82p257n697K497k070
12420i990p413p329Q623J6725M249k737o347j6205j6385J3186J6815J551l477
12407h734K505O818m466O539P079n725l976N449j9454l909K174J2733K157N496
12393D686j1852m386N342K970J6335m283p215j3800p260K3148N489l154j695P467
12379A1792N24o588j2715j3221J8697J206m20o467J7040R436o664q01j28j807
$$ plain form
12477 -27045 -24334 -9269 -10316 -17612 -11458 -22559 -25985 -16195 -16995 -28627 -34688 -32405 -19807 -4884
12463 -4884 9805 15718 13212 3238 -7466 -8498 -9249 -1170 -6426 -6584 5243 5463 -355 9418 15405
12448 15405 21060 13151 1947 5353 10209 2618 -13218 -21314 -12611 -9585 -8483 -1401 10430 20884
12434 20884 16057 8445 24649 31971 19035 12576 21889 10529 2355 2537 -4720 -10417 -7920 -9990
12420 -9990 -17403 -24732 -16109 616 4865 2128 -4219 -20424 -36809 -23623 -6808 -5257 -8734
12407 -8734 -6229 589 -3877 2662 9741 4016 40 5489 -13965 -17874 -15700 -2967 -810 4686
12393 4686 -7166 -11552 -6210 -3240 13095 8812 1597 -12203 -19463 3685 9174 6020 4325 11792
12379 11792 12316 5728 -6987 -20208 -1511 -305 -725 -7192 9848 19284 12620 11819 11691 9884
12365I884j318k805p693r327k700m452N349O678J652k97L348J260q020J324O076
12350a041j54L986O380j2001M121k508j978J6352p85r651J4765Q101j4609q051
12336B927q160j2824n312R16p418j293L416j370L683J5155j603n33M036j3891
12322b2271j9024J1397K7203J5786N234o994k299j1292j134O376q061J154L01
12309c624k0322j0317j2072J139J2418J4304K5778O226M868M022j4085k1916r296
12296b2877M600K790K151K083k456J6359R983j2192p590r42K05o828J1028M033
12282C47l01q872j1687n719K51p33l258J4527J1064J1338q295j93j605J506O809
12267E179j0191n329M522p639R352J1373J4508l122j4530j3652J3465j34q059
$$ plain form
12365 9884 8566 5761 -1932 -11259 -13959 -18411 -13062 -6384 -4732 -5029 -1681 -421 -8441 -7117 -1041
12350 -1041 -1195 2791 9171 -2830 1291 -1217 -3195 13157 12372 2721 17486 25587 10978 2927
12336 2927 -5233 -18057 -23369 -22453 -29871 -31164 -27748 -29118 -25435 -10280 -11883 -12416 -8380 -22271
12322 -22271 -41295 -29898 -2695 13091 18325 11331 9032 -2260 -3394 2982 -5079 -3925 -3624
12309 -3624 -23946 -34263 -46335 -45196 -32778 -18474 7304 13530 18398 22420 8335 -13581 -22877
12296 -22877 -18277 -15487 -13336 -11253 -13709 2650 12633 441 -7149 -8091 -7886 -14714 -3686 347
12282 347 46 -8826 -20513 -26232 -25981 -26714 -29972 -15445 -4381 6957 -1338 -1531 -3136 -1630 5179
12267 5179 -5012 -10341 -5819 -13458 -4106 7267 21775 18653 4123 -9529 3936 3802 -4257
12254d257J566P316o58m592Q822O59N956K5408m626j8362j4605l906m732q145
12240a4156l073k912J0723O480P023m540N262P851L915r220j5119j1174Q924K4417
12226A4401k461r753P81Q279L164J580O170M831l412q120l391K510k167k56P930
12211B0086q189p955j9271Q993P666j0869m492p568Q759J9227R216J876q865P91
12197I405P603K703o618j1037j4064j3557P6R326N158J937p737p59n32M26P600
12182a0070J2899L960m108M625L930K384P081L11p061J663L285O69M776O62o623
12167A8383N563r690j1390j3542J1025r112n718Q032j4600R24j558j78K0640L068
12153A847r965l237p735O43J1494J0371m938K85J0731o338m858J1988n227o372
$$ plain form
12254 -4257 -2691 4625 3967 -625 8197 8856 14812 40220 35594 17232 2627 -1279 -6011 -14156
12240 -14156 -17229 -20141 -9418 -2938 4085 -455 4807 12658 16573 7353 -7766 -18940 -10016 14401
12226 14401 11940 2187 2968 11247 14411 15991 22161 26992 23580 15460 12069 14579 12412 12156 20086
12211 20086 11897 3942 -15329 -6336 1330 -9539 -14031 -21599 -12840 6387 15603 17479 8614 9405
12197 9405 17008 19711 13093 2056 -12008 -25565 -25489 -16163 -11005 -9068 -16805 -17564 -18096 -17670 -10070
12182 -10070 2829 6789 2681 7306 11236 13620 20701 21012 13951 15614 18899 19568 24344 25006 18383
12167 18383 23946 14256 2866 -10676 349 -8763 -14481 -6449 -21049 -20125 -21683 -21861 -1221 1847
12153 1847 -8118 -11355 -19090 -18447 -6953 3418 -1520 -1235 9496 3158 -1700 10288 5061 -1311
12139a311M225N445J0194j1018k0854J2280Q1Q727R754j2475n454q08m655j4254
12125b0123o601l783J1138N905J4148J6574J136j6391j8803m95M326M057J6529
12112G617J1188j600p707j3247k230J0719K547N994J351j0372j0379j052N650
12099a521j230j768j6480M503J1489M174J1016m083j9427n472J223M425R555Q00
12085b796J1651K456L046J2875p069o505j30j1997j9101K133J5843J7100J2946
12072C0452r10j5496l206K66j2771j4368j3709O311J5293P85R435n642j0285R20
12058a2925R808M708O740J3233j0184k1635l930K582M678L259l291j948o495o815
12044b2215J1498J7130k784o851j570L606O859L233k046P971J1479r472j5189
$$ plain form
12139 -1311 2914 8359 18553 7535 -13319 -1039 -958 7769 17523 5048 -406 -1214 -5869 -20123
12125 -20123 -26724 -30507 -19369 -13464 684 17258 18394 2003 -16800 -17295 -12969 -8912 7617
12112 7617 18805 17205 9498 -3749 -5979 4740 7287 13281 14632 4260 -6119 -7171 -1521
12099 -1521 -2751 -4519 -20999 -16496 -5007 -833 10183 6100 -13327 -18799 -17576 -13151 -3596 -2796
12085 -2796 8855 11311 14357 27232 20163 13658 13528 1531 -17570 -15437 406 17506 30452
12072 30452 29542 14046 10840 11106 -1665 -16033 -29742 -23431 -8138 -7353 2082 -3560 -13845 -12925
12058 -12925 -3117 1591 8331 21564 11380 -10255 -14185 -11603 -6925 -3666 -6957 -8905 -15400 -22215
12044 -22215 -10717 6413 3629 -3222 -4792 -1186 5673 8906 6860 14831 26310 16838 1649
12031A649q217L748L691p71K610j692K300P94L226N642m287k1194R705M042l820
12016b574L617N080m241k872N197k55P698N88o392q823r538p268P503J6513J0154
12001A4387N913o922k641j1648K61J6528J654P763p135p874p143l672j217J181
11987e65l414m611r79J1796K436j50Q814M658r97n871M09M610j281j662J2946
11972B6139j1888k1207o708R719J6021r024O78J839o588p80j3947k233P707L525
11958f747P466R89J749j738m02J683l328r983J130R130l084j1097k308Q275R884
11943A619n916l618j4174n556M592M817N594P13J6600J799j7793n78J2188J3314
11929A3601m793j9840q530r182k292j81J3405j17K331J9515O375n317j396N352
$$ plain form
12031 1649 -6568 -2820 871 100 2710 1018 3318 4112 7338 12980 8693 -12501 -2796 1246 -2574
12016 -2574 1043 6123 1882 -990 4207 3952 11650 12238 5846 -2977 -12515 -19783 -12280 4233 14387
12001 14387 20300 13378 10737 -911 -650 15878 17532 25295 18160 10286 3143 -529 -1746 -565
11987 -565 -3979 -8590 -9569 2227 4663 4513 13327 17985 16988 11117 11526 16136 14855 13193 26139
11972 26139 14251 -6956 -13664 -3945 12076 3052 3730 5569 -1019 -1799 -15746 -17979 -10272 -6747
11958 -6747 719 1708 3457 1719 1317 3000 -328 -10311 -9181 -51 -3135 -14232 -16540 -8265 1619
11943 1619 -4297 -7915 -22089 -27645 -23053 -18236 -12642 -11929 4671 6470 -11323 -11901 287 13601
11929 13601 8808 -11032 -19562 -28744 -31036 -31217 -17812 -17929 -15598 3917 10292 4975 3579 8931
11915H931O321R94l72j2655m832J3498l099j4188m667m6m29J311Q138J024k896
11900b967o09J1254J738n237j5795M5J2201R200l936M294l791j057j5383m193
11886a4236L93Q399P173j5075r867j419J7617O922k393m122Q721N069l646K346
11872E882J0052j566j646j2817k176K382r271j4067J5635J5693M573N295j1893
11859F076j1839n626j17L689j357n524j2142M786Q20J2983P009q101o57j4481
11845b4481L12K2386Q632j3180l087k299q50N37L734k996J8010O996j1010n698
11831b994Q410k331m351Q103q766o563l599k253m936J3667J145J561Q344j1r128
11816c702k0573J428R484L447J7251K150q62k980j1783K108J2778J13q005m788
$$ plain form
11915 8931 15252 16246 15874 3219 -1613 11885 8786 -5402 -10069 -10115 -10544 -9233 -1095 -71 -2967
11900 -2967 -3576 7678 9416 4179 -11616 -11571 630 9830 5894 10188 6397 5340 -10043 -14236
11886 -14236 -13843 -5444 1729 -13346 -23213 -24632 -7015 -93 -2486 -6608 2113 7182 3536 5882
11872 5882 15934 14368 12722 -95 -2271 111 -9160 -23227 -7592 8101 12674 17969 6076
11859 6076 -5763 -11389 -11506 -7817 -9174 -14698 -26840 -22054 -21234 -8251 -1242 -9343 -10000 -24481
11845 -24481 -24169 -1783 6849 -6331 -9418 -11717 -12567 -12030 -8296 -11292 6718 13714 2704 -2994
11831 -2994 5416 3085 -1266 6837 -1929 -8492 -12091 -14344 -19280 -5613 -4468 -2907 5437 5426 -3702
11816 -3702 -24275 -22847 -13363 -9916 7335 9485 8623 5643 -6140 -4032 8746 8859 854 -3934
11802c934J0092k728j887O536n234n555L962J1929j252j1022J3025M854q16j0242
11788G728J172N685J387q041o73J2939m233j081p09j3037Q821j0885j7486Q882
11774i531J3961j1757j535J5693m817q502n748P035m511n516J94K993j0617L889
11760a8769N765j4633q699J5898Q502J8548L50p241j2909q606J1799J329k0285
11747b8951j193J1389J6630R84M04M504m092J798M2L540r683M255m096o933L482
11732g920m459n691P186J2014k826J758L143R539M484m847r247p378R533j4976
11718i687r837O484j077O409J3451M295j591n572R782o475k4139M673J1428k555
11704d411L445J8372J1110k194k1247j1668r296J0927J3571R64k389j18L588L349
$$ plain form
11802 -3934 6158 3430 1543 8079 2845 -2710 1252 13181 11929 907 13932 18786 17970 7728
11788 7728 8900 14585 15972 7931 7258 20197 15964 14883 14174 1137 9958 -927 -18413 -9531
11774 -9531 4430 -7327 -8862 6831 2014 -6488 -12236 -5201 -9712 -15228 -15034 -12041 -22658 -18769
11760 -18769 -13004 -27637 -36336 -20438 -11936 6612 6962 -279 -13188 -21794 -9995 -8666 -28951
11747 -28951 -30144 -18755 -2125 -1141 -737 3767 -325 1473 1515 5055 -4628 -373 -4469 -11402 -7920
11732 -7920 -12379 -18070 -10884 1130 -1696 62 3205 12744 17228 12381 3134 -4244 5289 -9687
11718 -9687 -19524 -13040 -14117 -7708 5743 10038 8447 2875 12657 6182 -17957 -13284 -1856 -4411
11704 -4411 -966 17406 28516 26322 5075 -6593 -15889 -4962 8609 9573 7184 7066 10654 14003
11690A4003j4008o602K478r962l446j2514P033n394L100L2210J6786m286j5526
11677C872j890J441J8440j4900k9757k512J1180J6623K361m077n05J0093Q395
11664A8764M897m542j1773l795q670o662J0773k627n798O292p410j4048J0892
11651a3707J951K545Q181M79N249R500R332N707l514p767r214j2046r892M42O583
11636f171K82P185n487M453o847J704J1885o951j2628m574l842J489Q579M78M612
11621e833r62O131J2102P146j4021l302q175p809p920Q507N318P690J386r846
11607i588l597Q151Q392r115p682l117l151L871P549K0963O610K996j0138j7859
11593e715j3743K787J981l621P36j433q314q586R639J3392Q040O190K295K1682
$$ plain form
11690 14003 -5 -6607 -4129 -14091 -17537 -30051 -23018 -28412 -25312 6898 23684 19398 3872
11677 3872 1982 3423 21863 6963 -22794 -25306 -14126 2497 4858 781 276 10369 18764
11664 18764 23661 19119 7346 3551 -5119 -11781 -1008 -3635 -9433 -3141 -10551 -24599 -13707
11651 -13707 -11756 -9211 -1030 -551 4698 14198 23530 29237 25723 17956 8742 -3304 -13196 -12754 -6171
11636 -6171 -5889 1296 -4191 262 -6585 -4881 7004 53 -12575 -17149 -20991 -19502 -10923 -10445 -5833
11621 -5833 -6795 -664 11438 18584 4563 1261 -6914 -14723 -22643 -14136 -8818 -1128 258 -9588
11607 -9588 -13185 -5034 3358 -5757 -13439 -16556 -19707 -15836 -8287 12676 19286 22282 12144 -5715
11593 -5715 -19458 -16671 -14690 -18311 -17575 -19008 -27322 -35908 -26269 -12877 -4837 1353 3648 25330
11579B5330J2556n974j4311j3487j448j5256J489l094k0785n134J2782N663m207
11566b5876J2827M790J2490p3n410k59O203k001p67l874k451J0434k14m056J1524
11551A3287J2040N972o878o87M513K47O307n065l891k0206j3495J2864O575j18
11537A1465P137L01n88q147n044L874Q404j1780j8745L760J0203k345m394K301
11523c598P43r237J1708J0533j4149K252k583p494M854P169J5000O58j1837M056
11509H075J6677L603j8196j111J7775J51k3496j5169r058N570O888K0258M639
11496A6606k0532r637K489J1417j415J0024K718O23M528k863M262P04j0671j0842
11482b589N308o667j711J1302P065O00o959l722n533j0117m147l631P215J4554
$$ plain form
11579 25330 37886 31912 17601 4114 2666 -12590 -11101 -14195 -34980 -40114 -27332 -21669 -25876
11566 -25876 -13049 -8259 4231 4158 -1252 -1511 4692 2691 1924 -1950 -4401 6033 5819 1763 13287
11551 13287 25327 31299 24421 23734 28247 28494 34801 29736 25845 5639 -7856 5008 11583 11465
11537 11465 18602 18903 18315 10168 5124 8998 17402 5622 -13123 -9363 840 -1505 -5899 -3598
11523 -3598 -2855 -12092 -384 10149 -4000 -1748 -4331 -11825 -6971 198 15198 15856 4019 8075
11509 8075 24752 28355 10159 9048 26823 26974 3478 -11691 -20749 -15179 -8291 11967 16606
11496 16606 -3926 -13563 -11074 343 -1072 8952 11670 12293 16821 13958 18220 18924 8253 -2589
11482 -2589 2719 -3948 -5659 5643 12708 13308 6349 2627 -2906 -13023 -17170 -20801 -13586 968
11468I68J2455P551K88k65j2392j5109k0361n715R665K7897R777j4008P818n180
11454C389j5342n107J069O493l18J5183J5835J7094K368j3493j9824r593j3686
11441a5932r643K605J220K967J0490J3356L738J1691p520j9458o288n323o26O730
11427a1993J309R241l542k868N612K903J0565j0803j0095J8356O999r880q108
11414b304m083K2875J5035o370l7555j3547K3178J6122N172p015r333Q796n600
11401E371r845n201J0632Q318K690n017j1270j0410Q338K522o406R328R15p746
11387g781K181j2591j1101o448J0857M356N890J9645J2810j938j1217j912k70
11374B481M416j754j1330l928j0418M840J3385J2206m274q696r256J638K639r278
$$ plain form
11468 968 13423 20974 21262 20997 8605 -6504 -26865 -32580 -22915 4982 14759 751 8569 3389
11454 3389 -11953 -17060 -15991 -9498 -9816 5367 21202 38296 40664 27171 7347 -2246 -15932
11441 -15932 -25575 -22970 -21750 -18783 -8293 5063 8801 20492 12972 -6486 -12774 -18097 -18723 -11993
11427 -11993 -10684 -1443 -4985 -7853 -2241 662 11227 424 -9671 8685 15684 5804 -2304
11414 -2304 -6387 16488 31523 25153 -12402 -25949 -2771 13351 18523 11508 2175 10971 5371
11401 5371 -4474 -9675 957 9275 11965 6948 -4322 -14732 -6394 -3872 -10278 -950 -35 -7781
11387 -7781 -5600 -18191 -29292 -35740 -24883 -20527 -14637 5008 17818 15880 4663 2751 2481
11374 2481 6897 5143 -6187 -10115 -20533 -15693 -2308 9898 5624 -3072 -12328 -10690 -8051 -17329
11360a7329N123L455J1142J1313r638m095j2307j1424M53R797J3239R925J886
11347A1540J216J48m843J602j3854j9907q952J5615K7653r378o700J88q78J3230
11333F680J4252j1591p599P093j0197j8939k948J1814J1604N149Q602P784P336
11320B9040j1946j5185j5550p537j839J0711P578J875L84r421q088J3208M92L052
11306c226K968j1559L79Q324J8572L119l754j386p918o155j0868j7861m345J0602
11292b3108P257R05J5505j029O874L312L386k199Q511J2276K124j4558o861j0884
11278A511k028J173O457P751n626M344J020j5741K285O491J214j584o746j4235
11264a3714N808N460J487J046o256K0840M268r516o529l400J1709J355o530N735
$$ plain form
11360 -17329 -12206 -8751 2391 13704 4066 -29 -12336 -23760 -23307 -13510 -271 9654 11540
11347 11540 12756 12904 8061 9663 -4191 -24098 -33050 -17435 10218 840 -5860 -5672 -6550 6680
11333 6680 20932 9341 1742 8835 -1362 -20301 -23249 -11435 169 5318 13920 21704 29040
11320 29040 17094 1909 -13641 -21178 -23017 -12306 -4728 -2853 -2469 -11890 -19978 -6770 -6278 -3226
11306 -3226 -258 -11817 -11438 -3114 15458 18577 14823 13437 5519 -636 -11504 -29365 -33710 -23108
11292 -23108 -15851 -14946 559 -470 6404 9716 13102 10903 19414 31690 33814 19256 12395 1511
11278 1511 -517 656 7113 14864 9238 13582 14602 -1139 1146 7637 8851 7267 521 -13714
11264 -13714 -7906 -2446 -959 87 -6169 14671 18939 9423 2894 -506 11203 12558 6028 11763
11250A1763r582q513K78P680R58k444j988j3133K356Q253o498k855J1674Q177
11236F126j60m233n524Q055R815o072j6705r070K156Q540P955o677m121J2092
11222B177P854R478j5660j2269m308q592R76Q105O622k087o76p008o126J6463
11208e051J5167J038j4886r764l469Q769N775K181j533o829K986m411r477J9745
11194B41J8312J0439q525j3374j4373j389Q972N349j0341o301J1633P334r99j6686
11180i708q206Q128K743O169R91Q686m056p536L51L245L420l242j1061o322R43
11165a5455O421O265j0002k729O672L980R426R098r004j992L94p999K465J2724
11151A0264O981j0671n063L601j3994L250J0066M061r47n876n52k976O591M524
$$ plain form
11250 11763 2181 -6332 -6054 1626 2584 140 -1848 -14981 -12625 -4372 -10870 -13725 -2051 6126
11236 6126 5966 1733 -3791 4264 14079 8007 -8698 -17768 -15612 -7072 883 -5794 -9915 2177
11222 2177 10031 19509 3849 -8420 -12728 -21320 -20344 -12239 -5617 -7704 -8380 -15388 -21514 -5051
11208 -5051 10116 11154 -3732 -13496 -16965 -8196 -2421 -240 -1773 -8602 -5616 -10027 -19504 241
11194 241 18553 28992 20467 7093 -7280 -8669 303 5652 -4689 -10990 643 7977 6978 -9708
11180 -9708 -17914 -9786 -7043 -874 117 8803 4747 -2789 -2438 807 4227 985 -10076 -16398 -15455
11165 -15455 -9034 -2769 -12771 -15500 -8828 -4848 4578 13676 4672 2680 3074 -4925 -2460 10264
11151 10264 17245 6574 1511 5112 -8882 -5632 4434 8495 7548 1672 1120 -1856 4735 9259
11137I259j7996j4141R771O449J6052K176j0863o729Q04Q363p651j4951o347k770
11123b8574l155J2467J9877J1423j3318j3712K046n048m455J6178J0586L786q731
11110f30j1032N71k60j064q666J484m241j1797K009J4873J5638Q121m028j4304
11096a3326o609J1015K4385O38j2916J0724Q545j4055j9199P723Q616N315p130
11083C726N22J3384q323j5600j0659J6621O909j1101m771J594J0112Q157M575
11070A5146j0445k273K431p366J1587O175j0921k3230l993J0765M442Q777j750
11057f55p338M15r66l173q166J368j9997j3796M675O076J0817J1523o83P225M059
11042h616l125q201o53N35P495N128J691N129J0822L535K750j119l580q900r035
$$ plain form
11137 9259 -8737 -22878 -13107 -6658 9394 11570 707 -6022 -5218 3145 -4506 -19457 -25804 -28574
11123 -28574 -31729 -19262 615 12038 -1280 -14992 -12946 -17994 -22449 -6271 4315 8101 -630
11110 -630 -11662 -11091 -11351 -12415 -21081 -19597 -23838 -35635 -33626 -18753 -3115 5006 978 -13326
11096 -13326 -19935 -8920 15465 16103 3187 13911 22456 8401 -10798 -3075 5541 10856 3726
11083 3726 4248 17632 9309 -6291 -16950 -329 6580 -4521 -9292 -7698 2414 10571 15146
11070 15146 4701 2428 4859 -2507 9080 15255 4334 -18896 -22889 -12124 -7682 1095 -655
11057 -655 -7993 -7578 -8544 -11717 -19883 -18515 -38512 -52308 -47633 -41557 -30740 -19217 -19900 -12675 -8616
11042 -8616 -11741 -19942 -20595 -20060 -12565 -7437 -5746 -617 10205 13740 16490 15371 11791 2891 -6144
11027f144L279K1756J014p265m936l199m120k769L98J8593J2400o543J133j439
11013B2158k278p248j887j205M46n876k803P264p246j834M651J431K392j0464
10999b499q408J740K426M587N572k692l534K282N007j1493m373j824L764O705
10985b740n746j094K397r520J2015J2174m597K406K305O59r686k895Q643P190
10971A1511p376m327L670J3683N074j0125j0195J0751R671j3192p443j0170K48
10958h220K941L399p417N000j301j1067m381j3006J0978J4482J7951N166p210
10945G315J073j128L461L805K621L540M407N34p758j4183n190n782P111O772r587
10930b989o846K943J6577J641L72J058n328l021q677r81J1688o623k0000J1027
$$ plain form
11027 -6144 -2865 18891 19905 12640 7704 4505 385 -2384 -1986 16607 29007 22464 23597 22158
11013 22158 19880 12632 10745 9540 9986 4110 1307 8571 1325 -509 4142 5573 7965 -2499
10999 -2499 -10907 -9167 -6741 -2154 3418 726 -2808 -526 4481 -7012 -11385 -13209 -9445 -2740
10985 -2740 -8486 -9580 -7183 -16703 -4688 7486 2889 5295 7600 8259 -1427 -4322 4321 11511
10971 11511 4135 -192 3478 17161 22235 12110 1915 12666 22337 9145 1702 -8468 -8220
10958 -8220 -5279 -1880 -9297 -4297 -5598 -16665 -21046 -34052 -23074 -8592 9359 14525 7315
10945 7315 8388 7260 10721 14526 17147 20687 25094 25628 17870 3687 -1503 -7285 -174 6598 -2989
10930 -2989 -9835 -6892 9685 11326 11698 12756 7428 4407 -4270 -5251 6437 -186 -20186 -9159
10916i159Q18L737J2095K431k335j2724o395J788N262Q293Q609k090k218l872
10902D240J380K306m517l885m108l590N512L68M17N59q313j051J9884J5555n125
10887A9632o600n830M324K677j362l051P457O311j7065j3950Q93L805j51m318
10873g228J1939p57N6J988n113j9111J524J920J3966r482r894K903N086J2167
10859c6j518r239n133J0534l217m99L860J329O498r609q322q866J3966J149L309
10844e794K560O096O958M857n716j988p748M92q257M759J0995q607o362m914Q190
10829d479M418q835K506K413m486K3R041o143o258j836O233n93j0323N825J0624
10814a870M233O021P15j0343J375l306m604M427R702J190j767p597j1503N445
$$ plain form
10916 -9159 -8341 -4604 7491 9922 7587 -5137 -11532 -9744 -4482 3811 12420 10330 8112 4240
10902 4240 5620 7926 3409 -476 -4584 -8174 -2662 -2294 -1877 -1318 -9631 -10682 9202 24757 19632
10887 19632 13032 7202 11526 14203 12841 9790 17247 23558 6493 -7457 -6564 -2759 -2910 -7228
10873 -7228 4711 3954 4010 5998 885 -18226 -16702 -14782 -816 -10298 -20192 -17289 -12203 -36
10859 -36 -1554 -10793 -15926 -5392 -8609 -9108 -5248 -3919 2579 -7030 -15352 -24218 -10252 -9103 -5794
10844 -5794 -3234 2862 9820 14677 8961 6973 -775 -283 -8540 -3781 7214 -1393 -7755 -12669 -4479
10829 -4479 -61 -8896 -6390 -3977 -8463 -8440 601 -5542 -11800 -13636 -7403 -7996 -18319 -12494 -1870
10814 -1870 2363 8384 9099 -1244 131 -3175 -7779 -3352 6350 7540 5773 -1824 -13327 -7882
10800g882j192j7769J396l333J2713l774L009J2691q198l937Q181k560J0136j0644
10786a1163j3080J3167J4622J153m45K0262M675k1400q500j239l386j564j7299
10773b4197r84J1016J8497K311j666O058P306j315j4888j989O730N413M746n719
10759A1319r916j7260K022o137j1748J1967K4036q574l980L417k468J040m995
10746a1277Q64j1142J0114N076p230J7190N644n003N52M104l760P486J224L868
10732A7710k767r715J472m209j1297L838N438L944k059j4645L296L72R448L950
10718D776j2300L84J1541M477j5080q681R173J4677P649m637N226P356q469L064
10704A9156M385p584p631k706J1799O878j6058j7379J652M757k119J25J0255n905
$$ plain form
10800 -7882 -9074 -26843 -25447 -28780 -16067 -19841 -16832 -4141 -12339 -16276 -8095 -10655 -519 -11163
10786 -11163 -24243 -11076 3546 4699 4254 24516 29191 7791 -709 -1948 -5334 -6898 -24197
10773 -24197 -25181 -14165 4332 6643 4977 11035 18341 17026 2138 149 6879 12292 17038 11319
10759 11319 1403 -15857 -13835 -19972 -31720 -19753 4283 -4291 -8271 -4854 -7322 -6282 -11277
10746 -11277 -10413 -21555 -11441 -6365 -13595 3595 9239 4236 4788 8892 5132 12618 13842 17710
10732 17710 14943 5228 6700 2491 -8806 -4968 470 4414 2355 -12290 -8994 -8622 826 4776
10718 4776 -7524 -7140 4401 8878 -6202 -14883 -5710 8967 16616 11979 17205 24561 16092 19156
10704 19156 23541 15957 8326 5620 17419 24297 8239 -9140 -7488 -2731 -4850 -4725 5530 -375
10690c75j396l513j331Q140J8009K322m608k0505n975J7635J4344r575q2l815
10676I275p251P20p445n611P257M271l163J0396l695r690j155j363N747N068Q821
10661A2182j6171L016n767j1625j582P371L104j658O544J1387L909J464l901o061
10647B212j153r864m874N944J682J4140j4337J881R976L239j952L468M225L03
10633A4890m254q153j6157j748J8239R441J0594O172r173k3027J287M730o599
10620c758J987J2734J582k0008m886M31Q511j4222L831J6311J1901o914o184K243
10606C559L277n984q269p64K4998J360p681l975M673j82o072J0162K724P65J5340
10591C3931O162o031j1619j2621r304q141J964K725J3463J6118k5071r644J1328
$$ plain form
10690 -375 -1771 -5284 -6615 1525 19534 21856 17248 -3257 -9232 8403 22747 13172 13090 9275
10676 9275 2024 2744 -4701 -10312 -3055 1216 -1947 8449 4754 -4936 -6091 -7454 -1707 3361 12182
10661 12182 -3989 -973 -6740 -18365 -19947 -12576 -9472 -11130 -4586 6801 10710 12174 8273 2212
10647 2212 1059 -8805 -13679 -7735 -6053 8087 -6250 -4369 5607 8846 6894 10362 14587 14890
10633 14890 10636 2483 -13674 -15422 2817 12258 22852 29024 19851 -3176 -1889 2841 -3758
10620 -3758 -1771 10963 12545 -7463 -12349 -11918 -3407 -17629 -13798 2513 14414 7500 1316 3559
10606 3559 6836 852 -7417 -8181 16817 18177 10496 6521 11194 11012 4940 15102 17826 18591 33931
10591 33931 40093 34062 22443 9822 518 -7623 -5659 -2934 10529 26647 1576 -8068 3260
10578C260J2050L276K599p167r275j0137O542J1325j459q541O363R180q823j2712
10564c519r855m710m968O245J3340O104M684k442k302p846j9024L017k301l0k89
10549b3896J2540J9426N428p319p744N228L220o907l723q98O417L398j5257r917
10535b0004o961m805J3595J5643k23J068N67J0791J2687q314m637l095p998n954
10521g640J1484J1372Q108n457j0159l166P852P610j3125P593L112l853k607L068
10507A4192q60j0957k784l479M662l171K499Q583M3j2791j5925J8R657P90M201
10492e322J9922O240o871j5361j837J2328J2852m576P053J0630l413j0244O61
10479B2062l321o200p775q365l531L182j12R921R596O926q630l657p447j2356
$$ plain form
10578 3260 15310 18586 21185 14018 4743 -5394 1148 12473 11014 2473 8836 18016 9193 -3519
10564 -3519 -13374 -18084 -23052 -16807 -3467 2637 7321 4879 2577 -5269 -24293 -21276 -23577 -23607 -23896
10549 -23896 -11356 8070 13498 6179 -1565 3663 6883 -24 -3747 -4645 1772 5170 -10087 -20004
10535 -20004 -26965 -31770 -18175 -2532 -2755 -1687 -1120 9671 22358 14044 9407 6312 -1686 -7640
10521 -7640 3844 15216 23324 17867 7708 4542 12394 20004 6879 14472 17584 13731 11124 14192
10507 14192 13332 2375 -409 -3888 774 -2397 102 8685 8728 -4063 -19988 -19970 -10313 -9523 -5322
10492 -5322 14600 20840 13969 -1392 -3229 9099 21951 17375 24428 35058 31645 21401 22062
10479 22062 18741 12541 4766 -3599 -7130 -3948 -4060 5861 15457 22383 13753 10096 2649 -9707
10465i707n757L667O18M032M941J1Q567J0931p36k25k505l278p237m981L033J7454
10449A8828o25j3166r66o809p729j3884O825O464O992J537q616o566K647m0n268
10434b0376j0771K046J0237R007m142P859L981Q139J4413N158j0584j1320m47
10421C200N602j864L89J7173J149j2952o504n829j3766l774M347J6440j561o876
10407d826l976k258q588M642J8104P74p2M76j97R147J427p412p875R23q271p01
10391h683m7M647K1294R800P023r034j4187j1721N475R697n261j961n151P361
10377I252l232K965l685L778Q953O863j1132q174J236O186Q39r583q222J765k930
10362e121J502j847r54J7889j044j1078o234n61p80O584Q731N413j6745j7307
$$ plain form
10465 -9707 -15464 -11797 -11179 -7147 -2206 -2195 6372 17303 16567 16342 13837 10559 3322 -1659 1374 18828
10449 18828 18203 5037 4071 -2738 -10467 -24351 -17526 -11062 -4070 -2533 -11149 -17715 -15068 -15108 -20376
10434 -20376 -31147 -29101 -18864 -9857 -13999 -6140 -2159 5980 20393 25551 14967 3647 3200
10421 3200 8802 6938 7327 24500 25649 12697 6193 364 -13402 -17176 -12829 3611 2050 -4826
10407 -4826 -8802 -11060 -19648 -15006 3098 3872 3800 4276 4079 13226 14653 7241 -634 289 -7982 -8683
10391 -8683 -8730 -4083 17211 27011 34034 25000 10813 -908 4567 14264 9003 7042 1891 9252
10377 9252 6020 8985 5300 9078 18031 24894 13762 5588 6824 13010 13849 4266 -3956 -2191 -5121
10362 -5121 -3619 -5466 -6420 11469 10425 -653 -6887 -7448 -8228 -1644 7087 12500 -4245 -21552
10348b1552j671R805P020K639J860j0867O831Q907K44m033j1025Q100J065j518
10334d195O411j515l303m470R30l210r282j1717k213K5808J0739o559J18J368
10320a090J0866l224M101k870K934l70J647k811p575J071R896O63p218j566k886
10305A568O48N829l554P50j479p916n445o351J443O830J6210Q461q111k434L85
10290F834m072RJ1394P816n340L84p017J512K230j2779l384J7914J7686p369r065
10275A6753n543j1669p283M187M658J1386j4266p679L950K777k165o770j111J7667
10261D892K284J541L104j488N049j0788r920J634J7367J37j1361Q115J1086N727
10247B7379j1124j8876L700N538Q727j1976j6778Q60R789O340K520N131N87j3089
$$ plain form
10348 -21552 -23223 -13418 -6398 -3759 -1899 -12766 -5935 2972 3216 -817 -11842 -3742 -2677 -4195
10334 -4195 2216 701 -2602 -7072 -6142 -9352 -18634 -30351 -32564 -6756 3983 -2576 -2458 -1090
10320 -1090 9776 6552 10653 7783 10717 10347 11994 9183 1608 2679 12575 13238 6020 4454 1568
10305 1568 2216 8045 4491 5241 3762 -4154 -9599 -15950 -14507 -7677 8533 16994 8883 6449 6834
10290 6834 2762 2771 14165 21981 16641 17025 10008 11520 13750 971 -2413 15501 33187 25818 16753
10275 16753 11210 -459 -7742 -3555 1103 12489 -1777 -9456 -5506 -2729 -4894 -11664 -12775 4892
10261 4892 7176 8717 11821 10333 15382 4594 -5326 -3692 13675 13812 2451 10566 21652 27379
10247 27379 16255 -2621 1079 6617 15344 3368 -13410 -12550 -2761 3579 6099 11230 11817 -1272
10233a272j1363J2130M781l969j0984j355P957Q265K452m507O380j754Q61p471
10219A51k870j990J0572O336l808L754J433n906q332O260k960J056J1229J3807
10205B8732M601j0129j7349o395J863N64l448n548P161m161o864n100M395J2504
10191H26r644j2259M83J4389K302l781P976R690M788j0615m421R333R251N67m06
10176A8479o617N069j2070q714N06J0752P289j4433k570L250K883p667n687L125
10162f405j2683P213J3922j0588P394L884q144K119q50L645K2924j0413l2404
10149b0386k095K7794M758m773l758R156J2380n425J8035J0338o691O120j9k17
10135D5217j2378N473m884m490o121K416j1062j5824j862R387l493m155J1287
$$ plain form
10233 -1272 -12635 -505 4276 307 -10677 -12032 -4075 4190 6642 2135 8515 6761 7622 151
10219 151 -2719 -4709 5863 12199 8391 12145 13578 7672 -660 5600 2640 3696 14925 28732
10205 28732 33333 23204 5855 -540 1323 1887 -1561 -7109 52 -4109 -10973 -16073 -11678 826
10191 826 -8818 -21077 -20594 -6205 -3903 -7684 292 9982 14770 4155 -266 9067 18318 18885 18479
10176 18479 11862 16931 4861 -3853 -3347 7405 14694 261 -2309 941 3824 -3843 -9530 -6405
10162 -6405 -19088 -11875 2047 -8541 -1147 2737 -5407 -3288 -4138 -493 22431 12018 -20386
10149 -20386 -22481 5313 10071 5298 1540 10696 23076 17651 35686 46024 39333 45453 45434 45217
10135 45217 32839 38312 33428 28938 22817 25233 14171 -1653 -3515 5872 2379 -1776 9511
10122I511m206m412p275P689M432P958J5342L802q578m865o684M998O354M08j4003
10107A0471j0020m997R137J87q168j29J1099L895P119n989O607J563m878j814
10093A4083m95j131j3215O243J3029J0811j0944R822m934j9053J3197J1226Q572
10080C7211J536j7673j8079L62o125K212J5837J8557K00j1462q953J6285j2768
10067A7140r813k25p653l8N413q838L408N504p675j759l962O056K622L779p756
10052c797K507j0420K128J4771P783l225j1696n35L344j0782q4M315J322J3586
10038I217J1564j74n899J1878J8732k133r659J509J1469o552j0389J480J0630
10025D1673k741J567n379n472m427J2982k882R98N995p498n695J1420M786J1734
$$ plain form
10122 9511 5305 893 -6382 1307 5739 13697 29039 32841 24263 19398 12714 17712 24066 24474 10471
10107 10471 451 -4546 4591 4778 -3390 -3519 7580 11475 18594 12605 19212 20775 15897 14083
10093 14083 13588 12457 -758 5485 18514 29325 18381 28203 23269 4216 17413 28639 37211
10080 37211 38747 21074 2995 3357 -2768 -556 15281 33838 34038 22576 13623 29908 17140
10067 17140 7327 7102 -551 -589 4824 -4014 -606 4898 -2777 -4536 -8498 -2442 180 3959 -3797
10052 -3797 -1290 -11710 -9582 5189 12972 9747 -1949 -2484 860 -9922 -10006 -5691 -4369 9217
10038 9217 20781 20607 14708 26586 45318 43185 33526 35035 46504 39952 29563 31043 41673
10025 41673 38932 40499 35120 29648 25221 38203 35321 36319 42314 34816 29121 40541 45327 57061
10011E7061m203o597N508M458r921j1492j481m686N797N300k292j1901J0350l324
9997C2577J4604J6457j5057o169L57k39k468P108Q983l739o175Q114J235m449
9983E1139m680j346l734k790N217J5843n564p634N008k687j7630m727J4375J8461
9969E9251k468m384L340M561l039N477M815K892M695K544L074k565j2673j1751
9955E3769m61P794K7440R634k0181j0031K3582J4122O212m104p00l115p460J262
9941I7763j095J3315L812M308M606P199P10r099J0971O594n167r713J6030K4172
9927A64406J3117l817M759O4J8999K1648P130J0353J1643J7486J0901J9170J8398
9914C14257J1695J9287L8731J9764N545K9554K2989L8513M6098L9650L6954M5385
$$ plain form
10011 57061 52858 46261 51769 56227 46306 34814 33333 28647 34444 39744 37452 25551 35901 32577
9997 32577 47181 63638 48581 42412 42769 42530 40062 47170 56153 52414 46239 54353 55588 51139
9983 51139 46459 45113 41379 38589 43806 59649 54085 46451 51459 48772 31142 26415 40790 59251
9969 59251 56783 52399 55739 60300 57261 62738 67553 70445 75140 77684 80758 78193 65520 53769
9955 53769 53308 61102 88542 98176 77995 67964 91546 105668 111880 107776 107076 103961 96501 97763
9941 97763 96668 109983 113795 118103 122709 129908 130618 121519 132490 139084 133917 124204 140234 164406
9927 164406 177523 173706 178465 178529 197528 219176 226306 236659 248302 265788 276689 295859 314257
9914 314257 325952 345239 383970 403734 409279 438833 461822 500335 546433 586083 623037 668422
9902F68422N4992P1096R4597R9980J04934J33450J59633K00041K47940L36256
9892B171341M19176N39031P12389R53070J254430J625051K064511K472753K551900
9883A4763652J908722M70555j145878k258341k595617k367567j916478j438464
9875E420584j054745q07984o16400m68846l68020k96598k32975k05567j73021
9866A196428j39524j16068r9823r2991p0350n8674n3055m8703l0229l9722m6167
9855D01122m7942l3323k5825q598l0074l6907j6853m387j4670o664o136r248r056
9842A51439j0039o861O26n431r795k0625J190k031K263j3251j1986j506J2445
9829H6438j870j2844J0971o27j6127j5110j370K050K955j4233k960l497m333N905
$$ plain form
9902 668422 723414 794510 889107 989087 1094021 1227471 1387104 1587145 1835085 2171341
9892 2171341 2590517 3129548 3841937 4795007 6049437 7674488 9738999 12211752 14763652
9883 14763652 16672374 17142929 15997051 13738710 11143093 8775526 6859048 5420584
9875 5420584 4365839 3557855 2941455 2472609 2104589 1807991 1575016 1369449 1196428
9866 1196428 1056904 940836 841013 748022 677672 618998 565943 517240 487011 447289 401122
9855 401122 353180 319857 294032 285434 255360 218453 201600 197213 182543 175879 169743 160495 151439
9842 151439 141400 134539 135165 129734 119939 99314 100504 98473 100736 87485 75499 73993 86438
9829 86438 84568 71724 82695 82068 65941 50831 49461 51511 54466 40233 37273 33776 29443 35348
9815C5348p204j5526O111O90m241m414r737L562J2978Q948K0555r558j5887j2442
9801I183k174j456R639Q410o098M05m332j1715j7981P480L318K260R073j4298
9787h286n690N204R117Q86K061J1767O052j902j3467j3584n827J1792O399j3784
9773i262p637M904L104K393L498M060P598K321Q599O582j0445o035j0185J557
9759A052Q547J3738o165j1251q24K575j2680O961K101j1203R60N493J646n439
9745d489o071P011J2918j11n12P57l599k733N214k227n201k456Q873J3174j179
9730A9369l331j522j2120l676l191l375J678m825J766j018k782N177o670r843
9716b4363m56N490J3611J218j911N248p787M242K226J1500k522n44Q862n124j3219
$$ plain form
9815 35348 28144 12618 18729 19419 15178 10764 1027 4589 17567 26515 47070 37512 21625 9183
9801 9183 7009 5553 15192 23602 17504 17909 13577 1862 -16119 -8639 -5321 -3061 6012 -8286
9787 -8286 -13976 -8772 345 1231 3292 15059 21111 19209 5742 -7842 -13669 -1877 4522 -9262
9773 -9262 -16899 -11995 -8891 -6498 -3000 1060 8658 10979 19578 26160 15715 9680 -505 1052
9759 1052 9599 23337 17172 5921 5097 7672 -5008 1953 4054 -7149 -6189 -696 950 -4489
9745 -4489 -10560 -3549 9369 9258 8746 9503 5904 3171 8385 6158 957 -1499 7374 20548 19369
9730 19369 16038 14516 2396 -1280 -4471 -7846 -6168 -10993 -9227 -10245 -13027 -7850 -14520 -24363
9716 -24363 -24819 -19329 -5718 -4500 -6411 -1163 -8950 -4708 -2482 9018 6496 5952 14814 9690 -3529
9701c529j993J2633J8830l951O36K336j689j2750J5744R297j562j9862l112Q831
9687A9859M02k918j7069j4840J4002L937Kp718j1427j311j854J2069R329P09q431
9672e259o102k2115k666J3961J3550M443J294K63j1072j5087L769J1024K595Q94
9658a0508o86l543l238r232J9323K3625L66J1243j8939k4486K516l15n173J0125
9644h922q161j0371Q130P516K673m701j1290O887P110J0272j0126L916p214m474
9630a8755J7973Q750L161o655L58o943o833R526P487j716j3717m194J150K3372
9616A2964M538O866j3122j9737j4861Q467P415J381Q678K914K326K84j0065K047
9602I5j1458j1383j354R495Q202L862o625M880m815N390p004q382J9943J4998
$$ plain form
9701 -3529 -5522 7111 25941 21990 22626 24962 23273 10523 26267 35564 34002 14140 11028 19859
9687 19859 20261 17343 274 -14566 -564 3373 3375 -4343 -15770 -17081 -18935 -6866 2463 3172 -5259
9672 -5259 -11361 -33476 -36142 -22181 -8631 -4188 -2894 -2631 -13703 -28790 -25021 -13997 -11402 -10508
9658 -10508 -11194 -14737 -17975 -27207 -7884 15741 16107 27350 8411 -16075 -13559 -13874 -19047 -8922
9644 -8922 -17083 -27454 -19324 -11808 -9135 -13836 -25126 -18239 -11129 -857 -10983 -7067 -14281 -18755
9630 -18755 -782 7968 11129 4474 4832 -2111 -8944 582 8069 6353 -7364 -11558 -10408 12964
9616 12964 17502 24368 11246 -8491 -23352 -14885 -7470 -6089 2589 5503 7829 8113 -1952 95
9602 95 -11363 -22746 -24100 -14605 -6403 -2541 -9166 -4286 -9101 -3711 -10715 -19097 846 15844
9588A5844l054n965r631m711R318J405q070j2090n142L88N875J622O055K348R930
9573D122m747N903J0447j1188R170Q750j2848l0554N942P834r645R792J4380Q090
9559A5448n330r000p43K933J242K890j447K23k089Q420p143m45P50m781P184L980
9543A2092p693n43q631J629L452R686l777p930l585R382P999m551J2116q415r883
9528A348r666j1838J3580J0431l399n227Q300l29r167K52J588n506l360O686k278
9513h585J297L743K376q332R415K734j1169j12O947Q040Q578K59N604l405k5795
9498h405n255J155J4667n462M268J2004J360j7673p797J1698K0673J3513P665
9485D2411l997k3392k5820k5805N60J0810M035M343j6223M969M548N50M430L035
$$ plain form
9588 15844 12790 6825 -2806 -7517 1801 3206 -4864 -16954 -22096 -21708 -15833 -14211 -8156 -5808 4122
9573 4122 -625 5278 15725 4537 13707 22457 9609 -20945 -15003 -7169 -16814 -7022 7358 15448
9559 15448 10118 1118 375 3308 4550 7440 5993 6216 4127 12547 5404 4959 5709 928 8112 12092
9543 12092 4399 3856 -4775 -3146 306 9992 6215 -1715 -5300 4082 12081 7530 19646 11231 1348
9528 1348 -8318 -20156 -6576 3855 456 -4771 3529 3200 -5967 -5715 -4127 -9633 -12993 -6307 -8585
9513 -8585 -7288 -3545 -1169 -9501 -86 2648 -8521 -8633 -1686 6354 14932 15191 20795 17390 -8405
9498 -8405 -13660 -12505 2162 -3300 968 12972 14332 -3341 -11138 560 21233 34746 42411
9485 42411 38414 15022 -10798 -36603 -36043 -25233 -21198 -16855 -33078 -28109 -23561 -23011 -18581 -15546
9471a5546l521K550j0907K548J3764O152j310j9329J1010J0003j408M014J4887
9458A2907n095j2396k732J4389j980j3530k912k539r149K234P25r04P615l952
9444a7319n615J1817P255M481Q498m501p31M923O744n719k148j3382L58N629Q090
9429H380M425M567J068j1158Q13n705j289n44j1070o804j531l300J0800P317O509
9414B478M00o05k853J261m10j5839l441N365r188J0586K5536M997p697N073M101
9399A9764o529n823n570n9n37O838J1550j1927p832o574m277R65k785j012n302
9384a9110Q015K526j3649j5082Q877K8033K989k899n602J068j846q221j2407l822
9370c1130J4345K060n661k891J0408Q099J1944k481n205q212K896m906J6j89K093
$$ plain form
9471 -15546 -19067 -16517 -27424 -24876 -11112 -4960 -6270 -25599 -14589 -4586 -5994 -1980 12907
9458 12907 7812 -4584 -7316 7073 5093 -8437 -11349 -13888 -23037 -20803 -20078 -20982 -13367 -17319
9444 -17319 -22934 -11117 -3862 619 9117 4616 3885 8808 15552 9833 7685 -5697 -5339 290 8380
9429 8380 12805 17372 18440 7282 8095 2390 1101 557 -10513 -17317 -18848 -22148 -11348 -4031 2478
9414 2478 2878 2273 -580 681 271 -15568 -19009 -13644 -22832 -12246 13290 18287 10590 15663 19764
9399 19764 13235 7412 1842 1783 1246 8084 19634 7707 -125 -6699 -10976 -10011 -12796 -13808 -19110
9384 -19110 -11095 -8569 -22218 -37300 -28423 -390 2599 -300 -5902 -4834 -6680 -14901 -27308 -31130
9370 -31130 -16785 -14725 -20386 -23277 -12869 -4770 7174 4693 -512 -8724 -5828 -10734 -10718 -10907 -8814
9355h814O028k83O220k931O276l384j3379j7774L046J0972J2666n546j0506q997
9341b6406K824P663o14J888R586R123m616M514K035j6468p001K566M892j197J4466
9326C255P711l828J675p507o456o255l901P819M989n971M068Q135l2n960j4728
9311a6986M576o809l968N614R83n686K650O873L280P811p609r12O429K900N177
9296D323O469j658P00l458r592p703r235p43n943o711K6748J2066P590O72k5240
9281a1715j4837k813P172m422J8058K798J039R403J645J988l726K148j3223j1368
9267a7853Q20O438R162M644k3346j1795n625Q012O522j815l021P138L793N615
9253a1311L336K4K561M520j451j0385L364O50o521P017N383Q955J430r973q631
$$ plain form
9355 -8814 -2786 -3069 3151 220 6496 3112 -10267 -28041 -24995 -14023 -1357 -6903 -17409 -26406
9341 -26406 -23582 -15919 -16533 -14645 -5059 4064 -552 3962 5997 -10471 -17472 -14906 -10014 -11211 3255
9326 3255 10966 7138 8813 1306 -5150 -11405 -15306 -7487 -2498 -8469 -4401 3734 3702 -2258 -16986
9311 -16986 -12410 -19219 -23187 -17573 -16590 -22276 -19626 -12753 -9473 -1662 -9271 -10183 -3754 -854 4323
9296 4323 10792 9134 9834 6376 -3216 -10919 -20154 -20897 -26840 -33551 -6803 5263 12853 13525 -11715
9281 -11715 -26552 -29365 -22193 -26615 -8557 -5759 -4720 4683 6328 8316 4590 6738 -6485 -17853
9267 -17853 -17033 -10595 -1433 3211 -20135 -31930 -37555 -29543 -23021 -24836 -27857 -20719 -16926 -11311
9253 -11311 -7975 -7951 -5390 -870 -2321 -12706 -9342 -8692 -15213 -8196 -2813 6142 7572 -2401 -11032
9238a1032L139P996L602o98m567L606K379Q056M072j6072j1706J2465P516O99
9224I455O08k395o106j5154m562M922n397l912K4094n379m616J1754J1765L692
9210A8769k2986j8174R273J4808o530p822M047n04m70j5753l85M942q245Q484
9196b0546N200J0467m35j0997m240N063N425k530l216J902P894J1125K217p293
9182C6j661n64P992L257L768R727R164K155j1077o51k465l898r215J162o97r391
9166b358j1916n852k452O223N982j201m667N176Q321n333N08o376M208K524j507
9151h720R252L930L341K49o771N35j0240J899O772l175K70L564m621k0096l275
9136b7086j136n144J0471J7415o318r231J1453K0868M337O346L829j6557j5048
$$ plain form
9238 -11032 -7893 103 3705 3007 -1560 2046 4425 12481 16553 481 -11225 1240 8756 9455
9224 9455 10063 7668 1562 -13592 -18154 -13232 -18629 -22541 1553 -3826 -8442 3312 15077 18769
9210 18769 -4217 -22391 -13118 1690 -4840 -12662 -8615 -9119 -9589 -25342 -25727 -20785 -29030 -20546
9196 -20546 -15346 -4879 -5314 -16311 -20551 -15488 -10063 -12593 -15809 -13907 -6013 5112 7329 36
9182 36 -1625 -2189 5803 9060 12828 22555 31719 33874 22797 22146 19681 15783 6568 7730 7033 -2358
9166 -2358 -14274 -20126 -22578 -16355 -10373 -11574 -16241 -11065 -2744 -8077 -7569 -13945 -9737 -7213 -8720
9151 -8720 532 4462 7803 8052 1281 1816 -8424 -6525 247 -2928 -2658 906 -3715 -23811 -27086
9136 -27086 -28222 -33366 -22895 -5480 -11798 -21029 -9576 11292 15629 21975 25804 9247 -5801
9123e801p295n237l271L053M987J1612J962j2579l842K098k180K72J6599J3544
9109A3922j6083j3763k102J2259J0664o533p446J0359K191M520n87r463O907o165
9095a320O141O08O86O759q582j0355K227Q828P507j3739j3682J988O300Q328J3462
9080A5156Q280J1085K201j9044j3985p331J994R208m142K958j2805m664N359Q113
9066B383m619k865k916K956J044n803o865O294L391P578M619q84K364O499O187
9051A9363L15j1078L435j026k936R031o4j4275n010J1756J0647J918o991j4438
9037F47N05j082J559P40k764N731j355k741j325K042P744j2402K75k263M358N178
9021D847r331p600Q724R110O24o995N0K487n595Q508n63n605j0737p688J414o475
$$ plain form
9123 -5801 -13096 -18333 -21604 -18551 -13564 -1952 10 -12569 -16411 -14313 -16493 -16221 378 13922
9109 13922 -2161 -15924 -18026 -5767 4897 -1636 -9082 1277 3468 7988 7401 -2062 4845 -1320
9095 -1320 4821 5429 6115 12874 4292 -6063 -3836 4992 12499 -1240 -14922 -12934 -6634 1694 15156
9080 15156 23436 34521 36722 17678 3693 -3638 -1644 7564 3422 6380 -6425 -11089 -5730 2383
9066 2383 -2236 -5101 -8017 -5061 -4017 -9820 -16685 -10391 -7000 578 5197 4313 6677 13176 19363
9051 19363 19678 8600 12035 11009 8073 17104 17040 2765 -2245 9511 20158 22076 15085 647
9037 647 1152 70 1629 2369 -395 5336 3981 1240 -85 1957 9701 -2701 -2426 -4689 -331 4847
9021 4847 -4484 -12084 -3360 5750 6374 -621 -571 1916 -3679 4829 4266 -1339 -12076 -19764 -18350 -24825
9005b4825O910J273K824M436n089j159j880N463J0068l283o652m575J5968L382
8991B861o077n413o284n594K719O159J5447J1126P032p569m765k076m123n720
8977b277l983n772k998m937j295J2590O965k224N298K006J506o394j266j1807
8963a4588N251k709q180K247O609j537J292P713o044l440P623J0737O839j2505
8949f92j2598k094r627O807J5109K099q085J080J6050j627k379O7O579n698l33
8934D658J5977J1035j3651j4575p805l327q668q475N10j4910k711P400L050Q603
8920b2889P27p184K612q10K957P073N547j547k189N072J1662M284R629k251o341
8905F352j445N58m316P092R579p111o829k869j5733M893K819Q781P604o586j4369
$$ plain form
9005 -24825 -17915 -16642 -13818 -9382 -14471 -15630 -17510 -12047 -1979 -5262 -11914 -16489 -521 2861
8991 2861 -3216 -8629 -14913 -20507 -17788 -11629 3818 14944 21976 14407 9642 7566 3443 -2277
8977 -2277 -6260 -12032 -15030 -19967 -21262 -8672 -1707 -3931 1367 3373 4879 -1515 -2781 -14588
8963 -14588 -9337 -12046 -20226 -17979 -11370 -12907 -11615 -3902 -9946 -13386 -5763 4974 11813 -692
8949 -692 -13290 -15384 -25011 -18204 -3095 -996 -9081 -8001 8049 6422 4043 4110 10689 4991 4658
8934 4658 20635 31670 18019 3444 -4361 -7688 -16356 -24831 -24321 -39231 -41942 -34542 -31492 -22889
8920 -22889 -22162 -29346 -26734 -27544 -24587 -17514 -11967 -13514 -15703 -10631 1031 5315 14944 12693 6352
8905 6352 4907 5465 1149 8241 17820 10709 3880 1011 -14722 -9829 -7010 1771 9375 2789 -11580
8890a1580j0437p36J1921L84R807O969n404q336k843j5824j1053n042L220J9058
8876a9896K2396j453l047l274J0100j310K784J16k609r002l712M308J8606J0077
8862B4084k071m806R52j8820j6600Q144J8593p020K858k329r179l507J2337j372
8848A264j3741j797j1572Q131J7335K589J009o581k926m647r948J3835L770j0532
8834a3811j0727l80m062L780J0811K816j0445j422N701J2925k499j0921q53n020
8820b4107r409O731J2459k6n658R864Q182J6174J7425Q356j904r348l073j1345
8806A4321q541J128q161K574R179l976j309K4542M067j8742k5036j2496J0264
8793a2186J0110O900m5p716r344J5221P32K651r295j56r973L566J308M704R320
$$ plain form
8890 -11580 -22017 -22753 -10832 -10448 -641 6328 924 -7412 -10255 -26079 -37132 -42174 -38954 -19896
8876 -19896 2500 1047 -2000 -5274 4826 3516 6300 6416 3807 -5195 -8907 -4599 14007 24084
8862 24084 22013 17207 18159 -661 -17261 -9117 9476 2456 5314 2985 -6194 -9701 2636 1264
8848 1264 -12477 -14274 -25846 -17715 -380 2209 3218 -3363 -6289 -10936 -20884 -7049 -3279 -13811
8834 -13811 -24538 -24918 -28980 -25200 -14389 -11573 -22018 -23440 -17739 -4814 -7313 -18234 -19087 -24107
8820 -24107 -33516 -26785 -14326 -14352 -20010 -10146 -1964 14210 31635 39991 38087 28739 25666 14321
8806 14321 5780 6908 -1253 1321 10500 6524 5215 29757 33824 15082 -9954 -22450 -12186
8793 -12186 -2076 4824 4779 -2937 -12281 2940 3672 6323 -2972 -3128 -13101 -9535 -8227 -3523 5797
8778E797n002j0538P372Q469L387p255j0232k143N074m48J252l93J2712o75j4937
8763g560k783m385r745p472P854J3355J3430R944J0606R295n160o405r218L793
8749A5549o355K018J168j7260O836O493J064l097j2437L322J3453j3737j0867
8736a3850l926n547j424J5588p797k940N037P839j165R199J1066R819K27j1957
8722A0169m86P791l933l030k251k197K891L782M35P193k0946r572J3636J3851
8708A7333q570j4250K537l855J0733Q234p518m031o676L297j251j660k726r674
8694a8077L808J0151R736K487m253m483q561l942J109K781q29m85J6746R289j5781
8679c04J2421j342l450j2118j078p205K831k217K298L484L344n258P444R84P928
$$ plain form
8778 5797 795 -9743 -2371 6098 9485 2230 -8002 -10145 -5071 -5519 -4267 -4660 8052 7377 -7560
8763 -7560 -10343 -14728 -24473 -31945 -24091 -10736 2694 12638 23244 32539 27379 20974 11756 15549
8749 15549 9194 11212 12380 -4880 1956 8449 9513 6416 -6021 -2699 10754 -2983 -13850
8736 -13850 -17776 -23323 -24747 -9159 -16956 -19896 -14859 -7020 -8185 1014 12080 21899 22126 10169
8722 10169 9683 17474 13541 10511 8260 6063 8954 12736 13171 20364 -582 -10154 3482 17333
8708 17333 8763 -5487 -2950 -6805 3928 12162 4644 613 -6063 -2766 -4017 -5677 -8403 -18077
8694 -18077 -14269 -4118 5618 8105 3852 -631 -9192 -13134 -12025 -9244 -10073 -10558 6188 15477 -304
8679 -304 12117 10775 7325 -4793 -5871 -13076 -10245 -12462 -10164 -6680 -3336 -8594 -1150 -166 7762
8664G762P59J116r63l647j151o997Q489O450j5114r106M326k498k0078J0741N724
8649a4187r756R056R033k419n011m260L415Q540L303J0767M667l843l013m709
8635A583m044R14K757m504q699q624k09J7567P054r736O097K1383J4667N275j7247
8620B4234j9280Q8J6571R080k7O294J703k675j2104j3438J8236l698r09j0333
8606A3742k8l06J476n436p063J1972J8212q495k1817p735R586J69k573M684Q611
8591A4999O019m366n019M06Q920L568N441m902J039M785r111j4245j0199J172
8577a493l710j787K884O652j962M313m91L705j967j2287L77O615L614j1315L046
8562c806O932r673j2387M387J5693o070O449J3543r64j4484O5L995K345j0935
$$ plain form
8664 7762 8521 9637 8674 5027 3876 -3121 5368 11818 -3296 -12402 -8076 -10574 -30652 -19911 -14187
8649 -14187 -23943 -14887 -5854 -8273 -13284 -17544 -14129 -5589 -2286 8481 13148 9305 6292 1583
8635 1583 -2461 -1547 1210 -3294 -11993 -20617 -20826 -3259 3795 -5941 156 21539 36206 41481 24234
8620 24234 4954 5042 21613 30693 30666 36960 38663 35988 23884 10446 28682 24984 24075 13742
8606 13742 13714 13408 14884 9448 2385 14357 32569 24074 2257 -5478 4108 4277 1704 6388 14999
8591 14999 21018 16652 11633 12039 20959 24527 29968 25066 26105 30890 21779 7534 -2665 -1493
8577 -1493 -5203 -6990 -4106 2546 584 4897 4406 8111 6144 -6143 -5766 849 4463 -6852 -3806
8562 -3806 3126 -6547 -18934 -14547 1146 -4924 1525 15068 14104 -380 -315 3680 6025 -4910
8548d910j0573p188J1884j9640n446J0677J0555J1530R69O2J2398L476q553K169
8534G410k649O810j70l965q133j31O615l14j7759j7099o136K152L097K607K4638
8519c027R337j4666M857j0059M771k183r25k709J3805K2416l082l127Q746m961
8505A9193M742j1385j993r334K0541Q475j9409j3830k3186L703N176Q289j2098
8492b1116k390n60J3168K5126J1506k091l713K420n4K463k442m687L806R32k1624
8477G44l117l19l070L423j1652q589j1147L926m151K640J2689J8412J1157P68
8463A1714j03N38L0J2922j171j2070j1671J9933n528j4937k295P241L375o047
8449A931K46J15l427l762N763J3493J1960p603j646j3864n986P364M135j1290
$$ plain form
8548 -4910 -15483 -22671 -10787 -30427 -35873 -25196 -14641 -3111 -2142 -2080 10318 13794 5241 7410
8534 7410 4761 11571 11401 7436 -697 -828 5787 5473 -12286 -29385 -35521 -33369 -30272 -27665 -3027
8519 -3027 6310 -8356 -3499 -13558 -8787 -10970 -11895 -14604 -799 21617 18535 15408 24154 19193
8505 19193 23935 12550 10557 1223 21764 30239 10830 -3000 -26186 -22483 -17307 -9018 -21116
8492 -21116 -23506 -24066 -10898 14228 25734 23643 19930 22350 22296 24759 22317 17630 21436 22368 744
8477 744 -2373 -2692 -5762 -2339 -13991 -22580 -33727 -29801 -33952 -31312 -18623 -211 10946 11714
8463 11714 11611 12149 12179 25101 23930 11860 189 20122 14594 -343 -2638 4603 7978 1931
8449 1931 2177 2292 -1135 -4897 866 14359 26319 18716 17070 3206 -2780 4584 8719 -2571
8435b571M158N38L793M197M802l082o026j018q59J86q716n484k799j2338P319
8420a7900J4395o053l048M638R52N517Q645O562o527j0993L089p060q479Q190
8406h072J5000J0069J1533M15k237j5024q041l151k567M258M245O45o600J98N554
8391F225m1p632J1918Q235J456j3858J638o39M161R897J1214r226j4267L505o307
8376F279j782o946Q623J8336n452k417l098n015j0668J2801Q69q885l236J2815
8362A2224j304P669j89j6436k912M1n142q628o88J9765J2800p490j339R857n363
8347A2865j2971m876N167j95o243l602O449M462k806R299l549J102q599K243N48
8332g06l814k788q751J6171J0831M573j1578j6623Q817P634p429M19K63j0204
$$ plain form
8435 -2571 1587 2125 5918 10115 14917 11835 5809 4791 3932 4118 -4598 -10082 -12881 -25219 -17900
8420 -17900 -3505 -9558 -12606 -7968 -7016 -1499 7146 13708 7181 -3812 -723 -7783 -16262 -8072
8406 -8072 6928 16997 28530 28945 26708 11684 3643 492 -2075 2183 6428 7073 473 671 6225
8391 6225 6184 -1448 10470 18705 20161 6303 7941 7302 11463 21360 32574 23348 9081 12586 6279
8376 6279 4497 -2449 6174 24510 19058 16641 13543 8528 -2140 10661 11530 2645 -591 12224
8362 12224 10920 18589 18400 1964 -948 -907 -6049 -14677 -15365 4400 17200 9710 8371 18228 12865
8347 12865 -106 -4982 185 -10 -6253 -9855 -3406 1056 -1750 7549 4000 5102 -3497 -1254 -706
8332 -706 -4520 -7308 -16059 112 10943 15516 3938 -12685 -3868 3766 -3663 -3244 -2981 -13185
8318a3185M78O081K466K765P152K3760n55j0817r021j508k375N881O145m321j6749
8303c803j3045J2931K6206O135k284L753j5829j0582k654O809M748j4570k085
8290d270O185N615o595j1729J677j058q234j271J5210J0495N269M429m790Q181
8276A9114j2830j8947P68M357J3313Q937j8968r698k528P329N429O85P07M260
8262A928m794j6329P390J4470j1650q267m311R3J9082K680P995j3176r66J0461
8248D606n359p093p706K980J956R592P698j9549n653P354J246L079J4609m049
8234C711q612J0369K0190n533m373k308j0029j5606J9055m103k5156l578J9642
8221f331Q302j738Q637l491j3323j5363J2483J1844m904m303o838m155J1237J5959
$$ plain form
8318 -13185 -12707 -6626 -4160 -1395 5757 29517 28962 18145 9124 7616 5241 11122 17267 12946 -3803
8303 -3803 -16848 -3917 22289 28424 26140 29893 14064 3482 828 7637 12385 -2185 -4270
8290 -4270 1915 7530 935 -10794 -9117 -10175 -18409 -19680 -4470 6025 11294 15723 10933 19114
8276 19114 6284 -12663 -11895 -7538 5775 14712 -4256 -13954 -16482 -9153 -3724 -3039 -2332 1928
8262 1928 -2866 -19195 -11805 2665 -8985 -17252 -21563 -21470 -2388 292 8287 -4889 -5855 4606
8248 4606 -753 -7846 -15552 -12572 -10616 -1024 6674 -12875 -18528 -11174 -9928 -6849 7760 3711
8234 3711 -4901 5468 25658 20125 15752 13444 3415 -12191 6864 2761 -22395 -25973 -6331
8221 -6331 1971 233 8870 5379 -7944 -23307 -10824 1020 -3884 -8187 -15025 -19180 -7943 8016
8207H016O116k106K936J254k610l11P82j1913l624O059n988r412J573M97R868
8192A137K939R16K2631J2339k1893j0411j648j142O259j0174L60N652J833l261
8178E537l217j810o715r441M547O309K247l475q802J600J3445J1228R975K796
8164B4224Q4j9457p237r2j1767l247k446k421J5732l729r201J1916J6217p062
8150A514o615R170j61o662J3607O438J0842q189j8400j0796j962M373K695p979
8136a2125j3198N188m032P680O206P923L232l842n088m383P340l338p081o026
8122b1544R855K1641Q053o672n342N00r679N317l240j719J194p695j1807J0421
8108a0717J9742p42J064n622M272R991j0883k3660r420O045K946K2452J4505r031
$$ plain form
8207 8016 14132 12026 14962 16216 13606 13295 14077 2164 -1460 4599 -1389 -10801 -9228 -8731 1137
8192 1137 4076 4992 27623 39962 18069 7658 6010 4868 11127 953 1313 6965 8798 5537
8178 5537 2320 510 -6205 -15646 -11099 -4790 -2543 -6018 -14820 -13220 225 11453 21428 24224
8164 24224 24308 4851 -2386 -2478 -14245 -17492 -19938 -22359 -6627 -10356 -19557 -7641 8576 1514
8150 1514 -5101 4069 3908 -2754 10853 17291 28133 19944 1544 -9252 -11214 -6841 -4146 -12125
8136 -12125 -25323 -20135 -24167 -16487 -10281 -2358 874 -2968 -8056 -12439 -5099 -8437 -15518 -21544
8122 -21544 -11689 9952 18005 11333 5991 6491 -3188 2129 -1111 -2830 -1636 -9331 -21138 -10717
8108 -10717 9025 8283 9347 3725 7997 17988 7105 -16555 -25975 -19930 -16984 5468 19973 10942
8094A0942L290J8806l617j5408j2780q13J367J459j0799q263k141p493K104Q7
8080b3259Q56m371Q703R459P202j320J257Q899P248k651J1407j1339j1200m386
8066c495K685P373M454L481m388j3250j8421L196J1022m658j2225J409J6112R419
8052B714J181O513J100N548j649r657j2656j1256J009J7958J2149j598m553n858
8038I45q875m40Q322k595K355J2542j1200q294K929K316j572l377P518k638l285
8023e349M083j8572J3757J2597P71K128n230J5454q195l080K288p6L213j57j9379
8008e747j8283k37J5451M670P769R320L108L211l496r782j949O407j060J222q515
7993B089p175N051J1206L310J985L113q786o187L082N986l37l818j534P966k155
$$ plain form
8094 10942 14232 33038 29421 14013 1233 420 1787 3246 -7553 -15816 -17957 -25450 -23346 -23259
8080 -23259 -22403 -26774 -18071 -8612 -1410 -2730 -1473 7426 14674 12023 23430 12091 891 -3495
8066 -3495 -810 6563 11017 14498 10110 -3140 -21561 -18365 -7343 -12001 -24226 -22817 -6705 2714
8052 2714 3895 10408 11508 17056 15407 5750 -6906 -18162 -17153 805 12954 11356 6803 945
8038 945 -7930 -8370 -48 -2643 -288 12254 1054 -7240 -4311 -1995 -3567 -6944 574 -2064 -5349
8023 -5349 -1266 -19838 -6081 6516 7287 9415 4185 19639 11444 8364 10652 10576 13789 13632 -5747
8008 -5747 -24030 -24267 -8816 -4146 3623 12943 16051 19262 15766 5984 4035 10442 9382 10604 2089
7993 2089 -5086 -35 11171 14481 16466 19579 10793 4606 7688 13674 13337 9519 7985 15951 13796
7978A3796M067J2332O929j349k852j0365j1326p673K23n814r7m27M597J8J313
7963C372K78R0P076N540p924J607n092j440J041O90j518M335m987P887J417j6011
7947c639R905J4113K211j3108j5555k94q974L219J033q099L926K253j689J951
7933a2747J3101J1778n999k354j3430n392o34l33J9774P27r349L98L682M5J1006
$$ plain form
7978 13796 17863 30195 37124 35775 32923 22558 11232 3559 3782 -2032 -2129 -2556 2041 2059 3372
7963 3372 3650 3740 10816 16356 8432 10039 4947 3507 4548 5238 3720 8055 3068 10955 12372 -3639
7947 -3639 6266 20379 22590 9482 -6073 -6367 -15341 -12122 -11089 -19188 -15262 -13009 -14698 -12747
7933 -12747 354 12132 6133 3779 -9651 -15043 -15677 -16010 3764 4491 -4858 -4460 -778 -733 10273
$$ [...]
##END NTUPLES=NMR SPECTRUM
##END=
