##TITLE=Analysis number 324553
Compound Code sb 01386
Project Code adrs
Chemist Name stores
##JCAMPDX= 6.0         $$ Bruker NMR JCAMP-DX V2.0
##DATA TYPE= NMR SPECTRUM
##DATA CLASS= NTUPLES
##ORIGIN= Bruker BioSpin GmbH
##OWNER= nmr
$$ XWIN-NMR		Version 3.5
$$ Fri Nov 24 13:46:39 2006 GMT Standard Time (UT+0h)  MAYBRIDGE\nmr@NMR_250MHZ
##.OBSERVE FREQUENCY= 250.131544655141
##.OBSERVE NUCLEUS= ^1H
##.ACQUISITION MODE= SIMULTANEOUS (DQD)
##.ACQUISITION SCHEME= undefined
##.AVERAGES= 16
##.DIGITISER RES= 18
##SPECTROMETER/DATA SYSTEM= dpx250
##.PULSE SEQUENCE= zg30
##.SOLVENT NAME= CDCl3
##.SHIFT REFERENCE= (INTERNAL, CDCl3, 0, 16.522)
##AUDIT TRAIL= $$ (NUMBER, WHEN, WHO, WHERE, WHAT)
$$ ##TITLE= Audit trail, XWIN-NMR		Version 3.5
$$ ##JCAMPDX= 5.01
$$ ##ORIGIN= Bruker BioSpin GmbH
$$ ##OWNER= nmr
$$ C:\u/data/dgb/nmr/ADRS/1080/pdata/1/auditp.txt
$$ ##AUDIT TRAIL=  $$ (NUMBER, WHEN, WHO, WHERE, WHAT)
(   1,<2006-11-24 13:45:48.34 +000>,<MAYBRIDGE\nmr>,<NMR_250MHZ>,
      <created by zg, POWCHK disabled, PULCHK disabled
       configuration hash MD5:
       49 4B E0 1D 92 C2 6B 37 9F E6 65 BC 52 41 86 1D
       data hash MD5: 64K
       5C 13 05 4A B3 AA 75 E6 D8 05 EF 45 93 31 97 98>)
(   2,<2006-11-24 13:46:11.13 +000>,<MAYBRIDGE\nmr>,<NMR_250MHZ>,
      <Start of raw data processing
       ef LB = 0.3 FT_mod = 6 PKNL = 1 SI = 32K 
       data hash MD5: 32K
       C6 3B 7C C2 E3 6E 3F B9 54 83 FD BA 48 21 E8 FC>)
(   3,<2006-11-24 13:46:16.25 +000>,<MAYBRIDGE\nmr>,<NMR_250MHZ>,
      <apk 
       data hash MD5: 32K
       25 89 5E CD EF 5B F2 C5 54 16 7B FB 8D 7D E4 00>)
(   4,<2006-11-24 13:46:17.80 +000>,<MAYBRIDGE\nmr>,<NMR_250MHZ>,
      <abs ABSG = 5 
       data hash MD5: 32K
       00 66 72 D4 25 6B BD 79 AC 99 DF AE 8F 71 35 B1>)
$$ ##END=
$$ 
$$ hash MD5
$$ FC 23 83 3A D3 5F DC 1C 3B FE AB 08 7C 8A CE 69
##$RELAX= 
##$RELAX= 
##$RELAX= 
##$RELAX= 
##$RELAX= 
##$RELAX= 
##$RELAX= 
$$ Bruker specific parameters
$$ --------------------------
##$DU= <C:\u>
##$EXPNO= 1080
##$NAME= <ADRS>
##$PROCNO= 1
##$TYPE= <nmr>
##$USER= <dgb>
##$AMP= (0..31)
100 100 100 100 100 100 100 100 100 100 100 100 100 100 100 100 100 100 
100 100 100 100 100 100 100 100 100 100 100 100 100 100 
##$AQSEQ= 0
##$AQ_mod= 3
##$AUNM= <au_zg>
##$AUTOPOS= <55 >
##$BF1= 250.13
##$BF2= 250.13
##$BF3= 250.13
##$BF4= 250.13
##$BF5= 500.13
##$BF6= 500.13
##$BF7= 500.13
##$BF8= 500.13
##$BYTORDA= 1
##$CFDGTYP= 0
##$CFRGTYP= 5
##$CHEMSTR= <none>
##$CNST= (0..31)
1 1 145 1 1 1 1 1 1 1 1 1 1 1 1 1 1 1 1 1 1 1 1 1 1 1 1 1 1 1 1 1 
##$CPDPRG= <>
##$CPDPRG1= <>
##$CPDPRG2= <>
##$CPDPRG3= <>
##$CPDPRG4= <mlev>
##$CPDPRG5= <mlev>
##$CPDPRG6= <mlev>
##$CPDPRG7= <mlev>
##$CPDPRG8= <mlev>
##$CPDPRGB= <>
##$CPDPRGT= <>
##$D= (0..31)
0 1 0 0 0 0 0 0 0 0.06 0 0 0 0 0 0 0.0002 0 0 0 0 0 0 0 0 0 0 0 0 0 0 
0 
##$DATE= 1164375945
##$DBL= (0..7)
120 120 120 120 120 120 120 120 
##$DBP= (0..7)
150 150 150 150 150 150 150 150 
##$DBP07= 0
##$DBPNAM0= <>
##$DBPNAM1= <>
##$DBPNAM2= <>
$$ [...]
##$SUBNAM7= <"">
##$SUBNAM8= <"">
##$SUBNAM9= <"">
##$SW= 20.6930455092707
##$SWIBOX= (0..15)
0 0 3 0 0 0 0 0 0 0 0 0 0 0 0 0 
##$SW_h= 5175.983436853
##$TD= 65536
##$TD0= 1
##$TE= 295.16
##$TE2= 300
##$TE3= 300
##$TEG= 300
##$TL= (0..7)
0 120 120 120 120 120 120 120 
##$TP= (0..7)
150 150 150 150 150 150 150 150 
##$TP07= 0
##$TPNAME0= <>
##$TPNAME1= <>
##$TPNAME2= <>
##$TPNAME3= <>
##$TPNAME4= <>
##$TPNAME5= <>
##$TPNAME6= <>
##$TPNAME7= <>
##$TPOAL= (0..7)
0.5 0.5 0.5 0.5 0.5 0.5 0.5 0.5 
##$TPOFFS= (0..7)
0 0 0 0 0 0 0 0 
##$TUNHIN= 0
##$TUNHOUT= 0
##$TUNXOUT= 0
##$USERA1= <user>
##$USERA2= <user>
##$USERA3= <user>
##$USERA4= <user>
##$USERA5= <user>
##$V9= 5
##$VALIST= <valist>
##$VCLIST= <CCCCCCCCCCCCCCC>
##$VD= 0
##$VDLIST= <DDDDDDDDDDDDDDD>
##$VPLIST= <PPPPPPPPPPPPPPP>
##$VTLIST= <TTTTTTTTTTTTTTT>
##$WBST= 1024
##$WBSW= 4
##$XGAIN= (0..3)
0 0 0 0 
##$XL= 0
##$YL= 0
##$YMAX_a= 612667
##$YMIN_a= -574007
##$ZGOPTNS= <>
##$ZL1= 120
##$ZL2= 120
##$ZL3= 120
##$ZL4= 120
##$ABSF1= 16.522
##$ABSF2= -4.171173
##$ABSG= 5
##$ABSL= 3
##$ALPHA= 0
##$AQORDER= 0
##$ASSFAC= 0
##$ASSFACI= 0
##$ASSFACX= 0
##$ASSWID= 0
##$AUNMP= <proc_1d>
##$AZFE= 0.1
##$AZFW= 0.1
##$BCFW= 0
##$BC_mod= 0
##$BYTORDP= 0
##$COROFFS= 0
##$CY= 12.5
##$DATMOD= 1
##$DC= 0
##$DFILT= <>
##$DTYPP= 0
##$F1P= 14.0000005364418
##$F2P= -0.99999901652339
##$FCOR= 0.5
##$FTSIZE= 32768
##$FT_mod= 6
##$GAMMA= 0
##$GB= 0
##$INTBC= 1
##$INTSCL= 1
##$ISEN= 128
##$LB= 0.3
##$LEV0= 0
##$LPBIN= 0
##$MAXI= 10000
##$MC2= 0
##$MEAN= 0
##$ME_mod= 0
##$MI= 0
##$NCOEF= 0
##$NC_proc= -1
##$NLEV= 6
##$NOISF1= 0
##$NOISF2= 0
##$NSP= 0
##$NTH_PI= 0
##$NZP= 0
##$OFFSET= 16.522
##$PC= 1
##$PHC0= 70.70652
##$PHC1= -2.985674
##$PH_mod= 1
##$PKNL= yes
##$PPARMOD= 0
##$PSCAL= 4
##$PSIGN= 0
##$REVERSE= no
##$SF= 250.13
##$SI= 32768
##$SIGF1= 0
##$SIGF2= 0
##$SINO= 400
##$SIOLD= 32768
##$SREGLST= <1H.CDCl3>
##$SSB= 0
##$STSI= 32768
##$STSR= 0
##$SW_p= 5175.98343685301
##$SYMM= 0
##$S_DEV= 0
##$TDeff= 65536
##$TDoff= 0
##$TI= <Analysis number 999999
Compound Code 99
Book Reference 9
Project Code 9>
##$TILT= no
##$TM1= 0
##$TM2= 0
##$TOPLEV= 0
##$USERP1= <user>
##$USERP2= <user>
##$USERP3= <user>
##$USERP4= <user>
##$USERP5= <user>
##$WDW= 1
##$XDIM= 32768
##$YMAX_p= 343929916
##$YMIN_p= -411685
$$ End of Bruker specific parameters
$$ ---------------------------------
##NTUPLES= NMR SPECTRUM
##VAR_NAME=  FREQUENCY,     SPECTRUM/REAL,   SPECTRUM/IMAG
##SYMBOL=    X,             R,               I
##VAR_TYPE=  INDEPENDENT,   DEPENDENT,       DEPENDENT
##VAR_FORM=  AFFN,          ASDF,            ASDF
##VAR_DIM=   32768,         32768,           32768
##UNITS=     HZ,            ARBITRARY UNITS, ARBITRARY UNITS
##FACTOR=    0.157963299565203, 1,           1
##FIRST=     4132.6476996994, 0,             0
##LAST=      -1043.33573715361, 0,           0
##MIN=       -1043.33573715361, -411685,     0
##MAX=       4132.6476996994, 343929916,     0
$$ Real data points
##PAGE= N=1
##DATA TABLE= (X++(R..R)), XYDATA
$$ [...]
18461A706O96j388j743j351P00J84l21l22J223K168l54j127p99M62l32j782p78
18444c158o82PQ10J805k18j666o94N20K301o81n10k95k52R70K00N34j85j311J275
18425a230O09j159j055J698L6k327r15M02K28K20J407M44j941M85J314J448R2
18408b44l13j07K3q36k288n10J58J846o8j079P73K980P50J368j384j475j21j12
18390f39k97j2j145Q20P70R28j77l49m8j136M25j048R28m48P31J850Q95Q88j455
18371A481l817k73J366J622l31m96m78j781l44O97J202J641P36p83K024m17k053
18354dj696p46N60O62J35j876P14K43N31K01K48m58m2j159J181R17o39o78M15
18335a491j12j39K078P32n00j547L32K91m92O05j078m76J049n48n20m31j238j38
$$ plain form
18461 1706 2402 1014 -729 -2080 -1380 -1196 -1517 -1839 -616 1552 1198 71 -728 -266 -598 -2380 -3158
18444 -3158 -3840 -3833 -3023 -1218 -1436 -3102 -3796 -3276 -975 -1656 -2166 -2461 -2713 -1743 -1543 -1009 -1194 -2505 -1230
18425 -1230 -621 -1780 -2835 -1137 -1101 -3428 -4343 -3941 -3713 -3493 -2086 -1642 -3583 -3098 -1784 -336 -244
18408 -244 -557 -664 -641 -1477 -3765 -4275 -4117 -2271 -2339 -3418 -2645 335 1085 2453 1069 -406 -527 -639
18390 -639 -936 -948 -2093 -1273 -503 425 248 -101 -149 -1285 -860 -1908 -980 -1428 -697 1153 2048 2936 1481
18371 1481 -2336 -2609 -1243 379 48 -448 -926 -2707 -3051 -2354 -1152 489 1225 442 2466 2049 -4
18354 -4 -1700 -2446 -1886 -1224 -1089 -2965 -2251 -2008 -1477 -1276 -1028 -1486 -1528 -2687 -1506 -589 -1228 -1906 -1491
18335 -1491 -1603 -1742 336 1068 568 -979 -647 -356 -848 -243 -1321 -1797 -748 -1296 -1816 -2247 -3485 -3623
18317c623N39J662J549K57r42J37n01m96K15j63L91L20J40m51r59o73J820p62
18299a540j462K51P32Q45m24j174K63j153M27J696R45J94M74l185N67J838P49
18282D3Q89m0o19r06j40q73j61J761J89j433l18N14m27j35J621L79j025J25N41
18263a5K74r84J159O74j368k78J283r21k182j442j03N40K031k49j769Q0P67K992
18245D89R29M63p68p59P16j410j237j210l279r95j100J942K782J466p36m27O44
18228b490Q19j375p31k21m42p34R4K29j91K37J314m13J60J414l77J066Q3j81N20
18209a219j116j696j69J047l48n28P66Q10J085o03r64k72N08k88M29o35J238L84
18191a571j225k342P44J394R25R50N31P87r6o19k582o79J292J796k31j529j238
$$ plain form
18317 -3623 -3084 -1422 127 384 -558 -421 -922 -1418 -1203 -1366 -975 -655 -515 -966 -1925 -2598 -778 -1540
18299 -1540 -3002 -2751 -2019 -1174 -1598 -2772 -2509 -3662 -3235 -1539 -594 -400 74 -3111 -2544 -706 43
18282 43 932 892 273 -633 -773 -1646 -1807 -46 143 -1290 -1608 -1094 -1521 -1656 -35 344 -681 -556 -15
18263 -15 259 -725 434 1108 -260 -538 745 -176 -2358 -3800 -3903 -3363 -1332 -1581 -3350 -3270 -2503 489
18245 489 1418 1881 1113 354 1070 -340 -1577 -2787 -6066 -7061 -8161 -6219 -3437 -1971 -2707 -3134 -2490
18228 -2490 -1671 -3046 -3777 -3998 -4440 -5174 -5080 -4851 -5042 -4805 -3491 -3904 -3744 -2330 -2707 -1641 -1558 -1739 -1219
18209 -1219 -2335 -4031 -4200 -3153 -3501 -4029 -3263 -2453 -1368 -1971 -2935 -3207 -2699 -2987 -2558 -3193 -1955 -1571
18191 -1571 -2796 -5138 -4394 -3000 -2075 -1125 -594 193 97 -522 -3104 -3783 -2491 -695 -926 -2455 -3693
18174c693k21k78n90Q09n9L79O30J426J068J358j998N41M90O37l31k198P68K377
18156A115o94O0K021J8k332j134r06J65J791K91J308J260P72J16M91k01J54O65
18138D960N0J539j03J02J731L16J463K312K525J951K802K802L519P058O974L962
18122D3963O784Q166J0846J1972J9435K8772M1804O3107R2753J47197K63465N06704
18110A244968J009781J329539Q8562q30966r87234p28702l88408k10282j20985
18101D06273p5385n3466m0887l2894k6949k2927k1409j6989j2447r167q630q670
18089G6453p671p884m249n283l395k174k112l480m448k087k585k738k528j488
18075B4331p9r49P2l3k396k745l163J578R77j963Q47Q16j800n54j52j342j154
$$ plain form
18174 -3693 -3914 -4192 -4782 -3973 -4032 -3653 -3023 -1597 -529 829 -1169 -628 -138 499 168 -2030 -1262 1115
18156 1115 421 481 2502 2520 188 -946 -1852 -1687 104 395 1703 2963 3735 3851 4342 4141 4295 4960
18138 4960 5010 6549 6446 6548 8279 8595 10058 12370 14895 16846 19648 22450 25969 33027 40001 43963
18122 43963 50747 58913 69759 81731 101166 129938 171742 234849 327602 474799 738264 1244968
18110 1244968 2254749 3584288 3672850 2841884 1854650 1125948 737540 527258 406273
18101 406273 330888 277422 236535 203641 176692 153765 132356 115367 102920 93753 85123 76453
18089 76453 68782 60898 56649 51366 47971 45797 43685 40205 35757 33670 31085 28347 25819 24331
18075 24331 24252 23303 23375 23342 20946 18201 15038 16616 17593 15630 16477 17293 15493 14939 14787 13445 12291
18058A2291j091k664O5m58n78J546o43k143l59J244K38M1j408k244K96J592j098
18041D627K94j262j243J208p8N77O2L32K13N79K20j204j393J053O51L30m21q87
18023C658j208J496M91n24L33M87o18l0p73L68o6n6K76j394j653r86K373o4l80
18004A730K04o22p78J087J858J019O96j616j808k89j44O65M07j202Q04K200P12
17987D923j172j554k982j382K886K596L234J788L19k039k110j562J057J508j358
17972D152j392j710o26J437N42rq17j751Q93K110J508j176j749j434l36J115J761
17955B518J462r79M64Q18k492l024l67K139J296M46J164n41r3j224r93r70J256
17938H80J060j895K34l21O27l44p06J070n8J520r94q7j012N31R49Q52J315q61
$$ plain form
18058 12291 11200 8536 8601 8143 7565 9111 8468 6325 5966 7210 7448 7489 6081 3837 4133 5725 4627
18041 4627 4921 3659 2416 3624 3546 4123 4185 4517 4730 5309 5529 4325 2932 3985 4636 4966 4545 3658
18023 3658 2450 3946 4437 3913 4246 4733 4115 4085 3312 3680 3614 3558 3834 2440 787 -199 2174 2110 1730
18004 1730 1934 1312 534 1621 3479 4498 5194 3578 1770 1481 1337 2002 2409 1207 2011 4211 4923
17987 4923 3751 2197 -785 -2167 719 3315 6549 8337 8656 6617 4507 2945 4002 5510 4152
17972 4152 2760 1050 424 1861 2403 2394 1577 -174 719 2829 4337 3161 1412 -22 -358 757 2518
17955 2518 3980 3001 3465 4283 1791 -1233 -1600 539 1835 2281 3445 2904 2811 1587 594 -376 880
17938 880 1940 45 279 -42 585 241 -465 605 547 2067 1073 986 -26 505 1454 2306 3621 2760
17920B760j189j382k88O0J247J788L4N76J58l00K10k442j590j029j385m43l33
17903c548O93N92p7J49J971N05O30J139j540j130L30j31L22J143P11M06J482r5
17885C552k43k35q16q94j892r97j734M23Q83N09J970L88j91j430k67k46m55J274
17867d01Q90J506j218j144q17J93j36j170l97J998M78L97P98j580m56J660k47
17850C54m28o75K177J518j682L6M06Q42j435j204lp76k321J181K141N41O68m1
17832A299J499L13j062n47J124q91L70j38r34p63P43p79k14J392K51j83n70j270
17814c60k72L69J388J864j593q78N2R33J74j773K080J379q03l53p45q82J45n35
17796A90j48l89l77k49Q97J227k39m15N08L41K67n29m67j476j172q59k278M28
$$ plain form
17920 2760 1571 189 -99 -39 1208 2996 3030 3606 3764 3464 3674 1232 -358 -1387 -2772 -3215 -3548
17903 -3548 -2855 -2263 -2340 -2191 -220 285 915 2054 514 -616 -286 -417 -95 1048 1759 2165 3647 3552
17885 3552 3309 3074 2258 1364 -528 -1525 -3259 -2836 -1953 -1444 526 914 723 -707 -974 -1220 -1675 -401
17867 -401 489 1995 777 -367 -1184 -991 -1127 -2297 -2694 -696 -218 179 977 -603 -1059 601 354
17850 354 -74 -749 1428 2946 1264 1300 1706 2548 1113 -91 -94 -870 -3191 -2010 131 672 1340 1299
17832 1299 2798 3111 2049 1502 2626 1735 2105 1967 1033 270 1013 234 20 1412 1663 1480 910 -360
17814 -360 -632 -263 1125 2989 1396 518 570 1503 1677 -96 1984 3363 2560 2207 1462 580 725 190
17796 190 42 -347 -724 -973 -76 1151 912 497 1005 1346 1613 1084 617 -859 -2031 -2890 -5168 -4740
17778d740J683J567oK16o86O63M36k4J495J375L40j57q15j103m41j14L41q4k28
17759b82Q56J27o95l47Q44k03K07L00p38J050K000N22k104k80j223K22M51K0p42
17740a5P82N15J154J06r0j283M9L54J294N80j736j507r65P61P27P7O61m47r89
17721B8j486J458J877J607j20P64j703j892n06j110P13J099M78j115N63K073J12
17704B840n44n61o95k040o8J364k76J55P44q53r6P41L12R46J276n29j630j52M2
17685I76n30O58P91j623Q67K78j603J88m97o12m92j38K04j304j37J045J445j373
17667a857k84M36m60m71R89q9p5P6N68l19j046K173K242k85J97K26k753k200J930
17648a002J700R8l0m04j609K35p1Q13J142l22q83j329p96k6n38j025j63K621J436
$$ plain form
17778 -4740 -3057 -1490 -1496 -1280 -1966 -1303 -867 -891 604 1979 2319 2162 1347 244 -197 -311 30 -54 -282
17759 -282 574 701 6 -341 503 300 507 807 69 1119 3119 3641 1537 1257 34 256 707 727 -15
17740 -15 767 1282 2436 2542 2452 1169 1218 1572 2866 3446 1710 203 -762 -1 726 803 1464 1017 28
17721 28 -1458 0 1877 3484 3364 4128 2425 533 27 -1083 -370 729 1207 92 655 2728 2840
17704 2840 2296 1735 1040 -1000 -1068 296 20 175 919 66 -30 711 1023 1969 3245 2716 1086 934 976
17685 976 446 1104 1895 272 1139 1417 -186 2 -495 -1107 -1599 -1737 -1533 -2837 -2974 -1929 -484 -1857
17667 -1857 -2141 -1705 -2165 -2636 -1647 -1736 -1811 -1735 -1167 -1486 -2532 -359 1883 1598 1795 2021 -732 -2932 -1002
17648 -1002 698 796 766 362 -1247 -1012 -1083 -270 872 550 -333 -1662 -2458 -2484 -3022 -4047 -4210 -1589 -153
17629a53J185J353j227j141o64o51J174M63k3p51n56O92K90j043m09J023P51j101
17611g88m43M71N95J89O1k41Q56k55o37J664Q97l99q6r22p62m22q43n44R66N44
17591i9K42M28j099r09N31m04R17P34l48k58r89r47O32m78M20K618K41r23j003
17572f94L35J922P28r68j119%O75k19J14L15K45j671j233q43O4J199J926M85r92
17553B69m07j427k389J756J341j001K44O86J35J261j161q41J291N68j549j205
17537b429J161J292J555M64K13l014j724j48K676J511r64k044N04K28p04j069
17521b492l19j520N31J105j58Q65J318j350j385N58N95J009K146j591o68r90M68
17504a878N30N69r4M61j013j035j13p5L73N38l26l80J363k50j548n90J475j47
$$ plain form
17629 -153 1032 2385 1158 17 -647 -1298 -124 339 316 -435 -991 -299 -9 -1052 -1461 -438 313 -788
17611 -788 -1231 -760 -165 24 85 -156 700 445 -192 1472 2369 1970 1884 962 200 -222 -1065 -1609 -643 -99
17591 -99 143 571 -528 -1437 -906 -1310 -393 341 -7 -265 -1254 -2201 -1569 -2047 -1627 991 1232 309 -694
17572 -694 -359 1563 2291 1323 204 204 879 660 774 1089 1334 -337 -1570 -2413 -2349 -1150 776 1261 269
17553 269 -138 -1565 -3954 -2198 -857 -1858 -1614 -928 -793 468 -693 -1534 -243 325 -1224 -2429
17537 -2429 -1268 24 1579 2043 2256 -758 -2482 -2630 46 1557 593 -1451 -947 -719 -1423 -2492
17521 -2492 -2811 -4331 -3800 -2695 -2853 -1988 -670 -2020 -3405 -2847 -2252 -1243 903 -688 -1356 -2346 -1878
17504 -1878 -1348 -779 -873 -412 -1425 -2460 -2573 -2648 -2275 -1737 -2063 -2443 -1080 -1330 -2878 -3468 -1993 -2140
17486b140J406p89l59O2l72M98Q85j72L09J010J267Q99j861j766P6L80j289K56
17468a700q84J41J807N44j032l03M95m41j801K97J246J1j33J923P56J340L05k331
17450B40k10n45r5J51L36K575J581J788M533N442K040j877m349o308m176k558
17434a432M19N35j067j11Q51K70J55Q79n78N05q80j191R93l81r47j224o77R91
17416b890J162J317j850j000J598M52q55o56r71P01J338J231O99L79Q40J06k81
17399A320k404o69r96K39O03M44j30p27N48K23o95j1K249o98j236L85l6l58J45
17380a804J908M29J28q85O88R77J188o2l09p47r91o84J66m02o44Q60J084P46K43
17361A889k093j374M72P03Q6P14K18K28j450j040q70J630k68qP31M40o79j034
$$ plain form
17486 -2140 -734 -1523 -1882 -1820 -2192 -1694 -809 -981 -672 338 1605 2504 643 -1123 -1047 -667 -1956 -1700
17468 -1700 -2584 -2443 -636 -92 -1124 -1427 -932 -1373 -3174 -2877 -1631 -1620 -1753 170 926 2266 2571 240
17450 240 30 -515 -610 -459 -123 2452 4033 5821 10354 15796 17836 15959 11610 5302 1126 -1432
17434 -1432 -1013 -478 -1545 -1656 -805 -535 -380 499 -79 426 -454 -1645 -652 -1033 -1980 -3204 -3881 -2890
17416 -2890 -1728 -411 -2261 -3261 -1663 -1211 -2066 -2722 -3693 -2992 -1654 -423 276 655 1495 1601 1320
17399 1320 -1084 -1753 -2749 -2510 -1907 -1463 -1593 -2320 -1772 -1549 -2244 -2255 -6 -704 -1940 -1555 -1591 -1949 -1804
17380 -1804 104 533 661 -224 464 1441 2629 2567 2258 1511 520 -164 2 -400 -1044 -184 900 1646 1889
17361 1889 -204 -1578 -1106 -403 -317 397 615 843 -607 -1647 -2517 -887 -1155 -1163 -432 8 -671 -1705
17343a705L37K72q7J466n73k062l01R6Q40N60k76L66P48J543J199N44j474j094
17325C99j347j145m18J275J925p79k539j895o53M45j56R62O63J98P03J31O68O64
17307h99p57m06J81J642j07j486j133J508J311Q56n49j02N62J50L77q6M2L98J63
17288A665M90l8j192j270p43L73p37M90J033J108J026m21j143q75M04k1j113M65
17270d99R32q52j197L07Q80R32Q79j334j067k06O05j640J093Q98l92J768O56j814
17252e1j925n2l02j724l75J77J413m52k00k32P00N66j43n6q61k87J880P42j191
17233b373q66J291Q41q04J103N62k35J55R88R3o31j468r47m09N84O86R5J271O4
17214@p56l08j286q42k05q59Q94J349J365p06q09K10Q75j037o90n80p36Q88K765
$$ plain form
17343 -1705 -1368 -1096 -1183 283 -290 -2352 -2653 -2557 -1717 -1157 -1433 -1067 -319 1224 2423 2967 1493 399
17325 399 -948 -2093 -2511 -1236 689 -90 -2629 -4524 -5177 -4732 -4888 -3926 -3263 -3065 -2362 -2231 -1563 -899
17307 -899 -1656 -2062 -1881 -239 -346 -1832 -2965 -1457 -146 710 161 59 621 771 1148 1062 1104 1502 1665
17288 1665 2155 2117 925 -345 -1088 -715 -1452 -962 71 1179 2205 1784 641 -234 170 149 -964 -499
17270 -499 433 -419 -1616 -1309 -429 503 1382 48 -1019 -1225 -620 -2260 -1167 -269 -661 1107 1763 -51
17252 -51 -1976 -2028 -2330 -4054 -4429 -4252 -2839 -3291 -3491 -3723 -3023 -2457 -2600 -2656 -3517 -3804 -1924 -1182 -2373
17233 -2373 -3239 -1948 -1107 -1911 -808 -246 -481 -326 662 755 124 -1344 -2291 -2700 -2116 -1430 -1335 -64 0
17214 0 -756 -1064 -2350 -3192 -3397 -4256 -3362 -2013 -648 -1354 -2163 -1953 -1078 -2115 -2805 -3385 -4121 -3233 -468
17195d68o27j564P67j284j808p31J132l55k68M94J453O79J106Q85J73j73M84Q50
17177G45M5N55k81m90Pj593Q2J91j222o8J009l06j682L73Q65m05p10J155o2J820
17157B8p31r71N69R89l58j783j621O36J187J458n75j100k87P84k55n4R42R99Q93
17138G50k24k46J959P36j708j525q45q10q25j252K180L22P96j396o6N42O75N67
17120c70j30K90J9j118j357n02M76P77P11O30o85J12Q97r49o84K19j033P07J054
17101i36O31j031j414N64J74k010k29J593K701J529J32j342J098q54p93p14l18
17084a219r31Q2l96j17L27J017k51J85M13j642p41J33J176J004o96k070L8J115
17066b573J670q84l41O17Q46J46j365j008N5n96O07J870J728j196r66j06R31M02
$$ plain form
17195 -468 -1095 -2659 -1892 -3176 -4984 -5715 -4583 -4938 -5206 -4712 -3259 -2580 -1474 -589 -416 -589 -105 745
17177 745 790 1345 1064 574 581 -1012 -930 -739 -1961 -2029 -1020 -1326 -3008 -2635 -1770 -2175 -2885 -1730 -1792 28
17157 28 -703 -1674 -1105 -116 -474 -2257 -3878 -3242 -2055 -597 -1172 -2272 -2559 -1775 -2030 -2084 -1142 -143 750
17138 750 526 280 2239 2975 1267 -258 -1103 -1913 -2738 -3990 -1810 -1488 -692 -2088 -2154 -1612 -937 -370
17120 -370 -500 -210 -191 -1309 -2666 -3168 -2692 -1915 -1204 -574 -1259 -1147 -250 -1199 -1883 -1664 -2697 -1990 -936
17101 -936 -305 -1336 -2750 -2186 -2012 -4022 -4251 -2658 43 1572 1704 362 1460 606 -187 -901 -1219
17084 -1219 -2150 -2068 -2464 -2581 -2254 -1237 -1488 -1303 -890 -2532 -3273 -3140 -1964 -960 -1656 -3726 -3688 -2573
17066 -2573 -903 -1787 -2128 -1511 -665 -519 -1884 -2892 -2837 -3433 -2826 -956 772 -424 -1390 -1496 -565 -163
17048a63j033p25M08J003l76p08Q06l56k52P70L2m30k059N1J76J030J431Q84n60
17029g1l69m39l46j459M48J567j57P35J504M66o0k77j840j148N13K042p20r34
17011e45J094j006K12N82o72n68N4l37J495L54k558j63K3l73J1L43J637K5n82
16992i74P43n37j68K06J512j459j347K76J63j047K47R87J72j071j778L55J480
16975b240O43K612M67p44j20N76j090j279j507k6J647P06K9K98r33J62q1j805
16957b685J084j063o84J726O31L75j71K70J171k39q82j059N79N16j895j023J576
16940a773J301q4j450k33m79J060J7j306n87K575K369L2j574j397m49O33L13j215
16922b247M64J235O16P6m75l52P21n14K82J07o49j988r62o92O74O40R6n96o78
$$ plain form
17048 -163 -1196 -1921 -1513 -510 -886 -1594 -788 -1144 -1396 -626 -594 -1024 -3083 -3032 -2856 -1826 -395 489 -71
17029 -71 -440 -879 -1225 -2684 -2236 -669 -826 -91 1413 1879 1819 1542 -298 -1446 -933 1109 389 -545
17011 -545 549 -457 -245 337 -335 -903 -849 -1186 309 663 -1895 -2058 -2035 -2408 -2397 -2054 -417 -392 -974
16992 -974 -231 -768 -936 -730 782 -677 -2024 -1748 -1585 -2632 -2385 -1398 -1226 -2297 -4075 -3720 -2240
16975 -2240 -1597 1015 1482 738 618 1194 104 -1175 -2682 -2708 -1061 -355 -326 -28 -961 -799 -880 -2685
16957 -2685 -1601 -2664 -3348 -1622 -991 -616 -787 -517 654 415 -467 -1526 -947 -431 -2326 -3349 -1773
16940 -1773 -472 -556 -2006 -2239 -2718 -1658 -1641 -2947 -3534 -959 1410 1442 -132 -1529 -1978 -1345 -1032 -2247
16922 -2247 -1783 -548 68 144 -331 -683 38 -476 -194 -87 -736 -2724 -3686 -4378 -3704 -3064 -2968 -3564 -4242
16903d242J347Q9o50j01K603J727j441m66p72k35J782L61k24r4r65MJ733m56q72
16884h72k11j391j662N85J306J200J922N91l50Q42K67n64o19P06J236p65j529
16867F92m36m82R98n90p7j006j523m95N46K410M29j812N0k30j292J31K52l4l28
16848b797k8J613R29p02k394m07J280N26q89M04P83N65k24L22l10m98O0k54L27
16829a694j98k883K5K631J466P36j033j228j109J72J483R89j300k18J013Q42P68
16812D62k61j154j768O40j74M15l60r24N29R92J447k9k0N05j67l87L20j797j079
16793b810M71j435j81P32q97n05P50J491J070O80k16o64LO20L33R41K076p74j745
16774f0l49M76p64k694p45J197R96j00o74r2K75q27Q63J185O9J83O78j163M66
$$ plain form
16903 -4242 -2895 -2806 -3456 -3557 -954 773 -668 -1134 -1906 -2141 -359 2 -222 -316 -1281 -1277 456 0 -872
16884 -872 -1083 -2474 -4136 -3551 -2245 -1045 877 1468 1118 1960 2227 1663 1044 1750 2986 2221 692
16867 692 256 -226 772 182 105 -901 -2424 -2919 -2373 37 466 -1346 -1296 -1526 -2818 -2687 -2435 -2469 -2797
16848 -2797 -2825 -1212 -283 -985 -3379 -3786 -2506 -1980 -2869 -2465 -1682 -1117 -1341 -1019 -1329 -1827 -1767 -2021 -1694
16829 -1694 -1892 -4775 -4750 -2119 -653 83 -950 -2178 -3287 -3115 -1632 -643 -1943 -2161 -1148 -306 462
16812 462 201 -953 -2721 -2081 -2255 -1840 -2200 -3124 -2595 -1603 -156 -185 -205 300 133 -254 66 -1731 -2810
16793 -2810 -2339 -3774 -3955 -3223 -4120 -4625 -3875 -2384 -1314 -634 -850 -1514 -1511 -891 -558 383 2459 1685 -60
16774 -60 -409 67 -697 -3391 -4136 -2939 -1943 -2043 -2717 -2809 -2534 -3361 -2498 -1313 -1244 -1061 -383 -1546 -1080
16755a080o53L69j825n05J08K349O09j644J53J324K33j86m35k85j9P15N96j043
16737a219M6R64J132q36k132M35N19r9m07j120J392J639r4n07k436J16J822J31
16719f54j623R09J28q43pn46J589J370q10O54J258n75k038j399K67J068K77o21
16701a596K13Q38Q2o08k55j6j056O04M83l38j242k99j54l78J83J899J514J039
16683I13q11J11o14j654q21Q85o36l00j7K74J312m8o80M29Q1K81j552j053M36
16664c464J089M56k15M38J086J041o90l0k60j18N57J82R00o60L64j577j594N46
16646a949J73o39O81J282M97L12R30n73j324j696J73J19P15N48J708m34L32P23
16628A578N71P71n32j493j50J941m27j216j439K4O77q68J224J09ql68r72q41L22
$$ plain form
16755 -1080 -1733 -1364 -3189 -3694 -3586 -1237 -628 -2272 -2119 -795 -562 -748 -1183 -1468 -1487 -772 -176 -1219
16737 -1219 -1173 -209 923 87 -2045 -1610 -1091 -1190 -1597 -2717 -1325 314 220 -287 -2723 -2607 -785 -654
16719 -654 -2277 -1368 -1240 -2083 -2090 -2636 -1047 323 -487 167 1425 850 -1188 -2587 -2320 -1252 -975 -1596
16701 -1596 -1383 -545 -463 -1071 -1326 -1342 -2398 -1794 -1311 -1649 -2891 -3190 -3344 -3722 -3539 -1640 -126 913
16683 913 102 213 -401 -2055 -2876 -1991 -2627 -2927 -2944 -2670 -1358 -1406 -2086 -1657 -1576 -1295 -2847 -3900 -3464
16664 -3464 -2375 -1919 -2134 -1696 -610 431 -259 -289 -549 -667 -110 72 972 312 676 -901 -2495 -1949
16646 -1949 -1776 -2415 -1734 -452 45 357 1287 714 -610 -2306 -2133 -2014 -1299 -751 957 523 855 1578
16628 1578 2149 2920 2388 895 745 2686 2259 1043 -396 -372 305 -563 661 770 762 394 -578 -1419 -1097
16609a097l44o82R12N81k40J23J457l76k08R67K56n2P54j048r64j517M28J752
16591G02J71o33j007j073j76N08K010K28m29p30j66l08j164R91JK82K11M77q64
16572i69k953J69J340J64q12q70J048J326R56o33j016l46k40J588L53R53L19k125
16554a748j258J000J203p44p70j142K56J111R58n85l40Q85o94J517K216j091k872
16537b098j885K11K294J357L16J11k331m71P82o04j660j248K368R15R31K142M80
16520A610q27r08k05O82o90r85M44K283P92m60j274j604o99K061J276J74j505
16503A65j489j21Q11k42J92j623r96N10M70O89M24j267K72n14J60J947J420j164
16485c56j593j58n0R21R82J95n69l09O78n49j115J545k27q88p0K12j461j923J153
$$ plain form
16609 -1097 -1441 -2123 -1211 -630 -870 -747 710 334 126 1093 1349 1297 2051 1003 39 -1478 -1050 702
16591 702 873 240 -767 -1840 -2016 -1508 502 730 301 -429 -595 -903 -2067 -1076 -1075 -793 -582 -105 -969
16572 -969 -3922 -3753 -2413 -2249 -3061 -3931 -2883 -1557 -601 -1234 -2250 -2596 -2836 -1248 -895 58 377 -1748
16554 -1748 -3006 -2006 -803 -1547 -2317 -3459 -3203 -2092 -1134 -1719 -2059 -1174 -1868 -351 1865 774 -2098
16537 -2098 -3983 -3772 -1478 -121 195 306 -2025 -2496 -1714 -2318 -3978 -5226 -2858 -1943 -1012 1130 1610
16520 1610 783 -125 -330 352 -338 -1323 -879 1404 2196 1736 462 -1142 -1841 220 1496 1670 165
16503 165 -1324 -1445 -634 -876 -684 -2307 -3303 -2793 -2323 -1634 -1210 -2477 -2205 -2719 -2559 -612 808 -356
16485 -356 -1949 -2107 -2157 -1236 -254 -59 -628 -937 -259 -808 -1923 -378 -605 -1493 -1563 -1351 -2812 -4735 -3582
16466c582JJ477o26o89J49J56Q42J560J319j118j515L20J698J854L75j708j48
16449C65q14n20j80K83J565K223m29P31o20j99m35j456j019O51n88J23j4J036
16431G03Qn74k55Q66R25m53j55J576p99k776L54J644j153l90P22m89j889N27N78
16412a030K1M20K61M84M8j683k076K44J249j39j58J343Q13L07k370j960j221R2
16394e355J505O12J313K203J18k283k23K558J039j6J18k29M22K30m31j52j84o55
16376E90j427L41l40Q89j849l56o97qJ336J229l35k09j87o24j108n91q6K728p83
16357a487k64M43J965L75k85r30r33q76q78P00K400J139j130k069L26q74K01K224
16339D7K282k66j156m02n48j268N47J711r05j190k11J189l97j051j52J349N4j190
$$ plain form
16466 -3582 -3581 -2104 -2730 -3419 -3270 -3114 -2272 -712 607 -511 -2026 -1706 -8 1846 2221 513 365
16449 365 -449 -969 -1149 -866 699 2922 2493 3224 2604 2405 1970 514 -505 146 -442 -319 -333 703
16431 703 711 137 -118 748 1673 1220 1065 2641 1842 -934 -580 1064 -89 -479 243 -246 -2135 -1608 -1030
16412 -1030 -1009 -589 -328 156 204 -1479 -3555 -3311 -2062 -2201 -2359 -1016 -203 104 -2266 -4226 -5447 -5355
16394 -5355 -3850 -3238 -1925 278 396 -1887 -2110 448 1487 1471 1589 1360 1782 2012 1581 1429 1245 590
16376 590 -837 -496 -836 53 -1796 -2152 -2849 -2857 -1521 -292 -627 -836 -1023 -1647 -2755 -3346 -3432 -704 -1487
16357 -1487 -1751 -1308 657 1032 747 -183 -1116 -1992 -2870 -2170 230 1369 239 -1830 -1504 -2378 -2177 47
16339 47 2329 2063 907 505 -43 -1311 -764 947 42 -1148 -1359 -170 -567 -1618 -1770 -421 -367 -1557
16321a557j073P60P64J60q67J149k226j588p50j40K19R31K988P44Q63J310r63
16304G24k32J561J50K0m34j406N09l6J89j20n1L39L26l47J361K250N018Q169J3164
16285C1154J9082J7562L795j2966j6181j3318r429m852m156l905m02j29j360j129
16271C766J64j035k307L69K048j039n60N82j235j532K27J053q40P53P38j389q77
16254a114J54m7M28j930n29J419k85k30J217J43p03m03J524P07j614m42j345K8
16236c022J99J6O95o8p83r8r13J454J964P65J786M86j670j194r16j609j195L34
16218c769r6J449J71M11J204M32Q42m09j52j264n06m78J021J179N08j628N73J088
16200E76j145P13K015j127j80j045l13O52n74P35J692q87l199K14K346m40k960
$$ plain form
16321 -1557 -2630 -1870 -1106 -946 -1813 -664 -2890 -4478 -5228 -5368 -5149 -4218 -1230 -486 377 1687 724
16304 724 492 2053 2203 2223 1789 383 892 856 1045 925 874 1213 1539 1192 2553 4803 9821 17990 31154
16285 31154 50236 67798 71593 58627 42446 29128 19699 14847 10691 6786 6384 6255 4895 3766
16271 3766 3930 2895 588 957 3005 1966 1406 1988 753 -779 -552 501 -339 414 1152 -237 -1114
16254 -1114 -960 -1007 -579 -2509 -3038 -1619 -1904 -2134 -917 -774 -1477 -1880 -356 351 -1263 -1705 -3050 -3022
16236 -3022 -2823 -2807 -2112 -2180 -2963 -3061 -3974 -2520 -556 209 1995 2481 811 -383 -1299 -2908 -4103 -3769
16218 -3769 -3865 -2416 -2245 -1834 -630 -198 644 235 83 -1181 -1687 -2165 -1144 35 543 -1085 -512 576
16200 576 -569 144 2159 1032 852 -193 -506 146 -428 307 1999 1112 -2087 -1873 473 33 -2927
16183b927o1k17m51k32Q00O46Q14o41O72m26O49R25l46J2o30M81J19j064O83J285
16163I1j58q72n60J155J024j76L88j399p33K26M39J354n0m88M27j365RN12N49
16144C73j2qK00j290J302O87j6n36n33j078O04M08n61N8Rj041K9K84J31PM54r62
16122a491P7J841o46p23j837j104J432O81j335N56J395K916J56k039M52l92j730
16105a791j227J108J254l45P43N92J326n46p34J66L16J787L15j235j943m24Q73
16088B35J092j107k080L59J763M88r84q86j317Q72n45M39O2O71J050N2j394n77
16070a807p29K560K1m81j408Q5R11j66p01l79l55J90p28M02O98m30j163J0K0K99
16050c151l10p12J628k48J354J861j01p85M32P50n74P1j754J39P02j03k37K37
$$ plain form
16183 -2927 -2988 -3205 -3656 -3888 -3088 -2442 -1628 -2269 -1597 -2023 -1374 -449 -795 -783 -1413 -932 -813 -1877 -1194 91
16163 91 -67 -939 -1499 -344 680 504 892 -507 -1240 -1014 -575 779 729 241 668 -697 -688 -176 373
16144 373 361 353 553 -737 565 1252 1236 700 167 -911 -307 101 -460 -402 -393 -1434 -1405 -1121 -990 -983 -529 -1491
16122 -1491 -1414 427 -219 -942 -2779 -3883 -2451 -1770 -3105 -2549 -1154 1762 1918 -121 331 -61 -1791
16105 -1791 -3018 -1910 -656 -1001 -258 334 1660 1114 380 546 862 2649 2964 1729 -214 -638 235
16088 235 1327 220 -1860 -1501 262 750 -234 -1120 -2437 -1565 -2110 -1671 -1609 -938 112 164 -1230 -1807
16070 -1807 -2536 24 45 -436 -1844 -1759 -848 -1014 -1715 -2094 -2449 -2259 -2987 -2585 -1887 -2317 -3480 -3470 -3450 -3151
16050 -3151 -3461 -4173 -2545 -2793 -1439 422 321 -464 -32 718 144 215 -1539 -1400 -698 -801 -1038 -801
16032h01K03j078j079n44j81J290M18n11R55n05j960j320J070j622j41K131P41
16015b934P6j127q1J540R48J89J83l16j427k87J386J818O20O77j052j410j662
15998b859j194Q79J46M36N45J39O02p12L62J913J26j845l15j2l60O61J58j159
15980b489P86M92R5L58L14r21L3n31j5M92m73Q26K463Qk05n12p84J057n01k407
15960a914n31J08j215l71J812J324m07k025q61q6J107J232J067O65p4L31j278
15943a116M6K74Q72n22j149m05K13O04J852N19o63j226o1M34J291p95J46J49j521
15924a058j09j253k035J186Q28k27M35O99l33R09L89q99n93j98L42J01J475K81
15906f0j511r69J840p46J93J088k50q65l03p9Q55o09p70P4J119J57O94q5j587
$$ plain form
16032 -801 -598 -1676 -2755 -3299 -3480 -2190 -1772 -2283 -1328 -1833 -3793 -5113 -4043 -5665 -5806 -3675 -2934
16015 -2934 -2858 -3985 -4066 -2526 -1578 -1389 -1206 -1522 -2949 -3236 -1850 -32 588 1265 213 -1197 -2859
15998 -2859 -4053 -3174 -3028 -2592 -2047 -1908 -1306 -2018 -1656 257 383 -1462 -1777 -1789 -2149 -1488 -1330 -2489
15980 -2489 -1703 -1211 -1116 -758 -444 -1365 -1332 -1863 -1878 -1386 -1859 -1033 1430 1438 1233 721 -63 994 493 -1914
15960 -1914 -2445 -2337 -3552 -3923 -2111 -787 -1194 -3219 -4080 -4166 -3059 -1827 -760 -95 -169 162 -1116
15943 -1116 -1070 -796 76 -446 -1595 -2000 -1787 -1183 669 1188 525 -701 -762 -328 963 168 314 463 -1058
15924 -1058 -1167 -2420 -4455 -3269 -2441 -2668 -2233 -1534 -1867 -958 -569 -1468 -2061 -2259 -1917 -1816 -341 -60
15906 -60 -1571 -2540 -700 -1446 -1253 -165 -415 -1280 -1583 -1662 -807 -1416 -2186 -2112 -993 -836 -142 -227 -1814
15887a814l00J267J438O84p20J40j152p01J34J644O41k171j406j004M67k21l13
15870c387J356J63N32J061J091K12j496q23L60M13J406j666k75O19NN95K54K04
15852F24n88j146r10j118J009M88N72O73P90k110p7Q33j13P99Q42p31L16L29j931
15833a449j348J017K22m54J467L52j745P26R86M88K15j9J40L49M89j769q95j603
15815b831j911J533J358R58J234K41k120k086j540j42L227J617m12k080p12P08
15799b958M49O4J511O71q04j288k39J42K08K959L90k160m56k54m34j790k96O54
15781c631P17J257J458O78m91M20j460j025P88%r69n7O95K8O25r35k23j15p22
15762b962J514O0j255o60J132J039j89M3R61P43Q66J275r80j256o11j622r29J097
$$ plain form
15887 -1814 -2114 -847 591 1275 555 695 -457 -1158 -1024 620 1261 -910 -2316 -3320 -2853 -3074 -3387
15870 -3387 -2031 -1868 -1336 -275 816 1028 -468 -1291 -931 -518 888 -778 -1053 -434 -429 166 420 624
15852 624 36 -1110 -2020 -3138 -2129 -1641 -1069 -396 394 -1716 -1793 -960 -1073 -274 568 -163 153 482 -1449
15833 -1449 -2797 -1780 -1558 -2012 -545 -193 -1938 -1212 -226 262 477 458 598 947 1436 -333 -1228 -2831
15815 -2831 -4742 -3209 -1851 -893 341 582 -1538 -3624 -5164 -5306 -2079 -462 -874 -2954 -3666 -2958
15799 -2958 -2509 -2445 -934 -263 -1067 -2355 -2594 -2452 -2244 715 1105 -1055 -1511 -1765 -2199 -3989 -4285 -3631
15781 -3631 -2914 -1657 -199 479 -12 408 -1052 -2077 -1289 -1289 -2258 -2315 -1620 -1592 -967 -1902 -2125 -2240 -2962
15762 -2962 -1448 -1388 -2643 -3303 -2171 -1132 -1321 -1278 -317 426 1292 2567 1587 331 -280 -1902 -2831 -1734
15744a734p26l80K203O63j284M03J21J295J287o05q24r21j124J81n09m61J804
15727f11O27M32j142n25j2j048J68o1j668k475J844J290J273Q37p23k34k57p01
15709b986O06L266J231p10p35j291n54K30l39m57J65n81P31J001J618p67l48j255
15691a175M2j115o01r42J240L36L58J009l00O06q10j429j119K27J22J189J614
15674g48q6j384J821o22o19R0J02Q37M3K09m84m98j97N11L88j488j269q53k204
15655f451M68L162K551L55M1p34R58K027m27k621m27k45m13J367j524m93K47J908
15637b51J415q10j188o00q17j294M07p46Q95l40k14L171K12o39j11j510q9n42
15619c051n82m09j467J235K650J292m73j284k42L57Q63j001j336K001N32Q1J424
$$ plain form
15744 -1734 -2460 -2840 -637 26 -1258 -855 -734 561 1848 1243 419 -502 -1626 -1445 -1954 -2415 -611
15727 -611 16 448 -694 -1219 -1231 -2279 -2111 -2172 -3840 -6315 -4471 -3181 -1908 -1071 -1794 -2028 -2285 -2986
15709 -2986 -2380 886 2117 1407 672 -619 -1173 -943 -1282 -1739 -1574 -2155 -1424 -423 1195 428 80 -1175
15691 -1175 -1133 -2248 -2849 -3791 -2551 -2215 -1857 -848 -1148 -542 -1352 -2781 -3900 -3673 -3551 -2362 -748
15674 -748 -834 -2218 -397 -1019 -1638 -1548 -1446 -609 -566 -357 -841 -1339 -1536 -1025 -637 -2125 -3394 -4247 -6451
15655 -6451 -5983 -2821 -270 85 126 -608 350 2377 1950 -671 -1098 -1343 -1756 -389 -1913 -2406 -2159 -251
15637 -251 1164 354 -834 -1434 -2251 -3545 -3138 -3884 -2989 -3329 -3543 -372 -160 -799 -910 -2420 -2509 -3051
15619 -3051 -3633 -4042 -5509 -4274 -1624 -332 -805 -2089 -2331 -1974 -1111 -2112 -3448 -1447 -915 -834 590
15602E90o73j670r15O80n77J609J367r44j173J50J762J45n86m24l58p24O51L25
15584g65q86J114O26m35p47l53j116r35J163K29j970k47J838m1M34P33k63N12
15566a109n81m53K9J39P18Q82O42j85P29j232J9p08N66K444n00j223l85L87k64
15547h5J261l60P5l75j178J088R86o6j130n84q46P11j522m03P2q90O39R95J775
15528A63L65k20J126N5J137N5k136j667n08J965R39j619k022r9J636J32k291J172
15510a817k16K24J076M56M46r5j385R87R9j106q6J65m05J289O64J07J048J011
15492B462j83j696q75r39l35M99M02J076O44k53p6J483K20q03K66P22r10j071
15474F33k201q1R18J143O11j231n65K15n01q50j077J43q56n20J249J351J566m12
$$ plain form
15602 590 -83 -1753 -2668 -1988 -2565 -956 411 -533 -1706 -1556 206 351 -235 -659 -1017 -1741 -1090 -765
15584 -765 -1651 -537 89 -346 -1093 -1446 -2562 -3497 -2334 -2105 -4075 -4322 -2484 -2525 -2091 -1358 -1621 -1109
15566 -1109 -1690 -2143 -2114 -1975 -1257 -375 267 82 811 -421 -402 -1110 -544 1900 1400 177 -208 179 -85
15547 -85 1176 816 891 516 -662 426 1412 1346 216 -368 -1214 -503 -2025 -2428 -2356 -3246 -2607 -1612 163
15528 163 528 308 1434 1489 2626 2681 545 -1122 -1630 335 1274 -345 -2367 -2466 -830 -698 -2989 -1817
15510 -1817 -2033 -1809 -733 -277 169 74 -1311 -324 -225 -1331 -1417 -1252 -1657 -368 296 403 1451 2462
15492 2462 2279 583 -292 -1231 -1566 -1067 -665 411 1055 802 726 2209 2429 1626 1892 2614 1704 633
15474 633 -1568 -1649 -731 412 1023 -208 -773 -558 -1059 -1909 -2986 -2843 -3699 -4219 -2970 -1619 -53 -465
15456d65j361j360j807J369J830J352P43J124L72l16j43K95m95K32k94j067k055
15439b046o00J565k53j370J333K255j598j092R98P77r90k94k025J213R13k48j118
15422b580N17N09L96m0J369J8K32j93m33q38Q65M08q13j26o05j209m66l75J576
15403a788k0K46N69P9P09j609j192J362K323J0j02l33O3j712o17J188J713N43
15385A432p38n13r9P13j003L12P39Lq20p05n37j74P86o41r74P98j87q4%m11j6
15364b119M23k15o59J700j277j192M57K335N78K88l69p24o33j934P14J412J511
15347B96Q55P29j376j155p91Q09K01L87J035L23o89j129m7K96o88J382k261j357
15329c180K53P50M5n07M62K21O94P45K171K76j021j063N85q58J452Q48k151r74
$$ plain form
15456 -465 -1826 -3186 -4993 -3624 -1794 -442 301 1425 1797 1481 1338 1633 1138 1370 1076 9 -2046
15439 -2046 -2646 -1081 -1334 -2704 -1371 884 -714 -1806 -808 -31 -1021 -1315 -3340 -2127 -1214 -1462 -2580
15422 -2580 -2063 -1554 -1158 -1198 171 189 421 228 -205 -1043 -178 230 -583 -709 -1314 -2523 -2989 -3364 -1788
15403 -1788 -1808 -1562 -993 -914 -205 -1814 -3006 -1644 679 689 587 254 317 -1395 -2012 -824 889 1432
15385 1432 694 181 82 795 -208 104 843 846 26 -679 -1216 -1390 -604 -1245 -2219 -1421 -1608 -1692 -1692 -2103 -2119
15364 -2119 -1696 -1911 -2570 -870 -2147 -3339 -2882 -547 31 319 -50 -774 -1407 -3341 -2627 -1215 296
15347 296 1151 1880 504 -651 -1442 -633 -432 -45 990 1313 624 -505 -552 -256 -944 438 -1823 -3180
15329 -3180 -2927 -2177 -2132 -2639 -2177 -1956 -1262 -517 1654 1930 909 -154 431 -427 1025 1873 -278 -1252
15311a252J418n2J88p78Q17j85p91j142j371J216m75j020m20k99L15m0p3k21R14
15292c251R72L98M02q39k556J443K2l88j574J327M01N55J284R83J411Q59r99l20
15274A30n73r0N35k31l67N12P69J028j31j648j122P03rJ50k84N49O61o18k35K03
15254f8l00J097L97k696j328j046J590J527J2l23P06q50L78J145p44P46J442p00
15236I85m89j051K44m73J018o36l66j048j193l83j378M22J224p39M13J037o7N65
15218a915O94K6L21n07r51l8J457R26o16o96K7j02J42J922L97p25M0j460q01K10
15198a649P63j30m10k86o52R99Q09O5p29n41Q66Q87p43r56J9L02J37N53n16R70
15178b42P8j146m37n43p74K97N62J479M98O30k34j973j952j4J318n93o11m32o14
$$ plain form
15311 -1252 166 114 302 -476 341 156 -635 -1777 -3148 -1932 -2407 -3427 -3847 -4146 -3831 -3871 -3944 -4165 -3251
15292 -3251 -2279 -1881 -1479 -2318 -4874 -3431 -3409 -3797 -5371 -4044 -3643 -3088 -1804 -821 590 1449 450 130
15274 130 -443 -533 2 -229 -596 -84 685 1713 1582 -66 -1188 -485 -494 -344 -628 -79 582 -36 -271 -68
15254 -68 -368 729 1126 -1570 -2898 -3944 -2354 -827 -815 -1138 -432 -1282 -904 241 -503 243 1685 985
15236 985 496 -555 -311 -784 234 -402 -768 -1816 -3009 -3392 -4770 -4348 -3124 -3863 -3450 -2413 -2480 -1915
15218 -1915 -1221 -1195 -874 -1381 -2332 -2370 -913 13 -603 -1299 -1272 -1374 -1232 690 1087 362 402 -1058 -1859 -1649
15198 -1649 -886 -1016 -1426 -1712 -2364 -1365 -556 -491 -1220 -1761 -895 -8 -751 -1707 -1688 -1386 -1249 -696 -1212 -242
15178 -242 -164 -1310 -1747 -2290 -3064 -2767 -2205 -726 -228 402 168 -1805 -3757 -3771 -2453 -3046 -3657 -4089 -4703
15159d703m14J524J08n37J324J002p19p0QK138J217q90p16k108K391L073O7j675
15141A020k025m35P76J579J064j385m89J807J824j854k901j983J348L000o75j446
15125g75m22O2K41K92M3N26J177m50j331p25p76j045J42J202P87j021R30J249
15107A06Q64M69%O59J618N51j730k026J501J404l42j530j770p48J78J224J392
15090A820k97n62R80n11o38M08N09L78j924N15j091k978R60L633j87k267k06K22
15072a236m8Q38N55O74j892j888o35R00J536J399O95j41J98j072J206r28k081
15055a920P96K080k83p21M81L59Q73N53j183j280p51L76Q02P09N49J166L27q67
15037B066l61n10j266j354P36k24r52R42J974j08j90m82J179J93k69o31k71j783
$$ plain form
15159 -4703 -5117 -3593 -3485 -4022 -2698 -1696 -2415 -2485 -2477 -339 878 -12 -728 -2836 -445 2628 2695 1020
15141 1020 -1005 -1440 -664 915 1979 594 105 1912 3736 1882 -1019 -3002 -1654 1346 671 -775
15125 -775 -1197 -1135 -894 -602 -559 -33 1144 694 -637 -1362 -2138 -3183 -3041 -1839 -1052 -2073 -1143 106
15107 106 970 1439 1439 2098 3716 4267 2537 511 2012 3416 3074 1544 -226 -974 -796 428 1820
15090 1820 1523 961 1941 1430 792 1200 1709 2087 163 678 -413 -3391 -2431 1202 1015 -1252 -1458 -1236
15072 -1236 -1284 -446 109 783 -1109 -2997 -3632 -2732 -1196 203 898 757 955 -117 1089 161 -1920
15055 -1920 -1124 956 673 -48 433 792 1665 2218 1035 -245 -996 -620 182 891 1440 2606 2933 2066
15037 2066 1705 1195 -71 -1425 -689 -913 -1865 -923 1051 943 753 271 1450 1643 1374 743 472 -1311
15019a311J78J127J058j82q60N50M21J116J614J281K70m40j100M8j011q90J353
15002C222J385j445m5M02r97n49J42j449K8J776J763j123P49j427q90K25K154
14985C921Q86p21n37K567J449o34n65j319n81r96K463L65J122J731J804J323J998
14968A4276j578j108k71o21K84j190o22J551L30n0J066n3k12M05J517L46J379
14951A5449P15j478o5J004O42n65J234l8R18p89n64q97J65O34K96P12j004j816
14933A4553j208K3M19Q6o56N89J944p20r22R1L45J665J634o26m88o16j057r93
14915A4063J074N66J170k00p2n64N72J324L058J379j800j893L79Q4o57m33P39
14898A8789k462J715J03J651O02m14j659k424j666M42j74j595R26j64l81J39l15
$$ plain form
15019 -1311 -1133 -6 1052 870 10 560 981 2097 3711 4992 5262 4822 3722 3770 2759 1869 3222
15002 3222 4607 3162 3117 3519 2522 1973 2115 666 694 2470 4233 3110 3859 2432 1542 1767 3921
14985 3921 4807 4086 3549 6116 7565 6931 6366 5047 4466 3470 5933 6298 7420 9151 10955 12278 14276
14968 14276 12698 11590 11319 10698 10982 9792 9170 10721 11051 11001 12067 12014 11802 12207 13724 14070 15449
14951 15449 16164 14686 14621 15625 16267 15702 16936 16898 17816 17027 16463 15566 15731 16365 16661 17373 16369 14553
14933 14553 13345 13368 13787 13873 13217 13806 15750 15030 14108 14199 14544 16209 17843 17217 16729 16113 15056 14063
14915 14063 15137 15703 16873 16673 16601 16037 16609 17933 20991 22370 20570 18677 19056 19140 18483 18050 18789
14898 18789 16327 18042 18145 19796 20398 19984 18325 15901 14235 14677 14503 12908 13834 13670 13289 13428 13113
14881A3113L41J12L85n07k199j792J102j10k36k216r86O6J437n30n40r55r10J88
14863E763j556j212O00l79r06l30J633O28m19j07J488L09q20Pk96j655j335J654
14845C067Q45n24n45k99Q53m61n64J40K24J283o65j83J52Q51n68j565n78j09j4
14826A340p53q87m28j11K310M20j092j2j493j892j599J113K064J931J117p09o86
14809F33j41k817Q2K794N67P51P45j307j98j467K202J897J83j216p23J150J24
14792C259j836k055n06K510J127j703r68P51N22l8j012n43j49k48K38k72j932
14775b855p38R16J449J148j267p4Q02J268K71M73l09j285P88R25%q47L71J319
14757B355Q94j221n27o2J018o06P5j611o47J141m09m47J515P67q07m04K79j81
$$ plain form
14881 13113 13454 13566 13951 13444 11245 9453 10555 10445 10209 7993 7007 7073 8510 7980 7440 6485 5575 5763
14863 5763 4207 2995 3595 3216 2310 1980 3613 4241 3822 3715 5203 5512 4692 4699 4403 2748 1413 3067
14845 3067 3912 3388 2843 2544 3397 2936 2372 2512 2736 4019 3354 3171 3323 4174 3606 2041 1463 1354 1340
14826 1340 587 -300 -728 -839 1471 1891 799 787 -706 -2598 -4197 -3084 -1020 911 2028 1319 633
14809 633 492 -2325 -2243 551 1118 1869 2614 1307 1109 -358 1844 3741 3924 2708 1985 3135 3259
14792 3259 1423 -632 -1138 1372 2499 796 -172 579 1101 1063 51 -492 -641 -889 -651 -923 -2855
14775 -2855 -3593 -2677 -1228 -80 -1347 -1421 -619 649 920 1393 1084 -201 587 1512 1512 665 1036 2355
14757 2355 3249 2028 1501 1439 2457 1851 1926 315 -332 809 400 -47 1468 2235 1428 1024 1303 1122
14739A122R46N30l27l209o21P80m11k77M53J811J220j114n09M52n4R0J231J192
14721C305Q01qk912k02J118O05q66K47n97q05j074j335M3J263J659M25o31m65
14703E71P06J719j84k91k87r00J671n90j111l87O61r26k449k02R44p1P09J595
14685A178J266o21j101j044r3K08J71j055J81k19K14J355L88J438K93j810j558
14668h09J687J004k89n58p51l69k78K139K006M70j534N32n03k916k68Q96N52Q55
14650A866j14k073m18Q25J204P45P61J077n22P98R56k93j54j384o99m44n27q3
14632A521Q45Q50O15o31O6L64j129j652m49L052K295p07k05j40j020j19Q6R56
14614D598J661P90j50l33K14K082P48N31J646L89o80j014N9M59K41p9l14K399
$$ plain form
14739 1122 2068 2598 2271 -938 -1559 -779 -1190 -1467 -1014 797 2017 903 394 846 792 882 2113 3305
14721 3305 4106 4098 1186 984 2102 2707 1841 2088 1491 686 -388 -1723 -1680 -417 1242 1667 1036 571
14703 571 1277 2996 2812 2521 2234 1334 3005 2415 1304 917 1578 652 -1797 -1999 -1055 -1126 -417 1178
14685 1178 2444 1823 722 -322 -415 -207 -36 -1091 -910 -1129 -915 440 828 2266 2559 749 -809
14668 -809 878 1882 1593 1035 284 -85 -363 1776 3782 4252 2718 3250 2747 -169 -437 459 1011 1866
14650 1866 1752 -321 -739 86 1290 2035 2796 3873 3351 4149 5105 4812 4658 3274 2575 2131 1604 1521
14632 1521 2366 3216 3831 3200 3266 3630 2501 849 400 3452 5747 5040 4835 4695 3675 3556 3642 4598
14614 4598 6259 7049 6899 6566 6780 8862 9610 10141 11787 12176 11496 10482 10541 11000 11241 11162 10848 13247
14596A3247K408m16K92J535r76j402R61J939J410J08M46l55P03l99o77K49M60
14579A9533m44N98R03J042L56n87j802K5J961K195O37r64l02j78n44k44J404J703
14561B5292J424J003n51j189J40j27P30J236o01K34M16J246k36r04M42K2K37N08
14543B9322j69j602k82q66R86%K0k878k793j440L92M29J514m43o16K6j495k564
14525A7541l22o2J004L58r36P04N50l25j243j531Q57p58M80K111j332j748j513
14508A3835j388j014J062Q95O79M16j621j453J049L92k320k516n20N61j435m64
14492F158N6L88P6k381j008P52n65j51J43O84L28j299j649J78K266R6l5R4l51
14473C780k479k061Q43R19K246J275O07j210k87N25N48j094p71j149j25P91P82
$$ plain form
14596 13247 15655 15239 15531 17066 16090 14688 15649 17588 18998 19106 19552 19197 19900 19501 18824 19073 19533
14579 19533 19089 19687 20590 21632 21988 21401 19599 19624 21585 23780 24417 23453 23151 22973 22429 22185 23589 25292
14561 25292 26716 27719 27168 25979 26119 25992 26722 27958 27357 27591 28007 29253 29017 28113 28555 28577 28814 29322
14543 29322 29153 27551 27269 26403 27389 27389 27409 24531 21738 20298 20690 21119 22633 22190 21574 21600 20105 17541
14525 17541 17219 17157 18161 18519 17583 18287 18837 18512 17269 15738 16595 15837 16317 18428 17096 15348 13835
14508 13835 12447 11433 12495 13390 14069 14485 12864 11411 12460 12852 10532 8016 7496 8057 6622 6158
14492 6158 6214 6602 6678 4297 3289 4041 3476 3325 3468 4152 4480 3181 1532 1710 3976 4072 4037 4131 3780
14473 3780 1301 -760 83 1002 3248 4523 5130 3920 3633 4158 4706 3612 2841 1692 1567 2358 3140
14456C140K105J891M47j808j177l49o01N12j020K96o81j586P42J522L32P29J073
14439E567q4j347k90n32o30m32n33n74L99J158j69p11J74j55j99k48r7L77l06
14420A368L9J362N46j161j46j3P5k54P09N46K95l72M21m1m72m97Q6j693o83l92
14400b77J063N96J06L84Q18P25j061o11j785K2r74LL22N24N20L72n63j089J075
14381A70J913j235m29O9J89J680N01M09k226J091J851O57J78j059q16K04L62o65
14363B844O17K4j87q38r83l89l07K60j56o5n06p55J715J650p08k227j64L83j13
14344I5M11Q45P10p97p75k36J798R99j319j570M17j01l20o30j19j091k19J770
14326a32J769O19j497J080R3n64j678O77N75n94p23q1N33L77J449O76k547r97
$$ plain form
14456 3140 5245 7136 7583 5775 4598 4249 3648 4160 3140 3436 2755 1169 1911 3433 3765 4494 5567
14439 5567 5483 4136 3846 3314 2684 2252 1719 1145 1544 2702 2533 1822 1996 1841 1642 1394 1297 1674 1368
14420 1368 1407 2769 3315 2154 2008 1995 2070 1816 2525 3071 3366 2994 3415 3374 2902 2405 2491 798 115 -277
14400 -277 786 1382 1488 1872 2690 3415 2354 1743 -42 -20 -994 -991 -669 -145 375 747 184 -905 170
14381 170 2083 848 419 488 677 2357 2858 3267 1041 2132 3983 4640 4818 3759 2943 3147 3509 2844
14363 2844 3461 3485 3298 2460 1477 1088 781 1041 885 820 314 -441 1274 2924 2216 -11 -175 208 95
14344 95 506 1351 2061 1264 489 253 2051 3050 1731 161 578 477 157 -473 -592 -1683 -1902 -132
14326 -132 1637 2256 759 1839 1932 1368 -310 367 942 348 -375 -456 77 454 1903 2579 32 -965
14308i65r78J610M22l29j11k95P40m53K73R10Q11p17r09J65O79j173J352K251
14290C283k62j156j733k578j000q8K25K764J408j175K77K398J63R9j212o18q90
14273i5Q95K69Q45J81k82r35q88l94N53M50R10J702J6J050j741j643p71p39J699
14254A082n17p12N9O09p68n16M00N93R4r70M80J57N0j70m88J262K8k573j286k28
14234c414R27J14J523J101P75m48o33l61j075p55n76J018K11O39p19Q79L26J473
14216A005L66p6J426j395q00j078P34K339O19j138j608j099M06j549j086j113
14200d047J763O37J356R14N21j209q24j379j1m62O47n63K61J287R5j083n15Q70
14182a742O03J349n24m21j164J409j29j529o63J228J402j1k27m8o09O79J486Q25
$$ plain form
14308 -965 -1943 -333 89 -240 -351 -646 94 -359 -86 824 1635 918 9 174 853 -320 1032 3283
14290 3283 3021 1865 132 -2446 -3446 -3534 -3309 -545 863 -312 -35 2363 2526 2625 1413 795 -95
14273 -95 800 1069 1914 2095 1813 878 -10 -404 149 599 1509 3211 3227 4277 2536 893 122 -617 1082
14254 1082 565 -147 -88 521 -247 -763 -363 230 324 -646 -166 -9 41 -129 -617 645 673 -1900 -3186 -3414
14234 -3414 -2487 -2373 -850 251 1026 578 -55 -416 -1491 -2246 -2822 -1804 -1593 -954 -1673 -794 -468 1005
14216 1005 1371 1295 2721 1326 526 -552 182 2521 3140 2002 394 -705 -299 -1848 -2934 -4047
14200 -4047 -2284 -1647 -291 623 1144 -65 -889 -2268 -2279 -2741 -2094 -2657 -2396 -1109 -1014 -2097 -2612 -1742
14182 -1742 -1139 210 -314 -735 -1899 -490 -619 -2148 -2811 -1583 -181 -192 -419 -467 -1076 -397 1089 1914
14164A914k618j535N48L1K95J743J433p97q00m90j046o1J69q13n03k37J621J0
14146a136n98o64n49K565o78j96j308o09J488K487J628l68o71P58N40k84j976
14129D29j584j55P50J525k48n92N83M25j946O52o15p6M08J742J219J096J164J50
14111D927n41R8k411p67l13M37o39LJ204J107R7j11Q4l47n31M99k3r01m43K093
14091C522J856J927J125Q05j622K7R86k13R79O62K98o16k993l5N98k39q69j219
14073D979o33J599L1j644n72P55n14k607m17J771K33j534j10j26M75J213J81L41
14055C421m03o88j227j047j368P31L22k083k36J906K080J74l69j914L48j677k70
14038b300L634J048j30J30j664l52j808k81L50P40MP06Q68o30r06M65m95j756
$$ plain form
14164 1914 -704 -2239 -1691 -1660 -1365 378 1811 1014 214 -276 -1322 -1383 -1214 -2027 -2530 -2767 -1146 -1136
14146 -1136 -1734 -2398 -2947 -382 -1060 -1256 -2564 -3173 -1685 802 2430 2062 1391 2149 2689 2405 429
14129 429 -1155 -1310 -560 965 717 125 708 1133 -813 -161 -776 -852 -444 1298 2517 3613 4777 4927
14111 4927 4386 4484 2073 1306 993 1430 791 794 1998 3105 3202 3091 3175 2828 2297 2796 2773 1872 1429 3522
14091 3522 5378 7305 8430 9235 7613 7640 8626 8413 9392 10054 10352 9736 6743 6708 7306 7067 6198 4979
14073 4979 4346 5945 5976 4332 3760 4515 4001 1394 977 2748 2981 1447 1337 1211 1686 2899 3080 3421
14055 3421 3018 2330 1103 56 -1312 -581 -259 -2342 -2578 -672 1408 1582 1213 -701 -353 -2030 -2300
14038 -2300 1334 2382 2252 2382 718 366 -1442 -1723 -1373 -633 -629 77 945 315 -591 -126 -621 -2377
14020b377J540J460M38J93q88j861p16r04m98J873PM10J973J586J304j689r22
14003I29J580M07j086j323J16j315q43J33J092R09J64O25J28K8Q17n5k83n33j830
13984c40m40J031J799j392j038r09J799N60J014m86j980j613n87P68J456m23J417
13967F36l9Q41O25j60l37n79p2Q97O6m06j288j734l69o1P64O34J273J328M05j142
13947A282j089J141n20k058k2N21L58J073J102j76K40n72N47k27J900l84r25j095
13929A096j182m39N49j23r35j307MM72l09M86K129k51J02j78Q80j26N08K93J303
13910B972k5j34Q9k039j000r1O09j22P86p24q66q5m37m55P06o00L23J824O31j150
13890B12j024k65q08J380K195l69m02K65p33n42N54K6J98l45m18L78j55j244J551
$$ plain form
14020 -2377 -837 623 1061 1254 366 -1495 -2211 -3115 -3613 -1740 -1733 -1323 650 2236 3540 1851 929
14003 929 2509 2916 1830 507 623 -692 -1535 -1402 -310 599 763 1388 1516 1544 2361 2306 2023 1490 -340
13984 -340 -780 251 2050 658 -380 -1289 510 1070 2084 1598 -382 -1995 -2582 -1814 -358 -781 636
13967 636 597 1438 2063 1903 1566 987 915 1812 1878 1472 184 -1550 -1919 -1980 -1216 -582 691 2019 2424 1282
13947 1282 193 1334 814 -1244 -1266 -745 -387 686 1788 1612 1852 1280 1827 1600 3500 3116 2191 1096
13929 1096 -86 -525 24 -99 -1034 -2341 -2337 -1865 -2174 -1688 441 190 292 114 994 868 1376 1669 2972
13910 2972 2947 2813 2902 863 -137 -228 381 259 1045 321 -545 -630 -1067 -1522 -816 -1416 -1093 731 1362 212
13890 212 -812 -1077 -1885 -505 1690 1321 919 1184 451 -91 463 489 687 342 -76 302 147 -1097 454
13871D54J695J331j887j604j422O43p02m35Q99K03k06N66j190o66N69j97Q51L091
13853A993j732o58L4J598Q82j43m82J60k302j260p24J96L30J438J262o33K307
13836B266J944P56q72j210j098j025p00j114n30K43j627r55J385M3O17K719J28
13819I70J94o12j658J53j41J468N02j150k070J19J450M01n56k82K178Q54P7N70
13801B467j254Q97q55j845m33j31k99K10J077K68K55m14j120J44L15l51q84m45
13783b398M08N47Q94Q67L87l0r06m44j46l35Q7K007l5N87n30J44M99Q4L32j737
13763B82p22P44q59j620o38J422P9O99J306l09M06K05r9J10m99l08j514n35R19
13744i31J695q15l52p83m54J666J72r08J082k20j537J034j61J36P10p05K74l3
$$ plain form
13871 454 2149 3480 1593 -11 -1433 -790 -1492 -1927 -1028 -825 -1031 -465 -1655 -2321 -1752 -1949 -1098 1993
13853 1993 261 -397 -363 1235 2117 1974 1492 1652 -650 -1910 -2634 -2438 -2108 -670 592 -41 2266
13836 2266 4210 4966 4094 2884 1786 761 61 -1053 -1583 -1340 -2967 -3922 -2537 -2494 -1877 842 970
13819 970 1164 552 -1106 -953 -1094 374 876 -274 -2344 -2225 -775 -374 -930 -1212 966 1820 1897 2467
13801 2467 1213 2110 1255 -590 -1023 -1154 -1453 -1243 -166 102 357 -57 -1177 -1033 -718 -1069 -1953 -2398
13783 -2398 -1990 -1443 -549 318 705 675 -231 -675 -821 -1156 -1069 938 903 1490 960 1104 1603 1687 2019 282
13763 282 -440 304 -555 -2175 -2813 -1391 -1312 -613 693 384 790 995 896 1006 507 199 -1315 -1850 -931
13744 -931 764 -51 -403 -1186 -1640 26 198 -710 372 152 -1385 -351 -512 -376 334 -371 -97 -130
13726a30J914L17r58p00O75K62l31m6k170p30M33Q60K92O6q23M96p81J688J890
13707B224o30j190K79K201r64j006o33r43J014N19k658n79Q62J739Q60O91K97
13690B083j136j113r81p2R05j52qP86K075j408j164J163O9J00M61r26R84L071
13672D737j22j317r34j342J26o55l33Q86j535l26m8J663R3j805M35N54N97n43
13654A31O00l64m68j9j897j38J326l83j22q13m87m66K03Q97L52O35j671J430J468
13635B14J133O25J293K37j274j77R60J264m79j089o83j135j60P96J118r32p88
13618I23J380k03Q29j134j484l82n55K35Ok407L0K210n4n00J111O76J418K1J29
13599B249J221j01Q44N38K35o36j00l13j867K37J875L39n94k329q27l90k68R0
$$ plain form
13726 -130 1784 2101 1143 443 1118 1380 1049 1003 -1167 -1897 -1464 -604 -312 -246 -1069 -573 -1354 334 2224
13707 2224 1594 404 683 2884 1920 914 281 -662 352 871 -1787 -2366 -1504 235 1095 1786 2083
13690 2083 947 -166 -1147 -1219 -314 -466 -474 312 2387 979 -185 978 1047 1147 1608 682 1666 4737
13672 4737 4615 3298 2364 1022 1148 493 160 1046 -489 -815 -863 800 893 -912 -477 77 674 131
13654 131 731 367 -101 -120 -2017 -2155 -829 -1212 -1334 -2147 -2634 -3100 -2897 -2000 -1648 -1013 -2684 -1254 214
13635 214 1347 1972 3265 3502 2228 2051 3011 4275 3796 2707 2024 889 729 1525 2643 1711 923
13618 923 2303 2100 2929 1795 311 -71 -626 -391 -385 -2792 -2762 -552 -606 -1106 5 681 2099 2120 2249
13599 2249 3470 3369 4213 4751 4986 4350 4250 3937 2070 2307 4182 4521 3927 1598 771 381 113 203
13581B03j352l45O91l87k92J510J380K99j454j35j117M25j20O59P75M44p31J78
13563F31j62p17j457j97nJ115p9N07J395L36J242P36k032q75j780j309P72J424
13545d55N3P4Q31n14j310k69J806l82J126J681L72k372q71N49p15l62o49J62J35
13526a110M69n19K98K157J27l02Q3M74N43L85j063o03r47p00J031J175Oo21J016
13507A899J2m06L53o44k61J56k66J394n58o05L14J009n66o03j595K42K842J477
13489D194N32o19q79j396p38j3J713P3r00n60j851l12J466k68P1k92R02M78K1
13470A622M32Q45J20j186r92J482o34O0k43o00r35j219M55J022M92N55m99q12
13452c5l22L4p80k16J808R87p76r61N96J211P79j413l30P79J145N41k53r93L2
$$ plain form
13581 203 -1149 -1494 -803 -1190 -1482 28 1408 1707 253 118 -999 -574 -694 -35 740 1184 453 631
13563 631 469 -248 -1705 -1902 -1907 -792 -871 -364 1031 1367 2609 3345 1313 438 -1342 -2651 -1879 -455
13545 -455 -402 -328 503 -11 -1321 -1590 216 -166 960 2641 3013 641 -230 319 -396 -758 -1407 -1245 -1110
13526 -1110 -641 -1160 -862 1295 1422 1120 1203 1677 2220 2605 1542 939 -8 -708 323 1498 1504 883 1899
13507 1899 1911 1505 1858 1214 953 1109 843 2237 1679 1074 1388 2397 1831 1228 -367 -125 2717 4194
13489 4194 4726 4107 3228 1832 1094 1081 2794 2867 1967 1407 -444 -756 710 442 513 221 1123 1601 1622
13470 1622 2054 2899 3019 1833 841 2323 1689 1749 1506 906 -29 -1248 -793 229 721 1276 777 -35
13452 -35 -357 -323 -1103 -1319 489 1476 700 -261 335 1546 2325 912 582 1361 2506 3047 2794 1801 1833
13433A833r18k34M62R5O51j91J409L46k016j554k96K94r60J523J14M33J32M67
13415A590M22n04j981m74J816k7n70j322Q92p10n78r0n26J169O77n06J406l39
13397C45j093o47j53J487R50M70l29n5O02P91j150j6R3J453J515k93n05J01J06
13378C672k215M60J689o61p90k12m27J348J898o01j532j423J135Q56K67j791j317
13361C56n75J787J7l93o77k72j269p30J139M93j090Q71J034O99J800J634j899
13344B925q65N51K2j163n70o7J065K89j208N56L05J511l47k75N35p95P14P92n72
13325C403P42l37r26Q5j817p3O52Jl29n05M61L37m23q20O80O26m89M13P19J250
13305C650l73j361R06l92k384Q48K074j065q92o93j496p97O79J488O64P79L40
$$ plain form
13433 1833 915 681 1143 1238 1889 1698 3107 3453 1437 -117 -413 -119 -1079 444 558 991 1123 1590
13415 1590 2012 1508 -473 -947 869 842 272 -1050 -158 -868 -1446 -1536 -2062 -893 -216 -722 684 345
13397 345 -748 -1395 -1548 -61 889 1359 1030 975 1577 2368 1218 1202 1295 2748 4263 3970 3465 3566 3672
13378 3672 1457 1917 3606 2945 2155 1943 1516 2864 4762 4161 2629 1206 2341 3197 3464 1673 356
13361 356 -219 1568 1585 1192 515 243 -1026 -1756 -617 -124 -1214 -343 691 1390 3190 4824 2925
13344 2925 2060 2611 2633 1470 900 833 1898 2187 979 1535 1840 3351 3004 2729 3264 2469 3183 3975 3403
13325 3403 4145 3808 2882 2967 1150 1077 1729 1730 1401 896 1357 1694 1271 451 1131 1757 1268 1681 2400 3650
13305 3650 3277 1916 2822 2430 46 894 2968 1903 1011 318 -1178 -1975 -1296 192 856 1635 1975
13288A975k282n78Q35P48k68P12l82o50Q74J511R0J34m37J40m22k189M42J383
13270A636O85j26j809j805K144K852j026j494j679J990l48k691J763J386j040
13255D38J566o8Q30P17O11o55J076n07j177J103p8j764j728j143M29J019m12m61
13237b04M18nK42Q62l87J522O97m42k464n32M65p22M37J337J192J353J241j037
13219C973k431j354J027K86N2O7J56l4J61q02r05J63R01J94M85m82J77o41J677
13200B670Q8J08k048j783K187K114L0q17L6j003J88J345L42l12M2j069L02m71
13182A949p46R53K153L17j175k032R73Q96K46p23j169M14o64J287J707j69o2N63
13164D718j086j073j36J427m93k181p82l58j303l47J386K119J684p06k832n42
$$ plain form
13288 1975 -307 -885 -50 698 430 1142 760 110 984 2495 2585 2719 2282 2422 2000 -189 253 1636
13270 1636 2321 2195 386 -1419 725 3577 2551 1057 -622 1368 1020 -1671 92 1478 438
13255 438 2004 1936 2766 3483 4094 3439 4515 4008 2831 3934 3856 2092 364 -779 -350 669 257 -204
13237 -204 214 209 451 1313 926 2448 3145 2703 239 -293 172 -550 -113 1224 2416 3769 5010 3973
13219 3973 1542 188 1215 1501 1553 1620 1776 1742 1903 1101 196 359 1260 1454 1939 1457 1634 993 2670
13200 2670 2758 2866 818 -965 1222 3336 3366 2549 2585 1582 1770 3115 3457 3145 3187 2118 2420 1949
13182 1949 1203 2156 4309 4626 3451 1419 2392 3288 3534 2811 1642 2056 1392 2679 4386 4217 4155 4718
13164 4718 3632 2559 2423 3850 3357 1176 394 36 -1267 -1614 -228 1891 3575 2869 37 -505
13148e05J437J268j14j127j168L50j213Q10K260K29k212P85J894r69j74O44M36
13131B631p00l46j008o66J86K08L42L94J303P39j314j192R68J075J630K467n67
13114F150m17J519k32j907p93j394j25o55O39j63l21N72n36j669J014L58J208
13097C248R99n30q64J26M99j317P3k53l50j110r89J92n33N41J453J121N90L43
13079C239j593k30O84M32P01J05q4O31J377R4O3K93j53p05j523k016n32j480K150
13060A453J428k82l36mk75m1r91J28o45p62K39n5o5K212J527n16M7M49j9l90N58
13039C660K27j672j019J17K54k90R5o18N5r28Q79J810J288j705J71O82J580Q3
13021D669l69l94l70N56m62l95m74l12K86P05M06J519L215o97l423K02o05j010
$$ plain form
13148 -505 932 2200 2086 959 -209 141 -1072 -262 1998 2227 15 800 2694 1725 1551 2195 2631
13131 2631 1931 1585 577 -89 97 305 647 1041 2344 3083 1769 577 1545 2620 4250 6717 6150
13114 6150 5733 7252 7020 5113 4320 2926 2801 2146 2785 2622 2301 2873 2337 668 1682 2040 3248
13097 3248 4247 3717 2853 2979 3478 2161 2234 1981 1631 521 -468 -276 -809 -268 1185 2306 2896 3239
13079 3239 1646 1416 2100 2532 3233 3338 3254 3885 5262 5356 5419 5712 5559 4854 3331 1315 783 -697 1453
13060 1453 2881 2599 2263 2259 1984 1943 952 1080 435 -327 -88 -143 -208 2004 3531 3015 3062 3511 3492 3102 3660
13039 3660 3887 2215 1196 1313 1567 1277 1372 754 809 -119 760 2570 3858 2153 2324 3006 4586 4669
13021 4669 4300 3906 3536 4092 3630 3235 2761 2449 2735 3440 3846 5365 8580 7883 4460 4662 4057 3047
13003C047J054Q50n51j122J270R6j442J46P63k03j859j889J042J035P98O9J786
12986D890N11O67J003r23j630n70n59r08j140j67K40m6J115K42Q61o23K88r99
12968B252j573O39J573L03p3M16L76J331j008j434j165k127J449K373j538m35
12952A359M66J655k41m65k76m36L67j689j021o73j396Q96L36J243J357J289J234
12935D005J378J864j025o17j454l99j26j535j12L08M7m01J34J07q9J418N25m72
12917C556k06q24j36j557L9K025k13K16o27M88j058l08O9J730LR19N62m96Q44
12898E026j09j054J47m65p81n46J420R5j861J589J048R06j563j979J209K062M66
12881E610j338j257J03J275M44K60k24r6L2O73l29O5J762J435m90m06j082k03
$$ plain form
13003 3047 4101 4951 4400 3278 4548 4644 3202 3348 4111 3908 2049 160 1202 2237 3035 3104 4890
12986 4890 5401 6068 7071 6148 4518 3948 3389 2481 1341 1174 1414 1368 2483 2725 3586 2963 3251 2252
12968 2252 679 1318 2891 3194 3121 3537 3913 5244 4236 2802 1637 -490 959 3332 1794 1359
12952 1359 1825 3480 3239 2774 2498 2062 2429 740 -281 -954 -2350 -1454 -1118 125 1482 2771 4005
12935 4005 5383 7247 6222 5605 4151 3752 3626 2091 1979 2287 2334 1933 2067 2174 2085 3503 4028 3556
12917 3556 3350 2526 2390 833 872 2897 2684 2900 2273 2761 1703 1395 1464 3194 3197 4116 4678 4182 5026
12898 5026 4917 3863 4010 3545 2764 2218 3638 3733 1872 3461 4509 5415 3852 1873 3082 5144 5610
12881 5610 4272 3015 3118 4393 4837 5097 4873 4777 4809 5482 5153 5218 6980 8415 7925 7519 6437 6234
12863F234r28k598J452J718n00j472L3K013m3j073k35q33r69P4j29K75O32k65
12845C386p59J490Q12r09j80J55R68m02n74J306Q39r18kO99m27p51j533K57R83
12826D440J86K15R63m90j381j045o67J451p20P17k00J677K411m66L3m21m68j122
12808E113o22j74J40Q94M85j183J5J726n53J215r31l015J73P56L04K13m99k396
12790A661n22J390J281Q07n86J106p4j097q83r63J856J898M65q67O7N97J79j26
12772F189q53j448j592J159r31k71J307M90j218J68N73j161L68Q81M74J621Q55
12755F611k318j714J215J178K102j103k578n86L63j99J812L49j055k044r8J636
12739C571K134K140m21j427j318j928k378l12K160J526P73M70j021j335M11l7
$$ plain form
12863 6234 5306 2708 4160 5878 5378 3906 3939 5952 5909 4836 4601 3768 2799 2873 2744 3019 3651 3386
12845 3386 2627 4117 4929 4020 3840 3995 4963 4561 3987 5293 6132 5214 5212 5911 5484 4733 3200 3457 4440
12826 4440 4626 4841 5804 5314 3933 2888 2221 3672 2952 3669 3469 5146 7557 7091 7124 6703 6235 5113
12808 5113 4491 4317 4457 5351 5836 4653 4668 6394 5841 7056 6125 3110 3283 4039 4343 4556 4057 1661
12790 1661 1139 2529 3810 4617 4031 5137 5063 3966 3083 2120 3976 5874 6339 5472 5539 6136 6315 6189
12772 6189 5336 3888 2296 3455 2524 2253 3560 4050 2832 3000 3573 2412 2780 3661 4135 5756 6611
12755 6611 4293 2579 3794 4972 7074 5971 3393 2807 3170 2971 4783 5132 4077 2033 1935 3571
12739 3571 5705 7845 7424 5997 4679 2751 373 61 2221 3747 4520 4990 3969 2634 3045 3008
12723C008O80P25N29K54j612j131n45J483P34L83Q76K88M66k71q36p26K80J162
12705E747n24j394j218J91J76J230J638o72L29J206J119n11J190P38K37n81L0
12688H931j501k63m92N05K603M75j771n46m61j34j89L2J430K234K395K597j18
12671A5727j498L40K6j394J889N437M943L911M825P295J3894K3761M0789O1202
12657A81147P2326M5333j2790n7000o6543n3406l5950j9691j1839p381m584k553
12645B7069l268l004j279j596j645k86m76j031q21O44R04m51k634j211n46j476
12629H893j212l59N59O28j224o79M88j163J81M58O35L41N1L98p25K92m25J2J594
12610H743r06k301k008j091J530K770O36n06P16q53q58o47j57k96j42K204K365
$$ plain form
12723 3008 3688 4413 4942 5196 3584 2453 1908 3391 4125 4508 5384 5672 6138 5867 5031 4305 4585 5747
12705 5747 5223 3829 2611 2802 2978 4208 5846 5174 5503 6709 7828 7317 8507 9245 9482 8901 8931
12688 8931 7430 7167 6675 7180 9783 10258 8487 7941 7480 7346 7157 7189 8619 10853 13248 15845 15727
12671 15727 14229 14569 14595 13201 15090 20527 25470 29381 34206 41501 55395 79156 119945 181147
12657 181147 253473 298806 286016 229016 162473 109067 73117 53426 41587 34206 29622 27069
12645 27069 23801 20797 19518 17922 16277 15991 15515 14484 13663 14307 15211 14760 12126 10915 10369 8893
12629 8893 7681 7322 7881 8509 7285 6606 7094 5931 6112 6570 7205 7546 7597 7995 7270 7562 7137 7149 8743
12610 8743 7837 5536 3528 2437 3967 6737 7373 6867 7583 6730 5872 5225 5068 4772 4630 6834 9199
12593I199K013J423j593k166j678J174J769J582J050L32j320o93j709J484Q51
12578A1718O16j05K7n64j938k237K19K68N46M87j118Q47R61k13o92j131k12R32
12560H411Q19L26j950L97J78J242k77J04J403j00j253Q13L04M53k52J021L652
12543A5291R79q25m35J501K619K231Qj996j559k919j19K49L25J31j390j82j207
12526A2702j582j097J448M05j33M38K03k2j291l60j167J028l67J780L53j419k281
12509H638p44Q53J795M07o16N09J002O83j290R0Q77m92k213j455N57K109J046
12492A1756K040J307L76J434K928J162Q00P71L82l965n046j421J2989p58r891
12477A4864m040m715M725k47l42j485N46J261J067k25r69o10Q86k425l146L50
$$ plain form
12593 9199 11212 12635 11042 8876 7198 8372 10141 11723 12773 13105 11785 11092 9383 10867 11718
12578 11718 12334 12229 12256 11692 9754 7517 7736 8004 8550 9037 7919 8766 9727 9514 8822 7691 7479 8411
12560 8411 9230 9556 7606 8003 8181 9423 9146 9250 10653 10553 9300 10113 10417 10870 10618 11639 15291
12543 15291 16270 15445 15010 16511 19130 21361 21369 19373 17814 14895 14776 15025 15350 15481 14091 13909 12702
12526 12702 11120 10023 11471 11876 11743 12181 12384 12362 11071 10711 9544 10572 10205 11985 12338 10919 8638
12509 8638 7894 8747 10542 10949 10333 10842 11844 12527 11237 11327 12204 11712 9499 8044 8601 10710 11756
12492 11756 13796 15103 15479 16913 19841 21003 21803 22574 22956 18991 13945 12524 25513 24755 14864
12477 14864 10824 6109 10834 10587 10245 8760 9306 10567 11634 11409 10440 9830 10716 8291 5145 5495
12461E495J047q5k14P94K33m94j9K332k7j128o28R06q78j018K35L23j839R63J862
12442G860P19m44K5j171j049K305J645n77q21j069J342J817O94r6j456O20M37
12425A0781k575j54P14k59N81K31L9r19j987oK271J667k70l500P09J874l29l72
12407H496l75M68j212j222j270J600K236Q24m75o30J122O26p60q01p48j56P32
12390H455O81j259Q35Q24q9M67j198j114l15P51o41k19J989n45q93j21J681O09
12372I898r09J22l61j515q25L324J378k99j01L33J238N98p01j743j600P52K067
12355A1656J747Q85R5q08j296r81J902p93l4j566n41J107R69q75J6l84k93j33
12337A0673k25J30J001M57o41M58j239J72R39r11j272L32k28J403K645J674O49
$$ plain form
12461 5495 6542 6457 6243 7037 7270 6776 6757 9089 9062 7934 7306 8212 7334 6316 6551 6874 5035 5998 7860
12442 7860 8579 8135 8160 6989 5940 8245 9890 9313 8492 7423 8765 10582 11276 11180 9724 10344 10781
12425 10781 8206 8052 8766 8507 9088 9319 9358 8439 6452 6446 8717 10384 10114 6614 7323 9197 8868 8496
12407 8496 8121 8589 7377 6155 4885 6485 8721 9545 9070 8440 9562 10188 9428 8627 7879 7723 8455
12390 8455 9136 7877 8712 9536 9447 9914 8716 7602 7287 8038 7397 7178 9167 8622 7729 7608 9289 9898
12372 9898 8989 9111 8750 7235 6410 9734 11112 10813 10712 11045 12283 12881 12180 10437 8837 9589 11656
12355 11656 13403 14288 14383 13575 12279 11298 13200 12407 12373 10807 10266 11373 12342 11467 11483 11099 10806 10673
12337 10673 10448 10578 11579 12036 11395 11853 10614 10786 11725 10814 9542 9874 9646 11049 13694 15368 16017
12320A6017j380j166o35j662l46J082O57J30K26M15P42K81r49j473J251M72r80
12303A2682l8j57r42j032L68O33R14m02P21J211J517k75o10J2j496j429p0N40
12285A2147J822l97r83n39J048M58j058nJ929o05k96N31k74j094P99L9P02k40
12267A3984%n71r47r57K703J169o7J352Q1K74k42k65L71Rn4R8k05p54J777j124
12247A6632j552k80m60N05R91O48Q06k05l11m5k97q26N77J485J586J534n50r01
12229A9337j082M1R56J397O99K135j0j009j456l70L470K856K094j168j688j279
12213B4923K263L492J376K560K318M214R686J7855K5981L4120K5979L931j0661
12200A48037o753R897K0659M073k1693l1662k8219k0564j5201r056n711l865m208
$$ plain form
12320 16017 14637 13471 12836 11174 10828 11910 12567 12697 12923 13338 14080 14361 13412 11939 13190 13662 12682
12303 12682 12644 12487 11545 10513 10881 11514 12428 12026 12747 13958 15475 15200 14590 14602 13106 11677 11607 12147
12285 12147 13969 13572 12589 12050 13098 13556 12498 12493 14422 13817 13521 14052 13778 12684 13483 13522 14224 13984
12267 13984 13984 13413 12466 11509 14212 15381 15314 16666 16747 17021 16779 16514 16885 16894 16840 16938 16733 15979 17756 16632
12247 16632 15080 14800 14340 14845 15836 16484 17290 17085 16774 16729 16432 15606 16183 17668 19254 20788 20238 19337
12229 19337 18255 18296 19252 20649 21348 23483 23473 22464 21008 20638 24108 26964 29058 27890 26202 24923
12213 24923 27186 30678 32054 34614 36932 41146 50832 68687 94668 128788 154767 158698 148037
12200 148037 141284 151181 171840 175913 154220 122558 94339 73775 58574 49518 43807 39942 35734
12187C5734l155P23k01j894k277N95O40j052r26Q34L626n20l493L43J484J195
12171C1656J724J923J420L178K201L313M465N472Q571J3259J4750K1932L6752
12158A50616O0316P8379N2622Q531k0909k3327j8280l3536m7113m1112k9182j7568
12146A19437q965k509O048J4606L0272M3229J9491k4910l9696l8271k8023j4768
12134G5941r562q298o341n529l597k503j668n43k13j236n27K144M140K938J580
12119D6726J311j243m702k581M47L728O279M813N541P144J1827J7938K8031M4216
12105A69475N9527M8133J0222p772k981m29k1838m3200m7092l9181k5402j5223
12093H4239r263m790m133m554m402k398n60n95k004n33m6L79J876N464J0194J4187
$$ plain form
12187 35734 32579 33302 33101 31207 28930 29525 30165 29113 28187 29021 32647 32127 28634 28977 30461 31656
12171 31656 33380 35303 36723 39901 42102 45415 49880 55352 63923 77182 91932 113864 150616
12158 150616 210932 289311 341933 350464 329555 306228 287948 254412 207299 166187 137005 119437
12146 119437 110472 107963 114011 128617 158889 202118 221609 196699 157003 118732 90709 75941
12134 75941 66379 58081 51740 46211 42614 40111 38443 37900 37687 36451 35924 38068 42208 45146 46726
12119 46726 48037 46794 42092 39511 39958 43686 49965 54778 60319 67463 79290 97228 125259 169475
12105 169475 229002 277135 287357 279585 276604 276175 254337 211137 164045 124864 99462 84239
12093 84239 74976 70186 66053 61499 57097 54699 54139 53544 51540 51007 50961 51340 53216 58680 68874 83061
12077H3061O888m328j0216j0994r839m728k582k088j637m443l273j22o41J160
12063C6218J110L107K770R52j793r47L73l32M95RL07O78j329k027J01j12n32Q68
12045C9916M88K68J01j252L71R15J076J121L208N906J2208J3509R601n906j2250
12030F9280j2105p302k707j673q54j718l087j191K065L419J929L306L101N407
12016E7870R568J8550K5595J4048p713k1527k6370k6026k0816j3860J530J2928
12004B3777J1063N727Q63j226l850k920k948j642J51J430K260j114l016j544m44
11989B6567j971j740P12J265J819J549K291J594J028L7K142M869O195P526N549
11974E9432L712N847J1542J7470K1581J0277m695j2806j2105q146o055j864j6
$$ plain form
12077 83061 89949 85621 75405 64411 54572 49844 47262 45174 43537 39094 35821 35699 35058 36218
12063 36218 37328 40435 43205 44157 42364 41417 41790 41458 41953 41962 42269 42947 41618 39591 39692 39580 39048 39916
12045 39916 40404 40672 40773 39521 39892 40807 41883 43004 46212 52118 64326 77835 87436 81530 69280
12030 69280 57175 49873 47166 45493 44639 42921 39834 38643 40708 44127 46056 49362 52463 57870
12016 57870 67438 85988 111583 125631 117918 96391 70021 43995 23179 9319 10849 23777
12004 23777 34840 40567 41430 40204 36354 33434 30486 28844 28995 30425 32685 31571 28555 27011 26567
11989 26567 24596 22856 23568 24833 26652 28201 30492 32086 33114 33151 35293 40162 46357 53883 59432
11974 59432 63144 68991 80533 98003 119584 129861 125166 112360 100255 92109 86054 84190 84174
11961H4174O922K2392K9927J7752l152j6092k4610j9132r747q550m402j232n244
11948F9006m635m62N519P39l708n817m977k736l118Q39P71j397J245J34m14k54
11932E0735Q81M44J982N729N384L621k200o591o085m587m841L5J887K175K274
11917E0843j315m421o442m084J46J769K982K173Q12n853r025n921k515K197J932
11902B3278R91K183P50Q34K515n24m081l964j927o436j3470j7153j7635j6527
11888e1166m600K7616N0214L9722K3438L593k947P6L13l403q173n741o117n916
11874E6909p365o689k092L958M926M875l61K25M877N209Q521R189L852J71n17
11859H5688j330N78M359O363J8983K8783M9576M0494J0674n514j7008j9941j8415
$$ plain form
11961 84174 91096 113488 143415 161167 158015 141923 117313 98181 88434 79884 75482 74250 69006
11948 69006 64371 63909 69428 70167 66459 60642 55665 52929 49811 50650 51421 50024 51269 51403 50989 50735
11932 50735 51616 52060 54042 59771 65155 68776 66576 59985 53900 49313 44472 44507 46394 48569 50843
11917 50843 49528 45107 38665 34581 34727 36496 39478 41651 42463 36610 27585 21664 19149 21346 23278
11902 23278 24269 26452 27202 28036 30551 30027 25946 21982 20055 13619 149 -17004 -34639 -51166
11888 -51166 -55766 -28150 22064 61786 85224 88817 85870 85946 86259 82856 74683 68942 62825 56909
11874 56909 49544 42855 40763 44721 49647 54522 54161 54386 59263 64472 72993 82182 86034 86205 85688
11859 85688 84358 84936 89295 95658 114641 143424 193000 233494 244168 238654 221646 201705 183290
11846A83290j0399o175m695j905j409K062L046J258L163J220j413n274j6332l2207
11832A14230o0044j11543j40029j00186O495J11765J43064J39577L2574m4813
11822I1090m6262q031J2884M809P97O569J1200O497P772J0168P874J525J274L647
11808A11813K711L829J154L48J344L084N484L496K85l173l471k025L836O797N114
11793A40626J101l35j243L736J3170J5721J0418L961J395j273j689o94Q88L429
11779A89211N751J1962J2254J0634J0244R388J5772K0323J8093J2337J3084J9958
11767C49011K5595K8630L1346J8359J00l10J6361L8209L9335K267k3435k6785
11755D98683j3385J370J0576J1029J4205J4855J4926K5233L2662L3884K6917J6220
$$ plain form
11846 183290 172891 166716 162021 160116 158707 160769 163815 165073 168236 169456 168043 162769 146437 114230
11832 114230 54186 -57357 -197386 -297572 -291077 -179312 -36248 103329 135903 91090
11822 91090 44828 36797 49681 54490 55287 61856 73056 79553 87325 97493 105367 106892 108166 111813
11808 111813 114524 118353 119507 119855 121199 124283 129767 133263 133548 130375 126904 124879 128715 135512 140626
11793 140626 141727 141392 140149 143885 157055 172776 183194 187155 188550 187277 185588 184894 185782 189211
11779 189211 194962 206924 219178 229812 240056 249444 265216 285539 303632 315969 329053 349011
11767 349011 374606 403236 434582 452941 453041 452731 469092 507301 546636 548903 525468 498683
11755 498683 485298 486668 497244 508273 522478 537333 552259 577492 610154 644038 670955 687175
11743F87175K4527M5494O8246Q2215R7689J04321P2475M1787N1704Q4538R5562
11732A455733O6740N3300M8630N0610O3064Q8564J30808J67673K07627K51636
11722B584385K84597L16983L46282M16905N00260N60026O12410O61305P66440
11713G049593R71990J232098J609204K250661L048796L692951M935583P304392
11705C2095268J1446419J8931706L2112690N3125252O6605329K3932821l1340539
11698B06908946m9788169n1177455l5121793k0816844j2390566p552078m795528
11691B5266513l589941l173591k758996k325282j891576j517880j215125r74886
11683G819236p68653o30074n85744n81920n42195m64432l79827l22910k83949
$$ plain form
11743 687175 711702 757196 825442 907657 1005346 1109667 1182142 1223929 1275633 1360171 1455733
11732 1455733 1522473 1575773 1624403 1675013 1738077 1826641 1957449 2125122 2332749 2584385
11722 2584385 2868982 3185965 3532247 3949152 4449412 5009438 5621848 6283153 7049593
11713 7049593 8021583 9253681 10862885 13113546 16162342 19855293 24790876 32095268
11705 32095268 43541687 62473393 94586083 147711335 214316664 238249485 206908946
11698 206908946 157120777 105943322 70821529 50004685 37614119 30062041 25266513
11691 25266513 21676572 18502981 15743985 13418703 11527127 10009247 8794122 7819236
11683 7819236 7050583 6420509 5834765 5252845 4710650 4246218 3866391 3543481 3259532
11674C259532k53654k44461k35723k07023j71866j37491r3194m4218k0571n2431
11664A798900r2094q8477o4347o0506o7046n2235j8962k0484q9683j29896j16213
11653I98957p7792n4776n0238m3113l9302l6684k7607k2585j8465k0959j8244
11642E89192m389J5079J8564j205j6535k0898j2988j0376k5667m0983m4689m1149
11630D03956l1999k1029j0815m749o946r572q225k871J031k463j903o26K460P728
11616C13977R180p440k1562j7796j3468n963k485m501p776j1013m716J806K307
11603B30550M117L365L728Q263N987r712j9295j9723j5344j2949r656o412k245
11590A60674l539o210j830K130P533R675Q803O130N765L259J0539K5911J0345
$$ plain form
11674 3259532 3005878 2761417 2525694 2318671 2146805 2009314 1916120 1871902 1851331 1798900
11664 1798900 1706806 1618329 1553982 1493476 1426430 1374195 1355233 1334749 1245066 1115170 998957
11653 998957 921165 866389 816151 773038 733736 697052 669445 646860 628395 607436 589192
11642 589192 584803 599882 618446 617241 600706 579808 566820 556444 530777 489794 445105 403956
11630 403956 371957 350928 340113 335364 328418 318846 310621 307750 308781 306318 304415 303789 306249 313977
11616 313977 323157 315717 294155 276359 262891 256928 254443 249942 242166 231153 226437 228243 230550
11603 230550 234667 238032 241760 250023 256010 246298 227003 207280 191936 178987 169331 162919 160674
11590 160674 157135 150925 149095 151225 158758 168433 177236 183366 189131 192390 202929 228840 239185
11577B39185m2988p1189L4840J25451J31069N9856K0637j7837r8852r9027o9889
11566B11256l7025k6030k3437j5545q128n307m414m811m256o398o942m560j069
11553F3334j182q985k3569l2001k8244L277L9142M1494K1170J1551O972m67j86
11540I2306j797j68P470J6867K0555R358k560j3127j0430o807k152p12j312m501
11526A02990p756r873r875j1607r094n181l386l760j875n34r82J5122M8884M4420
11512A47493K1175K101j2845j5171j7037j1370p564p364m435k585j800j452R37
11499I0083K011P53J384L68n5j223l673o842q277l137k10L129L945j719o785n032
11483F4720m744p03J427K26M76K336n35l996o324m056j294k26L332M716K633K94
$$ plain form
11577 239185 196197 125008 159848 285299 416368 476224 496861 479024 380172 281145 211256
11566 211256 174231 148201 124764 109219 101091 95784 91370 86559 82303 75905 68963 64403 63334
11553 63334 62152 53167 29598 -2403 -30647 -27370 11772 53266 74436 85987 92959 92492 92306
11540 92306 90509 90341 97811 114678 135233 144591 142031 128904 118474 111667 109515 108803 107491 102990
11526 102990 95234 85361 75486 63879 54785 49604 46218 42458 40583 40049 39067 54189 103073 147493
11512 147493 168668 170769 157924 142753 125716 114346 106782 99418 94983 92398 90598 89146 90083
11499 90083 92094 92847 94231 94599 94544 93321 89648 82806 74529 71392 71182 74311 78256 76537 69752 64720
11483 64720 59976 59273 60700 60926 61402 63738 63203 59207 52883 48827 47533 47307 50639 55355 57988 58282
11467E8282k555k152j452K03R33L014k8J030L506J586L847N377K953J110k492
11452G3162Q7L149L769O3N24n87k059j021j925l472p142p804n784j478n58k574
11436D6350k907k273k394M9K262O05n22k584J24K096L920L097R75J79J771L084
11420E3832N690M345j274k203k8j410R55J832p85m52l974l685k641N32N04J634
11404E2872K773J980p19j933l49j143k924K47O419J1275J2117J0775l182j3969
11390G4239r865n674n638n713N9L199n82k184j071k722j955J20k738j300J863
11375D0038N828M899L319M787N816P590P900P739N654N448O942R058R695J0293
11361A35006J0424J2310J9369L4715N7797R5382J66955L00415N14082N98066J75568
$$ plain form
11467 58282 55727 53575 52123 52326 53259 56273 56245 57275 60781 62367 66214 71591 74544 75654 73162
11452 73162 73249 76398 80167 80230 80754 80167 78108 77087 75162 71690 64548 56744 50960 49482 48924 46350
11436 46350 43443 41170 38776 38825 41087 41692 41170 38586 38710 40806 44726 47823 48798 48977 50748 53832
11420 53832 59522 63867 62593 60390 60362 58952 59907 61739 60954 60502 56528 52843 50202 50734 51238 52872
11404 52872 55645 57625 56906 54973 54624 53481 50557 50804 57223 68498 80615 91390 88208 74239
11390 74239 64374 58700 53062 47349 47408 50607 50025 47841 46770 44048 42093 42213 39475 38175 40038
11375 40038 45866 50765 54084 58871 64687 72277 80177 87916 93570 99018 105960 115018 124713 135006
11361 135006 145430 157740 177109 211824 269621 365003 531958 832373 1346455 1944521 2120089
11350B120089l45082n18652m40655k73988j52526q6857n1936l0279j9620j7285
11340A83209j8511k0988k1040j5973r354o133m289n565q073o771k631l238k947
11327E7696r91M92r8j919m548l317j5P47J033K23k33J271K659K661L746L153L894
11310F6454N014M295L717N091O262R001J0820J1393J8230L1217N0652Q5535J45000
11297D52681J56355M4734m9089o7649o1028m5102k2246K647o200l1247k9011J344
11285C46189N2846R6062P9514o641q7281j11390q6141n2599l1923k1052j6141
11274A61443j5485j1394q581p977r867p911n925m006k226K17j186N36r10k050
11260H4678k106Q07M056R509J8280L0019M8760L9177p168l1217l1245j9487r687
$$ plain form
11350 2120089 1775007 1256355 815700 541712 389186 302329 250393 220114 200494 183209
11340 183209 164698 143710 122670 106697 97343 91210 86921 81356 73283 66512 63881 60643 57696
11327 57696 56705 57197 57099 55180 50632 47315 47300 48047 49080 49303 49070 50341 53000 55661 59407 62560 66454
11310 66454 71468 75763 79480 84571 90833 99834 110654 122047 140277 171494 222146 307681 452681
11297 452681 609036 653770 604681 537032 476004 430902 408656 411303 405103 373856 344845 346189
11285 346189 399035 495097 574611 567970 480689 369299 283158 230559 198636 177584 161443
11274 161443 145958 134564 125983 118006 108139 100228 94303 90297 88071 88288 87102 87638 86728 84678
11260 84678 82572 83379 87435 96944 115224 145243 194003 233180 226012 194795 163550 144063 134376
11247A34376k81O109J6819K6681L9922M9372L7783K3875K5174K7072P029l8362
11235C55569o5167o5280m9106l4719l1443l0558k6108j5041J607J5122J4204N888
11223G4968M34l086n365m570m545l340j172R69J675J363j80k410k766l423K96
11208D8848J900J657J665J087K734N851N359Q329J3050K0460L1763M0774L5511
11195B18988M256j3178j1188M520J8399N118j5762k6195k2357j2034r600o434
11183A34533j6R611L1631M7647L2789j446k1843l9977l4215j7656j3694n670j015
11170A20679l164k499R585K9498L2384K5563j1940l3905l4396k3263j1246q719
11158H8577m062j090j701j758j072m104k735K68L625M869L946J011q066p652n398
$$ plain form
11247 134376 134095 140204 157023 183704 223626 272998 310781 334656 359830 386902 393931 355569
11235 355569 290402 225122 176016 141297 109854 79296 53188 38147 39754 54876 69080 74968
11223 74968 75402 72316 66951 62381 57836 54496 53324 54293 55968 57331 57151 54741 51975 48552 48848
11208 48848 50748 52405 54070 55157 57891 63742 69101 77430 90480 110940 142703 183477 218988
11195 218988 223244 210066 198878 203398 221797 226915 211153 184958 162601 150567 140967 134533
11183 134533 134517 144128 175759 223406 256195 254749 232906 192929 158714 141058 127364 121694 120679
11170 120679 117515 115016 124601 154099 186483 212046 200106 166201 131805 108542 97296 88577
11158 88577 84515 83425 81724 79966 78894 74790 72055 72323 75948 80817 84763 85774 77708 70056 64658
11143F4658p274k467L234N607M636j47m933o388n414k599K664M562K430k450p253
11128D8866r386n453l062N96K977K065L391o00n3L722J330k662o009o601r083
11113B0038j7329k1293k1653k4348r162L4849O6559N8614L6278R274k342m963
11101A24522n48J488o712q824q597q336r981r116j183N973O200K755O6l060N160
11086H9807J1442J0295J1343P821K901p00l324J418O467Q513K5739M5288O8041
11073B85051O0528J6860m375k5974l1075k5924j7487j0216q688m900l974J564
11061B31390L446L188Q830R204J394o044k3244m8581q4764j55603k04355j46546
11049d11685P207J60540J88620J91495O2652m7812o1779j7386J5912R469N08R749
$$ plain form
11143 64658 57384 54917 58151 63758 68394 68247 63314 56926 51512 48913 51577 56139 58569 56119 48866
11128 48866 39480 34027 30965 31561 34538 36603 39994 39394 39341 43063 44393 41731 35722 29121 20038
11113 20038 2709 -18584 -40237 -64585 -73747 -38898 27661 86275 122553 131827 129485 124522
11101 124522 123974 125462 118750 109926 101329 92993 83012 73896 72713 78686 84886 87641 87707 84647 89807
11086 89807 101249 111544 122887 130708 133609 132909 129585 131003 137470 145983 171722 217010 285051
11073 285051 345579 362439 358064 332090 301015 275091 257604 247388 238700 233800 229826 231390
11061 231390 234836 238024 246854 256058 257452 251408 228164 179583 94819 -60784 -265139 -411685
11049 -411685 -404478 -243938 -55318 136177 198829 151017 89238 71852 87764 97233 97741 107490
11037A07490J9365K0638K1271K4410K3607J5066J1369J4868K6139M2744O6801
11026C93768J13982J94385K50589J41788q0709k06018k05784j44625q2196m0102
11016C35078j9277r342j0950j2108j0568m255R363J5178J3184K498J32j027n578
11003C02328k022K744N149O745J2633J5180J7790J5291J3683J7615K2189K2939
10991D52264J4291Q961J2587J2442K240o726m216P377K2656L4584L4934K8890
10979F20284K1562J0542R294J9041K1402K6576K8482L0258K7392K2447L8239N1347
10967I26866N4572M1342K4888K9078N2225O9111P6285P9592Q9132Q0209P3076
10956A596376R6242J28936J67322J79823J72270J45824J26322J37098J73785K40848
$$ plain form
11037 107490 126855 147493 168764 193174 216781 231847 243216 258084 284223 326967 393768
11026 393768 507750 702135 952724 1094512 1013803 807785 602001 457376 375180 335078
11016 335078 315801 306459 295509 283401 272833 268578 277941 293119 306303 308801 308933 307906 302328
11003 302328 300306 303050 308199 314944 327577 342757 360547 375838 389521 407136 429325 452264
10991 452264 466555 475516 488103 500545 502785 496059 491843 499220 521876 556460 591394 620284
10979 620284 641846 652388 661682 680723 702125 728701 757183 787441 814833 837280 875519 926866
10967 926866 981438 1022780 1047668 1076746 1128971 1198082 1274367 1353959 1443091 1523300 1596376
10956 1596376 1692618 1821554 1988876 2168699 2340969 2486793 2613115 2750213 2923998 3164846
10946C164846L10374M00428N16845O37741O88159N52590M31084M87318O82823
10937G872208R30196J155763J453180K001174K683588L205536L423003L396940
10929B6121588M458734O871183J0735307J6805589K7221430M5171913P3532277
10922B10918021R4035869L8976026l9952990o5680476p3705946n4034439l2466758
10915G8089307j9563199j2160864p840777n077963l372141l197923l514206l584903
10907A9777331l142073k474713j883583j433616j147095r88778q69849p53637
10899G083987o42251n39061m76538m32890l93458l76213l61781l20823k79067
10890C261905k46911k04365j54691j27703j34862j51303j40709j20512j07460
$$ plain form
10946 3164846 3475220 3875648 4392493 5030234 5718393 6270983 6702067 7189385 7872208
10937 7872208 8802404 9958167 11411347 13412521 16096109 19301645 22724648 26121588
10929 26121588 30580322 37451505 48186812 64992401 92213831 137385744 210918021
10922 210918021 304953890 343929916 303976926 238296450 164590504 110556065 78089307
10915 78089307 58526108 46365244 38524467 33446504 30074363 26876440 23362234 19777331
10907 19777331 16635258 14160545 12276962 10843346 9696251 8707473 7837624 7083987
10899 7083987 6441736 5902675 5426137 4993247 4599789 4223576 3861795 3540972 3261905
10890 3261905 3014994 2810629 2655938 2528235 2393373 2242070 2101361 1980849 1873389
10881A873389q6211p1080p2393q4602r4949r6307p7980n2614m5403n4090n1259
10870A086501n2677n2993l8117l6324l6793m1765m3595m4557l5025j7725o565
10859F80365n647j4303k8483m0211m0295k8396k1173j9647j4840j0712q723k869
10847D45066m788j0110q268n787l502n797o705r744j2621j5536j3447j5415j7677
10834C15669o654M471Q838O104l397q679j3840q659k041k650m875o311j5008j7488
10820B45480q941k955l402k317p03l933q676m607Lk862o296l490M453R060J3559
10805B24373J5959J0390J0961L217J1667L4722J6018n1381j01142L5974J72202
10794C82960J80990R1431L0165q666j31820j45312j07804o1732m7212l6067j9403
$$ plain form
10881 1873389 1787178 1716098 1643705 1559103 1464154 1367847 1289867 1237253 1191850 1137760 1086501
10870 1086501 1033824 980831 942714 906390 869597 827832 784237 739680 704655 686930 680365
10859 680365 674718 660415 631932 591721 551426 523030 501857 482210 467370 456658 447935 445066
10847 445066 440278 430168 421900 416113 412611 406814 400109 390365 377744 362208 348761 333346 315669
10834 315669 309015 313486 322324 328428 325031 316352 302512 293853 291812 289162 284287 277976 262968 245480
10820 245480 236539 233584 230182 227865 227162 223229 214553 209946 209949 207087 200791 197301 201754 210814 224373
10805 224373 240332 250722 261683 264900 276567 311289 327307 275926 174784 210758 382960
10794 382960 563950 655381 685546 676880 545060 399748 291944 230212 183000 146933 127530
10783A27530j0767p696k855o683j1365j1958j4123j2978j6808k4427k9249l3913
10771e5292l4093k4085J5334O3626O5177L4700J4681J0276L1j414n071m856j174
10758G7840L284O494J0867R038K326K994J575K556M044R74l929j0299j4016j3273
10744H0475j2503j2691p267k137m642k458k103k0J8740O6325O4960L1611J0331
10731B28621j7369k6728k6360j4467q770q586p852l724m78j863j502J963L81J011
10717A14277J796j29l971p083j1664q889l581J6L136J890l461n650p421p196L0
10702F2100M237K827J354j278l490n658o991o576l938N03O462M762J497m69k2
10687E5320k222j127J159j1K80M35J484M484L00J363K570J844K150J184J877N780
$$ plain form
10783 127530 116763 109067 106212 99529 88164 76206 62083 49105 32297 7870 -21379 -55292
10771 -55292 -89385 -113470 -98136 -34510 30667 65367 80048 90324 90355 88941 83870 79014 77840
10758 77840 81124 87618 98485 107523 109849 112843 114418 116974 121018 121992 118063 107764 93748 80475
10744 80475 67972 55281 48014 45877 41235 38777 36674 36654 55394 121719 186679 218290 228621
10731 228621 211252 184524 158164 143697 134927 126341 118489 114765 114287 112424 110922 112885 113266 114277
10717 114277 116073 115944 111973 104890 93226 84337 80756 80772 83908 85798 82337 76687 69266 62070 62100
10702 62100 66337 69164 70518 69240 65750 60092 53101 46525 42587 43090 49552 54314 55811 55342 55320
10687 55320 53098 51971 53130 53119 53399 53834 55318 59802 60102 61465 64035 65879 68029 69213 71090 76870
10671G6870P009K937l53j260k495j381l41k568j2101j6734j1625m439j862j324
10657C0333j682j173J80n97j815J385J870J603K56k121J040J055J847J991K251
10642C6423J443K219M797K918J221J643J41j566PJ161K094j304l814m938j067
10627D1378j827k838n29K004J11k030k172m223o130j486R207J6518J4374J0697
10613G3054q635k1843j2308q860p317k804L48J667M462K986P9r73O74J716k77
10598B1969J85m84L71K30M44O51K178K020n02J770J867O16k76J528L74m049m385
10581B4507n594l883m20J772o50n4Q84O13K66j904k288j207K35J50O14N51L14
10564A3906n27j080k776p35O70M686M687K316J356m52m493k731j329j280j674
$$ plain form
10671 76870 83879 86816 86463 85203 82708 81327 80986 78418 66317 49583 37958 33519 31657 30333
10657 30333 28651 27478 27658 27061 25246 26631 28501 30104 30360 28239 29279 30334 32181 34172 36423
10642 36423 37866 40085 44882 47800 49021 50664 50805 49239 49246 50407 52501 51197 47383 42445 41378
10627 41378 39551 36713 36184 38188 38299 36269 34097 29874 23744 22258 31465 47983 62357 73054
10613 73054 64419 42576 30268 21408 14091 11287 11635 13302 17764 20750 20829 19856 20530 22246 21969
10598 21969 22154 21670 22041 22271 22715 23366 25544 27564 27062 28832 30699 31315 31039 32567 32941 28892 24507
10581 24507 18913 15030 14610 16382 15732 15678 16562 17175 17441 15537 13249 12042 12277 12427 13041 13592 13906
10564 13906 13379 12299 9523 8788 9458 14144 18831 21147 22503 22051 17558 14827 13498 12218 10544
10549A0544Q86J175K565M287K578k937l750k48J366j497j810K21R4q67j801j042
10533I764l62r79J090K367K850K904J339J325K327K529J382J27K388K361p17J165
10517C1860Q11n00j179j81J503L677n63m838k480K208N314P702J329j901j180
10502D1582o89J693M987P705P521R042J2222J3294J5655J5420J8818K9222M5432
10489B21904O9562J16900K11418L87004N95161M75819q1509m60222n09659l71481
10479F54897k14034j22965p3502m4876k7463j5312j2267j2708j2679j4218j4531
10468I0342j0183m388j682k889n515n965m571k890k936n310m806j076j113l023
10454C3995n265k205O58L34Q97R75k454l127q04L98n18J012P07k938m24J70j494
$$ plain form
10549 10544 11430 12605 15170 19457 22035 19098 15348 15100 16466 14969 13159 13380 13474 12607 10806 9764
10533 9764 9402 8423 9513 11880 14730 17634 18973 20298 22625 25154 26536 26663 29051 31412 30695 31860
10517 31860 32671 32171 30992 30811 32314 35991 35428 30590 28110 30318 35632 43334 44663 42762 41582
10502 41582 40893 42586 47573 55278 62799 71841 84063 97357 113012 128432 147250 176472 221904
10489 221904 291466 408366 619784 1006788 1601949 2077768 1996259 1536037 1026378 654897
10479 654897 440863 317898 244396 199520 172057 156745 144478 131770 119091 104873 90342
10468 90342 80159 75771 74089 71200 65685 59720 55149 52259 49323 44013 39207 38131 37018 33995
10454 33995 28730 26525 27183 27517 28414 29389 26935 23808 23004 23402 22884 23896 24603 21665 21241 21411 19917
10437A9917J80J068J676J898q98j871m57L94O04O17r91J54o80k04R53J512J707
10420B5579K494L22j719l212j841j20K99p49J13k09j85J818J145m2q95p44J213
10403B3267J345p81p19j386j210J092N59p98j697j314J025j27j614j371M98P42
10387A7511J770J106Q71J125J441R02Q77k764k96K598n82j686K96M91k45j146
10371B2269R18M014J386R42J57k5j754p56Q68P85N99j97K267J908J717L177J370
10354C9645j437k824k02j69n37M2Q01K08j29l84J671J692J336J803J422k09J753
10337D4482l68n4Q75J845L88K21K231M109J857J367pN44L160L694K114K785K544
10320G1787J862K035K659M645K617L812M457M744L233M963M453K815N215N950
$$ plain form
10437 19917 20097 21165 22841 24739 23841 21970 21513 21907 22511 23128 22137 22291 21611 21407 22360 23872 25579
10420 25579 28073 28395 26676 23464 21623 21503 21802 21053 21166 20957 20772 22590 23735 23693 22798 22054 23267
10403 23267 24612 23831 23112 21726 20516 21608 22167 21369 19672 18358 19383 19256 17642 16271 16769 17511
10387 17511 19281 20387 21258 22383 23824 24726 25603 22839 22543 25141 24559 22873 23169 23660 23415 22269
10371 22269 23187 27201 28587 29529 29686 29661 27907 27151 28019 28804 29403 29206 31473 33381 35098 38275 39645
10354 39645 38208 35384 35182 35013 34476 34518 35319 35527 35398 35014 36685 38377 39713 41516 42938 42729 44482
10337 44482 44114 44060 44935 46780 47168 47389 49620 53729 55586 56953 56946 57490 60650 64344 66458 69243 71787
10320 71787 73649 75684 78343 82988 85605 89417 93874 98618 101851 106814 111267 114082 119297 125247
10306A25247P072R642O415O010Q054P261P466Q695R859J2623J3775J3926J3725
10293B49770J4542J7242J8325J8065J7156J8622J8185J8709J8631J7405J7192
10282D43844J6622J7285J5619J3528J1387O287K551J456l922p501r519j4218j6309
10269D77110j5533j7301j9403k0700k1871k0792j9791j7570j7289j5240j5258
10258B76362j4512j3218j2705j2264j2296r812r575j1287r805r649j1508p372
10246A42359n940n212n250n494o198m806l242l656m274l242j879l406l303l579
10232H2878k841k421n063m758m014j543k46l36j784l201k582q49j815j917k074
10217D7434j662j643j193m19o30j969j895l57j006k060l02Q01J897R26o38p81
$$ plain form
10306 125247 132319 141961 148376 154386 162440 169701 177167 185862 195721 208344 222119 236045 249770
10293 249770 264312 281554 299879 317944 335100 353722 371907 390616 409247 426652 443844
10282 443844 460466 477751 493370 506898 518285 524572 527123 528579 524657 517156 507637 493419 477110
10269 477110 461577 444276 424873 404173 382302 361510 341719 324149 306860 291620 276362
10258 276362 261850 248632 235927 223663 211367 201555 191980 180693 170888 161239 149731 142359
10246 142359 136419 131207 125957 120463 114265 109459 106217 102561 98287 95045 93166 89760 86457 82878
10232 82878 80037 77616 72553 67795 63781 62238 61992 61656 59872 56671 54089 53240 51425 49508 47434
10217 47434 45772 44129 42936 42517 41887 39918 38023 37666 36660 34600 34298 35099 36996 37922 37284 36503
10201C6503j630j686k003j945p74k054J306o05k464m27K045J89m59j831l51l78
10185B3436k51j805j210J196R52m15K8p86j135L79J024j284J46n29J759J018j819
10168B0704j621r93M61J128r21j068m21J063r7J494o87M40J681J22o91J900J205
10151B3699q02J270J957L386K972j238L036J9737M3902L6856L3896N4986J8554
10138B42211l3640n2308m9618l4244k0356j0744m129m287m279m985k325j623k604
10125A7069n22o37L40P14N29k672j146m7J19j605Nq57m29L41m43r81m73R20O39
10106A0864n75m73j22N32p32J220j286K27J553P0j586M71o94k086l75r7K91L579
10088A0781O13j433k202j644j403j37K199J743O46j65j75L52q67M87j194j349
$$ plain form
10201 36503 34873 33187 31184 29239 28465 26411 27717 27112 24648 24221 26266 26455 25996 24165 23814 23436
10185 23436 23185 21380 20170 21366 22318 21903 21931 21145 20010 20389 21413 20129 20275 19746 21505 22523 20704
10168 20704 19083 18090 18551 19679 18758 17690 17269 18332 18235 19729 19042 19482 21163 21285 20594 22494 23699
10151 23699 22897 24167 26124 29510 32482 31244 34280 54017 97919 134775 168671 223657 242211
10138 242211 208571 156263 106645 72401 52045 41301 37172 32885 28606 23621 21296 19673 17069
10125 17069 16547 15910 16250 16964 17493 14821 13675 13628 13747 12142 12147 11290 10861 11202 10759 9778 9305 10225 10864
10106 10864 10289 9816 9694 10226 9494 10714 9428 9655 11208 11278 9692 10163 9469 7383 7008 6911 7202 10781
10088 10781 11394 9961 7759 6115 4712 4575 6774 8517 9163 8998 8823 9175 8308 8795 7601 6252
10072F252k86P4m09N41K82KM69j6o23o76q32J105m37O53N54Q35j148j836J397
10053E901O01j551j79R22J238J12o54j133n94J083M45j468p31n72j097K10Q58
10036C391P41j141L8q56n89j42M1N47j045p47R03J552J002J098J203j045n09N85
10018E027Q66N45Q97j111k508J84J095K66K04j432L45N8k73m11j447J965P40q52
10000D158j424j15J188j27J729M02j24j540j643k046j664J519J536k58K664N35
9984D790j422r19J135J594k0J639l58k45M64K302K894M504L547K30k86L80K120
9967B2349M466M538L512P668J1806J7538K8650M9222R5404J90171K48449o088
9955F77685j65137j87071j32453o7982l6000k0593j2599q768o688n255n389l841
$$ plain form
10072 6252 5966 6040 5631 6172 6454 6456 6925 6909 6286 5610 4778 5883 5446 6099 6653 7488 6340 4504 5901
10053 5901 6502 4951 4772 5694 6932 7044 6390 5257 4663 5746 6191 4723 3992 3420 2323 2533 3391
10036 3391 4132 2991 3029 2173 1584 1442 1483 2030 985 238 1141 2693 3695 4793 5996 4951 4442 5027
10018 5027 5893 6438 7335 6224 3716 3900 4995 5261 5465 4033 4378 4436 4163 3752 2305 4270 5010 4158
10000 4158 2734 2619 3807 3680 5409 5811 5687 4147 2504 458 -1206 313 1849 1591 4255 4790
9984 4790 3368 2449 3584 5178 5158 6797 6439 6194 6658 8960 11854 16358 19905 20135 19849 20229 22349
9967 22349 26815 31353 34865 42533 54339 71877 100527 149749 245153 435324 683773 677685
9955 677685 512548 325477 193024 125042 89042 68449 55850 47082 40394 35139 29750 25909
9943B5909k498o02l245l240j392K49j073k508k208j326j168j260j470j70R59N55
9927E512J85k427r89K92O47oj094O86J652L83k234j298M99P76K224J234n50o86
9909D806K53n36k6j12q08m79K517R08j185k19j293j193J645J68m43p19j535j772
9891b3j57J55J100J289m37J45o56o89J520J522mr05j406r76n71P79O39k41J60
9872A244j3L3Q93m34r13l82L05Q57j311o67K52o02j200J95Q53M03q76R13J556
9853A106J419k70O04o95j63j760k198M40Q34R69J746J023q64N69J168p53k588
9836E87K6J485J38Q71m61l16Q75P06l51K75J56j392j16L44k31K07j312p50k70
9817D71K21j94j060o50n91N63Q78O50K07p78l74m47N68o11L84m75n65j84j94K282
$$ plain form
9943 25909 23411 22809 19564 16324 14932 15181 14108 11600 9392 8066 6898 5638 4168 3998 4957 5512
9927 5512 5697 3270 2281 2573 3220 3214 2120 2806 4458 4841 2607 1309 1808 2584 4808 6042 5492 4806
9909 4806 5059 4523 4497 4385 3577 3098 5615 6523 5338 5119 3826 2633 4278 4446 4003 3284 1749 -23
9891 -23 -180 -25 1075 2364 1927 2072 1416 727 2247 3769 3765 2860 1454 478 -93 686 1325 1084 1244
9872 1244 1231 1264 2157 1723 810 428 733 1590 279 -388 -136 -738 -1938 -1743 -890 -487 -1363 -450 1106
9853 1106 2525 2255 2859 2164 2001 241 -1957 -1517 -683 286 2032 3055 2191 2760 3928 3175 587
9836 587 613 2098 2236 3107 2646 2330 3205 3911 3560 3835 3991 2599 2483 2827 2596 2803 1491 741 471
9817 471 692 498 -562 -1212 -1803 -1240 -362 288 495 -283 -657 -1104 -536 -1147 -763 -1238 -1803 -1987 -2181 101
9797A01J383n95l95q92l34K48R20r1m42J17P30J427j090k94K38O60n30j930j952
9778b721M11L04J206O76Q06l04k100q99o39J377k3P66J605K563J308j34j673p7
9760B452J837r78j704k79j096j215j47K365J753J180M3P26p93m4O7m25Q29J212
9742E783j738j320J8J434K20K82n94j040p44R92j10k784j085J59j38l94k66K503
9724A178M17q46q1j568L92J613K284L266J006q21j397j800k352K015O22m31J73
9707C670K09J229L981O444N765J844l28j807j722l404l049k937j612m69l195j486
9691C133O8r48k21j608n84Q12J216o44k262J198N06k880j056J534J887p22k127
9674b698L22m54L2J85K57n2K05O48O64R0m91L24q52l85K603P75k767J99k0j282
$$ plain form
9797 101 1484 889 494 -398 -732 -484 436 345 -97 20 750 2177 1087 793 1031 1691 1161 -769 -2721
9778 -2721 -2310 -2006 -800 -124 682 378 -1722 -2621 -3260 -1883 -1906 -1140 465 3028 4336 4202 2529 2452
9760 2452 4289 3311 1607 1328 232 -983 -1130 1235 2988 4168 4211 4937 4144 4100 4167 3742 4571 5783
9742 5783 4045 2725 2743 4177 4397 4679 4085 3045 2301 3293 3183 399 -686 -527 -665 -1059 -1325 1178
9724 1178 1595 749 668 -900 -508 1105 3389 6655 7661 6840 5443 3643 1291 3306 3928 3497 3670
9707 3670 3879 5108 9089 15533 21298 23142 22814 21007 19285 15881 12832 9895 8283 7814 4619 3133
9691 3133 3201 2253 2032 424 -160 652 1868 1224 -1038 160 666 -2214 -3270 -1736 151 -571 -2698
9674 -2698 -2376 -2830 -2798 -2613 -2356 -2408 -2203 -1555 -891 -801 -1292 -968 -1820 -2205 398 1173 -1594 -1395 -1415 -2697
9654b697K13J181l63R12J416j067J74J39p12l4J66p90p67J357J567m27MN01P27
9635A500O47m30j218l63J259O13J474r82k792k071J365L50q59OK31L83R16J60
9617A89L3N39l21k067K97Q05M97J396j76m57M87l29m48M95l15j353k39m68J08
9598a327J370l43k92P03j281j121K83J371J08r53N45p1N39J87j61r26R1J057O70
9579D49O83j268j776j24J115j04q62R73M62k63k57P87j32p15R28L93o14O65j908
9560a568k54J653N6K032L1j977l41l51R52K32J29k60J07J164j238J440m29j40
9542A238m43l2j017J448l64j276Q99J153L77j112j334l83J07q47k91J062J646
9525H31q40k177j99J685N71j44N67o34j677m87k38J418J410j50j59L30J7q97k55
$$ plain form
9654 -2697 -2484 -1303 -1666 -754 662 -405 -231 -92 -804 -838 -672 -1462 -2229 -872 695 268 272 773 1500
9635 1500 2147 1717 499 136 1395 2008 3482 2500 -292 -2363 -998 -648 -1507 -1501 -1270 -887 29 189
9617 189 222 761 440 -1627 -1330 -525 -28 1368 1192 735 1222 893 445 940 625 -728 -967 -1435 -1327
9598 -1327 43 -300 -592 111 -1170 -2291 -2008 -637 -529 -1482 -937 -1008 -469 -282 -443 -1369 -1278 -221 449
9579 449 1132 -136 -1912 -2036 -921 -1025 -1887 -914 -452 -715 -972 -185 -317 -1032 -104 289 -325 340 -1568
9560 -1568 -1822 -169 -113 1919 1950 -27 -368 -719 233 465 594 334 441 1605 367 1807 1378 1238
9542 1238 795 763 -254 1194 830 -446 453 1606 1983 871 -463 -846 -739 -1586 -1877 -815 831
9525 831 -9 -2186 -2385 -700 -129 -273 294 -340 -2017 -2504 -2742 -1324 86 -64 -223 107 124 -773 -1028
9506a028J654J7M41j25j194o36J168o05J55k78q44j338O56R09J663j335n05l05
9488a530L96O15k15l86J449l33p45J201N93r1o07p82l2J137o4M73q59N6m10M82
9468C48l76l55K3J95J042j119p9K46P8j52k91k98N45m22l92J743Q0Q36M48p08
9448A392o52m18p29J09J420R80j282l96J102l49L15O68j194n21n64k676k01n8
9430c054J184J350M61p72J055P14m22j649j999Q04J083J204j299j62N47r48q60
9413b763Q71M19j76O12j08j17k28Q24J358j10n05o48p58L31MJ519N82n61p82n21
9393g57j17O91J527r38n60j202R76Q55j080R21n81j238j57Q22n12j59p55O92J976
9374D04J330o99l36n42l88m76R38K170R13p011j2618j909N652Q505M163K113k491
$$ plain form
9506 -1028 626 643 1084 959 -235 -871 297 -308 -153 -431 -1275 -2613 -1957 -1048 615 -720 -1225 -1530
9488 -1530 -1134 -519 -734 -1120 329 -4 -749 452 1045 954 347 -435 -467 670 606 1079 220 276 -134 348
9468 348 -28 -383 -360 -165 877 -242 -321 -75 3 -149 -440 -738 -193 -615 -1007 736 816 1652 2100 1392
9448 1392 740 322 -407 -298 1122 2102 820 424 1526 1177 1492 2160 966 445 -119 -2795 -2996 -3054
9430 -3054 -1870 -520 -59 -831 224 938 516 -1133 -3132 -2328 -1245 -41 -1340 -1502 -955 -1903 -2763
9413 -2763 -1892 -1473 -1649 -1037 -1145 -1262 -1490 -666 692 582 77 -571 -1329 -998 -994 525 1107 546 -236 -757
9393 -757 -874 -183 1344 406 -154 -1356 -380 475 -605 316 -265 -1503 -1660 -838 -1350 -1509 -2264 -1572 404
9374 404 1734 1035 699 157 -231 -707 231 2401 3314 -3697 -16315 -18224 -12572 -4067 96 2209 -282
9357b82P94K244O78o51l5j84n03j287j334J89R55Q49p22q15j079j103K35J188
9339h63O19j430k835r12J738J083Q5J952N86L42N06M99q75j690j738j193J023
9322c103J686K586k01k064P35M82k55k143r96J517P96L81M71N97lj510q46K239
9304C69K011j306n74j52M86Q05J095k397k369l84R06J34J182L255m15j450J250
9287B446N61q41j116j50p61p29P77j727l516J626L727M11j326o52K63Q1r1K14
9269h03p50k4n55N04M90J10J016J168m04j532k11J123k0K04J350p4j300p57j771
9250b236j328P22Q5j231N13J262j64j252j32L32o34J664K093J59O22J32r18j72
9232d83m00J50n73L93P56R65p6l68l04J96N46J092q72j473j041o91P8m76R92L8
$$ plain form
9357 -282 512 2756 3434 2783 2748 2564 2061 774 -560 -371 584 1433 711 -104 -1183 -2286 -2051 -863
9339 -863 -244 -1674 -4509 -5421 -3683 -2600 -2515 -563 23 365 871 1370 495 -1195 -2933 -4126 -3103
9322 -3103 -1417 1169 968 -1096 -361 121 -134 -2277 -3273 -1756 -960 -579 -108 489 486 -1024 -1870 369
9304 369 2380 1074 500 348 834 1639 2734 337 -2032 -2416 -1510 -1376 -194 3061 2646 1196 2446
9287 2446 3007 2166 1050 900 139 -590 187 -1540 -5056 -3430 297 708 -618 -1270 -1007 -926 -1017 -803
9269 -803 -1553 -1577 -2132 -1628 -1138 -1028 -12 1156 752 -780 -991 132 112 316 1666 1592 292 -465 -2236
9250 -2236 -3564 -2842 -2757 -3988 -3475 -2213 -2377 -3629 -3761 -3429 -4063 -2399 -306 -147 475 607 -311 -483
9232 -483 -883 -733 -1306 -913 -157 808 732 364 60 256 802 1894 1022 -451 -1492 -2183 -2105 -2581 -1589 -1551
9212a551m30Q48J49j156j095P26P14N13P30J275o70o53J342R20j305j285J147
9195B19J780K157J437n74k854j006r41k019q94Q81p10J157J659J066l47j4L67
9178A364j149L17r0R71j727j166J89L84q43j38K795K00n97J253N7L56k300j706
9160a830J055n25n1j956j046P58m71l96J447J054O31k043K95J255K895R87j204
9143H55k61j648j84J770M44N67J1K85r53o94M61j673j148m02N56J003Q72j41J08
9124a72L03Q91J370q17K95p07p03R13L29m80k59j636j348k21L35R08J888J623
9106B512o67j870k04M96J339k293r60J043R40j8M69j87j108r56N92k41j086J490
9088g09O66k63o40N25N39j51k90j580j372P67Q86j025J242K42j008L75K561O16
$$ plain form
9212 -1551 -1981 -1133 -984 -2140 -3235 -2509 -1795 -1282 -552 723 53 -600 742 1662 357 -928 219
9195 219 1999 4156 5593 5019 2165 1159 218 -1801 -2695 -1814 -2524 -1367 292 1358 1011 997 1364
9178 1364 215 532 442 1413 -314 -1480 -1291 -907 -1750 -1888 907 1107 510 1763 1820 2176 -124 -1830
9160 -1830 -775 -1300 -1351 -3307 -4353 -3595 -4066 -4462 -3015 -1961 -1330 -3373 -3078 -1823 1072 2059 855
9143 855 594 -1054 -1238 532 976 1543 1554 1839 886 192 653 -1020 -2168 -2570 -2014 -1011 -139 -280 -172
9124 -172 131 1022 2392 1575 1870 1163 460 1373 1702 1222 963 -673 -2021 -2242 -1907 -999 889 2512
9106 2512 1845 -25 -229 267 1606 -687 -1647 -604 336 318 787 600 -508 -1464 -872 -1113 -2199 -709
9088 -709 -43 -306 -946 -421 118 -33 -323 -1903 -3275 -2508 -1622 -2647 -1405 -1163 -2171 -1796 765 1381
9070A381M75L25r44q15Q05j87m77j8M40J033o48j506j126K19N76l57L4k97J975
9051H88K333p14j105j709p7k31j63O82K406K016q50Q9k190j859N68O15P8j052
9033b75j630L94N89P0j413J42j05o40o97l7R99O45L88L67L43p47q89Q53N05J705
9013E67O13q88M51l0n88N76K76j345m89Q36q36K15J800r83r39N1R13m60j206J988
8993E22P80o75R55J970k91j675p86k351n62J434j50L24M32O2M52J59K78o18M42
8974G02p19J246Q16N46J457p16k033k237j056P45N99J06O86m24k267r6N05J30
8956b010K02K06p1K90j57j55L03J769O23p44j551j16J323J42l13n93Q30P78J394
8937B150j485n25Q60m25l71n54p7o2M16l80q47j63P55p83r57J309J210P16q07
$$ plain form
9070 1381 1856 2181 1237 422 1227 1040 563 545 985 2018 1370 -136 -1262 -1043 -467 -824 -790 -1087 888
9051 888 3221 2507 1402 -307 -384 -615 -778 -96 2310 4326 3476 3565 1375 -484 84 699 777 -275
9033 -275 -1905 -1511 -922 -852 -2265 -2123 -2228 -2868 -3565 -3602 -2603 -1958 -1570 -1203 -860 -1607 -2496 -1643 -1138 567
9013 567 1180 292 743 713 125 701 977 -368 -857 -21 -857 -642 1158 175 -764 -713 200 -260 -1466 522
8993 522 1302 627 1582 3552 3261 1586 800 -1551 -2113 -679 -829 -505 -73 -11 441 600 878 260 702
8974 702 -17 1229 2045 2591 4048 3332 1299 -938 -1994 -1249 -650 -544 142 -282 -2549 -2645 -2140 -2010
8956 -2010 -1808 -1602 -1673 -1383 -1540 -1695 -1392 377 1000 256 -1295 -1411 -88 54 -259 -852 -22 756 2150
8937 2150 665 140 1000 575 204 -350 -427 -489 -73 -453 -1300 -1463 -708 -1491 -2448 -1139 71 787 -20
8918b0k5p90q69K80M73J22L99M60Q49j9P03k37k216M76J20M05p85r39j611n8j494
8897d776j86J828R12J023l00k949j175P96J505P66K291J081Q62J247j169k170
8881d14j506n55j139N08J634J757k09M35j408M27Q9j33P22O49n75n22R76q24k366
8862b454r33P44K941J584j616j046q70L38Q7k56J924O09j17o42q18J19M02R18
8844I14M2O4p06KO21k63o81op18L0K52K32J963j165q88Q41k96j214Q6J457L26
8823H93l98N16n79O67L4k83n59j043k15j58J532K34R6K96M8Q6m3K87j47j89J71
8802A246j64j922J113Q64j736j72n55k95K78K204M75j937n75Q46O00m86K8j41
8784c29j938J77L73N14O03P75M80N11m87j850q76Q26J182m88J076n7n03J69p82
$$ plain form
8918 -20 -45 -835 -1704 -1424 -951 -829 -430 30 879 860 1563 1326 -890 -414 -294 111 -674 -1613 -3224 -3282 -4776
8897 -4776 -4962 -3134 -2222 -1199 -1499 -4448 -5623 -4827 -3322 -2556 -265 816 1678 2925 1756 -414
8881 -414 -1920 -2475 -3614 -3106 -1472 285 76 511 -897 -470 -381 -514 208 857 282 -240 736 -88 -2454
8862 -2454 -3387 -2643 298 1882 266 -780 -1650 -1312 -1225 -1481 443 1052 935 293 -525 -406 -4 914
8844 914 956 1020 314 316 937 674 -7 -13 -731 -701 -449 -217 1746 581 -307 534 238 -976 -890 567 893
8823 893 495 1011 432 1099 1133 850 291 -752 -967 -1125 407 641 737 1033 1081 1167 1124 1411 1264 1075 1246
8802 1246 1082 -840 273 1137 -599 -771 -1326 -1621 -1343 861 1336 -601 -1176 -330 270 -216 -188 -329
8784 -329 -2267 -2090 -1717 -1203 -600 175 655 1166 679 -1171 -2047 -1221 -39 -527 549 492 -11 158 -624
8765f24j465M86J129K28j381O74J289R14j004q98j368J92O26J409O50m80l13O53
8747G17O72O41j777M67o25o43j487L42N87m03J494O64n98m27j81J374q50j654
8729a687J659Q06l31J88O49k79k93j112j93P16O9M32j658N60J880K49M7j91j861
8710c50K29M88q32j73O14N32k433r3K221J045j739j999J92R64m02K90J82Q86J338
8691I60R82J14R66k86q75j050Q93K59r29l65J663l18o25M86l9r88q20K03Q25J469
8671B525K1o7O51M51m25k135j696J336J222q32P43J52o21O42J32L7j200P6R96
8652B008J029j505q76R40j42j656Q78o44q20N89J907J422j384R7M78J424J34j328
8634B551j832O48K665L45j556j529n20j055R93J81RO23l43p36N48k70j372m11
$$ plain form
8765 -624 -2089 -1603 -474 -246 -1627 -953 336 1250 246 -652 -2020 -1828 -1202 207 857 377 64 717
8747 717 1389 2030 253 720 95 -548 -2035 -1693 -1106 -1509 -15 649 51 -376 -557 817 -33 -1687
8729 -1687 -28 778 447 635 1284 1005 712 -400 -593 123 192 624 -1034 -474 1406 1655 1702 1511 -350
8710 -350 -121 367 -465 -638 -24 508 -1925 -2018 203 1248 -491 -2490 -2298 -1334 -1736 -1446 -1264 -378 960
8691 960 1942 2056 3022 2736 1861 811 1704 1963 1034 669 2332 2014 1389 1875 1836 848 28 231 1056 2525
8671 2525 2546 2479 3130 3581 3156 1021 -675 661 1883 1051 1794 1946 1325 1967 2099 2136 936 1012 2008
8652 2008 3037 1532 656 1596 1454 -202 676 32 -788 -199 1708 3130 1746 1843 2321 3745 3879 2551
8634 2551 719 1367 4032 4377 2821 1292 772 -283 710 891 900 1523 1180 444 992 722 -650 -1061
8616a061n86j510R66R47L18J0J454K95r82J332M61j023J73L72N93m48J532J54
8598B997j244j708j099j288N12P01r4J760K55j322j233J601N075N828J528K99
8582A2568m868m596k906R65j3p83p36j851l76k114j634R56J742J408m41P96l0
8565a913J35M53J408L99r24j595n86j008k70n26M51K407J381j482j82Q00J64p71
8547a659R43J72O18p24k180J010J853J797Q88p47L40j68M41p98r78j37j559r2
8529i80O21J73o21j87J345J778P96l00j427k50o71N09n2J098r64n45J368r81K73
8510I83l54J420K146P41k032n59J769j099P46j141o81O04L92k7j107j795Q01N40
8492A347R29P00J325M7k341m92K095j069L29L665L709J184j761k278j771o37j16
$$ plain form
8616 -1061 -1647 -3157 -2191 -1244 -926 -916 538 833 -149 1183 1644 621 794 1166 1759 1311 2843 2997
8598 2997 1753 45 -1054 -2342 -1830 -1129 -1223 537 792 -530 -1763 -162 4913 10741 12269 12568
8582 12568 7700 3104 198 1163 1150 367 -369 -2220 -2596 -4710 -6344 -5388 -3646 -2238 -2679 -1883 -1913
8565 -1913 -1778 -1325 83 482 -442 -2037 -2623 -3631 -3901 -4427 -3976 -1569 -188 -1670 -1852 -1052 -888 -1659
8547 -1659 -716 -544 74 -650 -2830 -1820 33 1830 2718 1971 2311 2143 2584 1786 808 671 -888 -980
8529 -980 -359 -186 -807 -994 351 2129 2925 2625 1198 948 277 786 734 1832 868 323 1691 710 983
8510 983 629 2049 4195 4936 2904 2345 4114 3015 3761 2620 1939 2543 2935 2908 1801 6 807 1347
8492 1347 2276 2976 4301 4348 2007 1515 3610 2541 2870 6535 10244 11428 9667 7389 5618 4981 4865
8475D865j684j056q63n52j6K56J60ol03k38j448J839J663K220K126o09n25K35
8457F064j273j094j03J68N5j286k02N82k893K25q8J481R79K266J223J782M825
8440A2711Q192J3880J0672l692r551r953o790n310k893m193j648K45p91k215J631
8425B95M88P16J762M73j388k472Q6k07J832K553J371q89j226o42k334n84o5r6
8407c27Q42M22K230J532L465L717P154J3545R188m400j0206j1353n979l466j305
8392E059k205m89J075J529L01J21j814m78j16j431j077N51K269l52p27j713K38
8375G41j83mm13K41m7J274K85J25j816p44K36J777k74o65k2K553O03k444P7j778
8355d78p40R2J334P95l74k99O22P50j325n87L66R71r10j989j047K258J698m45
$$ plain form
8475 4865 3181 2125 1262 710 694 950 1110 1104 801 563 -885 954 2617 4837 6963 6354 5829 6064
8457 6064 4791 3697 3594 3762 3817 2531 2329 2911 18 243 155 1636 2615 4881 6104 7886 12711
8440 12711 20903 34783 45455 41763 32212 22259 15469 10159 7266 3073 1425 1670 879 -1336 295
8425 295 783 1499 3261 3734 2346 -126 -40 -247 1585 4138 5509 4620 3394 2752 418 -166 -231 -327
8407 -327 515 937 3167 4699 8164 11881 19035 32580 41768 37368 27162 15809 9830 6364 5059
8392 5059 2854 2365 3440 4969 5270 5391 3577 3099 2983 1552 475 1026 3295 2943 2216 503 741
8375 741 558 554 141 382 335 1609 1894 2019 203 -541 -305 1472 1198 533 511 3064 3667 1223 1300 -478
8355 -478 -1218 -1126 208 1003 629 330 952 1702 377 -210 156 1127 217 -1772 -2819 -561 1137 692
8337F92k22J61J75K64r65k03M39K94N4m27j437m37L93J037L28N06N72p44o46r71
8317a137n26J099J160R8P0Q76j093K19J079m3m56O05k221R4N38J520L67m00j934
8298h5j409J033L13L05R41J295p38K23j818r95o19l61O29J533o75L64J069P56
8280A761j446r7j102m19Q76k48M0j64l34j193m4p1j382J035K339J007n60N48N33
8261A079J418K87l67j274k537J226J367j181o89J826p46J11j322k065L58J395
8245a114R56N28J488N14n35K4j158L07j582j38J196J651q54j512j46J993J554
8228C172j69J448L86m27N75l40r11j746j500k414J060P90K9K49J91j04r53O70
8210FP2n96M87N60L58Q88N70J744j646j858p06j309j766J282J550L64O50l50j039
$$ plain form
8337 692 470 631 806 1070 105 -98 341 635 689 262 -1175 -1612 -1219 -182 146 652 1224 480 -166 -1137
8317 -1137 -1663 -564 596 694 764 1640 547 766 1845 1802 1346 1951 -270 -176 362 1882 2249 1849 -85
8298 -85 -1494 -461 -148 157 1098 2393 1655 1878 60 -935 -1554 -1915 -1286 247 -428 -64 1005 1761
8280 1761 315 218 -884 -1303 -427 -675 -635 -799 -1133 -2326 -2370 -2441 -3823 -2788 -449 558 -2 546 1079
8261 1079 2497 2784 2417 1143 -1394 -168 1199 18 -671 1155 409 520 -802 -2867 -2509 -1114
8245 -1114 -158 370 1858 2372 1837 1861 703 1010 -572 -710 486 2137 1283 -229 -375 1618 3172
8228 3172 3003 4451 4837 4410 4985 4645 3734 1988 488 -1926 -866 -76 -47 202 393 289 -664 6
8210 6 78 -518 -31 529 887 1775 2345 4089 2443 585 -121 -1430 -3196 -1914 -364 0 650 300 -739
8191g39j531R64N91J1l15n87J29K366J30L32N72n04j001l58p04j30m80R3O75L04
8171a82n6j669j155m53J61K23N53J017l05L53l12O96O12R69P91j089m92L05j76
8152b09m94m78K56o40q12J574J872j16p10j509j092J123J368k19j549j244Q64
8135b015J516J155R8m28p42P98K69n78o32q24j273J174k67K07P98J484j63j731
8117a154J880l40n95j542R87J803O12O9j756r76K67K191J295P0j491L70R20k15
8099B395p60l38k276r63J6l59M78M74r30L91K172j929J35J540m02r36J326k5j194
8080a185r7k41j69J27r8M88K31j528k69L43n40n34M80J633K307j139l302J272
8062b221J876J452J266Q09k30k435M80l63j091O55k98R1r05r86k05O84Q58J699
$$ plain form
8191 -739 -2270 -1306 -715 -704 -1019 -1606 -1477 889 1019 1351 1923 1419 418 60 -644 -774 -1254 -1161 -486 -182
8171 -182 -238 -1907 -3062 -3515 -3354 -3131 -2578 -1561 -1866 -1513 -1825 -1129 -517 452 1243 154 -338 -33 -209
8152 -209 -703 -1181 -925 -1565 -2377 -803 1069 953 243 -1266 -2358 -1235 133 -86 -1635 -2879 -2015
8135 -2015 -499 656 754 326 -416 382 651 73 -559 -1383 -2656 -1482 -1749 -1542 -744 740 577 -1154
8117 -1154 726 386 -209 -1751 -764 1039 1651 1720 -36 -1012 -745 1446 2741 2811 1320 1690 2610 2395
8099 2395 1635 1297 -979 -1942 -1926 -2285 -1807 -1333 -2263 -1872 300 -1629 -1494 46 -356 -1292 34 9 -1185
8080 -1185 -1282 -1523 -1692 -1565 -1663 -1175 -944 -2472 -2741 -2398 -2938 -3472 -2992 -1359 948 -191 -3493 -2221
8062 -2221 -345 1107 2373 3182 2952 517 997 634 -457 198 -100 -9 -914 -1900 -2105 -1421 -563 1136
8044A136l92m32K078m51j341j166p00o22j312J012R93J812J193j2j110m19j155
8027h88m56K61J908J755j138Lr62L5m64R44M98j546j033N62l7j208M7J268m25
8008h76L45j301j57L66J021K299k42o82m19j800q10j67J001J506O18m93j251Q85
7990a57J047j337J963K43o37O39N6K3j232P31j798J77O74J01P37n55j352n08M55
7971g30K077J470N30j140j579m86o00N56K59q80l72j26J293j860r77J637m06o89
7953b023n48j8NR21N02l63M61R16p23J939L98K93M19J410j137k012pK77M97M59
7933A666M49J04n25j695r53K81q61n46M29J163M76J438O97m18j834n59Q3O99J120
7914A214j416j686M35J17r20K21M9K99L78R86l3L28K55k44p68o31k09m52J179
$$ plain form
8044 1136 744 312 2390 1939 598 -568 -1268 -1890 -3202 -2190 -1197 615 1808 1796 686 267 -888
8027 -888 -1344 -1083 825 2580 1442 1445 483 518 54 998 1496 -50 -1083 -521 -558 -1766 -1719 -451 -876
8008 -876 -531 -1832 -1989 -1623 -602 1697 1455 773 354 -1446 -2256 -2423 -1422 84 702 209 -1042 -157
7990 -157 890 -447 1516 1759 1122 1761 1817 1840 608 1339 -459 -282 392 493 1230 675 -677 -1185 -730
7971 -730 1347 2817 3347 2207 628 142 -458 98 357 -523 -895 -1021 272 -1588 -2565 -928 -1334 -2023
7953 -2023 -2571 -2589 -2584 -1663 -1161 -1524 -1063 -147 -870 1069 1467 1760 2179 3589 2452 440 433 710 1207 1666
7933 1666 2115 2219 1694 -1 -954 -673 -1534 -2080 -1651 -488 -12 1426 2123 1705 -129 -688 -605 94 1214
7914 1214 -202 -1888 -1453 -1336 -2256 -2035 -1986 -1687 -1309 -323 -356 -28 227 -17 -785 -1416 -1625 -2077 -898
7895h98J582l56K0J92o17m37q73O67P20k012o61J043N27P83p75j40Q81k794N03
7876b645M53M28J303m52M43j64J326K139p14l74o5j33P77m16O51j214j222L79
7858E00R43O33m23O01K20K82j565q49O16K03q74R0K159K015j800q76j184k84J753
7839B160O17m87n85j54p08j946J02K21o87k84N74J547R02K33J851O57J7j042l3
7820B955q61j44M00L10j568l12J248L91q0l378j04K249J61m916m735j123P27N391
7802c389M488J572n97o75j275j00J632N73m47j746j124l83L2K195N38j335k20
7785b61q30R19L54P43k62j088j357o25M31J506M66J167n61j693N21J345m99m07
7767a31O08m20j806Q96o17j138K18J424j202j220L56R26K341J048K7l74j722Q57
$$ plain form
7895 -898 684 328 348 540 -77 -514 -1387 -720 0 -2012 -2673 -1630 -1103 -320 -1095 -1235 -354 -3148 -2645
7876 -2645 -2192 -1764 -461 -913 -470 -634 692 2831 2117 1743 1678 1545 2322 1906 2557 1343 121 500
7858 500 1443 2076 1653 2254 2474 2756 1191 342 958 1161 287 377 2536 4551 2751 1875 691 407 2160
7839 2160 2777 2290 1705 1551 843 -1103 -1001 -780 -1467 -1751 -1177 370 1272 1505 3356 4013 4030 2988 2955
7820 2955 2094 1950 2350 2660 1092 780 2028 2419 2339 -1039 -1143 1106 1267 -3649 -8384 -9507 -8780 -3389
7802 -3389 1099 2671 2074 1399 124 24 1656 2229 1782 36 -1088 -1471 -1439 756 1294 -41 -261
7785 -261 -1091 -172 182 925 663 -425 -1782 -2407 -1976 -470 -4 1163 602 -1091 -570 775 276 -131
7767 -131 477 57 -1749 -853 -1470 -2608 -2390 -966 -2168 -3388 -3032 -2106 235 1283 1310 936 -786 71
7749G1K362J272N35J85k62m73k232j583j105n55J449O77O61J685K28o02j079R7
7731A331l29R6O17M14j12k06r48n76j976q49J431J094O6k97l87j567k87J456J993
7712I64R16J031j773p55O67N64M24q34n06O22j159j766j20L58k05q1N43kJ128
7693A6j37P91J182o6j229j214o48O27j066q86q36K40K71J311j08m45N13P52l16
7674a248j54j781n17J391M71Q64K48j069j480R38K120O67N51r32L54j33M59P92
7656A541m52P24J111j712k524n9L21K017j9j361o10K63q02j987j176K058k98L04
7638b661n7O19P9M46R98L92N75J529k314n11J656Q47r67K2k94j374L90J038R4
7619E07K53l77j871j036Q21j289k57K035l67q46K85R05J393N15j397j410j582
$$ plain form
7749 71 2433 3705 4240 4425 4163 3690 1458 -125 -1230 -1785 -336 341 1002 2687 2915 2313 1234 1331
7731 1331 1002 1098 1715 2129 2017 1811 863 287 -1689 -2538 -1107 -13 53 -244 -631 -2198 -2485 -1029 964
7712 964 1880 2911 1138 383 1050 1614 2038 1204 698 1320 161 -1605 -1725 -1367 -1572 -1653 -1110 -1112 16
7693 16 -121 670 1852 1786 557 -657 -1305 -678 -1744 -2630 -3466 -3226 -2955 -1644 -1752 -2197 -1684 -932 -1248
7674 -1248 -1402 -3183 -3700 -2309 -1838 -974 -726 -1795 -3275 -2337 -217 450 1001 69 423 290 749 1541
7656 1541 1089 1813 2924 1212 -1312 -1371 -1050 967 948 -413 -1023 -760 -1562 -3549 -4725 -2667 -2965 -2661
7638 -2661 -2718 -2099 -2020 -1574 -576 -184 391 1920 -394 -905 751 1598 631 653 359 -1015 -625 413 507
7619 507 760 383 -1488 -2524 -1703 -2992 -3249 -1214 -1581 -2427 -2142 -1237 156 671 -726 -2136 -3718
7602c718o55J569J491k7l09K300Q90j4m75j870k765J114K130J231J005j76l71
7585A350j438j65n65o55J885p01q89O35n27k104K15J059j1P97k77K11j29o22L60
7566a571J401r49j513K9K372L35O65j183j301K72j77p7P32J538J444M2l28l17
7548A414O60j92k313k388k68N56P78Q51J07j166R29K238N62j119K27K12o92j572
7530a176O12P54p51j19L87J08K78J110p31q70r50K36J81m77J23L65j672j424J716
7511b300K312m72J9R65p02J78J28k245m94J332J379m64k179K90N22p90N32K98
7493a691M53J265M47m30o48J262r93k373j033m4J203L059J595r11n6R43j23K61
7475B186o82j050j374P20L51M35m45j214j35M19m10K43o94j161m06O24J244n62
$$ plain form
7602 -3718 -4373 -2804 -1313 -1340 -1649 651 1541 1527 1052 -818 -3583 -2469 -339 892 1897 1721 1350
7585 1350 -88 -253 -818 -1473 412 -289 -1178 -543 -1070 -3174 -2959 -1900 -1911 -1114 -1391 -1180 -1309 -1931 -1571
7566 -1571 -170 -1119 -2632 -2603 -231 104 769 -414 -1715 -1443 -1620 -1697 -965 573 2017 2059 1731 1414
7548 1414 2074 1882 -431 -2819 -3087 -2531 -1753 -902 -795 -1961 -1032 1206 1768 649 876 1088 396 -1176
7530 -1176 -564 190 -561 -680 -293 -185 93 1203 472 -398 -1348 -1112 -931 -1408 -1285 -920 -2592 -4016 -2300
7511 -2300 12 -460 -441 524 -178 0 128 -2117 -2611 -1279 100 -364 -2543 -2253 -1731 -2521 -1989 -1691
7493 -1691 -1238 27 474 44 -604 658 -335 -2708 -3741 -3785 -2582 477 2072 1161 1105 2048 1925 2186
7475 2186 1504 454 -920 -200 151 586 141 -1073 -1208 -789 -1199 -956 -1650 -2811 -3217 -2593 -1349 -1911
7457a911N15l17j281J561J195R53k7M26O16J610j066k349k722k972J87K76K859
7440b447Q97r5o72M59k84J276K21J80L67j518p55R05O05N07M93n02q05n0j391
7421b609j068j09K052J806J22j469P30j796n78j311m83K119M74j017p18M94M64
7404b897P37J453J275J71j528P88j102k845P79J047j053J99Q44J249K379K51n10
7387A237k83M87K27N30j654j019k29k86m48p96O15O65q01p25j75J489L324o0k047
7368E1r51O08N91p71M95J193l7M17j843q64J395L63n88Q81M97n13J00n8k03j338
7348e75j079n3j69J405J219m12q22J164L19r6M81n79J072n27k443l50R06L74q9
7329b54j606j255J92l23J267R00r62K2P44j18o78K27j029J704J504p22j188p95
$$ plain form
7457 -1911 -1396 -1713 -2994 -1433 -238 715 688 1114 1730 3340 2274 -75 -2797 -5769 -5582 -5306 -2447
7440 -2447 -1550 -1645 -2317 -1858 -2142 -866 -645 -465 -98 -1616 -2371 -1466 -861 -354 139 -363 -1168 -1218 -2609
7421 -2609 -3677 -3786 -1734 72 194 -1275 -545 -2341 -2919 -4230 -4713 -2594 -2120 -3137 -3855 -3361 -2897
7404 -2897 -2160 -707 568 739 -789 -1 -1103 -3948 -3169 -2122 -3175 -2976 -2132 -883 1496 1747 1237
7387 1237 954 1441 1668 2198 544 -475 -704 -990 -1438 -2234 -1619 -954 -1755 -2480 -2655 -1166 2158 2098 51
7368 51 -900 -292 299 -472 23 1216 1179 1596 -247 -1111 284 647 59 940 1437 924 1024 966 763 -575
7348 -575 -1654 -1707 -1876 -471 748 336 -486 678 997 901 1382 803 1875 1348 -1095 -1445 -539 -165 -254
7329 -254 -1860 -3115 -2923 -3246 -1979 -1079 -2041 -2019 -1275 -1393 -2071 -1844 -2873 -1169 335 -387 -1575 -2370
7311b370O65Q10q05n69J264K077q20r19j184n90L03J526M70n33l16q3k3l98k82
7292a777J314J068l73p54j907O86K658P32p41j517o50J011O28J328M65j343j604
7275g76j808p72Q72L39m78L60r32J423r95J44O94J304J02j56n39Rl46J73J5J069
7255b98J778q08j006r22j714m46J786n85j071J602Q63P20J91M77K56p15k4p38
7237f54J2n82n13P12N50O95N82m78l33R1J8J57j055n69K264p88l91O80J24j393
7217h71m18K2l12O85J67J99q31j362k024J114J061M20J346K296p02j72j908l60
7199a650l05J322K18n23r36P73p34j74o20O02J18J32L31O74k73j327J711O10O66
7180F15M91J075K95j500J032l08n16o6l03j742K47P63k69L63N91M67J47j234q57
$$ plain form
7311 -2370 -1705 -895 -1700 -2269 -1005 1072 252 -667 -1851 -2441 -2138 -612 -142 -675 -991 -1074 -1097 -1495 -1777
7292 -1777 -463 605 232 -522 -2429 -1743 915 1647 906 -611 -1261 -250 378 1706 2171 828 -776
7275 -776 -2584 -3356 -2484 -2145 -2623 -2263 -3195 -1772 -2767 -2623 -1929 -625 -523 -679 -1218 -1209 -1555 -1382 -1367 -298
7255 -298 1480 672 -334 -1256 -2970 -3416 -1630 -2215 -3286 -1684 -821 -101 90 567 823 108 84 -654
7237 -654 -642 -1224 -1737 -1025 -475 220 802 324 -9 82 100 257 -798 -1367 897 109 -282 398 522 -871
7217 -871 -1289 -1267 -1579 -894 -727 -528 -1359 -2721 -4745 -3631 -2570 -2150 -804 1492 790 618 -1290 -1650
7199 -1650 -1955 -633 -415 -938 -1874 -1101 -1835 -2009 -2629 -2027 -1909 -1777 -1446 -772 -1045 -2372 -661 -51 615
7180 615 1106 2181 2476 976 2008 1700 1184 1118 815 -927 -680 83 -186 177 768 1235 1382 148 -709
7161g09r25O69K081N84l65n27k65Q75j67j139k420j909M35R44J048K2N36n83r53
7142b768m10J59M79M66R94J035J006J84q66k023j164N5Q10r24p30K84N14O6q07
7123c640J218M86R56Q30o61J610J009N64j740k968k309Q21K444O70o82j885K37
7106c040M75Q77M65Q78J334P55q88O81J308J95j943j251j166m49M90N58K072j164
7088A87k5J645P61J348l11k107j226j196L4j096q23j169J181O29M14L18R48j19
7070f07j501J097N06r83j589M79O37J908J882j460j193J147Q98J272N52K9j457
7053A617k828r23p5K49J719j43o03K678Q86J2j842N1l20j918k86J505O03p39k137
7034b494L01K285J240j227j368L66J582J313J870J215k736k984q25M87J428o62
$$ plain form
7161 -709 -1634 -965 1116 1700 1335 808 543 1418 1251 112 -2308 -4217 -3782 -2838 -1790 -1768 -1232 -1815 -2768
7142 -2768 -3178 -3019 -2540 -2074 -1080 -45 961 1145 279 -1744 -2908 -2853 -2043 -2967 -3697 -3413 -2899 -2833 -3640
7123 -3640 -2422 -1936 -980 -150 -811 799 1808 2372 632 -2336 -4645 -3824 -1380 -710 -1392 -3277 -3040
7106 -3040 -2565 -1688 -1223 -345 989 1744 856 1537 2845 3040 1097 -154 -1320 -1769 -1279 -721 1351 187
7088 187 162 1807 2568 3916 3605 1498 272 -924 -890 -1986 -2809 -3978 -2797 -2168 -1754 -1436 -488 -607
7070 -607 -2108 -1011 -505 -1488 -3077 -2598 -1961 -53 1829 369 -824 323 1221 2493 3045 3074 1617
7053 1617 -1211 -2134 -2209 -1960 -241 -384 -987 1691 2577 2589 747 798 478 -1440 -1726 -221 382 -357 -2494
7034 -2494 -2193 92 1332 105 -1263 -897 685 1998 3868 5083 2347 -637 -1462 -975 453 -209
7018b09J99J402J439j728r68o67Q77K6j251k254N89L56J9L64R56L69l75j266k56
6999b378N79OK820J865J135j021k356j578k256j34Q55l74R79n86Q48K077l40j351
6981a210j285M74J113N41Q00P6n26n31j082n46j367J75j081j88m2J075K002j217
6963b819P52K027m08P70J155k15M01j71j789M81m93j78o71K84P56j317j757K001
6945a191J419r96p89O47J186j675q22j4k45p50R19J872Q22Kj85K544Q57j060k126
6926D15j459m05M50J118J385j092j295j846O4J263q15l11K36r7N69j252j483N37
6908d018P97Q76j44p92R07R27R77J132M85O01m49j00r89R6j099K12J799J31r71
6889C78L61o14l68j138j35K041M13K183J018j159M92j00j794j256k144n65j457
$$ plain form
7018 -209 -10 1392 2831 1103 135 -532 345 371 -880 -3134 -2545 -2189 -2170 -1806 -850 -481 -856 -2122 -2378
6999 -2378 -1799 -1793 1027 2892 4027 3006 650 -928 -3184 -3318 -2463 -2837 -1858 -2444 -1596 481 141 -1210
6981 -1210 -2495 -2021 -908 -367 433 509 -17 -548 -1630 -2176 -3543 -3368 -4449 -4637 -4679 -3604 -1602 -2819
6963 -2819 -2067 -40 -448 322 1477 1262 1663 1492 -297 184 -309 -487 -1158 -874 -118 -1435 -3192 -1191
6945 -1191 228 -768 -1557 -910 276 -1399 -2221 -2235 -2480 -3230 -2311 -439 383 385 200 2744 3601 2541 415
6926 415 -1044 -1449 -999 119 1504 412 -883 -2729 -2665 -1402 -2217 -2528 -2292 -2389 -1820 -3072 -4555 -4018
6908 -4018 -3221 -2345 -2489 -3281 -2374 -1447 -470 662 1147 1748 1299 1199 210 306 -793 -581 1218 1349 378
6889 378 739 125 -243 -1381 -1516 525 938 3121 4139 2980 3472 3372 1578 322 -1822 -2387 -3844
6872c844m31L71m3J943M48p84or0k048L6J04K338K071j33j1J180r6j001l41P22
6852C85L50Q65K21J032l29n41K97Q27j784l89j101j270l76O63Q55L05j248q11
6834b049j58o09o36N7p65Q58J612j19m49L13M66K11j733K018J010K43J142K50
6816A662j520r85M15J750p82l53L64k0K27P91k22q63R68j537j322q19j152O71
6798b727J323M06K64J411Q71p88j907m61R70P04J31J646O04q74J020r39k693K
6780a037J083M52n04k9k11k01R85J33J94Q19o43j118L99j976K73L78n92l63m2
6761b000N63j31J94J237M92j889o7J625n19P15J629pK89j190j859J030m1j69J13
6742A5j94J102M9q72r02k443o65J291R09r7K296R0r80j74j438m31J838J281L93
$$ plain form
6872 -3844 -4275 -3904 -3947 -2004 -1556 -2340 -2346 -2436 -4484 -4448 -4344 -2006 65 -68 -79 1101 1005 4 -337 385
6852 385 735 1600 1821 2853 2524 1983 2280 3107 1323 934 -167 -1437 -1813 -1150 -295 10 -1238 -2049
6834 -2049 -2207 -2816 -3452 -3395 -4160 -3302 -1690 -1809 -2258 -1945 -1479 -1268 -3001 -983 27 270 1412 1662
6816 1662 142 -843 -428 1322 540 187 551 531 758 1549 1327 464 1432 -105 -1427 -2246 -3398 -2727
6798 -2727 -1404 -998 -734 677 1548 760 -1147 -1608 -638 66 197 1843 2447 1573 2593 1654 -1039 -1037
6780 -1037 46 498 -6 -35 -246 -447 538 671 865 1684 1041 -77 322 -1654 -1381 -1003 -1595 -1958 -2000
6761 -2000 -1437 -1568 -1374 -137 355 -1534 -1601 24 -495 220 1849 1842 2131 941 -918 112 71 -98 15
6742 15 -179 923 972 100 -802 -3245 -3910 -2619 -1710 -1807 489 579 -401 -575 -2013 -2444 -606 675 1068
6723A068L44j21j795m05P61Q17K190j2n04J93j226m78j051j616l46J484m52j599
6705b748N83J271R63J179j043n1J16O10o90l75L2j95J29P37m32N89O01j87j504
6686d15r42J156N86M2j73j467l42J281K19J529J643k081n76N38k71O48j122j535
6668a282o4O23R82J625j707j771k87l67j197J820K206n12M30m99J585P08j811
6651D82j04q76N27J090N14j374o92m48j9J01J8j635r99J210J983Q07J38q04j314
6632a395k004M83N00J070J201J06N41M50l77p05l52Q08M77j172j500j180j389
6615d438K39m82K189O46k66K021L8j137J079j865j730N55R05J316J256n77m85
6598g36J157L74K50n93j387k00p65R7P60Q56K07k768j982n52j325J848K768J998
$$ plain form
6723 1068 1412 1291 -504 -909 -148 669 2859 2847 2343 2536 1310 832 -219 -1835 -2181 -697 -1149 -2748
6705 -2748 -2165 -894 69 1248 205 154 270 880 190 -185 -153 -348 -219 518 86 675 1276 1089 -415
6686 -415 -1357 -201 385 427 254 -1213 -1555 -274 -55 1474 3117 1036 460 998 727 1375 253 -1282
6668 -1282 -1346 -723 259 1884 177 -1594 -1881 -2248 -3445 -1625 581 69 499 0 1585 2293 482
6651 482 378 -498 29 1119 1633 259 -433 -881 -900 -799 -781 -2416 -3415 -2205 -222 585 723 -81 -1395
6632 -1395 -3399 -2916 -2416 -1346 -145 -39 502 952 575 -130 -482 326 803 -369 -1869 -3049 -4438
6615 -4438 -4199 -4681 -2492 -1846 -2112 -91 -53 -1190 -111 -1976 -3706 -3151 -2246 -930 326 -251 -736
6598 -736 421 795 1045 452 -935 -1135 -1900 -1803 -1043 -187 20 -2748 -4730 -5282 -6607 -4759 -1991 7
6580GP61N80j090n22Q1k71J52o22m67l75R77K06N40J105q69J37r31k87r1M06o54
6559a227j253P94P01m38L57j9L30M08J236k102j21m02o0K087L32N74j032j099
6541i34J48J397K46j642k16K212M38j028j369j23l14o69K98j83Q50P95j301J94
6523a201K053l71n62j348n23l52J193L40l96m58k01R89J073P93L27j303l42Q46
6505E57l07j222j686P99K498j94R9n96k39K06Q19J451j330n39j544M09M99R89
6487F69L20r51m46O7M60r94j110J118K4j219o26O46J84K220L70j364J271j937
6469a298r25k34J363j01j201J456J224j690o51OK327P26j669j26J3M49J103j291
6451e19p57k29j41r2R69J606l99M10r64N72J92m55j037K02j316J182J858m07j078
$$ plain form
6580 7 768 1348 258 -264 -183 -454 -302 -924 -1391 -1766 -789 -583 -43 1062 193 330 -601 -888 -979 -573 -1227
6559 -1227 -2480 -1686 -985 -1423 -1066 -1085 -755 -347 889 -1213 -1334 -1736 -1796 291 623 1197 165 -934
6541 -934 -786 611 857 -785 -1001 1211 1649 621 -748 -871 -1185 -1854 -1556 -1739 -889 -94 -1395 -1201
6523 -1201 852 481 -81 -1429 -1952 -2304 -1111 -771 -1167 -1625 -1826 -837 236 1029 1356 53 -289 557
6505 557 250 -972 -2658 -1859 639 445 544 -52 -291 -85 734 2185 855 316 -1228 -819 -320 669
6487 669 989 38 -408 -341 119 -875 -1985 -867 -843 -2062 -2688 -2042 -1858 362 732 -632 639 -1298
6469 -1298 -2223 -2457 -1094 -1195 -2396 -940 284 -1406 -2057 -2051 276 1002 -667 -793 -780 -331 772 -519
6451 -519 -1276 -1505 -1646 -1738 -769 837 438 848 -116 456 648 193 -844 -642 -1958 -776 1082 675 -403
6432d03j014j193K120K777j81K23Q08J30r66j603o37q91l05N73P2k070l11O32
6414b239R12r96j369J335J374l56K36O1J231Q6m03O02N91m37K71n75j482R89J643
6395A474J331R00j602k628j224l69O67j476m69J640K149Q26m64M55J800q44j106
6378A060J577R91j832k398M81J072j023R48m99q31K78R30L70J292j257O71J095
6361B925j760j384l92k63n4M12p1m71q42r12J503R90m10P8m24M37J246j394k27
6342a013r8L54L45N73o41L96Q32q89N14J239k1l97j274p30j159p0l37m68M90N70
6322a784K6j406o84J399N63J58j087J080K054M82j516k141q93j049J822K461J395
6305H80m87L28j756M1N29O42J534k3M46j15J302J581M84k135j419k65q46p90J54
$$ plain form
6432 -403 -1417 -2610 -490 2287 2106 2329 3137 3267 2301 698 61 -830 -1135 -562 -490 -2560 -2871 -2239
6414 -2239 -1327 -2323 -3692 -2357 -983 -1339 -1103 -1042 189 275 -128 474 1065 628 899 324 -1158 -169 1474
6395 1474 2805 3705 2103 -525 -1749 -2118 -1451 -2927 -3396 -1756 393 1219 755 1210 3010 2166 1060
6378 1060 2637 3628 1796 -602 -121 951 -72 876 377 -454 -176 754 1124 2416 1159 1830 2925
6361 2925 1165 -219 -611 -874 -928 -516 -587 -1058 -1900 -2812 -1309 -319 -729 -651 -1075 -638 608 -786 -1013
6342 -1013 -1111 -757 -412 161 -480 -84 748 -141 373 1612 1591 1194 -80 -810 -1969 -2039 -2376 -2844 -2354 -1784
6322 -1784 -1758 -3164 -3848 -2449 -1886 -1728 -2815 -1735 319 801 -715 -2856 -3749 -4798 -2976 -515 880
6305 880 393 721 -1035 -994 -465 177 1711 1688 2134 2019 3321 4902 5386 3251 1832 1567 721 -69 85
6286H5l93n66M14R77k78j109N64q40Q6K26l22j26J756J297j67j104P13n20j314
6267f21J026Q30r26n81j86j216J19L210K202j884k852o48N98J036p53P77K723
6250B854J012l349k258q6p62K936M017j727l695l613J748j58m50J959J265m73
6234g80l78J86r07k49j187J228M98o04J42J227P74M92j74k68j276J10J263r5J105
6215A107l6o4L71k49N87k142j082J171o69K047m22k421J063J338J077O19j351
6198I44k84P33n12j154P95l58Q68O30l69j403l92m63P70P63J001M32q65N76m56
6179A256J067j967j555k62O73j116k921O54K299k90q44J148J352l15L54J281o52
6162A62O53K09m32k35N54j584k262J10J662Q80J150r92j346M55P04k3k72J187
$$ plain form
6286 85 -308 -874 -460 517 239 -870 -306 -1146 -1060 -834 -1156 -1282 474 1771 1604 500 1213 693 -621
6267 -621 405 1235 309 -272 -458 -1674 -1555 1655 3857 1973 -879 -1527 -929 107 -646 131 2854
6250 2854 3866 517 -1741 -1827 -2589 347 4364 2637 -1058 -4671 -2923 -3081 -3531 -1572 -307 -780
6234 -780 -1158 -972 -1879 -2128 -3315 -2087 -1589 -2193 -2051 -824 -50 442 268 0 -1276 -1166 97 2 1107
6215 1107 1071 1007 1378 1129 1716 -426 -1508 -337 -1006 1041 619 -1802 -739 599 1676 2295 944
6198 944 660 1393 881 -273 522 164 1032 1662 1293 -110 -502 -965 -195 568 1569 2001 1136 1712 1256
6179 1256 2323 356 -1199 -1461 -788 -1904 -4825 -4171 -1872 -2162 -3006 -1858 -506 -821 -467 814 162
6162 162 815 1024 592 357 911 -673 -2935 -2825 -1163 -283 867 -125 -1471 -1016 -312 -335 -607 580
6144E80K193k240o2K46j754J196O65O87l89q18K13P11k31o99j233J776J78j118
6126i9l46Q09k4j63m46n24q08j150j302j68J396K372R74J710N70j147j753K31
6108A32K506Q97k576q65R65o89j317O45J40m69q0J020J918m07j055n6j059j509
6090a859j18R84L032j22j809L69J24q74P19O32j616j689j862J700J272j58r19
6073b194R12K551J05j15j918j396N20J091m2r7K74N05j549K45R71N92N01P2m78
6054E50J086N7j997j310R80J074L41j583o09j664o10j46J412K88P57M85p94K105
6036D22m44k78k18O74p39j138l97P7K05k10j340j61J500k2O23J250n84j553k62
6017b595J368O84R38j8O38k63j164m2j10n9J500l20M14j20l96j042m70k29j009
$$ plain form
6144 580 2773 533 471 717 -1037 159 824 1511 1122 304 517 1228 997 298 -935 841 1019 -99
6126 -99 -445 364 340 177 -269 -793 -1601 -2751 -4053 -4221 -2825 -453 521 2231 2801 1654 -99 132
6108 132 2638 3535 959 94 1059 370 -947 -302 -162 -631 -711 309 2227 1820 765 709 -350 -1859
6090 -1859 -1977 -993 2039 1917 108 477 601 -273 446 1078 -538 -2227 -4089 -2389 -1117 -1275 -2194
6073 -2194 -1282 1269 1374 1259 -659 -2055 -1535 -444 -486 -583 -309 196 -1353 -1108 -137 455 956 1028 550
6054 550 1636 1693 -304 -1614 -634 440 781 -802 -1411 -3075 -3685 -3831 -2419 -2131 -1374 -889 -1683 422
6036 422 -22 -300 -518 156 -583 -1721 -2118 -2041 -1836 -2046 -3386 -3547 -2047 -2069 -1446 -196 -780 -2333 -2595
6017 -2595 -1227 -543 395 377 1015 752 -412 -454 -564 -623 877 557 971 851 455 -587 -1057 -1286 -2295
5998b295J057R66J148j255k8L92L95M82Q25O83R52q23m51j48J30K67p65p02k20
5979F10n49L32jr2Q45l83l46J221j177o17J383o48K2R1N87j165j012J008J423
5960A532J240j169j633J225j022o89K96L1j303j007K706J276n93q74K38J622Q69
5943B745j724q26j74J84q49P98J669o43n10j552n80j44n12O29L80N19R00J801
5925B111k91m77p73j129j10j162k4M67P59J380J74q62J238J354J215j06k23k015
5907A526p31L09n00R07k06j55j774j469p48L41N3J48j55L42k24j438J031J724
5889a019K573P8J83P14j148m55L06Q42J331q65j371N59R76o30J23n21j109j35
5871D32J075R47Q71j192j611J038o10r63J163K45k587r39M94P77q90m81J638K256
$$ plain form
5998 -2295 -1238 -272 876 -379 -407 -15 380 862 1687 2370 3322 2499 2048 1900 2030 2297 1532 830 610
5979 610 61 393 392 300 1145 762 416 1637 460 -157 1226 578 600 691 1278 113 -899 109 1532
5960 1532 2772 1603 -30 1195 173 -516 -220 -189 -1492 -2499 207 1483 890 16 254 1876 2745
5943 2745 1021 195 21 205 -644 154 1823 1180 670 -882 -1462 -1606 -2118 -1489 -1109 -590 310 2111
5925 2111 1820 1343 570 -559 -669 -1831 -1855 -1388 -629 751 925 63 1301 2655 3870 3764 3541 1526
5907 1526 795 1104 604 1511 1305 1150 -624 -2093 -2841 -2500 -2447 -2299 -2454 -2112 -2336 -3774 -2743 -1019
5889 -1019 1554 1632 1815 2529 1381 926 1232 2074 3405 2540 1169 1728 2704 2074 2197 1676 567 432
5871 432 1507 2454 3325 2133 522 1560 950 -13 1150 1395 -1192 -2131 -1637 -860 -1750 -2231 -593 1663
5853A663o81j789P3l28N13M56j080k214j424J515J113K181j12j061l19P94P16
5836A6j724k56M38P8p65P60Q08J082o91m70J423J310N03R79j893k82k65o29m60
5817c8m50p16j167j87O49N64L5p78R90J643J048l17m9P21J545J402o58k277j432
5798E28r15k28J395K25j769R54O47j039N27J02J442N16p52k54j132q81K98J180
5780H44O53l149l65K84j408o00J571J397Q58j568O2R79K72o65m84M69J06j51J187
5761B92m30J58K06N08p6J30m05p93n95L57J707N48l72q09j187J94k79M77P90j219
5741g98l59M64q00Q57L9r33p09n48O04K57j024J70J906K00O91M01k07L91P32N44
5721A878J175j022k286j002O45J013J426J341r06k194j985j990L16M50O79m68
$$ plain form
5853 1663 982 -807 -734 -1062 -549 -93 -1173 -3387 -4811 -3296 -2183 -2 -114 -1175 -1494 -700 16
5836 16 -1708 -1964 -1526 -1448 -2213 -1453 -645 437 -254 -724 699 2009 2512 3491 1598 1316 1051 422 -38
5817 -38 -488 -1204 -2371 -2558 -1909 -1345 -1310 -2088 -1098 545 1593 1276 1227 1948 3493 4895 4237 1960 528
5798 528 -387 -615 780 1005 -764 190 837 -202 325 427 1869 2385 1633 1379 247 -634 -336 844
5780 844 1497 -1652 -2017 -1733 -3141 -3741 -2170 -773 85 -1483 -1421 -442 -170 -835 -1319 -850 -744 -895 292
5761 292 -138 20 226 734 658 788 383 -410 -1005 -648 1059 1607 1235 426 -761 -567 -846 -369 421 -798
5741 -798 -1157 -693 -1493 -636 -597 -1530 -2239 -2787 -2183 -1926 -2950 -2780 -874 -674 17 418 211 602 1334 1878
5721 1878 3053 2031 -255 -1257 -612 401 1827 3168 2262 68 -1917 -3907 -3591 -3141 -2462 -2930
5705b930l22J807L188j669k149Q59J510O5p59k051L17j32j129J318P15K238Q18
5688A694L38k428m22P96k73N68j32L28q40j11N01J30r82j87Q71k7J171qJ309n52
5668A744q7J40N55l94R38mJ95j178j943k021M93L445l64j23j272j587J770O10
5650I17o05p77J077M11N18j038j576O84J299j171L44J064k416k196r23P4Q31J872
5632a611J148L80N98l57j872k33J113n3l92n0j93k49RK9O11M36L31k58j211N8
5612a766J513m37k581n66K310M61k39N34Q98j029P99J406Q10j098j85M1j23p39
5594Ip80n59N59j90O61m45p12o00j61J024J398J542L81r16j941k48J33P7J946
5575A178K38j748p26l41J98P7P85J196O30J55j042n37k11J782Q69k079k498Q85
$$ plain form
5705 -2930 -3252 -1445 1743 74 -2075 -1216 294 359 -400 -2451 -2134 -2266 -3395 -2077 -1362 876 1694
5688 1694 2032 -396 -818 -22 -295 273 141 469 -371 -482 19 149 -833 -1020 -149 -176 995 987 2296 1744
5668 1744 1657 1797 2352 1958 2896 2892 3087 1909 -34 -2055 -1562 1883 1519 1396 124 -1463 307 917
5650 917 312 -465 612 1023 1541 503 -1073 -389 910 -261 83 1147 -1269 -3465 -4388 -4314 -3483 -1611
5632 -1611 -463 -83 515 158 -1714 -1947 -834 -887 -1279 -1329 -1522 -1771 -1762 -1733 -1122 -686 -355 -613 -1824 -1766
5612 -1766 -253 -690 -3271 -3837 -1527 -1066 -1305 -771 127 -902 -103 1303 2113 1015 830 871 748 9
5594 9 -771 -1330 -771 -961 -300 -745 -1457 -2057 -2218 -1194 204 1746 2127 1211 -730 -978 -845 -768 1178
5575 1178 1416 -332 -1058 -1399 -1201 -1124 -339 857 1487 1642 600 63 -148 1634 2503 424 -2074 -1189
5557a189l61O74N4j62J13l57p20p00K86K166M77m79j195j562m9L92K925K083K37
5538B633nj128k489M13J639L22k34n74j096J381J981N34k071j464J52R32K82r76
5520B32j157r90J95L04J34P81J52j996k55Q76o02J975R0J222l72j975p4R95L211
5501B746J275q52o68q04n22r97p69P47J802j501j941l88J239J310J228j54o03
5484A148j890j240M10n7j7J89J423K418k017M05R20k335j60J909R0n0n18Q71L2
5465A531l182q37L40J079L98j09J238j215k022p09J597J797P65J007j624j016
5449i62j762j76M26J013O62j155N06K434p41r63j62q99P75J538N18m86j688l52
5431a474J436j041j324J948J743P0q78j112q95j27j141N01K80P81J602J005J278
$$ plain form
5557 -1189 -1550 -876 -822 -984 -871 -1228 -1948 -2648 -2362 -196 281 -198 -1393 -2955 -3004 -2612 313 2396 2633
5538 2633 2628 1500 -989 -576 1063 1385 1151 577 -519 862 2843 3377 1306 -158 -6 926 1208 232
5520 232 -925 -1915 -1720 -1416 -1282 -501 -349 -2345 -2600 -1724 -2326 -351 -261 961 589 -1386 -1460 -465 2746
5501 2746 4021 3169 2501 1697 1175 178 -591 156 1958 457 -1484 -1872 -633 677 1905 1751 1148
5484 1148 -742 -1982 -1572 -1629 -1646 -1457 -34 2384 367 772 1692 -643 -803 1106 1196 1146 628 1499 1531
5465 1531 -1651 -2488 -2148 -1069 -671 -780 458 -757 -2779 -3488 -1891 -94 671 1678 54 -962
5449 -962 -2724 -2900 -2474 -1461 -799 -1954 -1448 986 245 -718 -880 -1779 -1004 534 1052 566 -1122 -1474
5431 -1474 -38 -1079 -2403 -455 1288 1358 480 -632 -1527 -1654 -2795 -2294 -2014 -1233 369 1374 2652
5414B652k371j064J228P53p24j696J08j044o43K096K199m25R2p62j63n69j889
5397b222K84J155k90j219N3K293j8r88n29o0N43j229q22O05K204M05j17p21o60
5378a333l58j05J526k04j19n58L40N33r57j015J725K683r38l89j82J20j23k759
5360b113n60J819m59q15j027J030P62J214l20j317O95J407L95o87R13Q10N39N35
5342B821K44j04j609j290j84K53K42N76m61N26m81k62j169J69k66j677q17P66
5324b723k17P44J01N98J041J276M70j545q81m92j069R56J873O7n45O74K51J43
5306G22P98M46j923P31J230j214j553j999j657N64J579K068J74K96p71J48k03
5289e64M27r52J02O59J443p05k957j596P95J405o76j073n85J385K868R35n76j683
$$ plain form
5414 2652 281 -783 445 1198 474 -1222 -1114 -2158 -2801 -705 1494 1069 1161 399 236 -333 -2222
5397 -2222 -1938 -783 -1073 -2292 -2239 54 36 -952 -1481 -1541 -998 -2227 -3049 -2444 -240 165 48 -673 -1333
5378 -1333 -1691 -1796 -270 -474 -593 -1151 -811 -278 -1235 -2250 -525 2158 1220 831 649 769 646 -2113
5360 -2113 -2673 -854 -1313 -2128 -3155 -2125 -1363 -149 -469 -1786 -1091 316 711 24 937 1747 2286 2821
5342 2821 3065 2961 1352 62 -122 131 373 949 488 1014 533 271 -898 -729 -995 -2672 -3489 -2723
5324 -2723 -2940 -2196 -2095 -1497 -456 820 1290 -255 -1136 -1628 -2697 -1741 132 199 -346 328 579 722
5306 722 1520 1966 43 774 2004 790 -763 -2762 -4419 -3855 -2276 -208 -34 262 -509 -361 -564
5289 -564 -137 -1089 -987 -328 1115 410 -2547 -4143 -3348 -1943 -2619 -3692 -4277 -2892 -24 911 335 -1348
5271a348j396o15n30K027K448k32p75n67J751J851j033r02m92n46J359j95O80
5254A485m85J224Q9n61j838m84J175p47J134m52l63l34j558N5j71N15K39J123
5236D6L79K09m7p83p17J0j291l80j72o06L03O18P41K617K92o86J75j746j151M75
5216a714m45J315M0J138k73K12L61j11M12J72r24o62j94j57Q78P40J43n53p02
5197c24N4r61J265j24Q71j65o16M94J649Q38J451L6j568j569j94P67J052j932
5179A024l120j013J959P27p84J033L01j42q19M64L38J379j224j649O70J50L21
5162c85n55R19L7R71k98j251O49j080m95j57k59m22J824L18l99j528l86J023J626
5143A52l06n09M49r51J24J916k03r60P75j63r0k08n89n02L23R7j311J67m75j825
$$ plain form
5271 -1348 -2744 -3359 -3889 -1862 586 354 -421 -988 763 2614 1581 679 187 -359 1000 805 1485
5254 1485 1000 2224 2313 1752 -86 -570 605 -142 992 540 177 -157 -1715 -1660 -1831 -1316 -1077 46
5236 46 425 634 587 -196 -913 -903 -2194 -2574 -2746 -3352 -3049 -2431 -1690 927 1219 533 708 -1038 -2189 -1714
5216 -1714 -2159 -844 -804 334 61 273 634 523 935 1107 183 -479 -673 -830 48 788 931 378 -324
5197 -324 -270 -1231 34 -90 781 616 0 494 2143 2981 4432 4468 2900 1331 1137 1904 2956 1024
5179 1024 -2096 -3109 -1150 -423 -1207 -174 127 -15 -834 -370 -32 1347 123 -1526 -856 -706 -385
5162 -385 -940 -21 16 987 689 -562 87 -993 -1488 -1645 -1904 -2326 -502 -184 -583 -2111 -2497 -1474 152
5143 152 -154 -663 -214 -1165 -1041 875 672 -288 487 324 234 26 -563 -1065 -742 -645 -1956 -1789 -2264 -4089
5123d089P94O55J369J139m65J36k71j260p65K137J07j240N48O26n86m22J395Q92
5105G00m57k42k181R9J478L45q78q26M8K2K50j023n54M60L54J092L00P65J44P1
5085c3M92j001k260k37J616J100J883j227n53j90q52L10R71J601m75l49p07P62
5067H51N64M32j267n86p50O69j040r8J800K284L45n59l65m69k390q93k435j057
5049d964K018J992J72J126N65M6o64o03m57J287K72J608q70r21P14q87j218K8
5031g56r09L23M34J852P03j359k62R08K9j412q84L11Q13L01k28M68M6p18J08J233
5011A001P36p33k040j351Q98J926N08J263m55L22j969j817J660M89m49l08j280
4994a599J695J877j227m97J594M15q23k657r0M92j04J213j282j390k11J61J003
$$ plain form
5123 -4089 -3295 -2640 -1271 -132 -597 -461 -732 -1992 -2757 -620 -513 -1753 -1205 -579 -1165 -1587 -192 700
5105 700 243 1 -2180 -2081 -603 -258 -1136 -1962 -1914 -1892 -1642 -2665 -3219 -2759 -2405 -1313 -1013 -248 -104 -33
5085 -33 459 -542 -2802 -3039 -1423 -323 1560 333 -220 -410 -1262 -952 19 1620 1145 796 89 851
5067 851 1415 1847 580 -6 -756 -87 -1127 -1225 575 2859 3204 2645 2280 1811 -579 -1472 -3907 -4964
5049 -4964 -2946 -954 -782 344 909 955 291 -312 -769 518 790 2398 1528 607 1321 434 -784 -756
5031 -756 -1665 -1342 -908 944 1647 288 26 934 963 -449 -1333 -1022 -209 92 -136 332 378 -340 -232 1001
5011 1001 1737 1004 -1036 -2387 -1489 437 945 2208 1753 2075 106 -1711 -51 438 -11 -319 -1599
4994 -1599 96 1973 746 249 1843 2258 1435 -1222 -1312 -820 -924 289 -993 -2383 -2594 -2433 -1430
4977a430K013P04M91n44j015J67k9k008l76J168J57l02l1j434J143m33j565O22
4959b702M75p95O35J586J018Lq62o4j90R05J411L09r1O30p94j824N94M49O13N30
4939A836j518q66N0p1J480j367o85J63K60r69j480J531K764K68j723j379j56Q02
4921a060K739p89j022j77M94Q77k43q52j49J560N96J141r43j076J32j68J225J07
4903B392j866m28o89K22p2N1K65K36q18l39L42l82K794Q20j552K93p28j320K16
4884e63p13N83j08J0n90P21J649j217j190R95P29j268n21O59j93J434P63J194
4866B374q13j340r1Q79O95q83o24m36O78n5N48l33m04K410M92k057j38K46L35
4847A483p40l16K055L47j112j003j53L0N38M15j070k69j62l53j129rn72j012J094
$$ plain form
4977 -1430 583 1287 1778 1234 219 386 357 -1651 -2027 -859 -702 -1004 -1035 -2469 -1326 -1759 -3324 -2702
4959 -2702 -2227 -3022 -2387 -801 217 220 -642 -706 -896 9 1420 1729 1638 2268 1474 -350 244 693 1306 1836
4939 1836 318 -548 -498 -569 911 -456 -1141 -978 -718 -1687 -3167 -1636 1128 1396 -327 -1706 -1862 -1060
4921 -1060 1679 890 -132 -309 185 1062 819 -33 -182 1378 1974 3115 2172 1096 1228 1060 2285 2392
4903 2392 526 98 -591 -369 -441 -390 -125 111 -707 -1046 -704 -1086 1708 2528 976 1269 541 -779 -563
4884 -563 -1276 -693 -801 -791 -1381 -660 989 -228 -1418 -423 306 -962 -1483 -824 -1017 417 1180 2374
4866 2374 1561 221 130 1009 1704 821 197 -239 439 384 932 599 195 2605 3097 1040 902 1148 1483
4847 1483 743 427 2482 2829 1717 714 561 591 1129 1544 474 205 43 -310 -1439 -1448 -2020 -3032 -1938
4828a938k07j897Q12J245J119K397j09J34j224L36j089m80Q12N3o69M00q3P4M39
4809A25p42m41k44N95J121J192M15R64k439k353j422Q1L91q14m70q23O68M91J129
4790b576k89N97O57N0M75K09m80j218Q83L49L70K043j3N55q60J189r69j979n4
4771a061R80P58o38N07k29L78K96k36J021J467j255j330p41n43L67M42k073j149
4753c039P59J025O0O15Q89p1J15m18l29k75r54J148J419r85j697q87o62K070Q59
4734c58L09j243J142J524P76J981n12k690j511q30n1P65P76L38K97p2J339K003
4716C983q86o02l22j50k16o09k82j019p3j64O24K5J77M12O86J282k26j647p71
4697B22p14j124o7K258J720j698k399k97J196l002j375R82J143J054m94m04J244
$$ plain form
4828 -1938 -2145 -4042 -3230 -1985 -866 1531 1422 1556 332 668 -421 -901 -89 -36 -705 -305 -388 -314 125
4809 125 -617 -1058 -1302 -707 414 1606 2021 2985 546 -1807 -3229 -3148 -2757 -3571 -4041 -4864 -4196 -3705 -2576
4790 -2576 -2865 -2268 -1611 -1561 -1086 -877 -1357 -2575 -1692 -1343 -973 1070 1057 1612 752 1941 972 -1007 -1061
4771 -1061 -81 677 39 546 317 695 991 755 1776 3243 1988 658 -83 -626 -259 183 -1890 -3039
4753 -3039 -2280 -1255 -1195 -580 309 238 353 -65 -394 -669 -1623 -475 944 -41 -1738 -2625 -3287 -1217 -358
4734 -358 -49 -1292 -150 1374 2150 4131 3619 929 -582 -1412 -1463 -698 78 416 713 641 1980 3983
4716 3983 3097 2495 2173 2023 1807 1198 916 -103 -176 -340 284 309 486 898 1584 2866 2640 993 222
4697 222 -492 -1616 -1683 575 2295 597 -1802 -2099 -903 -3905 -5280 -4298 -3155 -2101 -2595 -2999 -1755
4680a755O91J374j25J605J263j723q14r68P48o46O49m23k339J007J782l6O66N2
4662A008n65J185Q9M1q50j499k72j954m36j38J990J505j41p49J64m07K52J85l76
4643i68J722J131J56K282P57n66n52l60K96j752j821m67P21j107p11oQ92o92J93
4624h52n68K262J362j927j062r72K68K060l7N10O97J96j06j351P9n99j576O3K770
4605A217N24K75J741J63k352k548l12K42o56l94p26K519J077k757o23p2M38N83
4587a661J382J801M94J733r26m29J41q15J226J036o08k908j538q84R42J534M59
4570I79J437j573j889n78j66Q0r06P14J298R1J679n6j293m58o28L28J136J4o56
4551d47k9R75P90O27j00j95J182k543j853o99J290Q12Q12j04K318J132m83l157
$$ plain form
4680 -1755 -1064 310 185 1790 3053 1330 516 -452 296 -350 299 -124 -2463 -1456 326 290 956 1008
4662 1008 443 1628 1717 1758 908 -591 -863 -2817 -3253 -3391 -1401 104 -37 -786 -622 -1029 -777 -592 -968
4643 -968 754 1885 2041 4323 5080 4514 3962 3602 3898 2146 325 -142 579 -528 -1239 -1245 -353 -1045 -852
4624 -852 -1420 842 2204 277 -785 -1757 -1489 571 534 1044 1741 1937 1831 480 559 -40 -1616 -1553 1217
4605 1217 1741 2016 3757 3920 1568 -980 -1292 -1050 -1706 -2100 -2826 -307 770 -1987 -2610 -2682 -2244 -1661
4587 -1661 -279 1522 2016 3749 2823 2394 2535 1720 2946 3982 3374 466 -1072 -1956 -1014 520 979
4570 979 2416 843 -1046 -1624 -1790 -1710 -2616 -1902 -604 -513 1166 1110 -183 -641 -1269 -941 195 209 -447
4551 -447 -476 499 1289 1916 1816 1621 2803 260 -1593 -2292 -1002 -190 622 518 2836 3968 3485 328
4533C28j514J696M52j184j018Q17j68l08J92j323N4R11n10q61K028K552j460k34
4515D50k90L06P70r23r83j495J779Q02L18J157J412o28j211j823j374n71J617
4498f87R37N86J480p80m51j214Q33P20j424j654j201J51J78J29K12J12L94J808
4480A29J088k60j078N02J137K87r4j47m31m94J641j262k350j528P08J194P08J069
4462H19n11j165K308J449n34j491j192n24J179K065q15K23p00l81n66k107J250
4445f93k55n43N78N35M38k71L10Q55J249j119q29o25M64K92M15k1k33j411n7R01
4425b0l56j22J05p53n99J29o6M12J553J346r85q76K95R41R1p94K42N26q41r25
4405f97K506k98o72j940J9J337q49j53j024j115n42o45J353K686R90j016j129
$$ plain form
4533 328 -1186 510 962 -222 -1240 -423 -591 -899 -707 -2030 -1976 -1065 -1575 -2436 -408 2144 684 450
4515 450 160 466 1236 313 -670 -2165 -386 416 734 1891 3303 2675 1464 -359 -1733 -2304 -687
4498 -687 250 836 2316 1536 1085 -129 704 1424 0 -1654 -2855 -2704 -2526 -2397 -2185 -2073 -1679 129
4480 129 1217 957 -121 381 1518 1805 1711 1564 1133 639 2280 1018 -1332 -2860 -2152 -958 -250 819
4462 819 308 -857 1451 2900 2366 875 -317 -841 338 2403 1588 1811 1111 730 164 -1943 -693
4445 -693 -948 -1491 -913 -378 60 -211 99 954 2203 1084 255 -370 94 386 801 780 547 -864 -921 -20
4425 -20 -376 -498 -393 -1146 -1745 -1616 -1682 -1270 283 1629 644 -232 63 1004 1095 301 543 1069 228 -697
4405 -697 1809 1511 839 -1101 -1082 255 -594 -747 -1771 -2886 -3428 -4073 -2720 -34 956 -60 -1189
4388a189J020J300P04Q46j535J297J4j223J380j6j079K59L48k7J97P96k43k063
4370G86o17k67p42m92J983P41Q60O46j662j93l38n15P8o62j215q64J264P32J96
4351b81j254l38J517J311o65j247q13K65K6Q28k1J203J696j472k550j196N4K69
4333b668M26R39r93j426M72o9P62J701J375J144j309j552J650J492p20L32R2n90
4315A058o04k35m08p0q18j005o36J035K132o31O19P95p24k03j14M0m32L11M33
4296E43L45r60j299K58j69J693M87J472M29j432k363K06O01Q63j77R45l52j076
4278A4q47j29k17j156j101P88J10k49J220P81J373j377j27p50l42M29n65j01R52
4259a294j966Q48K170p40J204J019j167j45l96o75J29J399Q97j296k207j528Q45
$$ plain form
4388 -1189 -169 1131 1835 2681 1146 2443 2457 1234 2614 2598 1519 1778 2126 2099 2296 3092 2849 786
4370 786 169 -98 -840 -1332 651 1392 2252 2898 1236 1043 705 190 268 -394 -1609 -2473 -1209 -477 -281
4351 -281 -1535 -1873 -356 955 290 -957 -1770 -1505 -1479 -651 -672 531 2227 755 -1795 -2991 -2937 -2668
4333 -2668 -2242 -1303 -2296 -3722 -3250 -3319 -2557 -856 519 1663 354 -1198 452 1944 1224 1556 1648 1058
4315 1058 454 219 -189 -259 -1077 -2082 -2718 -1683 449 -182 437 1232 508 305 191 231 -201 110 543
4296 543 888 -72 -1371 -1113 -1282 411 898 2370 2799 1367 -996 -790 -189 674 497 1442 1090 14
4278 14 -833 -962 -1179 -2335 -3436 -2648 -2538 -2787 -1567 -786 587 -790 -917 -1667 -2009 -1580 -2145 -2246 -1294
4259 -1294 -3260 -2412 -242 -982 222 1241 74 -71 -467 -1142 -1013 386 1283 -13 -2220 -3748 -2903
4242b903J005J71N49J329n81J91j339j167J091M84K66K8k99K312R21j277m08K305
4224B678O38O3K5q51K50j348j049j64J00L12j598N69J612J73m51N57j184K99J340
4205A971k38K66R2j8k06j495j91L30L55K53j930k034n99N82O69m02J606J899J170
4186B080n75j683o57R56L29L51J556L23k412l73N73n79p21l15J85R7K94j69J112
4167C72P24k6P22J73k179j206o17J151J490m31k3p77l2N03r3L23J434N38q5J62
4147B123m10k046l27J260O95n50M93k36L80N5k313q87Q21J450m5j066o30N22N09
4128b02Q83N12k71J003J97J36j393n14P38J519L34j085k156j766n96O45q17J000
4110a833L758J282k138j172J658R62j58Q29r13l283n92J92J346L63n16J36p85
$$ plain form
4242 -2903 -1898 -1727 -1178 151 -430 -239 -1578 -2745 -1654 -1170 -904 -876 -1175 1137 2058 781 373 2678
4224 2678 3316 3379 3404 2553 2803 1455 406 242 342 654 -944 -375 1237 1410 959 1516 332 631 1971
4205 1971 1733 1999 2091 2073 1867 372 181 511 866 1119 -811 -2845 -3444 -2862 -2193 -2595 -989 910 2080
4186 2080 1505 -178 -835 121 450 801 2357 2680 268 -105 468 -111 -832 -1147 -962 -865 -571 -740 372
4167 372 1096 1070 1792 1965 -214 -1420 -2037 -886 604 173 150 -627 -659 -156 -249 74 1508 2046 1961 2123
4147 2123 1713 -333 -660 600 1295 745 1238 1002 1382 1437 -876 -1763 -942 508 463 -603 -1233 -711 -202
4128 -202 681 1193 922 1925 2122 2258 865 351 1089 2608 2942 1857 -299 -2065 -2661 -2016 -2833 -1833
4110 -1833 1925 3207 1069 -103 1555 2517 2359 3188 2275 -1008 -1600 -1408 -62 301 -215 -79 -864
4093h64N77L07j588M40Q88K40j524j336J259l82N29J862o01K10m18K19o14j65
4075i61J023k78O5o2j986R23J914K07m02K1J569r91j829k239r3P36K876R51o14
4056H30q58j072j319On95R5o42J198J381k01M12l0K21Q07m39O06J29P8q82m78
4036g53k76O8J26J226L2L43j94J895L93j494j903K16J126j43l7K118Q41K92k007
4017A869j294j6l62J69m62q27K86K66J44O05j475q50L80K259j384o50N77K71j297
3998a791p46k117J423J189m83L50m3L38O06J68J650J99J16J06j405j84N67R90
3980I33n29K15q13q77k204J06K127J649j054J303p2j103m23n58J864N3MN2O73
3961A346l4q68l80l33j7j457J007k02o66J141J966j370r17J494l75l5J540J667
$$ plain form
4093 -864 -287 20 -1568 -1128 -240 0 -1524 -2860 -1601 -1983 -1454 408 -193 17 -401 -182 -796 -961
4075 -961 62 -216 -151 -213 -2199 -1276 638 845 443 464 2033 1042 -787 -3026 -3119 -2383 493 1444 830
4056 830 -28 -1100 -2419 -2413 -3008 -2913 -3555 -2357 -976 -1177 -765 -795 -574 233 -206 400 529 607 -275 -753
4036 -753 -1029 -961 -835 391 423 766 572 2467 2860 1366 -537 -321 805 662 625 2743 3584 3876 1869
4017 1869 575 559 197 366 -96 -923 -637 -371 -227 378 -1097 -1947 -1567 692 -692 -1342 -765 -494 -1791
3998 -1791 -2537 -4654 -3231 -2042 -2525 -2175 -2218 -1880 -1274 -1106 544 743 859 965 -440 -624 -57 933
3980 933 404 619 -194 -1071 -3275 -3169 -1042 607 -447 856 784 -319 -742 -1300 564 617 621 673 1346
3961 1346 1312 444 64 -269 -286 -1743 -736 -938 -1604 -463 1503 133 -784 710 335 300 1840 3507
3943C507j243n72j14q16K14M29J16k12j523P90k68j93m66r78j74Q06J801O87k86
3924A505j188k62Q0o97K56j31Q57m06o45L97n05J27M12L88M32L32N81k86p09J197
3904A735J224K37r53r76n60m62o7o77k032N96L025J230o39k61J181r60p10q92
3886C9J444p58j158o74o95Q01N70n63L13J9J63M03N35l40n97r17k034Q00J980
3867f69L41n20K73k62m91O66K096j137j038P59r49R76k51K80l57kO16J7r4m18
3847a64M30j053O60J156o12J41r9j66K66N45R38k183j540L73J75J573J899q90
3829A449j827O94L51k06j716o12j85J562J115J99N38q28M42m1m58q99O40k63j678
3810a723O16P41m97l92m65k92J16J133J585j114l163J899J950J461j053l16J725
$$ plain form
3943 3507 2264 1692 1578 762 976 1405 1521 1309 -214 576 308 115 -351 -1329 -1503 -697 1104 1791 1505
3924 1505 317 55 135 -562 -306 -437 420 14 -631 -234 -739 -612 -200 188 620 952 1533 1247 538 1735
3904 1735 2959 3196 2243 1267 707 245 178 -499 -2531 -1935 1090 2320 1681 1420 2601 1641 931 39
3886 39 1483 725 -433 -1107 -1802 -1001 -431 -994 -681 -662 -499 -96 439 99 -498 -1415 -3449 -2649 -669
3867 -669 -328 -848 -575 -837 -1328 -662 1434 297 -741 18 -931 45 -206 74 -283 -285 331 348 254 -164
3847 -164 266 -787 -127 1029 417 558 459 293 559 1104 2042 -141 -1681 -1308 -1133 440 2339 1449
3829 1449 -378 316 667 461 -1255 -1867 -2052 -490 625 824 1362 534 976 935 477 -422 218 -45 -1723
3810 -1723 -1107 -366 -863 -1255 -1720 -2012 -1896 -763 822 -292 -3455 -1556 394 1855 802 486 2211
3793B211l84j142J665l64k957J41J053Q70n39j333M16N00o31J61P26J154p63L83
3775A167P1m70Q85M55q6m26L52o81k508o57J723J924K780O0K9l56j896k33L68
3756B501j059J51o37j335j64J418m46n5m46k66j865n08r74O77J018O87O23Q14
3738A34K48K080l74j233m64Q87q32m83m3k83K89R83M19q95j580R23J31j364n96
3719b053O79l58J615n41R9K770L63o07n22n65l46r39N2M90j020j176J665J433
3701A039j503r65j303J349O91LN8l24j326r4L77P11Q12J81p60m65l85K98P21k22
3681a107M74O92j939j269N33J419k25K83N17L10M69M25J122m08J80L52J29j207
3663G50J50o03K64n69J307J76j016p65M8J972m93q58m99j173p70J100k16P91R36
$$ plain form
3793 2211 1827 685 2350 1986 -971 -830 223 1093 554 -779 -363 137 -494 -333 393 1547 784 1167
3775 1167 1238 768 1653 2108 2022 1596 1948 1267 -1241 -1898 -175 1749 4529 4589 4618 4262 2366 2133 2501
3756 2501 1442 1593 956 -379 -543 875 429 374 -72 -338 -2203 -2711 -3685 -3008 -1990 -1303 -680 134
3738 134 382 2462 2088 855 391 1278 446 -37 -80 -363 -74 909 1328 433 -1147 -224 -93 -1457 -2053
3719 -2053 -1374 -1732 -117 -658 -559 2211 2574 1967 1445 880 534 -405 -353 137 -883 -2059 -394 1039
3701 1039 -464 -1429 -2732 -1383 -692 -689 -631 -955 -2281 -2375 -1998 -1287 -475 -294 -1054 -1519 -1904 -1606 -885 -1107
3681 -1107 -633 59 -1880 -3149 -2616 -1197 -1422 -1139 -622 -312 157 582 1704 1296 1476 1828 1957 750
3663 750 900 297 561 -8 1299 1475 459 -306 -258 1714 1221 363 -136 -1309 -2079 -979 -1195 -404 532
3644E32J317L51j924r25K85J248L26r35L34M37P30q03N2nj634l56J205M7J737
3625B019q48k94p1r77J412j311Q64J715o21P28p89k641j613J748P13q68M57P01
3607C24j293j438J577J115l16k04j443j293N2J116R35L5j703o76P79K457M37O54
3589A115R88K11j180L58j484j418k8P79j090j77J149K134J538J04k939j337P43
3572e34O44N30J940J383r18r00k892O51J653l676j219K430n18L93j64k49N18J86
3554g42j0J158K08l24k17j050j98L2O3J966l69j797R90J722R34J24k17M5K89M21
3534C028p98j570l75m5N6m04j66n77n6o00L03q41K47J719J635Q52j391p32N8P37
3514A080l80N84M43k98j23P60j872j356M09j7Q54n53k057n12K67L43O59r67j223
$$ plain form
3644 532 1849 2200 276 -649 -364 884 1210 275 609 1046 1776 973 1025 1020 -614 -970 235 282 2019
3625 2019 1171 877 806 -171 1241 -70 794 2509 1888 2616 1827 -814 -2427 -679 34 -834 -377 324
3607 324 -969 -2407 -830 285 -31 -235 -1678 -2971 -2919 -1803 -868 -833 -2536 -3212 -2433 24 461 1115
3589 1115 2103 2314 1134 1492 8 -1410 -1438 -659 -1749 -1926 -777 1357 2895 2999 60 -1277 -534
3572 -534 110 640 2580 3963 3045 2145 -747 -96 1557 -2119 -3338 -908 -1426 -1033 -1197 -1446 -928 -742
3554 -742 -752 406 614 290 73 -977 -1175 -1143 -1080 886 517 -1280 -290 1432 2366 2490 2273 2318 2607 3028
3534 3028 2230 660 285 240 296 -108 -274 -851 -907 -1507 -1204 -2045 -1798 -79 1556 2408 1017 285 343 1080
3514 1080 700 1284 1727 1429 1306 2066 194 -1162 -753 -770 84 -469 -2526 -3038 -2771 -2428 -1769 -2736 -3959
3495c959J017K75K474J531j396o27Q00M79j714j175K24R48K625N5j561n62p98
3478a364L52J296J53M71Q50j22L57P47n25M8N92j004Q19J54j628j393R01J90j802
3459i08p57O99P14J11J52O35J559k30m88R8K69j100k484m27J250k05n38J453J153
3440I56m12p93l77n49P99q14o56L95J254K112J088J194j299l480r4j7K265m27
3422A145o76l74j280o51O66P50Q38N8O61K17j334j316M1K5J379L64l83O19n34
3403B15l013o37J041K782l13K5o66p04J66K26j22J431Q02q07P93R57o02j082j933
3384a441j316n65K11j59L3J353J019K6J380N66l04j466K74Q57N57O37L96j065
3366I93j498j419O61J340n87J193R58K10n8j085l83J0R34J00J471j77j195j536
$$ plain form
3495 -3959 -2942 -2667 -193 1338 -58 -685 115 594 -1120 -2295 -2071 -1123 1502 1557 -4 -566 -1364
3478 -1364 -1012 284 437 908 1758 1636 1993 2740 2215 2263 2855 1851 2670 2824 1196 -197 704 894 -908
3459 -908 -1665 -966 -252 -141 11 646 2205 1975 1487 1585 1854 754 -1730 -2157 -907 -1112 -1650 -197 956
3440 956 544 -249 -626 -1175 -376 -1190 -1846 -1451 -197 1915 3003 4197 2898 -582 -676 -693 1572 1145
3422 1145 469 95 -1185 -1836 -1170 -420 418 476 1137 1354 20 -1296 -1255 -1230 149 513 130 749 215
3403 215 -2798 -3435 -2394 388 75 100 -566 -1270 -1104 -878 -1000 431 1233 426 1219 2176 1574 492 -1441
3384 -1441 -2757 -3322 -3111 -3270 -3237 -1884 -865 -839 541 1107 803 -663 -389 468 1025 1662 2058 993
3366 993 -505 -1924 -1263 77 -510 683 1641 1851 1793 708 325 335 1269 1369 2840 2663 1468 -68
3348f8J54K92l3P95K17j45Q1J997M98J64K3j261n31k07k31q94o79Q6j050n74L55
3327a011M5R65N61J601j08j077K03L55r02K66k13q15N9R19k63L94J421k485j234
3308a319L7l58q54o35P43M68o86j272K193L115k54j828j293O72l06j520P15K762
3290C80J670L21q50j026N36j064j963J391L08n88Q26pn36R86L60l20j20J18J696
3271B118m32j278k154n1M92O36R15Q15l00o30K06J012J37m34p8J074J449j028
3253B469J10j32m28j64J969M02r98K74j319q96J57o58j237k56O59P87L07J351
3235B397R28J18m67k082k154j860J350J329kl95O02J169L40J93o13l66R33K94
3217A714K23P27r43m01N6j068j683J008Q58n85o58J422J721j10j113j676K64J523
$$ plain form
3348 -68 86 378 345 1140 1357 1212 1293 3290 3788 3952 3975 2714 2183 1976 1745 851 172 258 -792 -1366 -1011
3327 -1011 -966 -1 560 2161 2053 976 1179 1534 632 898 685 -130 -71 848 585 979 2400 -85 -1319
3308 -1319 -1282 -1640 -2494 -3129 -2386 -1918 -2604 -3876 -1683 1432 1178 -650 -1943 -1271 -1577 -3097 -2382 380
3290 380 2050 2371 1521 495 1031 -33 -1996 -605 -297 -885 -59 -66 -602 384 744 424 304 422 2118
3271 2118 1686 408 -1746 -1797 -1305 -669 246 1061 761 131 337 1349 1486 1052 974 2048 3497 2469
3253 2469 2579 2447 2019 1855 3824 4226 3228 3502 2183 1287 1444 786 -451 -707 -48 739 1046 2397
3235 2397 3325 3443 2976 894 -1260 -3120 -1770 -441 -443 -838 -236 933 1273 1466 853 487 1420 1714
3217 1714 1937 2664 1721 1320 1376 308 -1375 -367 491 -94 -752 670 2391 2281 1168 -508 -244 1279
3199A279N93j300j174o68L8J262O68J698j62l71j272j013r2J284J120j036k78
3182E76o67R86J509J298J397j841j905j567j965n01j00R54J820J269l36j289m46
3165h08N64N31n92l65n62p77N89K246J637M76j775j932M63L50o65r16J203J392
3147A059J090k25kR28p12j463j54j77q04j544N35J435m04k63J159P92J124j164
3129A210j773k04q09J500J080j541j395N05N21P5P0J006J074J047j45Q33r78n75
3111A501J216j425j213J047j1k91R9n56M18N43N77O94J428j127j714k2J198P49
3093C111j422k000L68K304m44j258M12J346O22J687p93k738r02l19j022P34n2
3076c66j206j325J784Q81L59o79M5J690J572l03J73q23j598Q06J546J27m62p10
$$ plain form
3199 1279 1872 572 -602 -1270 -1232 30 698 2396 2234 1863 591 -422 -514 770 1890 854 576
3182 576 -91 895 2404 3702 5099 3258 1353 -214 -2179 -2680 -2780 -1826 -6 1263 927 -362 -808
3165 -808 -244 287 -305 -670 -1232 -2009 -1420 826 2463 2939 1164 -768 -305 45 -620 -1536 -333 1059
3147 1059 2149 1924 1922 2850 2138 675 521 344 -460 -2004 -1469 -34 -438 -701 458 1250 2374 1210
3129 1210 -563 -767 -1576 -76 1004 -537 -1932 -1427 -906 -831 -761 245 1319 2366 2221 3054 2076 1501
3111 1501 2717 1292 79 1126 1115 824 923 367 785 1328 1905 2599 4027 2900 1186 1164 2362 3111
3093 3111 1689 -311 57 2361 1917 659 1071 2417 3039 4726 3933 1195 293 -26 -1048 -314 -366
3076 -366 -1572 -2897 -1113 -232 127 -552 -507 1183 2755 2452 2625 1802 204 1010 2556 2683 2221 1511
3058A511j256j220R68K017J238k081k20R19m82K87J356M81p33j987l00J58n85
3041G1O77L10L43N78j470K41m83j435L20J805J54q89M44K34j446q15N44J40O91
3022A4l43j097K66k95O64J603J100M05P52Q5l8M97j625L62J74lo33j409j386o9
3002i76K772o95j196j295l91L18M02j263J5M59P75p55R70J035n42J26l63j436
2984b040k25J017K2r49L06J01R12J476k11o65P97J484n73J80N25r67m04j851k891
2965c956j77J771J413j636k21J117J008J166O01k318Q89J536k73l18L87J83J63
2948A335l98o74P08j481j025j260J5K485J158J303j017K09P85J97R97o16p95j300
2930F26r61p33P00P12O25j745R35J324m21j427j507J10j052K44j40p6J734K159
$$ plain form
3058 1511 255 -965 3 2020 3258 1177 957 1876 1394 1681 3037 3518 2785 798 498 656 71
3041 71 748 1058 1401 1979 509 750 267 -1168 -848 957 1111 222 666 900 -546 -1361 -817 -677 14
3022 14 -329 -1426 -1160 -1455 -791 812 1912 2317 3069 3154 3116 3613 1988 2350 2524 2521 1888 479 -907 -976
3002 -976 1796 1101 -95 -1390 -1781 -1463 -1061 -2324 -2309 -1850 -1075 -1830 -860 175 -367 -241 -604 -2040
2984 -2040 -2265 -1248 -1226 -2175 -1869 -1768 -856 620 409 -256 541 2025 1452 1632 2157 1190 786 -1065 -3956
2965 -3956 -4133 -2362 -949 -2585 -2806 -1689 -681 485 1086 -1232 -343 1193 920 602 989 1172 1335
2948 1335 937 263 971 -510 -1535 -2795 -2780 -295 863 2166 1149 1358 2143 2340 3337 2721 1926 626
2930 626 -335 -1068 -368 344 969 -776 159 1483 1062 -365 -1872 -1762 -2814 -2570 -2710 -2786 -1052 1107
$$ [...]
##END NTUPLES=NMR SPECTRUM
##END=
