##TITLE=Analysis number 324494
Compound Code sew 06567
Project Code adrs
Chemist Name scafell
##JCAMPDX= 6.0         $$ Bruker NMR JCAMP-DX V2.0
##DATA TYPE= NMR SPECTRUM
##DATA CLASS= NTUPLES
##ORIGIN= Bruker BioSpin GmbH
##OWNER= nmr
$$ XWIN-NMR		Version 3.5
$$ Thu Nov 23 12:34:53 2006 GMT Standard Time (UT+0h)  MAYBRIDGE\nmr@NMR_250MHZ
##.OBSERVE FREQUENCY= 250.131544655141
##.OBSERVE NUCLEUS= ^1H
##.ACQUISITION MODE= SIMULTANEOUS (DQD)
##.ACQUISITION SCHEME= undefined
##.AVERAGES= 16
##.DIGITISER RES= 18
##SPECTROMETER/DATA SYSTEM= dpx250
##.PULSE SEQUENCE= zg30
##.SOLVENT NAME= CDCl3
##.SHIFT REFERENCE= (INTERNAL, CDCl3, 0, 16.522)
##AUDIT TRAIL= $$ (NUMBER, WHEN, WHO, WHERE, WHAT)
$$ ##TITLE= Audit trail, XWIN-NMR		Version 3.5
$$ ##JCAMPDX= 5.01
$$ ##ORIGIN= Bruker BioSpin GmbH
$$ ##OWNER= nmr
$$ C:\u/data/dgb/nmr/ADRS/890/pdata/1/auditp.txt
$$ ##AUDIT TRAIL=  $$ (NUMBER, WHEN, WHO, WHERE, WHAT)
(   1,<2006-11-23 12:34:10.40 +000>,<MAYBRIDGE\nmr>,<NMR_250MHZ>,
      <created by zg, POWCHK disabled, PULCHK disabled
       configuration hash MD5:
       49 4B E0 1D 92 C2 6B 37 9F E6 65 BC 52 41 86 1D
       data hash MD5: 64K
       D0 33 45 2F 21 BB A6 D6 BD 63 8B 4F 50 B2 F4 D6>)
(   2,<2006-11-23 12:34:26.04 +000>,<MAYBRIDGE\nmr>,<NMR_250MHZ>,
      <Start of raw data processing
       ef LB = 0.3 FT_mod = 6 PKNL = 1 SI = 32K 
       data hash MD5: 32K
       6A A2 63 BF 1A C9 5F 5B 80 B1 F4 43 8C E8 EF 85>)
(   3,<2006-11-23 12:34:27.89 +000>,<MAYBRIDGE\nmr>,<NMR_250MHZ>,
      <apk 
       data hash MD5: 32K
       2F 99 85 83 18 7C 93 FA 4E 3F AC FE 29 6F BC CE>)
(   4,<2006-11-23 12:34:28.99 +000>,<MAYBRIDGE\nmr>,<NMR_250MHZ>,
      <abs ABSG = 5 
       data hash MD5: 32K
       07 AE 04 2C AE 10 3D 7F 20 A4 50 1E 0C E9 94 A9>)
$$ ##END=
$$ 
$$ hash MD5
$$ 70 5C 21 DC D8 DF 49 91 DD 03 E6 35 DE 4A EA 82
##$RELAX= 
##$RELAX= 
##$RELAX= 
##$RELAX= 
##$RELAX= 
##$RELAX= 
##$RELAX= 
$$ Bruker specific parameters
$$ --------------------------
##$DU= <C:\u>
##$EXPNO= 890
##$NAME= <ADRS>
##$PROCNO= 1
##$TYPE= <nmr>
##$USER= <dgb>
##$AMP= (0..31)
100 100 100 100 100 100 100 100 100 100 100 100 100 100 100 100 100 100 
100 100 100 100 100 100 100 100 100 100 100 100 100 100 
##$AQSEQ= 0
##$AQ_mod= 3
##$AUNM= <au_zg>
##$AUTOPOS= <58 >
##$BF1= 250.13
##$BF2= 250.13
##$BF3= 250.13
##$BF4= 250.13
##$BF5= 500.13
##$BF6= 500.13
##$BF7= 500.13
##$BF8= 500.13
##$BYTORDA= 1
##$CFDGTYP= 0
##$CFRGTYP= 5
##$CHEMSTR= <none>
##$CNST= (0..31)
1 1 145 1 1 1 1 1 1 1 1 1 1 1 1 1 1 1 1 1 1 1 1 1 1 1 1 1 1 1 1 1 
##$CPDPRG= <>
##$CPDPRG1= <>
##$CPDPRG2= <>
##$CPDPRG3= <>
##$CPDPRG4= <mlev>
##$CPDPRG5= <mlev>
##$CPDPRG6= <mlev>
##$CPDPRG7= <mlev>
##$CPDPRG8= <mlev>
##$CPDPRGB= <>
##$CPDPRGT= <>
##$D= (0..31)
0 1 0 0 0 0 0 0 0 0.06 0 0 0 0 0 0 0.0002 0 0 0 0 0 0 0 0 0 0 0 0 0 0 
0 
##$DATE= 1164285249
##$DBL= (0..7)
120 120 120 120 120 120 120 120 
##$DBP= (0..7)
150 150 150 150 150 150 150 150 
##$DBP07= 0
##$DBPNAM0= <>
##$DBPNAM1= <>
##$DBPNAM2= <>
$$ [...]
##$SUBNAM7= <"">
##$SUBNAM8= <"">
##$SUBNAM9= <"">
##$SW= 20.6930455092707
##$SWIBOX= (0..15)
0 0 3 0 0 0 0 0 0 0 0 0 0 0 0 0 
##$SW_h= 5175.983436853
##$TD= 65536
##$TD0= 1
##$TE= 683.16
##$TE2= 300
##$TE3= 300
##$TEG= 300
##$TL= (0..7)
0 120 120 120 120 120 120 120 
##$TP= (0..7)
150 150 150 150 150 150 150 150 
##$TP07= 0
##$TPNAME0= <>
##$TPNAME1= <>
##$TPNAME2= <>
##$TPNAME3= <>
##$TPNAME4= <>
##$TPNAME5= <>
##$TPNAME6= <>
##$TPNAME7= <>
##$TPOAL= (0..7)
0.5 0.5 0.5 0.5 0.5 0.5 0.5 0.5 
##$TPOFFS= (0..7)
0 0 0 0 0 0 0 0 
##$TUNHIN= 0
##$TUNHOUT= 0
##$TUNXOUT= 0
##$USERA1= <user>
##$USERA2= <user>
##$USERA3= <user>
##$USERA4= <user>
##$USERA5= <user>
##$V9= 5
##$VALIST= <valist>
##$VCLIST= <CCCCCCCCCCCCCCC>
##$VD= 0
##$VDLIST= <DDDDDDDDDDDDDDD>
##$VPLIST= <PPPPPPPPPPPPPPP>
##$VTLIST= <TTTTTTTTTTTTTTT>
##$WBST= 1024
##$WBSW= 4
##$XGAIN= (0..3)
0 0 0 0 
##$XL= 0
##$YL= 0
##$YMAX_a= 632190
##$YMIN_a= -539205
##$ZGOPTNS= <>
##$ZL1= 120
##$ZL2= 120
##$ZL3= 120
##$ZL4= 120
##$ABSF1= 16.522
##$ABSF2= -4.171173
##$ABSG= 5
##$ABSL= 3
##$ALPHA= 0
##$AQORDER= 0
##$ASSFAC= 0
##$ASSFACI= 0
##$ASSFACX= 0
##$ASSWID= 0
##$AUNMP= <proc_1d>
##$AZFE= 0.1
##$AZFW= 0.1
##$BCFW= 0
##$BC_mod= 0
##$BYTORDP= 0
##$COROFFS= 0
##$CY= 12.5
##$DATMOD= 1
##$DC= 0
##$DFILT= <>
##$DTYPP= 0
##$F1P= 14.0000005364418
##$F2P= -0.99999901652339
##$FCOR= 0.5
##$FTSIZE= 32768
##$FT_mod= 6
##$GAMMA= 0
##$GB= 0
##$INTBC= 1
##$INTSCL= 1
##$ISEN= 128
##$LB= 0.3
##$LEV0= 0
##$LPBIN= 0
##$MAXI= 10000
##$MC2= 0
##$MEAN= 0
##$ME_mod= 0
##$MI= 0
##$NCOEF= 0
##$NC_proc= -3
##$NLEV= 6
##$NOISF1= 0
##$NOISF2= 0
##$NSP= 0
##$NTH_PI= 0
##$NZP= 0
##$OFFSET= 16.522
##$PC= 1
##$PHC0= -45.30713
##$PHC1= 4.028903
##$PH_mod= 1
##$PKNL= yes
##$PPARMOD= 0
##$PSCAL= 4
##$PSIGN= 0
##$REVERSE= no
##$SF= 250.13
##$SI= 32768
##$SIGF1= 0
##$SIGF2= 0
##$SINO= 400
##$SIOLD= 32768
##$SREGLST= <1H.CDCl3>
##$SSB= 0
##$STSI= 32768
##$STSR= 0
##$SW_p= 5175.98343685301
##$SYMM= 0
##$S_DEV= 0
##$TDeff= 65536
##$TDoff= 0
##$TI= <Analysis number 999999
Compound Code 99
Book Reference 9
Project Code 9>
##$TILT= no
##$TM1= 0
##$TM2= 0
##$TOPLEV= 0
##$USERP1= <user>
##$USERP2= <user>
##$USERP3= <user>
##$USERP4= <user>
##$USERP5= <user>
##$WDW= 1
##$XDIM= 32768
##$YMAX_p= 367477314
##$YMIN_p= -255680
$$ End of Bruker specific parameters
$$ ---------------------------------
##NTUPLES= NMR SPECTRUM
##VAR_NAME=  FREQUENCY,     SPECTRUM/REAL,   SPECTRUM/IMAG
##SYMBOL=    X,             R,               I
##VAR_TYPE=  INDEPENDENT,   DEPENDENT,       DEPENDENT
##VAR_FORM=  AFFN,          ASDF,            ASDF
##VAR_DIM=   32768,         32768,           32768
##UNITS=     HZ,            ARBITRARY UNITS, ARBITRARY UNITS
##FACTOR=    0.157963299565203, 1,           1
##FIRST=     4132.6476996994, 0,             0
##LAST=      -1043.33573715361, 0,           0
##MIN=       -1043.33573715361, -255680,     0
##MAX=       4132.6476996994, 367477314,     0
$$ Real data points
##PAGE= N=1
##DATA TABLE= (X++(R..R)), XYDATA
$$ [...]
28640e23J5377N12k3083k6079J1190J2596K1172N23j9521K29N992l4317K668L5142
28626A878K6127N420J8455k1763p717J9356k3292k1369J4470l51q541J5676j9773
28613a424k6817l811q292J5772Q564J5333J2711L372J2840P26k0343o287n145
28600b801n522L7942J5361k4779j3566j3294j0467L7377J4830P925K3105j2957
28588E3154l3461K951r965J0218r08p365r910j969L479j056k152p987l6296L4953
28574f314K3010l98J0147n780m1098r406j4417J3145j0865R037K6549N388M887
28561C885k6940q011K9921o407J965O163L9916K7618J4497j1016J6845j258r931
28548G7247j1943n535j3394K515j070K8241j4791k5582J4642p844k0617k1271
$$ plain form
28640 -523 14854 15366 -7717 -33796 -22606 -10010 11162 11685 -7836 -7607 -1615 -35932 -33264 1878
28626 1878 28005 33425 51880 30117 22400 41756 18464 -2905 11565 11214 2673 18349 -1424
28613 -1424 -28241 -32052 -40344 -24572 -16008 -675 12036 15408 28248 28974 8631 2344 -2801
28600 -2801 -8323 29619 44980 20201 6635 -6659 -17126 20251 35081 43006 66111 53154
28588 53154 19693 22644 12679 22897 21989 14624 4714 2745 6224 5168 3016 -4971 -41267 -6314
28574 -6314 16696 16298 26445 20665 -20433 -29839 -44256 -31111 -41976 -32939 -6390 -1002 3885
28561 3885 -23055 -31066 -1145 -7552 -5587 576 40492 68110 82607 71591 88436 87178 77247
28548 77247 65304 59769 46375 48890 47820 76061 61270 35688 50330 42486 21869 598
28536E98L594J4442L372J5040j2815k8154j2547j024K1558J2251j0207l0218j4667
28523c8777R248L757J0837J576j3844K604J2311J3404O218o150n3800Q822L6548
28510g246J2077Q913M586k592j3346m339k0693Q321M0792r291l6332Q14L3325
28497A4989J1771J383M565o319j0024J108j0635r123j560M295j6241q535j875
28484b6201j5698o086K173j4926K2693R745L016J4318J9685m315l731J4868L9137
28471E4678R355N654j8562k6912k6926k0550J4255J2519J2867Q983k1645j5652
28459a1936j4131Q764J5043P47j0338n448k8341N584J9205k10O66L9229j182k1916
28445d264j1370R955Q117j2890J1907J6815k663j0390r243l399L3468j0614k7669
$$ plain form
28536 598 4192 18634 22006 37046 24231 -3923 -16470 -17494 4064 16315 6108 -24110 -38777
28523 -38777 -29529 -25772 -14935 -13359 -27203 -24599 -12288 1116 7334 1184 -52616 -43794 -7246
28510 -7246 4831 13744 18330 15738 2392 -1947 -22640 -14319 26473 17182 -19150 -18336 14989
28497 14989 26760 28143 32708 26389 16365 17473 6838 -2285 -3845 450 -15791 -24326 -26201
28484 -26201 -41899 -47985 -45812 -60738 -38045 -28300 -25284 -10966 8719 4404 673 15541 54678
28471 54678 64033 69687 51125 24213 -2713 -23263 -9008 3511 16378 25361 3716 -11936
28459 -11936 -26067 -17303 -2260 -1513 -11851 -17299 -45640 -40056 -20851 -21061 -20395 18834 17652 -4264
28445 -4264 -15634 -5679 2438 -10452 1455 18270 15607 5217 -4026 -7425 26043 15429 -12240
28432a2240J415j1068k433K6983O640l661M716m416k3063j3783J348K385J3719
28419a3458j3529J123L4635K1846O124j8139l1298j5584j218J0394N345P332o420
28406a2847j4809L260N299q907k7487o84J2066j125p52J1708m935j630J4266J5748
28392a0829J7286p886j2211o618p547J2248J0033J7254M62P985M906l125j8090
28379C868q402J3229K6972l205k9286l3494k180K0928o665P06K0541Q994L034
28366A5040j6868J7894L1543J3595k6079k2614L805N330O144k453k0320j3808
28354h791J2823J2824o139M825K458K38k2274P230N333p232J661J5246Q660j107
28340B5755k9080r289K0173l543j777q283J4131R541k5857n176J7621L196K005
$$ plain form
28432 -12240 -10825 -21893 -24326 2657 9297 5636 10352 5936 -17127 -30910 -29562 -27177 -13458
28419 -13458 -26987 -25864 8771 30617 36741 18602 -12696 -28280 -29498 -19104 -13759 -6427 -12847
28406 -12847 -27656 -24396 -19097 -28004 -55491 -56175 -44109 -45234 -45986 -34278 -39213 -40843 -26577 -10829
28392 -10829 6457 -1429 -13640 -20258 -27805 -15557 -5524 11730 12192 20177 25083 21958 3868
28379 3868 -4534 8695 35667 32462 3176 -30318 -32498 -11570 -18235 -17529 3012 12006 15040
28366 15040 -1828 16066 47609 61204 35125 12511 16316 21646 27790 25337 5017 -8791
28354 -8791 4032 16856 10717 15542 18000 18238 -4036 3194 8527 1295 2956 18202 26862 25755
28340 25755 -3325 -12614 7559 4016 2239 -6044 8087 17628 -8229 -13405 4216 7412 9417
28327I417M958k4103j8689r902L5803J6611j5094O646L1044J0626O334k1728o4606
28314c2683N046j3299j4745K5319L3411J2040J3353k176O188j1276l0003l30k6742
28301c5897n135K5793L7962k2351l1111r667j2413J2156K8897l225O783J216k994
28288i986K1028p715J0006k2876k6179Q940J6912J9747j5060j4609L057n399J8523
28275c611P874j2304R894J3407N766o734k6535K261K1267K1905O753o172r946
28262B3825r486k495L7413r80l5613k5193j0601p265J0716K8082j925j6424k549
28249a2495J7705l683k4246j463l469k945j4024o74J1055L5313K1148j0247j1587
28236C88j8446k4183r619J050L1448K0903o316q478j2759K4629J1297o850r561
$$ plain form
28327 9417 14375 -9728 -28417 -38319 -2516 14095 -999 5647 36691 47317 53651 31923 -32683
28314 -32683 -27637 -40936 -55681 -30362 3049 15089 28442 26266 32454 21178 -8825 -9155 -35897
28301 -35897 -41032 -15239 22723 372 -30739 -40406 -52819 -40663 -11766 -14991 -8208 -6992 -9986
28288 -9986 11042 3327 13333 -9543 -35722 -26782 -9870 9877 -5183 -19792 -16735 -22134 -3611
28275 -3611 4263 -8041 1853 15260 21026 14292 -12243 -9982 11285 33190 39943 33771 23825
28262 23825 14339 11844 49257 48277 12664 -12529 -23130 -30395 -19679 8403 6478 -9946 -12495
28249 -12495 5210 1527 -22719 -24182 -27651 -30596 -44620 -45294 -34239 1074 22222 11975 388
28236 388 -18058 -42241 -51860 -50810 -19362 1541 -4775 -13253 -26012 -1383 9914 3064 -6497
28223f497K7029K0284R838P23k3656l3901J5446J532M243K0611j3602j2232K3051
28210C2869J9109j8963j6014j8102k1428q050j901N0602L0761j0103j1331k5236
28198B213l543k921k9657j1829J1391J3814n821R602L4050m716l2608k1843J5032
28185b6836J2742k9761O75K4502J9085K0046P268k490m574j0767k2454L084J0969
28172A489K754K0192K291J2174P173j3559l4651j5486k565L0936J4041k6343r444
28159a0998o709L325o625j0931O624n178J3975N267j234M593K1455k846L659p330
28145G047k2678O489M458J854M568J0728j0845j101J3481k904J536J4865L878
28132C1376j3493l1017J69J116K0041K1701K0542j0203j9054l689j0669k5809
$$ plain form
28223 -6497 20532 40816 50654 51377 27721 -6180 9266 10798 15041 35652 22050 9818 32869
28210 32869 51978 33015 17001 -1101 -22529 -30579 -32480 18122 48883 38780 27449 2213
28198 2213 -1330 -4251 -33908 -45737 -34346 -20532 -26353 -16751 17299 12583 -20025 -41868 -26836
28185 -26836 -14094 -43855 -43180 -18678 407 20453 27721 25231 20657 9890 -12564 -9480 1489
28172 1489 4243 24435 26726 38900 46073 32514 -2137 -17623 -20188 10748 24789 -1554 -10998
28159 -10998 -17707 -14382 -21007 -31938 -25314 -30492 -16517 -11250 -12484 -7891 13564 10718 14377 7047
28145 7047 -15631 -9142 -4684 -2830 1738 12466 1621 520 14001 11097 12633 27498 31376
28132 31376 17883 -13134 -12965 -11849 8192 29893 50435 40232 21178 17489 6820 -18989
28120a8989l029K5077P256N361m0269j6966L2485N1933J1087n609r047j2282k0710
28107F298o497N24o017k2720J3848J6331L22M929k500L775J1707J4640n117j3249
28093A6274P170K0468j5411k3293j1426o296j7868J1876l652k0836p938O505L0776
28080a3651L1978Q275k4044j0223j5370Q721l962Q317J2882J4486r746j7246R877
28067B94j4573k5134r99K4089K7816J082j9228O395J7237J5101k3894k4884r405
28054b6103J7225K4752J751l7887q640K2811J3427N807J0162q551k5267r584J122
28041a8975P128l633k7762q405j0710J2728M8633L6126n768r880L893N266j7549
28028A1092j077l201j813k6837Q034j2606J4768N14J780P886j2047j6062n08K2813
$$ plain form
28120 -18989 -22018 3059 10315 15676 -24593 -41559 -9074 42859 53946 48337 39290 27008 6298
28107 6298 -199 325 -5692 -28412 -14564 1767 2089 7018 4518 8293 20000 34640 29523 16274
28093 16274 23444 43912 28501 5208 -6218 -12514 -30382 -18506 -22158 -42994 -50932 -44427 -13651
28080 -13651 18327 26602 2558 -7665 -23035 -14314 -18276 -9959 2923 17409 7663 -9583 294
28067 294 -14279 -39413 -40412 -16323 11493 12575 -6653 -258 16979 32080 8186 -16698 -26103
28054 -26103 -8878 15874 17625 -20262 -28902 -6091 7336 13143 23305 14754 -10513 -20097 -18975
28041 -18975 -11847 -15480 -43242 -51647 -62357 -49629 -996 35130 29362 19482 23375 28641 11092
28028 11092 10015 6814 5001 -21836 -13802 -26408 -11640 -11126 -9346 -1460 -13507 -29569 -30077 -7264
28014g264L6162J8769k3593k0290k9449j1005J8584R221r393P876o094Q569K566
28001e341N891p452k94K27L7848J9062k883k4970l1166j3931p956L6622K5157
27988C0814m804l995j7829N32k1698J80K2648L126k6456k3767L4545p64k3070
27975c0538L1732L1526O832j2936R583K1035n772p124J7305N461l9459j2231k6630
27962a1216Q165J0644J3586j394p006n518n701P057j2080K515J852J3052J2974
27949B6930J1982J0556j0175j0999J2796q978j8654M280J5534j0896J7678J4581
27937E4635j3419j9689o65P728O04k9125j7570M215M153J341j1509j9881J249
27924c7933J9241J834K8187J3634q898j3334m107k8018k2066L3462J1388k5701
$$ plain form
28014 -7264 28898 47667 24074 3784 -25665 -36670 -18086 -8865 -18258 -10382 -16476 -7907 -5341
28001 -5341 550 -6902 -7196 -6969 30879 49941 47058 22088 -9078 -23009 -30965 5657 30814
27988 30814 26010 22015 4186 4718 -16980 -16800 5848 8974 -17482 -41249 -6704 -7468 -30538
27975 -30538 1194 32720 39552 26616 36199 57234 51462 44338 61643 67104 27645 15414 -11216
27962 -11216 -3051 7593 21179 19785 12779 7261 1560 8617 -3463 -948 904 13956 26930
27949 26930 38912 49468 39293 28294 41090 32112 13458 17738 33272 22376 40054 54635
27937 54635 41216 21527 20862 28590 29194 69 -17501 -13286 -9133 -7792 -19301 -39182 -37933
27924 -37933 -18692 -16858 11329 24963 16065 2731 -1376 -29394 -51460 -17998 -6610 -32311
27912c2311j1161k466J5273J6621O470R130R507R91k365q323J4473P779r444k1894
27898g720J3005q86O960J9670K1180j1122m93j01J896n741l2089k2238r510J6170
27884a1019J3203l0523j5152K7496L8621J9011N302j54r562k2477m0077o574K2996
27871h909k63j882J5109M2705m88l1812j3386l055n910R78r141j3303J3059K4754
27857H456M715J2613m879j8883q852M571O55j7173n394Q70P182J6633J8662O52
27843A9828J418j8384k7042L885q767J6144J1044L462n232O269J0269l169L3697
27830D3422M043k9733K996o441j7266r918M9324K8091l1225k9563r307m596J7298
27817G125L3480l3042k8475J7255m754k3573k8497q141L9719K3013K6917O671
$$ plain form
27912 -32311 -43472 -45938 -30665 -14044 -7574 1556 11063 12054 9689 1366 15839 23618 14174 -7720
27898 -7720 5285 4399 11359 31029 52209 41087 40594 40493 42389 36648 4559 -17679 -27189 -11019
27884 -11019 2184 -28339 -43491 -15995 22626 41637 46939 46785 37223 14746 -25331 -31905 -8909
27871 -8909 -9172 -11054 4055 46760 46272 14460 1074 -1981 -7891 -6913 -16054 -29357 -16298 8456
27857 8456 13171 25784 20905 2022 -6830 -2259 -1604 -18777 -24171 -23301 -16119 514 19176 19828
27843 19828 21246 2862 -24180 -20295 -29062 -12918 -1874 1588 -3644 2625 12894 9725 43422
27830 43422 47465 17732 20728 14287 -2979 -12897 36427 64518 33293 3730 -5577 -10173 7125
27817 7125 40605 7563 -20912 -3657 -8411 -31984 -60481 -68622 -28903 -5890 21027 27698
27805B7698k4909j9045K3911J6961o820l40p794R17M0052J246k2942L269j216
27792C0988q980o897J1830j365k0099o164K42K3216K5259j3728n924K3701J4515
27779F6594J4087j2018k8994L872L679j8407k5304K11P254r68o098K6883K725
27766C3516k280j4503L063j6479j7014n253L274J1527L2093P974k4662j3325j4782
27753a6851M807k437q969J8170J4271J72J9772O907k1306r123k3470J7496J4416
27740A3855k9494j5685n064K5616Q769j4104K4356n702k0611l715j42J8917K3909
27727B0905j4567J2279J8176l068J3505n455n378k2000o639O537j0723r718o736
27714a2882k8085o191M0294L1754M354l394o939m2018n02J5563K0545K998q271
$$ plain form
27805 27698 2789 -16256 7655 24616 17796 17456 9662 10579 50631 51877 28935 32204 30988
27792 30988 22008 15111 26941 25576 5477 -687 -445 22771 48030 34302 28378 52079 66594
27779 66594 80681 68663 39669 43541 47220 28813 3509 3720 10974 10006 3908 30791 33516
27766 33516 31236 16733 19796 3317 -13697 -18950 -15676 -4149 27944 35918 11256 -2069 -16851
27753 -16851 -12044 -14481 -23450 -5280 8991 9163 28935 35842 14536 5413 -18057 -561 13855
27740 13855 -15639 -31324 -36388 -10772 -2003 -16107 8249 2547 -18064 -21779 -21921 -3004 20905
27727 20905 6338 18617 36793 33725 47230 41775 36397 14397 7758 14295 3572 -6146 -12882
27714 -12882 -40967 -47158 -6864 24890 29244 25850 18911 -23107 -23609 -8046 12499 15497 7226
27701G226m3763l169M1513K2628j4569L631j5385o520m559N866j2817k6098M468
27688d1548o300j2702J2618J7300K3068J2946j5174j0280L9067L6514j537j7082
27676C6890j5517k4244j6797N527J3587J2765J2751j1052k2574K428R625K0196
27664B3585k4505q160K6975J5451r677K2845m20k4142K672K342K7903j6412o957
27651C1500N139o152N299M830j1103j0651k721l0691N20N025k2707j1969J4548
27638b9133J4474J5306k1604k348K360K154R983L5043K2704j4866k2517j3745
27626b189j5160k0087r293J4678K2752M057j1520j7253p451Q097N043O995K4980
27613C649J5979K1255K6041k6847j6666N012k2162J496j3266l757P550r323J8227
$$ plain form
27701 7226 -36537 -39706 1807 24435 9866 13497 -1888 -8408 -12967 -7101 -19918 -46016 -41548
27688 -41548 -47848 -60550 -47932 -30632 -7564 5382 -9792 -20072 18995 55509 53972 36890
27676 36890 21373 -2871 -19668 -14141 -554 12211 24962 13910 -8664 -6236 3389 23585
27664 23585 -920 -9080 17895 33346 23669 46514 46094 21952 24624 26966 54869 38457 31500
27651 31500 36639 30487 35786 40616 29513 18862 16141 -14550 -14030 -9005 -31712 -43681 -29133
27638 -29133 -14659 647 -20957 -23305 -20945 -18791 -8808 26235 48939 34073 11556 -2189
27626 -2189 -17349 -37436 -46729 -32051 -9299 -5242 -16762 -34015 -41466 -33369 -28326 -21331 3649
27613 3649 19628 40883 66924 40077 23411 28423 6261 7757 -5509 -9266 -1716 -11039 7188
27600G188J2904l316J7355j9332P53o429j4172Q348j321m112j3294K279k4470
27587c7619L13K2131P692k1972K2290Q377K4738K1717L454l3493k2196N377j3754
27574a2945J4192J8967j2418n809Q53j7246J325M54J4744O180L3251R126l421
27561D7253l2015l3076K9212K009j934m9975j5232J394r214K6750L6020J7885
27549A9077K2946o379n907k0631k1494j3698L3629J8886k4544j1J9668J4175j6999
27536A8718k3952R678q500N552k6377j8181J2410q306o570K5379K9005J1052K0794
27523D0702J5285q337p109l197k557k2345j7152P158K042j2196o2j1789j4662
27510c4219J4423J2900P65P180J2917Q074l3164p421K5094K9092L3917j674k5128
$$ plain form
27600 7188 20092 16776 34131 14799 15552 9123 -5049 3299 1978 -2134 -15428 -13149 -37619
27587 -37619 -37306 -15175 -7483 -29455 -7165 1212 25950 47667 51121 17628 -4568 809 -12945
27574 -12945 1247 20214 7796 1987 2840 -14406 -13081 -12627 2117 8297 41548 50674 47253
27561 47253 15238 -17838 11374 13383 11449 -38526 -53758 -52364 -61578 -34828 1192 19077
27549 19077 42023 35644 29737 9106 -12388 -26086 7543 26429 1885 1874 21542 35717 18718
27536 18718 -5234 4444 -4056 1496 -24881 -43062 -30652 -38958 -45528 -20149 8856 19908 40702
27523 40702 55987 47650 40541 37344 34787 12442 -4710 2448 4490 -7706 -7768 -19557 -34219
27510 -34219 -19796 -6896 -6131 1049 13966 22040 -11124 -18545 6549 35641 69558 67884 42756
27497D2756q087q6l2107l128j2398j5588O72J1420J3198J1245j1915k2829m701
27484c1548K4262J3811J1474j2406o219k6459J610P870K5884J499l9868J2285
27472a7805K3656J1848j2870J582r733J3225k214r893J374n974n860J694l638
27459a4608j3166J6345K862J3725J0787K0804j615j3585J1835m901o267j033N471
27446B6654k0938l1495K623N991Q243M3587l170l2748k7044j53l160P378J9341
27433d891R448R428K7576J7032n331j6797j9311p831o301p489K428J3648j5696
27420d087o680K0707j2732j278J3997K1434j1960j3897q34j4170m368P198J7530
27407A0860j7237j4500J1746K4031p391j0522k238p065O58R759K3729J600j8142
$$ plain form
27497 42756 34669 34583 2476 -652 -13050 -28638 -27966 -16546 -3348 7897 -4018 -26847 -31548
27484 -31548 -7286 6525 17999 5593 -626 -27085 -25475 -17605 8279 9778 -30090 -17805
27472 -17805 5851 17699 4829 6411 -3322 9903 7689 -2204 -830 -6804 -12664 -10970 -14608
27459 -14608 -27774 -11429 -8567 5158 15945 36749 35134 21549 33384 28483 22216 21183 26654
27446 26654 5716 -25779 -23156 -17165 -8922 34665 31495 -1253 -28297 -28450 -31610 -24232 -4891
27433 -4891 4557 13985 41561 58593 53262 36465 17154 9323 3022 -4467 -2039 11609 -4087
27420 -4087 -10767 9940 -2792 -4070 9927 31361 19401 5504 4670 -9500 -13868 -6670 10860
27407 10860 -6377 -20877 -9131 14900 7509 -3013 -5251 -12316 -11658 -1899 21830 23430 5288
27394E288j6416K305r885P672l1694j8505J7118K4623J0827n626j383K8572K6761
27381C9657q900r827l2099k6983L056N7353R559j6143k4248l130j311J9615R062
27368A5661p047o896L105J4578K9902j5405n85R891k1304K452k723J4895j0114
27355B6410p145N818L021J091N393j4101j798j5023m97j379j8198j3737N035m898
27341c0008o158l904K322J0314K3025J0946J3174j59Q836J8774j4069j7344k69
27328A5480P791L6915o270l9211l9878k0888p074o198J8806J2347O509M192j2973
27315c0452K5821J1227j2112N292J8021J3448l5884j7843O195O674n178L9691
27303B4900j329j718K6858m885j0942Q406k9685n762K204o819J3109m995P034
$$ plain form
27394 5288 -11128 -8823 -18708 -11036 -42730 -61235 -44117 -19494 -8667 -14293 -15676 12896 39657
27381 39657 30757 20930 -11169 -38152 -35096 22257 31816 15673 -8575 -11705 -13016 6599 15661
27368 15661 8614 1718 4823 19401 49303 33898 33313 43204 21900 24352 21629 36524 26410
27355 26410 19265 25083 28104 29195 34588 20487 18689 3666 3169 1790 -16408 -30145 -25110 -30008
27341 -30008 -36166 -40070 -37748 -27434 -4409 6537 19711 19552 28388 47162 33093 15749 15480
27328 15480 23271 60186 53916 14705 -25173 -46061 -53135 -59333 -40527 -28180 -21671 -17479 -30452
27315 -30452 -4631 6596 -5516 -224 17797 31245 -4639 -22482 -16287 -9613 -14791 24900
27303 24900 23571 21853 48711 43826 32884 41290 11605 5843 8047 1228 14337 9342 16376
27290A6376J4542r549l84n338Q483j1698l412j7121K858r031j1094J0309J6967
27277A908J4554n958j0782j2958k7771r383J2932l75O274J272J7243J4810R423
27264A1189K5509M075N102K723j803j7420k8479q237L920p474K3520J4009j1609
27251A5025p953O634q604L2127K8577j6286l0412j2673P700k8213j6542K8636
27239a984O975j9755K6648R428j8045O810l839q585K4574k118m202p420Q599j1463
27225E623n174L5829J0251k463j6600j8015k0368j1643J2216J3936K5203J1645
27213D0440j1891j0976m703j8260R160m481J1148R280l212p797j6572J4865o765
27200B36n92J968k168j5306R422L3971K138L211n42q373l674j5983m4386m167
$$ plain form
27290 16376 30918 21369 20985 15647 24130 12432 9020 -8101 -5243 -14274 -25368 -15059 1908
27277 1908 16462 10504 -278 -13236 -41007 -50390 -37458 -37833 -31559 -30287 -13044 1766 11189
27264 11189 36698 40773 45875 48598 46795 29375 896 -7341 -3421 -10895 12625 26634 15025
27251 15025 7072 13706 5102 37229 65806 49520 19108 6435 14135 -14078 -30620 -1984
27239 -1984 4991 -14764 11884 21312 3267 10077 6238 -2347 22227 20109 15907 8487 17086 5623
27225 5623 449 36278 46529 44066 27466 9451 -10917 -22560 -10344 3592 28795 40440
27213 40440 28549 17573 12870 -5390 3770 -711 10437 19717 16505 8708 -7864 7001 236
27200 236 -356 1612 -556 -15862 -6440 27531 29669 32880 32338 23965 20291 4308 -40078 -44245
27186d4245J7158K2726j6442j9840j91R137R521J8459L1372k1215p601J3250J1231
27173B3320J1501k2003k1013P969M749R788k245K844K4012N81l2814n084J1613
27160A3218M770k6153M22k41k977k3920m146L0280J1451L4815l437n730m2395
27147a4043j4575J2461m907K836J6733J5178K875p78j2846o83j238k614k2775
27134b4376J4207J3275K4609p049j6152J0573J0421l4540R075N451k359M952j3656
27121e569R085J7511r337p732J3917k01J6362J0486q897j4419p045l3131R448
27108i522R881l292R203j884l7192j4406L60L7763M7518L942k7814k2281j1151
27095a8875O594j4739K0863K650R626j1260J0930j8805j3975k0871J3101N258
$$ plain form
27186 -44245 -27087 -4361 -20803 -40643 -40834 -31697 -22176 -3717 27655 6440 -1161 12089 23320
27173 23320 34821 12818 -8195 -226 4523 14311 12066 14910 38922 39503 6689 1605 13218
27160 13218 17988 -8165 -7743 -7984 -10961 -34881 -39027 -8747 2704 37519 34082 28352 -14043
27147 -14043 -28618 -16157 -21064 -18228 -1495 13683 16558 15780 2934 2251 1013 -1601 -24376
27134 -24376 -10169 3106 27715 20666 4514 15087 25508 -9032 43 5494 3135 8087 -5569
27121 -5569 3516 21027 11690 3958 17875 17674 34036 44522 35625 21206 14161 -18970 -9522
27108 -9522 359 -2933 6270 4386 -32806 -47212 -46852 -9089 38429 42371 14557 -7724 -18875
27095 -18875 -12281 -27020 -6157 -3507 6119 -5141 5789 -13016 -26991 -47862 -34761 -29503
27083b9503J3749R780j1613m487k7108J4686M3678J4006j7214j1080K1866K904
27071A9664k5659q938J7001j2876N908J7166K58O403j7013P550p063N704J9228
27058B7333j227Q446O248k8443l1396j4262n436N162l096r101K8117J2774m441
27045i322o807J2744J3083m369p430k0280J2107J3513k0024q435k6586Q555K4855
27032a8396r682K934j0357L6309R694R161j8146j0866j986j049j2788P070J652
27019a6450N59q145L446K2988l1106l4309J7124K0977K6855J4050N762j6685n601
27006e35L3804K1304o367k0229j9842P147K1988P047q605k1656j952K4231k7K926
26992C9234j0574N046n890o866j437Q85J3152J5735L4954l2174k6675L690m737
$$ plain form
27083 -29503 -15754 -5974 -17587 -22074 -49182 -34496 9182 23188 5974 -5106 16760 19664
27071 19664 -5995 -14933 2068 -10808 -4900 12266 12524 18927 1914 9464 2401 8105 27333
27058 27333 26106 34552 40800 12357 -19039 -33301 -38737 -33575 -36671 -45772 -17655 -4881 -9322
27045 -9322 -16129 -3385 9698 5329 -2101 -22381 -10274 3239 -16785 -25220 -51806 -43251 -18396
27032 -18396 -28078 -25144 -35501 808 10502 19663 1517 -9349 -11335 -12384 -25172 -18102 -16450
27019 -16450 -15891 -24036 -20590 2398 -28708 -63017 -45893 -24916 1939 15989 21751 5066 -535
27006 -535 33269 54573 48206 27977 8135 15282 37270 44317 35712 14056 12104 36335 36308 39234
26992 39234 28660 33706 27816 20950 19513 20398 33550 49285 84239 52065 25390 29080 24343
26979B4343k9422k2071J9470k378o109L5720J9061j3374q576L272o351J912j5646
26966a49k0704J054q530n243K7150P189j6583K2708o115J6116J3196M266j9593
26953A4762j5225q210q068L7062K1279Q943j0872n577J1273p311j9980j7364P637
26940H349k774J5832J7059q753j4948N260j6563k2090j194J5456K1144l483k0313
26927g018j6644J0361m88n769j1348Q599J8167N9043J4058k760k5873j8482K566
26914B4412l3692J3312M61n013P794J5274J8376L034l711j7252l0478l6947P545
26901c6885K4035J1469k959j892l0974L5555J8169j4070K0750l0489m5001n705
26889e7997K202J6657J0259J8901K951j8254j762J1224R30p239m397R30L6111
$$ plain form
26979 24343 -5079 -27150 -7680 -10058 -16167 19553 38614 25240 16664 19936 13585 15497 -149
26966 -149 -20853 -19799 -28329 -33572 -6422 767 -15816 6892 777 16893 30089 34355 14762
26953 14762 -463 -8673 -16741 20321 41600 50543 39671 34094 45367 38056 18076 712 8349
26940 8349 5575 21407 38466 29713 14765 20025 3462 -18628 -19822 -4366 16778 13295 -7018
26927 -7018 -23662 -13301 -13789 -19558 -30906 -22307 -4140 54903 68961 66201 40328 21846 24412
26914 24412 -9280 4032 4493 -520 7274 22548 40924 43958 40247 22995 -7483 -44430 -36885
26901 -36885 -12850 -1381 -4340 -6232 -37206 -1651 16518 2448 23198 -7291 -52292 -57997
26889 -57997 -55795 -39138 -28879 -9978 -7027 -25281 -27043 -15819 -14889 -22128 -26525 -25595 10516
26876A0516N578q876m63k0541j1321n552p294j1671J3856J3078N712Q144N866
26863b968J904K3346P382k3461N679k9111k6744J6863J3253J8880K0877R299k9298
26850E901q077j8326j716K6389l853l327K5056J8852k4090j590O939k1198j6483
26837a5523J299K1129K5836j86j9064q693k838q603k3532l642P212o696j7756
26824e1057K0528J2819K1875J4286j0191n460j6147j3088k1646K7467L8516j4383
26812C519l0060M959J9030K0645l2558k0090L860J3897P261n768o114k965P177
26799a7207j150j6404J3087J7294o832N010k1312j6553k584k564K3918J0636Q215
26786f446K3396J2321k1540j8049J1622o412r232r233l194J1340J9416J4501J5495
$$ plain form
26876 10516 16094 7218 6755 -13786 -25107 -30659 -37953 -49624 -35768 -22690 -16978 -8834 -2968
26863 -2968 -1064 22282 29664 6203 11882 -17229 -43973 -27110 -13857 5023 25900 35199 5901
26850 5901 -2176 -20502 -22218 4171 318 -3009 22047 40899 16809 15219 22158 960 -15523
26837 -15523 -14224 6905 32741 32555 13491 4798 1960 -6643 -30175 -33817 -26605 -33301 -51057
26824 -51057 -30529 -17710 4165 18451 8260 2800 -13347 -26435 -48081 -20614 17902 3519
26812 3519 -26541 -21582 -2552 18093 -14465 -34555 -30695 -16798 -9537 -15305 -21419 -24384 -17207
26799 -17207 -18357 -34761 -21674 -4380 -11212 -6202 -27514 -44067 -46651 -49215 -25297 -14661 -6446
26786 -6446 16950 29271 7731 -10318 1304 -5108 -14340 -23573 -26767 -15427 3989 18490 33985
26773C3985N511j4785K054o684k6173m326J250j7594k3675j8769n412J6273J6749
26760d1596R807N65m666N581K5256J3768k7392J0001K1984J263m869j4013K5968
26747B1657k293l947j8285j7182j9258j5116J3905K0670Q905k717J168J4938K7306
26734B9751K781k0014j2502Q912j1762L206n659m078K8865J3337k7235k9829J3014
26721a1213m458j7663J570m196M911J1855j4197o408j0412K0683K0086j5463M495
26708b0410Q4M997Q490L581j1336j234R011J9618j3550N790j7201J2777N912K8130
26694C4659K3799M61q876j1543j6057k7276j5079k541N197p270K0229j0369N143
26681i523j8347k5469J4257J3070K1316M601l4283o416N508K366J4429K003N872
$$ plain form
26773 33985 39496 24711 26765 20081 -6092 -10418 -9168 -26762 -50437 -69206 -74618 -58345 -41596
26760 -41596 -31789 -31224 -35890 -30309 -5053 8715 -18677 -8676 13308 14571 9702 -4311 21657
26747 21657 19364 15417 -2868 -20050 -39308 -54424 -40519 -19849 -10944 -13661 -12493 2445 29751
26734 29751 32532 12518 16 8928 -2834 372 -5287 -9365 19500 32837 5602 -24227 -11213
26721 -11213 -15671 -33334 -31764 -35960 -31049 -19194 -33391 -39799 -50211 -29528 -9442 -24905 -20410
26708 -20410 -20326 -15329 -6839 -3258 -14594 -15828 -6817 12801 -749 5041 -12160 617 6529 34659
26694 34659 58458 58919 50043 38500 22443 -4833 -19912 -22453 -17256 -24526 -4297 -14666 -9523
26681 -9523 -27870 -53339 -39082 -26012 -4696 -95 -34378 -40794 -35286 -32920 -18491 -16488 -10616
26668a0616O391Q415l825k9976j3520K8665R798j10M532j7346j1717K2020K1884
26655A4595o573J2652j092K1421j549j5515j2046l6306j2166J1974N53k795R373
26642a7474J0479J3329K1489j1293j8106j7744q423J9313K9250p112l2046j533
26630a9871J5739J1409j180o256r749k795J1099k543P38q837n639K3362k1359
26617a5882k3173K7180L0056M877J8362j0363r876J3046j8481j0350J6896j7802
26605D490J905r315j2935L5518J0149p965Q274j4884Q802m606O958j8219k8398
26592b0226j0163J8955K4545o157k6490k355K003L3510J4397J1161j0144p838
26580B1198p037q190p136J5450m4754k2755j0429J2388K0772J5062J6492K2753
$$ plain form
26668 -10616 -4225 4190 365 -29611 -43131 -14466 -4668 -4778 -246 -17592 -29309 -7289 14595
26655 14595 8022 20674 19582 41003 39454 23939 11893 -24413 -36579 -24605 -24052 -26847 -17474
26642 -17474 -6995 6334 27823 16530 -1576 -19320 -27743 -8430 20820 13708 -18338 -19871
26630 -19871 -4132 7277 6097 -159 -9908 -12703 -1604 -4147 -3409 -12246 -17885 5477 -15882
26617 -15882 -39055 -11875 18181 23058 41420 31057 21181 34227 15746 5396 22292 4490
26605 4490 6395 -2920 -15855 19663 29812 21847 30121 15237 24039 19433 26391 8172 -20226
26592 -20226 -30389 -11434 13111 6954 -19536 -21891 -19888 13622 28019 39180 29036 21198
26580 21198 14161 5971 -1165 14285 -30469 -53224 -63653 -51265 -30493 -15431 1061 23814
26568B3814N48j8416j0071j0311j0072J2159L106J498Q21j1819J9071J2346P645
26555B0319q421J9150K1225q687l4214m308L156j153k0499j7811N18m83J9786
26542a1422L6137L842l7797j5392J7838J2041N75J1464J197p940P037O146j934
26529B1792k7971J0728P562j5557k772J0122j1260k1806o031J7720K6203J53j5510
26516f627J0565R197m614j8461k437P343K150N586J4653J6207J6588l0704k2871
26503c425J3485n081n072R594J967J0154J0600r416j4685J8611j7323P118J5551
26490C2078j0391J1735L2951m487l3011j1983p024k4067L664N152K522K9003J9388
26477D5530k7582l466O653J266m4597r087N325K8259K2313l768k452l133j1357
$$ plain form
26568 23814 24362 5946 -4125 -14436 -24508 -12349 -9243 -7745 -6924 -18743 328 12674 20319
26555 20319 11898 31048 52273 43586 9372 5064 8220 7067 -13432 -31243 -30725 -31208 -11422
26542 -11422 24715 28557 -9240 -24632 -6794 5247 5822 17286 18483 10543 17580 23726 21792
26529 21792 -6179 4549 12111 -3446 -6218 3904 -7356 -29162 -35193 -17473 8730 8883 -6627
26516 -6627 3938 13135 8521 -9940 -12377 -5034 -2884 2702 17355 33562 50150 19446 -3425
26503 -3425 10060 4979 -93 9501 11468 21622 32222 22806 8121 26732 9409 16527 32078
26490 32078 21687 33422 66373 61886 28875 16892 9868 -14199 -10535 -5383 -2861 26142 45530
26477 45530 17948 14482 21135 22401 -22196 -31283 -25958 2301 24614 20846 18394 15261 3904
26464C904K187J8833N208J523k8218l8145q631J3536K6186P726K1350k1134k5193
26451b0868N697J7833P365k0717j2307J6763J5691j0481j0022J1648J010n799
26439d187o14J0656J2027R926o254j4410k5916o853J1090p636p371J5064j3085
26426b7563l7485p571O485M120j3293j2138j4943K5441O6983K2460j692M554r258
26413F100k3794k7265J608L9442L6576n622k3427j5086O753k706k7465j5983j0912
26400f1781J4955M0600J6313p326k0604n720K3656R768j3770O209r975n468K8472
26387A5329J2858q227j2795J9781j3309l5717J5227Q377j1150M887O082J0783
26375A2126j337k0107j4177j411N955K5347K7549j656j5392j4812k4596j162K8934
$$ plain form
26464 3904 6091 24924 30132 31655 3437 -34708 -43339 -29803 -3617 4109 25459 4325 -20868
26451 -20868 -15171 2662 10027 -10690 -22997 -6234 9457 -1024 -11046 602 1612 -4187
26439 -4187 -4801 5855 17882 27808 21554 7144 -18772 -25625 -14535 -22171 -29542 -14478 -27563
26426 -27563 -65048 -72619 -66134 -62014 -75307 -87445 -102388 -76947 -9964 12496 10804 15358 6100
26413 6100 -17694 -44959 -43351 -3909 32667 27045 3618 -11468 -4715 -7421 -34886 -50869 -61781
26400 -61781 -46826 -6226 10087 2761 -17843 -23563 93 9861 -3909 2300 -7675 -13143 15329
26387 15329 28187 19960 7165 26946 13637 -22080 -6853 1524 -9626 -4739 1343 12126
26375 12126 10789 -9318 -23495 -24906 -18951 6396 33945 32289 16897 2085 -22511 -23673 5261
26362E261J5803J741q909M343q93n884K6217o01l9345j0686K3505L0908K5781
26349F7241o364k6183k6724k2993l383j6892K0520J7801p388K477Q650k978l072
26336G12q588m760M696j8356q705J0246Q611j196o889j7671J7044J8455K5579
26323A9178K1665R765J353Q072j2356k3566k1816j2910k1310L268m460K3718q000
26310a7399l747K68J5701J9447K6420j9749j6523j7895k5265k848p672Q147M5638
26297D523J1581j8447j1112J2331N230M868J6802J6857K3104n197l5148q192n477
26284A1723J775M2640J8101o410Q378k6983n8512k064N778j862j7362r726O04
26271c3920j098L2516L80r374J7546R231q776k563J3088k2100k2055k7331m350
$$ plain form
26362 5261 21064 22805 13896 18239 17346 11462 37679 37078 -2267 -12953 10552 41460 67241
26349 67241 60877 34694 7970 -15023 -18406 -35298 -14778 3023 -4365 -1888 6762 3784 712
26336 712 -7876 -12636 -7940 -26296 -35001 -24755 -16144 -17340 -24229 -41900 -24856 -6401 19178
26323 19178 40843 50608 51961 60033 47677 24111 2295 -10615 -31925 -28657 -33117 -9399 -17399
26310 -17399 -21146 -20878 -5177 14270 40690 20941 4418 -13477 -38742 -41590 -49262 -41115 4523
26297 4523 16104 -2343 -13455 -1124 4106 8974 25776 42633 65737 60540 25392 17200 11723
26284 11723 13498 56138 74239 67829 76207 49224 -9288 -11352 -5574 -7436 -24798 -34524 -33920
26271 -33920 -35018 -2502 -2122 -11496 6050 15281 6505 3942 17030 -5070 -27125 -54456 -58806
26258e8806K1583L5472K6701j6291j2101p389J1035N031J140M978n628j5022j3802
26245b3099Q468J052N863R016j4941k0674R711n286J9647J0396R117k8229p872
26232b6831K8370j5694o342K5575M677j8316o522K687J3692K2597n676Q677j9156
26219G738j8908P22q984j1153K2413O615l392j0609J50J9529N143k4578N055o361
26205a6620l70j9054J401R50J1656K1146N673q157J0802L412j9990j4471N904
26192a7718J1207l119J12J0541Q598p090J0501k483p284k3899P744j8801l4714
26179f6405j9589J5024K7234J4514K5406R590R832J8551J1912n609j0354k9856
26167B50k4557J2427J0456j6875m7622R723M3632J9007J0290j6169L420K472j56
$$ plain form
26258 -58806 -37223 -1751 24950 8659 -3442 -10831 204 5235 6375 11353 5725 -9297 -23099
26245 -23099 -14631 -13579 -7716 1300 -13641 -34315 -24604 -29890 -10243 153 9270 -18959 -26831
26232 -26831 1539 -14155 -20497 5078 9755 -8561 -15083 -12396 1296 23893 18217 26894 7738
26219 7738 -11170 -10448 -19432 -30585 -8172 -1557 -4949 -15558 -15408 4121 9264 -15314 -10259 -16620
26205 -16620 -16990 -36044 -34643 -33693 -22037 -891 4782 -3375 7427 10839 -9151 -23622 -17718
26192 -17718 -6511 -9630 -9518 1023 9621 2531 13032 10549 3265 -20634 -12890 -31691 -66405
26179 -66405 -85994 -70970 -43736 -29222 -3816 5774 15606 34157 46069 40460 30106 250
26167 250 -24307 -11880 -1424 -18299 -65921 -56198 -12566 6441 16731 562 3982 6454 6298
26154F298m526K1401J5213j2563j9009r029j2189j8589j2402R101J0244M4999
26142A8949j1389j789J0768Q591n351Q078j961j7213r508j8805k9222p979r654
26129f6485R536K5779N231k1213J0076J6914K0118J06P874j5936j3129p143L0942
26116B670O444J0269j0164J748O968k1505J0958J9718J1295k7688j576N297M458
26103A8892k2q902j3840L495r747j5254r511O902J6021K6810M572j7480q507n4
26089f625J6811Q331j4045l1736j0535J6091Q08P84Q571J0227J3479N189k773
26076A4577r115n612P53J37j0673j0643k796q35J1215K7189J0781N960n602J7164
26062D2500R917j2204j0861k113Q523j3527M402j4672j9820J9466J8131j282l6464
$$ plain form
26154 6298 1772 23173 38386 25823 6814 -2215 -14404 -32993 -45395 -36294 -26050 18949
26142 18949 7560 5771 16539 25130 19779 27857 25896 8683 -825 -19630 -48852 -56831 -66485
26129 -66485 -56949 -31170 -25939 -47152 -37076 -20162 -44 62 7936 -8000 -21129 -28272 2670
26116 2670 9114 19383 9219 10967 17935 -3570 7388 27106 38401 10713 9137 14434 18892
26103 18892 18870 9968 -3872 -377 -10124 -25378 -34889 -27987 -11966 14844 19416 1936 -6571 -6625
26089 -6625 10186 18517 4472 -27264 -37799 -21708 -20900 -20116 -11545 -1318 12161 17350 14577
26076 14577 5462 -150 603 740 -9933 -20576 -23372 -24207 -12992 14197 24978 30938 25336 42500
26062 42500 52417 40213 29352 27239 35762 22235 26637 11965 -7855 11611 29742 28460 -8004
26049h004k8573J7045j3571J0837Q707J2084J787K506N776o460K6075J3258j7888
26036B3579j1620J0838K239k4156P745k0802q300J3657P004m050N000j2246K0005
26023H893K1157q867k4186j1618j1077K0847R021k4254r158k9665l5026L4770
26011e9163N6167M2441o882K301k8384J0434M081k2884j2183m636j4878j7277
25999e0863K0795M0878J7236Q1j5268k7395K745K273m326L084K3433q98j8343
25986f568j8347o146p95M6862J3431j3353k3507l322R387J7044r303l9489l878
25973c7984J3674j0833K8991J5540q469j3980j6456M3290M556j3446l4570k2304
25961e1991J6429J9476n515K892J4957j6813k4070j0191J1675K9791J771k1829
$$ plain form
26049 -8004 -36577 -19532 -33103 -22266 -13559 -1475 312 2818 8594 2134 28209 41467 23579
26036 23579 11959 22797 25036 880 8625 -12177 -20477 -6820 184 -3866 1134 -11112 8893
26023 8893 30050 21183 -3003 -14621 -25698 -4851 4170 -20084 -29242 -58907 -93933 -59163
26011 -59163 -2996 39445 32563 34864 6480 16914 20995 -1889 -14072 -18708 -33586 -50863
25999 -50863 -30068 10810 28046 28127 12859 -14536 -11791 -9518 -13844 -10760 12673 11775 -6568
25986 -6568 -24915 -31061 -31856 15006 28437 15084 -8423 -11745 -2358 14686 5383 -34106 -37984
25973 -37984 -24310 -35143 -6152 9388 919 -13061 -29517 13773 18329 4883 -29687 -51991
25961 -51991 -35562 -16086 -21601 -18709 -3752 -20565 -44635 -54826 -43151 -13360 -11589 -33418
25949c3418j3924Q884K2566K705J1412L262j1411j2191j478K667j3653J1136K861
25936b0582J2132j2733l849Q946K5872l44j7711J727j0506j4655j4935J4495L2357
25923B14J8031l0160k175K184J2345j1623o890P884L60J1866K1518k3564k6m256
25909d292O524Q695k702j1577J3871n929R099j5047j5128J4038K2054p130L93
25896A2869L710l750k717q52M12K0599K2891m622K1077n207l4052j8489p494Q203
25882A2578L7423J2512l701k5477k6975k4236J6181j6659r669j0394N309q252
25870d1360Q946K0918J2792K6555j0241j1240M2Q201L811k6140r76O765K620N933
25856F626K6193L264j0237m797l9J800j6527k3199j2107P19K623K5856m90k7533
$$ plain form
25949 -33418 -47342 -38458 -15892 -13187 -1775 1487 -9924 -22115 -23593 -20926 -34579 -23443 -20582
25936 -20582 -8450 -21183 -25032 -16086 9786 9442 -8269 -6542 -17048 -31703 -46638 -32143 214
25923 214 18245 -11915 -14090 -11906 439 -11184 -18074 -10190 -9830 2036 23554 -10 -36 -4292
25909 -4292 2232 10927 8225 -3352 10519 4590 13689 -1358 -16486 -2448 19606 12476 12869
25896 12869 16579 12829 10112 9260 9672 30271 53162 48540 69617 64410 30358 11869 4375 12578
25882 12578 50001 62513 58812 33335 6360 -17876 -1695 -18354 -28023 -38417 -33108 -41360
25870 -41360 -32414 -11496 1296 27851 17610 6370 6412 14613 18424 -7716 -8692 -1927 693 6626
25856 6626 32819 36083 25846 21049 21010 22810 6283 -16916 -29023 -28304 -25681 175 -315 -27848
25842b7848j2298K3390Q646m1K0493K8069K172k0036J323K8168L8242N687m0228
25829E5739k6844j2348l8336j1991j813R182K0447J9486j764j7321k2271L904
25817b3930L963r880J0281J3572r213r197j411r711J6585J8294K6070q480r095
25804G848L3521q665k4632j719m903j3709k749J0726K5275p724l4865L3602J2148
25791B4154j6001n781k40J495J764Q453K2004J2128j5065k2728J1621J0534m739
25778B7599j4678l974M408K052j6179j6243L897O570K5753k379r126P721q245
25765G176p414o299K2274J6685j0103l238K524j4374J5007P66k0074k5491P432
25752a5129K1393R116q75J4355o668N861n748l4432Q424l512o265n581P506K4464
$$ plain form
25842 -27848 -40146 -16756 -8110 -8151 12342 40411 42583 22547 23870 52038 90280 95967 55739
25829 55739 28895 16547 -21789 -33780 -35593 -26411 -5964 13522 11758 -5563 -27834 -23930
25817 -23930 -19967 -29847 -19566 -5994 -15207 -24404 -25815 -35526 -18941 -647 25423 16943 7848
25804 7848 41369 32704 8072 6353 1450 -12259 -15008 -4282 20993 13269 -21596 12006 24154
25791 24154 8153 2372 2132 3627 5391 13844 35848 47976 32911 10183 21804 32338 27599
25778 27599 12921 8947 13355 15407 -772 -17015 -13118 -6548 19205 16826 7700 15421 7176
25765 7176 -238 -6537 15737 32422 22319 19081 21605 7231 22238 23004 2930 -22561 -15129
25752 -15129 6264 15380 14505 28860 22192 28053 22305 -12127 -3703 -7215 -13480 -19061 -11555 12909
25738A2909l392Q587J2408j7860k0485k548k8656P692K2125j1487o881L7480m748
25725E144k9939k300M315K5454l77l879p109O346j8580N027R973O869j6581J2273
25711c364J6596J2142O545n752k7573k3315L233L223r82n980J3091J5942J9337
25698B3143q69j8851J0114R209j2641j6941R909M328j2010k1415J7035J102r244
25685a7131J3482Q980j1659N516J3086J0099r228J9922m054l5789m1419J5035
25673c3160K271K6129o244j500n002j3729k6505m900J7241j6282J6988L2089J5861
25660C257O462R886J3534j1732n514k949J770K5152j9820k7439q729O779K4358
25647A5015j658k432Q67O605k8186j0890k0727l9703m184M754K951J9501L4535
$$ plain form
25738 12909 9517 18104 30512 12652 -7833 -10381 -39037 -31345 -9220 -20707 -27588 9892 5144
25725 5144 -24795 -27095 -22780 2674 2297 -1582 -8691 -2345 -20925 -15898 -5925 944 -15637 -3364
25711 -3364 13232 25374 31919 26167 -1406 -24721 -21488 -18265 -19247 -25227 -12136 3806 23143
25698 23143 22274 3423 13537 22746 10105 -6836 3073 7401 -4609 -26024 -8989 -7887 -17131
25685 -17131 -3649 5331 -6328 -812 12274 22373 13145 33067 29013 -6776 -48195 -33160
25673 -33160 -30889 -4760 -11004 -12504 -17506 -31235 -57740 -62640 -45399 -61681 -44693 -12604 3257
25660 3257 9719 19605 33139 21407 15893 12944 14714 39866 20046 -7393 -16122 -9343 15015
25647 15015 13357 10925 11792 18397 -9789 -20679 -41406 -81109 -85293 -80539 -77588 -58087 -23552
25634b3552O272k2504r058J6977j6432K5925K2428j3300J2344J9437q296j2231
25622a990m657J077j7439n653l783J9118J5697L460J0911Q411j1912j8615o370
25609a1745j8700J3925r6j0243K820o344L547J4675L253q788P676Q173k231l219
25595g297J7360m513K464J4769M507k221j5988Q617n352R257q978L892k681p795
25581F041J239j2631Q428K3062k8818j6706K51m678P97j2588Q113j3349M564K9007
25567g268J2014j8186J8095L3381K843o658k9614p047j3803j1496J3111Q474J6719
25554A0565J763k3887k2069J5464O045K1547Q353J596P757j2489j3342L286Q735
25541A3324k4180K3166J210J0986q337r645o725n169J2511K1546j9982L441j3440
$$ plain form
25634 -23552 -17280 -39784 -48842 -31865 -48297 -22372 56 -13244 -900 18537 10241 -1990
25622 -1990 -6647 -5570 -23009 -28662 -32445 -13327 2370 5830 16741 25152 13240 -5375 -11745
25609 -11745 -30445 -16520 -16616 -26859 -24039 -30383 -26836 -12161 -8908 -17696 -10020 -1847 -4078 -7297
25595 -7297 10063 5550 8014 22783 27290 25069 9081 17698 12346 21603 12625 16517 13836 6041
25581 6041 7280 -5351 3077 26139 -2679 -19385 -19134 -23812 -23015 -35603 -27490 -40839 -36275 -7268
25567 -7268 4746 -13440 4655 38036 40879 34221 4607 -2440 -16243 -27739 -14628 -6154 10565
25554 10565 12328 -11559 -33628 -18164 -12119 9428 17781 19377 27134 14645 1303 4589 13324
25541 13324 -10856 12310 13520 24506 16169 6524 -201 -5370 7141 28687 8705 12146 -1294
25528a294J6699J073J0034N915J3449J3056j7733j2056k8869m3769J1092J832
25516c0571M488K554Q944O094O195N041l79O746Q397n236l051l3393k4293P45
25502d7719K665o405J4102J1384J0127K5523K9307k9172j5974J580J691O067L551
25489F727k5888j7323j1722m594m786N170K5244K3172J1636L201P19j0933J0410
25476A1033J6922J5780j7090n220k690q443p183k799M627J3072L854M138K0562
25463D6563j4450j9373j0856j7235P848K3132q576r192q122N669J2666J4934l688
25450A9320m13K4601M598k2242l941k3089k1600R18K0067K3292r160p301K1333
25437B6383K805k9332j407q413j8707R082o853k1394Q75K2568K1094j775k0896
$$ plain form
25528 -1294 15405 16478 26512 32427 45876 58932 41199 29143 274 -43495 -32403 -30571
25516 -30571 -26083 -23529 -14585 -8491 -2296 2745 2366 9112 17509 12273 9222 -24171 -48464 -47719
25502 -47719 -45054 -51459 -37357 -25973 -15846 9677 38984 9812 -6162 -4582 -2891 3176 6727
25489 6727 -19161 -36484 -48206 -52800 -57586 -52416 -27172 -4000 7636 10837 11556 623 11033
25476 11033 27955 43735 26645 21425 18735 10292 3109 310 4937 18009 21863 26001 46563
25463 46563 32113 12740 1884 -15351 -7503 15629 7053 -2139 -10261 -4592 8074 23008 19320
25450 19320 18907 43508 48106 25864 21923 -1166 -22766 -21848 -1781 21511 12351 5050 26383
25437 26383 29188 -144 -1551 -9964 -28671 -19589 -26442 -47836 -46961 -24393 -3299 -5074 -25970
25424b5970J377j1266J7871j8269k959R165O31p037P723r081L8153J4767q444
25411F661N850J1826p926K007k358j6851j0950j774q226J0948M2881K717l1265
25398C540R373M605k4233m4376j874J0592j2952Q298J3748j1495m260K0711K8403
25385H0Q22K088O137p516q328J1343L275r535j0675k1351J3399k079J5326J7686
25371A0672j557K0906J6106M998k1126j107Q43k5938k3224j5549O643j2085O729
25358c3689K7770Q701p749Q464r782J452k805J4022L8525O715j2601r50n596k656
25344B9821M690j6749O513J1557j0591p787o363k5022j2086K7009R602j9971k313
25331a1690K1932K9894N630M202j2571k7784j8371M794O310q420o133m844j0563
$$ plain form
25424 -25970 -24593 -35859 -17988 -36257 -39216 -30051 -29420 -36457 -28734 -37815 338 15105 6661
25411 6661 12511 24337 16411 18418 16060 -791 -11741 -13515 -21741 -10793 32088 34805 3540
25398 3540 12913 17518 -6715 -51091 -52965 -42373 -55325 -47027 -33279 -44774 -49034 -28323 80
25385 80 902 2990 9127 1611 -6717 4626 7901 -1634 -12309 -33660 -20261 -22340 -7014 10672
25371 10672 9115 30021 46127 51125 29999 28892 29735 3797 -19427 -34976 -28333 -40418 -33689
25358 -33689 -5919 2782 -4967 3497 -6285 -4833 -7638 6384 44909 51624 39023 38073 32477 29821
25344 29821 34511 17762 24275 35832 25241 17454 11091 -13931 -26017 992 10594 -9377 -11690
25331 -11690 10242 40136 45766 49968 37397 9613 -8758 -3964 2346 -6074 -12207 -17051 -27614
25318b7614n815J3302O148l162O644k396j4826j0479m356J2054j5221K3656R222
25305a2843K4350M208J713J8368L480p760j9704q049Q302p197J9055j5451k208
25292F264J3749J4681P8k5119j205J3606r013j1929j2433k0293k2182o608J1070
25279d9334K2930o681p201J5370J5871R148J0296K1056L058J2092O544k0097j4043
25266A9009j1238j7992J5615L486P116J0088O379Q628j5643k3063N958J5208q638
25253A4913n031p800J3858J4161l641k9549o570m37J8951J965p075M561j5859
25240g553K0954R661k5722k1412q642R450J6898N27K916L500K7902j2564m056
25227A1859k1725k2o66O736r897O817K994K0581k1150k0034J5584L2800o773k0542
$$ plain form
25318 -27614 -33429 -20127 -13979 -17141 -10497 -12893 -27719 -38198 -42554 -30500 -45721 -22065 -12843
25305 -12843 11507 15715 17428 35796 39276 31516 11812 3763 12065 4868 23923 8472 6264
25292 6264 20013 34694 34772 9653 8448 22054 13041 1112 -11321 -31614 -53796 -60404 -49334
25279 -49334 -26404 -33085 -40286 -24916 -9045 103 10399 31455 34513 46605 53149 33052 19009
25266 19009 7771 -10221 5394 8880 15996 26084 32463 41091 25448 2385 8343 23551 14913
25253 14913 9882 2082 15940 30101 26460 -3089 -9659 -10096 8855 10820 3745 8306 -7553
25240 -7553 13401 23062 -2660 -24072 -32714 -23264 -6366 -5839 -2923 577 28479 15915 11859
25227 11859 -9866 -9888 -10554 -3818 -13715 -6898 -3904 16677 -4473 -24507 -8923 23877 17104 -3438
25213c438K4517N731R928N388N262j7071j6722k8082q384K6118K3275k1151j2816
25200g445J2252K487l274n151j3481M355K0874K0358N707k8203j7986j7922j5333
25187d2762M515J6187K4872o30r940j2760p00k371j0575K597j746m118j226J7246
25173b1411R213j4713k4851J6578J1860L3J3968J5387q748k5556k0502J4193N1891
25160A7342K1296j579k6880l1120K0658q864K7389J4666N855j4340l0961l465
25148a0003J8111j3556J2028R832k35j5861l811j8124O001j683j98p231m674K3632
25134e772K2076L074k8322j3784q759K1084N277j3032m503o875Q193J6609k292
25121g026k709K211N1122J0720r942l5984k7983L900J1036M622j2992j610l463
$$ plain form
25213 -3438 21079 26810 36738 42126 47388 30317 13595 -14487 -22871 3247 26522 5371 -7445
25200 -7445 4807 7294 4020 -1131 -14612 -10257 10617 30975 36682 8479 -9507 -27429 -42762
25187 -42762 -38247 -22060 2812 2182 -7758 -20518 -21218 -23589 -34164 -31567 -33313 -37431 -38657 -21411
25173 -21411 -12198 -26911 -51762 -35184 -23324 -23291 -9323 6064 -2684 -28240 -48742 -34549 17342
25160 17342 38638 37059 10179 -20941 -283 -9147 18242 32908 38763 24423 -6538 -10003
25148 -10003 8108 -5448 6580 16412 16177 316 -3495 -21619 -15618 -17301 -17499 -24730 -29404 -5772
25134 -5772 16304 19378 -8944 -22728 -31487 -10403 -5126 -18158 -22661 -29536 -21343 -4734 -7026
25121 -7026 -9735 -7524 43598 54318 44376 8392 -19591 -15691 -4655 -33 -13025 -14635 -18098
25108a8098k1084n584K4991J6561J3808K844k118j0199k490J1939Q125k9810k6161
25095c7276K1796j3104j3904N271J9487K3865P776k9504k3366l557R302J5671
25083a7543l447J0147J6592j5911r083J0574k3756N894P734J9956r702j4942j4577
25070c8064j3354k354J6763m55k5899J2729L7609q314k005J4797n798O046K9708
25057B1409K1104n962j3331O05k3609k1876R408J4050N619j8999k1685K3519j2001
25044b1749M410L207J739J2986j8524k4155l729K5469J8209L188j7625q27O587
25031a0814k5816Q997J5718N989j2334K7237o791j5497K3714q000j8025k0693
25019c6315Q005J9540R285j1568j6206J097j0702k589Q616M453K5221M8805M902
$$ plain form
25108 -18098 -39182 -44766 -19775 -3214 10594 13438 11320 1121 -1369 10570 18695 -11115 -37276
25095 -37276 -15480 -28584 -42488 -37217 -17730 6135 13911 -15593 -38959 -42516 -33214 -17543
25083 -17543 -20990 -10843 5749 -10162 -19245 -8671 -32427 -26533 -18799 1157 -8545 -23487 -38064
25070 -38064 -51418 -53772 -37009 -37464 -63363 -50634 -13025 -21339 -23344 -8547 -14345 -8299 21409
25057 21409 42513 36551 23220 23825 216 -21660 -12252 1798 7417 -11582 -33267 -9748 -21749
25044 -21749 -17339 -14132 -12393 593 -17931 -42086 -45815 -20346 -2137 1051 -16574 -17401 -10814
25031 -10814 -36630 -27633 -11915 -5926 -18260 8977 2186 -13311 10403 2403 -15622 -36315
25019 -36315 -28310 -8770 515 -11053 -27259 -26162 -36864 -39453 -30837 -26384 -1163 47642 52544
25006E2544j0258k9087l3656j3789J2902M302k2348L370L5608Q87k61q203m819
24993a2808J0959J3129R484k072k314o496j3013k0430j248P14k234L1069j2769
24980h029j455M015K0538j0812m019q608Q232j3754j7218j1673j6763J2467J6898
24967c0181Q678J4933K4213L079J052j6586M362j3904k1437j2315J5313K6869
24955D076N896k4230q062O165o083J8406L3319P115j4709q883K3571k1045p394
24942H142k333q118J2948J078j7569q17J8666J7218j1512m397j7391j2566o316
24929b2967J8143J5026l8777j4642Q996J7921q722j2347Q244j3417J964K6067
24917a4511j3271j3781L4588K5235j509j0818j798J362l6268k934J8549J5378
$$ plain form
25006 52544 42286 13199 -20457 -34246 -21344 -17042 -39390 -36020 -412 475 214 -7989 -12808
24993 -12808 -1849 11280 20764 18692 16378 9882 -3131 -23561 -24809 -24095 -26329 4740 -8029
24980 -8029 -9484 -5469 15069 4257 238 -8370 -138 -13892 -31110 -42783 -59546 -47079 -30181
24967 -30181 -21503 -6570 17643 20722 21774 5188 9550 -4354 -25791 -38106 -22793 4076
24955 4076 9972 -14258 -22320 -16155 -22238 -3832 29487 36602 21893 13010 36581 15536 8142
24942 8142 5809 -2309 10639 11717 -5852 -6669 11997 29215 17703 13306 -4085 -16651 -22967
24929 -22967 -4824 10202 -28575 -43217 -34221 -16300 -25022 -37369 -29125 -42542 -40578 -14511
24917 -14511 -27782 -41563 -6975 18260 16751 5933 4135 5497 -30771 -33705 -15156 222
24905B22j0344J8966K1246l971K3863J3206m7389l0787J287o579k3826r565K0292
24892c3379J0519p862K1913K0806K338j5922j804p237k5846Q698q180J9011m816
24879b1761o741J3178L0330J1738J4699j6106k8776M627K057k29L0203j537l07
24866C1375J1848k5470M13j7900l2240K0731J3692J377o571j1400k3629O977K5087
24853e710K1481j123j790K0905k5810l5255m475q573J6754K4161Q72J1631q636
24840D432l0283p857M3993J0646j2789k4875m060n233l2048J02K6279J0962j0548
24827c1279J0780k739j7460K735J1007O507J3858j7686k589K2891k730L343J4957
24814A1595K947j3612p335J4916R092J2209q405l1352j109J994k252R414n214
$$ plain form
24905 222 -10122 8844 30090 26119 49982 63188 15799 -14988 -13701 -20280 -44106 -53671 -33379
24892 -33379 -22860 -30722 -8809 11997 14335 -1587 -3391 -10628 -36474 -27776 -35956 -16945 -21761
24879 -21761 -28502 -15324 15006 26744 41443 25337 -3439 1188 3245 3016 33219 31682 31375
24866 31375 43223 17753 18166 266 -31974 -11243 2449 3826 -2745 -14145 -37774 -30797 -5710
24853 -5710 15771 14648 12858 33763 7953 -27302 -31777 -40350 -23596 565 1437 13068 4432
24840 4432 -25851 -33708 10285 20931 8142 -16733 -20793 -26026 -58074 -57972 -31693 -20731 -31279
24827 -31279 -20499 -23238 -40698 -37963 -26956 -20449 -6591 -24277 -26866 -3975 -6705 -3362 11595
24814 11595 14542 930 -6405 8511 17603 29812 21407 -9945 -11054 -9060 -11312 -1898 -7112
24801g112J0012j5564o118j5340K843Q930j9095K797r232k525K0133K5262R174
24788D165l23p38J618o29M469j3629j4083K4080q355k0235j3812K3272J7373J0067
24774A3240L908j5550R348K198n341l7655k2219J6166K858M1708J1468k4158P787
24761C758j8406k3972J43k2630Q274r269K9023K4281k3709m641M866K476L148
24748b6658J8270R815J8602J3587j7771j6872p329p551j0048K4488K0144l500
24736A5177m644N14k0700k911L4455J7255k1735m1535J2698L8376J9454k063J1125
24723E5466O639p517l9169l5169j6620R464J014O589J1567P902Q191Q471m281
24710A2547n268J1207n971L812k667q558q707O501n1628k1472N71J4761J3616
$$ plain form
24801 -7112 2900 -12664 -18782 -34122 -31279 -22349 -41444 -38647 -47879 -50404 -30271 -5009 4165
24788 4165 3842 3104 4722 4093 8562 -5067 -19150 4930 -3425 -23660 -37472 -14200 3173 13240
24774 13240 17148 1598 10946 13144 7803 -29852 -52071 -35905 -33047 8661 20129 -4029 3758
24761 3758 -14648 -38620 -38477 -61107 -52833 -62102 -33079 -8798 -32507 -37148 -32282 -29806 -26658
24748 -26658 -8388 1427 20029 33616 15845 -1027 -8356 -15907 -25955 -1467 18677 15177
24736 15177 10533 11047 -9653 -12564 21891 39146 17411 -24124 -11426 26950 46404 44341 55466
24723 55466 62105 54588 15419 -19750 -36370 -26906 -25892 -19303 -7736 166 8357 16828 12547
24710 12547 7279 18486 12515 16327 13660 5102 -3605 2896 -48732 -70204 -69633 -54872 -41256
24697d1256j0909q884L4217J2268K1702K4372j2940j3830l7036k6088K2902L3192
24685b290l194P926l754j9524l3723K16K718K5719J4198K028J7817j8064N150
24672d777J0812Q685J1117O591K759k992j7967r394N314Q519j7652L456J0743
24659A5214J1272R909R979j0945N285n534q824k9984Q647K0826j4948m8836J0676
24646b7263J6660J0260J433J2506p696Q386j639j5417k6495N164K6679K098j0523
24633e847j0157j4106L1649j875j1248R53o152j310k592k64j355J4675J4691r144
24619b082r244r190J8990P770o504p514o112j6233R483J5222K5271j4405m1069
24606c5617n943R01o629J9710J9504k4370k5185K936J2172J4730j2497R857J124
$$ plain form
24697 -41256 -52165 -61049 -26832 -14564 7138 31510 18570 4740 -32296 -58384 -35482 -2290
24685 -2290 -5484 2442 -1312 -20836 -54559 -54343 -51625 -25906 -11708 -9680 8137 -9927 -4777
24672 -4777 6035 14720 25837 32428 35187 32195 14228 4834 10148 18667 1015 4471 15214
24659 15214 26486 36395 46374 35429 40714 35180 26356 -3628 5019 25845 10897 -37939 -27263
24646 -27263 -10603 -343 1090 13596 5900 14286 12647 -2770 -29265 -24101 2578 4676 -5847
24633 -5847 -16004 -30110 1539 -336 -11584 -10631 -16783 -18093 -20685 -20949 -22304 -7629 7062 -2082
24619 -2082 -11326 -20516 -1526 6244 -260 -7774 -13886 -30119 -20636 -5414 19857 5452 -35617
24606 -35617 -41560 -40659 -47288 -27578 -8074 -32444 -57629 -54693 -42521 -27791 -40288 -30431 -29307
24593b9307j3136L157J5439O86j2471J3705j1122m620L7360K8270p198k1972l9267
24580d0476J4937K6411K3462k6429j3199j0134J1113M4567j2943j5411n902m580
24568h584p194Q878j7923j7107K1234J4898K642j3048M297J0388j3750j5657L1748
24555H22J9254k5312k9139J0712K7477j9440k8181k451K4220j2683j5551N544
24543d4728l160n966r332j7650K7272L5961L0242Q790r951L911J596l0046k839
24530a5900m128k4760n376J204m574Q861J3935p833J8660R362j5548K2913N723
24517B539j5263J1913J587j1790n816J763J3875P34q686j5733K1223J6076q628
24504C794r800J4611L2038j4470j7743k2539j2522M671K90O538K4507J9749J1110
$$ plain form
24593 -29307 -42443 -39286 -23847 -23161 -35632 -21927 -33049 -37669 -309 27961 20763 -1209 -40476
24580 -40476 -25539 872 24334 -2095 -15294 -25428 -14315 30252 17309 1898 -4004 -8584
24568 -8584 -15778 -6900 -24823 -41930 -20696 -5798 -3156 -16204 -11907 -1519 -15269 -30926 822
24555 822 20076 -5236 -34375 -23663 3814 -15626 -43807 -46258 -22038 -34721 -50272 -44728
24543 -44728 -47888 -53854 -63186 -80836 -53564 -17603 12639 21429 11478 15389 16985 -13061 -15900
24530 -15900 -20028 -44788 -50164 -48960 -53534 -44673 -30738 -38571 -19911 -10549 -26097 -3184 2539
24517 2539 -12724 -811 776 -11014 -16830 -15067 -1192 -458 -9144 -24877 -3654 12422 3794
24504 3794 -6006 8605 40643 26173 8430 -14109 -26631 -21960 -21670 -15132 9375 29124 40234
24491D0234k3941j7405K7714J432J0004R138n356j1805j0664k5206P815m341j5227
24478a7608k3742J7913n339K0511J6247j226q939J503N248o265j2812l422J9674
24465A743r019n809J0679k647k5817P651K74Q079j115M078l423p048j6416l477
24451d2267k709k2764N406J2234N258K1438J6662Q637J182j1658L68r580r511
24438b7304m892J0069R658K0886j5883J3361N2472Q612j3889j3537j2483k2187
24426D883J6618J1052j9530M771m173k0693j8864p979k256J2750L8257M942j6172
24413C606k0550l4223j245J1638J4762l3701k0955j0140K3133L0555K973M182
24401b9965l4724K5498L4265N991J3958r58l0691j4757L3477O799j6244k6310
$$ plain form
24491 40234 16293 -1112 26602 28034 38038 47176 41820 30015 19351 -5855 1960 -2381 -17608
24478 -17608 -41350 -23437 -28776 -8265 7982 6756 -2183 -680 4568 -1697 -14509 -17931 1743
24465 1743 -7276 -13085 -2406 -5053 -30870 -23219 -22945 -14866 -15981 -11903 -15326 -22374 -38790 -42267
24451 -42267 -44976 -67740 -62334 -50100 -44842 -23404 -6742 1895 3077 -8581 -8213 -17793 -27304
24438 -27304 -32196 -22127 -12469 8417 -7466 5895 58367 66979 53090 39553 27070 4883
24426 4883 21501 32553 13023 17794 13621 -7072 -25936 -33915 -36171 -23421 14836 19778 3606
24413 3606 -16944 -51167 -52412 -40774 -26012 -59713 -80668 -90808 -67675 -37120 -34147 -29965
24401 -29965 -64689 -39191 -4926 1065 15023 14065 -16626 -31383 2094 8893 -7351 -33661
24389c3661J9439j041J0484J826j2127o741R996k730m0584M049J8873J0636k7455
24376d9036K3038N461j8741J7739N060L782j7588M067L572K3493j728n356r41
24363g178j257J5718J5033R078j0221k0033J477k5626l779J4557k73K4945J0789
24350B3230m33k4451j7932K753K3689O206K1252j3040k115j3441o353K3710r567
24337A3508r435k594m87j2286K519L2469O076k6026q26J5704K6638n193l362l2236
24323D469j7112J5261j9027P060K5030J9352m960r648k4842j1729K1699L2018
24311C7571k7501n9497o000L5807O673P786O992P774o298p07k112o015p524q460
24297b1511n686L1575l875k2311k1747M181J8840L688J7300j9785p177J2444J7053
$$ plain form
24389 -33661 -14222 -15263 -4779 -2953 -15080 -21821 -11825 -14555 -55139 -51090 -32217 -21581 -49036
24376 -49036 -25998 -20537 -39278 -21539 -16479 -12697 -30285 -26218 -22646 847 -881 -6237 -7178
24363 -7178 -8435 7283 22316 31394 21173 1140 2617 -23009 -26788 -12231 -12504 12441 23230
24350 23230 22797 -1654 -19586 -16833 6856 13062 34314 21274 19159 5718 -635 23075 13508
24337 13508 4073 1479 992 -11294 -8775 23694 29770 3744 2918 18622 45260 40067 36705 4469
24323 4469 -12643 2618 -16409 -9349 15681 35033 30073 20425 -4417 -16146 5553 37571
24311 37571 10070 -49427 -55427 -19620 -12947 -5161 1831 9605 3307 2600 488 -5527 -13051 -21511
24297 -21511 -27197 4378 503 -21808 -43555 -39374 -20534 -16846 454 -19331 -26508 -14064 2989
24284B989R766L84j524k5492m0810L3929j665l1763J1604K5787R493r456Q147
24271h611J749K2126q038k685R683N023K838j7239j9680l98J3746L223p718n904
24257a1885K3669O65o137J3024j3317k6311J3573j2833j1212K4091L336p304J5150
24244D509L5079K5888k5964l2118k53Q609p179j9642j1767J8697q286l599P201
24231h825O552n92j3024J9556J1148k0776k3841j2425J6726K6214J7786K436J9032
24218C9967k2432N110J4248K667j3010l9704j4286L672J1453Q314n203k0402Q645
24205b0961Q476L48N076p06j6336O947M983K6220R682M217l523m2412l4189K2515
24191b9663L3005j2473k2036q348j9834J2375J8202R874J55j1334K524K3621J5248
$$ plain form
24284 2989 12755 13139 11615 -13877 -54687 -20758 -22423 -54186 -42582 -16795 -7302 -16758 -8611
24271 -8611 -6862 15264 7226 4541 14224 19247 22085 4846 -14834 -15232 -1486 1737 -5981 -11885
24257 -11885 11784 12449 6312 19336 6019 -20292 -6719 -19552 -30764 -6673 -3337 -10641 4509
24244 4509 39588 65476 39512 7394 7141 15750 8571 -11071 -22838 -4141 -12427 -16026 -8825
24231 -8825 -2273 -2865 -15889 3667 14815 -5961 -29802 -42227 -25501 713 18499 20935 39967
24218 39967 17535 22645 36893 39560 26550 -13154 -27440 -23768 -12315 -4001 -9204 -29606 -20961
24205 -20961 -12485 -12137 -7061 -7767 -24103 -17156 -12173 14047 23729 27946 24423 -17989 -52178 -29663
24191 -29663 3342 -9131 -31167 -39515 -59349 -46974 -28772 -18898 -18743 -30077 -27553 -3932 11316
24178A1316j3162j7546J4277k474l982r282j7377q216N838p926N6538K3793k0330
24165A1467j1254q349l4170j3078R094J9161k1402K1159N687L150j0859j6472
24153d5866N194j3281r619J1550J7344J7897J6588k3272j6584q564n417J1164
24141d2866K0533J4258m601j3929k5458J889R391J4336m398l077J2808J730J9360
24128b4J2246k1228k490K8020P7j4793n512L897m447k404r992J2216L6433J1496
24114D3495l0882j0845q714j6398O58K69J6994J5488M622l2964k5023k603K8684
24101a7219L5316J2792N960j2599j307o2840q314J2135J95p023K8374L8035k2486
24088A019k2155P257K218j4111R608J5372o99j2877K4437K317j7811k408R592
$$ plain form
24178 11316 -1846 -19392 -5115 -7589 -11571 -20853 -38230 -46446 -40608 -48534 8004 31797 11467
24165 11467 213 -8136 -42306 -55384 -46290 -27129 -48531 -27372 -21685 -18535 -29394 -45866
24153 -45866 -40672 -53953 -63572 -52022 -34678 -16781 -193 -23465 -40049 -48613 -54030 -42866
24141 -42866 -22333 -8075 -12676 -26605 -52063 -50174 -40783 -26447 -30845 -33922 -21114 -19384 -24
24128 -24 12222 -9006 -11496 16524 16601 1808 -3704 193 -4254 -6658 -16650 -4434 31999 43495
24114 43495 12613 1768 -6946 -23344 -22686 -22417 -5423 10065 14687 -18277 -43300 -45903 -17219
24101 -17219 18097 30889 36849 24250 22943 -39897 -48211 -36076 -35881 -42904 -14530 23505 1019
24088 1019 -21136 -13879 -11661 -25772 -16164 -792 -1491 -14368 10069 12386 -5425 -7833 1759
24075A759J0685M228r20j0808k2119M613j92J3067n386R962J2074j6777J107k9723
24061b8430p347Q609J1143P585J0767m723j6605J7766j5128j9242j495J5071O61
24048b1368n450k2190l707M939R958J6172L6021j0379k0932j9997K5990J4149
24036C206P855q00j2896J1006J82j9628k6354j3070k271L2180j270K282J5045
24023d533l318j1832K0248L2659k542k7834k1344l946K1295K6901j2138o161j3845
24010f390j9264K4476M2069j6233j7476k4229o517M082R649q667j0932J5958M689
23997h785J196M204j347k3590k1540j3716K0150J960L761K9298J9517k604J1110
23984A9614P349R593m117l3639r853J414m492K771j3665j7305J9473J346q33k2868
$$ plain form
24075 1759 12444 16672 15752 4944 -17175 -12562 -12754 313 -5073 4889 16963 186 1293 -28430
24061 -28430 -35777 -27168 -16025 -8440 2327 -2396 -19001 -1235 -16363 -35605 -37100 -22029 -21368
24048 -21368 -26818 -49008 -52715 -47776 -37818 -21646 14375 3996 -16936 -36933 -10943 3206
24036 3206 11061 10261 -2635 8371 8553 -11075 -37429 -50499 -52770 -20590 -21860 -19578 -4533
24023 -4533 -7851 -19683 565 33224 30682 2848 -18496 -22442 -1147 25754 13616 7455 -6390
24010 -6390 -25654 -1178 40891 24658 7182 -17047 -23564 -19482 -9833 -18500 -29432 -13474 -8785
23997 -8785 -7589 -3385 -4732 -28322 -49862 -63578 -43428 -41468 -37707 -8409 11108 8504 19614
23984 19614 26963 36556 32439 -1200 -11053 -9639 -14131 -11360 -25025 -42330 -22857 -21511 -22344 -45212
23970d5212j171N421j68K1057K5077K711K6886L401k0915K96N188k031k3837p519
23956a0816M4188K73j3477K8120j1778j9732k6087l869J1397L285j2200j6284
23944b6980j0957R040q274j1086n193k687k2660M4418K2034P333j1776K0489J576
23931E277o239k0909j8273J9968K5112J1196r350J6831j9459l1182l0444l107
23919f0579K0238K2811Q385Q03K74J1016J0472L282k7172J3374p30k551K308q373
23905f442R97J4133k40j2679j7858j0847J8219J1923K2144k4435j5358N224k132
23892a7351p757j0821o396J3295Q417k6720P667K4139R804j5613j2893M745J2857
23879a6627K1431j1221K146j1177j8611J6822q162j87M51l895P357J6811Q349
$$ plain form
23970 -45212 -46383 -40962 -41130 -20073 5004 7715 34601 38002 17087 17383 22571 20540 -3297 -10816
23956 -10816 33372 33645 20168 48288 36510 16778 -9309 -13178 -1781 1504 -10696 -26980
23944 -26980 -37937 -28897 -37171 -48257 -53450 -56137 -78797 -34379 -12345 -5012 -16788 3701 5277
23931 5277 -962 -21871 -40144 -20176 4936 16132 6782 23613 4154 -27028 -57472 -60579
23919 -60579 -40341 -17530 -9145 -8342 -8068 2948 13420 16702 -10470 2904 2174 -377 1931 -6442
23905 -6442 -5445 8688 8448 -4231 -22089 -32936 -14717 -2794 19350 -5085 -20443 -15219 -17351
23892 -17351 -25108 -35929 -42325 -29030 -20613 -47333 -39666 -15527 -5723 -21336 -34229 -29484 -16627
23879 -16627 4804 -6417 -4271 -15448 -34059 -17237 -25399 -25586 -25135 -29030 -21673 -4862 3487
23866C487q827K2003j4482N387k5982l5641p046J6684n546K1229J4897j1887j2533
23853c8257j0872R121K5627L2993K031p332p202j8352k3156K207K724J0968J6428
23840c072r50j6393j0J361J0374P597k4146J1358J2911O493o720M038k0027o424
23826b3610k1283K2046L9384M948j1168l952R811J0535n315k1712k8525l3289
23814f2130k2893K9822K7370p604Q472K8661J82O946q001j3012j4149n760j8803
23801e0899K8936J9213J935K1970J9150j3154k855j8644j2197K92K7440L613P380
23788C2180p433o9658j3633K2489K5399J4637N882l543m782j8227k359L956j0243
23775b5335j8659Q138k351j6913M732J4816L0393J1251j4300j760k6954j0127
$$ plain form
23866 3487 -5340 16663 2181 7568 -18414 -54055 -61101 -44417 -49963 -28734 -13837 -25724 -38257
23853 -38257 -49129 -40008 -14381 18612 20643 13311 6109 -12243 -35399 -33192 -30468 -19500 -3072
23840 -3072 -4022 -20415 -20425 -19064 -8690 -1093 -25239 -13881 -970 5523 -1197 2841 -17186 -23610
23826 -23610 -44893 -22847 16537 21485 10317 6365 16176 26711 21396 -316 -28841 -62130
23814 -62130 -85023 -55201 -27831 -35435 -26963 1698 1880 8826 825 -12187 -26336 -32096 -50899
23801 -50899 -21963 -2750 -815 21155 40305 27151 24296 5652 -6545 -6253 21187 24800 32180
23788 32180 24747 -44911 -58544 -36055 -10656 3981 9863 6320 1538 -16689 -19048 -15092 -25335
23775 -25335 -43994 -35856 -38207 -55120 -50388 -35572 -5179 6072 -8228 -9988 -36942 -47069
23763d7069J2466l07K4063J4391j0762N368k497j897K3057K607k1376k682J4396
23750I758K285K585k3362l8256n112K3766J2739M189K983j4543N737K3170J0532
23737A6471p937j3076o569K228k726j4196r821J6425n838J6947L129l153M104
23724d012l078n726j0450M230K5222K5213k3806n915R721o034n72J0909j6916
23711a214l4772J9899j826n792K0040Q337j7540k1844J5039o670M516j7498j3512
23698e2837j2717n377L5530K39J2705J6859L926J9267k6367k4854M935O021p203
23685b9873J3027J7538q260j770J9720L3350j8648l1335j1675Q699J9671j0287
23673A57k6296j5400M708Q019K2369K6702K126j4904M353o21n307j6523K66m585
$$ plain form
23763 -47069 -34603 -34910 -10847 3544 -7218 -1850 -4347 -6244 16813 19420 -1956 -4638 9758
23750 9758 12043 14628 -8734 -46990 -52102 -28336 -15597 -11408 -8425 -22968 -17231 5939 16471
23737 16471 8534 -4542 -11111 -8883 -11609 -25805 -35626 -19201 -25039 -8092 -4963 -8116 -4012
23724 -4012 -7090 -12816 -23266 -19036 6186 31399 7593 1678 11399 5365 4793 15702 -1214
23711 -1214 -35986 -16087 -17913 -23705 -3665 4672 -12868 -34712 -19673 -26343 -21827 -39325 -52837
23698 -52837 -65554 -70931 -35401 -35162 -22457 -5598 -1672 17595 -8772 -33626 -28691 -22670 -29873
23685 -29873 -16846 692 -7568 -9338 10382 43732 25084 -6251 -17926 -9227 10444 157
23673 157 -26139 -41539 -36831 -28812 -6443 20259 22385 7481 11834 11213 5906 -10617 -10351 -14936
23659a4936R630K1143m25N206N817j3657l5679j8163L61q16R438J3326q506m194
23645c1455J1626J2957K3183L1832m024l3163k5288Q762M92r839m2968o097K4430
23632c9552K4137L4326R818r107P244k8844j2382K475O692J2045J455M462J1300
23619B4069N568l041j5869m1659j9258j8883J1010K4874L054J0794J32J7224k051
23606d036n647L526l6K7389p529p798r108j2211k098p745K644J2965J0826J4890
23592A6032R286J4915o760j8179k9946k4868k2656p038J3382J0489K4001o758
23580b8100J2061L226K3096q86n826J1772k6104q065K4347J0982J3991o135j8931
23567E428j3941N391k974J408M632J5812L0957o598j7954j9127l3749J9437O201
$$ plain form
23659 -14936 -5306 15837 15412 20618 26435 12778 -22901 -41064 -40703 -41519 -32081 -18755 -27261 -31455
23645 -31455 -19829 -6872 16311 48143 44119 10956 -14332 -5570 -5078 -14917 -57885 -63982 -39552
23632 -39552 -15415 18911 28729 19622 26866 -1978 -14360 -11885 -5193 6852 8307 12769 24069
23619 24069 29637 26596 10727 -30932 -50190 -69073 -58063 -33189 -30135 -19341 -19209 -1985 -4036
23606 -4036 -9683 -6157 -6193 21196 13667 5869 -3239 -15450 -17548 -25293 -22649 -9684 1142 16032
23592 16032 25318 40233 33473 15294 -14652 -39520 -62176 -69214 -55832 -45343 -21342 -28100
23580 -28100 -16039 -12813 10283 9397 3571 15343 -10761 -18826 5521 16503 30494 24359 5428
23567 5428 -8513 -3122 -6096 -4688 -56 15756 46713 40115 22161 3034 -30715 -11278 -5077
23554e077K0785o80j9607M567J6926J6226m999J2629K560k568k2679m4080J201
23541b4796j132J3025L4402K9568J139k5707k9590m57j5796j9926K268j1635J0939
23528c7698R000J7420J0105J2212j047l2827R60j587R163Q680l314N758M789l644
23514b030j3973j5258J7317J9552J6231p970p05J9863k626l4871m20J8615j7808
23501d083j9573K317p899q562P256J6183k2862K7707M838l1688r328J4600p823
23488c8917J610p036K7400N013J4054O879k937l5159P957m284j4833K236J1461
23475b6556j2724k6777k8333L020M3544K6605N197P564r848O857L0235J183q312
23462A1655j5465j3392J3997J379k653J2760R270j705q639r997N915m537j4425
$$ plain form
23554 -5077 15708 15028 -4579 -12 16914 33140 28141 40770 43330 40762 18083 -25997 -24796
23541 -24796 -25928 -12903 21499 51067 52206 26499 -3091 -3548 -19344 -39270 -37002 -48637 -37698
23528 -37698 -28698 -11278 -1173 11039 9992 -22835 -21875 -23462 -14299 -5619 -8933 -3175 1614 -2030
23514 -2030 -16003 -31261 -13944 5608 21839 13869 13164 33027 30401 -4470 -4890 13725 -4083
23501 -4083 -23656 -21339 -29238 -37800 -30544 -14361 -37223 -9516 -4678 -36366 -45694 -31094 -38917
23488 -38917 -37307 -44343 -16943 -11930 2124 9003 6066 -29093 -21136 -25420 -40253 -38017 -26556
23475 -26556 -39280 -66057 -94390 -91370 -47826 -21221 -16024 -8460 -18308 -11451 18784 19967 11655
23462 11655 -3810 -17202 -3205 -1826 -4479 8281 17551 15846 7207 -2790 3125 -1412 -15837
23449a5837j771Q912l868J7449P24L987J3879L1987O177k4802k0437j2250K5165
23436B9315k755j086J248J0446R986j3929k7365k3812J2751r394q654k7109j5920
23423f6278J8871M187J4317k345J6012J7598M62J5675J7525l2461k5874n12Q685
23410a4138m652J5895m270l672Q724K5756o805l311m190J70M379N665j4376q484
23396c309k3162K3616L0883l800j3007k9725j1014K0722K3663J22j164j9909m045
23383a0129L5039J1975l997J0415j0211j141J7292j5761n665R570q494n752j5212
23370G929k9232K291J1176N983l0581l2225R823K2389L8o48L5257R790J3748q384
23356A7354J278j6331L399o109j2231k0946j0337O428L3265j13l4835j9499J5034
$$ plain form
23449 -15837 -17608 -8696 -12564 4885 5609 9596 23475 55462 61639 36837 16400 4150 29315
23436 29315 26560 25474 26722 37168 47154 33225 5860 -17952 -5201 -14595 -23249 -50358 -66278
23423 -66278 -47407 -43220 -28903 -31248 -15236 2362 2824 18499 36024 3563 -22311 -22823 -14138
23410 -14138 -18790 -2895 -7165 -10837 -2113 23643 16838 13527 9337 9507 13886 19551 5175 -3309
23396 -3309 -26471 -2855 28028 24228 11221 -18504 -29518 -8796 14867 14989 13825 -6084 -10129
23383 -10129 24910 36885 32888 43303 33092 31951 49243 33482 27817 37387 28893 23141 7929
23370 7929 -21303 -19012 -7836 -1853 -32434 -64659 -54836 -32447 -32409 -33057 2200 11990 25738 17354
23356 17354 18632 2301 5700 -409 -12640 -33586 -43923 -37495 -4230 -4343 -39178 -58677 -43643
23343d3643K0870J5204N092r358q956j6553R772k0418Q911J1332J1557J2032K582
23330a576k1650k888J7309j3041J0357M2124j5558j5803J8160q016j1820p056
23318i458k5391j2306o824L434L7129L1997n421j2289l730M809l4224k2051n189
23305e9514J4858k316j6163J0244L983O223p978K3218K1975J5747p214r295J5905
23292I673O537O509K675j3852n1503r54R585J1876J3838K7457K6672O344k8444
23279B6413j4987j1025M407J7055j848j0188j2372k178Q520R550k3519O097J3923
23266I848L478j1293l641k5806p350L0115K6542j0720j636o044Q571j0023J4002
23253A6043n367j7145o711k6116p847L982l200r70J1256j1876J3276J9972J0250
$$ plain form
23343 -43643 -22773 -7569 -2477 -11835 -20791 -37344 -27572 -47990 -39079 -27747 -16190 -4158 -1576
23330 -1576 -23226 -26114 -8805 -21846 -11489 30635 15077 -726 17434 9418 -2402 -9458
23318 -9458 -34849 -47155 -53979 -50545 -13416 18581 13160 871 -2859 1950 -32274 -54325 -59514
23305 -59514 -44656 -46972 -63135 -52891 -48908 -42685 -50663 -27445 -5470 10277 3063 -6232 9673
23292 9673 16210 22719 25394 11542 -39961 -40915 -31330 -19454 -5616 21841 48513 54857 26413
23279 26413 11426 401 4808 21863 20015 9827 -2545 -4723 3797 13347 -10172 -4075 9848
23266 9848 13326 2033 -1608 -27414 -34764 -4649 21893 11173 9537 3493 12064 2041 16043
23253 16043 10676 -6469 -13180 -39296 -47143 -43161 -46361 -47331 -36075 -47951 -34675 -14703 -4453
23240d453N495M517P242m90j7784k0928k892m800J6772n423K408J3395n779j9458
23226c2178m98k769p95l839K0223J9691P242L428J3946k4206O469J0338o713k1309
23212a0970K0812k5628K736J9137P871j677R741Q898k0802l796J3833j7533j4658
23199a2036L046j4740J0164L0090j9485N664K2376Q190k0467j6512j8884pK1994
23186f07j513j1457M945P198Q507p485J4105J369R724o171k5285l0491n706L370
23172c9497K7847p154K3239K288p837m3J7213J5384j6133j7141o532j2349K2534
23159A819J3823j0774k1950p902j501j0188M503O791j1573K7575k773J9272K0347
23146B7469k0j1913j21N634J319j408K838O758l481l249o208j4626m278j2777
$$ plain form
23240 -4453 1042 5559 12801 12311 -5473 -26401 -29293 -34093 -17321 -22744 -20336 -6941 -12720 -32178
23226 -32178 -32676 -35445 -36240 -40079 -19856 -165 7077 10505 24451 245 6714 17052 10339 -10970
23212 -10970 9842 -15786 -13050 6087 13958 12281 22022 30920 10118 6322 20155 2622 -12036
23199 -12036 -8990 -23730 -13566 16524 -2961 2703 25079 33269 12802 -3710 -22594 -22601 -607
23186 -607 -2120 -13577 -8632 -1434 7073 -412 13693 15062 24786 18615 -6670 -37161 -42867 -39497
23172 -39497 -11650 -18804 4435 6723 -1114 -1157 16056 31440 15307 -1834 -8366 -20715 1819
23159 1819 15642 4868 -17082 -24984 -26485 -36673 -32170 -25379 -36952 -9377 -12150 7122 27469
23146 27469 27449 15536 15415 21049 22368 20960 23798 30556 27075 23826 17618 2992 -1286 -14063
23132a4063q927j7803P308J7674o958Q25N2698k714k2614K1662q123l4865J2508
23119c392J1227M8077J6475j4298l2305l4935j2283j8711O635K3107L6575r594
23107A6578p818K3275L58p206L2420L0356J337J154J7315J4015K0796O4565M8657
23094B55802M3818J25268K07310L07829M26228L79179J31412j50670l07931k68456
23084A149789j03124J08534L04396L40072J64246j82256l54026l51979l10844
23075G64808k14976j28685q4434m9448m0386m6775l7483m383L724j8336k496n88
23063A40542o20k5265J5590J294k8324K693Q374J932l0090l46k6140j7112j5897
23050B6631j244K9713J4944k5245j0049j1125R553K4085j284Q460J696J8022j2627
$$ plain form
23132 -14063 -22990 -40793 -33485 -15811 -22769 -21944 30754 28040 5426 27088 18965 -15900 -3392
23119 -3392 7835 55912 72387 58089 25784 -9151 -21434 -40145 -33510 -10403 26172 16578
23107 16578 8760 32035 32393 25187 57607 87963 89300 90454 107769 121784 142580 207145 255802
23094 255802 299620 424888 632198 940027 1366255 1745434 1876846 1726176 1418245 1149789
23084 1149789 1046665 1155199 1459595 1799667 1963913 1781657 1427631 1075652 764808
23075 764808 549832 421147 336713 287265 246879 200104 162621 158238 161962 143626 141130 140542
23063 140542 139922 114657 130247 131541 103217 105910 114284 116216 86126 85780 59640 42528 26631
23050 26631 25387 55100 70044 44799 34750 23625 33178 57263 55979 64439 66135 84157 71530
23037G1530o836j7754k5098n933j4882K658J5535J2700q605m802O544n573R066
23024B8550Q983Q45J6255j5463k4752p46p145M699K4319J3744j0621l411M959
23011D0216l98K5194p13n925j1494K1714j0814k8858p195R093k8158j3567J1646
22998G41J0169J1950j9566k6915j7086J4428N836O951J2987j3168k2911o684p626
22985e0894K8900J0224J8659j5938M868M3790J9187j8931k6764k0935k273n587
22973a5694J1341k732j0276m677R777J4709J7015k9209j0584K8305Q654O526j7855
22960E300j5419n239L1699K863l5268k3900K4898R605J132j6735k5422J0533J9948
22947a6005p43j5024n656J4463J1962M325N812k445Q786J1471l854K5623K0268
$$ plain form
23037 71530 64694 46940 21842 15909 1027 3685 19220 31920 23315 18513 25057 19484 28550
23024 28550 37533 38378 54633 39170 14418 13672 6527 11226 35545 49289 38668 35257 40216
23011 40216 39818 65012 64299 58374 46880 68594 57780 28922 21727 30820 2662 -10905 741
22998 741 10910 22860 3294 -23621 -40707 -26279 -20443 -13492 -505 -13673 -36584 -43268 -50894
22985 -50894 -21994 -11770 6889 -9049 -4181 39609 58796 39865 13101 -7834 -10107 -15694
22973 -15694 -4353 -7085 -17361 -22038 -12261 2448 19463 -9746 -20330 7975 16629 23155 5300
22960 5300 -10119 -15358 16341 19204 -16064 -39964 -15066 -5461 -4329 -21064 -46486 -35953 -16005
22947 -16005 -16748 -31772 -37428 -22965 -11003 -6678 -866 -3311 5475 16946 13092 38715 58983
22934E8983j8557k5166q661o654Q547j5971N978j488K44j8375J7216k141l122
22921i167n81R825o358j0194J6391q805k677K7323J1175N561j8912j3761P009
22908F829k5281R187K1044J0866N995k3941r236J6167J0350k3682j0668K0380
22896H010J91o62o228K114J2397J204j1058j7084K5952m995k3314o289J7134M576
22882A948O182n571J600l4617J5825L0862m426K1096L1780j7087k5673j0101K9139
22869D0957K2124j9475l3836K4607J2963j2491m671J0471j885k735M95O294o381
22856C6437N64L1552m12k8993j6157p25R305j4284J549K882J3367K3740j58j4466
22842D4201m4662j3998P743J877j9580r159j4751M233J9246K6303j550k8126k250
$$ plain form
22934 58983 40426 15260 6599 -55 8492 -7479 -1501 -2989 -2745 -21120 -3904 -6045 -9167
22921 -9167 -9748 77 -6281 -16475 -84 -8889 -11566 15757 26932 32493 13581 -180 6829
22908 6829 -18452 -9265 11779 22645 28640 4699 -4537 11630 21980 -1702 -12370 8010
22896 8010 8201 7539 1311 3425 15822 17026 5968 -11116 14836 9841 -13473 -19762 -2628 1948
22882 1948 8130 2559 4159 -30458 -14633 16229 11803 32899 64679 47592 21919 11818 40957
22869 40957 63081 43606 9770 34377 47340 34849 30178 40649 38764 36029 36524 42818 36437
22856 36437 37001 68553 68141 39148 22991 22266 31571 17287 18836 21718 35085 58825 58667 44201
22842 44201 -461 -14459 -6716 -4839 -24419 -33578 -48329 -44096 -24850 1453 -97 -28223 -30473
22829c0473J426J7558N902k0203K2715L7628N4691M9565O9541j0644n0944r175
22817A37587q387j8434L839N7763O1154J9057N344p9294q6230l1287K256R980
22805G3348j6304K843K0944L494M57l135O748k5662p360J9299k5219p841K3226
22792F4838K0531Q168J9646J5403l761j4053J1551J4080M934L7468L9485j829
22780B16461k8316m1518k9136j4988M5351K7793J9988o731k1033j3559j0328J4533
22768A58517M3630N8508M3352Q1572M5557k8221p7847m5451O124L4336K0587K6150
22756C66814J4870l1429m1363l4061m3148k5911k3498m1334m9496j3831J497J7970
22744I7080J467m497J618J6441P927j0248m890k2439P011J1878N644P577r62J3540
$$ plain form
22829 -30473 -29047 -11489 -5587 -25790 -3075 34553 89244 138809 208350 197706 146762 137587
22817 137587 129200 110766 114605 172368 233522 252579 257923 178629 92399 61112 63368 73348
22805 73348 57044 59887 80831 84325 84782 81647 88395 62733 55373 74672 49453 41612 64838
22792 64838 85369 93537 113183 128586 124825 110772 122323 136403 141337 178805 218290 216461
22780 216461 188145 146627 117491 102503 147854 175647 195635 188904 167871 154312 143984 158517
22768 158517 202147 260655 304007 385579 431136 402915 325068 279617 285741 320077 340664 366814
22756 366814 381684 350255 308892 274831 231683 205772 182274 140940 91444 77613 79110 97080
22744 97080 98547 94050 95668 112109 120036 109788 104898 82459 89470 101348 106992 114569 113607 127147
22730A27147o748k1333k8202L186R725Q280O75j8673o855K8794N445K2514o65
22717A23290o369j7167k5251k889J56j5535n256M213N274J1654N23j5981l7592
22704A9070M628M0392M8988k5175k9894J2433P7211N3847M1671J700k9068R034
22692B24837L2592J9804J8738M0773J9368l5267l2453l4474n44K700j0311Q19
22680B46582k1346m5781o7164j8858P423K7606K3979P961Q664m279r271k746j8088
22667A34682L04J2478M085L1020K4219K5381J0726q885p574j7948m2814j6176
22655A49498Q542K2112J7959M492P699K2915K064K8381M6335K8091L186M9100
22643C90374M1954L3582N2660J02064P1046J4341o1686l8391R534K8191L1040
$$ plain form
22730 127147 120399 99066 70864 74050 83775 92055 92730 74057 67202 95996 101441 123955 123290
22717 123290 116921 99754 74503 71614 71770 56235 50979 55192 60466 72120 72643 56662 19070
22704 19070 23698 64090 113078 87903 58009 70442 147653 201500 243171 244871 215803 224837
22692 224837 257429 277233 295971 336744 356112 320845 288392 253918 253374 256074 245763 246582
22680 246582 225236 179455 112291 93433 100856 128462 152441 160402 169066 164787 155516 152770 134682
22667 134682 134986 147464 151549 182569 206788 232169 242895 234010 226436 208488 165674 149498
22655 149498 158040 180152 198111 202603 210302 233217 235281 263662 309997 338088 341274 390374
22643 390374 432328 465910 518570 620634 691680 706021 644335 605944 615478 643669 674709
22632F74709K1903L1483R985o3319m8835m7659l6608J05P036J7782J3661K8452
22620F08695O1096J20467K07108K81591M06925M66041K36918j45819k78205k68521
22610A696296j31447J02056K77962L78150K64705j51316l74599m08379l50751
22601A302677k06765r8760n0185l2787m2040l6552j7653m841N224J7311J2076
22590H47705J6081N895l5269j2614J9007L1230K1591R053K4066J1005J1094K80
22578I49124K7660L0587L9122P043K1935K7337l0957L2611Q2501P5159P7197O9204
22566A408523P1736L5139J6055K7072Q8278J06266O8197M3059O6886M8291Q5568
22555B065070Q6479J03472R9088R7545Q7048J29495J28787J68517K00622K20383
$$ plain form
22632 674709 696612 728095 738080 674761 625926 578267 541659 541764 548800 566582 580243 608695
22620 608695 669791 790258 997366 1278957 1685882 2151923 2388841 2243022 1964817 1696296
22610 1696296 1564849 1666905 1944867 2323017 2587722 2436406 2061807 1653428 1302677
22601 1302677 1095912 997152 946967 914180 872140 835588 817935 813094 818318 835629 847705
22590 847705 863786 869681 834412 821798 840805 872035 893626 902679 926745 937750 948844 949124
22578 949124 976784 1007371 1046493 1053536 1075471 1102808 1071851 1104462 1186963 1262122 1339319 1408523
22566 1408523 1480259 1515398 1531453 1558525 1646803 1753069 1821266 1864325 1931211 1979502 2065070
22555 2065070 2151549 2255021 2354109 2451654 2538702 2668197 2796984 2965501 3166123 3386506
22545C386506K19924K29792K26455K38384K70826K92006L04057K93941L19794
22536E781685M02305N16834N19444N55218O13519O32198P10124Q05206R35291
22527A1471824J140480J404810J824474K256795K743209L306926M139788N347572
22519C3635878P275512J0817721J8196160L3587467N8054980P9694014P9308993
22512C20570725L2640778l1775652n6073416n1607595k3881706J6000291N1729763
22505B57603188O7129948M2744178k5479430o4755370p1678827n9420549l8955936
22498A07187202k4221965j5664224j0754752p858991n897519m276763l144135
22491C5368853k646156k423710k228972k013413j809921j594786j429293j299153
$$ plain form
22545 3386506 3606430 3836222 4062677 4301061 4571887 4863893 5167950 5461891 5781685
22536 5781685 6183990 6700824 7220268 7775486 8389005 9021203 9731327 10536533 11471824
22527 11471824 12612304 14017114 15841588 18098383 20841592 24148518 28288306 33635878
22519 33635878 40911390 51729111 69925271 103512738 161567718 241261732 320570725
22512 320570725 353211503 321435851 265362435 213754840 189873134 205873425 257603188
22505 257603188 324733136 367477314 341997884 277242514 205563687 146143138 107187202
22498 107187202 82965237 67301013 56546261 48687270 42789751 38512988 35368853
22491 35368853 32722697 30298987 28070015 26056602 24246681 22651895 21222602 19923449
22483A9923449j114554r52113q10651p48713p22441p12513o92518o12882n39302
22474A3017762m81222m37141l84934l81062l98817l67564l22310l12951l12790
22465I618971l39590l62526k96049k51476k63183k70916k65125k41383k27943
22456G100780k32128j83597j73300j93540k24961k22508k02053j85166j43858
22447E339669j25702j20576r5360j38890j61767j03681q4422j37899j07393j01908
22437D162071j11518j16860q5791n8713o3390r3194p5816o8966p2200q5133p3383
22426C257107q0545p5347o4167n3261k9199n5212p4506m0913k2761m779j5963
22415B740454k1774M5646J32428K74203L72715L68020J30520k05539l41493l47764
$$ plain form
22483 19923449 18808895 17856782 17046131 16297418 15574977 14862464 14169946 13557064 13017762
22474 13017762 12536540 12099399 11714465 11333403 10934586 10567022 10244712 9931761 9618971
22465 9618971 9279381 8916855 8620806 8369330 8106147 7835231 7570106 7328723 7100780
22456 7100780 6868652 6685055 6511755 6318215 6093254 5870746 5668693 5483527 5339669
22447 5339669 5213967 5093391 4998031 4859141 4697374 4593693 4509271 4371372 4263979 4162071
22437 4162071 4050553 3933693 3847902 3789189 3725799 3632605 3556789 3487823 3415623 3330490 3257107
22426 3257107 3176562 3101215 3037048 2983787 2954588 2899376 2824870 2783957 2761196 2756417 2740454
22415 2740454 2718680 2764326 2896754 3170957 3543672 3911692 4042212 3836673 3495180 3147416
22405C147416j99440Q0065K58418L68644K06770k17281l91390m07325l41293k35630
22395B268954j35953r8313j02351o9543j0644n669n693q577O513n3215j34762
22384A650747j06797l9925j6387m182L6678J2645J5224m2277r3782o5036o0885
22373A286023m0069m0898n3890n3404n1011j6301l3878j1635J3131j792j012M555
22361I99819J0310l2996j1424n7682p6207l4493M198J7136K2812M597k6519l4034
22349G85517j5171k1508j6975k7591m7372l241Q668p086J1054J8264o881l2128
22337F45550n8977o5248l4515k6645k11M054l2998m9641j6119j0488j2053P365
22325C50074M3610K5441K5642q329J3564K313j0667L924L2124L8998J7868k041
$$ plain form
22405 3147416 2947976 3028041 3286459 3655103 3861873 3644592 3253202 2845877 2504584 2268954
22395 2268954 2133001 2034688 1932337 1862794 1852150 1846481 1840788 1832211 1838724 1785509 1650747
22384 1650747 1543950 1504025 1487638 1483456 1520134 1532779 1548003 1505726 1411944 1346908 1286023
22373 1286023 1245954 1205056 1151166 1097762 1046751 1030450 996572 984937 998068 996276 995264 999819
22361 999819 1010129 977133 965709 908027 831820 797327 801525 818661 841473 846070 819551 785517
22349 785517 770346 748838 731863 704272 656900 653659 662327 655241 666295 684559 677678 645550
22337 645550 586573 521325 486810 460165 459954 464008 431010 381369 365250 354762 342709 350074
22325 350074 393684 419125 444767 436438 450002 452315 441648 445572 477696 516694 534562 532521
22313E32521j076J6962j4004l9869m0526k1305j4887j1558l4319m0166O134L175
22301C41082m724J8704k2129r831r824m3941k0270L5332j178j5650k7003j2202
22289B28366L1262J7931K0136k1576k3547j88J4471j1372j3136j2816L820K239
22277B35590L583J7276K5210J0502r942J2548Q555M514p108R179q82j2858O287
22264C02454j5124J1500K4920O677L6489j4869N375j338j9352m6516n723K2369
22252C06862J7989K229k0325K8141J1754J4336L543K2737J9402K2724j3158M280
22240D20514O928n409K1449L6629N509K615M4892M1635K5019M2404N0756L6620
22228G29561N8896R9928J20024J46792K18650K17992K44715L79606N57306R05657
$$ plain form
22313 532521 531445 548407 534403 494534 454008 432703 417816 406258 371939 331773 337907 341082
22301 341082 336358 355062 332933 323102 313278 269337 249067 284399 283221 267571 240568 228366
22289 228366 259628 277559 297695 276119 252572 252384 266855 255483 242347 229531 233351 235590
22277 235590 239173 256449 281659 292161 282219 294767 303322 307836 300728 309907 309025 296167 302454
22264 302454 287330 298830 323750 330427 366916 352047 357422 356084 336732 290216 284493 306862
22252 306862 324851 327080 306755 334896 346650 360986 364529 387266 406668 429392 416234 420514
22240 420514 427442 422033 443482 480111 485620 488235 533127 574762 599781 642185 692941 729561
22228 729561 788457 888385 1008409 1155201 1373851 1591843 1836558 2216164 2773470 3679127
22218C679127J686396K870871M031145M287781K387941r08231k732148k816953
22210A2485929j557663N01923K443326L388015K316794q57051l289321l835203
22202A1596749l262421k249145j419623r24152o26345m74899l49107k33107j61310
22193A896640r1696j04210r3284q7802p7316p4038q4807r2951q7151l2748n4454
22182A016183n0242m7598k3883n780j9499k7784l0989k9708l2809m4782o1904
22171F41205k2645j7601k4939o99j1570J069j0006m5534r186P838j2144k5279
22159D70509m5972l9274J0056r603O481p514O311k9291n531j0976J2368Q728j4319
22146C51973j8234K219K859j3055l240n668j9577j7941J437k6310l2030N27J4262
$$ plain form
22218 3679127 5365523 8236394 12267539 16555320 18943261 18035030 15302882 12485929
22210 12485929 10928266 11430189 13873515 17261530 19578324 18721273 15431952 11596749
22202 11596749 8334328 6085183 4665560 3741408 3115063 2640164 2291057 2057950 1896640
22193 1896640 1804944 1700734 1607450 1519648 1442332 1368294 1283487 1190536 1103385 1070637 1016183
22182 1016183 965941 918343 894460 888680 869181 841397 810408 780700 747891 703109 641205
22171 641205 618560 600959 576020 575321 563751 564820 554814 509280 500094 507932 495788 470509
22159 470509 424537 385263 395319 385716 392197 384683 390994 361703 356172 345196 357564 366292 351973
22146 351973 333739 335958 338817 325762 322522 316854 297277 279336 280773 254463 222433 222960 237222
22133B37222n24n77N504j0827J8111j2875k9735k37j5444r940O17l372J8448L598
22119A99969j1418p629P440L186l162l3962P196L5188J0169M66m584L458q628
22106A97689J9019J4679p226k6092l7821O505L3723O2871K2563j6046j5933l6578
22094B17353j1150J7108n251l131J9354j2021o662K7793L2023J7582p086P393
22082B93305K2742M4377Q5059P6321P4412J23394J91969L26105O22009J048863
22072B908556J416472J506266Q51173l77571j189132j358911j144881p62055m50437
22063A399480k71967k29617j76236j05010n5389n1291j9307j8614m7342n6981
22053C67726l2248j4351l4146j3254Q86J1123K0007j3461n482k2268j0574P45
$$ plain form
22133 237222 236698 236121 241625 230798 248909 236034 206299 206062 190618 180678 181295 177923 196371 199969
22119 199969 188551 180922 188362 191548 188386 154424 161620 196808 206977 207443 202859 206317 197689
22106 197689 216708 231387 224161 198069 160248 166753 200476 263347 285910 269864 253931 217353
22094 217353 206203 223311 218060 214929 234283 222262 215600 243393 275416 292998 285912 293305
22082 293305 316047 360424 445483 521804 596216 719610 911579 1237684 1859693 2908556
22072 2908556 4325028 5831294 6682467 6304896 5115764 3756853 2611972 1849917 1399480
22063 1399480 1127513 897896 721660 616650 561261 509970 490663 472049 424707 367726
22053 367726 335478 321127 286981 273727 274613 285736 305743 292282 286800 264532 253958 254703
22041B54703j1533m226K7191K0432L2368N814k6050n3340k9997k1186k5992j4638
22029A53546Q938J6017j5751Q223K0567L27N771m069n932q162j5615j0274p874
22016A45712j0974n526j5503L314j0616l765j0592m655J0420J6192J9151j4876
22004A18282l2545Q707J6735N278j2651k7753J2443K0039j2396R032J596l1549
21992G5218l2280l1507Q865J3799o359J8212M598j2507l834J7396J3884l7922
21980B7563m877K9148J9604Q414J1552L353j1150j8367k3452j406K4524q68k3536
21967D0502J47J4405j336K5437J3844J5215j2182m3577J418l3071J1952K0807
21955E3561M962m738l0947j4907J2044L7306L3215j7981q929K952J5305j276L6644
$$ plain form
22041 254703 243170 238944 266135 286567 318935 324749 298699 245359 215362 194176 168184 153546
22029 153546 162484 178501 162750 170973 191540 191867 197638 193569 187637 179475 163860 153586 145712
22016 145712 134738 129212 113709 117023 106407 102642 92050 87395 97815 114007 133158 118282
22004 118282 85737 94444 111179 116457 103806 76053 88496 108535 96139 105171 106767 75218
21992 75218 42938 11431 20296 34095 27736 45948 50546 38039 34205 51601 65485 27563
21980 27563 22686 51834 71438 79852 91404 94757 83607 65240 41788 40382 64906 64038 40502
21967 40502 40649 55054 53718 79155 92999 108214 96032 52455 53873 20802 32754 53561
21955 53561 58523 53785 22838 7931 19975 57281 90496 72515 63586 66538 81843 80567 117211
21942A17211K2999J6325J5463p488j5865K1428L2735L4261L0022O1061Q5498J61188
21930E74838K38070L53387M23758K99074m1627k70651k69766j56270l934J96277
21920A343156L08355K62220k3974l22587m13281l26609k36363j37750q9461n3154
21910C10552l1373k1950k1529k5445k4370J5244o632r440l2815r077J9657j9918
21898A42904M933Q940j1992k4608q851p201j4535P322j1855r343P511k609j5073
21885F5543K464J804j2647j4646O28P409j7276k747J6694N8849J981l2078K0173
21872I6151p108j7600n607k3580j3159J7716K650k8958j9873K0479O822L5260
21860F3193j8258k0713l142M289J435n245q02J0356K8379M938j4657j5081J2375
$$ plain form
21942 117211 140210 156535 171998 164510 148645 170073 202808 237069 267091 328152 413650 574838
21930 574838 812908 1166295 1590053 1889127 1847500 1576849 1307083 1150813 1146879 1343156
21920 1343156 1651511 1913731 1889757 1567170 1153889 827280 590917 453167 363706 310552
21910 310552 279179 257229 235700 210255 185885 201129 194497 185057 152242 143165 162822 142904
21898 142904 147837 156777 144785 120177 111326 104125 89590 96912 85057 75714 83225 80616 65543
21885 65543 68007 69811 57164 42518 43146 50555 33279 30532 47226 106075 108056 75978 96151
21872 96151 89043 71443 65836 42256 29097 46813 49463 20505 632 21111 27933 63193
21860 63193 44935 24222 21080 25369 26804 21559 20757 31113 59492 64430 49773 34692 47067
21847D7067L044j1344L392m556j7482m16j0977J4913j5048j4802k048J639L200
21834c418L522O142J2620J940q477J3328K1756k346J4198p256l3505j773R965
21821B6696R841K6066J3229k8449N328L116k2323j7736j274m644m19j3528r342
21808a3439R848K3582K7357l3716k2987R057j877P192m093k9796M540R475l976
21795a8833j0245J2504J6262K0374O464j802l677j5747k1782Q292K4669K52j6835
21782a04k1266M581L0723m431k9371o288j3950J2900K0107J9641j3041q435q049
21769a6983k2092k2544p926Q408R638K6571n938n0101J2887M7650K0771L563J6199
21756B0103o68J9357J0133q38q523m058j6256k3349K571k4019N608J8234j4830
$$ plain form
21847 47067 50111 38767 42159 37603 20121 19705 8728 23641 8593 -6209 -8257 -6618 -3418
21834 -3418 104 6246 18866 20806 12329 25657 47413 45067 59265 52009 18504 16731 26696
21821 26696 36537 62603 75832 47383 52711 55827 33504 15768 14494 9850 9431 -4097 -13439
21808 -13439 -3591 19991 47348 13632 -9355 -298 -2175 5017 924 -28872 -24332 -14857 -18833
21795 -18833 -29078 -16574 -312 20062 26526 24724 21047 5300 -16482 -8190 16479 16731 -104
21782 -104 -21370 -16789 13934 9503 -19868 -26156 -40106 -27206 -7099 12542 -499 -8934 -16983
21769 -16983 -39075 -61619 -69545 -61137 -51499 -24928 -30866 -80967 -68080 -20430 341 3904 20103
21756 20103 19435 38792 48925 48087 39564 35506 19250 -4099 -1528 -25547 -19939 -1705 -16535
21743a6535Q060n423j3112m494O396Q888j4832Q107N407J1759j872m09n85Q073
21729e72n860j6743J7508J5742q109Q412j825L009K0340Q785j4519j2629k5402
21716a1863j664M338k7773j494J5088J1585j6868K7335O375p004j155j2219o289
21703b1608j5422k589j1759J5314J8897Q226J2706J1365K902R969k3741j9144
21691a4884Q526k222j1245J777m938K810j2674j550K8558J8473j6854k8512J3432
21678a9303J7181o552K388M696K0393j2512l5137P437N0508R223r794j9332Q410
21665A7606J5268l848J5j1873J0426J2221Q538l8813r112J0348j3294j8711L954
21652a7275k2538K4456K7046r271p51K5549R276J9181j2666j1111Q255N1375q089
$$ plain form
21743 -16535 -8475 -13898 -27010 -31504 -25108 -16220 -31052 -22945 -17538 -5779 -7651 -8060 -8645 -572
21729 -572 -6432 -23175 -5667 10075 1966 10378 8553 11562 31902 40687 26168 13539 -11863
21716 -11863 -13527 -9189 -36962 -38456 -23368 -11783 -28651 -1316 5059 -1945 -3100 -15319 -21608
21703 -21608 -37030 -39619 -51378 -36064 -17167 -8941 3765 15130 18032 28001 4260 -14884
21691 -14884 -6358 -8580 -19825 -18048 -22986 -20176 -32850 -34400 -5842 12631 -4223 -32735 -19303
21678 -19303 -2122 -8674 -6286 -1590 18803 6291 -28846 -21409 29099 38322 28528 9196 17606
21665 17606 32874 29026 29041 17168 27594 39815 48353 9540 428 10776 -2518 -21229 -17275
21652 -17275 -39813 -15357 11689 2418 1667 27216 36492 55673 43007 31896 40151 91526 83437
21639H3437k663L1575J5264k0482l5010J3126j3825j3053J0512J7616J3172J9354
21627A19023k2641k5545l6235k5714N186j2908k057J2257K6768Q517q638j166
21615C6847L391R77j6364j7816j5151M257O619l939q740N666k1539k2329k421
21602e0542K3417J1742J6128j8032J4366J0039j6441J686r601M108M3300K590
21590C2760l1101J2177K0611j7495l5442j0580J1344J8966J0692J9904j8858k3022
21578a0044P180q125L65M947L8549j7881k4372K2611O793m395J077j57q105p972
21564D71o958j3448j6214j899N138J2592O33M831J3870k225K0401L403k0558R641
21550I678J5192J553L724j9221j4265P584j6356J7925K1676k5648m908k2469J6610
$$ plain form
21639 83437 80774 112349 127613 107131 72121 85247 71422 58369 68881 86497 99669 119023
21627 119023 96382 70837 34602 8888 14074 1166 -891 11366 38134 46651 38013 36847
21615 36847 40238 41215 24851 7035 -8116 -3859 2760 -1179 -9919 -4253 -25792 -48121 -50542
21602 -50542 -27125 -15383 745 -17287 -2921 7118 -9323 -7637 -17238 -13130 30170 32760
21590 32760 1659 13836 34447 16952 -18490 -29070 -17726 1240 11932 31836 12978 -10044
21578 -10044 -2864 -10989 -10624 -5677 32872 14991 -9381 13230 20023 15628 16705 16548 8443 471
21564 471 -6487 -19935 -36149 -38048 -32910 -20318 -19685 -14854 -984 -3209 17192 20595 37 9678
21550 9678 24870 26423 30147 10926 -3339 4245 -12111 5814 27490 1842 -3066 -25535 -8925
21537h925o881j7056J5683L68K0424J2349o396r368j341j3817p62K865P643L562
21523a652o725J7761J8448O737j2942o929j9139l35J3415N393J6770O766k1107
21510A6461k6005l3167J8013K9541J777K0489o520O536p936J0022L877J0957J6229
21497F0274Q848l4904j8942Q406J1955l6940k7355m271J7190J4343r41J0382J0611
21484A8656p198M2147J9493q880j7770k2340K754j7283j0581K697j563J7383L7582
21471E5097l278j6674l5267k8548n85l414j1857M689O4238L0538m410j2103k222
21458C6204q369L186k531k1675L911K799l513p088K5463M471n725O184n26k349
21444C0442n078j6192j8228O601r520J6218J3338j1165q216j1063N448K7919M646
$$ plain form
21537 -8925 -15806 -32862 -17179 -16811 3613 15962 9566 198 -1143 -14960 -15722 -12857 -5214 -1652
21523 -1652 -8377 9384 27832 34569 21627 14698 -4441 -4776 8639 14032 30802 37568 16461
21510 16461 -9544 -42711 -24698 4843 6620 27109 20589 27125 19189 29211 33088 44045 60274
21497 60274 69122 34218 15276 23682 35637 -1303 -28658 -32929 -15739 -1396 -2337 8045 18656
21484 18656 11458 53605 73098 64218 46448 24108 26862 9579 -1002 1695 132 17515 55097
21471 55097 51819 35145 -122 -28670 -29255 -32669 -44526 -39837 24401 54939 50529 38426 36204
21458 36204 27835 31021 28490 6815 10726 13525 10012 2924 28387 32858 27133 33317 32791 30442
21444 30442 25364 9172 -9056 -2455 -11975 4243 17581 6416 -1800 -12863 -7415 20504 25150
21431B5150J0163j0886k0735j9062l0662j8804L6562j920O546K3445J6862Q540
21419B5199l2931n420J6655j4020M496P973O389m5665k5474K2455L9730J2399
21407A1786j1662N053o700L196P436m412o680K8335J018r378j6034l5599l5713
21394f9354j5310K3921M0198J2679l031j7730N771M0658J5480k3026j5800R122
21382C578n776L216k456k2678J1652K3910J3837j3126j8158j3356K0058J9544
21370B0245J463n626N309J7574l188k1280R401j649K2368m828j3326k110K1932
21357D6285k2277k2748j0670K290k150n313p012k3418l0444k096J7008L0023r833
21344d0355R504L2266J2282J666j7447q115K1619j6850M353p285n056m645R131
$$ plain form
21431 25150 35313 24427 3692 -15370 -46032 -64836 -28274 -30194 -23648 -203 16659 25199
21419 25199 -7732 -13152 3503 -10517 -6021 1952 8341 -37324 -62798 -40343 -613 11786
21407 11786 124 5177 -1523 1673 9109 4697 -1983 26352 27370 17992 1958 -33641 -69354
21394 -69354 -84664 -60743 -20545 -7866 -10897 -28627 -22856 17802 33282 10256 -5544 3578
21382 3578 -2198 1018 -1438 -24116 -12464 11446 25283 12157 -6001 -19357 701 20245
21370 20245 21708 16082 21391 38965 35777 14497 23898 22249 44617 39789 26463 24353 46285
21357 46285 24008 1260 -9410 -7120 -9270 -14583 -21595 -45013 -75457 -77553 -60545 -30522 -40355
21344 -40355 -30851 1415 13697 15363 -2084 -10199 11420 -5430 -1077 -8362 -13418 -18063 -8932
21331h932J2855j6891R345j8470Q232J2719L249j8729l354J7058M442o289j0031
21318a4796m429j2330j4063K8789J5990J2972K3239R534j7701o361q023m156L194
21305A1859N152J8077J27l3060k1935J6263J6992l400l804J9624p281J7467j5380
21292B0701j0471k928M139J4419j94P297J294k3196l4557j7147J1577j6989O701
21279c9354J0074N524k79J2270j2283J962n39J5711L5047J5743J3643j6816m2514
21266a811o277j4592N806j541J5196J2406M748M898K297j9062k1581O011J4269
21253G67j9016k8307K6749L1833r745O470J83j5519J0763L487l6541M953P801
21240a6122o239K344K3717K335j5614j27j1394O313J2202J0705r603j4034J3303
$$ plain form
21331 -8932 3923 -12968 -3623 -22093 -13861 -1142 2107 -16622 -19976 -2918 1524 -4765 -14796
21318 -14796 -19225 -31555 -45618 -16829 -839 12133 35372 44906 27205 20844 12821 8665 11859
21305 11859 17011 35088 35215 2155 -19780 -3517 13475 10075 6271 25895 18614 36081 20701
21292 20701 10230 7302 11441 25860 25666 32963 34257 11061 -23496 -40643 -29066 -46055 -39354
21279 -39354 -29280 -23756 -24035 -11765 -24048 -22086 -22625 -6914 28133 43876 57519 40703 -1811
21266 -1811 -8088 -22680 -16874 -18415 -3219 9187 13935 18833 21130 2068 -19513 -13502 767
21253 767 -18249 -46556 -19807 12026 2281 8751 8934 -6585 4178 7665 -28876 -23923 -16122
21240 -16122 -22361 -20017 3700 6035 -9579 -9706 -21100 -14787 -2585 8120 -1483 -15517 -2214
21227b214K0489k335q993K71m204j3825K3412J3784K7591J502l6231r624j0382
21214g59J6612q636j3335J137R992j564L903j3056l3285J5680K3530L656J2939
21201A6814j4684j2057L364P808j4913j6624K5808L912Q460j279j0420l821L4047
21188B6415J3578n390j7195j7679j918k921j3931l0654Q73R204J0134J0333K34
21175a8917k0892p728J6441J8139l175q890J0545j1441p920J5261J9761p60j1194
21162a0770K5217M1367l084j8290j2081l8702k0306K4794J0270j8842M080N420
21150a0927m500j3658K2405l117Q124O916p614J3716j9916j2507n30j2296r069
21137d2973r159j690L1888L0597k51j3974j3791J2020j0546j8491J3819J6376
$$ plain form
21227 -2214 18275 15940 6947 7218 3014 -10811 12601 26385 53976 55478 19247 9623 -759
21214 -759 15853 7217 -6118 -4981 5011 3447 7350 -5706 -38991 -23311 219 3875 16814
21201 16814 2130 -9927 -6563 1245 -13668 -30292 -4484 -572 7888 6609 -3811 -7632 26415
21188 26415 39993 34603 17408 -271 -2189 -5110 -19041 -49695 -48822 -39618 -29484 -19151 -18917
21175 -18917 -39809 -47537 -31096 -12957 -16132 -25022 -14477 -25918 -33838 -18577 1184 424 -10770
21162 -10770 14447 55814 52730 34440 22359 -16343 -36649 -11855 -1585 -20427 -16347 -10927
21150 -10927 -15427 -29085 -6680 -9797 -1673 5243 -2371 11345 -8571 -21078 -21608 -33904 -42973
21137 -42973 -52132 -53822 -21934 8663 8412 -5562 -19353 -7333 -17879 -36370 -22551 -6175
21125f175q557j5924r944o953K8346p188R885K645j0350J8324l0812j6563K0494
21112c2772K4881m4685k4217K2740K0703J5806K082n821O90k5816j6572J4972
21100d8009J2945K0465N335J4347l2118j2427K5080L1375K136M649r180j6716
21088b118j0729j0795j6602j9639j0329J6234J8218J9664K2341M6970r15J9122
21076G1422j7995j4076k047O547k7921j8846M162K0480j0304J1778N649j6805
21064A2044n766M429K5887r69O942J1301O026k1378l2273j2392l00m542p885q078
21050b6954L609j7385p577p0M982L8438J4061J6507M490j0877M664j7197L042
21037I733k652j7634J0580r503j0975L968J696K0637L144l6995m2298J9440K3123
$$ plain form
21125 -6175 -14732 -30656 -40600 -47553 -19207 -26395 -16510 -13865 -24215 -5891 -36703 -53266 -32772
21112 -32772 -7891 -52576 -76793 -54053 -33350 -17544 -15462 -21283 -20593 -46409 -62981 -48009
21100 -48009 -35064 -14599 -9264 5083 -27035 -39462 -14382 16993 19129 23778 14598 -2118
21088 -2118 -12847 -23642 -40244 -59883 -70212 -53978 -35760 -16096 6245 53215 52300 71422
21076 71422 53427 39351 37304 43851 15930 -2916 1246 21726 11422 23200 28849 12044
21064 12044 6278 10707 36594 35625 42567 53868 59894 38516 6243 -6149 -6449 -10991 -18876 -26954
21050 -26954 -23345 -40730 -48307 -48377 -43395 -4957 9104 25611 30101 19224 23888 6691 9733
21037 9733 7081 -10553 27 -9476 -20451 -16483 -14787 5850 8994 -28001 -70299 -50859 -27736
21024b7736J5052J5558q823P614P707j9411Q432J3625K6278r3j3177n147k906
21011A6973J7095j2059j4821m090q198j3758o370P486p276l448N214k755j0999
20998c7006m622J5662N256k4788N2O665K2678j2971j8721O066K3239J591l2484
20985d9383j2384J5999K1920K4808K496K811j5697k783k442m1533j7997K1930
20973e2255L3792K346M613R808L2691n741m7431J3454K9906k3408j9908J0596
20961a1537L726j8973J1737K7820j4001j5111j749q710o295J86m491Q044J5882
20948a3472K4341k750r167k411J7371O165r945j4331O616r683J1088J9612O23
20935B4057j4697p505N741J5747n258l300n461K3582k2699j6401m068J1987j4959
$$ plain form
21024 -27736 -12684 2874 -5949 1665 9372 -10039 -1607 12018 38296 38203 25026 19879 16973
21011 16973 34068 22009 7188 3098 -5100 -18858 -25228 -17742 -25018 -28466 -23252 -26007 -37006
20998 -37006 -41628 -25966 -20710 -45498 -45446 -38781 -16103 -29074 -47795 -41729 -18490 -16899 -49383
20985 -49383 -61767 -45768 -23848 960 3456 6267 -9430 -12213 -14655 -56188 -74185 -52255
20973 -52255 -18463 -16117 -11504 -1696 30995 25254 -22177 -8723 21183 -2225 -22133 -11537
20961 -11537 -7811 -26784 -15047 12773 -1228 -16339 -18088 -26798 -33093 -32907 -37398 -29354 -13472
20948 -13472 10869 8119 -1048 -3459 13912 20077 10132 -4199 2417 -7266 3822 23434 24057
20935 24057 9360 1855 7596 23343 18085 14785 9324 32906 10207 -6194 -10262 1725 -13234
20922a3234j7719r32O61K4533L9767J5911l6631k6139j3773k1001k938K071J9944
20909b9480L1234L6480j9846k4333N660j3401J2376O469j2769m0603j2107L7822
20897b2498J1595J9697K7527j168M289L657l936m25o353L609J1215j9843O779
20884C4145r352q996M852k5719l2539o14q472J7037K0483r472j2566K5740q369
20871a3842k3098j3538J4895J8997K972Q874P777J0550m257j5028j7796k2578
20859d6072j6022Q062L4865L1867O928J1145L636j7560j9067J1076K1368L305
20847C3531P91j1411j2624k4055M6J669K0285j1133l022L128J715j5100j7066
20834c3246m327j1574K3562M0059j4689k9260J7961K2288j4949j8942l545R494
$$ plain form
20922 -13234 -30953 -31885 -31224 -6691 33076 48987 12356 -13783 -27556 -48557 -51495 -49424 -29480
20909 -29480 1754 38234 18388 -5945 -285 -13686 -1310 5159 -7610 -48213 -60320 -22498
20897 -22498 -10903 8794 36321 35153 39442 43099 39163 38738 32385 35994 47209 27366 34145
20884 34145 24793 15797 20649 -5070 -37609 -38223 -46695 -29658 -9175 -18647 -31213 -5473 -13842
20871 -13842 -36940 -50478 -35583 -16586 -13614 -4740 3037 13587 9330 -5698 -23494 -46072
20859 -46072 -62094 -54032 -19167 12700 19628 30773 34409 16849 -2218 8858 30226 33531
20847 33531 34322 22911 10287 -13768 -13722 -12053 8232 -2901 -5923 -2795 -1080 -16180 -33246
20834 -33246 -37573 -49147 -25585 14474 -215 -29475 -11514 10774 -4175 -23117 -26662 -17168
20822a7168m009j1781J5590K5951j0242j5250K7097K3202l114n506j1401r448
20810C921J5082k2210m51J2279O933j127o184n85p276k277J7853J1194n62j5921
20796A0669j1821p145L189K4775L881q377l4112n652J3243k2091m187N749k3839
20783e5718J1220n253m10K1851J8334L748K0861n810M188L257k2869K100J0304
20770E803j1055n600k2938L251M474J4154R840r377o995J3929R947K3950j3028
20757A6355k4972k8968J1738n533j9437J0801N0197J218j2283j1310M41R518J3169
20744A0934L396j1793Q63K0366k135k6007l308j6085L303j5483J0647R724K0346
20731D768j024k8734J862j1177j7335m273K5636q219J073N791l681J3577J0875
$$ plain form
20822 -17168 -21177 -32958 -17368 8583 -1659 -16909 10188 33390 30276 24770 13369 3921
20810 3921 19003 -3207 -3658 8621 15554 14427 8243 7658 382 -1895 15958 27152 26590 10669
20796 10669 -1152 -8297 -5108 19667 23548 15171 -18941 -24593 -11350 -33441 -37628 -31879 -55718
20783 -55718 -44498 -49751 -50161 -28310 -9976 -6228 14633 8823 13011 16268 -6601 -4501 5803
20770 5803 -5252 -10852 -33790 -30539 -26065 -11911 -2071 -11448 -18443 -4514 5433 29383 16355
20757 16355 -8617 -37585 -25847 -31380 -50817 -40016 10181 11399 -884 -12194 -11753 -2235 10934
20744 10934 14330 2537 3400 23766 21631 -4376 -7684 -23769 -20466 -35949 -25302 -15578 4768
20731 4768 3744 -24990 -23128 -34305 -51640 -55913 -30277 -38496 -37423 -31632 -35313 -21736 -10861
20718a0861j7772l538j068J5504k429q740k1370J2576J5744K2167k0063l0591
20706e0441K4260J7154M987p43R720J6006J3777k919m201j5543O037M565k6654
20693c995k718J3724J9092l2423k3672k8811j5281J4386R683J9493J3667j7542
20681c4397r300p001o33J8798j2189K1303K6190k580K779Q013O198n237o613k0109
20667a4778K440k29k0749j6067J083J5706L439q344K4974L3377K7120N204J866
20654E5042o361j0646q837j4252j0700p950K695R43O142p429O32R230K0281q715
20640B0075j6535p457J9576J2738m127j2653k3539J0793J481J8682J4258j821
20628C1471l623r418j5262J0985j7067j4402M8443J0503l3483j933J787O52K0436
$$ plain form
20718 -10861 -28633 -32171 -33239 -17735 -20164 -28904 -50274 -37698 -21954 213 -19850 -50441
20706 -50441 -26181 -9027 -4040 -4783 4937 20943 34720 31801 27600 12057 18094 22659 -3995
20693 -3995 -6713 7011 26103 -6320 -29992 -58803 -74084 -59698 -50015 -30522 -16855 -34397
20681 -34397 -43697 -50698 -51331 -32533 -44722 -23419 2771 191 2970 10983 17181 11944 5331 -14778
20667 -14778 -12338 -12567 -33316 -49383 -48300 -32594 -29155 -37499 -12525 20852 47972 53176 55042
20654 55042 48681 38035 29198 14946 4246 -3704 -1009 -66 6076 -1353 -721 8509 28790 20075
20640 20075 3540 -3917 15659 28397 24270 11617 -11922 -1129 352 19034 33292 31471
20628 31471 27848 18430 3168 14153 -2914 -17316 31127 41630 8147 6214 8001 8653 29089
20615B9089K3758j5010j862o387j5118J0895k2315j2794J7225K0490L836k2147
20603I660j9858J2988J9786j330k6564n267k4917j0417K8944K6616j3240M832
20591A233J6627o40k5691l2374K914M5895Q552N626j63K5110J89k4944j2015j4919
20577d600K3018j0668j3109j003K956K053j5086k0988J7395K5490j2854q473N767
20564a0102j2122k760n378j4325J4374K4108J358J8092J0253j3072J5835R24l4415
20551g230j0979K2012J0823K3286J957J860l0774m0723k0656l430j0169J3624
20539e0399L6788M410k2063J3657J5513J8807J490J1272k8709m3223l838J8223
20527b8072J2113m656o79k4490l679J3079Q570K5088Q151k753K0224k0234k9372
$$ plain form
20615 29089 52847 37837 35975 29588 14470 25365 3050 -9744 7481 27971 31807 9660
20603 9660 -10198 2790 22576 21246 -5318 -10585 -35502 -45919 -16975 9641 -3599 1233
20591 1233 17860 17220 -8471 -40845 -37931 7964 16516 22142 21979 47089 47278 22334 10319 -4600
20577 -4600 18418 7750 -5359 -6362 -3406 -1353 -16439 -37427 -20032 5458 -7396 -15869 -10102
20564 -10102 -22224 -24984 -30362 -44687 -30313 -6205 -4847 13245 23498 10426 26261 27185 -7230
20551 -7230 -18209 3803 14626 37912 39869 41729 10955 -29768 -50424 -53854 -64023 -50399
20539 -50399 -13611 -9201 -31264 -17607 -2094 16713 18203 29475 766 -42457 -46295 -28072
20527 -28072 -15959 -20615 -21294 -45784 -49463 -36384 -27814 -2726 5425 2672 22896 2662 -26710
20514b6710J8887q814j8779K9499K2389m638L036O849j9322o707j2746j1126n41
20501b8723j483k60k189k507Q916j5814J5664J2917j6324p251j4554K1335K5453
20488d820l7183J0385N181q410O593L673J4449p219O983R087j0647J3499L62Q022
20474I955q671j2122P665l2197k9471Q37O173J7900K4103O295L811P938l0005
20461b7789q08o071J6924Q014p570R590P960M436J3027P544J7570J2817j1662
20448D3982j3706j2905r734J1880j6612j4344j7730L220J6038k4779P6J1092m882
20435b8404P63j4318j543R701J0738l1113j9889l882J6153L9164K4294j0920o279
20422a5535P855j4116o881J0101P393K5039K0789K0734m3661m7700k231j4787
$$ plain form
20514 -26710 -7823 -16637 -35416 -5917 16472 11834 14870 21719 2397 -4310 -17056 -28182 -28723
20501 -28723 -30206 -30466 -32655 -35162 -26246 -42060 -26396 -13479 -29803 -37054 -51608 -30273 -4820
20488 -4820 -42003 -31618 -26437 -34847 -28254 -24581 -10132 -17351 -10368 -1281 -11928 1571 1933 9955
20474 9955 1284 -10838 -3173 -35370 -64841 -64004 -57831 -39931 -15828 -9533 -5722 2216 -27789
20461 -27789 -28597 -34668 -17744 -9730 -17300 -7710 250 4686 17713 25257 42827 55644 43982
20448 43982 30276 17371 7637 19517 2905 -11439 -29169 -25949 -9911 -34690 -34614 -23522 -28404
20435 -28404 -27641 -41959 -43502 -33801 -23063 -54176 -74065 -77947 -61794 -22630 1664 -9256 -15535
20422 -15535 -7680 -21796 -28677 -18576 -11183 13856 34645 55379 11718 -35982 -38213 -53000
20410e3000K7525K7040J0013j709k1452J5504R931l1825j1246J763o424l244J7428
20397a9696m92j6919K682K8241p815j6856K3231L0398O02K02j1548j264n776n413
20383d23J7746J4685m998J0974k0366K5008J7449J5126K484k767j8007l5482j3242
20370H187J941J4130K921N030j7708L08K876j7456o434J0083J6751J9388l030
20357C6987j1928J1801J905j7068j1537m947o179j2752r143j207k072J8194J6521
20344H575L25K7047k7074j1091J50j6318j66r680N365R380L2263P432m0353J3970
20330a75K3599j7392P243J3952j5547k9164M651K8931J9215j4408j4651j8785
20318a2531j94L221J1972o836M415K993l883m914l0060l918J3596j473Q872j250
$$ plain form
20410 -53000 -25475 1565 11578 9869 -11583 3921 13852 -17973 -29219 -27456 -33880 -37124 -19696
20397 -19696 -20188 -37107 -34425 -6184 -13999 -30855 -7624 22774 23376 23578 12030 10766 4990 -423
20383 -423 17323 32008 27010 37984 17618 42626 60075 75201 77685 74918 56911 21429 8187
20370 8187 10128 24258 27179 32209 14501 14809 17685 229 -6205 3878 20629 40017 36987
20357 36987 25059 36860 38765 21697 10160 5213 -966 -13718 -22861 -24068 -26140 -7946 8575
20344 8575 8900 35947 8873 -2218 -2068 -18386 -18552 -28232 -22867 -13487 18776 26208 -14145 -175
20330 -175 23424 6032 13275 27227 11680 -17484 -12833 16098 35313 20905 6254 -12531
20318 -12531 -12725 -9504 2468 -4368 47 3040 -843 -5757 -35817 -39735 -26139 -27612 -18740 -19990
20304a9990l060o511K565K765L636J2552P331k424n234J0439L0206J8759k7217
20291B3817j4070J5273l53j7899p398k4962p599m941Q20J9100J5377J720r696
20278a0811r861q587J9423J6214J9939j078k0249J3187R958n737j5001k0448j1157
20265b4208k934J1870J7085J3514n477q828m576J8548J146j2662L166k3357k7420
20252d4133j2906l147R550J9477J4649K0510J9888J8938l994k9045J930j9212
20240g495p940J510k78K7408J7978L8367k0281k3677k6468r99K0771J513k0393
20227A6n726L378k592M563K4158O366k2975k088n166N576J0143J2604k5257q349
20213e349o61r153j0946K9279J7680j615j1652Q679K0624k5083l1416j6849K022
$$ plain form
20304 -19990 -23050 -29561 -26996 -24231 -20595 -8043 -712 -3136 -8370 2069 32275 51034 23817
20291 23817 9747 25020 24667 6768 -630 -25592 -33191 -38132 -37312 -18212 -2835 -1115 -10811
20278 -10811 -20672 -29259 -9836 6378 26317 25239 4990 18177 28135 22398 7397 -13051 -24208
20265 -24208 -27142 -15272 1813 15327 9850 1022 -3554 14994 16140 3478 6644 -16713 -44133
20252 -44133 -57039 -60186 -50636 -31159 -16510 4000 23888 42826 38832 9787 11717 -7495
20240 -7495 -15435 -13925 -14203 13205 31183 69550 49269 25592 -876 -1875 18896 20409 16
20227 16 -5710 -2332 -4924 -361 23797 30163 7188 5100 -66 5510 15653 28257 3000 -5349
20213 -5349 -6010 -15163 -26109 3170 20850 19235 7583 16262 36886 11803 -19613 -36462 -34440
20200c4440J0646R489o750K0646K3135n440j7309j6591K487N21J380J1113j7188
20187a8301J389K5175Q15O127Q710j8990j9647j0400K1396j6068j3021j7969j1835
20174f2619J727K3861K1294J0905j5441p640l839O471J5274L3664j6289M873K2706
20161C4947j2510j2970j3777j0937R140K0782q949R805K6285j648r644j3416j3273
20148C835j9126m640R292l365j776m222K7402L852o505L3300K8790k352k5080
20135C9405m0940o839J108Q705Q927j8664J6340j151o243j1389j4972O332L6967
20122A7586K830r478r43n755J2525K8372o158m4288k3540n329P573J5681L0959
20109B0035p604j7365j3446m911O217L251k176p495j4375r138K1005j705j9294
$$ plain form
20200 -34440 -23794 -14305 -21055 -409 22726 17286 -23 -16614 -14127 -13606 -12226 -1113 -18301
20187 -18301 -16912 8263 9078 15205 23915 4925 -14722 -25122 -3726 -19794 -32815 -50784 -62619
20174 -62619 -60892 -37031 -15737 -4832 -20273 -27913 -31752 -25281 -10007 23657 7368 12241 34947
20161 34947 22437 9467 -4310 -15247 -6107 14675 5726 15531 41816 40168 30524 17108 3835
20148 3835 -15291 -19931 -10639 -14004 -15780 -20002 7400 11252 4747 38047 66837 64485 39405
20135 39405 -1535 -8374 -7266 1439 10366 -8298 8042 6891 648 -10741 -25713 -19381 17586
20122 17586 20416 10938 9995 4240 16765 45137 38979 -5309 -28849 -34178 -26605 -10924 20035
20109 20035 12431 -4934 -18380 -23291 -17074 -13823 -15999 -23494 -37869 -47007 -26002 -27707 -47001
20096d7001q089K1260m473O181j1409j5766M123L4138K6788p523N513P580k024
20083I298j1242l5661j7728J0127J3686N72j829K237L7099K6078m02j1155k967
20070A8113k7785j9978j0589R706J6367K827J955r976N56Q883P161J944j287k504
20056d607K6570J1064k9317j4492K1408L868n288l6594l035J4516J1026Q07o517
20043a0591R710K6574J1687M736m433p956K120j6016j4203P32j2981j2412L995
20030a9038j691P859M156J0884K119j2759k5419j6426J2795J292j500N629K9668
20017b431K1555k1793j0939n866K7380J044p914J064R187m059p110P698Q608k1330
20003d906j4191R36m020J433L4314J8463j3135j9304R34L260J0114J4363r794
$$ plain form
20096 -47001 -55090 -33830 -38303 -32122 -43531 -59297 -55174 -21036 5752 -1771 3742 11322 9298
20083 9298 -1944 -37605 -55333 -45206 -31520 -30948 -32777 -30540 6559 32637 32235 21080 18113
20070 18113 -9672 -29650 -40239 -30533 -14166 -11339 -9384 -19360 -18804 -9921 -2760 -816 -2103 -4607
20056 -4607 21963 33027 3710 -10782 10626 14494 9206 -27388 -30423 -15907 -4881 -4074 -10591
20043 -10591 -881 25693 37380 42116 37683 29727 31847 15831 1628 2360 -10621 -23033 -19038
20030 -19038 -20729 -12870 -8714 2170 4289 -8470 -33889 -50315 -37520 -36228 -37728 -32099 -2431
20017 -2431 19124 -2669 -13608 -19474 7906 8950 1036 2100 11287 7228 118 7816 16424 -4906
20003 -4906 -19097 -18161 -22181 -20748 13566 32029 18894 -410 524 3784 13898 28261 18467
19990A8467N380j1809l2339j443J0130M113j5563M930J0444q593k237j2173J948
19977b8745J8753K296O711K1513M134J2261k3702j8882O4J4751J4127j0174j4812
19964a705k5996J249m186q557M009k2978j554J7242Q496k571K995P925l127O053
19950b2705O860l930j155Q374L255n225J8912j6170R881Q879p560l906K644K4179
19936B2333K9127l655L423j1697k4612j4884K2522K2449N235k6639j8612J7882
19924B2872J4906J0876p390p598j5476k2759k3942K5501K6903l971k1642J3236
19912A1516J1960K784k8616J389P193O117K1167j0508J1288j77m417j2834j0797
19899F065K1223J7137L113J5290j7566O068n55m7894k3717L9024n665o712k4644
$$ plain form
19990 18467 23847 12038 -20301 -21744 -11614 -7501 -23064 -18134 -7690 -16283 -18520 -30693 -28745
19977 -28745 -9992 -7696 -985 20528 24662 36923 13221 -5661 -5597 9154 23281 13107 -1705
19964 -1705 -27701 -26452 -30638 -39195 -35186 -58164 -59718 -42476 -33980 -36551 -33556 -25631 -28758 -22705
19950 -22705 -15845 -19775 -20930 -12556 -9301 -14526 4386 -11784 -1903 6976 -584 -4490 -1846 22333
19936 22333 51460 47805 51228 39531 14919 35 22557 45006 50241 23602 4990 22872
19924 22872 37778 48654 41264 33666 18190 -4569 -28511 -3010 23893 19922 -1720 11516
19912 11516 23476 26260 -2356 -967 6226 12343 33510 23002 34290 34113 29696 16862 6065
19899 6065 27288 44425 47538 62828 45262 51330 50775 2881 -20836 18188 12523 5811 -18833
19886a8833p038J7963K6774j9778n524J0731K3019Q440j1707j5460Q202j6526
19874B63N640J2117p097K591R64k670k0963k9356j5988K971K3636K3498K0088
19861A5694M577m557J1058k3109l3573k252K9800M713l4267J665m4401r293L1997
19848e1948J6588J6266L6649J573j4045k1396J538m504J9607K6085J1354j485
19836C6282j7618J6246k406N998j151l1759R116L4703k1669L320l100l668r26
19823B3368O757j2634r910N765P542j0084R712r797q209K5641p203P503N579j9884
19809A4146k0805L636n822j7748p527Q039J5228j0354k530J5232k009l554K7558
19796A3490O971K793n240m856j5278r644J6489Q492J2138n89n894j0086K719n222
$$ plain form
19886 -18833 -25871 -7908 18866 -912 -6436 4295 27314 35754 24047 8587 16789 263
19874 263 5903 18020 10923 13514 14478 11808 -9155 -38511 -54499 -51528 -27892 -4394 15694
19861 15694 20271 15714 26772 3663 -29910 -32162 -2362 2351 -31916 -30251 -74652 -83945 -51948
19848 -51948 -35360 -19094 17555 19128 5083 -16313 -14775 -19279 328 26413 37767 36282
19836 36282 18664 34910 32504 38502 37351 5592 14708 49411 27742 31062 27962 24294 23368
19823 23368 30125 17491 7581 13346 20888 10804 20516 10719 2510 28151 20948 28451 34030 14146
19809 14146 -6659 -3023 -8845 -26593 -34120 -26081 -10853 -21207 -23737 -8505 -10514 -14068 13490
19796 13490 20461 23254 18014 13158 -2120 -11764 4725 13217 25355 24766 18872 8786 11505 6283
19782F283j9173r615n561J5084j2160l373J3875J2658j4857R740K5955l0224k6114
19769c7482k6667n532L1614N953M639q522r057j5949J0800R543j479j5682K0916
19756c6905L9247M0682k2353N441J0128o007k9158m0092R7J7293O3345k282r777
19743B9659M477k0379J6436L639j5687k7575j4178K4009J6677j1238o941r479
19731a0580j901m327N743j3674O997K054N22K6557n800P564J8161l0023L808q668
19717c567k1802J298J2333K6177Q906k5405q741J9291q445J4386J0824j4954j6263
19704e962K5427l182m672P894J0576N289m303j5356j5289j4832p396K5031J6264
19691A9489R770n708Q31o195o662p95L747M156r11l415q276k1697R310o832J2094
$$ plain form
19782 6283 -12890 -22505 -28066 -12982 -25142 -28515 -14640 -1982 -16839 -7099 18856 -11368 -37482
19769 -37482 -64149 -69681 -38067 -32114 -27475 -35997 -45054 -61003 -50203 -40660 -42139 -57821 -36905
19756 -36905 2342 43024 20671 26112 36240 30233 1075 -39017 -38920 -21627 41718 39436 29659
19743 29659 34136 13757 30193 33832 18145 -9430 -23608 401 17078 5840 -1101 -10580
19731 -10580 -12481 -16808 -11065 -24739 -17742 -15688 -15166 11391 5591 13155 31316 1293 5101 -3567
19717 -3567 -25369 -24071 -11738 14439 23345 -2060 -10801 8490 45 14431 25255 10301 -5962
19704 -5962 19465 16283 11611 19505 30081 35370 31067 15711 422 -14410 -21806 3225 19489
19691 19489 29259 23551 24382 18187 11525 10730 14477 18633 17722 14307 6031 -15666 -6356 -13188 -1094
19676a094l0283o636J7037l897q09K6627m449l4565m465Q972J9067Q728K3358
19663A7591N160n033J7014K2508k4948k8203k1522K0140K6591j5452j2516K6415
19651B7745N889o375j9230J4292M502j0803r646Q804k652k9420L238M1N338j5625
19637b3902Q225J0127Q11J4206M288j4580k532K8325J68k5045L313j8128k0933
19624c5657J3013j0218P714L5993P268o486j2699J0182j9037K266K7146L9622
19612E9107l335l1417K3533m150k8838k4694J6176J9646L349k136k1367J7813
19600B3687p106r598M238o865k2810k486L2840j2843K464l2177q054Q242K0294
19587a0174J0532Q914R645q610r448P171O952l025k927K677L950P138k631k8072
$$ plain form
19676 -1094 -31377 -38013 -20976 -24873 -25682 945 -3504 -38069 -42534 -33562 -14495 -5767 17591
19663 17591 22751 17718 34732 57240 32292 4089 -17433 2707 29298 13846 1330 27745
19651 27745 33634 27259 8029 22321 26823 16020 6374 15178 12526 -16894 -13656 -13615 -8277 -23902
19637 -23902 -15677 -5550 -4739 9467 13755 -825 -3357 24968 25136 91 3404 -14724 -35657
19624 -35657 -22644 -32862 -25148 10845 18113 11627 -1072 9110 -9927 -7661 19485 59107
19612 59107 55772 24355 47888 43738 14900 -9794 6382 26028 29377 27241 5874 23687
19600 23687 16581 6983 11221 4356 -18454 -20940 11900 -943 1521 -30656 -38710 -30468 -10174
19587 -10174 358 9272 18917 10307 859 8030 14982 11957 9030 11707 15657 22795 20164 -7908
19573g908j2738P85K633K2565N553o332K773q884k054L2752M225k5519J3820J9272
19559D0943r714k9504j4616j553J7903R287J4262J4529J0608k5120J375O395k3632
19546A1163J2069l083j236m098k2359N604j1713M779J1496j3259O619P007Q361
19533A1350M6081K2584j7097l1656q111J6870j0174l6958k5768K562R380L6120
19521A5183J7527O392O369r656q176q384Q999J8512J0572K087k1548R128M3489
19508I0494k0242n6343r442J6114L9273R734k0488k1604L927k3137k720K950K0758
19495B9274n244l8920M204K4611L368j2613J127P238K901J1604J8684M093Q138
19482E8465l03J618M222o800P230J5538r018n4210k9367L885J1927j026J6826
$$ plain form
19573 -7908 -20646 -19861 -17228 5337 10890 4558 7331 -1553 -3607 29145 33370 7851 21671 40943
19559 40943 31229 1725 -12891 -14444 3459 12746 27008 41537 52145 27025 28400 34795 11163
19546 11163 23232 20149 18913 14815 -7544 -1940 -13653 -8874 2622 -10637 -4018 2989 11350
19533 11350 57431 80015 62918 31262 23151 40021 29847 -7111 -32879 -30317 -20937 15183
19521 15183 32710 39102 45471 35815 27639 19255 28254 46766 57338 59425 37877 47005 90494
19508 90494 70252 13909 4467 20581 59854 69588 49100 27496 31423 8286 5566 8516 29274
19495 29274 24030 -14890 -10686 13925 17293 4680 5807 13045 15946 27550 46234 50327 58465
19482 58465 58162 59780 64002 57202 64432 79970 70952 16742 -12625 -8740 3187 2161 18987
19469A8987k861q51K2405j77j8223Q025j1212j5835O846J7389J8371j5975L1744
19456E8633p488j2573R666J557j1416K0963J590j6925J8138L359L7405M1758K178
19443A46845J5334L2228N0757Q8302J46778K03836J96493Q9839r9113j24563j23303
19432F23433k7311M9857R4441J43400Q9953l8766j56036j79119j42312p7255p9459
19421C00826j02962k5531K8810q087j471j6737L2559R672l2465k8344l32K8815
19409A84753M6931R3650J04846J80020K09481J96400K8083j15773j82427j07766
19399F38198j600Q2332J10522J39101N4192r5614j97002j69230j38648q5073p6408
19388B60770n7263j1726k2810M591N707R991p058k0378m69j1015K7721r93J887
$$ plain form
19469 18987 16126 15275 37680 37503 19280 27305 16093 258 7104 24493 42864 26889 58633
19456 58633 51145 38572 48238 49795 38379 59342 60932 44007 62145 65504 102909 144667 146845
19443 146845 162179 194407 245164 333466 480244 684080 880573 970412 871299 746736 623433
19432 623433 596122 645979 740420 883820 973773 935007 778971 599852 457540 380285 300826
19421 300826 197864 172333 201143 193056 191585 174848 207407 217079 184614 156270 155938 184753
19409 184753 231684 325334 430180 610200 819681 1016081 1044164 928391 745964 638198
19399 638198 636598 718930 829452 968553 1022745 927131 730129 560899 422251 337178 260770
19388 260770 203507 191781 168971 173562 179269 189260 182202 161824 161355 150340 178061 177068 178955
19375A78955K5026M5647K3918J103J6260K7253M6618L2239L3011P0990N9535O6701
19363F27256O6136J6086K579n365j4989j4196k327k6126p4021m8307o1159p5605
19351C89962m1628j8618l2652j6305k6070j0217k0860k8678m061J4835j1984k4429
19339A69295Q094L297k0833j8242R484j7434j3882k9912Q464J5602j2047j3978
19327H7908P18n779j8425j6200J1224J2377j7680j0477q527l697k3703J3018M06
19314B1163l133Q244K7120j189J0182K022J172r640m522K6328O101j3650l1988
19301C8210k1984J3572K0969o354l020l693J756J8016j321k2355k2400J0759j139
19288B1016k1293M353j4838p625J2639M2943J1069r145Q928L928j4197k1483J1492
$$ plain form
19375 178955 203981 249628 273546 274649 290909 318162 364780 397019 430030 501020 560555 627256
19363 627256 693392 709478 712057 706692 691703 677507 675180 649054 575033 526726 465567 389962
19351 389962 348334 329716 297064 280759 254689 244472 223612 194934 190873 205708 193724 169295
19339 169295 177389 180686 159853 141611 151095 133661 119779 89867 98331 113933 101886 87908
19327 87908 88626 82847 64422 48222 59446 71823 54143 43666 35139 31442 7739 20757 21163
19314 21163 18030 26274 53394 52205 62387 64409 65581 55941 51419 77747 83848 70198 38210
19301 38210 16226 29798 50767 44413 41393 37700 39456 57472 56151 33796 11396 22155 21016
19288 21016 -277 4076 -10762 -18387 -5748 37195 48264 39119 48047 51975 37778 16295 27787
19275B7787j1619L004J3305j0115l701k3590l270K6040J0150O186o821j4671k3453
19262a0768M463J6595K8132J0724J7866Q68n584k719M13L680n2937l2813J4748
19249g332Q818j4260J7018L7970k2107k7585R76M5077J7242l1290J8436J6443
19237E9406J4466K2361j2409K6032O2573K7024k8223k6159k3679k6810J3700J4398
19225A22680L2625j013Q726K61k3789k9902j5893p542n658l0261J3467j7979k503
19212D3219J4930L9810m901k3265k624J498p320l0403j9410J67j5718K3367M0172
19199E9522k699j9646k219p525K0772R572k2319L128K1427J884K8186j9535m3654
19186B6894l3907J2766O411k928Q808J4338k1807j1061R18J4276K0694k2569J2681
$$ plain form
19275 27787 16168 19172 32477 22362 18661 -4929 -8199 17841 27991 34177 27356 12685 -10768
19262 -10768 -6305 10290 38422 49146 67012 67880 62296 59577 59990 63670 10733 -22080 -7332
19249 -7332 1486 -12774 4244 42214 20107 -7478 -6502 38575 55817 24527 42963 59406
19237 59406 73872 96233 83824 109856 172429 199453 171230 145071 121392 94582 108282 122680
19225 122680 155305 154292 163018 163279 139490 109588 93695 86153 80495 50234 63701 45722 43219
19212 43219 58149 97959 93058 69793 67169 68667 61347 30944 11534 11701 -4017 19350 59522
19199 59522 56823 37177 34958 27433 48205 57777 35458 38586 60013 61897 90083 70548 26894
19186 26894 -7013 5753 12164 9236 18044 32382 10575 -486 432 14708 35402 12833 25514
19173B5514K4045N338l0395n920J2413J2520J9463J7618n132J2488J390j5822
19161G3520J5622l516j6452l1364j0231K2268K2489J3880J783Q503P577l771r647
19148I0661J436J6467L7311L2964M12j1866k5905m3372l0833k3353O73J5214K8071
19135H7880O155L151K2080K1644J011k3620k8366O144K0708K7561L5716j006l674
19122A75384O256j2540K9177J8442k3181k0934P941M43j3228O801J8969M836p757
19109A90609m5770l1909m212J0759j0923o2J896J6076J4461K189K4162M1396J7128
19096B25800J7535L6058l6049k6871k8316l7349J1435K7042M1025j4135R968J0080
19084B36223k9653m3711j2865m572j4783j756J6524J0205N108p958l0672P510
$$ plain form
19173 25514 49559 54897 24502 18582 30995 43515 62978 80596 75464 87952 89342 73520
19161 73520 89142 85626 69174 37810 27579 49847 72336 86216 87999 96502 104079 100308 90661
19148 90661 92097 108564 145875 178839 179251 167385 141480 98108 67275 43922 44595 59809 87880
19135 87880 94035 97186 119266 140910 141921 118301 89935 96079 116787 144348 180064 179058 175384
19122 175384 181640 169100 198277 216719 193538 172604 180545 180988 167760 174561 193530 198366 190609
19109 190609 144839 112930 108718 119477 108554 108492 110388 126464 140925 143114 167276 208672 225800
19096 225800 243335 279393 243344 216473 188157 150808 162243 189285 230310 216175 226143 236223
19084 236223 206570 162859 149994 145422 130639 128883 145407 155612 160720 152762 122090 129600
19072A29600K1277j0657O163K9899O738L0829M2732K7367K3595j3084j9415k1625
19060B53419k7898k2504K0099O038K999J5429j5204k1527r336j5537j6155l1867
19048A37956j3837q933j5791N749K0362j8654L128K1635k081q979j0055j47R84
19035A11337j3684N549K1468j4882K0828J6892L0875K3875P986l931j354M881
19023B09840N957j3558K268M4158J0679n203J078r59k0773j0352o694j7593j8337
19010A80511j7544j5335j8504O819J4036o277l4192m390L6823K4616N123k7275
18998A44411m798j5315K2328M0290L559K0950K5609o19K2974J3637j193J6469
18986B88302j6705L995J6852J8680M0499J453M963j9233l5634k7995l216q318
$$ plain form
19072 129600 150877 140220 146383 176282 183020 213849 256581 283948 307543 294459 275044 253419
19060 253419 225521 203017 223116 229154 232153 247582 232378 210851 201515 185978 169823 137956
19048 137956 124119 115186 99395 105144 125506 106852 109980 131615 129534 120555 110500 110353 111337
19035 111337 97653 103202 124670 109788 130616 147508 178383 202258 210244 206313 204959 209840
19023 209840 215797 202239 204507 248665 259344 254141 255219 254260 233487 223135 216441 198848 180511
19010 180511 162967 147632 129128 135947 149983 143706 109514 105124 141947 166563 171686 144411
18998 144411 139613 124298 146626 186916 190475 211425 237034 236415 259389 273026 271833 288302
18986 288302 271597 275592 292444 311124 351623 353076 358039 338806 303172 275177 271961 263643
18974B63643L0906N0008O1957M5493Q846m0878m7836l7157j7616J2859M1473L8165
18962D09863R560j1253l9026j1828j4274J600J2109m6241j1071K7539K3603J2013
18950C62594J2248o619Q241J1133K8526J0858K1250L1510L0168L1322N932P789
18938E54952N6904L2545j0180k7077l6937K778M9354M7859R528K9324m8266k3638
18926F37146K690J6673j1652l3393j8867l296M300O648K247K9404K6978J6867
18914F75745M3882K5506J0330K628K5084J0368Q818K0255K8809K3232K5825L7715
18902I38197K3665L6729N9053N9362M2380L4909J181K1517M2503K6648Q6532R8131
18890A470807O7366P5357J22532K26673K61246K47066J13949o2917n2993o522
$$ plain form
18974 263643 294549 344557 406514 452007 460853 419975 372139 334982 317366 330225 371698 409863
18962 409863 419423 408170 369144 357316 343042 344642 356751 310510 299439 326978 350581 362594
18950 362594 374842 368223 376464 387597 416123 426981 448231 479741 509909 541231 547163 554952
18938 554952 611856 644401 634221 607144 570207 572985 622339 670198 679726 709050 660784 637146
18926 637146 639836 656509 644857 611464 592597 589301 593601 600249 602496 631900 658878 675745
18914 675745 719627 745133 755463 758091 783175 793543 802361 822616 851425 874657 900482 938197
18902 938197 961862 998591 1057644 1117006 1159386 1194295 1195476 1216993 1259496 1286144 1372676 1470807
18890 1470807 1538173 1613530 1736062 1962735 2223981 2471047 2584996 2522079 2469086 2462564
18880B462564Q4324J44839K04073K79673K13619M8576j8113p954N2350N1326J02924
18869C618201J36906K21710K69812L06344L61232L61939L39498M22191N75971
18860F613804P57706R70117J040292J017231J065481J199262J531751K022352
18852A6217996K641475L445627M714206P196145J2317113K1741620L2936800L8221483
18844A39432465K7619110l045586k2595247k5503758j7065073p15103J6815273
18837A14942081K8551740K6693382J943853k3999668l2341433k9794865k1154107
18830F4840983j3192529q307382n541890l818935k557688j498879o79435j50982
18822B9093263K61745O09193R37168J613599K752397M544856P807652J4135175
$$ plain form
18880 2462564 2546888 2691727 2895800 3175473 3389092 3437668 3419555 3411601 3463951 3515277 3618201
18869 3618201 3755107 3976817 4246629 4552973 4914205 5276144 5615642 6037833 6613804
18860 6613804 7371510 8341627 9381919 10399150 11464631 12663893 14195644 16217996
18852 16217996 18859471 22305098 27019304 34215449 46532562 68274182 101210982 139432465
18844 139432465 167051575 164005989 141410742 115906984 98841911 98126808 114942081
18837 114942081 143493821 170187203 172131056 148131388 115789955 85995090 64840983
18830 64840983 51648454 43341072 37799182 33980247 31422559 29923680 29244245 29093263
18822 29093263 29355008 29964201 30901369 32514968 35267365 39812221 47619873 61755048
18814F1755048K5001640L6303200L9278445K2692504j0000882k6260773k6444327
18807A22324855j5179942L181217K1156489L1200363K4520868n789305k9422001
18800A51992544l5261509l0682296k0976001j3125204q640013o269973m840438
18793C2197110l783039k769460j986601j403064j120030j078004j284304j389544
18785A7383064j302158j139373r54586q19130o84404n47467m69593n02798m70900
18776A0492655l73554l43429k55881j59110o3137o2115k03692l35484l91521l39064
18766G965668k67690j55127r3619o7454j59165k82078l63277l71193l52725k72407
18756E580933k09709j72362j60830j31251j56772j68884j49061j49030j20432
$$ plain form
18814 61755048 86756688 123059888 162338333 185030837 175029955 148769182 122324855
18807 122324855 107144913 110326130 131482619 162682982 187203850 181414545 151992544
18800 151992544 116731035 86048739 65072738 51947534 43307521 37037548 32197110
18793 32197110 28414071 25644611 23658010 22254946 21134916 20056912 18772608 17383064
18785 17383064 16080906 14941533 13986947 13167817 12483413 11935946 11466353 10963555 10492655
18776 10492655 10119101 9775672 9519791 9360681 9297544 9235429 9031737 8696253 8304732 7965668
18766 7965668 7697978 7542851 7449232 7381778 7222613 6940535 6577258 6206065 5853340 5580933
18756 5580933 5371224 5198862 5038032 4906781 4750009 4581125 4432064 4283034 4162602
18747D162602j05895o5724n3789o7908j04614j29163q9693q2373j13520r5972
18737C253951p5880r4158p2608p8307m2459j5442m5646l3212m8338m5505m6829
18726B655567m0994p4561o0280J0008k5470m3497j3583j3176l6030m3717m7628
18715B266639o7453k3274j0808j2891K1789J7309p264n0050n5217n1821j8199
18704B008760M4900N2228M0213L5529J1577K2513K1680O6304P5868R5237J36067
18693B610876J90160K68756K93129M56125P81988J465646K583320L675659L968031
18684A6293690K257853r07282k732652k900750k056657o18696R97018K644792
18676A2977316L769081L345704N56482k622853l887759l664938k727949j769972
$$ plain form
18747 4162602 4056707 3990983 3937194 3869286 3764672 3635509 3545816 3463443 3349923 3253951
18737 3253951 3178071 3083913 3011305 2932998 2890539 2875097 2829451 2796239 2747901 2702396 2655567
18726 2655567 2614573 2540012 2479732 2489740 2464270 2420773 2407190 2394014 2357984 2314267 2266639
18715 2266639 2199186 2175912 2165104 2152213 2174002 2191311 2184047 2133997 2078780 2026959 2008760
18704 2008760 2053660 2105888 2146101 2181630 2193207 2215720 2237400 2303704 2379572 2474809 2610876
18693 2610876 2801036 3069792 3362921 3819046 4601034 6066680 8650000 12325659 16293690
18684 16293690 18551543 17644261 14911609 12010859 9954202 9335506 10332524 12977316
18676 12977316 16746397 20092101 20648583 18025730 14137971 10473033 7745084 5975112
18668E975112j109580p34448m74447l57690k65895k10980j68039j85305j28699
18659B340029j24216j22913q1680p9426p8777j10218j05745o1020k5005n0368
18649A500661j7276j4447m3898o3884m8864n1556l7436p1150m3345j5118K094
18638A095781j6727l0265n2316m0122k3809k9735R136o1351l0934l2261l6919
18627G50478o153N120L044J8520K75R033Q407k4683j2062J6798M2816Q5723P0270
18614I67586R4925J23410K05895M16397O89515P56862M46006j78429n49024o60185
18604B312958n55851l44499k17280j23534q1372m6491l9001l0344j7551j3976
18594H43059J419m168K0770M7688K9812M3984Q2976K01987L61771O11719P98855
$$ plain form
18668 5975112 4865532 4131084 3656637 3298947 3033052 2822072 2654033 2468728 2340029
18659 2340029 2215813 2092900 2011220 1931794 1853017 1742799 1637054 1576034 1551029 1500661
18649 1500661 1483385 1468938 1425040 1361156 1312292 1260736 1223300 1152150 1108805 1093687 1095781
18638 1095781 1079054 1048789 996473 956351 932542 902807 911943 850592 819658 787397 750478
18627 750478 744325 749445 752489 771009 771284 780317 788724 764041 751979 768777 811593 897316 967586
18614 967586 1062511 1185921 1391816 1808213 2497728 3254590 3700596 3522167 2973143 2312958
18604 2312958 1757107 1412608 1195328 1071794 990422 943931 904930 874586 857035 843059
18594 843059 844478 840310 861080 908768 938580 982564 1065540 1267527 1629298 2241017 3039872
18583C039872P16244J10569m58716o95172o78011m95703l19002j73038r0867q6370
18573H69806m3371n8496k7801l6884k0534k7523p893o632O30J413m034q886K5585
18560F55380L795K6222M349l506K5812M3941M0102J5222J1895J8556L7941O2547
18548I42256R6180Q5450N5002L3223O5340J17570J95153K43424L77394O42996
18538B853988J133104J821748K293706K083644N31979r51548j348446r88102L2926
18529G462999J419450K783172L500355K560818J25710k253053l133501k746613
18521I719337j687670m42827O38326J250516J022156m00309j600995j871698j614285
18512E012551j127951p21227m88366l40185k73857j99700j58102j13162j08012
$$ plain form
18583 3039872 3756116 3866685 3407969 2712797 2034786 1539083 1220081 1047043 956176 869806
18573 869806 826435 767939 740138 703254 682720 655197 647304 640672 641302 642715 638681 629795 655380
18560 655380 659175 685397 689746 686240 712052 755993 796095 811317 823212 841768 879709 942256
18548 942256 1038436 1123886 1178888 1212111 1277451 1395021 1590174 1833598 2210992 2853988
18538 2853988 3987092 5808840 8102546 10186190 10718169 9766621 8418175 7430073 7462999
18529 7462999 8882449 11665621 15165976 17726794 17852504 15599451 12465950 9719337
18521 9719337 8031667 7588840 8227166 9477682 10499838 10099529 8498534 6626836 5012551
18512 5012551 3884600 3163373 2675007 2334822 2060965 1861265 1703163 1590001 1481989
18503A481989r7190j09052j10706o9293k9025j4462n8947m6458o1876o4748j1984
18492H08248j3285j973p381l1721m1673n9971m5302Q227O897k1938r77o604j3447
18479E79100j4559k8673O39k5335k3632l369k9142j803k4902p330R92j4513k6538
18466C80935l1028m885J880k455k0276j4998j8401r477Q215j3040l6306K23J6044
18453B56431r830r068J7472Q853l1219l051K0454J2223J7039j8896k5544k1541
18441B13323j5751J1621K8030Q673L946n450k2519j2772m720j4937K1838J9372
18429B30654M746o512m9153l0037J079K6781R522j7913m770m428M055n49N21p637
18415A56359n908K8359j5972m3870r58R650j8950Q759J9583J6324M833p527j0238
$$ plain form
18503 1481989 1384799 1275747 1165041 1095748 1066723 1052261 993314 946856 884980 820232 808248
18492 808248 794963 792990 785609 753888 712215 652244 606942 615169 622066 600128 599151 592547 579100
18479 579100 564541 535868 536507 511172 487540 484171 455029 453226 428324 420994 421986 407473 380935
18466 380935 349907 345022 346902 344447 324171 309173 290772 281295 289510 276470 240164 240387 256431
18453 256431 246601 237533 255005 263858 232639 229588 250042 262265 279304 260408 234864 213323
18441 213323 197572 209193 237223 245896 249842 244392 221873 209101 204381 189444 211282 230654
18429 230654 235400 228888 179735 149698 150777 177558 187080 169167 164397 159969 164024 163475 163996 156359
18415 156359 150451 178810 162838 118968 118010 127660 108710 117469 137052 153376 158209 150682 140444
18402A40444k61p123j8133M543J2348m6840j6711N8405J0453k8832j4621K3755
18390A17427J1884j0776o831o639p791j8804j311J5668P6J0427l304J6608K7842
18377A44476L587j115o954K6264r04j2952j1681O554J25K1780K6119L4267N9328
18364B88894O6415O4282J14810J62943K42991L61986M45551K81711j35473l29095
18354A565015l88004k92191k27229j58837p7408p9481o0760n180j4700j4586J5475
18343B62114N059L574k9781J1346J3763l571l100P502N982K5084J1986P180K6157
18330C43295M6600O1188J54520K73564L93251L61239J37834j66370l19131l30678
18320I55312k66825j68707j22521n1567m0560k9570k9090m6879j4825J8685j1189
$$ plain form
18402 140444 140183 133060 114927 119470 131818 84978 68267 126672 137125 108293 93672 117427
18390 117427 129311 118535 111704 105065 97274 78470 77159 92827 92903 103330 100026 116634 144476
18377 144476 148063 146948 139994 166258 165354 152402 140721 147275 147400 169180 195299 229566 288894
18364 288894 355309 419591 534401 697344 940335 1302321 1747872 2029583 1894110 1565015
18354 1565015 1177011 884820 657591 498754 421346 341865 281105 275925 261225 246639 262114
18343 262114 267173 270747 240966 252312 266075 262504 259404 266906 272888 297972 309958 317138 343295
18330 343295 389895 451083 605603 879167 1272418 1633657 1771491 1605121 1285990 955312
18320 955312 688487 519780 397259 345692 305132 275562 246472 199593 184768 203453 192264
18309A92264k2118j3850j2177K8473K342j6694r595J3432M152k0300k5077K980
18297A23832l468L133J3493j0059j8094o926J9524K8155R572q081j1192J391o734
18284A34546m85j7876k4098j5180O716J8674J231L432k3922r921J4226J0969l772
18271I4540L7692O638k6562p972j6081K3941J4659k0513k2575k451k8784M900
18259E7432K4880K1953m127M900J440o484K6358J2142J2799K4418M404N7232J11165
18246C48512J92003J75885J81950O2532p4824j32138r0337m1408M6231R8837J35830
18235I03073O2184q1531j38878j44521j02740r9821o9996m9013r872q703j3441
18224B46741P726p673K070J2741K4726k8040p31J5680L5793P2448J25919J80074
$$ plain form
18309 192264 170146 156296 144119 172592 174934 158240 148645 162077 166229 145929 120852 123832
18297 123832 120364 123497 136990 126931 108837 101911 121435 149590 159162 151081 139889 141280 134546
18284 134546 134061 116185 92087 76907 83623 102297 103528 106960 83038 73117 87343 98312 94540
18271 94540 132232 138870 112308 104336 88255 112196 126855 106342 83767 81316 52532 57432
18259 57432 82312 104265 100138 105038 106478 99994 126352 138494 151293 175711 180115 237347 348512
18246 348512 540515 716400 898350 960882 886058 753920 663583 622175 668406 767243 903073
18235 903073 965257 883726 744848 600327 497587 397766 327770 278757 268885 260182 246741
18224 246741 254467 246794 248864 261605 286331 258291 257560 273240 309033 381481 507400 687474
18212F87474K30953J78460R683j39943j59960j02990l458J00212J15974J84491
18202A100896N4545j11013k08881j90590j62156j01359l8141m3584l3393p977
18192B58347o28j627q044j8439j5376r214j1371J3881r721k7125K727J4661L3664
18179B21735k8374j6666J3535K3828L0266J2175k6382j4311p361k3395j5236Q78
18167A70692L0810K6361m51p933o285o799r47J7379J642Q049j2399k0986J6756
18154B15889K1609J6068j2423J8896K6196M0178J1218P571r010J9904L0617M5411
18142D32124M4296k751r783M2297J0974k764k0914J016M7813N0257N3138R1315
18130G37018Q8331K9781L4083O6271M4043M3568M6441R0883J76282K24625K79483
$$ plain form
18212 687474 918427 1096887 1106570 966627 806667 703677 700219 800431 916405 1100896
18202 1100896 1155441 1044428 835547 644957 482801 381442 343301 299717 266324 258347
18192 258347 257719 256092 248048 229609 214233 205019 193648 207529 197808 170683 173410 188071 221735
18179 221735 193361 176695 190230 214058 244324 256499 230117 215806 208445 185050 169814 170692
18167 170692 201502 227863 227412 219479 213194 206395 205448 222827 224469 232518 220119 199133 215889
18154 215889 237498 253566 241143 260039 286235 326413 337631 345202 336192 356096 386713 432124
18142 432124 476420 473669 463886 506183 517157 514393 493479 494495 542308 592565 645703 737018
18130 737018 825349 855130 889213 955484 999527 1043095 1089536 1180419 1356701 1581326 1860809
18119A860809L62652M21544N03249O79034J076672J828886L426876O192936Q912528
18110B5265186R331864M424030l967754p752350q036547o141573l794945k308156
18102G019755j490660r69675o86548m83531l15205k30040k16085k19877k04357
18093B203777j77856j26791j26419j21204j05970p8448p3048l2586o6818n0796
18083A243841n9456m5159l1051l1486p512K8886j5116l7612q0217p6322n4544
18072H34252m7255j6068j3835k2441j7501J8152o675K940o802L520K281p827j7400
18059G05341j4347j0558J333N0567P1460J9376k5348o9975k1511L271l0005m2552
18047F37052o4497n8760k8499j8054L4902J6573Q321k2366k1294P137L262k9684
$$ plain form
18119 1860809 2223461 2645005 3148254 3827288 4903960 6732846 10159722 16352658 25265186
18110 25265186 34597050 39021080 35053326 27300976 19264429 13122856 9327911 7019755
18102 7019755 5529095 4559420 3872872 3389341 3074136 2844096 2628011 2408134 2203777
18093 2203777 2025921 1899130 1772711 1651507 1545537 1467089 1394041 1361455 1294637 1243841
18083 1243841 1184385 1139226 1108175 1076689 1069177 1098063 1082947 1045335 965118 888796 834252
18072 834252 786997 770929 757094 734653 717152 735304 728629 731569 724767 728287 730568 722741 705341
18059 705341 690994 680436 681769 732336 803796 823172 797824 727849 706338 709609 679604 637052
18047 637052 572555 513795 485296 467242 502144 518717 527038 504672 483378 490515 493777 464093
18035D64093k0235k6760n476l854j8995Q245k7926j1270K3234q904L3843P1511
18023D77506O9015M8852o092n7001k3280l3017n5597k9921k0781m1227k0474k2673
18011B85310o50J8761o266k0809q448J7375K6590K264k3036j155J2286J9616j5162
17998C06676j7592j0476r309k4918r063l4527k0779R377m128M1499O9725L7056
17986C33541L2449N002M062o919l3782m04M137l7974j7538j4209k9134j1445J2027
17973B39813K6180k250k3259K158j0233m5493m4799k8524K1969L1750L1720O155
17961B05187L2108K2703l235l1210j6826m131q280J9650K6609R392J2318K7262
17949B91547n697J5050J5433L683L2171J7419l148P28k1839o454j3083J0651l2401
$$ plain form
18035 464093 443858 417098 411622 407768 388773 397018 369092 357822 381056 372152 405995 477506
18023 477506 546521 595373 589281 532280 509000 475983 420386 390465 369684 328457 307983 285310
18011 285310 284660 303421 297155 276346 267898 285273 311863 314127 291091 289936 302222 321838 306676
17998 306676 289084 278608 269299 244381 235318 200791 180012 189389 185261 226760 296485 333541
17986 333541 365990 370992 375054 368135 334353 333949 338086 300112 282574 268365 239231 227786 239813
17973 239813 265993 263743 240484 242642 232409 186916 142117 113593 135562 167312 199032 205187
17961 205187 237295 259998 256763 225553 208727 204596 196316 215966 242575 251967 264285 291547
17949 291547 285850 300900 316333 320016 352187 369606 366458 367186 345347 338893 325810 336461 304060
17936C04060Q577R325K2415M5871K8115Q0004R4418Q6536M1118m9989p8172m6520
17924E45758k5742j0786k0218j2618j213J9971k808l297l4738m4126k6142J5954
17912C99995K5068K8068K4487J5076M960K1773K0980L6850L1566J5702j0488R627
17900F23664J3658M3440N2948N1301L2295J0260n6824q4975j7260q563k2549k9262
17888F08133k333J3412j1281J8486M260J3536M2648M8392J9117J6608L4247j5748
17876G89477k1466J8114Q744K4728M4101N3911M7400N7405J2126j0889p247J584
17864A017988K6823N151j9201l3954O4420O9637P3059O5674N3898L0783L3867
17853A388145M1053L3015L1290L9309L0941J8827L9886M8729R9852J01132Q5975
$$ plain form
17936 304060 312637 321962 344377 390248 418363 498367 592785 679321 720439 670450 592278 545758
17924 545758 520016 509230 489012 476394 475181 495152 492344 489047 454309 410183 384041 399995
17912 399995 425063 453131 477618 492694 497654 519427 540407 577257 608823 624525 614037 623664
17900 623664 637322 680762 733710 785011 817306 827566 770742 685767 668507 659944 637395 608133
17888 608133 605800 619212 607931 626417 630677 644213 686861 735253 754370 770978 805225 789477
17876 789477 768011 786125 794869 819597 863698 917609 965009 1022414 1034540 1023651 1016404 1017988
17864 1017988 1044811 1049962 1030761 996807 1061227 1130864 1203923 1269597 1323495 1354278 1388145
17853 1388145 1429198 1462213 1493503 1532812 1563753 1582580 1622466 1671195 1771047 1872179 1958154
17842A958154Q2746R7975J27710J73144J82927J54883J46255J73461K01916K26679
17832C525850K35983K30352K25860K40473K94907M11206N95359Q47873J028365
17823G636228J017959Q00180O16227N14684L24998K21817L32017O11823J117014
17814A3192947J647959K184379K797719L586144M685796O385653R275911J4778692
17806E8535200K6087103M7050603P0782824Q0030047N2714946j8050035n9905850
17799B57244838o8366783n7144291l7207868k2549957j4155011r532060o636350
17792D1652518m568916k830959j703656j402848j265551j208904j156742q27342
17784B6687600k63683M14420J089590J366330J212374J444455K170039L495600
$$ plain form
17842 1958154 2040900 2138875 2266585 2439729 2622656 2777539 2923794 3097255 3299171 3525850
17832 3525850 3761833 3992185 4218045 4458518 4753425 5164631 5759990 6607863 7636228
17823 7636228 8654187 9454367 10070594 10585278 10910276 11132093 11464110 12075933 13192947
17814 13192947 14840906 17025285 19823004 23409148 28094944 34480597 43756508 58535200
17806 58535200 84622303 131672906 202455730 282485777 335200723 317150688 257244838
17799 257244838 188878055 131733764 94525896 71975939 57820928 48288868 41652518
17792 41652518 37083602 34252643 32548987 31146139 29880588 28671684 27514942 26687600
17784 26687600 26423917 26838337 27927927 29294257 30506631 31951086 34121125 37616725
17776C7616725N551973Q812221J4912539K7433409M8939939P0200980P3957676
17769B87425462L7446788k9323451o0986795o4698612n0999338l2372084j9799904
17762F6692066j2782050q965174o584447m799476l341927k439855k012798j862776
17754B3903563j705602j424457j071987o65346k95606j40080l71671q43013r03047
17745A6482754o39605l39799k60340n92522j026362j167785j080370q35855o10246
17736I929870m94874m42735l98741l59372k99626k67227k14460k38399k11957
17727G002479k14305j93863j98726j93765j98024k25755k05114j62819j32488
17718E277620j88617k02034j50775j57324j33541q1841o6784q3434j05421j29859
$$ plain form
17776 37616725 43168698 51980919 66893458 94326867 143266806 213467786 287425462
17769 287425462 324872250 295548799 234562004 169863392 118864054 86491970 66692066
17762 66692066 53910016 44944842 38360395 33560919 30218992 27779137 25766339 23903563
17754 23903563 22197961 20773504 19701517 19036171 18740565 18600485 18228814 17385801 16482754
17745 16482754 15843149 15503350 15243010 14650488 13624126 12456341 11375971 10540116 9929870
17736 9929870 9434996 8992261 8593520 8234148 7934522 7667295 7452835 7214436 7002479
17727 7002479 6788174 6594311 6395585 6201820 6003796 5778041 5572927 5410108 5277620
17718 5277620 5089003 4886969 4736194 4578870 4445329 4363488 4296704 4213270 4107849 3977990
17708C977990j19596j24474j18973q3727j04356j24773j02950p0502k5743r809
17698C093087k2880o2683q5562n6428o4736j07803p8891m3040l6994l6914m4365
17687B452791k5918n5088o6789m6218m3761n6129n4953k9664j3457l1311r689
17676B019814j5901p8712j04027p4188m1368l9634o2428p2170k8589J3254j2359
17665A503692l2179k7323l9466l3518o433k8117R237O050k8801l6194m4071M065
17653A246942Q8J8228j4321l7600l7425m5056n3681j8892J175K1909q560o6478
17641A006329p7232j9820K53P71K1004k4366n2315n1372m4453k7033p07R397k6216
17628G14240n3918k1728j8210k9167j7727k7939j570K552J5267Q743r949n355
$$ plain form
17708 3977990 3858394 3733920 3614947 3531220 3426864 3302091 3199141 3128639 3102896 3093087
17698 3093087 3070207 3007524 2921962 2865534 2800798 2692995 2614104 2571064 2534070 2497156 2452791
17687 2452791 2426873 2371785 2304996 2258778 2215017 2158888 2103935 2074271 2060814 2029503 2019814
17676 2019814 2003913 1925201 1821174 1746986 1705618 1665984 1603556 1531386 1502797 1516051 1503692
17665 1503692 1471513 1444190 1404724 1371206 1364773 1336656 1345893 1351943 1323142 1286948 1242877 1246942
17653 1246942 1247030 1265258 1250937 1213337 1175912 1130856 1077175 1058283 1059458 1081367 1072807 1006329
17641 1006329 929097 909277 909530 910301 931305 906939 854624 803252 758799 731766 731059 740456 714240
17628 714240 660322 638594 620384 591217 573490 545551 543981 546533 561800 570543 560594 555239
17616E55239J1599m329n752q821k9089j6846J702m063q091M449J7750J5178O664
17603E35590l3358n6645k0135p034o447m384j2108j914j7896m7577l2974k9733
17591B65385k52r160R989M722k4132k3999l4488M434M0539J6846N3174K4781M888
17578C32727r527j1545j6957k7110J3121j9832k18N1405q482m4230l160M905N061
17565B66158J9274K8016o904j0839j2759k0156j8192R800L9298j3084l3503j5515
17553B31594J1399L701J6997J2809k4025l9644j1371K130J3584K080l7475j3429
17541A68350K546j7796j7341j3025J0198j211q241O32J1642L0418K200j7411k7677
17528A23284M255M45N194l836p110J1577r17k3082j0354J1289K4135L3566j0723
$$ plain form
17616 555239 566838 562509 556757 547936 518847 502001 503703 499640 491549 495998 513748 528926 535590
17603 535590 502232 445587 425452 418418 411971 407587 395479 393565 375669 328092 295118 265385
17591 265385 265133 255973 265962 270684 246552 222553 188065 192499 233038 249884 303058 327839 332727
17578 332727 323200 311655 294698 267588 280709 260877 260659 312064 303582 259352 256192 261097 266158
17565 266158 285432 313448 306544 295705 282946 262790 244598 254398 293696 280612 247109 231594
17553 231594 242993 246694 263691 276500 252475 212831 201460 203590 217174 219254 181779 168350
17541 168350 170896 153100 135759 122734 132932 131721 123480 124112 135754 166172 168372 150961 123284
17528 123284 127539 127984 133178 129342 122232 133809 132892 109810 99456 110745 134880 168446 157723
17515A57723l0700J191j79j3653k9633k7236K4014r03l7664j9533J0579j9649
17503A4357J4663J2464j7495N442n385j6874L662n3455m9809j9954j2764R260
17491a15888K7733P4414L9524K836K2812K2079k62j1206j0679j8589M815J2323
17479D9912M7455J1725p733l9085l642J7912Q543k4616m6287j1926J3145J262
17467A6665J0287Q816J122j1288n6270o4524l8667M8042M0485M8548L1887L313
17455C8416J3954M3975l717m025M787N704l942J5822K444q607J5657O0545N3138
17442B34151O557o0901l1956p078k7736l3681J9782j7631j1655L202Q686o490
17430G5250p397J1688j1124k8823l5007K1314J066K38J9178L3392j2697J834Q403
$$ plain form
17515 157723 127023 128214 128035 114382 84749 57513 81527 80624 42960 23427 34006 14357
17503 14357 29020 41484 23989 29431 24046 7172 10834 -42621 -92430 -112384 -125148 -115888
17491 -115888 -88155 -13741 25783 28619 51431 73510 73248 62042 51363 32774 37589 49912
17479 49912 97367 109092 101359 62274 58632 76544 85087 60471 14184 2258 15403 16665
17467 16665 26952 35768 36890 25602 -30668 -95192 -133859 -85817 -45332 3216 35103 38416
17455 38416 52370 96345 92628 88603 93390 99094 95152 110974 113418 104811 120468 181013 234151
17442 234151 240708 179807 147851 140773 113037 79356 99138 81507 69852 73054 81740 75250
17430 75250 67853 79541 68417 39594 4587 25901 26967 27205 46383 79775 67078 68912 77315
17417G7315j3553l7834k1355r33K2279R211j680J9151j0783j1474j4685r585Q824
17404A4898J1116L3230K6931j4180k9046n961j6109m798M829O740j0634k852K3612
17391C7776m02j0624J9236K4656m038j8723j6228m280k1909k8103K1789J6146
17379A5296L058J9849n901k4071J659J6164L3281J4499k2277r732j1032K7143
17367E7936L0029o157j4592J569k195L285n582j0503j9328J5642o47L0328J1146
17354I0931j8158j7509j8277j3553L807j2599n110m018L2990J4018j1490j0972
17342C0060K6967m521j3841J5254Q069j5131k3756k9999J420M4176L8383n768
17330G1313k6232k6206m271J2577L7202j1287k9298N603j3354M3259M992j6113
$$ plain form
17417 77315 63762 25928 4573 3640 25919 35130 33450 52601 41818 30344 15659 6074 14898
17404 14898 26014 59244 86175 71995 42949 36988 20879 16081 20910 27650 17016 14164 37776
17391 37776 37374 26750 45986 70642 66604 47881 31653 27373 5464 -22639 -850 15296
17379 15296 18354 38203 32302 8231 9890 26054 59335 73834 51557 41825 30793 57936
17367 57936 87965 81808 67216 68785 66590 69875 64293 53790 34462 50104 49457 79785 90931
17354 90931 72773 55264 36987 23434 27241 14642 9532 5514 38504 52522 41032 30060
17342 30060 57027 52506 38665 53919 61988 46857 23101 -6898 -5478 38698 77081 71313
17330 71313 45081 18875 14604 27181 64383 53096 23798 29401 16047 59306 64298 48185
17318D8185K1638J214j3457l63K6554P912l1514k2311M1939J4217o033n543j6452
17305F5986k1081n148o337j6368m363P366J0414q309n182k459Q361J6690q033
17292C1537K914J5292l2848l27K0737j7702L053L1742l289m541R64k639j1697
17279C3196j1706l508J27J7976P683P278N19j788J5075j6248k3909K1994M4879
17266I1568j263k1147l1276J3303Q741J0119m36j348Q219j2801l473J8697j0216
17253F8687j0631J4615P404K5691M6468L7539J9284O5950Q8168J59605K50428
17242G73208M07353L90612K49847j22397l63339l76583k77923j73040j02175q8621
17232C16942o1027l5921k0072j8270k707P711j8497j1740j5427M0244R781m2388
$$ plain form
17318 48185 69823 71037 57580 57217 83771 91683 60169 37858 79797 94014 87981 82438 65986
17305 65986 44905 39757 33420 17052 12689 20055 30469 22160 16978 14519 22880 39570 31537
17292 31537 34451 49743 16895 16568 37305 19603 22656 54398 51109 46568 47532 44893 33196
17279 33196 21490 17982 18109 36085 43768 51046 51565 49777 64852 48604 24695 46689 91568
17266 91568 90305 69158 37882 51185 59926 70045 69609 68261 76480 63679 60206 78903 68687
17253 68687 58056 72671 80075 105766 152234 189773 209057 275007 363175 522780 773208
17242 773208 1180561 1571173 1821020 1698623 1335284 958701 680778 507738 405563 316942
17232 316942 255915 219994 199922 181652 178945 186656 168159 156419 140992 181236 191017 148629
17220A48629k8648r805K9937J5191K3276O4309N2865N7238J08783J80949K77847
17209I20571L36684L48255J47678j73510l39913l34430k61381j78833q7467p7856
17199B99798m5456m8390m1515j5430k127p209n899K2138j5959k4384l269j4674
17187I7624L722L1459J0902k7133j8671j793Q644p020j5543p524k3157l6234j7010
17174a734j4953J3196K0907J5833J2875J5477p677k8588j6145Q63J1870l711l5187
17161a6974n416K5200K1824J2235L097J182O744J2380l032j285k8453p370j7319
17148B813j1281l613J0791J1170l276J1331L5528M398j8174j3145m388N393Q322
17135C5869J4611L022k3980m0231N95l08j2877J8674L4100k071l108J3450K5011
$$ plain form
17220 148629 119981 110176 140113 155304 178580 242889 295754 352992 461775 642724 920571
17209 920571 1257255 1605510 1753188 1579678 1239765 905335 643954 465121 377654 299798
17199 299798 254342 205952 164437 149007 146880 139671 133772 155910 139951 115567 112298 97624
17187 97624 101346 132805 143707 116574 97903 96110 104754 97734 82191 74667 51510 15276 -1734
17174 -1734 -16687 -3491 17416 33249 46124 61601 53924 25336 9191 10054 21924 18213 -16974
17161 -16974 -22390 2810 24634 36869 39966 41148 47892 60272 57240 55955 27502 20132 2813
17148 2813 -8468 -12081 -1290 9880 6604 17935 53463 57861 39687 26542 22154 27547 35869
17135 35869 50480 53502 29522 -10709 -10114 -10422 -23299 -4625 29475 27404 24296 37746 62757
17122F2757j1237m3904n4799k3762L1671K6845J0939L297P693J7455J9849J8307
17110F5111j3872L428k6410k2205j6202l186j1624J0048M1483k260k6513J2755
17098A0553M836J0884j0875J0140M125L05o57Q67J385L825k1140j6958O341q380
17084d749o358J2573R121J3014K1095N831J3410j7795j2395M946l335O118K7496
17071F8972J980j4780k3814l674k830Q579j4220l8387K64J7513J3889K1724k924
17058C2292l7015N950K0807J4870P627p268M649q368j0508j2838j7936j7497M3785
17045A8550L6672j5164j8997J8559j5360j3880O539L23J3828J451j9149K6070
17033C9442O184l4832j8204J5824R86P13l2193k273J1721N560j1337l374J9038
$$ plain form
17122 62757 51520 7616 -47183 -70945 -39274 -12429 -1490 1807 9500 26955 46804 65111
17110 65111 51239 54667 28257 6052 -10150 -13336 -24960 -14912 26571 24311 -2202 10553
17098 10553 15389 26273 15398 25538 29663 29968 29311 30178 31563 35388 14248 -2710 3631 -4749
17084 -4749 -11107 1466 10587 23601 44696 50527 63937 46142 33747 38693 35358 41476 68972
17071 68972 70952 56172 32358 28684 25854 34433 20213 -18174 -17910 -397 13492 35216 32292
17058 32292 -4723 1227 22034 36904 44531 37263 41912 33544 23036 10198 -7738 -25235 18550
17045 18550 55222 40058 21061 39620 24260 10380 16919 17242 31070 32521 13372 39442
17033 39442 45626 10794 -7410 8414 9400 10113 -22080 -24353 -12632 -7072 -18409 -21783 -2745
17020b745Q003n630j7585L051L0946J2784r225j8940J7707r917M864M177o142
17007A1348j6862J5761K0231R029k0962J5435L936o206L176j1415Q137j01j7990
16994A3517l2734J5233J0809J3638j5337l1522j2186Q939L993K329K6268K4492
16982B7439j1719K2175J3207J509k1429m8598O77K9080J483j8118L3146K0439
16970D9291j0258l424P49k9939p380j1985K7951J2209Q581j1645j0173l802J0442
16957B0617P458J0581j5796m2836M220M1638p224O025N835j9292j4133j3919j814
16944a8640P937q377J484k1813K6912J0253k8949R121q203J6454J1285L0334k5701
16931B097k8771L594q813k1159j272Q425K2474K2075J6251l099j0907K0986q82
$$ plain form
17020 -2745 5258 -372 -17957 -14906 16040 28824 19599 659 18366 8449 13313 17490 11348
17007 11348 -5514 10247 30478 39507 18545 33980 37916 31710 34886 23471 31608 31507 13517
16994 13517 -19217 -3984 6825 20463 5126 -26396 -38582 -29643 -25650 -23321 2947 27439
16982 27439 15720 37895 51102 52611 31182 -17416 -16739 12341 13824 -4294 28852 49291
16970 49291 39033 35609 36358 6419 -961 -12946 15005 27214 35795 24150 13977 10175 20617
16957 20617 28075 38656 22860 -19976 -15756 25882 18658 24683 30518 11226 -2907 -16826 -18640
16944 -18640 -10703 -19080 -17596 -39409 -12497 -2244 -31193 -22072 -30275 -13821 -2536 27798 2097
16931 2097 -26674 -23080 -31893 -53052 -54324 -45899 -23425 -1350 14901 11802 895 21881 20999
16918B0999j8744j548j4397J1059K5124K560k4857j1791L1323J2963m52l1151
16906A088j8246j5305J1576j7188M887K1190K4728k0199m40K9894R039m5553j9396
16893c3925J0606L1357k356k772J1O319J4401k1010j912J2764R761k6147K529
16880c74J5119p807J0475K6452o70l9004K211L7374q354l0266j2664M094r833
16867a3247R321L2796R04j7975M296n674j7141R171Q775l932k5171K7086l037
16854F172j5064O672J6626J0904k0698j9454j0887j4839N300J0587p88l839M332
16841b4976j703L028K972Q905j5148k5659P771K1811J5839r636q216K0268j277
16828f021p004j340O774J0192K7755k3590j7570J3194J5906J1377r277j700o587
$$ plain form
16918 20999 2255 707 -13690 -2631 22493 25053 196 -11595 19728 32691 32239 1088
16906 1088 -17158 -32463 -20887 -38075 -33188 -11998 12730 -7469 -7909 21985 31024 -14529 -33925
16893 -33925 -23319 8038 5682 2910 2921 9240 23641 2631 719 13483 23244 -2903 -374
16880 -374 14745 6938 17413 43865 43195 4191 6402 43776 35422 5156 -7508 -3414 -13247
16867 -13247 -3926 28870 29774 11799 16095 10421 -6720 2451 11226 7294 -17877 9209 6172
16854 6172 -8892 -2220 14406 25310 4612 -14842 -25729 -40568 -35268 -24681 -25469 -29308 -24976
16841 -24976 -26679 -23651 -20679 -11774 -26922 -52581 -44810 -22999 -7160 -16796 -25012 -4744 -6021
16828 -6021 -13025 -14365 -7591 2601 30356 6766 -10804 2390 18296 29673 20396 18696 12109
16815A2109j8422j618M560M164K372J0408m496k528n644k945L0491r694l4503
$$ plain form
16815 12109 -6313 -7931 -3371 793 3165 13573 9077 6549 905 -2040 28451 18757 -15746
$$ [...]
##END NTUPLES=NMR SPECTRUM
##END=
