##TITLE=Analysis number 324642
Compound Code sp 00184
Project Code adrs
Chemist Name stores
##JCAMPDX= 6.0         $$ Bruker NMR JCAMP-DX V2.0
##DATA TYPE= NMR SPECTRUM
##DATA CLASS= NTUPLES
##ORIGIN= Bruker BioSpin GmbH
##OWNER= nmr
$$ XWIN-NMR		Version 3.5
$$ Tue Nov 28 12:47:41 2006 GMT Standard Time (UT+0h)  MAYBRIDGE\nmr@NMR_250MHZ
##.OBSERVE FREQUENCY= 250.131544655141
##.OBSERVE NUCLEUS= ^1H
##.ACQUISITION MODE= SIMULTANEOUS (DQD)
##.ACQUISITION SCHEME= undefined
##.AVERAGES= 16
##.DIGITISER RES= 18
##SPECTROMETER/DATA SYSTEM= dpx250
##.PULSE SEQUENCE= zg30
##.SOLVENT NAME= CDCl3
##.SHIFT REFERENCE= (INTERNAL, CDCl3, 0, 16.4403)
##AUDIT TRAIL= $$ (NUMBER, WHEN, WHO, WHERE, WHAT)
$$ ##TITLE= Audit trail, XWIN-NMR		Version 3.5
$$ ##JCAMPDX= 5.01
$$ ##ORIGIN= Bruker BioSpin GmbH
$$ ##OWNER= nmr
$$ C:\u/data/dgb/nmr/ADRS/1330/pdata/1/auditp.txt
$$ ##AUDIT TRAIL=  $$ (NUMBER, WHEN, WHO, WHERE, WHAT)
(   1,<2006-11-28 12:47:08.40 +000>,<MAYBRIDGE\nmr>,<NMR_250MHZ>,
      <created by zg, POWCHK disabled, PULCHK disabled
       configuration hash MD5:
       49 4B E0 1D 92 C2 6B 37 9F E6 65 BC 52 41 86 1D
       data hash MD5: 64K
       3F AD 4E E3 A7 BD 74 91 4C AC C9 84 76 AE 0A 99>)
(   2,<2006-11-28 12:47:26.48 +000>,<MAYBRIDGE\nmr>,<NMR_250MHZ>,
      <Start of raw data processing
       ef LB = 0.3 FT_mod = 6 PKNL = 1 SI = 32K 
       data hash MD5: 32K
       94 78 BB 6B 38 E8 D4 49 52 40 CC 7C 52 C3 78 B6>)
(   3,<2006-11-28 12:47:28.55 +000>,<MAYBRIDGE\nmr>,<NMR_250MHZ>,
      <apk 
       data hash MD5: 32K
       65 47 8B 23 54 A2 2C 60 98 0F 7D 7F 37 72 8B 6B>)
(   4,<2006-11-28 12:47:29.40 +000>,<MAYBRIDGE\nmr>,<NMR_250MHZ>,
      <abs ABSG = 5 
       data hash MD5: 32K
       11 A9 94 00 BA 81 5A 8E 99 FE 3D 61 4B 62 8A F2>)
$$ ##END=
$$ 
$$ hash MD5
$$ 91 80 F5 8C 4D F7 DE 26 E6 56 1D B9 91 57 D4 60
##$RELAX= 
##$RELAX= 
##$RELAX= 
##$RELAX= 
##$RELAX= 
##$RELAX= 
##$RELAX= 
$$ Bruker specific parameters
$$ --------------------------
##$DU= <C:\u>
##$EXPNO= 1330
##$NAME= <ADRS>
##$PROCNO= 1
##$TYPE= <nmr>
##$USER= <dgb>
##$AMP= (0..31)
100 100 100 100 100 100 100 100 100 100 100 100 100 100 100 100 100 100 
100 100 100 100 100 100 100 100 100 100 100 100 100 100 
##$AQSEQ= 0
##$AQ_mod= 3
##$AUNM= <au_zg>
##$AUTOPOS= <37 >
##$BF1= 250.13
##$BF2= 250.13
##$BF3= 250.13
##$BF4= 250.13
##$BF5= 500.13
##$BF6= 500.13
##$BF7= 500.13
##$BF8= 500.13
##$BYTORDA= 1
##$CFDGTYP= 0
##$CFRGTYP= 5
##$CHEMSTR= <none>
##$CNST= (0..31)
1 1 145 1 1 1 1 1 1 1 1 1 1 1 1 1 1 1 1 1 1 1 1 1 1 1 1 1 1 1 1 1 
##$CPDPRG= <>
##$CPDPRG1= <>
##$CPDPRG2= <>
##$CPDPRG3= <>
##$CPDPRG4= <mlev>
##$CPDPRG5= <mlev>
##$CPDPRG6= <mlev>
##$CPDPRG7= <mlev>
##$CPDPRG8= <mlev>
##$CPDPRGB= <>
##$CPDPRGT= <>
##$D= (0..31)
0 1 0 0 0 0 0 0 0 0.06 0 0 0 0 0 0 0.0002 0 0 0 0 0 0 0 0 0 0 0 0 0 0 
0 
##$DATE= 1164718026
##$DBL= (0..7)
120 120 120 120 120 120 120 120 
##$DBP= (0..7)
150 150 150 150 150 150 150 150 
##$DBP07= 0
##$DBPNAM0= <>
##$DBPNAM1= <>
##$DBPNAM2= <>
$$ [...]
##$SUBNAM7= <"">
##$SUBNAM8= <"">
##$SUBNAM9= <"">
##$SW= 20.6930455092707
##$SWIBOX= (0..15)
0 0 3 0 0 0 0 0 0 0 0 0 0 0 0 0 
##$SW_h= 5175.983436853
##$TD= 65536
##$TD0= 1
##$TE= 293.16
##$TE2= 300
##$TE3= 300
##$TEG= 300
##$TL= (0..7)
0 120 120 120 120 120 120 120 
##$TP= (0..7)
150 150 150 150 150 150 150 150 
##$TP07= 0
##$TPNAME0= <>
##$TPNAME1= <>
##$TPNAME2= <>
##$TPNAME3= <>
##$TPNAME4= <>
##$TPNAME5= <>
##$TPNAME6= <>
##$TPNAME7= <>
##$TPOAL= (0..7)
0.5 0.5 0.5 0.5 0.5 0.5 0.5 0.5 
##$TPOFFS= (0..7)
0 0 0 0 0 0 0 0 
##$TUNHIN= 0
##$TUNHOUT= 0
##$TUNXOUT= 0
##$USERA1= <user>
##$USERA2= <user>
##$USERA3= <user>
##$USERA4= <user>
##$USERA5= <user>
##$V9= 5
##$VALIST= <valist>
##$VCLIST= <CCCCCCCCCCCCCCC>
##$VD= 0
##$VDLIST= <DDDDDDDDDDDDDDD>
##$VPLIST= <PPPPPPPPPPPPPPP>
##$VTLIST= <TTTTTTTTTTTTTTT>
##$WBST= 1024
##$WBSW= 4
##$XGAIN= (0..3)
0 0 0 0 
##$XL= 0
##$YL= 0
##$YMAX_a= 773618
##$YMIN_a= -720735
##$ZGOPTNS= <>
##$ZL1= 120
##$ZL2= 120
##$ZL3= 120
##$ZL4= 120
##$ABSF1= 16.44025
##$ABSF2= -4.252922
##$ABSG= 5
##$ABSL= 3
##$ALPHA= 0
##$AQORDER= 0
##$ASSFAC= 0
##$ASSFACI= 0
##$ASSFACX= 0
##$ASSWID= 0
##$AUNMP= <proc_1d>
##$AZFE= 0.1
##$AZFW= 0.1
##$BCFW= 0
##$BC_mod= 0
##$BYTORDP= 0
##$COROFFS= 0
##$CY= 12.5
##$DATMOD= 1
##$DC= 0
##$DFILT= <>
##$DTYPP= 0
##$F1P= 14.0000005364418
##$F2P= -0.99999901652339
##$FCOR= 0.5
##$FTSIZE= 32768
##$FT_mod= 6
##$GAMMA= 0
##$GB= 0
##$INTBC= 1
##$INTSCL= 1
##$ISEN= 128
##$LB= 0.3
##$LEV0= 0
##$LPBIN= 0
##$MAXI= 10000
##$MC2= 0
##$MEAN= 0
##$ME_mod= 0
##$MI= 0
##$NCOEF= 0
##$NC_proc= -3
##$NLEV= 6
##$NOISF1= 0
##$NOISF2= 0
##$NSP= 0
##$NTH_PI= 0
##$NZP= 0
##$OFFSET= 16.44025
##$PC= 1
##$PHC0= 217.4193
##$PHC1= 12.76276
##$PH_mod= 1
##$PKNL= yes
##$PPARMOD= 0
##$PSCAL= 4
##$PSIGN= 0
##$REVERSE= no
##$SF= 250.130020445483
##$SI= 32768
##$SIGF1= 0
##$SIGF2= 0
##$SINO= 400
##$SIOLD= 32768
##$SREGLST= <1H.CDCl3>
##$SSB= 0
##$STSI= 32768
##$STSR= 0
##$SW_p= 5175.98343685301
##$SYMM= 0
##$S_DEV= 0
##$TDeff= 65536
##$TDoff= 0
##$TI= <Analysis number 999999
Compound Code 99
Book Reference 9
Project Code 9>
##$TILT= no
##$TM1= 0
##$TM2= 0
##$TOPLEV= 0
##$USERP1= <user>
##$USERP2= <user>
##$USERP3= <user>
##$USERP4= <user>
##$USERP5= <user>
##$WDW= 1
##$XDIM= 32768
##$YMAX_p= 358880790
##$YMIN_p= -447742
$$ End of Bruker specific parameters
$$ ---------------------------------
##NTUPLES= NMR SPECTRUM
##VAR_NAME=  FREQUENCY,     SPECTRUM/REAL,   SPECTRUM/IMAG
##SYMBOL=    X,             R,               I
##VAR_TYPE=  INDEPENDENT,   DEPENDENT,       DEPENDENT
##VAR_FORM=  AFFN,          ASDF,            ASDF
##VAR_DIM=   32768,         32768,           32768
##UNITS=     HZ,            ARBITRARY UNITS, ARBITRARY UNITS
##FACTOR=    0.157963299565203, 1,           1
##FIRST=     4112.20016786256, 0,            0
##LAST=      -1063.78326899045, 0,           0
##MIN=       -1063.78326899045, -447742,     0
##MAX=       4112.20016786256, 358880790,    0
$$ Real data points
##PAGE= N=1
##DATA TABLE= (X++(R..R)), XYDATA
$$ [...]
13973A6846j863k05K867J6284M561k137p139j0371j4047j0297k22K629k948O118
13959G6J4127N193J399j0370l285j0437n479j2979Q943J5867K306p14L057r302
13945a598j1434J2716J4888j1582j3892m571J1227R378j785P517k507q573j723
13932a939l990O67l283l274J2058O384K549J4724m053k277q838k387n65L4O14
13917F424l676j6284K824K1054J5191J006n214o034O349n72j7493K775J0406O6
13903A6822n220l618r476l323j0661K86R494Q749O126o997J375O946O001L219
13889A9723r724p21j4849j9396n077J3678J5157r62Q463K247N518Q326j186j0734
13875A0463o057j211R42p071M135J3024P693j204q239j4069m101l932M003J2253
$$ y = [16846, 14983, 14778, 17645, 33929, 38490, 36353, 29214, 18843, 4796, -5501, -5723, -3094, -6042, 76, 14203, 19396, 20795, 10425, 7140, -3297, -8776, -21755, -12812, 3055, 5361, 4647, 7704, -1598, -13032, -316, 14572, 2990, -10902, -15473, -4246, 5132, 3347, 10864, 8357, -216, -1939, -5929, -5262, -8545, -11819, 239, 6623, 9172, 23896, 19843, 17566, 8728, 6341, 5776, 5810, 6424, 2748, -13536, -10712, 10342, 25533, 26539, 21325, 15291, 21640, 21068, 3575, 6350, 16756, 16822, 11602, 7984, -1492, -4815, -15476, -15190, -5696, 3053, 9179, 2182, 3557, 10503, 16504, 19723, 9999, 9278, -5571, -24967, -30044, -16366, -1209, -2171, 6292, 8539, 14057, 22383, 21197, 10463, 4406, 3195, 4137, -2934, 1201, 14225, 21918, 20714, 12475, -1594, -5695, -9627, -5624, 6629]
13861F629q082n120Q498p28J854R303k0177k4582N563J6130l115J211N916P448
13847G48N632J906j0941j0888P161N093K143m40L290Q807n405m635k773j607P297
13832E388L832j2197j2152J6091N93k416j0003j0481J4260K454m591P13J0612
13819B103r11J451J7557o630p331J571l984J039J272N098j2014L859O843m161
13805E762j0650r56m305P815K691p881l784P687Q61O70M148K70k923m875N253
13790b17O166J693q426m019J4353J3524J862j3768q101L200m675J40M846j330
13776E248J278K583J910q634q953J6074j202K109j0728l349j733j498J3464J3097
13762A9666j5884j2817j0015K655o31M128O09k807M322M031R341J0814M290j1520
$$ y = [6629, -1453, -6573, 1925, 1197, 3051, 12354, -7823, -32405, -26842, -10712, -13827, -12616, -6700, 748, 6380, 8286, -2655, -13543, -6382, -1289, 854, 414, 3704, 12511, 7106, 2471, -302, -1909, 5388, 9220, -2977, -15129, 962, 1555, -861, -10864, -21345, -7085, -4631, -9222, -8509, 2103, 1192, 2643, 20200, 13570, 6239, 7810, 3826, 4865, 6137, 11235, -779, 3080, 9923, 5762, -4888, -5844, -10149, -2334, 357, -7524, -11308, -3621, -2760, -2090, 2058, 2328, -595, -5470, -217, 5949, 7642, -784, -4803, 9550, 23074, 24936, 11168, 3067, 6267, 1592, 1732, 6578, 5248, 6526, 9109, 11019, 2385, -6568, 9506, 8304, 10413, -315, -3664, -5397, -6895, 6569, 19666, 3782, -9035, -19050, -16395, -17026, -12898, -12289, -15096, -10774, -6743, 2598, 13412, 17702, 6182]
13748F182p321j4797n36J5198J139l352j4022M06J2300J1508k374l604J5925J5358
13734C2010j7669q243M408J649q717j0606M240J1585K074O246l694j7469K564
13721a622N094j613L114J507l669O899J0454k945J426l943j5729N457o29r194
13707e393j7414r93K0435J5120j096j7072p086j066J055m043J1248m837K706J1118
13693B682q232l639P76Q735J2575q061j9125m611R521P946r625j1825L743J5033
13679d107J4168j0500m792r60k301M139n08l287O160J7115k832k746p596o452
13665d499j0395P150n147m433k368R053Q421j4106k084J3567r59p214n539j506
13651b0059O71L06l131l320Q509J408j0077j20R707M130J0680M73Q540m181k773
$$ y = [6182, -1139, -15936, -16472, -1274, -135, -3487, -17509, -17103, -4803, 6705, 4331, 727, 16652, 32010, 14341, 6098, 10506, 12155, 3438, -7168, -2928, 8657, 10731, 16977, 13283, -4186, -1622, 3472, 1859, 4973, 6480, 2811, 9710, 20164, 17219, 18645, 14702, -1027, 4430, 3801, -5393, -22807, -23800, -3365, 11755, 10659, -6413, -13499, -14565, -13510, -17553, -6305, -11142, -8436, 2682, -5550, -9189, -8413, 322, 12897, 4836, -14289, -18900, -9379, -1433, -11058, -22883, -19140, -4107, 10061, -439, -5231, -6191, -8492, -4353, -4861, -8148, -1988, 15127, 12295, 9549, 1953, -4499, -14894, -7744, -12891, -17324, -19692, -10639, -2218, -16324, -18408, -4841, -5800, -13014, -18553, -20059, -19388, -19082, -22213, -25533, -17024, -15616, -25693, -25813, -16106, -11976, -1296, -823, 7717, 3536, 763]
13636G63j1066j1955J0426R215j881j3363p056p567Q168K2255P613O543q566L639
13622G168Q036j6554J424K47o095K373J4478Q149L837k4248n497q198j0250J0353
13608a4777N00Q793r31j629J7950n206r865p731p838j7295O462K2098r718o04
13594a9791J7778R917J824j1276q316l949J9234J052r061r548p156q189J1048
13581a6433j95r2K1359K949J490q342r18R822O604j4272q687J1617M252j1380
13567b226q420p64m572j3981M361J2549J0532R022J672j0263q903n13J0181j469
13553b794j1476N191k265J0126J3364n789j5124M213L876m886n599q033K457R406
13539g333J571n25p870r556K0870L333J2297J818j3913o947N649p705L98J8195
$$ y = [763, -10303, -22258, -11832, -2617, -4498, -17861, -24917, -32484, -24316, -2061, 5552, 12095, 3529, 7168, 15204, -1350, 74, 321, -5774, -3401, 11077, 19226, 23063, -1185, -6682, -14880, -25130, -14777, -14277, -5484, -6415, -8044, 9906, 4700, -5165, -12896, -20734, -38029, -31567, -9469, -19187, -19791, -2013, 7904, 9728, -1548, -9864, -13813, 5421, 6473, -2588, -12136, -19292, -27481, -16433, -16628, -16720, 4639, 7588, 9078, 736, -182, 9640, 16244, 1972, -6715, 4902, 9154, -2226, -10646, -11410, -15982, -29963, -25602, -13053, -2521, 6501, 8173, -2090, -10993, -11506, -1325, -2794, -14270, -9079, -11344, -1218, 12146, 6357, -8767, -4554, -678, -5564, -11163, -19196, -16739, -7333, -5762, -6287, -14157, -23713, -2843, 490, 12787, 14605, 692, -6255, -606, -8311, -7913, 10282]
13525A0282j390j0262j4193J6584J6284j3463p05Q490J227L355M275j1871j2871
13512d258n779n682L287P202O82q56n5m152P829m197q766O090q107j2256N565
13497b3453J2785K840o162P669J3634M122k381k2667j1153P289R975K520Q29O6
13483d087n329M598P659O353M352k193j1068O838n977q681K125k433O530K994
13469A681N2r2O361K724j1665J838J1066n057m405m206j426p971j0121l690P765
13454a7146O707k07Q250M633J068O479J572L121J587j8782q555M349k551L618
13440e857k009k823P723J0775K531R45J930J097r479R22P771L46q002j5663N157
13425d636Q723j0003q155k136M428l421r913j695N266M695L0405P175m195k326
$$ y = [10282, 8892, -1370, -15563, 1021, 17305, 3842, 3137, 11627, 12854, 16209, 20484, 8613, -4258, -10037, -15719, -12432, -5230, -4548, -5404, -5459, -9611, -1782, -5979, -14745, -8655, -16762, -29018, -23453, -10668, -7828, -13990, -6321, 7313, 11435, 9054, -13613, -24766, -17477, -7502, -4982, -4153, -4087, -9416, -4818, 2841, 9194, 13546, 11353, 285, 7123, 1146, -7535, -5410, -7843, -1313, 1681, 1733, 1641, 8002, 10726, -939, 899, 11965, 6908, 2503, -1703, -3129, -11100, -21221, -24911, -17146, -10439, -10646, -2396, 2237, 3305, 9784, 11356, 14477, 16064, -2718, -11273, -6924, -9475, -5857, -7866, -10689, -2966, 7809, 10340, 11285, 13215, 14312, 4833, 5755, 13526, 13872, 5870, -9793, -4636, 4087, -5916, -14071, -16207, -11779, -15200, -25113, -26808, -21542, -16847, 13558, 20733, 16538, 14212]
13411A4212J153n37n12J594p827k4355p372M707P364N87r035P860P896P036K455
13396E226j5999j1006Q24L098J5568J5855r203p121q920J0228O770M265o597j7044
13382a4056l490J3214J2626L035q709o633Q96L299m303j787m185l37J0321M08
13368B99j4868K175P614N676J2343k573p976J980j856K173P909j611n183N335
13354A1437j0423j408l698N161k680k001k621N415J5904q798j1539Q430J0961
13341A4140p244j6634j1351k993O32L291J9218Q834k301N895p887k0693m803K1576
13327c20k331j456j4532l187M485n882J975J2326N611j1001o586K40J2912J9057
13313A1311l780p446O365N535k665k772R266J2961J572N60J472p629j7172L317
$$ y = [14212, 15365, 14828, 14316, 15910, 8083, -16272, -23644, -18937, -11573, -10986, -20021, -12161, -4265, 2771, 5226, -10773, -21779, -20955, -17857, -2289, 13566, 4363, -2758, -11678, -1450, 5320, 9585, 2988, -14056, -17546, -4332, 8294, 11329, 2620, -4013, -3117, 182, -4121, -5908, -10093, -10430, -109, 299, -14569, -12394, -4780, 896, 13239, 10666, 2690, 4670, 2814, 4987, 12896, 11285, 6102, 11437, 1014, -394, -4092, 1069, -1611, -3612, -6233, -818, 15086, 6288, -5251, 3179, 14140, 6896, -9738, -21089, -24082, -23450, -20159, -941, 7893, 5592, 11487, 3600, -17093, -21896, -320, -2651, -4107, -18639, -21826, -17341, -23223, -21248, -8922, -3311, -14312, -20898, -20658, -7746, 11311, 7531, 85, 6450, 11985, 9320, 6548, 15814, 28775, 30347, 30907, 32379, 24750, 7578, 10895]
13299A0895q494K930l16j3739P646K540N176K934J497n495k338j903p772n664
13285a2103M80O931Q041O911J436j3577k132J782j0808R39J2555K208L03j46K3421
13270B6241J6631n035j8734K271k598l779n256p845M501N081J2828l850j70m342
13256A5944o169p698L078n112m409M416N403o263j000k950l960J3522J0065m442
13242A0425j2380m944p32j352Q723n860O305L957K391o839o174L859J1541j818
13228G102p105j230L835r307j6101O095R391J2478l514L20L424j0235L761K646
13214A560k106Q224Q035K695O644O475j8852j4539L62N165K986J130N620K186
13200A5585O84q511j5895N77J0452j9742q070J0323K2275J1784o045j3499J107
$$ y = [10895, 2401, 5331, 5015, -8724, -1078, 1462, 6638, 9572, 11069, 5574, 3236, 1333, -6439, -12103, -11623, -4692, 3349, 10260, 11696, -1881, -4013, -2231, -13039, -12100, 455, 2663, 2966, 2820, 26241, 42872, 37837, 19103, 21374, 18776, 14997, 9741, 1896, 6397, 11478, 24306, 20456, 20286, 15944, 9775, 2077, 5155, 43, -4366, 50, 5453, -810, -1810, -4760, -8720, 4802, 14867, 10425, -1955, -6899, -7631, -8983, -260, -6120, 185, 4142, 6533, -306, -6480, -2621, 8920, 7102, -3, -1233, 2602, -6705, -22806, -16711, -7320, 5158, 1644, 1964, 5388, -4847, -1086, 1560, -546, 7678, 15713, 18408, 25052, 31527, 12675, -1864, -1502, 3663, 6649, 7779, 13399, 15585, 16269, 7758, -8137, -7560, 2892, -16850, -24920, -14597, 7678, 19462, 13417, -82, 1025]
13187A025l063o66N985l106m999n105p94J7935J3926r668O163k579P84K890n529
13172A3199L95p803j6031j4918J2054Q786O314J0428l571R51m738n478j0763K920
13158h255r260j254M780J6536l352m771j1975M693J3564m417l383P633P674o336
13144A877j1650m514l790J1196l953K329L388K016p191l168j034J7325P534o988
13130C377j5055j257M276m67J386j890J0177m698q408j1530Q085J3948P282J5693
13116B0919Q605l213j712j383j5016m299Q369m808k888j923j6517M517Q815J0098
13102I564J7225n008j8407o960L149p540K588M671k735r054m796J5971R187j1383
13088c528p308R906k669p394O933j690Q571J1788q088j6970j244O113j0120M133
$$ y = [1025, -2038, -2704, 3281, 175, -4824, -9929, -10723, 7212, 21138, 11470, 17633, 15054, 15838, 18728, 13199, 13594, 5791, -10240, -25158, -13104, -4318, 1996, 12424, 8853, 9804, 5066, -412, -11175, -8255, -17515, -18769, -13989, 2547, -805, -5576, -17551, -12858, 706, -3711, -7094, 539, 8213, 1877, -9773, -14287, -18077, -6881, -10834, -8505, -5117, -3101, -10292, -13460, -14494, 2831, 10365, 3377, -11678, -12935, -8659, -9126, -7740, -9630, 547, -4151, -12559, -24089, -16004, -2056, 5226, 20919, 29524, 26311, 24599, 23216, 8200, 3901, 12270, 7462, 4574, 2651, -13866, -9349, -534, 9564, 26789, 21781, 3374, -3586, -437, -7977, -5389, -718, -3453, -12507, -17303, -1332, 7855, -3528, -10836, -930, -3599, -10993, -4060, -5750, 2821, 14609, 6521, -10449, -11693, -5580, -15700, -11567]
13074a1567l830j575N33K361l534Q246j1982q361p6J4998J1287o025m707J2182
13060b050J4587J057N439q028m720P740P496L024j4883o428n875J0680R626j146
13046A6519o423n061j5155L722N881K401q018m664L434J26J0056J4274N34L119
13032B0745p020j6708Q070j216j4270O816J679L349J661j5042k414J5452O355
13019G457K21j5853R327P119n706l826k317K1150J8515N97j7573r188j0258q617
13005h952J2666Q879j668n223L076J2900j0319j5099K942J1876j006q765l009
12992a702r264N135P263k6171K547J2319q46l152J6000r614J66p605P329N289
12978b306m203N563J0865j736j6123m456P553O067o573K37O929L238J592j0068
$$ y = [-11567, -15397, -16972, -16439, -14078, -17612, -9366, -21348, -29709, -29785, -14787, -3500, -9525, -14232, -2050, 12537, 13594, 19033, 11005, 6285, 14025, 21521, 24545, 9662, 3234, -2641, 8039, 17665, 16519, 10096, 5035, -10120, -6398, -517, 1884, -6134, -10798, -7364, -7238, 2818, 17092, 17626, 20745, 13725, -2983, 5087, 3871, -10399, -3583, -1904, 1445, 3106, -11936, -14350, 1102, 7457, 7678, -8175, 1152, 8271, 2565, -1261, -3578, 17572, 36087, 36684, 19111, 9923, -335, -8952, 3714, 12593, 10925, 5702, 8778, 21678, 11359, -3740, -798, 11078, 10072, 1307, -1702, -10966, -5831, 1432, -24739, -22192, -9873, -10719, -13871, 2129, -7485, -7319, -14924, -7595, -2306, -6509, -946, 9919, 8183, -7940, -12396, -4843, 1224, -5349, -5112, 1817, 5055, 6647, -3421]
12964c421k6511P193J5621N257J3147J8395j4318k662p99m169O961N221R79j723
12950A9171m088j4822n910k173j0722N373J7107J5210J496j5799j1446M116K2615
12937B0128N506j0002o848K724l053K552j0753p807O201Q536J2988o762p721L07
12923E996K5r564J463q642J0218J4131N18Q72o435o149m180R51l925m16R407J59
12907D429n18j478J680J0144M469J320p406L983q57j0179j8341o174k821l721
12893b5470J6096R377Q714L225j6589l505J5584K947o083j509j882n271K131P02
12879a533m097k3L514m831J0010k108p334L684L117l625J69J180n996Q07J2692
12864E626j2915m265j268N80K692j6463m406K3153R034J344K629q431K124M367
$$ y = [-3421, -29932, -22739, -7118, -1861, 11286, 29681, 15363, 12701, 11902, 7733, 14694, 19915, 20894, 19171, 15083, 261, -5649, -7822, -18544, -13171, 3936, 19146, 20642, 4843, -6603, -2487, 20128, 25634, 15632, 8784, 11508, 8455, 11007, 254, -7553, -1352, 7184, 20172, 13410, 5689, 5996, 6021, -3543, -2080, -10722, -504, 13627, 14145, 15017, 8582, 2433, -1747, -796, -4721, -5137, 4270, 4429, 3911, 2433, 4113, 14257, 18726, 20046, 12640, 16623, 15766, 5587, -12754, -18928, -21749, -25470, -9374, 3, 8717, 11942, -4647, -8152, 7432, 10379, 4296, 2787, 905, -4366, -2235, -1533, -5630, -5653, -2139, -6970, 3040, 932, -6402, -2718, 399, -3226, -3057, -1877, -7873, -7066, 5626, -7289, -11554, -12822, -12242, -9550, -26013, -30419, -7266, 1768, 3112, 5741, -2690, -566, 3801]
12850C801o896j198K452j6085K804J4776r07J3631R161q445m244M384j0740J383
12836C877J9168L6r076j4826r246K431K2742J1716j464j1470j4082J74n96J620
12822A004j871l56k782j091r543k892J883O080J989o104N096N042K950l848j1879
12807a6322L634L031l196J2432J6765J0240j0567j8501j3884j364O631O044L629
12794a428P373k652P130m115o088o186M49m568J3766J3919q375l777J81R820r770
12779E679j4885J9448N429j0087k675o175K040q055O104R563M616j4584o058J8479
12765H839K0875L203q823m070j92j9332j2889J8669J2682j5917j8555j852q684
12752b6046k340K27o502R981J0273K745J4192l283q486N590m517R334J1011j0347
$$ y = [3801, -3095, -4293, -1841, -17926, -15122, -346, -1253, 12378, 21539, 13094, 8850, 13234, 2494, 3877, 23045, 23081, 14005, -821, -10067, -7636, 15106, 26822, 25358, 13888, -194, -20, -616, 1004, -867, -1223, -4005, -5096, -14639, -17531, -15648, -9568, -7579, -13683, -8587, -3545, -595, -4443, -16322, -12688, -9657, -12853, -421, 16344, 26584, 16017, -2484, -16368, -17732, -11101, -5057, -1428, 5945, 3293, 10423, 6308, 220, -5966, -5517, -10085, 3681, 17600, 9225, 5448, 5629, 15449, 5679, -9206, 10242, 15671, 5584, 2909, -3266, -1226, -9281, -3177, 6386, 11002, -3582, -9640, 8839, 29714, 32917, 24094, 20024, 19832, 500, -12389, 6280, 18962, 3045, -15510, -17362, -26046, -28386, -28159, -34661, -24680, -14407, -11662, 2530, -753, -9239, -3649, -8166, 1168, 12179, 1832]
12738A832j4066j2750m10R046J323N868N428n917j1712O621Q739J0465P916p532
12724D851n396J4557O011l467j1219P44j534L99m111J893K21O67L406n153j0756
12709h887K306K045N647L891o193P86K132n340N4j2039j3942J4051J0905K909
12695a675O884P660K12j0726n858o897k176K697P895J1301P876j9239j7409n094
12681b4549J1924O40J6333R917P332j4856r203O052r749j5792o090N273J6616
12668f152K463M357k962l589M551J3068r759r40M381P906o780k018J886o265K097
12653B244M488J6848j1449j4667o916r924P104J2660K855O66K219k350J947o514
12639g89n990Q762J0720p589l047k815m826k595j623J546J0897J5618N737j2799
$$ y = [1832, -12234, -24984, -25394, -16348, -15025, -9157, -3729, -9646, -21358, -14737, -5998, 4467, 12383, 4851, -545, 14012, 20023, 16556, 5337, 6081, 4547, 4946, 835, 2728, 2949, 3616, 7022, 1869, -8887, -6581, -4536, 1111, 5002, -1191, -405, 1727, -3613, -3559, -15598, -29540, -15489, -4584, -1675, 5209, 12869, 13081, 2355, -3503, -10400, -12576, -9879, -1984, 9317, 17193, -2046, -19455, -24549, -12625, -11985, 4348, 14265, 21597, 6741, -2462, 3590, -6159, -21951, -28041, -22768, -6152, -3689, 668, -2294, -5883, -1332, 11736, 1977, 1037, 5418, 13324, 6544, 4526, 6412, 147, 2244, 6732, 23580, 12131, -2536, -9452, -19376, -12272, 388, 3243, 3909, 6128, 3778, 5725, -789, -6779, 1983, 12703, 5114, 2067, -748, -5574, -8169, -9792, -8246, 2651, 18269, 24006, 11207]
12625A1207o54P591L388k684k0080o403L085o36O74o452p139O248J1819J0412
12611A0376N452k976j6481l638O277M475J3312O19m694j6085l630q331j141K3947
12597G482R95j416Q294j2461j2538j804J784q358j168J0243M644K574j0856n221
12583a7806K572P334L534K1876O34k048o023p134O778J1721m732j178j746j0902
12569B880q660j640K1232L282k4033R25J3446L474j164m234J154j1004k1118K594
12555b2866K4213O819p673M501J5872L162l007j5929k0551l142M82M416M207M874
12541d622O58R474M235r173Q420K385o279m870K472j7J600J45J4456M142j4286
12526H740O528P649r343k2445j5454Q729J2271J3997J3541j7306o899l637j0866
$$ y = [11207, 10553, 18144, 21532, 18848, -1232, -7635, -4550, -5186, -4512, -10964, -18103, -11855, -36, 10376, 15828, 12852, -3629, -7267, -990, 3485, 16797, 17416, 12722, -3363, -6993, -15324, -16465, 7482, 8477, 7061, 15355, 2894, -9644, -11448, -9664, -18022, -19190, -8947, -4303, -1729, -12585, -17806, -15234, -7900, -4366, 17510, 18144, 16096, 10073, 2939, 9717, 21438, 16706, 15528, 13782, 2880, -5780, -7420, 13812, 17094, -6939, -6014, 7432, 10906, 9742, 5508, 6662, -4342, -25460, -22866, 1347, 8166, 493, 4994, 20866, 24028, 21021, 5092, -15459, -18601, -18119, -13703, -9496, -4622, -3964, 5510, 9745, 572, 8992, 11377, 5098, 228, 2700, 2683, 4283, 4428, 18884, 23026, 8740, 15268, 22917, 13574, -8871, -24325, -15596, -3325, 10672, 24213, 6907, 8, -3629, -14495]
12513a4495m454J2370J2350j274n894N183j022P85P646N828L411k052l047p012
12499H323j057o939J0470J3324m689Q025k076j6835p876k455R134J1470j4645
12486D174j1354l416N211M023O868J0083j477j2006K96j4221R718J7506n40J2160
12472B7025L433k553k432m625j6221J891J1935N044l984n732j0421n430L166l694
12458b598o672J450J1060J18l511K5005P358r639k876j2034o057j714l682Q227
12444D435o940K548j30J0374q336l070o30R604p694P104J1211L50l240j6704r090
12429a0208J1222l105L856L701l111p257J4575J0446R252r54j3895j1724R681
12416A2479J1417k288k1300j910J3285J412k721p792k968Q533m67j1166K400k260
$$ y = [-14495, -18949, -6579, 5771, 4497, -1397, 3786, 2764, 3549, 11195, 17023, 20434, 18382, 15335, 8323, 7266, 327, 10797, 24121, 19432, 27457, 25381, 8546, 670, -1785, 7349, 18819, 4174, -7180, -10596, -5385, -1362, 5506, 15589, 14112, 2106, 2402, -11819, -2101, 15405, 14865, 27025, 30458, 27905, 25473, 20848, 4627, 6518, 18453, 23497, 19513, 13781, 3360, -2070, 1096, -2598, -9270, -7820, 3240, 3358, -153, 24852, 32210, 22571, 19695, 7661, 1604, -110, -3792, 4435, -2505, 43, -87, 10287, 1951, -1119, -1749, 7855, 161, 7265, 18476, 18826, 15586, -1118, -10208, 1014, -2091, 1765, 5466, 2355, -4902, 9673, 20119, 29371, 28417, 14522, 2798, 12479, 23896, 21608, 308, -1602, 11683, 13095, 10374, 2582, -386, 8147, 7680, -3486, -1086, -3346]
12402c346K935k874l799N702M740l211j1615j670K718j0467m388J1638J1932J0772
12388I067J49j1078j170J596J7285k353j1188K799R194p830p033m442m021l593
12374a2618p519L46J0145O797O447k052M16p152l055J719J065L160n236l721N3
12359a1205J2232p722M31J3911M310j4663J287P541o254j2324j0077J1464K6617
12346A5548J456j2386o387J0848N746j402j642j849P808n785L09l667o523q075
12332f001j4223J3769J7726K0775j0940j5461p265l129J1308J2408j139r241o83
12319G904j3989J3788J7328N363k0516r908K637M860j333k725R405J1684k1909
12306B589q234m090Q622R938O645j0495j2924J4586R252K415j595M225n345Q059
$$ y = [-3346, -411, -3285, -7084, -1382, 3358, 147, -11468, -13138, -10420, -20887, -25275, -13637, -1705, 9067, 9216, -1862, -3032, -1436, 15849, 13496, 2308, 5107, 14301, 6471, -562, -5004, -9025, -12618, -20137, -19791, -9646, -2849, 3598, 1546, 1962, -5190, -8245, -6526, -5461, -2301, -7537, -11258, -11205, 1027, -6695, -6264, 7647, 11957, -2706, -1419, 6122, -132, -12456, -22533, -11069, 15548, 17004, 4618, -1769, 9079, 14825, 13423, 11781, 9932, 17740, 11955, 12264, 8597, 2074, -6001, -20224, -6455, 11271, 32046, 21106, 5645, -1620, -4749, 6559, 18967, 17828, 8587, 7904, -6085, 7703, 25031, 30394, 9878, -30, 2607, 7467, 6134, 3409, 12814, 24498, 2589, -5645, -9735, -1113, 8825, 15470, 4975, -7949, 6637, 15889, 18304, 16709, 20934, 15589, 23648]
12292B3648M772j5481j1921j1563J1003l355J722o298N343N140O385M392j519
12279A2268l824k561N718N603j7556r367J3962Q016r86N283K379O29p044j3205
12265f85K669K792o967J641O960n903M904L188k036M943j1616O840o66n692j89
12250A83o704j197L900J0293O22m766m730M317K043J1q791K967M434j1721O043
12235c096J1506o65o713n819J229r16K438n761l889N39O110Q029l445M965l581
12220I31J0517L603j0395l275j201q876k949J4586K237o965k016N10n003J260
12206g036J2665N577m305K376P840n529j7899o328J1475Q786j0267P569J1172
12193A6096J3983P786j8241l689J2329k018n342r745p423K453J6727M966j6857
$$ y = [23648, 28420, 12939, 1018, -10545, 458, -2897, -1175, -7473, -2130, 3010, 9395, 13787, 12268, 8444, 5883, 11601, 17204, -352, -9719, 4243, 12259, 11273, 16556, 18935, 19564, 12520, -685, 1984, 4776, -2191, -550, 6410, 507, 5411, 8599, 6563, 11506, -110, 6730, 6064, 372, 183, -6521, -7718, -3818, 6475, 7097, 2331, -2399, 1918, 3961, 3972, -4819, -1852, 2582, -9139, -3096, 8410, 7745, 1032, -4787, -3558, -4474, -2036, -7797, -11686, -11147, -5037, 2992, -453, 4512, 931, 11448, 15051, 4656, 1381, 180, -8696, -11645, 2941, 5178, -1787, -3803, -3293, -8296, -7036, 5629, 11206, 6901, 9277, 17117, 11588, -6311, -12639, -1164, 7622, -2645, 4924, 16096, 30079, 37865, 19624, 15935, 28264, 26246, 20904, 11159, 3736, 6189, 22916, 27882, 11025]
12180A1025r722j070P403J421r541R219R011P272m13l543k8376j715P489L917
12166B377j0502R176J4303J313k312k090j8181m541j532P459J3645J2426q138
12153A3403j4870p578K437J2693j435q052l45N731J0595J1799j619j0786l545
12140H428k533r797r592l477M091j757M520M07L672l001R821Q949j2932q289k744
12125a4234l57N987J0533J9473N845j1716n852j4814n427l524N767J1730n657
12112b246N652q264J601J1604o64n642k863M764P89k583K934n140l688j886J3406
12097G774O809j585j593q790j477N566m80L002l367l334K191J636o34N3j1008
12082e237r946Q451q67o631k175K1367J2544N194o479m424J1194j0869j5601q633
$$ y = [11025, 1303, 233, 7636, 9057, -484, 8735, 17746, 25018, 24605, 21062, -7314, -9029, -1540, 2377, -8125, 1051, 15354, 16667, 14355, 12265, -5916, -10457, -11989, -4530, 9115, 21541, 13403, -1467, -9045, -6608, 6085, 4650, -3402, -3747, 1984, 12579, 24378, 22759, 11973, 8428, 5895, -3902, -13494, -16971, -12880, -14637, -10117, -9710, -6038, -9039, 782, 9731, -3201, -11490, -14234, -14591, -8604, 1929, 21402, 27247, 15531, 9679, -5135, -10562, -14086, -8319, 3411, -2246, 3406, -4858, -3257, 8347, 7683, 2041, -822, 3942, 4731, 2148, 5082, -58, -3746, -5632, 7774, 14583, 12998, 11405, 2615, 1138, 6704, 6224, 9226, 5859, 2525, 4716, 6352, 5718, 5771, -5237, -15183, -6732, -7599, -14230, -16405, 4962, 17506, 22700, 16221, 11797, 22991, 12122, -3479, -12112]
12068a2112j5518J1732P35r164Q274J497m227M383J4309J936r813J3649m817j3369
12054a2505k661m255P452J3481J3629K393m619k072j1293k0919p081K4259R159
12041D968o791j2526O576Q962l959n482M011M545q97J267N282r518l739L644n142
12026h799j518Q028J0646J1284j5809j995J0995M770k862j1179k2918j2848J5172
12013a7033J7032K0141P532Q316O05r612m530o087l606K338K960J003j4829j0845
11999f615O99J02N698m118k502O589Q903J061l187j1474m221M095m647J7493N374
11984A3250m007P032r392O05R359o678K652n100p659R80N684q15o958j9156m88
11969b0691O170J4553J5128p899K576J3269n259j4564K636J8419K622n856r287
$$ y = [-12112, -27630, -15898, -15163, -24327, -16053, -14556, -18783, -14400, -91, 1845, -7968, 5681, 864, -12505, -15166, -19421, -11969, 1512, 15141, 17534, 12915, 10843, -450, -21369, -28450, -4191, 4968, -1823, -14349, -7773, 1189, -2770, -8252, -4241, 304, -593, 674, 5956, -3562, -7301, -3657, -8799, -10317, -2289, 8357, 19641, 3832, 1837, 12832, 17602, 14740, 3561, -19357, -32205, -17033, -1, 20140, 27672, 35988, 36593, 26981, 22451, 16364, 12758, 15096, 18056, 19059, 4230, -6615, -5916, -5814, -116, -4234, -6736, -147, 8756, 9817, 6630, -4844, -9065, -4970, -9617, 7876, 13250, 9243, 16275, 6883, 7488, 16847, 10169, 12821, 7721, 62, 1042, 6726, 5911, -1047, -20203, -20691, -14521, 32, 15160, 7261, 9837, 23106, 17847, 3283, 5919, 24338, 26960, 21104, 11817]
11956A1817n751P025N466L861j2966p226L940N145m828k719J2477J0970m906K38
11942B2543Q021o446K81m109j2366q044P741j441M814Q23J393K777K620J6550
11928C5157q952j6643n644r060P993M109p701J0870j1850m736p253O841j61J7339
11914A0309O561j0508j6092P261Q719N591j9445R383L588m256M803O428j666n062
11900E614Q006J0469j1161j6361m848n155J5318O443q236j4381m870K268q342
11887b5236m505M436J8056J1799q171R695r580R415j059L534L04j9102q495J5534
11873c375R726J228M275J1073L896J4047k0220j0623N756p58n497r21K082l293
11859G396K137P040P897m833j6747j0420K4298J6633K670j4384j5849j3837k913
$$ y = [11817, 6066, 13091, 18557, 22418, 9452, 2226, 6166, 11311, 6483, 3764, 16241, 27211, 22305, 22543, 30564, 24118, 24399, 20290, 7924, -120, 7621, 6180, 10994, 11817, 13210, 15987, 18607, 35157, 26205, 9562, 3918, -5142, 2851, 6960, -741, 10129, -1721, -6457, -13710, -6869, -7030, 10309, 16870, 6362, -9730, -2469, 6250, 11841, -7604, 1779, 5367, 1111, 5914, 12342, 10676, 5614, 13620, 24089, 12928, -3433, -8281, -13436, 1882, 8325, 89, -14292, -19162, -16894, -25236, -29741, -25305, -7249, 4550, -3621, 6074, -3506, 5909, 4850, 8384, 8688, -10414, -18909, -3375, 6351, 7579, 11854, 22927, 26823, 40870, 20650, 10027, 15783, 15025, 9528, 8607, 10689, 7396, 9533, 16573, 24470, 19637, 2890, -7530, 16768, 33401, 36071, 21687, 5838, -7999, -10912]
11846a0912P462J221K869M809K062l315o621l46J52O783j554p582L974Q78J5796
11831A5676M618n56K664o554j8340m499K853J226M050K2254q65n090L717p77p369
11816A3008j7589N032N24N118K273L673k567o949K717M735p620J0581n14k4531
11802a2109j7063N119J7360M767k603m734J1092L256r191K775o230o901R359J6409
11788A1306J1792k728M814L719j4695j4387R279J442N096j041j2738n009R30J1913
11774I693J1218p06r156O648N858m874q394q235Q50n645J160l900l802O707L999
11759A421J1469l59P723R016k560r642j184Q085K78j3858o840o83Q538j581o596
11744C227K607l396j4557J0033P085O811p017Q119q616N327P133O150j470J873
$$ y = [-10912, -3450, -2229, 640, 5449, 7511, 4196, -2425, -2771, -2619, 4164, 2610, -4972, -998, -120, 15676, 20294, 19738, 22402, 15848, -2492, -6991, -4138, -2912, 1138, 23392, 22527, 17437, 21154, 20377, 13008, -4581, 451, 975, 6093, 8366, 12039, 9472, 2523, 5240, 9975, 2355, 12936, 12422, -12109, -29172, -24053, -6693, -1926, -4529, -9263, 1829, 5085, -4106, -1331, -7561, -14462, -5103, 11306, 23098, 20370, 25184, 28903, 14208, -179, 9100, 10542, 15638, 14597, 1859, -3150, -2220, 9693, 20911, 20205, 11049, 17697, 23555, 18681, 10287, 2052, 2902, -2743, -1583, -5483, -9285, -2578, 1421, 12890, 12531, 20254, 29270, 26710, 17068, 15884, 23969, 24247, 10389, 3549, 2866, 11404, 9823, 3227, 5834, 2438, -12119, -2086, 4999, 11810, 4793, 12912, 4296, 9623, 16756, 22906, 21436, 23309]
11730B3309j5153k387j16O631Q592k417j952R897j1896j1387l417J4231l226m196
11716F513m473R262k837p547n559O986P119k365P142j2449N840K324j961l268
11702D727j867l27m837j4288m001J6245J0171K964M764k0428l066Q256m183j1458
11688a7328k592M624M355J2196P726n348N331p057m714j4926m171M431N161o913
11674a9225K0215J7071q448j7948j0157J0142j274K39j400L455N115j585m207
11661h007l109R083N516m489r416K627l969K008m547J3511J4248L479l394k396
11647A1145j0386J0127J3291k298j6112j6506K3255M890j2184p001J3577K714
11635A4512j0749r339N194k138o408P071J1433N728j3907m609J0383Q349j0574
$$ y = [23309, 8156, 5769, 5653, 12284, 20876, 18459, 16507, 26404, 14508, 3121, -296, 13935, 10709, 6513, 2040, 11302, 8465, 918, -4641, 2345, 9464, 7099, 14241, 1792, 7632, 9956, 7995, 4727, 2860, 2533, -2304, -16592, -20593, -4348, 5823, 8787, 13551, -6877, -9943, -1687, -5870, -17328, -19920, -15296, -10941, 1255, 8981, 3633, 8964, 1907, -2807, -17733, -21904, -17473, -12312, -19225, 990, 18061, 9613, -8335, -18492, -8350, -9624, -9385, -10785, -7330, -2215, -3800, -8007, -11116, -2033, 3483, -1006, -10422, -7795, -11764, -9756, -14303, -792, 13456, 16935, 13541, 11145, 759, 10886, 24177, 21879, 5767, -10739, 12516, 17406, 5222, -1779, 11798, 14512, 3763, -5576, -382, -2520, -8928, -1857, 9576, 15304, 1397, -3212, 7171, 15520, 4946]
11622D946P40O354j2535O705Q028j5424m680J3886P598Q07j6630l963J1355O305
11608A3492p633k597n633j8337J3222K1464Q339r188m830R901j347j628N723K667
11594B3615l799j0428k557N958Q300l214r479J837M465J6554p697j8269p730J7385
11580A4941o537j3791j1439Q790l580m169J8897r110J552O253n351k824P472J9986
11566B1090m076q357k715k256O106M727l657n093p80P970K852l830j0842m233
11552c094K975L924p71R73p45P178L96j142k304n3j0545L953J650Q0k628k893
11536c046l430J4590K1076m003j7240o72J762j013k963J3746J2036q394O32j176
11522B1905J363j2379N281J3752l649p023m963M877j0091k3117j0104J760R112
$$ y = [4946, 5686, 12040, -495, 6210, 14238, -1186, -5866, 8020, 15618, 16425, -205, -4168, 7187, 13492, 5859, 3262, -2371, -20708, -7486, 13978, 22317, 13129, 8299, 18200, 16853, 15225, 20948, 23615, 19816, 9388, 6831, 12789, 21089, 17875, 8396, 10233, 14698, 31252, 23555, 5286, -2444, 14941, 8404, -5387, -16826, -8036, -11616, -15785, 3112, -5998, -4446, 1807, -3544, -6368, 1104, 21090, 17014, 8657, 5942, 3686, 9792, 14519, 10862, 5769, 4989, 12959, 15811, 11981, 1139, -3094, -119, 3805, 3034, 4007, 3262, 10440, 10836, 9694, 7390, 7337, -3208, 745, 2395, 2475, -153, -3046, -6476, 8114, 29190, 25187, 7947, 7275, 9037, 8024, 5061, 18807, 30843, 22449, 23081, 21905, 23268, 10889, 16170, 29922, 26273, 19250, 14287, 19164, 9073, -14044, -24148, -22388, -13276]
11509a3276J3678K338j07j5252L697O187L331J6010P994k63q129j1008M609m024
11495E785j6231J1287J7218O18k2593k259J4274N36j0426N830J5991J3410j1492
11482B1948j3741j6481j813O997M95n200N725Q873J2469r646j2115p600l219m674
11468a7982J0586N083M111o714J397J2133J0289L07j5446J443p700j623k05k084
11454f405J665n866j3218P603q97j1125J3107R850L232N002M682K132q437N012
11440F337M284l861j1167P672R910K909j719K038K539k2549r593l296j01K598
11426a3999J2261J3606O886m469K752O57j0552j499r181n050O888R955J3061J083
11412B2399L268j383l937j1091j1050K449N495P911J341P507L240j6548M56J797
$$ y = [-13276, 402, 2740, 2633, -12619, -8922, -2735, 596, 16606, 24600, 24337, 16208, 5200, 9809, 5785, -10446, 841, 18059, 18677, -3916, -6175, 8099, 8635, -1791, 4039, 20030, 33440, 21948, 8207, -8274, -10087, -3090, -2595, -7795, -2070, 6803, 19272, 9626, -2489, -10089, -13308, -17982, -7396, -2313, 1798, -4916, -3519, 8614, 18903, 19210, 3764, 5207, -2493, -4116, -4321, -6405, -4740, -10606, -23824, -16221, -17118, -28243, -15136, -5286, -2054, 2948, 7630, 9762, 1325, 6337, 10621, 6760, -4407, 3265, 13175, 16084, 14365, 16403, 18942, -3607, -13200, -16496, -16597, -13999, -1738, 11868, 18754, 14285, 17037, 17694, 7142, 5643, -3538, -8588, -1700, 8255, 21316, 22399, 25667, 24284, 20347, 9256, -1794, 655, 6150, 14061, 15402, 22909, 26149, 9601, 10057, 11854]
11398A1854m219P1Q62O227j31p37P863O760P852j6048k184J1792j73r661n713
11383A4415M040K235K700j2578L421L74k742j6207n927j3166k161J0860J0271
11370d465N352O174M905j2544l624J1967Q852l348j2924J682p176j528q35K205
11356e307P640Q689j7574j1419M832R483r02o971K620R034J2826J1785m182j3803
11342F751N742L816K506l929r171K496L26R55Q485r565n514R937K1118L774q352
11327B9375j5006j6987O160O133Q449O603r189r455j3585Q639J4181J259q838
11314G739q602M069R8J748M099J1248J271J3407J0645r308p751O490p884j4914
11300A2355o175j900p97m966m937J7092J036K325L718j1869o204J4921j723o126
$$ y = [11854, 7635, 7706, 8568, 14795, 14664, 13927, 21790, 28550, 36402, 20354, 18170, 29962, 29789, 20128, 14415, 18455, 20690, 23390, 10812, 14233, 14607, 11865, -4342, -10269, -23435, -25596, -14736, -4465, 887, 7061, 11966, -578, -4202, 7765, 16617, 13269, 345, 2027, -5149, -6677, -7512, -5307, 2333, 11022, -6552, -17971, -13139, -3656, -4558, -11529, -8909, 125, 12951, 24736, 20554, 6751, 12493, 16309, 18815, 14886, 5715, 8211, 8537, 9492, 17977, 8412, 2898, 12835, 33953, 37727, 29375, 14369, -2618, 3542, 9675, 18124, 24727, 15538, 6083, -7502, 1137, 15318, 16577, 7739, -863, 3206, 3304, 5052, 9151, 20399, 21670, 35077, 45722, 36414, 28663, 35153, 27269, 12355, 6180, 4280, 3483, -1483, -6420, 10672, 11708, 14033, 17751, 5882, -322, 14599, 12876, 6750]
11286F750p821J6742j1049k776J0506l53l861j0776M589K421j603R50l326l579
11272c186K780Q813Q344k534j0444r525J8826O572j0209n651K600o277K517k003
11258F23k311o179m661k654J0650J3324r076M148L235Q51M176j436j0580r23J397
11243E84N586J9207m419M563L559l963j267J4469m788j8288j4995q913j19Q026
11229g58Q253n342r972K055J2344K513k024l611Q443K024J177K564L468r384o459
11214E291n549l138o792Q657R361k885q491r46Q931jm177j592j168L003j4312
11199a3808o457J1986J4766K34Q307N323k786J2586r739l55k197o10L043K702
11185B2995o002m976m102K470o478r150M320J478n281O773J3864l751o872Q364
$$ y = [6750, -1071, 15671, 4622, 1846, 12352, 11999, 8138, -2638, 1951, 4372, 2769, 3719, 393, -3186, -406, 8407, 16751, 14217, 3773, -5752, 13074, 19646, 9437, 3786, 6386, 109, 2626, 623, -1688, -7867, -12528, -15182, -4532, 8792, -284, 3864, 7099, 7950, 12126, 10690, 110, -813, 584, 6170, 25377, 20958, 25521, 29080, 25117, 23850, 38319, 33531, 15243, 248, -8665, -8784, -758, 7495, 2153, -7819, -5764, 6580, 9093, 7069, 3458, 11901, 13925, 15102, 17666, 21134, 11750, 5291, -258, -3396, -10188, -1531, 7830, 4945, -3546, -4492, 4439, 4438, 261, -1331, -2499, 504, -13808, -20265, -8279, 6487, 6721, 15028, 20351, 17565, 30151, 20412, 20057, 17860, 17250, 20293, 22995, 16993, 12017, 7915, 10385, 3907, -5243, -923, 555, -4726, 2047, 15911, 12160, 5288, 13652]
11171A3652J0443m79k206L48j7048j6660J3412J9844K426R49Q97L783j5765n652
11157G944O743j3400j0210J0418J2995K655N338r59r374l906Q832Q108j768q940
11143A4476o857j2326J243O087L824M860n551M140J47j3881K740M842l396l634
11129c286j1585L690jQ515J6360K970j6065m032J6283P328n469m41j2007n399
11115c139p315n117j369m569M393K49M92J0575J0351K999L656J6070O864o475
11101B7665j6479o926j2063k548J1704J5467L553l349O387J794O407j4153j2152
11088E307p601L575J0678J7977n561m478j4511k615R993o97j322l790J075J2118
11074B0148j639k708j5837k884j6339p000J7450J4467O573J1021m858n383r440
$$ y = [13652, 24095, 23616, 21410, 21758, 4710, -11950, 1462, 21306, 23732, 24681, 25578, 29361, 13596, 7944, 14687, 1287, -8923, 1495, 14490, 17145, 22483, 21524, 12150, 8244, 17076, 25184, 23416, 14476, 7619, -4707, -3464, 2623, 6447, 11307, 5756, 9896, 10043, -3838, -1098, 3744, 348, -3286, -14871, -11181, -11182, -2667, 13693, 16663, 598, -3434, 12849, 20177, 14708, 14267, 2260, -3139, -10454, -15571, -16940, -21509, -17116, -16867, -16375, -5800, 4551, 7550, 11206, 27276, 34140, 27665, 11186, 4260, -7803, -10351, 1353, 16820, 20373, 17024, 23411, 25205, 31612, 17459, 5307, -2294, 1281, 11959, 29936, 24375, 19897, 5386, 2771, 12764, 12067, 10745, 6955, 8030, 20148, 18509, 15801, -36, -2920, -19259, -26259, -8809, 5658, 12231, 23252, 18394, 13011, 3571]
11061C571j2294L592R913N314m947Q529p905q478j3710M646N238Q419m231J736
11047f07L869P123m956q959m296L660M325j957L397j008q240n021j2359P392K4422
11032F785J3636l244M559P907m462l882l813O312N716j1534o453O164N347r981
11018A3057r975L644J1185j3242j3870J6356N092Q724J0101K724j1677k7576j2099
11005a7556m99K855O278R674Q355p705l0M756Q128L427j20k735K1357O71j2899
10990B3957j2829O310n282j1240n859j2208K784J2239L438L979R520K04j5244
10977b31j0919o730J0123J390n933L088P241K596P612j522j3220Q944j661j2245
10963a1467J6222O810J5773R548k578q230L745n293N26j4536K503m474K368k196
$$ y = [3571, -8723, -5131, 4782, 10096, 5149, 13678, 5773, -2705, -16415, -11769, -6531, 1888, -2343, -607, 3262, 10385, 5429, -3530, -7826, -4166, 159, -1798, 1599, 591, -7649, -12670, -25029, -17637, 6785, 20421, 17177, 21736, 29643, 25181, 21299, 17486, 23798, 29514, 17980, 11527, 17691, 23038, 13057, 3082, 6726, 17911, 4669, -9201, 7155, 12247, 20971, 31072, 33796, 22119, -5457, -17556, -18055, -15200, -8922, 752, 9107, 1402, 1372, 6128, 14256, 17683, 17563, 14828, 36185, 36856, 23957, 11128, 17438, 12156, 916, -4943, -17151, -14367, -2128, 1310, 5289, 14809, 15013, -231, -11150, -17880, -7757, -6367, -12300, -9212, -1971, 625, 8237, 6715, -6505, 2439, 778, -11467, 4755, 11565, 27338, 36886, 34308, 26078, 29823, 24530, 25056, 10520, 13023, 8549, 10917, 8721]
10949H721j6369n261P827o90n606K020K0504n912k923J9996O750o458q674p280
10935F645p768M192K1068J896l636O004j0891k89L734R095L669l944N883j1665
10921B3993j6390j826J7697p101q770R68N132l092j6415O33J4619k572O335O856
10907B0067j5691j1391J478O333K533M521K032N604Q845q141l971j8298M106J3209
10893A1236q38q916m279J867n27J1216J2649Q156l896m795j2608k0359N242L416
10879b436n54k8024k443J5106L625J90l42K5227P814K9l641l774L225k800j2639
10864a437k718l481o304J2113l135j924n226M186R782M784L06j332k858N098N60
10849H414q663O863L962P304j304n275K626k912j4158M627J4355l788J1409N225
$$ y = [8721, -7648, -12909, -5082, -5772, -11378, -9358, 11146, 5234, 2311, 22307, 29057, 22599, 13925, 6645, -1123, 3069, 24137, 26033, 22397, 28401, 17510, 17221, 20955, 30050, 33719, 29775, 35658, 23993, 7603, 5777, 23474, 16373, 7603, 8571, 13703, 10611, -5804, -5171, 9448, 6876, 13211, 20067, 4376, -7015, -5537, 796, 3329, 7850, 9882, 15486, 24331, 16190, 12219, -6079, -1973, 11236, 10398, 1482, -2797, -930, -1457, 9759, 22408, 30564, 26668, 21873, 9265, -11094, -5852, -2436, -2990, -31014, -33457, -18351, -14726, -14536, -14878, 10349, 18163, 18192, 14551, 10777, 14002, 11202, -1437, -4155, -7636, -13940, -1827, -4962, -6886, -12112, -7926, 1856, 6640, 6946, 5614, 2756, 7854, 8414, -249, 6614, 10576, 17880, 16576, 11301, 13927, 11015, -3143, 1484, 15839, 12051, 23460, 28685]
10835B8685k470r180j0777R635K335N406p315j734J852l276j6247q714J0008P263
10821E471o168O230O521p009j2271J2758J8157j1114o275P426N930M768o898l650
10807A3876n674r60l85p97J6724O335p466j3626L749M325l198k0531L870R083
10793E325j2901J0717Q434Q947j0820l245P837j437P141o168q541k568P587k57
10779A0051o517r290M080J9285P443j462k194o257N085j2515q104K000j18O622
10765H109L728r132j6Q810L695n757l612J1649J0356M36j9817j2428j839J794
10751d024R778J110m469J2637J3526n880k1817r087P560J1961L288m437j1605
10738a459P900p80p213J87k876R304N275J1505K893q538r556l514Q311J6533J2069
$$ y = [28685, 26215, 17035, 6258, 15893, 18228, 23634, 16319, 14585, 16437, 13161, -3086, -11800, -1792, 5471, -697, 5533, 12054, 5045, -7226, 5532, 23689, 12575, 6300, 13726, 19656, 24424, 17526, 13876, 8202, 7242, 6857, 6060, 22784, 29119, 21653, 8027, 11776, 16101, 12903, -7628, -3758, 5325, -7576, 3141, 11575, 20522, 9702, 6457, 14294, 12857, 19998, 13830, 5289, 2721, 10308, 10051, 3534, -5756, -1676, 17609, 25052, 23590, 21396, 15139, 20224, 7709, -395, 1605, 1487, 8109, 11837, 2705, 2689, 11499, 15194, 9437, 5825, 17474, 27830, 28266, 8449, -3979, -5818, -4024, 5754, 6864, 2395, 15032, 28558, 22678, 861, -8226, -666, 11295, 14583, 10146, -1459, 6441, 5661, -1552, -1365, -4241, 5063, 10338, 21843, 24736, 16198, 6642, 3128, 11439, 27972, 40041]
10723D0041p414k3246j4110N734K090L479q796M60J5783N755J2241J0651j4229
10710B8439j1582n422m45p52j4780J968J0489J2172M198J4141N36l260j6737m31
10696A8534p688l685j0648J461P982M458l876j706j235k337l199J923m187L446
10682g57p67J6849M526J503J1949j083o778m62M290l640m186j774Q76j1566o507
10667B473K09M711O452j2297L936J2611K798n356j587p524K244q340p25K534J8173
10652B0312N199n785o027q453J1323Q061l065M397P863j337k1713j409l016j745
10638D605M131r618j1789o411L150j91K0839Q984M71r176p25J3266K934m077Q381
10623B4774k138L066m265j5180j977J1936J353q671J790j1468k903M500l042l288
$$ y = [40041, 32627, 9381, -4729, 1005, 3095, 6574, -2222, -1762, 14021, 19776, 32017, 42668, 28439, 16857, 11435, 10990, 10238, -4542, -2574, 7915, 20087, 24285, 38426, 38962, 35702, 18965, 18534, 10846, 7161, -3487, -2026, 5956, 10414, 6538, 4832, 3597, 1260, -1939, -16, -4203, -757, -1524, 15325, 19851, 21354, 33303, 32220, 25442, 24980, 29270, 25630, 21444, 19670, 20546, 8980, 2473, 2682, 7393, 13845, 1548, 5484, 18095, 20893, 15537, 13950, 6426, 8670, 330, -395, 2139, 20312, 25511, 19726, 13699, 5246, 16569, 24630, 21565, 25962, 33825, 32488, 10775, 9366, 6350, 4605, 8736, -882, -12671, -19082, -15932, -16123, 4716, 13700, 14171, 4995, 4270, 17536, 20470, 16393, 24774, 22636, 25702, 21437, 6257, 4280, 16216, 17569, 8898, 10688, -780, -3683, 817, -2225, -5513]
10609e513j1641N555J9989M798Q302j1876o140J8117k081j1808k698L607L62N419
10595A4392M325p20p71l531L88K684m545q321q489R633P515k395j4087N917J0227
10580A2222R388j8197o343N057P58Q966J305j140J1218K561P97R936K582j1984
10566B7126j3670j0792K0661o28k187N677q078o366M643k9L918r877j91R487j948
10551A7746l822k905p386K278L638m53P400k40j1141m039k985J566J471R730J281
10536A2139J0123j1282j1239m466M067J0689o568j2688q43J2175Q733L488J540
10523A5868j2505m896P137M811r880M539J7716k551r049k436P905Q92j3233J2289
10509A6607J8347j4931k1220K026J5684O363J886J979P722p110q292J964J157
$$ y = [-5513, -17154, -11599, 8390, 13188, 21490, 9614, 3474, 21591, 19510, 7702, 5004, 8611, 8973, 14392, 18717, 17997, 17226, 13695, 14083, 16767, 12222, 3901, -4588, 5045, 12560, 10165, -3922, 1995, 12222, 21610, 3413, -2930, 2127, 2885, 11851, 13156, 12016, 23234, 25795, 26592, 36528, 39110, 27126, 13456, 2664, 23325, 22697, 20510, 26187, 18109, 11743, 16386, 16357, 20275, 10398, 10207, 19694, 17746, 13924, 11019, 3633, 5911, 9549, 9096, 16496, 16256, 5115, 1076, -1909, -343, 1128, 10858, 12139, 22262, 10980, -259, -4725, -658, 10031, 3463, -9225, -10068, 2107, 10840, 14328, 15868, 3363, -1533, 5604, 10415, 535, 5074, 22790, 20239, 11190, 8754, 16659, 17551, 4318, 16607, 34954, 20023, -1197, 829, 16513, 22876, 24762, 26741, 34463, 27353, 19061, 21025, 22182]
10496B2182o325q103n771J1429Q861p094R731J010j7111L232K710p923j700O15
10482E743N098j2430j1976p524J1989R611p565L27L0866M745j0264n993j1593
10469A034J2685P84j1986r468J113J6852L890n353O309P692m369q597L891J9636
10455C4113M155k0522r602Q31k464L9Q030n455n682J2636j019P784m692k845K154
10440A7461L16j3115p174J856K446K433O000l421Q730P343O231j3143o256J731
10426A1438N437q531l544lP700Q988Q851J967m877j1743J044R192l028j7793j1385
10411f287J1331M604J633j352J0264P7K83O027n937m450l01J3798K586r547q744
10396A3985q272p788m975M479J612J7845P314J122K2821Q091k188O272p943j2170
$$ y = [22182, 15857, 7754, 1983, 13412, 22273, 15179, 24910, 25920, 8809, 12041, 14751, 6828, 5128, 5743, 10841, -1589, -13565, -21089, -9100, 511, -7054, -6727, 24139, 28884, 18620, 12627, 1034, 13719, 14503, 2517, -6951, -5838, 11014, 14904, 9551, 15860, 23552, 19183, 10586, 14477, 34113, 38268, 17746, 8144, 8975, 6511, 6550, 14580, 9125, 3443, 16079, 15060, 22844, 18152, 15307, 17461, 17777, 4662, -2512, -656, 1790, 4223, 10223, 6802, 15532, 22875, 29106, 15963, 9707, 11438, 16875, 8344, 4800, 4797, 12497, 21485, 30336, 32303, 27426, 15683, 16727, 25919, 22891, 5098, -6287, 5044, 9648, 11281, 9929, 20193, 20270, 20553, 26580, 20643, 16193, 15892, 29690, 32276, 22729, 13985, 5713, -2075, -7050, -2571, -959, 16886, 24200, 25322, 48143, 56234, 54046, 60318, 52375, 40205]
10382D0205j4076M49j2590l02j264J401n404p383Q510J5806P36p972Q67N158r345
10367A4796j1135O033R413P309m739q857L758j0501n223M888Q743L647r751q852
10353d71J553n537m287P608M801L199P198l564N940J5404R190N363m119L634M256
10338E0168l870J2716k706j2686J491j833P911K227j5398j7896k758M848O615
10325B8829O387k106k727m691J55j1617o32K64J0414J917J106K476J833N401j0900
10310B6109L429m12j3364l603l054j808j844L115j770K82J1096O577q313l539
10296A2901J620l685P665J6327o706J1189J3025j1629j3479k848K505N780K705
10283C5370l680j737n284m724J2311J48q504K889Q978o797k991N23j5958q614
$$ y = [40205, 26129, 26578, 13988, 13686, 12422, 13823, 8419, 1036, 9546, 25352, 26088, 18116, 18983, 24141, 14796, 3661, 9694, 19107, 26416, 21677, 12820, 16578, 6077, 854, 5742, 14485, 18132, 8381, -471, 1082, -4455, -8742, -1134, 3667, 6866, 14064, 10500, 16440, 31844, 41034, 46397, 42278, 45912, 50168, 46298, 59014, 56308, 43622, 45113, 43280, 51191, 53418, 38020, 20124, 17366, 22214, 28829, 35216, 33110, 30383, 25692, 25847, 14230, 13598, 13862, 24276, 26193, 27299, 29775, 31608, 37009, 26109, 29538, 29126, 15762, 12159, 9105, 7297, 5453, 8568, 6798, 7080, 18176, 24753, 16440, 12901, 14521, 10836, 18501, 34828, 28122, 39311, 52336, 40707, 27228, 24380, 26885, 32665, 35370, 31690, 29953, 24669, 19945, 32256, 32404, 23900, 26789, 35767, 28970, 25979, 26502, 10544, 1930]
10269A930J2352N681j0583P412R925q436p438O651N802j7N890k243J1414M783
10255D3123j957Q091m599k5108j1109K277J0008j117n134l791L105n201K246N962
10241A6796J6004M451o843R24J2333m6j4633q374J376l188p289m865J5620J7233
10227C9499o950o596L147M003k988j8071p577L176l593o249j135K202J5846p466
10213G248m015N543R177J6058L655J709j1282M779R045J80j4458n875R201R37
10199C1902q04k148o2k389j927o711R845K748o016p613l627m733N649J0371n553
10184A8932R421J3091p316r683P15p660K9k864l807J1134P667O69J749r142M814
10169B7749J4891K315p619j3023k639k2772O288N182k378J0581N01p278j2964
$$ y = [1930, 14282, 19963, 9380, 16792, 26717, 18281, 10843, 17494, 23296, 23279, 29169, 26926, 38340, 43123, 41166, 49257, 44658, 19550, 8441, 10718, 20726, 19609, 14475, 10684, 13789, 8588, 10834, 16796, 32800, 37251, 30408, 31332, 43665, 43619, 28986, 20612, 21988, 18800, 11511, 6646, 22266, 39499, 32549, 25953, 29100, 33103, 30115, 12044, 4467, 7643, 4050, -2199, -3334, -1132, 14714, 7248, 3233, 8776, 17953, 34011, 37666, 39375, 28093, 32872, 41917, 42097, 27639, 21764, 30965, 31902, 31098, 28950, 28888, 26499, 24572, 17861, 27706, 30454, 24438, 16825, 13198, 8465, 14114, 24485, 18932, 28353, 41444, 34128, 24445, 25160, 17500, 17529, 14665, 10858, 21992, 29659, 30328, 32077, 22935, 27749, 42640, 44955, 37336, 24313, 21674, -1098, 5190, 10372, 7994, 18575, 19076, 11798, -1166]
10156a166o155j174J3590J2783j358m751J1972J0446k72l613p326L318K754J388
10142C0436R646M340j393j6799m482k474R043J0028J22j913m300N319O709j2200
10128C2082j3394O979R52N099L006j7222j3740R602P547M511l482l295J1127J089
10114C0861j3742r351Q083R760Q188M510o330k031Q778N186j4921j3372J4197
10101B9816J8686l410j8878n813P702r22p375M647Q15L138J5268p862n714J1279
10087D1377M056K249j3990n423j1054o383k990J316M393J4381J8636j521n331
10074C9716n282k420N365M578P547j3342o653r94M369K0490N893K9443N5130J4892
10060A58732l4338m5764l0632q947j4285M29Q266L396J900k133k817L988j2358
$$ y = [-1166, -7321, -8495, 5095, 17878, 16520, 11769, 23741, 34187, 33915, 30302, 22976, 26294, 29048, 30436, 40082, 44422, 43029, 26230, 21748, 19274, 28317, 38345, 38467, 36554, 32254, 37573, 44282, 32082, 18688, 25667, 26619, 31718, 34724, 17502, 3762, 13364, 20911, 25422, 21940, 18645, 29772, 30861, 17119, 7768, 15851, 25611, 33799, 38309, 31979, 29948, 38726, 43912, 28991, 15619, 29816, 48502, 45092, 26214, 20401, 28103, 27181, 19806, 24453, 25268, 28406, 43674, 35812, 30098, 41377, 45433, 47682, 33692, 28269, 17215, 10832, 7842, 9158, 13551, 27932, 46568, 45047, 39716, 34434, 32014, 37379, 41957, 49504, 36162, 29509, 28515, 32884, 53374, 59267, 88710, 143840, 158732, 124394, 78630, 47998, 39051, 24766, 25195, 33461, 36857, 38757, 36624, 33807, 37795, 25437]
10047B5437j0475J3553J5611j521j0790K78j6010j3158P664K3473K934k424n550
10034B9022n804J222J2407k100j3429j9339j3892J2991J7866P211N360M92O989
10021C8996J142j8484l990J139M803J3279K735j1388N493l888r118k096K676L982
10007B5281J2628J4982j82j6313k242M68K428q49J6664M177j2512j1971p36L255
9993C5078J240N88J756J0102k694j1423k1166O007K3288N627l982q915j2298J1862
9979C5070p942J594q92m698j4526J139J0162J66J552k919J3057N569N223Q380
9965E0935m961j0438p14J522j0615o686L312j286J9834n098p085J1468n448m206
9951C0534k54M926o8L828k768J213Q75K0209m071K483j361n441L317P131j85k3240
$$ y = [25437, 14962, 28515, 44126, 42605, 31815, 32093, 16083, 2925, 10589, 34062, 36996, 34572, 29022, 23218, 24440, 36847, 34747, 21318, 1979, -11913, 1078, 18944, 26155, 31515, 32007, 38996, 40138, 21654, 17664, 18803, 23606, 36885, 39620, 28232, 33725, 29837, 20719, 18623, 21299, 25281, 37909, 52891, 52709, 36396, 34154, 34622, 37050, 36201, 52865, 57042, 44530, 32559, 31823, 35078, 36318, 36906, 38662, 48764, 46070, 34647, 13481, 19488, 42776, 48403, 44421, 35506, 23208, 35070, 27128, 28722, 27830, 23132, 8606, 9745, 19907, 20073, 21625, 18706, 31763, 37332, 42555, 50935, 45974, 35536, 34822, 36344, 25729, 19043, 22355, 21069, 40903, 35805, 28720, 40188, 34740, 30534, 30280, 35206, 35138, 38966, 36198, 37411, 38286, 58495, 54424, 56907, 55546, 50105, 53422, 60553, 60368, 37128]
9935C7128j2039q245k650J1484L319O526P922j1923K88j505j807J8594M410n203
9921D6299n837K12p025j4035N694O118Q346q381n360K328J3557J7430n555k106
9907E1685j2568L564L553L026J773M46L207r008L469K404J2106o781o066k936
9893D7874o576J4708m025j0552n415o245L300O666l70r04R111L677K381L111K857
9878E9598j4084j8774J7948J465Q1p812q30l164k192m131J0228J1851j637j4602
9864C3945m010O430P954J0967l712O194J7758J1959m840j1456k4505r403M878
9851D2159L673k331N314K7365J3219j609j2421j4023M94l911k7L5M661M501j6616
9836E0483j0331j692N560J5544J400r359j006L892J5418q171k398R882j3602j3808
$$ y = [37128, 25089, 16844, 14194, 25678, 28997, 35523, 43445, 31522, 31810, 30305, 28498, 47092, 51502, 46299, 40462, 40674, 33649, 19614, 25308, 31426, 39772, 31391, 26031, 28359, 41916, 59346, 53791, 51685, 39117, 42681, 46234, 49260, 51033, 51479, 54686, 45678, 49147, 51551, 63657, 56876, 50810, 47874, 41298, 56006, 51981, 41429, 36014, 29769, 33069, 39735, 39365, 38461, 47572, 51249, 53630, 56741, 59598, 45514, 26740, 44688, 46153, 46234, 38422, 37592, 34428, 32236, 28105, 38333, 50184, 48547, 33945, 29935, 36365, 44319, 55286, 51574, 57768, 75526, 87485, 82645, 71189, 46684, 37281, 42159, 45832, 43501, 48815, 76180, 89399, 87790, 75369, 61346, 61840, 57929, 57902, 57937, 62598, 67099, 50483, 40152, 38460, 44020, 59564, 60964, 51605, 50599, 54491, 69909, 61738, 59340, 69222, 55620, 41812]
9822D1812J6229J413p234m80j0L191J2156m459J336k0702r233N065m257m646M367
9807C4548O733J0539O57m406l657P355J0976r478j3043L164j468o973p145J4112
9793D1914J7930J0475j052j2445m887J659j0121K952J321R403k604R024J2631
9780G6200j8350j5994K897P655k965j1967j3664R224J0946k762K233J0508k769
9767E1192M321J2909J1490K240j1409k347J73k595Q038j1218j5003k409L004K353
9753E0739J308p556L385k586N453k441K213J0345O094N01j1766o023k290j033
9739D6343L932o125Q443M370J002J4888M608m222N907p206j0569L602J4204k769
9725G6408j1609q544L255R80n18L977Q109l4q583N659m695n068p460r155J9847
$$ y = [41812, 58041, 59454, 52220, 51740, 51730, 54921, 67077, 62618, 63954, 43252, 34019, 39084, 34827, 30181, 34548, 41281, 51820, 52477, 48071, 44414, 51769, 62745, 53267, 40224, 43388, 41920, 34947, 27802, 41914, 59844, 70319, 69267, 56822, 51935, 53594, 43473, 46425, 47746, 57149, 54545, 63569, 76200, 57850, 41856, 44753, 52408, 49443, 37476, 23812, 33036, 43982, 41220, 43453, 53961, 51192, 55513, 68422, 79912, 82152, 70743, 68396, 68569, 65974, 74012, 62794, 47791, 45382, 48386, 50739, 52047, 44491, 47876, 45290, 50743, 48302, 50515, 60860, 66954, 67455, 55689, 49666, 47376, 46343, 50275, 44150, 52593, 56963, 57965, 72853, 77461, 73239, 79146, 71940, 61371, 64973, 79177, 76408, 64799, 56255, 59510, 60490, 59972, 63949, 72058, 72024, 63441, 69100, 64405, 59337, 51877, 42722, 62569]
9710F2569J8265k033p857j2957j4713M345J8994P730J536j1197j46m019j0876
9697D9641J08K5120O257r639M993J8414J8483m336r840r3q531q856j1347m975
9683F5399J5501q84k744M794o048L79J3250J241j1241M868m475o916k154m635
9669F6335q066J0076J1009N898Q846J573q670n753L180l882l688J877P910K96
9655H6941j1285k051K1663O457K015j1258j546Q056J0202R602n475p877k522J436
9641A04358o174j566o652o098O886j7450j0823K025K0251J9181j068j5717j6057
9628G1096j374r739K255P082N566K908N781j081k990l112j3015L925O551Q955
9614H2808P480J249K05J8137P294j8230j5709J3455J4449J9399K717L66K101j6743
$$ y = [62569, 80834, 78801, 70944, 57987, 43274, 47619, 66613, 74343, 75879, 64682, 64536, 60517, 49641, 49749, 74869, 81126, 71487, 76480, 94894, 113377, 109041, 99201, 99108, 90577, 81721, 70374, 65399, 80900, 80016, 77272, 82066, 76018, 76397, 89647, 90888, 79647, 84515, 80040, 73124, 70970, 66335, 58269, 68345, 79354, 85252, 94098, 95671, 87001, 81248, 84428, 80546, 76858, 78735, 86645, 86941, 75656, 73605, 95268, 101725, 103740, 92482, 90936, 98992, 109194, 118796, 113321, 105444, 102922, 104358, 98184, 96618, 89966, 83868, 90754, 73304, 62481, 64506, 84757, 103938, 102870, 87153, 71096, 69722, 59983, 62238, 69320, 74886, 77794, 83575, 82494, 79504, 76392, 63377, 67302, 73853, 82808, 90288, 91537, 91742, 109879, 117173, 98943, 83234, 96689, 111138, 130537, 133254, 133620, 135721, 118978]
9600A18978j4696j4894o201J458o585N960J2946J7023J2370N13l863J452m456
9587A20005K578j030K506J097M05j1009j4460J033l126M693j0284m023k230K641
9573H8796K469J43Q757J3340n333j0055o649M842L497J406J6476o132j353M972
9559A15176K230o517R737J1627n333k2369k492J1877l221J24J809J64j287J677
9545A13202o176J158N27o026J9570R951J790r640j3556J120K2168R011r683J2086
9531A45502Q330O652J9328L2904J4902N976K356o584j1613q161j0081m579L749
9518A98681j025j471q056p553p851q537r747p088K509j328K036J2623l631l660
9504A55902j4349n388M128j604Q453L279p836L064J2762J3113N318R709J8999
$$ y = [118978, 104282, 89388, 83187, 84645, 78060, 84020, 96966, 113989, 126359, 126872, 123009, 124461, 120005, 122583, 121553, 124059, 125156, 125561, 114552, 100092, 101125, 97999, 102692, 92408, 88385, 86155, 88796, 91265, 91408, 100165, 113505, 108172, 98117, 91468, 96310, 99807, 101213, 117689, 111557, 110204, 115176, 117406, 110889, 120626, 132253, 126920, 104551, 102059, 113936, 110715, 110839, 112648, 112812, 111525, 113202, 107026, 108184, 108711, 102685, 122255, 132206, 133996, 124356, 110800, 111920, 134088, 143099, 133416, 145502, 153832, 160484, 179812, 212716, 227618, 233594, 235950, 229366, 217753, 209592, 199511, 194932, 198681, 197656, 196185, 188129, 180576, 172725, 164188, 154441, 147353, 149862, 148534, 150570, 163193, 159562, 155902, 141553, 136165, 140293, 138689, 147142, 150421, 142585, 145649, 158411, 171524, 176842, 186551, 205550]
9491B05550L2803L2337K7811J7741K5453L0770K3625j3148k510J1600J1524K6184
9479D29740L869J0445J8534L511J759j3653k1784j784L640j4440r496m150M687
9466D10878j6106k3404j8159j0362P269k672l156q117l123l91K701Q658p864q503
9452C27649m593j7228j0255r83k071K3294K7122K0497K7295M2129o25k518P424
9439D37137j1946L756J6537K0577M2151N4195N6687O0568K8677J5777J0752P859
9427G42727Q042Q123l2410k5826j3025r345j4346l0496k2016k8083l4448j6109
9415E32788l0764j2550K877L107J0189P454n352j1417q712k4268k1168M02j356
9402D41230J5132J9395J8664K4663K6384J562k6877j3609j5480k2808j5401m15
$$ y = [205550, 238353, 270690, 298501, 316242, 341695, 372465, 396090, 382942, 380432, 392032, 403556, 429740, 433609, 444054, 462588, 466099, 467858, 454205, 432421, 430637, 434277, 419837, 410341, 406191, 410878, 394772, 371368, 353209, 342847, 350116, 347444, 344288, 336171, 333048, 332657, 335358, 344016, 336152, 327649, 323056, 305828, 295573, 294590, 292519, 315813, 342935, 363432, 390727, 432856, 432231, 429713, 437137, 425191, 428947, 445484, 466061, 508212, 562407, 619094, 679662, 708339, 724116, 734868, 742727, 750769, 758892, 726482, 700656, 687631, 678286, 663940, 633444, 611428, 583345, 548897, 532788, 502024, 489474, 492351, 495458, 505647, 513101, 507749, 496332, 487620, 463352, 442184, 442586, 441230, 456362, 475757, 494421, 519084, 545468, 547030, 520153, 506544, 491064, 468256, 452855, 452440]
9390D52440O98j03m041j062J4630L7865O5416Q3916O5058M9200L6836K2347K492
9377H25692Q259p758k8317n5382p1672n0133k4954r901j7581J5382J2081m255
9365E91461l19m975j4697l3371n8161m4799m3612j3042q103j2224j0026p088K392
9352C43436L092k570r660j1287M991L303n693J2863r812k2887J854J3342J2283
9339C33255Q602R770J1793O53J3019K1931M5283P9667Q1863N6959J3518j8571
9327F57742k1403j6433k4807J9386K8881L8084N0580L4437L7228O3395Q8131M0094
9315I95315l8696p8925j10323p4560n0939J1801O7948R4663Q9433M1229q969o2427
9303H75550q6646o6958k8158K0591N9678P5536J14045J12232O8698J9722J527
$$ y = [452440, 453138, 453035, 448994, 447932, 462562, 500427, 565843, 649759, 714817, 764017, 800853, 823200, 825692, 833951, 826193, 797876, 742494, 670822, 620689, 595735, 585834, 568253, 583635, 595716, 591461, 591142, 586167, 571470, 538099, 479938, 435139, 391527, 378485, 370382, 358158, 348132, 341044, 343436, 346528, 343958, 334298, 323011, 328002, 331305, 325612, 338475, 328663, 305776, 307630, 320972, 333255, 341857, 351627, 363420, 364073, 377092, 399023, 444306, 523973, 605836, 662795, 676313, 657742, 636339, 619906, 595099, 614485, 643366, 681450, 732030, 766467, 803695, 867090, 955221, 995315, 956619, 877694, 767371, 692811, 641872, 653673, 721621, 816284, 905717, 946946, 937977, 875550, 788904, 721946, 693788, 714379, 774057, 849593, 963638, 1075870, 1144568, 1164290, 1165817]
9292A165817N1898J39986J97037J85527J17058K4455k4953k5999n672J8306n662
9281A837798l2959o3713n1373j1599L8943O8154J20531J99129K56292K08551J03076
9270B672830J3926m3306p9917j00979r9288n0965N130J6286j0982o792O253M6248
9258B368444J06117J55781J84515J84686J75604J46827J01678P4661R8528J43350
9248C740191K17851L02111K60010L6087k02520k84075k69908j61624m647J13929
9238C747405J07113J0387k9913J0628J13269K18804K48182J80129J18385R5527
9228D819916O7513O0780O6658L2283q159m1519j19367j40697p3755P7267K07765
9217D948685K22342J65185J15070P9622N5511J7683q4094j83857k13944j55969
$$ y = [1165817, 1217715, 1357701, 1554738, 1740265, 1857323, 1881778, 1856825, 1830826, 1825154, 1843460, 1837798, 1804839, 1741126, 1689753, 1678154, 1717097, 1785251, 1905782, 2104911, 2361203, 2569754, 2672830, 2686756, 2643450, 2563533, 2462554, 2363266, 2312301, 2317431, 2333717, 2322735, 2315943, 2322196, 2368444, 2474561, 2630342, 2814857, 2999543, 3175147, 3321974, 3423652, 3498313, 3596841, 3740191, 3958042, 4260153, 4520163, 4556250, 4353730, 4069655, 3799747, 3638123, 3633476, 3747405, 3854518, 3864905, 3834992, 3845620, 3958889, 4177693, 4425875, 4606004, 4724389, 4819916, 4887429, 4948209, 5014867, 5047150, 5038991, 4997472, 4878105, 4737408, 4663653, 4740920, 4948685, 5171027, 5336212, 5451282, 5530904, 5586415, 5604098, 5520004, 5336147, 5122203, 4966234]
9207D966234o9355r7400j55067j45326k3302J61858L60516M35205L36306J42593
9197E912262O3210J78948L30003L71124K45804L8343j01609j95990k46894k50120
9187F345081k21902j98455j65415j20858q7792n4015P356P7047R8985L9527n1884
9176E667675p3355m3123J8448J59332L09626L26959J34802j39962k63081k34462
9166E862859j58125j02191j41863k58896l31356l18821k63989k10412j11057R330
9156C975479J53613K49814K93165L64073M59499N45189N34011L00607l8669j53489
9146F683292l2327J71409M03170O95926J041358J432216J779155J487527J23275
9137A3785001j314009j729979j244648m66223K95943R88686J436935J338333M79330
$$ y = [4966234, 4896879, 4799479, 4644412, 4499086, 4475784, 4637642, 4998158, 5433363, 5769669, 5912262, 5975472, 6154420, 6484423, 6855547, 7101351, 7139694, 7038085, 6842095, 6595201, 6345081, 6123179, 5924724, 5759309, 5638451, 5550659, 5496644, 5504000, 5581047, 5680032, 5719559, 5667675, 5594320, 5551197, 5569645, 5728977, 6038603, 6365562, 6500364, 6360402, 6097321, 5862859, 5704734, 5602543, 5460680, 5201784, 4870428, 4551607, 4287618, 4077206, 3966149, 3975479, 4129092, 4378906, 4672071, 5036144, 5495643, 6040832, 6574843, 6875450, 6836781, 6683292, 6650965, 6822374, 7225544, 7921470, 8962828, 10395044, 12174199, 13661726, 13785001, 12470992, 10741013, 9496365, 9030142, 9326085, 10314771, 11751706, 13090039, 13569369]
9128A3569369p06361j499726j633052j360207r47224n81624m59293n57474o14774
9119E209634n15879l72330k00425p2222N0699J34711J22146q192j31828j54987
9109D061327p3993N0852J66750K96604M25424N69897Q06960J166676J705681K399329
9099A1575507L282100M211835N029794N588545M728789J327921k387918l549806
9091B9806767k317895o44588r590k90807r97500k053089k866244k739417j766969
9082A6120668n03331O38834J355992J440911R92559M52877J25373j9850m97982
9073B0106051j579340k189919j768531o67738O83108K017164K985160L840895
9065B3426850M933478J280768n232247o355069l953271j448018J23406J326449
$$ y = [13569369, 12863008, 11363282, 9730230, 8370023, 7422799, 6841175, 6381882, 5824408, 5209634, 4693755, 4321425, 4121000, 4048778, 4099477, 4234188, 4356334, 4348142, 4216314, 4061327, 3987334, 4038186, 4204936, 4501540, 4926964, 5496861, 6303821, 7470497, 9176178, 11575507, 14857607, 19069442, 24099236, 29687781, 34416570, 35744491, 33356573, 29806767, 27488872, 26844284, 26834694, 26543887, 25546387, 23493298, 20627054, 17887637, 16120668, 15617337, 16256171, 17612163, 19053074, 20045633, 20498510, 20623883, 20604033, 20106051, 18526711, 16336792, 14568261, 13900523, 14583631, 16600795, 19585955, 23426850, 28360328, 29641096, 24408849, 18053780, 14100509, 12652491, 12775897, 14102346]
9057A4102346K318400K432555J378726K78945L6242L83350Q72279J531207K490331
9048B5824381L420183L347855K298972J672844K467748M119044M553696K515297
9040E0220020q2535p08995N35098J387639R5296k440217m560305n451083m960260
9031C4034658l732526k519561j818006j809600k117654k219209j829031r81003
9023A7008068J96519J440577K142638J425696l215o43521m73858l14542m14269
9014B0364093m62245j66323n4190j010225k045698j810934n39492J077043K692851
9005A8044880L786251L300998R27472j907164l103281k364361p34900J056977
8997A9006872K958698N123840P635619J0029335J0369388O845703M51520n502205
$$ y = [14102346, 16420746, 18853301, 20232027, 20510972, 20547214, 20930564, 21802843, 23334050, 25824381, 29244564, 32592419, 34891391, 36564235, 39031983, 43151027, 47704723, 50220020, 50137485, 49428490, 49963588, 51351227, 51446523, 49006306, 44446001, 38994918, 34034658, 30302132, 27782571, 25964565, 24154965, 22037311, 19818102, 17989071, 17008068, 17204587, 18645164, 20787802, 22213498, 22210283, 21566762, 21092904, 20778362, 20364093, 19901848, 19735525, 19681335, 18671110, 16625412, 14814478, 14274986, 15352029, 18044880, 21831131, 25132129, 26059601, 24152437, 21049156, 18684795, 17949895, 19006872, 21965570, 27089410, 34725029, 44754364, 55123752, 61969455, 62420975, 56918770]
8989E6918770p853682o935398n523826n177332n208205m671227l577195k400669
8981A5571236j358998m41023M88172J628364L047565M460106N013729L796109
8973C2205260R65802j500195k585235l777070m805882m608286l517080k425955
8965I951359j654962j107919p40904m96548l60202k48216j31191k9904O5123J76891
8955E423527K33093K46699K96461L75039N60289Q68629J346213K003697K916297
8946A4269944M003277M512089L012993l62307k859322k961178j473325L46298
8938A8488469J921076K645890J444944j329179l441604l710179k876624k091044
8930A1051749j623805j307409j027829p97745o04316m48225l56388k87314k68113
$$ y = [56918770, 49065088, 42129690, 36605864, 31428532, 26220327, 21549100, 17971905, 15571236, 14212238, 13771215, 14259387, 15887751, 18935316, 23395422, 28409151, 32205260, 33171062, 31670867, 29085632, 25308562, 20502680, 15894394, 12377314, 9951359, 8296397, 7188478, 6447574, 5951026, 5590824, 5342608, 5211417, 5181513, 5246636, 5423527, 5656620, 5903319, 6199780, 6574819, 7135108, 8003737, 9349950, 11353647, 14269944, 18273221, 22785310, 25798303, 25435996, 22576674, 19615496, 18142171, 18488469, 20409545, 23055435, 24500379, 23171200, 19729596, 16019417, 13142793, 11051749, 9427944, 8120535, 7092706, 6294961, 5690645, 5242420, 4886032, 4598718, 4330605]
8921D330605k45224j87382j15442o4912k7248k6453q5938j88163k13804j61882
8911C014157p2627J6346J08208J01624L5437m777R015L7393Q0568Q5880P9347
8900C490571Q2063R6613J45818J89033K28301K68312K78707K41688K24242L15719
8890E561067M11695L36529R3380k27188m49550n10461m19089l11362k44124k20659
8880D020238k31504k23860j85350j25652o0817N637M5863M7176Q038j6353M737
8869C288153O5362J36039J78656J53693L9789p0492r8035o0682K6131J48477K02624
8858D009715K21174K33539K24094J50591R1201J30098J89896K28464L47227M76134
8848F302133N00096M39012M09497L77968L38109L01028J97207o033k84607m32891
$$ y = [4330605, 4085381, 3897999, 3782557, 3717645, 3690397, 3663944, 3578006, 3389843, 3176039, 3014157, 2941530, 2957876, 3066084, 3167708, 3203145, 3198368, 3207383, 3244776, 3325344, 3411224, 3490571, 3572634, 3669247, 3815065, 4004098, 4232399, 4500711, 4779418, 5021106, 5245348, 5561067, 5972762, 6309291, 6402671, 6175483, 5725933, 5215472, 4796383, 4485021, 4240897, 4020238, 3788734, 3564874, 3379524, 3253872, 3193055, 3198692, 3244555, 3291731, 3299769, 3283416, 3288153, 3353515, 3489554, 3668210, 3821903, 3861692, 3791200, 3693165, 3632483, 3658614, 3807091, 4009715, 4230889, 4464428, 4688522, 4839113, 4930314, 5060412, 5250308, 5478772, 5825999, 6302133, 6802229, 7241241, 7650738, 8028706, 8366815, 8667843, 8865050, 8859017, 8574410, 8141519]
8838H141519l63964j48660Q4884L35533N54612O97112Q48153J221771J966582
8829A3337542K838754L033799J532303j090297k830296k859142k011848j226029
8821A0724786p85159o39983n69713m90186l71708k01000n4483k425j0068O4115
8811G664176K44131N20682Q43215J106308J300131J218828R65933P26383N68642
8802A5158429L76156J79072J93484L55786L64892J62724k9460q4574J2383K50709
8792A6939601N82053J000310J581246K376686L339765M363621N319338N992431
8784D1495051O083273M745491J531249j406899k351161l254514n476217o590462
8776C4775811n671045l951869k567610j744615j400237j301848j297827j265953
$$ y = [8141519, 7777555, 7628895, 7713779, 8049312, 8603924, 9301036, 10149189, 11370960, 13337542, 16176296, 19210095, 20742398, 19652101, 16821805, 13962663, 11950815, 10724786, 9939627, 9299644, 8729931, 8239745, 7868037, 7667037, 7612554, 7610129, 7600061, 7664176, 7908307, 8428989, 9272204, 10378512, 11678643, 12897471, 13863404, 14589787, 15158429, 15534585, 15713657, 15907141, 16262927, 16627819, 16790543, 16761083, 16676509, 16688892, 16939601, 17521654, 18521964, 20103210, 22479896, 25819661, 30183282, 35502620, 41495051, 47578324, 52323815, 53855064, 52448165, 50097004, 46842490, 41366273, 34775811, 29104766, 25152897, 22585287, 20840672, 19440435, 18138587, 16840760, 15574807]
8768A5574807j184531j016203p86895n57484k96347j8931K50739M39459N80331
8759A2984945P89451J119275J552426J833660J870659J793398J685095J669404
8751B5298313J752748J661148J185935Q44106J176428K073334K927489L450474
8743D0369975L954307M709213N681725O542329O251634M241204J057729j542932
8735G1265184k517202k061843j056360j324157l030738m299858m828596n340802
8727D6805628n861212n767318m911486l822971k942768k267392j775604j561459
8719A7895418j475334j332732j053931o76599l07658K7583L61736P24823J056917
8710A5220223J351845J565001J531249J443384J554517J824588J913787J587283
$$ y = [15574807, 14390276, 13374073, 12587178, 12029694, 11733347, 11714416, 11965155, 12404614, 12984945, 13774396, 14893671, 16446097, 18279757, 20150416, 21943814, 23628909, 25298313, 27051061, 28712209, 29898144, 30742250, 31918678, 33992012, 36919501, 40369975, 44324282, 49033495, 54715220, 61257549, 67509183, 71750387, 72808116, 71265184, 68747982, 66686139, 65629779, 64305622, 61274884, 56975026, 52146430, 46805628, 40944416, 35177098, 30265612, 26442641, 23499873, 21232481, 19456877, 17895418, 16420084, 15087352, 14033421, 13356822, 13049164, 13076747, 13438483, 14163306, 15220223, 16572068, 18137069, 19668318, 21111702, 22666219, 24490807, 26404594, 27991877]
8702B7991877J202275J282948J826907K514657L059765L569915M098541M304250
8694D9851135M016092L290984J923645M38598N16383J940874K787922J981857
8686F6747490L77113j268116l943523p479409r460694q847313o728627m558727
8678B4838194k980121k047552j545699j386493j312616j203421j167171j100213
8670A2094908r80777p97342n61822l23830j73638p4381J10446L37445N33840P08088
8660A0872937Q48602P44175M12914J60907J81987M35970P84763J049287J306168
8651A6797710J612392K070104K764239L459795L665442L402669K923211K278260
8643C8973822J667002R34727k83163k313366m703487n970501n689042m563061
$$ y = [27991877, 29194152, 30477100, 32304007, 34818664, 37878429, 41448344, 45546885, 49851135, 53867227, 57158211, 59081856, 59520454, 60036837, 61977711, 64765633, 66747490, 67124603, 65856487, 61912964, 54433555, 44972861, 36125548, 29396921, 24838194, 21858073, 19810521, 18264822, 16878329, 15565713, 14362292, 13195121, 12094908, 11114131, 10316789, 9754967, 9431137, 9257499, 9183118, 9293564, 9631009, 10164849, 10872937, 11721539, 12465714, 12878628, 13039535, 13221522, 13657492, 14442255, 15491542, 16797710, 18410102, 20480206, 23244445, 26704240, 30369682, 33772351, 36695562, 38973822, 40640824, 41575551, 41292388, 38979022, 34275535, 28305034, 22615992, 18052931]
8635A8052931l305833k228621j442942j031608r27905q77328p42555n53130m48659
8626F494350m46903m51115l99523l10207k03808k01130k83674l54242l19840k39262
8616C284646j83674j18281n5025q313L8356L9738N0479Q7314J36221K30069L45883
8605C847413N17355P96172J196881J664209K169709K515072K331809J168981p64739
8596A5442862k345162k811633k425540j801764j249947q41163n61680m00151k86824
8587B718998j85922j46247j30056j30909j19276r8695q5720q3821r2350p0032
8577A575970l3091l1595n8676n4047m2674n3131p1285p6157q1383p8685o4797
8566I30449l5490j0912K6855L4220L2676K2212L1054K6746J2373J3350K6066N4766
$$ y = [18052931, 14747098, 12518477, 11075535, 10043927, 9116022, 8238694, 7496139, 6943009, 6494350, 6047447, 5596332, 5196809, 4886602, 4682794, 4481664, 4197990, 3843748, 3523908, 3284646, 3100972, 2982691, 2927666, 2919353, 2957709, 2997447, 3047926, 3135240, 3271461, 3501530, 3847413, 4364768, 5160940, 6357821, 8022030, 10191739, 12706811, 15038620, 16207601, 15442862, 13097700, 10286067, 7860527, 6058763, 4808816, 3967653, 3405973, 3005822, 2718998, 2533076, 2386829, 2256773, 2125864, 2006588, 1907893, 1822173, 1738352, 1646002, 1575970, 1542879, 1511284, 1452608, 1398561, 1355887, 1302756, 1231471, 1155314, 1073931, 995246, 930449, 894959, 884047, 910902, 945122, 977798, 1000010, 1031064, 1057810, 1070183, 1083533, 1109599, 1164365]
8554A164365N8763M9714K6301j4993o7994r0012o4802o4803o6216n2241j6806
8543H61276k313q148k2227L443K7025M1442N2919K6811j5630l351J3316R144k6235
8530I57472m4161n4480l0899n749k997j0002j4476j6437m348j9290j7234j8438
8518G18961l862j3514j8281j7767j3255l553N029L250r036j752p520K808J9401
8505F60909K4299K8535M3073N4640N2124M8795K6453K0897P13N57L7161O4723
8493A062879J22078J95938K90053M22527N46225O03234N57271M50899L62315M01285
8483E014704M47530L80720K32577Q1013n1585r7465j10017j38940k61755m26689
8473E070093n17713m94751m18290l66646k81262k05866j58293j35568j25879q5956
$$ y = [1164365, 1223128, 1272842, 1299143, 1284150, 1216156, 1126144, 1061342, 996539, 930323, 878082, 861276, 858963, 850815, 828588, 832031, 859056, 900498, 953417, 980228, 964598, 961247, 974563, 983707, 957472, 913311, 858831, 827932, 822183, 819186, 809184, 794708, 778271, 773923, 754633, 737399, 718961, 715099, 701585, 683304, 665537, 652282, 648729, 653758, 657008, 647972, 646220, 638700, 641508, 660909, 685208, 713743, 756816, 811456, 863580, 912375, 938828, 959725, 960438, 960995, 998156, 1062879, 1184957, 1380895, 1670948, 2093475, 2639700, 3242934, 3800205, 4251104, 4613419, 5014704, 5462234, 5842954, 6075531, 6156544, 6104959, 6007494, 5897477, 5758537, 5496782, 5070093, 4552380, 4057629, 3639339, 3272693, 2991431, 2785565, 2627272, 2491704, 2365825, 2279869]
8463B279869j0270N2464J12508J62665J55858R5381M6392o270M9914J83563K43692
8452C365766J91813J28805Q2814M7690L2921K6119O0768Q8231R3589R8063J24764
8441D341343J44963J94105K74299L64698M20674L99487L03404J71489J02706P6271
8431F793439Q1183J73243J99833Q8047j78377m29091n38229m82938l67190k64051
8421E075869j87601k24926k73837l07901k67738k24995j70648q2062P108N1013
8411C394282M4768j7783j37696k35825k42685k26279k13516j96801j59592j44967
8401A863906j02565n8420k1607j3724J1310N1829N5753N4279J00166J83917K81160
8390B406004L85739M78043M95111L82131J78306m6J5657J77939L57723L73329
$$ y = [2279869, 2269599, 2322063, 2434571, 2597236, 2753094, 2848475, 2894867, 2888597, 2938511, 3122074, 3365766, 3557579, 3686384, 3769198, 3816888, 3849809, 3875928, 3936696, 4024927, 4118516, 4216579, 4341343, 4486306, 4680411, 4954710, 5319408, 5740082, 6139569, 6442973, 6614462, 6717168, 6793439, 6874622, 7047865, 7247698, 7335745, 7157368, 6728277, 6190048, 5707110, 5339920, 5075869, 4888268, 4663342, 4389505, 4081604, 3813866, 3588871, 3418223, 3336161, 3343269, 3394282, 3439050, 3421267, 3283571, 3047746, 2805061, 2578782, 2365266, 2168465, 2008873, 1863906, 1761341, 1702921, 1681314, 1667590, 1678900, 1730729, 1786482, 1840761, 1940927, 2124844, 2406004, 2791743, 3269786, 3764897, 4147028, 4325334, 4325288, 4340945, 4518884, 4876607, 5249936]
8380E249936J61227j65330m15966m52519l29087j77051j43109k38713l45006l81301
8370B763081l07154k22425j47927r6338p0735l7185j4165q790l5745p1287r1115
8359A660215p4208l8227J1216N3933Q6271J03542J10501J00146P3675P2753O8129
8348B227946R9243J21015P7132M5275M4901P9487R5164J16346J59306K20728K84481
8337C571024L81815M60250N48186O89969Q24264R98554J262095J749322K516406
8328A3001885L751190N730295Q811879J3184740J7948901K0194192J7008002Q687116
8320A08318200k096186j2430843j8894222j9306102j5384707j0592290o874231
8313B2739619m451246k961144j994092j347434r42293p51495o70329o46248n85801
$$ y = [5249936, 5411163, 5245833, 4829867, 4377348, 4048261, 3871210, 3728101, 3489388, 3144382, 2763081, 2455927, 2233502, 2085575, 1989237, 1918502, 1881317, 1867152, 1858362, 1822617, 1751330, 1660215, 1586007, 1547780, 1558996, 1612929, 1699200, 1802742, 1913243, 2013389, 2087064, 2159817, 2227946, 2327189, 2448204, 2525336, 2570611, 2615512, 2694999, 2790163, 2906509, 3065815, 3286543, 3571024, 3952839, 4413089, 4961275, 5651244, 6475508, 7474062, 8736157, 10485479, 13001885, 16753075, 22483370, 31295249, 44479989, 62428890, 82623082, 99631084, 108318200, 106222014, 93791171, 74896949, 55590847, 40206140, 29613850, 22739619, 18288373, 15327229, 13333137, 11985703, 11043410, 10291915, 9621586, 8975338, 8389537]
8304H389537m56619k35789l286J15228J12631Q8385K16326M98860Q53541J290380
8294A0869194J988205L150353M590404N215403L985644J444477q15787j714991
8286B8712902j721900j312591k82280J229003K650578L170882K347179R08501
8278C5702274N759n8432O52623K015945L937667O442593R098445J0091113P822396
8269G5710383L694310O3809l228851o505408q073109o943405l890664n93830J341249
8260E1574484P00061k050973m375753n110837m942475m702251m237893l471547
8252B3382816k842691k241514j792841j779307j896135j778923j430181j071732
8244H549492q24587o73830n50179m38605l41790k74159k19103j25905n9241K69
$$ y = [8389537, 7932918, 7697129, 7693843, 7809071, 7921702, 8010087, 8226413, 8725273, 9578814, 10869194, 12857399, 16007752, 20598156, 25813559, 29799203, 31243680, 30427893, 28712902, 26991002, 25678411, 25396131, 26625134, 29275712, 32446594, 34793773, 35702274, 35708033, 35649601, 36302224, 38318169, 42255836, 48698429, 57796874, 67887987, 75710383, 79404693, 79468502, 76239651, 69734243, 61661134, 54717729, 50827065, 50233235, 51574484, 52274545, 50223572, 45847819, 40736982, 35794507, 31092256, 26854363, 23382816, 20540125, 18298611, 16505770, 14726463, 12830328, 11051405, 9621224, 8549492, 7724905, 7051075, 6500896, 6062291, 5720501, 5446342, 5227239, 5101334, 5042093, 5042362]
8234E042362J05934J99141L22271M57023O31658R01301J307130J903146K868088
8225A3738054M454475O854782R980110J2840555J3434517J0712751N898082L09563
8217G8222889n942049j1600528j4081891j2693436r391517o297132m120400k730748
8209A1365188j868457j314782r46435p27488n95823n16608m93317n05832m84231
8200C912215m43019l92437l09680k35864j92788j57830p8292m0601l3208m7398
8190A981098p0040p6199r2564r8035r7136r3769o5945l7728j4178J0553K8849
8179A374906M3786N9622P1436L5249k089k3691j7649J9401P8346J81034L30840
8168B151191N47476P95218J002405J008211P15076K39090j96702l65960j34551
$$ y = [5042362, 5148296, 5347437, 5669708, 6126731, 6758389, 7659690, 8966820, 10869966, 13738054, 18192529, 25047311, 35027421, 47867976, 61302493, 72015244, 77913326, 78222889, 72280840, 60680312, 46598421, 33904985, 24513468, 18216336, 14095936, 11365188, 9496731, 8181949, 7235514, 6508026, 5912203, 5395595, 4902278, 4396446, 3912215, 3469196, 3076759, 2767079, 2531215, 2338427, 2180597, 2102305, 2061704, 2028496, 1981098, 1911058, 1834859, 1742295, 1644260, 1547124, 1453355, 1387410, 1349682, 1335504, 1346057, 1374906, 1418692, 1478314, 1549750, 1584999, 1582910, 1559219, 1541570, 1560971, 1639317, 1820351, 2151191, 2698667, 3493885, 4496290, 5504501, 6219577, 6458667, 6261965, 5896005, 5761454]
8159E761454K71055N66979N13478P5058n28763r77638j091831r25216o31628l57747
8149B675201j78966n3578O8557J17078J00660N5964q701o653O3116J89077L08705
8138C330460L52788L55968M88150Q08332J247301J708620K067764K249176K117310
8129A4725869J543202O30752k46791j019994j617398j815346j615407j356691
8121I228196j137595q64825n32388k21205L3896K13192L22843L25330K93565J92066
8111G853075N5612p5807j57769r1385J01774K49224L25799L09959J94512M7543
8101H812537j07284k04953k40739j36630K3208J28810K08944K11439J10130j3023
8091H792439O7964M47361J099948K019055L221074M569417N431165N165749L124662
$$ y = [5761454, 6032509, 6599488, 7112966, 7188024, 6659261, 5681623, 4589792, 3664576, 3032948, 2675201, 2496235, 2442657, 2511214, 2628292, 2728952, 2784916, 2776215, 2769562, 2832678, 3021755, 3330460, 3683248, 4039216, 4527366, 5335698, 6582999, 8291619, 10359383, 12608559, 14725869, 16269071, 16899823, 16653032, 15633038, 14015640, 12200294, 10584887, 9228196, 8090601, 7225776, 6693388, 6472183, 6506079, 6719271, 7042114, 7367444, 7661009, 7853075, 7908687, 7832880, 7675111, 7583726, 7685500, 7934724, 8260523, 8570482, 8764994, 8812537, 8705253, 8500300, 8259561, 8122931, 8146139, 8274949, 8483893, 8695332, 8805462, 8792439, 8860403, 9307764, 10407712, 12426767, 15647841, 20217258, 25648423, 30814172, 33938834]
8082C3938834j12434k772898l843242l568684k669981j558099m06302O42439J626889
8073B1276522K753844M376312O945997J1002363J6608689K2576361K6399613K7085409
8065A39025110K5201403J7256021J929943j2828057k2485925k8085759k8274032
8058I1738704k3177529j6241201j0523984o755381m488276l247100k626517k256874
8050B2421842j925745j600304j395098j248508j047390p19641k96767J96955P37464
8041A5122808J212012J516547J566787J436476J212389Q03221K70196q393l5738
8032B3096305O9765K88297P88976J513110K572381M091381O390379R977291J5848169
8023F4636054K5919961M1683330N9144317O8952547O4443091L4101490j0213288
$$ y = [33938834, 33826400, 31053502, 27210260, 23641576, 20971595, 19413496, 19007194, 19649633, 21276522, 24030366, 28406678, 35352675, 46355038, 62963727, 85540088, 111939701, 139025110, 164226513, 181482534, 183412477, 170584420, 148098495, 120012736, 91738704, 68561175, 52319974, 41795990, 35040609, 30552333, 27305233, 24678716, 22421842, 20496097, 18895793, 17500695, 16252187, 15204797, 14485156, 14188389, 14385344, 15122808, 16334820, 17851367, 19418154, 20854630, 22067019, 22870240, 23140436, 23132043, 23096305, 23166070, 23454367, 24243343, 25756453, 28328834, 32420215, 38810594, 48787885, 64636054, 90556015, 132239345, 191383662, 260336209, 324779300, 358880790, 348667502]
8016C48667502m6624699o5153702o3269617m9142207l3456610k1839704j4456123
8009E4724840r814970o819672m860710l604897k878124k479135k179543j892275
8001B0195514j733459j694598j580489j366877j099490q46288o10986l65797j43382
7992A0754148K8583J50585K10891J98239J46623K66576M89130P51492J027611
7983A4023878J369459J925542K895859M515651P093239J0856087J5409779J8721367
7975G6810861J8890317J7542222J4490867M612115q528817j4337143j4241707
7968I5238715j6004204j8198081j6490276j1985401p770289n019119l380028k383975
7960A4007342j766362j369824j141129j008345r16027q24478p51836o61314n63517
$$ y = [348667502, 302042803, 236889101, 173619484, 124477277, 91020667, 69180963, 54724840, 44909870, 38090198, 33229488, 29624591, 26746467, 24267332, 22087789, 20195514, 18462055, 16767457, 15186968, 13820091, 12720601, 11874313, 11263327, 10897530, 10754148, 10782731, 10933316, 11144207, 11342446, 11489069, 11755645, 12244775, 12996267, 14023878, 15393337, 17318879, 20214738, 24730389, 31823628, 42679715, 58089494, 76810861, 95701178, 113243400, 127734267, 132346382, 123817565, 109480422, 95238715, 79234511, 61036430, 44546154, 32560753, 24790464, 19771345, 16391317, 14007342, 12240980, 10871156, 9730027, 8721682, 7805655, 6981177, 6229341, 5568027, 5004510]
7951E004510m79562l93136l23983k64426j86823j21244p6349l6190m8256n4608
7941C019933q2295j54863k22201k63906k47221k12902j50345j07352q0022n2061
7931A446765m6012l1171l2661n7493n9171m1859k7483r354j96J1355L9553Q0968
7919A273241J03875J10312N8894k5800q6912j17619j05805q1537o7669l8037m6793
7908I76150o0127o0882n0291l2668q203r235j7893J2913L7381K9750R013n241
7896H20667k8264l3054k8933m9823k1176L8377O4634N5311K3012Q104P044j2877
7884H43022l2581j7870k091p926j1550j7743j3193j3947J242j3096j0407p143
7872F96717K563O589J6416L1775N1739N5022L7079l431n0444r0092j16572r2452
$$ y = [5004510, 4524948, 4131812, 3807829, 3543403, 3356580, 3235336, 3158987, 3122797, 3074541, 3019933, 2937638, 2782775, 2560574, 2296668, 2049447, 1836545, 1686200, 1578848, 1498826, 1446765, 1400753, 1369582, 1336921, 1279428, 1220257, 1178398, 1150915, 1141561, 1141365, 1152720, 1192273, 1273241, 1377116, 1487428, 1546322, 1520522, 1433610, 1315991, 1210186, 1128649, 1060980, 1022943, 976150, 916023, 855141, 804850, 772182, 763979, 754744, 736851, 749764, 787145, 816895, 825908, 820667, 792403, 759349, 730416, 680593, 659417, 697794, 762428, 817739, 840751, 848855, 855899, 843022, 810441, 792571, 790480, 782554, 771004, 753261, 740068, 726121, 727363, 714267, 703860, 696717, 699280, 705869, 722285, 754060, 805799, 860821, 897900, 894469, 844025, 753933, 637361, 544909]
7860E44909p1972l9163j5062J4503K1790Q350K713K284j6485l9843k4348k9741
7848C57935l5823k2237j0961J88M7203P3989R9312R8860Q6759M6502j5848p1545
7836F54334r4181p7565p2854n4573l5512k4527j2702m380k3173J3076K0043R951
7824B97937P805R273K9277L3279J8801K3460M2074O3220P1567J8370j4684m7551
7812E52828q4778p8561o3231l9185k9356l8141j3083j2880Q622J0190M466j6459
7800B00432j9017j3710M215m701j295j1746k322J905K0265K0975J1320j9974l5110
7787A51237q496R636J2524J0474Q777P068m064j5167O987O055k6639j1207J1139
7774A58324R705N691o598J2986O029N972J167n231P296l460o989l163k006R259
$$ y = [544909, 472937, 433774, 418712, 433215, 455005, 463355, 466068, 468352, 451867, 412024, 387676, 357935, 322112, 299875, 288914, 289102, 336305, 410294, 509606, 608466, 695225, 741727, 725879, 654334, 560153, 482588, 409734, 355161, 319649, 295122, 282420, 278040, 254867, 267943, 287986, 297937, 305742, 315015, 344292, 377571, 396372, 419832, 461906, 525126, 596693, 615063, 600379, 552828, 468050, 389489, 326258, 287073, 257717, 219576, 206493, 193613, 202235, 212425, 216891, 200432, 181415, 167705, 171920, 167219, 165924, 154178, 151856, 153761, 174026, 195001, 206321, 186347, 151237, 142741, 152377, 164901, 175375, 184152, 191220, 187156, 171989, 178976, 185031, 158392, 147185, 158324, 168029, 173720, 167122, 180108, 186137, 192109, 193276, 188045, 195341, 191881, 184892, 181729, 179723, 188982]
7760A88982M695r95o583J975K230L507J45r921k167J502l930n203q483j2395j1175
7745A42184r423N458M001l080l062p945J1920J155P278m376K457J8916K2934J4152
7731B02569K5767O009k1227j4801k1881k342o570j0484m688r865j1368J0377L60
7718A41856n443O825J1065k853n206Q155O648J179J3031L373o938j1747j1213
7705A48732m919j8757k373l823N671q389r042l770N058R491r213r399Q461J1567
7691A19295O782J3054K0876L0590L5929K3939J2896N546k7899k1196j2206k6540
7679A81066j5477R94n978N383K7317M7753M6627O0566J15186J72636J75446J69788
7667I81307J02438j6571j21603j85832j79373j37423r2981n2625m1215l9383o400
$$ y = [188982, 193677, 192682, 186099, 188074, 190304, 193811, 193956, 184035, 181868, 183370, 179440, 174237, 165754, 153359, 142184, 132761, 138219, 142220, 139140, 136078, 128133, 140053, 141208, 148486, 144110, 146567, 165483, 188417, 202569, 228336, 234345, 213118, 198317, 176436, 174094, 167524, 157040, 152352, 142487, 131119, 141496, 141856, 136413, 143238, 154303, 151450, 146244, 154399, 161047, 162226, 175257, 178630, 171692, 159945, 148732, 143813, 125056, 122683, 118860, 124531, 116142, 107100, 103330, 108388, 117879, 108666, 99267, 107728, 119295, 126077, 139131, 160007, 190597, 226526, 250465, 263361, 268907, 241008, 219812, 207606, 181066, 165589, 166583, 160605, 165988, 193305, 241058, 287685, 348251, 463437, 636073, 811519, 981307, 1083745, 1067174, 945571, 759739, 580366, 442943, 349962, 297337, 256122, 216739, 210339]
7656B10339n921k234j8592l5877j2759J2801O07j3520j0013q578Q419J1433M142
7643A40247K376Q991J9489P284P911l675L583M407N798q610n553n72J0511J6036
7629B08223L0854N9162Q6088J14021K09470L28820M09418M13576K55070r0442
7619B024260l63528m39086l64647k35263j52670q8223n1139n7003n1727k4900
7609A96074p70j1438j2000j1417k7758k1753o123j5153m769j004k2183j3227O124
7596E4603K854J5553K1168R610p917j6425J8287R560j0996o94J3716K1265K0040
7583A50624J1936K2355N2303Q7985J13560J44229J49256R9067J5760p3100j22097
7572F51878j38583j20874j01560p9812m3380k2553j5162j2572N30J3763O694J129
$$ y = [210339, 204418, 202184, 183592, 147715, 134956, 147757, 148364, 134844, 124831, 116253, 124672, 136105, 140247, 142623, 151614, 171103, 178387, 186298, 182623, 186206, 190613, 196411, 187801, 182248, 181676, 192187, 208223, 239077, 298239, 384327, 498348, 707818, 1036638, 1446056, 1859632, 2114702, 2024260, 1660732, 1221646, 856999, 621736, 469066, 380843, 329704, 272701, 220974, 196074, 195304, 183866, 171866, 160449, 132691, 110938, 104815, 89662, 84893, 83889, 61706, 48479, 54603, 57457, 73010, 94178, 103788, 95871, 79446, 97733, 107293, 96297, 95603, 109319, 130584, 150624, 162560, 184915, 237218, 325203, 438763, 582992, 732248, 831315, 847075, 773975, 651878, 513295, 392421, 290861, 211049, 167669, 145116, 129954, 117382, 117912, 131675, 138369, 139498]
7560A39498l3863m2661l9684k4236k9540k2220L380J5225K4912J1518M059n683
7548G05n454J6718j070N621M175n728l146k730p541j0671Q06M256L685M279M641
7533H546m856q550J5446O223j1365j0230Q283J0905J952P584O149J650J895j388
7519C2244k7q845l620P588j3660J273P375j4055k939l5O4K7m720n342J0081n913
7503e04K658J815J689L951m444k974k93J691j0561K480k851l493J6562K655q796
7488d15j104J6330J0859M367j0950j0167L44r120j144J1897J4224o354P32O533
7474B6032L140j359j0932O490q072j6834K415J2883l235L483o19O365j531J032
7460A9258j0419k1471k031R294O298J111k793l062p621p025l418J0551M018Q640
$$ y = [139498, 105635, 62974, 23290, -946, -30486, -52706, -49326, -34101, -9189, 2329, 6388, 705, -4749, 11969, 10899, 16520, 20695, 14967, 11821, 9091, 1550, -9121, -8315, -4059, -374, 3905, 8546, 3690, -4860, 10586, 16809, 5444, -4786, 3497, 14402, 16354, 23938, 30087, 31737, 33632, 32244, 32217, 23372, 19752, 27340, 13680, 14953, 22328, 8273, 5334, 5299, 5363, 5390, 670, -4672, 5409, -504, 2154, 3969, 5658, 9609, 5165, 2191, 1898, 3589, -6972, -4492, -7343, -10836, 5726, 8381, -415, -1519, 14811, 25670, 30037, 19087, 8920, 9264, 144, -1000, 10897, 25121, 18767, 19499, 26032, 29172, 27813, 16881, 23371, 15299, -1535, 880, 13763, 10528, 14011, 13392, 19757, 18226, 19258, 8839, -12632, -14663, -5369, 929, 2040, -753, -3815, -11436, -18461, -21879, -11328, -7310, 1330]
7446A330J4780l796q935K636j250o62p02l198l663O556N798k283J026k274J497
7431F860J53q17j468j1078J396J0704P772J432J1106q189j2149l260J602p25P600
7416A0939J1434N190j3505j8620Q596K023k797j1146L414J7387K768o198q544
7403I41P335n194q31M967l03q580j907j53Q815O581J3977n006j0000K702J0138
7388B3482o326r709l570J53j483q873k117O575J3971J474K917K693M287q986k589
7373A1899M341J6884J2494j2323k7313o464k263M296J3963M113j5496j4309J025
7360i153J162j0501K0153l107j487J2580m578K618K7913J379j8951R10J420O62
7346B1020J142k3527j1751n28L906M710M646k95L680J303K614j605O2j1179j4631
$$ y = [1330, 16110, 12314, 3379, 6015, 4765, 4103, 3401, 203, -3460, 3096, 8894, 6611, 7637, 5363, 6860, 7013, 6196, 4728, -6350, -4954, 5750, 13522, 14954, 26060, 17871, 5722, 2462, 4064, 3339, 10939, 22373, 27563, 14058, -4562, 4034, 6057, 3260, -7886, -4472, 12915, 15683, 9485, 941, 8276, 3082, 2251, 7218, 6915, -1665, -3572, -3725, 5090, 11671, 25648, 20642, 10642, 13344, 23482, 17156, 7447, 3877, 4030, 2547, -6326, -8443, -1868, 12103, 13577, 16494, 19187, 23474, 14488, 11899, 16240, 33124, 45618, 33295, 5982, -482, -2745, 1551, 15514, 19627, 4131, -10178, -9153, -7991, -18492, 1661, -1446, -2933, 9647, 5069, 7687, 35600, 36979, 18028, 18938, 20358, 21020, 22162, -1365, -13116, -13644, -9738, -5028, -382, -677, 3003, 4306, 6920, 5315, 5377, -5802, -20433]
7331b0433O90J249j275J5840Q121p627J481j0286o339J3901J2322M589K885O516
7317B1634l48o681q174j6152J2703J3385j7123Q882Q548j0524K73J3377m265O99
7303A6234K705p494j1071k166M191N245J2238O064p588j3837P894k208K838J548
7289A4593j3958p4N770r766j776M507p993J1663j52n775k028J291M617Q69O186
7274G974p95L536r813q243J5179J7710J759p818m809L148J978q010j2706J0142
7260I232N934j2061l682O48Q349r69j2909q422L952P555n07q807J3139m639L833
7245F46J2853J0576l226M893J628r395j4131p15k717J424j2317j5843k376N803
7231b2897N898M469P377Q270J4q271q128n033N544K4530J7303k287n909q268r760
$$ y = [-20433, -19743, -18494, -19769, -3929, 4192, -3435, -1954, -12240, -18579, -4678, 7644, 12233, 15118, 21634, 21286, 14605, 6431, -9721, 2982, 16367, -756, 8126, 16674, 6150, 6423, 19800, 15535, 16234, 18939, 11445, 374, -1792, 2399, 7644, 19882, 25946, 18358, 4521, 12415, 10207, 13045, 14593, 635, 561, 6331, -3435, -5211, -704, -8697, 2966, 2814, -2961, -4989, -3698, 919, 1788, 7974, 7179, 10715, 902, -7341, 7838, 25548, 27307, 19489, 14680, 17828, 19806, 11796, -910, 9232, 15166, 3105, -577, 71, 8420, 7451, -5458, -13880, -9928, -2373, -2880, -11687, 1452, -3187, 646, 13499, 24075, 20849, 25742, 27370, 17975, 3844, 3129, 412, 1836, -10481, -26324, -28700, -22897, -16999, -12530, -5153, 3117, 3131, -5140, -13268, -18301, -12757, 11773, 29076, 26789, 20880, 12612, 2852]
7216B852r217m716q167J7785J2483J0235K445K11K55l479j5928l551m293j1313
7202a4398l444J9744J6301j0290j4213K007J2313N94m138N342J375j0653j0454
7189i914k431N30R854O273p677j3874M955J1680J1696O218J208n260K796m2j5875
7174A37M265J0707p847j2578j0646j1420J0910K1025O478o730J728J768j02r859
7160b164J7263Q085o968j3704o487J482M054L453M675n433n031M059p366n711
7146i793J3036n77q432j3974J3251J1253L791q297j2065J2406J0408k281q459
7133B67j0262k200p767N101L810P91o240N214l455m79P692R500J1426o428j1696
7118d726q668M382K0351M811k0499j0067n455J2490J1381M744j1655m960L757
$$ y = [2852, -6365, -11081, -19248, -1463, 11020, 21255, 23700, 23911, 24166, 20687, 4759, 1208, -3085, -14398, -17842, 1902, 18203, 7913, -6300, -4293, 8020, 8614, 4476, 9818, 11193, 540, -9914, -12345, -11815, -1961, 4312, -3365, -17239, -12284, -604, 11092, 17310, 18518, 13258, 16054, 16012, 137, 4402, 15109, 7262, -5316, -15962, -27382, -16472, 4553, 11031, 4301, 6029, 7797, 7695, -2164, 15099, 23184, 16216, 2512, -3975, -2493, 1561, 5014, 9689, 4256, -775, 3284, -4082, -9793, 3243, 2666, -5766, -19740, -6489, 4764, 8555, 258, -11807, 599, 11007, 8726, 267, -9995, -12195, -19962, -14861, -11051, -10260, -16500, -11286, -14741, -15220, -7528, 1972, 13398, 6970, -4726, -13394, -9012, 11339, 16150, -4349, -14416, -19871, -7381, 4000, 8744, -2911, -7871, -4114]
7105d114K984l398j118J2769M483j0827k03l504j0594M980P302J0506M352N894
7091A9512J6359l753j8435p767l727J2005J3134M303p858l350o599n717q937J494
7077F64L899R788L044p968J523K926j1980j2901p680L494J4470R426n605J6080
7063A9180L710l226j5288j4850n109o7L03N143N994J300l108Q715r32o167L888
7048e14r109n939Q239J6536Q475M824P278J1628j6563j1753L491k342k829J407
7034A2829j603j324M59o245l725r919n164O44R200K224q004P062K2193l461o646
7019H520L58j8564P5R591p244j7684J0236J0782q821p929J3138J7327P168n936
7005A1017L553k898P711l435j2590k900M549M057l231k92J673Q890N351j1170
$$ y = [-4114, -1130, -4528, -5646, 7123, 11606, 779, 576, -2928, -13522, -8542, -1240, 9266, 13618, 19512, 35871, 32118, 13683, 5916, 2189, 14194, 27328, 31631, 23773, 20423, 13824, 8107, -830, 664, 4563, 14351, 17395, 9427, 10950, 13876, 1896, -11005, -18685, -15191, -721, 8705, 3100, 19180, 22890, 19664, 4376, -10474, -15583, -15650, -15347, -10204, -4210, -2910, -6018, 2697, 1765, -4402, -514, -9623, -15562, -7323, 9213, 17688, 22512, 29790, 41418, 24855, 13102, 16593, 14251, 11422, 12829, 11226, 9902, 10361, 4116, 391, -9528, -14692, -14048, -4848, -2624, -10628, -3566, 18627, 15166, 8520, 8878, -9686, -9611, -20, -7264, -24948, -14712, -3930, -12751, -20680, -7542, 9785, 16953, 11017, 14570, 11672, 19383, 15948, 3358, 458, 5007, 9064, 5833, 5541, 7214, 16104, 21455, 10285]
6991A0285J842L884j0549J4103L810L227j0613l969M903P716m697m910j0263K324
6977G093O425m955l793P154j514j8698p301P023o495M287J656J670n940J1606
6963a782J2427p113P9m944r072O505J0722J582J8644l359k3174j8508M035J6896
6949B938j0949n985j541r772l493K5207M941j0027L43m9J5275l868j1824o402
6935a5206j1537J1571o664n937L371M444o218K066N447o197j630l437K612l446
6921c0761J1893L207J157n969p581Q845N854Q346K005L403N190J1317J0317P491
6907C4714o924k0916o270j598N511n638N69L150k638Q593J22q51J4796O824j101
6892B8343k412n203j2927j2705j0476M456J5012J2506l845n092m582k503l466
$$ y = [10285, 12127, 16011, 5462, 19565, 23375, 26602, 15989, 12020, 16923, 24639, 19942, 15032, 4769, 7093, 13518, 8563, 4770, 11924, 10410, -8288, -15589, -8566, -15061, -10774, -9118, -7448, -13388, -1782, 10645, 3532, 3611, -1333, -10405, -3900, 6822, 8404, 27048, 23689, 515, -17993, -13958, 2938, -8011, -13996, -15537, -25309, -28802, -3595, 1346, -8681, -8338, -8387, 6888, 3020, -8804, -15206, -26743, -15172, -21836, -27773, -24402, -19958, -26176, -24110, -18663, -24860, -26490, -29927, -27315, -30761, -18868, -15661, -14504, -20473, -28054, -19209, -13355, -5009, -3004, 399, 5589, 16906, 27223, 34714, 27790, 6874, 604, -994, 4517, -1121, -552, 2598, -40, 8553, 8675, 7824, 22620, 29444, 28343, 25931, 20728, 7801, -4904, -15380, -10924, 4088, 16594, 12749, 7657, 3075, 572, -2894]
6879b894j002J566k425j988j10M831J559J473m191r875j8498M027J5859K608K63
6864h797r82R282o052q531k366J9180Q596j1726p542j539J0754R305N005j0282
6850D305K909n90J142Q285n92j2335j0468J532P352K993P94q133q375q613N250
6835a4544J3540Q963L040l793j0351j2986K079n043M561J0658Q359L569j982n285
6821G85J051M726l51r471k2181j0172L049K4142K269l196q42N934K290j3469l227
6806a8663J0664n631l046J5341Q622l451L55l80P905j912j3470j2339M740M779
6792f486R396m412k895J1587P767R677J266l272j3620k789r658q937P393N42N250
6777H09J1717O9k6378K767R144j0225j1305Q254j649k257L558j410o936O40J8638
$$ y = [-2894, -3896, -2330, -4755, -6743, -6853, -2022, -463, 1010, -3181, -13056, -31554, -27527, -11668, -9060, -8797, -9779, -497, -6549, -15080, -17446, 1734, 10330, -1396, -8938, -10477, 277, 9582, 14587, 4305, 7214, 6624, 7766, 16051, 15459, 3124, -7344, -5812, 1540, 4533, 5327, -2806, -11181, -19794, -14544, -1004, 7959, 10999, 7206, -3145, -16131, -14052, -19095, -14534, -3876, 4483, 8052, 6070, 785, 1836, 6562, 6211, -3260, -25441, -35613, -32564, -8422, -6153, -9349, -10191, -4257, -1967, -15436, -18663, -7999, -13630, -16676, -1335, 7287, 3836, 4191, 3811, 11716, 9804, -3666, -16005, -11265, -6486, 2910, -1502, -4397, 7190, 14957, 24634, 25900, 22628, 9008, 6219, -3439, -12376, -4983, -4441, 809, 12526, 12595, -13783, -11016, -1872, -12097, -23402, -15148, -16797, -19054, -15496, -16906, -23842, -23202, -4564]
6762d564P684n578p482M685M782K799J0914m180m004o58J515k756M79J1319Q282
6747B3237m716l258K15J66j1842j19J8254J7028J9648L9503M7301N4978M2723
6734B43118l160n5724p0187k6378j8214j7262j1133n963n053Q171p342j7403j024
6721A2446J042p671l778R135P453K306m659q274p756m793K9591J0422q338j1005
6707A6121j0223q786O651q68j148o847p774R429j968l878m278n676r462k524N145
6692b6086J6830J0819j343j388j806p167j767J70J7109J0393r917K520N023r244
6678D146k90j3739N026J7441n711J690n45L923O01M316K360k057L789j3063n331
6663B556M632O654L638J8540P413j7197r483j5184l774l507J0504M977l876J544
$$ y = [-4564, 3120, -2458, -9940, -5255, -473, 2326, 13240, 9060, 5056, 4398, 5913, 3157, 3636, 14955, 23237, 18521, 15263, 15478, 15644, 3802, 3683, 21937, 38965, 58613, 98116, 145417, 200395, 243118, 239958, 184234, 114047, 87669, 69455, 52193, 41060, 35097, 30044, 38215, 30873, 13470, 12446, 13488, 5817, 2039, 11174, 18627, 20933, 16274, 8000, 244, -4549, 25042, 35464, 27126, 16121, 5898, -2888, 3763, 2895, 1747, -5100, -12874, -3445, -5413, -9291, -13569, -19245, -28707, -31231, -26086, -9256, 1563, 220, -1168, -2974, -10141, -11908, -11738, 5371, 15764, 5847, 8367, 13390, 4146, 3856, -9883, -4857, 12584, 6873, 8563, 8018, 11941, 12542, 16858, 19218, 17161, 20950, 7887, 2556, 7188, 13842, 17480, 36020, 43433, 26236, 16753, 1569, -2205, -5712, 4792, 9769, 5893, 7437]
6649G437k917n526j6712j0411l176J4559K5860J2177p264j0469K568N814r196
6636B744q45J592r801L602j210l021J078P930j140m496m112k507l631k399Q448
6621g768J20o712LJ7674R195O192p811j0655r459J21J1887m474M132j394K584
6606C635K701O720j340j8050j575l976r090m718K744L264r94L191N079p218K082
6591a7545J2622j1260N270R381Q33l249l466O619M173j0018L657J7924l93p400
6577G148K249o256Q2n024p515m376q098j106L534J1439O241J9005j18o876M085
6562A4414J265j2162j1095l493N163K869o292j1058m766j957j485J2481K0854
6549D738j4164r913K103M49M882J0173J7333J7276o117j7999p096K23q451J0619
$$ y = [7437, 4520, -1006, -17718, -28129, -31305, -16746, 9114, 21291, 14027, 3558, 6126, 11940, 2744, 1899, 3491, -6310, -2708, -3918, -6939, -5861, 2069, 929, -3567, -7679, -10186, -13817, -16216, -7768, -7648, -14360, -14357, 3317, 12512, 18704, 10893, 238, -9221, -9100, 2787, -1687, 2445, 1051, 3635, 6336, 13056, 11716, -6334, -7909, -11885, -20975, -25693, -22949, -19685, -20679, -17488, -12409, -19627, -17545, -4923, -16183, -10913, -1532, -699, -3948, -7414, -795, 3378, -6640, -2983, 14941, 14548, 7148, 9397, 3141, 3223, -1801, -9316, -13692, -21790, -22896, -19362, -7923, -1682, 17323, 17205, 10329, 14414, 15679, 3517, -7578, -11071, -5908, -3039, -9331, -20389, -25155, -27112, -28597, -16116, 4738, -9426, -19339, -17236, -16787, -11905, -1732, 15601, 32877, 26760, 8761, 1665, 1888, -6563, 4056]
6535D056m189l876j0283K28J8111R081j292J187P785j2955j5997k2410Q16J4228
6521a5510J1142o264m518j0552j729P942R070M709J3850N786k512J439o048m845
6507A960m501J775P821J180p775L12o550p141k569n436J2540J534n068R584O527
6492D193k297O699j1321j2357P76J77J1070L090O045n001Q707J3926L882j1479
6478A6110j9112m558m196J1595Q315l965j023J5880p918l405q315M841J021j9340
6464a4070n756N688J0855J7503j1593m953O388o742q260M299J5954J624n311k301
6450C325n855m259M008Q122j164M498Q092l283p359p655l072j404J4000q46l086
6435D062J0652j79j0154j8755p776J5209J0463p001L27J365L262J0630J140K790
$$ y = [4056, -133, -4009, -14292, -14064, 4047, 13128, 11836, 13023, 20808, 7853, -8144, -30554, -29738, -15510, -4368, -10632, -15150, -25702, -27431, -19489, -10419, -5710, 8140, 13926, 11414, 12853, 6805, 1960, -2541, -766, 7055, 8235, 460, 772, -5778, -12919, -15488, -20924, -8384, -6850, -11918, -2334, 4193, 1896, 8595, -2726, -15083, -14307, -14130, -3060, 30, 6075, 1074, 9781, 23707, 27589, 16110, -3002, -7560, -11756, -161, 8154, 4189, 3166, 19046, 11128, 7723, -592, 4249, 5270, -14070, -19826, -14138, -3283, 14220, 2627, -2326, 4062, -2680, -10940, -6641, 9313, 10937, 5626, 3325, -2530, -6789, -2781, 5341, 4177, 8675, 16767, 13484, 6125, -1530, -4602, -6006, 7994, 7148, 4062, 14714, 14535, 4381, -14374, -22150, -6941, 3522, -3479, -3152, -1787, 1475, 12105, 13245, 16035]
6421A6035n657k55j771M354o778l318k189r577N322M661N50Q682P904j4631j2557
6406i225J3661k553j6319P311O028Q461m211k869q720j5054M04L678R41j037J1642
6391g862J861j0260j1712J3253N273N290R544j0074n979N722l728L572L898j4749
6377a5951p037R240N083j1125K869J2343K1219R29m845j911o454O538p133p225
6363c460k889j936l608m834j900R127l505Q225L65J0757J0170j4989j2380o634
6349a7491j562o419N322O290q221N048p757m30l90L709J235J1707M663J989Q187
6334E880K758j0698j5932m72J0279Q314L401j5440k798J3292J9560n95j8224n041
6320e716O927q38p591n310J208l325k206m812O740O726r509P926K1330M773j5427
$$ y = [16035, 10378, 10123, 8352, 12706, 5928, 2610, 421, -9156, -3834, 827, 1377, 10059, 17963, 3332, -9225, 4436, 1883, -14436, -7125, -1097, 7364, 3153, 284, -8436, -23490, -23086, -19408, -18467, -19504, -7862, -6001, -16261, -27973, -14720, -9447, -4157, 5387, -4687, -10666, -4944, -8672, -5100, -1202, -15951, -22988, -13748, -8665, -19790, -16921, -4578, 16641, 17570, 12725, 10814, 4360, 10898, 3765, -3460, -6349, -8285, -11893, -16727, -18627, -9500, -13005, -4780, -4415, 6342, 16512, 1523, -10857, -17491, -19053, -25472, -20150, -13860, -22081, -17033, -24790, -25220, -25610, -21901, -20666, -8959, -4296, -2307, 5880, 8638, -2060, -17992, -18464, -8185, 129, 3530, -11910, -14708, -1416, 18144, 17549, -675, -5716, 1211, 373, -7218, -12528, -11320, -14645, -16851, -21663, -14923, -8197, -17706, -9780, 11550, 16323, 896]
6305H96j2877K630R279J668L800L357n624j0935O800K408j339l823N291M119k913
6290B737J969M387j0495j1995J819n996M692J8251m502j819K0609l048o140L864
6276A4333J369K389m239j457n918l881m425j2955l047J562k272r371M700K5115
6262A903R610r628j4610m256R108L717o376N790j1177m623L528M197r83Q871K438
6247b491N144N712J400j9442l048J3420L711m048L889M334M757P907r684p748
6233C813M659j72r090j434m369l451o310M024Q30o315J6581J0401L676J612j0259
6218D196k979j0155M813P912J5835N962r135J683K7547K8689M1901M5626O7253
6205B29148P7639N1925J458n3933p6383p6122n3947m4522j8541J22k934q444L148
$$ y = [896, -11981, -9351, -72, 1596, 5396, 8753, 3129, -7806, -1006, 1402, 63, -3760, 1531, 5650, 2737, 4706, 9093, -1402, -13397, -11578, -17574, -12882, 5369, 867, -952, 19657, 16609, 10469, 14333, 15702, 18091, 13852, 12395, 6477, 2596, -1829, -14784, -17831, -16269, -18541, -27912, -23212, 1903, 11513, 1885, -12725, -16981, -7873, -4156, -10532, -4742, -15919, -20542, -17014, -12817, -13800, -4929, -2491, 2653, 8365, 9765, -9677, -12725, 695, 4406, 358, 4247, 8581, 13338, 21245, 11561, 3813, 8472, 8300, -790, -2224, -6593, -10044, -16354, -12330, -11500, -17815, -1234, 9167, 12843, 14455, 4196, 1217, -8938, -4125, 3787, 19622, 25584, 16449, 18132, 45679, 74368, 116269, 161895, 229148, 306787, 358712, 360170, 306237, 229854, 153732, 99785, 55263, 36722, 36844, 33910, 25466, 28614]
6192B8614K751J7134j0035j5488K042m204j3946n99o571L101K834n0m593q989
6178g999K368Q167J4305o303m374M084o155r585q802k684K679l659Q805K2767
6164A3614l783j1058Q035P846M6P625N123l472P83o811q929o057l389m869K35
6149e061J1101M961j2975j2511P362J1552O518Q036J610j2235o604J7296m665
6136A4385l744R601m671r601q07p012L143J2053j3008L878J2091j1200k0931L736
6122a2087K257R025o024O490K1141K758r095o098k310J562L566J2907j009p132
6108A5951n382K335k374j2043k375M832o202R67R796J82j4137j691N764m713m102
6093a3192n896Q740J8496l662%j0784l970J0338j386j3480j343K664K681P51M118
$$ y = [28614, 31365, 48499, 38464, 22976, 25018, 20814, 6868, 6269, -302, 2799, 5633, 5583, 990, -7999, -5631, 2536, 16841, 10538, 6164, 10248, 4093, -5492, -14294, -16978, -14299, -17958, -9153, 13614, 9831, -1227, 6808, 14654, 14700, 22325, 27448, 23976, 24759, 17948, 9019, 2962, -427, -5296, -5061, 6040, 11001, -1974, -14485, -7123, 4429, 10947, 18983, 20593, 8358, 1754, 19050, 14385, 10641, 20242, 15571, 5970, 5163, -1849, 1294, 13347, 339, 4217, 16308, 5108, -15823, -12087, -9830, -805, -6829, -339, 20802, 23560, 14465, 8367, 6057, 7619, 11185, 24092, 23083, 15951, 10569, 12904, 10530, -1513, -3888, 944, -5258, -4291, 5505, 5687, -8450, -10141, -4377, -9090, -13192, -19088, -10348, 8148, 4486, 4486, -6298, -10268, 70, -1316, -14796, -16139, -13475, -10794, -10043, -5925]
6078e925M051L141m972n816L11Q934K1952o043q836o820R55L319L994L427l522
6063H150k747o401j4245N732Q348J373o948p600J5723K593m104k746M413L161
6049D702M415j2041j0360R11o397P597R265r727j1115P78K0556R103Q5k983O16
6034E405P533q245l155n631p27J479P960Q267O763K565j6087o064j3681j0451
6020b4069P01M863M761J6396J1068P197j0241M801n969p959R999r146K220p09
6006C913k4562k550R126J2882K136j0696M529j2003m19Q92K279M135Q451k244
5992d131n041j343Q963J80o330j9095j510R12L694O480R377j125n692J2362P866
5977E567j7402j1332m58J4933J5930N129p346J919o891j2653p035M977m647n507
$$ y = [-5925, -1874, 1267, -3705, -9521, -9210, -276, 21676, 15633, 6797, -23, 932, 4251, 8245, 11672, 8150, 5403, -998, -15243, -9511, -1163, 210, -6738, -14338, 1385, 3978, -126, -2872, 1541, 4702, 9117, -2924, -13284, -12373, -18770, -11173, -1908, -11635, -22750, -21972, -1416, 7687, 7772, 4789, 5405, 12938, 4693, 1538, -4093, -4820, -3341, 4619, 12886, 19649, 22214, 6127, 63, -13618, -24069, -23368, -18505, -13744, 2652, 13720, 20917, 10676, 15477, 9508, 1549, 11548, 2402, 4622, 3913, -20649, -23199, -14073, -1191, 945, -9751, -5222, -17225, -17644, -16752, -14473, -10338, -1887, -4131, -9172, -10515, -1552, -1372, -7702, -26797, -28307, -27395, -23701, -17221, -7844, -8969, -14661, -2299, 5567, -11835, -23167, -23625, -8692, 7238, 12367, 5021, 6940, 49, -12604, -19639, -14662, -19309, -24816]
5963b4816l613K769L395m293n385Q295J4433j1496R608J0664j6822o456M451O163
5949a3103N352M505J169N982O135m641j0837M854O255j3859n424O720l87k742
5935a0021O060N593j389j2300j7717M181J1500N323j201P827q899N503J0432k478
5921B414R702m15o298L323J5673k458o934j2687k235O089O442J0501J527n169
5907A9475n519k943j561j7543r09M665K677j910m259M704p116J934p387n840j432
5892b2964K258R614P261k948q949o069R675P226j0662o746J0223Q739j1380k957
5878a7679L893k903n130N493k570J2286L479J333J1220l948j7624o525p799J9975
5864f499R776o814L220O18M383M9n021k273r12L724J4290O56j1858J837k904p28
$$ y = [-24816, -28429, -25660, -22265, -26558, -31943, -23648, -9215, -20711, -11103, -439, -17261, -23717, -19266, -13103, -7751, -3246, -2077, 3905, 10040, 5399, -5438, -584, 5671, -8188, -13612, -6892, -7279, -10021, -3961, 1632, 243, -12057, -29774, -25593, -14093, -8770, -9971, -2144, -11043, -5540, 4892, 2414, 12116, 11701, 5403, 8726, 24399, 21941, 15007, 2320, 85, 6174, 12616, 23117, 24644, 19475, 13956, 11013, 9452, -8091, -9000, -4335, -1658, -3568, -7827, -3123, -10239, -8305, -15692, -21532, -22964, -20706, -11092, -3831, -6779, -15728, -21797, -12122, -4896, -15558, -22304, -12081, -3342, -14722, -17679, -13786, -16689, -21819, -16326, -18896, -6610, -3131, -1798, 9422, 5474, -12150, -18675, -26474, -6499, 3277, -3537, -317, 301, 4684, 4733, -288, -2561, -3473, 251, 14541, 15197, 3339, 5176, 2272, 1544]
5848A544M183J5200j735j3528M396K516l413q841l113N185l12K055r66N104m197
5833D078j2823M504J6577K003j1974O203r671L097j5660j793K955l151L625J333
5819a0697k1710j5911J0320L5653J2923q936l326q031J397K950r160Q320L145
5806c063L22P046M042P598k586k517j250j215j3970j0928l495Q574P78Q139n413
5791g938N787j659j0118J3526O908N525r830j0358p036J998J9487O887j720K437
5777A3896l309j235K219n460p062j5722N705J9873P916P137o595j3829p520O457
5763B471l124J350P21l87L585l878q484j115O320R309J1046O931k569j3434M568
5748A3310o898m665l473j0489P113J3528j576j0090L331j0284l746R783J301m545
$$ y = [1544, 5727, 20927, 19192, 5664, 10060, 12576, 9163, 322, -2791, 2394, 2082, 4137, 3171, 8275, 4078, -8745, -4241, 12336, 14339, 2365, 8568, -1103, 1994, -13666, -15459, -12504, -15655, -12030, -10697, -32407, -48318, -37998, -2345, 10578, 1642, -1684, -9715, -8318, -5368, -14528, -6208, -3063, -2741, 4305, 8347, 15945, 13359, 10842, 9592, 8377, -5593, -16521, -20016, -11442, -10664, -2525, -7938, -2151, -3810, -13928, -402, 6506, 12031, 2201, -8157, -15193, -13195, 6292, 13179, 11459, 13896, 10587, 9352, 11571, 6111, -951, -16673, -10968, 8905, 16821, 23958, 17363, 3534, -3986, 2471, -653, 697, 1418, 1031, 4616, 738, -7746, -8861, -2541, 6768, 17814, 24745, 22176, 8742, 13310, 6412, 1747, -1726, -12215, -5102, 8426, 6850, -3240, 91, -10193, -13939, -4156, -2855, -7400]
5734g400j736J4484n076O053K927K564j321l427K577M577k636K513J0633p974
5720A6758m631N069j0254L275m696M21q303l896J0952J6546r55k0393n971j1135
5706a7213O11p783P025Q945l141k050K486m560N721K831k355J1811r533j876J6896
5691G815l855j4657K014O013J6898j4583M19O02m345k453J664M460j1738j279
5677a3025Q511P307m888K245P77l700J967Q281J3823l767m433K3125N226j0226
5663C1223j5923K077j5045j7117p045R436J1824m342j1621n700j1365k937J0774
5650b5761J8296n103L800l367j853Q345O963m417Q532k335j4998j2824M22P180
5636a7120j531Q041j955j1875o383m5J7077J3051p385Q9j2043p522J7816J5842
$$ y = [-7400, -9136, 5348, 272, 6325, 9252, 11816, 10495, 7068, 9645, 14222, 11586, 14099, 24732, 16758, 12127, 17196, 6942, 10217, 5521, 5942, -2361, -6257, 4695, 21241, 20286, -107, -6078, -17213, -16602, -24385, -17360, -8415, -11556, -13606, -11120, -15680, -9959, -7128, -9483, 2328, -7205, -9081, 7815, 3960, -10697, -8683, -2670, 14228, -355, 64, 666, -3679, -6132, -4468, -8, -11746, -13025, -4514, 2793, -2095, 150, 927, -2773, -806, 7475, 21298, 17531, 13098, 36223, 41449, 31223, 15300, 17377, 2332, -14785, -21830, -12394, -570, -4912, -16533, -22233, -33598, -36535, -25761, -7465, -12568, -8768, -12135, -13988, -5643, 1320, -3097, 5435, 3100, -11898, -24722, -24300, -17120, -18651, -10610, -12565, -24440, -30823, -30868, -13791, -740, -8125, -8036, -20079, -27601, -9785, 6057]
5622F057N737r551p49p93J630J724o024p000K799J0685L147J0046o41r141j635
5607F291J0013j3466j8247n378J5768Q176j0632n941j501n054J3336J0034P207
5594A0606j1511j2112j1630O677j936r975L759J9277J0931O990r399n737P848
5581C788O454j447j707M508j2333m5J5818m308j8846j243J909K094j379M954N044
5566C261o082n724J236k668J2338p795l965q5k937J180P91J4849Q115m066N7n857
5550B648j274o11j6107k308p49j929J622K3880L177o707Q954J1532o041j4942
5536A145o801Q41m424r593O824J9193m902o155r635j2474Q076l97P024J0249L697
5521B668K642J4036O096j3304j1364j065l718j803P551k472j206p258j1703o151
$$ y = [6057, 11794, 2243, 1494, 701, 2331, 4055, -1969, -8969, -6170, 4515, 7662, 17708, 17067, 7926, 6291, 16304, 2838, -15409, -20787, -5019, 3157, -7475, -13416, -14917, -19971, -6635, 3399, 10606, -905, -13017, -24647, -17970, -19906, -29881, -26122, -6845, 4086, 11076, 1677, -4060, 3788, 10242, 8795, 7088, 11596, -737, -782, 15036, 10728, -8118, -9361, -7452, -5358, -6737, -1783, 3261, -2821, -8545, -7309, -9977, 2361, -5434, -9399, -9484, -12421, -11241, -10450, 4399, 12514, 8448, 8505, 2648, 1374, 763, -15344, -17652, -18401, -20330, -18708, 5172, 8349, 1642, 10596, 22128, 16087, 1145, -5656, -4815, -9239, -18832, -12008, 7185, 2283, -3872, -13507, -25981, -17905, -18302, -11278, -1029, 2668, 5310, 19346, 25442, 12138, 774, -291, -4009, -5812, 1739, -733, -1939, -9197, -20900, -27051]
5507b7051N554M869O498N939O576J811K497J6841o646m812Q590P760j1520l594
5493A3312k482j741P42J0971J2802l442j7813j1225j586J1256l562j529K891J0384
5479A8978j2100J84O153r136J314L872l38n040l191m110n790J5004L271k2821
5465a3750j8719O823K728N149q182j1137Q221J3J204J1501j1516J8975L383N232
5451g5k463K80N788L064p522p512M600j1649K590J7663M736k949j3781j4520L328
5436a8422o63l244k730O625M803J8972k626P079o117r403J7826M570j1886p849
5422c065M458Q274J585N33n282j0251o314L949o837n270J4945p989k2770N404
5408b8630O733K6641M914j1111j3022Q088J4386M921q139j0884K951J4168o573
$$ y = [-27051, -21497, -16628, -10130, -4191, 2385, 4196, 6693, 23534, 16888, 12076, 20666, 28426, 16906, 13312, 10830, 9089, 9831, 20802, 33604, 30162, 12349, 1124, -462, 10794, 7232, 5703, 8594, 18978, 6878, 7062, 13215, 4079, 5393, 9265, 8927, 3887, 696, -3414, -9204, 5800, 9071, -13750, -32469, -25646, -22918, -17769, -25951, -37088, -28867, -28854, -27650, -16149, -27665, -8690, -5307, -75, -2538, -2258, 3530, 6594, -928, -8440, -3840, -15489, -12899, 4764, 9500, 6551, -7230, -21750, -18422, -19085, -22329, -25059, -18434, -13631, 5341, 2715, 9794, 3677, -5726, 12100, 16670, 4784, -3065, 1393, 9667, 11252, 11785, 6503, -3748, -10062, -6113, -12950, -18220, -3275, -11264, -34034, -28630, -21897, 4744, 9658, -1453, -14475, -6387, 7999, 12920, 4781, -6103, -3152, 11016, 4443]
5395D443K827K0028m490r873q754J1281l425r803J673M372m096R039O217M328
5381B3767j0967r456j614j2046j1500P427Q710P07J5974O920p058j5799o344J0376
5367i03N331J213R839l425k307j117p683o365j4819q215J245P966J6286P500m002
5352E44N997n410L763K659m676M076q066j2601q109p442J534J0879J3203o666
5338a0315j2235Q693R374N446L991l761J2414j212k0317o988n958J1791J4683
5325E606M849j2869j908L071j93l338l646n47n134K273J398k168N055L933p239
5310a0857k013J5852P9r446l661K476N670m219m615o40O331j229O733Q321j640
5295G142k483k605l74j095K458j261N932q203j9783m921K2508J1437q240j617
$$ y = [4443, 7270, 27298, 22808, 12935, 4181, 15462, 12037, 2234, 3907, 8279, 4183, 13222, 19439, 23767, 12800, 3344, 1730, -10316, -21816, -14389, -5679, -4972, 11002, 17922, 10864, -4935, -11279, -903, 4428, 5641, 15480, 12055, 9748, 8631, 948, -5417, -20236, -28451, -27206, -19240, -2954, 4546, 544, 6541, 1131, 4894, 7553, 2877, 6953, -1113, -13714, -21823, -29265, -27731, -16852, -3649, -10315, -22550, -13857, -4483, 963, 4954, 1193, 13607, 12395, -7922, -14910, -20868, -9077, 5606, 10455, -2414, -4322, -1251, -1444, -4782, -8428, -8975, -14109, -11836, -10438, -12606, -7551, -3618, -10857, -12870, 2982, 3061, -6385, -10046, -7570, -1900, -6119, -10734, -11374, -5043, -6272, 461, 8782, 7142, 4659, 2054, 1680, 585, 3043, 1782, 7714, -489, -20272, -25193, -2685, 8752, 512, -1105]
5281a105j139K002k224j0203K639m80l359O509P036k189J1081k167o542L496J2340
5266A5695j030j1887k55J0961J3561L800k0718l463k308R00j516R24L728J996
5252A0388j4297j476P887o64n315Q588N779j8820J6726K1774n663p905k817j4497
5238c12p563M96M573m274m917N211j250O860j2611K821R077j8648n973J5479P328
5223c703J5143L444j5513L710R29j0245Q039M91K123N8j7619Q45m59L233J1087
5208A563l00p438j4428l82j687l750J26j0767l363k063O158J9659L654l947J2132
5193d833o911L8J2264k691p906J5263J5060j7752j1049K562o489p229j2342N485
5179b6530j435q47K0390J4476j7422j2985J5648M050L859j377o132k974J703K246
$$ y = [-1105, -2244, -242, -2466, -12669, -10030, -10510, -13869, -7360, -324, -2513, 8568, 6401, -141, 3355, 15695, 14665, 2778, 2523, 13484, 27045, 30845, 10127, 6664, 4356, 5256, 3740, 4664, 8392, 10388, -3909, -5385, 2502, 1838, -3477, 5111, 10890, -7930, 8796, 30570, 24907, 17002, 14185, -312, -7875, -7379, -2806, -7080, -11997, -6786, -8036, -1176, -13787, -10966, -1889, -20537, -26510, -11031, -3703, 11440, 14884, -629, 3081, 4010, -6235, 1804, 2295, 4418, 4476, -13143, -12298, -12757, -9524, 1563, 1263, -6175, -20603, -20985, -22672, -26422, -26296, -37063, -40426, -42489, -36331, -16672, -13018, -16965, -4833, -11744, -11706, 558, -2133, -10039, 5224, 20284, 2532, -8517, -5955, -12444, -19673, -32015, -26530, -27965, -28812, -8422, 6054, -11368, -24353, -8705, -4655, -796, -2173, -8305, -11279, -9576, -7330]
5165g330J1396n816M058j683l608J021q646q630R660J638j759P340M912J008M862
5150H423p918j1134l499J0025J1870j21L398N939O054j7667o116l309L537j1345
5136a1863o830K837K2619m229k984m849P48Q345j8655O969J2475O064p833O834
5122I648M596q98p664j5665k397o614J5154L737R342K787j815n905M6L989n838
5107B503N746J3063q045j1613m972j0750n185Q459P871q788K728k612q23R032
5093c386K235p5N770N4p759k960K051m050O387l683p847n972J3787P917l724J521
5077B66N628J4573O243p147o287j6017k0852K536R100J102K014p572N49M54P811
5062g599R235k0832N7J3985N651j8123j1515J1970P875J5103O341n683l37r443
$$ y = [-7330, 4066, -1750, 2308, 625, -2983, -1962, -10608, -19238, -9578, -7940, -9699, -2359, 2553, 3561, 8423, 505, -10629, -14128, -4103, 7767, 7646, 11044, 16983, 23037, 5370, -746, -4055, -518, -11863, -18693, -15856, 6763, 2534, -450, -5299, -4551, 3794, -14861, -7892, 4583, 10647, 2814, 9648, 14244, 13346, 5682, -9983, -12380, -18994, -3840, -103, 9239, 12026, 10211, 4306, 4352, 8341, 2503, 8249, 21312, 13267, 1654, -3318, -14068, -19253, -10794, -2923, -11711, -8983, -11595, -12418, -3386, -1151, -1226, 4544, 4598, -3161, -6121, -4070, -8120, -1733, -5416, -13263, -19235, -5448, 2469, -1255, 266, 5894, 20467, 26710, 19563, 13276, -2741, -23593, -21057, -11957, -10855, -8841, -16413, -15864, -15410, -7599, 1636, -19196, -19139, -5154, 497, -17626, -29141, -17171, -9296, 5807, 12148, 6465, 6128, -3315]
5048c315j7351R18J0977L941r062L984l21L683K405Q082j0301P223k23o625j786
5033g771q595L178K899K423M658k417l919J607J7549Q414K257O588o217j5388
5019E266L618r8n410K494j0081j2524q087p25J2631J2032J885p613m534K412n445
5004a4179j2119Q48N477Q919P936p688p492L548p67k518Q034J3508m808o620M15
4989g506m233J362J8279J6251O416o788k534l014q125k226Q8j3053m044K176k793
4974i744L507K592j084j5357q399p721J654J1681J4057K058l589J659J1142q314
4960e858j2910P34K190J0900J3931L895N580j4379l90M251l733j4180m562p912
4946b2443J4891J7818N44R07m53r13j772j5852N289R893n834j034p095j3737O775
$$ y = [-3315, -20666, -19748, -8771, -4830, -13892, -9908, -10229, -6546, -4141, 3941, -6360, 863, 640, -5985, -7771, -16366, -13188, -10289, -7866, -3208, -5625, -9544, -7937, 9612, 18026, 20283, 26871, 20654, 5266, 8884, 8786, 3376, 5870, -4211, -16735, -24822, -25547, -12916, -884, 1001, -6612, -11146, -8734, -14179, -26298, -25450, -19973, -11054, -3118, -10806, -18298, -14750, -15517, -18035, -10001, 3507, -1301, -7921, -7506, -11739, -10377, 7902, 24153, 30569, 23781, 21247, 18233, 10108, 7882, 7970, -5083, -9127, -6951, -9744, -6237, -3645, -4729, -20086, -28485, -36206, -34552, -22871, -8814, -6756, -10345, -8686, 2456, -5858, -18768, -18034, -15844, -4944, 8987, 12882, 18462, 4083, 3693, 7944, 4211, -9969, -14531, -22443, -7552, 10266, 10810, 11717, 11264, 10351, 8579, -7273, -1984, 7909, 2075, 1041, -6054, -19791, -13016]
4931a3016J1715P972J1387l620k720k696r606j5372l829K528j294j162P035J3515
4917H37m7o811M194M765J86J956j2749j1881R004k868o24J2314J866j0262j0249
4902b0369M31J0441K627Q52J7857K1359m947l770m71j786o446r594j4862n955
4888a4633k038O840M256L612Q744n451O170j215q756m548J2513j006K701R735
4874A6924R55j0811p794q480J881K335j3280l696J1491J0131J3263j382j0176
4861A361j4217J398O259n98J0792k267M853J303J434r92R863l238l208J365j2466
4846A642P455J0022K127j2314o734L712L000J0772L583m282n455p913k3487j4423
4832c2295k9J5539K4978l270L500j0977Q779K992k948J1286J258p831j3486Q695
$$ y = [-13016, -1301, 6671, 18058, 14438, 11718, 9022, -584, -15956, -19785, -17257, -18551, -19713, -12678, 837, 790, -6021, -1827, 2938, 3124, 5080, -7669, -19550, -10546, -13414, -14038, -1724, 142, -10120, -20369, -19938, -9497, -6870, -6018, 11839, 33198, 28251, 24481, 24010, 22224, 15778, 6184, -8678, -14633, -16671, -9831, -5575, -1963, 6781, 1330, 7500, 6285, -2471, -7019, 5494, 4488, 7189, 16924, 17879, 7068, -726, -9206, -7325, -4990, -18270, -21966, -10475, -344, 12919, 11537, 1361, -12856, -11458, -5199, -5797, 4995, 2728, 7581, 8884, 10318, 9326, 19189, 15951, 12743, 14108, 1642, 9097, 19119, 21246, 8932, 2198, 5910, 8910, 19682, 23265, 18983, 13528, 5615, -17872, -32295, -32324, -16785, 8193, 4923, 8423, -2554, 6225, 9217, 6269, 17555, 18813, 10982, -2504, 6191]
4818F191n422J30J881l360m98K766J618L222p784Q712M645j0261M747k496L018
4803G109J433o9l642K481n971K403p902m009L904O94n040j7690k370P519P550
4788a3600q36r105j0800J0593K1572L655j594R672Q570M440O129j3115r797O326
4774A2110p282n12M482r235o210N202M775k402n902J2353J8118O03P497n898j2738
4759A4961o129j5037j0970K561J0864M506l313L399K904k92L310M446P970J375
4745B0555l554r835K167q151j0467o079Q295j42j1718J449L808o555K281J5728
4731b218P603N595k414Q780r963j951p143o797O257k097P45m615l058J3088M395
4716F207O930N127j5546l07l368N411M813K0179N836j2506j7160j1075q971K54
$$ y = [6191, 769, 899, 2780, -580, -1078, 1688, 3306, 6528, -1256, 7456, 12101, 1840, 6587, 4091, 7109, 8542, 8473, 4831, 7312, 1341, 3744, -4158, -8167, -4263, -3569, -8609, -26299, -28669, -21150, -13600, -14436, -23541, -34341, -23748, -2176, 1479, -115, 9557, 18127, 22567, 28696, 15581, 5784, 12110, 4828, 4316, 8798, -437, -6647, -1445, 3330, 928, -4974, 7379, 25497, 26100, 33597, 27699, 14961, 8832, -6205, -17175, -14614, -3750, 756, -2557, 842, 3746, 3454, 6764, 11210, 19180, 20555, 17001, 7166, 9333, 1182, -9285, -15364, -7069, -7211, -18929, -17480, -13672, -20227, -17946, -2218, 5385, 10980, 8566, 17346, 7383, 5432, -1711, -8508, -2251, -4348, -3603, -8218, -11276, 1812, 6207, 13137, 18264, 2718, 2411, -957, 4454, 9267, 29446, 35282, 22776, 5616, -5459, -14430, -14176]
4702a4176j2189M236J2792K2394l715O20m614j9537j3062K140O869L669J1894
4689b679J0341o443k572L045R310l035K811q73k185j3887l904L045j575R601J0411
4674A1411l248m982M297J7885J4438q016j6239j5925m723N553L085J809Q581J500
4660A5426r883m714K083M362J985J802j1808j4135m026L984l45q5J4809j2773
4646a3318n897J3399J8320n292k149n075p085k604p33k909J161J4983J343j025
4632C119J912l183K208o615r082M018J7953R785o877k200K223j0279J857K38r857
4617d780q432j7401P809N345R991K0390P725P233L294m750q945P859J50j5297
4603A0191j4321k638O586N709N61J622p786j403J0518Q721q420j4499j432K869
$$ y = [-14176, -26365, -22129, -9337, 13057, 9342, 9962, 5348, -14189, -27251, -25111, -18242, -14573, -2679, 7662, 1219, -1353, 1692, 11002, 7967, 10778, 9905, 7720, -6167, -10071, -7026, -8601, 1000, 11411, 8163, 3181, 7478, 25363, 39801, 31785, 15546, -379, -5102, 451, 3536, 5345, 13926, 15426, 5543, 829, 2912, 7274, 9259, 11061, -747, -14882, -18908, -14924, -15269, -15354, -545, -13318, -19215, -5816, 12504, 7212, 5063, -12, -7097, -9701, -10434, -13343, -12182, 2801, 4144, 3119, 5031, 1848, 4056, -2559, -11641, -7623, 10330, 20115, 13238, 11038, 13261, 2982, 4839, 5077, -4780, -13212, -30613, -22804, -17459, -7468, 12922, 20647, 27880, 31174, 26424, 17479, 25338, 25488, 10191, -4130, -6768, -182, 5527, 6088, 7710, -76, -1479, 9039, 17760, 9340, -5159, -6591, -3722]
4589c722K23q184k682j0101M125J5939L157M762O279N658j7154p157l58q43l46
4574a0404N207N162J426N844L442j0106j312L158P418J6385L357l492j8438k3194
4560a5547j2375K594L958J2373J1764J0100q56m487P08l402j5776q957N376K2651
4546H124J249j3048k040L209r378k788n345Q962J6992k036q787l294R002N182
4532F004j2747q125q790q502O690N367m837Q413N124n848M291J2374N565r323
4518d344r356j0864N43J2253K358L411J3169N86n437L990J6297n326n949k109
4504I222J856q258K889k409Q080q008m282J2248K624j012r517N247K005j0881
4490a96n948j794R926K683j2765q490l670J5963r206N962P355M49L794O46j1381
$$ y = [-3722, -3499, -11683, -14365, -24466, -20341, -4402, -1245, 3517, 9796, 15454, -1700, -8857, -9215, -10058, -10404, -5197, -35, 1391, 7235, 10677, 571, -741, 2417, 9835, 26220, 29577, 26085, 7647, -15547, -27922, -25328, -21370, -8997, 2767, 12867, 12011, 7524, 8232, 4830, -10946, -19903, -14527, 8124, 9373, -3675, -5715, -2506, -11884, -14672, -20017, -11055, 5937, 3901, -4886, -8180, 822, 6004, -6743, -14868, -23658, -32160, -25470, -20103, -24940, -16527, -11403, -17251, -12960, -586, 4979, -4344, -13700, -24564, -24021, -11768, -9410, -5999, 7170, 7756, 2319, 6309, 22606, 17280, 11331, 9222, 11078, 2820, 5709, 3300, 11380, 3372, -910, 11338, 13962, 12950, 3433, 8680, 10685, -196, -6144, -7938, 1988, 4671, -8094, -16584, -20254, -4291, -13497, -7535, -180, 269, 4063, 4709, -6672]
4475f672o582K695O259N963m600P528N589k293K484j53Q040R673P208k52j0255
4460B4632j3626k740j531N60L083n190j09M378j2461K666J0265Q091q383k3562
4446a3927P667O03k164j1945J3948J3631o020o781j3479n761N209M962p768l305
4432b5130Q980P108J3651K320r1p379J0695n824J075J92J750R239J985r510j5140
4417f079J983R742j2727k333k546N354R521k152N764m934q178R598K521L057j0250
4402a659o469j3350R794J5703R071r668j2191k189l618J0871J7350M733j6095
4389B283j8770P201P289p734j861M694O69J3232O504j357q735j766l800p134r247
4374a8532L72O292N884J029n876J0984N804J3009J842j4910j2521K313p88L351
$$ y = [-6672, -13254, -10559, -4300, 1663, -2937, 4591, 10180, 7887, 10371, 10218, 18258, 27931, 35139, 34887, 24632, 11006, 8266, 6735, 7295, 10378, 5188, 5079, 9457, -3004, -338, 9927, 18018, 9635, -13927, -6260, -5657, -7821, -19766, -5818, 7813, 1793, -4988, -18467, -24228, -19019, -14057, -21825, -25130, -16150, -9042, 4609, 6929, 6838, -541, 10154, 4330, 5405, 5597, 7347, 16586, 18571, 9061, -6079, -4096, 5646, -7081, -9414, -11960, -6606, 2915, 763, 6527, 1593, -6585, 3013, 5534, 8591, -1659, -8128, -21478, -11684, 4019, 13090, 3422, -8769, -10958, -14576, -3705, 13645, 18378, 2283, -16487, -9286, -1997, -9731, -11592, -6898, -6229, 7003, 13507, 12150, 3415, 1649, -2151, -9285, -18532, -18160, -11868, -5984, -4955, -10831, 153, 5957, 18966, 20808, 5898, -6623, -4310, -5098, -1747]
4360a747r012k1930p737P570M688J3206J6459L76N36M871j014l833l248m60J314
4345C9P28q885n032l159K816K170r688K12J6763p677p843R06j568N382K50O520
4329h066N904O010J1466r727j1556n680j1008J4632J7238M13j1369j3077r608
4316b4428l136j665Q102J1722m949j989L481Q861N428L951j7037o885n374o739
4302c0657P906N558M672J0682K864j5954n703Q809P468l823P495q084n582J3641
4288g08L060M985n380J177N955n371j4611K26K664Q418O882l47l249j1465k083
4273i847p72j432J0479J3221M432m534j7710J2076J2891q938n73K611r156r84
4259A764N597l719m06L633r278m198K366J4376o347M58J403l792J150K061Q751
$$ y = [-1747, -10759, -32689, -40426, -32856, -28168, -14962, 1497, 1873, 2409, 7280, 6266, 2433, -815, -1275, 39, 767, -8118, -13150, -16309, -13493, -11323, -21011, -20799, -4036, -11713, -19556, -18650, -20218, -14836, -14586, -8066, -2162, 3848, 15314, 5587, -5969, -11649, -22657, -8025, 9213, 9626, -1743, -14820, -24428, -27564, -29229, -21127, -9405, -14354, -16343, -12862, -4001, 1427, 5378, -11659, -18544, -23918, -30657, -22751, -17193, -12521, -1839, 1025, -14929, -20632, -11823, -4355, -8178, -683, -8767, -14349, -708, 2352, 7337, 1957, 3134, 9089, 3718, -10893, -10667, -8003, 415, 7297, 6950, 3701, -7764, -9847, -10619, -12051, -1572, 11649, 16081, 11547, -6163, 5913, 18804, 9866, 9293, 11904, 2748, 1764, 7361, 3642, 3236, 6869, -2409, -6607, -4241, 10135, 3788, 4246, 5649, 1857, 3007, 5068, 13819]
4244A3819k921o717m574P236j2144j3383k785K2867J9133q816o605K600p542j2015
4230a1847o630J0802O601j441J6707N939j2727j1935L397O160l97k6294j2424
4217c4089J4676r159J7780J7396M607j9654n068N684o272l588M756J2380J5985
4204A5434J0649l349m434k753R49m164m023Q603j732j416j766k75K642l894j3932
4189c461JM647m485p900r194M356J6148Q47j1671n50R960J1266p380k36j277J0473
4173A1544n638M759K841O417R022n977K63M964m462r01L885K737j1716J132K131
4158B1001q843J172L374q967o294p017Q372J3861n838k070k783j416j4463n621
4144a5532J113k510r555J4800J4459K439l919L799L788O615k523q902n961p908
$$ y = [13819, 10898, 4181, -393, 6843, -5301, -18684, -21469, 1398, 20531, 11715, 5110, 7710, 168, -11847, -18477, -7675, -1074, -2515, 14192, 20131, 7404, -4531, -1134, 5026, 4629, -21665, -34089, -19413, -28572, -10792, 6604, 11211, -8443, -13511, -7827, -14099, -17687, -12931, -551, 15434, 26083, 22734, 18300, 15547, 16496, 12332, 8309, 16912, 15180, 13764, 11998, 11723, 14365, 10471, -3461, -3460, 1187, -3298, -11198, -20392, -16036, 112, 959, -10712, -11262, -1302, 9964, 2584, 2348, 1071, 11544, 5906, 10665, 13506, 19923, 28945, 22968, 23231, 28195, 23733, 22832, 26717, 29454, 17738, 18870, 21001, 12158, 13330, 16704, 7737, 1443, -5574, 2798, 16659, 10821, 8751, 5968, 4552, -9911, -15532, -14419, -16929, -26484, -11684, 2775, 5214, 1295, 5094, 8882, 15497, 12974, 4072, -1889, -9797]
4130i797j1299q571R30j006K3875R67n837M85L033J2321j590m376R497m11p851
4115C70K920J574n720m280j843K598K288p350J736N433l03Q35j1135k83M492Q719
4099E1M353p104m798L746j399m779m01o916Q040M881M7L324N521O052L76n993
4083E001j0745k884k5246K659J5813K1222P683j1194p159N544o429j0452l339
4070a9526J2493R986R02m484l653L611k744l629k0183p054R217L883j004L276
4056a8909N584Q865N665M92l225K1718O012k3657j1842k600P196j492Q60Q997
4042C664O549o798o100j215r50M729L538m012m398K56k293j2645j4241K532J5688
4027a5696J3389j169M059m495M460n018M280J1153q628q955J1361N095M36j3903
$$ y = [-9797, -21096, -29667, -28737, -29743, -5868, -4901, -10738, -10253, -7220, 5101, 3511, -865, 8632, 8221, 370, 3290, 4864, -856, -5136, -6979, -4381, -2093, -9443, -7707, -2274, -2577, -1742, -12877, -13160, -8668, 51, 4404, -2700, -7498, -3752, -5151, -9930, -10331, -17247, -9207, -4326, -4279, -955, 4566, 10618, 10994, 5001, -5744, -8628, -33874, -31215, -15402, 5820, 13503, 2309, -4850, 694, -5735, -16187, -19526, -7033, 2953, 3855, -629, -4282, -671, -3415, -7044, -27227, -34281, -25064, -21181, -22185, -18909, -13325, -4460, 1205, 1697, -1528, 20190, 26202, 2545, -9297, -11897, -4701, -6193, -5333, 3664, 10213, 3415, -2685, -3900, -4850, -121, 3417, -595, -4993, -4737, -7030, -19675, -33916, -31384, -15696, -2307, -3476, 583, -3912, 548, -4470, -190, 10963, 2335, -6620, 4741, 9836, 10272, -3631]
4013c631q386J039K762M48l883R003Q113K585K01N95j1373j6225J438R715M471
3998c128K055J7383J9268R309j8697j5992k550n832j537O559P410L602q171m151
3984E528j1883j5008J3696J0090n02j2597o082n339P436J0747k50j0162N097J8857
3970I628N328l016q257r422L264L020P503j3742n092j477J221j551q854J1096
3956a0351M591R772l835n594k636m77J8226M008j8052J830o42Q506J418j0391
3942c627L039q04q00L374n370N595K644j0942j0285J166J3307L133m662M805O897
3927G470j347R32p110n965L473M14L100l079j697q721n716J7512M791Q02l034
3912A825m112l984N647P844j0483N645O609l42m791J693J964j657r231N744L029
$$ y = [-3631, -12017, -10978, -8216, -7768, -11651, -2648, 5465, 8050, 8251, 8846, -2527, -18752, -17314, -7599, -3128, -1073, 16310, 35578, 44887, 26190, 10198, 7648, 1816, 279, 6838, 14248, 17850, 9679, 5528, -6355, -21363, -7667, 2423, 1921, -10676, -16758, -22097, -14661, -3914, -4164, -14326, -9229, 9628, 14956, 11940, 3683, -5739, -2475, 545, 8048, -5694, -10786, -12263, -11042, -12593, -21447, -10351, -5760, 4012, 177, -5417, -8053, -8530, 9696, 13704, -4348, -2518, -3160, 5346, 6764, -3627, -588, -1392, -2192, 1182, -4188, 1407, 4051, -6891, -17176, -16010, -2703, 430, -4232, 573, 7470, 6123, 7055, -55, -6020, -2547, -2133, 967, -2112, -3809, -12530, -18246, -734, 4057, 4859, 1825, -2287, -6271, -624, 7220, -3263, 2382, 8991, 8649, 3858, 5551, 7515, 5858, -3373, 2371, 5400]
3897E400l029n263M106R359J1874o394l879r748J714R479K62m149n7k65r819n389
3881e798J3521K994m927n968q682l16N460J6429j1942q095k859J1357O427q648
3867a047n293J2778r041L65N802m946J740J0136r714P534o065J780p434n484l579
3852a2468k69P205M944j4290r823J8788K6537m988p627J137K240R1j0769j0739
3838a0031j381k722m747k646M202Q115Q695J9816N227p744j2796q818J346K622
3824h62J4252Q209R11j3988P962m408j8400m082O004N911K455J3107M931j552
3810B0450n118j4181o61M631J7980O154j4420j8508l518P36N711n981j2276r432
3796b8433N670K576L344P950J541K620K4707j0299j5622j4778O983L130J335J1599
$$ y = [5400, 2371, -2892, 1214, 10573, 22447, 16053, 12174, 2426, 4140, 13619, 13881, 9732, 9675, 9410, -409, -5798, 7723, 10717, 5790, -178, -8860, -9176, -3716, 12713, 771, -7324, -10183, 1174, 7601, -1047, -6340, 6438, -2603, -2238, 3564, -1382, 358, 10494, 780, 8314, 2249, 4029, -3405, -8889, -12468, -12737, -5532, -588, -14878, -24701, -5913, 20624, 15636, 8009, 9146, 11386, 11477, 708, -10031, -11412, -14134, -18881, -21527, -17325, -9210, -515, 19301, 24528, 16784, 3988, -4830, -3484, -862, 13390, 21599, 22510, 8522, 16484, 12076, -6324, -10406, -4402, 1509, 3964, 17071, 22002, 20450, 15332, 1151, 490, 5121, 23101, 29255, 14835, -3673, -7191, -6455, -744, -6725, -19001, -28433, -22763, -20187, -16843, -8893, -7352, -4732, 19975, 9676, -5946, -20724, -13741, -10611, -9276, 2323]
3782B323o259j4593j4691N542j543P517Q649o73R267R610L239j1292o654K767
3768f791j741K753K447M006j3234j811R980K535j0321L814J0210J184j1171j2909
3754b1049K749K4440P549m330j1871l599Q04N406O811R946n65J593J1104j773
3740B7215q666k0050j6473N150J9034N167p079j1878n609M111N24J1634N422p233
3726A269j5735O743P451k288m796Q615L373j00o778j0674k196K795r073m135J3884
3711a1645l940j262P826N272q084K634O764J4991m67o197j0071p45j1634R54J4603
3696a001J355o387m462o687j333L966o677J2835K512M843Q017K490m515o405N967
3681D518n665j108N03n369q190Q956J0642m362K092j232j4604j1028J1140J4620
$$ y = [2323, -3936, -18529, -33220, -27678, -29221, -21704, -13055, -13728, -4461, 5149, 8388, -2904, -9558, -6791, -8532, -5779, -3332, 674, -12560, -14371, -4391, -1856, -12177, -8363, 1847, 3031, -8140, -21049, -18300, 6140, 13689, 9359, -2512, -6111, -5307, 99, 6910, 16856, 16291, 17884, 28988, 27215, 18549, -1501, -17974, -12824, 6210, 11377, 4298, -7580, -13189, -9078, -8554, 3080, 8502, 1269, -14466, -7723, -272, -2560, -7356, 1259, 4632, 4532, -2246, -12920, -15116, -12321, -21394, -25529, -11645, -15585, -16847, -9021, -3749, -11833, -9199, -2435, 12556, 12089, 5892, -4179, -4924, -16558, -15604, -1001, 354, -6033, -10495, -17182, -18515, -14549, -21226, -8391, -5879, -1036, 6981, 9471, 4956, -1449, 4518, -1147, -2255, -1752, -7121, -15311, -6355, 4287, -75, 2017, 785, -13819, -24847, -13707, 913]
3667I13q187j276j291j1967r730N588M478J3189J037m863j161n745O734P49R39
3652a0593o513R408M552M703O777l053p077j595m500k032J7767J1434J3733M088
3638C7099j0825j3305j4088N266K631M542o024j612l79N429n692j0322Q599J0728
3624A2047L972j512N673R763l523q072j836J761O622o72j0861P737L070j2093
3610A2076j5394K752L418J963n850M447K769L132n264J29n018m581j1898K414
3596a4905o080J49n225J268Q722Q237j243l435n497m007J1266N858m95J2244J2081
3581A8938k618o723j0239o09M001N664J2170N334n690q166l109N405J2296j4690
3567A1964j9065r631J1495k833L908k92Q417J6388P487j1778j3089J885K568j5969
$$ y = [913, -7274, -8550, -9841, -21808, -31538, -25950, -21472, -8283, -7246, -12109, -13270, -19015, -12281, -11532, -10593, -17106, -7698, -3146, 1557, 8334, 5281, -1796, -3391, -7891, -9923, 7844, 19278, 33011, 37099, 26274, 12969, -1119, 4147, 6778, 11320, 5296, 3684, 3305, 8734, 3042, -7280, 1319, 12047, 16019, 14507, 20180, 29943, 26420, 18348, 16512, 18273, 24895, 24223, 13362, 21099, 24169, 12076, -3318, -566, 2852, 4815, -1035, 3412, 6181, 9313, 4049, 4178, -840, -5421, -17319, -14905, -20985, -20836, -26061, -24793, -16071, -7834, -9077, -12512, -18009, -22016, -10750, -4892, -5387, 6857, 18938, 16320, 9597, -642, -1251, 2750, 8414, 20584, 25918, 20228, 12062, 8953, 14358, 26654, 11964, -7101, -16732, -5237, -8070, -4162, -4454, 3963, 20351, 27838, 16060, 2971, 4856, 7424, -8545]
3553h545J84o028k185r146n255J2140N429j1086Q192Q935J1569M123M291j1314
3539A304q857L116J2756R398N54m568j3895j2401k434J2707j2905m154K0492O785
3525G898J326N900j0192M270J4028q614n138J1720j773r674J2828o308j6132j5128
3511a4989R108J9588o064m585O81o013k382J143O048o734R359l427j4586k567
3497a5420R838J2655J0734J803k519j0812o893m604j0630n977Q327J2606J3321
3484A2429J3313j1995j1210j3252j131J164L940Q496M895j943n656K799q312o055
3470a2518R159M510j7042j1308m723K963L811J2176J5467L215j1043J0391J1550
3457A6608p245n804j5137o23p28Q40J4647R926N75n990j6136P358J2701m05r117
$$ y = [-8545, -8361, -14389, -16574, -25720, -30975, -18835, -13406, -24492, -16300, -7365, 4204, 8327, 12618, 1304, -7553, -4437, 8319, 17717, 18271, 13703, -192, -12593, -15027, -2320, -15225, -19379, 1113, 7898, 9224, 15124, 4932, 9202, 23230, 14616, 9478, 21198, 19425, 9751, 22579, 16271, 139, -14989, -5881, 13707, 7643, 3058, 3739, -2274, -4656, -3513, 2535, -4199, 5160, 1733, -12853, -15420, -5582, 7073, 17807, 19610, 17091, 6279, -614, -5218, -15848, -21825, -13498, -892, 12429, 25742, 13747, 2537, -10715, -11846, -10682, -6742, 1754, 6649, 4706, -950, 1849, -6463, -12518, -3359, 1151, -15891, -27199, -31922, -28959, -25148, -12972, 2495, 5710, -5333, 5058, 16608, 9363, 3559, -11578, -12201, -12929, -12089, 2558, 12484, 13059, 7069, -9067, -1709, 10992, 10587, 1470]
3442A470l293n734J3015J6025q093p618J5161k998j658p307j0247J046n425j8887
3428b4543j4038K4153J0138J089J2559K00K679m717k676n836j1544m665l267J2771
3414g697M766n794M234Q138N685j6425j7604m537M8l985l817P927J6168Q595J1758
3399G460k979J4126R087N909j666J0025m899j7638N986j583q033j6086j688J309
3385f70l37M34j1251j0093Q17R516K925k029j635m131l726N23M950K628N932M132
3369b015L317n085j0847K508M428k49J206M115J0693m464K899r756J711l568k835
3354g942o074j841J4854J736o909J212R304j0744K58J0266K035K306m100Q560
3340A2921r496j5648o478J146p653m800J2332J4249R135N248mj7528p724P358
$$ y = [1470, -1823, -7557, 5458, 21483, 13390, 5772, 20933, 17935, 16277, 8970, -1277, -231, -5656, -24543, -38581, -14428, -4290, -3201, 9358, 9558, 12237, 7520, 4844, -992, -12536, -17201, -20468, -7697, -2931, -8725, -4491, 3647, 9332, -7093, -24697, -29234, -29186, -33171, -36988, -29061, -12893, -4298, 7460, 4481, 18607, 27694, 33603, 31937, 41962, 37063, 19425, 25411, 23828, 15795, -291, -1979, -670, -1007, -573, -11824, -21917, -21100, -11584, -8659, -10688, -12323, -16454, -20180, -19657, -14707, -12079, -6147, -2015, 1302, -3783, -14630, -12122, -7694, -7943, -6737, -2622, 8071, 3607, 6506, -3250, -1539, -5107, -7942, -14016, -15857, -1003, 733, -6176, -4964, 4340, -6404, -6146, 4120, 6155, 8461, 4361, 12921, 3425, -12223, -18701, -17555, -25208, -30008, -17676, -3427, 5708, 10956, 10952, -6576, -14300, -6942]
3326f942J021J5206Q606o388m885P814l358k996j915r758J3486J0849l675j743
3312A5322l282p968J3046j35n747k095L70P312l968K536l595j2478p621j457J239
3297h521L881m034L209J1177Q997n80n890L40k568M51m170j7646J0246J1602P191
3282A3685N230J420r967j1910J6141P165m685n569j1655J586M741o022Q76J7432
3268A8468J8585j7955r901j583j6659J076L529n004M799Q96j4366p485J6689K4894
3254A5983o973j2845q715n154k788J038N681o50M388K212l330n333j5425K813
3240b9098R618l195O699R845J4424q173j2804j4665p345R274R809M23L692M20
3226a1076j03l249l095L668Q524J1491J3037M613j1421k05J760J336K672j0827
$$ y = [-6942, -5921, 9285, 17891, 11503, 6618, 14432, 11074, 8078, 6163, -3595, 9891, 20740, 17065, 15322, 12040, 4072, 17118, 16983, 11236, 9141, 9511, 16823, 12855, 15391, 11796, -682, -8303, -9760, -8521, -4640, -8674, -5465, 5712, 14709, 14129, 8239, 8579, 6011, 6462, 2292, -15354, -5108, 6494, 13685, 18915, 20335, 10368, -1542, 14599, 21764, 17079, 11510, -145, 1441, 6182, 160, 1036, 18468, 37053, 19098, 9197, 7614, -9045, -7969, -4440, -9444, -4645, -3749, -18115, -25600, -8911, 15983, 9010, -3835, -12550, -17704, -20492, -19454, -13773, -14423, -10035, -7823, -11153, -16486, -31911, -29098, -19480, -22675, -15976, -6131, 8293, 120, -12684, -27349, -34694, -25420, -15611, -15188, -11496, -11076, -11179, -14428, -17523, -13855, -5331, 6160, 19197, 23810, 12389, 12184, 13944, 15280, 17952, 7125]
3212G125l462j654n978J0824j3201n601O66N241M526k804R034k11l756Q668K465
3197A1882j3404p218n750j3312P579K0055R066O8l044o276m01L117n881k0053
3183b3572j0942R861J6135P745K146J348M900j515N12j045n841j5482j0974N960
3169b0764J4588J7440M497O132K942j4233r520o630k513M607J6604P32j2232q280
3155f630k675J1713M236m64N375J590Q063L698j1410N396M791j4418r569o949
3141g253O297r289l215L36p075Q711N346j212Q011n351k210N763L263J281R0q188
3125d695j6663o101J6240J1841k803l945j1735k235J1120P55p674P567N788J4641
3111A2101K0215n257j1910j6105p481J2342J890n92m629o593k959K816O234m535
$$ y = [7125, 3663, 2009, -3969, 6855, -6346, -11947, -11281, -6040, -1514, -4318, 4716, 4505, 749, 9417, 11882, -1522, -8740, -14490, -27802, -20223, -168, 8898, 8966, 5922, -354, -755, 2362, -3519, -23572, -34514, -24653, -8518, -773, 1373, 2721, 7621, 6106, 6618, 5573, -268, -15750, -26724, -20764, -6176, 11264, 15761, 21893, 24835, 10602, 1082, -5548, -8061, -3454, 13150, 13882, 1650, -6630, -9305, 2408, 6644, 6180, 11555, 13145, 21208, 24906, 13496, 18892, 23683, 9265, -304, -7253, -956, -10245, -13460, -13124, -20199, -11488, -6142, -7354, 657, -4694, -6904, -1141, 2122, 3403, 3493, -4695, -21358, -27459, -11219, 622, -2181, -6126, -17861, -20096, -8976, -8221, -15895, -8328, -2540, 12101, 32316, 27059, 15149, -956, -8437, 3905, 5795, 5203, 574, -6019, -8978, -6162, 72, -4463]
3097d463K784R748K28j8086J73j2273m843J371K988J3329l498K707N089K102J1838
3082I194k339n792m502o54K6248o894n52l673j2524o518Q889O971n160j2773p556
3067a7635J556K495K016R625K256p381K809l556j0986K441J0521m774o091O195
3053a0509J3701P135o147k79n706Q912J0613P629N252J0927k614j7900k5129r117
3039a3232M437j956j1629K917P005M532l027r914L350R901K366J505p853q252
3025a9850m489K742K2981N705M323j077j6315m737p194m062J3321J2523Q939m506
3011H304q282P422o165o336M145J2209K459m122j7899j0808L661J625N803K977
2997e007q327l562O870M419q87j0747K243j515K992J0905M029m24j807M77l375
$$ y = [-4463, -1679, 8069, 8297, -9789, -9616, -21889, -26732, -25361, -22373, -9044, -12542, -9835, -4746, -2644, 9194, 6855, 1063, -3439, -4093, 22155, 15261, 14709, 11036, -1488, -8006, 883, 7854, 2694, -10079, -17635, -16079, -13584, -11568, -1943, 313, -7068, -4259, -7815, -18801, -16360, -5839, -10613, -16704, -10509, 3192, 10327, 4180, 3901, -1805, 7107, 17720, 25349, 30601, 41528, 38914, 21014, -4115, -13232, -8795, -10751, -22380, -19463, -12458, -7926, -10953, -20867, -17517, -7616, -5250, -3745, -11598, -19850, -24339, -21597, 1384, 7089, 11412, 10335, -5980, -10717, -17911, -21973, -8652, 3871, 12810, 8304, 22, 7444, 1279, -5057, -912, 11297, 13756, 9634, -8265, -19073, -15412, -13787, -7984, -5007, -13334, -16896, -10026, -5607, -6494, -17241, -14998, -16513, -13521, -2616, 1413, 989, -818, -341, -3716]
2982c716n794k771m330K909J3338J8201j81j311k396K580k953n541q605q220r98
2967i788J3529M69K608N389j370J985j2599N119Q354L19M08j1653j2297J0189
2953F62J2932k52k120n789q859J3832J5096l85j033j2304j2156O020M981M16P727
2938A8768j126o641j0893J1469L668J23l861j6957o966R789N560j597r522l317
2924a1503Q911N668n469M26M338m35r108j922O41p414n517P048Q393q244j0494
2909b4681K336L748j1960O853J04m610Q214J1305o60l861Q772n814m037Q445N086
2894g60j6871j1743J4194j684L588l444o441N716N198Q052R131K751j726p793
2880a832k682M976L147L868k588n205m867K33P486J3282j319p129M638Q70j4197
$$ y = [-3716, -9510, -12281, -16611, -13702, -364, 17837, 17656, 16345, 13949, 16529, 13576, 8035, -570, -8790, -9788, 3741, 4210, 6818, 12207, 10837, 12822, 223, 5342, 13696, 14015, 14423, 2770, -9527, 662, 13594, 13342, 11222, 5433, -3426, 10406, 25502, 25117, 24084, 11780, -376, 5644, 10625, 11041, 18768, 17642, 11001, 108, 11577, 15245, 15368, 11507, -5450, -12416, -2627, 2933, 1336, -8186, -11503, -2592, 3076, -2393, -1967, 2371, 1936, -7172, -9094, -8453, -15867, -21384, -14336, -5943, -14187, -24681, -22345, -18597, -30557, -23704, -23600, -28210, -19996, -8691, -9351, -13212, -4440, -10254, -14291, -5846, -760, -17631, -29374, -15180, -16864, -13276, -16720, -23161, -17445, -12247, -4195, 4936, 7687, 5961, -1832, -4514, 462, 3609, 7477, 4889, -316, -5183, -4950, 2536, 15818, 14499, 7370, 12008, 12878, -1319]
2865a319q194n884n637J5403N884j3125n719R467J1244K771M045O785o892j0051
2851a222p43k648m339R343J4089j0425o295K135J1786R668N71j3743q196J1325
2837A1306N328j393j0100j2680n228J4297J1033o432k010K321j3256p69J8476
2824A0893O259J0486q018p609l969k773L280m377N589k85K159p995o096J0762
2810H306N080q932M428J125J3042r539j0656P984P810q946q300j458m033J3718
2796I629l931j3750r33M527m350k635o443n92K1166m950q510M575l958n05k6n539
2780a6225j533J681J873l180k990P549N430l075n579k839J2043J9706M086k2063
2766e116j4931j1965J0667J118j2371N795J5287P664M40J0733j812o684L686p450
$$ y = [-1319, -9513, -15397, -21034, -5631, 253, -12872, -18591, -9124, 2120, 4891, 8936, 15721, 8829, -1222, -1965, -4613, -8952, 391, 14480, 4055, -2240, -105, 11681, 21349, 21920, 8177, -19, 11306, 16634, 15241, 5141, -7539, -12767, 1530, 12563, 6131, 4121, 6442, -6814, -7583, 10893, 17152, 27638, 19620, 12011, 8042, 5269, 8549, 4172, 9761, 9476, 11635, 3640, -2456, 8306, 13386, 4454, 8882, 10007, 23049, 13510, 2854, 10838, 18648, 9702, 1402, -56, -4089, 9629, 5698, -8052, -8985, -4458, -8808, -11443, -17886, -18478, 2688, -2262, -10772, -6197, -10155, -10660, -10686, -16225, -17758, -16077, -14204, -17384, -20374, -12825, -7395, -10470, -16049, -18888, -6845, 12861, 16947, -5116, -20047, -32012, -21345, -20227, -32598, -26803, -11516, -3852, -3412, 7321, 5509, -1175, 2511, -4939]
2752d939L16J1867j0865j030K1672j0485j0637J2138R589o669r25p26M183K099
2738A5588J0208l877j0050o351n328p050J212n858N602J500J459M384K559P865
2724A1863R778k145j1295P97O303K266q76n278o034j474m615N468J1564m597j0213
2709A512j1225J1060J2494q13j6450k647J0217m205j0588p063n657J0622R605
2696c138m633L589K825R76N065O553j1754l499k656M856o752j1486R857J4998
2682D801L541l666l396J2770Q525j3471j2586l894K1033R132j2948j1731P851
2669E961J4250J1858q890j9460j3170j4648k81j038l64J85J078O855J3697O951
2655B984k744o385M952j0598q137O620J139K114r714Q321J6193n116n318J07J985
$$ y = [-4939, -4623, 7244, -3621, -4651, 17021, 6536, -4101, 8037, 17626, 10957, 10032, 9306, 13489, 15588, 25796, 21919, 11869, 5518, 190, -6860, -5648, -11506, -5904, -4404, -2945, 1439, 3998, 11863, 21641, 19496, 8201, 8998, 15301, 17567, 16691, 11413, 5379, 3905, -710, 4758, 16322, 11725, 1512, -9713, 1347, 13841, 13028, -3422, -6069, 4148, -57, -10645, -17708, -23365, -12743, -3138, -7771, -4182, -1357, -381, 4684, 11237, -517, -4016, -6672, -1816, -8568, -20054, -10197, 4801, 8342, 4676, 1280, 14050, 22575, 9104, -3482, -7376, 13657, 22789, 9841, -1890, 5961, 20211, 32069, 23179, 3719, -9451, -24099, -24380, -25418, -25782, -25597, -24519, -17664, -3967, 2984, 240, -6145, -1193, -11791, -19928, -13308, -12169, -10055, -19769, -11448, 4745, -371, -5689, -5582, -3597]
2640c597O591k60m627j3916R18m083k195q934J71O897q469N03J5623j099L319
2625a3158m213J766J9169J3997K814j3154r82O455j1890j5073p288K849J6541
2612b167P422m923L113j1031p763J6566p85n899Q924j748j9425j957J2333P200
2598a40N880m783j0803j503K0270J4484o128j2910j3562j3974M150N207P569K431
2584c812p155q897O659O741n553R240O562n969r991J744l773J3042j472k2254
2570b4888l060R059J9992J1048o227j0962o22O477L139J558l267k3L268L094o544
2555B042k069R586j2610P77M038p775j3045J1019N453j0455J3311L639J611Q4
2541E606k30r053n465J181M155M017N395q241p693k865J1857O22J200m631M560
$$ y = [-3597, 2994, 2734, -1893, -15809, -14891, -18974, -21169, -30103, -29932, -23035, -31504, -31001, -15378, -16477, -13158, -17371, -15605, 3564, 17561, 20375, 7221, 6239, 12694, 804, -14269, -21557, -18708, -2167, 5255, 332, 3445, -7586, -15349, 1217, 432, -5467, 3457, 1709, -17716, -19673, -7340, -140, 5740, 957, -9846, -11349, 8921, 23405, 17277, 4367, -9195, -23169, -19019, -13812, -6243, -3812, -10967, -19864, -13205, -6464, -12017, -2777, 3785, -2184, -12175, -10431, -14204, -1162, -2634, -24888, -27948, -18889, 1103, 12151, 5924, -5038, -5660, 817, 3956, 5514, 2247, 2224, 5492, 8586, 2042, -27, 9559, -3051, -2274, 1764, -6011, -19056, -8037, -2584, -13039, 272, 3911, 5522, 5606, 5376, -3677, -9142, -7961, -3806, 211, 5606, -2635, -10328, -13193, -1336, -714, 486, -4145, 415]
2526D15O87j795n03J142J0552j516o951J6518J255l285j4826l782j2400J2667
2512a822q20J009j1039J2621J7082M737q257l720O965n711j426l503m603K251
2498C764m494j520J38r545k47J2190J4175m22p297k87R834J4300K19J168M551
2483C6527j5771k104K756j1205j4402j1588N257J3654J734j4800j3917q249K2066
2470a0042l530j0404J4181O943M874j735p073j3411J1865J3674L316n981k646
2457C1r133j0826o577R674R140N834P702k6m897j5034k656R187K803O11R743o160
2441e84L532r40j2780q302J869M682J7372J0606l012k607J94j612p781j847L714
2426B504j791J975p428K808Q77r48j599J4550m490j2375j1261j0484N362K550
$$ y = [415, 1102, -693, -1196, -54, 10498, 8982, 2031, 18549, 19804, 16519, 1693, -2089, -14489, -1822, -2642, -1633, -12672, -51, 17031, 21768, 13511, 9791, 16756, 11045, 9619, 6116, 1513, 3764, -730, -2250, -2112, -11657, -11904, 286, 14461, 14039, 6742, 6455, 16289, 30589, 30808, 31976, 36527, 20756, 18652, 21408, 10203, -4199, -15787, -10530, 3124, 4858, -9942, -23859, -32108, -10042, -13572, -23976, -9795, -2852, 2022, 287, -6786, -20197, -8332, 5342, 8658, 2677, 31, -9102, -19928, -26505, -16831, -7691, -1857, 5845, 5819, 922, -14112, -16768, -7581, -4778, -4167, 5576, -584, 2948, 2008, -10772, -19074, -17205, -12523, 4849, 15455, 12443, 9836, 10030, 8418, 637, -1210, 2504, 713, 2688, -4740, -1932, -1055, -2003, -3602, 10948, 6458, -5917, -17178, -27662, -22300, -19750]
2412a9750Q899P592Q86j0134p960O177o374K522R204J634r015o304O949J9121
2398C447J0662j6041j4719r308j9O938P741J4315J9866O107j2657n188M393j931
2384A3606q656o738R670J930O044J0103j1034j5005n992L039J3530Q012j1524
2371F985r615j3439n887K0641Q721J1464k370j5640n276k590P935J347p693q043
2357a3460l061P953J1508n122p000k189J1136P467O200k624l617j5822j9698o791
2343c5120L482O632J7391m73p023Q401J5506J5670k592j7293q927L521J4064n039
2329H200r74K23j3838l891J5309J8055r227j7233p537o64j881O060p606K929N840
2314f235j1098J0506J1146m825j4838J538k616m819j461n38M441N436J5698J6976
$$ y = [-19750, -10851, -3259, -2373, -12507, -20467, -14290, -20664, -18142, -8938, -7304, -16319, -22623, -15674, 3447, 14109, -1932, -16651, -25959, -25978, -19040, -11299, 3016, 22882, 28989, 16332, 11144, 15537, 13606, 4950, -1788, 7882, 9812, 15856, 25959, 14925, -80, -6072, -3033, 10497, 18509, 6985, -2630, -16069, -21956, -1315, 7406, 18870, 16500, 860, -4416, -7006, 929, 2276, -5417, -13460, -16521, -8568, 2940, -2182, -9182, -11371, -235, 7232, 13432, 10808, 7191, -8631, -28329, -35120, -31638, -25006, -7615, -8088, -15111, -6710, 8796, 24466, 21874, 4581, -4346, -825, 13239, 8200, 7226, 7449, -6389, -10280, 5029, 23084, 13857, -3376, -10913, -11577, -13458, -7398, -15004, -12075, -6235, -17333, -6827, 4319, -506, -15344, -13806, -16422, -21241, -22702, -23240, -18799, -13363, 2335, 19311]
2300A9311K078m243r783j4859O235J5951K160M539J5279p918j6294J859R293j0393
2286A3215j9066m305P318J3552q984J78R630n868j2659o780J5581K810l950P620
2272H292J2374N435o736q322n687J1186J291j5557l601o093O011J6628J7949k582
2258C0588n884P23P78o716j7907j1076J22P689J113K68l509Q616J268j3352K802
2243d477k744j2036j2603j6542J9657J6813J9030o893q618K061M291M606q901
2230f356j2171J2406K2301K657p269K059O842L850N185o097r272l449r146m352
2216b812O441k842k427J1635m05L742k255j9410R398l497R22J1416l462J203j646
2201F001l775o306n344j5333K852J5766K7542J7212j2094K298L254j0822j4223
$$ y = [19311, 21389, 17146, 7363, -7496, -1261, 14690, 16850, 21389, 36668, 28750, 12456, 14315, 23608, 13215, -5851, -10156, -2838, 10714, 1730, 1908, 11538, 5670, -6989, -13769, 1812, 4622, 672, 8292, 20666, 26101, 19365, 11043, 5356, 16542, 17833, 2276, -1325, -7418, -1407, 15221, 33170, 30588, 24704, 25427, 26205, 19489, 1582, -9494, -9372, -1683, -570, -302, -3811, 4805, 6073, -7279, -4477, -7221, -19257, -31860, -48402, -28745, -11932, 7098, 205, -8413, -6352, -2061, 2545, -6356, -18527, -6121, 16180, 18837, 11568, 13627, 20469, 24319, 29504, 23407, 14135, 10686, 1540, -2812, 3629, 787, -1640, 9995, 9590, 13332, 11077, -8333, 1065, -2432, -1510, 9906, 6444, 7647, 6001, 2226, -4080, -9424, -24757, -21905, -6139, 21403, 38615, 26521, 28819, 32073, 21251, 7028]
2188G028M453p432o943k28Q678N266j2773J658K386j2430p752j269J1411J1227
2174C280J3447R32l202j5276q707J0418J643m467j2295R190M223o129j8081j158
2160b6182N05J566M904J082J7080p152q850J6686P179j2112Q335J366j1831Q139
2146G15M22r937j1260p420J7717J3390L971l619L401n026M438o466j9851J3950
2132e575Q120r821m295O304N776q95J979l763j0355L878k723J3983j5289L124
2118i552J5124K212O001R400q266N932K180n364K232k386l715L653n379L923J4109
2103C0104n80j1427l212m876j2765n337l884p39o896m008J5627l74q887q34J6103
2088a985q181j4223J343O951O142L409l240K196J532M740L662M116K396j5827
$$ y = [7028, 11481, 4049, -2894, -3122, 5556, 10822, -1951, -293, 2093, -10337, -18089, -19358, -7947, 3280, 16727, 17659, 14457, -819, -9526, 892, 2535, -1932, -14227, -5037, -814, -6943, -25024, -26182, -25677, -24111, -19207, -18125, -1045, -8197, -17047, -361, 6818, -5294, 3041, 4407, -7424, 715, 1137, -8800, -20060, -27480, -9763, 3627, 7598, 3979, 7380, 2354, 6792, 326, -19525, -5575, 2545, -7276, -11571, -5267, 509, -386, 1593, -2170, -12525, -8647, -11370, 2613, -12676, -9552, 5572, 7784, 13785, 23185, 14919, 20851, 23031, 17667, 19899, 17513, 13798, 17451, 12072, 15995, 30104, 29524, 18097, 14885, 10009, -2756, -8093, -11977, -12716, -19612, -23620, -7993, -8367, -17254, -18088, -1985, -10166, -24389, -23046, -16095, -9953, -6544, -9784, -7588, -6056, -1316, 2346, 6462, 8858, -6969]
2074f969k964J5916J1014j0355j3543o483p894m774K7403Q569k6k58m031J152
2060F757N636q671j0378L855J468Q73j0901j1622o69R640R863l960J417J2596
2046E904M493m445J5967o583k247p385n623j0721j6438L488J0078J0390K518M246
2032C642l78o39j0816k997p473l473j5590j7700J2411Q485j675N829P634j0271
2018c3011l021K3225j624m908K737j239J5268R202p618j875M819k341L377l343
2004c52L468J374O952o892k0196r543J2446L87J6626N808J087M54r734j0920J0801
1989A766O817m831o73M283k890r638p838J3941N881l333k477l90K898o033o626
1974i143M631K249K455j7178m566P018J5944J5227J942j4268r095q511m413k785
$$ y = [-6969, -9933, 5983, 16997, 6642, -6901, -13384, -21278, -26052, 1351, 9920, 9894, 9636, 5605, 6757, 12393, 3722, -6656, -2801, -1333, -460, -11361, -22983, -23652, -14012, -4149, -8109, -6692, 5904, 10397, 5952, 21919, 15336, 13089, 5704, 81, -10640, -27078, -23590, -13512, -3122, -604, 3642, 3264, 2625, -8191, -11188, -18661, -22134, -37724, -55424, -43013, -34528, -36203, -30374, -22740, -33011, -36032, -12807, -14431, -19339, -16602, -17841, -2573, 6629, -989, -2864, 1955, -386, 2991, -352, 3116, 4490, 11442, 4550, -15646, -25189, -12743, -12356, 4270, 10078, 11165, 11619, 1885, -9035, 1766, 8583, 3752, 3079, 7362, 4472, -5166, -13004, 937, 6818, 3485, 1008, 618, 3516, -2517, -9143, -4512, -2263, 192, -16986, -21552, -14534, 1410, 16637, 18579, 4311, -4784, -13295, -17708, -20493]
1960b0493R75J0829Q69J3294J408Q122J4093Q99m059r193j0300J489l572r155
1946d794J4306J0398N136L066O492j8933j1616j3221j0065n433R073R239n095
1933a1447L85J0625P558l178p644M576P238L270L316j2146j3302N325j828j3011
1919b0263J1814M012J1016L625j9448j624Q024K855n223j0174q318k412J0184
1906a5932J2411J6204N8j452j515o314j173q645n605M713Q032R673L053m853K416
1891A1071Q066J3128k862l594j063l590k553r217j9058K199J1789Q408r715q895
1877e886r367n710P772j3654J2864J1246R196j2773K962J122k216r966O346P486
1863e78K728q01J287M180j7565o431J6525J1536q27j2907J371L595k510k007o740
$$ y = [-20493, -19518, -8689, -7820, 5474, 6882, 15004, 29097, 29996, 25937, 16744, 6444, 7933, 4361, -4794, 9512, 19910, 25046, 28112, 34604, 15671, 4055, -9166, -19231, -24664, -15591, -6352, -11447, -11062, -437, 7121, 3943, -3701, 875, 8113, 11383, 14699, 2553, -10749, -5424, -7252, -20263, -8449, -4437, 6579, 10204, -9244, -10868, -2844, 11, -5212, -15386, -23704, -26116, -15932, -3521, 12683, 12741, 11289, 9774, 3460, 2287, -6358, -11963, -7250, 782, 10455, 13508, 8655, 11071, 19137, 32265, 29403, 25809, 24746, 21156, 18603, 9386, -9672, -7473, 4316, 12724, 3009, -5886, -15253, -20963, -13191, -26845, -13981, -2735, 6461, -6312, -3350, -2228, -4444, -14410, -8064, -578, 2150, 1349, 2636, 6816, -10749, -17180, -655, 10881, 10054, -2853, -1482, 2113, -397, -2404, -9144]
1848i144L939M424J0843J2718K02j4761j2905j6495Q237M470N363J0344J1346
1835A8581l252J995j349j0396n081J4419j1205j6573P738J088p975L103n903P667
1821g143O412l00l779m172O524J0544k134l473R718m862p430j3713J3570m010
1807d248L399N92r301K78J0445K210M739J0438J0369o72R940m885q749r729j280
1792A3546j85j0592J337k295J490J4955n79o958j959o308O584J4821n345j6500
1778B012j2929K1688L97j3350K366O276k09O21J4585m941j2578Q036m001N120
1764A3093n580r42r980k466J4740L462n813m198k805j540k437l374m402J0619
1750a623R636O318p317o343o112L962K053o396L0j7731L847K4915p577O201K1506
$$ y = [-9144, -5205, -781, 10062, 22780, 22982, 8221, -4684, -21179, -12942, -8472, -3109, 7235, 18581, 15329, 17324, 15975, 5579, 498, 14917, 3712, -12861, -5123, -4035, -12010, -8907, -14810, -7143, -731, -1031, -4810, -8982, -2458, 8086, 5952, 2479, 12197, 7335, -95, -13808, -238, -4248, -849, -257, -9558, -9280, 1165, 3375, 8114, 18552, 28921, 28249, 38189, 33304, 24555, 14826, 13546, 13361, 2769, 4106, 1811, 3301, 18256, 17677, 10719, 8760, 2452, 9036, 23857, 18512, 2012, -10917, 10771, 11168, -2182, 184, 6460, 6251, 6872, 21457, 16516, 3938, 11974, 7973, 13093, 7513, 6571, -3409, -5875, 8865, 12327, 6514, 2316, -489, -2029, -4466, -7840, -12242, -1623, 8013, 14331, 7014, 671, -5441, -1479, 574, -5822, -5792, -23523, -19676, 5239, -2338, 3863, 25369]
1735B5369K263L57Q86N999j4010j5995o704R755J2584L513j611j420j188m969
1721A4829P44q980o128L275Q813J0455L511r575k0793j080K3444k697n596R7q509
1706A810n346J420k100P444N041j867j0795j4922o551j400J9678Q420K710k458
1692A084m832O545n37M904j5764r087L404k411M834K7025J3433o186j4686O336
1678A4062m495J521L666O122J6784l930q706n803J111K720l917j3796q5o61l732
1663H61M387O201J602m738O162j345k1963q02j76R27r423p280P019K910O339m466
1647a3785J0012p338p544j962J2421o5M56n930j2852j1298k878O501J2441J1162
1633a0659k749J9743J2201k269L871j2559k0555m550N622P772k522j354J4803
$$ y = [25369, 27632, 27989, 28875, 34874, 20864, 4869, -1835, 7920, 20504, 24017, 22406, 20986, 19798, 14829, 15573, 6593, 465, 3740, 12553, 23008, 26519, 16944, -3849, -4929, 18515, 15818, 10222, 10319, 1810, -3536, -2116, -4216, 3228, 8269, 6402, -4393, -19315, -25866, -27266, -7588, 832, 3542, 1084, -3748, 2797, 2260, 7164, -8600, -17687, -14283, -16694, -11860, 15165, 28598, 22412, 7726, 14062, 9567, 11088, 14754, 20876, 37660, 33730, 25024, 19221, 20332, 23052, 19135, 5339, 5254, 4593, 861, 5248, 11449, 13051, 8313, 14475, 13130, -8833, -9635, -9811, -8884, -18307, -25587, -18568, -15658, -9319, -13785, -3773, -11111, -18655, -20617, -8196, -8261, -7805, -13735, -26587, -37885, -40763, -34262, -21821, -10659, -13408, 6335, 18536, 16267, 20138, 7579, -12976, -17526, -11904, -4132, -6654, -8008, 6795]
1620F795M481Q318q085j3935p141n251O115r602n394k312n308M828N570J1942
1606h979J5793p997r175L309R43j0654J6423J20n796j022Q883J114o693L985k728
1591b474j218P153o585m709J0517o411K686P069l350m921N302J247k900O361l607
1576D160N283j805J054j5357J296J5742J2904J1564J998r918j406O966n453j7520
1562I508j6347j3350kQ702m983r777K1711J7745q634q979L230J0251N069Q690
1548B2834l162l984P146j3824j0321O24P518q93p786n878k919J3324M038j2J2126
1533A8831m767j948j0048j7444k3019N154J4139O931L258N119O906O130J460l69
1519A0333J311j114j3383K503p310L931l029J2256K746j1771R407J07M840J1071
$$ y = [6795, 11276, 19594, 11509, -2426, -9567, -14818, -8703, -18305, -23699, -26011, -31319, -26491, -20921, -8979, 6814, -1183, -10358, -7049, -6106, -16760, -337, -217, -6013, -7035, 1848, 2962, -3731, 254, -2474, -3692, 3461, -3124, -7833, 2684, -3727, -1041, 6028, 2678, -2243, 3059, 4306, 1406, 7767, 4160, 9443, 7638, 8692, -6665, -5369, 10373, 23277, 34841, 36839, 26921, 25515, 32481, 27028, 9508, -6839, -20189, -20191, -11489, -16472, -26249, -4538, 13207, 4573, -4406, -1176, 9075, 14144, 22834, 19672, 15688, 22834, 9010, -1311, -687, 6831, 5938, -1848, -7726, -10645, 2679, 6717, 6705, 18831, 14064, 12116, 2068, -15376, -38395, -33241, -19102, -12171, -8913, -3794, 3112, 9242, 10702, 10333, 11644, 10530, -2853, -350, -7660, -3729, -6758, 5498, 8244, -3527, 5880, 5987, 10827, 21898]
1505B1898O36n36l541r701j951J685m473l468K903J3427l449k3276m064Q600J2227
1490F917N150n895K149j056J3851j3105j22Q052o755q63k288J032O028j0041r828
1475f774O290R302J0069p277l388O682j578l428p71q086Q066O461o28p925O703
1460A3718J1515Q736n350j0214k1929m815J2477J085p608k0272M659J0654N28
1447f816J3419j095j0671O030n093n042m207r253k683O517J3264N490r868Q767
1433a241j246r472P680P349l304j4772K802j784p19L637L437K371m888J0508k71
1418H7K290l758k5929Q825O197Q956J5953P087N345o479P823q372j0886r245k0203
1403b2309N163J2393J1381k096L469l226n106J0899M55p544m94m509N681l734
$$ y = [21898, 22534, 21998, 18457, 8756, 6805, 8490, 4017, 549, 3452, 16879, 13430, -9846, -13910, -5310, 6917, 12067, 6172, 8321, 7265, 21116, 8011, 7889, 15941, 9186, 8323, 6035, 7067, 13095, 3054, -6774, -484, 8818, 18887, 11610, 8222, 14904, 13326, 9898, 9127, 1041, 9107, 15568, 14940, 7015, 13718, 25233, 33969, 28619, 18405, -3524, -8339, 4138, 5223, -2385, -22657, -17998, -7344, -6816, 6603, 5508, -5163, 867, -4226, -9268, -13475, -22728, -25411, -18894, -5630, -140, -10008, -1241, -2487, -11959, -4279, 3070, -234, -15006, -12204, -13988, -14707, -11070, -7633, -5262, -10150, 358, 87, 2377, -1381, -27310, -18485, -12288, -3332, 12621, 19708, 25053, 18574, 26397, 18025, 7139, -2106, -22309, -17146, -4753, 6628, 4532, 8001, 4775, -331, 10568, 11023, 3479, 2985, -1524, 4157, 423]
1389D23q184n626q781k863J9826O251k080J1022R89j2541N124p274k803q088r651
$$ y = [423, -7761, -13387, -22168, -25031, -5205, 1046, -1034, 9988, 10977, -1564, 3560, -3714, -6517, -14605, -24256]
$$ [...]
##END NTUPLES=NMR SPECTRUM
##END=
