##TITLE=Analysis number 324177
Compound Code spb 05355
Book Reference 504/78
Project Code adrs
Chemist Name howarde
##JCAMPDX= 6.0         $$ Bruker NMR JCAMP-DX V2.0
##DATA TYPE= NMR SPECTRUM
##DATA CLASS= NTUPLES
##ORIGIN= Bruker BioSpin GmbH
##OWNER= nmr
$$ XWIN-NMR		Version 3.5
$$ Wed Nov 15 12:01:05 2006 GMT Standard Time (UT+0h)  MAYBRIDGE\nmr@NMR_250MHZ
##.OBSERVE FREQUENCY= 250.131544655141
##.OBSERVE NUCLEUS= ^1H
##.ACQUISITION MODE= SIMULTANEOUS (DQD)
##.ACQUISITION SCHEME= undefined
##.AVERAGES= 16
##.DIGITISER RES= 18
##SPECTROMETER/DATA SYSTEM= dpx250
##.PULSE SEQUENCE= zg30
##.SOLVENT NAME= DMSO
##.SHIFT REFERENCE= (INTERNAL, DMSO, 0, 16.522)
##AUDIT TRAIL= $$ (NUMBER, WHEN, WHO, WHERE, WHAT)
$$ ##TITLE= Audit trail, XWIN-NMR		Version 3.5
$$ ##JCAMPDX= 5.01
$$ ##ORIGIN= Bruker BioSpin GmbH
$$ ##OWNER= nmr
$$ C:\u/data/dgb/nmr/ADRS/430/pdata/1/auditp.txt
$$ ##AUDIT TRAIL=  $$ (NUMBER, WHEN, WHO, WHERE, WHAT)
(   1,<2006-11-15 12:00:40.01 +000>,<MAYBRIDGE\nmr>,<NMR_250MHZ>,
      <created by zg, POWCHK disabled, PULCHK disabled
       configuration hash MD5:
       49 4B E0 1D 92 C2 6B 37 9F E6 65 BC 52 41 86 1D
       data hash MD5: 64K
       4D 73 D6 C5 20 32 A6 58 D1 80 08 0D A1 A1 67 CE>)
(   2,<2006-11-15 12:00:53.14 +000>,<MAYBRIDGE\nmr>,<NMR_250MHZ>,
      <Start of raw data processing
       ef LB = 0.3 FT_mod = 6 PKNL = 1 SI = 32K 
       data hash MD5: 32K
       B3 ED F6 B0 27 17 7C C6 B7 44 B1 74 8A 8F 36 67>)
(   3,<2006-11-15 12:00:54.95 +000>,<MAYBRIDGE\nmr>,<NMR_250MHZ>,
      <apk 
       data hash MD5: 32K
       6B BD F3 1A EC E5 C9 3E 4C FD 17 91 09 DF 47 E9>)
(   4,<2006-11-15 12:00:55.69 +000>,<MAYBRIDGE\nmr>,<NMR_250MHZ>,
      <abs ABSG = 5 
       data hash MD5: 32K
       B5 F0 AF BF 05 C1 0F DF 9E 8B 61 2E 01 F9 5B B4>)
$$ ##END=
$$ 
$$ hash MD5
$$ 09 67 40 EC E3 5D 9F C4 41 EC AE 2A 4A 2A 1E D3
##$RELAX= 
##$RELAX= 
##$RELAX= 
##$RELAX= 
##$RELAX= 
##$RELAX= 
##$RELAX= 
$$ Bruker specific parameters
$$ --------------------------
##$DU= <C:\u>
##$EXPNO= 430
##$NAME= <ADRS>
##$PROCNO= 1
##$TYPE= <nmr>
##$USER= <dgb>
##$AMP= (0..31)
100 100 100 100 100 100 100 100 100 100 100 100 100 100 100 100 100 100 
100 100 100 100 100 100 100 100 100 100 100 100 100 100 
##$AQSEQ= 0
##$AQ_mod= 3
##$AUNM= <au_zg>
##$AUTOPOS= <20 >
##$BF1= 250.13
##$BF2= 250.13
##$BF3= 250.13
##$BF4= 250.13
##$BF5= 500.13
##$BF6= 500.13
##$BF7= 500.13
##$BF8= 500.13
##$BYTORDA= 1
##$CFDGTYP= 0
##$CFRGTYP= 5
##$CHEMSTR= <none>
##$CNST= (0..31)
1 1 145 1 1 1 1 1 1 1 1 1 1 1 1 1 1 1 1 1 1 1 1 1 1 1 1 1 1 1 1 1 
##$CPDPRG= <>
##$CPDPRG1= <>
##$CPDPRG2= <>
##$CPDPRG3= <>
##$CPDPRG4= <mlev>
##$CPDPRG5= <mlev>
##$CPDPRG6= <mlev>
##$CPDPRG7= <mlev>
##$CPDPRG8= <mlev>
##$CPDPRGB= <>
##$CPDPRGT= <>
##$D= (0..31)
0 1 0 0 0 0 0 0 0 0.06 0 0 0 0 0 0 0.0002 0 0 0 0 0 0 0 0 0 0 0 0 0 0 
0 
##$DATE= 1163592038
##$DBL= (0..7)
120 120 120 120 120 120 120 120 
##$DBP= (0..7)
150 150 150 150 150 150 150 150 
##$DBP07= 0
##$DBPNAM0= <>
##$DBPNAM1= <>
$$ [...]
##$SUBNAM7= <"">
##$SUBNAM8= <"">
##$SUBNAM9= <"">
##$SW= 20.6930455092707
##$SWIBOX= (0..15)
0 0 3 0 0 0 0 0 0 0 0 0 0 0 0 0 
##$SW_h= 5175.983436853
##$TD= 65536
##$TD0= 1
##$TE= 683.16
##$TE2= 300
##$TE3= 300
##$TEG= 300
##$TL= (0..7)
0 120 120 120 120 120 120 120 
##$TP= (0..7)
150 150 150 150 150 150 150 150 
##$TP07= 0
##$TPNAME0= <>
##$TPNAME1= <>
##$TPNAME2= <>
##$TPNAME3= <>
##$TPNAME4= <>
##$TPNAME5= <>
##$TPNAME6= <>
##$TPNAME7= <>
##$TPOAL= (0..7)
0.5 0.5 0.5 0.5 0.5 0.5 0.5 0.5 
##$TPOFFS= (0..7)
0 0 0 0 0 0 0 0 
##$TUNHIN= 0
##$TUNHOUT= 0
##$TUNXOUT= 0
##$USERA1= <user>
##$USERA2= <user>
##$USERA3= <user>
##$USERA4= <user>
##$USERA5= <user>
##$V9= 5
##$VALIST= <valist>
##$VCLIST= <CCCCCCCCCCCCCCC>
##$VD= 0
##$VDLIST= <DDDDDDDDDDDDDDD>
##$VPLIST= <PPPPPPPPPPPPPPP>
##$VTLIST= <TTTTTTTTTTTTTTT>
##$WBST= 1024
##$WBSW= 4
##$XGAIN= (0..3)
0 0 0 0 
##$XL= 0
##$YL= 0
##$YMAX_a= 393416
##$YMIN_a= -336996
##$ZGOPTNS= <>
##$ZL1= 120
##$ZL2= 120
##$ZL3= 120
##$ZL4= 120
##$ABSF1= 16.522
##$ABSF2= -4.171173
##$ABSG= 5
##$ABSL= 3
##$ALPHA= 0
##$AQORDER= 0
##$ASSFAC= 0
##$ASSFACI= 0
##$ASSFACX= 0
##$ASSWID= 0
##$AUNMP= <proc_1d>
##$AZFE= 0.1
##$AZFW= 0.1
##$BCFW= 0
##$BC_mod= 0
##$BYTORDP= 0
##$COROFFS= 0
##$CY= 12.5
##$DATMOD= 1
##$DC= 0
##$DFILT= <>
##$DTYPP= 0
##$F1P= 14.0000005364418
##$F2P= -0.99999901652339
##$FCOR= 0.5
##$FTSIZE= 32768
##$FT_mod= 6
##$GAMMA= 0
##$GB= 0
##$INTBC= 1
##$INTSCL= 1
##$ISEN= 128
##$LB= 0.3
##$LEV0= 0
##$LPBIN= 0
##$MAXI= 10000
##$MC2= 0
##$MEAN= 0
##$ME_mod= 0
##$MI= 0
##$NCOEF= 0
##$NC_proc= -3
##$NLEV= 6
##$NOISF1= 0
##$NOISF2= 0
##$NSP= 0
##$NTH_PI= 0
##$NZP= 0
##$OFFSET= 16.522
##$PC= 1
##$PHC0= -46.59053
##$PHC1= -2.088988
##$PH_mod= 1
##$PKNL= yes
##$PPARMOD= 0
##$PSCAL= 4
##$PSIGN= 0
##$REVERSE= no
##$SF= 250.13
##$SI= 32768
##$SIGF1= 0
##$SIGF2= 0
##$SINO= 400
##$SIOLD= 32768
##$SREGLST= <1H.DMSO>
##$SSB= 0
##$STSI= 32768
##$STSR= 0
##$SW_p= 5175.98343685301
##$SYMM= 0
##$S_DEV= 0
##$TDeff= 65536
##$TDoff= 0
##$TI= <Analysis number 999999
Compound Code 99
Book Reference 9
Project Code 9>
##$TILT= no
##$TM1= 0
##$TM2= 0
##$TOPLEV= 0
##$USERP1= <user>
##$USERP2= <user>
##$USERP3= <user>
##$USERP4= <user>
##$USERP5= <user>
##$WDW= 1
##$XDIM= 32768
##$YMAX_p= 481927194
##$YMIN_p= -306978
$$ End of Bruker specific parameters
$$ ---------------------------------
##NTUPLES= NMR SPECTRUM
##VAR_NAME=  FREQUENCY,     SPECTRUM/REAL,   SPECTRUM/IMAG
##SYMBOL=    X,             R,               I
##VAR_TYPE=  INDEPENDENT,   DEPENDENT,       DEPENDENT
##VAR_FORM=  AFFN,          ASDF,            ASDF
##VAR_DIM=   32768,         32768,           32768
##UNITS=     HZ,            ARBITRARY UNITS, ARBITRARY UNITS
##FACTOR=    0.157963299565203, 1,           1
##FIRST=     4132.6476996994, 0,             0
##LAST=      -1043.33573715361, 0,           0
##MIN=       -1043.33573715361, -306978,     0
##MAX=       4132.6476996994, 481927194,     0
$$ Real data points
##PAGE= N=1
##DATA TABLE= (X++(R..R)), XYDATA
$$ [...]
16341h5196k0173N9921P2667M9597J3247p9696m5412J8834M0835l5767j9285L8195
$$ -85196 -105369 -45448 27219 76816 90063 10367 -35045 -16211 24624 -11143 -30428 7767
16329G767M2427l4782m5376R937M5799K0915J7582j1563k6646L6831m1709p1250
$$ 7767 50194 15412 -29964 -20027 25772 46687 64269 52706 26060 62891 21182 -50068
16317e0068J3251K3304J9001J5555R313k0602k9477O457K8099J6905j232j6746
$$ -50068 -36817 -13513 5488 21043 30356 9754 -19723 -13266 14833 31738 30506 13760
16305A3760K7666K5007n1499l0279n1338L214K0725o134P254J1750j4242j8069
$$ 13760 41426 66433 14934 -15345 -66683 -63469 -42744 -48878 -41624 -29874 -44116 -62185
16293f2185M6641L5734m1369m1157N5274k7665o6472n526L1560l2033M7308N0997
$$ -62185 -15544 20190 -21179 -62336 -7062 -34727 -101199 -106725 -75165 -107198 -59890 -8893
16281h893K6006k8643p600R549K3745K7709L0951K1039j4184P020k7509j5089
$$ -8893 17113 -11530 -19130 -9581 14164 41873 72824 93863 79679 86699 59190 44101
16269D4101l4115j9608m766K5132J0048l1895J7856k8210m900K4386M6065M5039
$$ 44101 9986 -9622 -14388 10744 20792 -11103 6753 -21457 -26357 -1971 44094 89133
16257H9133k0892n0801l2045m492j9795J678j7926k5263K527O8161L1625L353
$$ 89133 68241 17440 -14605 -19097 -38892 -37214 -55140 -80403 -77876 -9715 21910 25263
16245B5263m9058j9201L4900j1847j2963l0195K2135L5873K1777K9637J5179l631
$$ 25263 -23795 -42996 -8096 -19943 -32906 -63101 -40966 -5093 16684 46321 61500 57869
16233E7869M717m342J9570N554r572O2535K3813p3509q8937j898j5218n3355j5111
$$ 57869 62586 58244 77814 83368 73796 136331 160144 86635 -2302 -4200 -19418 -72773 -87884
16220h7884O7746L1944O892J1803n153j3001Q977K0268K9247m3453n1721m2781
$$ -87884 -20138 11806 18698 30501 25348 12347 21324 41592 70839 27386 -24335 -67116
16208f7116l4899M4918M2269j2046l3401l3818K6374k0879N3207P050J4963P0405
$$ -67116 -102015 -57097 -14828 -26874 -60275 -94093 -67719 -88598 -35391 -28341 -13378 57027
16196E7027l9619n1853L9508J1713k1710P495Q080r344K6068J5224J1454M9620
$$ 57027 17408 -34445 5063 16776 -4934 2561 10641 1297 27365 42589 54043 103663
16184A03663r503k6330o7190k1346K0900L8423n1323r993J303L669j0944K796
$$ 103663 94160 67830 640 -20706 194 38617 -12706 -22699 -21396 -17727 -28671 -25875
16172b5875k3916r763R412J1732K5202j9401j5193O0577O14l2242n4132k5818
$$ -25875 -49791 -59554 -50142 -38410 -13208 -32609 -47802 12775 13389 -18853 -72985 -98803
16160i8803M1778K6466L317j6102Q6K3714j5171l4026K064M0900K8720j0396L9713
$$ -98803 -57025 -30559 -27242 -43344 -43258 -19544 -34715 -68741 -66677 -25777 2943 -7453 32260
16147C2260M2798K4242k1034n5509p9666j9082L8658K9153K1312P364k5018m210
$$ 32260 75058 99300 78266 22757 -56909 -75991 -37333 -8180 13132 20496 -4522 -8732
16135h732l2503k4317K1483N462N4042L0038n2476l751l186K9387j9140l0852
$$ -8732 -41235 -65552 -44069 -38607 15435 45473 -7003 -10754 -13940 15447 -3693 -34545
16123c4545j8336n0881J5498L7604N1359Q4702M6024n0763j0019n3189m1079n6702
$$ -34545 -52881 -103762 -88264 -50660 699 85401 131425 80662 70643 17454 -23625 -80327
16111h0327k587N4991P1266L3447l2994j7734n189o676M3760k8862M915K0491
$$ -80327 -82914 -27923 43343 76790 43796 26062 20873 14197 57957 29095 34010 54501
16099E4501j3278j2425m1916k5940k4328P1941J4931M4981J488n3252k5071J3608
$$ 54501 41223 28798 -13118 -39058 -63386 8555 23486 68467 69955 16703 -8368 5240
16087E240M6235l7137P062m898k3180J6018j7980j393O1913Q458J2618r3318l0661
$$ 5240 51475 14338 21400 16502 -6678 9340 -8640 -10033 51880 60338 72956 -20362 -51023
16074e1023l8607M9478K1460J3330N233l921K4346l93k8994k5251k4669P708P6062
$$ -51023 -89630 -40152 -18692 -5362 -129 -4050 20296 19903 -9091 -34342 -59011 -51303 24759
16061B4759M6385l1229L1179j3833m7864k1882N3147j8862J408o0102Q544j4870
$$ 24759 71144 39915 71094 57261 9397 -12485 40662 21800 23208 -36894 -28350 -43220
16049d3220m3865j7891j6704J4625M2347j4284l8862M6439Q6652J250P013j5745
$$ -43220 -87085 -104976 -121680 -107055 -64708 -78992 -117854 -71415 15237 16487 23500 7755
16037G755r7236m1198L4868J9695K583k6567L7246P7260k6381j0662J0176j0984
$$ 7755 -89481 -130679 -95811 -76116 -73533 -100100 -62854 14406 -11975 -22637 -12461 -23445
16025b3445Q99L9439J452N9435m9846k2347p067l9960n6386j5158O3341K1098
$$ -23445 -22546 16893 18345 77780 27934 5587 -1480 -41440 -97826 -112984 -49643 -28545
16013b8545Q0634P754m1318j7887M16Q511M055r424n7618J8489M7343k4320M2742
$$ -28545 52089 59843 18525 638 1054 9565 13620 4196 -53422 -34933 12410 -11910 30832
16000C0832j5692m2160o0581L201j419m9270n6160n878P400O5249O9583l1758
$$ 30832 15140 -27020 -87601 -84400 -85819 -135089 -191249 -197127 -189727 -124478 -54895 -86653
15988h6653p6531m6904O0921J11151N8015J8622l0171k2809n611k7515K5696N0221
$$ -86653 -163184 -210088 -149167 -38016 19999 38621 8450 -14359 -19970 -47485 -21789 28432
15976B8432p2205m2964j8046k6951P1505P9217j393L960J8268n8907K925l4884
$$ 28432 -43773 -86737 -104783 -131734 -60229 18988 17595 21555 39823 -19084 -16159 -51043
15964e1043J648M854j5565l0545M4374K0736R539N948J997j5839j6544L6306J571
$$ -51043 -49395 -44541 -60106 -90651 -46277 -25541 -16002 -10054 -8057 -23896 -40440 -4134 -2563
15951b563l5168k6750n4794M1769M3590M6526j1155q9879K230K4471J410l0783
$$ -2563 -37731 -64481 -119275 -77506 -33916 12610 1455 -88424 -86194 -61723 -60313 -91096
15939i1096J03451O1170P339J3275j8303m0656Q717J184l6765j6195M9229o1836
$$ -91096 12355 73525 80864 94139 75836 35180 43897 45081 8316 -7879 41350 -20486
15927b0486o2030j0636j9582K0288p209Q760L445L1931N254J9249L2389K0326
$$ -20486 -82516 -93152 -112734 -92446 -99655 -90895 -87450 -55519 -50265 -31016 1373 21699
15915B1699k726l9994j727n4022o865O5262K0841l1276j9104j7882k6347Q020
$$ 21699 18973 -21021 -22748 -76770 -83635 -18373 2468 -28808 -47912 -65794 -92141 -84121
15903h4121l8065M1871L6686L5765M359K3534m9824j1372P7678N7960J2163k9889
$$ -84121 -122186 -80315 -43629 -7864 -3505 20029 -29795 -41167 36511 94471 106634 76745
15891G6745r0406L2734J7131o2808m8544P3R346k2997M331K3743k2228J1320K7271
$$ 76745 -13661 19073 36204 -26604 -75148 -75075 -65729 -88726 -84395 -60652 -82880 -71560 -44289
15878d4289L7517k8771K5886J6105M1815o251k3411m2686o9567J9323K0075k729
$$ -44289 -6772 -35543 -9657 6448 48263 42012 18601 -24085 -93652 -74329 -54254 -56983
15866e6983L2562M1300j970O005l8528k5345o9707k5316N9961R3191J7589m9642
$$ -56983 -24421 16879 14909 20914 -17614 -42959 -112666 -137982 -78021 15170 32759 -16883
15854a6883M791K8082J66J2541K3567o210k1708k6592n3679P027L2913K3751N2611
$$ -16883 -12092 15990 16156 28697 52264 46054 24346 -2246 -55925 -48898 -15985 7766 60377
15841F0377l0961J9146o94l8672n393J6964k2956q6603n647N4759L1214k3746
$$ 60377 29416 48562 47868 9196 3803 20767 -2189 -88792 -94439 -39680 -8466 -32212
15829c2212J0063K2146j1752Q678L3003j8086l7448K8832K1714j5337m7761N177
$$ -32212 -22149 -3 -11755 -3077 29926 11840 -25608 3224 24938 9601 -38160 -32983
15817c2983Q1184L5322j6560L0901l7228l1257q910q738L4366m9098j8663J5793
$$ -32983 48201 83523 66963 97864 60636 29379 20469 11731 46097 -3001 -21664 -5871
15805e871k9215M0046o821J6191J7252L4440k4109J7333j8716o0949m6540l2274
$$ -5871 -35086 4960 -1861 14330 31582 66022 41913 59246 40530 -20419 -66959 -99233
15793i9233J0542K6611L873k3129L8454m175K1825P751J7730M0364j9926k7313
$$ -99233 -88691 -62080 -58207 -81336 -42882 -47057 -25232 -17481 249 40613 20687 -6626
15781f626l5538l0572l609Q1415P533M4324k223M5149l380k2448j6407j8188o685
$$ -6626 -42164 -72736 -76345 5070 12603 56927 54704 99853 96473 74025 57618 39430 32745
15768C2745k750M8280k2736k8540n9237l1982J7042K1231j1930o5897K1438R5931
$$ 32745 29995 78275 55539 26999 -32238 -64220 -47178 -25947 -37877 -103774 -82336 13595
15756A3595J2329p9933p6239J3005K8449j902K1793O1221M982m2687k4797p131
$$ 13595 25924 -54009 -130248 -117243 -88794 -90696 -68903 -7682 -2700 -45387 -70184 -77315
15744g7315J0817M6529Q188k9698K2970M6129L2898n4960o3262N9163J6886n0391
$$ -77315 -66498 -19969 -11781 -41479 -18509 27620 60518 5558 -57704 1459 18345 -32046
15732c2046o138K7757K7722J9930j4982l0042q3336k9215O5645K8985o5097m649
$$ -32046 -38184 -10427 17295 37225 22243 -7799 -91135 -120350 -54705 -25720 -90817 -95466
15720i5466L8490L6893N5121J2683l540k3468m7412j1051j5240N3118J6998R193
$$ -95466 -56976 -20083 35038 47721 44181 20713 -26699 -37750 -52990 128 17126 26319
15708B6319j4153N6921J4918L5650j5365n1072j6183J6448K9413N146o7821o8576
$$ 26319 12166 69087 84005 119655 104290 53218 37035 53483 82896 88042 20221 -48355
15696d8355L1944L2408L5573o87n1400n4200K6949j3711K7907K1654L1962M298
$$ -48355 -16411 15997 51570 50883 -517 -54717 -27768 -41479 -13572 8082 40044 44342
15684D4342j8675k3937j1378k2740l4926j5133L7906k6529k286q815P3512O0248
$$ 44342 25667 1730 -9648 -32388 -67314 -82447 -44541 -71070 -73356 -82171 -8659 51589
15672E1589k3998m5116l8297J2027M3262o8549o538P1223J848l1828L6056N7939
$$ 51589 27591 -17525 -55822 -43795 -533 -69082 -75620 -4397 -2549 -34377 1679 59618
15660E9618l6370J6971J7511j0371m3874K0605P084m3701K780o751j3408m4438
$$ 59618 23248 40219 57730 47359 3485 24090 31174 -12527 -9747 -16498 -29906 -74344
15648g4344K0576k9517Q614M8331l4632k3662j483J3732N7509O2647L1626L0423
$$ -74344 -53768 -83285 -74671 -26340 -60972 -84634 -86117 -72385 -14876 47771 79397 109820
15636A09820P670m1134q4161m7818K6118p599k2829j1786J1034J2214M8864K1137
$$ 109820 117490 76356 -7805 -55623 -29505 -37104 -59933 -71719 -60685 -48471 393 21530
15624B1530q795k5204M028K0331M611l5425m3087l1139Q976N8616L3703K1539
$$ 21530 12735 -12469 -8441 11890 16501 -18924 -62011 -93150 -84174 -25558 8145 29684
15612B9684P482O8455k6561p0222n6801m3949o001K9281J7882K917n214M8023
$$ 29684 37166 105621 79060 8838 -47963 -91912 -97913 -68632 -50750 -47833 -53047 -5024
15600e024K9557L021K4362q578k8303J6645j4490J4242J3177l5678j9342M072
$$ -5024 24533 27554 51916 43338 15035 31680 17190 31432 44609 8931 -10411 -6339
15588f339k1564k644j128q0306J491j8608J4910O3574N5745M4024k7325q074j7213
$$ -6339 -27903 -30547 -31675 -111981 -110490 -129098 -114188 -50614 5131 49155 21830 13756 -3457
15575c457l9443k2848k3858P5806N3109P857m9286j8047J3658k4414O1294J5497
$$ -3457 -42900 -65748 -89606 -13800 39309 47166 -2120 -20167 -6509 -30923 30371 45868
15563D5868o0340O963O7317L1284l0762O317n1882n0914K991L890N5477L8081
$$ 45868 -14472 -7509 59808 91092 60330 66647 14765 -36149 -33158 -29268 26209 64290
15551F4290j7032l351J8303l4079n0752l6379N0583J8013M73k5303k2102L762
$$ 64290 47258 43907 62210 28131 -22621 -59000 -8417 9596 10069 -15234 -37336 -33574
15539c3574k9232j3664K4080l6407j8296P9486K9622M239l8545l8861K5161L2986
$$ -33574 -62806 -76470 -52390 -88797 -107093 -27607 2015 6254 -32291 -71152 -45991 -13005
15527a3005L124P96J7765K5474k6134m8825R560K2139M7157J787J2810j2677o5497
$$ -13005 -9881 -9085 8680 34154 8020 -40805 -31245 -9106 38051 39838 52648 39971 -25526
15514b5526r245L6106L7847k9935q0526j0667K4556J5250K9440N2354n139l1657
$$ -25526 -34771 1335 39182 9247 -71279 -81946 -57390 -42140 -12700 39654 34515 2858
15502B858K9189k7224K8455O4651j5720n7580j8456j4415J8156j8688p2226m2625
$$ 2858 32047 4823 33278 97929 82209 24629 6173 -8242 9914 -8774 -81000 -123625
15490a23625J5533M7326K8226L31J7187L488L4118J1726L4055R068K544m0479
$$ -123625 -108092 -60766 -32540 -32209 -15022 -11534 22584 34310 68365 77433 79977 39498
15478C9498j7738O403j5737m6827J032L4487L5365k3132j9826J5994j5062l8732
$$ 39498 21760 28163 12426 -34401 -33369 1118 36483 13351 -6475 9519 -5543 -44275
15466d4275L006K657n424j6012p2535O233K8252N6323N7277l788o2858r2598K1033
$$ -44275 -41269 -38612 -44036 -60048 -132583 -126350 -98098 -41775 15502 11714 -51144 -143742 -122709
15453a22709N8546M8101J4541L4151J423o4340m3092P211L3225j8445l2457j495
$$ -122709 -64163 -16062 -1521 32630 34053 -30287 -73379 -66168 -32943 -51388 -83845 -85340
15441h5340Q1784K8065J1616l9000k7964k6268J2204J0546M9985m0935n2623K0228
$$ -85340 -3556 24509 36125 -2875 -30839 -57107 -44903 -34357 15628 -25307 -77930 -57702
15429e7702R93R408J8367K6713n5038l9108N843O2129O5849K3217p3579o8892
$$ -57702 -56709 -47301 -28934 -2221 -57259 -96367 -90524 -28395 37454 60671 -12908 -81800
15417h1800j0564n624n0630L8982P7162o0388l6910O6658L7750L1824L0455k4132
$$ -81800 -92364 -97988 -148618 -109636 -32474 -92862 -129772 -63114 -25364 6460 36915 12783
15405A2783n3821N969L7870J328L3085J0068L575o2894k5349P3193P0505m2427
$$ 12783 -41038 -35069 2801 4129 37214 47282 50857 -12037 -37386 35807 106312 63885
15393F3885j20290K0303L3007K1395N6571l3692m4679k1214k4018q1123j9141
$$ 63885 -56405 -36102 -3095 18300 74871 41179 -3500 -24714 -48732 -129855 -148996
15382a48996J2307L6322r468o37K5224R0425M0547p7873o6097l601P6096P9626
$$ -148996 -136689 -100367 -109835 -110472 -85248 5177 45724 -32149 -98246 -101847 -25751 53875
15370E3875k5141k637J6610L2574k5488m1609j7868n9434k0199K3110J5171L298
$$ 53875 28734 26097 42707 75281 49793 8184 -9684 -69118 -89317 -66207 -51036 -47738
15358d7738K132o7631J2683M1085L6044L3666K740m3356P252J8715J1549j0660
$$ -47738 -45606 -113237 -100554 -59469 -23425 10241 12981 -30375 -23123 -4408 7141 -3519
15346c519L4512J3781m0852j0549l2410k0894M8892r462p5636P7959M8279J1396
$$ -3519 30993 44774 3922 -6627 -39037 -59931 -11039 -20501 -96137 -18178 30101 41497
15334D1497m8615m7878J5736j2881J3800j5393l736N3503K1264k4883l4691r499
$$ 41497 -7118 -54996 -39260 -52141 -38341 -53734 -57470 -3967 17297 -7586 -42277 -51776
15322e1776j0863M5495R415J759L7817L36l5484J5220L0658r671n3551N8433m5241
$$ -51776 -62639 -17144 -7729 -5970 31847 32183 -3301 11919 42577 32906 -20645 37788 -7453
15309g453j7168L5772J9467m4367K4890M0481k0586m5785L9896l6072L5757L8896
$$ -7453 -24621 11151 30618 -13749 11141 51622 31036 -14749 25147 -10925 24832 63728
15297F3728k8973p8092n4914l5082k4636J4002K117J857l5429M7119K8777j4280
$$ 63728 34755 -43337 -98251 -133333 -157969 -143967 -141850 -139993 -175422 -128303 -99526 -113806
15285a13806J5568J2090M0913M5367J12p0415k5965K5766m8307N8637j433N3159
$$ -113806 -98238 -86148 -45235 132 244 -70171 -96136 -70370 -118677 -60040 -61473 -8314
15273h314K2472K6412K0286k4344J0064Q805o7933l5272j3897n630L0937n578
$$ -8314 14158 40570 60856 36512 46576 55381 -12552 -47824 -61721 -67351 -36414 -41992
15261d1992k7017N5004k0102m9747j7995M1809L5858L4025P2073K912n6566p2815
$$ -41992 -69009 -14005 -34107 -83854 -101849 -60040 -24182 9843 81916 84828 28262 -44553
15249d4553l2360K9560J977O044L7790J09k90L3521q305K0484K9835K7624n7959
$$ -44553 -76913 -47353 -45376 -39332 -1542 -1433 -1723 31798 23493 43977 73812 101436 43477
15236D3477n3786o2999L888L1407O3950k8904j21729m5592J0009j5973O3724R187
$$ 43477 -10309 -73308 -69420 -38013 25937 -2967 -124696 -170288 -160279 -176252 -112528 -103341
15224a03341M3325K2857K2897j7709k7604Q658L6395M6449M6755Q289l8983l8089
$$ -103341 -60016 -37159 -14262 -31971 -59575 -50917 -14522 31927 78682 86971 47988 9899
15212I899j8161Q842J9997J5982j7367N422P845j9144k1950L1530M232m6282R867
$$ 9899 -8262 580 20577 36559 19192 24614 32459 13315 -8635 22895 27127 -19155 -9288
15199i288L9042p567L6356l2933J288r6561k8270Q0817L4281m4690o003j9045
$$ -9288 29754 22187 58543 25610 26898 -69663 -97933 -17116 17165 -27525 -33528 -52573
15187e2573l8242j8460O2504O6118j2892m8789j5880J9491J5059o804K5526L5648
$$ -52573 -90815 -109275 -46771 19347 6455 -42334 -58214 -38723 -23664 -30468 -4942 30706
15175C0706l0064l2792k9164N264L3821K4532J055K1132l4925k5418K9320M7087
$$ 30706 642 -32150 -61314 -56050 -22229 2303 3358 24490 -10435 -35853 -6533 40554
15163D0554m2n6049L6999J3696k4849M4720J0995K9126l8390m3722k6638K1639
$$ 40554 40512 -15537 21462 35158 10309 55029 66024 95150 56760 13038 -13600 8039
15151H039J0356l0286k2526J3924l710m5752L6702L4962J9132J8810J2252k0821
$$ 8039 18395 -11891 -34417 -20493 -24203 -69955 -33253 1709 20841 39651 51903 31082
15139C1082J1731k3304j04646l1041N8240j7710K1993K8135K1699R2P087J5752
$$ 31082 42813 19509 -85137 -116178 -57938 -75648 -53655 -25520 -3821 -3729 3358 19110
15127A9110P814q527L850L707j4583R284P7817l909j4876n4191k7372j8163K0675
$$ 19110 26924 18397 22247 25954 11371 20655 98472 94563 79687 25496 -1876 -20039 636
15114F36M8940K3088m590M292l7001k2404j7496l6167L6135l114N728L1690J9814
$$ 636 49576 72664 68074 72366 35365 12961 -4535 -40702 -4567 -7681 -1953 29737 49551
15101D9551k6676l417k5396o8589l1N2541K2104k6120L7639l0015r689l460K4719
$$ 49551 22875 19458 -5938 -74527 -74558 -22017 87 -26033 11606 -18409 -28098 -31558 -6839
15088f839J1581k1617n4341m895K5665k7253L111M0970L7031j1448K747O3988
$$ -6839 4742 -16875 -71216 -76111 -50446 -77699 -74588 -33618 3413 -8035 -5288 58700
15076E8700K5330J5488j0237j3777j007r606k3723j2212o1325k6633j7672P863
$$ 58700 84030 99518 89281 75504 74497 64891 41168 28956 -32369 -59002 -76674 -68811
15064f8811l8370J1245M4247M3879o424K1640r444N902J8141l4718J0141J3519
$$ -68811 -107181 -95936 -51689 -7810 -14234 7406 -2038 3864 22005 -12713 -2572 10947
15052A0947O353m679K058K767l2948j5357j0452m8194j3990L0674N6034j1705
$$ 10947 17300 12621 14679 17446 -15502 -30859 -41311 -89505 -103495 -72821 -16787 -28492
15040b8492J0948O895n0665J8210L5629L0668M4734r395l1593M6938o6498j6857
$$ -28492 -17544 -10649 -61314 -43104 -7475 23193 67927 58532 26939 73877 7379 -9478
15028i478n95M4563J6927l2569m2624J5204Q3599L0282m6516k4772m1638k5575
$$ -9478 -10073 34490 51417 18848 -23776 -8572 75027 105309 58793 34021 -7617 -33192
15016c3192n8099L0608N7047N1997l8828p4378o1169K8727P3055J6826o3694j2435
$$ -33192 -91291 -60683 -3636 48361 9533 -64845 -126014 -97287 -24232 -7406 -71100 -83535
15004h3535k0771o011J0543N4966k0947J3843N7426j7817n5912n8959J2809L6074
$$ -83535 -104306 -110317 -99774 -44808 -65755 -51912 5514 -12303 -68215 -127174 -114365 -78291
14992g8291Q4469K1286l8601j1120K5070N2944l6338l5949q406M6107K6680m9702
$$ -78291 6178 27464 -11137 -22257 2813 55757 19419 -16530 -24936 21171 47851 -1851
14980a851j7951J3839l1632l5448l0212j450N4450q303k6731N8250L6690M4794
$$ -1851 -19802 -5963 -37595 -73043 -103255 -104705 -50255 -58558 -85289 -27039 9651 54445
14968E4445J3069l5423n380O047N4091J5621P084n5317k5384J7105l0065j3614
$$ 54445 67514 32091 26711 32758 86849 102470 109554 54237 28853 45958 15893 2279
14956B279l6732l1061N3494L5794J0132K3373J5045K267m9172p7555o5297O6360
$$ 2279 -34453 -65514 -12020 23774 33906 57279 72324 74591 25419 -52136 -117433 -51073
14944e1073K3685j4152k059K5517J2673K8253L8102m7944j5607O1955j736j7603
$$ -51073 -27388 -41540 -43599 -18082 -5409 22844 60946 13002 -2605 59350 57614 40011
14932D0011k517M623k9556n3377K66K9275j7847j3310J0597M1944K7313L707J4205
$$ 40011 37494 42117 12561 -40816 -40550 -11275 -29122 -42432 -31835 10109 37422 41129 55334
14919E5334O4450r589k5560o4183p5738l6674M1274J0334K5061j1274L35k5341
$$ 55334 119784 110195 84635 20452 -55286 -91960 -50686 -40352 -15291 -26565 -26230 -51571
14907e1571m4239j7492K2921M5028K8594M6440N2460n6817k3532J9786k5672r462
$$ -51571 -95810 -113302 -90381 -45353 -16759 29681 82141 25324 1792 21578 -4094 -13556
14895a3556q4650k3171P8196J4113l2469l3772P99R4426l5156p4027M2961O0314
$$ -13556 -98206 -121377 -43181 -29068 -61537 -95309 -94510 -84 -35240 -109267 -66306 -5992
14883e992K078O7317M1462j04148m0960M125O942j1803M309j1767P0763k3907
$$ -5992 -3914 63403 104865 717 -40243 -36118 -29176 -40979 -36670 -48437 22326 -1581
14871a581J4510k587l1121m2480P7027Q099m1513M900L2215k824m657L3109K1669
$$ -1581 12929 10342 -20779 -63259 13768 21867 -19646 -14746 17469 14645 9988 43097 64766
14858F4766m0592m0713p1854k1444L9827L3441J9888l313m5225n1269j0978k328
$$ 64766 24174 -16539 -88393 -109837 -70010 -36569 -16681 -19994 -65219 -116488 -127466 -129794
14846a29794k0584L7491O5476q370k5886K0796J2334l461J4017l1852K0085M7583
$$ -129794 -150378 -112887 -47411 -55781 -81667 -60871 -48537 -51998 -37981 -69833 -49748 -2165
14834b165N0455j8844n2355J4622M0373p0819k0723K1559K7934m137J5309n5131
$$ -2165 48290 29446 -22909 -8287 32086 -38733 -59456 -37897 -9963 -14100 1209 -53922
14822e3922L6768L5579J5428l3181n394L2502k1935r0850J6426N0552P6358N142
$$ -53922 -17154 18425 33853 672 -4722 27780 5845 -85005 -68579 -18027 58331 63473
14810F3473k8734l567q634l2276J737K7828j8656k1366M0183L0908l2843n7922
$$ 63473 34739 31172 22538 -9738 -8001 19827 1171 -20195 19988 50896 18053 -39869
14798c9869N8241L8229K568j1904n3774L7860l632k011k5245k7981k3571k9971
$$ -39869 18372 56601 59169 47265 -6509 31351 27719 25708 463 -27518 -51089 -81060
14786h1060m8441O1972J9941j9071q034j8583J5913k5112l532j431K9362N2936
$$ -81060 -129501 -67529 -47588 -66659 -74693 -93276 -77363 -102475 -106007 -107438 -78076 -25140
14774b5140J6019O4369k4181P594J2533n7101J9561k2083m2546p869J3627j3525
$$ -25140 -9121 55248 31067 38661 51194 -5907 13654 -8429 -50975 -58844 -45217 -58742
14762e8742L9784m9525k8715J3227q946k5459j9790J3457L8596M4152Q2931j1715
$$ -58742 -18958 -68483 -97198 -83971 -92917 -118376 -138166 -124709 -86113 -41961 40970 29255
14750B9255l5785j0095k1996K1232J18P3300O626o3908l0979j685L3174J798j1183
$$ 29255 -6530 -16625 -38621 -17389 -17271 56029 62655 -1253 -32232 -33917 -743 1055 -10128
14737a0128m6313o649O7142L9995o9136K1795L3660p2689m8926K1856k2550q217
$$ -10128 -56441 -63090 4052 44047 -25089 -3294 30366 -42323 -91249 -69393 -91943 -100160
14725a00160O4698N9404R456j5020o9733k5628J0276J7146J8594p667J6410j5124
$$ -100160 -35462 23942 33398 18378 -51355 -76983 -66707 -49561 -30967 -38634 -22224 -37348
14713c7348M7658L537J2590k4222l2731k068L0796k6097l288j4930j2047k5057
$$ -37348 10310 13847 26437 2215 -30516 -32584 -1788 -27885 -31173 -46103 -58150 -83207
14701h3207L73R19j522M6752k1486k1216J9475p311N030N0682O0351j4184m3471
$$ -83207 -82834 -81915 -83437 -36685 -58171 -79387 -59912 -67223 -62193 -11511 48840 34656 -8815
14688h815k4136r770L632O7653K5674L9287o1855l5225M2135k1912j2871K1160
$$ -8815 -32951 -42721 -39089 28564 54238 93525 31670 -3555 38580 16668 3797 24957
14676B4957p5599J7422o794j3407M4772J3506p3226O4639m725n6906L3245K1294
$$ 24957 -50642 -33220 -40014 -53421 -8649 4857 -68369 -3730 -8455 -65361 -32116 -10822
14664a0822L8715O5121k2403K3275m4540n3454K6492Q190j2774j6401j0856k1521
$$ -10822 27893 93014 70611 93886 49346 -4108 22384 30574 17800 1399 -9457 -30978
14652c0978k5476P4k7636m8810n831J7467j3748Q950P3572M3973M1590k5154k0147
$$ -30978 -56454 -56380 -84016 -132826 -138657 -121190 -134938 -125988 -52416 -8443 33147 7993 -12154
14639a2154j4257k7554L238K9509n5863n5563M343Q3668Q3024j9027p3637L3688
$$ -12154 -26411 -53965 -50727 -21218 -77081 -132644 -128301 -44633 38391 19364 -54273 -20585
14627b0585L1960L8596j9740l5336o6146j1642J4472L591N573N563J0481M5909
$$ -20585 11375 49971 30231 -5105 -71251 -82893 -68421 -64830 -59257 -53694 -43213 2696
14615B696n167l8296J662P217N5893M0135m1055j6077Q224l1995m5287n6644J665
$$ 2696 -2471 -40767 -39105 -31888 24005 64140 23085 7008 15232 -16763 -62050 -118694 -117029
14602a17029j442K0589R0185J5617m6242m5883L1032j5153p14N7092k3748j9801
$$ -117029 -118471 -97882 -7697 7920 -38322 -84205 -53173 -68326 -69040 -11948 -35696 -55497
14590e5497m4630o150J7620P0189O2424q333o4670N0494Q8057m8533p1878N4021
$$ -55497 -100127 -106277 -88657 -18468 43956 35623 -29047 21447 109504 60971 -10907 43114
14578D3114o729j6865j2364r21r4790n5381K2724n322N7052M3921m5045m9567
$$ 43114 36385 19520 7156 6235 -88555 -143936 -121212 -126534 -69482 -25561 -70606 -120173
14566a20173M1917N5586L695l5625j5170J4002J8307K8369k6581O303j8147N498
$$ -120173 -78256 -22670 -18975 -54600 -69770 -55768 -37461 -9092 -35673 -29370 -47517 -42019
14554d2019K2232L7697k9332q704P330O9781R217q6660l7347p431m1969Q8357
$$ -42019 -19787 17910 -11422 -20126 -12796 56985 66202 -20458 -57805 -65236 -107205 -18848
14542a8848M6958j5107p1554l89L8534l8506L331K604p422k2185K7687L1968L3019
$$ -18848 28110 13003 -58551 -58940 -20406 -58912 -55581 -52977 -60399 -82584 -54897 -22929 10090
14529A0090K249l9809J7099M5295L1215n4294p2785J0221P1054j2064j1523Q912
$$ 10090 12339 -27470 -10371 34924 66139 11845 -60940 -50719 20335 8271 -3252 5660
14517E660l28M0910k5217M162P48J3363J9290K9327L8094m4306o0796J8938K6560
$$ 5660 5332 46242 21025 25187 25935 39298 58588 87915 126009 81703 20907 39845 66405
14504F6405l3882l5963N6190J0692K223p8509j6797M8119j3828K4149Q2996R598
$$ 66405 32523 -3440 52750 63442 65665 -12844 -29641 18478 4650 28799 111795 121393
14492A21393l5291K657q3463j0732k017l1317n4148K6255O2691o971J7933K433
$$ 121393 86102 88759 5296 -5436 -7453 -38770 -92918 -66663 -3972 -10943 6990 9423
14480I423k0008m4904k5376K4312L5992R360j2241l5068M896N0808k2908J0434
$$ 9423 -10585 -55489 -80865 -56553 -20561 -11201 -23442 -58510 -53614 -2806 -25714 -15280
14468a5280r089k8122j0636n068K4688N4811L6480l7711l422q827j1285k5004
$$ -15280 -24369 -52491 -63127 -68195 -43507 11304 47784 10073 6651 -2176 -13461 -38465
14456c8465M368J3678m1141k893K1370J7323n9692m7551M3675K5806M01j9399
$$ -38465 -34097 -20419 -61560 -64453 -43083 -25760 -85452 -133003 -89328 -63522 -63121 -82520
14444h2520l3347L0622O5439J523L820R6541r076q4135m5167J56L6876J5865p264
$$ -82520 -115867 -85245 -19806 -18283 -14463 82078 73002 -11133 -56300 -56144 -19268 -3403 -10667
14431a0667O0386J3684j5216k7095p7305J8822k4996l2861k850K989J0713L7694
$$ -10667 49719 63403 48187 21092 -56213 -37391 -62387 -95248 -98098 -95109 -84396 -46702
14419d6702N3163K0189J7999m6986l8275M1900J1j2848j0392N9151N1245n3238
$$ -46702 6461 26650 44649 -2337 -40612 1288 1299 -11549 -21941 37210 88455 35217
14407C5217p8062J5254j128L6748N8646j4137n1066j694m8362j56l1557j1085
$$ 35217 -42845 -27591 -28719 8029 66675 52538 1472 -222 -48584 -48740 -80297 -91382
14395i1382P306R0765j8549n0591J1336J6349k5574K2030J1042J1733k808J8432
$$ -91382 -84076 6689 -11860 -62451 -51115 -34766 -60340 -38310 -27268 -15535 -18343 89
14383H9M8528l1993l4976j6718L2234K1786k4283K0848o423j9101n5230L4636
$$ 89 48617 16624 -18352 -35070 -2836 18950 -5333 15515 9092 -10009 -65239 -30603
14371c0603k850j9387o907L2696K8124j0125o8406J8252K6037J7378J6048N4302
$$ -30603 -33453 -52840 -59747 -27051 1073 -9052 -77458 -59206 -33169 -15791 257 54559
14359E4559J1300l6181l1452j8363q909J6654O398J957j2275p291P3345j635k7779
$$ 54559 65859 29678 -1774 -20137 -29046 -12392 -5994 -4037 -16312 -23603 49742 48107 20328
14346B0328n166k1347J2404l4188l4049K8863N8660K0266n509r982p76m3646K2334
$$ 20328 15162 -6185 6219 -27969 -62018 -33155 25505 45771 40262 30280 29504 -14142 8192
14333H192N9090L1249l7066k7247q087o2193K8437l1562L645N3922k9389k2655
$$ 8192 67282 98531 61465 34218 26131 -36062 -7625 -39187 -35542 18380 -11009 -33664
14321c3664j8652k6797j3614M9663L1339N7539M7610K6105o3581p5306L2641L7372
$$ -33664 -52316 -79113 -92727 -43064 -11725 45814 93424 119529 55948 -19358 13283 50655
14309E0655L9784l6765j0484j636m6648J7634k4099k3637n7334l4532R054j0259
$$ 50655 90439 53674 43190 41554 -5094 12540 -11559 -35196 -92530 -127062 -118008 -128267
14297a28267M8616N1215L5078j6416m0249M5032N860l4705R934K1566j3712L9575
$$ -128267 -79651 -28436 6642 -9774 -50023 -4991 869 -33836 -23902 -2336 -16048 23527
14285B3527J6172j3294l7793l2863j0613M3457Q269n6885J6486K6270k1820J1713
$$ 23527 39699 26405 -11388 -44251 -54864 -11407 -3138 -60023 -43537 -17267 -39087 -27374
14273b7374M987k308q1309k82K4403N4085L4988j5074J0103N997l830m5112j2678
$$ -27374 -22387 -24695 -106004 -106286 -81883 -27798 7190 -7884 2219 8216 4386 -40726 -53404
14260e3404J8452j0266J0841k8798m6419M440K4378J0219O1846O0811J036k5138
$$ -53404 -34952 -45218 -34377 -63175 -109594 -105154 -80776 -70557 -8711 52100 53136 27998
14248B7998m205j3716J7494O2176k1647o5681N884L7221m1132k9200j3528N2731
$$ 27998 23793 10077 27571 89747 68100 2419 8303 45524 4392 -24808 -38336 14395
14236A4395J13217L8272o5020j3723N346k6768l4699L1711l3078o6452n8890O1583
$$ 14395 127612 165884 100864 87141 92487 65719 31020 62731 29653 -36799 -95689 -34106
14224c4106o07m4651j8338J6505M0950M9660L5078n6006l7016l2608N0385M7005
$$ -34106 -34713 -79364 -97702 -81197 -40247 9413 44491 -11515 -48531 -81139 -30754 16251
14212A6251J0487J3452k5186l9860l5493n0672K6688L4846J4642n866k549o2078
$$ 16251 26738 40190 15004 -24856 -60349 -111021 -84333 -49487 -34845 -40711 -43260 -105338
14200a05338K8616M4461N62n0045k7697O6309J9841l3716n2493j7558P5586J9972
$$ -105338 -76722 -32261 -31699 -81744 -109441 -43132 -23291 -57007 -109500 -127058 -51472 -31500
14188c1500r586n033K258o0882o6302N7678N1472K8525J357N4798K7612l6636
$$ -31500 -41086 -46119 -43861 -104743 -171045 -113367 -61895 -33370 -32013 22785 50397 13761
14176A3761n1935J0164J9657k740l8781n505M2405k8135L5363O5996K8381k3273
$$ 13761 -38174 -28010 -8353 -11093 -49874 -55379 -12974 -41109 -5746 60250 88631 65358
14164F5358n954l1066m5714m4599K5135m3745L3114N2376J3540N16m1218j0327
$$ 65358 59404 28338 -17376 -61975 -36840 -80585 -47471 4905 18445 18961 -22257 -32584
14152c2584j2248m7582j7493K1041j2639L1801O7718J3737K6729L6642L1391M090
$$ -32584 -44832 -92414 -109907 -88866 -101505 -69704 -1986 11751 38480 75122 106513 110603
14140A10603J0421r7189n4557m119N5120k0727o701P797r885l3429l584R869l6712
$$ 110603 121024 23835 -30722 -34841 20279 -448 -7149 648 -9237 -42666 -46250 -36381 -73093
14127g3093l4244k7743K2440L3636J7864M4808n937M796J1326K8019K4588j2830
$$ -73093 -107337 -135080 -112640 -79004 -61140 -16332 -22269 -17473 -6147 21872 46460 33630
14115C3630n5019l2233l2038l2341L0711O4994j7068O853J986J2935j8096L2539
$$ 33630 -21389 -53622 -85660 -118001 -87290 -22296 -39364 -32511 -30525 -17590 -35686 -3147
14103c147l3768K0811M7r5284L7165L8437J7079N7445K7044r787j6832J5646l4574
$$ -3147 -36915 -16104 -16057 -111341 -74176 -35739 -18660 38785 65829 56042 39210 54856 20282
14090B0282m4754K3562O1101L4517k0023j5q346o0916N101J6116O252R734O7722
$$ 20282 -24472 -910 60191 94708 74685 74670 66324 5408 10509 26625 32877 42611 110333
14077A10333M7227j6893r0198n8290m7637j9491K0797K5716O0019k1197o5590
$$ 110333 157560 140667 50469 -7821 -55458 -74949 -54152 -28436 31583 10386 -55204
14066e5204J5402j739M4570n9577l6524L1992k1103l5085K4161K1074J4833P271
$$ -55204 -39802 -41541 3029 -56548 -93072 -61080 -82183 -117268 -93107 -72033 -57200 -49929
14054d9929K7881J6844k8348k8724L4561M6109J3744n518m8638m7506L2052J6467
$$ -49929 -22048 -5204 -33552 -62276 -27715 18394 32138 26620 -22018 -69524 -37472 -21005
14042b1005m4206L2232k530N9124J5413m1853q571K495o304K3678l7970n46J6035
$$ -21005 -65211 -32979 -35509 23615 39028 -2825 -11396 -8901 -15205 8473 -29497 -30043 -14008
14029a4008j6878p338m4000M2799O4856O717m4201n3688n2086J8454O4086M790
$$ -14008 -30886 -38224 -82224 -39425 25431 32148 -12053 -65741 -117827 -99373 -35287 -30497
14017c0497M119O475o9231K6162Q802K7278J4140o540j9767j3671K3406K1465
$$ -30497 -26378 -19903 -89134 -62972 -54170 -26892 -12752 -19292 -39059 -52730 -29324 -7859
14005g859R470n8769L4771M7763n632m470m1061m5721Q6366L8649q467k3321n7223
$$ -7859 1611 -57158 -22387 25376 19744 15274 -25787 -71508 14858 53507 45040 21719 -35504
13992c5504j3297k2792k434K5638m332j2432J1940k1675o1446P57L4470j0183
$$ -35504 -48801 -71593 -74027 -48389 -52721 -65153 -53213 -74888 -136334 -135577 -101107 -111290
13980a11290L9449k1861L875J0833J052l6019k310Q1489p530r42j9618J2473o165
$$ -111290 -71841 -93702 -89827 -78994 -77942 -113961 -116271 -34782 -42312 -43254 -62872 -50399 -56564
13967e6564M6696l5281o4630j5216N4335M2904J6206q99K6924L2967j376m304
$$ -56564 -9868 -45149 -109779 -124995 -70660 -27756 -11550 -12449 14475 47442 46066 41762
13955D1762l9704k2201M4499J469J3277n6169j8335K6773J0560K620J9585k3891
$$ 41762 2058 -20143 24356 25825 39102 -17067 -35402 -8629 1931 4551 24136 245
13943B45l7888o3219n9283P5395P4675l7175q903N2301L9224l2920r004l7033
$$ 245 -37643 -100862 -160145 -84750 -10075 -47250 -56153 -3852 35372 2452 -6552 -43585
13931d3585J2737L5696k0830J4765n246L6938p4838j9615L9850J8847j9570j8727
$$ -43585 -30848 4848 -15982 -1217 -6463 30475 -44363 -63978 -24128 -5281 -24851 -43578
13919d3578K2511L7917K2733R765l7003K10r6456m5891M5918M7326l3747j2752
$$ -43578 -21067 16850 39583 49348 12345 12555 -83901 -129792 -83874 -36548 -70295 -83047
13907h3047N9331K9967J568m4606n177M9M805n060K989L4230l0257l3589L2812
$$ -83047 -23716 6251 7819 -36787 -41964 -41915 -37110 -42170 -39181 -4951 -35208 -68797 -35985
13894c5985Q367N1930K7497J490K4424J1024m5350n4483k3284N9343M8394k3994
$$ -35985 -27618 24312 51809 53299 77723 88747 43397 -11086 -34370 24973 73367 49373
13882D9373q3324R367P2856m1601q8031m3178j4559K8914O7826P249N8180k643
$$ 49373 -33951 -24584 48272 6671 -81360 -124538 -139097 -110183 -42357 -35108 23072 20429
13870B0429R425n3131j7224K6634k196J7797J2748O7979k4585n2160n1583L856
$$ 20429 29854 -23277 -40501 -13867 -16063 1734 14482 82461 57876 5716 -45867 -42011
13858d2011M2261K7557J2578K1886l8100J3905l0178k3228J5317m331O853q097
$$ -42011 250 27807 40385 62271 24171 38076 7898 -15330 -13 -4344 2509 -5588
13846e588k6797o0302L676K3997m0063j1282P1123O2629J15k3915M756J5517m546
$$ -5588 -32385 -92687 -89011 -65014 -105077 -116359 -45236 17393 17508 -6407 -1651 13866 9320
13833I320K1040k376J5419m2604j04699l9774J9269P3598J4459m6849O5365P2168
$$ 9320 30360 27984 43403 799 -103900 -143674 -124405 -50807 -36348 -83197 -17832 54336
13821E4336j4747J933j5053j7665p4782m3103P1208N7904l4512o17K7711L143
$$ 54336 39589 41522 26469 8804 -65978 -109081 -37873 20031 -14481 -15098 12613 15756
13809A5756j06j5650r802l498k3958J9737J0263M162k4915L6790j1755j5277L366
$$ 15756 15650 0 -9802 -13300 -37258 -17521 -7258 -3096 -28011 8779 -2976 -18253 -14887
13796a4887m5540k8329q007J5064j667l3953J5429p23J4950J4455L9857L6162
$$ -14887 -60427 -88756 -96763 -81699 -83366 -117319 -101890 -102613 -87663 -73208 -33351 2811
13784B811q5322k4201m8472j1560O9259N4441J410p973k8335l297k5268P667L5752
$$ 2811 -82511 -106712 -155184 -166744 -97485 -43044 -41634 -49607 -77942 -81239 -106507 -98840 -63088
13771f3088L0904K089L2341m765q480K8556J9797m6978o5115K1919L9389K3702
$$ -63088 -32184 -30095 2246 -2519 -10999 17557 37354 -9624 -74739 -52820 -13431 10271
13759A0271K093P033m7363P613k0368k3K808j5660J5498J5693J3295q483j9115
$$ 10271 12364 19397 -27966 -20353 -40721 -40744 -37936 -53596 -38098 -22405 -9110 -17593 -36708
13746c6708L0069m221j7786k2995O689N3757k0134j7006j3524l0324q108L0968
$$ -36708 -6639 -10860 -28646 -51641 -44952 8805 -11329 -28335 -41859 -72183 -80291 -49323
13734d9323N7752K5285m9765j0084l54J8784k05K2322K7775o0633k3099N5884
$$ -49323 8429 33714 -16051 -26135 -26489 -7705 -7910 14412 42187 -18446 -41545 14339
13722A4339J3156L8862l6463l1798o1j4121L4574j2975k2504K0978K6136m6856
$$ 14339 27495 66357 29894 -1904 -1965 -16086 18488 5513 -16991 3987 30123 -16733
13710a6733q310k3281N97m4090P563J5529l5326J377K2264J7575l6463L4321K8033
$$ -16733 -25043 -48324 -47727 -91817 -84254 -68725 -104051 -102674 -80410 -62835 -99298 -64977 -36944
13697c6944m953J1138J3308Q550k9312j776k9221M6134O7749Q640o621k9495M909
$$ -36944 -41897 -30759 -17451 -8901 -38213 -39989 -69210 -23076 44673 53313 46692 17197 22106
13684B2106n7005o7326r842k1671L1578K6029Q0246R1572m6513M226j1565j46
$$ 22106 -34899 -102225 -112067 -133738 -102160 -76131 4115 95687 49174 53400 41835 41689
13672D1689K581o453L2233J9154K8587K6893l1981l0815n0937k3877m8742K1429
$$ 41689 44270 37817 70050 89204 117791 144684 112703 81888 30951 7074 -41668 -20239
13660b0239M855O172j2619j7302l801k7242R716N0517k9806K8346Q858j2283r530
$$ -20239 -15384 -9212 -21831 -39133 -42934 -70176 -60460 -9943 -39749 -11403 -2545 -14828 -24358
13647b4358M1809K3135k2975R685j3070p554k4735k6111K905j6143M7707O368
$$ -24358 17451 40586 17611 27296 14226 6672 -18063 -44174 -41269 -57412 -9705 -3337
13635c337J7367J05844L6329l7913Q646j9850L5120k3877p3899r4739n38N1386
$$ -3337 14030 119874 156203 118290 126936 107086 142206 118329 44430 -50309 -50847 539
13623E39k3780j9036K2421K2628j8746K951K6568K566m137N7162J3061o8339k6360
$$ 539 -23241 -42277 -19856 2772 -15974 -13023 13545 16111 11974 69136 82197 13858 -12502
13610a2502k480Q989k3344n7718N2779J0875L3917n7546o398m422J4653L8104
$$ -12502 -14982 -5993 -29337 -87055 -34276 -23401 10516 -47030 -53428 -57850 -43197 -5093
13598e093J9027K861q437N539k3091J2913J4069r840n0653j5354l965n4842p870
$$ -5093 13934 16795 8358 13897 -9194 3719 17788 7948 -42705 -58059 -62024 -116866 -124736
13585a24736N6244k5089M662J363k7802O806K7843Q7356O529p54L0143j506r3752
$$ -124736 -68492 -93581 -88919 -87556 -115358 -108552 -80709 6647 13176 12422 42565 41059 -52693
13572e2693n0793j3538n5685O4494N1632Q897o2681k4982m140M1723K9098m9292
$$ -52693 -103486 -117024 -172709 -108215 -56583 -47686 -110367 -135349 -139489 -97766 -68668 -117960
13560a17960L0817M6528K9986K9395J3169N2047J1282o5377j7307N234k8736k02
$$ -117960 -87143 -40615 -10629 18766 31935 83982 95264 29887 12580 17814 -10922 -11124
13548a1124Q191J7596L2631k8311j3474q002O313l8212L0J2167m4935K1683O3398
$$ -11124 -2933 14663 47294 18983 5509 -2493 3820 -34392 -34362 -22195 -67130 -45447 17951
13535A7951J1305l1233o3119j1048K0853O1253M6796j7897j5792R121q730j2030
$$ 17951 29256 -1977 -65096 -76144 -55291 5962 52758 34861 19069 28190 19460 7430
13523G430k2117n2241j1081P985J5967M3981L5829j6487l0883o7791J6546K2672
$$ 7430 -14687 -66928 -78009 -70024 -54057 -10076 25753 9266 -21617 -89408 -72862 -50190
13511e0190O2136m2161K5987L1979L2733N607q5768j2083N452J5161P066Q13L8930
$$ -50190 11946 -30215 -4228 27751 60484 66091 -19677 -31760 -26308 -11147 -4081 -3268 35662
13498C5662Q0695n637j6350j2057J6022n4924m4318p0431j9225o641L0002O6131
$$ 35662 116357 110720 94370 82313 98335 43411 -907 -71338 -90563 -97204 -67202 -1071
13486a071O2378k2119m7940j1309o001n5732l147k6785p247m4787O6535P6202
$$ -1071 61307 39188 -8752 -20061 -26062 -81794 -84941 -111726 -118973 -163760 -97225 -21023
13474b1023M4603l8181q2145j9170J5419J8433K7808n3499R407J7856l5255k9101
$$ -21023 23580 -14601 -96746 -115916 -100497 -82064 -54256 -107755 -98348 -80492 -115747 -144848
13462a44848P3209J18303L5637k6531n2430l1694K4765J3742k8531J4132j6848
$$ -144848 -71639 46664 82301 55770 3340 -28354 -3589 10153 -18378 -4246 -21094
13451b1094n0193j425J3745K8851k1055j9120j4187O2180M1559J430k8433K75
$$ -21094 -71287 -72712 -58967 -30116 -51171 -70291 -84478 -22298 19261 20691 -7742 -7467
13439g467l1331n1088L1731R617k9776j3474J7323j8592j209P341O02l479n6686
$$ -7467 -38798 -89886 -58155 -48538 -78314 -91788 -74465 -93057 -94266 -86925 -86323 -89802 -146488
13426a46488j5258N660J7727N3918R709o0322J1173P2048Q3335J1383n087o8137
$$ -146488 -161746 -156086 -138359 -84441 -74732 -135054 -123881 -51833 31502 42885 37798 -30339
13414c0339Q237L5283m890j0756J8979m7284l8123M116J3101L4566L4490K6175
$$ -30339 -22102 13181 8291 -2465 16514 -30770 -68893 -64777 -51676 -17110 17380 43555
13402D3555N224n0383L4341J2579m4946l4291o2668k812J2397L4670M5082k7005
$$ 43555 48779 -1604 32737 45316 370 -33921 -96589 -99401 -87004 -52334 -7252 -34257
13390c4257K410r405J881j2083M299l588j3686O3058R775m7681q559R6289L4981
$$ -34257 -31847 -41252 -39371 -51454 -47155 -50743 -64429 -1371 8404 -39277 -47836 48453 83434
13377H3434j0697J9489l7729O482P322P611p369j3678j7665j9712l9693j0215
$$ 83434 72737 92226 54497 60979 68301 75912 68543 54865 37200 17488 -22205 -32420
13365c2420L3329p54m3115n5062K6511k4722K3406O0603l410j5947j0266M4622
$$ -32420 909 155 -42960 -98022 -71511 -96233 -72827 -12224 -15634 -31581 -41847 2775
13353B775R34k2724M0085K6646n5092k4512o022K6443k6069L4810L2378k0514
$$ 2775 3709 -19015 21070 47716 -7376 -31888 -37910 -11467 -37536 -2726 29652 9138
13341I138m1366l6675J1301L9534J9933N5973L919K0745n3161l7199j4916j4056
$$ 9138 -32228 -68903 -57602 -18068 1865 57838 61757 82502 29341 -7858 -22774 -36830
13329c6830O8796N5549n1040q1638m2766J5031Q2159M5810k1896l2931K1083M1885
$$ -36830 31966 87515 36475 -45163 -87929 -72898 9261 55071 33175 244 21327 63212
13317F3212L6564J4762o4009q2425j7428l1636j2919J5685K8058o24J2062l6419
$$ 63212 99776 114538 50529 -31896 -49324 -80960 -93879 -78194 -50136 -50760 -38698 -75117
13305g5117Q847K1406q0043m079N7198M7784k1483M1784M3175K0157q3294k0714
$$ -75117 -66270 -44864 -124907 -128986 -71788 -24004 -45487 -3703 39472 59629 -23665 -44379
13293d4379Q8397J4083j9671J6892l8886j8584j0551k526k2666l5437k0337K1308
$$ -44379 44018 58101 38430 55322 16436 -2148 -12699 -15225 -37891 -73328 -93665 -72357
13281g2357j4194k013J0236P040N5811O5218n0041k6702P31J4025J7224m6333
$$ -72357 -86551 -88564 -78328 -71288 -15477 49741 -300 -27002 -26271 -12246 4978 -41355
13269d1355j7277J8893J0362P399p5984q2798L0438M8574O1730J8516k2902K7517
$$ -41355 -58632 -39739 -29377 -21978 -97962 -180760 -150322 -101748 -40018 -21502 -44404 -16887
13257a6887M3360j2047j6395K2078p1101l050P655q9951k3884L1996P0994M9590
$$ -16887 26473 14426 -1969 20109 -50992 -54042 -46387 -136338 -160222 -128226 -57232 -7642
13245g642M1552j9308o7340M7443L2919j8891j0173N1155L834n2902n3308j0928
$$ -7642 33910 14602 -52738 -5295 27624 8733 -1440 49715 53549 647 -52661 -63589
13233f3589n4920k9788J9431M1691J1892j4053k1492K6490M4327N1171k384k1141
$$ -63589 -118509 -148297 -128866 -87175 -75283 -89336 -110828 -84338 -40011 11160 8776 -12365
13221a2365j3720j6942r754M1043j6180j3901j9459J2333J9850J8910k3483L957
$$ -12365 -26085 -43027 -52781 -11738 -27918 -41819 -61278 -48945 -29095 -10185 -33668 -29711
13209b9711p561n5559n052O6428q398N601M4348l3095j2217l0197M7247k6534
$$ -29711 -37272 -92831 -97883 -31455 -39853 -34252 10096 -22999 -35216 -65413 -18166 -44700
13197d4700m4801L4468K4466K8701O0395K2728l9341j0045M5123K9110j3456r13
$$ -44700 -89501 -55033 -30567 -1866 58529 81257 41916 31871 76994 106104 92648 91735
13185I1735k8226m6470j1023J8670k2741j1105n367L1048J0538m858l379L5070
$$ 91735 63509 17039 6016 24686 1945 -9160 -14527 16521 27059 22201 18822 53892
13173E3892J7301m654m1885k7527J3302k4253P239M5099J874l1542n9748q384
$$ 53892 71193 66539 24654 -2873 10429 -13824 -6585 38514 40388 8846 -50902 -59286
13161e9286m78J2166r161k7686m7332l2129L4332J6909l1460M5051N8224L8387
$$ -59286 -59764 -47598 -56759 -84445 -131777 -163906 -129574 -112665 -144125 -99074 -40850 -2463
13149b463n41K7482Q311n3847O6518O6645r994n6132l6450m7920K8033N1798O6004
$$ -2463 -3004 24478 32789 -21058 45460 112105 102111 45979 9529 -38391 -10358 41440 107444
13136A07444J9523q453o1350o0786L8691N1550l6038k2046n7918j8359l0556N3592
$$ 107444 126967 118514 57164 -3622 35069 86619 50581 28535 -29383 -47742 -78298 -24706
13124b4706m8515k4418k9338J1133N4675L2288R5304K1832l5388n5168j9543M1095
$$ -24706 -73221 -97639 -126977 -115844 -61169 -28881 66423 88255 52867 -2301 -21844 19251
13112A9251j1810p5265n193L3507J4762K4132L2989k6951m1909n624L9868L9271
$$ 19251 7441 -67824 -73017 -39510 -24748 -616 32373 5422 -36487 -42111 -2243 37028
13100C7028k8034m8411n9308m4165N3692J23709j3459l2118L0267L0832l9141
$$ 37028 8994 -39417 -98725 -142890 -89198 34511 21052 -11066 19201 50033 10892
13089A0892L6081j7923J3858n7369m4001m581p7361J9358N5679K3585O6019O6794
$$ 10892 46973 29050 42908 -14461 -58462 -63043 -140404 -121046 -65367 -41782 24237 91031
13077I1031j208j1515l6000o7086J2442n3686k6714j7121j8249J5995L6601J8829
$$ 91031 89823 78308 42308 -24778 -12336 -66022 -92736 -109857 -128106 -112111 -75510 -56681
13065e6681K3826N4097M5358O8602k0727j09610n1828l8464K8678L1171k0948
$$ -56681 -32855 21242 66600 135202 114475 4865 -46963 -85427 -56749 -25578 -46526
13054d6526R422L7952J8687o5489k3416J263k2543L6110K4493l7809n09N6611
$$ -46526 -37104 848 19535 -45954 -69370 -68107 -90650 -54540 -30047 -67856 -68365 -11754
13042a1754L019K0077M3700m938m551m2249m6766k5555J5159O2824m3778m5973
$$ -11754 -8735 11342 55042 50104 45553 3304 -43462 -69017 -53858 8966 -34812 -80785
13030h0785M707j6227O169O0496r765J1603J2781J2886J828o473J1236q0K1907
$$ -80785 -76078 -92305 -86136 -25640 -35405 -23802 -11021 1865 3693 -2780 8456 8376 30283
13017C0283k5094L1808M0971j1383J1937n1841r7862j5285L6061o736K8667J3442
$$ 30283 5189 36997 77968 66585 78522 26681 -71181 -86466 -50405 -57141 -28474 -15032
13005a5032J5507l0788K5772k3659l2944O111P1584p46l2442n708q312j8841J9020
$$ -15032 475 -30313 -4541 -28200 -61144 -55033 16551 15805 -16637 -22345 -30657 -49498 -30478
12992c0478k7531J13658P5128p1543l7894j3927l5475P246J2168l2025q524k0467
$$ -30478 -58009 55649 130777 59234 21340 7413 -28062 -20816 -8648 -40673 -49197 -69664
12980f9664m782K2674O1066P658R642l0087J5160Q02j3548j8815r68K822K3308
$$ -69664 -74446 -51772 9294 16952 26594 -3493 11667 12469 -1079 -19894 -20862 -18040 5268
12967E268O20q296m1748l5196k0075J5103l973P4419P1025j8975J871n073m5130
$$ 5268 5888 -2408 -44156 -79352 -99427 -84324 -88297 -13878 57147 38172 40043 34970 -10160
12954a0160l6612k0123p902j5025J8752J5506L4391M4324Q089j573K563L6943
$$ -10160 -46772 -66895 -74797 -89822 -71070 -55564 -21173 23151 31240 29667 32230 69173
12942F9173n588m9830l2002J5119J1607J653j9689m918L257j6542m1110k9250
$$ 69173 63585 13755 -18247 -3128 8479 10132 -9557 -14475 -11218 -27760 -68870 -98120
12930i8120Q73j2684K1057k5892n1904J0001R0369J7914k519L947J6582l0049
$$ -98120 -97247 -109931 -88874 -114766 -166670 -156669 -66300 -48386 -50905 -46958 -30376 -60425
12918f0425L0955L2476q6130l5579O3146j5995O898O671M398J3603N8614p803
$$ -60425 -29470 3006 -83124 -118703 -55557 -71552 -64654 -57983 -53585 -39982 18632 10829
12906A0829O8805k6615l4077l0017l5838J3281K343L8553j1617n478K2009M2329
$$ 10829 79634 53019 18942 -11075 -46913 -33632 -31289 7264 -4353 -9831 12178 54507
12894E4507j9740k8576m2383k2741K5699k8322J1436k220j5714N9497K8531m721
$$ 54507 34767 6191 -36192 -58933 -33234 -61556 -50120 -52340 -68054 -8557 19974 15253
12882A5253l1368j2343L3076N492R118K5861L7967k9492l0761j3783L8589J1872
$$ 15253 -16115 -28458 4618 10110 19228 45089 83056 53564 22803 9020 47609 59481
12870E9481m4122m6340J6936R004N0098q73m7043l6194Q354j2553L5125J9396
$$ 59481 15359 -30981 -14045 -5041 45057 44184 -2859 -39053 -30699 -43252 -8127 11269
12858A1269l5455j4589L288L3251J5342J4999j0643l6705K5545L4001q024m2070
$$ 11269 -24186 -38775 -35487 -2236 13106 28105 17462 -19243 6302 40303 32279 -9791
12846i791k0629M2742N0982n2l2624m2627j8512J8692m7390j1650K1090j9573
$$ -9791 -30420 12322 63304 63252 30628 -11999 -30511 -11819 -59209 -70859 -49769 -69342
12834f9342P297M2416N2502O631m1828o772O0173N2940j1480n7837m7732K8335
$$ -69342 -62045 -19629 32873 39504 -2324 -9096 51077 104017 92537 34700 -13032 15303
12822A5303L9199n924o4404n0038L1781L4403J8192N055R935N067l3533o4344
$$ 15303 54502 48578 -15826 -65864 -34083 320 18512 23567 33502 38569 5036 -59308
12810e9308m5157J0016Q7408L390m8516j8474j8675l556o216M0430M8846K1515
$$ -59308 -104465 -94449 -7041 -3651 -52167 -70641 -89316 -92872 -99088 -58658 -9812 11703
12798A1703k4444P1k8671J6216N904Q84J9359J7464L8478M749o4828N144O7486
$$ 11703 -12741 -12670 -41341 -25125 -19221 -18337 1022 18486 56964 61713 -3115 2029 69515
12785F9515K8666k6624p9226n0451M9421R786j3909p203K1881l0968j2520O9948
$$ 69515 98181 71557 -7669 -58120 -8699 1087 -12822 -20025 1856 -29112 -41632 28316
12773B8316j4567k1881Q3240L3456o7237m9015j7738K3784n111k4204L0355M0689
$$ 28316 13749 -8132 75108 108564 41327 -7688 -25426 -1642 -6753 -30957 -602 40087
12761D0087m4097j8968j7235m5480J2281l981P8868L3521L3873k2069k5375R60
$$ 40087 -4010 -22978 -40213 -85693 -73412 -77393 1475 34996 68869 46800 21425 22385
12749B2385l6795n1363k1842O581O8164j0632N1406N9354r656j1047N222n42k9641
$$ 22385 -14410 -65773 -87615 -81034 -12870 -23502 27904 87258 77602 66555 71777 71235 41594
12736D1594l4109j4400o8670Q637Q919J4794P1588O726p3120n0150K3997K6790
$$ 41594 7485 -6915 -75585 -66948 -58029 -43235 28353 35079 -38041 -88191 -64194 -37404
12724c7404j4900K1831k7774r161Q689M5830P8003j1742o2066n534K1592L0621
$$ -37404 -52304 -30473 -58247 -67408 -58719 -12889 65114 53372 -8694 -14228 7364 37985
12712C7985j1472K0920L3585j6501n7129K1469q802K2791K2244l7375m5090m5789
$$ 37985 26513 47433 81018 64517 7388 28857 20055 42846 65090 27715 -17375 -63164
12700f3164K8407K4468O0426M109k4704m0121n59N0447j1126j1746k7671o037
$$ -63164 -34757 -10289 50137 54246 29542 -10579 -11138 39309 28183 16437 -11234 -17271
12688a7271O0051n037J01j8176n3994k5099J2972l471K516k7625L428N5620J8834
$$ -17271 42780 37743 37844 19668 -34326 -59425 -46453 -49924 -47408 -75033 -71605 -15985 2849
12675B849k2398l4977R254k6315k7065o8233j5522M5193N632j4184j8834j4661
$$ 2849 -19549 -54526 -45272 -71587 -98652 -166885 -182407 -137214 -131582 -145766 -164600 -179261
12663a79261k784r369J4939K0897J9850l8920L9122M5943K9902J4116q9926l142
$$ -179261 -182045 -191414 -176475 -155578 -135728 -174648 -135526 -89583 -59681 -45565 -135491 -138633
12651a38633Q787Q0831Q3025q7722j9907j8667L1587Q3390K6325m9261l8029l7720
$$ -138633 -129846 -49015 34010 -53712 -73619 -92286 -60699 22691 49016 -245 -38274 -75994
12639g5994L6708J4699J8600k9407K9911N1807M965l7734J6224l1699o0589L8293
$$ -75994 -39286 -24587 -5987 -35394 -5483 46324 51289 13555 29779 -1920 -62509 -24216
12627b4216L9551m9845j3383m1172k1235J0923Q950J3445K7882K8719N245r628
$$ -24216 15335 -34510 -47893 -89065 -110300 -99377 -90427 -76982 -49100 -20381 -15136 -24764
12615b4764l1693P9578L6727p0456j5035J5187p405j4918j033R072K1126q732
$$ -24764 -56457 23121 59848 -10608 -25643 -10456 -17861 -32779 -33812 -24740 -3614 -12346
12603a2346q2912p1315J5817K7055L0837L3663N3815K8242p247Q443J1475r940
$$ -12346 -95258 -166573 -150756 -123701 -92864 -59201 -5386 22856 15609 24052 35527 25587
12591B5587k5601J997n0410k9290M132M1260j9215J8951M5300K6026J950l1187
$$ 25587 -14 1983 -48427 -77717 -73585 -32325 -51540 -32589 12711 38737 40687 9500
12579I500L1720k5705m2601J8605L7237m61j0102p4971O2684p300j2990N216J775
$$ 9500 41220 15515 -27086 -8481 28756 28295 18193 -56778 5906 -1394 -14384 -9168 -7393
12566g393k0448k1806j4203J5953L6853l1599n3595J1321j7225l7041N2886n572
$$ -7393 -27841 -49647 -63850 -47897 -11044 -42643 -96238 -84917 -102142 -139183 -86297 -91869
12554i1869j0107P3404l6238J0651J9441k7912J034N0561K1052j2752k8375l8000
$$ -91869 -101976 -28572 -64810 -54159 -34718 -62630 -61596 -11035 10017 -2735 -31110 -69110
12542f9110m7706j3800K1206J5196K3373L5034J9904l5998L0218m669m5621O11
$$ -69110 -116816 -130616 -109410 -94214 -70841 -35807 -15903 -51901 -21683 -26352 -71973 -71362
12530g1362L9406J7761M170j2560O893p3651r093k3706m5405K3373r80n121K7896
$$ -71362 -31956 -14195 -10025 -22585 -15692 -89343 -98436 -122142 -167547 -144174 -145154 -150275 -122379
12517a22379P8056m2303n0975J4991M7533p651L4446R480K1252k8278K5666m7005
$$ -122379 -44323 -86626 -137601 -122610 -75077 -82728 -48282 -38802 -17550 -45828 -20162 -67167
12505f7167j24N643j0145j2029K7139P7840L2061J4815r295k0792m4934j6322
$$ -67167 -67291 -61648 -71793 -83822 -56683 21157 53218 68033 58738 37946 -6988 -23310
12493b3310l2724L9690j2991O79L5678J885k7373l8135Q50j0862N1413p105j1265
$$ -23310 -56034 -16344 -29335 -28656 7022 8907 -18466 -56601 -55751 -66613 -15200 -22305 -33570
12480c3570J9296K021N933N649J7221l505k769K6615m6591k4961n469m9288j2126
$$ -33570 -14274 -12253 -6320 -671 16550 13045 10276 36891 -9700 -34661 -40130 -89418 -101544
12467a01544N7079P477l9861q241M8217O163j0793J3001M997k3718r668R2067
$$ -101544 -44465 -36988 -76849 -85090 -36873 -30710 -41503 -28502 -23505 -47223 -56891 35176
12455C5176N8058M3741j20313q2772J6683O0279K7783J7051j493J1859K0940k7491
$$ 35176 93234 136975 16662 -66110 -49427 10852 38635 55686 54193 66052 86992 59501
12443E9501q0944p6886k9009N2557N0551J068J0856l7817j7829J0664M7970M7574
$$ 59501 -21443 -98329 -127338 -74781 -24230 -23162 -12306 -50123 -67952 -57288 -9318 38256
12431C8256P6690J6538m058M0098k5862n5836o3322L7149M5570l8470l0420n821
$$ 38256 114946 131484 127426 167524 141662 85826 22504 59653 105223 66753 36333 30512
12419C0512J5512k8333l508J587J2954k4862J5065l4123o6046j994K5038K0783
$$ 30512 46024 17691 14183 15770 28724 3862 18927 -15196 -81242 -83236 -58198 -37415
12407c7415k2120m1715P294L4818O4400m2870n9245l1717J7256K4255R1442K0318
$$ -37415 -59535 -101250 -93956 -59138 5262 -37608 -96853 -128570 -111314 -87059 4383 24701
12395B4701n2361R273N48m786J2886K235o903J183o3582K027L6669K3027J214
$$ 24701 -27660 -18387 -17839 -22625 -9739 -7504 -14407 -13224 -76806 -74779 -38110 -15083 -13869
12382a3869K4385j6317M062M1061K3448j7217n0296N00K4924n172n3490k92K0118
$$ -13869 10516 -5801 -1739 39322 62770 45553 -4743 -4243 20681 15509 -37981 -38273 -18155
12369a8155j6225m8290o3088p960K9329L2178O4034M7764k0789J6743n667j6731
$$ -18155 -34380 -82670 -145758 -153718 -124389 -92211 -28177 19587 -1202 15541 9874 -6857
12357f857j3033N744o143P4405M749r1151j2935P9206L7744n5947o9400L3250
$$ -6857 -19890 -14146 -20289 54116 58865 -32286 -45221 33985 71729 15782 -53618 -20368
12345b0368N2354k2854n305P291o8855l9446K1699N5463k0679K7019j2366p2887
$$ -20368 31986 9132 3827 11118 -57737 -97183 -75484 -20021 -40700 -13681 -26047 -98934
12333i8934p1686L9189O000N9022M5818M470Q078K3239p0489m1323L3765K2890
$$ -98934 -170620 -131431 -125431 -66409 -20591 -16121 -8043 15196 -55293 -96616 -62851 -39961
12321c9961J1673j6861O4246K7329m7160j7820K847L7578J112k669J1562m8609
$$ -39961 -28288 -45149 19097 46426 -734 -18554 -15707 21871 22983 20314 31876 -16733
12309a6733L8193L4032m1743l1433l7986N6451Q2966P06o6087m1953j2826l3677
$$ -16733 21460 55492 13749 -17684 -55670 781 83747 84453 18366 -23587 -36413 -70090
12297g0090L648J6912J3682j915j3168m86m2922N9461N7709l0733J0444L5494
$$ -70090 -66442 -49530 -35848 -37763 -50931 -51417 -94339 -34878 22831 -7902 2542 38036
12285C8036K4694n8337J5906P5354J9690n1467R7863Q7630J56843K14592L32862
$$ 38036 62730 4393 20299 95653 115343 63876 161739 249369 406212 620804 953666
12274I53666L00516P3119K2737J22666j5612m30667l66537j54961j09761n5880
$$ 953666 1254182 1327301 1350038 1472704 1457092 1026425 659888 504927 395166 339286
12264C39286p1477o6069r7051o8208L5683o0656k700N4480N206m9912J0859J6315
$$ 339286 267809 201740 104689 36481 72164 11508 8808 63288 68494 18582 29441 45756
12252D5756J1093l0377q559n161M9493O2877p746k8358j4124o5971l5550j6774
$$ 45756 56849 26472 17913 12752 62245 125122 117376 89018 74894 8923 -26627 -43401
12240d3401N0585N3194o279k6386m8533r950n669K6838m0396m2632N4305M5384
$$ -43401 7184 60378 54099 27713 -20820 -30770 -36439 -9601 -49997 -92629 -38324 7060
12228G060M4459m8997j2954O3731m712k8433k1597l443k7771o2896q146M0190
$$ 7060 51519 2522 -10432 53299 48587 20154 -1443 -4886 -32657 -95553 -103699 -63509
12216f3509M0021L8674L4325L6856M3051o7250m8710l3001p1673L7033M3355m8000
$$ -63509 -23488 15186 49511 86367 129418 62168 13458 -19543 -91216 -54183 -10828 -58828
12204e8828l8522k2871J17061O8664m2264K90k4216j7538l4800O5343L6464P2041
$$ -58828 -97350 -120221 -3160 65504 23240 23530 -686 -18224 -53024 12319 48783 120824
12192A20824L4644r6431o7094K319p980o819q069l8044M084k2769J5373N8788
$$ 120824 155468 59037 -8057 -5738 -13718 -20537 -28606 -66650 -62566 -85335 -69962 -11174
12180a1174J517K8781O4023J1481n3864p2720L7851L2305J317L470l8068l6968
$$ -11174 -9657 19124 83147 94628 40764 -31956 5895 38200 39517 42987 4919 -32049
12168c2049L7161l3887Q2313L4499l1218R200k1514p6161J5576M3021k7573l2659
$$ -32049 5112 -28775 53538 88037 56819 66019 44505 -31656 -16080 26941 -632 -33291
12156c3291j9729N484l7462K6442j2362l291L3580O1827M2384J8479j842k5627
$$ -33291 -53020 -47536 -84998 -58556 -70918 -74209 -40629 21198 63582 82061 80219 54592
12144E4592j8118L29M2848M7019p644p9971m2435l3910n1277L3158M9941k4702
$$ 54592 36474 36803 79651 126670 119026 39055 -3380 -37290 -88567 -55409 -5468 -30170
12132c0170j8474J5554K1550M5312K4168n3201m9245R605k576k6219N607j2641
$$ -30170 -48644 -33090 -11540 33772 57940 4739 -44506 -34901 -37477 -63696 -58089 -70730
12120g0730M2685J2967K0916O3440J2610N221m3832o2595k929K221l009M8870
$$ -70730 -28045 -15078 5838 69278 81888 87109 43277 -19318 -22247 -20026 -23035 25835
12108B5835J0687j4666p745L993r5996K0300P914M616l6114L7393P6511M8255
$$ 25835 36522 21856 14111 18104 -77892 -57592 -49678 -45062 -81176 -43783 32728 80983
12096H0983J6598l4695K5949N16q2951j9806J9600j0314J2511j6993M7703R3252
$$ 80983 97581 62886 88835 89351 6400 -13406 6194 -4120 8391 -8602 39101 132353
12084A32353o4362l1678M9983P7526m4659j32578p4973j7484R835M6899j962K5351
$$ 132353 67991 36313 86296 163822 119163 -13415 -88388 -105872 -96037 -49138 -51100 -25749
12072b5749p8542m012J05371N2570o2904j22633k5879O1560J4215P77L2584J4029
$$ -25749 -104291 -108303 -2932 49638 -13266 -135899 -161778 -100218 -86003 -85226 -52642 -38613
12060c8613K6801l0973J0094L1743J9610J4071R607k5251K2959M1824k3520M5072
$$ -38613 -11812 -42785 -32691 -948 18662 32733 42340 17089 40048 81872 58352 103424
12048A03424M0612o4685q9030m0996P4348K5145j4966j9701k7133p2645O0156
$$ 103424 144036 79351 -9679 -50675 23673 48818 33852 14151 -12982 -85627 -25471
12037b5471N1260j0202j2213J6585j5702R841J7024m0792k3017K0439M8975m4388
$$ -25471 25789 15587 3374 19959 4257 14098 31122 -9670 -32687 -12248 36727 -7661
12025g661m1173L152J1485m9425M0742L7578k9083k144L5842J1126j2146m6816
$$ -7661 -48834 -45682 -34197 -83622 -42880 -5302 -34385 -36529 -687 10439 -1707 -48523
12013d8523j0587J738K7623L4298k4296m0816r0159O277N2752R4040P7423O4813
$$ -48523 -59110 -57372 -29749 4549 -19747 -60563 -150722 -144445 -91693 2347 79770 144583
12001A44583O6095k2225m1341L510j5560o2316l8110L4020K7657k0963m9592n227
$$ 144583 210678 188453 147112 150622 135062 72746 34636 68656 96313 75350 25758 20531
11989B0531K1285J5201p960k8537m9579o7934l0790N8771M8382K6955M4198L203
$$ 20531 41816 57017 49057 20520 -29059 -96993 -127783 -69012 -20630 6325 50523 53726
11977E3726l5401o584p302j8735L7828K4820k9031q7292k1475L7397L9413J9649
$$ 53726 18325 11741 4439 -14296 23532 48352 19321 -67971 -89446 -52049 -12636 7013
11965G013N397P589k4756K3900k1657M1869Q3158O2323K7663P208m6090k48J6358
$$ 7013 12410 19999 -4757 19143 -2514 39355 122513 184836 212499 219707 173617 173369 189727
11952A89727q3166r2241m223N1273J7950k2785n8432m8439L887J5461m1189l3261
$$ 189727 106561 14320 10097 61370 79320 56535 -1897 -50336 -46449 -30988 -72177 -105438
11940a05438K4459Q7256L1974n729p0814j8877J6325j7606j388j5882j638K5676
$$ -105438 -80979 6277 38251 32522 -38292 -57169 -40844 -58450 -59838 -75720 -77358 -51682
11928e1682P413P171K0754j8093L727L6940l0885J6903K392K3182n6694k5848
$$ -51682 -44269 -37098 -16344 -34437 -30710 6230 -24655 -7752 -5360 17822 -38872 -64720
11916f4720K0741L3446M8334N9431k1175m2449l0525K1850Q940Q30k3700k3230
$$ -64720 -43979 -10533 37801 97232 76057 33608 3083 24933 33873 34703 11003 -12227
11904a2227j7037J6123J4126n4052j4854O0072P4466j7435l1835L7572J8057p5982
$$ -12227 -29264 -13141 985 -53067 -67921 -7849 66617 49182 17347 54919 72976 -3006
11892c006J301P348o816J3180k9950l9987O6018k3120O118j9932p849K0537K0821
$$ -3006 -1705 5643 -1173 12007 -17943 -57930 8088 -15032 -8914 -28846 -36695 -16158 4663
11879D663j2865l4106J2421k7434k2569R054J2597N0083O6299n551k5114J3837
$$ 4663 -8202 -42308 -29887 -57321 -79890 -70836 -58239 -8156 58143 52592 27478 41315
11867D1315K6061j2420L8228o156o5537k2931K3623K4861m3652o361P5191l0171
$$ 41315 67376 54956 93184 87028 21491 -1440 22183 47044 3392 -2969 72222 42051
11855D2051k433k8729l0718J2239M0418k2272m3363o3682n38l461J667M2606M2610
$$ 42051 39618 10889 -19829 -7590 32828 10556 -32807 -96489 -97027 -100488 -98821 -56215 -13605
11842a3605m1484q0569O3848J8272J7299K975j1101m4442K7811N0392J17K1334
$$ -13605 -55089 -135658 -71810 -53538 -36239 -33264 -44365 -88807 -60996 -10604 -10487 10847
11830A0847Q330M4074m8694q2303o6980J4002L9805K4779M661J6479k2532P157
$$ 10847 19177 63251 14557 -67746 -134726 -120724 -80919 -56140 -51479 -35000 -57532 -50375
11818e0375j5758J3202O9651N7088k5998k7305N735N2786L6011n7909p56J1209
$$ -50375 -66133 -52931 16720 73808 47810 20505 26240 79026 115037 57128 56372 67581
11806F7581O381n2245m5904l4397L7471M8201N5431n2106p913R457l3435j1154
$$ 67581 73962 21717 -24187 -58584 -21113 27088 82519 30413 22500 31957 -1478 -12632
11794a2632N602L068M4723j56K6176J4716m5062l1334K4514m349k392J3366K1802
$$ -12632 -7030 -3962 40761 40605 66781 81497 36435 5101 29615 25266 22874 36240 58042
11781E8042l8868n2267o104L3869N4601N3962r104m9838m26K1796j7368O046l4600
$$ 58042 19174 -33093 -39197 -5328 49273 103235 94131 44293 43867 65663 48295 54341 19741
11768A9741M743L2041J0142j5616k8753j1733l7230l0353N4556o382r050L0428
$$ 19741 24484 56525 66667 51051 22298 10565 -26665 -57018 -2462 -8844 -17894 12534
11756A2534n7200k2381L557L4949L4610m772K6062j60j433n7994P429k506N4299
$$ 12534 -44666 -67047 -63490 -28541 6069 1297 27359 27199 25766 -32228 -24799 -27305 26994
11743B6994L7095j6749n467j0033K1829K2695m9842o6120j2205Q754j8755J6391
$$ 26994 64089 47340 41873 31840 53669 76364 26522 -39598 -51803 -43049 -61804 -45413
11731d5413l0862j3076k6342N880M0338k015m6804O2412P7789J1215m0300p1560
$$ -45413 -76275 -89351 -115693 -109813 -69475 -71490 -118294 -55882 21907 33122 -7178 -78738
11719g8738L6520N0969p347l6043L1038M5666M6156q2512n7287O8054L8102j5747
$$ -78738 -42218 8751 1404 -34639 -3601 42065 88221 5709 -51578 16476 54578 38831
11707C8831p8012k9455M1622K302L6902J3913l1761o2646n34j3249O1195K5919
$$ 38831 -39181 -68636 -27014 -24712 12190 26103 -5658 -68304 -68838 -82087 -20892 5027
11695E027K1180J6501k5014J914K3604L0338l7969o8065L5624l1724p891K2845
$$ 5027 26207 42708 17694 19608 43212 73550 35581 -32484 3140 -28584 -36475 -13630
11683a3630l2517J0344M4018l8926R280K9207J8348K440k4335k0017m9038K1017
$$ -13630 -46147 -35803 8215 -30711 -21431 7776 26124 28564 4229 -15788 -64826 -43809
11671d3809L6037K8494J9876l1992J3619k8697k744j0281m256J294M9416K6892
$$ -43809 -7772 20722 40598 8606 22225 -6472 -9216 -19497 -23753 -22459 26957 53849
11659E3849J6998p978l0979j9186k2845j9875k5835K3171L3200J2565L587j9488
$$ 53849 70847 62869 31890 12704 -10141 -30016 -55851 -32680 520 13085 16672 -2816
11647b816l5563O1781J6180m3963J4549n22j5168L9334k9224q8668K7315N0011
$$ -2816 -38379 23402 39582 -4381 10168 9646 -5522 33812 4588 -84080 -56765 -6754
11635f754L9160K412K9852l0440k9372j8517J5084m0719J8983K2582L7163O2114
$$ -6754 32406 34818 64670 34230 4858 -13659 1425 -39294 -20311 2271 39434 101548
11623A01548m4856m8716J9952K5600l990k4336m2008K0263m3675n672m3116l9847
$$ 101548 56692 7976 27928 53528 49538 25202 -16806 3457 -40218 -45890 -89006 -128853
11611a28853M0393K865L7438J8738O1823L4074J7446r1677l2384O5222j2393j2255
$$ -128853 -88460 -85595 -48157 -29419 32404 66478 83924 -7753 -40137 25085 12692 437
11599D37l3155Q962k181M2905K1006j8379K1632j789n5808O0822j121n720k5975
$$ 437 -32718 -23756 -25937 16968 37974 19595 41227 39438 -16370 44452 43331 37611 11636
11586A1636m7946L9005L4301O934l7179j9303J5275K8535k54l4147k7479j4018
$$ 11636 -36310 2695 36996 43930 6751 -12552 2723 31258 31004 -3143 -30622 -44640
11574d4640j7718l0397q381P273R6533K3565l2245m5143l9137K1487J8370M2693
$$ -44640 -62358 -92755 -101136 -93863 2670 26235 -6010 -51153 -90290 -68803 -50433 -7740
11562g740M476k0957K739L0071m270Q935n272O037L8393O8091j07n6780n3727
$$ -7740 -3264 -24221 -21482 8589 4319 13254 7982 14019 52412 120503 120396 63616 9889
11549I889J1921l0300j0922Q176N8595m1268k3506J0553r959j2134N0751j852
$$ 9889 21810 -8490 -19412 -11236 47359 6091 -17415 -6862 -16821 -28955 21796 19944
11537A9944m9810o5284l5525M4664L3666J5847K6507R881r628j3491J3218J9654
$$ 19944 -29866 -95150 -130675 -86011 -52345 -36498 -9991 -110 -9738 -23229 -10011 9643
11525I643j4120k0650j364J6015O2231k4546p7929l9105K9395J6252K4577N6669
$$ 9643 -4477 -25127 -26491 -10476 51755 27209 -50720 -89825 -60430 -44178 -19601 37068
11513C7068N2448K1666m4213n3082k2576j2510j9342j7626L3771K2738j9767p2845
$$ 37068 89516 111182 66969 13887 -8689 -21199 -40541 -58167 -24396 -1658 -21425 -94270
11501i4270L4378Q2353M7318K9424j3646o1759k8048K7017j3815l8207k0543l3812
$$ -94270 -59892 22461 69779 99203 85557 23798 -4250 22767 8952 -29255 -49798 -83610
11489h3610j0620M4531l533l353N6455j9247L3134O847m6944M6Q4363K2659m9521
$$ -83610 -94230 -49699 -53232 -56585 -130 -19377 13757 20604 -26340 -26294 58069 80728 31207
11476C1207n2985K0482j0904l4595M5774O3839p167n5107k3802J6334L7833J3377
$$ 31207 -21778 -1296 -12200 -46795 -1021 62818 55651 544 -23258 -6924 30909 44286
11464D4286p5557m6130J2105K8687O3271N7239J755o4992l2827l38k8556N9838
$$ 44286 -31271 -77401 -65296 -36609 26662 83901 85656 20664 -12163 -12501 -41057 18781
11452A8781L6173l4052k4726l8669m6893K1967N465L0054M9759N382k7502l7305
$$ 18781 54954 20902 -3824 -42493 -89386 -67419 -61954 -31900 17859 23241 -4261 -41566
11440d1566N4475J6648N576K3340J7625m4848N410m1862p16K6002K9180J2299
$$ -41566 12909 29557 35133 58473 76098 31250 36660 -5202 -5918 20084 49264 61563
11428F1563k6376j3885J7081J4842L0718k8788j7369O2690l9163q84L0475M3651
$$ 61563 35187 21302 38383 53225 83943 55155 37786 100476 61313 60429 90904 134555
11416A34555q786l7541o066o8722l3023J0153O305O0509M6759k1312j0786R604
$$ 134555 125769 88228 82162 13440 -19583 -9430 -3125 57384 104143 82831 72045 81649
11404H1649J9901L1004m8872l6345k9433l1042k9843K0350k6432L4703Q0604M6634
$$ 81649 101550 132554 83682 47337 17904 -13138 -42981 -22631 -49063 -14360 66244 112878
11392A12878o6912r3130L5704L1782J5178K643p337o8140l6976K6118N5196M7860
$$ 112878 45966 -47164 -11460 20322 35500 38143 30806 -37334 -74310 -48192 7004 54864
11380E4864p0960l9523L6898L5325m589j5515k5354L2197K3729l4682m0641j503
$$ 54864 -16096 -55619 -18721 16604 12015 -3500 -28854 3343 27072 -7610 -48251 -49754
11368d9754n077K6073j4258j4381j3830L1016N6348N4982N5056n9685n8771J3852
$$ -49754 -54831 -28758 -43016 -57397 -71227 -40211 16137 71119 126175 66490 7719 21571
11356B1571j8492N485Q331K4254j2684r250m2690j9270K3657L9675j3727K0741
$$ 21571 3079 8564 16895 41149 28465 19215 -23475 -42745 -19088 20587 6860 27601
11344B7601n6473o7978M9312K6019n790K7123N5137K2530P748J0613o0405n9856
$$ 27601 -28872 -96850 -47538 -21519 -27309 -186 54951 77481 85229 95842 35437 -24419
11332b4419j0526J3794j2445J6913P374N1799K8212j9420r6333l0540m5147J4595
$$ -24419 -34945 -21151 -33596 -16683 -9309 42490 70702 51282 -45051 -75591 -120738 -106143
11320a06143L7422M9250O5222K8485K609p2176n4358n6025k1200P5078N6984N2590
$$ -106143 -68721 -19471 45751 74236 76845 4669 -49689 -105714 -126914 -51836 5148 57738
11308E7738n8832j7743m459K1212j753k371p7640L2399N6244N5719J4638l8669
$$ 57738 -1094 -18837 -23296 -2084 -3837 -6208 -83848 -51449 4795 60514 75152 36483
11296C6483j0469K6848l7094m5813k9911n921L9973o797j7755k7700j2655K2503
$$ 36483 26014 52862 15768 -30045 -59956 -65877 -25904 -32701 -50456 -78156 -90811 -68308
11284f8308M9402N9275N1856j0786q393K5039j3974K3855L3236l582N966k9339
$$ -68308 -18906 40369 92225 81439 73046 98085 84111 107966 141202 137620 143586 114247
11272A14247n2137m3464r0026K2012L696j6971M5630K3889j0332m04P0171O351
$$ 114247 62110 18646 -71380 -49368 -45672 -62643 -17013 6876 -3456 -3860 66311 72662
11260G2662n019k3512p36j5472N2901j408O529j3023l6186j809J1996l7800j4385
$$ 72662 67643 44131 43395 27923 80824 79416 85945 72922 36736 34927 46923 9123 -5262
11247e262N3675L264J6650j1774p4276p3805K3325K5445k6627L7715R9254L6522
$$ -5262 48413 51677 68327 56553 -17723 -91528 -68203 -42758 -69385 -31670 67584 104106
11235A04106L6591m0341m9049j4031k6882N0088P6867J4817j7863J9762P543M5820
$$ 104106 140697 100356 51307 37276 10394 60482 137349 152166 134303 154065 161608 207428
11223B07428l7859r293o6106j10276k405K5579K7255K9881k767n461O789m484
$$ 207428 169569 160276 94170 -16106 -18511 7068 34323 64204 61437 55976 62765 58281
11211E8281j1595k4188J2478K6729o5934j06397k1613K9393N4574k821M0075L9900
$$ 58281 46686 22498 34976 61705 -4229 -110626 -132239 -102846 -48272 -51093 -11018 28882
11199B8882m376j5274N400j9648J181K1434n243L1166J1965k161n0209l851N6366
$$ 28882 24506 9232 14632 -5016 -3835 17599 12356 43522 55487 53326 3117 -734 55632
11186E5632j6392J7938Q643q730j1180l0543m1270k0909M9543K9997m2478M5802
$$ 55632 39240 57178 65821 57091 45911 15368 -25902 -46811 2732 32729 -9749 36053
11174C6053K318p9302k1511n15L2703K1725J1870k3475Q4129N6011J8132l8242
$$ 36053 38371 -40931 -62442 -62957 -30254 -8529 3341 -20134 63995 120006 138138 99896
11162I9896k0037j9417J2138j0212j9732M2577K2722j4317m1290l5000j5995n3940
$$ 99896 79859 60442 72580 62368 42636 85213 107935 93618 52328 17328 1333 -52607
11150e2607j0458Q140L9719O5699J9449J7483l0229k7330l5426n5795L0729K5772
$$ -52607 -63065 -54925 -15206 50493 69942 87425 57196 29866 -5560 -61355 -30626 -4854
11138d854k012K9829L2936o792M1966K3885p7621P291j132l4628J3485p840l433
$$ -4854 -6866 22963 55899 49107 91073 114958 37337 44628 43496 8868 22353 14513 11080
11125A1080L7603J6942j2832j1948M043l3966l1224j4253K5812K3022N7307P228
$$ 11080 48683 65625 52793 40845 44888 10922 -20302 -34555 -8743 14279 71586 78814
11113G8814j5984q3459m8707J443J08014K7323L2170Q117k1296j4294j59m6912
$$ 78814 62830 -20629 -69336 -67893 40121 67444 99614 107731 86435 72141 71982 25070
11101B5070p5971J0888Q6589m5987j1910N0608l4183q3612M4680P2881K5539k0438
$$ 25070 -50901 -40013 46576 589 -11321 39287 5104 -78508 -33828 39053 64592 44154
11089D4154l0894m1696o786q946n705K8125K5389r7691L4649R0217P123r022q2487
$$ 44154 13260 -28436 -35222 -44168 -49873 -21748 3641 -94050 -59401 30816 37939 28917 -53570
11076e3570L526J8835j4015L1043l4389k752N1332R264Q855m3588K3383J02116
$$ -53570 -50044 -31209 -45224 -14181 -48570 -51322 10 9274 18129 -25459 -2076 100040
11064A00040j690m2536r6819N3111L4219N258j367L4925M6904n1650k3248M9872
$$ 100040 98350 55814 -41005 12106 46325 51583 50216 85141 132045 80395 57147 107019
11052A07019K4640J166J2722J122J3406K2173K0106l8565n2722K1710K9883P3274
$$ 107019 131659 132825 145547 146669 160075 182248 202354 163789 111067 132777 162660 235934
11040B35934L6035N4664P5644M9966L6688J4926o586m5440j03079o1908k0265
$$ 235934 271969 326633 402277 452243 488931 503857 497271 451831 348752 286844 266579
11029B66579O1214P1644L4341M9984M2495J7865l7994n5577p5105l9053l944K7853
$$ 266579 327793 399437 433778 483762 526257 544122 506128 450551 375446 336393 332449 360302
11017C60302m6184m0988l5229K1059L2227K7131J1689L0163L5627l6245n7671
$$ 360302 314118 273130 237901 258960 291187 318318 330007 360170 395797 359552 301881
11006C01881l6771J7085P44l0992l4891O8747k5778p6998J351j0532j4882j3901
$$ 301881 265110 282195 282939 251947 217056 285803 260025 183027 184378 173846 158964 145063
10994A45063P835m1723o1417L6081L7992p431m060j6491Q349J335O0887M1552
$$ 145063 152898 111175 49758 85839 123831 116400 112340 95849 104198 105533 166420 207972
10982B07972Q610r393n9901m4181J1037J1281J9284O3341R5957m786l1187l7708
$$ 207972 216582 207189 147288 103107 114144 125425 144709 208050 304007 299221 268034 230326
10970B30326K4431J15558Q0232J65450K12997L10102M26528M95529L16638J06653
$$ 230326 254757 370315 450547 615997 828994 1139096 1565624 2061153 2377791 2484444
10960B484444O8830J6048l92967n94013n38933k83663j92727j60806q2124l4981
$$ 2484444 2553274 2569322 2176355 1582342 1043409 759746 567019 406213 324089 289108
10950B89108P146l3707p3803Q390j9530r842J4087K9597O4483J7342j09285p8472
$$ 289108 296254 262547 188744 197134 177604 167762 181849 211446 275929 293271 183986 105514
10938A05514k8557k802L2205k6330N00m3777L8881L4027k5379m3518L034L2692
$$ 105514 76957 74155 106360 80030 80530 36753 75634 109661 84282 40764 43798 76490
10926G6490M816J7314J0713j2969k1364p672k579J3676J8578M8941j5780R405
$$ 76490 81306 98620 109333 96364 75000 67328 64749 78425 97003 145944 130164 139569
10914A39569n4425q692k0456j7864j2131k7591J994J1714J9573M4703J1055J6491
$$ 139569 85144 76452 55996 38132 26001 -1590 404 12118 31691 76394 87449 103940
10902A03940l9443r411J6895L9040P020K5514J0908o302j683k1251k792k5274
$$ 103940 64497 55086 71981 111021 118041 143555 154463 148161 146478 125227 122435 97161
10890I7161j8617N0044M3583j882m0309k9756Q3566J6617j8630j6491n3001L331
$$ 97161 78544 128588 172171 170289 129980 100224 183790 200407 181777 165286 112285 115616
10878A15616K6247J7728j4526Q304L2174O1746j8208k8443J3222k6290N8842K1931
$$ 115616 141863 159591 145065 153369 185543 247289 229081 200638 213860 187570 246412 268343
10866B68343K0733k4637m8631l3378J4776P2128L585p1961l1044p0089k6344j5700
$$ 268343 289076 264439 215808 182430 197206 269334 272919 200958 169914 99825 73481 57781
10854E7781k2502P632O7704J0313j2508O8054L7923J1738k7753n0696l235L2293
$$ 57781 35279 42911 110615 120928 108420 176474 214397 226135 198382 147686 144451 176744
10842A76744j945n0525J6812k3410j8068R96L5828K7658L1635K5482o3257p3723
$$ 176744 174799 124274 141086 117676 99608 100604 136432 164090 195725 221207 157950 84227
10830H4227P2590M6185p585O911K4617J6160k1398m6912K2437l598O6085P9709
$$ 84227 156817 203002 195417 202328 226945 243105 221707 174795 197232 193634 259719 339428
10818C39428M1786M2379N0868J20301J03529n4602n3091l216m7743r9235q0515
$$ 339428 381214 423593 474461 594762 698291 643689 590598 587382 539639 440404 359889
10807C59889p9636r2034m4408j5377k9437n1123J4756L1691K4449r555K4133m4494
$$ 359889 280253 188219 143811 128434 98997 47874 62630 94321 118770 109215 133348 88854
10795H8854k2375L1885j4329l1714J0644O4291O354l163L8560K5204l9760r4485
$$ 88854 66479 98364 84035 52321 62965 127256 133610 130447 169007 194211 154451 59966
10783E9966k4555P797l4528o926p7983o6949J0772K2792L5704M3078N7986K8296
$$ 59966 35411 43208 8680 1754 -76229 -143178 -132406 -109614 -73910 -30832 27154 55450
10771E5450k4479o5095l923L5353L5437j1883o480J2731k0725K7665N2879k347
$$ 55450 30971 -34124 -38047 -2694 32743 20860 14380 27111 6386 34051 86930 84583
10759H4583L176n400J17172Q9628o7389o8567l3879k5543m81k3555r6557j28996
$$ 84583 87759 82359 199531 289159 221770 153203 119324 93781 93300 69745 -26812 -155808
10747a55808r0903o0267O2056j517L2750J20109O0316Q5437Q7988M5200J10736
$$ -155808 -246711 -306978 -244922 -246439 -213689 -93580 -33264 52173 140161 185361 296097
10736B96097J27253P5002L8343L5124l2634J8007L167j0997m916J12918J6339
$$ 296097 423350 498352 536695 571819 539185 557192 560359 549362 544446 657364 673703
10725F73703l7240m7398m491m2474n0162l1520p2305k6223j7297l2673o3481r324
$$ 673703 636463 589065 584574 542100 491938 460418 388113 361890 344593 311920 248439 239115
10713B39115K2311o5845k234K6540O4309O2846K0815O7964L9935n1620r110m5610
$$ 239115 261426 195581 193347 219887 284196 347042 367857 435821 475756 424136 415026 369416
10701C69416q314J5090K1983l0759L6524j1089M9524r830J6792L7192Q2202J28691
$$ 369416 361102 376192 398175 367416 403940 392851 442375 432545 449337 486529 568731 697422
10689F97422R8837P3973N2500K3896M0668M4740n5248j01913j46334j00512o4844
$$ 697422 796259 870232 922732 946628 987296 1032036 976788 874875 728541 628029 563185
10678E63185m2252o0907k2465R3797M6724p2046j8153N4412l2906N3364N5363
$$ 563185 520933 460026 437561 531358 578082 506036 487883 542295 509389 562753 618116
10667F18116J0058m322J7174J03114M6892k200k6069r541K4152N6192O3187R8066
$$ 618116 628174 623852 641026 744140 791032 788832 762763 753222 777374 833566 896753 994819
10655I94819Q7138J7938J1444j541N6077N3401M734N6805M3875K2629N7228O5523
$$ 994819 1081957 1099895 1111339 1109798 1165875 1219276 1224010 1280815 1324690 1347319 1404547 1470070
10643A470070O1203J13772K22740J94586J88745K33444K44961K17147K09445L04148
$$ 1470070 1531273 1645045 1867785 2062371 2251116 2484560 2729521 2946668 3156113 3460261
10633C460261L26714K67565K36489K89650L80403M64207P47060R80898J336884
$$ 3460261 3786975 4054540 4291029 4580679 4961082 5425289 6172349 7153247 8490131
10624H490131J836937K396222L055753L712813L998475L710017L122342K528699
$$ 8490131 10327068 12723290 15779043 19491856 23490331 27200348 30322690 32851389
10616C2851389J753500P82357K5347K870Q74373K435972M399632O199399P078915
$$ 32851389 34604889 35387246 35412593 35415463 36289836 38725808 43125440 49324839 56403754
10607E6403754O426200M954081L558785J660584j126066l500653l641243j555544
$$ 56403754 62829954 67784035 71342820 73003404 71877338 68376685 64735442 63179898
10599F3179898J540608M840349P472606Q364663P121993M797249K399710p46257
$$ 63179898 64720506 69560855 77033461 85398124 92520117 97317366 99717076 98970819
10591I8970819n176423q701954q916503o462208l050324J94952K613026L572140
$$ 98970819 93794396 85092442 76175939 69713731 66663407 66858359 69471385 73043525
10583G3043525K992913J638268K16816j831717m685944o849115o607245m696613
$$ 73043525 76036438 77674706 77891522 76059805 71373861 64524746 57917501 53220888
10575E3220888k845035j034098P77792J992891K586045K943489L605492M744093
$$ 53220888 50375853 49341755 50119547 52112438 54698483 57641972 61247464 65991557
10567F5991557P275835J2735995K3485557M1993072O8986975R3451107Q3873288
$$ 65991557 73267392 86003387 109488944 151482016 220468991 313920098 397793386
10560C97793386L6911811J5914830L1307167k626058j06222368j22247456q2177970
$$ 397793386 434705197 450620027 481927194 479301136 373078768 250831312 168653342
10553A68653342n0760738l1613895k0086423j3284263r182945o623840m782350
$$ 168653342 117892604 86278709 66192286 52908023 43725078 37101238 32318888
10546C2318888l686406k967212k290652j735315j266352j086000j086007r76690
$$ 32318888 28632482 25665270 23374618 21639303 20372951 19286951 18200944 17224254
10538A7224254p03922o89405j163736j380136j170927r02656p79440n76159o39596
$$ 17224254 16520332 15830927 14667191 13287055 12116128 11213472 10434032 9857873 9218277
10529I218277n03009m68071m29858l72264m00278k90151k78587k41643k39949
$$ 9218277 8715268 8247197 7817339 7445075 7044797 6754646 6476059 6234416 5994467
10520E994467l34620l19633k45320j88487j44688j63086j95941j74016j78620
$$ 5994467 5659847 5340214 5094894 4906407 4761719 4598633 4402692 4228676 4050056
10511D050056j88473j52342j10870j86107k11314j51357o5469j15248j85203q7161
$$ 4050056 3861583 3709241 3598371 3412264 3200950 3049593 2984124 2868876 2683673 2596512
10501B596512n819k0130r8347m8493r3725j29052r2247j8038q549n4261m1102
$$ 2596512 2590693 2570563 2472216 2423723 2329998 2200946 2108699 2090661 2082112 2027851 1986749
10490A986749o8253j51024m6126K3126n7377m0272j7237K292Q574j1421p9002
$$ 1986749 1918496 1767472 1721346 1744472 1687095 1646823 1629586 1631878 1640452 1629031 1550029
10479A550029q5359m4609k7625k3703n4927j9377l3577p249K067l3194l194m1527
$$ 1550029 1464670 1420061 1392436 1368733 1313806 1294429 1260852 1253603 1255670 1222476 1219282 1177755
10467A177755l003K1712n8224o8728j687l9368n9560j661o9479o4995m0432K2871
$$ 1177755 1174752 1196464 1138240 1069512 1067825 1028457 968897 967236 897757 832762 792330 815201
10455H15201J3026p4142n6681j5576n602K2097L1541L7406k1955k3261M2234k9476
$$ 815201 828227 754085 697404 681828 676226 698323 729864 767270 745315 722054 764288 734812
10443G34812q6010l1070j916L4725l6486m7086J9220J04664J25179O4236l0413
$$ 734812 648802 617732 615816 650541 614055 566969 586189 690853 816032 880268 849855
10432H49855N362R1890R5077k0810j05371p7252j18585m5137n6044m3856L393
$$ 849855 855217 947107 1042184 1021374 916003 838751 720166 675029 618985 575129 578522
10421E78522O673k3415L0109j0478n1886J5689N0058j5443n1705l0058M6425j0032
$$ 578522 585195 561780 591889 581411 529525 545214 595272 579829 528124 498066 544491 534459
10409E34459o2867r966L2497k7265j9371O1211k9119o2070q69J247l7646m2809
$$ 534459 471592 461626 494123 466858 447487 508698 479579 417509 416640 417887 380241 337432
10397C37432m1324m741r289j0882M3640J2969r061N982o2447j0190J8680J384
$$ 337432 296108 291367 282078 271196 314836 327805 318744 324726 262279 252089 270769 272153
10385B72153k6564J4705R4248O9516j271k095l0332Q735P8101J26315J41297L9106
$$ 272153 245589 260294 354542 424058 422787 420692 390360 399095 477196 603511 744808 783914
10373G83914q9878n8284k6442j39131j50241q3849l5145k5421n3190o176l7415
$$ 783914 694036 635752 609310 470179 319938 236089 200944 175523 122333 116157 78742
10362G8742l6910R305K4678M376j643L2328K9492j3616L4200K0440m6282p9336
$$ 78742 41832 51137 75815 80191 78548 110876 140368 126752 160952 181392 135110 55774
10350E5774j328L6137O1440p299k5884j7308j2910J6627Q2385L8741j08526q4016
$$ 55774 54446 90583 152023 144724 118840 101532 88622 105249 187634 226375 117849 33833
10338C3833r883M4991k1920k298l3875j6206K8705O892K4795O0992j6564J0259
$$ 33833 23950 68941 47021 44723 10848 -5358 23347 30239 55034 116026 99462 109721
10326A09721K3357m603k5806O2813n046n4744j02914p826j5641p817K2431j3548
$$ 109721 133078 128475 102669 165482 160436 105692 2778 -5048 -20689 -28506 -6075 -19623
10314a9623R968R0949J2778J3503M1020J0974K8195m4964M159n3620j0174K1032
$$ -19623 -9655 81294 94072 107575 148595 159569 187764 142800 146959 93339 83165 104197
10302A04197P3884j2504n5049j6501k572r769l1246k1938j2716m134j0758M0478
$$ 104197 178081 165577 110528 94027 91455 81686 50440 28502 15786 11652 894 41372
10290D1372J738m4456k0433J9359k5403L5882L8908k8067N1974n204L3048k355
$$ 41372 43110 -1346 -21779 -2420 -27823 8059 46967 18900 70874 65670 98718 96363
10278I6363P507K5144l4980O075L751l4823o389L5168J3318N44n091k7379q012
$$ 96363 103870 129014 94034 100109 103860 69037 62648 97816 111134 111678 106587 79208 71196
10265G1196n818k0915L2785M8433m7874k1696k8750L3337j5821k5197L416j0847
$$ 71196 65378 44463 77248 125681 77807 56111 27361 60698 44877 19680 23096 12249
10253A2249J05O4743O700j07242M16J7924j5280Q6390L09o1813k5455l2945j0768
$$ 12249 12354 77097 83797 -23445 -23029 -5105 -20385 66005 66314 4501 -20954 -53899 -64667
10240f4667j4781J0470m007N7539K4892K0779M018k0790J5088n2123q8136l4982
$$ -64667 -79448 -68978 -72985 -15446 9446 30225 34243 13453 28541 -23582 -111718 -146700
10228a46700P8135N1765K5072j6135l2545R511K3676M7898M302j1901M5887k3997
$$ -146700 -68565 -16800 8272 -7863 -40408 -30897 -7221 40677 44979 33078 78965 54968
10216E4968n9095J8522K5081J03327K2983k6979J733j740n8613L338j0130j3801
$$ 54968 -4127 14395 39476 142803 165786 138807 140540 138800 80187 83525 73395 59594
10204E9594p429j12300K7618L0834j5245K3004K3194r037l9284k498l7255K9427
$$ 59594 52165 -60135 -32517 -1683 -16928 6076 29270 20233 -19051 -21549 -58804 -29377
10192b9377K1582k4206N366K8581L5784m3699l0364N9502J23881P5022J7659j994
$$ -29377 -7795 -32001 -26635 1946 37730 -5969 -36333 23169 147050 222072 239731 237737
10180B37737L622L4473J943J5518r7414K5748P1554O9407N8390j5274k894j835
$$ 237737 241359 275832 277775 293293 195879 221627 293181 362588 420978 405704 402810 400975
10168D00975O754K1749J9338l7624P8978j0513M064Q1546J05860J64777J92031
$$ 400975 407729 429478 448816 411192 490170 479657 483721 565267 671127 835904 1027935
10157A027935K64055L40252M76266M21327J52258J4551P7342m3608m15336o07688
$$ 1027935 1291990 1632242 2108508 2529835 2682093 2696644 2773986 2730378 2315042 1707354
10147A707354m06201k55479k48703j60179r0325l4161r1854k1757m6037p0497
$$ 1707354 1301153 1045674 796971 636792 546467 512306 420452 398695 352658 282161
10137B82161Q996K4904j6506k8252k5291M6658K4019n1460p5959l2260J025K4289
$$ 282161 291157 316061 299555 271303 246012 292670 316689 265229 189270 157010 158035 182324
10125A82324l554J9408K828j5866j6381m9383j9475K2878k2317k5599k1729K366
$$ 182324 178770 198178 201006 185140 168759 119376 99901 122779 100462 74863 53134 55500
10113E5500l492q3379M8583P2559k0593K2747j141J4006l3612n9767M2257J244
$$ 55500 52008 -31371 17212 89771 69178 91925 90784 104790 71178 11411 53668 54912
10101E4912k8990J6532j8186l0544L3628J4551r548R681J8544K9671j6966l567
$$ 54912 25922 42454 24268 -6276 27352 41903 32355 42036 60580 90251 73285 69718
10089F9718N3054m032n0026m9333J6286J1518n037P891J7575m749o2118J6279
$$ 69718 122772 118740 68714 19381 35667 47185 42148 50039 67614 62865 747 17026
10077A7026L8944J5856J845N6178j9470m6950l1389j7857J4818K7552L0274m8447
$$ 17026 55970 71826 73671 129849 110379 63429 32040 14183 29001 56553 86827 38380
10065C8380O296K6966o4974L0852J6726K6216J65j4913k669j603m113n04L3925
$$ 38380 44676 71642 6668 37520 54246 80462 80627 65714 63045 61442 57329 56825 90750
10052I0750K4921j259j037m9326l2665j9035K008J3466M146k4541r148K4392R774
$$ 90750 115671 114412 113375 64049 31384 12349 14357 27823 31969 7428 -1720 22672 32446
10039C2446O5737l2690l0901o7436m0072p436m435l1692n549k1335K8585N4177
$$ 32446 98183 65493 34592 -32844 -72916 -80352 -84787 -116479 -122028 -143363 -114778 -60601
10027f0601K1212j228j0182j11952n6973J8726L4440Q2851P5448l361l3307l346
$$ -60601 -39389 -40617 -50799 -162751 -219724 -200998 -166558 -83707 -8259 -11620 -44927 -48273
10015d8273K9981J6777l4074J463J7580l1750j3530L1358L9950N8862M9643j8356
$$ -48273 -18292 -1515 -35589 -34126 -16546 -48296 -61826 -30468 9482 68344 117987 99631
10003I9631k9781n2112K6389p756J7213K5775q120k7689K0207k3981k2256p6625
$$ 99631 69850 17738 44127 36371 53584 79359 71239 43550 63757 39776 17520 -59105
9991e9105j648K2219j5012L9571j5606p6227M6578P3660j9418M002J05697K4219
$$ -59105 -60753 -38534 -53546 -13975 -29581 -105808 -59230 14430 -4988 -986 104711 128930
9979A28930l9376l2211m7344l2791k5204j0654L2232N4896J7881L995l2942K3920
$$ 128930 89554 57343 9999 -22792 -47996 -58650 -26418 28478 46359 50354 17412 41332
9967D1332m2494k7061m6423j2704J7139L2408k0349l6564k920N4423L7368J1547
$$ 41332 -1162 -28223 -74646 -87350 -70211 -37803 -58152 -94716 -97636 -43213 -5845 5702
9955E702q092j5376q469P8430N2380L5270M566l4293p4198K7895L8456j8774n8335
$$ 5702 -2390 -17766 -26235 52195 104575 139845 144411 110118 35920 63815 102271 83497 25162
9942B5162n7130k3519L1850m4163j7202K710q078j0496J2772O3349O1772n789
$$ 25162 -31968 -55487 -23637 -67800 -85002 -82292 -90370 -100866 -88094 -24745 37027 31238
9930C1238L8174J7856j5549K0718P077k55J6203k2040k4482Q772m1366k0809k1870
$$ 31238 69412 87268 71719 92437 99514 99259 115462 93422 68940 77712 36346 15537 -6333
9917f333L2772N4983J4812o602l563j7902n2404p704M23K2720J8467k9309j7578
$$ -6333 26439 81422 96234 89632 86069 68167 15763 8059 8482 31202 49669 20360 2782
9904B782n663L6364K4042O8800n015l4775q8373k590O5104l0728l3107N950M2527
$$ 2782 -2881 33483 57525 126325 121310 86535 -1838 -4428 60676 29948 -3159 2791 45318
9891D5318k1917L0081p0960k7865L8338K7438M3204K8269k0102n8619J3314n535
$$ 45318 23401 53482 -17478 -45343 -7005 20433 63637 91906 71804 13185 26499 20964
9879B0964J1959m4748L0645M1725J6939n9684m728k9709j712J8280K7836Q540
$$ 20964 32923 -11825 18820 60545 77484 17800 13072 -16637 -18349 -69 27767 36307
9867C6307m1102k7227N8779m599m2296K255L4011m2817K2799J188J4916N3198
$$ 36307 -4795 -32022 26757 22158 -20138 -17883 16128 -26689 -3890 -2702 12214 65412
9855F5412M6195j8961k8475o7247q3632p596N8694L6388M7981L1891J3583M3087
$$ 65412 111607 92646 64171 -3076 -86708 -94304 -35610 778 48759 80650 94233 137320
9843A37320l2711q8812k6401j8985j4183N0964J9678m3860L44K2292n482j4744
$$ 137320 104609 15797 -10604 -29589 -43772 7192 26870 -16990 -16646 5646 164 -14580
9831a4580L8305M712m2511k8491M3409M3843J5332j3162j1400L2187J3547l5268
$$ -14580 23725 28437 -14074 -42565 844 44687 60019 46857 35457 67644 81191 45923
9819D5923l645j9492l9588l2301J3016l2458L6210M1969K0249j841k2829P34M0316
$$ 45923 42278 22786 -16802 -49103 -36087 -68545 -32335 9634 29883 28042 5213 5947 46263
9806D6263l777l344J8733J1201m5761q4499K1271J1631n0334k2160J9502j5194
$$ 46263 42486 39142 57875 69076 23315 -61184 -39913 -28282 -78616 -100776 -81274 -96468
9794i6468M01J450n003P9879O0709M3178j1485o5283K5249L109k7400J839j9296
$$ -96468 -96067 -94617 -99620 -19741 40968 84146 72661 7378 32627 35736 8336 10175 -9121
9781i121q2815O0401P2298q0310k2697P8426q587m6828k9458Q1667J0392n783
$$ -9121 -91936 -31535 40763 -39547 -62244 16182 7595 -39233 -68691 12976 23368 17585
9769A7585m9065L8855j1905O2814M8972k3316p1962M2498j5927k6097K3469j7058
$$ 17585 -31480 7375 -4530 58284 107256 83940 11978 54476 38549 12452 35921 18863
9757A8863j03471L1724N9795l3512o3060N0352M6904j0643P735o298J8338P767
$$ 18863 -84608 -52884 6911 -26601 -89661 -39309 7595 -3048 4687 -1611 16727 24494
9745B4494L0955k3351k3769j3954q172R952K2519l4851n1415L7835P9783k273
$$ 24494 55449 32098 8329 -5625 -13797 -3845 18674 -16177 -67592 -29757 50026 47753
9733D7753j7644J8543L3308J9077l598j7709o1588N9237K8446l2012k8765K7215
$$ 47753 30109 48652 81960 101037 97439 79730 18142 77379 105825 73813 45048 72263
9721G2263M0083m2655m0017j5970O385L908n4916j7015Q419j3009j1665M3071
$$ 72263 112346 69691 29674 13704 20089 23997 -30919 -47934 -39515 -52524 -64189 -21118
9709b1118L5735L3879K7551k6657p6329k991O6406k6813q7280l1713m459q509
$$ -21118 14617 48496 76047 49390 -26939 -29930 36476 9663 -77617 -109330 -113789 -122298
9697a22298Q159P9045p607L0033K1042k9163m4522n363N1660L360k5069J0840
$$ -122298 -114139 -35094 -42701 -12668 8374 -20789 -65311 -70674 -19014 -15654 -40723 -29883
9685b9883Q974m3237O563O7311R8543L4761k6110m0909m9339k5194n89K2944m7949
$$ -29883 -20909 -64146 -57583 9728 108271 143032 116922 76013 26674 1480 891 23835 -24114
9672b4114p5768M095j3373M7973J12772l0715l6213l4358O4142K5464k0474q735
$$ -24114 -99882 -95787 -109160 -61187 51585 20870 -15343 -49701 14441 39905 19431 10696
9660A0696N220J3856q309j309L5559l1871K5921J16020K0684k7920o77P272j3799
$$ 10696 15916 29772 21463 20154 55713 23842 49763 165783 186467 158547 157870 165142 151343
9647A51343j31119p8411l7112P694N7132K2520K1647o9478l1771l7402N2105M8577
$$ 151343 20224 -58187 -95299 -87605 -30473 -7953 13694 -55784 -87555 -124957 -72852 -24275
9635b4275j8469p0155L1819O4155j7099o1135j4584Q4748N1933j0937n2087o5638
$$ -24275 -42744 -112899 -81080 -16925 -34024 -95159 -109743 -24995 26938 16001 -36086 -101724
9623a01724j057L5221m9990J4339M878N716o0260M4302N1251Q236Q442M023K393
$$ -101724 -102781 -67560 -117550 -103211 -98333 -92617 -152877 -108575 -57324 -49088 -40646 -36623 -34230
9610c4230o2974L0975K8234O5637O40J218n1513M3514L1900q4420l4139K3005
$$ -34230 -97204 -66229 -37995 27642 28282 29500 -22013 21501 53401 -31019 -65158 -42153
9598d2153O2147k0644n8593j767J5811N209j9210K462K3940N0079k8600J4263
$$ -42153 19994 -650 -59243 -61010 -45199 -39990 -59200 -56738 -32798 17281 -11319 2944
9586B944K6784j1735l1352n0921n1971O583M6560O9837L6462j0842j3467J4239
$$ 2944 29728 17993 -13359 -64280 -116251 -109668 -63108 6729 43191 32349 18882 33121
9574C3121P8978J2086m2288n2352p2041l0029N1058N3309p455j0506j9042l578
$$ 33121 112099 124185 81897 29545 -42496 -72525 -21467 31842 24387 13881 -5161 -8739
9562h739k5897l9491M4040K8260J6432j7062k3751K2598L8497L8395j0293q4010
$$ -8739 -34636 -74127 -30087 -1827 14605 -2457 -26208 -3610 34887 73282 62989 -21021
9550b1021p6582N2278R903M691K9283m0684K0762J3978N156m3502m1355M4510
$$ -21021 -97603 -45325 -35422 -30731 -1448 -42132 -21370 -7392 -2236 -45738 -87093 -42583
9538d2583K7438m211l0315J4015K8734K6979M2790k964J1695j8156m1128N058
$$ -42583 -15145 -19356 -49671 -35656 -6922 20057 62847 59883 71578 53422 12294 17352
9526A7352N811j4057j8078j476j0344m8636o525j8527k7296P3631J4291J3573
$$ 17352 23163 9106 -8972 -10448 -20792 -69428 -75953 -94480 -121776 -48145 -33854 -20281
9514b0281J2219K0996K9803L7076j9431l1339L8256M8455K3102o5029p1184l7824
$$ -20281 -8062 12934 42737 79813 60382 29043 67299 115754 138856 73827 2643 -35181
9502c5181q178j2039O3807O4365m3001o2010q016L5973m6710j3706M8089K0385
$$ -35181 -43359 -55398 8409 72774 29773 -32237 -40253 -4280 -50990 -64696 -16607 3778
9490C778J1513N1330n444j465k3216j6365o2489M996J9624L8577J877m1518k6866
$$ 3778 15291 66621 61177 59712 36496 20131 -42358 -37362 -17738 20839 22716 -18802 -45668
9477d5668K6036L3179M7460l7589l3595J4217j6191l3382k2065J7172M6769N975
$$ -45668 -19632 13547 61007 23418 -10177 4040 -12151 -45533 -67598 -50426 -3657 2318
9465B318K1815O473n070l2343m4165M0031O3306j1656m2483O1471J4156o2709
$$ 2318 24133 30606 25536 -6807 -50972 -10941 52365 40709 -1774 59697 73853 11144
9453A1144r153k3338j1230M2214P2440L8923m1034k9818J972n8419k5887J3661
$$ 11144 1991 -21347 -32577 9637 82077 121000 79966 50148 52120 -6299 -32186 -18525
9441a8525N9596K6394l9442q129P96j507M9944L8859n114m5892m7448R721k6139
$$ -18525 41071 67465 28023 19894 20690 19183 69127 107986 102872 56980 9532 19253 -6886
9428f886l6795J8285N1594j8856L4427q700k5016L0m919k1400J7842L5171n0316
$$ -6886 -43681 -25396 26198 7342 41769 33069 8053 8083 3164 -18236 -394 34777 -15539
9415a5539n0266j1886J4548L834M3735J9247p431J6967L4212n7325N223K1655
$$ -15539 -65805 -77691 -63143 -59309 -15574 3673 -3758 13209 47421 -9904 -4681 16974
9403A6974l9479j3988K8460m975J5042N880m2739j0473K714L1486J2041m172k2195
$$ 16974 -22505 -36493 -8033 -13008 2034 7914 -34825 -45298 -42584 -11098 943 -3229 -25424
9390b5424j6024M228J2728L9640L8459k2702n8803K4312pn935O0250K938p6096
$$ -25424 -41448 -37220 -24492 15148 53607 30905 -27898 -3586 -3593 -9528 50722 53660 -22436
9377b2436l2118J9766M5566J034j2199j7070K838m7104m505R9184K7636m2431
$$ -22436 -54554 -34788 10778 11812 -387 -17457 -14619 -61723 -66228 32956 60592 18161
9365A8161L0474K3974J8750l0610l2653k8478j2237k1457k920j7210J924M7201
$$ 18161 48635 72609 91359 60749 28096 -382 -12619 -34076 -36996 -54206 -52282 -5081
9353e081l426N0047K8815J2065l9237m3343J3808j9190l1701N1981P4399l793
$$ -5081 -8507 41540 70355 82420 43183 -160 13648 -5542 -37243 14738 89137 85344
9341H5344n3917K4901L908n498N7720p565l9694P0716P562m8683o6501j3106j7648
$$ 85344 31427 56328 60236 54738 112458 104893 65199 135915 143477 94794 28293 15187 -2461
9328b461k3419L8358J0248n0507j5815L0154J7653m5411k3373O7217k7039K0651
$$ -2461 -25880 12478 22726 -27781 -43596 -13442 4211 -41200 -64573 2644 -24395 -3744
9316c744p336N91K0965J4965p672j171o3599l6085j7987L7787R7584k730m4823
$$ -3744 -11080 -10489 10476 25441 17769 16598 -47001 -83086 -101073 -63286 34298 31568 -13255
9303a3255o52k158K1506j5252Q725K5217J4472j9259r409L9468o78j9661k1157
$$ -13255 -13907 -16065 5441 -9811 -1086 24131 38603 19344 9935 49403 48725 29064 7907
9290G907k6686k4337J794M4145j9458k6559jJ9695K5975L6474k7470m1653j6965
$$ 7907 -18779 -43116 -41322 2823 -16635 -43194 -43195 -23500 2475 38949 11479 -30174 -47139
9277d7139P889M0942k9663m0176N3023P1464R449Q501k732n8756k9672k2772N3433
$$ -47139 -39250 1692 -27971 -68147 -15124 56340 65789 74290 71558 12802 -16870 -39642 13791
9264A3791J046j089L841r980J8526m505j7639q9294k7549O6422P6991o0955q982
$$ 13791 14837 13748 17589 7609 26135 21630 3991 -85303 -112852 -46430 30561 -30394 -39376
9251c9376M7007N9747K2532j4167N7k4303p9759j6253K1439m139J0262j7099O1601
$$ -39376 7631 67378 89910 75743 75800 51497 -28262 -44515 -23076 -27215 -16953 -34052 27549
9238B7549L4185l2611N698M9063k6815p8128m762J5005K0463J7154j3332J1994
$$ 27549 61734 29123 34821 83884 57069 -21059 -25821 -10816 9647 26801 13469 25463
9226B5463K1142r108m1302J0875J1644L2028J6325q54P865L1833l0233n7379J0425
$$ 25463 46605 37497 -3805 7070 18714 50742 67067 66213 74078 105911 75678 18299 28724
9213B8724J9410J3927J1166p7754j2197O8482q386j1046Q534q7954j6193J5704
$$ 28724 48134 62061 73227 -4527 -16724 51758 43372 32326 40860 -47094 -63287 -47583
9201d7583J8747N0748n341o0695M4562M3676j2316Q843n972l7921j0778K870p2571
$$ -47583 -28836 21912 16571 -44124 438 44114 31798 40641 34669 -3252 -14030 -11160 -83731
9188h3731p4089K0544O6466j6427m3499k9792O732k4699M7264M6299M3843M2775
$$ -83731 -157820 -137276 -70810 -87237 -130736 -160528 -153796 -178495 -131231 -84932 -41089 1686
9176A686K3473J3478K936n1383k1318j012M2734j2181O3643K0992O853o1953p6724
$$ 1686 25159 38637 41573 -9810 -31128 -32140 10594 -1587 62056 83048 89901 27948 -48776
9163d8776l4497M8746K8611O7869N4217l0410l1899p438l4584m4738j9907j014
$$ -48776 -83273 -34527 -5916 61953 116170 85760 53861 46423 11839 -32899 -52806 -53820
9151e3820K7644N6789J070j5170o6578j8465L6466k0356j1597m1389P310J5830
$$ -53820 -26176 30613 31683 16513 -50065 -68530 -32064 -52420 -64017 -105406 -98096 -82266
9139h2266Q2863N2735k8622l1460k4265J4494N0215M9937M3448p1599k1371r126
$$ -82266 597 53332 24710 -6750 -31015 -16521 33694 83631 127079 55480 34109 24983
9127B4983l2760J2759N2694n7986M4667N1463J0765n5126L979J2469J3089m7145
$$ 24983 -7777 4982 57676 -310 44357 95820 106585 51459 55438 67907 80996 33851
9115C3851N826N21q279j9695N751M414l9885j4748J3616P075K3361K0131R466
$$ 33851 39677 40198 31919 12224 17975 22389 -17496 -32244 -18628 -11553 11808 31939 41405
9102D1405N4922k2084j05966n6811l281K267J3834J9445L6245O623M5492L4142
$$ 41405 96327 74243 -31723 -88534 -91815 -89548 -75714 -56269 -20024 -13401 32091 66233
9090F6233R523m5562o1919k0242J2174J7037j3099Q183m734L6704J7638R91m3450
$$ 66233 75756 30194 -31725 -51967 -39793 -22756 -35855 -27672 -32406 4298 21936 22927 -20523
9077b0523m8623k047O638j8688j9535O3256O1448q511Q268j5100o6716n9660P547
$$ -20523 -69146 -71193 -64555 -83243 -102778 -39522 21926 13415 21683 6583 -60133 -119793 -112246
9064a12246M8876P3925L251k9088l0706N4772M5782j3473j2902q1520l6173O4289
$$ -112246 -63370 10555 13806 -15282 -45988 8784 54566 41093 28191 -53329 -89502 -25213
9052b5213N175o791L8037J8987K925M4980O393L5445J4071j06650m6288N1049
$$ -25213 -20038 -26829 11208 30195 33120 78100 84493 119938 134009 27359 -18929 32120
9040C2120L4944o622k7106L67K2887L0164j7743m0955r134l6861r391J290j0853
$$ 32120 67064 60442 33336 33703 56590 86754 69011 28056 18922 -17939 -27330 -26040 -36893
9027c6893j4803j9469P0523J413m1039k7854L7752P4731k1485l2333L6024k1460
$$ -36893 -51696 -71165 -642 771 -40268 -68122 -30370 44361 22876 -9457 26567 5107
9015E107p000k9263m7549Q3400m696j2081R727m038k6233K3094L8912k5390k723
$$ 5107 -1893 -31156 -78705 4695 -1 -12082 -2355 -6393 -32626 -9532 29380 3990 1267
9002A267L0705n861n7822l7037L8583M8717k5815l2160J3055K5491N3103j9106
$$ 1267 31972 26111 -31711 -68748 -30165 18552 -7263 -39423 -26368 -877 52226 33120
8990C3120K0039K3738L6692j4376k6653m9554k9491L8477M150M0034n4362l2026
$$ 33120 53159 76897 113589 99213 72560 23006 -6485 31992 36142 76176 21814 -10212
8978a0212N224O76K756l4472j3421O2861Q5871M815o1317N601O708k2464p0362
$$ -10212 -4988 -4312 -1556 -36028 -49449 13412 99283 104098 42781 48382 55090 32626 -37736
8965c7736p0536P3205O0605L5348k1785R186K5382M6845J44p9280o2859k4663
$$ -37736 -108272 -35067 25538 60886 39101 48287 73669 120514 120658 41378 -21481 -46144
8953d6144n120K2361r234K7481O768l3148L3454O320R000J4753k7379l3367l75
$$ -46144 -51264 -28903 -38137 -10656 -3888 -37036 -3582 2738 11738 26491 -888 -34255 -34630
8940c4630l2213J331R500k939J3218K9646J6885L2335J0255j3822l4989L1512
$$ -34630 -66843 -65512 -56012 -58951 -45733 -16087 798 33133 43388 29566 -5423 26089
8928B6089j035k0782L6491k8770m1896j0084o2917N4443K1794M10K8161M3376
$$ 26089 25054 4272 40763 11993 -29903 -39987 -102904 -48461 -26667 -26257 1904 45280
8916D5280k7460j7233k6345N8220K6582j20218p2973M6850M8018k395J5087j7838
$$ 45280 17820 587 -25758 32462 59044 -61174 -134147 -87297 -39279 -41674 -26587 -44425
8904d4425M6411k4226l8053K953N2400M2873j9481l0840q385l7166M6173R143
$$ -44425 1986 -22240 -60293 -57340 -4940 37933 18452 -12388 -20773 -57939 -11766 -2623
8892b623L6367R539m6325Q480K1318k2178l3747m371K3011J1606k6063L545K4270
$$ -2623 33744 43283 -3042 5438 26756 4578 -29169 -33540 -10529 1077 -24986 -21441 2829
8879B829o79l1714J9533J7800m0043k0693M2698J9611L6841M57N09m0032j0005
$$ 2829 2150 -29564 -10031 7769 -32274 -52967 -10269 9342 46183 46640 47149 7117 -2888
8866b888k1994l048n0379L9389Q3695L7466m027m2825l5099j0400j4133j4926
$$ -2888 -24882 -27930 -78309 -38920 44775 82241 78214 35389 290 -10110 -24243 -39169
8854c9169L258k7795L7125m472L9260M3752L1057m6943q79k4335j9983O8038l0095
$$ -39169 -35911 -63706 -26581 -31053 8207 51959 83016 36073 35194 10859 -9124 58914 28819
8841B8819k3974r019L3402L3687K688p0125j13221M946R3361O4958J051l8786
$$ 28819 4845 -4174 29228 62915 65603 -4522 -117743 -112797 -19436 45522 46573 7787
8829G787j890p3157k8795J9395K6473L8901k4064J2547J44m371J3234K5901o7156
$$ 7787 5897 -67260 -96055 -76660 -50187 -11286 -35350 -22803 -22659 -27030 -13796 12105 -55051
8816e5051k972R503n3384J632N9929L5189o216L3354K6406O980K194k2464l1095
$$ -55051 -58023 -48520 -101904 -100272 -40343 -5154 -11370 21984 48390 55370 57564 35100 4005
8803D005m704J3638K0660L3317J3615n7429m4708K3526O709J3318k863o8826J8185
$$ 4005 -699 12939 33599 66916 80531 23102 -21606 1920 8629 21947 19084 -49742 -31557
8790c1557J0204k0124J1456k3345k9252K0444n6006j7017L2269N7148L8928J4380
$$ -31557 -21353 -41477 -30021 -53366 -82618 -62174 -118180 -135197 -102928 -45780 -6852 7528
8778G528j1940k580m751K3935N0695k762m7648J1717P332J7388J3660l9525l8407
$$ 7528 -4412 -6992 -11743 12192 62887 60125 12477 24194 31526 48914 62574 23049 -15358
8765a5358k0715P683L009J2969m21O9484M7133q073o9769J2414p363r1905k6623
$$ -15358 -36073 -28390 -25381 -12412 -12833 56651 103784 95711 25942 38356 30993 -60912 -87535
8752h7535P2970R1919J8874q2053l4624l0459K9861K2142j0050k3473R0147K730
$$ -87535 -14565 77354 96228 14175 -20449 -50908 -21047 1095 -8955 -32428 57719 60449
8740F0449K0111L4255K9147m5126p1540q326l4944J6440O137O8807J5554k5160
$$ 60449 80560 114815 143962 98836 27296 18970 -15974 466 6603 75410 90964 65804
8728F5804j087k8521j4192j849m780O4732J9639K565L0669m4559n1613K9786R045
$$ 65804 64717 36196 22004 20155 15375 80107 99746 102311 132980 88421 36808 66594 75639
8715G5639m5528q4385J338M9024K2913N756J221j2216j1088J2455p415K1750K8835
$$ 75639 30111 -54274 -52936 -3912 19001 24757 25978 13762 2674 15129 7714 29464 58299
8702E8299n8950k5871k6804j1963M9769O4446K6121j9649P9694k6117k6606K9447
$$ 58299 -651 -26522 -53326 -65289 -15520 48926 75047 55398 135092 108975 82369 111816
8690A11816K4885k8266j0229l2813l212q8970j131p093j5123q722K7783J1133
$$ 111816 136701 108435 98206 65393 62181 -26789 -27920 -35013 -50136 -58858 -31075 -19942
8678a9942J0987k177n383R860K7880P704j8239j4654L1450l859m2852k991J3359
$$ -19942 -8955 -11132 -16515 -6655 21225 28929 10690 -3964 27486 23627 -19225 -22216 -8857
8665h857k6496j9176j2763N0108N9245k802k9008n8932j7793J7608j9004Q349
$$ -8857 -35353 -54529 -67292 -17184 42061 39259 10251 -48681 -66474 -48866 -67870 -59521
8653e9521L2777J7784l071M1311K8543k581M4467n1641o2134m827Q334o856j33
$$ -59521 -26744 -8960 -12031 29280 57823 55242 99709 48068 -14066 -18893 -10559 -17415 -17548
8640a7548K290j5766K6642M4502K612K5453N342j1845J4371N849m1719l9595K8931
$$ -17548 -15258 -31024 -4382 40120 42732 68185 73527 61682 76053 81902 40183 588 29519
8627B9519L1062n4473k9755N3436L3918M30j2596M7218L4115m9282m9379k2798
$$ 29519 60581 6108 -23647 29789 63707 64137 51541 98759 132874 83592 34213 11415
8615A1415N010o3241L0109j984m2534k1088L2167R3480N057k2612o978q4205Q256
$$ 11415 16425 -46816 -16707 -18691 -61225 -82313 -50146 43334 48391 25779 18801 -65404 -57148
8602e7148M7346L2981R1213O1689m5043n1249r6807j2330j4559m9349l5264j3974
$$ -57148 -9802 23179 114392 176081 131038 79789 -17018 -29348 -43907 -93256 -128520 -142494
8590a42494O3125L429K3510Q1655K4863J4873m696Q806n830l3122J0557l6071
$$ -142494 -79369 -75940 -52430 29225 54088 68961 64265 73071 67241 34119 44676 8605
8578H605J3001P439N005k4973j4463m0417J1817M4588O805l6005n0252k6402O2143
$$ 8605 21606 29045 34050 9077 -5386 -45803 -33986 10602 17407 -18598 -68850 -95252 -33109
8565c3109K0933k5078q243k2319R673J8227L8059q226p678O080k8138k1141Q548
$$ -33109 -12176 -37254 -45497 -67816 -58143 -39916 -1857 -10083 -17761 -11681 -39819 -60960 -52412
8552e2412J9862m042l4916j6188j336L7138J8082K9851N200J7384k1213M4285
$$ -52412 -32550 -36592 -71508 -87696 -89032 -51894 -33812 -3961 1239 18623 -2590 41695
8540D1695m0826j6635o017J0968l0O4900K7663j2934k8873k9401N2692Q308P9038
$$ 41695 869 -15766 -21783 -10815 -10845 54055 81718 68784 39911 10510 63202 71510 150548
8527A50548j573m5952j1442l5196j5630k0166K5179m8330k4692q740k9041K967
$$ 150548 148975 103023 91581 56385 40755 20589 45768 -2562 -27254 -35994 -65035 -62068
8515f2068M705M6106k8442j2205j6791K496K6969N9843j207k7256p3855R324O3200
$$ -62068 -57363 -11257 -39699 -51904 -68695 -66199 -39230 20613 19406 -7850 -81705 -72381 -9181
8502i181P2489L7955l6023q9857j01542L3343N8183O9074k6307n9751j9036L8393
$$ -9181 63308 101263 65240 -24617 -126159 -92816 -34633 34441 8134 -51617 -70653 -32260
8490c2260J8729P608N4092j0099q133r677L002J8258l0478j6254M8301k8998n6673
$$ -32260 -13531 -5923 48169 38070 29937 20260 23262 41520 11042 -5212 43089 14091 -42582
8477d2582n920O8382j5277k9518L7036M0998L7259o762n7157n7462r064p2242
$$ -42582 -48502 19880 4603 -24915 12121 53119 90378 83616 26459 -31003 -40067 -112309
8465a12309l2149Q6893N0554L9970n229R0243k2112k1399k4357Q479R519k2261
$$ -112309 -144458 -57565 -7011 32959 27730 117973 95861 74462 50105 58584 68103 45842
8453D5842o8844j9472N6714l561q5488r068k876q295K2050J0479L0601N7545m1757
$$ 45842 -23002 -42474 14240 10679 -74809 -83877 -86753 -95048 -72998 -62519 -31918 25627 -16130
8440a6130m5145o951L7496O543l8150J2320L1828P010l3293j9564J7818M1614
$$ -16130 -61275 -68226 -30730 -24187 -62337 -50017 -18189 -11179 -44472 -64036 -46218 -4604
8428d604K496J285M0005k68n1535m427J0632j5086L6348j6157q13K1757l0646
$$ -4604 -2108 -823 39182 38914 -12621 -17048 -6416 -21502 14846 -1311 -2124 19633 -11013
8415a1013m1666j4159r650J1334L4400K2173l661L3022J5134M3162R012p0665
$$ -11013 -52679 -66838 -76488 -65154 -30754 -8581 -12242 20780 35914 79076 88088 17423
8403A7423k6623L8684K0919J5201J1458J3905O6610M4611J4740o7563l7830L7565
$$ 17423 -9200 29484 50403 65604 77062 90967 157577 202188 216928 149365 111535 149100
8391A49100P8748J2087m5615m0667j2027n4602o2015p0621j3920m9749k429M5773
$$ 149100 227848 239935 194320 153653 141626 87024 25009 -45612 -59532 -109281 -111710 -65937
8379f5937N0377O0862r300p064k2925K4522o190K5032o864O987j6811l5983k8414
$$ -65937 -15560 45302 36002 28938 6013 30535 24345 49377 42513 49500 32689 -3294 -31708
8366c1708J9677M5530j2403j1931K9928l0524m0134M8963J4384m8106K60K5758
$$ -31708 -12031 33499 21096 9165 39093 8569 -31565 17398 31782 -16324 -16064 9694
8354I694J7484M9582M9222P2920R4870N9542K3091n0759n1352q1874r063o4334
$$ 9694 27178 76760 125982 198902 293772 353314 376405 325646 274294 192420 183357 119023
8342A19023m4738l4396n008L634m1307p0949O491J21288J0085k3178p546k6837
$$ 119023 74285 39889 34881 38515 -2792 -73741 -67250 54038 64123 40945 33399 6562
8330F562p0223l0277N3343o809M3308J1651m9418K2919k6282l817L4561Q676n024
$$ 6562 -63661 -93938 -40595 -47404 -4096 7555 -41863 -18944 -45226 -49043 -14482 -5806 -10830
8317a0830O552K7013k5437m8749n875P9484N5144M4333j4785K4725N2385o9303
$$ -10830 -4278 22735 -2702 -51451 -57326 22158 77302 121635 106850 131575 183960 114657
8305A14657j9133L800K7990M0815m8872o4138N723j9424k3231k1936m2040J2932
$$ 114657 95524 99324 127314 168129 119257 55119 60842 41418 18187 -3749 -45789 -32857
8293c2857L0378l1311J2914J0608k5485L3928Q2196l5970p2408K3915j205j0396
$$ -32857 -2479 -33790 -20876 -10268 -35753 -1825 80371 44401 -28007 -4092 -5297 -15693
8281a5693R3690M5021r6373m1910k6485O3569L2357n6787O2j1436j6380O890P84
$$ -15693 77997 123018 26645 -15265 -41750 21819 54176 -2611 -2549 -13985 -30365 -23475 -22691
8268b2691l7188K9198L6333j2315K4598j3263k5769J1886K7021J3605M779l5761
$$ -22691 -59879 -30681 5652 -6663 17935 4672 -21097 -9211 17810 31415 36194 433
8256D33o0976P9405r717o185K3162k517j9999J3860K3006m0974L4705l3565l5383
$$ 433 -60543 18862 9145 2960 26122 23605 3606 17466 40472 -502 34203 638 -34745
8243c4745N9589P2803m1117n7170k5660M1376k6381r0728l297J5671J6015K2832
$$ -34745 24844 97647 56530 -640 -26300 15076 -11305 -102033 -105330 -89659 -73644 -50812
8231e0812K3242m0519K5429P000J7330M2212k7165q1628l0672K5465j7925j9182
$$ -50812 -27570 -68089 -42660 -35660 -18330 23882 -3283 -84911 -115583 -90118 -108043 -127225
8219a27225M9253L8175j1844N788Q8123J3517l7407l105j5722k5748r093Q265
$$ -127225 -77972 -39797 -51641 -45853 42270 55787 18380 15275 -447 -26195 -35288 -27023
8207b7023P0160Q534j4170p2335n8791O819k5255J5184O0754N2406K0017M0881
$$ -27023 43137 51671 37501 -34834 -93625 -86806 -112061 -96877 -36123 16283 36300 77181
8195G7181N0019l511k5651k5911l7653j7617k444l6511j0045j4727m9661N8220
$$ 77181 127200 123689 98038 72127 34474 16857 14413 -22098 -32143 -46870 -96531 -38311
8183c8311Q5228L7355n4793k2493j5411k0131l6387k2630P209M7751M0663p243
$$ -38311 46917 84272 29479 6986 -8425 -28556 -64943 -87573 -80364 -32613 8050 807
8171H07m1006M7420L1891o5700m010N1352m9391j4333J5850J5597J6466l6167
$$ 807 -40199 7221 39112 -26588 -30598 20754 -28637 -42970 -27120 -11523 4943 -31224
8159c1224K2629l5466k7107O9813J2646k00N0432j2550l2660j7795k6734r08O9706
$$ -31224 -8595 -44061 -71168 -1355 11291 11091 61523 48973 16313 -1482 -28216 -29124 40582
8146D0582Q7257p2065m9836j1355N832P129n464o96m6340L2057K5669K6589o0189
$$ 40582 127839 55774 5938 -5417 415 7544 2080 1384 -44956 -12899 12770 39359 -20830
8133b0830k2530j1617L2066L3347R34k0894l266J5210j8464K1546K0520n7946
$$ -20830 -43360 -54977 -22911 10436 11370 -9524 -12790 2420 -16044 5502 26022 -31924
8121c1924p2746L594n1053K0645P6175N067m1396P377J8105j2027Q260M3484J2786
$$ -31924 -104670 -101076 -152129 -131484 -55309 -50242 -91638 -84261 -66156 -78183 -69923 -26439 -13653
8108a3653J6633n3063k6698J6787M619K9289j764n3842L5014Q2156k7047n6064
$$ -13653 2980 -50083 -76781 -59994 -55375 -26086 -27850 -81692 -46678 35478 8431 -47633
8096d7633o405k0614j3876j4576N7638M3239J6928j123K8263m2791q518L4376
$$ -47633 -54038 -74652 -88528 -103104 -45466 -2227 14701 13578 41841 -950 -9468 24908
8084B4908J7898Q097n9044l0775o030m0778L4380M604P7267L497q809k4417l0491
$$ 24908 42806 50903 -8141 -38916 -44946 -85724 -51344 -46740 30527 34024 25215 798 -29693
8071b9693j7387j8860Q7747J3897J33N2268J0258n2461o9314O0645P1828K7315
$$ -29693 -47080 -65940 21807 35704 35837 88105 98363 45902 -23412 37233 109061 136376
8059A36376l0178q3495l9247p973l5975o6487K989Q0726P6158l3079n0375J9137
$$ 136376 106198 22703 -16544 -24517 -60492 -126979 -123990 -43264 32894 -185 -50560 -31423
8047c1423l3273k9439N1499q038n4829O272K8621L4675L7134P0756o762q1400
$$ -31423 -64696 -94135 -42636 -50674 -105503 -99231 -70610 -35935 1199 71955 65193 -16207
8035a6207O7764L4299J3507n3076k6778N2042M1804k9961L5117K1513m2286n0520
$$ -16207 51557 85856 99363 46287 19509 71551 113355 83394 118511 140024 97738 47218
8023D7218M383J3467n4966n9723n3287L5340L617r305J2715J911P9834Q2806j4376
$$ 47218 51601 65068 10102 -49621 -102908 -67568 -63951 -73256 -60541 -58630 21204 104010 89634
8010H9634o6423j3168Q3181P506r0425n7417L530J4866O794p410M7663j2855J2100
$$ 89634 23211 10043 93224 100730 10305 -47112 -43582 -28716 -21922 -29332 18331 5476 17576
7997A7576r7061j1613R199j4348J7446K4868M4893J4159P36K4622J9939j5610
$$ 17576 -79485 -91098 -81899 -96247 -78801 -53933 -9040 5119 5855 30477 50416 34806
7985C4806m5174N374J8760l5765M112l1365M9172J4172J4651J7668k1309l876
$$ 34806 -10368 -4994 13766 -21999 -17887 -49252 -80 14092 28743 46411 25102 21226
7973B1226j8012m3379R864N7788M2507m2274m105k6790k1366m9382O8333m05m6881
$$ 21226 3214 -40165 -30301 27487 69994 27720 23615 -3175 -24541 -73923 -5590 -5995 -52876
7960e2876J8610J3975l5664l1921J1411M0748P6366K3199j0042m4326l4467k4916
$$ -52876 -34266 -20291 -55955 -87876 -76465 -35717 40649 63848 53806 9480 -24987 -49903
7948d9903L5913J8103k5070o5234m336Q8272k4626N253L2938m0566J6310J3683
$$ -49903 -13990 4113 -20957 -86191 -90527 -2255 -26881 -21628 11310 -29256 -12946 737
7936G37k3934J254j3929j0139J2945k4880K5990L5816r242l0473k4287J521J07623
$$ 737 -23197 -21943 -35872 -46011 -33066 -57946 -31956 3860 -5382 -35855 -60142 -58621 49002
7923D9002L5741o3167l3750o110J4915J4366m305K9468L237j7952k3959l7478
$$ 49002 84743 21576 -12174 -18284 -3369 10997 6692 36160 39397 21445 -2514 -39992
7911c9992j0862o6553K1750P865M5104q28l7364J9808K4736P651J2280l4892J9366
$$ -39992 -50854 -117407 -95657 -87792 -42688 -43516 -80880 -61072 -36336 -28685 -16405 -51297 -31931
7898c1931L1273K3623L5432M9371p468n0424j4844R246k0283k2095j128M2220
$$ -31931 -658 22965 58397 107768 100300 49876 35032 44278 23995 1900 772 42992
7886D2992l9676m8931R74N8818L8187q465n7970k502m8094R293Q34M1019p948
$$ 42992 3316 -45615 -44641 14177 52364 43899 -14071 -16573 -64667 -55374 -54540 -13521 -21469
7873b1469n9564M8224O5872J1287k3293l8334l9078K3650P99L0196N1566m0101
$$ -21469 -81033 -32809 33063 44350 21057 -17277 -56355 -32705 -31906 -1710 49856 9755
7861I755n1047J5142J1026J5070l5392M4589P3641K2221j6817k461J9930k222
$$ 9755 -41292 -26150 -15124 -54 -35446 9143 82784 105005 88188 85727 105657 103435
7849A03435J5928l7256J424n5849o0653M9066l675L0950n7861m8689j278O6285
$$ 103435 119363 82107 83531 27682 -32971 16095 12420 43370 -14491 -63180 -64458 1827
7837A827K8629o2311n306J6243R0071O5053k9683p8867l7128n5668l1239L6412
$$ 1827 30456 -31855 -37161 -20918 69153 134206 104523 25656 -11472 -67140 -98379 -61967
7825f1967J7368j9885J1993L0683J9144L4950M0861O0528l8990j7593q965n71
$$ -61967 -44599 -64484 -52491 -21808 -2664 32286 73147 133675 94685 77092 68127 67556
7813F7556m1929m0032N6067J7064q2805k0034k018M8661K1445k3825j3946q228
$$ 67556 25627 -14405 41662 58726 -24079 -44113 -46131 2530 23975 150 -13796 -22024
7801b2024k509J0083K4844m439k3713L4862L2338K4869l0426j1247q045k3555
$$ -22024 -24533 -14450 10394 5955 -17758 17104 49442 74311 43885 32638 24593 1038
7789A038J986l9071L2253L6122l0621j5589l2297j5186l2079L3933P2232O993
$$ 1038 3024 -36047 -3794 32328 1707 -13882 -46179 -61365 -93444 -59511 12721 19714
7777A9714j3564J8763j9924J1750P8397j3641o8366k6142L8486j377J0065j7012
$$ 19714 6150 24913 4989 16739 95136 81495 13129 -13013 25473 24096 34161 17149
7765A7149n376p9726j6743O4468L956N4782M096m7829N5735o9382o7938O900P0908
$$ 17149 11773 -67953 -84696 -20228 -16272 38510 42606 -5223 50512 -18870 -86808 -79908 -9000
7752i000J1936l0237n4956L6307R1853j3016k3400L0364l733j3525L1323J5826
$$ -9000 2936 -27301 -82257 -45950 45903 32887 9487 39851 36118 22593 53916 69742
7740F9742j2016j8196L1659l8946j2554l3912Q941m5951l872J5638O4293m1562
$$ 69742 57726 39530 71189 32243 19689 -14223 -5282 -51233 -55105 -39467 24826 -16736
7728a6736o1974J5387M0337K1081m050n0005l281Q8059k8144p5781n431M3106
$$ -16736 -78710 -63323 -22986 -1905 -5955 -55960 -59241 28818 674 -75107 -80538 -37432
7716c7432j5674k4358P5422J5862N9705K0075l7788q1790k1993N2446M5116j7647
$$ -37432 -53106 -77464 -2042 13820 73525 93600 55812 -25978 -47971 4475 49591 31944
7704C1944l7788n9849k1082M055k984M1931M4885l6356J2071m5248j0654J9597
$$ 31944 -5844 -65693 -86775 -82720 -85704 -43773 1112 -35244 -23173 -68421 -79075 -59478
7692e9478j885J0699J2677l5273p3156N0840P3337M4191n5614j2891L8985l0781
$$ -59478 -61363 -50664 -37987 -73260 -146416 -95576 -22239 21952 -33662 -46553 -7568 -38349
7680c8349J1549K6735J8594M726m747j6715m9748j0590M3689J7657j4098j6607
$$ -38349 -26800 -65 18529 23255 18508 1793 -47955 -58545 -14856 2801 -11297 -27904
7668b7904l8539L7282j0464q794l8870O0157M8464K8877N0082j4890j6193n1909
$$ -27904 -66443 -29161 -39625 -48419 -87289 -27132 21332 50209 100291 85401 69208 17299
7656A7299m8969L2636j9471k1909l3867p4421J134j1326J9708N2727Q4911K8375
$$ 17299 -31670 966 -18505 -40414 -74281 -148702 -147568 -158894 -139186 -86459 -1548 26827
7644B6827m3567n2067j1224j3467j031j844J2537L7723j1124L7512j1891j8039
$$ 26827 -16740 -68807 -80031 -93498 -94529 -96373 -83836 -46113 -57237 -19725 -31616 -49655
7632d9655k6794L025k983K8166j313K5721J7973k2988L5433l7891k9502K8808
$$ -49655 -76449 -73424 -76407 -48241 -49554 -23833 -5860 -28848 6585 -31306 -60808 -32000
7620c2000p425j393k3508k4245K4374M7288r45J7528N6598l2200j2996K3041J8732
$$ -32000 -39425 -40818 -64326 -88571 -64197 -16909 -17854 -326 56272 24072 11076 34117 52849
7607E2849l8098M0148r397k4473M2830j1038j9634n4808J8236J5347K7016k005
$$ 52849 14751 54899 45502 21029 63859 52821 33187 -21621 -3385 11962 38978 36973
7595C6973O796l0195n4470m2863J9494Q2623P0029k5611k1976k7938K4303J7384
$$ 36973 43769 13574 -40896 -83759 -64265 18358 88387 62776 40800 12862 37165 54549
7583E4549j3546j1515l1666k7182L9792K3014k903N2930m202k5631p0637J4940
$$ 54549 41003 29488 -2178 -29360 10432 33446 30543 83473 79271 53640 -16997 -2057
7571b057j6307j0491j74k8913J812J3933P283l7476q665j3388L1545N0085J4318
$$ -2057 -18364 -28855 -29029 -57942 -56130 -42197 -34914 -72390 -81055 -94443 -62898 -12813 1505
7558A505j0976n5338O907K8051l7239K2656O0820L901L4674k455J6285N5155m2068
$$ 1505 -9471 -64809 -57902 -29851 -67090 -44434 16386 20287 54961 52506 68791 123946 81878
7545H1878o0585K7980K2344k6951n3424q500L6754M3122O607j2350m769k0746
$$ 81878 21293 49273 71617 44666 -8758 -17258 19496 62618 69225 56875 52106 31360
7533C1360j1710J0010L5073p227n3100p7711M782J15080L0184k7908q360j8926
$$ 31360 19650 29660 64733 57506 4406 -73305 -68523 46557 76741 48833 40473 21547
7521B1547l790J5605L1025j278p9762n4962J3942J3815M1605P6019N0693n2284
$$ 21547 17757 33362 64387 63109 -16653 -71615 -57673 -43858 -2253 73766 124459 72175
7509G2175l5413r1490K3878j4755r809P0892K7972q4804o986j4133m790L015O2735
$$ 72175 36762 -54728 -30850 -45605 -55414 15478 43450 -41354 -48340 -62473 -67263 -64248 -1513
7496a513O4721R269k3924p2443j0491M5624l3814n8925j3055O60L3866M4491N6680
$$ -1513 63208 72477 48553 -23890 -34381 11243 -22571 -81496 -94551 -93891 -60025 -15534 41146
7483D1146m530j6683K2992p029k7241Q012k6234o0232n2361L8285L4877l8974
$$ 41146 36616 19933 42925 35896 8655 16667 -9567 -69799 -122160 -83875 -48998 -87972
7471h7972O2305Q1507R523J0833J3010q5897j8953J2442q167l5697J0964N1552
$$ -87972 -25667 55840 65363 76196 89206 3309 -15644 -3202 -11369 -47066 -36102 15450
7459A5450K3342L6879K0352n6862k8425j6675R129k4326L013K8300j6956K3902
$$ 15450 38792 75671 96023 39161 10736 -5939 3190 -21136 -18123 10177 -6779 17123
7447A7123L3124M9108J7486o4769o3138l8409n3414k8338N5652P8553j4183k6021
$$ 17123 50247 99355 116841 52072 -11066 -49475 -102889 -131227 -75575 2978 -11205 -37226
7435c7226k4185j6361J0288R464R63R68K66M69K8845K9457J1561l948k0670k7684
$$ -37226 -61411 -77772 -67484 -58020 -57057 -56089 -55823 -55354 -26509 2948 14509 10561 -10109 -37793
7421c7793q402R3293N8737j1904K0142r594p0147r3934M666O2946j6710k0491
$$ -37793 -46195 47098 105835 93931 114073 104479 34332 -59602 -54936 8010 -8700 -29191
7409b9191P556l0272l556N5844j0207m2971L4790J3790l3994K6813R541k4668
$$ -29191 -21635 -51907 -55463 381 -9826 -52797 -18007 -4217 -38211 -11398 -1857 -26525
7397b6525O345M3696M8221K2958m7898j182k5024n8360n929K6531M0555l1342
$$ -26525 -20180 23516 71737 94695 46797 45615 20591 -37769 -43698 -17167 23388 -7954
7385g954k4920j5817n2442N689Q9008n6483k7470J0381N205l310J752L7123L4726
$$ -7954 -32874 -48691 -101133 -95444 -6436 -62919 -90389 -80008 -74803 -78113 -76361 -39238 -4512
7372d512P0154l0653k4178K0435k573k7887k7636l321Q2708J6959m4368o2277
$$ -4512 65642 34989 10811 31246 28673 786 -26850 -30171 52537 69496 25128 -37149
7360c7149J9199M4776k0343k8345M353M6844K444Q461n7426p263K5232P4519k0222
$$ -37149 -17950 26826 6483 -21862 -17509 29335 31779 40240 -17186 -24449 783 75302 55080
7347E5080j03987k2390N0595M0238O7377n8006m9229K9904l3328q6504P4500R8578
$$ 55080 -48907 -71297 -20702 19536 86913 28907 -20322 9582 -23746 -110250 -35750 62828
7335F2828p964l2870J9695K524L440L2210q147L2444k6108m6983m7277M2607O6940
$$ 62828 54864 21994 41689 44213 47653 79863 71716 104160 78052 31069 -16208 26399 93339
7322I3339l595K4997M9703M605n1071l2776K4422J030l7842O253o2129n1342J7084
$$ 93339 89744 114741 164444 169049 117978 85202 109624 110654 72812 79065 16936 -34406 -17322
7309a7322k2248j8714L1347M3979K9853O1214l980k8279n8282k6033L6983P829
$$ -17322 -39570 -58284 -26937 17042 46895 108109 104129 75850 17568 -8465 28518 36347
7297C6347k2954N913M8835l2359m3528k4786Q80J2547l7606k346r891N5800L4072
$$ 36347 13393 19306 68141 35782 -7746 -32532 -31652 -19105 -56711 -59057 -68948 -13148 20924
7284B0924J1571r75l6769n0545k4294K0656J0049O940P2552N680r1337n25k6868
$$ 20924 32495 31520 -5249 -55794 -80088 -59432 -49383 -42443 30109 35789 -55548 -56073 -82941
7271h2941N537J2149K3557k0659Q534L5481J5496o767j1862Q821m7966q4293N141
$$ -82941 -77404 -65255 -41698 -62357 -53823 -18342 -2846 -9613 -21475 -12654 -60620 -144913 -139772
7258a39772J6538K5842L4386Q5042M8520k7891l5567l5548l3696L545K9643p791
$$ -139772 -123234 -97392 -63006 22036 70556 42665 7098 -28450 -62146 -58601 -28958 -36749
7246c6749J360L4273r390l5218J9107J9447O64J4009M0466l7660k269O9269K741
$$ -36749 -35389 -1116 -10506 -45724 -26617 -7170 -6506 7503 47969 10309 8040 77309 80050
7233H0050K630K484n7623K012K8373k8861r170q99k5845J7441L3095J3841j7672
$$ 80050 82680 85164 27541 29553 57926 29065 19895 18996 -6849 10592 43687 57528 39856
7220C9856p3838k5976K9480M754j0677l7127R651P8090K7443K0160l0117k5100
$$ 39856 -33982 -59958 -30478 -25724 -36401 -73528 -63877 14213 41656 61816 31699 6599
7208F599J1201K3796J4193l8356J1284m8971j8724n0849q9448P732N9118Q7335
$$ 6599 17800 41596 55789 17433 28717 -20254 -38978 -89827 -179275 -171543 -112425 -25090
7196b5090J4683K7312l881J2175M33j4912j3235L3236J3546L4625k0824o592l4971
$$ -25090 -10407 16905 13024 25199 25632 10720 -2515 30721 44267 78892 58068 51476 16505
7183A6505N88K583n4746m7969k7289J8580L3161J7416K3913j5054j7735K5844
$$ 16505 17093 19676 -35070 -83039 -110328 -91748 -58587 -41171 -17258 -32312 -50047 -24203
7171b4203J9381R055n1845m8344L4176P969o483j3286J1781O28n0604N4159N3287
$$ -24203 -4822 4233 -47612 -95956 -61780 -53811 -60294 -73580 -61799 -61171 -111775 -57616 -4329
7158d329j0843k1276N969K0602K6697R58L9029k8133p6621l0246k4674M334J0867
$$ -4329 -15172 -36448 -30479 -9877 16820 17778 56807 28674 -47947 -78193 -102867 -98533 -87666
7145h7666L2172m6315l0226k4176N7550O6505K515o0037J1880J0221k6114l4814
$$ -87666 -55494 -101809 -132035 -156211 -98661 -32156 -29641 -89678 -77798 -67577 -93691 -128505
7133a28505p467M0233O3427K2463K0364M4420J1574n8784M54p554M885P5909L6462
$$ -128505 -135972 -95739 -32312 -9849 10515 54935 66509 7725 8179 625 5510 81419 117881
7120A17881l6555o3977N519k4042K2484L6868l3862J0362O9089l8900n7695N112
$$ 117881 81326 17349 22868 -1174 21310 58178 24316 34678 103767 64867 7172 12284
7108A2284K211r302k1102o437L2828K5230j384K0485K3485k9535l4411M2217m1718
$$ 12284 14495 5193 -15909 -22346 10482 35712 34328 54813 78298 48763 14352 56569 14851
7095A4851m5945M7306p523J850K1214j4220J8623k7482k7935k5468m232L07P3032
$$ 14851 -31094 16212 8689 10539 31753 17533 36156 8674 -19261 -44729 -48961 -48654 24378
7082B4378J5770k6699n037q306P890k994p6191l8788J7977J03186J11170K2152
$$ 24378 40148 13449 8412 106 7996 5002 -71189 -109977 -92000 11186 122356 144508
7070A44508n1746m1878m0374m3889N207R161n0957k2749M5013M2083R406j7133
$$ 144508 92762 50884 10510 -33379 -28172 -19011 -69968 -92717 -47704 -5621 3785 -13348
7058a3348p981J8161M8698J6532q148q216k9163j1476N7435o3843n3657n5256
$$ -13348 -21329 -3168 45530 62062 53914 45698 16535 5059 62494 -1349 -55006 -110262
7046a10262O2932M1513J1831J5338p277j3520n0621Q656J3129o789L5516k796
$$ -110262 -47330 -5817 6014 21352 14075 555 -50066 -41410 -28281 -35070 446 -2350
7034b350K8305o850j0229L3927P3413J3481p1240n0514j4706M2120L0606J5678
$$ -2350 25955 19105 8876 42803 116216 129697 58457 7943 -6763 35357 65963 81641
7022H1641J3339J7134k1662n3879k4541M930m7369m5951M3362J8378j6399j2150
$$ 81641 94980 112114 90452 36573 12032 16962 -30407 -76358 -32996 -14618 -31017 -43167
7010d3167L2827L6146J3281j607K213q3288j6312m9076L8257N6344P49K6179l2970
$$ -43167 -10340 25806 39087 37480 39693 -43595 -59907 -108983 -70726 -14382 -13633 12546 -20424
6997b0424M8560L2950M440N832L4427P943L314m0164n3932m2325J914M8385p034
$$ -20424 28136 61086 65526 71358 105785 113728 117042 76878 22946 -19379 -17465 30920 23886
6984B3886l4221K1061J379m8069l7198m409N4252J5359J3398l190n382L1906J9049
$$ 23886 -10335 10726 12105 -35964 -73162 -77571 -23319 -7960 5438 2248 -3134 28772 47821
6971D7821k020l2627j8216j5697m9722j6033P0996J04968j6877K865l867m7370
$$ 47821 45801 13174 -5042 -20739 -70461 -86494 -15498 89470 72593 75458 71591 24221
6959B4221q857J9184k202r369l8962R949j2602m8828M0221L8210l1249k8555M1393
$$ 24221 15364 34548 32346 22977 -15985 -6036 -18638 -67466 -27245 10965 -20284 -48839 -7446
6946g446k7603K925K7902K7733L5390L428m6384o6400m4253k3392L4340O5954
$$ -7446 -35049 -32124 -4222 23511 58901 62329 15945 -50455 -94708 -118100 -83760 -17806
6934a7806L6351J28n851n152J0712k8469p2174j211O4931P1996q657j5946j9226
$$ -17806 18545 18673 12822 7670 18382 -10087 -82261 -83472 -18541 53455 44798 28852 9626
6921I626P7618k6215n9585k6419q0339M306Q8179Q665K5049K0443p546m1931k1515
$$ 9626 87244 61029 1444 -24975 -105314 -101008 -12829 -4164 20885 41328 33782 -8149 -29664
6908b9664j6215N4891k9760l7581m0315k4434N9054M8124n84j0243K7293P942
$$ -29664 -45879 9012 -20748 -58329 -98644 -123078 -64024 -15900 -16484 -26727 566 8508
6896H508K4739N130n8698p239K4200j3275K429N2054R552n9427q041M064m0159
$$ 8508 33247 38377 -20321 -27560 -3360 -16635 -14206 37848 47400 -12027 -20068 -16004 -56163
6883e6163L5996j791J619N779R876n5425j8082N286j4099k2689L3394J04603J8077
$$ -56163 -20167 -21958 -20339 -14560 -4684 -60109 -78191 -72905 -87004 -109693 -76299 28304 46381
6870D6381p2312J6296J3672k4762r0529p8390K8083P0282L1141J6129K4920N4247
$$ 46381 -25931 -9635 4037 -20725 -111254 -189644 -161561 -91279 -60138 -44009 -19089 35158
6858C5158r070l6172n4655J2596m5829J3864J8285l9175J4373K6470k7005q758
$$ 35158 26088 -10084 -64739 -52143 -97972 -84108 -65823 -104998 -90625 -64155 -91160 -99918
6846i9918N2120J0963J075K7138J9533K0840L205r178m3304j0659M7562j1267
$$ -99918 -47798 -36835 -35760 -8622 10911 31751 34956 25778 -17526 -28185 19377 8110
6834H110J1809L6568m1928Q872j8416q2505J6070N9575r563m3225o2945K7796
$$ 8110 19919 56487 14559 23431 5015 -77490 -61420 -1845 -11408 -54633 -117578 -89782
6822h9782N0128J4270l0490l6344q9885k1157R5484J00029K017l9812J5094N145
$$ -89782 -39654 -25384 -55874 -92218 -182103 -203260 -107776 -7747 -5730 -45542 -30448 -25303
6810b5303l9032k5310K8268M7262p083l5146J1835J6073j4813l5570J0372J3355
$$ -25303 -64335 -89645 -61377 -14115 -21198 -56344 -44509 -28436 -43249 -78819 -68447 -55092
6798e5092M2810N5222n7854n8266j7089K4025J177O396J5857M6325O9465k5113
$$ -55092 -12282 42940 -14914 -73180 -90269 -66244 -65067 -58671 -42814 3511 72976 47863
6786D7863q1869p1443J1440K8091K0190q723O2237J4605K9879L8542l161L9245
$$ 47863 -34006 -105449 -94009 -65918 -45728 -54451 7786 22391 52270 90812 87651 126896
6774A26896j9540l2408j7875l0190K6729M4198l6003p2167m8459J7325O2753Q0044
$$ 126896 107356 74948 57073 26883 53612 97810 61807 -10360 -58819 -41494 21259 101303
6762A01303m9377p8378k9754K9391j1221J583k1200J2510J02369L4495m3284m1861
$$ 101303 51926 -26452 -56206 -26815 -38036 -36453 -57653 -45143 57226 91721 48437 6576
6750F576K7263l181k3044j7862l0241K2306N0614L0199M2673j1251j421o176q747
$$ 6576 33839 30658 7614 -10248 -40489 -18183 32431 62630 105303 94052 92631 86455 77708
6737G7708k8106j6027k2939L411O3714l821j4944m4312M488o1542J152N350K8468
$$ 77708 49602 33575 10636 14047 77761 73940 58996 14684 19172 -42370 -41218 -35868 -7400
6724g400M6460k5847k0518m0375n5112M7344L7438J6188J10867L1395n1961k0325
$$ -7400 39060 13213 -7305 -47680 -102792 -55448 -18010 -1822 109045 140440 88479 68154
6712F8154j4656L842Q482n0801L2824J388m3599k7605n367L6940j3815m3831K7058
$$ 68154 53498 57340 65822 15021 47845 49233 5634 -21971 -27338 9602 -4213 -48044 -20986
6699b0986N6559k0940l4035M066Q441L0550o0614q1394M1876K2153k4816J5643
$$ -20986 35573 14633 -19402 -15336 -6895 23655 -36959 -118353 -76477 -54324 -79140 -63497
6687f3497L5133k209l7653L0829K78M631j8844J7138K6002m454n4337L491j5945
$$ -63497 -28364 -30573 -68226 -37397 -37119 -32488 -51332 -34194 -8192 -12646 -66983 -63492 -79437
6674g9437L1145k6600L5525J5514j7160Q6959j3462r7764k2981L7951j3279k0446
$$ -79437 -48292 -74892 -39367 -23853 -41013 45946 32484 -65280 -88261 -50310 -63589 -84035
6662h4035O3071N5239l5334l3853l7040l2112O2173N6969R00j7731l1545n399
$$ -84035 -20964 34275 -1059 -34912 -71952 -104064 -41891 15078 15978 -1753 -33298 -38697
6650c8697M2671K7579j3372l3331n6459K7039O2344J2204k3161O5199K9274k62
$$ -38697 3974 31553 18181 -15150 -71609 -44570 17774 29978 6817 72016 101290 101028
6638A01028k0994m3802j4706l222K942o539P2924m7402j935L5109n4055m6745
$$ 101028 80034 36232 21526 18304 21246 14707 87631 40229 38294 73403 19348 -27397
6626b7397N922L2374J4424k0211J941J0053j4494k601J9707M3245j6325m56k3992
$$ -27397 -21475 10899 25323 5112 7053 17106 2612 11 19718 62963 46638 46182 22190
6613B2190j143m8888O691O1418M1253j9201o0704l0167O518K5743L8184j7323
$$ 22190 21047 -27841 -21150 40268 81521 62320 1616 -28551 -22033 3710 41894 24571
6601B4571J6073K3788n2940n8812J6294J58J6945L3660Q668P945N7432l2031n9654
$$ 24571 40644 64432 11492 -47320 -31026 -30868 -13923 19737 28405 36350 93782 61751 2097
6588B097l3064J1428O1742j221r9903J3616o222J736q680M9479O0790l9701l3935
$$ 2097 -30967 -19539 42203 40982 -58921 -45305 -51527 -49791 -58471 -8992 51798 12097 -21838
6575b1838N2081J6966L8129L7707n3837k6249J9698j1514J8486k4292k100n5665
$$ -21838 30243 47209 85338 123045 69208 42959 62657 51143 69629 45337 43237 -12428
6563a2428m3807j1020N9349l3335j4711K8940O4155J9712j1835l1301K106J096
$$ -12428 -56235 -67255 -7906 -41241 -55952 -27012 37143 56855 45020 13719 15825 16921
6551A6921j2025o7903L4163P7686J6808q552o2166J2036O4715J14k4544J1122
$$ 16921 4896 -63007 -28844 48842 65650 57098 -5068 6968 71683 71797 47253 58375
6539E8375l1142m0446j3093K6898l0206o308j8213r777Q109N0701N5560j3148
$$ 58375 27233 -13213 -26306 592 -29614 -35922 -54135 -63912 -55803 -5102 50458 37310
6527C7310o3042M416N479L2158j6991r4064K4742M2847K1399k9607N4631J8804
$$ 37310 -25732 -21316 -15837 16321 -670 -94734 -69992 -27145 -5746 -35353 19278 38082
6515C8082k8981J991J8932r755K5609l88K709R815Q103o2574k7661j4515j5737
$$ 38082 9101 11092 30024 20269 45878 45490 48199 58014 66117 3543 -24118 -38633 -54370
6502e4370P3519P6291j4684k2332p1059j4922J5061K3421l0524k4558J2896M9072
$$ -54370 19149 95440 80756 58424 -12635 -27557 -12496 10925 -19599 -44157 -31261 17811
6490A7811L9805k2813l1717l019j0795Q8012K5242k5824k8369j2294L8517L3678
$$ 17811 57616 34803 3086 67 -10728 77284 102526 76702 48333 36039 74556 108234
6478A08234m8556j8446L417l9099l9338k4480O695m4133O476J6131k9551N204
$$ 108234 59678 41232 44649 5550 -33788 -58268 -51573 -95706 -89230 -73099 -102650 -97446
6466i7446P6052M2244j8007m0190N334k4439O856L5420J8984J0184j8842L5933
$$ -97446 -21394 20850 2843 -37347 -32013 -56452 -49596 -14176 4808 14992 -3850 32083
6454C2083L4589k8529j7140K2498J9276k1497l2144K9135O6433l1904o5622M0252
$$ 32083 66672 38143 21003 43501 62777 41280 9136 38271 104704 72800 7178 47430
6442D7430P3435k2727j4784k5012K1694J3992k4592m5317J1893j6109L9641J1594
$$ 47430 120865 98138 83354 58342 80036 94028 69436 24119 36012 19903 59544 71138
6430G1138k524m4892n0100k6633j3626L5108j617P673J6510k248P170J4190l6462
$$ 71138 68614 23722 -26378 -53011 -66637 -31529 -33146 -25473 -8963 -11211 -4041 10149 -26313
6417b6313m1450j0079j7509j4087l5416N0421M0969N8688k7210p2448k9650k061
$$ -26313 -67763 -77842 -95351 -109438 -144854 -94433 -53464 5224 -21986 -94434 -124084 -126145
6405a26145n185K8143O6756p392J8037K832L814k0067M2077P7560j5442m3645
$$ -126145 -131330 -103187 -36431 -43823 -25786 -22954 -19140 -39207 2870 80430 64988 21343
6393B1343k4266p863L0415P5105J1794J806N779l0294r44J2061l0069j3778n2157
$$ 21343 -2923 -10786 19629 94734 106528 108334 114113 83819 82875 94936 64867 51089 -1068
6380a068q5976m9955J14091M2873J1228M958K2202L3315l7505m4080Q547K6505
$$ -1068 -87044 -136999 -22908 19965 31193 36151 58353 91668 54163 10083 18630 45135
6368D5135L2338j2501l9715k4353J0066L184k2013m1047l7058M3771N0521Q231
$$ 45135 77473 64972 25257 904 10970 14154 -7859 -48906 -85964 -42193 8328 16559
6356A6559m4163l4323P7955J5908o880J318j1462L1935N3224j5733j3720k122
$$ 16559 -27604 -61927 16028 31936 25056 26374 14912 46847 100071 84338 70618 68496
6344F8496P1425k5487l4498P586k9172l3915M1707l6116N990J0764J2064j7985
$$ 68496 139921 114434 79936 87522 58350 24435 66142 30026 36016 46780 58844 40859
6332D0859l5031L9405J4725K09M316j6416k2979K1901n0076n5104L7898M7451
$$ 40859 5828 45233 59958 60167 64483 48067 25088 46989 -3087 -58191 -20293 27158
6320B7158m4159l356j4379J4543j7892j1106l2441L2645M8796K1949J4685m710
$$ 27158 -17001 -20357 -34736 -20193 -38085 -49191 -81632 -48987 -191 21758 36443 31733
6308C1733J6068l3680J092J6677M1553O803R470L5181j8830k0015n2466n8607
$$ 31733 47801 14121 15213 31890 73443 80246 89716 124897 106067 86052 33586 -25021
6296b5021L0030K9647o620K4314p5211l064L5154L079j6245K3601J1513J5686
$$ -25021 5009 34656 28036 52350 -22861 -25925 9229 12308 -3937 19664 31177 46863
6284D6863L0243O096J7719j3455m0211p8277k579k38K2315L1814j4820L4781J3461
$$ 46863 77106 83202 100921 87466 47255 -31022 -33601 -33839 -11524 20290 5470 40251 53712
6271E3712m5893l1526K2681j8337l8909o728N1331k5429j7099J2648m194O231
$$ 53712 7819 -23707 -1026 -19363 -58272 -65000 -13669 -39098 -56197 -43549 -47743 -41512
6259d1512P5755L8828J3286m1449m9224p4485j4514L4114j8112L1274K4535L0494
$$ -41512 34243 73071 86357 44908 -4316 -78801 -93315 -59201 -77313 -46039 -21504 8990
6247H990L5840j9796N048m1509L550O6560j4396k7830m2149k9942K5368Q617n54
$$ 8990 44830 25034 30082 -11427 -7877 58683 44287 16457 -25692 -55634 -30266 -21649 -22203
6234b2203M0075P838m8825m4908J0039j8308J258N6515K5339k8790N3675Q1591
$$ -22203 17872 25710 -23115 -68023 -57984 -76292 -75034 -18519 6820 -21970 31705 113296
6222A13296j8732m6056l4670l751J4092n3375n8786q011J8962P3713j2962p2472
$$ 113296 94564 48508 13838 10087 24179 -29196 -87982 -95993 -77031 -3318 -16280 -88752
6210h8752L5884M4525l1626L7074J1430k6963P8735l6079m3508R178M0494O8202
$$ -88752 -52868 -8343 -39969 -2895 8535 -18428 60307 24228 -19280 -10102 30392 98594
6198I8594j0966q8244K1321O446j6807k97k9102l7493k4018m085L2452O7789m704
$$ 98594 87628 -616 20705 27151 10344 10047 -19055 -56548 -80566 -84651 -52199 15590 10886
6185A0886n4758l0476j3975R0912j2481o1428K8917J2065K4693J2414M8484j0414
$$ 10886 -43872 -74348 -88323 2589 -9892 -71320 -42403 -30338 -5645 6769 55253 44839
6173D4839M4480l4388m9176k4422k6760K762L4443m380J4140k1965k272k7819
$$ 44839 89319 54931 5755 -18667 -45427 -42665 -8222 -12602 1538 -20427 -22699 -50518
6161e0518q7478R236O0534N0730j060j7568m292M1431O038K3215l3730k6848j0543
$$ -50518 -137996 -128760 -68226 -17496 -18556 -36124 -40416 1015 7053 30268 -3462 -30310 -40853
6148d0853L5195M7247L2757j063m3110k9605L0077K7741l1451p9717L4864N6279
$$ -40853 -5658 41589 74346 73283 30173 568 30645 58386 26935 -52782 -17918 38361
6136C8361k8157M416M1892m7171J8459J8231m9280l8713O912M4583O2262r65n3084
$$ 38361 10204 14620 56512 9341 27800 46031 -3249 -41962 -35050 9533 71795 70830 17746
6123A7746n3166q135J8342K1037J3130j7354J2641o474K2861m621O505N6944J3358
$$ 17746 -35420 -43555 -25213 -4176 8954 -8400 4241 -2233 20628 16007 22512 79456 92814
6110I2814J3574l3654j8206m49L4244p762j02783O106L5892K0979K7149o95J9457
$$ 92814 106388 72734 54528 54079 88323 80561 -22222 -16116 19776 40755 67904 67209 86666
6097H6666L7725j6628m8561o057k8813R559k5996k9095q135n402K4940m341N845
$$ 86666 124391 107763 59202 53145 24332 33891 7895 -21200 -29335 -34737 -9797 -14138 -8293
6084h293J1773L3879m4332k4414M144M6206L0925l5973j7881n47L8784l4663l570
$$ -8293 3480 37359 -6973 -31387 -27243 18963 49888 13915 -3966 -4513 34271 -392 -3962
6071c962L084j5045M7268J5445k9099K5703M6582n479k3905n8150Q291K0960Q20
$$ -3962 -878 -15923 31345 46790 17691 43394 89976 84497 60592 2442 10733 31693 32513
6058C2513j5547o9889n455M1307o3682n7459J4741Q1131J1293L4661L3254n3698
$$ 32513 16966 -52923 -58378 -17071 -80753 -138212 -123471 -42340 -31047 3614 36868 -16830
6046a6830l9329l3386q833J9449J8201K8013J4954l3862k654k8653P7390K8456
$$ -16830 -56159 -89545 -98378 -78929 -60728 -32715 -17761 -51623 -54277 -82930 -5540 22916
6034B2916L2092l4762J670r789o1092j0185j7935N6928L3586O5037l658k7127
$$ 22916 55008 20246 21916 12127 -48965 -59150 -77085 -20157 13429 78466 74808 47681
6022D7681j8082N313n7468M872P1501j8514j3022k5299K9107m757m2129l5738
$$ 47681 29599 34912 -22556 -17684 53817 35303 22281 -3018 26089 21332 -20797 -56535
6010e6535L281L6207P0631k5934o136j6721j00646o707L7236n9250M3372J2450
$$ -56535 -53254 -17047 53584 27650 21514 4793 -95853 -102560 -65324 -124574 -81202 -68752
5998f8752o651R5245P1323l7857k5059j1791o3929j6622Q262Q371m561L9513O5192
$$ -68752 -75403 19842 91165 53308 28249 16458 -47471 -64093 -55831 -47460 -52021 -12508 52684
5985E2684M2243K6339K419k8699m2208o5322j0596R856m6363k0125J5202k5576
$$ 52684 94927 121266 123685 94986 52778 -12544 -23140 -13284 -59647 -79772 -64570 -90146
5973i0146L7271J7565k68P820q712K5989L4578J1180J4990l5711r8562l4596K8146
$$ -90146 -52875 -35310 -35578 -27758 -36470 -10481 24097 35277 50267 14556 -84006 -118602 -90456
5960i0456O5694M3504m159m4620k9899L2619P847k4765l670l4763l1517O8602
$$ -90456 -24762 18742 14583 -30037 -59936 -27317 -19470 -44235 -47905 -82668 -114185 -45583
5948d5583O7558M495M7125P5730j6832q6207j4104l5646J31l9868K443O2078j0402
$$ -45583 21975 26470 73595 149325 132493 46286 32182 -3464 -3333 -43201 -40758 21320 10918
5935A0918k2311J954K5585J1102k9177r221K250J5538J2752M6993J7407k5369
$$ 10918 -11393 -9439 16146 27248 -1929 -11150 -8900 6638 19390 66383 83790 58421
5923E8421m0964l5917j085R039K8090k8813o8209N022l400k6462M8182N2050M4751
$$ 58421 17457 -18460 -19545 -10506 17584 -11229 -79438 -74416 -77816 -104278 -56096 -4046 40705
5910D0705J2798K1847l3472m3534K4814O4770o8338n2156O646P39l6899j0544
$$ 40705 53503 75350 41878 -1656 23158 87928 19590 -32566 -25920 -25181 -62080 -72624
5898g2624q729m443K5957l1220k3242k7590L6651P3110O9785k0205l9648J7449
$$ -72624 -81353 -85796 -59839 -91059 -114301 -141891 -105240 -32130 37655 17450 -22198 -4749
5886d749N5154M0725m0507O348p193k8072K5992J7699j3691j520M463m2587k8705
$$ -4749 50405 91130 50623 56971 49778 21706 47698 65397 51706 50186 54649 12062 -16643
5873a6643k5753k4455K8840j3102J0885N6292N962o2575M0848J3867o7332J9980
$$ -16643 -42396 -66851 -38011 -51113 -40228 16064 22026 -40549 299 14166 -53166 -33186
5861c3186O1111P4275M3585L9475k6554m7496J7159M8125l4465q9878k4954q523
$$ -33186 27925 102200 145785 185260 158706 111210 128369 176494 142029 52151 27197 18674
5849A8674p4926l2270P8049m3679m9821J9821N6623j0181l4777l1367N2394P5775
$$ 18674 -56252 -88522 -10473 -54152 -103973 -84152 -27529 -37710 -72487 -103854 -51460 24315
5837B4315K8740J8J03236J4016l1393p7326l8814J4120k9628j978P952J4398k1532
$$ 24315 53055 53073 156309 170325 138932 61606 22792 36912 7284 5306 13258 27656 6124
5824F124o6842J4633N2334l3058j9540R627l4037K1394j7485M6047k631m7716
$$ 6124 -60718 -46085 6249 -26809 -46349 -36722 -70759 -49365 -66850 -20803 -23434 -71150
5812g1150N4594K1491k555k8049J6265J210p725N8999M1826k3035o4319J2516
$$ -71150 -16556 4935 2380 -25669 -9404 -8194 -15919 43080 84906 61871 -2448 10068
5800A0068k6690m4601M033P1664K7823q564m0380M6789J2062p5074Q933M6K7322
$$ 10068 -16622 -61223 -57190 14474 42297 33733 -6647 40142 52204 -22870 -13937 -13891 13431
5787A3431N9820P0814K0972m7609m1349j23070m933K7731L2377k192K4729k4552
$$ 13431 73251 144065 165037 117428 76079 -46991 -51924 -24193 8184 5992 30721 6169
5775F169j8403M6598Q197k4561o4731L1873K9872l2802J6535J6294K2284J4620
$$ 6169 -12234 34364 42561 18000 -46731 -14858 15014 -17788 -1253 15041 37325 51945
5763E1945O8633K898J4735J135n1955k8092o2526M8692M0535n8366k9165k8381
$$ 51945 120578 123476 138211 139346 87391 59299 -3227 45465 86000 27634 -1531 -29912
5751b9912k8077M0118O268j4945L2582o463j0717j2191P0477J9030k4258K7060
$$ -29912 -57989 -17871 -11603 -26548 6034 -429 -11146 -23337 47140 66170 41912 68972
5739F8972M2222j4552l9748n6008m5766j5630R844O4603N2255K9624j1329k3502
$$ 68972 111194 96642 56894 886 -44880 -60510 -50666 13937 66192 95816 84487 60985
5727F0985j5754N801m4252j3499M376P756k6250k2361k3804L0871N7171J13399
$$ 60985 45231 51032 6780 -6719 -2343 5413 -20837 -43198 -67002 -36131 21040 134439
5715A34439Q1920o3723j36949m6428M1199J8621m1758n4518O9434O8773n086k7143
$$ 134439 216359 152636 15687 -30741 10458 29079 -12679 -67197 2237 71010 65924 38781
5703C8781m5450L7021k0544N347Q7171r230n8680n7741m2590M5983M7639q388
$$ 38781 -6669 30352 9808 15155 102326 93096 34416 -23325 -65915 -19932 27707 19319
5691A9319L6379M3210k4140n5229k6672R502L0106M0062n4795r379l5219l983
$$ 19319 55698 98908 74768 19539 -7133 2369 32475 72537 17742 8363 -26856 -30839
5679c0839O6324r680m4929J7506O1421k5774l2058o3807m735R53K7262J4128M6978
$$ -30839 35485 25805 -19124 -1618 59803 34029 1971 -61836 -66571 -65618 -38356 -24228 22750
5666B2750k2543l7792M8153M7278L7771o130O036k6952O2093k2971q6859n5506
$$ 22750 207 -37585 10568 57846 95617 89487 95523 68571 130664 107693 20834 -34672
5654c4672k2192n3251o525J9223m6206N6579M0703j0451M3369O50L4944J0581
$$ -34672 -56864 -110115 -116640 -97417 -143623 -87044 -46341 -56792 -13423 -12773 22171 32752
5642C2752l6386j4006K5525M660l2369j0323n5156J8825M6685L8316p984R624
$$ 32752 -3634 -17640 7885 12545 -19824 -30147 -85303 -66478 -19793 18523 10539 20163
5630B0163Q373k3838J4885O639o1695j8191M5794l0678m715L4058L3812n4344
$$ 20163 28536 4698 19583 26222 -35473 -53664 -7870 -38548 -43263 -9205 24607 -29737
5618b9737k8479l3292M1152L0800L3115O6793K3523n9515m6946n7951M7766K7200
$$ -29737 -58216 -91508 -50356 -19556 13559 80352 103875 44360 -2586 -60537 -12771 14429
5606A4429m7951o2948K7613L3601j5487J4434j781m6383J3733Q0033K2741k1305
$$ 14429 -33522 -96470 -68857 -35256 -50743 -36309 -38090 -84473 -70740 9293 32034 10729
5594A0729N0726k1238J405N2977k1351o7559p7825J346K4980P386M0093M2305
$$ 10729 61455 40217 41622 94599 73248 5689 -72136 -70790 -45810 -38424 1669 43974
5582D3974l2952m9147k2772k1798J4898R3930K6942m4057J1568m897l4042n7715
$$ 43974 11022 -38125 -60897 -82695 -67797 26133 53075 9018 20586 15689 -18353 -76068
5570g6068q693K2733n63p902l2935M4211N1582N062l5806O0694N3757r536q8484
$$ -76068 -84761 -62028 -62591 -70493 -103428 -59217 -7635 -2573 -38379 22315 76072 66536 -21948
5557b1948m6165k32N467L9642J6058r487o339K0410n0663K5632O4119l399p794
$$ -21948 -68113 -68345 -62878 -23236 -7178 -16665 -23004 -2594 -53257 -27625 36494 33095 25301
5544B5301J0731j2767P952l9277L775m7449l3749O9774K1699q330J4263J6370
$$ 25301 36032 23265 31217 -8060 -4285 -51734 -85483 -15709 5990 -2340 11923 28293
5532B8293j0514m9204K7655M6939n2957q439K8124K0431J1819n3653l0208p031
$$ 28293 17779 -31425 -3770 43169 -9788 -18227 9897 30328 42147 -11506 -41714 -48745
5520d8745N4425K7021J0490n8866k7045M9973L275O6196K9299K4005K3534k3352
$$ -48745 5680 32701 43191 -15675 -42720 7253 10528 76724 106023 130028 153562 130210
5508A30210m8784m8424r853j3374K221J0250n2361m3091K3114M8871K828q011
$$ 130210 81426 33002 23149 9775 11996 22246 -30115 -73206 -50092 -1221 1607 -6404
5496f404L798J6479P0457N490k8288k5315j7499L2776j1939Q505L0459m890j9880
$$ -6404 -2606 13873 84330 89820 61532 36217 18718 51494 39555 48060 78519 73629 53749
5483E3749k2392N962k3423L073l3028l4662J061O1223O0327m4740k2183r221k7780
$$ 53749 31357 37319 13896 16969 -16059 -50721 -49660 11563 71890 27150 4967 -4254 -32034
5470c2034M0252L3974j272k1588m7493j714J6207J4859M732p577O593j8578J07
$$ -32034 8218 42192 40920 19332 -28161 -29875 -13668 1191 5923 -1654 4939 -13639 -13532
5457a3532k9194K3009N8261j4160k8072K6359K4202O5273L019j16207k3327L1425
$$ -13532 -42726 -19717 38544 24384 -3688 22671 46873 112146 115165 -1042 -24369 7056
5445G056P668o1375k4052k7944k554K88N8362K7098J0911k2414m338O6536k4928
$$ 7056 14724 -46651 -70703 -98647 -101201 -100913 -42551 -15453 -4542 -26956 -31294 35242 10314
5432A0314k0457L3716L8432k0898j8011j6289q10K7794k8537n507L164K0075P6034
$$ 10314 -10143 23573 62005 41107 23096 6807 5997 33791 5254 -253 2911 22986 99020
5419I9020j891n3770j5538p5252J0608L6468l2686m2953K5191o791j1766Q2495
$$ 99020 97129 43359 27821 -47431 -36823 -355 -33041 -75994 -50803 -57594 -69360 13135
5407A3135P2979Q409J979m2248n2374l5675K0768l0093n6048k770K1030k1304
$$ 13135 86114 94523 96502 54254 1880 -33795 -13027 -43120 -99168 -101938 -80908 -102212
5395a02212K0237L1122j020q995l7893N6993P9474Q388J9795j3251j730q8274
$$ -102212 -81975 -50853 -51873 -60868 -98761 -41768 37706 46094 65889 52638 50908 -37366
5383c7366j2970L152l637J3403q644M3210J5320j5436K2421k2612l9786K980q27
$$ -37366 -50336 -47184 -50821 -37418 -46062 -2852 12468 -2968 19453 -3159 -42945 -39965 -40792
5370d0792p114N3766l9417m2295K4039Q12Q940J1214O099m5462p3489M1149N4115
$$ -40792 -47906 5860 -33557 -75852 -51813 -51001 -42061 -30847 -24748 -70210 -143699 -102550 -48435
5357d8435n90k374l73L1812p484j7508K7139N223n273K1566k4193J8744j1214
$$ -48435 -49025 -51399 -51772 -19960 -27444 -44952 -17813 -12590 -17863 3703 -20490 -1746 -12960
5344a2960K2116j7670L18j8649j7611L114L9499l7100m839j4162N682O8926j0041
$$ -12960 9156 -8514 -8196 -26845 -44456 -41342 -1843 -38943 -43782 -57944 -52262 16664 6623
5331F623q8087P9983K3607o970q270n2701n772K0381J4682N5820J8285r144R910
$$ 6623 -81464 -1481 22126 15156 6886 -45815 -51587 -31206 -16524 39296 57581 48437 58347
5318E8347j10397n7230L1864N1106m417M9938N832l7029m7755M728q375J3721
$$ 58347 -52050 -109280 -77416 -26310 -30727 19211 25043 -11986 -59741 -55013 -63388 -49667
5306d9667O7447N8633Q333m042l6705j1619k649L1562O670K6083l8298n8115O986
$$ -49667 17780 76413 84746 80704 43999 32380 29731 61293 67963 94046 55748 -2367 4619
5293D619N5281J05j8680o8854o1862O6671L21j0000k0763J685O590l3993n3057
$$ 4619 59900 60005 41325 -27529 -89391 -22720 -22399 -32399 -53162 -51477 -44887 -78880 -131937
5280a31937k8386J0125J8518J03148M2991l8744o2010k7710L2383R9604K9771
$$ -131937 -160323 -150198 -131680 -28532 14459 -24285 -86295 -114005 -81622 17982 47753
5269D7753O457m6405m0802K6124p031M3077K7031L748r2078m5682N2761J3788
$$ 47753 54210 7805 -32997 -6873 -13904 29173 56204 59952 -32126 -77808 -25047 -11259
5257a1259r329P06L614J1432j8369M177K1672j5971m5246m153K7982j0725m135
$$ -11259 -20588 -19882 -16268 -4836 -23205 -19028 2644 -13327 -58573 -62726 -34744 -45469 -49604
5244d9604k3580J0968P4905L4771l214r847K7602N6779N427n7855m0090k9160
$$ -49604 -73184 -62216 12689 47460 44246 34399 62001 118780 124207 66352 26262 -2898
5232b898n2758N0261P0289K5657n9879P603L9113j046j12193r561P7940L4388
$$ -2898 -55656 -5395 64894 90551 30672 38275 77388 76342 -35851 -45412 32528 66916
5220F6916m2501N2642J3268n7819l6723m7113m1062l4215N711N7341J4859K6073
$$ 66916 24415 77057 90325 32506 -4217 -51330 -92392 -126607 -120896 -63555 -48696 -22623
5208b2623k7022j558K6800m61J7112K149L1049j8613l187k8476j5245L9647J05312
$$ -22623 -49645 -51203 -24403 -24864 -7752 -5603 25446 6833 3646 -24830 -40075 -428 104884
5195A04884J1344J9767l8176p6693n248R548p366p950j28L1967l4431m143o352
$$ 104884 116228 135995 97819 21126 15878 25426 18060 10110 9982 41949 7518 3375 -2977
5182b977K2137J0578L727l7139p483l9738n5667K9128O3462m528L5873j2187n3112
$$ -2977 19160 29738 33465 -3674 -11157 -50895 -106562 -77434 -13972 -18500 17373 5186 -47926
5169d7926L6170O6791o783J8617N217o1850n3551J5954K6540l5785J47K8184M0313
$$ -47926 -11756 55035 48252 66869 72086 10236 -43315 -27361 -821 -36606 -36459 -8275 32038
5156C2038m470J8619o5973K7069n0333L8188O2757o891j1843j7653j1716J3472
$$ 32038 27568 46187 -19786 7283 -43050 -4862 57895 51004 39161 21508 9792 23264
5144B3264r30k1544k8032j8900L4279K7163J0564K4285j7009o1185k5518J672
$$ 23264 22334 790 -27242 -46142 -11863 15300 25864 50149 33140 -28045 -53563 -51891
5132e1891p028l1329J4644K7047P0310P829L771k0540n9845k5928M5695M3091
$$ -51891 -58919 -90248 -75604 -48557 21753 29582 33353 12813 -47032 -72960 -27265 15826
5120A5826K7650j5416m8478k0016k8001q5800Q0321Q5444K4238n1693Q573o3696
$$ 15826 43476 28060 -20418 -40434 -68435 -154235 -73914 11530 35768 -15925 -7352 -71048
5108g1048m7038N0353K9359j1451J4130K5029K057J0258j6716k3790j6493R974
$$ -71048 -118086 -67733 -38374 -49825 -35695 -10666 -8609 1649 -15067 -38857 -55350 -45376
5096d5376K5147J3809L7173R10K4287j0734l4632L333L5631k6734K2579r8522
$$ -45376 -20229 -6420 30753 31663 55950 45216 10584 13917 49548 22814 45393 -53129
5084e3129p3415K0983J9319N0682j9875K7189L8030m5795J1239N8324m119j6211
$$ -53129 -126544 -105561 -86242 -35560 -55435 -28246 9784 -36011 -24772 33552 29433 13222
5072A3222k0426M50l6345J6105k108O449J7040K9753J5016n7867L2503N2760K8947
$$ 13222 -7204 -6754 -43099 -26994 -29102 -22653 -5613 24140 39156 -18711 13792 66552 95499
5059I5499k0827n9575m4924m0303O8217N1703k8361N366p629L7054K4293n0623
$$ 95499 74672 15097 -29827 -70130 -1913 49790 21429 26795 19166 56220 80513 29890
5047B9890J9184j47N886K5058n7666q800L3751L286l3304J5062m4844m9324K5447
$$ 29890 49074 48927 54813 79871 22205 13405 47156 50442 17138 32200 -12644 -61968 -36521
5034c6521J1310M3034P2032j1931k0966l0395m0180n9645K9396J46k4525m9602
$$ -36521 -25211 17823 89855 77924 56958 26563 -13617 -73262 -43866 -43720 -68245 -117847
5022a17847j2903j3863L6658J02547o945j3191N4157M8867K5423R3L047k4008
$$ -117847 -130750 -144613 -107955 -5408 -12353 -25544 28613 77480 102903 102996 106043 82035
5010H2035o3386K5237L0291J0631L928n5966p5280n1436p186M2831l4170j8834
$$ 82035 18649 43886 74177 84808 88736 32770 -42510 -93946 -101132 -58301 -92471 -111305
4998a11305L104O8393N8991j5650K0363K6589k3164n8627L6174Q4318j485K159
$$ -111305 -108201 -39808 19183 3533 23896 50485 27321 -31306 4868 89186 87701 89860
4986H9860K0885L9359m6745q2314q1731m2864J9299L7551J0495N7519q948r684
$$ 89860 110745 150104 103359 21045 -60686 -103550 -84251 -46700 -36205 21314 12366 2682
4974B682l4197m5882o693J2824o13L440m526K0098k472N104K8438K7550r298J0725
$$ 2682 -31515 -77397 -84090 -71266 -71879 -68439 -72965 -52867 -55339 -50235 -21797 5753 -3545 7180
4960G180k1088n4485J9940N1298m900P2361J7967n5935l7259m9637J6144k04k363
$$ 7180 -13908 -68393 -48453 2845 -2055 70306 88273 32338 -4921 -54558 -38414 -38618 -40981
4947d0981l6632j8470M9019j2788j0437J5155L3825J5985N6879n213k8237l8658
$$ -40981 -77613 -96083 -47064 -59852 -70289 -55134 -21309 -5324 51555 46342 18105 -20553
4935b0553l9984M383Q197L5014M0223j1784j0768J9042P5950l0946n8634k4752
$$ -20553 -60537 -56154 -47957 -12943 27280 15496 4728 23770 99720 68774 10140 -14612
4923a4612K562P0455O2746p0143l2846n0854n2810K5423M9914M8520L0228K1372
$$ -14612 -12050 58405 121151 51008 18162 -32692 -85502 -60079 -10165 38355 68583 89955
4911H9955l1836P822m2946n3201K0164Q3138j060m2607J9436r489q7236K5395
$$ 89955 58119 65941 22995 -30206 -10042 73096 72036 29429 48865 39376 -47860 -22465
4899b2465M8577K9897J2035r6906l5759L2581R4752L1913p846n380k816P015J5654
$$ -22465 26112 56009 68044 -28862 -64621 -32040 62712 94625 86779 81399 78583 85598 101252
4886A01252p9429k153N4400k0493q643N589N4224l2172j4782j1200J0710m564
$$ 101252 21823 19670 74070 53577 44934 50523 104747 72575 57793 46593 57303 52739
4874E2739k5821k2371K8256J9037O773L2686K2519q0473j4627J7819l4310J2938
$$ 52739 26918 4547 32803 51840 58613 91299 113818 33345 18718 36537 2227 15165
4862A5165K964K9470N8968J2721K928o8382l8502j4503r62m1470p2047O1035O4022
$$ 15165 18129 47599 106567 119288 122216 53834 15332 829 -133 -41603 -113650 -52615 11407
4849A1407J2542N2515M8682l4430n3973k5387M510J678j4628o0887k0274K8665
$$ 11407 23949 76464 125146 90716 36743 11356 15866 17544 2916 -57971 -78245 -49580
4837d9580Q6564J6515J2384M8425q2561q2913K1349L5247J7407j6486j5268K9605
$$ -49580 36984 53499 65883 114308 31747 -51166 -29817 5430 22837 6351 -8917 20688
4825B0688k4405M7933M0598p0470p7541R673L9231K2220l350K9966k2792P600
$$ 20688 -3717 44216 84814 14344 -63197 -53524 -14293 7927 4577 34543 11751 19351
4813A9351J0806j2308L3223K9863J5191N679j2708n2021l0928J8121j5250k5402
$$ 19351 30157 17849 51072 80935 96126 101805 89097 37076 6148 24269 9019 -16383
4801a6383N6480K2917m155k2431K869l8763k8443K2145J8986n266K2930K482J052
$$ -16383 40097 63014 58859 36428 39297 534 -27909 -5764 13222 7956 30886 33368 34420
4788C4420Q2250K872J145m258k5934l8808k3712n556m2397m2941k4467N8816m215
$$ 34420 116670 119542 120687 116429 90495 51687 27975 22419 -19978 -62919 -87386 -28570 -32785
4775c2785K020l7587r189K4319M094P3134J8287k8810m831J0758L8535j5648k5599
$$ -32785 -30765 -68352 -77541 -53222 -49128 24006 42293 13483 8652 19410 57945 42297 16698
4762A6698M94n1004k7374N8480N7219L1144n9556o7256o920N0523L0050l4160
$$ 16698 17192 -33812 -61186 -2706 54513 85657 26101 -41155 -48075 2448 32498 -1662
4750a662k7126L0108J0609q10l5704L1986P3427M0047K1963m2905r4348L3888
$$ -1662 -28788 1320 11929 11119 -24585 7401 80828 120875 142838 99933 5585 39473
4738C9473K2455n5202n9472l573j742J0361L3864N4437L9906J9455o565j7779
$$ 39473 61928 6726 -52746 -56319 -58061 -47700 -13836 40601 80507 99962 93397 75618
4726G5618j6903o5281k6430q3746M5874R3707M1651j229m5803M872K0390M6870
$$ 75618 58715 -6566 -32996 -116742 -70868 22839 64490 63261 17458 22330 42720 89590
4714H9590L6587j6685j2146l7606k8685M5338J316P780l3239n6495k9258K8550
$$ 89590 126177 109492 97346 59740 31055 76393 77709 85489 52250 -4245 -33503 -4953
4702d953k189K4454l240o179p8274l5745L6254n1385J2458P3555Q0736J5096J570
$$ -4953 -7142 17312 14072 7893 -70381 -106126 -69872 -121257 -108799 -35244 45492 60588 62158
4689F2158j05251N3753K8667n1389k3287n6515k954M7339O7375o036k9100K2593
$$ 62158 -43093 10660 39327 -12062 -35349 -91864 -94818 -47479 19896 13860 -15240 7353
4677G353P4135m2935P331k1074l1005M7544L0985m6759J2592j5214m3542k1063
$$ 7353 81488 38553 45884 24810 -6195 41349 72334 25575 38167 22953 -20589 -41652
4665d1652j282k5327M0801K5794j7382R239M0287K3697o8872k0888M8111J0035
$$ -41652 -42934 -68261 -27460 -1666 -19048 -9809 30478 54175 -14697 -35585 12526 22561
$$ [...]
##END NTUPLES=NMR SPECTRUM
##END=
