##TITLE=Analysis number 323685
Compound Code spb 05802
Project Code adrs
Chemist Name fudan
##JCAMPDX= 6.0         $$ Bruker NMR JCAMP-DX V2.0
##DATA TYPE= NMR SPECTRUM
##DATA CLASS= NTUPLES
##ORIGIN= Bruker BioSpin GmbH
##OWNER= nmr
$$ XWIN-NMR		Version 3.5
$$ Fri Nov  3 11:00:44 2006 GMT Standard Time (UT+0h)  MAYBRIDGE\nmr@NMR_250MHZ
##.OBSERVE FREQUENCY= 250.131544655141
##.OBSERVE NUCLEUS= ^1H
##.ACQUISITION MODE= SIMULTANEOUS (DQD)
##.ACQUISITION SCHEME= undefined
##.AVERAGES= 16
##.DIGITISER RES= 18
##SPECTROMETER/DATA SYSTEM= dpx250
##.PULSE SEQUENCE= zg30
##.SOLVENT NAME= CDCl3
##.SHIFT REFERENCE= (INTERNAL, CDCl3, 0, 16.522)
##AUDIT TRAIL= $$ (NUMBER, WHEN, WHO, WHERE, WHAT)
$$ ##TITLE= Audit trail, XWIN-NMR		Version 3.5
$$ ##JCAMPDX= 5.01
$$ ##ORIGIN= Bruker BioSpin GmbH
$$ ##OWNER= nmr
$$ C:\u/data/dgb/nmr/ADRS/2170/pdata/1/auditp.txt
$$ ##AUDIT TRAIL=  $$ (NUMBER, WHEN, WHO, WHERE, WHAT)
(   1,<2006-11-03 11:00:21.36 +000>,<MAYBRIDGE\nmr>,<NMR_250MHZ>,
      <created by zg, POWCHK disabled, PULCHK disabled
       configuration hash MD5:
       49 4B E0 1D 92 C2 6B 37 9F E6 65 BC 52 41 86 1D
       data hash MD5: 64K
       9C 65 64 89 5C ED 95 9B F1 3E 24 21 5F FB 44 63>)
(   2,<2006-11-03 11:00:35.72 +000>,<MAYBRIDGE\nmr>,<NMR_250MHZ>,
      <Start of raw data processing
       ef LB = 0.3 FT_mod = 6 PKNL = 1 SI = 32K 
       data hash MD5: 32K
       F6 56 4F 00 4B DD 4C F0 C6 C6 EF 39 C6 12 4B 7F>)
(   3,<2006-11-03 11:00:37.38 +000>,<MAYBRIDGE\nmr>,<NMR_250MHZ>,
      <apk 
       data hash MD5: 32K
       37 57 B7 75 E1 6A 7F 69 76 6D 43 FC 58 56 DA F1>)
(   4,<2006-11-03 11:00:38.13 +000>,<MAYBRIDGE\nmr>,<NMR_250MHZ>,
      <abs ABSG = 5 
       data hash MD5: 32K
       CC 99 19 16 92 BD A1 29 85 6E FB 54 46 90 BF FC>)
$$ ##END=
$$ 
$$ hash MD5
$$ 62 7C 61 F5 9D 10 22 A1 EA C8 2C 22 91 D3 53 E7
##$RELAX= 
##$RELAX= 
##$RELAX= 
##$RELAX= 
##$RELAX= 
##$RELAX= 
##$RELAX= 
$$ Bruker specific parameters
$$ --------------------------
##$DU= <C:\u>
##$EXPNO= 2170
##$NAME= <ADRS>
##$PROCNO= 1
##$TYPE= <nmr>
##$USER= <dgb>
##$AMP= (0..31)
100 100 100 100 100 100 100 100 100 100 100 100 100 100 100 100 100 100 
100 100 100 100 100 100 100 100 100 100 100 100 100 100 
##$AQSEQ= 0
##$AQ_mod= 3
##$AUNM= <au_zg>
##$AUTOPOS= <4 >
##$BF1= 250.13
##$BF2= 250.13
##$BF3= 250.13
##$BF4= 250.13
##$BF5= 500.13
##$BF6= 500.13
##$BF7= 500.13
##$BF8= 500.13
##$BYTORDA= 1
##$CFDGTYP= 0
##$CFRGTYP= 5
##$CHEMSTR= <none>
##$CNST= (0..31)
1 1 145 1 1 1 1 1 1 1 1 1 1 1 1 1 1 1 1 1 1 1 1 1 1 1 1 1 1 1 1 1 
##$CPDPRG= <>
##$CPDPRG1= <>
##$CPDPRG2= <>
##$CPDPRG3= <>
##$CPDPRG4= <mlev>
##$CPDPRG5= <mlev>
##$CPDPRG6= <mlev>
##$CPDPRG7= <mlev>
##$CPDPRG8= <mlev>
##$CPDPRGB= <>
##$CPDPRGT= <>
##$D= (0..31)
0 1 0 0 0 0 0 0 0 0.06 0 0 0 0 0 0 0.0002 0 0 0 0 0 0 0 0 0 0 0 0 0 0 
0 
##$DATE= 1162551620
##$DBL= (0..7)
120 120 120 120 120 120 120 120 
##$DBP= (0..7)
150 150 150 150 150 150 150 150 
##$DBP07= 0
##$DBPNAM0= <>
##$DBPNAM1= <>
##$DBPNAM2= <>
$$ [...]
##$SUBNAM7= <"">
##$SUBNAM8= <"">
##$SUBNAM9= <"">
##$SW= 20.6930455092707
##$SWIBOX= (0..15)
0 0 3 0 0 0 0 0 0 0 0 0 0 0 0 0 
##$SW_h= 5175.983436853
##$TD= 65536
##$TD0= 1
##$TE= 683.16
##$TE2= 300
##$TE3= 300
##$TEG= 300
##$TL= (0..7)
0 120 120 120 120 120 120 120 
##$TP= (0..7)
150 150 150 150 150 150 150 150 
##$TP07= 0
##$TPNAME0= <>
##$TPNAME1= <>
##$TPNAME2= <>
##$TPNAME3= <>
##$TPNAME4= <>
##$TPNAME5= <>
##$TPNAME6= <>
##$TPNAME7= <>
##$TPOAL= (0..7)
0.5 0.5 0.5 0.5 0.5 0.5 0.5 0.5 
##$TPOFFS= (0..7)
0 0 0 0 0 0 0 0 
##$TUNHIN= 0
##$TUNHOUT= 0
##$TUNXOUT= 0
##$USERA1= <user>
##$USERA2= <user>
##$USERA3= <user>
##$USERA4= <user>
##$USERA5= <user>
##$V9= 5
##$VALIST= <valist>
##$VCLIST= <CCCCCCCCCCCCCCC>
##$VD= 0
##$VDLIST= <DDDDDDDDDDDDDDD>
##$VPLIST= <PPPPPPPPPPPPPPP>
##$VTLIST= <TTTTTTTTTTTTTTT>
##$WBST= 1024
##$WBSW= 4
##$XGAIN= (0..3)
0 0 0 0 
##$XL= 0
##$YL= 0
##$YMAX_a= 514205
##$YMIN_a= -447363
##$ZGOPTNS= <>
##$ZL1= 120
##$ZL2= 120
##$ZL3= 120
##$ZL4= 120
##$ABSF1= 16.522
##$ABSF2= -4.171173
##$ABSG= 5
##$ABSL= 3
##$ALPHA= 0
##$AQORDER= 0
##$ASSFAC= 0
##$ASSFACI= 0
##$ASSFACX= 0
##$ASSWID= 0
##$AUNMP= <proc_1d>
##$AZFE= 0.1
##$AZFW= 0.1
##$BCFW= 0
##$BC_mod= 0
##$BYTORDP= 0
##$COROFFS= 0
##$CY= 12.5
##$DATMOD= 1
##$DC= 0
##$DFILT= <>
##$DTYPP= 0
##$F1P= 14.0000005364418
##$F2P= -0.99999901652339
##$FCOR= 0.5
##$FTSIZE= 32768
##$FT_mod= 6
##$GAMMA= 0
##$GB= 0
##$INTBC= 1
##$INTSCL= 1
##$ISEN= 128
##$LB= 0.3
##$LEV0= 0
##$LPBIN= 0
##$MAXI= 10000
##$MC2= 0
##$MEAN= 0
##$ME_mod= 0
##$MI= 0
##$NCOEF= 0
##$NC_proc= -4
##$NLEV= 6
##$NOISF1= 0
##$NOISF2= 0
##$NSP= 0
##$NTH_PI= 0
##$NZP= 0
##$OFFSET= 16.522
##$PC= 1
##$PHC0= -32.20219
##$PHC1= -0.9764325
##$PH_mod= 1
##$PKNL= yes
##$PPARMOD= 0
##$PSCAL= 4
##$PSIGN= 0
##$REVERSE= no
##$SF= 250.13
##$SI= 32768
##$SIGF1= 0
##$SIGF2= 0
##$SINO= 400
##$SIOLD= 32768
##$SREGLST= <1H.CDCl3>
##$SSB= 0
##$STSI= 32768
##$STSR= 0
##$SW_p= 5175.98343685301
##$SYMM= 0
##$S_DEV= 0
##$TDeff= 65536
##$TDoff= 0
##$TI= <Analysis number 999999
Compound Code 99
Book Reference 9
Project Code 9>
##$TILT= no
##$TM1= 0
##$TM2= 0
##$TOPLEV= 0
##$USERP1= <user>
##$USERP2= <user>
##$USERP3= <user>
##$USERP4= <user>
##$USERP5= <user>
##$WDW= 1
##$XDIM= 32768
##$YMAX_p= 412117371
##$YMIN_p= -1087250
$$ End of Bruker specific parameters
$$ ---------------------------------
##NTUPLES= NMR SPECTRUM
##VAR_NAME=  FREQUENCY,     SPECTRUM/REAL,   SPECTRUM/IMAG
##SYMBOL=    X,             R,               I
##VAR_TYPE=  INDEPENDENT,   DEPENDENT,       DEPENDENT
##VAR_FORM=  AFFN,          ASDF,            ASDF
##VAR_DIM=   32768,         32768,           32768
##UNITS=     HZ,            ARBITRARY UNITS, ARBITRARY UNITS
##FACTOR=    0.157963299565203, 1,           1
##FIRST=     4132.6476996994, 0,             0
##LAST=      -1043.33573715361, 0,           0
##MIN=       -1043.33573715361, -1087250,    0
##MAX=       4132.6476996994, 412117371,     0
$$ Real data points
##PAGE= N=1
##DATA TABLE= (X++(R..R)), XYDATA
$$ [...]
23855a93870k11127L29825j05057l4842J68767j09856O7366L22382J03150j96853
23845A39885j0840J30006o2427n0335L9111Q2881J65531p8280o3862j28689j95905
23834c2924n4987K0131j64343J82276P6489Q7652K00167o8942j67557j34883K22371
23823A65450m15k50342k11976Q7279Q8317M9468L7716L2135j58948j81953j74055
23812e17324L31757L01149k951J18851k53080k51512J91202K44563j40199j49261
23802a26805r8316k42597k13125j20088L77356L04066K48382L6031l46561K2135
23792a59522J89067O7657O3921q5415p9126m7662L15512Q5296p5772j87955j01169
23781a5168J23555K38810K98094J062k86892Q9308K28449k54335j24472l72621
$$ y = [-193870, -404997, -75172, -180229, -215071, -46304, -156160, -88794, 233588, 336738, 139885, 129045, 259051, 196624, 146289, 185400, 268281, 433812, 355532, 291670, 162981, -32924, -87911, -67780, -232123, -49847, 26642, 114294, 314461, 245519, 77962, -56921, 165450, 165035, -85307, -297283, -210004, -121687, -72219, -34503, -2368, -161316, -343269, -517324, -185567, 115582, 112631, 231482, -21598, -273110, -81908, 162655, 22456, -126805, -225121, -467718, -680843, -800931, -423575, -119509, 128873, 164904, -181657, -159522, 29545, 97202, 161123, 75708, -3418, -51080, 264432, 349728, 273956, 86001, -15168, 108387, 347197, 645291, 646353, 359461, 448769, 677218, 422883, 298411, -74210]
23771g4210m0347N0669L032J44514J13654J05548j27662j24921k32850J09116
23761g3457P7091j86790K8562J02382K66401N85k22380k0335j17982M9775J52059
23750E5911m2892l52293j9512L74978L51985p7933j0999o087j65870j11283n8308
23739f2303L60184J73482o6442k46505j57375l3721q9849N7246l3885P0090m2019
23728g1097j65093K44138J78520r637k86280j01908K5772K02683l8730j51855
23718a73487j24559O5149j0171M26367K54486o255j38796l8087n1367l65902k49653
23707d12275L1448J65321K37868r620k6897N013J51037O6362q4565j29580O1116
23696E5228L0494L321J16025j55187k11305k51096j54188j0804j0698l4089J63822
$$ y = [-74210, -114557, -63888, -60856, 83658, 197312, 302860, 175198, 50277, -182573, -73457, 3634, -183156, -154594, -52212, 214189, 214774, -7606, -27941, -145923, -96148, 55911, 13019, -339274, -358786, 16192, 368177, 290244, 279245, 273158, 107288, -3995, -62303, 297881, 471363, 404921, 158416, 1041, -32680, -122529, -65283, -99168, -29078, -71097, -236190, 7948, 186468, 176831, -109449, -211357, -185585, 17098, -21632, -173487, -298046, -232897, -243068, 183299, 437785, 431530, 292734, 254647, 203280, -162622, -412275, -380827, -215506, 22362, 12742, -14155, -9142, 141895, 208257, 123692, -5888, 55228, 85722, 89043, 205068, 49881, -161424, -412520, -566708, -577512, -588210, -622299, -458477]
23685d58477K50554K68125q0864J7114K62900J50154J7383k81883k25630k6332
23675a06956J10184J27615J66928M2899q3521m43492O9638k5916m764K2245M7550
23664g7590p159J2317n063n9397o6050j34389R8872J46040J04254n6388l07818
23653c52371j40755N875k8723l3341M5884J98656L72382j26421R2342P4561o7514
23642D0575r989J13932L34684j2095n4360k35922O7775R5239j49529o8092P8647
23631B00865n1775n9658J27123r6918k73330k17109J13455K18699J92102k3629
23621A29825m3123j33260K25873N0080j10344l8573k22787k21061l2061N9244
23611c36187j29374J03783M05899J63614r8214o0805k9053l1167k28714n0075
$$ y = [-458477, -207923, 60202, -20662, -3548, 259352, 409506, 426889, 145006, -80624, -106956, 3228, 130843, 297771, 340670, 257149, -186343, -116705, -142621, -147385, -125140, -77590, -84749, -72432, -77495, -136892, -202942, -337331, -238459, -92419, 11835, -44553, -352371, -493126, -487251, -515974, -549315, -503431, -304775, 67607, -58814, 33528, 108089, 40575, 30586, 144518, 479202, 467107, 412747, 176825, 244600, 339839, 190310, 122218, 200865, 149090, 89432, 216555, 119637, -153693, -370802, -257347, -38648, 153454, 129825, 86702, -46558, 179315, 229395, 119051, 80478, -142309, -363370, -395431, -336187, -465561, -361778, 44121, 207735, 109521, 48716, 19663, -11504, -240218, -290293]
23601b90293m1778o5900K43105J24763J12778j00842l31582r6717K88370J70502
23591A2406j79241r3498N277N10945J50451j36178J19828j85444M111J06572J54705
23580D69934k78288k05575Q0532m0353j47653j57773j46051j3662J50172J71938
23570a16779R4406J72308Q3141k27157M7520M70M8547J81208M7952R6601j11416
23559C16801R8708r0495m17952l48455J49628r1902m0583J54159K64617r5391
23549a00865R6141O2601J16295J28832l48701Q5625K19453J1977r5585R9933J0479
23538B86185k33777n4948n6496J65612K368k02322p4100j49912Q1758J8595P9378
23527a37659J99920k91178l18489K18170K48177L5439j08547j049L0061J26784
$$ y = [-290293, -332071, -397971, -154866, -30103, 82675, -18167, -349749, -446466, -158096, 12406, -166835, -260333, -255056, 255889, 406340, 270162, 389990, 204546, 208657, 315229, 469934, 191646, -13929, 66603, 26250, -121403, -279176, -425227, -438889, -288717, -116779, -22373, 149935, 233076, 5919, 53439, 53909, 102456, 283664, 331616, 428217, 316801, 415509, 325014, -92938, -441393, -291765, -383667, -424250, -270091, -5474, -100865, -4724, 57877, 174172, 303004, -45697, 39928, 259381, 271358, 175773, 275706, 286185, 52408, -2540, -59036, 106576, 108944, -93378, -167478, -317390, -235632, -217037, -137659, 62261, -228917, -547406, -329236, -81059, -45620, -154167, -155216, -125155, 1629]
23517A629j41937k24643K20754k68314l1298R5472M13753L5656k1017m56975J7719
23506c59201p9060j59606k7091K08550K16022J06384l26755J08552M32461J47266
23496B67522m0724m9208j01776J71318J80329O5210J8068J30807J5575m63807
23486A93314k21244j51913K24984Q1801j10580j2871l00287k71912j35924M59855
23476b44777K47613k3524k34790r2898K67633J90268m2577k31592j56055L56874
23466C6175P4388j63176O4681J73204J44291K31273j22894l60798L931J43549
23456B24624p115k32493l55225m36310L37671K41799l773P667J43475K17287P4667
23445B12274O016k51013M147L6595Q022R1837k06404k78450r5299P3675j96418
$$ y = [1629, -140308, -364951, -144197, -412511, -443809, -348337, 65416, 101072, 80055, -376920, -359201, -438261, -597867, -624958, -416408, -200386, -94002, -420757, -312205, 120256, 267522, 226798, 177590, 75814, 247132, 427461, 492671, 510739, 641546, 657121, 193314, -27930, -179843, 45141, 126942, 16362, 3491, -296796, -568708, -704632, -244777, 2836, -20688, -255478, -348376, -80743, 109525, 66948, -164644, -320699, 36175, 110563, -52613, 12068, 185272, 329563, 560836, 437942, 77144, 81075, 224624, 217509, -14984, -370209, -806519, -468848, -227049, -230822, -223155, -79680, 137607, 212274, 218290, -32723, -28576, 8019, 16041, 107878, -98526, -376976, -472275, -398600, -595018]
23434e95018O019K55845N2789M30710J33126q2415k65150J23014O8046j15391
23424A1575j12877p0678J93056K55038P1294k38311k21393o4219K33374L54158
23414D11017L8605k12358j2187O8849p2385l31395j6390M5140J39985J10566j06606
23403F2841n3229l16002r1822J09827J66894L40040J70389j16284k30687l24767
23393b82800K52457J32252l5767P9003J16943K91394J86085k20656l29554j09694
23383G9663o8476Q3270J01317j16392r2117l1063P2320J57353J2173M4680k4110
23372B18618k43503k28736K81220J44908n09505k3112J5437J6640M12604K70085
23362C54656j33433m7657M8451j21215k87436R6550L15686L85529K36692l8246
$$ y = [-595018, -588999, -333154, -280365, 150345, 283471, 201056, -64094, 58920, 126966, 11575, -101302, -171980, 21076, 276114, 347408, 109097, -112296, -176515, 56859, 411017, 449622, 237264, 225077, 293926, 221541, -109854, -126244, -81104, 58881, 169447, 62841, 9612, -306390, -398212, -288385, -121491, 218549, 388938, 272654, 41967, -282800, -30343, 101909, 66142, 145145, 262088, 553482, 739567, 518911, 189357, 79663, 11187, 94457, 195774, 79382, -12735, -43798, 28522, 185875, 198048, 242728, 218618, -24885, -253621, 27599, 172507, -336998, -360110, -344673, -328033, 84571, 354656, 221223, 173566, 222017, 100802, -186634, -90084, 225602, 611131, 847823, 809577]
23352H09577j80271k84059k77867n0207m9722q7088j54030J53544L33236J09670
23342C22783J15328k23497M040L0563l91547m81130k45283L68526J28325K35823
23332a36069N7098M9528j16000k98943J13583k28497P1531j9324J59095K88149
23322e9849j16956O374K59512K21980q35k56813j08283p8607N2544j52997r282
23311b43212J49143j58375P1398N18980l4982j99686R8900p2927j36530R8150
23301I0859L31093k11708K7191P9277k6685K27829P2213k59342k97254l06507
23291b73034K33034K07995J27584j96484j05971k91452N4709j1552Q5532J85942
23281A6303M002J67640Q928k55384n2524J71764n2621J08347J94421K05319n4877
$$ y = [809577, 629306, 345247, 67380, 17173, -32549, -119637, -273667, -120123, 213113, 322783, 438111, 214614, 218654, 249217, -142330, -623460, -868743, -500217, -371892, -136069, -78971, -29443, -145443, -444386, -330803, -559300, -487769, -507093, -347998, -59849, -176805, -170431, 89081, 311061, 310226, 53413, -54870, -133477, -80933, -233930, -243212, -94069, -252444, -181046, 337934, 302952, 103266, 202166, 129239, -7291, 90859, 421952, 210244, 237435, 316712, 290027, 517856, 590069, 330727, 33473, -273034, -40000, 167995, 295579, 99095, -6876, -298328, -243619, -255171, -169639, 16303, 20305, 187945, 196873, -58511, -111035, 60729, 8108, 116455, 310876, 516195, 461318]
23270D61318l39507k91771R7204J40891o5116Q4741M062l10010J832N7630J16426
23259d2300O8824Q5427k923r6896p4389m8078O2311M8731L8373J91127L37945
23248E68152j97274k81460K33392j63130j11514j8057R2428n5734m6904L7535
23238E7434R7425j23329q3675O4299J7789N3056J80006k9406k92690l9701N8205
23227d0587K09254M0524M2074O1751P9247j36414j19544j43874N9414j05888k46197
23216c00240n2176K62752R0398o1442M7412N3737n5719kq4932k24197n7569N84969
23204B02991r3324j51249J46857M0646J88040j69003k52989k49135J40470K80837
23194H4141J96618J05779j89612j60776J99668L2763j65547N3855j11058l6487
$$ y = [461318, 121811, -169960, -72756, 68135, 3019, 87760, 91822, -218188, -216356, -158726, -42300, 26524, 111951, 109028, 12132, -62257, -110335, -48024, 707, 39080, 230207, 568152, 370878, 89418, 322810, 159680, 48166, 30109, 122537, 66803, 19899, 57434, 154859, 31530, -52145, 12154, 29943, 82999, 263005, 233599, -59091, -98792, -40587, 168667, 209191, 251265, 313016, 392263, 255849, 136305, -7569, 51845, -54043, -300240, -352416, -89664, 734, -60708, -13296, 40441, -15278, -15280, -100212, -324409, -381978, 202991, 109667, -41582, 105275, 145921, 333961, 164958, -88031, -337166, -196696, 84141, 280759, 386538, 196926, 36150, 235818, 268581, 103034, 156889, 45831, 9344]
23184I344J36822o7449J125M67113j16414l66097R5578l26798P2344L0883k58384
23173c21933k53849m7825K30284L02851k01991j11713M46248j97044l09305J95285
23163b68992L21145K97049j33620l1049M0873k3504n7213k88554m6449j10211
23153c00525N533R6266O8689j80055m534Q7835J74774K38168r6377j70296j856
23142h2378K40545k9253j01325j15943K23955K16182k30996K0159K6244j05918
23132F1272k73354N6695J54871N5305k48530j22863M6246K14985L44018j05434
23122A83211j44244J08689j02370p7874r587r0912J8638L89762J23786q8111p4971
23111B36017j17478L604j14496K897J5994J01406l4320K20658p6402k5308o9441
$$ y = [9344, 146166, 78717, 79842, 546955, 430541, 64444, 160022, -166776, -94432, -63549, -321933, -575782, -623607, -393323, -90472, -292463, -404176, 42072, -154972, -464277, -268992, 52153, 349202, 215582, 184533, 225406, 201902, 144689, -143865, -190314, -300525, -294992, -198726, -130037, -310092, -314626, -226791, -52017, 186151, 89774, -80522, -82378, 158167, 128914, 27589, -88354, 135601, 351783, 120787, 140946, 167190, 61272, -212082, -155387, -516, 54789, -193741, -316604, -270358, -55373, 288645, 183211, 38967, 147656, 45286, -32588, -42175, -133087, -114449, 275313, 399099, 310988, 236017, 118539, 122143, 7647, 10544, 26538, 127944, 93624, 314282, 237880, 212572, 143131]
23100A43131O364R28N220N1682J70731L336n043m0932j40124j16974k70140l84439
23088e76260Q6665M00798K82016J17625j52388j62604k08880k32723q2436K88602
23078b39585K39973K22706k30552l10668j6732q9182K2234J67149K15581j25463
23068a44539j31110j41544o644J98486j29897Q2321N6354k2601M5770j38663j08996
23057d41063K78753J82161j84430k36188J33775J16094K20883j75267k26560j45812
23047d77654J06912P5129K53577K72088p1177j77028j41118l6159J56410j017
23037d0037K9152j13548j68122q3097K57714Q4356L66156K18039j29293m53946
23027c2626l83730J80853J81299N3284L6413L48274k214l34635q1899K09792J03372
$$ y = [143131, 149495, 150423, 155643, 207325, 378056, 381392, 376349, 335417, 195293, 78319, -191821, -576260, -489595, -88797, 193219, 310844, 158456, -4148, -213028, -445751, -528187, -239585, 388, 223094, -7458, -318126, -334858, -424040, -401806, -234657, -19076, -144539, -275649, -417193, -423837, -225351, -355248, -272927, -216573, -239174, -193404, -332067, -441063, -162310, 19851, -164579, -400767, -266992, -150898, 69985, -105282, -331842, -477654, -370742, -295613, -42036, 230052, 158875, -18153, -159271, -195430, -39020, -40037, -10885, -124433, -292555, -375652, -117938, -33582, 332574, 550613, 421320, -32626, -416356, -235503, -54204, -920, 35493, 383767, 381553, 46918, -34981, 174811, 278183]
23016B78183K12749m4874R6460K5805l75116j23669k20139K2070R1764k8972J85456
23005A19717K21671J31759p2493q7904k60161K82677J33948j50750j33751k36233
22995e1520q8808K45998L04457J75946m17274j59075J16836N9252Q8693J7563
22985B92068j64042o1515j21508M1726n2678j81024n072K65197L57565J46659
22975E17376n1947j12847l7447r5442j6896Q3242j77004o6462m6004k24548Q8291
22964a39688K89825J9729p5690p5441l746k78462N1087R712j4183K95888m0091
22953C8940k70517o1998L5399k95296R2026J55968J12090J99881Q8066M53070
22943E47629L82690J09180j12332m71534j57309n4925Q5497o9319j9120K07302
$$ y = [278183, 490932, 446058, 542518, 568323, 193207, 69538, -150601, -128531, -36767, -65739, 119717, 341388, 473147, 400654, 312750, 52589, 335266, 469214, 318464, 184713, -51520, -140328, 105670, 410127, 586073, 168799, 9724, 126560, 185812, 274505, 292068, 128026, 66511, -54997, -13271, -65949, -246973, -252045, 13152, 370717, 517376, 465429, 352582, 315135, 219693, 202797, 286039, 109035, 42573, -3431, -227979, -139688, 150137, 169866, 94176, 18735, 14989, -263473, -212386, -202674, -216857, 79031, 38940, -231577, -293575, -258176, -553472, -461446, -305478, -193388, 6493, 94559, 547629, 930319, 1039499, 927167, 455633, 298324, 243399, 328896, 259577, 240457, 447759]
22933D47759p8510j30588R0159J07019L3114J0196l28815m21259M0548o5745L16647
22922B0525J87001J73494K36936r993m89384l82137R4442j19142o4853j58725
22912e11836J93081P5386K89263o510j8162p7791j38772N3891m090j98965J33899
22901b10606J05693K7343l74962q3444J01085M0499J77928O3101n4436J27573
22891h0226J57106m3452l8222r9671k00781J28454r9133K57724N2714m8961m37343
22880d51791j04455M06901K85368j98616j51414j9061j53987j25364J21484L79365
22870a1570K53848J18591p5248q1394j40594j686j16818J56270j63733l38281
22860d00615K10096K07364M0780j4567J21594k40361o1441o6462j02319P9664
$$ y = [447759, 369249, 238661, 328820, 435839, 468953, 479149, 150334, -270925, -230377, -296122, 20525, 207526, 381020, 617956, 607963, 118579, -263558, -169116, -288258, -353111, -511836, -318755, -243369, 45894, 39384, 21222, -56569, -195341, -141450, -145540, -344505, -210606, -104913, -77570, -452532, -535976, -434891, -394392, -216464, -153363, -207799, -80226, 76880, 33428, -4794, -104465, -305246, -176792, -275925, -18201, 34513, -14448, -451791, -556246, -149345, 136023, -62593, -214007, -233068, -387055, -512419, -390935, -11570, 242278, 360869, 285621, 204227, 63633, 61947, -54871, 101399, -62334, -400615, -190519, 16845, 57625, 43058, 164652, -75709, -137150, -203612, -305931, -226267]
22850b26267J50224q8402L54181P3234k62699J38214K97360j0245j31789k38067
22840E5744o4684J30764J28537P3861q9303J42117L1297m61329j50193k3402R6778
22829a29813J18476j39242K7337k1k8087L4802N0230J44024N5110J41037l74942
22818a01089j63573K08812O3494j39063K4431N0545K33740R5213p9670q5885K6716
22807A33671l0418J62944j41653K70928N3108k95974M3815k81775J4717m3658
22797a14295L0489j3256J89714J91314j31864j36487j59518L1205k71271l26292
22787g10261Q7175K96793P747m2407J17880k0791J40895L24325r4229J74357R1527
22776C73011k3297j46971j0947r9602l75802N2206j2270k00249J848L1179O1189
$$ y = [-226267, -76043, -164445, 189736, 262970, 271, 138485, 435845, 425600, 293811, 55744, -8940, 121824, 250361, 324222, 234919, 377036, 408333, -52996, -203189, -226591, -129813, -11337, -150579, -123242, -123263, -151350, -116548, -66318, 77706, 132816, 273853, -101089, -264662, -55850, 7644, -131419, -106988, -56443, 177297, 272510, 192840, 106955, 133671, 103253, 266197, 124544, 395472, 448580, 152606, 196421, -85354, -70637, -114295, -83806, -97062, 92652, 283966, 152102, 15615, -143903, -112698, -383969, -710261, -623086, -326293, -318546, -360953, -243073, -263864, -122969, 201356, 107127, 281484, 373011, 349714, 202743, 191796, 92194, -283608, -231402, -243672, -443921, -442073, -410894, -349705]
22765c49705n359P9199K25115L83010O3777k35137l34895j70887L06073J34377
22755I5568j35489K27576K80706j6811j6224p8940j62389L7419J47994J82360
22745E61770j77959l67961q7691l12278p4784O4406N5273K23951J41906k22277
22735a95644P0649J25083O8970K22688l1114j05262k56485j49975K31241Q3326
22725F3477K3442r0232l74253j21357M0788K01739L2890J60105J25661k70242
22715b07982J5251J59536J40973j6680N4853O7873K11544J02885j56911m55611
22705h4269j1310K66224M5107J23711M536p1582j96000j09896n4809n3338j27686
22694b69312P5887K39509J0026o8787j11887p1535P509K18557L66410J59557j11897
$$ y = [-349705, -355064, -275865, -50750, 332260, 396037, 160900, -173995, -344882, -38809, 95568, -39921, 187655, 468361, 451550, 435326, 356386, 193997, 231416, 379410, 561770, 383811, 15850, -71841, -384119, -458903, -394497, -339224, -115273, 26633, -195644, -124995, 88, 69058, 291746, 260632, 155370, -101115, -251090, -19849, 63477, 86919, -3313, -377566, -498923, -458135, -256396, -223506, -63401, 62260, -207982, -192731, -33195, 107778, 91098, 145951, 213824, 425368, 528253, 371342, -84269, -95579, 170645, 215752, 339463, 343999, 272417, 76417, -33479, -88288, -141626, -269312, -193425, 46084, 56110, -12677, -124564, -196099, -188590, 29967, 396377, 555934, 444037]
22683D44037l61268j35747O459j26226J8016K25752J93218j27990j01844r2265
22673e7858j50104l22054j52897J39735k12003K12899K32273l1660J34365K16893
22663I589J85680J6383r4153o5311o5850k56273j27046k1786L02847K70583Q1984
22652B36647k07657n24113O008n5956r861J18546j15872K0113L38189L417j1068
22641b01607J16768J2962L636L9258q0258J00851O9429Q4298l7410k51609J06238
22630c7444M370k91834q5679J61369n6325j5895K07Q0807q0678n3116J02480n7168
22618c28906J57494j081J88682L86137K21635l90473k89795m578m6980j65050
22608b72915p7117K06453K06280R5008q3883k95406J26328K22496K42453j02475
$$ y = [444037, 82769, -52978, -46519, -172745, -154729, 71023, 264241, 136251, 34407, -57858, -207962, -530016, -682913, -543178, -755181, -542282, -310009, -341669, -207304, 9589, 195269, 211652, 117499, 52188, -13662, -269935, -396981, -418767, -115920, 154663, 236647, 28990, -495123, -489115, -545071, -554932, -436386, -552258, -532145, -193956, -190539, -201607, -84839, -71877, -68241, -28983, -109241, -8390, 61039, 145337, 107927, -143682, -37444, -33074, -324908, -410587, -249218, -305543, -321438, -321231, -240424, -321102, -374218, -271738, -328906, -171412, -172493, 16189, 402326, 623961, 233488, -56307, -60885, -107865, -272915, -350032, -143579, 62701, 157709, 73826, -221580, -95252, 127244, 369697, 267222]
22598B67222l19864l683j1753k3981M2619J55051P0298L26060k45511j32288n5696
22587F8474P9978k09790j85959n4809L04984L4650J96355o2689n3708j50375R446
22576b3443k66148k50826M40865K15499o9893M5103N2118n6994j57388o4738Q8743
22565d7102j06579K71524J22451J32053l81115j50547k37611J36872K13676j80279
22555b26657N6821L04571Q0227k7616l05365K26338K08203j18365J63213J6081
22545C77451j16325k45483p7106J73384l4388j13315j97554J72385K4657k06952
22535b43246M7903j37995k02486L3825M01964L37528j8611j70849j08014r7017
22525a56998j33926K82019K19185J67159j14369k47774j02927k63191j6526p5960
$$ y = [267222, -52642, -56325, -68078, -92059, -49440, 105611, 175909, 501969, 256458, 124170, 68474, 148452, -61338, -247297, -302106, 2878, 37528, 233883, 171194, 117486, -32889, -23443, -289591, -540417, -99552, 115947, 46054, 91157, 143275, 86281, -71107, -135845, -47102, -153681, 117843, 240294, 372347, -8768, -159315, -396926, -260054, -46378, -226657, -169836, 134735, 214962, 187346, -118019, 108319, 316522, 198157, 361370, 377451, 261126, 15643, -61463, 111921, 77533, -35782, -233336, -60951, -36294, -243246, -195343, -333338, -535824, -501999, -100035, 237493, 218882, 48033, -59981, -156998, -290924, -8905, 210280, 377439, 263070, 15296, -87631, -350822, -367348, -443308]
22515d43308n8001k0715Q4810J33359J91257J11138J2311J2336k4321k19286j67380
22504c87800J10003J91664K96634J68842j9745j59749o7284q3896k9367J8356
22494C7658j45129P4816r1930J32152J63095K2165j25040k37698K15182l3641
22484A1630l67622l8705K52058l3540j44262k20652K50150O8152p405q9908k15376
22473e35480k45399N4393M72676K65239K61690q6403Q8229P3335J04718o4346
22463C88652M5646o4225j52650j17880J01628k33056m20028K21398J53072N3294
22453b4149j02756j7456j7383l9435R4940k98000j35321R1467L01621k6008J03010
22442f9470o2990r1410J74385K09764j46982n0781J27914J39135l0418j70335
$$ y = [-443308, -501309, -522024, -437214, -303855, -112598, -1460, 10851, 23187, -1134, -220420, -387800, -277797, -86133, 210501, 379343, 359598, 199849, 132565, 48669, 19302, 37658, -107471, -32655, -124585, 7567, 170662, 192827, 67787, -169911, 45271, 11630, -355992, -394697, -142639, -176179, -320441, -541093, -290943, -222791, -230196, -320104, -535480, -780879, -726486, -253810, 11429, 273119, 186716, 274945, 348280, 452998, 388652, 434298, 370073, 217423, 99543, 201171, -31885, -451913, -230515, -77443, -24149, -126905, -144361, -161744, -201179, -106239, -404239, -539560, -448093, -146472, -172480, -69470, -132460, -223870, -49485, 160279, 13297, -37484, 90430, 229565, 199147, 28812]
22432B8812j93605J27564K66316N9942k42539L0634j9991j86013N3613m5513K3909
22421i6871j42295k38717R8419K50936n399K98085J60912l5348J5088p5522j57107
22410G2181j64620r4505L11191K38049J04566l10855p0918j73772p3637N2374
22400a09946l3820K22564P7257J43446R9618L9436j18930J3254k12811m4536k28692
22389a53160M7464K76708J15078o9747k82169j38154L4953j22649M2321o0276
22379c09631k22387j32363R6741J07483J68620K30906K66324J10757J83710J50695
22369F50855J12201k40470j52664Q0481k52707k25279l67653O3030l60J69571
22359a62995P7137q9033L2536r022o3420r1801J01649m9600o5538p0740j14902
$$ y = [28812, -164793, -37229, 229087, 289029, 46490, 77124, 57133, -128880, -75267, -120780, -96871, -239166, -477883, -379464, -128528, -133927, 164158, 325070, 289722, 304810, 229288, 72181, -92439, -186944, 124247, 362296, 466862, 156007, 85089, -88683, -162320, -109946, -143766, 78798, 156055, 299501, 399119, 438555, 319625, 332879, 120068, 75532, -153160, -105696, 171012, 286090, 216343, -65826, -203980, -169027, -291676, -249355, -309631, -532018, -664381, -567640, -460157, -291537, -60631, 205693, 316450, 500160, 650855, 763056, 522586, 369922, 450403, 197696, -27583, -395236, -332206, -332566, -162995, -85858, -174891, -142355, -151377, -214797, -306598, -204949, -254549, -320087, -390827, -505729]
22348e05729K44770L75946O6080M4849k16167M1154p1751J66202J94246k30922
22338A08678m8964P4472M9969j83507j15078J46283M0642M2081K28292j1339j25856
22327B05673l27986K9614j42277J17991K76778O3057o3313j70585l39226J46342
22317b03932k7604k958J09034j54441J78527r833N4544J27038k4876l47864m3932
22306c46297J54768k05393J96207K47591j99201j39358K7745r0561o6271K17842
22296b02928K41889k18Q7564q9891P1453K41707J62981j55431m2646j19435m75237
22285b80192n6033N05676M71792m44974l87306K2169J59338r5757J81444j88086
22275a11929m9190P2393J92308O4810N4539J45956j01424n1650P0738n3735K1920
$$ y = [-505729, -260959, 114987, 181067, 225916, 9749, 50903, -20848, 145354, 339600, 108678, 59714, 134186, 184155, 648, -114430, 31853, 72495, 114576, 342868, 331529, 205673, -122313, -92699, -234976, -116985, 159793, 222850, 159537, -11048, -350274, -203932, -231536, -234494, -125460, -279901, -101374, -111207, -56663, 70375, 45499, -302365, -346297, -191529, -396922, -200715, 46876, -152325, -291683, -263938, -354499, -420770, -202928, 38961, 38743, 126307, 36416, 107869, 349576, 512557, 357126, 314480, 195045, -280192, -336225, 169451, 641243, 196269, -191037, -168868, -9530, -105287, 76157, -111929, -161119, -88726, 103582, 168392, 222931, 368887, 267463, 215813, 286551, 232816, 254736]
22264B54736j9085J78381J6054o6394k02099j82365N7161Q5411J0691j61958k53037
22253b82504Q931K23375K98634k01322P0887J65015K24477K65725k20042m05446
22243A47730n7848O1545m6476j00820J92638o5529j68465r2580o1544m4291j73006
22232d08646j57595K73403J46293J311j9420j66053o2154K83286K12023m5746
22222E6702J3095l2632M5115o3979K89259J67991J5468j77898l71426k58351q0393
22211c97049R7246L51666J94732Q8002o2566K24416q6618k34969q695J40376P9592
22200C86133O3008k3847r4529k20802l17010j1256J02912j74665m7985j19561
22190d57602k6410J00091J97119K80068j22702l27382j46433K2410K17750j73027
$$ y = [254736, 235651, 414032, 430086, 363692, 161593, -20772, 36389, 121800, 132491, -29467, -282504, -273573, -50198, 248436, 47114, 118001, 283016, 507493, 773218, 553176, 147730, 89882, 151427, 104951, 4131, 196769, 131240, -37225, -129805, -191349, -235640, -408646, -566241, -292838, -146545, -145234, -164654, -330707, -392861, -109575, 102448, 56702, 69797, 37165, 82280, 18301, 307560, 475551, 491019, 313121, -58305, -316656, -397049, -299803, 51863, 246595, 334597, 272031, 496447, 409829, 174860, 166165, 306541, 386133, 449141, 425294, 330765, 109963, -207047, -218303, -115391, -290056, -338041, -457602, -484012, -383921, -186802, 93266, -29436, -356818, -503251, -480841, -263091, -436118]
22180d36118K0328O7627K29317J67340J52990J60591Q1293j77349j46144K9664
22170A49539O9878o3875k31720l50219M9667J12484j34103J44925K51358J18973
22160A16907j92858j9397J73408K19377j61673o4668r1261M5775j54735p8269
22150b07394J54126K91052p6546j10968J12212L34932o5057j07975j61478k25311
22140f2407j32604J12528K05289M9593l72695K9372J0403J58291K56575J18261
22130C72606L5877r780l43220l59622L33352M57284K14135n5936m30162j03282
22120A11252O2721J51177k07864n6997J79883J01695j31312R1650L35345P3203
22110G10753l60184k0725j16440j09376k06537j7469Q747n1449L86862O8264j3198
$$ y = [-436118, -415790, -348163, -118846, 48494, 201484, 362075, 443368, 266019, 119875, 149539, 219417, 155542, -76178, -426397, -376730, -264246, -398349, -253424, -2066, 116907, -75951, -95348, 78060, 297437, 135764, 71096, -20165, 25610, -129125, -207394, -53268, 237784, 161238, 50270, 162482, 497414, 432357, 324382, 162904, -62407, -195011, -82483, 122806, 172399, -200296, -170924, -160521, -2230, 254345, 372606, 408483, 398703, 55483, -304139, 29213, 486497, 700632, 644696, 214534, 111252, 173973, 325150, 117286, 60289, 240172, 341867, 210555, 302205, 637550, 710753, 350569, 329844, 213404, 104028, -102509, -119978, -111231, -162680, 224182, 292446, 279248]
22099B79248J57628j96156k23493o0215J84436j24072j68518k0491j54439L74082
22089D8010J202j12426R5903O1464R6916N8334J9284n9707k08481l81836j72466
22078e53803R2898J69223L40643J14659J7385R976p6246L7889m0849l05884K10747
22067A6638K21624j6298j36194q9482J13233J00631k93674L6286K29075o9047
22057A12792j42848q547Q7733m8852K33637R0483p5645k32730Q3316K33708j98901
22046A34146j47442Q469j7624M2869j94659K26175Q2597P164j67861j42286J687
22035a66765Q6584k42051K2413r0295K1468J61020J99054j89710k74425J65877
22025c06830J44895Q4241l59196j17660J762L29338K9960l5317q403J95428k34718
$$ y = [279248, 436876, 240720, 17227, -42988, 141448, 17376, -151142, -171633, -326072, 48010, 49212, -63214, 32689, 94153, 191069, 249403, 268687, 208980, 499, -381337, -553803, -460905, -291682, 48961, 163620, 181005, 190981, 114735, 152624, 111775, -194109, 16638, 238262, 221964, 85770, -3712, 109521, 210152, -83522, -47236, 181839, 112792, -30056, -38603, 49130, 278, 233915, 324398, 248753, 16023, 99339, 333047, 134146, -13296, -4827, -22451, 20418, -174241, 51934, 134531, 141695, -26166, -168452, -166765, -80181, -322232, -299819, -390114, -368646, -207626, -8572, -198282, -472707, -306830, -161935, -77694, -436890, -554550, -552788, -223450, -193490, -228807, -237210, -41782, -276500]
22014b76500K88190j57442j3086n5477L3328J06320j82317n8137K61902L81438
22004C28219n3768J8917l10082Q2380p7385o2649j316j86402j23954K58122L79615
21993B51697K18649m6540k05236j7051J51552L1938J98033l4010l48980k89277
21983h9225N470Q3243J60297r6001l3469k433l62313j54426J45384k8883J77383
21972a94973k653m9122J99669l1726K4768J06201J43675R4626k72441k19341R0621
21961a10696K02042J50596j57166j57891K802J1797J90982n444n1140J28789O9615
21950B74286j70021k82726j66984Q4003J00807J90168m5764J3460j70882k69242
21940d42895K18367L8201J30321K7971j19562l6720J94181P8292l02383j88321
$$ y = [-276500, 11690, -145752, -158838, -214315, -180987, -74667, -256984, -315121, -53219, 328219, 274451, 293368, -16714, 65666, -11719, -74368, -75684, -262086, -386040, -127918, 251697, 470346, 423806, 218570, 201519, 353071, 385009, 583042, 549032, 200052, -89225, -83755, -512, 159785, 63784, 30315, 27882, -334431, -488857, -343473, -372356, -194973, -197626, -246748, -47079, -78805, -54037, 52164, 195839, 290465, 18024, -201317, -110696, 91346, 241942, 84776, -73115, -70313, -58516, 132466, 127022, 75882, 204671, 274286, 104265, -178461, -345445, -261442, -160635, 29533, -16231, -2771, -173653, -442895, -224528, -186327, -56006, -28035, -147597, -184317, 9864, 88156, -214227, -402548]
21930d02548J85143Q1883K20346k4569q9303l17136k44916J54835J93757J70837
21920g1671j32295j7840N14322L66956J53732p9809j94622J24375L335l28826
21910C37657o8227K3120J36661j81278j10902q8892k34129J27645P3226j15500
21900a00619J66586K72292j37472k75215j19507k8398K98168K20761o7630l18632
21890h9666j99778J38065J71697K69889P3130o1491M2493o5961k81402J85807
21880A82783j91099N2981K30528j5342L4969M0846r1554j07876k66233p2592m4874
21869b47463Q4174r258k14596Q6238J48103J92059L87891j21473j95423q3394
21859B6858k29880J7992K54906j21759j2055k92031k51460l7808J89589L27074
$$ y = [-402548, -217405, -135522, 84824, 60255, -29048, -346184, -591100, -436265, -242508, -71671, -203966, -221806, 292516, 659472, 813204, 733395, 538773, 663148, 666483, 337657, 269430, 292550, 429211, 247933, 137031, 48139, -185990, -58345, 14881, -100619, 65967, 338259, 200787, -74428, -193935, -222333, 75835, 296596, 228966, -89666, -289444, -151379, 20318, 290207, 363337, 301846, 344339, 278378, -3024, 182783, -8316, 44665, 275193, 259851, 294820, 335666, 244112, 136236, -129997, -202589, -247463, -163289, -172547, -387143, -300905, -152802, 39257, 427148, 305675, 110252, 26858, -203022, -185030, 69876, -51883, -63938, -355969, -607429, -645237, -455648, -128574]
21849a28574J23578j5446O0993k8091l01377l7662L1000J72117J47074k00888
21839a77276k21054p692k52895L03423M27022k00873j21032L5619J01218J22550
21829I010P9007j778P1452j88536j76093j21429o910q4765J77382K50186L2625
21818D0151r1400J79774j07491O4816j66427J02178K58093P5152J07374p9871
21808C82349j05012n4018n15507j32931K65336J35830K9651j27283j80947n4561
21798c57093j27266m782K39371j1534J32502L44735M193P3110k20238j96396j58809
21787b82207p3520j4116K56535M34335K01999j95632m33112j77152K8296P8650
21777a75924J41385r0198p5183J15187k8150j10107l5215K3103Q8178J178j1322
$$ y = [-128574, -4996, -20442, 40551, 12460, -288917, -326579, -295579, -123462, 23612, -177276, -398330, -406022, -658917, -355494, 71528, -129345, -250377, -214758, -113540, 9010, 88017, 86239, 157691, -30845, -206938, -328367, -335277, -420042, -242660, 7526, 40151, -51249, 128525, 21034, 85850, -80577, 21601, 279694, 354846, 462220, 382349, 277337, 223319, -292188, -425119, -159783, -23953, 5698, -121585, -302532, -357093, -484359, -489141, -249770, -261304, -128802, 215933, 220126, 293236, 72998, -123398, -282207, -355727, -369843, -113308, 321027, 523026, 327394, -105718, -282870, -254574, -175924, -34539, -124737, -199920, -84733, -112883, -222990, -258205, -235102, -146924, -145746, -157068]
21766a57068p4222k14142J1757J65284J32723j60770k13746L5331j78219n1281
21756g04353R3445R6290M14200K05608K61358o6044j65596r8013J31785O2052
21746B30732k3500l3569K738K47431J02990j8365j47708j18174k14037P3526J73030
21735B75094l01578j59949j39912K82576J13287j3580n4113m937o1246M867l9308
21724i8799r9342j24538K33538J30280j79190O2258o91J14302J81238q8729J47800
21713B78127k9596j82376j72941j04121r8077R4144m295q4503J69267L58605J20801
21702C45035j68209k60520J98910n1080K592j79744M9503J57765j06244k65432
21692b77424J37753J76339j67709J28570Q7475j64375j0486M0555J43167P8888
$$ y = [-157068, -231290, -445432, -433675, -268391, -135668, -296438, -510184, -474853, -653072, -704353, -610908, -514618, -100418, 105190, 366548, 300504, 134908, 36895, 168680, 230732, 207232, 173663, 176401, 423832, 526822, 508457, 360749, 242575, 28538, 102064, 275094, -26484, -186433, -326345, -43769, 69518, 55938, 1825, -3112, -64358, -59491, -98799, -198141, -322679, -89141, 41139, -138051, -75793, -76484, 37818, 219056, 130327, 278127, 248531, 66155, -106786, -210907, -308984, -214840, -219135, -303638, -134371, 224234, 345035, 176826, -83694, 115216, 64136, 66728, -113016, -63513, 94252, -11992, -277424, -139671, 36668, -131041, -2471, 85004, -79371, -89857, -49302, 93865, 172753]
21682A72753K370J5222m3523p009j20143n5514k7588P312K47206J43573k61649
21671G3010k93480n036M8909Q37j26865J95165K22098O7501L6150L9904P3314
21660C31507k7408n9373j59713l77253q9185j42096J2980P0338L22026m2227j05815
21649b66219k65595j17509L5088L02663K71720q6981k48978K84567N4447p3922
21639a10719j2362J32122j37568j60095J00175J22983L013J7229M8183j02553
21629i9592J50614p7265q7495k68207J0903Q2322M1631J97870L1982J192K75031
21618B58986O4700j31424J13270k01963l6577Q2187J56853K13097j70423j8283
21608C30423J3997j56412j22991m479J52002Q8194q9727r4142k03241j17293N9212
$$ y = [172753, 175123, 190345, 146822, 139813, 19670, -35844, -63432, -56120, 191086, 334659, 73010, -220470, -225506, -176597, -175760, -302625, -107460, 114638, 182139, 218289, 258193, 331507, 304099, 244726, 85013, -292240, -381425, -523521, -510541, -440203, -118177, -160404, -266219, -531814, -649323, -614235, -311572, -39852, -126833, -375811, -91244, -36797, -110719, -123081, 9041, -128527, -288622, -188447, -65464, -62451, -45222, 2961, -99592, 51022, -26243, -113738, -381945, -371042, -288720, -247089, -49219, -17237, -16045, 258986, 323686, 192262, 305532, 103569, 66992, 149179, 306032, 519129, 348706, 330423, 344420, 188008, 65017, 60538, 212540, 300734, 211007, 116865, -86376, -203669, -144457]
21597a44457N5452M47281M5805J7304k88279j84033j09464j28770P5662J54474
21587e9025K95232m5892l09554L3177M2568K04319J75906j04408l85781j296J13715
21576d1039m0921j50267j70609J49514R1579m3358K58258j39146J09313o75o7467
21565d4818J98189j48593k70136l35845L0272J47477k4131j8468m4169K5042J17984
21554c67196K01914J58113K0411r0807K17874j23004n4955Q0776M6049Q2150j50381
21543B0944o6119J49143O5045K26258j02974k35088K69833K64893j19121k31432
21533B41382l2797j31445O9445J96160J91943n5810k15056l06837j45144J07282
21523h0877Q7946p5102p9543k00388j03408K60166J89237J12376J0500k90314
$$ y = [-144457, -89005, 358276, 404081, 421385, 133106, -50927, -160391, -289161, -213499, -59025, 236207, 190315, -119239, -86062, -43494, 160825, 336731, 232323, -153458, -154754, -41039, -81960, -232227, -402836, -253322, -161743, -205101, 53157, -85989, 23324, 22649, -44818, 153371, 4778, -265358, -601203, -570931, -423454, -447585, -466053, -510222, -485180, -367196, -165282, -7169, 13242, -77565, 140309, 17305, -37650, 43126, 89175, 171325, 20944, -45175, 103968, 169013, 395271, 292297, 57209, 327042, 591935, 472814, 241382, 208585, 77140, 146585, 342745, 534688, 478878, 263822, -43015, -188159, -80877, 7069, -68033, -147576, -347964, -451372, -191206, -1969, 110407, 120907, -169407]
21513a69407k15412Q2704K64310m0691J67172J75676l39183l26785N0498J23765
21503b27353O4344K30785J60532J27250j95692j15169Q0125J69811l661J186J15383
21492D07541r8834M4146O455J88827j89427j82371k83453j23388L01944j93470
21482a22030k43820K00768j4301r9874L9104l7517O759J40745R0160Q4663J79376
21471B24033K7272o4483K04169J01521k41217j80432j47833p7877L91296o5494
21461A70955Q8518J2043k20726l14848l89919q9328K99433L18228O8631j67673
21451b24686K1632K58314J48880k7887j2573J7608j8951n514j73533K8233O8009
21440G9532J9678J03313m8210J18354P454o0750j8879L50114L56870j85951l08651
$$ y = [-169407, -384819, -302115, -37805, -78496, 88676, 264352, -74831, -401616, -351118, -227353, -163009, 67776, 228308, 355558, 159866, 44697, 124822, 294633, 290972, 292158, 407541, 308707, 352853, 359308, 548135, 358708, 176337, -107116, -230504, 71440, -122030, -365850, -165082, -179383, -279257, -240153, -277670, -270911, -130166, -40006, 44657, 224033, 251305, 186822, 390991, 492512, 251295, 70863, -76970, -154847, 236449, 170955, 259473, 271516, 50790, -264058, -653977, -743305, -443872, -125644, -57013, -224686, -203054, 55260, 204140, 176253, 163680, 181288, 162337, 156823, -16710, 11523, 79532, 99210, 202523, 154313, 272667, 280121, 219371, 200492, 550606, 907476, 721525, 412874]
21429D12874k94734k11179o9765N6277K31160O8833Q251j92124j27805j57482
21419b75694j50090J88584K16601J53759k79657j7948J12097j16367n0865J98518
21409b1062k01134J56850L18777q4428j2773L5520L05482K1853j94560j67879
21399A56646j12476k52975J31986l12303j85916J66325K32854N0864J14172K13756
21389B02933J35342J54236n1122L2424p8480j08240k2794j17146j95823q1124
21379a29794J16285K49244l35274l94379j41090J50141K402j67239J88098J38102
21369c23504K46807M07597Q5716k61483j49450j05277J35493L01766r0044j22273
21359A25348j38433j20968J6233L85219l22470j67482L49153M00242N1284k95514
$$ y = [412874, 118140, -93039, -162804, -106527, 124633, 193466, 201717, 9593, -118212, -275694, -425784, -237200, -20599, 133160, -146497, -164445, -52348, -168715, -219580, -21062, -222196, -65346, 253431, 169003, 156230, 191750, 497232, 519085, 324525, 156646, 44170, -208805, -76819, -389122, -575038, -408713, -175859, -124995, -10823, 202933, 338275, 492511, 441389, 473813, 395333, 287093, 264299, 147153, -48670, -129794, -13509, 235735, -99539, -493918, -635008, -484867, -482465, -649704, -461606, -323504, -76697, 330900, 416616, 155133, 5683, -99594, 35899, 337665, 247621, 125348, -13085, -134053, -117820, 267399, -55071, -222553, 126600, 526842, 578126, 282612]
21349B82612l5206l813j3282Q6942k74356l23270J9068J83878J9836k3362j8803
21338i9756R5034J37806l43917P7970k87668Q1368L6146M4760K7300J42947R6603
21327H593J0162j12200j55369L3327L33220K76616j29509j75618k48831L4973
21317a24636K8777K8207M9562j47508l9732j16093j02574j47894K28497J31674
21307b11720J04934l13542k05195J87093J08202M1038Q4425N465N8552K77153
21297A36405J24424k40721L10917J77060p9845j01179k2247L6611J46272J09920
21287E97617q0014k31022l73620j56560K45850J5365J30947J38793N9933P1727
21277D19016k5076j42439k30052K1324K32157Q5290k47862J55275J99373q8070
$$ y = [282612, 247406, 243593, 230311, 317253, 42897, -280373, -261305, -77427, -57591, -80953, -99756, -4722, 133084, -210833, -132863, -420531, -339163, -303017, -258257, -230957, -88010, 8593, 18755, -93445, -248814, -215487, 117733, 394349, 264840, 89222, -159609, -124636, -95859, -67652, -18090, -165598, -205330, -321423, -423997, -571891, -343394, -211720, -106786, -420328, -625523, -438430, -330228, -289190, -204765, -199300, -140748, 136405, 260829, 20108, 331025, 508085, 428240, 327061, 304814, 341425, 487697, 597617, 517603, 286581, -87039, -243599, 2251, 17616, 148563, 287356, 347289, 419016, 393940, 251501, 21449, 42773, 274930, 360220, 112358, 267633, 467006, 378936]
21267C78936k70405l57P8822L9769l96910J40314k4232P4154L18121j96695L8864
21256A80381R4110j07043J60987j17270m68793j17189P3681R7707q2300j6741
21246c02470K06737J246m0961N8915R6278k0437N8716J7431k31294j12910J62197
21235a06552J64780j61454n4303j9251m4816j5659r3977O1335o7583J11345J46399
21224g9736k08780N7979J06131R7281M0204L6449R198o5658O0917j13129r4211
21213a53355n3177J45793J30245L17621q1962l22072r793L2893J64774r341k43353
21202h1727j42946J9203L47106K22724O3750j92524n5855l05510j24170N5359
21192a94590O4155O1981k89193l8851J93691O4668R7721K93714k5899L3783Q3345
$$ y = [378936, 108531, 108174, 186996, 226765, -170145, -29831, -54063, 20091, 338212, 141517, 180381, 274491, 167448, 328435, 211165, -257628, -374817, -301136, -203429, -285729, -302470, -95733, -94487, -135448, -76533, 19745, -692, 58024, 75455, -155839, -268749, -106552, 58228, -103226, -157529, -176780, -221596, -237255, -331232, -269897, -337480, -226135, -79736, -288516, -230537, -124406, -27125, 13079, 49528, 58726, -6932, 53985, -59144, -153355, -206532, -60739, 69506, 387127, 305165, -16907, -26700, 6193, 170967, 161626, -81727, -224673, -205470, 141636, 364360, 428110, 235586, 179731, -125779, -249949, -194590, -130435, -68454, -357647, -396498, -202807, -138139, -40418, 253296, 227397, 261180, 344525]
21181C44525j00742j24540K5698L5890q6064P1293k19517j26756K41556N1508
21171A12851k1464J13686L84134J24193K9583j58376J46012j03611l748n4259
21161E69001k2989J3037o1658J2474j55933j13351j78216o4653P3366m0924j87483
21150a57329j0406J15805J36949m4681m5038k02284P5348k487m8421q2069P6728
21139a87885l1376N3128J10007P6307k30087K8389J18271Q0576J12733j55823
21129b5760J1849J56374M1783P490l42282k9596L87717J78867K04791k12813k43216
21118A35204l45230P8755K09027J90576K24766r8886j65075l66977m9437K63010
21108G5733K56095l36174j59878R3545J41228k50045J05669J41644l2768N9786
$$ y = [344525, 243783, 119243, 144941, 180831, 94767, 166060, -53457, -180213, 61343, 112851, 91387, 205073, 589207, 713400, 742983, 584607, 730619, 627008, 623260, 569001, 546012, 559049, 497391, 509865, 353932, 240581, 62365, -2288, 71078, 30154, -157329, -167735, -51930, 85019, 40338, -4700, -206984, -131636, -134123, -182544, -264613, -187885, -219261, -166133, -56126, 20181, -209906, -181517, -63246, 17330, 130063, -25760, -13911, 142463, 184246, 191736, -150546, -180142, 207575, 386442, 591233, 378420, 135204, -210026, -131271, 77756, 268332, 493098, 394212, 229137, -137840, -187277, 75733, 331828, -4346, -164224, -70679, 70549, -179496, -73827, 67817, 35049, 94835]
21098I4835n3344p3248k27348K4459p089o1286R8997m66796j16787l4770L35433
21087d86944L14722J51822r047J45379r2911o0570j25925J10827K09825j5238
21077A41940R945k7714k95492j76933K47517J56990n421l44949k17228K60511
21067b50834N07383L21342m2565j82054J24963j3737j84553j16262K23085J36682
21057E23450k27135j37224j35223p7355j25557J37550J74801P071J7568k11874
21047e3928o8921l7044o27J16371J20832k04581J53297L9579R0667k3067p6009
21036E6569k63879j11557j5147o81p7696r5710J1385J67808k987j49131j14241
21025e95267K05845J85317j40236M5076k5037j5686P503k64942j30274L21911
$$ y = [94835, 41491, -31757, -259105, -234646, -241735, -303021, -204024, -670820, -787607, -822377, -486944, -172222, -20400, -29447, 115932, 23021, -37549, -163474, -52647, 157178, 141940, 151885, 124171, -171321, -348254, -100737, 56253, 50832, -294117, -511345, -250834, 256549, 577891, 535326, 353272, 478235, 464498, 279945, 163683, 386768, 523450, 296315, 159091, 23868, -53487, -179044, -41494, 133307, 140378, 157946, -53928, -122849, -159893, -160520, -44149, 76683, -127898, 25399, 64978, 155645, 132578, 56569, -207310, -318867, -334014, -334695, -412391, -508101, -496716, -328908, -331895, -481026, -595267, -389422, -204105, -344341, -299265, -324302, -339988, -332485, -597427, -727701, -405790]
21015d05790M1467K02877K44670J76458K8154k36965m25391q5661K00391J39046
21005a20744R7810p1432K31961J02328j22860O786l17209L3357P5982l15267J95684
20994b03604K38322j04113j71076J51229J47509J28414J67359k5627j67131j10264
20984E1018j41439O3977J95674K21770j59820l19089j82813j49125l17194j76746
20974i13787L98698J65339K24264O8734j03486N3805n5241N3251P3525o0678L6680
20963e8896P4909j19812J3389J10073j80296J90569P02219J09061l61367k33394
20953B46455k05048j44463k02279q6775K60462k40535k90837J76599M25301k48948
20943c10068J13715M7224K13573o4794j8099J63367P7316p7143q8706k28717J6951
$$ y = [-405790, -364323, -161446, 83224, 259682, 287836, 50871, -374520, -460181, -259790, -120744, -22934, -94366, 137595, 239923, 117063, 123849, -193360, -160003, -84021, -399288, -203604, 34718, -69395, -240471, -89242, 58267, 186681, 354040, 328413, 161282, 51018, -90421, -26444, 169230, 391000, 231180, -87909, -270722, -419847, -737041, -913787, -515089, -349750, -125486, -56752, -160238, -106433, -161674, -108423, -34898, -95576, -58896, 16013, -103799, -90410, 19663, -160633, 29936, 732155, 841216, 479849, 246455, 41407, -103056, -305335, -392110, -131648, -372183, -663020, -486421, -61120, -310068, -196353, -149129, 64444, -350, -18449, 144918, 222234, 145091, 56385, -172332, -155381]
20932a55381K46896p920k96275N0568j9495M2164k592L2103Q6624K25994M61460
20921F64146L28632m64274k78303j7764K11199m7472k28035J27003K18567l9894
20911D73805j12796J74662k83475m09251M747J15256j21706J20832R7060j17204
20901e8070K7433n1011k52279j11277L83661K63179j45612J56144j27015m3341
20891D1812K33868j62065J09167j15562K615k10071n5958K64215N299k10166M1861
20880e4985K15352J73113p1966j79678j90441K00999J3267j66350j184o3179Q8939
20869c6113K89739p6081k01428j11007j11581l0940j95322M25957K20872M0479
20859B14575K0481r0396k4909k2700p907L7922J38627j38700j41906j29682Q591
$$ y = [-155381, 91515, 83595, -212680, -162112, -181607, -139443, -142035, -109932, -23308, 202686, 664146, 992778, 528504, 250201, 232437, 443636, 396164, 168129, 295132, 513699, 473805, 361009, 535671, 252196, -157055, -152308, -37052, -158758, -37926, 59134, -58070, -30637, -81648, -333927, -445204, -61543, 201636, 56024, 212168, 85153, 41812, 275680, 113615, 222782, 107220, 109835, -100236, -156194, 108021, 113320, -96846, -54985, 160367, 333480, 261514, 81836, -108605, 92394, 105661, -60689, -61873, -125052, -36113, 253626, 177545, -23883, -134890, -246471, -277411, -472733, -46776, 174096, 214575, 235056, 144660, 119751, 97051, 89144, 127066, 265693, 126993, -14913, -144595, -136004]
20848a36004p3995J87370L07587r0471r0693q6560J19372j01743R2810k6222k6722
20837G4729l08113K79009L07384j51232k14604j41837P0628Q1917P1708J39839
20827B09428L4360j93279j13532r3438j69717J20681J99599K76690k15026j13788
20817e8022Q9121k16515j13421R6633o2385j19043K29202O2053P3147P6219J40134
20806A97123o3447p6937j49362r3780k8602J51677J03723M3911j7568j01193J66370
20795A31915p2676r4726q9091r8365J55576R7821L6535j79756m1251Q9382J33363
20784F8727K73196N4731J88965k69717m840j54423J37408J07854k6425m34036
20774e8560l17848J48354K93824K77612k1268k68090l749K3749k98041m4970K77725
$$ y = [-136004, -209999, -22629, 284958, 194487, 103794, 17234, 136606, 34863, 127673, 101451, 74729, -233384, 45625, 353009, 201777, -12827, -154664, -84036, -2119, 69589, 209428, 243788, 50509, -63023, -156461, -326178, -205497, -5898, 270792, 55766, -58022, 31099, -185416, -298837, -202204, -264589, -383632, -154430, -92377, -19230, 56989, 197123, 133676, 56739, -92623, -186403, -215005, -63328, 40395, 84306, 66738, -34455, 131915, 59239, -35487, -124578, -222943, -67367, 30454, 66989, -112767, -154018, -64636, 68727, 341923, 396654, 585619, 315902, 311062, 156639, 294047, 401901, 375476, -58560, -376408, -228054, 65770, 343382, 322114, 54024, 50275, 74024, -224017, -268987, 8738]
20763H738N1735Q0680j61494j69610j58319J14735o842k16929Q6543J79370L5823
20752a55570j4733N3618j17253P5260K0994L4356k26406j25458K8331L22712J88373
20741H4224k01333R2811J21928j56260q0386J53997j07705n20075P7665J22748
20731d12386k6628j86259Q5386M20618J39871J61853K2268k62827J82358L22708
20721D46962M8606j11103j74247j85272m1017k0571k08936J79836J38723q6499
20711a3518l1109j783q4151m7723K12744N8806j2872k80018j65479j0119J58915
20700b16307r4264j80254n3084R6690j48089m8154K88886L10748m1854J2088j26531
20689b00125N0494J91426j56021j32655n2349m5683K54265Q2730j76783j0942
$$ y = [8738, 60473, 141153, -20341, -189951, -348270, -233535, -240377, -457306, -370763, -191393, -155570, -170303, -116685, -233938, -158678, -137684, -103328, -329734, -455192, -426861, -104149, 84224, -117109, -24298, 97630, -58630, -139016, 14981, -92724, -612799, -535134, -412386, -439014, -625273, -539887, -119269, 20602, 182455, 204723, -58104, 124254, 446962, 495568, 384465, 210218, 24946, -16071, -36642, -245578, -65742, 72981, -13518, -44627, -46410, -130561, -178284, 34460, 93266, 80394, -199624, -365103, -375222, -216307, -310571, -490825, -543909, -447219, -595308, -643462, -354576, -43828, -85682, -73594, -200125, -149631, 41795, -114226, -246881, -299230, -344913, -90648, -7918, -184701, -195643]
20679a95643J55781P8359J1433j13709N6379J70229J48281n9152q0428k26098
20669e4568K4511J12091j99306k21271j14035P6074J11552J73945j68626j90155
20659d49788n7849Q7843O1681K89857Q4978R713o062M1381O6023o5553m781j92744
20647a35301k09827k12653J45950J78584J66772Q0505k61121J4156N8639p6660
20637b50956Q0530L20716r7404J67016J49490K14146l994k47449m40563j29406
20627b37874p8748k03766R7274K05307K9538K80064j84200l07022o2238J13114
20617c48551j96781J3777L43590N0532k82888j59604J57940K71388j0910M6571
20607a14936j23340j59967o1291J90300J11948J09053J87891J23941j6686j87356
$$ y = [-195643, -39862, 38497, 49930, -63779, -7400, 162829, 311110, 251958, 171530, -54568, -30057, 82034, -117272, -338543, -452578, -376504, -264952, -91007, -259633, -449788, -507637, -419794, -358113, -68256, 16722, 26435, 20373, 61754, 127777, 62224, 57443, -135301, -345128, -557781, -411831, -233247, -66475, 14030, -247091, -232935, -174296, -250956, -170426, 150290, 52886, 219902, 369392, 583538, 579544, 332095, -108468, -237874, -316622, -520388, -423114, -217807, -188269, 91795, -92405, -399427, -461665, -348551, -545332, -531555, -187965, -137433, -420321, -579925, -421985, -150597, -161507, -114936, -238276, -398243, -459534, -269234, -157286, -48233, 139658, 263599, 246913, 59557]
20597E9557k04318k34483J39002M28686j39338j40542N9245K00364l92742o6467
20587b91036k788J57508J0902J15782r8673k10756M87896K74162M022l40086k25573
20576a18640n8064O2297L5948k0786J84971Q4799k53192P1116J63154J33896j53093
20565A32406J24412J29491k79288l17183L25055J81827j51500l30561r9656J97016
20555h7981J61159q8943M7323N043M9750Q6844j80428o6919K5207J76945l9793
20544H8207j67252k55387R4803K43144K51684m63736j91868L05381m9779j01321
20534b46124k6909J5962J0710J47871M1024n5480j19496k20258Q5152Q5229K13820
20523f8499K33068o9596q3907j88227q8309Q7612j96285Q1605J91173L54159J94739
$$ y = [59557, -144761, -379244, -240242, 188444, 49106, -91436, -32191, 168173, -224569, -291036, -293824, -136316, -125414, -9632, -108305, -319061, 168835, 442997, 447019, 106933, -118640, -176704, -114407, -78459, -99245, 85726, 170525, -82667, -11551, 151603, 285499, 132406, 256818, 386309, 107021, -210162, 114893, 296720, 145220, -185341, -284997, -87981, 73178, -15765, 31558, 36601, 86351, 173195, -7233, -74152, -48945, 128000, 88207, -79045, -334432, -239629, 3515, 255199, -208537, -400405, -95024, -144803, -246124, -273033, -257071, -246361, -98490, -57466, -112946, -232442, -452700, -367548, -282319, -68499, 164569, 94973, 11066, -177161, -265470, -177858, -374143, -292538, -101365, 252794, 447533]
20512D47533j74720l53617J38389Q0473M1391K19368r0712J7762m61568p6015
20502b11716K95295m2196j05088j54631K67819J84162k8268Q8735J24628j16253
20492C02487q9864k74585mJ82072K16721Q5533L0453k57786k37485l03800O3536
20481b82722J54187o2075n1842J6551j19986j88323m1996L83233L59893R1578
20471B58498J44597K0298j79387m4100K86581L25490m17708n55269j02213R1698
20461a71515J15168J28945j55804o9715M846j88805k46750K85430K56427J3701
20451b8072P7618k31617r4105P3212n6931J17675K97501L24614j00229k85954
20441I3712j4788l3849q621j25937Q5000R5137M8881J13912j01409j97982K48227
$$ y = [447533, 272813, -80804, 57585, 138058, 179449, 398817, 308105, 325867, -135701, -211716, 83579, 41383, -63705, -218336, 49483, 233645, 205377, 294112, 418740, 302487, 212623, -61962, -61966, 120106, 336827, 422360, 452813, 195027, -42458, -346258, -282722, -128535, -190610, -242452, -225901, -345887, -534210, -576206, -192973, 166920, 258498, 403095, 423393, 244006, 199906, 486487, 811977, 394269, -161000, -263213, -171515, -56347, 72598, -83206, -152921, -148075, -336880, -583630, -298200, -41773, -28072, 49546, -182071, -276176, -202964, -259895, -142220, 155281, 479895, 379666, 93712, 78924, 45075, 36454, -89483, -4483, 90654, 139535, 253447, 152038, -45944, 202283]
20430B02283J45931l4165m1729k03644M0106q7644L820m7350j11435j7128L62716
20419B11761J61035M3406o1671q9691j08320k16930K4961P8234K58957J32767
20409D34509n0586j17593j36988J24676j34595j00940n4870k417l9148K08475
20399A30523J56663K21857L7695o2903k25347k34679O4287l1472K2004r7793K57148
20388B37983M6652k11757j41815Q5083K62561K06142O7243n54107k79792L81054
20378I9247j30252L9555l4689n6878K37055J15326o9309r1722j99680N5299J29367
20367I3319j02464j04913k70977j27521L03854L02814J08548j41217k07653l7110
20357a83320N3022N2856k70966j13067K69141J95669j69868r0197J05406K67558
$$ y = [202283, 348214, 314049, 272320, 68676, 108782, 21138, 24958, -22392, -133827, -150955, 211761, 372796, 416202, 354531, 264840, 156520, -60410, -35449, 42785, 301742, 434509, 383923, 266330, 129342, 254018, 119423, 18483, -36387, -38804, -77952, 130523, 287186, 509043, 546738, 483835, 258488, 23809, 88096, 56624, 78628, -19165, 237983, 284635, 72878, -68937, 16146, 278707, 484849, 552092, -2015, -281807, 99247, -31005, 8550, -26139, -83017, 154038, 269364, 200055, 108333, -91347, -36048, 93319, -9145, -114058, -385035, -512556, -208702, 94112, 202660, 61443, -146210, -183320, -130298, -77442, -348408, -461475, -192334, 3335, -166533, -256730, -151324, 116234]
20347A16234J40125q7814j31357l3237l56967r439m5550K92213N0471J86552r1137
20336C0094l87553l10615J31602K26944J81711K03K0749J2338k6324j72088j47125
20325d40064j50557K1315M0313J93205J65697m7723J37506J54348L5579m92043
20315c82424p2453L33458j47705o2639J50325j0171J4643J70700l9718k2666o04
20304f9254n9573o6770j38550n9808N6209R7380J43905j781J57528J19629j8981
20293A59934l8023N4866K4336J15484j59704j83294J11964K54271J29099j90264
20283B78669Q722k52232J5703K16078l8691m8624r374R1456N8497j0826j31092
20272A78286Q46Q2511o3402l05704r8939J35718K8977j45079k08736j30676K51515
$$ y = [116234, 256359, 168545, 37188, 3951, -353016, -362455, -408005, -115792, -65321, 121231, 30094, -357459, -668074, -536472, -309528, -127817, -127614, -106865, -94527, -120851, -292939, -440064, -590621, -569306, -528993, -335788, -170091, -217814, -80308, 74040, 109619, -382424, -454877, -121419, -269124, -331763, -181438, -191609, -176966, -6266, -45984, -68650, -69254, -128827, -195597, -334147, -393955, -337746, -240366, -96461, -98242, 59286, 178915, 159934, 121911, 176777, 201113, 316597, 156893, -26401, 85563, 339834, 468933, 278669, 287391, 35159, 50862, 266940, 228249, 179625, 170251, 261707, 320204, 309378, 178286, 179132, 261643, 198241, -107463, -206402, -70684, -41707, -186786, -395522, -526198, -274683]
20261b74683k061L0687Q5065k3316J94466L09438J45045l69276q5163Q5071j62380
20250f7107j29998k68376K5806K14787K95002L2341k71162k18986K81688J2694
20240i3311K44803J57577k74816q1482J43800L3390j46121j24697j32804K9444
20230b44217J33408R5872K42666j0526K9012r8717n9843l0718K07013O3716J14531
20219D42197l9045j12847k8641R3150N45k52492j9382o6686J35116J54459j53988
20208A52386l53169J06203L4529j47098k12356k43656k4152J60703M14066L2808
20198g9736j16617J48342l4245j65599M1770L8225N4009n3320q9272L0635K00780
20187b5028J52421J12583m2593k96072q5326l06220K14597m2412k07496K54781
$$ y = [-274683, -276744, -246057, -160992, -184308, 10158, 319596, 464641, 95365, 10202, 95273, -67107, -197105, -465481, -439675, -224888, 70114, 102455, -168707, -387693, -106005, -93311, 151492, 309069, 34253, -47229, 96571, 129961, -16160, -140857, -273661, -244217, -110809, -14937, 227729, 217203, 246215, 147498, 87655, 56937, 263950, 327666, 442197, 403152, 290305, 261664, 354814, 355359, 102867, 83485, 16799, 151915, 306374, 152386, -200783, -94580, -60051, -207149, -419505, -663161, -687313, -526610, -112544, -79736, -196353, -48011, -82256, -247855, -206085, -167860, -113851, -167171, -256443, -225808, -25028, 127393, 239976, 197383, -98689, -184015, -490235, -275638, -318050, -525546, -270765]
20177b70765K33229j59736n1084J02452M4677J48509K74038j62348J721K1906
20167A82599n4845o5828L4373j36392o0118k51982J95332L32862O0014m39250
20157b03235j06349K35144J52925J58833R4985j29501l48187J35609J86204J0975
20147A87403O2886j2195N1317O7510k06120k51316k27817j23605K67096K19624
20137C4783J24608J9150K8800m00556J32479J62357j16958k44905n9530K04637
20127a15135J24099R1595Q5019k30683n33431M2346J42494J47818M6067J07618
20117i2193R7183j12819K16789P6243j07034l6315j29307M0576m7950O7814L2212
20106E199j75920L4461J38977J1017L0758k95152M3876Q9970q9152M4670j3974
$$ y = [-270765, -37536, -197272, -248356, -145904, -101227, 47282, 321320, 158972, 160693, 182599, 127754, 61926, 96299, -40093, -100211, -352193, -156861, 176001, 236015, -203235, -309584, -74440, 78485, 237318, 332303, 202802, -145385, -9776, 176428, 187403, 250289, 238094, 289411, 356921, 150801, -100515, -328332, -451937, -184841, 34783, 159391, 178541, 207341, -193215, -60736, 101621, -15337, -260242, -319772, -115135, 8964, 100559, 185578, -45105, -578536, -536190, -393696, -245878, -199811, -92193, 4990, -107829, 108960, 185203, 78169, 41854, -87453, -46877, -94827, -27013, 5199, -170721, -136260, 2717, 13734, 44492, -250660, -206784, -116814, -205966, -161296, -175270]
20095a75270N2413N8244R9007Q4135P474j73180k40694Q0617K76977J59224L9559
20084B68506J75391j31630k36841j08705j13505r5184J67058J2711O984M29572
20074C74357J32294q417j01293l60238K26560l3472j38452k08430L6820N3982
20064b6289l2965k8573j19956j63281j96088m1935J56384n527J66247P462J56215
20053a28306k2260m9010L16866j25483o9633k3260K6472J48854r0797j58388p98
20042a75743L31931o8108k89303j0929K62990J83405l05109k18751m3929j7459
20032c51005J75688K0858J13273K82363L47953o1266l32652k20828j19217J3059
20022a31774J51090P9406J35438M7498k09257j35501P8430k00317k96239K06358
$$ y = [-175270, -122857, -64613, 34394, 118529, 126003, -47177, -287871, -207254, 69723, 228947, 268506, 443897, 312267, 75426, -33279, -146784, -241968, -74910, -62199, -55215, 374357, 506651, 498234, 396941, 36703, 263263, 229791, 91339, -117091, -80271, -26289, -59254, -87827, -207783, -371064, -567152, -609087, -452703, -458230, -291983, -284521, -128306, -150566, -199576, 117290, -8193, -77826, -101086, -74614, 74240, -16557, -174945, -175743, 156188, 88080, -201223, -212152, 50838, 234243, -70866, -289617, -333546, -351005, -175317, -154459, -41186, 241177, 589130, 527864, 195212, -25616, -144833, -131774, 19316, 98722, 234160, 281658, 72401, -63100, 15330, -184987, -481226, -274868]
20012b74868N2574j99251L1321J11924K66992K30932J63565k1828J10747k7393
20002D44715J39183Q5419R7925l26855l53800k06448j74589K99605L36467o5146
19992B76476k05692j34851o7868O4220m599o4398j761o6768Q9652K81009J56028
19981C21448J8090l17409J24220J41972K37941k67893k22221j59065l0121L1502
19971a21536O4115p2085J23120J2432Q881K97077J6855l11486k09827o7675j34555
19960c94684k8748L06610K02810J430r5441J16202n9950Q7832K68163j8870l71892
19949A3462k54482R5190k26047m79524K32008J10935R7531L49813O1867J7447
19939A8200o7734j4815O0716j21073l1570P658L4147P3086Q6869m9477k6906m5453
$$ y = [-274868, -222294, -421545, -390224, -278300, -11308, 219624, 383189, 361361, 472108, 444715, 583898, 669317, 767242, 440387, 86587, -119861, -294450, 5155, 341622, 276476, 70784, -64067, -131935, -67715, -72314, -136712, -138473, -205241, -115589, 165420, 321448, 339538, 22129, 146349, 288321, 526262, 258369, 36148, -122917, -153038, -121536, -57421, -129506, -6386, 6046, 14927, 312004, 328859, 17373, -192454, -260129, -394684, -423432, -116822, 85988, 87418, -8023, 108179, 48229, 136061, 404224, 385354, 13462, -241020, -145830, -371877, -851401, -619393, -508458, -410927, -61114, 753, 18200, -49534, -64349, -3633, -124706, -156276, -148618, -114471, -41385, 45484, -3993, -30899, -76352]
19927g6352j62315k58909L43971P8924L15322L2381J90401j0731l41191k90460
19917a78959J2772p302o224L26958q7433p8294m7623j48520L2864m0538O7053
19906a55246L52210J26852k82520k20577L27877R6932M5345J31832Q3444k71029
19896B35120m35642o3915J53019L13471L09960J93378j40470p9390O1461j59641
19886C87351n88j28388j55522l66557p7867M41282J51267N591N1200M5060o7500
19875B85329k24925K15079J18010k29617j60945K44052Q5839J14649O1289l7115
19865D71645K48863M8966j48364k55785j49202p9792j2403P371j0738n5440k90971
19854b25850j1055J66547K00223K36349j53463q3317m15079j01405K46386K5082
$$ y = [-76352, -238667, -497576, -153605, -74681, 240641, 273022, 463423, 452692, 111501, -178959, -166187, -173489, -179713, 147245, 59812, -18482, -66105, -214625, -181761, -222299, -155246, 196964, 323816, 41296, -179281, 148596, 245528, 290873, 422705, 506149, 235120, -200522, -264437, -111418, 202053, 512013, 705391, 564921, 485531, 546992, 387351, 386763, 258375, 102853, -263704, -341571, 99711, 250978, 256569, 307769, 352829, 285329, 60404, 275483, 393493, 163876, 2931, 246983, 332822, 447471, 508760, 471645, 720508, 769474, 621110, 365325, 216123, 136331, 123928, 131299, 120561, 65121, -225850, -236905, -70358, 129865, 366214, 212751, 129434, -285645, -387050, -140664, -115582]
19844a15582j32184K6695P9177M9563r825j18992j13986j80200J06216N51463
19834A42345L01100K55028k96883k39991j52587j69242L18097P2270j85657Q472
19824E2952k0880K70968j02337j40048j42977o2906p5660Q5993J33476K4323L2313
19813E5217p9838O0425m3766M1078j39203m117q2969M0440m7377k28255M0768
19802c87597n2148j58738J75670P8074J43515K00551m9983j40331o0964K3600
19792b28351L8880p2792M5053L33862j43467k02194M1730K52169K69741L38741
19782F73372j15015m51961m20814K00167J44126j40842j5486j63169k0929N0235
19772b60316Q9257J30484k0541k84093Q4008j28839L83970Q4243j17603j58334
$$ y = [-115582, -247766, -221071, -141894, -92331, -102156, -221148, -335134, -515334, -409118, 142345, 443445, 698473, 401590, 161599, 9012, -160230, 157867, 230137, 44480, 52952, 32072, 303040, 200703, 60655, -82322, -145228, -220888, -134895, -1419, 22904, 55217, -24621, 35804, -7962, 33116, -106087, -110204, -193173, -152733, -200110, -428365, -387597, -439745, -598483, -422813, -344739, -201224, -673, -50656, -190987, -251951, -228351, -189471, -262263, -217210, 116652, -26815, -229009, -187279, 64890, 334631, 673372, 558357, 106396, -314418, -114251, 29875, -110967, -126453, -289622, -310551, -260316, -171059, -40575, -61116, -345209, -261201, -390040, -6070, 78173, -39430, -197764]
19762a97764K3881o8123P3410J35676r9080Q3258L84013j50241l33244Q4918N653
19751e7643k2676Q0013J26396l2555J40182j58661J38836r4427J1084L8289O3730
19740B32568o65J32707j17350l6623Q6526P1151j03129l07936j19450K01070K6339
19729F5208J95981M9343l05628j05156J33808J3586j46598K07651n4067j15883
19719f1755O7600J05388J78595q129j42616N8505J3629N4779p9481J78961Q0731
19708D46207l22639j29592k83004k37036K55880J7780K15704K96997K6251r6992
19698A89556j59350l154J5955J62730L27761r5977j60735l9093l18314m137j4438
19687i9196N04885J6282j49952j80475N2586k3515j67115m0163L8367N6493R0890
$$ y = [-197764, -173883, -242006, -168596, -32920, -132000, -48742, 335271, 185030, -148214, -63296, -57643, -80319, -306, 126090, 93535, 233717, 75056, 213892, 119465, 130549, 168838, 232568, 231903, 364610, 247260, 210637, 297163, 368314, 265185, -42751, -162201, 38869, 65208, 261189, 310532, 4904, -100252, 33556, 47142, -99456, 108195, 54128, -61755, 5845, 111233, 289828, 281699, 139083, 197588, 211217, 265996, 186515, 365476, 446207, 123568, -6024, -289028, -526064, -270184, -252404, -36700, 260297, 286548, 189556, 30206, 27052, 43007, 205737, 533498, 437521, 276786, 237693, -80621, -84758, -99196, 405689, 421971, 272019, 91544, 144130, 120615, -46500, -86663, -48296, 8197, 99087]
19676I9087q4280k48544k1576J58485K24018L15342n602q0047k53212q4507j10518
19665i1354j50405J04328M42379L04191p7462k88920J5560J06666j58710N043
19655B11316K1366M8289m42675k07410J62399J5326k8770M3965J51855P3032m7785
19644I08P5799j38336j08045J90161K92731Q9453j11770j60736j06025J92061
19634B16201j21958l9546M02312L15924O6651j14315m77338j68743L6146J78511
19624B93845K8991k23252J3518o35p6188j95477J38807L53460J58804k76859j64580
19613E0434K14846j39649j32467J33728J18783R8034j61943q0827j53621J40601
19603H7919L0970O1112j17617l28149k945J59551N04264j10336l7883J64761k7164
$$ y = [99087, 14807, -233737, -255313, -96828, 127190, 442532, 436930, 356883, 103671, 19164, -91354, -241759, -137431, 304948, 609139, 531677, 242757, 258317, 364983, 206273, 211316, 232682, 280971, -161704, -369114, -206715, -191389, -220159, -176194, -24339, 48693, 908, 76707, -61629, -169674, 20487, 313218, 402671, 290901, 130165, 24140, 216201, 94243, 54697, 457009, 772933, 839584, 725269, 247931, 79188, 115334, 293845, 322836, 99584, 113102, 112467, 36279, -159198, -20391, 333069, 491873, 215014, 50434, 265280, 125631, -6836, 126892, 245675, 343709, 181766, 100939, -52682, 87919, 118889, 180001, 62384, -265765, -268710, -109159, 395105, 284769, 246886, 411647, 384483]
19592C84483l16305j31562k31636O056J72645K96212K29403K2713K30817p303
19582F55523k95345j05970Q142M2291J31679L6415j18060k94405k41423K32367
19572E1214J31184J55407J291L8081q839L6243k07859j41150j08737K43989j22583
19561F8241j23529k7596K24116O5070o1992L8806n1967l4422j25825Q7110J85103
19550B43115J16202Q7499l4268k48342o03178J61027K32761L07240J12892J37956
19540E12904r9932o1781m1585k1708j00571L3950K24673l46362m07792j4082N15771
19529A93485M3056l87451j40516J62332K30551J62514K2458m26293k17211j3881
19519c70956J01473K05665K50083J02958J39732j84442m07237K5763Q436M7936
$$ y = [384483, 68178, -63384, -295020, -288964, -116319, 179893, 409296, 432009, 662826, 655523, 360178, 254208, 262350, 304641, 436320, 472735, 354675, 60270, -181153, 51214, 182398, 337805, 339096, 377177, 368338, 404581, 196722, 55572, -53165, 190824, 68241, -55288, -82884, 141232, 206302, 144310, 183116, 131149, 96727, -29098, 58012, 243115, 359317, 446816, 412548, 164206, -438972, -277945, -45184, 262056, 374948, 512904, 412972, 351191, 309606, 287898, 187327, 221277, 445950, 99588, -308204, -322286, 193485, 236541, -150910, -291426, -129094, 101457, 263971, 286429, -139864, -357075, -370956, -269483, -63818, 186265, 289223, 428955, 244513, -162724, -136961, -128525, -80589]
19509h0589J67389J24145J28976m7236J15119J96920j44349m5955n4124M2066
19499D02362J87179k86551k32418R4043j11853J35592K38271J56017j63687k62277
19489A56678l84229K45852J57188n2080k89966J80891M13403K35252N1880j87758
19479E27111L8641J34241l10489m5314K25500p2523j4089j08696j50698j69425
19469E4259K67485K10356K29268n9478k53155j92351j99664j40350L01715L49399
19459E67484j1212j2744K0914m09890l16009J64980K86802K91252L26289k83960
19449F23906l82845L03493J52901M3213K2965j01918K7735K46312j97615l96492
19439C41655j43112j78286L0588J41040Q4654O6360O389j02830K61127j7809j20823
$$ y = [-80589, 86800, 210945, 339921, 292685, 407804, 604724, 460375, 414420, 360296, 402362, 589541, 302990, 70572, 164615, 52762, 188354, 426625, 582642, 418955, 156678, -227551, 18301, 175489, 123409, -166557, 14334, 427737, 662989, 714869, 527111, 565752, 699993, 389504, 344190, 569690, 497167, 483078, 374382, 223684, 54259, 321744, 532100, 761368, 701890, 448735, 256384, 56720, -83630, 218085, 567484, 556272, 543528, 564442, 154552, -161457, 3523, 290325, 581577, 907866, 623906, 241061, 544554, 697455, 740668, 763633, 661715, 689450, 935762, 738147, 341655, 198543, 20257, 50845, 191885, 276539, 342899, 349288, 246458, 507585, 489776, 368953]
19428C68953m6981N8584n5729k6747J06037K4639q7871L2153L30722K28628j16414
19417H15974j31095l6194o2906k84903J00240J34747J4948j83503m3618K53878
19407E77568L88766P6133Q3155k72888L4048k2169K57794M36677K91367o8121
19397A782330l15878p5885n7284P3221k69611J8642j47582n52493j9089J45460
19387E81831J07638n0361J86148K0057j56749K51930L3298K49573l5588j09510
19377A078267M2069J07208P1656m5455j89122Q6545J32312j22109j82015l19102
19367F60254l17159K9742K00891k04532L9512N1797J49478J83173m7170J13944
19357H59930J67247o1763r6996Q5572O0289M05943J15368k87157m09884m1980
$$ y = [368953, 321972, 380556, 324827, 298080, 404117, 428756, 340885, 373038, 703760, 932388, 815974, 684879, 648685, 585779, 300876, 401116, 535863, 550811, 367308, 323690, 577568, 966334, 1042467, 1125622, 852734, 886782, 864613, 1122407, 1559084, 1850451, 1782330, 1466452, 1390567, 1333283, 1406504, 1136893, 1155535, 1007953, 455460, 436371, 581831, 689469, 639108, 825256, 845313, 688564, 940494, 973792, 1223365, 1187777, 1078267, 1120336, 1227544, 1299200, 1253745, 1064623, 1151168, 1283480, 1161371, 979356, 660254, 343095, 372837, 573728, 369196, 408708, 460505, 609983, 793156, 745986, 859930, 1027177, 965414, 868418, 953990, 1014279, 1420222, 1535590, 1248433, 838549, 796569]
19347G96569k0812J57038m05265j21408O7852O4895K25099o4745j83927l9240
19337D76056J09882L23812K17483L00928J20254M9018q1520k09165R0418J42291
19327A539457r7761j65149R003j62691P3551l1158N062K79320k750j76587k3788
19316A246509k13644l0632K95199l29905l81274k24290L07199k8936J95574J00851
19306I36651M13896M1897r0647Q9516l9163j87888j55008N4248L7259n4802j30475
19295I15484K32311J86530P1299j12608j16100m99632J51843q106k85826q6341
19285D48854L50101L29688j41686m10687l42028j5588J19867n3977q0848L07240
19275E10936K84962P8118R2606K82170J97691N1406j47811O4157o5876k83156
$$ y = [796569, 775757, 932795, 527530, 406122, 473974, 538869, 763968, 699223, 515296, 476056, 585938, 909750, 1127233, 1428161, 1548415, 1597433, 1515913, 1306748, 1397166, 1539457, 1441696, 1276547, 1285550, 1122859, 1196410, 1165252, 1170314, 1449634, 1446884, 1270297, 1246509, 1032865, 1002233, 1297432, 967527, 586253, 361963, 669162, 640226, 835800, 936651, 1350547, 1392444, 1301797, 1391313, 1352150, 1164262, 1009254, 1063502, 1100761, 1045959, 915484, 1147795, 1334325, 1405624, 1293016, 1176916, 677284, 829127, 821021, 535195, 448854, 798955, 1128643, 986957, 576270, 234242, 218654, 338521, 284544, 203696, 510936, 795898, 874016, 966622, 1248792, 1446483, 1497889, 1350078, 1414235, 1348359, 1065203]
19265A065203p7090K23631j5311J05156J54136r1686R4600j08061k88750j97772
19255H64056L78033P9650K52235L00405j19687l7055j73869k94094Q144n1096
19245A206722m19866j19519j94940K01869k3969n6800J58376r4545j40858K4442
19235E40912K48247J1579l7310N4638j15021m16533j22214l3400q7634J2371J3900
19224F9535K02090J24398j8932k69471j62165p717L55431K6406J67640j62780
19214C24435J96923P0835J03538J20431l85131m12852n2804R8561l1934K7695
19204E9697M31312m7821K37224j83854P7659Q6154k2860l23390l05375j89509
19194a80763j00924J62584K54805K97526j63141j55570J41698R3011R4922P8085
$$ y = [1065203, 988113, 1211744, 1196433, 1301589, 1455725, 1364039, 1458639, 1350578, 1061828, 864056, 1242089, 1321739, 1573974, 1874379, 1754692, 1717637, 1543768, 1249674, 1257818, 1206722, 786856, 667337, 472397, 674266, 650297, 593497, 751873, 657328, 516470, 540912, 789159, 800738, 763428, 818066, 703045, 286512, 164298, 130898, 43264, 55635, 69535, 271625, 396023, 377091, 107620, -54545, -62262, 293169, 319575, 487215, 324435, 521358, 592193, 695731, 816162, 431031, 18179, -34625, 63936, 32002, 59697, 491009, 443188, 680412, 496558, 574217, 660371, 637511, 314121, 8746, -180763, -281687, -119103, 135702, 433228, 270087, 114517, 256215, 349226, 444148, 522233]
19184E22233J70419r0186j12139Q7983k38282l73112J65615R6223Q0323r3546
19174B15531k72411K11321J70657L4405J90811K71900k73454k30509j47682J76722
19164C47291N8736r2001j40732r0999J11536K78332J12915n3358j69214j71003
19154A91503k14764J01573M48660K56239K4673o2647j73836r8768O6042p204k3127
19143E08344O6223L38879k8631l25461l68173Q0744K45245L679n9402L74731K1712
19132H57890K9949J0261N7579L0007k53767P878L9223j90316q7099o4503o370
19121D30732j0260j21350o5483K24845j71473K14838L46077j28646q8246K25734
19111H56768L01146L16404K63209M60160L58628J24297j62604l23754l19726J03789
$$ y = [522233, 692652, 602466, 490327, 578310, 340028, -33084, 132531, 228754, 309077, 215531, -56880, 154441, 325098, 359503, 550314, 822214, 548760, 318251, 170569, 347291, 406027, 314026, 173294, 82295, 193831, 472163, 585078, 531720, 362506, 191503, -23261, 78312, 526972, 783211, 807884, 745237, 571401, 472633, 538675, 531471, 508344, 574567, 913446, 884815, 559354, 191181, 271925, 517170, 520849, 461447, 836178, 857890, 887839, 898100, 955679, 985686, 731919, 739797, 779020, 588704, 501605, 437102, 430732, 420472, 299122, 233639, 458484, 287011, 501849, 847926, 719280, 631034, 856768, 1157914, 1474318, 1737527, 2197687, 2556315, 2680612, 2518008, 2194254, 1874528, 1978317]
19101A978317J60993m9776N8604j36114j63985r8914j93427N3958k98122m51947
19091H59587j54577P0219J47005J03640J63436J9260j40166J16107J31651r3711
19081A222451k88461j23038L50647J72294N3524k61798j65932K81651M02362j73583
19071A470117J56024M9722o1870j64267j3923P3260L09745L36900J41203L47657
19061B644568N04254N5773K98714J054041Q66146K12951k1794J58642j79011j34981
19051E459303j69191l03618m00210m24735n34844m86485l62316n13804j73600
19042B090500l2127j57977l07263q6818J16144j7429j16794n147l7399k77170
19032A168520j69294n7477K07001R7002n1404M0263r9522N5694K97491J66916
$$ y = [1978317, 2139310, 2089534, 2148138, 2012024, 1848039, 1749125, 1555698, 1609656, 1311534, 859587, 705010, 775229, 922234, 1025874, 1189310, 1208570, 1068404, 1184511, 1316162, 1222451, 933990, 810952, 1161599, 1333893, 1387417, 1125619, 959687, 1241338, 1643700, 1470117, 1626141, 1675863, 1613993, 1449726, 1435803, 1509063, 1818808, 2155708, 2296911, 2644568, 3148822, 3204595, 3503309, 4557350, 5423496, 5636447, 5614653, 5773295, 5594284, 5459303, 5290112, 4986494, 4586284, 4161549, 3626705, 3140220, 2777904, 2264100, 2090500, 2058373, 1900396, 1593133, 1506315, 1622459, 1605030, 1488236, 1483089, 1445690, 1168520, 999226, 941749, 1148750, 1245752, 1194348, 1234611, 1135089, 1190783, 1488274, 1655190]
19022A655190K21921r3969j93566J53687L69222M2174p559J46719J96064L08693
19012B798576M16293O4737K15283M13074P2856K27851n2252j66397o4603O0735
19002C986153j01452j87790l56679m22901k96487J03277j71788k03554q6325l32041
18992A930413m75537K0096k8040k84859j60926J34372J84466K54083J43148R2065
18982A809281O6827o2920k7578P850k5292M2350j3750j89450l27772J37758J48644
18971A565948K68807J719K24242J93403r9155J19950K22262P4711k1932J68202
18961B718157Q7346J72516J65733k10880j51575J7614L81251J0416n6711J58904
18951C292771J64814K60712L11457N72629P13940N09264N36977M84454Q86651
$$ y = [1655190, 1877111, 1783142, 1589576, 1743263, 2112485, 2154659, 2147100, 2293819, 2489883, 2798576, 3214869, 3279606, 3494889, 3907963, 3980819, 4208670, 4156418, 3990021, 3925418, 3986153, 3884701, 3696911, 3340232, 2917331, 2620844, 2724121, 2552333, 2348779, 2262454, 1930413, 1454876, 1474972, 1446932, 1162073, 1001147, 1135519, 1319985, 1574068, 1717216, 1809281, 1876108, 1813188, 1785610, 1793460, 1768168, 1810518, 1796768, 1607318, 1279546, 1417304, 1565948, 1834755, 1836474, 2060716, 2254119, 2154964, 2274914, 2497176, 2571887, 2549955, 2718157, 2805503, 2978019, 3143752, 2932872, 2781297, 2798911, 3180162, 3190578, 3133867, 3292771, 3457585, 3718297, 4029754, 4602383, 5316323, 5825587, 6362564, 6847018, 7733669]
18942G733669J457303K016682K263876L257375M415381M465367N056219N750356
18934C6416228N125487L333440J627169O47199j160700l168787m465771m614759
18926C3739506n093694m566653m008273l297636k181435j728430j356742j009997
18918A0496646q82981o87648l68441j52209K30476K58490O759j09135r4286J95528
18908H893199L32517M34455K20874M70172M58966L67803K67290Q29364Q80447
18899A3155087J374618K144811K963847M341220O123279P694977Q921583J0468890
18891E7188312J2757884J3705224J3679289J3244247J1712206J0127496J0144362
18884A42559020Q862058M003344l38958j422829m904282j0612405j4658998j5450690
$$ y = [7733669, 9190972, 11207654, 13471530, 16728905, 21144286, 25609653, 30665872, 36416228, 41541715, 44875155, 46502324, 47149523, 45988823, 42820036, 38354265, 33739506, 28645812, 24079159, 20070886, 16773250, 14591815, 12863385, 11506643, 10496646, 9613665, 8926017, 8557576, 8405367, 8635843, 8894333, 8901092, 8791957, 8697671, 8893199, 9225716, 9660171, 9881045, 10351217, 10810183, 11177986, 11445276, 12274640, 13155087, 14529705, 16674516, 19638363, 23979583, 30102862, 37797839, 46719422, 57188312, 69946196, 83651420, 97330709, 110574956, 122287162, 132414658, 142559020, 151421078, 155424422, 155085464, 153662635, 148758353, 138145948, 123486950, 108036260]
18876A08036260j6323394j5680352j3395312j1060311q947123o691259m201758
18869C1736751k912043k007387j470460j092929r71748o59577k11115j19622j84597
18860B2107273K64115J40578J30110J63525Q98157J224648J266037J742191K066631
18851C0003265K945574L831199N302663P318039J0552419J5328745K2113502K9383902
18843A26779308L5462314M1916875M6442649M4017852L4048816K2153838R092797
18836C59914449q305185k1102630k3433048k4232931j8220297p000285R30500
18829B58550573L611791K079264n64815o201992j0999657r711317m396762N925274
18821B38292359K1660526L7478671M6160448M2526527K5894120J04720k5453939
$$ y = [108036260, 91712866, 76032514, 62637202, 51576891, 42629768, 35938509, 31736751, 28824708, 26817321, 25346861, 24253932, 23282184, 22622607, 22411492, 22291870, 22107273, 22371388, 22511966, 22642076, 22805601, 23703758, 24928406, 26194443, 27936634, 30003265, 32948839, 36780038, 42082701, 49400740, 59953159, 75281904, 97395406, 126779308, 162241622, 204158497, 250601146, 294618998, 328667814, 350821652, 359914449, 351609264, 330506634, 307073586, 282840655, 264620358, 257620073, 258550573, 262162364, 264241628, 263676813, 257474821, 246475164, 236763847, 232367085, 238292359, 259952885, 297431556, 343592004, 386118531, 412012651, 412117371, 386663432]
18814C86663432m8240007n6864609n7347583n0259800l8340353k8313055j9946859
18807H7351166j3886068r914185p435504n630809m191906l399614k991709k358907
18799C7542464j734706j320750j585636j440724p06930o70546l72594k02990K35166
18790B9742754P09660J347555J782667K737398M427402O513499Q611498J1388131
18782F7260564J3343257J5379228J4694329J1301574P737932M754283j26122m084149
18774A30260896l839011j622690L292902J2908044K7018897M1891550N2580134
18767B62490722N1024969L4316260N393551k4190870m4779471n0685465m4246184
18760A89323512k9943960j3244317M971746K2690502L3950826K8954235O638560
$$ y = [386663432, 338423425, 281558816, 224211233, 173951433, 135611080, 107298025, 87351166, 73465098, 63550913, 56115409, 50484600, 46292694, 42893080, 39901371, 37542464, 35807758, 34487008, 32901372, 31460648, 30753718, 30083172, 29710578, 29507588, 29742754, 30452414, 31799969, 33582636, 36320034, 40747436, 47260935, 55872433, 67260564, 80603821, 95983049, 110677378, 121978952, 129716884, 134471167, 134345045, 130260896, 126421885, 124799195, 128092097, 141000141, 168019038, 209910588, 262490722, 313515691, 347831951, 353225502, 329034632, 284255161, 233569696, 189323512, 159379552, 146135235, 151106981, 173797483, 207748309, 236702544, 243341104]
18753B43341104j9806803l6647877m2210714l6482439k5871406j6614084j0471390
18746E5236391o916851n113549l794381k994071k816460k283266j408851j095435
18738B8813527j427535j230604n81789m00151j17014N61694J525406K467869L239299
18729C2850702N188528Q417589J1984641J5613472J8153335J8040779J5022662
18722A25271708P920503M15684p958313j2450968j2988089j0474632m503744L346550
18714H8578699J1667715J6844838J6467628Q685442l941285j5450175k2280913
18707A00571949k2978111j8935833j3490852r129093n792553l823622l391676
18700B3030209k372423j722198j300605j438639j079175q98281p98829q31157
$$ y = [243341104, 223534301, 186886424, 144675710, 108193271, 82321865, 65707781, 55236391, 48319540, 43205991, 39411610, 36417539, 33601079, 31317813, 29908962, 28813527, 27385992, 26155388, 25573599, 25173448, 25056434, 25618128, 27143534, 29611403, 32850702, 38039230, 46456819, 58441460, 74054932, 92208267, 110249046, 125271708, 133192211, 133607895, 125649582, 113198614, 100210525, 89735893, 85232149, 88578699, 100246414, 117091252, 133558880, 142244322, 138303037, 122852862, 100571949, 77593838, 58658005, 45167153, 36038060, 30245507, 26421885, 23030209, 20657786, 18935588, 17634983, 16196344, 15117169, 14218888, 13420059, 12588902]
18692A2588902p86137n60770o72510o69585m77965n01500o07972l40806j46839
18683G824818k52969j73727j95344p6525k40518j46446L67291P37100P46484M82816
18673I072980K14245k01539j01748l62621K27046K26494m84974j062663o90354
18664F836866m41773m30451m23799m22948j61361l40091j86411j4754P1706j60329
18654D326655j07257j11378K59858j86360m0524o5698l44557N5284K65474L77099
18644D428596k49466o07688l84483j85788K7598m65450M6185Q1912j97685k07958
18634B285773j8152j88097k92436k4149J40028p8367Q3703O2822k99803K7666
18624A698988J3762k13944k32176K6679J266J60493J64811j43734k82768o9045
$$ y = [12588902, 11802765, 11241995, 10569485, 9899900, 9421935, 8920435, 8312463, 7971657, 7824818, 7571849, 7398122, 7202778, 7126253, 6885735, 6739289, 7106580, 7843680, 8590164, 9072980, 9287225, 9085686, 8983938, 8621317, 8848363, 9074857, 8589883, 7527220, 6836866, 6395093, 5964642, 5540843, 5117895, 4956534, 4616443, 4430032, 4415278, 4486984, 4326655, 4219398, 4108020, 4367878, 4181518, 4140994, 4075296, 3730739, 3786023, 4051497, 4428596, 4179130, 3571442, 3186959, 3001171, 3028769, 2563319, 2609504, 2691416, 2493731, 2285773, 2267621, 2079524, 1787088, 1762939, 1902967, 1824600, 1908303, 1971125, 1671322, 1698988, 1712750, 1498806, 1266630, 1293309, 1294575, 1455068, 1619879, 1476145, 1193377, 1124332]
18614A124332J35864o3380M09701J04453l33350l24905j27080q8375J51843l800
18604I85303Q8229J31462o2920K34829j1470q439J29724L3180L22439L43929M11281
18593B597547N94329P48988N68461N79777M11852M93894M88286J99576k47961
18584F434749l69238l23010m07832n00729n31619l97641m87443p20715n15236
18575B181286m12173q5406N1712j06245l80204k94152J969j28220j19383j94563
18565E14621n5641j69141K47401P9367l17415l12160k8285M66246K04247J09641
18555G38881m2459j0009J23663J32972j4032j24496r1103n5244O5003K12111L09262
18544A244549N25899M45691K51158N54151N75649L28969K75138J56276O35871
$$ y = [1124332, 1260196, 1196816, 1606517, 1710970, 1377620, 1052715, 925635, 837260, 989103, 985303, 1073532, 1204994, 1142074, 1376903, 1365433, 1356994, 1486718, 1519898, 1842337, 2186266, 2597547, 3191876, 3940864, 4509325, 5089102, 5500954, 5994848, 6483134, 6682710, 6434749, 6065511, 5742501, 5334669, 4833940, 4302321, 3904680, 3417237, 2696522, 2181286, 1769113, 1683707, 1735419, 1629174, 1248970, 954818, 956787, 828567, 709184, 514621, 458980, 289839, 537240, 616607, 299192, -12968, -41253, 424993, 629240, 738881, 696422, 686413, 810076, 943048, 929016, 804520, 713417, 658173, 723176, 935287, 1244549, 1770448, 2216139, 2467297, 3021448, 3597097, 3926066, 4201204, 4357480, 4993351]
18535D993351K52654j35941k10986n17166o60357n50302l19045m60586o04241
18526A787381m20647j38249j16359m23961l54074j13876J88516Q4858j57709k88588
18516D7292j95467K01385n7556Q4177m1067N9719J12516Q6348j97903l0860J01339
18505A69923L7222k12828k48881K00617Q207J02568K29305j548j15186k07011
18495c7612j55108j02181L23254J42053n369K19251K40571o0697k24655K7784
18485C67291R90q4796J19925o6945l36442r5223j94981l31994l4872L99683J136
18474b56228J63997l1193J36574J0545O9149m3989k4563K50978Q532j50987J12082
18463B44897l7776q5472m1903J5882j83674K4444k18954k9676J02310o0237j52569
$$ y = [4993351, 5246005, 5110064, 4899078, 4381912, 3721555, 3171253, 2852208, 2391622, 1787381, 1366734, 1228485, 1112126, 688165, 334091, 220215, 408731, 493589, 335880, 47292, -148175, 53210, -4346, 79831, 38764, 98483, 210999, 297347, 99444, 68584, 169923, 207145, -5683, -254564, -53947, -45740, 56828, 286133, 284585, 169399, -37612, -192720, -294901, 28353, 170406, 165037, 384288, 624859, 564162, 339507, 367291, 368281, 283485, 403410, 336465, 23, -95200, -290181, -622175, -657047, -257364, -256228, -92231, -123424, 13150, 23695, 92844, 48855, 24292, 275270, 283802, 132815, 244897, 207121, 121649, 79746, 95628, -88046, -63602, -282556, -312232, -209922, -270159, -422728]
18452d22728K70006J28966n3759J48598L9667M8598K988R7544M8422n36624n9024
18441b87346J50877m15238J01410M95607j5301l5246k71264m6813J21376K68342
18431F6404R6910j24959L5684J77863J04326j28340r5124L70729K50059k57933
18421D95619K8722j04023Q4940j93664l89028r0194J33932j01612m13175j3207
18411e61690J26560N15631J07617l893m9952K03448K52691k68574J2841K85813
18401F20492j40799j45812j14424j23335J05393P959q4323j90388R6158J25709
18391A56630M29372J82122j64488n6347J01073J54598K7317R6079O5439J91823
18381A183618K5882k99481m32190m02972l98796N7657K76748J46466K55978o2033
$$ y = [-422728, -152722, -23756, -77515, 71083, 110750, 159348, 162336, 259880, 308302, -228322, -287346, -136469, -551707, -450297, 45310, 30009, -5237, -276501, -323314, -201938, 66404, 163314, 38355, 74039, 251902, 356228, 227888, 132764, 503493, 753552, 495619, 524341, 420318, 505258, 311594, -77434, -167628, -33696, -135308, -548483, -561690, -435130, 80501, 188118, 184225, 134273, 337721, 590412, 321838, 334679, 620492, 479693, 333881, 219457, 96122, 201515, 209474, 125151, -65237, 30921, 156630, 586002, 768124, 603636, 547289, 648362, 802960, 830277, 926356, 991795, 1183618, 1209500, 910019, 477829, 74857, -323939, -266282, 10466, 156932, 412910, 350877]
18371C50877K89030Q998P5408l2064k48047r7497j56091K40492j23810l46799
18361c9503K5306j557J23039L15108K0038k93901K76188J57484j10246M0341J95351
18350G07648N9454N6070m25079k8497R8619r8191k26226R2136K49158K31846K00249
18339I17187M27672L03512R1376M5674l55745j27208Q9357k03331l75538j76450
18329F36506N0216m599j88601j37408o0037k26412j73345J61448j06080L4601
18319a3711Q0008j08141k08399K28245L38168l8409j49595l94220j8243J53007
18309a31290k0816K01493J40111J36822j19493j21472k0288K92324K74907k00396
18299D31902k86541o1850p9390l2320K35272K89616J44690k03204l53964k93932
$$ y = [350877, 639907, 648905, 724313, 692249, 444202, 346705, 190614, 431106, 307296, -39503, -14197, -15754, 107285, 422393, 442431, 148530, 424718, 582202, 471956, 512297, 707648, 767102, 823172, 398093, 369596, 468215, 370024, 143798, 235934, 485092, 716938, 917187, 1344859, 1648371, 1739747, 1785421, 1429676, 1302468, 1391825, 1188494, 812956, 636506, 686722, 682123, 493522, 356114, 296077, 69665, -103680, 57768, -48312, -13711, 66297, -41844, -250243, -21998, 316170, 277761, 128166, -266054, -284297, -131290, -152106, 49387, 189498, 326320, 206827, 85355, 65067, 357391, 632298, 431902, 145361, 83511, 4121, -28199, 207073, 496689, 641379, 438175, 84211, -209721]
18289b09721J51710K53964M44690M91635K59245j07717O0006K28359K75201K14237
18279B061609q0131k62486o8560p1921j21104l02667k89114o1301k6631j97703
18269E79991q1120Q0008p2724J9117k61629q8099L07695K7293l55854l21960M5519
18258a21763J85845J00377J0200Q2771k29861l75696L83M00263K41230K63602
18248E57351j67530j29237N784k04566j40377J90162K09453K66497J3647q7092
18238E14092J04744M29013J68595J92714J66584L15464J64208J76348O7023l40254
18228A958531J53145K36940O8917M9083k37490k11625J51430M9811l89640j02565
18218A726537j55963j99296k15596m17517r1878j2768j02616L1170O029R8651
$$ y = [-209721, -58011, 195953, 640643, 1132278, 1391523, 1283806, 1343812, 1572171, 1847372, 2061609, 1981478, 1718992, 1650432, 1578511, 1457407, 1154740, 865626, 804325, 777694, 579991, 498871, 578879, 506155, 525272, 263643, 175544, 483239, 510532, 154678, -167282, -121763, 64082, 164459, 174659, 257430, 27569, -348127, -347744, 52519, 293749, 557351, 389821, 260584, 266368, 61802, -78575, 111587, 321040, 587537, 601184, 514092, 618836, 1047849, 1216444, 1409158, 1575742, 1891206, 2055414, 2231762, 2298785, 1958531, 2111676, 2348616, 2417533, 2466616, 2229126, 2017501, 2168931, 2218742, 1829102, 1726537, 1570574, 1371278, 1155682, 738165, 646287, 633519, 530903, 562073, 568102, 666753]
18208F66753n6029j10041J62658N7250J46436J29856p5017o6195o6044O9827q2848
18197G76606l92646j9794J56100j1133M3621j36857J63922L01668j02561M3319
18187H22245L08778L44680O2315j06400j67228J54575J67527P1430P0728J43512
18177A872162J25766j43088k50800L2214j68236j24227j47715j50256Q6877R320
18167A142017K2723R8219J32715j81484p9326J862p2956n995R1008r9399j8920
18156A030464O36272P3319p1526K88410M28324l8257k27917j40319k60637K91359
18146B009492k7685K0042M37341l8647O490k5970r0731N5503L67874M50978n699
18135C158988r2548M62633N86787M15379N76341O50593M30633M46211P23784R39394
$$ y = [666753, 610724, 500683, 663341, 720591, 867027, 996883, 921866, 855671, 789627, 859454, 776606, 383960, 364166, 520266, 509133, 552754, 415897, 579819, 881487, 778926, 822245, 1131023, 1475703, 1538018, 1431618, 1264390, 1418965, 1586492, 1657922, 1728650, 1872162, 1997928, 1854840, 1604040, 1636254, 1468018, 1343791, 1196076, 1045820, 1132697, 1142017, 1164740, 1262959, 1395674, 1214190, 1134864, 1136726, 1063770, 1057775, 1148783, 1049384, 1030464, 1666736, 1740055, 1668529, 1956939, 2385263, 2347006, 2119089, 1978770, 1718133, 2009492, 1981807, 2001849, 2439190, 2400543, 2407033, 2381063, 2290332, 2345835, 2713709, 3164687, 3158988, 3066440, 3529073, 4115860, 4531239, 5107580, 5758173, 6188806, 6635017, 7358801, 8298195]
18125H298195J137416J368254J417032J727373K164971K854064M188608O085617
18117B9241530P844514J2079834J9082524L1256273N4151315Q7544817R7677700
18110C38878507O1614058j7133899o6762580q2108117q1615857n2795038k9422930
18103G0654144j7489649j1006621p530635n285997m108148l395708k621532k302363
18095A6913491j409700j476796j667034j219808l22723n82771o21833r19690o19549
18086H073587m69662l59365k07006l32522m09358k94560l97308m56176n03912
18077D643718n73126k96115j18762o8421j22431P5156k41296k28488j93082j58687
18067B718466M6194l30693L6315N9451P6507J17964j58197k81363k95248p8742
$$ y = [8298195, 9435611, 10803865, 12220897, 13948270, 16113241, 18967305, 23155913, 29241530, 37086044, 49165878, 68248402, 99504675, 153655990, 241200807, 338878507, 400492565, 383358666, 316596086, 234487969, 152872112, 100077074, 70654144, 53164495, 42157874, 34627239, 29341242, 25233094, 21837386, 19215854, 16913491, 15503791, 14026995, 12359961, 11140153, 10817430, 10234659, 9612826, 8693136, 8073587, 7603925, 7244560, 7037554, 6705032, 6295674, 6001114, 5603806, 5147630, 4643718, 4070592, 3774477, 3655715, 3587294, 3464863, 3540019, 3298723, 3070235, 2877153, 2718466, 2764660, 2433967, 2470282, 2529733, 2606240, 2724204, 2566007, 2284644, 1989396, 1910654]
18057A910654o8530q9704M041J81127k42018j5562K02030j26265j81962K57077
18047A830888L01888j29829r5091j92163l61924m38355l64633J84592L74756J46093
18037A256222l57552o6008L50518K86330k40321k37965p5501j71184L410K62342
18027A010291N9720j66384k94659J27514J97076l3246j06365l3659L2085j97756
18017E94617n2960L9042J84335M6904j51517j62890N16l55964j33798J28570J57416
18006B94271K72016j1369k49210j11866J11955L37187l28Q6888l1271j15774j5406
17995E67093k91785j2737M4959P9819l0315j22581k3721Q0988m878j29105j08224
17984D9513K45293K11735n2589p8434j1439J15801L0371k82694k65691k3701J6422
$$ y = [1910654, 1842124, 1752420, 1756461, 1937588, 1695570, 1680008, 1882038, 1755773, 1573811, 1830888, 2132776, 2002947, 1907856, 1715693, 1353769, 915414, 550781, 735373, 1110129, 1256222, 898670, 832662, 1183180, 1469510, 1229189, 991224, 915723, 744539, 747949, 1010291, 1070011, 903627, 608968, 736482, 933558, 900312, 793947, 760288, 792373, 594617, 541657, 580699, 765034, 811938, 660421, 497531, 498047, 142083, 8285, 136855, 294271, 566287, 554918, 305708, 193842, 305797, 642984, 642656, 729544, 698273, 582499, 567093, 275308, 262571, 307530, 387349, 357034, 234453, 210732, 291720, 286842, 157737, 49513, 294806, 506541, 453952, 375518, 364079, 479880, 510251, 227557, -38134, -61835, -45413]
17973d5413K64331M06627j74613k82945L6763J24719J70334j12760j92381k67804
17963g3142j66043j97208j6970K55555J66900K74678j79861J99014M7644o33764
17953c23197K8827K5594l1732K79733J23594J19562K43353j1866k59577P745r7003
17942A05033j04353J04936j59237k08493l003L64618K55286j15490j94317J21772
17932A66752K00361J84008j16523j73361j58642k76412l4218n2081j27279K612
17922c84783P9899M8478n2228K54789J14914O7194J05385M0459l2180N628M9085
17911B96640k72890k59188j1937k39842o4677j42707J8322M14973L42546j80453
17901i9213l59846K9993P5216J87030K51831j46045K44581k3099o2019o7340l1776
$$ y = [-45413, 218918, 625545, 450932, 167987, 204750, 329469, 499803, 387043, 194662, -73142, -239185, -436393, -453363, -197808, -30908, 243770, 63909, 262923, 310567, -323197, -294370, -268776, -300508, -20775, 102819, 222381, 465734, 453868, 194291, 202036, 105033, 680, 105616, -53621, -262114, -265117, 99501, 354787, 239297, 44980, 166752, 367113, 551121, 434598, 261237, 102595, -173817, -208035, -260116, -387395, -384783, -304884, -256406, -308634, -53845, 61069, 128263, 233648, 274107, 241927, 247555, 296640, 23750, -235438, -247375, -487217, -551894, -694601, -676279, -261306, 81240, -99213, -459059, -429066, -353850, -166820, 85011, -61034, 183547, 160448, 98429, 31089, -687]
17890f87l1128o0338r3500m5232K34442J47087K24388K4372n3811Q8876o1565
17879C72904k51775r5157m3270k4965j39981n8065Q6791R263j40492j26865K17184
17868a94428j75936M1090M05308r2770q5160J64093K42814l08k83816n344P6527
17857I2070Q1386j8088J07573K252k13615j5853J37869J53518l97920l95183K2339
17846d43652N2524M71465K22265j05218k21721P2177J22625J56901j82687m00384
17836b55705j5662J64915j54937O5339m6425J28096J06859j60874J03164P1304
17826F074J99238K7397j28097j25956j45867m23352J33788J97052J95963n4073
17816a17833J55995k9444m17J05253L1884j09083r9604k59366J89077J83985l5369
$$ y = [-687, -31815, -92153, -185653, -230885, 3557, 150644, 375032, 399404, 345593, 434469, 372904, 121129, 25972, -17298, -42263, -182244, -240309, -153518, -144255, -284747, -411612, -194428, -370364, -329274, 76034, -16736, -101896, 62197, 305011, 304703, 20887, 15543, 92070, 173456, 155368, 262941, 265193, 51578, 35725, 173594, 327112, -70808, -465991, -443652, -391128, 80337, 302602, 197384, -24337, 47840, 170465, 327366, 144679, -255705, -271367, -106452, -261389, -196050, -242475, -114379, -7520, -168394, -65230, 6074, 205312, 232709, 104612, -21344, -167211, -590563, -456775, -259723, -63760, -117833, 38162, 8718, 8301, 113554, 145438, 36355, -63249, -322615, -133538, 50447, 15078]
17805A5078j10285O378L6325J76694r8446o0076j51110k27589M8706L31191P2431
17794C9297j12779J01290M8703j82259j13366j14206Q7027K95517J96878j44438
17784A01664j91592Q68P207J97613k7084j13062J32295M4111O0243j16645K67336
17773C62954R6864l40782k67787k20731J0281L84530m3193m9883K39703J07967
17763B79923j12937O6105j55133k99563J77973K39196N9243n2025R0997M3019
17753C36798N2750J13110j50549l09441Q3349j16150l49402j94284K09627P9384
17743b44808J9045K13552J97950l5878J10149k8047j52131k3911j93632N0040
17733h7671o9936j30553P8600l679p3048k4463m4295J19603J92321Q2066l427
$$ y = [15078, -95207, -88829, -52504, 124190, 25744, -34332, -185442, -413031, -364325, -33134, 39297, -73482, 27808, 76511, -105748, -219114, -333320, -246293, 49224, 246102, 101664, -89928, -89060, -81853, 115760, 88676, -24386, 107909, 152020, 212263, 95618, 362954, 459818, 119036, -148751, -369482, -359201, 25329, -17864, -67747, 171956, 279923, 166986, 233091, 77958, -221605, -43632, 195564, 254807, 202782, 293779, 336798, 389548, 502658, 352109, 42668, 126017, 9867, -339535, -533819, -324192, -244808, -225763, -12211, 185739, 149861, 260010, 231963, 79832, 55921, -137711, -87671, -157607, -288160, -209560, -213239, -286287, -310750, -355045, -235442, -43121, 38945, 35518]
17722C5518j74881j77309j00946Q1664j13301j81307n7467M6713r0559J79077
17712e52798L67517J84686J37957J03591L23216L04175l04372o66526q0469k1027
17702b04050L29415K2981k2512K9903R692j09653k52741m7105J28308J8094J350
17691i6318k1296n9064J17897l1481j11630M1134J15056J6248O4743L32140q8092
17680B79337j67266p6916q9091j14746J38935k23428k8467J23722K69941j21963
17670i942O3086K23637K99867J98424l19111n3373m8739k03327j17380j23940
17660i0798K9737j25719l1496N7272Q1996P7893l1188j28070r8479K96078J3139
17649E0365k0731q8128o53M0347j18089J87400J50572l0125k00244n1770j11046
$$ y = [35518, -139363, -316672, -417618, -335954, -449255, -630562, -688029, -641316, -731875, -552798, -185281, -595, 137362, 240953, 564169, 868344, 563972, -102554, -183023, -204050, 125365, 148346, 125834, 155737, 165429, 55776, -196965, -244070, -115762, -97668, -96318, -117614, -176678, -58781, -90262, -201892, -160758, -45702, -29454, 35289, 367429, 279337, 112071, 35155, -53936, -168682, -29747, -253175, -281642, -157920, 112021, -9942, 53144, 276781, 576648, 775072, 455961, 402588, 353849, 150522, 33142, -90798, -61061, -186780, -218276, -161004, -79008, -1115, -32303, -160373, -258852, 37226, 50365, 29634, -58494, -59147, -18800, -136889, 50511, 201083, 170958, -29286, -81056, -192102]
17638a92102r6341j69625j76539L76271L87649n0555O2318l2438j12395m3293
17628d7050r1236J17213Q2624J43624O7560j58995Q1083j81109P7281q2492M7633
17617E6136j6251J57748K78970Q5641j88924k06147L9120j01391J70807K50346
17607E26055n1105o0437Q0354P6083k28687K6877o3479k31535K8829L7891n838
17596A35008O127Q5804n53859r9773N54066n3859J10273J09639P2892j33801k10742
17585B1775m9011J86253K92307p1985l79296L7256J19998K30585P0441r1721j66224
17574B00378j46815P2099k12878l17236j6839L27274K40302J64556J52584m3231
17564D20194j08978l40252j74575j17640M1788j27137j57396L25978K08639J06535
$$ y = [-192102, -288443, -458068, -634607, -258336, 129313, 78758, 141076, 108638, -3757, -47050, -138286, -21073, 61551, 205175, 272735, 113740, 194823, 13714, 90995, 8503, 56136, 39885, 197633, 476603, 562244, 373320, 167173, 206293, 104902, 275709, 526055, 474950, 414513, 494867, 570950, 342263, 369140, 305661, 74126, 102955, 140846, 135008, 141135, 226939, -326920, -426693, 127373, 73514, 183787, 293426, 366318, 232517, 21775, -27236, 159017, 451324, 379339, 43, 37299, 157297, 387882, 458323, 366602, 200378, 53563, 125662, -87216, -404452, -421291, -94017, 146285, 310841, 463425, 420194, 311216, -29036, -203611, -321251, -279463, -406600, -563996, -238018, -29379, 77156]
17554G7156n639k51962k33687j71612R0280K57052J17048J52826p6701k95286
17544c40525N5599N3500J49703m3234O9351P4704n2698o3272j6046m5407L9928
17533a18397K59455k41821k1365k4198J17411J25015j06192J67530K93877J59488
17523F10803k85518k90819J11263k0905k66742k14816j63215K22135K47257n2893
17513a03450j52307M00068K67795l59147k94474j94562o3545J38341n7548J83170
17503b35659j14922J28128R3476k25122Q966J29130M48046K97909Q4295l94646
17493B19601k87192q7148J50553M4200P0038K73512L7588o5650j68958j22953
17483F3591O0154m9410N6812J80418j36951l15196L0750M38713K8045j20806j75911
$$ y = [77156, 71517, -180445, -414132, -585744, -495464, -238412, -121364, 31462, -45239, -340525, -284926, -231426, -81723, -124957, -55606, 19098, -33600, -96872, -112918, -158325, -118397, 141058, -100763, -122128, -146326, -28915, 96100, -10092, 157438, 451315, 610803, 325285, 34466, 145729, 124824, -141918, -356734, -519949, -297814, -50557, -103450, -255757, 144311, 412106, 52959, -241515, -436077, -499622, -361281, -418829, -235659, -350581, -222453, -128977, -354099, -345133, -216003, 232043, 529952, 614247, 219601, -67591, -154739, -4186, 40014, 110052, 383564, 421152, 355502, 186544, 63591, 123745, 74335, 131147, 311565, 174614, -140582, -109832, 328881, 356926, 236120, 60209]
17472F0209n631o0799L5498k25162N0342M20808K0583K2316j28697r5638j9288
17461G4541l8788q4785K32533J06434n9373p0825l89959o6116K01996K28325j94971
17450f0988l07193J15828Q2067N12527M81848M89527N62215J58536l01564k30963
17440A501840o59427n84393j87181l948M5804j38800N8563K37790O1370J48527
17430D80145k60340j23855j9544R5082r3872k44210J69682l41403j86181Q2288
17420d42208J54316k20975r0813J67061K53797K70982R124N8006J36510j32906
17410A62894k65595j6029K51176J02904q5264K26277K5527j09135k2711k56386
17400A3658p7927k2647k1709m4385K48639N3126j6170o9359R5095r9080j5238
$$ y = [60209, 54578, -6221, 29277, -195885, -145543, 275265, 295848, 318164, 189467, 93829, 74541, 35753, -49032, 183501, 289935, 230562, 159737, -230222, -296338, -94342, 133983, -60988, -368181, -252353, -170286, 342241, 824089, 1313616, 1875831, 2034367, 1732803, 1501840, 842413, 258020, 70839, 66891, 112695, -26105, 32458, 270248, 331618, 480145, 219805, 95950, 76406, 171488, 77616, -166594, 3088, -338315, -524496, -442208, -287892, -508867, -599680, -432619, -178822, 92160, 101284, 159290, 295800, 162894, -102701, -118730, 132446, 235350, 150086, 376363, 401890, 292755, 270044, 13658, -64269, -86916, -108625, -153010, 95629, 148755, 132585, 63226, 158321, 59241, 44003]
17389D4003r5189j1761K75702l0708k18623k06291N4073J60373k7322K38629L6518
17378B19404p2998k72423J12865p2965k38650Q9005J84458L4315k31812o2099
17368c10900j12034j27649J29683m134K15293K49724j04822m3286l11911j781
17358d21817L05242L2811j06522k69368L71662K22299q401L92015R6008m66161
17348A47768k63082M9412K30337l06582R3715J5608M4452j57112K7049J92038
17338G3603J03558K16700l6681j06555j4771n8081q9637j96881P5477L72924j485
17327C38171o3879j65189k70543j28946L53061K89558k61724j40769k5967K133
17317g4094L13378J87043r3981l38647m27882j61064L15819J57790o7012K7769
$$ y = [44003, -51186, -62947, 212755, 182047, -36576, -242867, -188794, -28421, -55743, 182886, 219404, 146406, -126017, -13152, -86117, -324767, -235762, -51304, -16989, -248801, -310900, -422934, -550583, -420900, -425034, -209741, 39983, -64839, -108125, -420036, -421817, -116575, -83764, -190286, -459654, -87992, 134307, 125906, 517921, 613929, 147768, -115314, -65902, 164435, -142147, -48432, -32824, 11628, -145484, -118435, 73603, 177161, 393861, 357180, 250625, 235854, 177773, 88136, -108745, -33268, 339656, 338171, 274292, 109103, -161440, -290386, 62675, 352233, 90509, -50260, -76227, -74094, 239284, 426327, 332346, -6301, -434183, -595247, -279428, -121638, -188650, -160881]
17307a60881r9377j27643p9247r2095J49185L45665L7640p6466j21595r027k4885
17296b58726J73535N9616p4972l2217k08529K37667P87282K05845m39454l91781
17286E8266j47773k7347J20342K57169o1060l07312K9762k69699J7800n3143l0453
17275d13448K42875K77488j64143J22668j07914k86309l0671k49207M22892N1062
17265a34707j11968j02204l8943J61627J25238L0484M5559o5525p6358l5815j88065
17254c90677q7334K51387M41011Q7312r8762p4130L682L3959j2352r179k53969
17243a09052k55213L4134K01651Q3119q2199J83577j91420K6194J86370k66677
17233a89516o2175j01842n5372K47512K52700O9055K4529J31821J33261j22052
$$ y = [-160881, -260258, -387901, -467148, -559243, -410058, -64393, -26753, -103219, -224814, -233841, -258726, -85191, -25575, -100547, -132764, -341293, -103626, 683656, 889501, 450047, 58266, -89507, -116854, 3488, 260657, 199597, -107715, -77953, -347652, -329852, -382995, -413448, -170573, 106915, -57228, 65440, -42474, -328783, -359454, -608661, -185769, -134707, -246675, -348879, -387822, -226195, -100957, -70473, -24914, -90439, -166797, -202612, -390677, -478011, -226624, 214387, 301699, 202937, 128807, 132489, 166448, 154096, 144917, -109052, -364265, -330131, -128480, -45361, -127560, 56017, -135403, -109209, 77161, -189516, -251691, -353533, -408905, -161393, 91307, 160362, 184891, 316712, 449973, 327921]
17223C27921N2466J19653j14124q4129m3553P6729O8249k94316k62654r7252l351
17212b54361n4838m1045J47657l0853J30592M9255Q8084M5485k23125l40380L8626
17201d44903k86041J64492L18630J69805L26798K98280l24945k75740k03749R216
17191b48157K36300P0304j22414L44952j56346m00763k67792K08584K79849M5257
17181a0226m8883P2879J75996J67710m80233m96999P8596J8726K38704M02500
17171A18770j45J40871k48749j63425j80665J48118K36323J40842L4770J36709
17161C63419k5545o0899m0489k15619P0314O902k39036P2796K2614j38721J80670
17150c594p9168k05517J66974K22937j56883j2356J21983n1129J22506j42454
$$ y = [327921, 380387, 500040, 385916, 301787, 258234, 334963, 403212, 108896, -153758, -251010, -254361, -309199, -350244, -202587, -233440, -102848, -53593, 34491, 79976, -143149, -483529, -444903, -730944, -566452, -247822, -78017, 248781, 547061, 222116, -53624, -257373, -248157, -11857, 58447, -63967, 280985, 124639, -276124, -543916, -335332, -55483, -10226, -59109, 13770, 189766, 357476, -122757, -619756, -541160, -522434, -283730, 118770, 118625, 259496, 10747, -152678, -333343, -185225, 51098, 191940, 226710, 363419, 337874, 276975, 236486, 20867, 91181, 98083, -140953, -68157, -45543, -184264, -3594, -82762, -288279, -121305, 101632, -55251, -67607, 54376, 3247, 125753, -16701]
17140a6701o2546K38614o4532r0238r3122P3261k3693p1130k04429K08443J97670
17129I1597J33047K7440k89333j44255r9862J11954K9007k37480l3924K52738
17119a59071R543O6579M1932o145k49103R3808K48278j19483o0898M02914K81337
17108E49691k94996j69649K8174J53308j04700J05085O0002l34705k20079J58183
17098f9686O958K5061j70904J2280K19237j02221K8907p5978N8635J71338J32058
17087B35685l31619j26561J54650K57718r4480K29197k47291j73886l41533k06829
17077f44949O4125L55436K89551K5653k08967j70844q9262J48390J66455J62325
17067I7913N484k99446J70450L634m378P1614J79544k61579L1507L12026l34797
$$ y = [-16701, -79247, 159367, 94835, 4597, -88525, -15264, -38957, -110087, -314516, -106073, 91597, 224644, 252084, -37249, -181504, -281366, -169412, -140405, -377885, -411809, -159071, -149528, -82949, -41017, -47162, -296265, -202457, 45821, -73662, -134560, 268354, 549691, 254695, 85046, 113220, 266528, 161828, 266913, 326915, -7790, -227869, -69686, -62728, -37667, -208571, -196291, 22946, -79275, -50368, -126346, -67711, 103627, 235685, -95934, -222495, -67845, 189873, 95393, 324590, 77299, -96587, -438120, -644949, -580824, -225388, 64163, 89816, -119151, -289995, -379257, -230867, -64412, 97913, 103397, -196049, -25599, -21965, -26343, 45271, 224815, -36764, -5257, 306769, -28028]
17056b8028k27421j73925L21827K18157J68424Q5075P4246j56936n01350j14471
17046c34402K82962L20237m6076k06379L878L55885J84348m71110m5720K31551
17036B75174k9127o6676j28584M3403R2479j81671j4089L2920k62850j61019K5815
17025c74225j09961j04553K76319J49416K75172L3061j62709j54666q8094K36035
17015b4205K4600k8769J5654j89519J40743k72091J8102K34022J0617O0291n7338
17004f7893j96598J5499J82258P9454M6841j38447R5255r3616k20461O6916j24066
16993c54858n2695J61669j082J1963j37113J25300R8812J14710r0091M8851J58897
16982H4363p7881J65540M1497j33624p8745J73793J80862K52320k25669j81869
$$ y = [-28028, -255449, -429374, -107547, 110610, 279034, 364109, 438355, 281419, -219931, -334402, -51440, 268797, 222721, 16342, 20220, 376105, 560453, 89343, 43623, 275174, 246047, 179371, 50787, 94190, 186669, 4998, -9091, 23829, -239021, -400040, -374225, -484186, -588739, -312420, -163004, 112168, 145229, -17480, -172146, -260240, -24205, 395, -28374, -12720, -202239, -61496, -333587, -315485, -81463, -70846, -10555, -67893, -264491, -248992, -66734, 12720, 59561, -78886, 16369, -77247, -297708, -230792, -354858, -407553, -245884, -246966, -235003, -372116, -246816, -148004, -33294, -123385, -74534, 84363, 6482, 172022, 213519, 79895, 1150, 174943, 355805, 608125, 382456, 200587]
16972B00587L2811J29040k27124l54911k45367r6970j3989K10342N80837J19709
16962C34965r5831J15623K00991J19012k06663l67419k86418J15335J38494p6578
16952h489K21374J99839j95051N6478l4065j16607l0702r9837o1080j01813J88359
16941A8406J50560l93443m04890K53179J47799M9944J82791O460j1848K28770
16931B27728J99065k48685J77597J83995j554k73189r4168k37175J19317J56923
16921B09854k9527r0118J17712J39046j77682M5680l0543k63224l9184J24900
16911F914l1563l43678p436J21904n4351K25207J65824m0589J15136k63940k02086
16900c08658J38839j0275k67284M9320J66741K8993j90954l9809J60034l8213
$$ y = [200587, 233398, 362438, 135314, -219597, -464964, -561934, -575923, -365581, 215256, 334965, 239134, 354757, 555748, 674760, 468097, 100678, -185740, -70405, 68089, -8489, 212885, 412724, 217673, 274151, 240086, 123479, 92777, -7060, -68140, -169953, 18406, 168966, -224477, -629367, -376188, -228389, -178445, 4346, 10806, -1042, 227728, 426793, 178108, 355705, 539700, 538146, 264957, 170789, -66386, 52931, 209854, 180327, 90209, 207921, 346967, 169285, 214965, 184422, -78802, -117986, 6914, -24649, -368327, -375763, -253859, -308210, -83003, 82821, 42232, 157368, -106572, -308658, -169819, -180094, -447378, -398058, -231317, -202324, -393278, -433087, -273053, -311266]
16890c11266l4149J67385o0797j26140k2450Q3176q083J11974L8864n5427J01930
16879a14983j8790L6371J26980J5936j5722K53599P2146p4684J22525R6980j17217
16868C83141k73948K39024l2499Q7539J80906j62636j6237L6185j42080l54807
16858e5412r1073n6436J88906j788j67448j57619Q1157p2606J88525L37534P428
16847B01168l3243j51636r7037L43638L40750m20037l97292n189K83102K79467
16837C43691K81365m04826Q187q374j79335m1837j87124k3099K55310J1857M7551
16826A03366k09413p1872J75766j04812j86565J23631J71667j67215J62763q1500
16816h4184j40360J24416K96713j33371r2054R9445l40995j27706l8347K61930
$$ y = [-311266, -345415, -178030, -238827, -364967, -387417, -304241, -312324, -200350, -161486, -216913, -114983, -133773, -97402, 29578, 45514, 29792, 283391, 355537, 280853, 403378, 500358, 383141, 109193, 348217, 315718, 403257, 584163, 421527, 405290, 441475, 299395, -55412, -146485, -202921, -14015, -15803, -183251, -340870, -259713, -332319, -143794, 193740, 201168, 167925, 16289, -80748, 262890, 603640, 183603, -213689, -218878, 64224, 343691, 625056, 220230, 228417, 220043, 40708, -1129, -188253, -211352, 43958, 55815, 103366, -106047, -177919, -2153, -106965, -293530, -169899, 1768, -165447, -2684, -84184, -224544, -100128, 196585, 63214, -28840, 70605, -270390, -398096, -436443, -174513]
16806a74513j4066j85697k86141K8979L19277K85968J66880j91744l55696j58589
16796e65342Q8220P6346K93068J62123q5186m2538k08133r5333M5764J90571j66709
16785c07149p0813O183o75m2884j33227K6367L79039K91813K51463R3346L1547
16774E25010k91041j55133J69312Q2120j23146m6256o5535J94277j96525J14195
16764B07278O2183j41247J31168j70427j3866L13280k41843j65908J04507J14787
16754A99912j8438j63971j75679j62761K23352K31503J19487l2747k43224n0930
16744g3496K43949J82276l2538J57639M6657j20181j27817k65125O6880M37822
16734E16066R3544j79195l95230j75982J37116q6927k0480J78418K36864R1929
$$ y = [-174513, -188579, -374276, -660417, -631438, -312161, -26193, 140687, -51057, -406753, -565342, -477122, -400776, -107708, 54415, -30771, -73309, -281442, -376775, -331011, -140440, -307149, -377962, -371779, -372454, -415338, -548565, -522198, -143159, 148654, 400117, 493463, 525010, 233969, 78836, 248148, 330268, 207122, 160866, 95331, 289608, 93083, 207278, 269461, 128214, 259382, 88955, 75089, 388369, 146526, -19382, 85125, 199912, 181474, 17503, -158176, -320937, -97585, 133918, 253405, 220658, -22566, -73496, 170453, 352729, 320191, 477830, 524487, 404306, 276489, 11364, 78244, 516066, 609610, 430415, 35185, -140797, -3681, -90608, -111088, 67330, 304194, 396123]
16724C96123K2390N6231j47425l93704n1187o9778k3091o8626l0607R250J58370
16713a42054M8769j39693L4558R7453J37049K09462l9556l2906J11290M6448k7742
16702C03078Q1443K4305j11166m6385j02590j67664J54924R6142l30431j00054
16692a98398j0820M9244P9747k87637O252L49645J79310J6016J30288k41079k3714
16681D8854P9120k13817j82844l6525Q9115J43510j07071J22097j33014k01422
16671c91997J61866k1223R813R046p2807N1093J3410J05569N9674J14902j11419
16660g2073P9733J33220J55340K22494K0312j57196l2836j87262j03420r7593
16650c9281j67730k54732o9175J5067l8770K68343K87589o9886l26951n2622J78244
$$ y = [396123, 418513, 474744, 327319, -66385, -117572, -187350, -210441, -279067, -309674, -300424, -142054, -93285, -232978, -198420, -100967, 36082, 245544, 205988, 173082, 284372, 330820, 303078, 384521, 408826, 297660, 251275, 148685, -18979, 135945, 232087, -98344, -198398, -209218, -159974, -80227, -367864, -361612, -11967, 167343, 183359, 313647, 72568, 48854, 127974, -85843, -268687, -305212, -216097, -72587, -179658, -57561, -190575, -391997, -230131, -251354, -241541, -232495, -305302, -254209, -240799, -135230, -75556, 39346, -72073, 7660, 140880, 296220, 518714, 539026, 381830, 348994, 161732, 58312, -39281, -207011, -461743, -530918, -515851, -554621, -286278, 1311, -68575, -395526, -448148, -269904]
16639b69904J71657Q9691k2538j27040o2193R3071j84729m0601O9721J29069q5046
16628b38842K14380L58632l4540l44234k15926k06910J92605j407J20599L32255
16618A76612K31801o0737m5541j48943K48490j2498j73626r549j470N9886o9593
16607A94832k37573j2739L1593k45519N235J27764J03358j37859N8876r8015Q0147
16596a29900k25280J98280J89065q916K10357j03127j01296L4416M8090j31633
16586a9944j9535m9867N4946j2984K7267r6237o8894O6126r3427Q5626j4560K20769
16574G9286k693j84262j57244J60449j44334O4715J96722o8654l2901j05789r3867
16563b88572j38131p8652J07941K58633o1335J39640l7133J49192n3222j84670
$$ y = [-269904, -98247, -8556, -31094, -158134, -220327, -127256, -311985, -352586, -282865, -153796, -238842, -24462, 334170, 299630, -44604, -260530, -467440, -274835, -276242, -155643, 176612, 408413, 347676, 302135, 153192, 401682, 389184, 215558, 206009, 204539, 264425, 194832, -42741, -55480, -23887, -269406, -264171, -136407, -33049, -170908, -112032, -210047, -129900, -355180, -156900, 32165, 23249, 233606, 130479, 29183, 63599, 111689, -19944, -39479, -89346, -34400, -47384, -20117, -116354, -185248, -119122, -212549, -126923, -141483, 79286, 76593, -107669, -264913, -104464, -248798, -184083, 12639, -56015, -88916, -194705, -288572, -426703, -505355, -397414, -138781, -200116, -60476, -97609, 51583, -1639, -186309]
16553a86309l6327J7131j38796R5994R7822J06993J2691k0944K22763N5869j32241
16542I4646j10648p5415R8673J45138p0634J86155n6410l04360j28200O2646k04457
16531c62866L93615L09572r6688k12150k22469l39687K15575K88178j103L9464
16521A1441J83721J90332l67769j31800m3511P7201J48112K30605m6938k67220
16511a5826j74006j69041J42381J29389k49069K0131K33577K37520n2689j30631
16501b8264O4943J25341k41627k07215K16597J55805J21183j0524r5470p5059
16491B5710q3481l2679L9368K98526n5262l87135k48099j05047L41218K22840
16481A5959j48800l9149M877M3579j33837k5603L8075P0900j96764J8017K97891
$$ y = [-186309, -222636, -205505, -344301, -248307, -150485, -43492, -30801, -51745, 171018, 226887, 94646, -16002, -91417, 7256, 152394, 81760, 267915, 211505, -92855, -221055, -158409, -362866, 30749, 340321, 243633, 31483, -190986, -530673, -315098, -26920, -28023, 11441, 195162, 385494, 17725, -114075, -157586, -80385, 67727, 298332, 251394, -15826, -189832, -358873, -216492, -87103, -336172, -316041, -82464, 155056, 102367, -28264, 36679, 162020, -79607, -286822, -70225, 85580, 206763, 196239, 100769, 25710, -57771, -90450, -51082, 247444, 192182, -194953, -443052, -548099, -206881, 15959, -132841, -171990, -167113, -123534, -257371, -282974, -244899, -173999, -370763, -352746, -54855]
16470e4855J36150O7875J17752m457k34405j16586K0137L40483K43960k63825
16460B52229j34331m8j68920J71759J64437n046j12909r8244K8143o6741L5736
16449F6065O1971j72409j57841j23264K61752K54565J28208n0594l7741n707j72743
16438E2262r27k65433J47656J55596k8022m1527k33447j62472k00763M43968L12623
16427A79514r8006Q6765j67669j90055q9753J31371J03998N6022k12826k20691
16417d21330K25402K45672K37186J50254J92469j29722l77663k76297J31327J08077
16407H5375J52676j08427K44643k53203j02690O4660j99111R8176P7887n2018
16397G968J57056N0636J8946J00243K56082O2194j36972k12127k34706J37146
$$ y = [-54855, 81295, 149170, 266922, 262465, 28060, -88526, -68389, 272094, 516054, 252229, 117898, 117850, -51070, 120689, 285126, 280080, 167171, 68927, 97070, 30329, 66065, 128036, -44373, -202214, -325478, -63726, 190839, 319047, 268453, 230712, 225005, 52262, 51335, -214098, -66442, 89154, 61132, 19605, -213842, -376314, -577077, -133109, 179514, 81508, 168273, 604, -189451, -279204, -147833, -43835, 12187, -200639, -421330, -195928, 49744, 286930, 437184, 629653, 499931, 122268, -154029, -22702, 85375, 238051, 129624, 374267, 121064, 18374, 83034, -116077, -17901, 59986, 7968, 165024, 215660, 234606, 334849, 590931, 653125, 516153, 304026, 69320, 206466]
16387B06466l5626q2882j94469j60126n1986J54470J33969J38188J96984k75367
16377B9621m59729R0900J10805r9450j09872r6644q1001K124M00247M76579m3401
16366B20179m52137Q7322J0325J25816J24577J41406q3409j52804j91894K7355
16356a43264L20568m7625p769j43341k41664p7097o2623n5680k3825J92766K8186
16345b61368J24849K73673K07386J20405k63004K073J95698J07001j80842k73345
16335E2526O2604j63468j0618K80516O2361l69248l30831K88671J87588P0388
16325A30489l5506j9969j1011j90252L7546j02345K19099Q2330n188l98065l9267
16314c32139J47229j41363j0293m2293L19529L74463L362k15449L565j96341j91331
$$ y = [206466, 170840, 87958, -106511, -266637, -318623, -164153, -30184, 108004, 304988, 29621, -430108, -339208, -228403, -327853, -437725, -534369, -615370, -613246, -212999, 263580, 220179, -231958, -144636, -134311, -8495, 116082, 257488, 174079, 21275, -170619, -143264, 177304, 129679, 121910, -21431, -263095, -340192, -402815, -458495, -482320, -289554, -261368, -136519, 137154, 344540, 464945, 201941, 204014, 399712, 506713, 325871, 52526, 115130, -48338, -58956, 221560, 283921, -85327, -416158, -127487, 60101, 130489, 94983, 75014, 64003, -126249, -88703, -191048, 28051, 110381, 105193, -292872, -332139, -184910, -326273, -336566, -378859, -59330, 315133, 318495, 103046, 106611, -89730, -281061]
16303b81061O4487J54560k29075J69777L44222J97074l02584k45223q2341K03362
16293f802o6004M1967K7122L9913Q8730k26532Q9844L34096J40958m58649k33893
16282b29250J10753J75073O4942o0609p5150M290R3342K22637J08934j77939k14777
16271B2246j92397L9560J17872j22705K04483J87307l6434q1346m1112l4476P6536
16260A39534k09471K8075J65406R4524j072k77624j36148o6882j0832J97072O1208
16249a6210J17734k37950j90655j56134O7339r61j7995j73340L41128J73000O351
16238h7693n9072K24131R8782j29900J48144k3188l42475j71424k7793J9763j06978
16227d57703r8962N1752K45459j50377k97862K22009M68346J17193o4880J10160
$$ y = [-281061, -216574, -62014, -291089, -121312, 222910, 419984, 117400, -127823, -210164, -6802, -72806, -30839, -3717, 36196, 124926, -101606, -11762, 322334, 463292, 4643, -229250, -118497, 56576, 121518, 60909, -14241, -9951, 83391, 306028, 414962, 237023, 22246, -170151, -130591, -12719, -135424, 69059, 256366, 219932, 138586, 97474, 62998, 139534, -69937, -41862, 123544, 218068, 216996, -60628, -196776, -263658, -274490, -77418, -16210, 101524, -136426, -327081, -483215, -415876, -416837, -434832, -608172, -267044, -94044, -87693, -146765, 77366, 176148, 46248, 194392, 171204, -171271, -342695, -370488, -350725, -457703, -556665, -504913, -259454, -409831, -707693, -485684, -17338, 99855, 34975, 145135]
16217A45135o9246N857R954k3426k08021j61489k23413O7532J08072K76801o767
16206g9011j74828M7918Q9192L74590n770k79772j52091K9501J99283J06109j85451
16195c0330k35071K26436J66134l59508K03110J77036Q7962j20646J12392n8962
16185A68553k07323j02095K79984K87339K10281j16139k02440k39266j65177l27558
16175d13841l8837M97153L8999Q1906L80612J2261p1471l02523j12411n2513j55759
16164a36424j7340j9247o8855n4702k13890J08646J02425R5230K27187n5859m4225
16153g7054j03600j91964l8686L38244l7260K8765J79243j38936M8213k3115P4092
16142E7942J04634k56179j00953J94006m0186J12685j72868k26663K36222K79098
$$ y = [145135, 75889, 81746, 91700, 68274, -139747, -301236, -524649, -457117, -349045, -72244, -79011, -253839, -205921, -116729, 257861, 252091, -27681, -179772, -150271, 49012, 155121, -30330, -265401, -38965, 127169, -232339, -29229, 147807, 235769, 115123, 227515, 168553, -38770, -140865, 139119, 426458, 636739, 520600, 318160, 78894, -86283, -413841, -452678, 44475, 83474, 165380, 545992, 558253, 486782, 184259, 71848, 19335, -136424, -153764, -173011, -241866, -296568, -510458, -401812, -299387, -204157, 23030, -32829, -77054, -180654, -372618, -411304, -73060, -110320, -81555, 97688, -41248, 6965, -16150, 57942, 162576, -93603, -194556, -550, -40736, 71949, -100919, -327582, -91360, 187738]
16132A87738m3837p9746l71470K16879L38009j04375n07455q7243p6572J77279
16122c50793L23308L59868j83223k42041j04483P8621j30741L4253J2139J17276
16112h5816j05n0417M0615K25144L79017N406l05626l7580O4649m5438j56494
16101C3355k09920o5774j1212J31835K34772l73899j67881J41375j0893o23J99656
16090i9209j5392K11360j2528R0819J88423l26266l04111k00999J48954j77789
16080d96738Q7304O9362L13811J14206k3531k9363l32729l16191J40867J03650
16070c69352Q2022K37663K16733Q61m39409p3822J47668J51489q2569j75909J74318
16059a30307K89988O558J48835j91641q8604n6131j4049K02419r218l8761P9793
$$ y = [187738, 143901, 64155, -307315, -90436, 247573, 143198, -364257, -451500, -528072, -350793, -27485, 332383, 149160, -92881, -197364, -118743, -249484, -215231, -203092, -85816, -85921, -136338, -95723, 129421, 508438, 513844, 208218, 170638, 235287, 189849, 33355, -176565, -242339, -253551, -121716, 113056, -260843, -428724, -287349, -298242, -298865, -99209, -114601, 96759, 84231, 175050, 363473, 37207, -266904, -467903, -318949, -496738, -409434, -340072, -26261, 87945, 64414, 35051, -297678, -613869, -473002, -369352, -287330, -49667, 167066, 167927, -271482, -345304, -197636, -46147, -128716, -304625, -130307, 159681, 166239, 315074, 123433, 34829, -21302, -35351, 167068, 157850, 119089, 198882]
16048A98882J68278q7462k70834L2582J89197j79179K0042l4651J1830j64132
16038a15447o2186L47793J8770j63155P6108J42445O9045o4288j18386K06762
16028C37461J47575j78539l52062m36040J24676J73170L45766N0529M6388K50705
16018E09629o227k28102j76262j50092j94109j60706L90535Q1105J59438M0002
16008B65211j40717P799L59618J03097O3096o5619m54274j59685p4956n9894L18560
15997A62236L6393j72797L0213r2999j95394L7364K18616M7242m22145P289K6086
15986c17896O9966J21035R217j18259j65245K8902L23260j24646k528L6206n6776
15975a96764J98780j08994l179L41648J35737j80283j55886L885Q711k26620K08072
$$ y = [198882, 367160, 279698, 8864, 41446, 230643, 51464, 71506, 36855, 48685, -115447, -177633, 170160, 188930, 25775, 101883, 244328, 313373, 249085, 130699, 337461, 485036, 306497, -45565, -481605, -356929, -183759, 162007, 212536, 258924, 509629, 503402, 275300, 99038, -51054, -245163, -405869, -15334, 65771, 225209, 265211, 124494, 132293, 491911, 595008, 658104, 592485, 138211, -21474, -96430, -156324, 162236, 198629, 25832, 56045, -36954, -232348, -194984, 23632, 70874, -351271, -343982, -317896, -247930, -126895, -117678, -235937, -401182, -372280, -49020, -173666, -176194, -139988, -196764, 2016, -106978, -110157, 231491, 367228, 186945, 31059, 34944, 43655, -182965, 25107]
15964B5107M39544j07481j9295J71931j2913k39900j34006l5011J46453R6197
15954C30626j64332k17039n6162N6715R3504J9251l4095j00101l9940L23137J24326
15943C35890k77063l4951J85239j71308n577j20182j33158N3765J48800K58139
15933B39594O7010j39781p1762l51747k25125J58154L22691k46666O0145P9967
15923a07520K8343L7628j17838P1326K60259r4250l2530K2067n4734K65062k88105
15912a0292k79270J3369q0034r0054r7977N2573Q6046k8404J77359J53236J68340
15901F4892O4064l91139J08944K39385J92111j42061L6782k4273j05624q4230
15891d1149L4311P2103J59787K13181q715j10298j58669j5055j35342j64579J90770
$$ y = [25107, 464651, 357170, 337875, 509806, 496893, 256993, 122987, 87976, 234429, 330626, 166294, -50745, -106907, -50192, 43312, 62563, 28468, -71633, -111573, 211564, 335890, 58827, 23876, 209115, 37807, 32230, -87952, -221110, -167345, -18545, 239594, 306604, 166823, 95061, -256686, -481811, -323657, -966, -247632, -187487, -107520, -79177, -41549, -159387, -88061, 172198, 77948, 45418, 67485, 12751, 277813, -10292, -289562, -276193, -356227, -446281, -544258, -491685, -405639, -434043, -256684, -103448, 64892, 128956, -262183, -153239, 86146, 278257, 136196, 172978, 148705, 43081, -41149, -6838, 65265, 225052, 438233, 429518, 319220, 160551, 145496, 10154, -154425, 36345]
15880C6345n1869J5180R2112J10967j32842l03387K19015J71960j08759P0139
15870A18861K03934j45491Q118j82555o3296J66135r3863k2424J69809k80325
15860a21097m51995K09434K95941J11292r8825K810j6561M2060R6262L6656j23477
15849a7500O255J44331M8172P3492J8436r3757j81563p2934K25309M0473l04061
15838a13347J0466J94022J56789j97377k17932n5169J9546J75618J58083k8916
15828A01783j51994j20442L80977J98025q7010k38582j55069L469K6570R1466
15818D9193Q5472N2295j26510k30870N2063Q540J10681p1219J44857j08799r2550
15807a26847p0340J67972J56561k28667j60963K9440L08467L9188L1066J12432
$$ y = [36345, -15524, -344, 91768, 202735, 69893, -233494, -14479, 157481, 48722, 118861, 322795, 177304, 185422, 2867, -60429, 105706, 11843, -10581, 159228, -121097, -573092, -363658, -67717, 43575, -55250, -52440, -69001, -26941, 69321, 105977, -17500, -11245, 133086, 181258, 254750, 273186, 179429, -2134, -75068, 150241, 190714, -113347, -102881, 91141, 247930, 50553, -167379, -222548, -203002, -27384, 130699, 101783, -50211, -170653, 210324, 408349, 321339, 82757, -72312, -68843, -42273, 49193, 134665, 186960, 60450, -170420, -118357, -109817, 864, -70355, 74502, -34297, -126847, -197187, -29215, 127346, -101321, -262284, -232844, 75623, 114811, 145877, 258309]
15797B58309j16139k23380j59803K82661J34594k49067n5401R9733j8375j11825
15787a58693o6765n5574J06425l782J69048K80458J82472l37116k24499k42661
15777c50687K8231l5854J15097M43257P6032l06425j18048J713J52198K37209
15767B42723j2892k00448J6453J1259J47735R7844j68983o3387L7823Q5316k44965
15756e1522j91969m34738j8890N866J73042L00893J66752P6945J02607l8285k45181
15745a54480J92506j21042L1241j29714p8742J76890j46400M6719L68071n0289
15735A34760m9097k42739k42443J08554K3033J76678J33378O8963N1612J57386
15725C20085J70440l16654K2276Q4940J05447m9605j08559m36276j02097J1250
$$ y = [258309, 142170, -81210, -241013, 41648, 176242, -72825, -128226, -28493, -46868, -158693, -225458, -281032, -174607, -178389, -9341, 271117, 453589, 116473, -108026, -350687, -322456, -358310, -243213, 200044, 276076, -30349, -148397, -146684, 5514, 242723, 229831, 29383, 45836, 57095, 204830, 302674, 133691, 70304, 108127, 193443, -51522, -243491, -678229, -697119, -691253, -518211, -217318, -50566, 26379, 128986, 90701, -154480, 38026, -83016, -51775, -181489, -260231, -83341, -229741, -183022, 185049, 134760, 85663, -157076, -399519, -290965, -267932, -91254, 42124, 111087, 162699, 320085, 490525, 173871, 196147, 281087, 386534, 336929, 228370, -207906, -310003, -298753]
15715b98753k5950j8060l5348l2375m0423K67254J64012j87177j07069J3702P1626
15704b28561R7335L52882J08821J4867n3731j61249j08608j00764J64259J51172
15694B36423l02731j01157P8258q438J18273j37013K74258Q5816k24836j80416
15684a61563k92226q3648J85744J45356p189l3753J91355o1288K41910n0412j8848
15673E5438j22980N1047L61720k34844j08564P3452J59997k88709k21482R4042
15663a80883j04211M21483K03643r3711q2099j43947q1427O0321j9066r7158o9065
15652a86120J2249L28105N5698N523r4219R5008k41395m864j20638O3370J82106
15641I4823P0737K04500l7523j39283m5383o2386l01759J6175j13144J38253K10083
$$ y = [-298753, -324703, -342763, -378111, -410486, -450909, -183655, -19643, -206820, -313889, -300187, -228561, -131226, 221656, 330477, 345344, 291613, 130364, 21756, -79008, 85251, 236423, -66308, -167465, -89207, -97645, 20628, -116385, 157873, 243689, 18853, -161563, -453789, -537437, -351693, -206337, -213526, -247279, -55924, -117212, 124698, 74286, 55438, -67542, -16495, 345225, 110381, 1817, 75269, 235266, -53443, -274925, -180883, -285094, 136389, 340032, 246321, 164222, 20275, -61152, -831, -19897, -117055, -186120, -173871, 154234, 209932, 215455, 121236, 216244, -25151, -30015, -150653, -87283, 94823, 165560, 370060, 332537, 193254, 147871, 85485, -216274, -200099, -313243, -174990, 35093]
15630C5093R2709L628J6946K01853p0595k19547k57294q3336k0471o9611j07863
15619d78488p2892J45432K42618K27830L9755k07403j12942P4658Q2177j22668
15609a81923J56098J24293j55187j25061m4265J3065J26919l9471J03601j1051
15599c2982J43489K04389K775k67182K1409j11589r2096j82594P6487O0381L97939
15588B20426J12077k9686k12730k96682l06540J14912L48346P3209M2380Q0549
15578A46261n8283J7319l7883j16601R4092J10450l1110k1137J74360j8344n5168
15567B03956j16639k66964m8026n217K51561L22050M6463R4148j62172l71489
15557e2329P3268k91558r7295l4144r6590o0809k15660O7711M52559K65217J78243
$$ y = [35093, 127802, 131430, 148376, 350229, 279634, 60087, -197207, -280543, -301014, -370625, -478488, -551380, -405948, -163330, 64500, 104255, -103148, -216090, -141432, -59255, -181923, -25825, 98468, -56719, -181780, -226045, -212980, -86061, -125532, -21931, -32982, 110507, 314896, 317671, 50489, 71898, -39691, -131787, -314381, -237894, -177513, 220426, 332503, 302817, 90087, -206595, -513135, -398223, -49877, 23332, 65712, 146261, 87978, 105297, 67414, -49187, 44905, 155355, 124245, 103108, 277468, 259124, 203956, 87317, -179647, -227673, -232890, 18671, 340721, 387184, 481332, 319160, -52329, 20939, -270619, -367914, -402058, -498648, -559457, -775117, -707406, -254847, 10370, 188613]
15546A88613r202k022M7377k47203k38043L47087J00850K6665j58503k37730j88184
15535c70295l8191K68906J54358K8234Q7820n209j2967j07828m22036J49398J99101
15524f8709L28831L20152J76745l91318m02086Q1486J00208Q247J5730J15073
15514B84359N5642j08401k1843J91364R3873l57299k83126k69297J57419J09821
15504a47488k11842O3315M09917J46120l4101j6132J03464K20151k43967k32240
15494E7197J72635M2836j32547j60851j95441P7262N031J74257J38203J03475
15484B82057j21496j43009P6736j71007k9722J1811j82021j04447K77397n0998
15474a54699J66212J46782l41033J5251J80068K82952j75207k72589j8589Q6169
$$ y = [188613, 179411, 177389, 224766, -22437, -260480, 86607, 187457, 214122, 55619, -182111, -370295, -408486, -139580, 14778, 43012, 130832, 125623, 112656, 4828, -417208, -267810, -68709, 260122, 580274, 757019, 365701, -36385, 45101, 145309, 153556, 169286, 284359, 340001, 231600, 209757, 401121, 494994, 137695, -145431, -414728, -257309, -147488, -359330, -296015, 113902, 260022, 225921, 209789, 313253, 533404, 289437, 57197, 229832, 272668, 140121, -20730, -216171, -138909, -133878, 40379, 178582, 282057, 160561, 17552, 94288, -76719, -106441, -94630, -276651, -381098, -103701, -154699, 11513, 158295, -182738, -167487, 12581, 295533, 120326, -152263, -170852, -84683]
15464h4683j35652J59216l8645K20927q2353K9576K7064J0091j5989k3150L937
15453G0339q3133K75677K29538J55769j10200K9159K5895j62459J16033J07979
15443F54597k83710k36970j15494j6158N0111J83576P4059j42183K8135m9810
15433A46153j28970J02905Q1668k41765j54505J3974K15983K33775k33007l71802
15423c35591P5594J32562R4423J63750j55506k9509K01509J30791J21781k47970
15413A51834j02745K861K29811J9020k18763r3356j29258j05221J48349J87816
15403I0348J61928j45723j53626J10103o4464j43311o3389j51434Q951K45141
15393a05476j7267l8846j264l8701J7740k13006m420N8032o2930M00955J40982
$$ y = [-84683, -220335, -61119, -99764, 121163, 38810, 68386, 95450, 105541, 89552, 66402, 70339, -12794, 262883, 492421, 648190, 537990, 567149, 593044, 430585, 546618, 654597, 370887, 133917, 18423, 2265, 52376, 235952, 310011, 167828, 195963, 146153, 17183, 120088, 201756, -40009, -194514, -180540, 35443, 269218, 36211, -335591, -259997, -127435, -33012, 130738, -24768, -54277, 147232, 278023, 399804, 151834, 49089, 51950, 281761, 300781, 82018, -11338, -140596, -245817, -97468, 90348, 252276, 106553, -47073, 63030, -1434, -144745, -208134, -359568, -350617, -105476, -122743, -161589, -162853, -201554, -183814, -396820, -401240, -343208, -406138, -5183, 135799]
15382A35799j86140k1285k89420J28036L22800j18572j25225k85839o2334Q0743
15372d21437L49000J26375m9395o8245p290R2925J13422Q6346q5912Q2936l4387
15361A84338K0397j80641l26050k7952M00167O6690l10969j02006P0535r9391
15351c04882Q314K5314n5659J36653J43755J72938J13601j45715J00872K05603
15341D00794k47880j24820J74578j16900j64536k12006m2548L94472J20042j13978
15331F7218j75200M997R0401n9482L9701P0227J17478r6720j54326j88920J01800
15320a82826Q9725J18289j9005K83674j70351m03457l6036M744J57925l6020L46380
15309A53042J69793k87898j26238J40443K2123r3534J36544o8149j2460o2020
$$ y = [135799, -50341, -71626, -361046, -233010, 89790, -28782, -154007, -439846, -502180, -421437, -72437, 53938, 4543, -63702, -70992, 21933, 135355, 221701, 135789, 218725, 184338, 204735, 24094, -301956, -329908, 70259, 136949, -174020, -276026, -205491, -304882, -296568, -271254, -326913, -190260, -46505, 126433, 240034, 94319, 195191, 400794, 152914, 28094, 202672, 85772, -78764, -290770, -333318, 61154, 181196, 67218, -107982, -102985, -12584, -72066, -32365, 37862, 155340, 58620, -95706, -284626, -182826, -93101, 25188, 6183, 289857, 119506, -283951, -319987, -315243, -157318, -193338, 153042, 322835, 34937, -91301, 49142, 71265, -22269, 114275, 46126, 33666, -28354]
15299b8354l6458J09902K09654K35697j69739l14423j56607q9193j7588k008L05095
15288D5978q6261j3835J05736R8415j61401k78203n6965O9706J83486K10399N288
15277A22343J75523L7026j77506j38232r5698O3066k409l16438J0888K42884K8488
15266e0065r3767M01R9270J24956q3819l20279R174K88620N3941J40614J28068
15255B97114m9844j94155l398M2248P3958k75315k59729j94093K40988K27421
15245i4805J7895Q1592p7970k29064q1201n0139L03216K18228r3605n938o7734
15234g9525j09096j10794L93765P4358P6379J34248m0949l9340k9854m08176m8552
15223a87536K89294o2553q8035J75558R2515j33428n3656j66222M56578L23261
$$ y = [-28354, -64812, 45090, 254744, 490441, 320702, 6279, -150328, -239521, -257109, -259117, 45978, -40283, -54118, 51618, 150033, -11368, -289571, -346536, -276830, -93344, 117055, 122343, 297866, 334892, 157386, 19154, -76544, -13478, -15887, -332325, -321437, -78553, -50065, -143832, -143431, -44161, 80795, -3024, -323303, -314129, -25509, 28432, 169046, 297114, 247270, 53115, 49717, 91965, 165923, -109392, -369121, -563214, -322226, -94805, -76910, 4682, -73288, -302352, -383553, -433692, -130476, 87752, -5853, -11791, -79525, -188621, -299415, 94350, 168708, 245087, 379335, 338386, 299046, 269192, -138984, -187536, 101758, 39205, -48830, 126728, 219243, 85815, 32159, -134063, 322515, 645776]
15213F45776n10434k83390q0892j04810j8166q6926k8959m8928q3197K81118K13523
15202a05285J12016n6458n7353L97916R1210l06680k72533p683K35702K67190
15192B98042M00129k5202l17527j85110J8574j81026j62337L46138J2236N8158
15182B62075k10781j09576J20146K69612R0843k14198j83460J96300K03481j54709
15172B69733m05407j98104N847K56697M366J31754M3732K46086N7624j3739l14876
15161H3713K6111J71732Q1463j23667k72817j70998r5590J51145r728n5139j12559
15150c26334j16289K00696L3091M5165K21037J86378k30241k76445J04914K040
15140a55988K91926l0741m4526J23437L2457R5698j78800k76906L4104P6746p3913
$$ y = [645776, 135342, -148048, -228940, -333750, -351916, -438842, -467801, -516729, -599926, -318808, -105285, 6731, -49727, -107080, 290836, 382046, 75366, -197167, -204850, 30852, 298042, 698171, 672969, 355442, 170332, 188906, 7880, -154457, 191681, 203917, 262075, 51294, -58282, 61864, 331476, 422319, 208121, 24661, 220961, 424442, 269733, -135674, -333778, -327931, -71234, -66868, 64886, 108618, 354704, 412328, 398589, 83713, 109824, 281556, 363019, 239352, -33465, -204463, -300053, -148908, -158636, -213775, -326334, -442623, -241927, -208836, -163671, 57366, 243744, 13503, -262942, -158028, -155988, 135938, 105197, 60671, 184108, 216565, 312263, 133463, -143443, -109339, -32593, -106506]
15129a06506J81174J14740q7104k62538j09392Q4283K93706K66902k12859L1014
15119A93420Q0096R4298J05170l7663j09640j81425l40014K3698j4734p7280J85140
15108g8934j65180l4731j20836M9357J66922p1286O1734J3736K98217L56793k0674
15097D55118k34480l04591k76819j0700L11990L71864P2555j15003j81305n2804
15087C5825R6788J7241m8004j14083k2471J4823J2795J92033K03237k79839j63546
15076e5201J53116K0150j81702j41649J68329k8470O8741N2046j04717K15832
15066A66475K38525j89773j18687O773L8046j14862l5442K9597J18099K6667p9910
15055H5508K10423M32395j37703p18447k4908K17035j19352l75972K07886p7924
$$ y = [-106506, 74668, 189408, 102304, -160234, -269626, -185343, 108363, 375265, 162406, 193420, 273516, 367814, 472984, 435321, 325681, 144256, -195758, -172060, -186794, -264074, -78934, -244114, -278845, -399681, -350324, -183402, -254688, -192954, -179218, 118999, 475792, 455118, 220638, -83953, -360772, -371472, -59482, 312382, 384937, 269934, 88629, 35825, 132613, 149854, 101850, -12233, -34704, -19881, -7086, 184947, 388184, 108345, -55201, 97915, 118065, -63637, -205286, -36957, -65427, 3314, 55360, -49357, 166475, 405000, 215227, 96540, 103313, 141359, 26497, -8945, 20652, 138751, 165418, 85508, 295931, 728326, 590623, -127824, -152732, 64303, -55049, -431021, -223135, -301059]
15045c01059o3545o3501M04170J66121k76235k47477K39068J69385K67633J84127
15035D78687P9925l11842k66193K3820Q5859l44534r647M16873J74544K40730
15025E68222K9009k37229N7437k9007k05060P2969K16721K11117q9573k87499
15015C07107k97237J78424M00020K64061J79837M71125M38492J51439n9766l49526
15005A683976l33900m06463n38119j11723J09830J38283j00354j30225j53802
14996A57503Q7371J05797L5131k86549N2871j30902j71425Q2986N5111n3529K5422
14985d0213J8539j55122J14831J46950M9249K59999P7174k479m2279j62328k58373
14974E948p4585l5879p2495k832N7267J72844q5079n3028J09291l8517J9455P2815
$$ y = [-301059, -364604, -428105, -23935, 142186, -134049, -381526, -142458, 26927, 294560, 478687, 558612, 246770, -19423, 4397, 90256, -254278, -263925, 152948, 327492, 568222, 597231, 360002, 417439, 388432, 183372, 256341, 473062, 684179, 594606, 307107, 9870, 188294, 588314, 852375, 1032212, 1503337, 1941829, 2093268, 2033502, 1683976, 1350076, 943613, 405494, 293771, 403601, 541884, 441530, 311305, 157503, 244874, 350671, 385802, 99253, 152124, 21222, -150203, -67217, -12106, -65635, -40213, -21674, -176796, -61965, 84985, 134234, 394233, 471407, 468928, 426649, 264321, 5948, -68637, -104516, -177011, -179843, -122576, 50268, -34811, -87839, 21452, -17065, 2390, 75205]
14962G5205k8220l28154r4533M70669j8031q0584k7206j27987k2151J54013K6389
14951e90O6168J43762p1791M5166k20275m1606j34001j22044K6927j1221k3755
14940c43260l2202n4934M7027K49688K01814n5030k60023L3942j50604n6508j30463
14929e50553K95046L35505N1084j01139l01269m844K27617J71840L45441L8617
14919E07345k67902k27314k39187O6714K62732J61048k00993M52M819j0436j56048
14908i8770j06053j44697P4414L0539j01032L0631J11009r5714k94318J40607
14898d53384M60350J08343O4404j3074m0195N7394r6682p8314J26078j10965j39270
14887a15315j25532n7381K54944Q1082k65471J42846m1179r0429P3864N8454J25065
$$ y = [75205, 46985, -281169, -375702, 94967, 76936, -3648, -30854, -158841, -180992, -26979, -590, 65578, 209340, 137549, 182715, -37560, -79166, -213167, -335211, -308284, -319505, -343260, -375462, -430396, -383369, -133681, 68133, 13103, -246920, -212978, -363582, -420090, -550553, -255507, 79998, 131082, 29943, -271326, -276170, -48553, 123287, 468728, 507345, 239443, 12129, -227058, -160344, 102388, 263436, 62443, 62895, 67714, 57278, -98770, -204823, -349520, -275106, -244567, -345599, -314968, -203959, -299673, -593991, -453384, 6966, 115309, 179713, 166639, 126444, 183838, 87156, 8842, 134920, 23955, -115315, -240847, -298228, -43284, 37798, -227673, -84827, -126006, -216435, -142571, -84117, 40948]
14876D0948p4791L7903J59047J83298K57854o5634n01469k07443k1566O2126j53352
14865b83079j52785j58958M1155J9404J08279O6923N8462L27832L14343l26900
14855A4676l17229L5873J76217n6882P5429J83082k21381k02333R8671r2451n0839
14844c57167J08898j56139K35984N13764J7770l04189k48170l0816n9316j36246
14834d15627J63290J82712R4037N4222M7613k04638p0017J63970L6930j45142
14824i2650K4639J38006K30782K61075j25945j80761k34983N8217j7558n6225
14814D597J62290L21053j01302m19183k76061n1965k1131J21795J46289j49888
14804b63506K38919K71378j91586j08072L30617K49118k91054j08539j09521o6211
$$ y = [40948, -33843, 4060, 163107, 346405, 604259, 538625, 37156, -170287, -191853, -129727, -283079, -435864, -594822, -553667, -534263, -425984, -359061, -300599, 27233, 341576, 14676, -302553, -266680, -90463, -147345, -71916, 111166, -110215, -312548, -213877, -306328, -357167, -248269, -404408, -168424, 345340, 363110, 58921, -189249, -220065, -279381, -415627, -252337, -69625, 24412, 78634, 126247, -78391, -148408, 15562, 52492, -92650, -68011, 69995, 300777, 561852, 435907, 255146, 20163, 78380, 60822, 4597, 166887, 487940, 386638, -32545, -308606, -360571, -381702, -259907, -113618, -263506, -24587, 246791, 55205, -52867, 277750, 526868, 235814, 127275, 17754, -48457]
14794d8457K2058N0058K12179k54494j24561j64802j79705o1322l7439J95800
14784c90685J06017K61788N1724j20257J489k96978M894o1652N835L07593K65347
14773A35115J15062j27761l4289k7253K2470J10237k90670k52038j786J50443
14763b00470k2712N1248k18294J6979K38571L49282j36113j25322k67225j09806
14753d23862j61275J56269P9710p8257k5344J02460K64896N7927J23832J07840
14743B04196j66051m6684n4443k80395J20329L01141M8892o2496J11627k33448
14733e7332j41181K06905M178J34698J70941k255j01543k95614n6295P0136j27442
14722a94804l0838j67822L0407K31477K00176r5157j5831L04655P3950J2969J4581
$$ y = [-48457, -26399, 23659, 235838, -18656, -143217, -308019, -487724, -549046, -586485, -390685, -284668, -22880, 28844, -91413, -89924, -386902, -382008, -443660, -437825, -130232, 135115, 250177, 122416, 88127, 60874, 83344, 193581, -97089, -349127, -350913, -200470, -223182, -171934, -390228, -373249, -134678, 214604, 78491, -46831, -314056, -423862, -585137, -428868, -349158, -427415, -452759, -350299, -85403, -27476, 96356, 204196, 38145, -8539, -62982, -343377, -223048, 78093, 126985, 64489, 176116, -57332, -198513, 8392, 12570, 147268, 318209, 315954, 214411, -81203, -137498, -67362, -194804, -225642, -393464, -363057, -131580, 68596, -26561, -42392, 262263, 336213, 349182, 363763]
14711C63763j4639j34125k90074m3991J68702j64287j57382J61539J16865K94225
14701C00596J9248k55258P799J82536M4871l26518M1241L36942R894j10353j02987
14690A48011k28536J38743J35926P9899j60885k4306j90649n0438J78539K19003
14680B45307j89072k47378l1234K09975q9331P120K35570P717j3373k1349p8565
14669C5387j23585R5867P8097l65542l25646J7389J20616O8704K03682j98334
14659c93365J43133j34495J45295n7698l07739q7736K77212K87081M8995q8621
14649a67938j1367K77904K08642l20160l00425M9575J43131o6514R1108J32721
14639C6677J24916o6071r1546P4692p5329p5764j15057N4352P4486j20372Q9464
$$ y = [363763, 349124, 214999, -75075, -119066, 49636, -114651, -272033, -110494, 6371, 300596, 319844, 64586, 72385, 254921, 299792, -26726, 14515, 351457, 361351, 250998, 148011, -80525, 58218, 194144, 274043, 113158, 88852, -101797, -152235, 26304, 245307, 56235, -191143, -222377, -12402, -101733, -94613, 140957, 148674, 135301, 113952, 35387, -88198, 7669, 85766, -279776, -605422, -588033, -467417, -398713, -195031, -393365, -250232, -384727, -239432, -297130, -604869, -692605, -415393, -128312, -79317, -167938, -179305, 98599, 307241, -12919, -313344, -263769, -120638, -187152, -96044, 36677, 161593, 95522, 3976, 78668, 3339, -72425, -187482, -133130, -58644, -179016, -89552]
14628h9552J25711O3121K9614j32398j6749j55192n9372R4529M4786O0544R6139
14617F1181J78374j16857P2419J9220p3271k11038k20499j60504K19015Q4720
14607a47240j42732k73154J8136K15747L59246K12736l52473l29125J93340J43496
14597a02023m7925j7704o6387J87067k8667r1716K18845K87429j11851k82465
14587e5397j09074K0960R7683J09591P1660k76913j79734J55658K39991k310j13475
14576d1360p5181j21586J30934j12628L42701n2974j66692K55661J36044M4712
14566C39631o1578M6728j65461j20102K13355J20713J06639m1700j60155j68132
14556A09938N4540J38553K06165j53072j40596j33723L2558j57439k05058K40997
$$ y = [-89552, 36159, 99280, 128894, -3504, -20253, -175445, -234817, -140288, -95502, -34958, 61181, 239555, 122698, 195117, 214337, 141066, -69972, -290471, -450975, -231960, -147240, -289972, -563126, -544990, -329243, 30003, 242739, -109734, -438859, -245519, -102023, -149948, -167652, -234039, -46972, -75639, -167355, 51490, 338919, 227068, -55397, -164471, -143511, -45828, 63763, 135423, -141490, -321224, -165566, 74425, 72115, -41360, -116541, -238127, -107193, -219821, 122880, 69906, -96786, 158875, 294919, 339631, 278053, 324781, 159320, 39218, 252573, 373286, 479925, 438225, 278070, 109938, 164478, 303031, 509196, 356124, 215528, 81805, 114363, -43076, -248134, -7137]
14546g137m2939k18772K51063J45097o9488J72978j29099r7875L6324k33983k02191
14535c96022J55078O686J30035J12372M0164L3254K50668K55097o0812j76535
14525C49985l32346o6237j41602L8107M3306J19324r920N2752l1858l80006K89266
14514f9229k34383j39924K47839J14334K579J58252J57153J88969J84859j99591
14504D10858k24982p8057q784k71515N1821J27071N3337L3239j80769k11502J20405
14493a78878K51729j69480q4836R0472N1735k30139j21309L31019p003o6872K31018
14482I7456J169k54157k62931k88836J17600J18715o304O7581L12705L721q5738
14471a79019j79644r0889R8184L0485o2876k12944k4884K6522J89413O1033K12619
$$ y = [-7137, -50076, -268848, -17785, 127312, 57824, 230802, 101703, 3828, 40152, -193831, -396022, -240944, -234258, -104223, 8149, 48313, 81567, 332235, 587332, 526520, 349985, 17639, -48598, -190200, -152093, -108787, 10537, 617, 53369, 21511, -358495, -69229, -303612, -443536, -195697, -81363, -78784, 79468, 236621, 425590, 610449, 410858, 185876, 107819, 99035, -172480, -120659, 6412, 59749, 92988, -87781, -299283, -178878, 72851, -96629, -181465, -90993, -39258, -269397, -390706, -59687, -66690, -133562, 97456, 98625, -155532, -418463, -707299, -589699, -470984, -477288, -409707, -97002, -93281, -179019, -358663, -449552, -351368, -320883, -383759, -596703, -621587, -595065, -405652, -344619, -132000]
14460a32000L86992j200k98928k3969P831M2569j15210p257P3338j8738q652O139
14448h9085j06709n6968J97648k24536o7424K45088L5771j6681J54392N5139J8962
14437A45597j56014K47797K71257N0473R8296j80395j79328l75266l11272J85509
14427b03346J75928Q9471L04678k09O6180M0214j08224k4242K7850k370j14682
14416B51248r4240L9201j57790j35754j84401J51174q967J99861R1355R8682P4714
14405C25083r3907l31008j37423j87149J2953J24528K36516K06862k64545k75650
14395c83740M1474j40584P2736J46268L1052K676N8309o5207M8534R9146k6505
14384a15841j26178J85601j01546k4318O5170J64719r1400k97796K64711L76630
$$ y = [-132000, 254992, 253792, -45136, -69105, -61274, -18705, -133915, -141172, -67834, -86572, -95224, -89085, -195794, -252762, -55114, -279650, -347074, -101986, -66215, -82896, 71496, 126635, 145597, -10417, 237380, 508637, 559110, 657406, 477011, 297683, -77583, -388855, -203346, -27418, 62053, 366731, 366522, 432702, 472916, 364692, 340450, 368300, 365930, 251248, 157008, 196209, 38419, -97335, -281736, -130562, -139529, 60332, 151687, 250369, 325083, 231176, -99832, -237255, -424404, -411451, -286923, -50407, 156455, -108090, -383740, -342266, -482850, -410114, -263846, -232794, -230118, -171809, -237016, -188482, -89336, -115841, -242019, -56418, -157964, -182282, -117112, 47607, -43793, -341589, -76878, 299752]
14374B99752j9487n29629j62471j04374Q7030O8075J51746L94740O388M6486r4445
14363A43811l72086L84496K05302k73117j31225J8451r0624k72412k43312Q099
14353f22617m0727L62747N4881k13736L46771L14652J75379R9107m5464j57912
14343B73081j64575Q1793k31986m3416J30201J15244K27889J55526l57211l71656
14333a85110k08742J74036J18969J54797J23354n3802k24604j3097j72248J4581
14323b71866p4197J05770k76527L3977J87990K12202K6551N3432O2973r8633n6433
14312i4761K99369N0002Q424N3707P4554k9985j48849K08409m8578k76263p5800
14301B0229l10895J9585L40371N09359o4120j97630k58613J6405R9828J41279
$$ y = [299752, 280265, -249364, -411835, -516209, -429179, -361104, -209358, 185382, 191770, 238256, 143811, -228275, 156221, 361523, 88406, -42819, -24368, -114992, -387404, -630716, -622617, -663344, -300597, -245716, -459452, -112681, 201971, 377350, 476457, 430993, 273081, 108506, 190299, -41687, -85103, 45098, 160342, 388231, 543757, 186546, -185110, -393852, -219816, -100847, 53950, 177304, 123502, -101102, -114199, -286447, -271866, -346063, -240293, -516820, -482843, -294853, -82651, -56100, -2668, 60305, -38328, -94761, 204608, 254610, 263034, 316741, 391295, 361310, 212461, 420870, 372292, 96029, 20229, -290666, -271081, 69290, 578649, 514529, 316899, 58286, 74691, 174519, 315798]
14291C15798k03021N5748k6404j10978p5662j8565K79725p512k97086r5521J86538
14280C060J45850k67530j89168J82706K47119p245l0124k7635J32797j63100l0553
14269c823p2423k87736O1191M84950J41272j86735q1560K6454K25690K33938r4599
14258D46619k59898l44513j36026K2502j74126K43938M01504K51461n2088k32291
14248A67082j21491J30285J33704R4680q2600j61037j64452j89502K20918o3286
14238c5699K2290P6283r2937k9219Q6084J16107j98406k88970J37212o7125N9179
14227b15201M83530J055O9840K093J69035m22888l23025N2999n6479K24874J49520
14216A35353r7432j41824j00581J13592J63304j36022P6460J46983j95247J583
$$ y = [315798, 112777, 168525, 142121, 31143, -44519, -63084, 216641, 209129, -87957, -183478, 3060, 148910, -118620, -307788, -125082, 122037, 114792, 84668, 57033, 189830, 26730, -3823, -76246, -363982, -302791, 182159, 323431, 136696, 55136, 81590, 307280, 541218, 446619, 186721, -157792, -293818, -271316, -445442, -201504, 200000, 451461, 399373, 167082, 45591, 175876, 309580, 404260, 321660, 160623, -3829, -193331, 27587, -35699, -13409, 62874, -30063, -59282, 26802, 142909, -55497, -344467, -207255, -274380, -215201, 268329, 269384, 339224, 341317, 510352, 87464, -235561, -182562, -239041, -14167, 135353, 37921, -103903, -204484, -90892, 72412, -63610, 12850, 159833, -35414, -33831]
14206c3831K3361j71526p874M7519r9904J16166J79368L8101j92023K7106k58129
14195c31666l9466L55181n4951K19410R844j81730q1502k29531o4082K47913K58784
14184A08204M2070o877J61905K4534l57410j81990K38749k32102k42002k18925
14174f63844J15733M7369j7913J65995K74048K39757n6552k2225j20886K39388
14164B00870K11691j82875o4232J82842j30646l85206k65399J17649K59480o5577
14154a21403K47377R1306m22491j1508J7245j26196J18431K22010O8261P6847
14144A59879O0782J64150k8369o8755N5852l28431j49835m2151M62485J49372
14134D34979j80570p9868N6467j94714k9840J84358j9757k23244O5136k9640j07651
$$ y = [-33831, -10470, -181996, -189870, -142351, -242255, -126089, 53279, 91380, -100643, -73537, -331666, -371132, -15951, -70902, 148508, 158352, -23378, -104880, -334411, -398493, -150580, 108204, 150274, 143397, 305302, 329836, -27574, -209564, 29185, -202917, -444919, -663844, -548111, -500742, -518655, -352660, -78612, 161145, 104593, 82368, -38518, 200870, 412561, 229686, 165454, 348296, 217650, -167556, -432955, -315306, -55826, -121403, 125974, 217280, -205211, -216719, -199474, -325670, -207239, 14771, 83032, 159879, 220661, 384811, 356442, 287687, 343539, 15108, -134727, -176878, 285607, 434979, 254409, 174541, 231008, 36294, 6454, 190812, 171055, -52189, 12947, -16693, -124344]
14123a24344K04492L07879j2011n3109l01524j48792R7188L5997K5218j59747
14113a28753L2523P2890J46411O0041l54661p19L55247J69872j57732l64263p0453
14102b39597L00996J36669j99174J8210J64631j01083j44344k31517o5911M6774
14092c14346N6140q8802J13893J9439j90043j3875k07245P3833J30506O1402o093
14081c65191q2522J41629J00319R8826R7641j42397k01347J7282p5651K08305
14071b03106P2856P8833O54O8684J00021j64079k83593J706N1379j630Q6064L43665
14059A51454J58312k4685J5982j21644k32266m0333O2615m3345j90783Q7165K01246
14048B3718N7247j46317j40854Q6595j23187k54225K13688o6855K4310J86594
$$ y = [-124344, 80148, 388027, 376016, 322907, 21383, -127409, -30221, 5776, 30994, -128753, -96230, -23340, 123071, 183112, -171549, -172268, 182979, 352851, 195119, -169144, -239597, 61399, 198068, -1106, 17104, 181735, 80652, -63692, -295209, -361120, -314346, -258206, -347008, -233115, -213676, -403719, -417594, -624839, -551006, -420500, -359098, -365191, -447713, -306084, -205765, -106939, -9298, -151695, -353042, -335760, -411411, -203106, -130250, -51417, -50763, 17921, 117942, -46137, -329730, -328024, -276645, -278275, -192211, 151454, 309766, 285081, 301063, 179419, -52847, -93180, -30565, -73910, -264693, -177528, 23718, 80965, -65352, -206206, -119611, -242798, -497023, -283335, -350190, -325880, -139286]
14038a39286L52124N5167o8646J93652M4721j73566j79661q4357K0332k21805
14028b01325K4409K79677k8615n27702j16291J98936J15782K5326L1793M0377
14018a57633k17483k21703N6937J38754L13374Q450M4630j47651J9473j50617
14008c13469j40385l8425M6434L37971J88346k43609k93733Q2340K93289P5895
13998e346p0433k26741P2803k37533k85732K83627L47836J1376k8591m29907j95119
13987g63760J83874K25507n0365J61327j65002j39082L27112J29028Q556j04456
13977a87261P7651K35099j479j18836k24221N8274j26291K29266o5971J33883
13967A0114L08520j54810m26863P048k8264N4043J33079n2951J86875N2931p2470
$$ y = [-139286, 212838, 268005, 199359, 393011, 437732, 264166, 84505, 148, 20480, -201325, -176916, 102761, 74146, -453556, -569847, -370911, -255129, -229803, -198010, -157633, -375116, -596819, -539882, -401128, -87754, -79304, -34674, -182325, -162852, -313469, -453854, -492279, -445845, -107874, 80472, -163137, -456870, -374530, -81241, -5346, -75779, -302520, -229717, -467250, -752982, -469355, -121519, -110143, -138734, -568641, -763760, -579886, -354379, -404744, -243417, -408419, -547501, -220389, -91361, -82805, -187261, -109610, 125489, 124010, 5174, -219047, -160773, -287064, -57798, -123769, 10114, 318634, 163824, -263039, -255991, -284255, -230212, -97133, -150084, 36791, 89722, 17252]
13956A7252O9898m9235Q9961K87071p8644J01428r4170k28963j08204q9144k68586
13945c51336o7962L49254J79823J54473m297M5760M126j20976j28400m5999j81219
13934a66753k0098j28330K9369Q4113l6238L20252L4914j49439p1931K96790L00432
13923D93081k1148n7034j27323k77516N6174j56866K2456J04624L1922M419P6004
13912A48793k18218j56822J88969k0826j63844j30430K79830j18666k9067R5691
13902a24590K15956j22084j46553K20127j931k7398q3646j19522N4990J64064
13892B9413K32223r358n5715j67505N335K5700J7600J95640q6466J0338J25219
13881C22424j82950j90161P8108J50320N2509m22435j1299L43624O4373j46773
$$ y = [17252, 87150, 37915, 127876, 414947, 336303, 437731, 343561, 114598, 6394, -82750, -351336, -419298, -70044, 109779, 264252, 259955, 305715, 309841, 188865, 60465, 14466, -166753, -186851, -315181, -285812, -201699, -237937, 82315, 117229, -32210, -104141, 192649, 493081, 471933, 414899, 287576, 10060, 66234, -90632, -68176, 36448, 68370, 72789, 148793, -69425, -226247, -37278, -58104, -221948, -352378, -72548, -191214, -220281, -124590, 91366, -30718, -177271, 42856, 40925, 13527, -70119, -189641, -134651, 29413, 261636, 252278, 196563, 29058, 34393, 60093, 77693, 273333, 186867, 197205, 322424, 139474, -50687, 27421, 177741, 230250, -192185, -203484, 140140, 204513, 57740]
13871E7740l7940r2764J03646O0014K6517k11955J27974K15305K36904j84886
13861C00555k18079j43138k32730n9583J66472L6975l2542J17139j4046j06106
13851a85083r0637p0418J3136K66357J81297j50814m5913L9153j09459K54299
13841A01918L03537J8129k44413l19755o9490P8809J22977r2031l26399l04930
13831g31648K04049J75151L46890J75763l12473l66551j62733J16417K73667J75903
13821a05565J48037Q1918j64554K58494O3143l76616j79781j9048p0008J06571
13811b57409N6245J60436J75795J3384m00733P4579L51202k8632p0548K82758
13801C57077J90355K0134n04590l72739o4317j2723K09550K28111L0541M4345
$$ y = [57740, 19800, -72964, 30682, 90696, 117213, -94742, 33232, 248537, 485441, 300555, 82476, -60662, -293392, -352975, -186503, -149528, -182070, -64931, -78977, -185083, -275720, -346138, -333002, -66645, 114652, -36162, -82075, -42922, -152381, 101918, 405455, 423584, 179171, -140584, -210074, -131265, -8288, -100319, -426718, -731648, -527599, -352448, -5558, 170205, -142268, -508819, -671552, -555135, -281468, -105565, 42472, 124390, -40164, 218330, 281473, -95143, -274924, -293972, -363980, -257409, -201164, -40728, 135067, 148451, -252282, -177703, 173499, 144867, 74319, 357077, 547432, 567566, 62976, -309763, -374080, -386803, -177253, 50858, 81399, 125744]
13791A25744k3753o8140J03520n102j21105l48255m0485J94250J1304P4265K7051
13780g0706N1771j64294j12429L2898J64024p0691l6047q970k04656l9486P2460
$$ y = [125744, 101991, 33851, 137371, 132269, 11164, -337091, -377576, -183326, -172022, -97757, -70706, -18935, -183229, -295658, -262760, -98736, -169427, -205474, -214444, -419100, -458586, -386126]
$$ [...]
##END NTUPLES=NMR SPECTRUM
##END=
