##TITLE=Analysis number 324569
Compound Code tl 00680
Project Code adrs
Chemist Name apollo
##JCAMPDX= 6.0         $$ Bruker NMR JCAMP-DX V2.0
##DATA TYPE= NMR SPECTRUM
##DATA CLASS= NTUPLES
##ORIGIN= Bruker BioSpin GmbH
##OWNER= nmr
$$ XWIN-NMR		Version 3.5
$$ Mon Nov 27 11:38:21 2006 GMT Standard Time (UT+0h)  MAYBRIDGE\nmr@NMR_250MHZ
##.OBSERVE FREQUENCY= 250.131544655141
##.OBSERVE NUCLEUS= ^1H
##.ACQUISITION MODE= SIMULTANEOUS (DQD)
##.ACQUISITION SCHEME= undefined
##.AVERAGES= 16
##.DIGITISER RES= 18
##SPECTROMETER/DATA SYSTEM= dpx250
##.PULSE SEQUENCE= zg30
##.SOLVENT NAME= CDCl3
##.SHIFT REFERENCE= (INTERNAL, CDCl3, 0, 16.522)
##AUDIT TRAIL= $$ (NUMBER, WHEN, WHO, WHERE, WHAT)
$$ ##TITLE= Audit trail, XWIN-NMR		Version 3.5
$$ ##JCAMPDX= 5.01
$$ ##ORIGIN= Bruker BioSpin GmbH
$$ ##OWNER= nmr
$$ C:\u/data/dgb/nmr/ADRS/1130/pdata/1/auditp.txt
$$ ##AUDIT TRAIL=  $$ (NUMBER, WHEN, WHO, WHERE, WHAT)
(   1,<2006-11-27 11:37:51.69 +000>,<MAYBRIDGE\nmr>,<NMR_250MHZ>,
      <created by zg, POWCHK disabled, PULCHK disabled
       configuration hash MD5:
       49 4B E0 1D 92 C2 6B 37 9F E6 65 BC 52 41 86 1D
       data hash MD5: 64K
       07 26 42 3E 70 25 51 BD 7B E4 C7 98 C3 7A 7A 71>)
(   2,<2006-11-27 11:38:07.62 +000>,<MAYBRIDGE\nmr>,<NMR_250MHZ>,
      <Start of raw data processing
       ef LB = 0.3 FT_mod = 6 PKNL = 1 SI = 32K 
       data hash MD5: 32K
       4E 2E BE 39 B8 32 4F AF 03 1F 5D 39 69 C5 C5 62>)
(   3,<2006-11-27 11:38:09.37 +000>,<MAYBRIDGE\nmr>,<NMR_250MHZ>,
      <apk 
       data hash MD5: 32K
       BE B2 27 29 35 04 71 AA D8 E7 12 E6 78 DF 83 6F>)
(   4,<2006-11-27 11:38:10.17 +000>,<MAYBRIDGE\nmr>,<NMR_250MHZ>,
      <abs ABSG = 5 
       data hash MD5: 32K
       60 B9 E7 FC 48 88 1D E3 56 AA 78 65 AD 8B 3E 70>)
$$ ##END=
$$ 
$$ hash MD5
$$ 69 9F 93 0E A4 38 5F 6F 73 13 F2 74 67 9A 37 57
##$RELAX= 
##$RELAX= 
##$RELAX= 
##$RELAX= 
##$RELAX= 
##$RELAX= 
##$RELAX= 
$$ Bruker specific parameters
$$ --------------------------
##$DU= <C:\u>
##$EXPNO= 1130
##$NAME= <ADRS>
##$PROCNO= 1
##$TYPE= <nmr>
##$USER= <dgb>
##$AMP= (0..31)
100 100 100 100 100 100 100 100 100 100 100 100 100 100 100 100 100 100 
100 100 100 100 100 100 100 100 100 100 100 100 100 100 
##$AQSEQ= 0
##$AQ_mod= 3
##$AUNM= <au_zg>
##$AUTOPOS= <46 >
##$BF1= 250.13
##$BF2= 250.13
##$BF3= 250.13
##$BF4= 250.13
##$BF5= 500.13
##$BF6= 500.13
##$BF7= 500.13
##$BF8= 500.13
##$BYTORDA= 1
##$CFDGTYP= 0
##$CFRGTYP= 5
##$CHEMSTR= <none>
##$CNST= (0..31)
1 1 145 1 1 1 1 1 1 1 1 1 1 1 1 1 1 1 1 1 1 1 1 1 1 1 1 1 1 1 1 1 
##$CPDPRG= <>
##$CPDPRG1= <>
##$CPDPRG2= <>
##$CPDPRG3= <>
##$CPDPRG4= <mlev>
##$CPDPRG5= <mlev>
##$CPDPRG6= <mlev>
##$CPDPRG7= <mlev>
##$CPDPRG8= <mlev>
##$CPDPRGB= <>
##$CPDPRGT= <>
##$D= (0..31)
0 1 0 0 0 0 0 0 0 0.06 0 0 0 0 0 0 0.0002 0 0 0 0 0 0 0 0 0 0 0 0 0 0 
0 
##$DATE= 1164627469
##$DBL= (0..7)
120 120 120 120 120 120 120 120 
##$DBP= (0..7)
150 150 150 150 150 150 150 150 
##$DBP07= 0
##$DBPNAM0= <>
##$DBPNAM1= <>
##$DBPNAM2= <>
$$ [...]
##$SUBNAM7= <"">
##$SUBNAM8= <"">
##$SUBNAM9= <"">
##$SW= 20.6930455092707
##$SWIBOX= (0..15)
0 0 3 0 0 0 0 0 0 0 0 0 0 0 0 0 
##$SW_h= 5175.983436853
##$TD= 65536
##$TD0= 1
##$TE= 294.16
##$TE2= 300
##$TE3= 300
##$TEG= 300
##$TL= (0..7)
0 120 120 120 120 120 120 120 
##$TP= (0..7)
150 150 150 150 150 150 150 150 
##$TP07= 0
##$TPNAME0= <>
##$TPNAME1= <>
##$TPNAME2= <>
##$TPNAME3= <>
##$TPNAME4= <>
##$TPNAME5= <>
##$TPNAME6= <>
##$TPNAME7= <>
##$TPOAL= (0..7)
0.5 0.5 0.5 0.5 0.5 0.5 0.5 0.5 
##$TPOFFS= (0..7)
0 0 0 0 0 0 0 0 
##$TUNHIN= 0
##$TUNHOUT= 0
##$TUNXOUT= 0
##$USERA1= <user>
##$USERA2= <user>
##$USERA3= <user>
##$USERA4= <user>
##$USERA5= <user>
##$V9= 5
##$VALIST= <valist>
##$VCLIST= <CCCCCCCCCCCCCCC>
##$VD= 0
##$VDLIST= <DDDDDDDDDDDDDDD>
##$VPLIST= <PPPPPPPPPPPPPPP>
##$VTLIST= <TTTTTTTTTTTTTTT>
##$WBST= 1024
##$WBSW= 4
##$XGAIN= (0..3)
0 0 0 0 
##$XL= 0
##$YL= 0
##$YMAX_a= 210645
##$YMIN_a= -318704
##$ZGOPTNS= <>
##$ZL1= 120
##$ZL2= 120
##$ZL3= 120
##$ZL4= 120
##$ABSF1= 16.522
##$ABSF2= -4.171173
##$ABSG= 5
##$ABSL= 3
##$ALPHA= 0
##$AQORDER= 0
##$ASSFAC= 0
##$ASSFACI= 0
##$ASSFACX= 0
##$ASSWID= 0
##$AUNMP= <proc_1d>
##$AZFE= 0.1
##$AZFW= 0.1
##$BCFW= 0
##$BC_mod= 0
##$BYTORDP= 0
##$COROFFS= 0
##$CY= 12.5
##$DATMOD= 1
##$DC= 0
##$DFILT= <>
##$DTYPP= 0
##$F1P= 14.0000005364418
##$F2P= -0.99999901652339
##$FCOR= 0.5
##$FTSIZE= 32768
##$FT_mod= 6
##$GAMMA= 0
##$GB= 0
##$INTBC= 1
##$INTSCL= 1
##$ISEN= 128
##$LB= 0.3
##$LEV0= 0
##$LPBIN= 0
##$MAXI= 10000
##$MC2= 0
##$MEAN= 0
##$ME_mod= 0
##$MI= 0
##$NCOEF= 0
##$NC_proc= -5
##$NLEV= 6
##$NOISF1= 0
##$NOISF2= 0
##$NSP= 0
##$NTH_PI= 0
##$NZP= 0
##$OFFSET= 16.522
##$PC= 1
##$PHC0= 221.4869
##$PHC1= 16.25916
##$PH_mod= 1
##$PKNL= yes
##$PPARMOD= 0
##$PSCAL= 4
##$PSIGN= 0
##$REVERSE= no
##$SF= 250.13
##$SI= 32768
##$SIGF1= 0
##$SIGF2= 0
##$SINO= 400
##$SIOLD= 32768
##$SREGLST= <1H.CDCl3>
##$SSB= 0
##$STSI= 32768
##$STSR= 0
##$SW_p= 5175.98343685301
##$SYMM= 0
##$S_DEV= 0
##$TDeff= 65536
##$TDoff= 0
##$TI= <Analysis number 999999
Compound Code 99
Book Reference 9
Project Code 9>
##$TILT= no
##$TM1= 0
##$TM2= 0
##$TOPLEV= 0
##$USERP1= <user>
##$USERP2= <user>
##$USERP3= <user>
##$USERP4= <user>
##$USERP5= <user>
##$WDW= 1
##$XDIM= 32768
##$YMAX_p= 367766242
##$YMIN_p= -920785
$$ End of Bruker specific parameters
$$ ---------------------------------
##NTUPLES= NMR SPECTRUM
##VAR_NAME=  FREQUENCY,     SPECTRUM/REAL,   SPECTRUM/IMAG
##SYMBOL=    X,             R,               I
##VAR_TYPE=  INDEPENDENT,   DEPENDENT,       DEPENDENT
##VAR_FORM=  AFFN,          ASDF,            ASDF
##VAR_DIM=   32768,         32768,           32768
##UNITS=     HZ,            ARBITRARY UNITS, ARBITRARY UNITS
##FACTOR=    0.157963299565203, 1,           1
##FIRST=     4132.6476996994, 0,             0
##LAST=      -1043.33573715361, 0,           0
##MIN=       -1043.33573715361, -920785,     0
##MAX=       4132.6476996994, 367766242,     0
$$ Real data points
##PAGE= N=1
##DATA TABLE= (X++(R..R)), XYDATA
$$ [...]
23284A3105r3399n342J13543J06665j42071k16571o2292J90008J01563p3247m2433
23273a10471j1797j62209n3111R8077Q9842k1008J40790K11615q6115M2236M5667
23262A83516k9100n6888r5051N3633J07796K6045j77768P8704Q3383j2803K2328
23251A83795j50965M775j03432j5114J27306N4500J37781q9529j46431K6504P5911
23240A05101J1447L9250p5075p3988o4748j10832j66450N5914J03096j4847J9916
23229a71216R1697l2447m901Q6237J53250J35213l0406j78521L7606j1014q3203
23218g705j12565K28807K13910q9410K393K8607j03898j86367o353J80853l8740
23207A09532j9722J38788N7884N7323j61235o9732O941m6757L1556p8458o0858
$$ y = [13105, -80294, -85636, 27907, 134572, -7499, -224070, -286362, -96354, 5209, -68038, -110471, -122268, -284477, -337588, -239511, -149669, -170677, -29887, 181728, 95613, 137849, 183516, 154416, 97528, 2477, 56110, 163906, 189951, 12183, 90887, 174270, 161467, 183795, 32830, 37605, -65827, -80941, 46365, 100865, 238646, 149117, 2686, 29190, 105101, 116548, 155798, 80723, 6735, -58013, -168845, -335295, -279381, -176285, -191132, -171216, -79519, -111966, -116867, -30630, 122620, 257833, 227427, 48906, 86512, 75498, -7705, -120270, 108537, 322447, 233037, 235430, 264037, 160139, -26228, -32581, 148272, 109532, 89810, 228598, 286482, 343805, 182570, 112838, 119779, 73022, 104578, 26120, -34738]
23196c4738p4699K3883J03729k7648r715L0758k9961J48856o9657l5194j42655
23185a17041J2316l6638j77128J5525J8199j31773J25350L8740O7847l4653j2221
23174b31477r9020J03526j1913n1852N3139r4929n5543l863J20081J08666J82443
23163A9258N4182j03237j15362r2276P8188J46136O5685Q2832J1261k24513p0297
23152a48143k8615m7336l3683l3834J62083J75811J31733L1438k11486l11566
23142c13598Q8478P0843J33147O455J75816N6269k2880j59636R6100l4874q3614
23131A2506j95146P3097J34611Q9553j2207j5577l6207n2021R483j44310j4156
23120a50374M1103n313J5495P1157j6948k9714m4443J6816K16063M6801q5664
$$ y = [-34738, -109437, -85554, 18175, -9473, -19188, 11570, -18391, 130465, 60808, 25614, -117041, -104725, -141363, -318491, -302966, -284767, -416540, -291190, -252450, -184603, -219256, -231477, -330497, -226971, -238884, -290736, -237597, -332526, -388069, -391932, -271851, -163185, 19258, 73440, -29797, -145159, -237435, -159247, -13111, 52574, 135406, 146667, -77846, -148143, -176758, -224094, -257777, -291611, -129528, 46283, 178016, 209454, -2032, -313598, -225120, -154277, -21130, -14675, 161141, 217410, 194530, 34894, 130994, 96120, 12506, -182640, -109543, 25068, 114621, 102414, 86837, 50630, -1391, 8092, -136218, -150374, -109271, -114584, -99089, -27932, -44880, -74594, -119037, -102221, 113842, 160643, 74979]
23109G4979p8487J07801J03283q8791j7753o7011n4814l7822O3985n5690j0400
23098f0720J81251O8982j79631J2069J14579L5471m7775j67180j50135j66193
23088c59282J85023K2660k4341j2162m8990l2649J82803J53593N2462j04222p6813
23077f1918j86563j04205K44187P9029q7510r2743J54205P6370r4095L5243K447
23066c5553m3778k019j58597q0110o4073J81042J93721q3775j50667j93620J32563
23055c04866J10828J80362J37203n7681K0741J6199j4981N0339P7430n0375k8845
23044A36354o8901l0831J36159p2124o0160J19918o0169k32391K10274J84705
23034B62834K6123r6439j27760j0954Q4176L8772j24129J3268Q0499K4251j25985
$$ y = [74979, -3508, 104293, 207576, 118785, 101032, 34021, -20793, -58615, 5370, -50320, -60720, 120531, 189513, 9882, 21951, 136530, 172001, 124226, -42954, -193089, -359282, -174259, -151599, -175940, -188102, -237092, -269741, -86938, 66655, 119117, 14895, -61918, -248481, -352686, -108499, -29470, -116980, -209723, -55518, 20852, -73243, -38000, -35553, -79331, -81350, -239947, -320057, -384130, -203088, -9367, -93142, -243809, -437429, -304866, -194038, -13676, 123527, 65846, 86587, 102786, 87805, 138144, 215574, 165199, 136354, 67453, 36622, 172781, 100657, 40497, 160415, 100246, -132145, 78129, 262834, 288957, 192518, 64758, 53804, 137980, 176752, 52623, 65891, 146390, 170641, 44656]
23023D4656j15909n3365p5759j33636P9010J87895J52925J091m1384j67112M7744
23012g3844R9716M3802m1773J8669j16862q9817p0459p1552P5147J48267k8260
23001a06966m2106j5914J03682L7770N9891J15101L9328p7734J650N2247j6134
22990A50815o5035j58453m6541J27695o169o6947N7577O8836O7122P1120j07004
22979I3016o1993K44948k2593k78987q6554J69427k3914j01292L8085R452n018
22968b5423M5848N7182J66762L9418l52065o0149J64767J09224j4682k0779k76156
22957a66053N9624P8536N449J41751J33727J18890k2912j90026j43921j03096
22947h8031r9547Q3958r9636r7194K03717N4404j11443j41868Q7632N6733M8511
$$ y = [44656, -71253, -124618, -200377, -334013, -255003, -67108, 85817, 86908, 45524, -121588, -73844, 25872, 69674, 27901, 46570, -70292, -160109, -230568, -302120, -226973, -78706, -106966, -149072, -164986, -61304, -23534, 36357, 151458, 190786, 113052, 114702, 166949, 150815, 85780, -72673, -119214, 8481, 2312, -64635, -7058, 61778, 128900, 200020, 93016, 31023, 275971, 253378, -25609, -112163, 57264, 33350, -67942, -29857, -20405, -25423, 20425, 77607, 244369, 283787, -68278, -128427, 36340, 145564, 130882, 110103, -166053, -106429, -27893, -22444, 119307, 253034, 371924, 349012, 158986, 15065, -88031, -187578, -103620, -203256, -300450, -96733, -42329, -153772, -295640, -208008, -151275, -102764]
22936a02764J22589J00437j14163j29649J27060J37409O3258L3199j80855n0577
22926E944p5657l0353N0458K27561l2228n8731J0709o9987n8210j05805J64508
22915B8209m3412J01609m2952K4322j17113p3402j4519N7911K02680J39850P4258
22904C37441j19611k34085j37919J47292K99061J14484M4132j19171p5920r1111
22894A64593m8922P4967p050P3903P6238m2174j23346j20197J02037J50057j17667
22883A82439n1133J74098j09916k62229k27633J6459o0932P2686r4439o6011J27788
22872b98823M9723K09645J53304n0592j6739K6112K7498n6359L7202J60589J05520
22861C47080R2474k54912j69532J7315J55022p2051r054j35977p6004q1353J62147
$$ y = [-102764, 19825, 120262, 6099, -123550, 3510, 140919, 204177, 237376, 56521, 5944, -69713, -100066, -49608, 177953, 145725, 86994, 97703, 27716, -30494, -136299, 28209, -15203, 86406, 43454, 67776, -49337, -122739, -137258, -79347, 123333, 263183, 337441, 217830, -16255, -154174, -6882, 292179, 406663, 450795, 331624, 255704, 164593, 115671, 190638, 183588, 257491, 333729, 291555, 168209, 48012, 150049, 300106, 182439, 131306, 305404, 195488, -66741, -294374, -277915, -338847, -266161, -360600, -426611, -298823, -249100, -39455, 113849, 63257, 46518, 72630, 100128, 43769, 80971, 241560, 347080, 439554, 184642, 15110, 32425, 187447, 115396, 106342, -29635, -105639, -186992, -24845]
22850b4845P1876m5080k2617j79351J3399J19084J50425J84125o6609j96974j32004
22839a28571R9517J07698k12984o1061J46009J17407j53352O9167p8418J12335
22829A7747o1705k24388j01116J91325k4228r2462N106J27684k7984p1925l9277
22818c01223N4916K1512O4350k379L3664L8635n4036N7306M6838j00409j55470
22807b96296P4551J8300K7882Q1449j15724P3295L7454k2390j59339N032J34752
22796a41034N4277j18348n6996K14752L3945L6942N681n8476p6194R1050J10842
22785I6441J50953o8437j49884j20148j01344M8063P9057J218J03062J01862j22770
22774A8073j05622l6546M2431P9713K3411J03924j3237j09520j2500n3603J0416
$$ y = [-24845, 47031, 1951, -20666, -200017, -186618, -67534, 82891, 267016, 200407, 3433, -128571, -29054, 78644, -134340, -195401, -49392, 68015, -85337, -16170, -94588, 17747, -43958, -268346, -369462, -178137, -202365, -294827, -289721, -162037, -190021, -261946, -301223, -246307, -224795, -160445, -162824, -129160, -90525, -144561, -87255, -40417, -140826, -296296, -221745, -203445, -175563, -94114, -209838, -136543, -99089, -121479, -280818, -275786, -141034, -86757, -205105, -262101, -47349, -13404, 23538, 29219, -29257, -105451, -14401, 96441, 247394, 178957, 29073, -91075, -192419, -144356, -65299, -64081, 38981, 140843, 18073, -87549, -124095, -81664, -1951, 21460, 125384, 112147, 2627, -9873, -63476, -53060]
22763e3060L4842j47643o5685J81563K70460K1814J3145J7812q8816J00248j1309
22752B73371P5708Q7795R8013M4279r0993j64103j01866r7834j47350j24701K00679
22741E2998K066j68651O4961J14789J18939O0203o9448o2852j31043O3374n5159
22730i823k7552l3106p6166K793L2736J2941M737N67Q5073J9522n8384L8050J4681
22717F069j4596m7685N0130q4352q6344q4012J15885J62586N2342J30785O764
22706B07572K6581Q3859l2151J25066k73689q4360L9397N9173J38973n4503k32406
22695C512j02466k6389J45411J2287L0094N6004j52075q3858k26338J04599J81860
22684e7359J63940J06189q4477r465M8426J00202j33782J516L9848q8896k27227
$$ y = [-53060, -18218, -165861, -231546, -49983, 220477, 242291, 255436, 273248, 184432, 284680, 273371, 349079, 436874, 534887, 579166, 488173, 324070, 222204, 124370, -22980, -147681, 52998, 55064, -113587, -48626, 66163, 185102, 245305, 175857, 113005, -18038, 45336, -9823, -37375, -70481, -146647, -143854, -111118, -98177, -93440, -92873, -7800, 11722, -46662, -8612, 6069, -8527, -56212, -6082, -90434, -176778, -260790, -144905, 17681, 70023, 200808, 207572, 234153, 318012, 285861, 410927, 137238, 52878, 92275, 151448, 290421, 235918, 3512, -98954, -125343, 20068, 32355, 62449, 118453, -33622, -117480, -343818, -239219, -57359, 106581, 212770, 128293, 118828, 167254, 267456, 133674, 135190, 175038, 86142, -141085]
22673a41085j45148j69760m7002K59204K48522J44805k7564m4492n1132r2782
22663f6434r1475o7191N1963R5864N9638L9785n91J36995K0335q9777o4688j825
22651B2599K1865l513p6225j31751j15496K7557J28726K31392M6296j20116J8270
22640D9604J52163J6789j12001P19J10068R7102j23279J8026k8012p1383q7523
22629B2273j22979j30856L6809R3844K38835j36690k36962P1779o5441L5334J4728
22618a79326R2935K76585q194k21553j84639J01110K14470J8890o4340j600j2026
22607C2312N1769L2472J85980j425o5983j46804r8658L6325j03220j03315J73699
22596f848Q0216M1641J01942P0811R0914q5897J15517P295J8162K2192j63208
$$ y = [-141085, -286233, -455993, -502995, -243791, 4731, 149536, 121972, 77480, 26348, -66434, -157909, -225100, -173137, -77273, -17635, 22150, 21559, 158554, 178889, 89112, 24424, 22599, 44464, 40951, -35274, -167025, -282521, -254964, -126238, 105154, 151450, 31334, 49604, 201767, 218556, 106555, 107274, 217342, 314444, 191165, 209191, 181179, 109796, 22273, -100706, -231562, -194753, -100909, 137926, 1236, -235726, -163947, -229388, -194054, -179326, -86391, 190194, 182000, -39553, -224192, -123082, 91388, 110278, 45938, 44338, 32312, 84081, 116553, 302533, 301108, 235125, 88321, -10337, 25988, -77232, -180547, -6848, 73368, 115009, 216951, 287762, 378676, 292779, 408296, 415591, 433753, 455945, 292737]
22585B92737k1248j96131j64664N1256p809j00244o0142J28255M5852j34621J4579
22574a52180l2650L8338K5112J8432k831k4148k8683N6718M6208r6214J05278
22563d6620Q3038k8710O4259M3210J99763r2338j90158k490J38350j49176O2085
22552H1213j06364k22574m9763N5669Q5095m5821j31447k1335N8724Q0051l083
22541b19635o232J33668l5482q2688l5632r0150l3000M7997M4384O923K46058
22530b3789J51847J33070j37928k78628j12873J9494j0712k8376P7968J71843
22520c8084Q2705j41913q1393K26707K7910p8576O1862K751K6706O7642q4728
22509G1589n9184m0207j4543J02083K5733k12403j06335K22525K31876J24475
$$ y = [292737, 271489, 75358, -89306, -38050, -45859, -146103, -206245, -77990, -32138, -166759, -152180, -184830, -146492, -121380, -102948, -105779, -129927, -158610, -101892, -55684, -151898, -46620, 36418, 7708, 71967, 115177, 314940, 222602, 32444, 29954, 168304, 19128, 81213, -25151, -247725, -297488, -241819, -156724, -202545, -333992, -355327, -296603, -216552, -219635, -225867, -92199, -127681, -210369, -246001, -336151, -369151, -321154, -276770, -269847, -23789, 128058, 261128, 123200, -155428, -268301, -248807, -259519, -287895, -209927, -38084, 44621, -97292, -178685, 48022, 75932, -2644, 59218, 61969, 88675, 156317, 71589, 12405, -27802, -42345, 59738, 85471, -126932, -233267, -10742, 221134, 345609]
22499C45609n4014n9519p5337j68894J24033Q3600j07222l9438p5777J58343q51
22488A30533l5576j45347N4117m7544J16924N0157M6155O3308k023j58234L2171
22477A04641J793l5466r5322n0381m9640M0167k5807l221j25371j390M3558q1555
22465b77994j638K29521J11042R4716j2914k13684r9217M2330J17211M537L0651
22454B4561r2867M6922N0323k868K42081m7314n1133Q8720K9436k69896j51008
22443a33043j03711k0024Q2461q531J38719k5098m5903J4401N6100P593O9438
22432C2402Q9738n2006j05858N3356k9183k83k8132Q615J22860Q2048P6468q5150
22420A64875j47704o802n9060r2805M2435j76218Q8926J09565p6033k8114p2628
$$ y = [345609, 291595, 232076, 156739, -12155, 111878, 195478, 88256, 48818, -26959, 131384, 130533, 94957, -50390, 3727, -43817, 73107, 123264, 169419, 232727, 230704, 72470, 104641, 106434, 70968, -24354, -74735, -124375, -84208, -110015, -113236, -238607, -239997, -196439, -277994, -279632, -50111, 60931, 155647, 142733, -70951, -170168, -127838, -10627, -6090, 24561, -68306, -21384, 28939, 26071, 268152, 220838, 169705, 258425, 287861, 17965, -133043, -236754, -256778, -174317, -182848, -44129, -69227, -115130, -100729, -44629, -37036, 32402, 122140, 70134, -35724, 17632, -11551, -11834, -39966, -31351, 91509, 173557, 250025, 164875, 17171, 10369, -48691, -141496, -99061, -275279, -186353, -76788, -152821, -180935, -253563]
22409b53563j07939O2337J54880L2078l4941j95442J22515J33400J95700J88601
22399B97626j44973o5679l8577J00959K3230j05452J55968q7532l1087m4662J30362
22388A90183P7838o575l7555J3964q3016k32440j5584J52486O1136M8422j6062
22377A52797j76771N2935K1481l8266j13408J87309R0647p8293r7809k5116j7869
22366d2363k3378m158K1190K0562J26285J19041p9438p3720k0228M8879o214l9081
22354D7377O8440M4972m3796j57395j31271N2341J9728o5403j34900Q9280k2582
22343b33209k31081J89119J98135k5128o515N6613j16705j1602K16806J03132
22333A39565p5596O5123m5827k50944j26647K12729J80295J19132j12272j28133
$$ y = [-253563, -361502, -299165, -144285, -112207, -147148, -342590, -220075, -86675, 109025, 297626, 152653, 86974, 48397, 149356, 172586, 67134, 223102, 135570, 104483, 59821, 190183, 268021, 261446, 223891, 237855, 154839, -77601, -93185, 59301, 120437, 168859, 152797, -23974, 28961, 50442, 12176, -101232, 86077, 176724, 98431, 622, -24494, -42363, -65741, -69899, -48709, -28147, 98138, 217179, 137741, 64021, 43793, 92672, 86458, 47377, 115817, 160789, 116993, -40402, -171673, -119332, -99604, -165007, -299907, -210627, -233209, -464290, -275171, -77036, -102164, -108679, -52066, -168771, -180373, 36433, 139565, 63969, 129092, 83265, -167679, -294326, -81597, 98698, 217830, 105558, -22575]
22323b2575k8235J75103K98498k18951k36050p860O5546K8632K3709N8282K2749
22312A58848N1464j23305M160m9901j23859j62065Q2568k3963r3118K1706K3660
22301b33805J46783j3275j03993J8663O2905n5937j77721J2692J80319K26596
22291F3227J8331m1237q4329J6276J14623n8866n6160Q3530J15983n6824J13611
22280B28165q621j45890j22699l5368o9911J21135K54940p9605o4094j17323j0858
22269e0129K0957K01830Q4469j43721K0904N7935l5847O7958p5323j10736j58155
22258a19858n88J15594J55855l021r2195L970j36204Q2501m174q8285J44063M1957
22246I9615J7366q0523K7368r6244j11598Q1809J23219K3796J38400J14759j42638
$$ y = [-22575, -50810, 124293, 422791, 203840, -32210, -40070, 25476, 54108, 77817, 136099, 158848, 210312, 87007, 91167, 41266, -82593, -244658, -162090, -186053, -279171, -257465, -233805, -87022, -100297, -204290, -185627, -122722, -178659, -356380, -343688, -163369, 63227, 81558, 40321, -44008, -27732, 86891, 28025, -28135, 55395, 171378, 114554, 228165, 219544, 73654, -49045, -84413, -154324, -33189, 221751, 142146, 78052, -39271, -50129, -29172, 172658, 257127, 113406, 134310, 192245, 156398, 224356, 149033, 38297, -119858, -120446, -4852, 151003, 147982, 55787, 59757, -76447, 6054, 1880, -86405, 57658, 99615, 116981, 36458, 63826, -32418, -144016, -62207, 61012, 84808, 223208, 337967, 195329]
22235A95329k31122j11561J10684j6788M3695p0673j678M1463j85392J02533J04021
22224a9489n7203Q3680J10908O6755K701O8540p2954l6802q1754j10554P0400
22213B4228l007m0071q276j98365j19375P0685J76224R8765k733j8300p648l2968
22201f0841J3931J95192n7283M5688N3162N0312l3381m7355K7933o0933p5485
22190E0940P3154n0345P8927r0828N159K37050j69573l664k4274q06l3988l3496
22178C8256k087L6628k521j44876K6890M0926J08620n905k2196k58977n4180L2310
22166b07112J35114J17779K9110J19138j51221l2642r9521j00239J6196L969L7040
22155a32389K66498J48732n6956j33421k8409K4237O2659J6635n6022R1693N0921
$$ y = [195329, -35793, -147354, -36670, -53458, -9763, -80436, -82114, -40651, -226043, -123510, -19489, -76692, 6988, 117896, 184651, 187352, 255892, 182938, 146136, 64382, -46172, 24228, 21221, -18850, -27126, -225491, -344866, -274181, -97957, 808, -1925, -20225, -27873, -60841, -46910, 148282, 90999, 136687, 189849, 240161, 206780, 159425, 187358, 126425, 50940, 124094, 73749, 152676, 61848, 67007, 304057, 134484, 130820, 106546, 105740, 71752, 38256, 36169, 72797, 70276, -74600, -47710, -6784, 101836, 95931, 73735, -185242, -239422, -207112, -71998, 45781, 74891, 194029, 42808, 10166, -89355, -189594, -173398, -169429, -132389, 134109, 282841, 225885, 92464, 64055, 88292, 150951, 167586, 111564, 203257, 254178]
22144B54178L7833j19430n3191l1488j17092R0830J39700P1580j20103j71751
22134a8934n7572R0427Q0601j16409n5765O7767j21218j1630M5568m4182J18529
22123b2818K73245j07620j46390m4936N5199J5021j74814p7148Q6319M0500J0382
22112i3060M7118l9919n669q2593r3167R9209n8793M4883J27920Q6508q5537j7454
22100g0554L3922j1374k0568M976j11915j08225J3608p1420J07304K03208q2727
22089a13765K4187J26856p6593l9838k7323J31569N6888L6722j67087o2803q4114
22078a95301M3095K63354K592k42622p5622L0551j4859j72545J39534O0284O4101
22067i7438l732k9139L0928L9327K1189n6261n2112Q7938J1678N1393O8751n7147
$$ y = [254178, 292011, 172581, 119390, 87902, -29190, 61640, 201340, 272920, 152817, -18934, -76506, 13921, 94522, -21887, -77652, -9885, -131103, -142733, -97165, -141347, -22818, 250427, 142807, -3583, -48519, 6680, 21701, -153113, -230261, -143942, -103442, -93060, -45942, -85861, -91530, -174123, -267290, -168081, -226874, -181991, -54071, 32437, -53100, -70554, -36632, -48006, -68574, -63598, -175513, -283738, -270130, -341550, -234246, -31038, -113765, -89578, 37278, -39315, -79153, -106476, 25093, 81981, 118703, -48384, -111187, -195301, -152206, 111148, 113740, -128882, -204504, -173953, -188812, -361357, -221823, -161539, -97438, -101170, -130309, -99381, -60054, -38865, -95126, -147238, -59300, -47622, 3771, 72522, 15375]
22055A5375j26472j0407J44285O5843L7962L9200j29209J7632K4n9796P2973J25799
22043A93209r8185l6964m2194n216J7504p1651k9699j08047J49040K47647r7902
22032A17542l4879l0949r8733p7658O7441J08901P4840l0989o4588l0157j81000
22021a80229j37021m2590J29892K9189J03171j3932k4358O5743o8039r3543J26571
22010a05146N7605J2789J09960R0250j45149K6455l1085j47346O7839J68450j080
21999A03542Q335n8034p215J00846l1262j88676j33765j03215J49201J56364j8349
21988b2228m6830J25921o7282m9590j5483K9957J98446M2656j49840k14767n2046
21977b21086p758L1436J26770J2575L8527L907r297q9897o2227J95926J79454
$$ y = [15375, -111097, -121504, 22781, 88624, 126586, 165786, 36577, 54209, 54233, -5563, 67410, 193209, 95024, 58060, 15866, 10650, 28154, -43497, -73196, -181243, -32203, 215444, 117542, 82663, 51714, -47019, -124677, -57236, 51665, 126505, 95516, 30928, 771, -180229, -317250, -359840, -229948, -200759, -97588, -111520, -135878, -70135, -138174, -231717, -105146, -47541, -34752, 75208, 165458, 20309, 46764, 15679, -131667, -63828, 104622, 103542, 111877, 53843, 46628, 147474, 116212, -72464, -206229, -309444, -160243, -3879, -22228, -69058, 56863, -10419, -60009, -75492, -45535, 152911, 195567, 45727, -169040, -221086, -228844, -197408, -70638, -58063, -19536, -15629, -24926, -114823, -177050, 18876, 198330]
21966A98330j82517k40133O5080K01071J40457k0690j10227J5781K18911J53655
21956D39718j44368m5071M8141r1825n9199M83m0958l9555j37793j6699K24637
21945A37511N7089j41518r9830k9813J6193j2548N3550n2343l339p0649M2439
21934a03258j18938N4000n2536k5103Q5981J62071K5749k4183M71q9159q6434
21923a71339p5147J83852m1416k1624O6323L4262P275j05037j29446L0158o426
21912b28565J22870K41492j47261j93394J8350J78552o490N0455L007p6185k66882
21901c04051J1830L18793j2500n8010j30721L4881q2167r4890J14050m8614L1718
21890b19681J51367j08890k7877M06K8868J46812R1489l8586o2769L87J8326l6385
$$ y = [198330, 15813, -224320, -159240, 41831, 182288, 161598, 51371, 67152, 286063, 439718, 295350, 250279, 298420, 206595, 147396, 147879, 106921, 67366, -70427, -87126, 137511, 194600, 53082, -46748, -76561, -60368, -72916, -19366, -71709, -75048, -145697, -103258, -222196, -168196, -220732, -245835, -159854, 2217, 27966, 3783, 4254, -84905, -171339, -246486, -62634, -104050, -125674, -59351, -25089, -17814, -122851, -252297, -222139, -228565, -105695, 135797, -11464, -204858, -186508, -7956, -14446, 36009, 39016, -37169, -304051, -292221, 26572, 14072, -43938, -174659, -139778, -221945, -316835, -202785, -251399, -219681, -68314, -177204, -205081, -204675, -175807, -28995, 62494, 23908, -38861, -38474, -20148, -56533]
21878e6533r5325O5306Q9051j31524q3947L0388K04080J91644k2389J08942L2040
21867C31733j69016j63214n3971K16451n0757n0176J8814m358J1300j42350n7807
21856a13351J37020o4941l8143r6612J02261J14181O287m5752j9893L1330o7077
21845e4690J47448J9650p0691j04568l2064n1322J40995J72882j04173q9143j4072
21834c9748Q153P3254L9694m1211j89152m0584q6179N4067j00018P0018M3450
21823b08256J8369R3838k0203R4763P5099K29032R943k02596p1676o9150j96363
21812b47200J36962K31569n145J04345P4523r2078P107M3048r9344k51488j47201
21801b44902k665M5008K15259J50298m2229k95546p5565k3461J47928J67143j9280
$$ y = [-56533, -151858, -86552, 2499, -129025, -212972, -182584, 21496, 213140, 190751, 299693, 331733, 162717, -497, -54468, 161983, 111226, 61050, 79864, 75506, 86806, -55544, -113351, 23669, -41272, -79415, -176027, -73766, 40415, 46702, 950, -18943, 12387, -54690, 92758, 112408, 41717, -62851, -94915, -146237, -5242, 167640, 63467, -25676, -39748, -31595, 41659, 81353, 40142, -149010, -189594, -275773, -221706, -321724, -251706, -208256, -189887, -96049, -116252, -21489, 53610, 282642, 292585, 89989, 18313, -50837, -247200, -110238, 121331, 116186, 220531, 295054, 202976, 210083, 253131, 153787, -97701, -244902, -247567, -202559, 12700, 162998, 120769, -174777, -250342, -273803, -125875, 41268, 21988]
21790B1988p0998j05025j6614o7670j7797J25686M3676q474k3341j10818k762
21779b32149J28458P8229O3826n7684m8776J32J20424P3298m8538l0971j04710
21768e8461L2875k5369M0356K47P1805L8857J1218j07293j31160K2469N7755j22927
21756a69628j5229l7000m7242k8989R3389J59325k6976N7409j26768q4077J15437
21745a10349j7145Q8849J06598m0791m2393J08735O985j08751o8762j77981o9027
21734c24032j8610Q5889r7030L5963J16915n4280m2093J63206R984N9645o3434
21723a27877l5372M9529J66827K5042j94076j07295M7299L1246p800o4375J13760
21712a03092J48912Q0338k17565J8232J20274P0615j55975J19618Q3149p1964
$$ y = [21988, -49010, -154035, -170649, -238319, -256116, -130430, -86754, -95228, -118569, -229387, -232149, -103691, -25462, 38364, -19320, -68096, -67964, 52460, 125758, 77220, 46249, -58461, -25586, -50955, -10599, -10352, 61453, 100310, 111528, 4235, -126925, -104456, -46701, -169628, -184857, -221857, -269099, -298088, -204699, -45374, -72350, -14941, -141709, -225786, -110349, -127494, -38645, 67953, 27162, -15231, 93504, 100489, -8262, -77024, -255005, -324032, -342642, -256753, -353783, -317820, -200905, -255185, -297278, -134072, -124088, -64443, -127877, -163249, -113720, 53107, 78149, -115927, -223222, -175923, -144677, -152477, -216852, -103092, 45820, 126158, -91407, -73175, 47099, 117714, -38261, 81357, 164506, 92542]
21702I2542R4121J40823j40987j02036J0014J41434r5889P028p3305l6930J19122
21691A55937m3547l5213j41138M6693J56267J05537J8740L4585m2567k11208k32343
21680a88257P541J08775J45401K2424j37445j6599q5936J30639R9452k51678l5435
21669b01118K81349N6135k16072K1724j7374M6790j8095J7008K936m4205m3607
21658a14529P8675J20557J3641j15728n0189j3483J06477J06475l3314p2722l3787
21647g927Q139k807N7921l4416Q1322q7316q2523l6976J7326M9021R7473M0688
21635I9925N3072o7903k11737j78536K9992J64781l9040N2674Q9333J5116K1891
21624B9568J19933j01411j16841k5762n8745J43059K5009k01079m2595J07813
$$ y = [92542, 186663, 327486, 186499, 84463, 94477, 235911, 140022, 147050, 73745, 36815, 155937, 112390, 77177, -63961, -17268, 138999, 244536, 263276, 297861, 255294, 44086, -188257, -180716, -71941, 73460, 95884, -41561, -58160, -144096, -13457, 85995, -165683, -201118, 80231, 136366, -79706, -57982, -75356, -28566, -46661, -29653, -26717, -70922, -114529, -35854, 84703, 98344, -17384, -67573, -81056, 25421, 131896, 98582, 25860, -7927, 212, -2595, 55326, 20910, 102232, 14916, -67607, -104583, -87257, -38236, 59237, 99925, 152997, 85094, -126643, -305179, -275187, -110406, -149446, -96772, -7439, 7677, 29568, 149501, 48090, -68751, -94513, -153258, -10199, 14810, -186269, -228864, -121051]
21614a21051Q5504J55265M1562P331k17279q162K5828J61747P4871m7566j28007
21603C0043K7577J18518n4342k6413M9759J9847M9805o9979j59490K23698J673
21592B10696j23495r4131p7881J7880R5086j0792j05997J42037M4956M3025J99506
21581C40890O1636k894N9802j32275r4138m5549p8423o9582k4945j46273l3644
21570a65395M8063O1690Q6925O8495n121R9224n0321j71491M3293r0982Q3917
21559H297J1893j4517K3082J00582j15367p6505k8132J19729r184o4640r5874
21548a40636J29021J23836P8002K8577N4901r4698j10924j4647j4257j8343p7519
21537e6687n9654J2480N0126r5250O5066m9779n880j54460j28888K3969N6392
$$ y = [-121051, -35547, 119718, 161280, 168611, -48668, -56830, -31002, 130745, 205616, 158050, 30043, 57620, 176138, 121796, 95383, 145142, 164989, 214794, 144815, -14675, 209023, 210696, 87201, -6930, -84811, -66931, 28155, 17363, -88634, 53403, 98359, 141384, 340890, 402526, 399632, 459434, 327159, 233021, 187472, 109049, 39467, 14522, -131751, -165395, -117332, -55642, 31283, 99778, 94657, 193881, 143560, -27931, 15362, -75620, 8297, 20190, 5673, 28755, 129337, 13970, -62535, -90667, 29062, 19878, -44762, -140636, -11615, 112221, 190223, 218800, 273701, 179003, 68079, 53432, 39175, 20832, -56687, -116341, -103861, -53735, -148985, -83919, -133698, -139578, -294038, -422926, -398957, -342565]
21526c42565J29666J13179O7214J12664m8926k38786L6849j1429J2204P380l9457
21515b02007L4660L8385k554P3353j50533m6521o863j34115j0238J86789J66297
21504e3347K42201o5736j23704L3412n0163J31980j19608o3455Q3849j5878k8036
21493b8485J74554j0996j17912J7404q101m7830m3527L04834J10089o6419r1862
21482A91749K6772j11247j5972j73740o8198M0414o175O9121k4242j24790P5910
21471a20398J08341n446J6440q7959j0583m1614O646Q7590r9616M4131N4211P7664
21459B9407p801j35730M8258P9562Q2885m7851j7689j07446r3769K17143J60306
21448B07275K2948n8876k57021j69325J7123J01427m6280k4957J27766J49457
$$ y = [-342565, -212899, -99720, -32506, 80158, 31232, -207554, -170705, -182134, -169930, -162550, -202007, -167347, -128962, -131516, -58163, -208696, -255217, -262080, -396195, -406433, -219644, -53347, 188854, 123118, -586, 32826, -17337, 114643, -4965, -68420, 15429, -449, -28485, 146069, 135073, 17161, 34565, 26464, -21366, -64893, 239941, 350030, 283611, 191749, 218521, 107274, 91302, -82438, -150636, -110222, -116397, -47276, -71518, -196308, -120398, -12057, -17503, -1063, -89022, -99605, -141219, -134573, -46983, -146599, -102468, -48257, 29407, 21606, -114124, -65866, 13696, 96581, 48730, 31041, -76405, -170174, 46969, 207275, 230223, 171347, -85674, -254999, -237876, -136449, -182729, -207686, -79920, 69537]
21438F9537K0812J13104J7407j04145j0183j67060O9284n5780n1617R2557p8621
21427h4705P996N2936J41364k9835r8890j5895j4640P884j7704o2919L7345O1564
21415a5499q4274j02524q4261J30517o963k32508K01412K57079M7087O0137j1280
21404A58923Q0188M2399R5136n1463l6026N3401r1421p1456N6428n1414o7954
21393A16741j17512j0417J04694l7658j22614N0523J50855r9385M6492k0834k26483
21382a65598l0438O4570J22802M5058O0155J76909j35904k37943l7321J76913
21372C9203K7741j39436j10955k4521j9839j29231Q8663J19861j9956J00947K2746
21361d4777P7703P5544M5743j2498P743j7214n6478j98138K1676J30872L13837
$$ y = [69537, 90349, 203453, 220860, 116715, 106532, -60528, 8756, -47024, -98641, -6084, -84705, -76709, -23773, 117591, 87756, -11134, -27029, -41669, -33785, -51489, -114408, -77063, -15499, -99773, -202297, -286558, -156041, -163004, -395512, -194100, 62979, 110066, 170203, 158923, 239111, 281510, 376646, 325183, 289157, 342558, 251137, 179681, 236109, 184695, 116741, -771, -11188, 93506, 55848, -66766, -16243, 134612, 35227, 81719, 60885, -165598, -196036, -131466, -8664, 36394, 96549, 273458, 137554, -100389, -137710, 39203, 66944, -72492, -183447, -207968, -227807, -357038, -268375, -148514, -168470, -67523, -44777, 32926, 108470, 154213, 141715, 149458, 132244, 75766, -122372, -100696, 30176, 344013]
21350C44013P1799j41661j76807p8099k30285M1563J66759j33767K8881K4686
21340h2918l3093n4527R8921J7871p3419l3663Q6952J0838L8424p9034L0515L1194
21328d1939J7654O1830M1572O2186J04691K1803r7415j94291j30028J59319J94093
21317A99475J68555r8235j55326n8707n6793k71873j73490K420J60665L2151J18111
21306a33047J2460m0528J59863J91406j12678j98162J20768M5607K096j6559k14029
21295a82803j83422J14531J14021O0494J43561l5001j05020l8509p1588L9213
21285a44523r7964R3130K64197n5498J1214j09522l33832r8481K44073J36669
21275i0537J11445P7975q4824o4434L555J30446J8433j26618j9481M9315l478
$$ y = [344013, 415812, 274151, 97344, 19245, -211040, -169477, -2718, -136485, -107604, -82918, -116011, -170538, -71617, -53746, -127165, -160828, -73876, -63038, -24614, -103648, -73133, -41939, -24285, 37545, 79117, 141303, 245994, 267797, 170382, -23909, -153937, 5382, 199475, 368030, 269795, 114469, 55762, -1031, -272904, -446394, -443974, -283309, -251158, -133047, -120587, -161115, -1252, 190154, 77476, -120686, 82, 45689, 47785, 31226, -182803, -366225, -251694, -137673, -77179, 66382, 31381, -73639, -112148, -183736, -144523, -242487, -149357, 114840, 59342, 70556, -38966, -372798, -471279, -227206, -90537, 20908, 98883, 14059, -50375, -46820, 83626, 102059, -24559, -44040, 5275, 1797]
21264A797q6495O508k5551l7630J32001L9794m0186J53306L8902L5950O1182j74203
21252A05375k38025m7645J23409O8245J00768K840J73339k606M9270p884q3438
21241B43648j41014J12998L0552K3554q6944j65811n0763M462p8866Q740J89593
21230I0149J52462k6596p2958j19931J9006l1028l0198j6133Q1124p0972l3829
21219e8904J25129l310o7832R0303J66004m8126k61362k27079K4736O3543P3524
21208a23374l9936O6712M1848p4147J09827N4846j7737M5209m2963r4967j9377
21197i4059m6124j34632M5935j04395J0316J06971K60493J01801j14543J33455
21187A65218L4728m4589j55860m8143O1485O5552j93144O8960L0291j46033j18964
$$ y = [1797, -84698, -78190, -103741, -141371, -9370, 30424, -9762, 143544, 182446, 218396, 279578, 105375, -132650, -180295, -56886, 11359, 112127, 114967, 288306, 285700, 334970, 327086, 243648, 102634, 215632, 246184, 269738, 182794, 16983, -33780, -29318, -108184, -99444, 90149, 242611, 216015, 143057, 23126, 42132, 11104, -19094, -35227, 45897, -25075, -58904, 66225, 62915, -4917, 85386, 251390, 203264, -58098, -285177, -260441, -196898, -123374, -163310, -96598, -54750, -128897, -19070, 35776, 18039, 63248, 20285, -74682, -94059, -140183, -274815, -228880, -333275, -322959, -215988, 44505, 146306, 31763, 165218, 199946, 155357, -503, -48646, 12839, 78391, -114753, -45793, -15502, -161535, -280499]
21176b80499j26686K4976J20504j46060o0871J13333J23435o6049Q341l6797P5467
21165b50906J88198J32576m9297j07072n9651M0096l2790n6623j26006P885J13237
21154b00353J04200R2855m4528k3327J02083K3891L01514R4281j27097j96140
21144A27379q5781q1456j74423K0084O2777P9125L6894r114j71625J41160J88931
21133A33951r7755j37752K9912J2109J09777P5153j12240p5702n7608j08048L4437
21122a93766J58477L0924n5685O0195J29300r2270K5216m8318o5827O0697L6860
21111D5803l0835l0754J48733Q0334j39448j73336J481L4024j34385N6722J11087
21100c0574o1419q95o6382O6972r2389P9762K407l0331p8287O525j2115R2311
$$ y = [-280499, -407185, -382209, -261705, -407765, -468636, -355303, -231868, -297917, -289576, -326373, -250906, -62708, 69868, 20571, -86501, -146152, -106056, -138846, -195469, -321475, -313590, -200353, -96153, -3298, -47826, -71153, 30930, 54821, 356335, 450616, 323519, 127379, 41598, -39858, -214281, -194197, -131420, -52295, -15401, -24515, -196140, -54980, 133951, 36196, -101556, -71644, -59535, 50242, 125395, 13155, -62547, -120155, -228203, -193766, -35289, -4365, -60050, 145, 129445, 37175, 62391, 14073, -51754, 8943, 45803, 14968, -15786, 132947, 213281, 73833, -99503, -98022, -63998, -198383, -141661, -30574, -91993, -92888, -159270, -92298, -184687, -104925, -102518, -132849, -211136, -204611, -216726, -124415]
21088a24415K82253Q6038r3550j86479n202n3196j5541j59206r1959J07368Q6939
21077a66950P8826l6996J88614J7365k785L7255K4709N5022m0498j0418J5770
21066A59914j45918o0655J42892J00839M7402j49370n6863N1651j63976l9798
21056a13882l4815J50808J20063j39039O6789M3559p3764O8385J58605o2473j24622
21045E9614r202J01235O634j06335j78273J46557J31462r4816J2120L952j23364
21034e0416r9403M3441J54993J44789L5407M7820j67890R5721O875K9858j23964
21023A17231j65220m8616O9977J33874m1381o7711J16644p8251j58945j5420O2166
21012g5652M6169K4682n7683j09630j29444j070j03237O6759J08075l1744O9833
$$ y = [-124415, 157838, 243876, 150326, -36153, -41355, -94551, -110092, -269298, -361257, -253889, -166950, -88124, -125120, 63494, 80859, 78074, 115329, 140038, 195060, 154562, 144144, 159914, 13996, -46659, 96233, 197072, 244474, 95104, 38241, 89892, -74084, -113882, -148697, 2111, 122174, -16865, 49924, 93483, 19719, 88104, 246709, 184236, 59614, 50412, 151647, 158281, 51946, -126327, 20230, 151692, 56876, 68996, 72948, -50416, -149819, -106378, 48615, 193404, 228811, 276631, 108741, 204462, 211337, 241195, 117231, -47989, -96605, -26628, 107246, 65865, -1846, 114798, 36547, -122398, -137818, -75652, -29483, -4801, -62484, -172114, -301558, -302628, -405865, -339106, -231031, -262775, -192942]
21001a92942J33428q848j35731n3576N5346K2589M8717L0057K06994o7738N0198
20990H8494M4780j02897j68887K4017J39828J71439j65742l8846J61923K09102
20980C63211J6290n3695r1244k9239J3552Q8497j61013K18247J03089k34140j35952
20969I7603j40385O625r7332j9698q6541O8933L5621P2199J07745j31906j15758
20958b02894J53320m4781j58748M2469R4742M0220L8785R0981K6987j45188L4848
20947b9259L4901N7364R252M0299K13928o0209j70743j30596q0957j70281J68608
20936a17693L14286Q4246j24306j61366l0526l1720R9445K08278J79325r5957
20926C24012k09819j4019O6262j93449k27152J89202N2643J09057j1578m4623
$$ y = [-192942, -59514, -68362, -204093, -257669, -202323, -179734, -131017, -100960, 106034, 38296, 88494, 133274, 30377, -138510, -114493, 25335, 196774, 31032, -7814, 154109, 363211, 379501, 325806, 234562, 205323, 218875, 307372, 146359, 364606, 467695, 233555, 97603, -42782, -36157, -133489, -153187, -239728, -170795, -135174, -62975, 44770, -87136, -202894, -49574, -94355, -253103, -210634, -115892, -75672, -36887, 54094, 81081, -64107, -29259, 5642, 63006, 72258, 112557, 326485, 266276, 95533, -35063, -116020, -286301, -117693, 196593, 280839, 156533, -4833, -35359, -67079, 32366, 240644, 419969, 324012, 114193, 100174, 166436, -27013, -254165, -64963, -12320, 96737, 85159, 40536]
20916D0536L6554J78697l1907p3817n4180l0155j75859k32178M4920J92381K2070
20905h2938m4917O464n1293K04769k2521n4082L2098R128J44998m0366j58188
20894e6848q7373J30492J0799Q922J15983j4678O5916k9998r5768l5311l6421
20883b4285L6525j07702J159Q5610p511k9935J42455J39976k2687K4778k27004
20872A1379O1099k1108N1173J90016k1307r9654j62583p7644N9323q9776J78854
20861G9772J00394k9509k53k1168p4582J7373l8973j45140j49676K1643J61934
20850g8185N4572k4792j4195k9619R3695M7486j4130j23834j04241Q38K38167
20839D5762R954m8940L70L4570K7981m9253n8129M5893j20798J5505M6914j9301
$$ y = [40536, 77090, 255787, 223880, 150063, 95883, 65728, -110131, -342309, -297389, -105008, -82938, -127855, -121391, -172684, 32085, 9564, -44518, -12420, -3292, 141706, 101340, -56848, -144221, -13729, -2930, 5992, 121975, 107297, 173213, 143215, 47447, 12136, -24285, 12240, -95462, -94303, -8693, -16204, -46139, 96316, 236292, 213605, 238383, 11379, 72478, 51370, 102543, 292559, 271252, 171598, 9015, -68629, -9306, -99082, 79772, 180166, 150657, 150404, 129236, 54654, 72027, 33054, -112086, -261762, -240119, -78185, -23613, -48405, -62600, -92219, 1476, 48962, 34832, -89002, -193243, -192405, 45762, 55716, 6776, 7146, 41716, 69697, 20444, -37685, 8208, -112590, -97085, -50171, -69472]
20827f9472L2119n3122Q7830J8749J52560M4841L9793k28733j66300J09025J80505
20816A47795K5181L4522k9664j27004j29472N2482Q1308P4126j26452j16230m5730
20805a59138m6218j418J34047J38455l202k29761K3178K18206J40033K925j94313
20794B2794j55232K4658Q2424J2490l4817P3256k4412l7555J52683J6249n7284
20783G5254J18726J78772q6584J22611n2834q0268j10155j11284j11125l0806
20773h7693J46772j47309k9055K02165K0895j0259j32729j45049r0081J38279
20763a34064J22076l7991K6410m6083j03374k2235j59210j10168J68551J34331
20753a61757J24719Q8604k9923Q066L0402k27760k14581N9066M2536K95722J57085
$$ y = [-69472, -37353, -90475, -2645, 16104, 168664, 213505, 253298, 24565, -141735, -32710, 147795, 172976, 207498, 177834, 50830, -78642, -26160, 55148, 129274, 2822, -113408, -159138, -205356, -206774, -72727, 65728, 62526, -167235, -144057, 74149, 214182, 217107, 22794, -132438, -107780, -25356, -12866, -47683, 25573, 1161, -36394, 116289, 132538, 75254, 193980, 372752, 286168, 408779, 355945, 275677, 165522, 54238, -56887, -87693, 59079, -88230, -117285, 84880, 105775, 95516, -37213, -182262, -272343, -134064, -11988, -49979, -23569, -69652, -173026, -195261, -354471, -464639, -296088, -161757, -37038, 51566, 21643, 29709, 60111, -167649, -382230, -323164, -280628, 15094, 172179]
20742A72179L0023l3848n8944K3446k8500k3959m5309l4212j16200O350L3642
20731g5332M46J19616J56034j09697j33920O2478L0098l245M1835J25003J7307
20720B30623j45190r222l9015j15749m3055N1055J61784J54591m817k13190j44835
20709a17020J13724K60687k1731j98448m0929k7965n8077j31921j99078J89440
20699b31318J50352N5566K9449L5152J5074j02922J8469J13138q7669J49730N8908
20688B03929j19631L225R9546o3621j28317J3707L7386Q749J21559m1286n4171
20677H1075J5819o6800k9171J24583j33940r5171M8410J54262m4967j13734r118
20666f8752R6261K0724N5727O3263K897j70092j09641k2598n1940j5088J75974
$$ y = [172179, 202202, 168354, 109410, 132856, 104356, 80397, 35088, 876, -115324, -108974, -75332, -74886, 44730, 200764, 91067, -42853, 19625, 49723, 46478, 88313, 213316, 230623, 85433, 76211, 37196, -78553, -121608, -70553, 91231, 245822, 241005, 27815, -117020, -3296, 257391, 235660, 37212, -3717, -31682, -89759, -221680, -420758, -231318, -80966, -25400, 4049, 39201, 54275, -48647, -30178, 82960, -4709, 145021, 203929, 84298, 87523, 187069, 123448, -4869, 8838, 46224, 54973, 176532, 135246, 81075, 96894, 30094, 923, 125506, -8434, -103605, -55195, 99067, 54100, -59634, -68752, 27509, 48233, 103960, 167223, 170120, 28, -109613, -132211, -184151, -199239, -23265]
20655b3265R3664l2164n8687k0703p3538L1440K5360O4494R5396j45593k2174
20644f5770m7951R9255R5340j08345k600J72886p8291R2643J48193j67434k55761
20633a17835j44660K9740L9141J08222K53351R5465j57860o7712o2186l9181p4073
20622a37588r9840M6512l9737R5937N4538n527O0055O2709n0916k63875j36025
20611d13757K12170J12647J19671j5883m6600p1742M3881P7246Q4623O8213j24492
20600D5977q156J32093j3890r7095j0992n6368O7516j5772K3378M9301L9907j19310
20588C6589j85934j7012p7609M5901J6695K5908k5673K7131n2202N1459J24674
20577c0073N3087m3222r9821K3168K00875J11202j35176l6417J25295M7228m194
$$ y = [-23265, 70399, 38235, -20452, -41155, -114693, -83253, -57893, 6601, 101997, -43596, -65770, -113721, -14466, 80874, -27471, -30071, 142815, 64524, 157167, 305360, 137926, -117835, -262495, -232755, -193614, -85392, 167959, 263424, 105564, 37852, -24334, -63515, -137588, -237428, -190916, -230653, -134716, -80178, -85705, -25650, 37059, -13857, -277732, -413757, -201587, -88940, 30731, 14848, -31752, -103494, -59613, 17633, 102256, 170469, 45977, 37821, 169914, 156024, 58929, 47937, -8431, 59085, 43313, 66691, 115992, 155899, 36589, -149345, -166357, -243966, -198065, -181370, -155462, -181135, -154004, -206206, -154747, -30073, 23014, -20208, -120029, -96861, 104014, 215216, 80040, 43623, 168918, 216146, 211952]
20566B11952j83696O1023k3363r5646j74767J08403N5283J84996L3901q3347k6874
20555F7865j4652K19436j43974j18587j04447K8019P5499P5029p2971J9805r7716
20544f6694K5676L8686n1608l3191J37568o619l5311P1809J37400L0841n9003
20533A89554j44867j49659q9315J83734J03066j43729j33903k5013R652M9128
20523a51352J68890J19903k141p2183n3078J6804j1334j15369j66434J52217J01215
20512a2862j17244R9313L910J0696M7328N3733J85684r8177k41991K1955M1914
20501e741o5778q297m6530J9571J44392J3838m0077J7579j06477j08738j31516
20490c17774M3559o2516J66893J6680L4235j4346j5342j35728j14585K3893O0739
$$ y = [211952, 28256, 89279, 65916, -29730, -204497, -96094, -40811, 144185, 178086, 94739, 67865, 53213, 272649, 128675, 10088, -94359, -66340, 9159, 84188, 11217, 31022, -66694, -41018, -2332, -53940, -87131, 50437, 43818, 8507, 80316, 217716, 248557, 189554, 44687, -104972, -194287, -10553, 92513, -51216, -185119, -210132, -200480, -151352, 17538, 137441, 135300, 63117, 10039, 26843, 15509, -99860, -266294, -114077, -12862, -130106, -30793, -26883, -16187, 31141, 84874, 270558, 172381, -69610, -47655, -5741, -71519, -79816, -126346, -106775, 37617, 51455, 11378, 28957, -77520, -186258, -317774, -274215, -336731, -169838, -153158, -118923, -133269, -148611, -284339, -398924, -375031, -314292]
20479c14292J98096K03489k2023l1479K5452j6408l9354r3938J29491J64628K00921
20468D04583J18413j22505k00957j42319q418r4368l4417R1843m8768q7302L359
20457a20856J11961M171o8554q333m2593j6460J38059K2924l5194J15062n6665
20446D3522r2619J19210R5609m4836j68672J17037L4277k3426k09496n938r30
20435a36262j7805n9039K9685Q1243r6646o1551N5724J32506O3765K9939P0567
20424I2126J1281l9829J29713P9371q4090n5036M9866n5951j21902J70872J36864
20413C13285k14002L8758J06400q3130j33781q8063o0748n9310J20638j29845
20403a89798K2983P9772j7810Q444j2072J73441j24086q1620O6173R634J5432
$$ y = [-314292, -116196, 87293, 65270, 33791, 59243, 42835, 3481, -90457, 39034, 203662, 404583, 522996, 400491, 199534, 57215, 48797, -45571, -79988, 11855, -36913, -124215, -120856, -8895, -4724, -73278, -81611, -124204, -140664, -2605, 20319, -14875, 100187, 43522, -49097, 70113, 165722, 120886, -47786, 69251, 103528, 80102, -129394, -135332, -136262, -154067, -213106, -183421, -102178, -198824, -260375, -204651, -72145, -8380, 21559, 92126, 103407, 63578, 193291, 272662, 188572, 133536, 183402, 127451, 5549, 176421, 313285, 99283, 138041, 244441, 161311, 27530, -60533, -121281, -180591, -59953, -189798, -166815, -87043, -104853, -96409, -108481, 64960, -59126, -140746, -74573, -64939, -49507]
20392d9507n4774n3619J50628K9762n7867j5749m8131n8083k7387L015O8477o1156
20380a74391q7513M9367j04599l0613J73684N1292k7233M8539m4083r9464k9711
20369b74725J91807J93199J08700Q9748r003O6373k31594j45853r4612K8373M5260
20358c2327Q7138O6819J6284P1877l8114j62783j07111j48372k326K26534J7284
20347e097L011p9242o0774j69469K9901J20770J51523Q1548q2133j41623J17808
20336c3777m7977l2761l3454J90414J16146j12402L0790J0205M6254M8039k48979
20325f7502j28287Q3059k8226j22104o5054K9312M2290o1443J34629N6635l6078
20314a62769R119q7440m3403J32548J69574o8569q4739M7129P549k8568m268k72306
$$ y = [-49507, -104281, -157900, -7272, 22490, -35377, -51126, -99257, -157340, -184727, -181712, -113235, -174391, -261904, -212537, -317136, -347749, -174065, -122773, -150006, -101467, -145550, -245014, -274725, -82918, 110281, 218981, 308729, 299726, 366099, 134505, -11348, -105960, -77587, -32327, 54811, 121630, 137914, 209791, 171677, 8894, -98217, -246589, -248915, -22381, -5097, -2086, -81328, -142102, -311571, -281670, -160900, -9377, 72171, -9962, -151585, -33777, -81754, -114515, -147969, 42445, 158591, 46189, 76979, 87184, 133438, 181477, -67502, -195789, -112730, -140956, -263060, -328114, -298802, -256512, -317955, -183326, -126691, -162769, -153650, -241090, -284493, -151945, 17629, -50940, -135679, -88550, -81001, -109569, -113837, -386143]
20302c86143R5554L55943L1876m7040J40457J18945k1252l9597k11166J4973Q5568
20291A38118j20726k9016M443L495K23737J66986K7292m0885K9352k22753j97820
20280a7777J3104N6803J24516J42067j13660k23759l7763J0634J44469m8612q5050
20269c5028L2144r7006n4772M1444l983j31618L7359J31711K5413J73433r4157
20258B4940j76400L816K09121r7153p022L9901M6586R3722l6281K1011N4112N6930
20246B33283j36095p1482J84199L8517R043j78415o1051O607j22852q1478K07920
20235B8196o989J35287r6761j93365p83N7100k4964M540j52049r886l006m8131
20223c10811Q1523J65853J20237P9704k45388N1689J20548J04693j07729k32955
$$ y = [-386143, -290589, 65354, 97230, 50190, 190647, 309592, 288340, 248743, 37577, 52550, 138118, 17392, -11624, -7181, -3686, 220051, 387037, 414329, 373444, 402796, 180043, -17777, -4673, 52130, 176646, 318713, 205053, -18706, -56469, -45835, 98634, 50022, -35028, -2884, -99890, -154662, -113218, -117201, -248819, -211460, -79749, -54336, 119097, 24940, -151460, -147644, 61477, -35676, -42698, -2797, 43789, 137511, 101230, 122241, 176353, 233283, 97188, 25706, 209905, 248422, 257465, 79050, 17999, 24606, -98246, -179724, 28196, 21207, 156494, 59733, -133632, -134415, -77315, -102279, -97739, -249788, -259674, -262680, -310811, -229288, -63435, 56802, 136506, -108882, -57193, 63355, 168048, 60319, -172636]
20213a72636j06014L8339l414J9351N4747R4341K10935J01252j07971o8547j21692
20202f1309J5900l7061j95796K0514M7684R8342L167M4106J06411J10659J05663
20191B58280l7882q4318p9707k0675J09182N3142K16279l3334j12586m4145j03087
20180A21149j01283j3756m1518m2678J41210L0751j03800j14414k3544J19644
20170b8239J15696J3396m6460l4555m8852r63l5222N2801p499P0623N5684m042
20158A02368k42365L02P712k0361j8125J74407l2196J12056n1966j14561j19395
20147b02124n2531J72167J51093P6012L2029r0962k18200k46704R7981K38856
20137d2383O0774J11780j68661p2230J80834j1582J13176j3044j85248j68238
$$ y = [-172636, -278650, -240311, -243725, -224374, -169627, -75286, 135649, 236901, 128930, 60383, -61309, -45409, -82470, -278266, -257752, -210068, -111726, -108559, -64453, 41958, 152617, 258280, 220398, 136080, 56373, 35698, 144880, 198022, 414301, 380967, 268381, 224236, 121149, 19866, 6110, -35408, -78086, 63124, 93875, -9925, -124339, -147883, -28239, 87457, 100853, 54393, 19838, -29014, -29977, -65199, -12398, -19897, 50726, 106410, 102368, -139997, -139695, -131983, -152344, -170469, 3938, -28258, 83798, 31832, -82729, -202124, -254655, -82488, 68605, 144617, 176646, 85684, -132516, -379220, -281239, -42383, 18391, 130171, -38490, -110720, 70114, 58532, 171708, 158664, -26584, -194822]
20127a94822Q7406J06608Q5495j2486o8298N0018J02252K6665J2576n1718k27171
20116h3475j16328j7297j5157K6024N0435R7968K07451J06514r1080k84K5690
20105A90461o0666k5251L4786K3439k03506k05529j4767R8910J16337J77715L5961
20094A67890k05295j0714J50208k5933l5265r4241m5764J56084K4914j3406m7726
20083B0752R6306J2996p5755k44792j8540j5283J54739J34645o1074j37524r751
20072a43281m2534R5063M5963j66842O7005R9852Q9560N0337p127p0358R4440
20061A12078K58716j00114j90331P4397j0822l7711P5882q3387j75975R1286R9053
20050A13072m5709k21497r4440K00906m824n9905r1436o2339L842R7564R4130
$$ y = [-194822, -107416, -808, 84687, 72201, 3903, 53921, 156173, 182838, 195414, 143696, -83475, -199803, -217100, -232257, -206233, -155798, -57830, 149621, 256135, 165055, 164771, 190461, 129795, 104544, 139330, 162769, -40737, -246266, -261033, -162123, -45786, 131929, 167890, -37405, -48119, 102089, 76156, 40891, -53350, -99114, 56970, 81884, 68478, 20752, 117058, 130054, 54299, -190493, -209033, -224316, -69577, 65068, 3994, -133530, -143281, -185815, -90752, -44789, -211631, -144626, -44774, 44786, 95123, 87996, 17638, 112078, 370794, 270680, 80349, 154746, 143924, 106213, 182095, 98708, -77267, 14019, 113072, 67363, -154134, -248574, -47668, -52492, -112397, -203833, -266172, -262330, -164766, -70636]
20039g0636J31640k6583o0891R089o7773j39991j60738Q0022J61530N7579P1794
20028a4958l025j1192m6450j78632K9167K33226j55032j04558R0399J53781R8758
20017I1484O590j4957j37477m0967k9038L6782J24834P7760J3416k941n1835o2424
20005A1227o3520q7669R5526m5855k7024M5034j02807k9329O5440p2436O7314
19994a44099J29622p8944k2921l3828K6640Q284o2119O8167o0820L6011q864r2085
19982b34956m8817J4084N6136J08885R7270q2645j50547J00404J02171n6307M5935
19971d8387J30442m969n48j09611j36427R1045K00603j40875L0624L9545L5042
19960H6484j53189L1372J33900o3017q913Q0589N4472R747K704p6217j32517o3473
$$ y = [-70636, 61004, 34421, -26470, -17381, -85154, -225145, -385883, -305861, -144331, -86752, -14958, -17983, -29175, -75625, -254257, -225090, 8136, -146896, -251454, -161055, -7274, 91484, 98074, 83117, -54360, -95327, -124365, -87583, 37251, 115011, 128427, 125486, 73651, 11227, -52293, -139962, -44436, -90291, -117315, -72281, -175088, -204417, -138977, -211413, -144099, -14477, -93421, -116342, -150170, -123530, -115246, -177365, -109198, -170018, -134007, -142871, -234956, -283773, -269689, -213553, -104668, -7398, -90043, -240590, -140186, -38015, -94322, -48387, 82055, 77086, 76538, -33073, -169500, -78455, 122148, -18727, 11897, 51442, 86484, -66705, -35333, 98567, 35550, 26637, 107226, 161698, 171445, 174149, 97932, -34585, -98058]
19948i8058J18679p1300K2027M4613q7233P4877K40704K5256k80340l2199J55343
19937A12369J60104P952k22665p0029J0132o8685j07304M2759O2371l7546l9845
19926a50387j12960j93942M9406M4926Q6544R5517o1116J43143J81592r43j09526
19915b7746k17116p3528K04508L30648J44011p0702l7432k17597j00239j65n1604
19904a16962J36960O3768j8285p238j49954M6467Q3598m7453K06119L03080q9553
19893D10547m04740j8331J1061j42823j6140j7237O5447P2199j9530Q2510J0897
19882C3860M4343L4802Q333o3458r5474K8180J82128O8991J65077L9404j94314
19871B51872j17101P963j9155K8397n0250r6568j24676p0823J72086K19497m2496
$$ y = [-98058, 20621, -50679, -28652, 15961, -71272, 3605, 244309, 269565, -10775, -42974, 112369, 272473, 280425, 57760, -12269, -2137, -70822, -178126, -135367, -72996, -110542, -150387, -263347, -457289, -407883, -362957, -276413, -180896, -242012, -98869, 82723, 81780, -27746, -244862, -318390, -113882, 216766, 360777, 290075, 252643, 35046, -65193, -65358, -116962, 19998, 83766, 65481, 58243, -91711, -45244, 38354, -9099, 197020, 500100, 410547, 5807, -12524, -1463, -144286, -160426, -177663, -112216, -40017, -59547, 22963, 33860, 78203, 113005, 121338, 57880, -37594, -9414, 172714, 241705, 406782, 446186, 251872, 134771, 142734, 123579, 151976, 101726, 5158, -119518, -190341, -18255, 201242, 158746]
19860A58746j8665p4154r1806J85141j5208k1728k3802Q4890J14053N3924j16107
19849B35284q7226J39871j1837J1976O2804j23168j13842j69527K7336J9481j18879
19838a27727o2224P7994k182p691m7266o2951P7916R5235N6863J43488J55383
19827B96838o7143k4851q036j69547O4512O1015l2267k0663l9139J21689m9197
19816A33211j83557l8838j00646M6028j30463K2695N2773m7638K9810Q6643J87273
19805E7291j08250o7845L6413r1000Q0752Q7544r4081j78093k487n6632J448R6864
19793b38076L2370J6229Q10R2826K672P5111R3946j51856J15014J15336q1407
19782G2975M053n7299o8530L8423J7639L1848q9177J68775q0642O4039M6788p1232
$$ y = [158746, 140081, 65927, -25879, 159262, 144054, 122326, 98524, 183414, 297467, 351391, 235284, 148058, 287929, 276092, 288068, 350872, 227704, 113862, -55665, -28329, -8848, -127727, -189951, -111957, -114139, -121830, -169096, -232047, -154131, -58896, -2033, 141455, 296838, 229695, 204844, 196808, 27261, 91773, 152788, 120521, 99858, 60719, 182408, 133211, -50346, -89184, -189830, -143802, -274265, -251570, -198797, -246435, -216625, -129982, 57291, -50959, -118804, -82391, -173391, -92639, -5095, -99176, -277269, -279756, -336388, -334940, -238076, -205706, -189477, -188667, -95841, -93169, -18058, 75888, -75968, 39046, 154382, 72975, 77028, 19729, -48801, -10378, 7261, 39109, -50068, 118707, 38065, 102104, 148892, 77660]
19770G7660K0297K70046O7950j32875j85065j70375j34242J29598K29441J9639
19760A92074o8059k04177q0798K10490K09667j47281r8685q4392J15863K51296
19750B95998j00395k1588q9074J0328J90259m7674O1801q7556p0389k4917M9418
19739A66211j38294p1700j12124N3925j23501p322l4947L2325J25089M1326M3932
19728b5080j27811J8838R8070N4384K7056J89652K44517r9736l7337n5018q3431
19717B04104j61339j18491k8860J94239J27663n1832p3492j06004L9371K01039
19707B26398K0048k37858r4646L812N4517R0541J22370j02589M881K4869J4028
19696A26371l1036k47871r2253J31761J58074N1449j24829k5526J43936n7366
$$ y = [77660, 97957, 368003, 435953, 303078, 118013, -52362, -186604, -57006, 172435, 192074, 124015, -80162, -160960, 49530, 259197, 111916, 13231, -71161, 44702, 295998, 195603, 174015, 84941, 95269, 285528, 237854, 299655, 212099, 141710, 116793, 166211, 27917, -43783, -155907, -101982, -225483, -232805, -267752, -235427, -110338, -69012, -25080, -152891, -134053, -35983, 18401, 45457, 235109, 479626, 379890, 342553, 287535, 204104, 42765, -75726, -104586, 89653, 217316, 165484, 91992, -14012, 25359, 226398, 246446, 8588, -86058, -82246, -27729, 62812, 185182, 82593, 87474, 112343, 126371, 95335, -152536, -244789, -113028, 45046, 96495, -28334, -53860, 90076, 32710]
19686C2710r3757n8726M8167R2783p1716Q7117K37907j18810k82521k23281m3994
19675c94121J24768l141O2380O7478n8954J4463K1970k4290M3517J931p326J15122
19663c6203Q5206n1479L1377N0004J01860N8032p3948j14461J6846N4971L3714
19652A55919O453K6478j70430Q7548J57668j481p6802j73383K7313j03322j39135
19641b03174K14682J74966K0248r7543K9543k2839j504L1028J3726k29007r7816
19630a67690M8201J04681j11881J09069J05715K48148K1718j13094j40359k08540
19620a04032p0181Q8312J9821k4362L1518P5339L2513r5676R2649J39935J24468
19609C10304j06633N7718m8636n5712J79591m5578j06620p9318k9052L7828R3932
$$ y = [32710, -61047, -119773, -71606, 21177, -50539, 36578, 274485, 155675, -126846, -350127, -394121, -269353, -272494, -210114, -142636, -201590, -187127, -165157, -189447, -145930, -143999, -151325, -36203, 49003, -2476, 28901, 78905, 180765, 238797, 164849, 50388, 67234, 122205, 155919, 162372, 188850, 18420, 105968, 263636, 262155, 185353, 11970, 39283, -64039, -203174, 11508, 186474, 206722, 109179, 138722, 115883, 114379, 145407, 159133, -69874, -167690, -119489, -14808, -126689, -17620, 88095, 336243, 357961, 244867, 104508, -104032, -174213, -85901, -66080, -90442, -58924, 16415, 48928, -46748, 45901, 185836, 310304, 203671, 261389, 212753, 157041, 336632, 291054, 184434, 105116, 76064, 113892, 207824]
19598B07824k675j23287j15047P156o7297j85452M7826K06045P3937K3987o8087
19587D930j2361o9169j8870O24J50299P763l5483J02785N2553j81179j7185M7040
19575C1747L9129J69068P805j63022L4982O3933n4084o4812m0329J17375L9492
19564A81284k452o7364L5223m5943R619j11140k3260j1916j09043m0910K7554
19553a58348J25778K91835j2177j6250p5084j98033R1436Q1061n2777j318J15122
19542A91245M6915n6458Q6391J0306j07309N358M1955j36862R332j2730M9453
19531A27596n5440k10734j73405L5532J60977R2567J06441n9294M7220J07903
19521A79363J75397j61499j34817n7258M5345L6902r2556K6121J14240O7006j02730
$$ y = [207824, 205149, 81862, -33185, -26029, -93326, -278778, -230952, -24907, 49030, 73017, 4930, -7431, -76600, -95470, -94846, 55453, 63216, 27733, 130518, 183071, 1892, -15293, 31747, 70876, 239944, 247749, 84727, 119709, 183642, 129558, 64746, 24417, 141792, 181284, 178832, 111468, 146691, 100748, 110367, -773, -24033, -35949, -144992, -185902, -158348, -32570, 259265, 247088, 230838, 155754, -42279, 49157, 130218, 77441, 76123, 191245, 238160, 181702, 268093, 278399, 171090, 176448, 218403, 81541, 90873, 78143, 127596, 72156, -138578, -311983, -276451, -115474, -22907, 83534, 24240, 71460, 179363, 354760, 193261, 58444, 1186, 46531, 83433, -9123, 16998, 131238, 198244, 95514]
19510I5514j16850K70864J39580j35432P1551O5711q3084o47k6361j31364j47073
19499B409O7702P5806o8122p854J10538O5230j26598j38719K2421Q4621j10260
19488b2826k18111r883P0656L7778j3230m355q0287p694R2242J69008n7106l962
19476d7770R1427J51108j34234m7850j4246j8551n3966k50351K4145J05155n4636
19465b49769J1363P790M1096M603R679j1097L3457J49307J34466j47769M4411
19454B7537K9942j6317j16118J28994M1260n8541J63230m6400j90882j42514R5870
19443h3939K2706M9994J06834J17466k99889k04707O5029K77528R8165j12576
19433C6611j62732M7915N794p8977J44609J98205j51598j73809j02823J28798
$$ y = [95514, -21336, 249528, 389108, 253676, 325227, 390938, 307854, 307207, 280846, 149482, 2409, 70111, 145917, 77795, 69941, 180479, 245709, 119111, -19608, 2813, 87434, -22826, -240937, -250820, -180164, -142386, -155616, -159971, -240258, -247952, -155710, 13298, -43808, -47770, 43657, 194765, 60531, 12681, -1565, -20116, -74082, -324433, -300288, -195133, -249769, -238406, -230616, -189520, -184917, -175238, -186335, -152878, -3571, 130895, -16874, 27537, 57479, 41162, -74956, 54038, 95298, 36757, 199987, 153587, -37295, -179809, -83939, -61233, -11239, 95595, 213061, -86828, -291535, -226506, 51022, 149187, 36611, -126121, -78206, -72412, -151389, -6780, 191425, 39827, -133982, -236805, -108007]
19423a08007J58665O4300o108O388j00507P3816m687K0425P1716O7046p6249o3218
19411A03580m831j56792j20494N745r2620J2230J45685M8329o6266M355N2273
19400f8806P0928j6396l4425O8795J53743O2284R0670L5210j8757k17830j61521
19389c6105p0962r2714Q5240Q5822Q405O5627P2751q2850L9547J86957Q3790O6384
19377D11892L5769k8463L1830l9313o1940j67700m5005m6234L5865J72312J16202
19366D15215j45753r3261L9481j4435j51617Q8372N6313j0011j53973o3742J0640
19355b2771K30902K53500n0733j49056j50765r7501O0481J85294o5564m1515j58900
19344f628R8528P8019L863j31423j57654k6077O9279K178l8048N1861j1038P7988
$$ y = [-108007, 50658, 114958, 108850, 115238, 14731, 88547, 83860, 104285, 176001, 243047, 166798, 103580, 98749, -58043, -178537, -172792, -265412, -253182, -107497, -59168, -125434, -121079, -68806, 2122, -14274, -48699, 20096, 173839, 236123, 326793, 362003, 343246, 125416, -36105, -107067, -199781, -114541, -28719, -20314, 45313, 118064, 35214, 74761, 261718, 345508, 411892, 447661, 419198, 451028, 411715, 349775, 182075, 137070, 90836, 126701, 299013, 415215, 269462, 176201, 215682, 201247, 49630, 138002, 194315, 184304, 30331, -33411, -22771, 208131, 461631, 410898, 261842, 111077, 13576, 74057, 259351, 193787, 152272, -6628, 91900, 169919, 173782, 42359, -115295, -141372, -72093, -69915, -107963, -56102, -67140, 10848]
19332A0848O0613M6129J04010m4014p8989J1462O4089n7899q6855m4446J40029
19321A24977P4080p0421j36712k14418j15244J33185K33474J07656J55146J1144
19311C02867n5956m2331M1095O4385q6074P8613l5533m0541K1189j03090k9652
19300A14972J85379j9174j33577m3718P4681K9235o3446j608M1811j02973j31608
19289e0026J23684J64109j26615l4554K4926o0557P0578L7860Q8942P1113L5845
19278C45305J8623q1704k46331M0158J95123L0082j1383j008K5437r6132o2644
19267A55526j08637J10130K06138N4070k9532j20864j05218j75479j04818K01090
19257H2406J00175J1108P4885J0252k72913k535m1829P6916R7229K3594J33341
$$ y = [10848, 71461, 117590, 221600, 177586, 98597, 110059, 174148, 116249, 29394, -15052, 124977, 199057, 128636, -8076, -222494, -337738, -204553, 28921, 136577, 291723, 302867, 246911, 204580, 245675, 310060, 223986, 302599, 267066, 226525, 247714, 144624, 114972, 300351, 281177, 147600, 103882, 178563, 207798, 144352, 142744, 184555, 81582, -50026, 73658, 237767, 111152, 76598, 101524, 40967, 111545, 149405, 238347, 309460, 345305, 363928, 282224, 35893, 76051, 271174, 301256, 289873, 288865, 314302, 218170, 155526, 46889, 157019, 363157, 417227, 387695, 266831, 161613, -13866, -118684, 82406, 182581, 193689, 268574, 278826, 5913, 3378, -38451, 38465, 135694, 159288, 292629]
19246B92629M9693j55069k56665M6865r6447j40476R0417J92162J73372L213k49338
19235d9644m9873j8486o546Q6415J49276K52989R731j81884m224P1545n6433j07711
19223I5155o1471K5416M6031o3963m602J25778J49168k15432j88601M8552L0968
19212a3001M1677K12798J69935k33358o8880j549N4281m011o9371k3212O5156
19201A30465J47018j34350j60514J43587K183M0250r3639o2090J06281L5090j4034
19190A40247M7794J4352M5232l8153p3511J22386J23884R4989j05632k33923m3667
19179I3998p073o9984l1275j7042N7032m1827J09291J3155q2907l8810Q241k4321
19167c1522J28866p5923j29062Q6570M4852O5557o5358p6698o4875k8595K4465
$$ y = [292629, 342322, 187253, -69412, -22547, -118994, -259470, -169053, 23109, 196481, 199694, -49644, -99517, -118003, -124549, -38134, 111142, 364131, 373862, 191978, 187754, 259299, 202866, 95155, 33684, 59100, 105131, 41168, 36566, 162344, 311512, 96080, -92521, -43969, -13001, 28676, 241474, 411409, 178051, 109171, 107622, 161903, 157892, 88521, 65309, 130465, 277483, 143133, -17381, 126206, 128389, 168639, 75000, 12910, 119191, 154281, 140247, 188041, 202393, 247625, 209472, 135961, 258347, 382231, 477220, 371588, 137665, 93998, 86925, 16941, -14334, -31376, 25656, -16171, 93120, 106275, 23368, -15442, -7201, -31522, 97344, 21421, -107641, -21071, 23781, 89338, 23980, -52718, -117593, -146188, -121723]
19156a21723k0170l6685J11969K4036j45884M8507Q0994M6476j0352J83865j5776
19145A45257l7852r9351Q2552J36487M3254q5932j8728j06684m3425K24263R3405
19134C33246j25619k50340l0531p6860M1331j56J19969J90973J37616o8306j28240
19123A43083K5114p1090o9442j60324k4403J93546k7561j17782m2830J15523M8312
19112A2146r8321n5702j55877M1612J48347l8739J2185o602O5516J31784J80448
19101B36797j83416m6977J75683J9500K1756j43161m0429p7731Q2903K2784J46922
19090B14631J55798j29378l483P2692k04443j20239R9070K06251m9646q2462j02677
19079E6114j2405J7867J67581k9551k71167n1764r646J67734M1869o9484M6663
$$ y = [-121723, -141893, -178578, -66609, -42573, -188457, -139950, -58956, -12480, -22832, 161033, 145257, 107405, 8054, 90606, 227093, 270347, 184415, 165687, 59003, 15578, 239841, 333246, 207627, -42713, -73244, -150104, -108773, -108929, 11040, 202013, 339629, 271323, 143083, 168197, 97107, 27665, -132659, -157062, 36484, 8923, -108859, -151689, -36166, 12146, -86175, -141877, -297754, -256142, -107795, -146534, -134349, -140951, -75435, 56349, 236797, 53381, 6404, 182087, 201587, 223343, 80182, 39753, -37978, 44925, 67709, 214631, 370429, 241051, 237568, 310260, 105817, -14422, 84648, 290899, 241253, 158791, 56114, 43709, 61576, 229157, 199606, -71561, -123325, -132971, 34763, 76632, 7148, 53811]
19068E3811m0164J5600P7380n1422J17555k8322J31999k06897j34345n2659P8956
19057c8508J16928L8957o4711L3988o1434R7770K6264J98446p4365r2010Q3147
19046B64472j10518P673N730j55018n4477K70130N0266j8091J8091M3161l8657
19035B82762m0901j141P0954r3656j38262l0633R533K5488j0674O8810O3675K6837
19023B32792o2827P1936j22040j63825l4566N4541M871L1434J15806O8736k39031
19012d2173j10876o2908N352J06643l8642J4807J14718j7834L4668K62990N3064
19001C19809j06626j3937k1506K4289K8717J74226J6041j24884k30814P609N3714
18990A26638J4549J38247k974k7384L9706j06817k0754P9715k967N2996N1027
$$ y = [53811, 13647, 29247, 106627, 55205, 172760, 144438, 276437, 69540, -64805, -117464, -38508, 78420, 117377, 52666, 86654, 25220, 122990, 149254, 347700, 273335, 181325, 264472, 153954, 161627, 167357, 12339, -42138, 227992, 278258, 260167, 278258, 321419, 282762, 241861, 240720, 311674, 218018, 79756, 49123, 58656, 84144, 73470, 142280, 205955, 232792, 169965, 241901, 119861, -43964, -78530, -23989, -19118, 12316, 128122, 196858, -42173, -153049, -215957, -210605, -103962, -142604, -127797, -13079, -30913, 3755, 266745, 319809, 213183, 199246, 177740, 202029, 230746, 404972, 421013, 296129, 65315, 72924, 126638, 141187, 279434, 276460, 249076, 288782, 181965, 161211, 240926, 237959, 290955, 341982]
18979C41982K5552r05j05099j34924j08786k2644L9775K8153J27690N0303L0126
18968B71223j11573N5566O0271R4935k20370j93235q038P9733J00187K9803r1034
18957F7468N936O7538k0676o5242q5533L8081N9586K5744q8531q72l534o290k2916
18944b9241m8487j0741N9641R7474K13506Q0646j64911j26969j03720J10025J48102
18933B25325N861o5169Q0291j48486q6678Q9647M9899j5700J77947N2031L2741
18922C97709J08870j9298K7322M8346r2631j71657j3328J22292L6221l22671j00840
18911B0335J75840M1842j5541N9536J8405J32753N9667p6050o641N4781N2068
18900E16995L092j0194j5547P2804O7548K11153J35392J56674O8070P2883q772
$$ y = [341982, 367534, 366629, 261530, 126606, 17820, -4824, 34951, 63104, 190794, 241097, 271223, 159650, 215216, 275487, 370422, 150052, -43183, -51221, 28512, 128699, 158502, 67468, 73404, 140942, 120266, 55024, -30509, 7572, 67158, 92902, 4371, 3499, -35, -6325, -29241, -77728, -88469, -28828, 68646, 282152, 362798, 197887, 70918, -32802, 77223, 225325, 231186, 166017, 246308, 97822, 11144, 100791, 150690, 134990, 312937, 364968, 397709, 506579, 487281, 514603, 562949, 470318, 298661, 285333, 407625, 443846, 121175, 20335, 196175, 238017, 222476, 282012, 300417, 433170, 492837, 416787, 410146, 464927, 516995, 520087, 509893, 494346, 567150, 634698, 845851, 981243, 1137917, 1205987, 1278870, 1270098]
18889A270098n8186J36085Q4138J15585M1367o0549o384r8595o2671Q0002m8921
18878A391969j31736q6955k7746J0530K8100l9988M040Q328q4048K1357J45292
18867A239143j52255m3805l3465j68176m2487k78310j08243r9387L9857k8757
18857C24115o0529J30179R8316k332k30301j3402N7051P9312J50547J20273j9973
18846F33256j34644j59981j9822J35358J490r0763p9316J6617R3933P0501P1756
18835E38385l0724k7470K8365R7223L9785M8490O6019J04036O5016L0487n6434
18824I03178j93026j73733m7809J31942n6466K15211J71288R1612J89676l5120
18814A196753J0031j58966k63191k87363j09482l7850J35881j55723j43926P5362
$$ y = [1270098, 1211912, 1347997, 1432135, 1547720, 1589087, 1528538, 1522154, 1423559, 1360888, 1440890, 1391969, 1260233, 1173278, 1145532, 1156062, 1184162, 1144174, 1148214, 1156542, 1072494, 1093851, 1239143, 1086888, 1043083, 1009618, 841442, 798955, 520645, 412402, 313015, 352872, 324115, 263586, 393765, 492081, 489749, 259448, 246046, 303097, 382409, 532956, 653229, 633256, 498612, 338631, 318809, 454167, 455657, 364894, 285578, 302195, 396128, 466629, 538385, 507661, 480191, 508556, 605779, 645564, 694054, 760073, 864109, 929125, 959612, 903178, 710152, 536419, 488610, 620552, 564086, 779297, 950585, 1042197, 1231873, 1196753, 1206784, 1047818, 784627, 497264, 387782, 349932, 485813, 330090, 186164, 261526]
18804B61526K21181J2176j93144l8242K39796R9548L749q220k85701k54292R0714
18793A49091K48288J3991J11428p5310j7944N6721L8990J0328r988J4839L423
18782E43857J01442R6618j91932N6633J54134O0948J96759K48831K4789J2635
18772A304714j567R7199J02355L34214O02129K21760k71470k89668j60262q3698
18762A855706j2490r9456k85544l71775k62394k49118n8619r6713j15635L9395
18752C43357J23494n1322R685j51891p9506k4826R6676N4085J8896P002n8009
18741B87641j38290N5218R6721J19857J07110m8475n3279k43109q333O1466J38576
18730C75103o3207P1830k3410o4027j15951k233P2412Q4478J03408J39645J677
$$ y = [261526, 482707, 494883, 301739, 263497, 503293, 602841, 606590, 598370, 312669, 58377, 149091, 397379, 411370, 522798, 447488, 429544, 486265, 525255, 535583, 525595, 540434, 543857, 645299, 741917, 549985, 606618, 760752, 821700, 1018459, 1267290, 1292079, 1304714, 1303147, 1400346, 1502701, 1836915, 2439044, 2660804, 2389334, 2099666, 1939404, 1855706, 1843216, 1743760, 1458216, 1086441, 824047, 574929, 516310, 419597, 303962, 343357, 466851, 415529, 425214, 273323, 193817, 168991, 265667, 319752, 338648, 345650, 287641, 149351, 204569, 301290, 421147, 528257, 479782, 426503, 183394, 175061, 236527, 375103, 311896, 383726, 360316, 296289, 180338, 178105, 250517, 334995, 438403, 578048, 579725]
18719E79725p1734P8171J39320p660m7760j26337O036N5439n7743l5480p2655
18708D39322O544p2639r3361n6760O5703m2516R946K9597J22167J35329l1157
18697E12175j59088J13728J24045K1463R479j4345L8170O8106j35851K9716L498
18686F11096n8047K10323k6656j08161M4396j68378L5965r6024n4288k0493P8602
18675D48335m0996n7573p4955M990J02624l9290N1036K9057k38018j02650J07348
18664A89908K4896j235J21733l3236K1758R006N272K8371J11310Q3544p379j26554
18652D27394k63065R739N9944J08298J06486r7181k640m1771M2986N8840P7901
18641D86931p0096l1863Q5854O7476j24603j26307k6907Q0683J7665J30395P6340
$$ y = [579725, 507991, 586162, 725482, 717822, 670062, 543725, 549761, 605200, 547457, 511977, 439322, 445866, 373227, 279866, 223106, 288809, 246293, 256239, 285836, 408003, 543332, 512175, 353087, 466815, 590860, 612323, 621802, 607457, 645627, 713733, 577882, 607598, 611096, 553049, 763372, 736716, 628555, 672951, 504573, 540538, 444514, 390226, 369733, 448335, 407339, 349766, 274811, 279801, 382425, 343135, 394171, 423228, 185210, 82560, 189908, 214804, 213569, 335302, 302066, 323824, 332830, 338102, 366473, 477783, 561327, 553948, 427394, 164329, 174068, 234012, 342310, 448796, 351615, 348975, 307204, 350190, 409030, 486931, 416835, 384972, 470826, 538302, 413699, 287392, 260485, 341168, 358833, 489228, 565568]
18630E65568j5097J9470R0138j1513M7456q5681R18l2074q3440J7958J27831J92873
18618H34407j8663J6754J84424k9071k3148j48975q5272j1093K4084r6861Q8041
18607G34627R4718j6951r4833j26310j0898O0843N1127n8894M2342J36633n8181
18596G54223j47394m9120M371k4733j4739R9184m034l4279j7953J08423j18025
18585E55924j76955O5054m6939O810N8041J25122K49499Q5414J03491q2852k5947
18574I16662J11110Q5234N7094O6960J67601K55361J67581K64690K23924J51700
18564B467917n1193K9516O1612m2247k5219j43216l09097k51899j75780l7726
18554A522668m6856j91807k03489k7496q7023q9032L9588N1307j1232R9981o8022
$$ y = [565568, 550471, 569941, 660079, 648566, 696022, 610341, 611259, 579185, 495745, 513703, 641534, 834407, 815744, 832498, 1016922, 987851, 964703, 815728, 730456, 719363, 743447, 646586, 734627, 829345, 812394, 717561, 591251, 580353, 641196, 692323, 633429, 675771, 812404, 754223, 606829, 557709, 562080, 537347, 522608, 621792, 617758, 583479, 565526, 673949, 555924, 378969, 444023, 397084, 403894, 461935, 587057, 836556, 921970, 1025461, 942609, 916662, 1027772, 1113006, 1170100, 1237060, 1404661, 1660022, 1827603, 2092293, 2316217, 2467917, 2416724, 2446240, 2507852, 2465605, 2440386, 2297170, 1988073, 1736174, 1560394, 1522668, 1475812, 1284005, 1080516, 1053020, 965997, 876965, 916553, 967860, 956628, 1056609, 988587]
18543I88587n8340Q2762l229J355r1665o3604L5436L6969r2720o4139J3435Q775
18531G93622p315j2591J14504J58303L5118l9450j93238j09425j35821R9995L454
18520G07156r966l4640Q0357J96349P3695q3815J27639L02602J31066r7020R6573
18509A489996J6145j33450j05785j77574l7734m4535P4669O0338N7938M932J05338
18498A310278P1528O2152K9525J04130J37448q4704p034o5501k28431m9221j38429
18487A141741n5803l9413O3731K9972N8229j38974j10579J11590M5586Q4252J7410
18476A207742k2086j9583n0292J78916j879j04694k38543N1431q9505R2307J47856
18465A151670n8815m2629r2900J49051K16369O3265J56721k273o7545O5785J78533
$$ y = [988587, 930247, 1013009, 1009780, 1011135, 919470, 855866, 891302, 928271, 835551, 771412, 784847, 793622, 786307, 773716, 888220, 1046523, 1081641, 1042191, 848953, 739528, 603707, 703702, 707156, 697190, 662550, 742907, 939256, 1012951, 929136, 1056775, 1359377, 1490443, 1393423, 1489996, 1506141, 1372691, 1266906, 1089332, 1051598, 1007063, 1081732, 1142070, 1200008, 1204940, 1310278, 1381806, 1443958, 1473483, 1577613, 1715061, 1630357, 1623323, 1557822, 1329391, 1280170, 1141741, 1085938, 1046525, 1110256, 1140228, 1198457, 1059483, 948904, 1060494, 1106080, 1190332, 1207742, 1185656, 1166073, 1115781, 1294697, 1292818, 1188124, 949581, 1001012, 911507, 1003814, 1151670, 1092855, 1050226, 957326, 1106377, 1322746, 1386011, 1542732, 1540459, 1472914, 1538699, 1717232]
18454A717232l161j45675K6449K4638K56282K28685J41566J35793J56908R3095
18444B631812N3919K89555L29478L83550M96081M25397K17655O9776N6566K75977
18434E229766R0177L21987Q5704k16668k19434j55237j73083j47469j59584P0690
18424D726849J63781L68710N11440J47314j88816k97241j10308k86220l11162
18415D724347j72580K95832K59430K93316N3351m0673j43650L1553k06642j41855
18405D952429J44257J35329L91734L80256J64204R4654M8480L63641M54732N46764
18395G676480M89323P18478P71570R34961J169657J307269J143739J254159J553846
18386A7019482K354100L256614M303731N447752O649422O944920O058245N103021
$$ y = [1717232, 1714071, 1568396, 1594845, 1619483, 1875765, 2104450, 2246016, 2381809, 2538717, 2631812, 2685731, 2975286, 3304764, 3688314, 4184395, 4609792, 4827447, 4897223, 4953789, 5229766, 5319943, 5641930, 5727634, 5510966, 5291532, 5136295, 4963212, 4815743, 4656159, 4726849, 4890630, 5259340, 5770780, 5918094, 5729278, 5432037, 5321729, 5035509, 4724347, 4551767, 4847599, 5107029, 5400345, 5453696, 5413023, 5269373, 5300926, 5094284, 4952429, 5096686, 5232015, 5623749, 6004005, 6168209, 6262863, 6311343, 6674984, 7129716, 7676480, 8165803, 8884281, 9655851, 10590812, 11760469, 13067738, 14211477, 15465636, 17019482, 19373582, 22630196, 26933927, 32381679, 39031101, 45976021, 52034266, 57137287]
18378E7137287L499427K965542M376092P533738J1659974J6093976J8749372J6860310
18370A38875718J3701549O437617O0533k612775k857688J939707R743427J7149785
18362A82437873J9037267J9177981J1183777o18941q806871j7668493j8227541
18355A86515052j3173907n768593J268637O970993N987668p03835o699470j6356398
18347A58040147k0699432k0064452j6987189j1800199o671977l714332l653726
18340G4448840m408904o558329p966581p978720p593932o282412m724197l512286
18332B5423479k667412j833234j581906j321683j001321n39864k97663m06766
18324A5773630n4955K93746K60648K24022K93287M68607P60028J150479J848077
$$ y = [57137287, 60636714, 63602256, 67978348, 75512086, 87172060, 103266036, 122015408, 138875718, 152577267, 159014884, 159075417, 156462642, 153604954, 155544661, 165288088, 182437873, 201475140, 220653121, 231836898, 231217957, 222411086, 204742593, 186515052, 173341145, 167572552, 168841189, 175812182, 181799850, 181096015, 174396545, 158040147, 137340715, 117276263, 100289074, 88488875, 81816898, 78102566, 74448840, 70039936, 63481607, 55515026, 47536306, 39942374, 33659962, 28935765, 25423479, 22756067, 20922833, 19340927, 18019244, 17017923, 16478059, 16180396, 15773630, 15718675, 16012421, 16273069, 16497091, 16790378, 17258985, 18019013, 19169492, 21017569]
18315B1017569K782763L745391N653159Q209971J2187523J9296562K9162941L6371435
18307A38427314L6274112K0796565l478578k1919362l2081563l0095599k1395063
18300H6527826j1132174j012364Q988042J7394896K1048197J6654614J446548
18293A39915585j2892999k2557898k4615940k0608995j4995031j0048972o353903
18286B7841847m073600k786378j957597j191170q09457o43237m74126l46452k51942
18277A5307888k89879n89323m65202l19808O9213K09242M53971N76795P07389
18268A5660286N93136N30338P56000Q84356J352136J803740K696392M001110N702642
18259C3980136Q309077J2609864J9624967K9791744L7745843L8217875K2951773
$$ y = [21017569, 23800332, 27545723, 33198882, 41408853, 53596376, 72892938, 102055879, 138427314, 174701426, 195497991, 192019413, 170100051, 138018488, 107922889, 86527826, 75395652, 74383288, 83371330, 100766226, 121814423, 138469037, 139915585, 127022586, 104464688, 79848748, 59239753, 44244722, 34195750, 27841847, 23768247, 20981869, 19024272, 17833102, 17023645, 16380408, 15906282, 15559830, 15307888, 15018009, 14428686, 13963484, 13643676, 13712889, 13922131, 14376102, 14952897, 15660286, 16253422, 16783760, 17539760, 18424116, 19776252, 21579992, 24276384, 28277494, 33980136, 42289213, 54899077, 74524044, 104315788, 142061631, 180279506, 203231279]
18252B03231279l088764k1982382l2763184l0903917k1629185j0562818P64597
18245H3065626J2348787K2637743K7614189K2407181K961873j5533838k7915982
18238A27585579l1167737k6112101j9210188j2745638q218702n469364l800843
18231B0861006k610255j812339j527095j128406n33226n18663n81911p63995q26583
18222A0558533r31030j071321q72208p67090m38065l60476k72809j63330q9807
18213E592397l0659J2180l72758o64601o62069l75428l83155l26247k04228j88615
18203B396817p9063l30805j5843M2333j77669j75560j97135m8485J32335j11551
18193A435374k86933j07828n2991j27974j19593O5393L50624O8288J8200p7032
$$ y = [203231279, 200142515, 178160133, 145396949, 114493032, 92863847, 82301029, 83065626, 95414413, 118052156, 145666345, 168073526, 171035399, 155501561, 127585579, 96417842, 70305741, 51095553, 38349915, 30131213, 24661849, 20861006, 18250751, 16438412, 14911317, 13782911, 13249685, 12731022, 12149111, 11385116, 10558533, 9627503, 8556182, 7683974, 6916884, 6478819, 6118343, 5845534, 5682204, 5592397, 5561738, 5573918, 5201160, 4536559, 3874490, 3499062, 3115907, 2789660, 2585432, 2396817, 2317754, 1986949, 1971106, 2013439, 1835770, 1660210, 1463075, 1414590, 1546925, 1435374, 1148441, 1040613, 987622, 859648, 740055, 805448, 1156072, 1224360, 1242560, 1165528]
18183A165528j9454o9601r5609L05889J9689j04172r0591q9098q1243k278M1777
18172I80837j61817P2922J36018j31499j88523J15468J9496P3289K15754J66693
18162A298638Q4435K2115k4562o7071j12040j28426m2596J17099J37040K14503
18152A499135K19737R580M5309L1115M4324J13996M9118M0536p3311p7871J01946
18141B003614L19557L96047J81705J91936J92942J07442Q2569L2952K86991K07632
18131D003387L25995N08649O27195L62543N87154O23367Q51190J071426J065315
18122A0026221J305778J730454K222480K879558L556257M876786O960639R673584
18114D3231757J4300957K2097498L8110285P4358575J25405712M4257333n2844851
$$ y = [1165528, 1146074, 1076473, 980864, 1286753, 1306442, 1202270, 1111679, 1022581, 941338, 939060, 980837, 819020, 891942, 1027960, 896461, 707938, 823406, 842902, 916191, 1131945, 1298638, 1383073, 1405188, 1380626, 1313555, 1201515, 1073089, 1030493, 1147592, 1284632, 1499135, 1718872, 1728452, 1773761, 1804876, 1849200, 1963196, 2012314, 2052850, 1979539, 1901668, 2003614, 2323171, 2719218, 2900923, 3092859, 3285801, 3393243, 3475812, 3508764, 3795755, 4003387, 4329382, 4838031, 5465226, 5827769, 6414923, 7038290, 7889480, 8960906, 10026221, 11331999, 13062453, 15284933, 18164491, 21720748, 26597534, 33558173, 43231757, 57532714, 79630212, 117740497, 192099072, 317504784, 361762117, 308917266]
18107C08917266o6287120q2920686o1703915l2718263j8360912j1408486p241579
18100B8276305m717842l426261k793057k181172j613436j534738j422013j303924
18092I283862r07452o87345p03161p55956n00665m44349n11548m62718k73011
18083D037657l69757l81497m19909l44988j67844O5170j17826p8299j13444r0884
18073B018379k77296k14958q4270j09747k38582j96377j01564m5576k26971j35949
18063C87089Q0102K40181J21937q6333m9705k9564r7239P3780o7693K2124k360
18052E92319J3348q1072J1056k3283j61439k4401j6921J3662j2068j2257q4891
18041B14053P5944M8211N5054Q9773j22494j51101j4745N9517K12974O2932r8305
$$ y = [308917266, 242630146, 159709460, 98005545, 65287282, 46926370, 35517884, 28276305, 23558463, 20132202, 17339145, 15157973, 13544537, 12009799, 10587786, 9283862, 8376410, 7689065, 6985904, 6229948, 5729283, 5284934, 4773386, 4310668, 4037657, 3667900, 3286403, 2866494, 2521506, 2353662, 2418832, 2301006, 2222707, 2109263, 2018379, 1741083, 1526125, 1441855, 1332108, 1093526, 897149, 795585, 750009, 523038, 387089, 467191, 707372, 829309, 742976, 693271, 663707, 566468, 640248, 572555, 594679, 592319, 605667, 524595, 535651, 512368, 350929, 326528, 309607, 323269, 311201, 298944, 214053, 289997, 338208, 393262, 483035, 360541, 209440, 194695, 254212, 467186, 530118, 431813]
18030D31813O3130l7903k75594j58108n1341O7603L7081q8313K24P4699J5907
18019G9198m3665j16174J94417R2993r5472o3301J45465P148r7262j66899j25364
18008a88916K9440l8502O7366J1462L2781K76747J61293j20439p3967m167j52577
17997E21L8691m5552K6327J10005J12599Q7878J12314M3473o1968j72652k87896
17986c6260M3083j43467N8455J03296q571l0707j673k8887N4359N7331N3985M6483
17974A67427J0494p7050j21089o0304Q7801M5016j26317k7277j9937j03395J1998
17963b12633Q7840m079J3516J49725j35975o5313N5827J95081N1497k4936j95032
17952h4482p3210L4044k9344k08739J22079J40205J24217J01162K02209J5901
$$ y = [431813, 494943, 457040, 181446, 23338, -28003, 39600, 76681, -11632, -11408, 63291, 79198, 35533, -80641, 113776, 206769, 111297, 47996, 193461, 200609, 103347, -63552, -188916, -159476, -197978, -130612, -119150, -86369, 190378, 351671, 231232, 157265, 153098, 521, 39212, -6340, 19987, 129992, 242591, 330469, 442783, 486256, 424288, 251636, -36260, 6823, -136644, -78189, 25107, 16536, -14171, -15844, -44731, 9628, 66959, 120944, 167427, 177921, 100871, -20218, -80522, 7279, 52295, -74022, -101299, -121236, -224631, -212633, -124793, -128872, -115356, 34369, -101606, -166919, -111092, 83989, 135486, 110550, -84482, -157692, -123648, -152992, -361731, -239652, -99447, 24770, 125932, 328141, 344042]
17942C44042k26694l00847j78315Q3125J21502R1436q1818J13949K1318J07177
17932I4875Q7105N9377m3488j42145j53751j65815R5229J1159j73701p6168o6392
17921d73715j3990J8183J78477J88199L35397K60279q4411L2879J58284J98162
17911G97744K55044L77671K25806K33325J7434k17960l78514m07328k73598j16570
17901E13054j92995j35621j4002n2886L0252M8595J21841l4879j75547j93634
17891h5822j67714j806P8737O097Q7305R4998n3574J37214k3721R719j5019n9650
17879F764l0120L0061M771Q9855L4173J15983P5970q4211o510j01937j30013P4820
17867G9606K02J00560L1453q6114k2748r7049P8822K83427J91056J74426L25988
$$ y = [344042, 117348, -183499, -361814, -278689, -157187, -65751, -147569, -33620, -12302, 94875, 181980, 241357, 197869, 55724, -98027, -263842, -168613, -157454, -331155, -407323, -473715, -487705, -469522, -291045, -102846, 232551, 492830, 408419, 441298, 599582, 797744, 1052788, 1430459, 1656265, 1889590, 1907024, 1689064, 1310550, 903222, 629624, 513054, 320059, 184438, 170436, 117550, 147802, 196397, 318238, 283359, 107812, -85822, -253536, -255342, -176605, -170508, -83203, 11795, -41779, 95435, 71714, 81433, 66414, 6764, -23356, 6705, 11476, 101331, 135504, 251487, 327457, 243246, 236736, 134799, 4786, 79606, 79808, 180368, 211821, 125707, 102959, 5910, 84732, 368159, 559215, 733641, 1059629]
17856A059629L43247J85742r8965k33718k12632k94966n0080J12888j96597o4928
17846E49620Q0508J33751k2962L2310J31956K32305Q1188j62841j19316N6142
17836I92661J10611N5408m6708O1245J85451J70295L0907j32761p3012N7019p6204
17825A334912p003m5656Q0020L8824j72004l43740j92372R5055N7737k30898O3528
17814F78403Q6223J00277J22748J08172o7838j86387k28900k31029q9737j39571
17804A52361j57193R2324J12507P8593J2853L2259k61062K2345J97041r3071j86800
17793B157r7091J15478K04765J60442o5693p6755K07891K78277J51712J71328
17783A052511K00951O0320J18849J19298M9818k7150P8773J44771m8505j54558
$$ y = [1059629, 1402876, 1588618, 1489653, 1255935, 1043303, 748337, 698257, 811145, 614548, 549620, 630128, 763879, 740917, 773227, 905183, 1137488, 1218676, 1055835, 936519, 992661, 1103272, 1158680, 1111972, 1173217, 1358668, 1528963, 1559870, 1427109, 1354097, 1411116, 1334912, 1327909, 1282253, 1362273, 1401097, 1229093, 885353, 692981, 788036, 845773, 614875, 678403, 764626, 864903, 987651, 1095823, 1027985, 841598, 612698, 381669, 291932, 152361, -4832, 87492, 199999, 278592, 291445, 323704, 62642, 84987, 282028, 188957, 2157, -94934, 20544, 225309, 385751, 320058, 243303, 451194, 729471, 881183, 1052511, 1253462, 1313782, 1432631, 1551929, 1601747, 1574597, 1653370, 1798141, 1749636, 1595078]
17773A595078J14925L07402J24490J779R7515R2455M7008r250J5827o213p4753
17762B306263L6977k8824j3023r6066j82867j02202r7929j14364j17719J22807
17752A713053K2561O7621j00069k08662N5328k58933k09308J1016o9842q3144
17742I39621o5479L6187J27581j20982j5069m6666j12663o8717j35824N3468K08320
17731G99777K61242R3783K52759K54928R5711j37204l77085j24245j05356j22743
17721H91567L6167M1892k2241J85663K79643J334K0826j78493l77852j96503j84422
17710D97581j61207m4213k8307Q0379l8218J08402O6744K45965K24934R6073L29203
17699A377336J61011P0635n9298o494K7903j19789l06817k16443r8930q4710L0004
$$ y = [1595078, 1710003, 2017405, 2141895, 2143674, 2241189, 2333644, 2380652, 2371402, 2387229, 2381016, 2306263, 2343240, 2314416, 2301393, 2205327, 2022460, 1920258, 1822329, 1707965, 1590246, 1713053, 1735614, 1803235, 1703166, 1494504, 1549832, 1290899, 1081591, 1092607, 1022765, 939621, 874142, 910329, 1037910, 916928, 901859, 855193, 742530, 673813, 537989, 591457, 799777, 1061019, 1154802, 1407561, 1662489, 1758200, 1620996, 1243911, 1119666, 1014310, 891567, 927734, 969626, 947385, 1133048, 1412691, 1414025, 1434851, 1256358, 878506, 682003, 497581, 336374, 292161, 263854, 344233, 306015, 414417, 481161, 727126, 952060, 1048133, 1377336, 1538347, 1608982, 1549684, 1543190, 1571093, 1451304, 1144487, 928044, 829114, 744404, 774408]
17688G74408J94939J89071L70246K90470J77631J60205P3177j67413l47911k95871
17678A418952k36305j56561j10486n417j39583j02292j41787q6418M1977J17598
17668E99678K49008j59j08741L3791r135j27245l11938j3828K8101J3629N0484
17657D03645m3501p2025j29415M4975K13804K39372P7515Q1359K70006J61995
17647A247730K16342J75970O6792J63191K06531j49061l34320j78655j83064L0675
17637A262131O5254j04508O4667J57126P1368J95010M16397J74498R0562J05543
17627B498048J00464j6309k44213m11319l76784k92544l4965j08000q4418p9343
17617I50617j68982j28987k56760j09449K3988L337L0711J44114J1722P4720M7342
$$ y = [774408, 969347, 1158418, 1528664, 1819134, 1996765, 2156970, 2230147, 2062734, 1714823, 1418952, 1182647, 1026086, 915600, 910183, 770600, 668308, 526521, 440103, 482080, 599678, 848686, 848527, 739786, 773577, 764442, 637197, 325259, 311431, 339532, 353161, 403645, 360144, 288119, 158704, 203679, 417483, 656855, 734370, 815729, 1085735, 1247730, 1464072, 1640042, 1706834, 1870025, 2076556, 1927495, 1593175, 1414520, 1231456, 1262131, 1327385, 1222877, 1287544, 1444670, 1516038, 1711048, 2127445, 2301943, 2392505, 2498048, 2598512, 2582203, 2337990, 1926671, 1549887, 1257343, 1222378, 1114378, 1029960, 950617, 781635, 652648, 395888, 286439, 310427, 313764, 344475, 488589, 500311, 575031, 622373]
17606F22373j52134j92676j004J41873J1951R3068j00901p2093J06175O1962n8393
17595D60201k3312L959L0608K7439j50110j98133K179O7088J23681R3933M7698
17584D85231j9062p0975n0954m9410P5813Q4082j12929o5269k06467P6596M6219
17573A92875J31012J45375P2322k39558k52104O1922N422m2956p1407j9438j56529
17562a73064m2369O8596O1482l3311j35134J02693J79938L9965p6705L2677P6021
17551A00789M7086J11277K70166J63630j05289j29185j7738j23676q4486j911
17541B30663k69548L8294K40844K34992j0998q8173N3928K5362M2187O2770J21911
17530F82232R583q1612j06265Q1723O1107j08343L3381J2716n1598k3285j12577
$$ y = [622373, 470239, 277563, 276559, 418432, 430383, 523451, 422550, 350457, 456632, 518594, 460201, 436889, 440848, 471456, 498895, 348785, 150652, 152831, 219919, 343600, 437533, 485231, 466169, 395194, 344240, 294830, 370643, 454725, 341796, 276527, 70060, 146656, 192875, 323887, 469262, 541584, 302026, 49922, 111844, 117266, 74310, 2903, -16535, -173064, -215433, -146837, -85355, -118666, -253800, -151107, 28831, 68796, -7909, 24768, 100789, 147875, 259152, 529318, 692948, 587659, 458474, 440736, 317060, 232574, 230663, -38885, -591, 240253, 475245, 464247, 376074, 430002, 455364, 497551, 560321, 682232, 691815, 610203, 503938, 585661, 646768, 538425, 571806, 584522, 532924, 509639, 397062]
17519C97062O5474K04336o3423m9811K2139M0091J527J0859p6967M1907P9693
17508F72887J84627K2965L7338K64835O17205P23009O28214O93751L56395k4984
17498D176242k77643o18970p32418o95352l13715j42476k16309j41747m3594j68826
17488H25192j01174J0398L1113Q8646J48118P0191m3366r1361J3904l5840j01306
17477H14515J65146R5074k8807N2469R3364J50837K56807J58840R9187K05958
17467B063390N22324N80538N52753N33290M71473L22257J26788l02506n95471
17458D274836n92878n23471l87189j02388P6852l427J30230K41165K32883M99192
17448C845805M40080O71752Q04130N76166K36486m0815n99446o98752r48490n59463
$$ y = [397062, 462536, 666872, 603449, 553638, 575777, 615868, 617395, 628254, 551287, 593194, 672887, 857514, 880479, 917817, 1182652, 1799857, 2522866, 3151080, 3844831, 4201226, 4176242, 3898599, 3279629, 2547211, 1851859, 1538144, 1395668, 1179359, 1037612, 994018, 825192, 724018, 734416, 765529, 854175, 1002293, 1072484, 1029118, 937757, 951661, 915821, 814515, 979661, 1074735, 1045928, 1098397, 1191761, 1342598, 1599405, 1758245, 1857432, 2063390, 2585714, 3166252, 3719005, 4252295, 4723768, 5046025, 5172813, 4870307, 4274836, 3681958, 3158487, 2771298, 2668910, 2745762, 2742335, 2872565, 3113730, 3346613, 3845805, 4285885, 4957637, 5761767, 6337933, 6574419, 6533604, 5934158, 5235406, 4286916, 3727453]
17438C727453l13342m3608O1165M09562L68516M45874N13076N00222J60262Q7337
17428E916517K32380J37583J21141J82415K58668O279k10394o6127J58981L76819
17418G114262N71281P93183Q07347J268838J265397J538660K186682K668687K975479
17409B1189816L723918M664689O158747Q127977J1496513J7023881K5937751M2664923
17401A40988215O8323137P8535145N5076766K4842979k4562396o4577642p0068396
17394B08557808o1415466m5300051k8846186j7884371j1602280p917150n424191
17387C0168113m088578l141613k355051j898080j665480j104293q38008o06967
17379A4470043m62994o24269n61733l47160m03818K43193M86876J8354l36299
$$ y = [3727453, 3414111, 3370503, 3431668, 3841230, 4209746, 4655620, 5168696, 5668918, 5829180, 5916517, 6148897, 6286480, 6407621, 6590036, 6848704, 6854983, 6644589, 6578462, 6737443, 7114262, 7685543, 8478726, 9286073, 10554911, 11820308, 13358968, 15545650, 18214337, 21189816, 24913734, 29578423, 35737170, 43865147, 55361660, 72385541, 98323292, 140988215, 209311352, 287846497, 342923263, 367766242, 343203846, 278626204, 208557808, 147142342, 101842291, 72996105, 55111734, 43509454, 35592304, 30168113, 26079535, 22937922, 20582871, 18684791, 17019311, 15915018, 15077010, 14470043, 14007049, 13382780, 12821047, 12473887, 12070069, 12313262, 12800138, 12818492, 12482193]
17370A2482193l82203l38287j86622o3804o1044J41380P0469l7352R3793M77011
17360A2195534R67875J197461J742496K314582L138584L926799N269938P131269
17352C7884538J0133352J4716622K2213742L6426279N9549037P1828963N1298985
17345C04051518K4734246j9026320n7926868o3528846n6092500m1452218k6049960
17338F4709052j6114491j0541097p197908n286159l767166k678798k386476j924995
17330A4811962j573747j418436j199566r83629r26233p89081n37353l90674n12261
17321F480982k02126J18953r7426m68j18770l08987k13324k36367k71332k25231
17311D925904l08568n68840p38875o03067l74210n6731j27703r5578j11532j18119
$$ y = [12482193, 12099990, 11761703, 11575081, 11511277, 11450233, 11591613, 11662082, 11624730, 11718523, 12195534, 13163409, 14360870, 16103366, 18417948, 21556532, 25483331, 30753269, 37884538, 48017890, 62734512, 84948254, 121374533, 180923570, 252752533, 304051518, 328785764, 309759444, 251832576, 188303730, 132211230, 90759012, 64709052, 48594561, 38053464, 30855556, 25569397, 21802231, 19123433, 16736957, 14811962, 13238215, 11819779, 10620213, 9636584, 8710351, 7921270, 7383917, 6993243, 6480982, 6278856, 6397809, 6300383, 6299915, 6181145, 5872158, 5658834, 5422467, 5151135, 4925904, 4617336, 4048496, 3309621, 2706554, 2332344, 2275613, 2147910, 2052332, 1940800, 1822681]
17301A822681j20150j63898j49762k42063j10328J64099j29993j61951R7642P4301
17291A080578j32504l9575P5058P9333o829l8156j21915k60820j2632K16120N7130
17280H95788j5942k28628j27039r9102n0636o1176n604l3229r0215L5063J10538
17269C29818J59862O4776p4428j96521l7163j21708p0358m2041j6391q5081j05247
17258a94482P8185K98468K42066L0353p9470n7208k50286p3133q0760J73066L212
17247I0011k32723l696J8637N9219J87418K8021n9378r274k9201r550R5052O3490
17235A98026k4901k3073J13857m8127k7588M5193M5440j28002p6793K2320L2735
17224A29087J7117J0816N7935j0783j72810j70514K6565J73558k7109O3390p9997
$$ y = [1822681, 1702531, 1538633, 1388871, 1146808, 1036480, 1200579, 1070586, 908635, 1006277, 1080578, 948074, 908499, 983557, 1062890, 1056061, 1017905, 895990, 635170, 622538, 838658, 895788, 879846, 651218, 524179, 425077, 374441, 313265, 307661, 274432, 184217, 219280, 329818, 489680, 554456, 480028, 283507, 246344, 124636, 54278, 12237, -4154, -89235, -194482, -116297, 182171, 424237, 454590, 375120, 317912, 67626, -5507, -86267, 86799, 90011, -142712, -146408, -127771, -68552, 118866, 146887, 87509, 78235, 49034, 39484, 134536, 198026, 173125, 150052, 263909, 215782, 188194, 233387, 278827, 150825, 74032, 96352, 129087, 146204, 157020, 214955, 204172, 31362, -139152, -112587, 60971, 33862, 97252, 17255]
17213A7255R897m9436o8019j19928k1099M4383m0386K36356l0715Q0823P4198
17202A33329K8533n6197k29458L6123m5067p8790n7063l4995j9868L7548J95743
17191i0162K00340o102j09416R4319M5671n6146n6188K251j79112L0838j35951
17180b59658o5195J6537K02691n0682m6201L11004P0814j6117K6433j89048j35098
17169a34520J21040R3029p8605j95394N5711M7656R7256R9127J13082j0439o5396
17158A42547M5623O4316j10861j0040Q353j8672j64993n8685K5623o848J13054
17147B9417K0158l05031m1815J39703M4989j76362O5908Q3300L314J14904l3428
17136e4943j13366N4245J91564J00925j04192O4626P1505k28220j63528m5546
$$ y = [17255, 27152, -22284, -90303, -210231, -231330, -186947, -227333, 9023, -21692, 59131, 133329, 161862, 105665, -123793, -87670, -132737, -211527, -268590, -303585, -323453, -285905, -90162, 110178, 104076, -5340, 88979, 134650, 78504, 22316, 24567, -154545, -123707, -259658, -324853, -308316, -105625, -156307, -202508, 108496, 179310, 163193, 189626, 578, -134520, -13480, 79549, 944, -194450, -138739, -91083, 6173, 105300, 218382, 207943, 142547, 188170, 252486, 141625, 131585, 139938, 121266, -43727, -102412, -76789, -83637, 29417, 49575, -255456, -297271, -157568, -112579, -288941, -223033, -139733, -136419, -21515, -54943, -168309, -114064, 77500, 178425, 74233, 138859, 210364, -17856, -181384, -226930]
17126b26930J09402K63939J61428j23051k334j9000j22614l1863M9546m2828j21997
17115a06302K5398J52226J56605n2362l18614n9982r8248j11301O8540J51107
17105a92933J19215k5507M7024K5577J24499L6507q6590N369r8198r8593l2107
17094a75737O117J12251O6291k7705J1879J71260j56190n2916n3956j41467m3017
17083b83190M9087J03642j19425r472Q1563k6957J98367K2078j31994j2808n1083
17072a80192O1538L6325r6071N5762n4604o372K05983r311j14636R1385J96171
17061A85978K05956N8034j37033j94495j19682K0907n141j19662j05785N4253
17051a56670Q9681O7721Q2156p5933M7187N1238n5285j89271j12639P7835J45093
$$ y = [-226930, -117528, 146411, 307839, 184788, 182454, 163454, 40840, 8977, 58523, 15695, -106302, -80904, 71322, 227927, 175565, -143049, -203031, -301279, -412580, -344040, -192933, -73718, -99225, -52201, -26624, 97875, 134382, 47792, 53161, -45037, -143630, -175737, -169620, -57369, 8922, -18783, -6904, 164356, 8166, -44750, -98706, -240173, -283190, -234103, -130461, -249886, -259358, -177795, -204752, -6385, 15693, -116301, -129109, -180192, -118654, -82329, -178400, -122638, -177242, -183614, 22369, 13058, -101578, -10193, 185978, 391934, 449968, 312935, 118440, -1242, 19665, 14524, -105138, -210923, -156670, -66989, 732, 82888, 6955, 54142, 105380, 50095, -139176, -251815, -173980, -28887]
17040b8887J02047P6987m0759k44955O5039l7839j5323Q564J03438l5365j14008
17029a61061K691K6096Q0293n7456M4455p908q642n4137j77432j8788K29812K57523
17017A55446L8847k2709j08741j89821J0258N6373p8017l1085j5132L7557P8452
17006f8572J4116l974J3553O4074J55816j73688n0870Q714j66847j87808j7317
16995d12803J71489o5476K6079k501j51485l2916L02384J56490J4411J8372j51463
16984a27419j37585J8221M5936O413R7506O7284J8334m0958J19647j27063k70655
16973c30339R735o3479m1263k602J3681J90552J48963l394k13830K508J2194P8389
16961a98885j24611j51345j47953N5329J02216L0348k2257k7804o5365J98246
$$ y = [-28887, 73160, 150147, 109388, -135567, -70528, -108367, -123690, -115126, -11688, -47053, -161061, -158370, -132274, -51981, -109437, -64982, -72890, -81532, -135669, -313101, -331889, -102077, 155446, 194293, 171584, 62843, -126978, -116720, -60347, -138364, -169449, -184581, -147024, -68572, -54456, -58430, -44877, 19197, 175013, 1325, -49545, -40831, -207678, -395486, -412803, -241314, -306790, -280711, -283212, -434697, -467613, -165229, -8739, 5672, 24044, -127419, -265004, -246783, -200847, -194434, -96928, -29644, -11310, -52268, 67379, -59684, -330339, -320604, -384083, -425346, -427948, -414267, -223715, -74752, -78146, -291976, -289468, -277274, -198885, -323496, -474841, -622794, -567465, -465249, -434901, -457158, -484962, -550327, -352081]
16951c52081K59747O7243j27954o8382K00719J16688k01111j87214J2250j8773
16941b98868L8586J97761J4475l0398J35385m3629j27452j40332j06799J85868
16931a75403p5700j21172J6346N8353J58815j7549k4736k8888R1464O977l6944
16920a48437K2737n9849q2085J22272O9770M3370j28988m0797l720K61098N7071
16909A12442j75985J6808r9473k0645J88761R4566P8927o4544J7451j23541p5210
16898e0443K7174J48681K4340l44367k3309O4434J62700J97892J38735J36735
16888D82572Q2590L0945O5655L85372N36097J99355L9044j92567n21583k66929
16878H40551k63054k44248k27172l04014j40911K53484J26755Q7895R7120Q9269
$$ y = [-352081, -92334, -25091, -153045, -221427, -20708, 95980, -105131, -292345, -280095, -298868, -260282, -62521, -48046, -78444, 56941, 13312, -114140, -254472, -361271, -175403, -251103, -372275, -355929, -297576, -138761, -156310, -181046, -209934, -118470, -111493, -148437, -125700, -185549, -267634, -145362, -75592, -32222, -161210, -202007, -205727, 55371, 112442, -63543, -46735, -146208, -166853, 21908, 116474, 195401, 130857, 148308, 24767, -50443, -23269, 125412, 149752, -194615, -217924, -153490, 9210, 207102, 345837, 482572, 565162, 596107, 661762, 1047134, 1583231, 1782586, 1821630, 1629063, 1107480, 840551, 577497, 333249, 106077, -197937, -338848, -85364, 41391, 129286, 226406, 315675]
16868C15675m8916r7494p2362j29647R5492N2792r0989m0740O322J83915J17137
16857B91185L7162j17409j91416o331J1916R7768M9167M819L8083p3692o9576
16846G1676n3887n8670R6447J60006k6328j47255p6545r7026K57015L6835K9252
16835A91520K6503Q5955K06321L94283L82663M8851J96872J01008q0538l86570
16825A166868m02427k01807k20509j75441q8148j70418m1251J62722l5821N0091
16815D3859j44846m3713J3394j75170J0117p824M160J44888j01624J14702Q5004
16804e7053k1524k9927j06226P7452J44070l5228q7162q480O7278o1092O3649
16793e4243l6876j7621j09967P2267J59322K1164r66M6708L8963m7176n6810q7402
$$ y = [315675, 266759, 169265, 96903, -32744, 62748, 115540, 24551, -16189, -9867, 174048, 291185, 328347, 210938, 19522, 13191, 25107, 122875, 172042, 176861, 214944, 141252, 71676, 17789, -40881, 55566, 215572, 189244, 41989, -34556, -131582, 125433, 162268, 191520, 218023, 303978, 510299, 904582, 1287245, 1336096, 1532968, 1633976, 1553438, 1166868, 764441, 562634, 342125, 166684, 78536, -91882, -133133, 29589, -6232, 43859, -100987, -144700, -131306, -306476, -296359, -304183, -300023, -155135, -256759, -142057, -57053, -78577, -108504, -214730, -137278, 6792, -28436, -115598, -124078, -56800, -117892, -54243, -91119, -108740, -218707, -146440, 12882, 34046, 33080, 79788, 118751, 71575, 14765, -72637]
16781g2637j25163P4697Q4094m2136J65842K8375n2629r8161K6227j03389l03757
16770d18637j306J91476J60650M2952o6125j61363n8556K18330O4576r2260j24778
16759b45041Q8457J20020O8218r9839O3550P753J17427o495p9855p9046Q6594
16748D1743K1666l02433q7816O9674q07J6909j02162p5554m494M9901J05472K85458
16736A7557J6993o1344j54743q3966m9718N9429J55994j10924J029r877n0873
16725b70443R5968p2418n5938M6644J9710M6856k6314O3102Q6239k9603J33078
16714C6881P3585K0344L5267j15482j0755L8014K6164P609j32350m4280j90508
16703b55511j12498P4408J66841M2828j45549j3701K1240q5339m6194J5957Q1534
$$ y = [-72637, -197800, -123103, -39009, -81145, 84697, 113072, 60443, -37718, -11491, -114880, -418637, -419943, -228467, -67817, -24865, -90990, -252353, -310909, -92579, -28003, -120263, -245041, -156584, -36564, 31654, -68185, -4635, 3118, 120545, 114050, 34195, -44851, 41743, 63409, -239024, -326840, -257166, -257973, -241064, -343226, -418780, -423274, -373373, -267901, 17557, 34550, -26794, -181537, -265503, -315221, -255792, -99798, -210722, -209693, -219570, -270443, -174475, -246893, -302831, -256187, -236477, -189621, -215935, -152833, -66594, -96197, 36881, 110466, 130810, 166077, 50595, 39840, 77854, 104018, 111627, -20723, -65003, -255511, -368009, -293601, -126760, -83932, -229481, -243182, -221942, -307281, -353475, -337518, -255984]
16692b55984O3241O8633R982R6815K517J41061q0271l7709r9802k25731J0113
16681c07135R235J04860J37774k78037N094j1439Q9121K78551O9393n5733r9588
16670e7904l3781O2059K21537J370O246r7784j64220j41715j50952l6858k5056
16659d17058J19115R1637K5852P2864j12098r8158K2962Q1828K32909O6064o1498
16648B4419m5719n8539j55435o9372n0485O1026k76673q4022J87634K41684J66132
16637e9350R5518m2809k7779q3304m6088Q7462j09806n9341k0730N583M2965l482
16625b21161J52460M5850j38660k4702m9954N6873l3509K25842K11016P0268N0287
16614C44610j73157k58440n8450N6879l2932N8368r4720j46394J56006J74255
$$ y = [-255984, -192743, -124110, -114128, -17313, -14796, 126265, 45994, 8285, -91517, -317248, -307135, -297900, -193040, -55266, -333303, -328209, -339648, -250527, 28024, 97417, 41684, -57904, -91685, -29626, 191911, 193281, 199527, 101743, -62477, -204192, -355144, -392002, -417058, -297943, -206306, -180454, -107590, -219688, -317846, -294884, -213056, 19853, 85917, 24419, -21300, -79839, -235274, -304646, -355131, -294105, -570778, -654800, -467166, -225482, -59350, 36168, -6641, -34420, -117724, -163812, -76350, -186156, -245497, -266227, -260644, -217679, -221161, -68701, -22851, -161511, -186213, -236167, -179294, -212803, 13039, 224055, 294323, 344610, 171453, -86987, -145437, -88558, -121490, -63122, -157842, -304236, -148230, 26025]
16604B6025O9320j33307m4118j25077P5622K75628J66406O476p5721j08700P7334
16593B09888n6603k5644p2006n0795l47j17053L7976P9897O917j10798o8031K2544
16581a44055r0475J9912K07958K2602n5843m8668J6674J03689k3697n147Q6712
16570H9662J25949j58491Q0822J7393m7577j39070m1963j0932J7963L3473K6478
16559f293R8020Q8813j7981r1845p9603n4859M5427O3245J78170K03518j31730
16548B94882j44131o5502Q4276J50930r5485j30706j26539N86P9338j98690k6704
16537a77745J40527j550Q6556J53758J6455p5246l7339k16388q914j149L7948
16526h3087j4161m5153J0083O5082p7443J1317k8763o2597J63803K7474P328p0602
$$ y = [26025, 95345, -37962, -82080, -207157, -131535, 144093, 310499, 316975, 241254, 132554, 209888, 153285, 127641, 55635, 4840, 4493, -112560, -74584, 5313, 12230, -98568, -166599, -144055, -234530, -214618, -6660, 15942, -39901, -88569, -71895, 31794, 8097, 2950, 89662, 215611, 57120, 137942, 155335, 107758, -31312, -73275, -84207, -66244, -32771, -6293, 91727, 180540, 162559, 70714, -8889, -63748, -18321, 44924, 223094, 426612, 294882, 150751, 85249, 169525, 320455, 224970, 94264, -32275, -31689, 47649, -151041, -177745, -37218, -38768, 47788, 201546, 218001, 142755, 105416, -110972, -119886, -121035, -83087, -97248, -142401, -132318, -67236, -144679, -133362, -162125, -224722, -60919, -33445, -26117, -96719]
16514i6719Q4426L01642j7575j59761n7275M6523Q8461P9772j15529q5427j0214
16503E8324n7708j28883Q9903q934J7820J66009m3185o1461j1961j1462j19977
16492a11515n6609J73934J97445o426j46958R4399k49741j40212N3018Q7880l4415
16481a39200j0339j7787l6413P9479M807N7806J35938P771L3543o7818l8382j15716
16469a06311M6213M7437Q5552l4977m9795L5197n4022P976j08419r6331J31170
16458i6310N2488N2634K6351j42023j04275l0586Q9900j2200J51535J1204j45471
16447a46753p5587K50941J00387P022P6948J15931j79435k48919L8933K4139J30525
16436I4132J79422N6451M5951J8056M4140j98567j22851O9157m5715J3669J75821
$$ y = [-96719, -12293, 289349, 271774, 112013, 54738, 101261, 189722, 269494, 153965, 68538, 58324, 616, -128267, -38364, -47298, -29478, 136531, 93346, 31885, 19924, 8462, -111515, -168124, 5810, 203255, 196829, 49871, 144270, -105471, -245683, -192665, -104785, -139200, -149539, -167326, -203739, -124260, -119453, -61647, 74291, 82062, 115605, 47787, 9405, -106311, -60098, -12661, 72891, 37914, -11881, 23316, -30706, -22730, -131149, -227480, -96310, -43822, 8812, 35163, -106860, -211135, -241721, -151821, -164021, -12486, -1282, -146753, -222340, 28601, 128988, 136010, 212958, 328889, 149454, -99465, -60532, -36393, 94132, 273554, 330005, 375956, 394012, 438152, 239585, 116734, 185891, 140176, 153845, 329666]
16425C29666l8197m8341j33383o916N0079J15140N2313J48183J06745o5915m925
16414E04449l7132j4414n8389M2599R8192M9513L5642j0517O0692j7953J62163
16403H14845L33992k5835j87145J28047K09833K06370J0284l6171J32929K964
16393A590113l338r0291m3564l3648P16P4481p2036l0961J6562o0740M1976k38903
16381A150367l5067j04816j06375l8963k61299j51446J43079J07j22561O4202
16371E37228J25081j05768k91954j70965R5831K35437N4188j09573J27529l7931
16361D59103j93133J04177m9726j31664l6085K2320o822J00109j33831o0121J27639
16350B01966L6251r1647j81246l6978O392L9058J66888r8207K4049J72758m0538
$$ y = [329666, 291469, 243128, 109745, 102829, 152908, 268048, 320361, 468544, 575289, 509374, 504449, 467317, 452903, 394514, 437113, 535305, 584818, 620460, 609943, 670635, 652682, 814845, 1148837, 1123002, 935857, 1063904, 1273737, 1480107, 1490391, 1454220, 1587149, 1590113, 1586775, 1496484, 1452920, 1419272, 1419988, 1494469, 1422433, 1391472, 1408034, 1347294, 1389270, 1150367, 1115300, 1010484, 904109, 865146, 603847, 452401, 595480, 595587, 473026, 537228, 662309, 556541, 264587, 93622, 189453, 424890, 479078, 369505, 497034, 459103, 265970, 370147, 320421, 188757, 152672, 174992, 168170, 268279, 134448, 74327, 201966, 238217, 146570, -34676, -71654, -65262, -26204, 140684, 42477, 66526, 239284, 198746]
16339A98746j29789r9416O3514M706j81552p0398J29860N8765m4246p9067Q5602
16328f3275J14451J38733P2272j38284j38089J39692J36029J09291o4465o1054
16318B45301r5161L503p792R292q8074J0673K9769o0155k0397j20481o3638k9345
16306a86505J9092j3612R2760J18860R3955k00347j06258R0516K7989j6789p0522
16295a50861Q0370Q6154J20471J49594j23362j02815K17265r1418j48261o5021
16285b7884k4478j35073q1253n3787m6031J40579N4212J02693k3966q27R5973
16274A58M8142n7827j5489L7442q2496q8737l1357k504k3508K0673J42185N1588
16262a730o025j06857o0227l5967J03647P2475j36515l996k5489J08074P4930
$$ y = [198746, 68957, -30459, 33055, 37761, -143791, -214189, -84329, -25564, -69810, -148877, -63275, 51176, 189909, 262181, 123897, -14192, 125500, 261529, 370820, 306355, 245301, 150140, 153643, 145851, 155143, 67069, 77742, 107511, 47356, 26959, -93522, -157160, -186505, -167413, -181025, -88265, 30595, 124550, -75797, -182055, -91539, -63550, -80339, -150861, -70491, 15663, 136134, 285728, 162366, 59551, 276816, 185398, 37137, -27884, -52362, -187435, -268688, -322475, -368506, -227927, -173715, -71022, -94988, -95815, 158, 48300, -9527, -25016, 12426, -70070, -158807, -190164, -192668, -216176, -195503, -53318, -1730, -7755, -114612, -174839, -210806, -107159, -34684, -171199, -175195, -200684, -92610, -17680]
16251a7680j1127p6072j0788k4955Q7615K2481n1097R449l903L7413r7128M699
16239a31093r6267K151j6360j13131j1238J06021K73916M9496j40040J3609o125
16228f9061p3417R7773P5830k05524j74631N2173K0014R9798j5654n9943J2819
16217b39823K14555M7541j68251K6542J90473P7162j09703j69189R1346l1981
16207g1328o5978k4234N1494J2681j42049Q1626O1117p830k9212O5462m0010j34467
16195b42728R1543J46834J43050m3847k77459p5170k9003J12598J32239j1536
16185e3479j10757m2862k20j5586p4980p7899P2249J29235M1128l757N8576J55602
16173G7250j41529j90748K1660L227o0604P082J02994Q1279j26836O4491R5726
$$ y = [-17680, -28807, -104879, -115667, -140622, -53007, -30526, -81623, -72174, -76077, -38664, -135792, -131093, -227360, -225209, -241569, -354700, -365938, -259917, 13999, 63495, -76545, -62936, -69061, -142478, -44705, 31125, -174399, -349030, -296857, -276843, -177045, -192699, -252642, -239823, -25268, 22273, -145978, -119436, 71037, 148199, 38496, -130693, -39347, -71328, -137306, -161540, -110046, -97365, -239414, -157788, -96671, -104501, -133713, -68251, -108261, -242728, -151185, -4351, 138699, 94852, -182607, -257777, -286780, -174182, -41943, -53479, -164236, -207098, -207318, -222904, -297884, -375783, -303534, -174299, -133171, -136928, -78352, 77250, -64279, -255027, -233367, -230140, -290744, -283662, -180668, -99389, -226225, -161734, -66008]
16162f6008P8145l8073q7168r7643J19716O8030j12608n0822K7732J07318q0460
16151a31841j59991n0518Q9710M2405n646r5432j67968J07983K60558J94159p517
16140G5902m3211L1650l1303n5917j05520j41754J20229N9625l7312j14932j09283
16129c51826R8414N6940j13563J90076J36038j38332O6276k8160n5899k0742m2519
16118b03297l9550l1727N9794J44802J01060j31963k67682o2212L8564k7182j53511
16107e72904K0592K87367K25853j0187J2249l4363m26M1883j84195K349J32700
16096g9082m2345Q9302j1665j8402p274j3020k0739K0137m9667J22699J6865j65780
16084a58971J1644P7583j02008K372J01271R5580j76076L5447J52768j61904J30104
$$ y = [-66008, 12137, -25936, -113104, -210747, -91031, -23001, -135609, -186431, -158699, -51381, -131841, -291832, -342350, -252640, -210235, -215881, -311313, -479281, -371298, -110740, 83419, 75902, 32691, 64341, 33038, -22879, -128399, -270153, -149924, -90299, -127611, -242543, -351826, -253412, -196472, -310035, -119959, 16079, -122253, -55977, -84137, -140036, -160778, -203297, -242847, -274574, -214780, -69978, 31082, -100881, -368563, -430775, -392211, -419393, -572904, -552312, -264945, -39092, -49279, -37030, -71393, -71819, -29936, -214131, -211782, -79082, -121427, -32125, -43790, -62192, -69466, -82486, -103225, -83088, -132755, -10056, 6809, -158971, -147327, -69744, -171752, -169380, -68109, 27471, -148605, -113158, 39610, -122294, 7810]
16073G810K55719L6453o1509r4384J4427j916n6677q9988L7113j83189j35378
16062b71519p9337N4227m6495j3507J40443N5040K4320r5088L7271K4491j81113
16051c51267j05961J81760J64821J17142N7332j51813o732M8314q1234o1294m4895
16040b33827K8939Q8219J81253J64830j49587j96340R1158J35018q220j48072
16030d6629j59462M6152P4316n4165n06r3421k0544J6897j35537J3848q3669P8079
16018c64641J71248R0386Q4963L1690q0759j48453J33131L05538J07394m5735
16008B84762j44000J31724l5741j89079p5447k0580q5950p7630J35560n0027K738
15997a23670q1524j54948R4898M3032l6371K0023K11569r2343k19942q1382J87915
$$ y = [7810, 263529, 299982, 238473, 144089, 158516, 156600, 99923, 9935, 47048, -136141, -271519, -350856, -296629, -343124, -356631, -216188, -161148, -136828, -231916, -194645, -170154, -351267, -457228, -275468, -110647, 6495, 63827, -87986, -94718, -46404, -127638, -188932, -233827, -204888, -116669, 64584, 229414, 79827, -116513, -25355, 109663, 101443, -46629, -206091, -159939, -85623, -139788, -140294, -233715, -254259, -237362, -372899, -359051, -442720, -364641, -193393, -103007, -18044, 13646, -67113, -215566, -82435, 223103, 330497, 284762, 140762, 272486, 236745, 47666, -27781, -48361, -134311, -211941, -76381, -126408, -123670, -205194, -360142, -265244, -222212, -258583, -238560, -26991, -119334, -339276, -420658, -232743]
15986b32743J90323O3588K6504N8626p6504M082J29442J15194j81437l08442j13832
15975c25199k1452L1858J49743O0494K6223M1096j9831Q0578J0793l3606J95957
15964A96654Q2762j61447j80824q2995J8930n3482j8132J6538J166l3593n3194
15953b67617J05675J49812j43734n5292n2227L4497J63730J26425K9674j48378
15943e7435q2981l3811J71064n248K3835L6930M8263O751k00090j33040j32827
15932c58589Q8629K29159M5032N0883J47952j4394j86655n3904K5999l243j98395
15921b27526j08325M7778J1250m1510k5769N3960n7518J47520K10158J4461j53275
15910a28796o4322M9321Q7957p0755N4681n6335J08286O9177q455q5950n8357
$$ y = [-232743, -42420, 21168, 47672, 106298, 29794, 33876, 163318, 278512, 97075, -211367, -325199, -346651, -314793, -165050, -104556, -78333, -37237, -57068, 23510, 34303, 697, 196654, 279416, 117969, -62855, -145850, -126920, -180402, -198534, -181996, -180830, -214423, -267617, -161942, -12130, -155864, -211156, -263383, -228886, -65156, 61269, 90943, -57435, -140416, -174227, -3163, -8411, 15424, 52354, 100617, 107368, -92722, -225762, -358589, -269960, -40801, 4231, 55114, 203066, 188672, 2017, -51887, -25888, -29131, -227526, -335851, -288073, -276823, -318333, -344102, -290142, -347660, -200140, 10018, 24479, -128796, -193118, -143797, -55840, -126595, -71914, -128249, -19963, 49214, 40759, -45191, -103548]
15899a03548o991j8232R0246J06258q3264M2764m7352j71894k13718N0047L0244
15888c25440K637J18588j2975j09127j67876k7018J28418l0812P693J82320J00690
15877a32902Q7796N8488r9401N4215n5626j18366P5592N1883j40251q7902J72928
15866a33546J29507M802j07713J0909P1584m6115j29102p8470J7511J41424R4012
15855b5197p4526j29729M2036J66752j9806L8261Q1550J6272m3239p7382k37286
15844b62294j67247o2985J78571L22965J53773J44203o9241R654K916K2514p3018
15833A99811J0205p735j12793m5795J58119p3745j13940j42163m768Q2435k0912
15822g1281R1738M9141Q2170N483o9571K1624p0574r6426r8844k7113J05606P1164
$$ y = [-103548, -110539, -128771, -38525, 67733, -15531, 27233, -20119, -192013, -405731, -355684, -325440, -322803, -204215, -217190, -326317, -494193, -521211, -392793, -423605, -415912, -233592, -132902, -45106, 13382, -86019, -31804, -87430, -205796, -130204, -78321, -218572, -306474, -133546, -4039, 763, -106950, -96041, -24457, -70572, -199674, -278144, -260633, -119209, -25197, -99723, -229452, -187416, -20664, -40470, -2209, 79341, 95613, 52374, -25008, -262294, -429541, -492526, -313955, 9010, 162783, 306986, 237745, 247399, 250315, 272829, 199811, 210016, 202281, 89488, 43693, 201812, 128067, 14127, -128036, -132804, -50369, -71281, 20457, 69598, 151768, 157251, 87680, 109304, 38730, -57696, -156540, -183653, -78047, -6883]
15810f883J28740K4462m0022o3109J5852m8707J8129m819j50778j4810m4396N7712
15798a28629J12384K6206J11008K6019k4477j22725j49019O8631M6137r9160R6524
15787c7101l8644N7408O202j22250k7505R1681l0468K8389J50660q6742k29099
15776b37469M6371Q5777J81020K7687j27624j25073L1849L2658n6320J31924N7241
15765D8041o138j33474R9903n5388N5547q5640r1183R7989R0804L6430m0999r1479
15753g5587l1792J4619l46L3651J8462M7129r2524j1181J51341l3612N5612q526
15741F7246m6491L364k4825j60228j33982k1393o2181K4996J58011M9584j49182
15730b95081J53609N6080l0895j10819R7988J14322Q1080K844j6028p1398J14574
$$ y = [-6883, 121857, 146319, 106297, 43188, 59040, 10333, 28462, 23643, -127135, -141945, -186341, -128629, -16245, 9961, 120969, 146988, 122511, -214, -149233, -80602, -34465, -133625, -37101, -75745, -18337, -12135, -134385, -161890, -70209, -100677, -72288, 78372, -8370, -237469, -191098, -105321, 75699, 103386, -24238, -149311, -117462, -84804, -141124, -9200, 48041, 41903, -91571, 8332, -47056, 8491, -77149, -168332, -70343, 20461, 56891, 15892, -75587, -107379, -92760, -93106, -59455, -40993, 6136, -86388, -97569, 53772, 20160, 75772, 67246, 20755, 24119, -706, -160934, -294916, -316309, -378490, -353494, -195483, -145899, -295081, -141472, -85392, -116287, -227106, -129118, -14796, 66284, 69128, 53100, -18298, 96276]
15719I6276k8522l2135r905k4763O7578K00678j87543k0223R3937n6877k03697
15708a05196p0083k8057j6303J65641J75517k4601n4368n7806q6367J29145M4199
15697G1721j8484j36971j42518J10830R9594Q0441K8659j39543q5140j9126o3354
15686b13891O4392J40783P890j3147P7444j22133j61297O1653J26648j11428j08473
15675b51559M3128J20393J37010J29766R310j32553o7438L9484O4142L5850m2951
15664H4582j79669n8802J43413J81742J729r8770p6097n9116l2217J16735K772
15653B6302J3383J37838N866j30596j14258o2722k9610M8575o7886j8473k854
15642a94435j07526J45617K79287J44965o3043j56586P9979p2354j26021Q6541
$$ y = [96276, 67754, 35619, 25714, 951, 68529, 269207, 81664, 61441, 155378, 98501, -105196, -175279, -203336, -219639, -53998, 121519, 96918, 42550, -15256, -101623, 27522, 71721, 53237, -83734, -226252, -115422, -15828, 64613, 93272, -46271, -131411, -150537, -213891, -149499, -8716, -826, -13973, 63471, -58662, -219959, -158306, -31658, -143086, -251559, -208431, -88038, 48972, 178738, 188048, 55495, -11943, 27541, 91683, 127533, 84582, -95087, -153889, -10476, 171266, 172995, 74225, -1872, -60988, -93205, 23530, 26302, 39685, 177523, 183389, 52793, -61465, -124187, -153797, -105222, -173108, -191581, -194435, -301961, -156344, 122943, 267908, 204865, 48279, 128258, 55904, -70117, 16424]
15632A6424Q4993j5624r1528l5564L3836l6006k78160Q4702J34194R8381K9033
15621B4681r2519n0794J83392J79542j29727p6114m690J27748q6332r7230m4893
15610f6936o6327j72559K184q675M9285O7249K3101L9567j5431p7884o9375K2741
15598b73060n1851J17207J24938p0263l3536J17644J42995J30343r8764k30038
15588a24385j26830j52455J08994j3279O2965m9682M8586J35414P262j10856j1868
15577b26134K9087q3693j69654J0217J12591M5584L9358L7558j1641L3744R2860
15566i0123Q044o5003p158J6703j7381k7813J50644O4436j42309j53578M1564
15555b21974O9292p8701N2222J10388M7394Q1215M5048n7586J60727o511r9309
$$ y = [16424, 101417, 85793, -5735, -41299, -7463, -43469, -321629, -236927, -102733, -4352, 24681, -67838, -118632, 64760, 244302, 114575, 38461, 33771, 161519, 75187, -22043, -66936, -133263, -305822, -303638, -312313, -263028, -195779, -172678, -133111, -148542, -226426, -295801, -273060, -324911, -207704, -82766, -153029, -186565, -68921, 74074, 204417, 105653, -124385, -251215, -403670, -294676, -307955, -244990, -294672, -246086, -110672, -103410, -214266, -226134, -197047, -280740, -450394, -440177, -327586, -282002, -242644, -205086, -216727, -182983, -90123, -82079, -147082, -154240, -137537, -154918, -182731, -32087, 32349, -109960, -263538, -221974, -152682, -231383, -179161, -68773, -21379, 59836, 104884, 47298, 208025, 201514, 102205]
15544A02205P071j14931L9770n4604j48286J08869J1365k5534m9051p1590p5750
15533b70466O4180K45606l4268k07719p909R3582l3055P724J26738O5864k02440
15522a52163R1977L3923j56877j95478L9872K61964L7470n1633K3885o5756J19461
15511a3355L6883j86503L8532J25433K1958N6378j03656j16390k123J08729J55866
15500A21752J9332p0999j06721J817N5838J08281J99721o1214k16266o4300l9668
15489e2427K5159L5008j63391j15573N7057K10243r6988J10604J22594O2972k24774
15478b9516n9939N9403K4851o8205j1177J10516j03580j5136P5893j39710j86668
15467c43268K0273m3883J13335J63448R1812K05705L0628r6978j21019j20540
$$ y = [102205, 109276, -5655, 34115, -20489, -168775, -59906, -48541, -74075, -123126, -194716, -270466, -206286, 39320, 5052, -202667, -210576, -116994, -150049, -142325, -15587, 50277, -152163, -60186, -26263, -183140, -378618, -338746, -76782, -39312, -90945, -67060, -132816, -13355, 23528, -162975, -124443, 990, 22948, 79326, -24330, -140720, -142843, -34114, 121752, 141084, 70085, -36636, -34819, 21019, 129300, 329021, 267807, 51541, -12759, -52427, -27268, 7740, -155651, -271224, -214167, -3924, -100912, 9692, 132286, 195258, -29516, -89455, -30052, -5201, -73406, -84583, 25933, -77647, -92783, -16890, -156600, -343268, -322995, -366878, -253543, -90095, 1717, 207422, 238050, 141072, 20053, -100487]
15457a00487K0669j12702o6828P3575J96742q1305p8503O5809J006j07002M3028
15446a45998K582J486J35785r7394p7441j37784J1485J06173m8311p8134J57372
15435a70179J57676j43944Q551O1800M8415j39938q758J78694q1793q4239q4921
15424b58636j6024r3531J2572K29128J71901j51580n3516n6618J60703J25338
15414F9737J08027O0157j66003k1329J06031N3486J386m2689r0470j8006M6428
15403A06755P9597L2863P986M8324m708j20425j87764L6853J11570K62o6453K0557
15391F5417j3729Q3543J9857j98150l0146p6538n343P7937j6075O9052Q7379J0065
15379G3269J94147j3674k13825j09434o4649n2400J47942Q8809J66036n3456k05638
$$ y = [-100487, -79818, -192520, -259348, -185773, 10969, -70336, -148839, -83030, -82024, -189026, -145998, -143416, -141930, -6145, -103539, -180980, -318764, -307279, -201106, -249417, -327551, -170179, -12503, -156447, -147896, -86096, -37681, -177619, -186377, -7683, -89476, -173715, -258636, -274660, -368191, -355619, -126491, 45410, -106170, -159686, -216304, -55601, 69737, 177764, 237921, 71918, 50589, 156620, 210106, 211492, 168803, 78333, 60327, 106755, 186352, 219215, 227201, 275525, 270817, 150392, -37372, -519, 111051, 111313, 44860, 65417, 51688, 135231, 155088, -43062, -73208, -149746, -155089, -77152, -93227, -24175, 63204, 73269, 267416, 253742, 39917, -69517, -134166, -186566, -38624, 50185, 216221, 162765, -42873]
15368d2873k64475q5483K11937K11748J20358p3154j23467K5893N5824O8337j22499
15357a7854j29503J0502L9183q0735J3138N6272o8426n3916P7397l7094M6208
15346a44828J64748K0153L3780M4878J37925j04555j04128M2940K09494J4241
15336C14648n605k685k45987L6523J50705n1982r675j30035l7399J18318L1330
15325A68156p3487K5145J62603k3640k25505J9478l9398L6716O125k5791N9948
15314I0350j26613o4549J2741m0551Q8582n1423M8486j26414j53327Q0389J97356
15303d4973R5725j53672J23827J60982j03449j06945O6603K1024k07678q8176
15293b36732J39524N9606J70620R3663j78040p5062p9952J75380J65860k50766
$$ y = [-42873, -307348, -392831, -180894, 30854, 151212, 78058, -45409, -19516, 36308, 104645, -17854, -147357, -136855, -97672, -178407, -165269, -108997, -177423, -231339, -153942, -191036, -144828, 19920, 40073, 73853, 118731, 256656, 152101, 47973, 90913, 300407, 314648, 309043, 306358, 60371, 96894, 247599, 195617, 185942, 55907, 18508, 136826, 168156, 94669, 119814, 282417, 258777, 33272, 52750, 13352, 50068, 56193, 30402, 90350, -36263, -100812, -88071, -128622, -40040, -91463, -42977, -169391, -322718, -242329, -44973, 50752, -102920, 20907, 181889, 78440, -28505, 38098, 59122, -148556, -236732, -97208, -37602, 133018, 226681, 48641, -26421, -106373, 69007, 234867, -15899]
15283a5899j40421M4260J10018J5964j27859p8158O2805L7068J9829J50352j2797
15272F5162j08570q8002Q0879J5177j28681O7486J94720J52386q6742j29073R3488
15261A28230p9682l3549p7352O9426k4866j12937j6420j3726J9242o1964K1767
15250a81831J7108K07361q0658q2745l8777J19375J43176r6218j68133r1637q7415
15239c40394K17836J03600P5992L0227N506r2216q5306N0615k4294n0629j3084
15228a22147J23150J69299o0423j56028l9346J32535Q8909j79599j78391k7880
15218b49921P0544J29507J73156J3488R371K0116j26459l6535J15317N0224p6621
15207I2187n2374L5512M1740p161l9524Q4538k1731k0873j01076Q3175O3308P6137
$$ y = [-15899, -156320, -112060, -2042, 13922, -113937, -192095, -129290, -92222, -72393, 77959, 65162, -43408, -131410, -50531, -35354, -164035, -96549, 98171, 250557, 163815, 34742, 128230, 48548, 14999, -62353, 7073, -17793, -130730, -147150, -160876, -141634, -203598, -181831, -164723, 42638, -38020, -120765, -159542, -40167, 103009, 6791, -161342, -252979, -340394, -122558, -18958, 57034, 87261, 92767, 551, -84755, -34140, -58434, -109063, -122147, 1003, 170302, 109879, -46149, -85495, 47040, 135949, -43650, -222041, -249921, -179377, -49870, 123286, 136774, 146145, 166261, 39802, 3267, 118584, 168808, 92187, 39813, 75325, 117065, 109904, 70380, 154918, 133187, 112314, 11238, 94413, 157721, 233858]
15195B33858P9646P0339o7341j39102p0426p816P930Q0548J6841K0243p2361L4618
15183A86977L0596j13328j74611j18774J81836Q8495q1760j26273j40089n633
15173b72564J87710J69836k07732j60075Q3364K9174j9022N9957J54905M5213
15163G0766j48640J6450m677k3347J26858k8125m1108J69472o4581l8180M4106
15152G8994j85519j43357K3699r1195q8525N190N4473K5208M4487L2451J15543
15141a28551Q7902M2775j8627p345O0545k02627j39836Q713J2176J24429O6543
15130i3903j7264p8153O8173J03123K8213j665m6756l2854J304k0268K12467k6122
15118I6295k4154O231p3421j47037Q8484N5111j15604J67821n338k15639p2187
$$ y = [233858, 313504, 383843, 316502, 177400, 106974, 99158, 107088, 187636, 204477, 224720, 152359, 186977, 217573, 104245, -70366, -189140, -7304, 81191, -569, -126842, -266931, -272564, -84854, 84982, -122750, -282825, -199461, -170287, -189309, -129352, 25553, 70766, -77874, -61424, -66101, -89448, 37410, 9285, -31823, 137649, 73068, 34888, 78994, -106525, -249882, -226183, -317378, -405903, -400713, -346240, -321032, -276545, -244094, -128551, -40649, 2126, -16501, -23846, 36699, -165928, -305764, -297051, -284875, -160446, -93903, -111167, -189320, -121147, -18024, 10189, 8524, -38232, -71086, -69782, -90050, 122417, 96295, 72141, 78372, 4951, -142086, -53602, 1509, -114095, 53726, 48388, -167251, -239438]
15107b39438Q247J51404m6021R908K5741Q5102J53548q0057k05827j33272k2092
15096b92757K0639P2589J77425N5168R2183r6788m3889N395N6954j03574j23365
15085a80020M2019N1761J25590O6086J03091q4616j32976L7342q2831l6676J51474
15074F0244Q7941m6748Q7478n473N6502P671K8065J6405J8404M6826j82924k23643
15062d9252p182N8561K50699K26849j34391j70742m6136K1799O0092k1468j5950
15051A72879q607j46568j62224J20658J54835L6375K4160J820j08019M1482M580
15040A31371q2879J25771M5344r7450P5255J49292k27180k52417J835l3568N8056
15029a06570J382O5965j2813N1665k7765J18088L1539O0765r9615j96361k02411
$$ y = [-239438, -231191, -79787, -125808, -115900, -90159, -5057, 148491, 68434, -137393, -270665, -292757, -272118, -199529, -22104, 33064, 125247, 28459, -15430, -10035, 46919, -56655, -180020, -138001, -86240, 39350, 105436, 208527, 123911, -9065, 28277, -54554, -91230, 60244, 148185, 101437, 188915, 183442, 239944, 247615, 275680, 292085, 310489, 357315, 174391, -49252, -56434, 2127, 252826, 479675, 345284, 174542, 128406, 150205, 210297, 188829, 172879, 164272, 17704, -144520, -23862, 130973, 167348, 191508, 193328, 85309, 126791, 131371, 48492, 174263, 219607, 122157, 197412, 346704, 119524, -132893, -131058, -164626, -106570, -105188, -39223, -52036, -371, -28136, 89952, 121491, 182256, 82641, -113720, -316131]
15018c16131Q3158l9675O8993M8665j13107J15979K54737N6726m5895k26852m0222
15007a53624J20841n4720j80882o3712J3861K83309J52478j2378j29710j64125
14997a88662N3716Q782k007R5488J8969p2322r6488J02559J45821J73498J36448
14986C75802P7891k03533k31984J163M3501q2268N5530j10905n9030m5673P4868
14975a04638J5801L2114K4476o2786j7980J02281K15133L7828l9382j33599p4943
14964e695L6648k3356N4043K22656o4181m5372k11865j36634N2066M6668N6921
14953a8101M9682P306Q1496o2460j07710Q0387N7717o9569P5604J28455K8882
14942B51689r1881j21232j63342J99851R9186m5291R1304R6998n7190j33513p2882
$$ y = [-316131, -232973, -272648, -203655, -154990, -268097, -152118, 102619, 159345, 113450, -113402, -153624, -32783, -87503, -268385, -332097, -318236, -34927, 117551, 105173, -24537, -188662, -134946, -126164, -128171, -32683, -13714, -86036, -182524, -79965, 65856, 239354, 375802, 453693, 250160, 18176, 19339, 62840, -19428, 36102, -74803, -133833, -179506, -104638, -88837, -56723, -32247, -95033, -113013, -10732, 204401, 242229, 202847, 69248, -5695, 30953, 7597, 61640, 284296, 220115, 174743, -37122, -173756, -121690, -75022, -18101, 31581, 38887, 120383, 57923, -49787, 30600, 88317, 18748, 94352, 222807, 251689, 159808, 38576, -124766, 75085, 174271, 128980, 220284, 317282, 260092, 126579, 53697]
14931E3697K715j46177o5422o4182P2100J00633j23590j27616O9487l1447j1500
14920b71302K28139L99L5349K6263p0869p4146j461K15587P5340j39030J1886
14909C6155j20499M5179K3785O939R007m9970N1985J70549M5310j18229r1821
14898H390q7899p3536O7257Q2101L7741N3290j17940K8631K635j1329J03845r6936
14886c750o3021o1989Q1530r317j6870l9980l5913J17942J16918J63686m7773
14875B01463r529N077N1650r846l8287j39693m7792m8470M8579R3755J12832J35624
14863C55363p5085k37943j32876n4942J40233r1868k08353J22451J23939J69549
14853A10468L1183m6552j5101r4333n5908J49535M6000n9525P0962K0966j9350
$$ y = [53697, 56412, -89765, -155187, -219369, -147269, -46636, -170226, -297842, -228355, -259802, -271302, -43163, -42764, -7415, 18848, -52021, -126167, -127628, 87959, 163299, 24269, 36155, -84344, -39165, -15380, -8441, 566, -49404, 2581, 173130, 218440, 100211, 8390, -79509, -153045, -85788, -3687, 34054, 87344, -30596, -1965, 670, -10659, 93186, -3750, -66771, -128760, -47230, -56547, -73417, -113397, -149310, -31368, 85550, 249236, 201463, 191934, 197011, 248661, 238815, 200528, 60835, 13043, -35427, 13152, 106907, 219739, 355363, 280278, 42335, -90541, -145483, -5250, -97118, -305471, -183020, -59081, 110468, 141651, 95099, 79998, -14335, -70243, 79292, 125292, 65767, 136729, 157695, 138345]
14842A38345l8697l9880P0653J01899N8370J16357k22626k48681J13275K15785
14832B64800q5736r6869n57L8561J8810p1792Q542J21858j60643J73203J71691
14821C81868n4265p7329k14753J6016K0928q1251J7424m530L2629J49766N6285
14810B42788k3526j35315P83J14998M6958j12312j15031J07243j9444O8338K4904
14799B00384R894o0406j16392o116l0261j63852R2421Q4219O9892J18667j5146
14788A83304j1755J26075Q7605j29657j31618M595p5062j49302j7417m3541J00959
14777e5814P4704P7951n1289r4403o3038j8119J19243N1828k659O9471n4560j3423
14765C9892j11155o9697N8590r263r5106J48314K15761l8968j81148k7233K325
$$ y = [138345, 99648, 59768, 130421, 232320, 290690, 407047, 184421, -64260, 49015, 264800, 179064, 82195, 81638, 120199, 139009, 67217, 75759, 197617, 36974, 210177, 381868, 327603, 250274, 35521, 51537, 72465, -8786, 8638, 4108, 36737, 186503, 242788, 219262, 83947, 84730, 199728, 246686, 134374, 19343, 126586, 107142, 175480, 200384, 210278, 149872, 33480, 27364, -2897, -166749, -74328, 9891, 79783, 198450, 183304, 171549, 297624, 385229, 255572, 123954, 128549, 53487, -95815, -113232, -156773, -55814, 18890, 96841, 45552, -48851, -111889, -130008, -10765, 41063, 38404, 107875, 53315, 39892, -71263, -140960, -82370, -91633, -186739, -38425, 177336, 138368, -42780, -70013, -67688]
14754f7688p1517J13032j0564j25405j7942l1225j2661K38560J01707j04416o916
14743D965J07161k5933q3121n3402J26789J18682K5360j97862J27r5273n8063
14732a30570M9916M1918O6251J4549M8926M7417r952L4479j33423K6233M4781
14721A00525Q0766R2937o5818j92381j97539L5246j8256J77150K3602L3795l4683
14710C5344k9549l9820K3289r9602q6409j06202J10531J95726K04271K2716j67115
14699F3180J55457Q0062m1126j78566j74162j01700m4598J75940J30159j0041
14689E4605p4585J27573n313p9357M4170o2202J11006l9698p3464n7440J81715
14678A27010J52513j58206j5961q594q5306q5768P0761j29451j09207j7163J24989
$$ y = [-67688, -139205, -26173, -36737, -162142, -180084, -211309, -223970, 14590, 116297, 11881, 4965, 112126, 86193, 3072, -50330, 76459, 195141, 220501, 22639, 22766, -72507, -130570, -80654, -38736, 27515, 42064, 90990, 138407, 128455, 162934, 29511, 55744, 100525, 181291, 274228, 208410, 16029, -181510, -146264, -164520, 12630, 36232, 70027, 35344, 5795, -34025, -10736, -110338, -196747, -302949, -192418, 3308, 207579, 230295, 63180, 218637, 298699, 257573, 79007, -95155, -196855, -241453, -65513, 64646, 54605, -19980, 107593, 102280, 22923, 67093, 4891, 115897, 76199, 2735, -54705, 127010, 279523, 121317, 105356, 96762, 11456, -74312, -3551, -133002, -242209, -259372, -134383]
14667a34383J03050q189K054N9548p9992P8922J58541n323J306k4520l453m901
14655A42660N2533Q4002j34967j12390n2076M1582J27135j21342k93644K08526
14645e7981J38788M2268J65826L6007l8186L0976j57523l173n4033J6558M2642
14634A62169n5814q4355q5940J52230O4155j72304J80826N1533k86316o7812J24210
14623a7418P6690J23091K293j83021p501J24042l9234m1227n2965J6008R123K4725
14611C4606L8977O9203j08689j78096J09049N5301J9011R8588l9862j21180R499
14600a3593J12280O290K4034J9350k8318J7196L6211j02296L4890R6346j12142
14589I0248j3766R17o0030J32729O5299J40990J4226j36934k5633m6525o5690
$$ y = [-134383, -31333, -39522, -37468, 22080, -57912, 21010, 179551, 174228, 175534, 151014, 147561, 142660, 195193, 279195, 144228, 31838, -20238, 21344, 148479, 27137, -266507, -57981, 80807, 123075, 288901, 324908, 286722, 317698, 160175, 157002, 102969, 119527, 162169, 106355, 22000, -63940, 88290, 152445, -19859, 160967, 212500, -73816, -141628, -17418, 59272, 182363, 184656, 1635, -5866, 118176, 78942, 37715, -15250, 758, 9881, 34606, 73583, 142786, 34097, -143999, -34950, 20351, 39362, 137950, 98088, -23092, -13593, 98687, 104977, 129011, 148361, 120043, 137239, 173450, 71154, 106044, 202390, 90248, 76482, 77399, 17369, 150098, 215397, 356387, 370613, 233679, 208046, 161521, 95831]
14578I5831K0763L6857N5310p0815j2777L0408o7935L368K1736M098J5751J48377
14566B80972J64913K0745j58041k85570m1878J42012m7282j10993O0440J19102
14556A44420k3474n4362J10286l1458j3930M1744J4740J278N6016r4148l0997
14545A20115R6897P8066O143p9982o6413o4637l4915n7143L26O4921J45522J43411
14533C52311m1485j53127j78333J3705J10482P1462P5287j07722k0160J4797m1844
14522I5373Q0339P4861j23382J54076o150k28258J0467R801J6613p546n4219K8337
14510E0312L5465J08413N6880N9163O2198J9306k8274j19946k23123J24530L6182
14499A81106n7171L8816m3667M6840L1108j59638j1616J70623Q8908m2331r0605
$$ y = [95831, 116594, 153451, 208761, 137946, 125169, 155577, 87642, 91010, 112746, 116844, 132595, 280972, 445885, 466630, 308589, 23019, -18859, 123153, 75871, -35122, 25318, 144420, 120946, 66584, 176870, 145412, 131482, 173226, 187966, 189244, 245260, 151112, 120115, 217012, 295078, 301221, 221239, 154826, 90189, 55274, -1869, -1543, 63378, 208900, 352311, 310826, 157699, -20634, -6929, 103553, 175015, 250302, 142580, 122420, 137217, 95373, 175712, 250573, 127191, 281267, 275117, 46859, 57326, 67127, 83740, 76194, 21975, 50312, 85777, 194190, 251070, 310233, 372431, 391737, 363463, 243517, 20394, 144924, 181106, 123935, 162751, 119084, 165924, 197032, 37394, 25778, 196401, 285309, 242978, 152373]
14488A52373j5696J05442M0449k7275m1289o6881j1951p0154j6049J02659Q2608
14477B34236j30000j88831j5873L0476N9115N2272J05427K7690o6156j45170J95105
14466A58291P7249o3967R090J26599J28987J8180l02834k11028P8641O9036j3999
14455G4245J27739K9786j04113J09880J3358j58430k8637J7453K4583k6108M5294
14444A25050J22273R7382J75058o9933J1577m6751j80756l1650o876J9717k172
14433B12919l5998Q380K1008J8007o0701p5215j2447k11003n9078k0264K15300
14422I08N2848j6291O3605L5441k1370j24017J09466l9940J18566J79173Q0382
14411D38771k7917r3903k8699J34738O4373k01307j13752L3637M0202n3272j63729
$$ y = [152373, 136677, 242119, 282568, 255293, 214004, 147123, 135172, 65018, 48969, 151628, 234236, 104236, -84595, -100468, -69992, -10877, 41395, 146822, 174512, 108356, -36814, 158291, 235540, 171573, 180663, 307262, 436249, 454429, 151595, -59433, 19208, 88244, 74245, 201984, 231770, 127657, 237537, 250895, 92465, 63828, 81281, 105864, 79756, 125050, 247323, 344705, 519763, 449830, 461407, 414656, 233900, 202250, 195374, 215091, 212919, 176921, 185301, 206309, 224316, 163615, 88400, 75953, -135050, -194128, -214392, 908, 53756, 37465, 101070, 136511, 115141, -8876, 100590, 60650, 179216, 358389, 438771, 410854, 316951, 288252, 422990, 487363, 286056, 172304, 205941, 246143, 192871, 29142]
14400B9142j7773r4225J24142J23911L3467J30920k8027k2475q5543j8059P0125
14389B45605J26412P7594j27489k00271N427P3916j23472r6386J6514P2494P2003
14378A42347J7755L7233J54489n2824k62947q6561K00054Q0732j41497q1804K02320
14367B09297Q8801j50372k1492J2632N5300p1094j30602O4196N6009N6769K84156
14356D53600J28620o0186q3349m8931o0249j00555k52282q8268p1740J16281R2109
14345B5050M8867N0843j49496p2521K34497N6254l127L6618L2738J076j28306
14334A32493l0625L1839M6540j3587L0693K57573k1731j55338K27996M1598r7350
14323D50101j88705M6339J94500M5285j63299p1748L0384n2338j2529k1887K50262
$$ y = [29142, 11369, -82856, 41286, 165197, 198664, 329584, 301557, 279082, 193539, 175480, 245605, 372017, 449611, 322122, 121851, 127278, 201194, 77722, -18664, -2150, 70344, 142347, 160102, 197335, 351824, 299000, 36053, -50508, 149546, 230278, 88781, 6977, 209297, 298098, 147726, 126234, 138866, 194166, 123072, -7530, 56666, 112675, 169444, 453600, 582220, 522034, 438685, 389754, 329505, 228950, -23332, -111600, -183340, -67059, 25050, 73917, 124760, -24736, -97257, 137240, 193494, 190367, 226985, 259723, 260799, 132493, 101868, 133707, 180247, 166660, 197353, 454926, 433195, 277857, 505853, 547451, 450101, 261396, 307735, 502235, 547520, 384221, 312473, 342857, 290519, 277990, 256103, 506365]
14312E06365M418j92596j66005j7658R9785R4030M5062n1648L0723j02531M9078
14301B99023l5512O4941m5764k0300j4096j32208q6524J91989L506j98316J29983
14290A56722K20934J7619J2823n5780j63950j0011J24252R6767R9408j7780o9444
14279D11560j5209k13513M3311K5183k3778J08522J72463N0304j45092q9600K06858
14268E31009J43414j95489n4993J3398J06476K6214J32776P1951l6361j31015
14258F07380j41173N8386j32364k8585Q9684r5449j01077O9337M5924o793P8337
14247D43607Q9429J24617k16062j74664P4022K496j20423Q7637j4099J6081o1923
14236B50718j04265M0564L6817r016O7005K37798q1123p2868l8637K7607J5010
$$ y = [506365, 510783, 318187, 152182, 134524, 234309, 328339, 373401, 321753, 352476, 249945, 299023, 263511, 328452, 282688, 262388, 248292, 116084, 29560, 221549, 225055, 26739, 156722, 377656, 395275, 408098, 352318, 188368, 178357, 302609, 399376, 498784, 481004, 411560, 396351, 182838, 226149, 251332, 227554, 336076, 508539, 558843, 413751, 324151, 531009, 674423, 478934, 423941, 437339, 543815, 570029, 702805, 774756, 738395, 607380, 466207, 524593, 392229, 363644, 453328, 357879, 256802, 326139, 372063, 365270, 443607, 533036, 657653, 441591, 266927, 340949, 343445, 223022, 310659, 296560, 312641, 250718, 146453, 187017, 223834, 214818, 281823, 519621, 438498, 365630, 326993, 354600, 369610]
14225C69610K6992L6162J572N0552k8799r2745j00649K03495M7669p2874K0486
14214D61471J93089J56379m2688k70724M0918L6738p7619p4909L9666J13824j12048
14203D64097j07550l2973l4379J62431P5442O0841J70885N5475j6609n8451k52662
14192D86547n5005J99249J67696n2022j39982j33535j29427k5974L0103N9102
14182D06752r2116J15066J65705O0671j35244j60164k3626J93510O1504J4656
14172F06714m4743n1056Q7316J57557k0558J4490K5102q3310p6474Q0797Q808
14161G04643J48799P8280j73392o4464r1378K0022j1525j39700L3400J33793J61949
14150H00427K7791j20037j88419q5963J10893j00618j80551m7319L6145J7220
$$ y = [369610, 396602, 432764, 434336, 484888, 456089, 363344, 262695, 466190, 513859, 440985, 461471, 654560, 810939, 768251, 497527, 538445, 575183, 497564, 422655, 462321, 576145, 464097, 356547, 323574, 289195, 451626, 527068, 587909, 758794, 814269, 797660, 739209, 486547, 431542, 630791, 798487, 746465, 606483, 472948, 343521, 317547, 347650, 406752, 314636, 429702, 595407, 656078, 520834, 360670, 337044, 530554, 592058, 606714, 561971, 510915, 598231, 755788, 735230, 749720, 774822, 691512, 615038, 695835, 704643, 853442, 931722, 758330, 693866, 602488, 622510, 610985, 471285, 504685, 638478, 800427, 828218, 708181, 519762, 433799, 544692, 444074, 263523, 216204, 252349, 269569]
14140B69569J55678q7516j0181J10304j3929K9749N1711n2531m3566r1133J16939
14129D35094K47957J53462J57773j5555j28597J01725k3398j60288k25227K7782
14119E70728o219j3401J38455M1061j92382j00542R7994j2651o2905O7746J05736
14108F33620J96123K57139J49333Q3765l499q0830j10955k84142p7735l586N3875
14097H13108K66433j20922k1316j55462k7014P6259j23653J7038J21184Q7859
14087I33514J4629K0261j10591j17559K0173J74042O5538k10309k96886K67644
14077G60456K05297q5273r9373k4386M7944k4889l5735o4288o4968J38293J92457
14066I45535O1906j26389J1058J27426l7870R4185J02996q5374j26190J4892j06746
$$ y = [269569, 425247, 337731, 327550, 437854, 423925, 453674, 505385, 452854, 409288, 318155, 435094, 683051, 836513, 994286, 978731, 850134, 951859, 928461, 768173, 542946, 570728, 564509, 551108, 689563, 730624, 538242, 437700, 535694, 523043, 460138, 527884, 633620, 829743, 1086882, 1236215, 1319980, 1316481, 1235651, 1124696, 840554, 762819, 759233, 813108, 1079541, 958619, 937303, 781841, 754827, 831086, 707433, 724471, 845655, 933514, 948143, 968404, 857813, 740254, 760427, 934469, 1000007, 789698, 492812, 760456, 965753, 880480, 781107, 756721, 804665, 779776, 744041, 679753, 614785, 753078, 945535, 1007441, 881052, 892110, 1019536, 981666, 1075851, 1178847, 1093473, 967283, 982175, 875429]
14055H75429K3960Q7131j00982q6153n4611L7528J2296K36974M1846N0783j1775
14044A112426L0741K0810P477Q9078q7349k73932j22996O3189j8438M950J8979
14033H44935J63044K05527l0005k51265l5685J28569l8012n8634J02990K0980
14023A052444l1244J5107K2050Q6311k1848j4917q0658l5416P8003J09951M1238
14012A221021p9109l1769r9643Q283J65120J8095l047k133j8815J10949j30193
14001A158759O2609R7752M8702l6272k78701l6256j2203J0312J29741J3665K20837
13990A378945M7519j66258k73804N701L20506j1704j45341L5730Q8230J36842
13980A416366P6796k9611k86047j899M9537r0991O4133O5302j6796J20191N0088
$$ y = [875429, 899389, 986520, 885538, 799385, 744774, 782302, 794598, 1031572, 1073418, 1124201, 1112426, 1143167, 1163977, 1171454, 1260532, 1173183, 899251, 776255, 839444, 821006, 825956, 844935, 1007979, 1213506, 1183501, 932236, 896551, 1025120, 987108, 928474, 1031464, 1052444, 1021200, 1036307, 1058357, 1144668, 1122820, 1107903, 1027245, 991829, 1069832, 1179783, 1221021, 1141912, 1110143, 1010500, 1018783, 1183903, 1201998, 1198951, 1196818, 1178003, 1288952, 1158759, 1221368, 1319120, 1367822, 1331550, 1052849, 1016593, 1004390, 1014702, 1144443, 1158108, 1378945, 1426464, 1260206, 986402, 992103, 1312609, 1300905, 1155564, 1191294, 1279524, 1416366, 1493162, 1463551, 1177504, 1175605, 1225142, 1134151, 1198284, 1263586, 1246790, 1366981, 1417069]
13969A417069o123p8521j42525N3273J69769J96640L8013r4646m0369J46933R2658
13958A752171r5339j52825O2029N1141q7300o8582J09120K01215N0231j43433
13948A678428q07j05767j71027L468K90977K55937N6469J6844Q1774L8082q4016
13937B060362o7555k35919n0922m2966J12R8866K19843K81319r7241j34356l880
13926B027663J0450M835o1722o1717L0049O2628R303J11696r0985j22345n3427
13915A866428R4770M1003r4816O3057J31485P1225Q7881L644J5271K5688J73778
13904B479414j2665J57839L20353L92214M75133L64304L63850J41880o3178j32537
13894D486607l24092m19672l08611l05958j67154p0654J5286R6722J12265j04314
$$ y = [1417069, 1410946, 1332425, 1189900, 1243173, 1412942, 1609582, 1647595, 1552949, 1512580, 1659513, 1752171, 1656832, 1504007, 1566036, 1617177, 1529877, 1461295, 1570415, 1771630, 1821861, 1678428, 1677621, 1571854, 1400827, 1404295, 1695272, 1951209, 2007678, 2024522, 2106296, 2144378, 2060362, 1992807, 1756888, 1705966, 1663000, 1663112, 1761978, 1981821, 2263140, 2165899, 2031543, 2027663, 2038113, 2042948, 1981226, 1919509, 1949558, 2012186, 2021489, 2133185, 2042200, 1919855, 1866428, 1961198, 2002201, 1907385, 1970442, 2101927, 2173152, 2261033, 2264677, 2279948, 2305636, 2479414, 2466749, 2624588, 2944941, 3337155, 3812288, 4176592, 4540442, 4682322, 4619144, 4486607, 4162515, 3742843, 3434232, 3128274, 2961120, 2890466, 2905752, 3002474, 3114739, 3010425]
13884C010425j29996k07351q5610k7154K13218j2114k79273J012L24051q219k5176
13873B773813K9206J06052M3069J02828k7613j85574R5461K39999R1543j83386
13863C085398N9092k2443k3253J2087J49239J51083j03772O0315O9047j1038j21272
13852C304483L5219Q1963n0922j9929L9920M7272L8255k2973J08754n1412Q9583
13841C600213K00026J74777N1219j53705j35543m2930q4419J76795J14567j7398
13831C883602j2251m750k653J21492J29065N8082k00736N8725J50716J10210J79108
13820D470610R9740j8310M1599L9681Q2864j09758L2029N3609L6995q824j03117
13809D617118K1971K57123J63937J82432J30149J14369r700j12300J63289P0730
$$ y = [3010425, 2880429, 2673078, 2587468, 2560314, 2773532, 2761418, 2482145, 2483157, 2807208, 2798989, 2773813, 2803019, 2909071, 2952140, 3054968, 3027355, 2841781, 2937242, 3177241, 3268784, 3085398, 3144490, 3122047, 3098794, 3110881, 3260120, 3411203, 3307431, 3367746, 3436793, 3425755, 3304483, 3339702, 3421665, 3370743, 3350814, 3390734, 3438006, 3476261, 3453288, 3562042, 3510630, 3600213, 3800239, 3975016, 4026235, 3872530, 3736987, 3694057, 3609638, 3786433, 3901000, 3883602, 3871351, 3866601, 3863948, 3985440, 4114505, 4172587, 3971851, 4030576, 4181292, 4291502, 4470610, 4570350, 4552040, 4593639, 4633320, 4716184, 4606426, 4638455, 4692064, 4729059, 4720235, 4617118, 4639089, 4896212, 5060149, 5242581, 5372730, 5487099, 5477399, 5365099, 5528388, 5599118]
13799E599118N0179J59748K5516n0348Q3129J3159N4106j07692m1385k1504q463
13788E755563J81920K80894P9499k4265J08454K26364J11934Q3134j2212L4401
13778F825686j2543j6497P2250P9933R2582J8495J39811J32826K07512L08099
13768G848154J79397J43457R9437J31648m2772q5789O6230O4767K06531K13301
13758H824361J46265n566J14976K66006J36493L9851N9759P7971K29957K62510
13748A0152583R9991R6380J34471L46161J24586J81814J92294K09239O484J27943
13738A1671946K83019K09232P7271J33258K29512J79177K69615K26500J84263
13729A3463793J68042K30288K12377K82976K97182L15493J43735K11031J21039
$$ y = [5599118, 5649297, 5809045, 5834561, 5784213, 5867342, 5880501, 5934607, 5826915, 5785530, 5764026, 5755563, 5937483, 6218377, 6297876, 6273611, 6382065, 6608429, 6720363, 6803497, 6791285, 6825686, 6813143, 6796646, 6868896, 6948829, 7041411, 7059906, 7199717, 7332543, 7540055, 7848154, 8027551, 8171008, 8270445, 8402093, 8359321, 8273532, 8339762, 8404529, 8611060, 8824361, 8970626, 8965060, 9080036, 9346042, 9482535, 9522386, 9582145, 9660116, 9890073, 10152583, 10252574, 10348954, 10483425, 10829586, 10954172, 11135986, 11328280, 11537519, 11544003, 11671946, 11954965, 12164197, 12241468, 12374726, 12604238, 12783415, 13053030, 13279530, 13463793, 13631835, 13862123, 14074500, 14357476, 14654658, 14970151, 15113886, 15324917, 15445956]
13720A5445956K78850M26116J22639J82184J27614K56920M50406M15197M76255
13711A8182137K50553N30939M34988M04071M64530L70970L37253L49104M84133
13702B1808678M35420N59704L82126L97026K94251M58586M97384M62489N89676
13693B5885340N91113O09413N36806N15002O28297P10736O31253O57681P12682
13684C1478323P41353P89663R03577P44794P53487P63947P23480O51861R98443
13675C8548928J044860P19711J069566J003320R92319J069631R70743J182322
13667D6601400J290899J104070J071540J247461J250309J231008J330253J313739
13659E6440679J273948J431035J344072J407880J392120J635974J499331J513840
$$ y = [15445956, 15724806, 16150922, 16273561, 16455745, 16583359, 16840279, 17290685, 17705882, 18182137, 18432690, 18963629, 19398617, 19802688, 20267218, 20638188, 20975441, 21324545, 21808678, 22244098, 22803802, 23185928, 23582954, 23877205, 24335791, 24833175, 25295664, 25885340, 26476453, 27085866, 27622672, 28137674, 28765971, 29476707, 30107960, 30765641, 31478323, 32219676, 33009339, 33912916, 34657710, 35411197, 36175144, 36898624, 37550485, 38548928, 39593788, 40313499, 41383065, 42386385, 43378704, 44448335, 45419078, 46601400, 47892299, 48996369, 50067909, 51315370, 52565679, 53796687, 55126940, 56440679, 57714627, 59145662, 60489734, 61897614, 63289734, 64925708, 66425039, 67938879]
13651F7938879J608812J557667J554048J572861J636199J500347J526457J565957
13643H0461227J607730J602068J613150J589677J567643J643957J529477J407007
13635I3021936J511064J365237J387954J043110P69872R36066J004745Q98995
13627A01938979R33848Q68145N65970K97914L80975K75675K07608k0216k24526
13618A05224372j62981k06414n00234n10576o20385p90232o43993p81122j171840
13609I9836595j262508j294426j336838j388027j273707j474662j324198j228371
13601H9253858j423534j699633j532371j429575j628837j694697j511206j514985
13593G6819020j518030j511831j701462j687760j517997j663293j447259j302128
$$ y = [67938879, 69547691, 71105358, 72659406, 74232267, 75868466, 77368813, 78895270, 80461227, 82068957, 83671025, 85284175, 86873852, 88441495, 90085452, 91614929, 93021936, 94533000, 95898237, 97286191, 98329301, 99099173, 100035239, 101039984, 101938979, 102872827, 103740972, 104306942, 104604856, 104985831, 105261506, 105469114, 105448898, 105224372, 105061391, 104854977, 104354743, 103844167, 103223782, 102433550, 101789557, 101008435, 99836595, 98574087, 97279661, 95942823, 94554796, 93281089, 91806427, 90482229, 89253858, 87830324, 86130691, 84598320, 83168745, 81539908, 79845211, 78334005, 76819020, 75300990, 73789159, 72087697, 70399937, 68881940, 67218647, 65771388, 64469260]
13585F4469260j399988j394620j475096j413385j247863j375493j236050j071113
13577E3855652j227600j412586j212161j026297r49868j111911j180662j059565
13569D4675002r71332j004421j044887q35277q33076q77915q73558p94092r17068
13560C6523376p74048n57615p49921q64305p48177o68745n79684q11220o88205
13551C0081456n28800n30520p43526q28238m53281m85638m38478n01119o52200
13542B4919656n30100m69497l97997l94590k25511j09820l67934n77662o18570
13533B1227975n71468j76564j40885l20209k97109k49702n25771n72388j60552
13524A8213327j68234l65515n05306m18792k30029l87309k10863j64257l71658
$$ y = [64469260, 63069272, 61674652, 60199556, 58786171, 57538308, 56162815, 54926765, 53855652, 52628052, 51215466, 50003305, 48977008, 48027140, 46915229, 45734567, 44675002, 43703670, 42699249, 41654362, 40819085, 39986009, 39108094, 38234536, 37440444, 36523376, 35749328, 35191713, 34441792, 33577487, 32829310, 32160565, 31580881, 30769661, 30081456, 29552656, 29022136, 28278610, 27450372, 26997091, 26511453, 26072975, 25571856, 24919656, 24389556, 23920059, 23522062, 23127472, 22901961, 22792141, 22424207, 21846545, 21227975, 20656507, 20479943, 20339058, 20018849, 19721740, 19472038, 18946267, 18373879, 18213327, 18045093, 17679578, 17174272, 16755480, 16525451, 16138142, 15927279, 15763022, 15391364]
13515A5391364k72342j50900j48481p9884p6136j40852l35336m29512k52525k29432
13505A3275964j62632k02277k30955m7738k85986k33974m3579k21286k62948k40709
13495A1343880k26624r0296K0256j39673j94472j84777m1364q3709k34628j24728
13485A0043865j28913k11444r8542j72699r7696j35214k08497K3161O899k14250
13475H806670j63010k11082j80470l9567p0533p7982j38856j31679j53104j16346
13465G524041O3744r4827j55118m2856j0001p9768m5778m7960j16427o7047j12148
13454F815855q831N1001j43610k9760K2639k22561j84812p5845j00227j21947
13444F001902P0177p3645j26507k74868m9744k512o063Q3863j43455k47306p4525
$$ y = [15391364, 15119022, 14968122, 14819641, 14739757, 14663621, 14522769, 14187433, 13757921, 13505396, 13275964, 13113332, 12911055, 12680100, 12632362, 12346376, 12112402, 12068823, 11847537, 11584589, 11343880, 11117256, 11026960, 11047216, 10907543, 10713071, 10528294, 10486930, 10403221, 10168593, 10043865, 9914952, 9703508, 9604966, 9432267, 9334571, 9199357, 8990860, 9014021, 9020920, 8806670, 8643660, 8432578, 8252108, 8212541, 8142008, 8064026, 7925170, 7793491, 7640387, 7524041, 7587785, 7492958, 7337840, 7294984, 7284983, 7205215, 7159437, 7111477, 6995050, 6928003, 6815855, 6807024, 6858025, 6714415, 6684655, 6707294, 6484733, 6299921, 6224076, 6123849, 6001902, 6072079, 5998434, 5871927, 5597059, 5547315, 5544803, 5538740, 5622603, 5479148, 5231842, 5157317]
13433E157317L6181R524o3110j34030N6626L24297k2383j58770j86144n2327J3340
13422D980521K3040j67698j18612j16924m7685j10433j92251j96449k6290J72359
13412D199578K8537N1545n5193j23585R9590J79212k30411j43919M1289M3503
13402D090146K5289o319j08668j59452k2814J15833K36734j513j1989M937j85518
13391C976666p3582l2532K2569j2680j05106o8703m2368o9993k1921J40949j42345
13380C570954j27354j287n9776r7203J9749m2885o0255o462j49214j17794l3339
13369B895134p399J60867K9864p2322J06671j39985N5708J08842j51735m2246
13359B943399m0035r1425r3032J23232N1046K13296K29081j36035k46916j01596
$$ y = [5157317, 5193498, 5203022, 5139912, 5005882, 5062508, 5386805, 5364422, 5205652, 5019508, 4967181, 4980521, 5003561, 4835863, 4717251, 4600327, 4552642, 4442209, 4249958, 4053509, 4027219, 4199578, 4228115, 4279660, 4224467, 4100882, 4200472, 4379684, 4149273, 4005354, 4046643, 4090146, 4115435, 4109116, 4000448, 3840996, 3818182, 3934015, 4170749, 4169236, 4157247, 4162184, 3976666, 3903084, 3870552, 3893121, 3880441, 3775335, 3706632, 3664264, 3594271, 3572350, 3713299, 3570954, 3443600, 3442313, 3382537, 3285334, 3305083, 3262198, 3201943, 3195481, 3046267, 2928473, 2895134, 2887735, 3048602, 3078466, 3006144, 3112815, 2972830, 3028538, 3137380, 2985645, 2943399, 2903364, 2811939, 2718907, 2842139, 2893185, 3106481, 3335562, 3199527, 2952611, 2851015]
13349B851015J88315K95275K46789K56185M10615L92880K29793J71042k03719
13340D838190m73310l78670m39760l74693l26110m5821J0255k2089l7550P415
13330B757857j02725l9463k3400m6042j85173j33136J93524O9954J21904l8378
13320B574922j08429K3445j05521q0945p4943k13409P8016Q1965Q7200j92932
13310B069369j2900N7161R5668J37114j4900k40983p7780l0383o7370m0914K2337
13299A896419J01767M0148j72202l1120n3499o2366l0536K07177k683p2111Q5102
13288A906096o9499j83788o4005J64294N91J1727R5702O1926k1560m7420m8481
13277A805583r5175J0950j31247J89040O216J0622M3957j17980j46787o9902r0988
$$ y = [2851015, 3039330, 3334605, 3581394, 3837579, 4248194, 4641074, 4870867, 5041909, 4838190, 4364880, 3986210, 3546450, 3171757, 2845647, 2799826, 2810081, 2787992, 2750442, 2757857, 2655132, 2615669, 2592269, 2546227, 2361054, 2227918, 2421442, 2491396, 2613300, 2574922, 2466493, 2489938, 2384417, 2303472, 2228529, 2015120, 2093136, 2175101, 2262301, 2069369, 2056469, 2113630, 2209298, 2346412, 2331512, 2090529, 2012749, 1982366, 1914996, 1874082, 1896419, 1998186, 2038334, 1866132, 1835012, 1781513, 1719147, 1688611, 1895788, 1893105, 1820994, 1906096, 1836597, 1652809, 1588804, 1753098, 1753689, 1765416, 1861118, 1923044, 1901484, 1854064, 1805583, 1710408, 1721358, 1590111, 1779151, 1785367, 1795989, 1839946, 1721966, 1575179, 1505277, 1414289]
13266A414289J20462j9101N5530K6743J13028K9696j60245r1073Q1646J54038
13256A725013k7941k48057Q6345L1662m046O349m5294j53453M3097K18953L2292
13245A664920L8755k00583q0581j00937j05965J06578J36358M1636r948K3368
13235A513601L6019l9726J04094N4787j53156j24840l186j3213M449n9881j75972
13224A142976n325J01305p9686p0133R6690J99107j8195m6980m0223M3302Q0295
13213A403133q1950j05368R1136N4598J0517j06261Q6418O1909K8518j67509N35
13202A275676P1542o3707Q8408J16926m383j3622l3249j30744j78330J6199J38393
13191A283109J1282J05772j47895j66703L1966m7979Q8591j301J58630J1720j57675
$$ y = [1414289, 1534751, 1515650, 1571180, 1597923, 1710951, 1740647, 1580402, 1489329, 1570975, 1725013, 1697072, 1449015, 1535360, 1567022, 1562976, 1569325, 1524031, 1370578, 1413675, 1632628, 1664920, 1703675, 1503092, 1422511, 1321574, 1215609, 1322187, 1458545, 1500181, 1490233, 1513601, 1549620, 1509894, 1613988, 1668775, 1515619, 1390779, 1387593, 1374380, 1378829, 1318948, 1142976, 1137651, 1238956, 1159270, 1089137, 1185827, 1384934, 1366739, 1319759, 1279536, 1322838, 1403133, 1321183, 1215815, 1306951, 1361549, 1372066, 1265805, 1352223, 1414132, 1442650, 1275141, 1275676, 1347218, 1283511, 1371919, 1488845, 1484462, 1470840, 1437591, 1306847, 1128517, 1144716, 1283109, 1294391, 1400163, 1252268, 1085565, 1117531, 1069552, 1158143, 1156842, 1315472, 1327192, 1169517]
13180A169517j64928l9173P0510q3966M5442j52526r2564L3657p895J47540r8885
13169H26729l6613O6927j10758N3037M2804N7221J70620J04291o0592M0049L9185
13158A192900R5950l5639j85344N475k71o1155j12720M2670n3514m5519O5354
13147I08187J6282j13870j1931K05779Q0324j08351j9431J21938N4743l00769
13137H32901j26918J6920K888R0505k8411J27463R6249J7063p5630p1059L9292
13126I21263j12453k5503j9885J26419J77216j21923j00836J88311O2569m8606
13116A046572L6492P6105j30221o0071l285p4071Q2152K426r3569j05866J24590
13105I01254k1672q242J0336j38615r4408K23758J89323j02512j69310O7698R2106
$$ y = [1169517, 1004589, 965416, 1035926, 951960, 997402, 844876, 752312, 785969, 778074, 925614, 826729, 790116, 857043, 746285, 799322, 842126, 899347, 1069967, 1174258, 1113666, 1153715, 1192900, 1288850, 1253211, 1067867, 1073342, 1073071, 1011916, 899196, 941866, 888352, 842833, 908187, 924469, 810599, 798668, 1004447, 1084771, 976420, 956989, 1078927, 1133670, 832901, 705983, 722903, 725791, 816296, 787885, 915348, 1011597, 1028660, 953030, 881971, 921263, 808810, 783307, 763422, 889841, 1067057, 945134, 844298, 1032609, 1095178, 1046572, 1083064, 1159169, 1028948, 968877, 965592, 891521, 973673, 976099, 882530, 776664, 901254, 879582, 871340, 881676, 743061, 648653, 872411, 1061734, 959222, 789912, 857610, 949716]
13094I49716K1387J67273j7950j31080l6642L2303J97483j2157j46097r5855J34467
13083A062848m6857q3247p5780P9718L5171l331r3531o1483n9463J25701p2298
13072H07448k8307M251K7339J03353J98766k4044q2912j41298p8397J25204j69813
13061G41590j06004J32585J6683k06806J6855J48566l7970M9832j78039l5996
13051E41296R5870J68200P6001p167J5458L5055j29387p2704J30993j19910j32758
13040F00947N1396r4208l2880J7097j38024J22892J4220j08233m8057J6245N0078
13029D51473R9350j7274q068j3212K2958j0982j26936J13706m105R2727J95069
13018G94706j2360j12227j3192M6699o9550n7878J25773O0895L8646j17011l0541
$$ y = [949716, 971103, 1138376, 1120426, 989346, 952704, 985007, 1182490, 1170333, 1024236, 928381, 1062848, 1015991, 932744, 856964, 936682, 971853, 968522, 874991, 813508, 754045, 879746, 807448, 779141, 783392, 810731, 914084, 1112850, 1088806, 1005894, 864596, 786199, 911403, 741590, 635586, 768171, 784854, 578048, 594903, 743469, 705499, 755331, 577292, 541296, 637166, 805366, 881367, 874200, 889658, 924713, 795326, 722622, 853615, 733705, 600947, 652343, 558135, 525255, 542352, 404328, 527220, 541440, 433207, 385150, 401395, 451473, 550823, 533549, 525481, 512269, 535227, 524245, 397309, 511015, 506910, 599637, 794706, 782346, 670119, 656927, 703626, 634076, 576198, 701971, 762866, 801512, 684501, 653960]
13007F53960L1309J3414R2542L7277j55557n1711K9876J9297j7106Q5570k3270
12996G15601r0494o0366o2112l104J40604k0580J3072k6063J3452L4457p7015
$$ y = [653960, 685269, 698683, 791225, 828502, 672945, 621234, 651110, 670407, 653301, 738871, 715601, 625107, 564741, 502629, 499525, 640129, 619549, 632621, 606558, 620010, 654467, 577452]
$$ [...]
##END NTUPLES=NMR SPECTRUM
##END=
