##TITLE=Analysis number 322116
Compound Code gk 03066
Project Code adrs
Chemist Name fudan
##JCAMPDX= 6.0         $$ Bruker NMR JCAMP-DX V2.0
##DATA TYPE= NMR SPECTRUM
##DATA CLASS= NTUPLES
##ORIGIN= Bruker BioSpin GmbH
##OWNER= nmr
$$ XWIN-NMR		Version 3.5
$$ Wed Sep 13 10:58:37 2006 GMT Daylight Time (UT+1h)  MAYBRIDGE\nmr@NMR_250MHZ
##.OBSERVE FREQUENCY= 250.131544655141
##.OBSERVE NUCLEUS= ^1H
##.ACQUISITION MODE= SIMULTANEOUS (DQD)
##.ACQUISITION SCHEME= undefined
##.AVERAGES= 16
##.DIGITISER RES= 18
##SPECTROMETER/DATA SYSTEM= dpx250
##.PULSE SEQUENCE= zg30
##.SOLVENT NAME= CDCl3
##.SHIFT REFERENCE= (INTERNAL, CDCl3, 0, 16.522)
##AUDIT TRAIL= $$ (NUMBER, WHEN, WHO, WHERE, WHAT)
$$ ##TITLE= Audit trail, XWIN-NMR		Version 3.5
$$ ##JCAMPDX= 5.01
$$ ##ORIGIN= Bruker BioSpin GmbH
$$ ##OWNER= nmr
$$ C:\u/data/dgb/nmr/ADRS/670/pdata/1/auditp.txt
$$ ##AUDIT TRAIL=  $$ (NUMBER, WHEN, WHO, WHERE, WHAT)
(   1,<2006-09-13 10:58:14.10 +100>,<MAYBRIDGE\nmr>,<NMR_250MHZ>,
      <created by zg, POWCHK disabled, PULCHK disabled
       configuration hash MD5:
       E2 DF 36 D8 04 B2 41 60 5A D7 A3 38 5A 4B D0 FE
       data hash MD5: 64K
       C1 22 D0 81 88 75 11 E5 49 A7 F4 21 28 B7 6F F1>)
(   2,<2006-09-13 10:58:27.45 +100>,<MAYBRIDGE\nmr>,<NMR_250MHZ>,
      <Start of raw data processing
       ef LB = 0.3 FT_mod = 6 PKNL = 1 SI = 32K 
       data hash MD5: 32K
       7A 3A CD 40 72 BF 2F 28 A2 38 64 7E 62 7D 97 28>)
(   3,<2006-09-13 10:58:29.17 +100>,<MAYBRIDGE\nmr>,<NMR_250MHZ>,
      <apk 
       data hash MD5: 32K
       A7 A9 4A 1B C1 8B 0D A3 63 96 CB D3 31 0B DA 06>)
(   4,<2006-09-13 10:58:30.03 +100>,<MAYBRIDGE\nmr>,<NMR_250MHZ>,
      <abs ABSG = 5 
       data hash MD5: 32K
       25 8F D6 54 01 B6 00 46 61 93 2C 48 EC 44 0E DF>)
$$ ##END=
$$ 
$$ hash MD5
$$ 64 FE AD 37 55 0A EE FB 41 60 E8 52 43 88 F6 E5
##$RELAX= 
##$RELAX= 
##$RELAX= 
##$RELAX= 
##$RELAX= 
##$RELAX= 
##$RELAX= 
$$ Bruker specific parameters
$$ --------------------------
##$DU= <C:\u>
##$EXPNO= 670
##$NAME= <ADRS>
##$PROCNO= 1
##$TYPE= <nmr>
##$USER= <dgb>
##$AMP= (0..31)
100 100 100 100 100 100 100 100 100 100 100 100 100 100 100 100 100 100 
100 100 100 100 100 100 100 100 100 100 100 100 100 100 
##$AQSEQ= 0
##$AQ_mod= 3
##$AUNM= <au_zg>
##$AUTOPOS= <17 >
##$BF1= 250.13
##$BF2= 250.13
##$BF3= 250.13
##$BF4= 250.13
##$BF5= 500.13
##$BF6= 500.13
##$BF7= 500.13
##$BF8= 500.13
##$BYTORDA= 1
##$CFDGTYP= 0
##$CFRGTYP= 5
##$CHEMSTR= <none>
##$CNST= (0..31)
1 1 145 1 1 1 1 1 1 1 1 1 1 1 1 1 1 1 1 1 1 1 1 1 1 1 1 1 1 1 1 1 
##$CPDPRG= <>
##$CPDPRG1= <>
##$CPDPRG2= <>
##$CPDPRG3= <>
##$CPDPRG4= <mlev>
##$CPDPRG5= <mlev>
##$CPDPRG6= <mlev>
##$CPDPRG7= <mlev>
##$CPDPRG8= <mlev>
##$CPDPRGB= <>
##$CPDPRGT= <>
##$D= (0..31)
0 1 0 0 0 0 0 0 0 0.06 0 0 0 0 0 0 0.0002 0 0 0 0 0 0 0 0 0 0 0 0 0 0 
0 
##$DATE= 1158141493
##$DBL= (0..7)
120 120 120 120 120 120 120 120 
##$DBP= (0..7)
150 150 150 150 150 150 150 150 
##$DBP07= 0
##$DBPNAM0= <>
##$DBPNAM1= <>
##$DBPNAM2= <>
##$DBPNAM3= <>
$$ [...]
##$SUBNAM7= <"">
##$SUBNAM8= <"">
##$SUBNAM9= <"">
##$SW= 20.6930455092707
##$SWIBOX= (0..15)
0 0 3 0 0 0 0 0 0 0 0 0 0 0 0 0 
##$SW_h= 5175.983436853
##$TD= 65536
##$TD0= 1
##$TE= 296.16
##$TE2= 300
##$TE3= 300
##$TEG= 300
##$TL= (0..7)
0 120 120 120 120 120 120 120 
##$TP= (0..7)
150 150 150 150 150 150 150 150 
##$TP07= 0
##$TPNAME0= <>
##$TPNAME1= <>
##$TPNAME2= <>
##$TPNAME3= <>
##$TPNAME4= <>
##$TPNAME5= <>
##$TPNAME6= <>
##$TPNAME7= <>
##$TPOAL= (0..7)
0.5 0.5 0.5 0.5 0.5 0.5 0.5 0.5 
##$TPOFFS= (0..7)
0 0 0 0 0 0 0 0 
##$TUNHIN= 0
##$TUNHOUT= 0
##$TUNXOUT= 0
##$USERA1= <user>
##$USERA2= <user>
##$USERA3= <user>
##$USERA4= <user>
##$USERA5= <user>
##$V9= 5
##$VALIST= <valist>
##$VCLIST= <CCCCCCCCCCCCCCC>
##$VD= 0
##$VDLIST= <DDDDDDDDDDDDDDD>
##$VPLIST= <PPPPPPPPPPPPPPP>
##$VTLIST= <TTTTTTTTTTTTTTT>
##$WBST= 1024
##$WBSW= 4
##$XGAIN= (0..3)
0 0 0 0 
##$XL= 0
##$YL= 0
##$YMAX_a= 518891
##$YMIN_a= -526236
##$ZGOPTNS= <>
##$ZL1= 120
##$ZL2= 120
##$ZL3= 120
##$ZL4= 120
##$ABSF1= 16.522
##$ABSF2= -4.171173
##$ABSG= 5
##$ABSL= 3
##$ALPHA= 0
##$AQORDER= 0
##$ASSFAC= 0
##$ASSFACI= 0
##$ASSFACX= 0
##$ASSWID= 0
##$AUNMP= <proc_1d>
##$AZFE= 0.1
##$AZFW= 0.1
##$BCFW= 0
##$BC_mod= 0
##$BYTORDP= 0
##$COROFFS= 0
##$CY= 12.5
##$DATMOD= 1
##$DC= 0
##$DFILT= <>
##$DTYPP= 0
##$F1P= 14.0000005364418
##$F2P= -0.99999901652339
##$FCOR= 0.5
##$FTSIZE= 32768
##$FT_mod= 6
##$GAMMA= 0
##$GB= 0
##$INTBC= 1
##$INTSCL= 1
##$ISEN= 128
##$LB= 0.3
##$LEV0= 0
##$LPBIN= 0
##$MAXI= 10000
##$MC2= 0
##$MEAN= 0
##$ME_mod= 0
##$MI= 0
##$NCOEF= 0
##$NC_proc= -2
##$NLEV= 6
##$NOISF1= 0
##$NOISF2= 0
##$NSP= 0
##$NTH_PI= 0
##$NZP= 0
##$OFFSET= 16.522
##$PC= 1
##$PHC0= 144.7777
##$PHC1= 4.275058
##$PH_mod= 1
##$PKNL= yes
##$PPARMOD= 0
##$PSCAL= 4
##$PSIGN= 0
##$REVERSE= no
##$SF= 250.13
##$SI= 32768
##$SIGF1= 0
##$SIGF2= 0
##$SINO= 400
##$SIOLD= 32768
##$SREGLST= <1H.CDCl3>
##$SSB= 0
##$STSI= 32768
##$STSR= 0
##$SW_p= 5175.98343685301
##$SYMM= 0
##$S_DEV= 0
##$TDeff= 65536
##$TDoff= 0
##$TI= <Analysis number 999999
Compound Code 99
Book Reference 9
Project Code 9>
##$TILT= no
##$TM1= 0
##$TM2= 0
##$TOPLEV= 0
##$USERP1= <user>
##$USERP2= <user>
##$USERP3= <user>
##$USERP4= <user>
##$USERP5= <user>
##$WDW= 1
##$XDIM= 32768
##$YMAX_p= 305581985
##$YMIN_p= -38143
$$ End of Bruker specific parameters
$$ ---------------------------------
##NTUPLES= NMR SPECTRUM
##VAR_NAME=  FREQUENCY,     SPECTRUM/REAL,   SPECTRUM/IMAG
##SYMBOL=    X,             R,               I
##VAR_TYPE=  INDEPENDENT,   DEPENDENT,       DEPENDENT
##VAR_FORM=  AFFN,          ASDF,            ASDF
##VAR_DIM=   32768,         32768,           32768
##UNITS=     HZ,            ARBITRARY UNITS, ARBITRARY UNITS
##FACTOR=    0.157963299565203, 1,           1
##FIRST=     4132.6476996994, 0,             0
##LAST=      -1043.33573715361, 0,           0
##MIN=       -1043.33573715361, -38143,      0
##MAX=       4132.6476996994, 305581985,     0
$$ Real data points
##PAGE= N=1
##DATA TABLE= (X++(R..R)), XYDATA
$$ [...]
18875b692N827o355r417k055J4925J2869m541o91o152r997k029P135J1603l866
18861D564j2971q054r351K97R288K966r566k595J2593P110j891K75k451n204j1605
18846b6595J879J3365J1245L409p39k676M31m161R86o416J170J0177J446l368
18832A53N594k519j1106n814K032K933p661j3039j987N497N668n72k00N609J7909
18817B497k008o598M064L583P375P40k784l441j246k092Q39Q877L00J543m685
18802F964j4835n495k549l32r59J6061J7122N154n693j1874j0933N968K698m630
18788c333L943J458n931p203j418P385J2557L37n10p98P65r29k163r016L747Q835
18772G726Q287J0164N21L922J2884P724P156j7133j7689J834j0043j1805J059
$$ y = [-2692, 3135, -3220, -12637, -14692, 233, 13102, 8561, 7870, 1718, -8279, -10308, -3173, 8430, 4564, -8407, -16461, -25812, -25515, -16227, -13261, -22827, -25422, -12829, -5719, -7610, -7335, -9786, -14990, -26595, -24716, -11351, -106, 3303, 2564, -112, 319, -3842, -2856, -9272, -8102, 2075, 3521, 153, 5747, 3228, -7878, -13692, -11660, -8727, -16388, -29427, -31414, -25917, -20249, -20821, -21021, -15412, 2497, 489, -6109, -2045, 1538, 8913, 9653, 6869, 3428, 2182, 90, 929, 9806, 10106, 11649, 6964, -7871, -13366, -15915, -16247, -17206, -1145, 15977, 21131, 15438, 3564, -7369, -1401, 1297, -3333, 610, 2068, -3863, -11066, -12484, -5099, 7458, 7795, 7285, 6487, 7252, 6323, 4160, -4856, -1109, 7726, 16013, 26177, 26698, 30620, 43504, 51228, 58384, 41251, 23562, 25396, 15353, 3548, 4607]
18759D607q377k395q24K955N065R708j721p443L275K267Q583M937j552j530N921
18744B3476o587j5071n565M943p902l488J803j3551N797Q309k759l024l11J135
18730a2795J1608M162P197J403k320K819k07n753K910Q783m351M32p385k309j5731
18715a1537m364Q793n845K761J5539L251P217LP94q351l442Q735R394j1075n167
18700F706n141o135K247l380l858n600p1J1612m469p740L443P88N533L623O065
18685C623n805j7483N923R914j806j027l92M210R60J29O531R572n184j4917l745
18670i497P98r032R19J5029J0229k254l643o644l653N613L129K014P012J4380
18656B4400O934j1129j2165n333N659N77j434k93m368J1534R206O815J732M447
$$ y = [4607, -3770, -6165, -6989, -4034, 1031, 10739, 9018, 1575, 4850, 7117, 15700, 20637, 19085, 17555, 23476, 16889, 1818, -3747, 1196, -6706, -10194, -8391, -21942, -16145, -7836, -10595, -13619, -13930, -12795, -1187, 2975, 10172, 11575, 9255, 12074, 11867, 6114, 9024, 17807, 13456, 13888, 6503, 4194, -11537, -15901, -7108, -12953, -10192, 5347, 8598, 15815, 15818, 16612, 8261, 4819, 13554, 22948, 11873, 6706, 1565, -4570, -2323, -5703, -9561, -15161, -15232, -3620, -8089, -15829, -12386, -11598, -6065, -2442, 3623, -2182, -19665, -13742, -3828, -5634, -6661, -7053, -2843, -1883, -1754, 4777, 14349, 9165, -5752, -9497, -8699, -17731, -16812, -1783, 8446, 6192, 2549, -4095, -7748, -2135, 994, 3008, 10020, 24400, 31334, 20205, 8040, 2707, 8366, 8943, 7509, 7216, 2848, 14382, 23588, 30403, 32135, 36582]
18642C6582J441J14O904J0667Q739N409L559J2024J8741Q876J7595K8193K6628
18629A85472O710l75o7Q112o744j4215j93K964Q666J1654K3909l515l310q071
18615B10997j2283l00j3833k2535l0258j8931j4971j7135j2612j2354l504r249
18603D3032j6012N110Q578l528p630q042L513M689J96L939m465j3865k822M117
18589A6810j0062M162R556K325j201M307r64M766l72j8038q582R755Q54O788N795
18574B5899j6049l415j650m243l627K533L476L454J498N327O246K757n089o163
18560A0954j595q35m860J1485N566M842L899j0209p004r65n492O761K743M83m240
18545A1533j6543k286J2273N639r464p610J4700L315j0318K095O250n53n682n887
$$ y = [36582, 38023, 38137, 45041, 55708, 64447, 69856, 73415, 85439, 104180, 113056, 130651, 158844, 185472, 192182, 191807, 191740, 199852, 193108, 178893, 178700, 181664, 190330, 201984, 225893, 222378, 219068, 210997, 198714, 198414, 184581, 162046, 131788, 112857, 97886, 80751, 68139, 55785, 52281, 43032, 27020, 32130, 40708, 37180, 29550, 21508, 25021, 29710, 29906, 33845, 29380, 15515, 12693, 16810, 6748, 10910, 20466, 22791, 21590, 25897, 24933, 29699, 29327, 11289, 2707, 12462, 13316, 20104, 25899, 9850, 6435, 4785, 542, -3085, -552, 2924, 6378, 7876, 13203, 19449, 22206, 17117, 10954, 9359, 8524, 3664, 15149, 20715, 25557, 29456, 19247, 12243, 11278, 5786, 12547, 15290, 15773, 11533, -5010, -7296, 4977, 10616, 1152, -6458, 8242, 11557, 1239, 3334, 9584, 9031, 3349, -2538]
18531b538j670k719K881n958R31L733P001l08n652R517Q509M707l643n467j999
18516G325O863m95P11n263j980j754Q22J0161K059j2904j6098l232Q885R823n551
18501f28j514J568L904p156M669K921l628m59J0279J3927n930o057n731j436J772
18486F501N92J700j0977j999J604p50j505N541J93N589P522k16o314J633l33J708
18470A0489K408m011o1l018o568K711P813J0796O857N44o719J042J0693j6336
18456A6640l644q83o306j919J105P279J289j84l548l80J1660j767k701q672q458
18441d89r587N969K935N316p81l239L918O332l001o105M400J101l83M706N706
18426A6798P085o632n113M536l826l825K277k570m495M660q690n4n558L098P828
$$ y = [-2538, -4208, -6927, -4046, -10004, -9073, -5340, 1661, 1353, -4299, 5218, 13727, 18434, 14791, 9324, 7325, 14188, 13693, 14404, 9141, 7161, 5407, 6229, 16390, 18449, 5545, -10553, -13785, -4900, 4923, -628, -2142, -574, 3330, -3826, 843, 3764, 136, -323, 9956, 23883, 17953, 11896, 6165, 4729, 6501, 7093, 8793, -2184, -4183, -2579, -3329, -4834, 707, 900, 6489, 14011, 13795, 7481, 9114, 8781, 10489, 12897, 8886, 8825, 5807, -761, 1950, 9763, 20559, 27416, 27960, 21241, 22283, 32976, 16640, 12996, 12113, 5807, 3888, 4993, 12272, 13561, 13377, 9829, 9449, 21109, 19342, 16641, 7969, -489, -10076, -4107, -1172, 4144, 3363, 124, 4042, 10374, 7373, 1268, 5668, 6769, 6386, 11092, 16798, 23883, 17251, 12138, 16674, 12848, 9023, 11300, 8730, 4235, 8895, 205, 151, -5407, -2309, 5519]
18411E519o33j50j326l516J55R450O645l126j135n122l009O48M243j799o534N465
18395E775l21K010P01K29j1534j145M716m69j255k28k556K51l744R558M807k329
18379D466j811r849L561R812K178Q945J921l362k481M545K051j207n884o391o91
18364E803J981n625n045L012O949L580Q35o25j0431J216O7o206P103L526q535
18349b395j164L012j612m672o834L584O211m166o377O581K250L854J343o73J2076
18334A1018J3434Q267n302r261p825M1O864k184m508Q225L78j004L867o223n175
18319A0612L82J1819K49r138p505M235Q649l916k518N184M461R273J766Q977m740
18304C7790N35l182p268L990j525K550n701O577R970N301m197m665N68m989o15
$$ y = [5519, 4886, 4736, 3410, -106, 49, 9499, 16144, 13018, 11883, 6761, 3752, 4400, 8643, 6844, 310, 5775, 5454, 7464, 8165, 8394, -3140, -4285, 431, -38, -1293, -1521, -4077, -3826, -7570, 1988, 6795, 4466, 2655, -7194, -3633, 6179, 8357, 17302, 19223, 15861, 13380, 17925, 19976, 18769, 12885, 6494, 5803, 7784, 2159, -2886, 126, 7075, 10655, 11490, 10865, 434, 1650, 1717, -4489, 2614, 6140, -2395, -3559, -547, -2159, -6831, -13665, -10081, -3870, -8036, -14413, -7832, -5582, -1728, -385, -1058, 11018, 24452, 32719, 27417, 18156, 10331, 10372, 17236, 15052, 10544, 18769, 19147, 18143, 22010, 15787, 10612, 10994, 22813, 23062, 13924, 6419, 10654, 19303, 15387, 12869, 18053, 22514, 31787, 33553, 42530, 37790, 38325, 35143, 27875, 31865, 30340, 32890, 27189, 33766, 43736, 49037, 44840, 40175, 40743, 35754, 35139]
18289C5139L690p661p413o0k390n687O966J87k695K019l169r723n754k257J1954
18274A3146J3344l334o493k726p419L93J2393J108J124r824r307K512j221L6J064
18259D796M434k07j0592o566J0991N992n039n633K404M528K465k709L904l52m922
18244C494P78N629J2207m76j1259M413M689P377L744p22m545n71o587j477P428
18229B4122O441j509o404O377R251q617m836M380P993L544O456l22R70K095o631
18214D3310m89q47M052Q20k209P010l61m828P087P878j972j5024n982K111M271
18199D4827j546O46Q485L793N293R748K520J065j997k850K055K795m92J1399J7499
18184A03240K6003Q780O416K906Q406L161m147L239K573l73J038l201n636K431
$$ y = [35139, 38829, 31168, 23755, 23695, 21305, 15618, 22584, 22771, 20076, 22095, 18926, 9203, 3449, 1192, 13146, 26490, 23156, 16663, 13937, 6518, 6911, 19304, 20412, 21536, 11712, 2405, 4917, 3696, 3732, 4796, 9230, 9023, -1569, -8135, 2856, 8848, 3809, -1824, 580, 5108, 7573, 4864, 8768, 8416, 3494, 4272, 9901, 22108, 21632, 10373, 14786, 19475, 26852, 30596, 29874, 25329, 24758, 18171, 16694, 24122, 30563, 29054, 22650, 29027, 38278, 29661, 24825, 29205, 37198, 40742, 47198, 46876, 47846, 49941, 43310, 42821, 41974, 46026, 46846, 44637, 51647, 51286, 46458, 53545, 61423, 59451, 44427, 38445, 40556, 44827, 43281, 43927, 52412, 56205, 61498, 71246, 73766, 74831, 72834, 69984, 72039, 74834, 74342, 85741, 103240, 129243, 138023, 144439, 147345, 155751, 158912, 154765, 158004, 160577, 160204, 161242, 158041, 152405, 154836]
18170A54836R491P652N562O183K809k740j55O399j347l706r834j0012m058K484
18156A63564n106K024o622Q46L811J972m561M25K0708L453L542M867l611k742
18142A82570J563Q537J2377J0096p31J2911Q66P865J7527J2836K3J0903J1167
18129B88510J5408J3083K7429J5475J8680L5573M1433M8936N9171Q0699J09759
18118G54156J60592K42005L82445O81246J154942J525560J289785Q03460Q65684
18109G859875R76723Q67689n61829k717687k043092j125020o53543l98069k63597
18100A941450j93944j61472j19461p8918m8605k7283k157K144k910J3002R144
18089A330990N069J3310K8431K8850L8339M8682M6260O0698O8320Q4768R8575
$$ y = [154836, 164327, 171979, 177541, 183724, 186533, 183793, 183638, 190037, 188690, 184984, 175150, 165138, 161080, 163564, 158458, 160482, 153860, 154706, 158517, 160489, 155928, 156353, 177061, 180514, 184056, 188923, 185312, 182570, 184133, 192670, 205047, 215143, 214412, 227323, 228189, 236054, 253581, 266417, 266440, 277343, 288510, 303918, 317001, 344430, 359905, 378585, 414158, 455591, 504527, 563698, 644397, 754156, 914748, 1156753, 1539198, 2220444, 3375386, 4900946, 6190731, 6994191, 7859875, 8836598, 9704287, 9142458, 6424771, 4381679, 3256659, 2603116, 2205047, 1941450, 1747506, 1586034, 1466573, 1387655, 1339050, 1311767, 1309610, 1311754, 1308844, 1321846, 1330990, 1336059, 1349369, 1377800, 1406650, 1444989, 1493671, 1539931, 1600629, 1668949, 1753717, 1852292]
18078A852292R2176J00563J18919J29803J39604J56405J80511K04403K31151K77964
18068C483791L41763M14056N08312O64482Q77104J153186J506668J962183K472413
18059A3383958K994793L462337L756467L812340L541600K949265K066933R86801
18051C6954494j02486r68325j369502j208243o08708K21355J043859J586201J745745
18042C7294390J454115P30036l07608j504333k643647l457935l835496l763371
18034B3966151l389670k859930k301869j827208j452566j163294r43405p74056
18026I254153o45024n46265m78938m15850l67295l32906k94876k88449k61897
18017E622653k41257k30144k08016j89459j77221j64796j58118j42881j37709
$$ y = [1852292, 1944468, 2045031, 2163950, 2293753, 2433357, 2589762, 2770273, 2974676, 3205827, 3483791, 3825554, 4239610, 4747922, 5412404, 6289508, 7442694, 8949362, 10911545, 13383958, 16378751, 19841088, 23597555, 27409895, 30951495, 33900760, 35967693, 36954494, 36852008, 35883683, 34514181, 33305938, 32697230, 32918585, 33962444, 35548645, 37294390, 38748505, 39478541, 39170933, 37666600, 35022953, 31565018, 27729522, 23966151, 20576481, 17716551, 15414682, 13587474, 12134908, 10971614, 10028209, 9254153, 8609129, 8062864, 7583926, 7168076, 6800781, 6467875, 6172999, 5884550, 5622653, 5381396, 5151252, 4943236, 4753777, 4576556, 4411760, 4253642, 4110761, 3973052]
18008C973052j35697j32353j21190j17763j06275j07976j10244j12687j20030
17999B908837j08052j04052q8532r7521r7910q5267p7436p6893p4577p0428o5969
17988A962200n0272n1705o4381n6306m8591n1124n9960m4438l7050m5372l4630
17977A418371k7622m1225m2753m0616m1323k7136k6406l2164l9636l0465k8927
17966A040098l4033l2755l3915l1171k4998k0357k3480j1688j5336q576j3746
17955G90043k4006k9730k0316j5491r620j4579k6045m743l939j7161j3204n261
17943F05948j6863j9364j1636o155j5596j4843j6523j1837o416j4305j5795j5070
17931D41545k3125j9251j5805j6635j4111k892m329j5904j3478j2700j2832o323
$$ y = [3973052, 3837355, 3705002, 3583812, 3466049, 3359774, 3251798, 3141554, 3028867, 2908837, 2800785, 2696733, 2608201, 2510680, 2412770, 2327503, 2250067, 2173174, 2098597, 2028169, 1962200, 1911928, 1860223, 1795842, 1739536, 1690945, 1639821, 1579861, 1535423, 1498373, 1453001, 1418371, 1390749, 1349524, 1306771, 1266155, 1224832, 1197696, 1171290, 1139126, 1099490, 1069025, 1040098, 1006065, 973310, 939395, 908224, 883226, 862869, 839389, 827701, 812365, 803789, 790043, 766037, 736307, 715991, 700500, 690880, 676301, 650256, 645513, 641574, 624413, 611209, 605948, 589085, 569721, 558085, 551930, 536334, 521491, 504968, 493131, 486715, 472410, 456615, 441545, 418420, 399169, 383364, 366729, 352618, 349726, 345397, 329493, 316015, 303315, 290483, 284160]
17919B84160o772j0840j7030j6543o692j565l711n245r317k2211q910m720j441
17906A69163p217o647J496L668n306j765k426n717k238O490m669j0935J956K746
17892A38599j5208r632Q296R432K566J728m361L034o015o907o092l528k964M549
17878A13497K155O18M467P516p056r650l858Q040P259J983J210k080o943n932
17864A11226k948j003K049j1973L382M534K184N32K468N149K265L836K023m748
17850A18976m625P01l838j0593m982k663k04K800J873k838j8735j824M301j257
17836G7092j0164J581L941l497L73N346J304q33J891n864m746P450K807M577l424
17821G7834k131N147M863l174r802r279N071M069O163j948J791j906k099q365
$$ y = [284160, 277388, 266548, 249518, 232975, 226283, 224718, 221007, 215762, 206445, 184234, 175324, 170604, 169163, 161946, 155299, 156795, 160463, 155157, 153392, 150966, 145249, 143011, 149501, 144832, 133897, 135853, 138599, 123391, 113759, 122055, 131487, 134053, 135781, 131420, 134454, 128439, 121532, 115440, 111912, 108948, 113497, 115652, 116270, 120737, 128253, 121197, 111547, 107689, 115729, 122988, 124971, 126181, 124101, 117158, 111226, 108278, 107275, 109324, 97351, 100733, 105267, 107451, 107983, 110451, 115600, 117865, 121701, 123724, 118976, 114351, 115052, 111214, 100621, 95639, 92976, 92772, 95572, 97445, 94607, 75872, 74048, 78349, 77092, 66928, 68509, 72450, 68953, 69326, 74672, 75976, 75143, 77034, 71170, 66424, 73874, 76681, 81258, 77834, 75703, 80850, 85713, 82539, 72737, 63458, 68529, 72598, 78761, 76813, 78604, 76698, 74599, 66234]
17807F6234l918L721L496q237L925J1672J127m674K427n522j0394l233R99K06
17793E7829l532L784J41O628m218k975q459K224Q355J1736j0041j1762K240j61
17779E1789l293P18N56k7J276k218J1827p984j6639n867N898M76n002k178j862
17764B7470J243k230Q12J1207L680J1072q53j5205o548k914J279J2264Q74o335
17750C5816r713q800J712R643l926m980m52J0213P118o821k258L98N012o767l832
17735B2363K375n708N139J827J424o163k44J109M579L734l659r322M377p097j869
17720A2865k359R015K956Q415j934j4112q859r76k429j0517N94M218J71j74R677
17705F551R212M777o923m149l499L45L694k18N726k824j487r412P472R677N669
$$ y = [66234, 62316, 66037, 69533, 61296, 65221, 76893, 78020, 73346, 75773, 70251, 59857, 56624, 57623, 57829, 54297, 58081, 58222, 64850, 60632, 57657, 49198, 51422, 59777, 71513, 61472, 49710, 51950, 51789, 48496, 49214, 49770, 49743, 51019, 48801, 60628, 52644, 36005, 30138, 36036, 36512, 31510, 29332, 27470, 28713, 26483, 27295, 38502, 42182, 53254, 52401, 37196, 30648, 27734, 29013, 41277, 42151, 35816, 26103, 17303, 19015, 28658, 24732, 19752, 19300, 29513, 36631, 29810, 27552, 27950, 32962, 26195, 22363, 24738, 19030, 24169, 25996, 27420, 21257, 21013, 22122, 26701, 30435, 26776, 17454, 21831, 14734, 12865, 10506, 19521, 22477, 30892, 28958, 14846, 5987, 5011, 2582, -7935, -7341, -3123, -2952, -3126, 6551, 15763, 20540, 13617, 9468, 5969, 6314, 10008, 9790, 15516, 12692, 11205, 1793, 9265, 18942, 24611]
17690B4611L770m60K794m713j724m737k410o453L125k858k871N952K050J608p344
17675A0340K95J410l268J967J3850k739N169k070j3129o227R541n930m277n097
17661a65K437m505P49M46J710N445Q366K41l313R478J979K950j2335q866J0765
17646A5382O490m083k513m151j2681o782L269M310k627N93L389j357m151J776
17632c136m136m463P756J447P403L169q715K912Q573q565k707M739L290J302N272
17617A4141K790j3113J704l40o750j602M02K859j147O687R951n554j0457L007
17603B578M896n561j973J106K710m739n253m878N122J4862P4K845L955q580m892
17588B272L456k702k998o001K939M544J126M696K31J0073J752k010j818K908K31
$$ y = [24611, 28381, 27921, 30715, 26002, 24278, 19541, 17131, 10678, 13803, 10945, 8074, 14026, 16076, 17684, 10340, 10635, 12045, 8777, 10744, 24594, 21855, 27024, 24954, 11825, 5598, 15139, 9209, 4932, -165, 2272, -2233, -1484, -1038, 672, 6117, 14483, 14724, 11411, 20889, 22868, 25818, 13483, 4617, 15382, 21872, 17789, 15276, 11125, -1556, -8338, -5069, -759, -3386, -2793, 596, -761, -4912, -3136, -7272, -11735, -3979, -2532, 4871, 8040, -675, 2237, 10810, 2245, -462, 4277, 7567, 8869, 14141, 16931, 3818, 5522, 5182, -1568, -3170, -2768, 91, -1056, 5631, 15582, 10028, -429, 2578, 7474, 1913, -60, 1046, 3756, -983, -6236, -11114, -5992, 8870, 8944, 11789, 15744, 7164, 2272, 5728, 3026, 28, -5973, -3034, 1510, 2636, 7332, 7563, 17636, 19388, 17378, 15560, 18468, 18699]
17573A8699q851j7156M953N867J3085n450o716l896m602l381Q532J491O347J602
17559A0524j0904p86N840k025L851N508P06k359j47n978n089m467l608N956N723
17544B745Q012M904r096q546M090J270l069M764N583M942k787l50L654j1483j693
17529B940p614K668J56N242k455r58M069K790j339o649j2274k72J536K309K004
17514g847L698N818K585k841l301M019P723p690j787j06P449N221n877o947p87
17499f70N457L629j363p149l856l941J2398j983l071N264P929K166M700j0126
17485I384N630j714j380M765j506O53J0143J4440P927J2158J6118J1748J5240
17472A03606K0074L5770K0292J5291k862n831J705O688l7j5153m244n453L769
$$ y = [18699, 9848, -7308, -2355, 3512, 16597, 11147, 4431, 535, -4067, -7448, 1084, 2575, 8922, 10524, -380, -1166, 4674, 2649, 6500, 12008, 12714, 10355, 10208, 4230, -859, -5326, -8934, -2978, 2745, 10757, 15661, 6565, -1981, 2109, 3379, 310, 5074, 10657, 15599, 12812, 12462, 16116, 4633, 2940, -4674, -2006, -1850, 3392, 937, -21, 4048, 6838, 5499, -1150, -13424, -13696, -12160, -9851, -7847, -4149, 1669, 4254, 1413, -1888, 2131, 9854, 2164, 377, 271, 7720, 12941, 7064, 117, -670, 4787, 8416, 7053, -96, -3952, -7893, 4505, 2522, -549, 4715, 12644, 14810, 19510, 9384, 15014, 13300, 11920, 16685, 15179, 15832, 25975, 40415, 48342, 60500, 76618, 88366, 103606, 123680, 159450, 179742, 195033, 192171, 186340, 188045, 194733, 194696, 179543, 175299, 169846, 173615]
17459A73615J9560J6358J3458J0972J926j1465j5095k1584l3557l1390r645J065
17447A14218j4122p006q61N319R063L069o244m646j0758j4366j5788M89K233k404
17433E8196j341k1507j5462r835O973O928O89M791l058n938o04L14n092N332P216
17418B7602J228l933m510J832J059n645j608K66q687k887l965M027R756R743j973
17403B2305M086P132k432p354n908k322O38M046J423k294p165r964n167j2L306
17388C18K520K595M331O872n342K858j440l796k677k060n62R590K885J910j511
17373A6491N869j853j1398j0629r65L97m247k322j1679N361J7174K48l737m209
17359e499O27j90j823j18J352O082M323J822l041q854j3899j324J0082P292K540
$$ y = [173615, 193175, 209533, 222991, 233963, 235889, 224424, 209329, 187745, 154188, 122798, 113153, 114218, 100096, 93090, 92229, 97548, 106611, 109680, 103436, 98790, 88032, 73666, 57878, 58367, 60600, 58196, 56855, 35348, 19886, 10051, 17024, 23952, 24641, 29432, 26374, 20436, 19832, 20146, 15054, 20386, 27602, 28830, 24897, 20387, 22219, 23278, 17633, 16025, 16291, 7604, 4717, 752, 4779, 14535, 24278, 22305, 26391, 33523, 31091, 23737, 17829, 15507, 16145, 20191, 21614, 19320, 12155, 2191, -2976, -2988, 318, 2838, 5433, 9764, 16636, 11294, 14152, 12712, 8916, 6239, 4179, 3617, 13207, 16092, 18002, 16491, 22360, 20507, 9109, -1520, -2485, -2088, -6335, -8657, -20336, -14975, 2199, 2447, -1290, -5499, -4872, -5062, -6885, -7003, -5651, 431, 4754, 6576, 3535, -5319, -19218, -20542, -10460, -3168, -628]
17344f28M320n54n99Q36J985O052m60n735J601J158o134J761o483j105Q653K155
17328F823n371l09j986p430R82J730R03K892M011l686L30M682O694K20p746k79
17312B460N296J1000j701l075j3203m939L401J4128R456k873q11L004l293n142
17298A3708k734n331l631K595l957n893o597r926j791P742R250P821j130K951
17284C077N114M48n298j8583P43J4467j05m621j426O937p7l829R095J787o600
17269A129L436N52r7m03M447j282L993K771l148j25J478r713L465n258m991P372
17253C626N895P066m437j1034j1988k085m85m35M243N631j285n478J739j049K327
17238g749M060m928l307l71K193M877k202k609R25J1263Q684J083o086p792n888
$$ y = [-628, 3692, 3138, 2539, 3375, 5360, 11412, 10952, 5217, 6818, 7976, 1842, 3603, -2880, -3985, 4668, 6823, 1452, 1143, -843, -8273, -7291, -5561, -4658, -1766, 2245, -1441, -1111, 3571, 10265, 10485, 2739, 2460, 7756, 18756, 17055, 13980, 777, -4162, -761, 13367, 22823, 19950, 19139, 22143, 18850, 13708, 10974, 5643, 2012, 4607, 650, -5243, -11840, -21766, -23557, -15815, -6565, 1256, 126, 3077, 8191, 8639, 3341, -15242, -14499, -32, -137, -4758, -6184, 753, 676, -3153, 5942, 7729, 1129, 4565, 5117, 5020, 4617, 9064, 7782, 11775, 14546, 11398, 11273, 12751, 3038, 6503, 1245, -3746, 3626, 9521, 16587, 12150, 1116, -10872, -12957, -13442, -13877, -9634, -4003, -5288, -10766, -9027, -10076, -7749, -3689, -8617, -11924, -12295, -10102, -5225, -7427, -10036, -9111, 2152, 10836, 11919, 5833, -1959, -7847]
17223g847K2M747l634M62M972P99k257L897Q172p985k813k554j497M80O169J147
17207B280r213O080P871m965o134K723J1341N389p530j7288l664rm118Q001n63
17192i799M963O585J725J0314p068j805n548j774m162r543q53Q220J101J596k284
17177h332m810l983M122N136n57l362k265K229L856r6j5K977j0036k288N325j0183
17161b2282M022J0952L753K071k021J0352r23l985j447k914o933m459P916p004
17147a2902j4966N794K898M616Q379o001j243l353J371p68j0086K902K069J1515
17133i775N966k456j728L041N915O162m47p073O063n23j2920l290l89m687K355
17118a3786J4068M991o41Q56q07j3070Q511N758k992j778N191J326m98Q84j193
$$ y = [-7847, -7825, -3078, -6712, -6250, -1278, -479, -2736, 1161, 9333, 1348, -1465, -4019, -5516, -5036, 1133, 2280, -6933, -853, 7018, 2053, -4081, -1358, 9983, 15372, 7842, -9446, -13110, -13119, -17237, -9236, -9799, -4836, 1749, 3474, 13788, 6720, 4915, -633, -2407, -6569, -16112, -16965, -8745, -7644, -6048, -8332, -13142, -17125, -13003, -7867, -8424, -11786, -14051, -11822, -7966, -8062, -8077, -5100, -15136, -17424, -12099, -22282, -18260, -7308, -3555, -1484, -3505, 6847, 5924, 1939, 492, -2422, -9355, -13814, -5898, -12902, -27868, -22074, -19176, -14560, -6181, -12182, -13425, -16778, -15407, -16175, -26261, -23359, -21290, -9775, -3809, -6265, -7993, -4952, 963, 7125, 6678, -395, 5668, 5145, -7775, -11065, -11454, -16141, -13786, 282, 5273, 4632, 5488, 4681, -8389, 122, 5880, 2888, 1110, 6301, 7627, 7129, 8013, 6820]
17103F820m199q854r902M458j574R317L538J569k377p646J54j575M408n762J602
17088a0023j392J3368p865j4325J856Q901P966m860q523j688L152J3632J840k879
17074h40M099M617q283l689K791N020n640k941Q549l80l312J866o438o335M619
17059f297Q468n513j1023k749P167K274j374K17M552P341J187K475n056j1672
17045a0003m689K263J2380K480n121L50L749l725N805K171o156q153j986K712
17031g923N297O7J254P33N504P212P69j0404r109j734k30j779j1702p864K490
17016b7419j993J3500L081K450J310O133L59K372L338j5429l598J4200O214r942
17002e424r100O837M052q18O621O01n510k003M556j54q673l522M607R734L48K815
$$ y = [6820, 2621, -6233, -16135, -11677, -13251, -3934, -396, 1173, -1204, -8850, -8696, -10271, -5863, -11625, -10023, -11415, 1953, -5912, -20237, -18381, -9480, -1514, -6374, -14897, -16585, -13433, 199, 2039, -840, 3259, 7876, -407, -4096, -1305, 3715, -1925, -4866, 3683, 3303, -9, 1857, -4581, -10916, -6297, 2171, -3342, -14365, -17114, -9947, -7673, -9047, -8830, -4278, 3063, 4250, 6725, 1669, -10003, -14692, -12429, -49, 2431, -2690, -2340, 1409, -2316, 3489, 5660, -496, -8649, -10635, -7923, -2626, -2559, -1305, -572, 4932, 12144, 12913, 2509, -6600, -8334, -8564, -10343, -22045, -29909, -27419, -29412, -15912, -12831, -10381, -9071, -2938, -2579, -207, 3131, -12298, -15896, -1696, 4518, -5424, -14524, -7687, -3635, -4453, 2168, 2769, -2741, -4744, -188, -342, -9015, -12537, -7930, 1804, 2152, 4967]
16986D967M885Q754n982l77n658j863o420n554l906l614n120P822N659O612j279
16971a074m311j223K903J2664N094j1859q142m885n378M114J862O16J780L765
16957d074o177j222L223O038J2036N89l937n636j362m09R013K94k400M166j4769
16942d627o593j462N337O772l43j553R3L95n270O527P374L036j844r737k649O98
16926c846L976N733n477l636N765L776m042l499J813L604l533M74J422k391K770
16911B909k686j775p45q928k713L128J460o015O88J065P569o945m130K177Q861
16896f080o289m868L258L585K057l768J97O964M313o865j783M755K018j616l515
16881g637P578l900j5296j297O679M2l187p504l391N976P972l247J0049N215N64
$$ y = [4967, 9852, 18606, 12624, 12247, 6589, 4726, -1694, -7248, -11154, -14768, -19888, -12066, -6407, 205, -1074, -5385, -6608, -3705, 8959, 14053, 2194, -5948, -10833, -16211, -12097, -10235, -9619, -7839, -4074, -10251, -11473, -8250, -2212, 9824, 10413, 6476, 840, -522, -931, 8082, 8376, 5976, 10142, -4627, -11220, -12682, -7345, -573, -916, -2469, -2376, -1981, -7251, -724, 6650, 9686, 7842, -1895, -4544, -3846, 130, 5863, 386, -3250, 2515, 6291, 2249, -1250, 563, 4167, 634, 1108, 2530, 139, 2909, 223, -1552, -2297, -11225, -13938, -10810, -9350, -15365, -14677, -13612, -6043, -12988, -17118, -14941, -6080, -12369, -17237, -13979, -10394, -8337, -12105, -11908, -4944, -631, -7496, -9279, -4524, -2506, -4122, -7637, -59, -3959, -19255, -20552, -13873, -13831, -17018, -24522, -27913, -21937, -13965, -17212, -7163, -1948, -1384]
16866a384K098p692J332j869O906Q817j580L21J624j683p252J321k965L628n961
16851d339j533n075J0003L371Q116R143o052l023n130l833N238r252J744R629
16837I007m761l431K693q946j912Q201j352j003J953M136j872R7l528N91K59q211
16821h079j694K250m468Q97J175j2792M570R41K156N983l219N660j120K080O779
16806A119O389K826j3034K967o584P468M412n602j2063k337N995K25L349o485
16792a1355m264L43M185N558N839n982n502j358r337l326Q029M413J0520k034
16778d271L317J0592J930p751j3453p123M971N679o113j3510j082Q732R465j526
16764a0143m318p090O004r683j083R215O106J0685M951L621j181r460j4354J521
$$ y = [-1384, 714, -6978, -5646, -7515, -609, 8208, 6628, 6949, 8573, 6890, -362, 959, -2006, 1622, -4339, -5872, -10947, -944, 2427, 10543, 19686, 13634, 10611, 5481, 1648, 6886, -2366, -622, 9007, 4246, 815, 3508, -5438, -7350, 851, -501, -1504, 449, 4585, 2713, 2810, -718, -127, 132, -8079, -9773, -7523, -11991, -11094, -9919, -22711, -18141, -17200, -15044, -9061, -12280, -6620, -7740, -5660, 1119, 7508, 10334, -2700, 267, -6317, 1151, 5563, -39, -12102, -14439, -8444, -8219, -4870, -11355, -15619, -15276, -11091, -5533, 306, -5676, -11178, -12536, -21873, -25199, -17170, -12757, -2237, -4271, -954, 9638, 11568, 3817, -9636, -16759, -11788, -6109, -12222, -25732, -26814, -18082, -8617, -10143, -14461, -21551, -15547, -25230, -26313, -17098, -10992, -307, 4644, 8265, 7084, -2376, -16730, -15209]
16750a5209O305O380k995k672m09M741R046K098l539m750n008J662P404N46l931
16735c31l323q93N764L399O795k05o896O952J724l751O974o084n606J175n440
16720B54p597r35L943j857R60K674j289k210R435l352j412o525o876j596l388
16705a9771R38O705O946M373q965k588n48k558J1776K07j1711k271R770J4198
16691F501Q57r88O950j346n249r440q819l302M788O042j291O081J009l843l730
16676e780N045J063k128L091m55j491O88j083M01j87o238R0K449R441K754j175
16660F485q555k446n596L681O988O233j2839j2130l230P79J2342N375J0127J2810
16646B0024K059j8522o295r569K642N496m687K086O76Q991O98K986j466o756r146
$$ y = [-15209, -8904, -2524, -5519, -8191, -8600, -3859, 5187, 7285, 3746, -1004, -6012, -4350, 3054, 3600, -331, -3654, -4547, 1217, 4616, 11411, 11206, 4310, 11262, 12986, 9235, 16209, 10125, 4519, 5694, 254, -7343, -8278, -4335, -6192, -5232, -2558, -3847, -6057, 3378, 26, -1386, -7911, -14787, -16383, -19771, -18833, -12128, -5182, -809, -9774, -12362, -12910, -15468, -3692, -3485, -15196, -17467, -7697, 6501, 7358, 6370, 13320, 11974, 6725, -2715, -11534, -14836, -10048, -4006, -5297, 784, 1793, -2050, -5780, -735, 328, -1800, 1291, 836, -655, 33, -1050, -649, -836, -7074, -6984, -4535, 4906, 7660, 6485, -2070, -4516, -10112, -6431, 557, 6790, -6049, -18179, -21409, -20630, -8288, -2913, 7214, 20024, 22083, 3561, -2734, -12303, -9661, -4165, -8852, -6766, -6090, 2901, 3599, 6585, 5119, -1637, -10783]
16631a0783O671j132L216N693N86J984j773n333J912k483j940N072L181k595n904
16616c628J863k545p402j231J517R874o820O07N401L923K145j488L841l284o476
16601c703j5410o145O288K441J0001O048o852j2773R997R358K944p790K363N343
16587B110k298p434m729k185m62k69n54M83J0852k284k967O760N508M401P992
16572A4924j7015l250Q761N800j5919p350L305O836R6q31j738l95J071Q439J6036
16557A8770o01p521j0765P090Q96j7282j3242M192J1028M124k985M642Q631O016
16543A2993r087j688o622o696j727K062J735j393k060K010l563j444M82L66J5299
16528F67O297r186q369M125J0196p6J012N563m312l46P174j2336r257N214p721
$$ y = [-10783, -4112, -5244, -2028, 3665, 4251, 6235, 4462, -871, 1041, -1442, -3382, 1690, 4871, 2276, -3628, -1765, -4310, -11712, -12943, -11426, -1552, -8372, -7765, -2364, 1559, 3704, 2216, 6057, 2773, -3703, -19113, -25258, -18970, -16529, -6528, -480, -7332, -20105, -10108, -750, 2194, -5596, -3233, 2110, -188, -7622, -12351, -14536, -14998, -15267, -15821, -15338, -4486, -6770, -9737, -2977, 2531, 6932, 14924, -2091, -5341, 3420, 9220, -6699, -14049, -10744, -3908, -3812, -4643, -6381, -6776, -5705, 2734, 18770, 18169, 10648, -117, 6973, 7869, -9413, -22655, -18463, -7435, -3311, -6296, -1654, 6977, 12993, 3906, 2218, -4404, -11100, -12827, -10765, -9030, -10423, -12483, -10473, -14036, -15480, -14998, -14632, 667, 6964, -2222, -10591, -6466, 3730, 3654, 4666, 10229, 5917, 5571, 12745, 409, -8848, -3634, -11355]
16513a1355J764M12Q435J1209J1145K475n859j2758o589L258o510O66J1348K267
16499I908o235J20M553l342r5o671j176n404r00o296o257R918O941j2491q317
16484b5744L459L061j333l815m371Q040L650M369J78n89O789k865p264l090K891
16469a6634P70K228J1148O603k551n652r667l866J0583J1479J243J153m627M608
16455F818K268O114m289j1999n669j2247m120J1633L052o90L811L154j582m264
16441h010n498K414P607N732n532p227l038J967k448K001N053R54n172R51q75
16426a1121k825l756J100Q861k171k244J1517M905o732j843m65M44q795r751J0474
16411a2402J9202l24n683m827L565K187n252r108k634N341O639L97J00o956l20
$$ y = [-11355, -9591, -9179, -744, 10465, 21610, 24085, 18226, 5468, -1121, 2137, -4373, -3707, 7641, 9908, 3673, 3793, 8346, 5004, 4909, -1762, -2938, -8342, -9242, -15538, -21795, -11877, -4936, -17427, -25744, -22285, -19224, -20557, -24372, -28743, -20703, -17053, -12684, -12506, -13095, -6306, -9171, -16435, -19525, -16634, -15864, -13636, -2488, 4115, 1564, -4088, -13755, -17621, -7038, 4441, 5684, 6837, 2210, 6818, 9086, 15200, 10911, -1088, -6757, -19004, -23124, -11491, -8439, -9129, -5318, -2164, -3746, -8010, -13508, -11094, -3487, 2245, -3287, -10514, -13552, -11585, -14033, -12032, -6979, -6025, -11197, -10246, -11121, -13946, -17702, -16602, -7741, -9912, -12156, -639, 4266, -2466, -4309, -4774, -4330, -13125, -22876, -12402, 6800, 6476, 793, -4034, -469, 1718, -3534, -12642, -15276, -9935, -3296, -2899, -2799, -9755, -10075]
16396a0075M578j496J258j934M98l16l54J0512L9O485K388m20m098p251m489L64
16380d311J088k748q971K522N980N774n455j781K615k399n030J493n90j666Q62
16365a2617K052J2829P465k597j386o490n529J86O154P117J2296K253j3360q999
16351f26Q757P501q24j391n905n44O54k321o764K048L586J526k990m063j4438
16336a5794n1J0533L167K108K804R401k544k209l309K601o327r66m281N39q44
16321e172L578l017l30q882M456K286m875J021K213m16K091N571J684o576m176
16306a0544q549K334J2195N933R383o882n279m909m058j1217K179K0315k17n310
16292d626L869k820r462N207O984n136r096k618M401Q630N843l054p13O69Q615
$$ y = [-10075, -5497, -6993, -5735, -7669, -7171, -7487, -7841, 2671, 2710, 9195, 11583, 11163, 7065, -186, -4675, -4311, -3223, -5971, -14942, -12420, -6440, -666, -6121, -7902, -5287, -7686, -12716, -11223, -11813, -13479, -12617, -10565, 2264, 9729, 7132, 5746, -744, -6273, -6087, 67, 7184, 19480, 21733, 8373, -626, 8131, 15632, 14808, 13417, 7512, 6968, 7622, 5301, -1463, 585, 4171, 5697, 2707, -1356, -15794, -15845, -5312, -2145, -37, 2767, 12168, 9624, 7415, 4106, 6707, 380, -586, -4867, -4328, -5172, -1594, -4611, -4941, -13823, -9367, -7081, -11956, -10935, -8722, -9138, -7047, -1476, 208, -6368, -10544, -19093, -16759, -4564, 1369, 10752, 3870, -1409, -6318, -10376, -21593, -19414, 901, 684, -4626, -757, -3577, -13039, -7832, -848, -5984, -15080, -17698, -13297, -4667, 1176, -1878, -2591, -1922, 6693]
16277F693o77j0065k202K060J2170j38r254R89p736o451R321N6K317Q199r78k184
16261B120k465o54L877k804J666M311m958M210Q958j795N9j2079j2608m844K399
16246a4607J720P425M478q217P60O167L483J711r061k796j404Q415R324j185n383
16231H30l301N909N5k820j2088j931P343k725l683O2J0106J0912j0670r203k897
16216a4101L347J0223L196R65P94M323q902j7547R080R773m397k721J805Q772
16202D610K110m155J500r529j6357m869J0364k84o73J2362P660J934p227j463
16188d017l008J297p474l113J759J73J629N00p88K159p92k568j1354J687N852
16173a8058R46J2231L607m888k338o724K4r10M205Q463J5587K859j2215p735K257
$$ y = [6693, 6016, -4049, -6251, -4191, 7979, 7841, -1413, -424, -8160, -14611, -5290, -5234, -2917, 5282, 4304, 2120, -345, -999, 2878, 74, 1740, 6051, 1093, 5303, 14261, 12466, 12525, 446, -12162, -17006, -14607, -12887, -5462, -984, -9201, -8441, -2274, 1209, 2920, -6141, -8937, -10341, -1926, 7398, 6213, 830, -2471, 3438, 3493, 673, -11415, -13346, -6003, -8728, -12411, -12349, -2243, 8669, -2001, -11204, -14101, -10754, -531, 2665, 3630, 4424, 8747, -155, -17702, -8622, 1151, -3246, -5967, -4162, 4610, 6720, 2565, 4065, -5464, -21821, -26690, -16326, -16610, -17283, -4921, 2739, 4673, -2554, -4017, -7025, -5728, -13202, -16315, -14556, -14383, -12754, -12254, -13042, -10883, -11675, -14243, -25597, -23910, -18058, -17112, -4881, -1274, -6162, -8500, -15224, -15200, -16110, -11905, -3442, 12145, 15004, 2789, -4946, -2689]
16158b689q667j062N133P494N15k191r49N793J457n162l955m642M825P207l788
16143f81j3043k605Q309P694k992M62K653L903J718N722j354j0332r163r272p075
16128b6056o183O878J2614K990K716O273l45j3777M750Q570M878L163j227J95
16114E439p930J219L604r795j6987p799L76Q324J134R050J344K210j24p818P04
16099a7049M378K136L021L751N957l36p196K674M627n698o482Q01M57N805M514
16084A360l851j1325m504P032P908j884K465o27K724N778K117n339n046K673p671
16069h190o105j850l34k844k792P921Q914K143J517J1077J697n587O465l365J716
16054A0383p658l488O40R77P052J668q345l538R903N10m769r00k271M380L279
$$ y = [-2689, -11356, -12418, -7285, 209, 724, -1467, -2416, 3377, 4834, -328, -4283, -8925, -4100, 3107, -681, -13724, -16329, -8020, -326, -3318, -2856, -203, 3700, 5418, 11140, 9786, -546, -9709, -18981, -26056, -32239, -25361, -12747, -9757, -7041, -768, -1113, -14890, -10140, -1570, 3308, 6471, 5244, 5439, -2491, -1272, 2332, -7463, -24450, -32249, -31873, -23549, -22415, -13365, -12021, -9811, -9935, -17753, -17049, -12671, -10535, -7514, -3763, 2194, 1858, -5338, -2664, 1963, -3735, -10217, -9416, -8959, -3154, 1360, -2491, -13816, -18320, -11288, -3380, -5264, -2799, -3426, -702, 5076, 7193, 1854, -3192, -519, -8190, -14295, -16145, -16479, -19323, -22115, -14194, -5280, -3137, -1620, 9457, 11154, 5567, 12032, 8667, 10383, 2725, -763, -123, 854, 7906, 9574, 1229, -2309, 7594, 8104, 3335, 2435, 164, 4544, 7823]
16039G823p939q673p505p57N6J977j656l87K79Q880Q857K127L899j234r370o376
16023i999P881O388j209J237k732p069j556M924J0271j858m37k533k276p648r267
16008a5883M258K742J077K893n126k783K304o216l154M461K158Q52r043j116N993
15993a6583J0531Q174j1982K449L624N625n96j069j436j181j317Q087j562l617
15979h53J0536j600p692P0m124L12Q164J070k691M73j872l157l969n017o00J5430
15963D480O81K936L59m918L486n191m225M834O065j0291n204k734l761n58J834
15948a2207J1118Q920J965L571k415m277o489k606k256j5053Q320J0261K957j169
15934F40j157q946J782R417O708j2716r220j292n48O773R042p72j124j44m979
$$ y = [7823, -116, -8789, -16294, -17051, -16995, -15018, -16674, -17061, -16782, -7902, 955, 3082, 6981, 5747, -3623, -9999, -2118, 4270, 3061, 4298, 1566, -5503, -7059, -2135, 8136, 6278, 5841, 3308, 1032, -6616, -15883, -11625, -8883, -7806, -4913, -10039, -12822, -10518, -16734, -19888, -15427, -13269, -12417, -21460, -22576, -16583, -6052, 2122, -9860, -7411, -3787, 1838, 1242, 173, -1263, -2444, -3761, 4326, 2764, -853, 9683, 8083, 391, 461, -3663, -3351, 4813, 5883, 3192, 3665, 1793, -1364, -5333, -10350, -10950, 4480, 5161, 8097, 8456, 3538, 7024, 1833, -2392, 2442, 8507, -1784, -6988, -9722, -13483, -14041, -12207, -1089, 7831, 9796, 13367, 10952, 6675, 186, -2420, -4676, -19729, -11409, -1148, 1809, 640, -517, -9463, -7681, 1736, 8444, -4272, -13492, -14784, -15332, -8559, 483, -289, -1413, -1557, -6536]
15919f536p39L038L709o009j11n990p035J91J3467Q691O439M371j638J3752j752
15904B3848j1032O666J6360J1313J8791L1016L9247L5342K0213J8881J6421o861
15892B20205K921m330k1098n896j5088K205K0465J8227J8562K2835O163j4971
15880B50200k1066k6688j7581k1414k9247k7199k0059j2909j0258k105m465q649
15868D8560O683J769k288j2598n534K280n904N659l587l194m832L693j975q065
15854B0667k595k495l080J405P467O350p541k873p825j255J41m01M494n236n416
15839A807J610N821l408o39J035l662j680k617L06k474P647J3760m877q873o063
15824b307Q284J8923K43k648l908L196j83j4291j131l366l403r14J2988n771n687
$$ y = [-6536, -7275, -4237, -528, -6537, -6648, -12638, -19673, -19482, -6015, 2676, 9115, 13486, 11848, 25600, 23848, 12816, 19482, 35842, 47155, 65946, 96962, 136209, 171551, 191764, 210645, 227066, 220205, 223126, 218796, 197698, 191802, 176714, 178919, 199384, 217611, 236173, 259008, 265171, 250200, 229134, 202446, 184865, 163451, 134204, 107005, 86946, 74037, 63779, 61674, 57209, 48560, 55243, 57012, 54724, 42126, 36592, 38872, 32968, 38627, 35040, 31846, 27014, 30707, 28732, 20667, 18072, 15577, 12497, 13902, 21369, 27719, 20178, 17305, 9480, 8225, 8366, 7965, 12459, 7223, 1807, 3417, 9238, 5830, 5191, 6226, 2564, 884, -1733, -1427, -3901, 3746, 17506, 12629, 3756, -2307, 5977, 24900, 25143, 22495, 18587, 21783, 21600, 7309, 6178, 2812, -591, -1505, 11483, 5712, 25]
15809B5M21r70k214k546J239k287q440j060J0842J0670M183o622J775J123L247
15794I386n99o650j010J766p098l512O442P98m542N433N369P056j3032k916n881
15779h990j582N302M389L434k643K628n048n063R901Q434j824l547n669p73K588
15764A537K173p671k685R09N530O082J4307R92n622r07J72M359k009j964J60n116
15748A0247n738o66J819j324K71L233J511J781k046l921k187n663J818P151M611
15733A0897m514j2487p226J177j120q484K835J5256M277Q704R04n888r817l96
15719e882o70M903M455M904O746O391m17j234o205r840R95l597K250q64J0226
15704A2161L178q022J404O149o199q81L740n442n307O604m7o736q702M025M21
$$ y = [25, 446, -524, -2738, -5284, -4045, -6332, -14772, -15832, -4990, 5680, 9863, 3241, 5016, 6139, 9386, 8787, 2137, 1127, 2893, -4205, -7717, -1275, -477, -5019, 414, 5783, 12839, -193, -3109, -8990, -10572, -5270, -881, 2553, -90, 2538, -2510, -7573, 2328, 10762, 8938, 5391, -278, -1051, 1537, 3710, -3961, -6646, -5737, -207, 5875, 20182, 21174, 15552, 14645, 14817, 19176, 17167, 15203, 15363, 10247, 4509, 3843, 5662, 4338, 4609, 7842, 9353, 11134, 9088, 5167, 2980, -2683, -865, 6286, 10897, 6383, -6104, -13330, -12153, -13273, -21757, -18922, -3666, 611, 9315, 10219, 4331, -5486, -5882, -6552, -1649, 2806, 7710, 14456, 20847, 20430, 19196, 12991, 3151, 4146, 549, 2799, 1935, 12161, 15339, 7317, 8721, 14870, 8671, 7790, 11530, 6088, 781, 7385, 7338, 602, -8100, -4075, -3654]
15689c654M652k421p781O429J332p263M382M679m545K283J709o131M09N536K462
15674B078N02n450m383n311Q230J0526M404n26R0j389N10m161m775O019k035o962
15658b633o880L841j507m6p779L513M898j264j1326j0529K66J0420M599N837P608
15643i82o084l868o05M087M464l552p974M651R433j249k130N086m734o483L679
15628f261q32J962M08M829n471L207L50N465P455n106N392m630J083J050j045
15613G856k852N328J027J411j6116p852N888K312J0784J1408k690o673N740R909
15599B5480n02P972O307k729q57J101m442N070M951K461j557j222M293j010K434
15584D7750l606J1242j869J036N274n56m868j3136j0912k676N109m605j3718k389
$$ y = [-3654, 998, -1423, -9204, -2775, -1443, -8706, -4324, 355, -4190, -1907, -198, -6329, -5920, -384, 2078, 2580, -2870, -7253, -12564, -4334, 6192, 10596, 10070, 10160, 8771, 9281, 5120, 345, 6364, 4329, -2633, -9513, -5672, -7179, -7225, -15004, -11491, -6593, -7857, -19183, -29712, -29446, -19026, -14427, -8590, -982, -7066, -10934, -11539, -7452, -2988, -6540, -14514, -9863, -430, -1679, -3809, 1277, -3457, -9940, -6261, -7093, -5131, -4723, 106, -5365, -2158, -1808, 3657, 11112, 6006, 11398, 6768, 7851, 8901, 7856, 5004, 10332, 11359, 12770, -3346, -11198, -5310, -2998, 7786, 19194, 16504, 9831, 15571, 25480, 24978, 32950, 39257, 36528, 35671, 36772, 32330, 37400, 42351, 44812, 43255, 42033, 46326, 45316, 47750, 44144, 55386, 53517, 54553, 59827, 59271, 54403, 41267, 30355, 27679, 32788, 28183, 14465, 12076]
15570A2076O396Q628M441j026N89K17j733m471Q441L755l31q903j1365J354K145
15555B0213N62M369p861n871J248o170L858P766l994o611K089R246M31j4069j427
15540C779J604J3897K477j1075p278j104K689j4013p918K863R67o135j9J6116
15526c150J0077O02J344O656j260m577m639o458j581Q863M186j305l554Q73J2136
15511A8213R571k369n040n450o93P502J865q564K627Q029K263N633q10j8131j3520
15496A126K708J18J108Q574m088K500J2119N967k057j95k109M060O849K955L151
15481D2786M636J910O445j420l396J0653J1362J2614L612R017J0581O693J780
15468A17273L467J492j018j243l842j5041l464L451J5572Q444L415M584j239R45
$$ y = [12076, 18472, 27100, 31541, 30515, 31104, 31321, 29588, 25117, 33558, 37313, 36982, 28079, 16714, 18068, 20213, 20775, 25144, 17283, 11412, 12660, 6490, 10348, 18114, 14120, 7509, 9598, 18844, 19275, 5206, 3779, 5383, 19280, 21757, 10682, 3404, 2300, 4989, -9024, -16942, -14079, -13112, -19247, -19266, -3150, 6927, 7529, 8873, 15529, 14269, 9692, 5053, -1405, -2986, 5877, 10063, 8758, 5204, 6077, 18213, 27784, 25415, 20375, 14925, 14232, 21734, 23599, 15035, 17662, 25691, 27954, 33587, 32777, 14646, 1126, 3834, 3952, 5060, 13634, 9546, 12046, 24165, 30132, 28075, 27880, 25771, 29831, 36680, 39635, 42786, 47422, 49332, 55777, 54357, 50961, 61614, 72976, 85590, 89202, 98219, 108800, 115493, 117273, 120740, 122232, 121214, 119971, 116129, 101088, 97624, 101075, 116647, 125091, 128506, 133090, 131851, 132796]
15454A32796n869n538l328j595p318j707O755p732o642m752o834l699K691J1000
15440I8228J451L159N033m293O751K327k851l392Q235R279j023p082R45n496j0288
15425A00983m246Q316j687j636L429K120P953K775m511Q646O666Q493j903n012
15411A30386j176K649l416l006o302N248k824L062M743K679M651J1296J0242l269
15397A54963K625p51m892N877J2014R534O228L533J2965J1894Q630P64K36J3844
15383B37464Q055J7681K2547L451J1242K2445J2081K4347L5264K8893L5431M4983
15371E03884N4204N7956P7182Q0505Q3623J01019J21417J36165J47456J53531
15361A516942J64742J82593J94836K21851K72457L38991M38423N93350Q32484
$$ y = [132796, 126927, 121389, 118061, 116466, 109148, 107441, 114196, 106464, 99822, 95070, 88236, 84537, 87228, 98228, 99679, 102838, 107871, 103578, 110329, 112656, 109805, 106413, 114648, 123927, 122904, 115822, 116767, 111271, 100983, 96737, 105053, 103366, 101730, 105159, 107279, 115232, 118007, 113496, 122142, 128808, 137301, 135398, 130386, 129210, 131859, 128443, 125437, 119135, 124383, 121559, 124621, 129364, 132043, 136694, 147990, 158232, 154963, 157588, 156837, 151945, 157822, 169836, 179370, 185598, 189131, 202096, 213990, 222620, 223384, 223620, 237464, 245519, 263200, 285747, 289198, 300440, 322885, 334966, 359313, 394577, 423470, 458901, 503884, 558088, 616044, 693226, 773731, 857354, 958373, 1079790, 1215955, 1363411, 1516942, 1681684, 1864277, 2059113, 2280964, 2553421, 2892412, 3330835, 3924185, 4756669]
15352D756669J188901J730383K457493L333803M209960M947042N389238N356976
15344C3370465M771653L594950J930177l964j953685l231426l247866k263045
15336C2967259o88666J110663K588666L352220L321435K532591J052872q50763
15328D5386277k963888m775061n623535n575233m920481l899152k855835k051375
15320A2721717j513030j152622q96416p16764n88642m94795m27996l78650l33169
15311F219633l06029k84737k72565k53321k27581k11545k03172j91721j85441
15302D083521j76666j57147j53441j46608j17030j14096j14967j11240j02759
15293B889567r6534j00434q6375p8974p9156q4043p6822p3936o8472p3210p1107
$$ y = [4756669, 5945570, 7675953, 10133446, 13467249, 17677209, 22624251, 28013489, 33370465, 38142118, 41737068, 43667245, 43663281, 41709596, 38478170, 35230304, 32967259, 32278593, 33389256, 35977922, 39330142, 42651577, 45184168, 46237040, 45386277, 42422389, 37647328, 32023793, 26448560, 21528079, 17628927, 14773092, 12721717, 11208687, 10056065, 9159649, 8442885, 7854243, 7359448, 6931452, 6552802, 6219633, 5913604, 5628867, 5356302, 5102981, 4875400, 4663855, 4460683, 4268962, 4083521, 3906855, 3749708, 3596267, 3449659, 3332629, 3218533, 3103566, 2992326, 2889567, 2793033, 2692599, 2606224, 2527250, 2448094, 2364051, 2287229, 2213293, 2144821, 2071611, 2000504]
15282B000504o1301m9612l8324n9752o5639o3006n9179n1664l7945m4007l5229
15271A434846l8804m4878m5903l2659l6107l0872m0178l5747j7128k9298l0415
15260A052857k9229l4068k1502k5227l2117l5815l1377k1670j7462k9409j1383
15249G63598k3754k4464j5183r960n742j3233j4899j9930j6048j3960j4353j8478
15237E73594k0441q89o196q138j1040j6771k0362k1488k0080o294r702p869p217
15224D17107j6679j6763m751q076j5995j0428j990j3274r703k1586k2983p107
15212B67772j7138j6554p946j2796j0075m296j4599j1186j2078j2953j7940j874
15200A28337j0646l368r133l075l387p34Q382Q0k921r08K039j236j0911r616P530
$$ y = [2000504, 1939203, 1889591, 1851267, 1791515, 1725876, 1662870, 1603691, 1552027, 1514082, 1470075, 1434846, 1396042, 1351164, 1305261, 1272602, 1236495, 1205623, 1165445, 1129698, 1112570, 1083272, 1052857, 1023628, 989560, 968058, 942831, 910714, 874899, 843522, 821852, 804390, 774981, 763598, 739844, 715380, 700197, 690237, 684495, 671262, 656363, 636433, 620385, 606425, 592072, 573594, 553153, 552264, 546068, 537930, 526890, 510119, 489757, 468269, 448189, 441895, 432193, 424324, 417107, 400428, 383665, 378914, 370838, 354843, 344415, 342425, 329151, 319448, 297862, 274879, 267772, 250634, 234080, 226134, 213338, 203263, 198967, 184368, 173182, 161104, 148151, 130211, 128337, 117691, 114323, 105190, 102115, 98728, 97994, 106376, 106456, 103535, 102627, 104666, 103430, 92519, 82903, 90433]
15185I0433k225M094n617K285O256O434P066j0993j8912m893P093R871l190l017
15171H4685j305L522m052j282M762J744j677n127p99j278j281r019Q177J0930
15157H8000N971K378J950J691j402r385l899k930N807R838P666L345K836o809
15143A05057k983N342K184O530m896j1003p460J732j473n814l234l432j2858J390
15129F9082J336p529n104K734P818l498k211Q31J3825p48o166l284n889k369J754
15114F0582o219l046N391m265M268Q651m167j961L34P800j421k376n593M668Q908
15099G1554L022k293K368l586p446l186J844k052m079L217R24p783p605J745K767
15084D9411K965L283J953l526M62N96m664p077o6j053m923l739n374P991O238
$$ y = [90433, 88208, 92302, 86685, 88970, 95226, 101660, 108726, 97733, 78821, 73928, 81021, 90892, 87702, 84685, 83380, 86902, 82850, 81568, 86330, 88074, 86397, 81270, 80471, 79193, 77912, 68893, 77070, 88000, 93971, 96349, 98299, 99990, 98588, 89203, 85304, 82374, 88181, 98019, 105685, 109030, 111866, 105057, 102074, 107416, 109600, 116130, 111234, 100231, 92771, 94503, 93030, 87216, 83982, 80550, 67692, 69082, 70418, 62889, 57785, 60519, 68337, 64839, 62628, 63459, 77284, 76536, 70370, 67086, 61197, 58828, 60582, 54363, 51317, 56708, 52443, 56711, 65362, 61195, 59234, 59568, 67368, 65947, 63571, 57978, 62646, 71554, 74576, 72283, 74651, 71065, 63619, 60433, 62277, 60225, 56146, 59363, 60287, 52504, 44899, 46644, 49411, 52376, 55659, 57612, 54086, 54548, 55144, 50480, 43403, 43337, 42284, 37361, 33622, 28248, 36239, 42477]
15069D2477j058r107j0139n364j830M272m21J26P150M699n389J218M59L609L6
15054C0738Q8r86r092j3789O348M759M448M193q89n909L1M471j718m748R418P711
15038C5074K724K755j809m724q990q768p980l321Q044J6154N263k606j0493q129
15024A3194N086K392K140p50r723J1447O074m97P16k616r190o38L587Q699j01
15009B9820r463o450K57j612L131R717m519k240l00l78j698J2855l673j4118q943
14994B386K904K624L137N581L782k717O815j529m810l964o338n640P239O835L053
14979A9358p764o883L261q39Q762j953j2553l538j438J659O642k377m731J12J2684
14964A0402R978l432p723j386l739n648J531M56r34m742L385J0012O77K323Qk206
$$ y = [42477, 41419, 32312, 22173, 16809, 14979, 19251, 18830, 18956, 26106, 30805, 25416, 26634, 27093, 30702, 30738, 30826, 29840, 20748, 6959, 13307, 18066, 22514, 26707, 25818, 19909, 19940, 24411, 22693, 17945, 27363, 35074, 37798, 40553, 38744, 34020, 25030, 16262, 8282, 4961, 13005, 29159, 34422, 31816, 21323, 13194, 18280, 20672, 22812, 22062, 12339, 23786, 29860, 29363, 30079, 27463, 18273, 17635, 21222, 29921, 29820, 20357, 13907, 14164, 12552, 15683, 25400, 20881, 18641, 18341, 17963, 16265, 29120, 25447, 11329, 2386, 5290, 7914, 11051, 16632, 20414, 17697, 24512, 22983, 18173, 14209, 7871, 2231, 9470, 16305, 19358, 11594, 4711, 7972, 7133, 15895, 13942, 1389, -2149, -3587, -1928, 4714, 2337, -2394, -2282, 10402, 20380, 16948, 9225, 7839, 4100, -1548, -17, 439, -495, -5237, -1852, 8160, 8837, 11160, 11168, 8962]
14948H962P50K178j419o780p786M225N688p25J135q366N660N350J783j801J30
14933H984j550o146N833k952n732q178K727P290p29l43p879n434J652K407Q730
14918a320l303m590J207M377k614N469K825R5P969O018n944K019j214M441L86
14903A5821r312q68k919l120k029K012l022J588J829M124o554j122j009N108M942
14888E469N141N80j591O524j467o85R86k093p605j453j233L613k681m342K24K234
14872A621O205l24l85o401k555j328K256J880K834N345p179o047k74J880M642
14857B170n202M850j073n550k488L673K099J0852J0822O60r593j6359k335J3159
14843E685j0381j0983K974N421J1032P299l277j2867N373j587L554k570m249N876
$$ y = [8962, 9712, 11890, 10471, 3691, -4095, 130, 5818, 5093, 6228, -2138, 3522, 8872, 10655, 8854, 8984, 7434, 1288, 7121, 4169, -1563, -9741, -7014, 276, -453, -796, -8675, -14109, -12457, -10050, -1320, -4623, -9213, -8006, -3629, -6243, -774, 2051, 2146, 10115, 16133, 10189, 12208, 10994, 15435, 15821, 6509, 5641, 2722, -398, -2427, -415, -3437, -1849, -20, 4104, -2450, -3572, -4581, 527, 5469, 10610, 11190, 9599, 16123, 14656, 13971, 14957, 12864, 5259, 3806, 2573, 6186, 3505, -837, -613, 1621, 7826, 7502, 7117, 716, -1839, -3167, -911, 969, 3803, 9148, 1969, -4078, -4352, -2472, 2170, -3032, 1818, 745, -4805, -7293, -3620, -1521, 9331, 20153, 20813, 11220, -5139, -7474, 5685, -4696, -15679, -12705, -7284, 3748, 11047, 7770, -5097, 276, -1311, 2243, -327, -4576, 1300]
14829A300p02K066R60P543l208k049j0895q177R492O4M267m931L968K627M400
14814F725N281O20n631m831L81n76p915n155p49M471J744m35l36M526J3028N637
14798A6785m80P642l683q772J1291K5143K1633J6182K0543K1077L4060K9749K6618
14785B17788K5391J6530q534j8284k6905j7425n412k285P396J3107K2068J6914
14773B40349R334n332j1365j5086j9586k4202l0943l2216j5964j4177j7245o420
14761E7147q842n706K391L2O05p000O152J450K627r764j0608l47M60J320n700
14746B4217k525k520j3483o617N429k034j667K522J2Q037R320j87K817Q68N383
14731B9572l050l460j481l380m841J533m454l752o511l031Q256o7N352L683l122
$$ y = [1300, 598, 2664, 3624, 11167, 7959, 5910, -4985, -13162, -3670, -3606, 661, -4270, -302, 2325, 6725, 12006, 12626, 6995, 2164, 2545, 1969, -5946, -11101, -11850, -7379, -5635, -6070, -6406, -1880, 11148, 16785, 16305, 23947, 20264, 11492, 22783, 47926, 69559, 85741, 106284, 127361, 161421, 191170, 217788, 243179, 259709, 251175, 232891, 205986, 188561, 183149, 180864, 188260, 201367, 223435, 240349, 249683, 244351, 232986, 217900, 198314, 174112, 143169, 110953, 94989, 80812, 63567, 57147, 48305, 42599, 44990, 45022, 45627, 38627, 44779, 46229, 48856, 39092, 28484, 28137, 28597, 29917, 24217, 21692, 19172, 5689, -928, 4501, 2467, 800, 3322, 3334, 11371, 20691, 20504, 23321, 24189, 29572, 26522, 23062, 21581, 18201, 13360, 14893, 10439, 6687, 176, -2855, 5401, 5334, 10686, 14369, 11247]
14716A1247J692P470M037q223r028l100N939J86p717n354k723K295J7237L629
14702A7587j0591j5365R72N070O575j381k295l369j55O940J079j308k050j417
14688B92J482K820p242M11M596j0145j284R716J0494J375J900K730L640m04n888
14673A4493l351j0481j052J429j262q386l207Q222J1229L40j618o545p217K243
14659e163j479J1037M509L823J1520n402j7153N760J1409J806l201p056J468N031
14645A6909m172p296l891l797m142m870K739P405J0946L875J433K92L91o498k954
14630F370Q768k69k654j1944j905p543j486O785j671J419L104J1250R258J240
14616B0722l879J546J869O21q563k413q739r156Q545O340o229K221O854L851M710
$$ y = [11247, 12939, 20409, 24446, 16223, 7195, 4095, 10034, 10220, 2503, -2851, -5574, -3279, 13958, 17587, 6996, -8369, -7397, -2327, 4248, 2867, 572, -2797, -2952, 3988, 5067, 3759, 1709, 292, 1774, 4594, -2648, -2237, 2359, -7786, -9070, 646, 11140, 12515, 14415, 17145, 20785, 20381, 14493, 11142, 661, -391, 1038, -224, -8610, -11817, -3595, 7634, 7974, 6356, -189, -7406, -5163, -6642, 4395, 8904, 12727, 24247, 18845, 1692, 7452, 18861, 20667, 17466, 10410, 11878, 16909, 12737, 5441, 1550, -2247, -6389, -11259, -8520, -1115, 9831, 13706, 15139, 15431, 15822, 9324, 6370, 15138, 14869, 12215, 271, -1634, -9177, -10663, -3878, -5549, -4130, -1026, 10224, 19482, 20722, 16843, 18389, 20258, 20879, 12316, 9903, 1164, -7992, 553, 6893, 664, 2885, 9739, 13590, 18300]
14601A8300p373o067L100K520o490L06p48J74m224k110R66m39k306L852O705o344
14585a78p46N296j036l809M364J755j526P503J054m777k153N41K27J428n7K255
14569A0141J698k60j0236j316o16N245k807l924R053J3930M456q686L967j1966
14555H679q299J746l243N654k587q250j933j450k281K459M104L114J906M388M046
14540H053j230M63P02J707m871m861j431m04r81R718M310J464l826J237J405k49
14524A1206j5808J83K41J108N402N846J068k902j611k208q616k249o29R898j220
14509b91l878Q794k440r532o990j522L704j007m297L446J0541J0563O467k317
14495A1241j2225j958N610M701k782j058M667M377L884P269q180j1304m783j339
$$ y = [18300, 10927, 4860, 7960, 10480, 3990, 4296, 3548, 3722, -502, -2612, -1646, -2085, -4391, -539, 6166, -178, -924, 4372, 3336, -473, 3891, 5646, 4120, 11623, 12677, 7900, 5747, 6288, 6515, 7943, 7886, 10141, 11839, 11579, 1343, 27, -589, 4656, 1849, -2075, 6978, 20908, 25364, 16678, 20645, 8679, 380, 2126, -1117, 4537, 1950, -6300, -8233, -9683, -11964, -9505, -5401, -2287, -381, 4007, 8053, 6823, 7286, 7988, 9695, 4824, -37, -1468, -1872, -2853, 6865, 11175, 12639, 8813, 10050, 11455, 11206, -4602, -4419, -4178, -3070, 2332, 8178, 9246, 6344, 4733, 2525, -6091, -8340, -8969, 929, -291, -4169, 4625, 2185, -7347, -14337, -15859, -12155, -13162, -17459, -14013, -3472, 7091, 13558, 11241, -984, -2942, 2668, 7369, 4587, 3529, 8196, 12573, 16457, 23726, 15546, 4242, -541, -1880]
14481a880N060j986j470o504j0024N467Q551N593k809j0110M684Q643l294J681
14467A602K754q767q862K722o07L184J198N713L157p79P298n781k340r583J991
14452g100N193O860m37m643O42n44n28o890j744P161q170o090Q108L076l341K634
14436e813J830J2206M355k350j264J481l05j6N576Q59l586k510r771m225j785
14421e318j411N786N018L68k188l861r453k242l64J3040J2659M708R794L44L380
14406C0260o844p569j636r840r491l567P652j07o521N151J307J170m61m840j1095
14391a6431k424J1790j1241o170J0299K2832o90p22n977n267K155N143k131l238
14377b072J295l98k64q433n914K742o616j049J5428N295N980n874k066J653J289
$$ y = [-1880, 3180, 1194, -276, -6780, -16804, -11337, -2786, 2807, -2, -10112, -5428, 3215, -79, 1602, 4356, -4411, -13273, -10551, -11158, -7974, -6776, -1063, 2094, 1315, 8613, 2832, 492, -9091, -7100, -1907, 4953, 4516, -127, 515, -29, -557, -7447, -9191, -2030, -10200, -16290, -8182, -5106, -8447, -5813, -3983, 8223, 12578, 10228, 8964, 10445, 10140, 10124, 15700, 16559, 12973, 10463, 692, -3533, -5318, -6729, -943, 4075, 4443, 2255, -1606, -11059, -13301, -13665, -625, 12034, 16742, 26536, 26880, 30260, 23416, 15847, 14211, 4371, -5120, -8687, -1035, -1142, -7663, -2512, -1205, -35, -496, -5336, -16431, -18855, -7065, -18306, -24476, -14177, 8655, 7965, 7243, 1266, -4001, -1846, 3297, 1166, -2072, -777, -1175, -1439, -9872, -15786, -13044, -19660, -20709, -5281, 14, 5994, 120, -1946, -293, 996]
14362I96j668K271K679Q872J205m041n059m531n303O317n090j708M309l314N720
14347A655k34j1175J709J0569l634k441J223O64R23k457m148Q113N443K34p778
14332a334j811O633L353k150L714k325j3389j1671j974j80L237M601N800k85M974
14317b807q08k451p658l17M161O610J538P81j823J994L150l09o780m558j174J0946
14301D95J5819L863k63o941q239l056l52p851l928j826P736L615r72m263j060
14286g223J4289J2844j175r715M53N253n74o443j2092j2420m479Q035N162j292
14272i377N281O293n579Q09P061N233L479m457l661j893m773l738o389k171N372
14257h510J0290K813j335j781l170o578q857k86J4052J904K043J3328M103q667
$$ y = [996, -672, 1599, 4278, 13150, 14355, 10314, 5255, 724, -4579, 1738, -3352, -5060, -751, -4065, 1655, 1421, -9754, -8045, 2524, -1110, -3551, -2328, -1664, -741, -3198, -7346, 767, 6210, 6444, -1334, -3145, 3488, 6841, 4691, 8405, 6080, -7309, -18980, -20954, -21134, -17897, -13296, -7496, -7781, -2807, -3615, -6066, -13724, -14041, -9880, -3270, -1732, -951, -2774, -780, 2370, 2061, -4719, -9277, -10451, 495, 16314, 20177, 19914, 12973, 4734, 1678, 1326, -6525, -10453, -12279, -4543, -928, -1900, -6163, -7223, 7066, 19910, 18735, 9020, 9473, 14726, 14152, 7709, -4383, -16803, -21282, -13247, -8085, -9377, -4096, 2197, -3382, -2573, 4488, 9721, 13200, 8743, 5082, 3189, -1584, -5322, -11711, -13882, -8510, 1780, 4593, 3258, 1477, -1693, -8271, -17128, -17414, -3362, -1458, 585, 13913, 18016, 9349]
14243I349r295l771J0916N709M175j214r430l786j169j945p3q52N277n620n941
14228g670o993L79n75M291N841N669o335p58q938O322K758L276R594L728M65M827
14212A5881L790m248l808M596M53N533l283r849n305j2797O372J2611o149K273
14198F070Q530p55j0366j177j788q726J55N455n168P225P527R252l031r297Q30
14183D736O133q118m144o80N834P141k266Q13o096p102l572N191M332k125O010
14168F087q508j002O003P5j0309m908n698k24J2482N832K321P786m021o116J157
14153I57L48m103m155J3008R627p865j037J832l642P592M001j608m874j1364r416
14138a0699K808Q8n965J2761M891R645P307k85p83k292p001M735o577L015n878
$$ y = [9349, 54, -3717, 7199, 12908, 17083, 15869, 6439, 2653, 1484, -461, -534, -1386, 3891, -1729, -7670, -14663, -14284, -14859, -10568, -4727, 942, -5393, -6151, -15089, -8767, -6009, -2733, 6861, 10589, 11054, 15881, 19671, 15423, 11615, 16211, 16664, 22197, 18914, 9065, 3760, -9037, -2665, 9946, 3797, 6070, 14600, 13845, 3479, 2302, 514, -8212, -8057, -2602, -7770, -545, 6982, 16234, 13203, 3906, 4736, 10869, 2751, -1393, -2073, 3761, 10902, 8636, 9449, 3353, -3749, -7321, -2130, 2202, 77, 6087, -2421, -3423, 2580, 2655, -7654, -12562, -18260, -18484, -6002, -170, 2151, 9937, 5916, -200, 957, 1305, -2798, -6953, 6055, 15682, 7817, 6780, 8612, 4970, 12562, 16563, 14955, 10081, -1283, -10699, -7891, -7803, -13768, -1007, 3884, 13529, 20836, 20551, 19768, 17476, 10475, 15210, 8633, 11648, 5770]
14123E770o987O282J782q026L006j217O446m559o783k888l522o272k524J4874
14109d618M381J288M853N80Q933N106j2622l795p287q921N527N506N672k835Q70
14094B638J3444J6623K60r398m265j2172m74Q593K074p204j3528j0848K984J483
14080i790N000j497p199l466O151M816N374j690k186o734j2193J572R797J0615
14066a430M952m6Q16m888R9M329K648m323M186l080m94N42k254j024l170M190
14050A053k12O43J664O583n356k674K234m200l987m291m120k293o127n284Q322
14035a8045M656Q4P336K966K145o14k078O884Nn683J580M030l761n766J62k873
14019h972r53L526K36P107m981j5788N920J3206n077j636K388O092j482j2665
$$ y = [5770, -1217, 5065, 6847, -1179, 1827, 610, 7056, 2497, -4286, -7174, -10696, -16968, -19492, -4618, -237, 1051, 5904, 6484, 15417, 20523, 7901, 4106, -3181, -12102, -6575, -1069, 4603, 1768, 2638, 16082, 32705, 32965, 23567, 19302, 7130, 6656, 15249, 17323, 10119, -3409, -14257, -11273, -9790, -4790, -6287, -13486, -16952, -10801, -5985, -611, -2301, -4487, -11221, -23414, -21842, -12045, -1430, 3522, 3476, 4292, -596, -497, 3832, 6480, 2157, 6343, 3263, 2769, 3311, 1057, 33, -3137, 1053, 841, 1484, 3148, 9731, 4375, 1701, 3935, -265, -4252, -8543, -12663, -14956, -21083, -26367, -18045, -13389, -13305, -5969, -3003, -858, -1472, -3550, 3334, 3339, -2344, -764, 3266, -495, -6261, -6099, -8972, -9925, -6399, -6163, 944, -4037, -19825, -13905, -699, -5776, -7412, -5024, 1068, -414, -13079]
14005a3079R49M294L367L396m840j598O128J724N17N084N064k011j4234p914K678
13990a0475N889K460L728N76k662O823L100q51j971q158l806J152O773K401M357
13975I336j0272m382l248R83M161O267P169J785j691j2489l903j1070l392Q22
13961a9924R457J125N506Q167m206o333q323O3M74P981O772J3712r32N847J749
13946B1135m619J879l810l423m840m752L185J0409K339k673p710p455n036K946
13932b425j27Q259O547L110p85o960j0099r06M075q349m205J428L76J459n2O737
13916a917k283o277R448J1074K210j0913K31P398K708p59l947o27N039r478o359
13901d452j796o805P411P574M679L523K77m776q575p470k236P247k043o696J1715
$$ y = [-13079, -12130, -7836, -4469, -1073, -5913, -7511, -1383, 341, 858, 5942, 11006, 8995, -5239, -13153, -10475, -4586, -2126, 1602, 2178, -484, 6339, 9439, 8588, 6617, -1541, -5347, -4195, 2578, 4979, 9336, -936, -5318, -8566, -7583, -3422, 2845, 10014, 11799, 10108, -2381, -6284, -17354, -20746, -19924, -10467, -9342, -3836, 4331, 125, -6208, -14531, -14468, -13994, -6013, 759, 14471, 13539, 19386, 21135, 16516, 18395, 14585, 11162, 6322, 1570, 4755, 15164, 17503, 14830, 7120, -335, -5371, -2425, -2552, 5707, 12254, 15364, 14579, 7619, -2480, -3386, 689, -7660, -11865, -10437, -10061, -8602, -8654, -1917, -4200, -10477, -1029, 10045, 12255, 1342, 1573, 8971, 11679, 10920, 6973, 6346, 11385, 1907, -4452, -6248, -13053, -5642, 1932, 6611, 10134, 10411, 5635, -2940, -10410, -12646, -5399, -7442, -14138, -2423]
13886b423M415j44P329p6J746L437J750J4266p88j2310o678j4176m867O663ll407
13870e266P117O865p36k610O064M524J199l555j7330l123m78M546N601P694m953
13855E559k370n722Q882J9645l180n385j374m440p385n960K466J350M368m914
13841A540k199J042K26j403Q02L986R380K401p86q473L372O579k768k536m651
13826F512Q108n379k949j689O441L434j903K30j2849n630q687l021J2775J5391
13812A0784k619N679K622n787m145j547M391O463L3N732K264j1169j2483o207
13798e989n73q80j863Q060O224p688J063L23n362J855P038Q475l918J219p242
13783G42l413k101l48j681O906Q959N720q817n28r312J45J3093Q358o916J504
$$ y = [-2423, 1992, 1848, 9177, 9101, 10847, 14284, 16034, 30300, 29512, 17202, 10524, -3652, -8519, -1856, -1859, -5266, 1851, 8716, 7980, 5370, 11434, 15958, 17157, 13602, -3728, -6851, -7329, -2783, 2818, 10512, 5559, 3189, -2533, 6349, 25994, 22814, 17429, 16055, 11615, 4230, -1730, 736, 2086, 6454, 1540, -659, 383, 609, -794, 8, 3994, 13374, 15775, 14989, 6516, 9888, 16467, 13699, 11163, 6512, 14620, 9241, 6292, 4603, 11044, 14478, 12575, 12805, -44, -5674, -14361, -17382, -4607, 10784, 8165, 13844, 16466, 10679, 6534, 4987, 9378, 15841, 15874, 21606, 23870, 12701, 218, -5989, -6562, -7442, -9305, -1245, 4979, -2709, -1646, -1323, -6685, -4830, 2208, 10683, 6765, 7984, 742, -2671, -4772, -5120, -6801, 105, 9064, 14784, 5967, 5439, -3873, -3728, 9365, 17723, 10807, 12311]
13768A2311L92O826p6P646m706k58j1418m201O033J786N812M7m615L317j1956
13753F940q114P23J0065j535j0480J1039J7936J1492j0010p243j3045m260r37
13740B571J3468R092l474o429q29L162Q025j0516j5692o869K219j644m082K103
13726h895O746N368J2979K039j215K500j579j0051k117Q097L595K461J1670q564
13712B3034j1069j1159J608Q697J928j1343j2493N490K89O673O798N822k154n363
13698F758J506K980N832m27q035p232k823M778J989J527L068Q470k020l089j2093
13683A189K527L466n9p155q90O664O412J726K1M364n62j6343m852P42O122K41
13667C613m510l62J1515O539r556j179L734M839j153J280M510k91m897Q725J70
$$ y = [12311, 12703, 19529, 19453, 27099, 22393, 22135, 10717, 6516, 12549, 14335, 20147, 20194, 15579, 18896, 6940, -1174, -451, 9614, 8079, -2401, 8638, 26574, 38066, 28056, 20813, 7768, 3508, 2571, 16039, 25131, 21657, 15228, 14399, 17561, 25586, 15070, -622, -7491, -5272, -6916, -10998, -8895, -2149, 3219, 16198, 18237, 17022, 19522, 17943, 7892, 5775, 13872, 17467, 19928, 31598, 23034, 11965, 806, 2414, 11111, 13039, 1696, -10797, -5307, -5018, 1655, 8453, 14275, 12121, 6758, 8264, 11244, 17076, 16649, 8614, 1382, -1441, 3337, 5326, 6853, 9921, 18391, 16371, 13282, 1189, 3716, 7182, 7123, -32, -922, 5742, 12154, 13880, 13901, 18265, 17703, 1360, -3492, -2750, 3372, 3613, -897, -1259, 10256, 16795, 7239, 6060, 9794, 14633, 13480, 14760, 19270, 18979, 14082, 22807, 22977]
13652B2977j433l315l975Q416O606J970m124o466K490K331l9j0836k542p162m665
13637B33O114R507L483p337j469l862L866r09M031p069q482M160N186O79K776
13622A0907K590P223r010J608K818O90r784N85K252L499l927o072n542m05Q79
13607a689R240J3333J0041m783j3924M7K525r697k847N748R038k052O570M304
13593B5854j720p999m09M924L223J1358p627p046L110L95k634j238K426K316K565
13578B7498R63K742J470m958p788m024M255K477j143J082l811k352R99L043K527
13563B2980K578R44n867n451p844l511k674R429R769j3061o609J340P657K252
13549A1932M231K288J030j010q812p684n934J217p65l31O835K778J6011L967R545
$$ y = [22977, 21544, 18229, 14254, 22670, 29276, 31246, 27122, 20656, 23146, 25477, 25438, 14602, 12060, 4898, 233, 6347, 15854, 19337, 12000, 10531, 6669, 10535, 9626, 13657, 6588, -1894, 2266, 7452, 8131, 10907, 13497, 20720, 11710, 13318, 16136, 16826, 7042, 7627, 9879, 13378, 9451, 3379, -2163, -2568, -1689, 7551, 20884, 30925, 26142, 12218, 12265, 14790, 5093, 2246, 7994, 17032, 14980, 21550, 25854, 24134, 16135, 15726, 20650, 23873, 35231, 27604, 20558, 23668, 24063, 21429, 20191, 22617, 24933, 27498, 28461, 31203, 32673, 27715, 19927, 15903, 20158, 22635, 21492, 22574, 18763, 16411, 17410, 20453, 22980, 25558, 26502, 20635, 15184, 7340, 3829, 1155, 10584, 20353, 7292, 683, 2023, 9680, 11932, 16163, 18451, 19481, 18471, 9659, 1975, -3959, -2742, -3507, -3838, 2997, 5775, 21786, 25753, 35298]
13534C5298M856q945l986k998j571N921p529k648M763l401j176m286m193N624
13520A5729p926k802K970o1l82N151j0225J847J2021O92k012m764o419k022N532
13505G329K648m452l436L128j110Q026m553O097k777N465O008k038O446K756J950
13490C1487K591q409J790J015n708j820j018J353k539m765q458L686J627m323
13476F509J200N343J162N212R230L247o938L194j516p241l507K971L774j393n192
13461A6055p363n470O272n367m68L31L151P600P837k403N846R672k398j202j061
13446C1032p207m245M330K749q676r949M071K459M07R2l610L493P860J883J240
13431B5929P754J452O807p388j4931n201O733M568l373M136k259N087K677n890
$$ y = [35298, 40154, 31209, 27223, 24225, 22654, 28575, 21046, 18398, 23161, 19760, 18584, 14298, 10105, 15729, 7803, 5001, 7971, 7910, 7528, 12679, 2454, 4301, 16322, 17014, 15002, 10238, 3819, 1797, 7329, 9977, 5525, 2089, 5217, 4107, 12133, 7580, 13677, 10900, 16365, 22373, 20335, 26781, 29537, 31487, 34078, 25669, 27459, 28474, 22766, 20946, 19928, 21281, 18742, 13977, 5519, 9205, 10832, 6509, 7709, 13052, 14214, 19426, 28656, 31903, 24965, 28159, 26643, 19402, 15895, 18866, 22640, 21247, 16055, 8692, 3222, 9494, 4127, 3659, 3990, 7141, 14741, 22578, 20175, 26021, 35693, 33295, 32093, 31032, 23825, 19580, 23910, 26659, 17983, 8034, 12105, 14564, 14971, 15063, 11453, 14946, 22806, 24689, 25929, 33683, 35135, 41942, 34554, 19623, 14422, 21155, 25723, 22350, 26486, 24227, 29314, 31991, 26101]
13417B6101m613j885P707k962n761n446N155K155L045l050M823k862J304o16K220
13402B5315l004L924n085K966m517n24P040P619q730q137m919L425Q463K294n059
13387B1071l578J0890j534m352L545p600k654M950n849K509M465L91k459O136
13373B5931j40K803k503m069M883k101p808L429R711O850j799r187n041M207n228
13358A9938K426L02N47L057Q175p09j3338k326K838P723N156j548O88J595K900
13343C7424r0M112m9L930N615j621j0045j1015m080J4759K573m237O85M258j2865
13328B9354q644j46j58M154J884r276j864J1383J822J181r429j4290J1823J4804
13314C2598J585R88N25N807R098J044j1458q728m797M27L992Q12r599n225Q807
$$ y = [26101, 21488, 19603, 27310, 24348, 18587, 13141, 18296, 20451, 23496, 20446, 25269, 22407, 23711, 23095, 25315, 22311, 26235, 21150, 24116, 19599, 19075, 26115, 33734, 25004, 16867, 11948, 15373, 23836, 26130, 21071, 17493, 28383, 26849, 22497, 26042, 18442, 15788, 20738, 14889, 17398, 21863, 22254, 19795, 25931, 25791, 28594, 26091, 22022, 26905, 24804, 16996, 20425, 30136, 36986, 35187, 26000, 20959, 25166, 19938, 22364, 22666, 23213, 26270, 34445, 33736, 20398, 18072, 20910, 28633, 33789, 32241, 32929, 34524, 37424, 37334, 41446, 41397, 45327, 50942, 49321, 39276, 28261, 24181, 38940, 41513, 37276, 37961, 42219, 29354, 20710, 20564, 20406, 24560, 26444, 17168, 15304, 26687, 28509, 29690, 20261, 5971, 17794, 32598, 34183, 35171, 35696, 41503, 50601, 51645, 40187, 31459, 26662, 27089, 31081, 31893, 22294, 17069, 25876]
13299B5876m709k627o124M240L251L264Q448k119o02R393Q92n689l853l388k475
13284B3778k576K862K469R451q026j8904J037J0781L77r096J1022L060q319N796
13270B3712J1716K774n349M657L344o081o448J2939O758o65j894j928j0136k137
13256C1262k307r02K98L416P821R397N971M044n970j2317o45l186N33N41o560
13241C1396K984l53k140o45k188O681k519o572P22J3276N570o601j584n6J1174
13226D9145N148L420K2k754n370J82l164l649M260J0835m943n658j486O144j73
13211E1959q202j5076M047O217P941p636n822J3197J2059K833n050L349N691r307
13197E6200l995j02O183K315l731o663l41j14P396N461k456m116N075L012m486
$$ y = [25876, 21167, 18540, 12416, 16656, 19907, 23171, 31619, 29500, 28898, 38291, 39183, 33494, 29641, 26253, 23778, 21202, 24064, 26533, 35984, 27958, 9054, 10091, 20872, 21249, 12153, 23175, 26235, 17916, 23712, 35428, 38202, 32853, 37510, 40854, 34773, 28325, 41264, 48022, 47357, 45463, 43535, 33399, 31262, 28955, 28053, 28351, 31767, 39588, 48985, 54956, 59000, 53030, 40713, 40068, 36882, 37415, 37956, 31396, 34380, 34027, 31887, 31242, 29054, 35735, 33216, 26644, 27366, 40642, 46212, 39611, 38027, 37971, 49145, 54293, 57713, 57735, 54981, 49611, 49793, 46629, 42980, 47240, 58075, 53132, 47474, 45988, 52132, 51959, 43757, 28681, 32728, 38945, 46886, 39250, 33428, 46625, 58684, 61517, 56467, 59816, 65507, 56200, 52205, 52103, 58286, 60601, 56870, 50207, 49866, 49752, 57148, 62609, 60153, 56037, 61112, 64124, 59638]
13182E9638m839L744j905o840j2851M261o329j858J3149R485l351p91m175N18
13168D7856N838M785j345o21j1041q064J008j412o351J309P460L777J536O32L758
13153D9125k073p00R41J1311Q366l144O404N921r069n118l545L392j0144m995
13139D6672N45K493J1090R255M399o116q884n696N363L903q099K655K608n485
13125E4703p874l323L804M803j94M623P355K576n892k782J4307K62l878p57m807
13110F2926m505k106Q33j696k504J0011K482n017P918L958J886k245M148k558
13096G3531m462J544L701q382o632K810K526M001L8j749N01R750Q167n039n236
13081G5069k005N62J102k510k228Q457J3305n99r326J694N722r906m421N347o01
$$ y = [59638, 54799, 58543, 56638, 49798, 36947, 41208, 34879, 33021, 46170, 55655, 52304, 51513, 47338, 47856, 53694, 58479, 57134, 56513, 45472, 37408, 38416, 37004, 30653, 31962, 39422, 43199, 44735, 45367, 49125, 47052, 46352, 47293, 58604, 66970, 63826, 70230, 76151, 67082, 61964, 58419, 61811, 51667, 46672, 47217, 49710, 60800, 70055, 74454, 68338, 59454, 53758, 59121, 63024, 54925, 57580, 60188, 54703, 46829, 43506, 47310, 52113, 51919, 56542, 63897, 66473, 60581, 57799, 72106, 72368, 68490, 67733, 62926, 58421, 56315, 57148, 55452, 52948, 62959, 65441, 60424, 68342, 72300, 74186, 71941, 76089, 73531, 69069, 70613, 74314, 65932, 59300, 62110, 64636, 68637, 68675, 66926, 67427, 77177, 85344, 80305, 75069, 73064, 73626, 74728, 72218, 69990, 78447, 91752, 91153, 81827, 83521, 89243, 79337, 74916, 80263, 79662]
13066G9662L915r884q797k568P406n224J562j574L266P601J0734n31L201N45o007
13051H3307j0420P170L308o35m758r747o56Q488K539j0052j4612O240M72k029
13037E8615j231L546J212M414N352N927N223m896k58L176K924J64J243N164M635
13022I5210p416o186m25O576N123M673N57J0127k816j6170j121P078J0548L915
13008A09673q024l871k906J50J217K437k121n158N352R998n184o043Q200l136
12994A00584j996M271k755r263L204J1565l654N306m785p857J35J102O032N296
12980A07185m409j413K642m138j597N131Q388k681o299j894O445J634J155J992
12966A12141k537n222m911M977O258L266j0262n05L569q926q207o492Q590N688
$$ y = [79662, 83577, 73693, 64896, 62328, 69734, 64510, 66072, 64498, 67764, 75365, 86099, 85568, 88769, 89314, 83307, 72887, 80057, 83365, 82730, 77972, 68225, 67569, 76057, 78596, 68544, 53932, 60172, 60644, 58615, 57384, 60930, 62142, 66556, 71908, 77835, 83058, 78162, 77904, 81080, 84004, 84168, 85411, 90575, 95210, 87794, 81608, 81183, 87759, 92882, 97555, 98112, 108239, 105423, 89253, 88132, 95210, 105758, 109673, 101649, 97778, 94872, 95022, 96239, 98676, 96555, 91397, 96749, 106747, 101563, 95520, 103720, 100584, 98588, 102859, 100104, 90841, 94045, 105610, 101956, 107262, 102477, 94620, 94755, 95857, 101889, 107185, 102776, 101363, 104005, 99867, 98270, 103401, 111789, 109108, 102809, 100915, 107360, 108994, 110149, 112141, 109604, 104382, 99471, 104448, 110706, 113972, 103710, 103205, 106774, 97848, 89641, 83149, 91739, 97427]
12952I7427L527L505j069m323O6n037p92O051O408O462m411m7k652p4n514P600
12936A07127P871r565L111j632R48JO746O520l082p144p15J0564J553O167l119
12921A25351M92M331Q423M428O845J2535K921o958k84r276j3948m852L7q885k552
12906A18608M452O571J1588K521j4789J75L37j596p366M720J5185P003n34r845
12892A37030N313m987j475J2019P020m84l023j3393o311k424K906J118N29J57
12878A33995N580M993Q216R693P618N615P339k458m461p8k646j3206n766M864
12864A59298J6911M843o909o825m074R257K430k333J0325m263j3531N312P529
12851A77970p711l554L743j573N76l675p667m445Q606J8567J0798Q333O525M261
$$ y = [97427, 100954, 104459, 103390, 99067, 99133, 94096, 93304, 99355, 105763, 112225, 107814, 107767, 105115, 105041, 99527, 107127, 114998, 105433, 108544, 106912, 107860, 107861, 114607, 121127, 118045, 110901, 110186, 120750, 122303, 128470, 125351, 125843, 130174, 138597, 143025, 149870, 162405, 165326, 158368, 158084, 148808, 134860, 130008, 130045, 121160, 118608, 123060, 129631, 141219, 143740, 128951, 129126, 129463, 127867, 120501, 125221, 140406, 147409, 146875, 137030, 142343, 137356, 135881, 147900, 154920, 154436, 151413, 138020, 131709, 129285, 132191, 133309, 133838, 133995, 139575, 144568, 152784, 162477, 170095, 175710, 183049, 180591, 176130, 176052, 173406, 160200, 154434, 159298, 176209, 181052, 174143, 167318, 163244, 172501, 174931, 172598, 182923, 178660, 165129, 170441, 177970, 170259, 166705, 170448, 168875, 169451, 165776, 158109, 153664, 162270, 180837, 191635, 199968, 206493, 210754]
12837B10754M391P759L158L732J3669Q381L59R738J5578K1122M2007P1154J07313
12824E19115J63988K33474K43639J88107J60361J67468J43657J9254k63453l85724
12814A189886k86649j77714j09947p4777n8419m6989l0349j1243k2441l0158r563
12803C31637N903m743j8038j7900o707o295L868L594J822m029k252L242P11n666
12789B85147o246k529J798L769l200j0816j3078j125K105o861k469j2592J011
12776B34914P493K306l562K201N676M369P649o14J17r53J824K203j0509m836j825
12761B46453k295L174M438N996o56l83q359O852j535J940M342L331J364l716j771
12746B59175n340M449P979P044O294o239r513j4844J622J1275M135K168N640p690
$$ y = [210754, 215145, 222904, 226062, 229794, 243463, 251844, 252203, 261941, 277519, 298641, 340648, 411802, 519115, 683103, 916577, 1160216, 1348323, 1508684, 1676152, 1819809, 1839063, 1575610, 1189886, 903237, 725523, 615576, 540799, 482380, 435391, 405042, 393799, 371358, 341200, 331637, 337540, 332797, 314759, 296859, 290152, 283857, 287725, 291319, 293141, 289112, 286860, 290102, 290813, 285147, 278901, 276372, 278170, 281939, 278739, 267923, 254845, 253720, 255825, 248964, 246495, 233903, 234914, 242407, 244713, 241151, 243352, 249028, 253397, 261046, 260432, 260549, 259596, 261420, 263623, 253114, 248278, 246453, 244158, 247332, 251770, 257766, 257110, 256727, 248368, 255220, 253685, 255625, 259967, 263298, 264662, 260946, 259175, 253835, 258284, 266263, 273307, 279601, 273362, 263849, 249005, 250627, 261902, 266037, 268205, 273845, 266155]
12732B66155J949M435N630j675r674p143J671M12L462K365K881q795L902N689
12718B71264K952m688N302J5732P866J716m798j3599j921p02K898O086k000q681
12704B77427M66Q60k271q739m924N013P214J47n977M390M186J0139K945J285M837
12689B96998n669N939N376k40l410j343m316p981o912J2981J2062N806R486M676
12675C23453l470J766m33n24n547q70N768N172k878M066N230J4317N843P8K29
12660C52200q37K86r74j0568j948J5102J5990K934M856J0224N794L756J0228K425
12646D09468M540J2614K6242L489r039j5418j5594K5930O1580O5741M0788O229
12634F16570l9715l6133j5876j0346p101j5972j1982j3719J753L477N859o197
$$ y = [266155, 268104, 272539, 278169, 276494, 266820, 259677, 261348, 261760, 265222, 267587, 270468, 261673, 265575, 271264, 274216, 269528, 274830, 290562, 298428, 300144, 295346, 281747, 279826, 279124, 282022, 288108, 286108, 277427, 277893, 278753, 276482, 267743, 262819, 267832, 275046, 275193, 269216, 273606, 277792, 287931, 290876, 292161, 296998, 291329, 297268, 302644, 302404, 298994, 297651, 293335, 285354, 278442, 291423, 303485, 309291, 318777, 323453, 319983, 321749, 321316, 320792, 315245, 314375, 320143, 325315, 322437, 326503, 331733, 346050, 351893, 351971, 352200, 351363, 351649, 350675, 340107, 338159, 353261, 369251, 372185, 377041, 387265, 393059, 396815, 407043, 409468, 414008, 426622, 452864, 456353, 447314, 431896, 416302, 442232, 503812, 569553, 610341, 616570, 576855, 540722, 524846, 514500, 507399, 491427, 479445, 465726, 467479, 470956, 476815, 470618]
12622D70618j7670p673K815J0528l438J283M789k328n507J106J312L324J4678
12609D73837J0944J2436k842J642R703R997R010j2851j5240k349l7L104K884O938
12595E07176m110q696P83K110k525m833J47N177l992N453J359R107N693R636L587
12580E26072m261O767R041M929j457k0876k3084j8343j0898q759q785r271Q508
12567D49583L0189L9053L6247L7374K8578J5084j958M230n22L633R193J1103J2451
12554F74238K278k335L453M462n913R199M643N645j1448n146J016N95L255R518
12540F93460J1525R545o53N264N727J1230J0867J4466K045J810J0962L837J1273
12527G91358K4123K3034J7484J5914J0056o98L906J2350J9815K3392K4072L0003
$$ y = [470618, 452948, 445275, 448090, 458618, 455180, 456463, 461252, 458924, 453417, 454523, 455835, 459159, 473837, 484781, 497217, 494375, 496017, 505720, 515717, 524727, 511876, 496636, 494287, 494250, 497354, 500238, 507176, 503066, 494370, 495153, 497263, 494738, 489905, 490052, 495229, 491237, 496690, 498049, 507156, 512849, 522485, 526072, 521811, 528578, 537619, 542548, 541091, 520215, 497131, 478788, 467890, 459131, 450346, 441075, 449583, 479772, 518825, 555072, 592446, 621024, 636108, 634150, 638380, 637858, 641491, 650684, 661787, 674238, 676516, 674181, 677634, 682096, 676183, 685382, 690025, 695670, 684222, 679076, 680092, 680687, 683942, 693460, 704985, 714530, 713877, 719141, 724868, 736098, 746965, 761431, 763476, 765286, 776248, 780085, 791358, 815481, 838515, 855999, 871913, 881969, 881271, 885177, 897527, 917342, 940734, 964806, 994809]
12515I94809K1647Q422O2145J02663R3372P6926P9106P2367j304p3512q2515q0331
12503A273795m5707m3447k5085l0316j2430N982j479L643J0974Q136J0493M2147
12491A196706M6673L9452K2541K2180M1101M8294L3425K2798L3350K8524J6817
12480A551861K1981J5176k556j5072k0118j8025k6401k4593Q9M15P792N446J9905
12467A515900L3307K0759j877j864O505P375K325j020P461K1347J4716J4727M814
12454A644475K4731L4462K2439J0948J2130O258K769Q990K3585J6504P029P701
12442A822021N929J6437L1746L6200K3507R607R635J2090K2728L3277M2456M2058
12430B107691M3356N1346O1627P0348P3310N9764N8611N8402P8931P9900O6315
$$ y = [994809, 1016456, 1024878, 1087023, 1189686, 1283058, 1359984, 1439090, 1511457, 1510153, 1436641, 1354126, 1273795, 1228088, 1184641, 1159556, 1129240, 1116810, 1122792, 1121313, 1124956, 1135930, 1144066, 1154559, 1196706, 1243379, 1282831, 1305372, 1327552, 1368653, 1416947, 1450372, 1473170, 1506520, 1535044, 1551861, 1573842, 1589018, 1586462, 1571390, 1551272, 1533247, 1506846, 1482253, 1482342, 1482757, 1490549, 1495995, 1515900, 1549207, 1569966, 1568089, 1566225, 1572730, 1580105, 1582430, 1581410, 1588871, 1610218, 1624934, 1639661, 1644475, 1669206, 1703668, 1726107, 1737055, 1749185, 1755443, 1758212, 1767202, 1790787, 1807291, 1814320, 1822021, 1827950, 1844387, 1876133, 1912333, 1935840, 1945447, 1955082, 1967172, 1989900, 2023177, 2065633, 2107691, 2151047, 2202393, 2264020, 2334368, 2407678, 2467442, 2526053, 2584455, 2663386, 2743286, 2809601]
12419B809601N1355M3987N4152O4827R7318J33001J57130J73689K07809K54150
12409D047019K92461L03470L11966L51398M05397M38503M50446M64681N18196
12400G583537O05146P38046Q73589J060216J354412J750856K310150L146940M244296
12391B3667188N816636Q505622J3360691K1925239L4566017M5173557M3098424
12384A96113374L1469454K6621630K8204548K3172979o672205n6320194o9237929
12377A73351657m8291086k9144396j8072181j2026851q911940p204599n851583
12370D3849021m594727l606310k872060k297560j869098j592428j443187j374622
12362B4199029j322725j201796r98750q16643o96168n84254n17093m90246n07063
$$ y = [2809601, 2860956, 2904943, 2959095, 3023922, 3121240, 3254241, 3411371, 3585060, 3792869, 4047019, 4339480, 4642950, 4954916, 5306314, 5711711, 6150214, 6600660, 7065341, 7583537, 8188683, 8926729, 9800318, 10860534, 12214946, 13965802, 16275952, 19422892, 23667188, 29483824, 37989446, 51350137, 73275376, 107841393, 153014950, 196113374, 227582828, 254204458, 282409006, 305581985, 298909780, 242589586, 173351657, 125060571, 95916175, 77843994, 65817143, 56905203, 49700604, 43849021, 39254294, 35647984, 32775924, 30478364, 28609266, 27016838, 25573651, 24199029, 22876304, 21674508, 20675758, 19859115, 19162947, 18578693, 18061600, 17571354, 17064291]
12353A7064291m98086m67105l97643l72444l53440l39048l33063k96643k69605
12344A3737214k78486k97641l00348k89911k68332k32608k16087k03441k09258
12335A1441102j92742j60242j34974j25227j28869j37754j41007j36133j20414
12326A0163740r2638q8883r4465q3123o1926n8603o0171o5435o0565n9809n9769
12315I378353m1254k6164j5911k2094l5286m3532m0410j9818l816j585M72J0222
12303I139177J6256J7964J6331J7911J7481J1993K5537L3087L3124M2038M9347
12292I420246N1860P0737P5733O8571N3296M9448N6828P1856P4852P2140P2503
12281A0138070O6363P6058Q8000Q5395R2446J03542J06449R9119Q3274P2061O9698
$$ y = [17064291, 16566205, 16099100, 15701457, 15329013, 14975573, 14636525, 14303462, 14006819, 13737214, 13458728, 13161087, 12860739, 12570828, 12302496, 12069888, 11853801, 11650360, 11441102, 11248360, 11088118, 10953144, 10827917, 10699048, 10561294, 10420287, 10284154, 10163740, 10071102, 9982219, 9887754, 9804631, 9742705, 9684102, 9623931, 9558496, 9497931, 9438122, 9378353, 9337099, 9310935, 9295024, 9272930, 9237644, 9194112, 9153702, 9133884, 9130068, 9128483, 9128955, 9139177, 9155433, 9173397, 9189728, 9207639, 9225120, 9237113, 9262650, 9295737, 9328861, 9370899, 9420246, 9472106, 9542843, 9618576, 9687147, 9740443, 9789891, 9846719, 9918575, 9993427, 10065567, 10138070, 10204433, 10280491, 10368491, 10453886, 10546332, 10649874, 10756323, 10855442, 10938716, 11010777, 11080475]
12270A1080475N7819N5253L5850L7076M9271N5462N8519N5785M8330M8696M6013
12259A1628549L3674M6190M6550M4247M3862M1098K5211K134K092L6414P3022
12248A2023043P3727N6772K7644K2489J7908R078M142N059J3395J1777K1872K2021
12236A2308927J2338m679l96L176p561j4167k0485k4432l3263l9028l9926l2670
12224A2107834k4332l6614m7883o9105n8959o0464p1192p1399p2469p9178q0692
12213A1435547q0513p4129r0640q6199q6496r3282r6640q8464q7733q8640q1933
12202A0480878r2892r4807q6578r2999q3411p4213o9798o3130o4550r2233j13002
12191I553265j34032j37693j26826j20146j12842j10723j04127r7037r5518j00464
$$ y = [11080475, 11138294, 11193547, 11229397, 11266473, 11315744, 11371206, 11429725, 11485510, 11533840, 11582536, 11628549, 11662223, 11708413, 11754963, 11799210, 11843072, 11884170, 11909381, 11911515, 11913607, 11950021, 12023043, 12096770, 12153542, 12181186, 12203675, 12221583, 12230661, 12234803, 12239862, 12253257, 12265034, 12286906, 12308927, 12321265, 12316586, 12316190, 12319366, 12311805, 12297638, 12277153, 12252721, 12219458, 12180430, 12140504, 12107834, 12083502, 12046888, 11999005, 11929900, 11870941, 11810477, 11739285, 11667886, 11595417, 11516239, 11435547, 11355034, 11280905, 11190265, 11104066, 11017570, 10924288, 10827648, 10739184, 10651451, 10562811, 10480878, 10387986, 10293179, 10206601, 10113602, 10030191, 9955978, 9886180, 9823050, 9758500, 9666267, 9553265, 9419233, 9281540, 9154714, 9034568, 8921726, 8811003, 8706876, 8609839, 8514321, 8413857]
12181H413857j05137r4099r4313q8982r8775r6147q5314q3543r3378r8504j02329
12170G373336r1563q6496r3433r8741j03829r2058q3044r3277r0907q0554q9790
12159F369644p7852o4375o6029p0238p9032p1206n6800n9318p1315q2355p0909
12148E600215o9648p3993o1655o6902p6802p7191o4952p1762o0469n8103n9314
12137D859424n9360n4343n9471n6688n3584m5023m6075o1568o2587n6214o7480
12126D237031m8426l6717n2271n7501o0646n8952n0125n7579m4876m6844m8777
12115C674317n4141n2746m9835l7669l7817k9423m2610m1263m4015l9111m4083
12104C201604m0608l0123l6327k7558k4205l6511m1986l9491l9976m0064l4924
$$ y = [8413857, 8308720, 8214621, 8120308, 8031326, 7932551, 7836404, 7751090, 7667547, 7574169, 7475665, 7373336, 7281773, 7195277, 7101844, 7003103, 6899274, 6807216, 6724172, 6630895, 6539988, 6459434, 6369644, 6291792, 6227417, 6161388, 6091150, 6012118, 5940912, 5884112, 5824794, 5753479, 5671124, 5600215, 5530567, 5456574, 5394919, 5328017, 5251215, 5174024, 5109072, 5037310, 4976841, 4918738, 4859424, 4800064, 4745721, 4686250, 4629562, 4575978, 4530955, 4484880, 4423312, 4360725, 4304511, 4237031, 4188605, 4151888, 4099617, 4042116, 3981470, 3922518, 3872393, 3814814, 3769938, 3723094, 3674317, 3620176, 3567430, 3517595, 3479926, 3442109, 3412686, 3370076, 3328813, 3284798, 3245687, 3201604, 3160996, 3130873, 3094546, 3066988, 3042783, 3006272, 2964286, 2924795, 2884819, 2844755, 2809831]
12093B809831k4537j8608j9066l2907m0974l4340k9336j6405j7256l1428l2571
12082B512403l1783k5838j3566j4093l5580l5288k9633k9742k0129k6353k2450
12071B227948j0116k4321l2517l4062j9934o225j8682p675j9911m2216k8913k7062
12059A956314k0516j7685j5323j4037j5484j3173j0821j9071k3909k5386k0966
12048A759943j8664j0424j482k371j7302k3849j9171j8051j6585j9827j9468j2551
12036A580198q889j5706k4317k0608j3933o544j5459n341j265j0629j7367o432
12024A433708j5228k5918j3397q561j5054p805j0584j0623k912j0663k0971m324
12012A287668j582j1288r922j1827m985p930o914j264Q076J2226J5847J7713K6886
$$ y = [2809831, 2785294, 2766686, 2747620, 2714713, 2673739, 2639399, 2610063, 2593658, 2576402, 2544974, 2512403, 2480620, 2454782, 2441216, 2427123, 2391543, 2356255, 2326622, 2296880, 2276751, 2250398, 2227948, 2217832, 2193511, 2160994, 2126932, 2106998, 2100773, 2082091, 2074416, 2054505, 2012289, 1983376, 1956314, 1935798, 1918113, 1902790, 1888753, 1873269, 1860096, 1849275, 1830204, 1806295, 1780909, 1759943, 1741279, 1730855, 1729373, 1727002, 1709700, 1685851, 1666680, 1648629, 1632044, 1612217, 1592749, 1580198, 1571309, 1555603, 1531286, 1510678, 1496745, 1490201, 1474742, 1469401, 1468136, 1457507, 1440140, 1433708, 1418480, 1392562, 1379165, 1370604, 1355550, 1347745, 1337161, 1326538, 1323626, 1312963, 1291992, 1287668, 1286086, 1274798, 1264876, 1253049, 1248064, 1240134, 1233220, 1231956, 1240032, 1252258, 1268105, 1285818, 1312704]
11999A312704J9888J5794K0824J5410J46j5467l2424l6275l4692m2264l8343l1159
11987A154142k9457j7946j8322k4683j5816o974p583j9303k3956O15j1089j3320
11975I66308j1943j6147m634j0171n823J848N340j2453j9026K955L576o001p167
11962H86662r07P206k236l751q664j034l948j1320o511K572Q164J1067L002N682
11948H85984P366L1729M8126Q2103J40602K14356K54068K15377J47901J36595
11938B164207J46930P4258j59400l82240l44355k23473j30901p9431o7086n2261
11928I46248m7095l9597k2700k1773j2156J503j0719o782k127k0621k0442j7432
11916G26307r011o418o536j6285r341q887j6026j1705k107p99k103K736o24m536
$$ y = [1312704, 1332592, 1348386, 1369210, 1384620, 1384766, 1369299, 1336875, 1300600, 1265908, 1223644, 1185301, 1154142, 1124685, 1106739, 1088417, 1063734, 1047918, 1040944, 1033361, 1014058, 990102, 990717, 979628, 966308, 954365, 938218, 933584, 923413, 917590, 919438, 924778, 912325, 893299, 896254, 899830, 893829, 886662, 885755, 892961, 890725, 886974, 878310, 877276, 873328, 862008, 855497, 858069, 866233, 877300, 880302, 885984, 893350, 925079, 973205, 1055308, 1195910, 1410266, 1664334, 1879711, 2027612, 2164207, 2311137, 2385395, 2225995, 1843755, 1499400, 1275927, 1145026, 1065595, 998509, 946248, 899153, 859556, 836856, 815083, 802927, 804430, 793711, 786929, 784802, 764181, 743739, 726307, 717296, 710878, 704342, 688057, 678716, 669829, 653803, 642098, 639991, 639192, 637089, 639825, 639201, 634665]
11902F34665r975J21n187p761N449q071m870r39n850j0903k940j6107j0027M519
11888E62124L403n326n481p221o422q12L153J814r658r819r032l860o815p441
11874D98607N029n08l785r940l374l530n683m016p748j837m416n912J519k472
11860D51934K799N169j635J39j638j838k0676j6106j29N120l295M446O235k217
11846D28308m829m618J425K493n381k610K145L85l182n238L486p969j8893r628
11832C75894m545R08p020M026J1455l20j182q355l809O934m731j8932L396J691
11818C55410r09M730L793m202p258j5193P240L080N721j267j1241p242J208k275
11804C31595m650j200J972N376r310j0475p313j976k195J285p91j821L861J3420
$$ y = [634665, 624690, 624811, 619624, 611863, 617312, 609241, 604371, 603432, 597582, 586679, 583739, 567632, 557605, 562124, 565527, 560201, 554720, 547499, 541077, 540265, 543418, 545232, 535574, 525755, 516723, 512863, 506048, 498607, 503636, 503128, 499343, 489403, 486029, 482499, 476816, 472800, 465052, 463215, 458799, 452887, 454406, 451934, 454733, 459902, 458267, 458406, 456768, 454930, 434254, 418148, 418019, 423139, 419844, 424290, 430525, 428308, 423479, 418861, 420286, 422779, 417398, 414788, 416933, 417318, 414136, 408898, 412384, 404415, 385522, 375894, 371349, 372257, 365237, 369263, 380718, 380398, 379216, 370861, 367052, 373986, 369255, 350323, 353719, 355410, 354501, 359231, 363024, 358822, 351564, 336371, 343611, 346691, 352412, 351145, 339904, 332662, 333870, 331595, 326945, 325745, 327717, 333093, 323783, 313308, 305995, 304019, 301824, 303109, 302318, 300497, 304358, 317778]
11790C17778N896O07l735j977O054j2452o931j111l565l56Q54j0889K684L691
11776B96548q888r237j240j57L750j576q193l969O60r069j957O950n801J088l844
11761B55065J864n375j121k353k168Q893O677n639l622j1695l668l63J141K683
11747B40319j703r020k569N231o312P768J8801J791l618k633j0836p536P20o55
11733B29748q190L995J5751L053n040m244l969R63L50J905m174m25J720m893P088
11718B33638P330j1871n645q20j166l893j587O0m164n402l239m013K350Q735l867
11703B06446J02K226P134n04j2054l296O316r11q78l346n88L89J565m096J032
11688A99537O885o791q574k218q414m914m814N967J3393l458N412K610m736r44
$$ y = [317778, 323674, 324281, 320546, 318569, 324623, 312171, 305240, 304129, 300564, 300208, 301062, 290173, 292857, 296548, 287660, 278423, 277183, 277026, 280776, 279200, 271007, 267038, 267698, 258629, 256672, 263622, 257821, 258909, 255065, 256929, 251554, 250433, 248080, 245912, 254805, 261482, 255843, 252221, 240526, 236858, 236495, 237636, 240319, 238616, 229596, 227027, 232258, 225946, 233714, 252515, 254306, 250688, 248055, 237219, 229683, 230403, 229748, 221558, 225553, 241304, 244357, 239317, 235073, 231104, 232067, 232417, 234322, 230148, 229723, 231443, 226550, 233638, 240968, 229097, 223452, 222632, 221466, 217573, 215986, 216046, 211882, 206480, 203241, 199228, 201578, 210313, 206446, 206548, 208774, 215908, 215404, 203350, 200054, 206370, 205459, 204581, 201235, 200647, 201036, 202601, 198505, 199537, 206422, 199631, 191057, 188839, 180425, 175511, 170697, 176664, 190057, 186599, 192011, 194621, 189885, 188941]
11674A88941N81k481N69J0137P96n03M070O709k642j8423j6262K657N592J460
11660A81201J308k177O22M38n589o904K823p44p608l240J0023j87N534j562j5257
11645A58681p924J759N268M206R51Q64n332K269j231j638J817m711N73r204n908
11630A40440N750J224L414J231p42M635k209j1602j221R944O523l159l53N692
11616A59567l852o154n525K294n711o877R473J641M648L292o438l864o264M188
11602A40418O0K360O411R76l210j2372m678L035J850Q28o180o428M858J28n269
11587A22787K275P325p236O69K415J898N343K304l741j709N028q923j0377J882
11573A19940j847n017O104o869L202R629K849Q47m642p005J252n416j302l638
$$ y = [188941, 189522, 187041, 187610, 197747, 198543, 198040, 202110, 208819, 206177, 187754, 171492, 174149, 179741, 181201, 182509, 180332, 180954, 181392, 175803, 168899, 171722, 170978, 163370, 160130, 170153, 169966, 175500, 173938, 158681, 150757, 152516, 157784, 161990, 162941, 163805, 158473, 160742, 159511, 157873, 159690, 154979, 155552, 146348, 140440, 146190, 147414, 150828, 152059, 151317, 155952, 153743, 142141, 140920, 150864, 157387, 154228, 153875, 159567, 155715, 149561, 144036, 146330, 140619, 133742, 143215, 144856, 149504, 152796, 146358, 142494, 136230, 140418, 140478, 142838, 149249, 150225, 147015, 134643, 129965, 133000, 134850, 135678, 129498, 123070, 127928, 128056, 122787, 125062, 132387, 125151, 125820, 128235, 130133, 135476, 137780, 134039, 132330, 137358, 128435, 118058, 119940, 118093, 113076, 119180, 112311, 115513, 125142, 127991, 128838, 124196, 117191, 118443, 113027, 111725, 108087]
11559A08087M689K17J1117k004j803L537n595l13o189j674Q142K679q92M494P533
11544A32025k580p088q671o371M118l151l773K592J31j219O866j0741j4852l118
11530H4168R37l237O299J0069J1247O257O63M479j729j1151l38J0362l611j1379
11516A03036M560P826n554m810p287n883k899m580K5J0380r98q347J942J0339
11502I7750K339Q94m755Q459O651k494j0758l156N283O439j404r994N34P703q807
11487I4684j3591N946J3757l391r815O482N396k873K674m787l836L357m291J013
11473I0725q252l151J1658l039j176K244J790Q025k927q631K69m670j6708j784
11459F4373P706N453Q605j193P245L282j3350j1510j590j760J195R982K791m315
$$ y = [108087, 112776, 112993, 124110, 122106, 120303, 123840, 118245, 117932, 111743, 110069, 118211, 120890, 119998, 124492, 132025, 129445, 122357, 113686, 107315, 111433, 108282, 104509, 107101, 107232, 106013, 112879, 102138, 87286, 84168, 85105, 81868, 88167, 98236, 109483, 115740, 116403, 120882, 119153, 108002, 107664, 118026, 114415, 103036, 107596, 115422, 109868, 105058, 97771, 91888, 88989, 84409, 84434, 94814, 93816, 85469, 87411, 97750, 100089, 100983, 96228, 104687, 111338, 108844, 98086, 94930, 100213, 106652, 105248, 95254, 95788, 103491, 94684, 81093, 87039, 100796, 97405, 87590, 94072, 99468, 96595, 99269, 94482, 90646, 94003, 89712, 90725, 82473, 79322, 90980, 87941, 86765, 89009, 90799, 98824, 95897, 87266, 87535, 82865, 66157, 64373, 72079, 77532, 86137, 84944, 92189, 95471, 82121, 70611, 69021, 67261, 68456, 78438, 81229, 76914]
11445G6914j833O187q179p900J2001p99O307P026j4411l603n495K671k395L716
11431G0207P051q48o048m714J049J2064j332n405J195L700m322o160M974J3516
11417H4927p310j612N512m409j160o828n129J995J382k570j97J936o04N148q495
11402F2586n62K86M674l28M487k48n186k257j002L822O001r843j2162m619l981
11387D1668K189Q348L945K594l810K010M379l073K740O198P686K19q42n955n543
11372F2753M439Q287j258N676K668o298j1786n631n624l7m409N447M823l413l335
11357E2302N721M984l766n407J3211L874m417M263q043l167K579J80q832J734
11343E5216J2216k946l841J955q711j6198K571J0027l35L523L269l988O42q85
$$ y = [76914, 75081, 81268, 73089, 65189, 77190, 76391, 82698, 89724, 75313, 71710, 66215, 68886, 66491, 70207, 77258, 76410, 70362, 65648, 66697, 78761, 77429, 72024, 73219, 76919, 72597, 66437, 71411, 84927, 77617, 76005, 81517, 77108, 75948, 69120, 63991, 65986, 67368, 64798, 64601, 66537, 65933, 71081, 62586, 62024, 62310, 66984, 66656, 71143, 70895, 65709, 63452, 62450, 66272, 72273, 62430, 50268, 45649, 41668, 43857, 52205, 56150, 58744, 54934, 56944, 61323, 58250, 60990, 67188, 74874, 75093, 74251, 68296, 62753, 67192, 75479, 74221, 79897, 82565, 76267, 64481, 58850, 53226, 53189, 48780, 54227, 59050, 55637, 52302, 58023, 63007, 59241, 53834, 67045, 70919, 66502, 70765, 62722, 59555, 62134, 62314, 53482, 55216, 67432, 64486, 60645, 62600, 53889, 37691, 40262, 50289, 49954, 53477, 56746, 52758, 53400, 52515]
11329E2515J095n689p89J817j259o787M559o118j992J536q38K696Q28Q461J0404
11314F0439k687L266r60L70N259l860j3078K970J1247J320J841k341o340j010
11300E6436o756k371J345m087p66o326J90M380M746P916j501j0461n343J293J1232
11285D9927M214L57l187p179m510L72L865n310k426N690J3544k068r834K57M791
11270D8503K970p363J5315l59l749p639n477M052l197Q755l700o446o515n926
11256B9224l548K587N019L82L29O326M099j079K172O87J827L625O44L917j924
11241E4287p156k212L817R75k484l350m832O66M590O447p673L885K817j3170j675
11226C4932J2405O390m225n295l92L201J861k144l95O302P234q241j649L354l659
$$ y = [52515, 53610, 47921, 47132, 48949, 47690, 40903, 45462, 39344, 37352, 38888, 38050, 40746, 41574, 50035, 60439, 57752, 61018, 60058, 60428, 65687, 61827, 48749, 51719, 62966, 64286, 66127, 63786, 57446, 56436, 49680, 47309, 48654, 44567, 43801, 37475, 37665, 42045, 46791, 54707, 53206, 42745, 37402, 38695, 49927, 54141, 54498, 51311, 44132, 39622, 39994, 43859, 38549, 36123, 41813, 55357, 53289, 43455, 43712, 48503, 51473, 44110, 59425, 59066, 55317, 47678, 42201, 46253, 43056, 51811, 48111, 41665, 35150, 29224, 25676, 28263, 33282, 33664, 33993, 40319, 44418, 43339, 45511, 46198, 48025, 51650, 52294, 56211, 54287, 47131, 44919, 48736, 49711, 47227, 43877, 39045, 39711, 44301, 50748, 43075, 46960, 49777, 36607, 34932, 47337, 53727, 49502, 44207, 43815, 47016, 48877, 46733, 46338, 52640, 59874, 51633, 49984, 53338, 49679]
11211D9679j728j780L756j1313j2688P179K720J586m883K828O660j337J339M306
11197D6324O601p323j0785m475N158n722l098J1334Q930M887m650o232J683q788
11183C3844K380N264n62j140p483L54Q902l18j1040q56J201o169r526j325J2742
11168B6268M949L604Q119M570l474K466j0610j1060o048n01J1034J1729j107p629
11154C2310j174p8K990m119m538J427L240L573k173l145j890L560P938K230n453
11139C4698r71J186M333k726q611j929k149J8889M996j1210q135k280J74l735
11125B2530J834P784n994L057N366n29n755j591o139J62l681n571j445M891J4302
11110B9221O448q818o109m476M218m429L085Q451O136j124l51J378K682r4k299
$$ y = [49679, 47951, 46171, 49927, 38614, 25926, 33105, 35825, 37411, 32528, 35356, 42016, 40679, 42018, 46324, 52925, 45602, 34817, 30342, 35500, 29778, 26680, 38014, 46944, 51831, 47181, 40949, 42632, 33844, 36224, 41488, 40926, 39786, 32303, 32657, 41559, 41241, 30201, 29345, 30546, 24377, 14851, 13526, 26268, 31217, 34821, 42940, 47510, 44036, 46502, 35892, 24832, 18784, 18283, 29317, 41046, 39939, 32310, 31136, 31058, 34048, 29929, 25391, 26818, 30058, 33631, 31458, 28313, 26423, 29983, 37921, 40151, 34698, 33727, 34913, 39246, 36520, 27909, 25980, 23831, 42720, 47716, 36506, 28371, 26091, 26265, 22530, 24364, 32148, 26154, 29211, 34577, 34048, 28293, 26702, 20563, 20725, 17044, 11473, 10028, 14919, 29221, 35669, 26851, 20742, 16266, 20484, 16055, 19140, 27591, 33727, 32603, 32252, 33630, 36312, 36218, 33919]
11095C3919p02N226K747p184P12r239m98L595L046o179o426P22M775n65l166o98
11079B0085Q348K501p816p791J586L016P625M718l243m948m42O793j085q180q525
11064A2642N823P173K0N932L233j1216m247J880r12N876M965N51k77R790L594
11049D4827k677l365j2160q14M371n460o57R37j357L89p93j1487p400M755K0846
11034B9955L090l351j0416q156P854k15m257K333O178L65l335J455M92o85k89
11019B1018J2266O326j24j4333q903j069k378R92J076M4P041n982l132L693L166
11004A9701K226r738R577K868k221n691m817L210J0018N388P47N596m386l668
10990B8810j254n629j308L196n011j3101J716J0815O922m512J3224J2802J65k0567
$$ y = [33919, 33217, 38443, 41190, 34006, 34718, 25479, 24981, 28576, 31622, 25443, 19017, 19739, 24514, 23949, 20783, 20085, 28433, 30934, 23118, 15327, 16913, 19929, 27554, 32272, 29029, 24081, 23639, 30432, 29347, 21167, 12642, 18465, 25638, 25658, 31590, 34823, 23607, 19360, 21240, 20328, 26204, 31169, 31720, 31443, 41233, 44827, 42150, 38785, 26625, 25811, 30182, 24722, 24065, 25002, 23645, 24034, 23241, 11754, 4354, 9109, 29955, 33045, 29694, 19278, 11122, 18976, 18761, 14504, 16837, 23015, 23380, 20045, 21500, 21992, 21307, 21018, 33284, 39610, 39486, 25153, 16250, 15181, 12803, 13795, 14871, 14915, 21956, 15974, 12842, 16535, 19701, 21927, 12189, 21766, 24634, 22413, 16722, 11905, 15115, 25133, 30521, 31268, 36864, 32478, 28810, 27556, 21927, 20619, 23815, 18804, 5703, 7419, 18234, 25156, 20644, 33868, 46670, 46835, 26268]
10976B6268l834j3329n244P673M216n33l618L038J976n899R383Q4k051Q38L159
10961B2127O69m293P245O207l064m546j1172r512J166K426M237P835k778j610
10947A4937m062O264P075L318N051n640m588j743j76l954o971p39J6551O834L278
10932C5435m985l161p555p839j055j861M87j784O222J0305K013m127K326j980
10918B2441n049M09l388M097l18L864l728o967L049q997k301J5592J0945j4705
10904A4944j0426M581n08R21P473k508J0515P975M573l838j1892L678j889O447
10890C0046j49n309N69M620m964j073l839j938L014q057j861J3948k696k897o183
10875A3231q134j78Q684Q313j084r07l138j1997l773M683J1573o28m68M445J2785
$$ y = [26268, 22434, 9105, 3861, 11534, 15750, 15217, 11599, 14637, 16613, 10714, 20097, 20181, 18130, 18968, 22127, 22796, 18503, 25748, 31955, 28891, 24345, 13173, 3661, 4827, 7253, 11490, 19325, 16547, 14937, 10875, 17139, 24214, 27532, 32583, 26943, 22355, 20612, 20436, 16482, 9511, 8772, 25323, 32157, 35435, 30450, 27289, 19734, 11895, 10840, 8979, 9466, 7682, 13904, 24209, 26222, 22095, 24421, 22441, 17392, 17801, 14413, 18510, 18192, 22056, 18328, 11361, 14410, 5413, 3112, 18704, 29649, 14944, 4518, 9099, 8591, 9512, 16985, 14477, 24992, 32967, 37540, 33702, 21810, 25488, 23599, 30046, 29897, 24588, 25157, 29777, 24813, 23740, 19901, 17963, 20977, 12920, 11059, 25007, 22311, 19414, 13231, 5097, 4919, 13603, 21916, 20832, 19925, 16787, 4790, 1017, 5700, 17273, 16645, 16177, 20622, 33407]
10860C3407O005q251m064J275Q784n282r103j816k802N619q783k657M703J069
10846A8104o570O527M409j76O379J157r439p893m412m76O224N363p49M0P840J373
10830B7701m885R94q99q672n488M436Q108n957K617o245n550N357K984o852O617
10815A4266M298l306J304L94n14P447J2558k012j1234j615Q749K0195r65j4298
10801C5267j894j13j3429k264r330n648l038J0593j157l04J836M292k15n177l245
10786F174M566k950M15R979r263l502k393J0268p08l117l1o986k314J50j385J2893
10770A1796J2836o375j234R57P702L245r101k241L42l447m181r823Q13J19O988
10755H396M745O203m839N745J2106J039l534k826l902n888m855m85K699K860o639
$$ y = [33407, 39412, 31161, 27097, 28372, 37156, 31874, 22771, 20955, 18153, 23772, 14989, 12332, 17035, 18104, 11534, 18061, 22470, 22294, 28673, 29830, 20391, 12498, 8086, 7610, 13834, 19197, 18448, 18488, 26328, 27701, 22816, 23810, 22911, 14239, 8751, 13187, 21295, 15338, 17955, 11710, 6160, 11517, 14501, 7649, 14266, 18564, 15258, 16562, 16956, 16442, 23889, 36447, 34435, 23201, 21586, 30335, 50530, 49565, 35267, 33373, 33260, 19831, 17567, 8237, 2589, -449, 10144, 8987, 8683, 10519, 14811, 14596, 9419, 6174, 10740, 7790, 8205, 18184, 8921, 5419, 3026, 13294, 12586, 9469, 9438, 2452, 138, 288, -1097, 11796, 24632, 18257, 17023, 17980, 25682, 28927, 19826, 17585, 17927, 14480, 10299, 476, 1289, 1408, 8396, 13141, 19344, 14505, 20250, 32356, 33395, 29861, 27035, 23133, 17245, 12390, 11905, 14604, 17464, 10825]
10740A0825m452J2032J854n822O87J1536L704j3731l182m013n377Q25Q672L974
10726A7532j331k283Q78l439M926K42n599K171J159M028k124j3371q813M393k18
10711a849k577J256Q47Q128N894M565l149k295q271M899M850k185m563k862p077
10696d389N732J562L969J192M47P158J25j0046J645K014m95o285l985m426O121
10681C39o309P126P364K9o673K333O608K13J547k290J039P98L52j151j563J443
10665A1205J736j769M1l326k032K328m6l702r96m916m594K174l15O834P747J0461
10649B0830m72l679l422m752j779n368R933Q606J828n873N849M911j274p532K805
10634B0611J60j3230l857J4026Q24p543K795o365k757L955j219m09L664k866N238
$$ y = [10825, 6373, 18405, 20259, 14437, 15124, 26660, 30364, 16633, 13451, 9438, 4061, 4886, 13558, 17532, 16201, 13918, 14796, 11357, 16283, 16525, 10926, 13097, 14256, 18284, 16160, 2789, -6024, -1631, -1849, -4426, -3170, -2323, 5805, 11699, 16264, 13115, 10820, 2549, 7448, 12298, 10113, 5550, 2688, -4389, 1343, 2905, 6874, 8066, 8513, 15671, 15796, 5750, 7395, 9409, 8914, 2629, -1356, -5782, 339, -5970, 1156, 8520, 8549, 1876, 4209, 10817, 11030, 12577, 10287, 11326, 12124, 12476, 11325, 9762, 11205, 12941, 11172, 11213, 7887, 5855, 8183, 8137, 4435, 3439, -1477, -6071, -3897, -4212, 2622, 10369, 20830, 20358, 16679, 13257, 8505, 6726, 1358, 11291, 19897, 21725, 15852, 21701, 26612, 25338, 17806, 20611, 20771, 7541, 3684, 17710, 18534, 10991, 13786, 7421, 4664, 8619, 7400, 6991, 10655, 7789, 13027]
10619A3027M117R126J351p454L438l120j1008K702K565o766p124N578M353M938
10605A5723J416j370q789M825L824j362K506N426j884M669P546N45p539k159j713
10590B1664J279j959k770l828p966n444R099J1936k725l836j936J161l781n18
10576A0376J532o593K370N672l036o867J785L623m793p403L964M921q96p322l460
10561f127l523M74n06k705O733n188N541J0705P08K226L417P70K707Q289K32k514
10545B1239J229M629Q912m47o455j1499m306j406K547n316j974N094m63M22N246
10530A7452j576j891j1029p570j219k81K369K375J0261M657K59K851k449m779
10516I430k130K845R125p879n362j955j1225k248J7870P809m735O674k902P487
$$ y = [13027, 17144, 26270, 27621, 20167, 23605, 20485, 9477, 12179, 14744, 7978, 854, 6432, 10785, 15723, 17139, 15769, 6980, 11805, 15629, 14267, 16773, 22199, 20315, 24984, 32530, 33075, 25536, 23377, 21664, 22943, 20984, 18214, 14386, 6420, 976, 10075, 22011, 19286, 15450, 13514, 14675, 10894, 10376, 11908, 5315, 7685, 13357, 10321, 3454, 5239, 8862, 4069, -3334, 630, 5551, 4655, -2667, -6127, -9650, -9176, -9682, -12387, -5654, -10842, -5301, 5404, 6112, 8338, 11755, 12525, 15232, 23521, 23753, 21239, 22468, 27097, 36009, 35562, 29107, 17608, 13302, 11896, 14443, 9127, 7153, 12247, 11784, 12206, 17452, 15876, 13985, 2956, -4614, -5833, -6114, -3745, -1370, 8891, 13548, 13807, 16658, 14209, 9430, 7300, 10145, 19270, 11391, 6029, 4074, -7151, -9399, 8471, 16280, 11545, 18219, 15317, 22804]
10502B2804N193O74k844r592n039j1059J196O533l084o994O20N354o87R044J1729
10487B3848n02j0576j1112j450n945k355j906J2133O428j067L668L170J579j968
10473A3945p615K970M721O303K269l206n850M489J350p04j28O837l942o756j785
10458A2898O728L320K621l649k16j0755p491K95j84K424Q67M236L471m549K64
10443A0280P247K239p436n476K127m26P83j401J026J220J14j362N035L998j579
10428A6389j2256k663K92Q866q05j106l162P010k993O957O460o671r554j748K082
10413G098N512J472M170N050K373J631k835n686j613J0490L154N301J534q283
10399B9368j0187L766L429k895J188m201J934m066j3711j0388o534J4926J2034
$$ y = [22804, 27997, 28671, 25827, 16235, 11196, 137, 1333, 7866, 4782, -2212, -1592, 3762, 3075, 12119, 23848, 23346, 12770, 1658, 208, -5737, -8092, -9998, 2135, 8563, 7496, 11164, 14334, 15913, 13945, 6330, 9300, 14021, 20324, 22593, 19387, 13537, 18026, 19376, 18672, 18544, 25381, 21439, 14683, 12898, 19626, 22946, 25567, 21918, 21702, 10947, 3456, 3751, 3567, 5991, 6858, 11094, 14565, 10016, 10280, 17527, 19766, 12330, 6854, 8981, 8555, 9338, 7937, 8963, 10183, 10297, 8935, 13970, 17968, 16389, 4133, 1470, 1762, 10628, 9823, 8717, 5555, 12565, 9572, 16529, 22989, 16318, 6764, 5016, 7098, 12610, 14082, 18252, 23302, 25675, 27306, 24471, 18785, 17172, 27662, 30816, 36117, 37651, 29368, 19181, 22947, 26376, 23481, 24669, 20468, 22402, 18336, 4625, -5763, -12297, 2629, 14663]
10386A4663N373p809j029J899m725r57j527q317o375Q736M328L543J08M847M456
10371A7214K856j5568m902m002l440Q072J2500O551j950l977J832L938l15j881
10357A6928K064k296l029m014N68N055r60q24k928k646o34j264N057L405p9N84
10341A4987k359L556m187q49p582P026K456N667o620p608j482L790P095K988k189
10326A4689n130M957J232p577l140o462p262p8O857Q460J5125N39j2007n074k382
10311B747L993O208L339L150Q950r345o273O171K656j1956q404j0923O049P495
10297C857R609j883K404N456N744m321r551k724o36N670L526n277J0087M173k162
10282B3972K207q24N018l797m906K1J327J396J690o253j6274l320R319r54j678
$$ y = [14663, 20036, 12227, 11198, 13097, 8372, 7415, 5888, -2429, -8804, -68, 4260, 7803, 7911, 12758, 17214, 20070, 4502, -400, -4402, -7842, 230, 12730, 19281, 17331, 13354, 15186, 19124, 18809, 16928, 18992, 16696, 13667, 9653, 10221, 15276, 14316, 13492, 10564, 7918, 7284, 6020, 11077, 14482, 14403, 14987, 12628, 16184, 11997, 11148, 3566, 10592, 13048, 18715, 12095, 4487, 3005, 6795, 13890, 16878, 14689, 9559, 14516, 15748, 8171, 5031, -1431, -8693, -8771, -1914, 6546, 21671, 22210, 10203, 5129, 2747, 6740, 12948, 16287, 19437, 28387, 19042, 12769, 18940, 21596, 9640, 1236, -9687, -3638, 3857, 13466, 11583, 13987, 19443, 25187, 20866, 11315, 8591, 7955, 13625, 17151, 11874, 21961, 26134, 23972, 26179, 25355, 30373, 26576, 21670, 21691, 23018, 24414, 26104, 19851, 3577, 257, 9576, 8622, 6944]
10267F944q94N0J0440N217M085j3308o085Q93M32q887n922Q57J992J495J790J703
10251H02L224J981N860R139l856K118Q369P531o042j0428p969k387M645K495l129
10236A2353J771K461K640j665l667J467r4j3946j0322J1371P288L283Q863L232
10222B5035N890m5j0824O04P607m720P578L329p542o325j1342Q64Q439O498L602
10207B8648j544P54k94n176k460K773O462J551p051p543L590k431n148M161Q143
10192B4435K256j0400j641j440O43O066L979k411l862j0005k348R197K828P052
10178B4349k082l320m393K385k809m591K826O739J1276J910M748r94Q76j068o730
10163B9122p562o302K699R5Q17j837N568O681p358J494M430L320m87n638L022
$$ y = [6944, 6050, 6100, 16540, 21757, 25842, 12534, 6449, 7342, 7774, -1113, -7035, -6178, -4186, -2691, -901, 802, 4026, 6007, 11867, 21006, 17150, 19268, 27637, 35168, 29126, 18698, 10729, 8342, 12987, 15482, 12353, 14124, 16585, 19225, 17560, 13893, 15360, 15266, 1320, -9002, 2369, 9657, 12940, 21803, 25035, 30925, 30880, 20056, 20660, 28267, 23547, 31125, 34454, 26912, 20587, 9245, 10109, 18548, 25046, 28648, 27104, 27858, 27564, 22388, 19928, 22701, 29163, 30714, 23663, 16120, 19710, 17279, 12131, 16292, 24435, 26691, 16291, 14650, 13210, 13853, 19919, 23898, 21487, 17625, 7620, 5272, 14469, 17297, 24349, 22267, 18947, 14554, 16939, 14130, 9539, 12365, 19104, 30380, 32290, 37038, 36044, 36920, 35852, 29122, 21560, 15258, 17957, 18052, 18869, 17032, 22600, 29281, 21923, 23417, 27847, 31167, 30680, 25042, 28064]
10148B8064J116M366j53m901J785K864o569K16P988N801J981O060k621m126j62
10133D1709q154n53J0052j879o55M142m89k896l558M460J814O258O400J463O046
10118F4160j41k466o051m898J44K083l809l404Q62m647j644Q498M355N536R109
10103F7687j686n150N485P332M085l296o637j442K798J0459o402j82J1207o068
10089G8190O593m16K820o405n781Q572R115j2089j2593K675J237m028O228O085
10075H0203J903K217j450m78N879k63j206P208J4780M443L796k674l238n94J1084
10060A21610Q137l128N831Q70j933r63O129O558L667P806q88o529m008Q387P439
10045A58985J6733k992N11J2877J3061j32J566Q549J0523L661P550o38J2471J1466
$$ y = [28064, 29180, 33546, 33393, 28492, 30277, 33141, 26572, 26788, 34776, 40577, 42558, 48618, 45997, 41871, 41709, 33555, 33002, 43054, 41175, 40520, 44662, 44173, 41277, 37719, 42179, 43993, 50251, 56651, 58114, 64160, 64019, 61553, 55502, 50604, 50748, 52831, 49022, 45618, 46480, 41833, 40189, 48687, 53042, 58578, 67687, 66001, 60851, 66336, 73668, 77753, 74457, 67820, 66378, 69176, 79635, 73233, 73051, 84258, 78190, 84783, 84367, 87187, 80782, 75001, 83573, 92688, 80599, 68006, 70681, 71918, 67890, 74118, 80203, 82106, 84323, 82873, 82395, 88274, 88011, 86805, 94013, 108793, 113236, 117032, 114358, 111120, 110526, 121610, 129747, 126619, 132450, 133320, 131387, 130424, 136553, 143111, 146778, 154584, 153696, 147167, 143159, 151546, 158985, 175718, 172726, 173237, 186114, 199175, 199043, 200609, 209158, 219681, 223342, 230892, 230254, 242725, 254191]
10031B54191J0194J0316J6761J4327J4745J9756Q795J5335K0463K6919J4245K0681
10019D46728J9118J6885L4554K9353K8851L5044K3117M5050M0447L9509N4732
10008H13388N2555O0700O3914Q2457P7449Q7633R9888J14205J13429J22103J46486
9997A834207J54833J52393J68745J87878J87496J75103J62180J65220J39354J13929
9987C441338R6001N6417J7182k1597o4465q9661j13356j31612j48796j48635j53279
9976B739537j50704j46263j47581j49537j36208j20872j04758r7005j04167r2987
9966A489455p3611p1008o8961n7135n3332n8272n5709n0501l6420l8728l8453
9955H87325m5364m2536l0868k4563j6643l6794l2889k5910j7116k2657j3479j3070
$$ y = [254191, 264385, 274701, 291462, 305789, 320534, 340290, 349085, 364420, 384883, 411802, 426047, 446728, 465846, 482731, 517285, 546638, 575489, 610533, 633650, 678700, 719147, 758656, 813388, 865943, 926643, 990557, 1073014, 1150463, 1238096, 1337984, 1452189, 1565618, 1687721, 1834207, 1989040, 2141433, 2310178, 2498056, 2685552, 2860655, 3022835, 3188055, 3327409, 3441338, 3537339, 3593756, 3610938, 3589341, 3524876, 3435215, 3321859, 3190247, 3041451, 2892816, 2739537, 2588833, 2442570, 2294989, 2145452, 2009244, 1888372, 1783614, 1686609, 1582442, 1489455, 1415844, 1344836, 1275875, 1218740, 1165408, 1107136, 1051427, 1000926, 964506, 925778, 887325, 841961, 799425, 768557, 743994, 727351, 690557, 657668, 631758, 614642, 591985, 578506, 565436]
9943E65436k1401k3469k4393j6156j4233k0168j4490l375j2221j2757j0790n223
9931C86760r064j0659j3161j5351K417j0063k1748r022r143J657l694j2777j2347
9918B63805q666q383k640o560q630j8869m262M207j436q937o891p64m033j1872
9904A76069n266j0525J250R0o375m297L879J053m798m202k299J395q228k458j156
9889A34132o673m396n534J395Q9L10l284j1542j1647j187O846P251p976j0213
9875H7571J036K735L612j304j5148p69N179M917o058k238M913l456j2125j041
9861F7824j628k311M157l59n94J556k415o744l273O59L719R14k949r017K116k035
9845D9620J277o9p152r2K553l567J166K527k245j4635K065O31j659L219K401o912
$$ y = [565436, 544035, 520566, 496173, 480017, 465784, 445616, 431126, 427751, 415530, 402773, 391983, 386760, 377696, 367037, 353876, 338525, 340942, 330879, 309131, 300109, 290966, 292623, 288929, 276152, 263805, 255139, 246756, 244116, 237556, 228926, 210057, 205795, 210002, 208566, 199629, 192738, 191974, 187941, 176069, 170803, 160278, 161528, 161618, 155243, 150946, 154825, 155878, 151080, 146878, 144579, 145974, 137746, 135288, 134132, 127459, 123063, 117529, 118924, 119013, 119323, 116039, 104497, 92850, 91663, 98509, 105760, 97784, 87571, 88607, 91342, 94954, 93650, 78502, 77733, 82912, 87829, 81771, 79533, 84446, 80990, 68865, 67824, 66196, 63885, 68042, 67683, 67089, 68645, 66230, 59486, 56213, 56872, 60591, 61505, 58556, 49539, 51655, 49620, 50897, 50828, 43676, 43584, 46137, 42570, 43736, 46263, 44018, 29383, 31448, 32079, 30420, 33639, 36040, 29128]
9829B9128J0397J0018P532j3262l513L370K863o979j3085K602Q080K319p639l390
9815B8441j834q283J097L371Q230r2n363J052j01j485K994N834o245p217M22O886
9799B7707k516N13K628N614J202l60k572p755n091Q341k931j886p44L03K576K936
9783B7965K926p38O293l104j278J958k179p385j941P74l385Q286O732n686l327
9768B5911k952q116n284m326K081J0826O996J061m724j257N7l070K810o555l670
9753I788q758k2j0449J887M127L031N181R227K568J908N257J058o675p486m577
9738F065J708Q58j09P38J2383l055q239k573M583P367l559j252K99n352m179n090
9722E93J3120O355n01o5k312k967l587J739P404R062o556o686N493L673m065j2078
$$ y = [29128, 39525, 49543, 57075, 43813, 40300, 43670, 46533, 39554, 26469, 29071, 37151, 39470, 31831, 28441, 26607, 18324, 19421, 22792, 31022, 30930, 25567, 26619, 26518, 25033, 28027, 33861, 27616, 20399, 20821, 27707, 25191, 25704, 28332, 33946, 35148, 34788, 32216, 24461, 19370, 27711, 24780, 22894, 22150, 22453, 25029, 27965, 30891, 30153, 36446, 33342, 32064, 34022, 31843, 24458, 22517, 23291, 19906, 28192, 34924, 29238, 25911, 22959, 14843, 9559, 5233, 7314, 18140, 25136, 26197, 21473, 20216, 20273, 17203, 20013, 13458, 9788, 1030, 1008, -9441, -7554, -3427, -396, 4785, 14012, 16580, 18488, 23745, 24803, 18128, 10642, 6065, 7773, 8631, 8522, 9260, 21643, 18588, 10349, 7776, 12359, 19726, 16167, 14915, 15214, 9862, 5683, 593, 13713, 20068, 19567, 19502, 17190, 14223, 10636, 12375, 19779, 28841, 22285, 15599, 21092, 24765, 20700, 8622]
9706H622O26j030L026J573J788j0351p26N522L388K089K91J538o887O47K273L98
9690A2787l087k452j476K835p001n888k413N721J34j21J051M249L228o171r075
9675g679K947N473Q096J96l614J223J367L05K710m006J002o85n204k42M002M284
9659A0175J25L603n194k153O275L804m908k107N10m848m887J267l779l326L823
9644a620k13J579M690M841j628J592j656P844K331l685k832p028n163J921k130
9629a157n464L584q21J646K551n41O250o376l158j048p44P61m621K778p1M76k835
9612h790j4497m587k560J9996J1129k248L265J0248j87j6l521n110l902k112M42
9597b450K491P562J144K17M405N144q676j1389K855M759q28l697j929r203r998
$$ y = [8622, 9248, 8218, 11244, 12817, 14605, 4254, 3528, 9050, 12438, 14527, 14818, 16356, 9469, 10116, 12389, 12787, 9700, 7248, 5772, 8607, 1606, -4282, -6695, -974, -840, -961, 90, 4339, 7567, 1396, -7679, -4732, 741, 8837, 9033, 5419, 6642, 8009, 8314, 11024, 7018, 8020, 7335, 2131, 1889, 5891, 10175, 10300, 13903, 8709, 6556, 12831, 16635, 11727, 9620, 10130, 5282, 395, 1662, -2117, -5443, -1620, -1833, -254, 4436, 9277, 7649, 9241, 7585, 15429, 17760, 14075, 11243, 4215, -948, 973, -1157, -6621, -3037, -3858, -2212, 339, -202, 6048, -328, -3486, -4534, -5278, -4517, -9138, -6360, -6431, -5955, -8790, -23287, -27874, -30434, -10438, 691, -1557, 1708, 11956, 11769, 11753, 8232, 3122, -780, -2892, -2450, 41, 7603, 8747, 8964, 13369, 18513, 9837, -1552, 1303, 6062, 5234, 1537, -392, -9595, -19593]
9582a9593j2607O662J3237J2398O315j299o887p341m568r1P967R751L914J093
9568H951o300m814j232j888j629K063j1912j401N514R47j2403Q637K0752R781
9554A5066n496L368p331k383N691m332o885l267n661K280J1134O548o387m219
9540a874R325P36r458p488R179L848q943l992M122N68M463M217q71N45j067k978
9524C32M78L667p871r062N070P341P020j794M756l809n874L736p74l598k391R206
9508F433Q500m342j5588r177N647O397K45J0406l784m924l102j038K865r585K319
9493h728p03n306Q71J218N503O903q48j0060M147K588Q946K243k937o127L821
9478A531J510p07o624n083l37L534P177q89N088P319N9p266r495j978M445l575
$$ y = [-19593, -32200, -25538, -12301, 97, 6412, 5113, -1774, -9115, -13683, -13774, -5807, 3944, 7858, 8951, 2651, -2163, -3395, -5283, -6912, -4849, -16761, -18162, -12648, -11701, -24104, -15467, 5285, 15066, 9570, 12938, 5607, 3224, 8915, 4583, -2302, -5569, -11230, -8950, 2184, 8732, 2345, -1874, 7451, 8187, -1271, -8759, 420, 4268, -4675, -8667, -4545, -3977, 486, 4703, 3832, 4377, 3310, 332, 810, 4477, -3394, -12456, -7386, -45, 6975, 5181, 9937, 6128, 254, 3990, 3216, -382, -2773, 6433, 14933, 10591, -4997, -14174, -8527, -2130, -1885, 8521, 4737, -187, -3289, -4327, -1462, -11047, -8728, -9431, -14737, -13866, -12648, -7145, -242, -1090, -11150, -7003, -4415, 4531, 6774, 3837, -2290, 1531, 3041, 2334, -4290, -9373, -9710, -6176, 1001, 112, 5200, 12519, 12578, 5312, -4183, -6161, -1716, -5291]
9462e291N979L595J064O09l032J949R775M486q385n223J90k877q778p520J6249
9447B790J4259P455m552j378k184q396j0507L296J0150M500L577j0535k872J174
9433F777R291J220r459o408L935N694o942p651K54k061P033J2531O831m002P77
9418A7820o136o582N571K135l542j1240l472L984P197q38O847k197m268n695n183
9403e599K723o427Q753O170l73r08p373q788l928L400P883K156m3K430n954J208
9387d670K904m044J026m474M288J1120J1180m468m408o576k196K683O958L43q32
9372H834O289l661j2452p051O2q27k353K526J347n112r14n24L329J0935P606l614
9356D420n278l48L602M176K630O35q2o114p518P235O190n0K974R261j0097m209
$$ y = [-5291, 688, 4283, 5347, 5956, 2924, 4873, 14648, 19134, 10749, 5526, 5716, 2839, -5939, -13459, 2790, 17049, 24504, 19952, 18574, 16390, 7994, -2513, 783, 10933, 15433, 19010, 8475, 5603, 6777, 16068, 17288, 7829, 1421, 5356, 11050, 4108, -3543, -3289, -5350, 1683, 14214, 21045, 17043, 17820, 11684, 5102, 10673, 12808, 9266, -1974, -5446, -1462, 5735, 4897, 11744, 9547, 5279, -416, -5599, -2876, -9303, -550, 5620, 5247, 4339, -3034, -11822, -15750, -12350, -4467, -2311, -2354, 76, -5878, -4670, -1766, -5810, -4784, -9258, -4970, 6150, 17330, 12862, 8454, 1878, -318, 2365, 9323, 9666, 8834, 15123, 11462, -990, -8041, -7979, -8806, -11159, -8633, -7286, -12398, -13312, -13836, -10507, 428, 8034, 4420, -858, -1206, 2396, 6572, 9202, 9837, 9755, 3641, -3877, 3358, 9548, 9498, 12472, 21733, 11636, 7427]
9340G427O25M985n894p143j120M668j541k790M085J243l717J680R422p986p061
9325c117k867L395l961n42n26J0699M78L774P411k390m254K701r710j0264Q985
9310a88N614n691j146L099Q25Q1o114N202K080J39N416n171k63L718o029M070
9294E642K997p786j871K095m216q350j732k170J770N336J824L977J2163J3193
9280B2872K88p013m121p48M088j397j511J73l614l157l097j093j339M931L975
9265I237r439o97K163o932k601O57n389O975P779l614k567O63o293o868R774l691
9249a0843J660N87M381L216M901L701l81K429l245o436O896L45K849J136o148
9234E048m962p94k057K40L613Q09J726M506m01n807k756m995N956J113n411l845
$$ y = [7427, 8052, 13037, 7143, 0, -1120, 3548, 2007, -783, 3302, 4545, 828, 2508, 11930, 3944, -3117, -5984, -2589, -6550, -7092, -7618, 3081, 3559, 7333, 14744, 12354, 8100, 10801, 1091, -9173, -188, 5426, -265, -1411, 1688, 2513, 2594, -3520, 1682, 3762, 3901, 9317, 4146, 3883, 7601, 1572, 5642, 8639, 853, -1018, 1077, -3139, -11489, -13221, -15391, -13621, -8285, -6461, -2484, 9679, 22872, 23160, 16147, 12026, 11278, 15366, 13969, 12458, 12631, 9017, 5860, 2763, 1670, 331, 5262, 9237, -202, -899, 1264, -5668, -8269, -7612, -13001, -6026, 1753, -1861, -4428, -3765, -10058, -16926, -7152, -10843, -9183, -8596, -4215, -999, 3902, 7603, 7222, 9651, 6406, -30, 6866, 7211, 10060, 11196, 5048, 86, -708, -2765, -2525, 1088, 1897, 3623, 8129, 7728, 1921, -835, -5830, 126, 1239, -4172, -8017]
9218h017q663J0786J4273R78l886m799n927o744j197Q825j368L507q936J0501
9204f67J1671j0866p628J661o158r54O301N028M011K485l274r353K949J0790K324
9189H320l428p192P468N626O090o558q104k490j608K502m631J756K923p646n041
9174a2013R346Q564J75q925l687R071N066K789M208j340j0636o850O947L848o695
9159a32j321M643l174L179M070P99m295l500O997L302J138o396N321j181n39J668
9143A0579o189r792N592L603r007j860N259j400l772n787P703j703N499M20n039
9128e894K460Q796O44L106K987j770j1200n416r031K182J2298N822o11j012o135
9113b774m351N579Q793Q663k249p342j4883m080P775L48K999P397p174r210O693
$$ y = [-8017, -16680, -5894, 8379, 9357, 5471, 672, -5255, -11999, -13196, -4371, -5739, -2232, -11168, -667, 11004, 138, -7490, -5829, -11987, -12941, -6640, -1612, 2399, 4884, 1610, -7743, -4794, 5996, 8320, 4892, -2300, 5168, 10794, 16884, 10326, 2222, -268, -1876, 626, -4005, -2249, 674, -6972, -12013, -2667, 5897, 6072, -2853, -6540, 2531, 7597, 10386, 14594, 13254, 2618, -4232, 2715, 6563, -132, -1453, 3190, 16, 3195, 7265, 8064, 3769, 269, 7266, 10568, 11706, 5310, 10631, 9450, 8911, 10579, 4390, -5402, 190, 3793, -5214, -7074, -1815, -3215, -6987, -12774, -5071, -6774, -1275, -855, -5894, -3434, 5362, 6006, 9112, 12099, 10329, -871, -6287, -15318, -13136, -838, 4984, 4373, 3361, -2774, -7125, -1546, 7247, 15910, 13661, 6319, -8564, -12644, -4869, -4521, -1522, 5875, -1299, -10509, -3816]
9098c816M978m64k553k984O920Q59n782k157l85l06L265n79l660m564K988k725
9082a0965n16N176p19N903J97k591k968J014j01K654p861j916N475J2037N149
9067I968M99o729n473m695l817l821l544L899J7838J4468p682j0751q28P3M824
9052D229q40r670O343O623J408q77r552l373J438M1m938L858k215m819n911K941
9036a5314J3595N616o240p591R715L998J243N062l310j522r63K569M643N413o188
9021A0726n354k406L434M93O553n421n865r55n874m566k936O187J008L78j137
9006e735K889R5m392l930K894Q116Q319L358o342L932o643l153M129j4585N662
8991e386o02K828J15j363K795k270Q769l200m248m693K707j17j0992O466O904
$$ y = [-3816, 1162, 698, -1855, -4839, 2081, 2940, -2842, -4999, -5384, -5690, -2425, -3004, -6664, -11228, -8240, -10965, -11481, -6305, -7024, -1121, -924, -3515, -6483, -5469, -5570, -2916, -10777, -12693, -7218, 4819, 9968, 10467, 3738, -1735, -6430, -10247, -14068, -17612, -13713, 4125, 18593, 10911, 160, -668, -595, 4229, 3389, -6281, 62, 6685, 8093, 7216, -2336, -5709, -4271, -4230, -9168, -5310, -7525, -12344, -18255, -15314, -1719, 3897, -2343, -9934, -219, 3779, 5022, 10084, 6774, 5252, 4289, 6858, 11501, 16914, 10726, 5372, 2966, 6400, 6893, 13446, 8025, 2160, 1205, -4669, -9235, -12171, -5984, -4976, -4598, -5735, -2846, -2751, -7143, -11073, -8179, -63, 8256, 11614, 5272, 9204, 2561, -592, 3537, -11048, -5386, -5988, -3160, -3045, -4408, -1613, -3883, 4886, 1686, -2562, -7255, -4548, -4665, -15657, -9191, -2287]
8976b287j691M60M440N422Q270o755q704J790m371J667j090J111l875k991N148
8961c456Q839P93N317K616J467R59m402m116P00l272L459k897j0994o701k724
8946a4412J5449M949k562k293m501k004o917P544R854J2813M663m410j025j3297
8932C851l994O685o95K443L647R2l550L2J098p227k649O334J0226J155k684m354
8916A0410j4k295j444p879l617P96N43P787N028l881q63K898k895p081p305L641
8900f171J714l408r305l21j643N116N641N936o852m840P93L854J0392K354l845
8885e85j0726J354n39K105N883q640o073J5140K841m209R855l651o157k793r789
8870a5984l809J4623J103L038k257M799J713O919R88j890q693K082L814k238N05
$$ y = [-2287, -3978, -3518, 922, 6344, 14614, 7859, -845, 945, -3426, -1759, -2849, -1738, -5613, -8604, -3456, 5383, 6176, 11493, 14109, 15576, 16535, 12133, 8017, 8717, 5445, 8904, 6007, -4987, -11688, -14412, 1037, 5986, 3424, 1131, -3370, -5374, -12291, -4747, 5107, 17920, 22583, 18173, 17148, 3851, -143, 6542, 5847, 8290, 11937, 12029, 8479, 8511, 9609, 2382, -267, 6067, 16293, 17448, 14764, 10410, 10396, 8101, 6657, -1222, -4839, -4043, -3500, 4287, 9315, 5434, 4571, 7469, 4574, -2507, -9812, -6171, -4457, -7865, -17170, -17491, -19134, -14018, -8377, -2441, -9293, -14133, -13340, -9486, 906, 3260, -585, -11311, -9957, -10496, -8391, -2508, -11148, -17221, -2081, 760, -3449, 6406, 2755, -3402, -6195, -15984, -19793, -5170, -4067, -1029, -3286, 1513, 3226, 10145, 11133, 9243, 550, 2632, 6446, 4208, 4713]
8855D713o407q027O290M182Q066L166o58n265k072M218J831m9Q530Q783j1474
8840A5827j6559k309K232N495R64L297M697J655r3k158o019r396o368L586R375
8825D226m209N261L442l878q712l031j437J551o573L174J4293O450M788r732J391
8810G004K415l816p036l209j379P664R619Q413J610R11N680O011M166J1417J825
8795E1295j7599j6938j0835k085k56j807R180J33j118o864j221P871n707j563
8781B486K94q974j745M424J4858J614J868m260j912j348j83j750o176L748N679
8766H623J252q162p855N067m849r155N720N310k810R750K547K151k784J0858Q669
8751B4332N345K870q637j629j116j2279o933O571k663j248M9K493J322l337l669
$$ y = [4713, -1694, -9721, -3431, 751, 8817, 11983, 11325, 6060, 3988, 8206, 10037, 9988, 18518, 27301, 15827, -732, -3041, -809, 4686, 5650, 8947, 13644, 15299, 15206, 13048, 7029, -2367, -8735, -5149, 4226, 17, 5278, 8720, 4842, -3870, -6901, -8338, -6787, -13360, -10186, 4107, 10557, 15345, 5613, 7004, 9419, 5603, -1433, -4642, -6021, 1643, 11262, 19675, 21285, 22196, 27876, 33887, 38053, 49470, 51295, 33696, 16758, 5923, 3838, 3582, 1775, 10955, 11088, 9970, 3106, 1885, 9756, 4049, 2486, 2780, -6194, -7939, -3515, 11343, 12957, 14825, 10565, 8653, 7305, 7122, 5372, -804, 2944, 8623, 9875, 1713, -6142, -1075, -5924, -15079, -9359, -4049, -6859, 2891, 5438, 7589, 4805, 15663, 24332, 29677, 32547, 23910, 22281, 21165, 8886, 1953, 8524, 5861, 4613, 4662, 7155, 8477, 5140, 1471]
8736A471k794m411k322J0483N356j292p941k999P066n646R20k710n271L595L399
8721c096O009O086n510o198N66j343P661J732k785m624l780L856M282J01J261
8706D218k147j2418m710P207L478L031l721m804K761P159O877k635Q53J3880L384
8691B2413r033r980o159K517j739q832L855k805k487O479M975L37L363N335o749
8676A490p200j646J0509J530K802q964n565K963O606n11q749J233P452J243M77
8661C670p272n04M650O94P200k864J870k789p703R282j52m930l073l349j793J534
8645e529p692j806m00J3203Q114L017M395q45o132M045Q41K008o015L219L939
8630A4362n613R465O335j002o230p579l70L204o60M96j657q270j082M90O708m337
$$ y = [1471, -1323, -5734, -8056, 2427, 7783, 6491, -1450, -4449, 2617, -3029, -2109, -4819, -10090, -6495, -3096, 2913, 8999, 3489, -2709, -2143, -3486, 4175, 5907, 3122, -1502, -5282, -1426, 2856, 2957, 4218, 2071, -10347, -15057, -7850, -4372, -1341, -5062, -9866, -7105, 54, 6931, 4296, 5149, 19029, 22413, 13380, 3400, -2759, -242, -1981, -10813, -6958, -9763, -12250, -5771, -796, -459, 2904, 8239, 1490, -5710, -7356, 3153, 4683, 7485, -1479, -7044, -4081, 2525, 2014, -6735, -5502, 1950, 3193, 3670, -3602, -4106, 544, 1238, 8438, 5574, 7444, 4655, -3048, 6234, 6082, 1152, -1921, -5270, -7063, -5529, -13221, -15027, -15427, -2224, 5890, 8907, 13302, 12457, 6325, 10370, 11211, 13219, 7204, 10423, 14362, 8749, 18214, 24549, 23547, 17317, 9738, 9368, 12572, 11912, 12408, 10751, 2481, 1399, 1889, 8597, 4260]
8614D260j0796M51O004K106P073N634P705R776m975k808l523j063l904n708m343
8599E889O180J2051j206j1056n491n249K845J3907l521n505P553n245K559k1j480
8584A2210j0246m736K72j185O156J3109J089m998M00j067l793L819K150j3687
8570e07j2508Q891M028K928Q368k808L810j3464j0299N815k455m509J903o676
8556a7483L038r88p6j807M556J559R88N224J862L940j651o869m158L761P014N562
8540D472p626J279J367o463k655L74Q653j843J84o075L686Q74L581M649j502K013
8524D968P95M161J884l021n703r698k92Q625O482M62m818r92l684l528K165M175
8508A981N967j3044q085K277K752M748N941j714m443K480l303J735m97l320J530
$$ y = [4260, -6536, -6085, -81, 2025, 9098, 14732, 22437, 32213, 27238, 24430, 20907, 19844, 15940, 10232, 5889, 12069, 24120, 22914, 11858, 6367, 1118, 3963, 17870, 14349, 8844, 16397, 11152, 13711, 13690, 12210, 1964, -2772, -2500, -3685, 2471, 15580, 16669, 11671, 12071, 11004, 7211, 11030, 13180, -507, -13015, -4124, -96, 2832, 11200, 8392, 12202, -1262, -11561, -5746, -8201, -12710, -10807, -17483, -14445, -15433, -15509, -17316, -12760, -11201, -10213, -4989, -3127, 813, -838, -7707, -11865, -8104, -1090, 4472, -3154, -1875, -508, -6971, -9626, -9252, -599, -2442, -2258, -8333, -4647, -3773, -192, 4457, 2955, 4968, 5763, 9924, 11808, 8787, 3084, -6614, -6906, 1719, 8201, 8663, 3845, 2853, -831, -4359, -2194, 1981, 7948, -5096, -13181, -10904, -8152, -3404, 2537, 823, -3620, -1140, -4443, -2708, -3205, -6525, -4995]
8493d995N494L98p898P571j007l354M356O367K206L62j5082J473J764J298J234
8478A87l231p442J441N610N378p50K328m374n314P256J0880j452l846K383j1199
8463b145q601N925R88k722m808n233J782J2373N134K752Q64l296K039K48k702
8448B598n77p7p915R0M480K041J040j1782j1794O357M503k214R443J1292J0332
8433A7817O002P25J46o197r006o811N214p329l024q46n732l187J1573P907o436
8418H16J365j766P568J065N54l71n678k386j3934L370o333o607m22M821N134O942
8402e862J402M377P798K570N307M623p007n651q390m899K379l354l862K576O865
8387a128L238j112K180k896j975M314R280O88l858l182m876q98N246p510j0340
$$ y = [-4995, 499, 897, -7001, 570, -437, -3791, 565, 6932, 9138, 9500, -5582, -4109, -2345, -1047, 187, -3044, -10486, -9045, -3435, 1943, 1193, 3521, -853, -6167, 1089, 11969, 10517, 6671, 9054, -2145, -10746, -4821, -3833, -6555, -11363, -16596, -14814, -2441, 2693, 5445, 6309, 3013, 5052, 5300, 2598, 2021, 1944, -5971, -5881, -1401, 640, 1680, -10102, -21896, -15539, -11036, -13250, -3807, 7485, 17817, 23819, 24544, 24690, 18493, 9487, 2676, 7890, 561, -2463, -3309, -9041, -12228, -655, 7252, 816, 2181, 415, 7983, 9048, 9602, 9231, 3553, 1167, -12767, -9397, -15730, -22337, -22759, -17938, -12804, -5862, -4460, -83, 7715, 10285, 15592, 20215, 13208, 7557, -833, -5732, -3353, -6707, -10569, -7993, -1128, 2110, 998, 3178, 282, -1693, 2621, 11901, 12589, 8731, 5549, 673, -225, 5021, -2489, -12829]
8372a2829n358Q202O638J107n062P842J4489l205p955l767K104P501O674j6702
8358c21k233K206j769j314O247J1043k944p650l872L213L216j3053j2250J932
8344a7549N784P903M958r491j2045m232J3547Q938K632L008l128J75o838l082
8330i420J1718M691q699o644J3042j27p646J863O023J1661M688p402n106j1239
8316b597n757M297M258l029k658k199P04O11j09N321j825k580k913j406K461P277
8300a44N27L629L658j84n131j5986m97N624Q715L789j0736J854J318N279J083
8285B798k239r110o820K428m00L180P326m274k136N250o53N369R284l139j2243
8270e379L302m74J149m039K526K760L146q075o765K943k730J29Q580K02j1099
$$ y = [-12829, -18187, -9985, -3347, -2240, -7302, 540, 15029, 11824, 3869, 102, 2206, 9707, 16381, -321, -2554, -348, -2117, -3431, 2816, 13859, 10915, 3265, -607, 2606, 5822, -7231, -19481, -17549, -11765, -3862, 1096, -8395, -20440, -24672, -11125, -2187, 445, 3453, 325, 500, -6338, -9420, 2298, 6989, -1710, -8354, 4688, 4561, -3085, -1222, 4801, 16462, 21150, 13748, 8642, -2597, -8354, -4057, 201, -2828, -5486, -7685, -6981, -6370, -6479, -1158, -2983, -5563, -8476, -9882, -7421, -144, 383, 4012, 7670, 7486, 2355, -13631, -14128, -8504, 211, 4000, -6736, -4882, -3564, 1715, 2798, 559, -8551, -15371, -12943, -13343, -10163, -2837, -7111, -9247, -3997, -4650, 719, 10003, 6864, -5379, -2077, -2551, -1402, -5441, -2915, -155, 2991, -5084, -11849, -8906, -11636, -11507, -2927, -2725, -13824]
8255a3824o25L562K142J491l847J3703j37l053M240K880L268R67j173p26k1560
8240a2692j161J3672j275q820n3O80K000N172L249j1002j0565R878P080m192K27
8225g802J269M090p80L632M310L508o065m389N715l990j5700M583N061L053j366
8210d871R101o949q262k817p852P91M399Q472N512j377N507q648j696J1364M965
8195G639j832M735R110l594m212J21j2719r384J1877N764J249K665j238N154P16
8180A6051K718l9o072q330M659O893k420j2450k33n546q875j105L968M322n501
8165a1960l42J1900m604j3506J2148L323r34L609P756k34n347r64m889M189o563
8150f418n964k54J553Q688O44o316N63p136n070J199M874p73o960K099J1535J1180
$$ y = [-13824, -14449, -10887, -8745, -7254, -11101, 2602, 2465, -588, 3652, 6532, 9800, 10767, 9594, 8868, -12692, -13853, -181, -1456, -10276, -10329, -9649, -7649, -2477, 772, -10230, -20795, -10917, -3837, -8029, -7802, -6533, -2443, -3223, 409, 4719, 8227, 2162, -2227, 3488, -502, -16202, -11619, -6558, -3505, -4871, 4230, -2719, -10981, -13798, -21650, -20859, -16460, -7988, -2476, -3853, 1654, -6994, -8690, 2674, 7639, 5807, 10542, 19652, 16058, 11846, 11967, -752, -10136, 1741, 7505, 8754, 11419, 10181, 15335, 16051, 18769, 18730, 12658, 4328, 8987, 15880, 13460, 1010, 777, -4769, -13644, -14749, -10781, -6459, -11960, -12302, -402, -5006, -18512, -6364, -3041, -3975, -366, 7390, 7156, 1809, 845, -4044, 145, -6418, -12382, -12636, -11083, -2395, -1751, -8067, -7504, -14640, -19710, -18511, -13637, -14410, -21370, -19271, -7736, 3444]
8134C444K416L464j1572n00N654j885p673N943O655K923l201o555m905l510K233
8119g069q85n592j388O044l194q814J4101J6361p82p087k593J110n480j40O28
8104d780l257N731K690o987j606M345Q57J002Q712p972q010J779R622J034J600
8089D760n384O465Q618P067n899k212k059r027q676K790J380P376k658k485K466
8074B522k841k798q6N375N641N891o652q985n250O903j2304n86P196l248q860
8059a8082O927O969K696P022P709n821l819L108N309j600j2658p661L947Q548
8045B594K157k336n334O807o063o440o87M203J370o952k847n050m266J4834J2173
8030D163l675o883n059L429J0783P148L100o077m491M400R42q713M183n704j18
$$ y = [3444, 5860, 9324, -2248, -2748, 2906, 1021, -6652, -709, 5946, 8869, 5668, -887, -5792, -9302, -7069, -7954, -13546, -14934, -8890, -12084, -20898, -6797, 9564, 8782, 1695, -898, 212, -5268, -5408, -4780, -8037, -2306, 384, -6603, -8209, -3864, -3007, -2005, 6707, -1265, -9275, -7496, 2126, 3160, 4760, -624, 5841, 14459, 21526, 15627, 13415, 11356, 2329, -6347, -3557, -2177, 5199, 2541, 56, 2522, -319, -3117, -3203, 2172, 7813, 13704, 7052, -1933, -7183, -280, -12584, -13170, -5974, -9222, -18082, -11155, -4186, -1490, 5532, 13241, 7420, 3601, 6709, 12018, 10418, -2240, -9901, -5954, 2594, 4751, 2415, -2919, 3888, -2175, -8615, -9302, -5099, -3729, -10681, -13528, -18578, -22844, -8010, 4163, 488, -6395, -11454, -8025, 2758, 9906, 13006, 6929, 2438, 6838, 7780, -933, 3250, -2454, -2572]
8015b572j484o070J0189J5106n318o681j1379n929j947Q538L42m03O219o34L118
8000A095Q262r213j2417p558R387J5488K794j487j5349k158J0624n388j897L081
7986d736r759L617J4939R997p110j1162m225J6761O224j1460r75P902M941m441
7972A0513k818k611L697p37r834R756N725m43K456M994m568j4737o84J1064J469
7957A3242k376n745p386r72K012l257J462k223R7P144J0169K8r529Q566Q626L603
7941B3461L809p881j6590J45N902O948j0987j0991M500P830j057m819l406J611
7927a525O520m627o78J1111J651m503l391l567r40R836m078n003k532k672k76
7912d674O36J220L145k504j068K396l883L422Q47m114q576k079N418j473L729
$$ y = [-2572, -4056, -10126, 63, 15169, 9851, 3170, -8209, -14138, -16085, -7547, -7205, -7608, -1389, -2023, 1095, 9357, 144, -12273, -19831, -10444, 5044, 7838, 6351, -8998, -11156, -532, -5920, -7817, -4736, -14495, -10878, 4061, 14058, 6948, -4214, -8439, 8322, 14546, 3086, 2111, 10013, 14954, 10513, 7695, 5084, 8781, 8044, -1790, 7966, 13691, 13248, 15704, 20698, 16130, 1393, 709, 11773, 13242, 10866, 5121, -2265, -3237, -1225, -4482, -3020, -5243, -5146, 1998, 12167, 12195, 2666, 11232, 19858, 23461, 27270, 19389, 2799, 2944, 8846, 15794, 4807, -6184, -1684, 6146, 5089, 270, -3136, -1525, 4995, 368, -310, 10801, 12452, 7949, 4558, 991, 51, 9887, 5809, 806, -1726, -4398, -4674, -4038, -2818, 327, -2177, -3245, -849, -4732, -1310, -463, -4577, -13153, -15232, -9814, -11287, -7558]
7897g558J2121Q936l056K497k623L520N2M338q79p193J290n307m360m248p396
7882i866j859Q021N054k60l748P218O305m421j0762m68j878L170J3258L692o292
7867G164l564O568n43k544Q28q17r579m440M023Q93k632m789L079j780m855N737
7851g251L332k621P026J382r895j260j980J297J1921J0136K062m657m299L212
7837H405m544o470j05L181J2835L108o740j494L407j1157q100k904m736M862J0431
7822b1J854o475r28L504j0004n938m906J1074P401K025r148p358K95n525j529
7807b5679O163J1103J1439O257l621k186P87l902o566M246p367J550K951K813
7793b012J775j291K136j266n553l881q115l500J2728O557Q376l022j2849n550
$$ y = [-7558, 4563, 13499, 10443, 12940, 10317, 13837, 13889, 18227, 17348, 10155, 11445, 6138, 1778, -2470, -9866, -11725, -3704, 1350, 1090, -2658, 4560, 10865, 6444, -4318, -4786, -6664, -3494, 9764, 13456, 7164, 3600, 10168, 9625, 7081, 7909, 7092, -2487, -6927, -2904, -2011, -4643, -9432, -6353, -8133, -12988, -7251, -3919, -6540, 486, 1868, -8027, -9287, -11267, -9970, 1951, 12087, 14149, 9492, 5193, 8405, 3861, -2609, -2714, 467, 13302, 16410, 9670, 8176, 11583, 426, -7674, -10578, -15314, -10452, -21, 1833, -4642, -5570, -2066, -12070, -18008, -22914, -11840, -4439, -2414, -11562, -18920, -18625, -24150, -25679, -19516, -8413, 3026, 9283, 5662, 3476, 4263, 361, -6205, -1959, -9326, -7776, -4825, -2012, -237, -1528, 608, -658, -6211, -10092, -18207, -21707, -8979, -2422, 5954, 2932, -9917, -15467]
7779a5467R39m370q565k657O731J2541P731R21n064o323O445k562m775O952N623
7764a900k116P304l731o207M284K240M665j1669o282N324M154M169q814Q37P29
7749g013L071j0706p390j824J1325Q222q944o645M911M121p016L011J0568m282
7735h591m855J588j453P629P982j200m077R49L847o180k836O472J435j02J1475
7720A2083J821j0521n809k469l139N423M375j692p932M485M149O804M60r1M216
7705A2163j3020r964J249J4952j0830q007k166j916J8701P880j4953j0651k749
7692a9311K907Q662j768m243p516J1788Q026j190M123q913K76J941k875L591P854
7677C352N314N896m761o481n455m833m180k190j1943M866J2956o76m386M306M777
$$ y = [-15467, -14528, -18898, -27463, -30120, -23389, -10848, -3117, -2196, -7260, -13583, -7138, -9700, -14475, -7523, -1900, -4016, 3288, -443, -6650, -2366, -126, 4539, -7130, -13412, -8088, -3934, 235, -8579, -7742, -7013, -3942, -14648, -22038, -23862, -12537, -4315, -13259, -19904, -14993, -10872, -17888, -14877, -4309, -8591, -13446, -11858, -13311, -5682, 2300, 1100, -2977, -2028, 1819, -4361, -7197, -725, 710, 608, 12083, 13904, 3383, -2426, -4895, -8034, -2611, 1764, 72, -7860, -3375, 774, 7578, 8038, 7947, 12163, -857, -10821, -9572, 5380, -5450, -13457, -15623, -17539, 1162, 9042, -5911, -16562, -19311, -16404, -7742, -9510, -13753, -21269, -9481, -1455, -2645, 1478, -7435, -7159, -5218, -8093, -4502, 3352, 8666, 14562, 9801, 3320, -2135, -6968, -11148, -13338, -25281, -20415, -7459, -8135, -12521, -8215, -3438]
7662c438J1395K041j0859j3219k083J7011j25p380o812n560P135R99K461J601
7648f833r027J263J982o734L028J2801J245l506J3627j296l924k679j3167k976
7634a6196P410M288j930J580j340j611M383R009L565p239o526n808P742M404O518
7619H249p611J489J013q831N867L168r246J766J520m326l889R75P027p693m277
7604a4799K551N386J4359Q936j5480o082p991j3311j1712R705K0656k730n763
7591a6275L979J2246Q331M612k190j083M806n387p329j68l489L7j615N951l482
7576a056L155l468j801j289o441l042R835Q857P169r546o269J546k937k124J4573
7561G162K144r837k193m411l610P129P356O416j405o325m722j521j0073p661L684
$$ y = [-3438, 7957, 9998, -861, -14080, -16163, 848, 723, -6657, -13469, -19029, -11894, -10895, -8434, -6833, -15860, -14597, -12615, -19349, -16321, -3520, -2275, -5781, 7846, 6550, 2626, -53, -13220, -16196, -8786, -4498, -6428, -4848, -6188, -7799, -3416, 5593, 9158, 1919, -4607, -10415, -2673, 1731, 8249, 638, 2127, 3140, -5691, 176, 3344, -5902, -4136, -2616, -6942, -10831, -9856, -2829, -10522, -14799, -12248, -6862, 7497, 16433, 953, -5129, -13120, -26431, -38143, -28438, -7782, -10512, -16275, -12296, -50, 8281, 12893, 10703, 9620, 14426, 9039, 1710, 1542, -1947, -1910, -3525, 2426, -1056, 2099, -1369, -3170, -4459, -10900, -13942, -4107, 4750, 11919, 2373, -3896, -2350, -5287, -7411, 7162, 9306, -531, -2724, -7135, -10745, -3616, 3740, 10156, 8751, 2426, -2296, -3817, -13890, -21551, -17867]
7546a7867M226K083j408k974P258Q475k765q897m696J39N086J4331N528j517N433
7531A2435O788j2883l990n47J247N399p652r602o558K477J3241O901j0145p794
7517a0683m462R876J0126M693j125J696L851N790j384q708p121p947o021M124
7503g295J027pP175k696k588m846k054k456J0146J3181P433j2374j0821N79p48
7488f344l622L835L934R39R592J827j1051o670M046l11j935n929K349J1859R575
7473A2094p387m845M406k397j0241o879N570l149k988L380J513m037k240o854
7459b4054O304m576n987Q720J0697K688N310Q949M877n496r566p504O611R588
7445F561k994l510j283J793O031l81n774p019L684K632Q645K443m178j5966r131
$$ y = [-17867, -13641, -11558, -12966, -15940, -8682, -207, -2972, -11869, -16565, -16426, -11340, 2991, 8519, 7002, 12435, 19223, 6340, 2350, 1803, 3050, 8449, 797, -8805, -15363, -12886, 355, 7256, -2889, -10683, -15145, -5269, 4857, 9550, 8425, 10121, 13972, 19762, 18378, 9670, 2549, -5398, -11419, -7295, -6268, -6275, 900, -1796, -4384, -9230, -11284, -13740, -3594, 9587, 17020, 4646, -6175, -5596, -6344, -9966, -6131, -2197, -1258, 8334, 10161, -890, -7560, -3514, -3825, -5760, -11689, -9340, 2519, 12094, 4707, -138, 4268, 1871, -8370, -15249, -9679, -12828, -15816, -12436, -10923, -14960, -17200, -24054, -17750, -22326, -28313, -19593, -8896, -6208, -898, 8051, 12928, 7432, -2134, -9638, -3027, 6561, 3567, 57, -1226, 567, 6598, 6217, 443, -6576, -2892, -260, 8385, 10828, 6650, -9316, -18447]
7430a8447R845M124j230j741O592Q571J0092Q05m192q764l997n532o92k641n85
7415g792k61N042k864m13R96O5J97J1375P672j0322l612Q725P979j0419l686j910
7399G72m964k065M637L809o984p988l674P204J798K760p149O409L561o17k299
7384d790k431L929N746J762r166r033O452O501j866n020k497J297N773O570m197
7369i70p01K798o296K432j607l470K678k696M57N831L733j197K868j337N363Q63
7353H749n554j3590j121L720l122L008j274j91M500L209p800P984l250j890j675
7338h297L396j58j1508m044M473M944l985j676P296L252j408l233K345M282K117
7323b204M276n988L96L166o995J384L987P029l31K070R065l964N781r975k3275
$$ y = [-18447, -8602, -4478, -5708, -7449, -857, 7714, 17806, 18611, 14419, 5655, 1658, -3874, -4566, -7207, -7792, -8053, -3011, -5875, -6288, -5292, -5227, -5030, 6345, 14017, 3695, 83, 8808, 16787, 6368, 2682, 772, -4192, -6257, -1620, 2189, -4795, -12783, -16457, -9253, -7455, -4695, -11844, -5435, -1874, -2491, -4790, -7221, -3292, 2454, 4216, -4950, -13983, -7531, -1030, -2896, -7916, -10413, -9116, -3343, 3227, -970, -1671, 1127, -5169, -2737, -4344, -7814, -5136, -7832, -7375, -1544, 2189, 992, 3860, 2523, 7886, 8749, 3195, -10395, -11516, -7796, -10918, -7910, -9184, -9375, -4875, -1666, -9466, -1482, -4732, -6622, -8297, -4901, -5059, -16567, -20611, -16138, -11194, -15179, -16855, -9559, -6307, -7715, -10948, -8603, -4321, -2204, 2072, -3916, -3520, -354, -7349, -5965, -1978, 5051, 4720, 6790, 15855, 11891, 17672, 7697, -15578]
7308a5578p913P464O323j623n010K249j83k926m287J695J0666P245o022r92l175
7293a2067L159J034N387j2276K740K327N582m590m060k2P942R943J895j977n755
7278g38r18J716N996m631o584l767Q765P777L513l742p180L264J1371p664o050
7263A128j743O347j887l450o055L168N189p463J844q115l852N833k02N147K434
7248a677n585m116O619P490n143L123K335l713p605k741P612J083L527j831k084
7233b706o87K836L067O877o593K337l058n908m910j3J934K047J827J0462k856
7218D656j0819K756p16J884j791K586J113J040j805K447J754K164M015Q827O259
7203B4370m896k085J103j1446j0645M54m96j811j0100j315r807M375Q563N910
$$ y = [-15578, -23491, -16027, -9704, -11327, -16337, -14088, -14271, -17197, -21484, -19789, -9123, -1878, -7900, -8892, -12067, -8908, -7874, -2487, -14763, -12023, -9696, -4114, -8704, -12764, -12786, -4844, 5099, 6994, 5017, -738, -1656, 60, 6056, 1425, -5159, -8926, -161, 7616, 11129, 7387, 207, 3471, 14842, 7178, 1128, -615, 5732, 3845, 395, -5660, -2492, 2697, -4766, -2922, -11037, -14889, -9056, -9258, -4111, -1677, -7262, -11378, -4759, 2731, -2412, 711, 3046, -667, -8272, -11013, -3401, -2318, 1209, -622, -2706, -3393, -557, 2510, 9387, 2794, 5131, 2073, -3835, -8745, -8758, -6824, -4777, -2950, 7512, 4656, -6163, -3407, -4123, -2239, -4030, -1444, -331, 709, -1096, 1351, 3105, 5269, 9284, 18111, 24370, 19474, 17389, 18492, 7046, -3599, -3145, -3641, -5452, -15552, -16867, -26674, -22299, -13736, -7826]
7189g826J616m345O720o33l074l443l865M782K053k258N89k606P348J6682m397
7174G343p026j033j84L943J226q927o32K962q059l533j838R47P709O007O220m137
7158I88M427L558j1800j0018k670M685N741p306P03n251j95L804q55M268M513
7143e408M166L671K245J696O252L81r200j1169n81q57n564j693O516Q298Q214
7128F967n649p575K279K326o041r988J214R051P999O734J800l144l643n055J281
7113a444n613L106J776n942l800P312N871j4758p337L749J1422n503q56K312M33
7098i272j768k552P83k769P729M999o572p128J375N765L661J641J744o05k692
7083e661J1236J130K185o085p154j773K539l214p933O425l100L031j32N043M979
$$ y = [-7826, -6210, -10555, -3835, -4468, -7542, -10985, -14850, -10068, -8015, -10273, -9684, -12290, -4942, 11740, 7343, 317, -716, -900, 3043, 4269, -4658, -5290, -2328, -10387, -13920, -15758, -14811, -7102, -1095, 5125, 988, 5415, 8973, -2827, -12845, -15515, -10830, -5089, -12395, -11692, -16943, -17138, -13334, -14189, -9921, -5408, -1242, 2429, 4674, 6370, 12622, 13003, 3803, -7366, -7947, -8804, -14368, -16061, -9545, -1247, 6967, 1318, -6257, -3978, -1652, -7693, -17681, -16467, -7416, 583, 7317, 9117, 5973, 2330, -2725, -1444, -7057, -3951, -2175, -8117, -11917, -4605, 1266, -13492, -20829, -17080, -5658, -11161, -12017, -9705, -9272, -11040, -13592, -12809, -15578, -7849, -2850, -9422, -16550, -15175, -9410, -5749, -4108, -2364, -2969, -5661, 5575, 6705, 8890, 2805, -4349, -6122, -3583, -6797, -14730, -8305, -11405, -8374, -8506, -3463, 1516]
7068A516n706n265k387n742L040J1629j090K417L233q246j27J1218n165K824P700
7053I849J511j1890n701P803K143k055j3067k069J1583J2089K559J819p286j316
7039E972K809R29l85j312P20k499p758j344o249p110Q128J777p265j679M318N234
7023e714O240K693R161j779j1243m950P694N273l872j2046l033L29J1338R07j729
7008g31j3802m537O876q63M471J1280k647o015K22J217l026N17Q724J1768k17
6993A3237o821j496R49J400o245n268p256Q692P834K109n380K128K657j138o41
6978D761l524j823K002J0457N07j464O98K678q73n5r689k064o50N364J3532k89
6962A9568r117n503M40m555n699O699J944j18r78K466l260k308n365J871R688
$$ y = [1516, -4190, -9455, -11842, -17584, -14544, -2915, -4005, -1588, 1645, -6601, -6728, 4490, -675, 2149, 9849, 11360, -530, -6231, 1572, 3715, 1660, -11407, -13476, -1893, 10196, 12755, 14574, 7288, 5972, 8781, 9710, 9325, 8013, 8733, 6234, -1524, -2868, -9117, -16227, -8099, -6322, -13587, -15266, -10948, -5714, 526, 3219, 12380, 10601, -642, -5592, 2102, 7375, 3503, -8543, -11576, -11247, 91, 998, -731, -14533, -19070, -12194, -13057, -8586, 2694, 47, -5968, -5746, -4529, -7555, -7038, 1686, 13454, 13237, 6416, 4920, 5869, 7269, 1024, -4244, -11500, -2808, 5026, 7135, 1755, 3883, 6540, 5402, 4761, 1237, -586, 1416, 11873, 12380, 10916, 11614, 14292, 13419, 13364, 3675, 1611, 961, 6325, 19857, 19568, 10451, 4948, 5388, 833, -4866, 1833, 3777, 3659, 2681, 5147, 1887, -421, -5786, -3915, 5773]
6947E773j171m798p757P438M754p187j1815p097R693R884J31J499m810r878K327
6932a3014J3361j658o337L098p13O099k876k399m177j596M871J770o380P530N707
6917C286q964n182J641J4196R057j2134j2604P59k13m810L899K251J3063K117
6903F362j934J36l933j550P70m544M88N776q335M929k05o478P76K46K123m219
6887i592o331J340m234M377Q291K055k622J2025n401r30j124J451R903M839o53
6872A3394j2735K367O635L87o494j068J285o041p64K929n856K102j318K572L775
6857A170J996k56P79J55k953k101L500J536J299L415m519j1026o798k900M249
6842a2454R93n80L356L888Q441o990k853N997R01M125l54J168J012k155j0005
$$ y = [5773, 4602, -196, -7953, -515, 4239, -2948, -14763, -21860, -12167, -2283, -2152, -653, -5463, -15341, -13014, 347, -1311, -7648, -4550, -5263, 836, -2040, -4439, -8616, -10212, -5341, -3571, -9951, -2421, 3286, -5678, -10860, -9219, 4977, 14034, 1900, -10704, -9945, -10158, -14968, -11069, -8818, 4245, 6362, 4428, 4564, 631, -919, -149, -4693, -4205, 1571, -6764, -1835, -2040, -8518, -7742, -7496, -5373, -9592, -15923, -14583, -18817, -14440, -6149, -4094, -6716, 5309, -92, -1022, -2146, -695, 9208, 14047, 13394, 659, 3026, 9661, 10048, 3554, 2486, 3771, -2270, -3034, -105, -5961, -3859, -5177, -2605, 1170, 3166, 2910, 3689, 3844, 891, -1210, 2290, 3826, 5125, 8540, 4021, -7005, -13803, -16703, -12454, -11461, -12041, -8685, -4797, 3644, -3346, -6199, -202, 699, 4824, 4470, 5638, 6650, 4495, -5510]
6827e510L278n320n631l271q004n379J1501J746K671Q890L24O89J78p909N696
6812f051n02J471j119j751Q015n045L923M352P83q314J064o9q92L917O97K485
6796B964R788o327j030o901l229j2539M832J3963O516m969q97j0235j826J875
6782h015n178K229L043k229Q333p037n842N42P646Q025j1571o109M928m534M318
6767a1451K395k909n81m208K086O28O081k163N640m221o852J832n419R063P933
6752b146k999o50O979j412N20q92L770J973r402l428j132p559J295M432N93N702
6736d356J148N95N467K689r283o780P040J5239q753j383p01p178J452L104l767
6721e467R139J3704k394j3666n350L797O929Q19j679n756k160N684l312l097m80
$$ y = [-5510, -2232, -7552, -13183, -16454, -24458, -29837, -18336, -16590, -13919, -5029, -4705, -4016, -3838, -11747, -6051, -6553, -5082, -6201, -7952, 63, -4982, -1059, 3293, 4076, -4238, -3174, -3243, -4135, -218, 479, 2964, 12752, 6425, 5395, -1506, -4735, -17274, -12442, 1521, 8037, 3068, 2171, -8064, -9890, -8015, -13193, -10964, -7921, -10150, -1817, -8854, -14696, -14154, -6508, 1517, -10054, -16163, -11235, -15769, -11451, -9056, -11965, -12546, -16754, -14668, -14040, -7959, -10122, -4482, -8703, -15555, -13723, -19142, -10079, -2146, -5145, -5795, 1184, -228, 292, -600, 3170, 5143, -4259, -7687, -8819, -16378, -15083, -10651, -10058, -4356, -3208, -2613, 2854, 5543, -3740, -10520, -3480, 11759, 3006, 1623, 922, -6256, -4804, -1700, -5467, 3672, 17376, 14982, 1316, -4034, -237, 6692, 7511, 5832, 76, -2084, 3600, 288, -2809, -3289]
6706c289L207k105k436n251m173n7J0090J7362J338o102r354j0461l29J489R823
6691b48O346L423o824j1303J2182O612P33O735N508K812k526j0533q946l113o782
6676e924K61P10J0831M716m143K816j798j980k241o102j359r899Q79J3600J8567
6661A8934P782l738j4538m438J131l294J872Q822n634j369r535o016J536n04O820
6646b169l249l06L249j843M18J1650j664k176L138q975j1402q816M393R477N803
6631b472K123j0204j67J2301N236l25p654j1089m300m029K856J7126J0004k218
6617G188L694J208m560j0315p443K526n514p0J0981J1412K964j0143p021j881
6603f974j98K752K437k875R183p091m372K627j077J485l783J449M423m017L306
$$ y = [-3289, -82, -2187, -4623, -9874, -14047, -14104, -4014, 13348, 14686, 8584, -770, -11231, -11560, -10071, -248, 6098, 9521, 2697, -8606, 3576, 10188, 10921, 17656, 23164, 25976, 23450, 12917, 3971, 858, -5924, -5663, -4953, 5878, 10594, 6451, 9267, 7469, 5489, 3248, -2854, -4213, -14112, -13233, 367, 18934, 26716, 22978, 8440, 4002, 5133, 1839, 3711, 12533, 6899, 5530, -4005, -10021, -8485, -8989, -2169, -5418, -5724, -2475, -4318, -3900, 7750, 6086, 3910, 7048, -1927, -13329, -22145, -17752, -8275, -2472, -349, -10553, -10720, 1581, 6817, 6492, -1162, -12251, -16551, -20580, -17724, -598, 9406, 7188, 10882, 12090, 7530, -2785, -10228, -7702, -13216, -13286, -2305, 9107, 12071, 1928, -5093, -6974, -7172, -4420, -1983, -4858, 4325, -2766, -7138, -4511, -5588, -4103, -7886, -6437, -2014, -6031, -2725]
6588b725K593q148q619N40P629l091L17L505k560o94R195K600L193m226M076M173
6572G758J298j029o75j1121M63p013J80P588K689o87N742o138n215m962o468M005
6556a3585M328j267n140L349J993M718L30P988J0655l408r602l594o351J3266
6542C680R992p286j872j105o50j0694K163l476J956N971M354m238n120K622J1180
6527G477P427o46q805l303o917k088k177j93j020L189J1644O273j0824j568O886
6512E355J2928K803n433j0749m614P461j097j8816l034K031P290k218J563p22
6498g252j418O794O518J538l140j2940k626P406L476K90j661j0394O759j118L246
6483d522J086p224j403j529R446K60n651P52P208J7846J620j5980Q498j560q715
$$ y = [-2725, -132, -8280, -16899, -16359, -8730, -11821, -11504, -7999, -10559, -11253, -2058, 542, 3735, -491, 3585, 7758, 9056, 8027, 7352, -3769, -3306, -10319, -10139, -2551, 138, -549, 5193, -945, -6160, -11122, -17590, -13585, -9257, -10524, -15664, -12315, -10322, -5604, -5274, 2714, 13369, 9961, 359, -3235, -9586, 3680, 13672, 6386, 4514, 3409, 2759, -7935, -5772, -9248, -7292, -1321, 3033, -1205, -6325, -3703, 7477, 14904, 14258, 5453, 2150, -4767, -6855, -9032, -9225, -10245, -7056, 4588, 10861, 37, -1531, 5355, 18283, 21086, 15653, 4904, 290, 7751, 6654, -12162, -15196, -13165, -5875, -8093, -6530, -7252, -8670, -1876, 4642, 6180, 3040, -9900, -12526, -5120, -1644, -1354, -3015, -13409, -6650, -7768, -4522, -3436, -10660, -12063, -13592, -4146, -3886, -9537, -8785, -1577, 16269, 17889, 1909, 10407, 8847, 132]
6468A32R40j4006m145Q91J1337P591P353j672j3518k833k705J32j196M719K729
6453d251R230L234m791m897K807K894n410J483j665j2176k735J2635Q986k188
6439C156j2056j272M070L28J0002L793r725n084k280k307o779K521q359K789J3842
6424g361M151O596j461K922L038J373J60l165M701l768N764k328q123l646l725
6409d872J584J2370L369k14q051k706m767Q026J1567P175j2452j0325J2389O575
6395A9668K412n871o557l327N062K621J2268jj2227k983n925n337K862j277r866
6380h478K19Q07L272J4824K942r658p335l505M437J3083j702r309r537K698K714
6365d528j0962r632Q585J2255j0195o06M028l563Q770L156L88r593J590R431r32
$$ y = [132, 1072, -12934, -17079, -16188, -4851, 2740, 10093, 8421, -5097, -7930, -10635, -10503, -11699, -6980, -4251, 4979, 8213, 3422, -1475, 1332, 4226, -1184, 299, -1366, -13542, -16277, -3642, 5344, 3156, -8900, -10172, -6102, -5774, 4228, 8021, -1704, -6788, -9068, -11375, -18154, -15633, -23992, -21203, -7361, -3210, 3386, 1925, 4847, 7885, 9258, 9418, 6253, 10954, 7186, 12950, 10622, 2499, -1147, -4872, -3288, 9082, 12451, 12237, 4186, 1480, -3287, 4739, 16306, 23481, 11029, 704, 13093, 19668, 22080, 16209, 9652, 6325, 11387, 14008, 26276, 26275, 14048, 11065, 5140, -197, 2665, 1388, -8478, -8259, -7452, -4180, 10644, 13586, 3928, -3407, -6912, -2475, 10608, 8906, -403, -9940, -7242, -4528, -15490, -25122, -16537, -4282, -14477, -15083, -11055, -14618, -5848, -2692, -2304, -11897, -10307, -876, -1808]
6350a808J655j437L5p758L805L544j0363k044L021q96m123N637P275r45K497R604
6334G699R115j730o217p625r804r057k043L709N140m020J22N857P106M847M986
6319H085m532J349M145L065n192r223o656q55R654Q364o093q314l673k171M900
6304g147l677O04j951r12j210O683L518N560Q60j302J858n721M39m293M270L382
6288I61n988k949P99M832Q155P17M242n93o250M61R824j0020q880j247Q71l714
6272h779M11O621o845L97m609l683J0015O207n332n753m723r222O562N111N27
6257a3095n503k795M042L11K651J14N398P580J896J748j28k222O986k986q193
6242d196k743N605k701k212M610L047p184k166M266l212J1313K633r724q673L727
$$ y = [-1808, -153, -1590, -1555, -9313, -5508, -1964, -12327, -14371, -11350, -12246, -16369, -10732, -3457, -4402, -1905, 7699, 16814, 15084, 8867, 1242, -8562, -17619, -19662, -15953, -10813, -14833, -14711, -8854, -1748, 3099, 8085, 3553, 4902, 9047, 12112, 6920, -2303, -8959, -9814, -160, 8204, 2111, -6203, -9876, -12047, -7147, -10824, -10220, -12171, -13083, -14293, -7610, -4092, 1468, 2328, 1026, 2884, -2837, -2398, -6691, -2421, 961, -5027, -7976, -7177, -2345, 5810, 6527, 10769, 10176, 3926, 4387, 14211, 4191, -4689, -5936, -5065, -8779, -8368, -1747, -8592, -8195, -12804, -16487, -6472, -265, -5597, -11350, -16073, -25295, -18733, -13622, -13095, -18598, -21393, -17351, -17040, -14389, -14275, -8877, -1297, 599, 2347, 2219, -3, 6983, 3997, -4196, -6939, -1334, -4035, -6247, -1637, 1410, -5774, -7940, -3674, -6886, 4427, 7060, -2664, -11337, -7610]
6227g610P33j038j549n801J610K626J095j1182M815M948K075l813Q37Q402Q840
6212D988L365K350j140o171l015J471p25n530k147M587L13N144P76K513j042k186
6196C551n35q183M430O309m04J728o345m252r563j228J8O749n951N900Q472K640
6180C336O577k921o239o150l771L564j432o903K197k512k942L110N5M465J2145
6165B579R240o544q427l255L671Q643o436j0030N957J837j923O872k02N80N133
6150G695K241n932o309n290O591m171p352pN002J5311o579j2748N618k752J810
6135f872R245J2598j0095K522o302j3103l438P964J020n622j736N832Q210Q166
6121H389L148M095j527q317N341m077j1527l166O07l635P729Q880k912q856L131
$$ y = [-7610, -6877, -7915, -9464, -15265, -13655, -11029, -9934, -21116, -16301, -11353, -9278, -13091, -12254, -3852, 4988, 8353, 10703, 9563, 3392, 377, 1848, 1123, -4407, -6554, -1967, -1654, 3490, 4266, 6779, 5737, 3551, 3016, -5167, -737, 5572, 5168, 6896, 551, -3701, -13264, -14492, -14474, -7725, -13676, -7776, 696, 3336, 9913, 6992, 753, -5397, -9168, -5604, -7036, -13939, -11742, -14254, -17196, -14086, -14031, -9566, 2579, 11819, 5275, -3152, -6407, -2736, 5907, -529, -10559, -4602, -2765, -4688, 2184, 1982, 2562, 7695, 9936, 4004, -2305, -7595, -1004, -5175, -12527, -12534, -7532, 7779, 1200, -11548, -5930, -8682, -6872, 2373, 14971, 4876, 7398, 1096, -12007, -15445, -7481, -6461, -12083, -13819, -7987, 223, 8389, 11537, 15632, 14105, 5788, 11129, 7052, -4475, -7641, -7034, -10669, -2940, 5940, 3028, -5828, -2697]
6106b697L670k84p825J942M0L261L973k66m265l216n81O554K382j119k850m681
6090e962N065R348M064k532l868O120l236l287r087n592P386j210q516M296J4273
6075G262j470K257P063j577n170j4757j3128m064P921J0335O86n621K67O479Q833
6060E316L050R669k810r636n107m630L083K623m079n102M030M099K136k812k612
6045b782P037O220l084P76O914n367j2004j188m422M493J1375J1109l298o081
6031I698p16N667m599j2933k16N012O833j7035n440l42K643M537J916p1M035J1296
6015A0285n101n791p836q904P397J961L791o73o132n336L059Q197L038O167j897
6000B225m808P105m840o759l447P779J4354M202j527m006M699N181j1785n528
$$ y = [-2697, 973, 689, -7136, -5194, -5154, -1893, 2080, 1814, -2451, -5667, -6248, 306, 2688, 1569, -1281, -5962, -897, 8451, 12515, 9983, 6115, 12235, 8999, 5712, -3375, -8967, -1581, -2791, -11307, -7011, 7262, 5792, 8049, 15112, 13535, 8365, -6392, -19520, -23584, -15663, -5328, -4642, -10263, -9996, -3517, 5316, 8366, 18035, 15225, 5589, 482, -4148, -1065, 1558, -2521, -7623, -3593, 506, 2642, -170, -2782, 4255, 10475, 7391, 8167, 15081, 9714, -2290, -3478, -7900, -3407, 7968, 19077, 15779, 9698, 8982, 14649, 10050, -2883, -3099, 1913, 8746, -8289, -13729, -14071, -11428, -6891, -4975, -5046, -1011, 10285, 5184, -607, -8443, -17347, -9950, -7989, -4198, -4871, -11003, -16339, -13280, -5083, -2045, 4122, 2225, -2583, 4522, -318, -7077, -10524, -2745, 11609, 15811, 14284, 10278, 14977, 20158, 8373, 2845]
5986B845m198M835L972J38R41M57l920k312L284L341n358q860o86J2270N630r030
5970C349l197K185O285n629o977k996N939j267j726J68L107L160O06m975K228
5955B60l555K240N506J548J990K863j449o355P04j749k4m28n277K727P13k798
5939c084l293K742O046R772K320r801r392M938K743n90J460J871Q39k928l645
5924bj610J401J772k427q448m255N278O53l510p406O719L077p584k048N181N546
5908g663O957m404O790k860k846J210L74j8450n42J951Q313J3046P236p052p369
5893e309K75Q06m291m0M69N76L757j0328r318J3495J3225m524m113M893l936M821
5877D58n99M637J952m364L375J784N22o501n85K74p386k10P260K560r574k1J0754
$$ y = [2845, -1353, 3482, 7454, 7592, 8533, 8990, 5070, 2758, 6042, 9383, 4025, -4835, -5521, 6749, 12379, 3349, 152, 2337, 8622, 2993, -3984, -6980, -1041, -2308, -4034, -3866, -759, 2401, 3007, -1968, 260, -3295, -1055, 4451, 5999, 7989, 10852, 9403, 3048, 3752, 2003, 1979, 1551, -3726, -999, -286, -3084, -6377, -3635, 2411, 12183, 14503, 4702, -4690, 248, 2991, 2401, 3861, 5732, 6571, 3643, -2, -1612, -211, 1561, -866, -9314, -13569, -8291, -7638, -11148, -18554, -11835, -8758, -16342, -18390, -13209, -7663, -706, -5110, 1680, -1180, -4026, -2816, -2442, -20892, -21434, -19483, -11170, 1876, 9112, 2060, -5309, -5034, -4228, -8519, -8559, -8090, -7514, -3757, -14085, -23403, -9908, 3317, -1207, -5320, -427, -4363, 458, -141, 4496, 6448, 2084, 5459, 7243, 7765, 1264, 679, 953, -6433, -6643, 617, 3177, -6397, -6418, 4336]
5860D336M583p106p238Q978o387k219K706l318K477O081O802n5j0229o752O157
5845a184l179r92L80k018Q331J3131m534j1191N279K840q615o506J1546J3066
5831A6354P350r096j6838j0966J703J3115O127l113J6n437q78l166j908J0009
5817C272J171r733n663j616L9K398M79r599M32M507R16j142J678P443P46o8J0998
5800F258P631p318p818J832o737m769Q297o07r506N762M597K699o507L297p97
5785c686M216O620p104j1148l995R020J339N52L732n212R59N533n740n773q7N236
5769e538L222J2473P499p351j3797p898k059Q161N073q697N338N740l18k791o651
5754g594k026j485J446J3427O716n190r550l03J3756k088o894J528m200j513K503
$$ y = [4336, 8919, 1813, -5425, 3553, -2834, -5053, -2347, -5665, -3188, 2893, 9695, 9640, -589, -7341, -1184, -4363, -5355, -4975, -6993, 1338, 14469, 9935, -1256, 4023, 6863, -1752, -8258, 3288, 16354, 23704, 14608, -2230, -13196, -11493, 1622, 7749, 4636, 4652, -785, -1663, -4829, -6737, 3272, 4443, -5290, -10953, -12569, -12530, -10132, -9653, -19252, -18820, -14313, -13397, -14539, -12861, -5418, -4672, -4740, 6258, 13889, 6571, -1247, 585, -6152, -10921, -2624, -3231, -12737, -6975, -2378, 321, -6186, -2889, -3686, 530, 7150, 46, -11102, -15097, -6077, -4738, -4186, -454, -5666, -4707, 826, -4914, -10687, -10774, -5538, -2316, 10157, 17656, 10305, -3492, -11390, -13449, -5288, -215, -8912, -3574, 2166, 1848, -943, -7594, -9620, -11105, -9659, 3768, 10484, 5294, -4256, -4559, 9197, 7109, 215, 1743, -2457, -3970, -1467]
5739a467J5016J986n398k431j3877N288P450l765n496m201q282o309N535K671
$$ y = [-1467, 13549, 15535, 10137, 7706, -6171, -883, 6567, 2802, -2694, -6895, -15177, -21486, -15951, -13280]
$$ [...]
##END NTUPLES=NMR SPECTRUM
##END=
