##TITLE=Analysis number 321948
Compound Code km 08543
Project Code adrs
Chemist Name fudan
##JCAMPDX= 6.0         $$ Bruker NMR JCAMP-DX V2.0
##DATA TYPE= NMR SPECTRUM
##DATA CLASS= NTUPLES
##ORIGIN= Bruker BioSpin GmbH
##OWNER= nmr
$$ XWIN-NMR		Version 3.5
$$ Wed Sep  6 09:07:49 2006 GMT Daylight Time (UT+1h)  MAYBRIDGE\nmr@NMR_250MHZ
##.OBSERVE FREQUENCY= 250.131544655141
##.OBSERVE NUCLEUS= ^1H
##.ACQUISITION MODE= SIMULTANEOUS (DQD)
##.ACQUISITION SCHEME= undefined
##.AVERAGES= 16
##.DIGITISER RES= 18
##SPECTROMETER/DATA SYSTEM= dpx250
##.PULSE SEQUENCE= zg30
##.SOLVENT NAME= CDCl3
##.SHIFT REFERENCE= (INTERNAL, CDCl3, 0, 16.522)
##AUDIT TRAIL= $$ (NUMBER, WHEN, WHO, WHERE, WHAT)
$$ ##TITLE= Audit trail, XWIN-NMR		Version 3.5
$$ ##JCAMPDX= 5.01
$$ ##ORIGIN= Bruker BioSpin GmbH
$$ ##OWNER= nmr
$$ C:\u/data/dgb/nmr/ADRS/240/pdata/1/auditp.txt
$$ ##AUDIT TRAIL=  $$ (NUMBER, WHEN, WHO, WHERE, WHAT)
(   1,<2006-09-06 09:07:29.42 +100>,<MAYBRIDGE\nmr>,<NMR_250MHZ>,
      <created by zg, POWCHK disabled, PULCHK disabled
       configuration hash MD5:
       E2 DF 36 D8 04 B2 41 60 5A D7 A3 38 5A 4B D0 FE
       data hash MD5: 64K
       C8 0B 1C 2D 34 B5 00 FC 00 0F FE 51 CD DC 67 F6>)
(   2,<2006-09-06 09:07:40.38 +100>,<MAYBRIDGE\nmr>,<NMR_250MHZ>,
      <Start of raw data processing
       ef LB = 0.3 FT_mod = 6 PKNL = 1 SI = 32K 
       data hash MD5: 32K
       B2 5D 2A 21 04 27 79 C7 E6 EB 94 DC 91 74 F7 5F>)
(   3,<2006-09-06 09:07:42.38 +100>,<MAYBRIDGE\nmr>,<NMR_250MHZ>,
      <apk 
       data hash MD5: 32K
       11 04 DE F5 B5 89 70 3D 34 77 93 AE 78 36 AF 5B>)
(   4,<2006-09-06 09:07:43.13 +100>,<MAYBRIDGE\nmr>,<NMR_250MHZ>,
      <abs ABSG = 5 
       data hash MD5: 32K
       FC 8E 9F 3E 24 22 1F EB EB 15 4D CE E7 17 9E F4>)
$$ ##END=
$$ 
$$ hash MD5
$$ FF 50 52 B8 96 6E 7C 67 1A D3 D2 2F A2 DA 91 29
##$RELAX= 
##$RELAX= 
##$RELAX= 
##$RELAX= 
##$RELAX= 
##$RELAX= 
##$RELAX= 
$$ Bruker specific parameters
$$ --------------------------
##$DU= <C:\u>
##$EXPNO= 240
##$NAME= <ADRS>
##$PROCNO= 1
##$TYPE= <nmr>
##$USER= <dgb>
##$AMP= (0..31)
100 100 100 100 100 100 100 100 100 100 100 100 100 100 100 100 100 100 
100 100 100 100 100 100 100 100 100 100 100 100 100 100 
##$AQSEQ= 0
##$AQ_mod= 3
##$AUNM= <au_zg>
##$AUTOPOS= <47 >
##$BF1= 250.13
##$BF2= 250.13
##$BF3= 250.13
##$BF4= 250.13
##$BF5= 500.13
##$BF6= 500.13
##$BF7= 500.13
##$BF8= 500.13
##$BYTORDA= 1
##$CFDGTYP= 0
##$CFRGTYP= 5
##$CHEMSTR= <none>
##$CNST= (0..31)
1 1 145 1 1 1 1 1 1 1 1 1 1 1 1 1 1 1 1 1 1 1 1 1 1 1 1 1 1 1 1 1 
##$CPDPRG= <>
##$CPDPRG1= <>
##$CPDPRG2= <>
##$CPDPRG3= <>
##$CPDPRG4= <mlev>
##$CPDPRG5= <mlev>
##$CPDPRG6= <mlev>
##$CPDPRG7= <mlev>
##$CPDPRG8= <mlev>
##$CPDPRGB= <>
##$CPDPRGT= <>
##$D= (0..31)
0 1 0 0 0 0 0 0 0 0.06 0 0 0 0 0 0 0.0002 0 0 0 0 0 0 0 0 0 0 0 0 0 0 
0 
##$DATE= 1157530048
##$DBL= (0..7)
120 120 120 120 120 120 120 120 
##$DBP= (0..7)
150 150 150 150 150 150 150 150 
##$DBP07= 0
##$DBPNAM0= <>
##$DBPNAM1= <>
##$DBPNAM2= <>
##$DBPNAM3= <>
$$ [...]
##$SUBNAM7= <"">
##$SUBNAM8= <"">
##$SUBNAM9= <"">
##$SW= 20.6930455092707
##$SWIBOX= (0..15)
0 0 3 0 0 0 0 0 0 0 0 0 0 0 0 0 
##$SW_h= 5175.983436853
##$TD= 65536
##$TD0= 1
##$TE= 295.16
##$TE2= 300
##$TE3= 300
##$TEG= 300
##$TL= (0..7)
0 120 120 120 120 120 120 120 
##$TP= (0..7)
150 150 150 150 150 150 150 150 
##$TP07= 0
##$TPNAME0= <>
##$TPNAME1= <>
##$TPNAME2= <>
##$TPNAME3= <>
##$TPNAME4= <>
##$TPNAME5= <>
##$TPNAME6= <>
##$TPNAME7= <>
##$TPOAL= (0..7)
0.5 0.5 0.5 0.5 0.5 0.5 0.5 0.5 
##$TPOFFS= (0..7)
0 0 0 0 0 0 0 0 
##$TUNHIN= 0
##$TUNHOUT= 0
##$TUNXOUT= 0
##$USERA1= <user>
##$USERA2= <user>
##$USERA3= <user>
##$USERA4= <user>
##$USERA5= <user>
##$V9= 5
##$VALIST= <valist>
##$VCLIST= <CCCCCCCCCCCCCCC>
##$VD= 0
##$VDLIST= <DDDDDDDDDDDDDDD>
##$VPLIST= <PPPPPPPPPPPPPPP>
##$VTLIST= <TTTTTTTTTTTTTTT>
##$WBST= 1024
##$WBSW= 4
##$XGAIN= (0..3)
0 0 0 0 
##$XL= 0
##$YL= 0
##$YMAX_a= 545715
##$YMIN_a= -628323
##$ZGOPTNS= <>
##$ZL1= 120
##$ZL2= 120
##$ZL3= 120
##$ZL4= 120
##$ABSF1= 16.522
##$ABSF2= -4.171173
##$ABSG= 5
##$ABSL= 3
##$ALPHA= 0
##$AQORDER= 0
##$ASSFAC= 0
##$ASSFACI= 0
##$ASSFACX= 0
##$ASSWID= 0
##$AUNMP= <proc_1d>
##$AZFE= 0.1
##$AZFW= 0.1
##$BCFW= 0
##$BC_mod= 0
##$BYTORDP= 0
##$COROFFS= 0
##$CY= 12.5
##$DATMOD= 1
##$DC= 0
##$DFILT= <>
##$DTYPP= 0
##$F1P= 14.0000005364418
##$F2P= -0.99999901652339
##$FCOR= 0.5
##$FTSIZE= 32768
##$FT_mod= 6
##$GAMMA= 0
##$GB= 0
##$INTBC= 1
##$INTSCL= 1
##$ISEN= 128
##$LB= 0.3
##$LEV0= 0
##$LPBIN= 0
##$MAXI= 10000
##$MC2= 0
##$MEAN= 0
##$ME_mod= 0
##$MI= 0
##$NCOEF= 0
##$NC_proc= -3
##$NLEV= 6
##$NOISF1= 0
##$NOISF2= 0
##$NSP= 0
##$NTH_PI= 0
##$NZP= 0
##$OFFSET= 16.522
##$PC= 1
##$PHC0= 146.5755
##$PHC1= 4.166613
##$PH_mod= 1
##$PKNL= yes
##$PPARMOD= 0
##$PSCAL= 4
##$PSIGN= 0
##$REVERSE= no
##$SF= 250.13
##$SI= 32768
##$SIGF1= 0
##$SIGF2= 0
##$SINO= 400
##$SIOLD= 32768
##$SREGLST= <1H.CDCl3>
##$SSB= 0
##$STSI= 32768
##$STSR= 0
##$SW_p= 5175.98343685301
##$SYMM= 0
##$S_DEV= 0
##$TDeff= 65536
##$TDoff= 0
##$TI= <Analysis number 999999
Compound Code 99
Book Reference 9
Project Code 9>
##$TILT= no
##$TM1= 0
##$TM2= 0
##$TOPLEV= 0
##$USERP1= <user>
##$USERP2= <user>
##$USERP3= <user>
##$USERP4= <user>
##$USERP5= <user>
##$WDW= 1
##$XDIM= 32768
##$YMAX_p= 464691572
##$YMIN_p= -51446
$$ End of Bruker specific parameters
$$ ---------------------------------
##NTUPLES= NMR SPECTRUM
##VAR_NAME=  FREQUENCY,     SPECTRUM/REAL,   SPECTRUM/IMAG
##SYMBOL=    X,             R,               I
##VAR_TYPE=  INDEPENDENT,   DEPENDENT,       DEPENDENT
##VAR_FORM=  AFFN,          ASDF,            ASDF
##VAR_DIM=   32768,         32768,           32768
##UNITS=     HZ,            ARBITRARY UNITS, ARBITRARY UNITS
##FACTOR=    0.157963299565203, 1,           1
##FIRST=     4132.6476996994, 0,             0
##LAST=      -1043.33573715361, 0,           0
##MIN=       -1043.33573715361, -51446,      0
##MAX=       4132.6476996994, 464691572,     0
$$ Real data points
##PAGE= N=1
##DATA TABLE= (X++(R..R)), XYDATA
$$ [...]
21018 6345 4470 1147 1150 192 -20387 -31163 -26176 -20765 -16263 -9644 4099 -4395 -25070 -30761 -27305
21003 -27305 -10299 869 5894 -2163 -11023 -1864 1390 4433 9327 11773 -2208 4431 21261
20990 21261 18746 12481 -2235 2001 5537 9668 10884 4057 -6113 1271 2280 -8642 -8655 -7586
20976 -7586 -8652 -6811 -2033 8109 11529 1200 -4011 493 2500 -3654 -7953 4451 13292 13531
20962 13531 -5080 -18700 -7552 3527 -13151 -24706 -28665 -18344 -25533 -21326 -6339 2616
20950 2616 1470 225 8295 8047 126 -349 5010 -12892 -21836 -25464 -18070 -11245 -14375 -15292 -13677
20935 -13677 -17820 -3273 6047 -7082 -3534 3544 2252 3483 3589 10411 12860 335 5853 2850
20921 2850 -4659 -3154 2638 4792 12954 19126 19804 8337 5961 15671 12507 2364 -1844 170
20907 170 -4377 -8190 -6804 -11070 -1313 10104 -1008 11324 9309 -12544 -24831 -26269 -21528 -12923
20893 -12923 -1497 6496 8939 5865 -764 -13689 -11618 -4829 -11201 -9619 1057 4126 5418 5828
20879 5828 -6453 -17621 -6918 -10779 -23712 -22934 -20942 -16140 -13331 -1972 -7314 -9248 -14774 -7172
20865 -7172 -7096 -29349 -30818 -14453 -15811 -15549 -17220 -15392 -24711 -39126 -47528 -31087 -11630 -2993
20851 -2993 17669 24191 11820 12743 12055 -5769 -8121 -7560 -12451 -5583 12465 9101 -9823 717
20837 717 14243 11733 10896 -310 -732 -2924 -8390 -9853 -9829 -4075 -1132 -6720 -8329 -10488 -2107
20822 -2107 -2910 -5295 7216 8552 -2703 -19683 -18134 -12144 -12572 2454 9501 17765 27988 17041
20808 17041 855 -7261 -14327 -20289 -30454 -28293 -23286 -10881 -4170 -3663 -2501 -14387 -10048 9558
20794 9558 11805 8976 13305 564 -6954 -2908 -6073 -9992 -8843 -2721 11110 12619 7956 4993
20780 4993 8433 -2045 -10073 -13042 -25240 -33406 -23642 -14979 -1629 -5455 -12190 -5353 1053 -3304
20766 -3304 2323 15268 8547 2206 -3543 -13451 -10749 -10286 -6879 -15301 -19432 -4355 4649 9490
20752 9490 4293 2560 9486 16668 16281 12639 21921 9448 -3689 -9054 -5269 -7690 -12230 -19911
20738 -19911 -22777 -23318 -28849 -24804 -14185 -21983 -6559 -1101 -9543 -9177 -10708 -1169 2227 -2557
20724 -2557 -330 9613 10622 -461 -665 8824 13637 20844 17983 5534 4980 11905 13073 10597 18351
20709 18351 34908 35729 24494 9856 -7655 -4759 -1492 4572 10300 24016 18027 13740 -1101
20696 -1101 -11722 -22429 -10716 6045 -5634 -14412 10257 957 -1025 -6572 -6862 -5258 -1993
20683 -1993 5961 22850 18014 8060 15943 23707 13521 17733 28723 4960 -5162 -9057 -15007
20670 -15007 -11009 -546 -7180 1590 15285 5748 -4132 3643 11695 22206 15054 -3236 -6500
20657 -6500 -3971 -6691 10106 105 -20320 -32726 -39965 -34053 -15854 -16798 -21571 -13338 -13168 -21603
20643 -21603 -19770 -9104 8699 11396 -2928 -12614 -8299 -7295 -13736 -3283 2375 8511 14137
20630 14137 14931 7183 -2400 6749 10207 20897 28132 26865 31566 22924 27976 29387 10821 -1994
20616 -1994 -7360 -3613 4796 7140 13436 16401 15712 16410 17390 13575 5766 6900 9791 13406 5341
20601 5341 -2 7284 5781 -6517 -2671 -42 354 4541 15814 25430 3417 -18471 -17816 -22030
20587 -22030 -17637 -18325 -15187 -7519 -10226 -11439 -12913 -1977 3374 1515 8018 8811 2662 -8195
20573 -8195 -13353 -18241 -23304 -6171 9282 12343 361 -11127 2494 1055 -1219 -4979 -9068
20560 -9068 -8754 -15862 -11020 -12668 -12730 -15802 -24843 -21182 -8029 -792 13718 15609 18585 18501 8684
20545 8684 -37 6079 8758 6806 17227 23970 7613 -2006 1342 -5430 -10068 -4906 -7185 -10723
20531 -10723 -21239 -26503 -15892 -18322 -25152 -17690 -15033 -21546 -25840 -21656 -27423 -19780 -10037 -5872
20517 -5872 -10678 -306 5190 -5250 -15697 -13802 -3445 -1011 -5295 -1793 -6445 -16353 -28113
20504 -28113 -30468 -21477 -21400 -21867 -24343 -22890 -23127 -14614 -5663 -2690 1388 11354 15373 22817 16470
20489 16470 9659 -4563 -13531 -964 17864 18826 -1056 -16453 -26298 -15311 -211 8219 -1834
20476 -1834 -7694 -21805 -30915 -20299 -20136 -15491 -11295 -5675 4131 -4173 -11258 -8719 -6906 -7608 -2409
20461 -2409 4453 14790 24265 15547 16489 11953 -1340 -9515 -15856 -12636 -15434 -8124 -9631 -6392
20447 -6392 6452 7451 3207 -1227 -6537 -6669 -916 2454 -5065 -1871 -952 4935 -176 -4595 1603
20432 1603 12204 11242 -3131 -6283 3997 7669 2004 6483 11682 15370 6981 6767 -2042 -2
20418 -2 -425 7387 1388 -818 691 -7089 -5149 -10404 -8788 -6894 -4886 -8915 -16354 -3572 -8402
20403 -8402 -9383 -5347 -13140 -5383 921 10486 6081 -587 337 -1217 8718 -4778 -10622 -18205 -6896
20388 -6896 2427 -2102 -2672 -2074 -1339 5432 5414 1333 -17423 -24034 -22301 -23224 -20080 -11207 -18002 -29142
20372 -29142 -10271 -6362 -11087 -10268 -1956 56 -5522 1265 -2961 -11972 -11770 -18532 -11820 -3823 -6092
20357 -6092 -5936 2306 -3724 -3199 -5012 1634 -1489 -7703 -7665 -19256 -9877 1669 3663 -3722 6239
20342 6239 12441 4487 6366 20315 20468 5195 737 5669 5877 7118 -1422 -19575 -17896 -9447
20328 -9447 -7914 -10981 -6539 -13152 -12767 -7640 -14 -1850 -1993 5094 5494 -117 -12636 -5943 -3199
20313 -3199 -15514 -13811 -16405 -20672 -14548 -9571 4124 16724 20679 21744 13252 -9569 -17190 -17454
20299 -17454 -22047 -9958 15313 17699 10047 15265 17857 19705 15591 5060 -5128 -14955 -10352
20286 -10352 -3130 1741 -9173 -12373 -12798 -16788 -7023 4072 4396 -941 2755 16412 16939 -1272
20272 -1272 -3605 -1046 1988 8933 3063 -7940 -8333 -4901 -7208 -26357 -26692 -24458 -12424 -4778
20258 -4778 9978 14029 3298 -10625 -21529 -19426 -6006 -4576 -5284 -8373 -18793 -15391 -8329
20245 -8329 -3434 -8332 3882 1593 1638 5515 -5869 -3283 -9090 -3929 -9484 -21091 -29084 -24454
20231 -24454 -21612 -4838 1868 -11381 -24576 -18132 -7911 -2913 952 -2207 -16386 -12423 -5345
20218 -5345 -309 -2992 -5766 584 13058 11143 2339 -13297 -16551 -13465 -5368 -10363 -30061 -26237
20204 -26237 -9912 -5093 -3857 -6820 -14988 1608 3451 -2365 -2907 -8487 -520 -447 -4234 -18801
20190 -18801 -30740 -16550 -7619 -4167 7097 10365 -3033 -14738 -10067 -2927 -2569 -17421 -16314
20177 -16314 888 8084 11522 12588 10253 313 8200 19695 9835 10195 6703 9271 1397 -7529
20163 -7529 -18658 -32653 -29064 -15560 -5472 7387 1207 -145 -6789 1194 17300 19679 10188
20150 10188 -1394 -13345 -12953 -13676 -17326 -7910 -6281 -2543 6085 6637 -3220 -1801 -12481 -6017
20136 -6017 6555 11173 12741 27166 25565 15735 1099 4223 -1954 831 15931 13102 6398 3042
20122 3042 3060 4654 3042 101 8759 5133 -4182 -8243 -9768 -15360 -26219 -9641 943 -402
20108 -402 12293 5619 -10707 -18342 -41274 -42407 -20178 -16466 -6900 -9593 -20516 -20056 -14617 -15367
20094 -15367 -9429 7557 21371 30496 33280 21979 17026 4731 2492 6836 14197 7403 2655
20081 2655 27 -1274 14212 19756 18969 21893 22597 6559 7439 10499 8153 9939 -10594 -13002 -11957
20066 -11957 -19379 -9916 -2959 2556 18343 17114 2632 8365 530 -8314 1978 1519 11507 17478
20052 17478 12720 9986 23729 13714 15631 15444 3969 -10833 -1622 1580 -8269 -8522 -3773 7539
20038 7539 18509 15571 11306 8574 1595 5449 7830 7497 4180 -5080 -18928 -15213 -5898 3195
20024 3195 10728 8908 11475 11748 12468 13808 17943 2146 -7150 -7836 -16260 -19047 -12976 6636 7955
20009 7955 -4971 995 2614 1517 1870 -10101 -15617 -1100 6664 14864 14966 14041 26672 20600
19995 20600 17129 4156 -6645 -11584 3817 12563 3638 12254 17991 13208 491 1547 -3734
19982 -3734 1997 10952 12532 14219 20281 15877 890 -10685 -235 17266 -1178 -13906 -11839
19969 -11839 -10978 -9811 -176 9967 25910 22493 4796 -10380 -21447 -8854 -7478 -14636 -16891
19956 -16891 -9177 -4808 -1346 6109 7764 1786 4714 20008 28536 24804 19417 -663 -8993 3216
19942 3216 -449 -3957 349 16505 24864 21756 6088 3542 -2759 -199 -5199 -18712 -9922 -18494
19928 -18494 -21123 -3484 11972 17076 6383 8444 9187 5309 8299 14768 7992 -1268 4057 7961
19914 7961 13477 15198 2099 1824 -8291 -2406 -12331 -22039 -11958 -990 -6979 -4864 -6000 -13891
19900 -13891 -14587 -15108 359 15141 18998 16373 -3275 -17992 -8888 -2559 6283 6261 -1887 -8353
19886 -8353 -5558 1145 4498 3813 1637 4176 10763 25889 20962 2078 491 10822 17153 8277
19872 8277 4083 2307 4178 -4709 -13055 -3964 23629 33341 16632 -413 7594 17318 21761 18632
19858 18632 11019 10972 7486 -1269 -7960 -14037 -7203 -3937 -3393 6046 11502 1069 4578 23600 19471
19843 19471 11821 5422 182 15524 12886 15978 22129 13422 9740 -4325 -19964 -20359 -19067 -3579
19829 -3579 3733 1877 -1471 -12432 -22357 -5365 8552 12951 12739 10057 -4141 -12497 -16432 -11387
19815 -11387 -3135 13525 972 -9252 -9074 2063 -436 -15121 -29466 -19970 -4393 4718 -1909
19802 -1909 -9070 -13589 -14652 -14934 -12586 -16645 -10863 -6427 -761 -1235 7664 7730 -1676 -5790 -2460 15720
19786 15720 17163 19565 15838 9519 -7013 -15403 -16370 -29325 -20073 -4152 3508 4910 -8162 -10096
19772 -10096 -17989 -15189 -19330 -33009 -28081 -17346 -1080 9492 -5324 -16878 -12957 -5933 1489
19759 1489 -6023 -2553 5014 13492 21454 19676 3022 4917 7517 12032 6162 6470 -4194 -25519
19745 -25519 -20427 -10889 5296 8679 -6659 -8802 4142 21240 10037 -8553 -6655 -9469 -10923
19732 -10923 -3649 -7733 -15644 -20099 -5242 -3001 -4386 9805 12327 14154 11964 9434 17072 9960
19718 9960 -220 -7879 -2311 -739 2997 3180 10252 -2786 -3953 -3185 -927 -3222 -9526 -18229 -11447
19703 -11447 2556 11786 7549 -2120 -6506 -5162 -6188 6324 7674 15909 19291 19547 7201 12765
19689 12765 16121 -212 -6760 -802 -6250 -3556 7754 15133 707 -2305 663 -2468 16420
19676 16420 14622 8094 18530 30992 27048 7492 5921 16549 30316 26133 2728 370 17088
19663 17088 16522 9706 10629 9042 14515 25514 28378 14917 -2998 -17174 -5245 -673 -9490 -11720
19649 -11720 -4852 -5259 -11968 787 9981 13745 15744 4607 -7918 -17516 5470 11016 10475 6800
19635 6800 4518 -7372 -12558 -12246 6712 13920 21851 27666 25903 20118 24341 26255 22245 16836
19621 16836 18485 19369 19812 33030 29262 27645 41710 34405 26734 28615 26412 21028 3797 2514
19607 2514 6465 10358 12648 13394 11032 -4162 -643 12500 30088 30004 24609 16415 20425 14002 5210
19592 5210 7655 1515 -5041 4514 13253 15765 20321 13728 15850 28206 23432 14287 15945 14591
19578 14591 16753 10919 5852 12564 10999 540 6689 10696 7408 18284 24647 21760 9275 7611
19564 7611 1701 -975 5530 4503 10943 14226 13146 -4282 6430 14899 18732 14480 10552 23227
19550 23227 32776 27616 25549 21117 8405 -1815 10605 28623 23861 27891 31298 43412 37035
19537 37035 33118 42791 29693 18551 10686 282 927 8772 15148 36458 48137 45832 27813
19524 27813 21241 12001 823 -525 7639 31965 25785 12826 9762 14594 15951 -3025 -15552
19511 -15552 -22884 -14860 352 7893 -2447 -2203 8038 27909 32328 25487 25615 18163 16016 22590
19497 22590 31654 31560 32560 42924 37044 29814 45298 49215 52701 36855 24031 27146 31987 37394
19483 37394 23459 10297 4915 24178 54026 69947 89582 125687 172207 214783 266122 302289
19471 302289 305763 298613 267111 214422 161540 122215 106491 106975 98000 88058 83862 79603 69529
19458 69529 64205 74943 83803 93661 93793 93387 89160 91451 85208 91427 103494 105267 123537 159231
19444 159231 215090 274395 319793 320803 315451 296694 266796 208893 156150 137542 121095 101448
19432 101448 86949 79061 78881 83059 78762 81301 81552 79037 83076 92917 118669 147533 177345 237712
19418 237712 281820 316827 334203 333401 299658 251941 201606 165965 152677 131788 107012 94370
19406 94370 88987 75269 74963 69059 66727 64390 69838 69425 57940 61579 67697 77280 92075 90755
19392 90755 95364 117195 153173 203023 255563 305170 333219 335791 328612 296937 227739 158495
19380 158495 119697 106069 89166 74443 70933 72093 76807 65468 60011 54727 54414 55199 54374 49146
19366 49146 46643 35513 37692 36325 31692 29456 34221 42105 46433 49570 52168 36503 23557 20578
19352 20578 31361 38815 27472 10390 9136 14885 12420 15404 17229 23081 35491 42887 33837
19339 33837 26105 30376 32281 24637 17431 16539 22392 27402 33155 29510 23862 16557 20755 41746
19325 41746 52162 45603 52298 50775 21763 22997 47665 46349 27568 16164 13648 11928 13654
19312 13654 19420 35962 40099 41907 48303 35050 30346 27951 27733 41048 46323 44389 36388 40299
19298 40299 40701 33615 21293 18721 25371 27514 30224 42358 52623 54815 37030 27267 22575 29159
19284 29159 36734 34873 31958 20740 24982 30759 17715 16126 27648 30549 37776 52596 58213
19271 58213 45648 31647 33724 55007 53395 44430 39512 40300 33504 24390 26245 25893 20621 29648
19257 29648 20937 25586 44277 42024 38600 42211 31256 21351 25123 25869 36452 29440 32176 27508
19243 27508 26762 33279 42832 47675 43810 43861 50133 48815 60466 60527 49189 44534 38627 28214 27380
19228 27380 33099 36211 26488 28972 37822 25812 22743 25385 35355 28588 31232 42158 45086 44330
19214 44330 41771 38745 48139 47669 40005 31861 32584 43446 34607 30929 34901 44124 51415 60063 63691
19199 63691 47715 36229 25707 22138 29692 31754 32559 33379 31008 35707 43800 41778 40358 40369 42373
19184 42373 53118 48050 39452 55648 70730 68584 69883 69376 59117 52034 48920 32766 35946
19171 35946 36356 31907 30358 38013 36342 27659 28301 25151 41805 45156 50524 63035 68273 62595
19157 62595 54720 70100 80008 81904 79660 83647 83424 72190 66435 61001 64051 65166 59788 45872
19143 45872 41101 59778 74643 71977 71523 70067 59580 61193 52224 58960 72640 74312 88353
19130 88353 85526 85944 95281 105920 104605 98160 101175 105656 95425 83592 81410 76610 80303 86848
19116 86848 97411 121921 132956 137822 145802 176903 172584 159071 165372 164784 151503 134765 119001
19103 119001 113164 120331 137630 134102 137246 143543 138820 133271 124771 119471 109193 118105 112989 92085
19089 92085 91147 100696 97153 108934 117916 145430 162697 157914 163485 157209 143821 124810 129797
19076 129797 135635 132872 136228 129278 133750 127889 136369 146453 159654 172434 162636 160252 170991
19063 170991 188314 208798 227605 242201 258095 257946 242252 232859 225009 234333 225870 214199 221437
19050 221437 220505 207641 202693 208116 202527 201609 187031 173425 157490 154954 166981 176246 166092
19037 166092 164096 185806 192153 182969 190149 196675 219053 234650 253832 284439 284921 281686 292660
19024 292660 291423 276328 271484 287116 281592 263848 259324 256387 242949 232937 242095 245637 241893
19011 241893 255453 263354 262565 270956 283266 285403 285940 308975 320872 329189 347367 371279 406615
18998 406615 457493 489834 509387 541673 576951 616334 658093 718822 772431 799092 793448 784452
18986 784452 751400 721530 723010 740792 775964 844554 928917 1017366 1100119 1157368 1205290 1265884
18974 1265884 1337352 1421365 1526580 1653550 1820334 2053901 2372173 2768212 3262003 3947476
18964 3947476 4866057 6127832 7919464 10672765 15298371 22860765 32595638 41406532
18956 41406532 47494647 49856883 49318669 46156318 38442797 27709287 19514102 14842988
18948 14842988 12242659 10709931 9726445 9073101 8640197 8294719 8001873 7801878 7701449
18939 7701449 7661830 7704386 7845525 8085327 8451040 8965291 9670921 10679397 12247261
18930 12247261 14908845 19761541 28067621 38835375 48245973 54495602 55696200 53056497
18922 53056497 47965189 38343056 27479060 20315315 16312681 14011754 12655036 11847731
18914 11847731 11403891 11181166 11127111 11209882 11498916 12073771 13045183 14593789 16997611
18905 16997611 20761889 26863361 36033952 46695878 55862532 61810839 62506953 58719946
18897 58719946 50972541 39036301 28472748 22073327 18422497 16192363 14734866 13702708
18889 13702708 12958684 12383009 11877247 11470025 11143355 10889964 10741398 10686459 10748744 10944248
18879 10944248 11309311 11883738 12772037 14122162 16365063 20317664 27411673 38234274
18871 38234274 49596468 58204044 62273687 61017841 56817303 48801763 36522566 26201772
18863 26201772 20100023 16607842 14477217 13085126 12123792 11409479 10856825 10394315 9990172
18854 9990172 9593797 9223713 8898966 8608111 8338126 8106230 7912584 7700116 7427683
18845 7427683 7124630 6813093 6486924 6163952 5878615 5643673 5469969 5346874 5230067
18836 5230067 5105441 4979460 4855728 4740783 4602458 4455393 4318427 4183996 4034389
18827 4034389 3859850 3691100 3529523 3383407 3247242 3129569 3028908 2939472 2844207 2744331
18817 2744331 2662005 2585785 2528738 2475076 2407049 2353531 2298459 2260490 2194932 2135658 2084329
18806 2084329 2039336 1999452 1983079 1968347 1932507 1894598 1853309 1807561 1758147 1676650 1619071
18795 1619071 1580833 1553909 1500353 1444164 1407420 1389664 1383204 1386076 1424355 1464191 1509175 1551459
18783 1551459 1580177 1601066 1614033 1624898 1603595 1594793 1593603 1544335 1483660 1423794 1349094 1289923
18771 1289923 1257922 1252246 1250100 1226394 1194866 1148535 1114431 1065985 998577 952784 892965 852037
18759 852037 822158 792318 779470 772530 770648 779297 782944 819429 872695 924648 977864 1035295
18747 1035295 1088514 1092326 1050306 1002688 954597 877337 778851 686360 639625 604416 572622
18736 572622 544290 504334 477606 471049 464582 458572 472914 503014 553874 614659 670036 710467
18724 710467 744383 779049 780214 765042 733281 681878 624093 556152 494548 446896 406666 401022
18712 401022 397971 392698 387638 381881 376820 360030 346243 333086 325976 323463 327731 333121 330694
18699 330694 349816 366927 414627 472209 531648 572969 604607 637648 658522 635740 593831
18688 593831 548472 503177 450307 390614 352459 337114 307258 290601 288123 286249 288896 283179
18676 283179 269295 258891 255066 250577 245819 240568 244173 245617 238578 237167 237045 233387 232104 233090
18662 233090 243088 229925 217284 207314 198075 197198 196390 195680 198605 197421 188529 188705 197428 198537 199854
18647 199854 192318 171943 171833 185659 184188 159299 144351 147220 135309 123876 127283 127730 137290
18634 137290 142734 126246 107239 113649 136164 151581 145151 143730 145912 152533 145426 156535 144302
18621 144302 145582 142935 142911 132253 130867 129452 118657 118828 125476 123511 122867 131596 144316 137374
18607 137374 124406 122026 127496 139161 139675 128465 132469 146212 145481 128741 136003 121505 116747
18594 116747 126666 144165 141964 129489 112801 110902 116648 116457 109539 111117 122815 134355 150392
18581 150392 139455 123382 112168 104728 87567 82562 95386 107384 124045 150759 169886 161591
18569 161591 147785 144988 139741 137691 137135 124215 113309 105819 95845 97214 100872 99640 101272 103388
18555 103388 105093 120170 116822 116886 121797 119103 115513 119740 142881 148978 148290 155523 152797 152725 159906
18540 159906 175668 187894 202927 209463 204821 196036 198911 220844 240328 275802 311201 334408
18528 334408 358552 395025 440594 491243 531513 567942 598936 630771 647985 642133 651744 673407
18516 673407 683606 682953 667501 642590 621609 596466 560677 528997 494017 460586 438299 416725
18504 416725 378361 356931 342894 334870 318572 299772 297647 283092 266495 251222 235924 231604
18492 231604 230852 227859 212971 205310 197665 212795 225674 235595 245237 238573 218951 201352 213112
18479 213112 229240 239946 239942 228808 218579 215081 209469 208806 211974 212029 217045 230123 255127 286123
18465 286123 322619 344260 369660 399597 421782 430486 425112 389942 331854 301766 273719 259867
18453 259867 270822 293848 309352 326520 355693 392765 436067 448851 446318 419993 391687 373858
18441 373858 365998 357571 350992 367894 400908 439498 468614 491813 508542 512129 510651 484737
18429 484737 446995 428672 414702 389409 367283 351167 342408 336658 331918 332224 346307 352038 356227
18416 356227 375173 376297 389092 406497 429126 463218 509831 549459 586689 643988 708676 777202
18404 777202 828454 858976 851909 808796 755119 693468 650251 621105 628657 666704 723193 775231
18392 775231 789735 795830 782215 763495 724244 673455 661373 675446 685588 707947 747531 792978
18380 792978 850331 893228 916828 931332 944835 932603 883925 850811 832383 824177 807294 791429
18368 791429 786596 793842 814528 841376 889400 954037 1031211 1117678 1224450 1321952 1405588 1490963
18356 1490963 1583923 1657107 1745941 1880259 2066088 2290240 2571953 2897386 3234682 3594903
18346 3594903 4017240 4529659 5181405 6014048 7159006 8857661 11601544 16256783 23648435
18337 23648435 32738397 41277871 47481270 50430336 51205612 48903057 42288942 33136342
18329 33136342 25000419 20238549 18223466 18024980 19160837 21547031 25541662 31644651
18321 31644651 40045056 49455130 57138157 61378602 60308575 54724213 45562848 34857101
18313 34857101 25931511 20399178 17205454 15293809 14059981 13184171 12488490 11867303
18305 11867303 11301270 10826755 10436192 10108126 9815572 9553452 9315806 9095816 8880823
18296 8880823 8629644 8353253 8077463 7827799 7602751 7425731 7314818 7264072 7293333 7389013
18286 7389013 7539197 7776791 8133242 8621560 9265291 10175616 11569791 13891931 17928213
18277 17928213 24700087 34036359 43925861 51733429 55602605 55440204 51805880 44654244
18269 44654244 35288400 26836856 21724706 19346545 18659789 19260330 21281386 25412712
18261 25412712 32613411 42384982 52428167 59861582 62889656 61594292 56663650 48176974
18253 48176974 37590878 28164051 22093226 18621661 16551923 15181243 14202720 13452277
18245 13452277 12824839 12266690 11823173 11437979 11084848 10731631 10350525 9949722 9537184
18236 9537184 9149195 8753522 8333981 7932473 7570609 7260874 6943964 6655854 6412634
18227 6412634 6212745 6064377 5930474 5785441 5616293 5438549 5229799 5006273 4779435
18218 4779435 4564347 4384781 4235845 4113128 3990108 3858260 3737991 3637000 3523818
18209 3523818 3428434 3335525 3233131 3144512 3055179 2976014 2920419 2873555 2822144 2770805 2705081
18198 2705081 2625712 2565291 2503279 2462008 2430480 2409370 2374200 2334319 2268774 2225182 2171327
18187 2171327 2118661 2066622 2038742 2037958 2047880 2094200 2143325 2181582 2202118 2175939 2115814 2031548
18175 2031548 1934623 1838603 1752543 1691617 1659775 1655482 1658755 1673723 1698153 1715303 1752781 1791900
18163 1791900 1784475 1754974 1685806 1581635 1491877 1418607 1346292 1304614 1287443 1274750 1252889
18152 1252889 1237536 1235471 1236639 1225180 1235631 1255098 1267273 1263955 1253997 1237030 1205041 1196174
18140 1196174 1181766 1142638 1112631 1096393 1093605 1086384 1082468 1072094 1049906 1018753 989387 938767
18128 938767 889420 874991 869761 851141 856222 863949 884073 912400 937568 969102 1000944 1034664
18116 1034664 1092039 1176465 1286716 1447988 1667153 1975292 2469698 3338547 4988110 8150176
18106 8150176 12751087 16224808 16923199 13597852 8669418 5688812 4230535 3462670
18098 3462670 3029509 2769992 2593370 2453664 2340580 2219112 2121701 2038249 1948888 1858032
18088 1858032 1770123 1695739 1622637 1568360 1521482 1478356 1429522 1382574 1338023 1295595 1265706
18077 1265706 1251167 1236061 1215223 1198569 1181558 1169047 1148871 1133836 1123657 1113384 1098534
18066 1098534 1071991 1033878 985836 949518 930471 922763 931078 924001 920071 918657 907844 894655
18054 894655 896415 893496 895384 879338 863670 860063 865872 863915 861058 867105 873145 884822 892140
18041 892140 914194 942221 960158 996808 1038287 1062951 1093373 1125203 1176657 1243207 1262676
18030 1262676 1265450 1259138 1248377 1242539 1226123 1188227 1165453 1148989 1121959 1102309 1078012 1049191
18018 1049191 1040025 1046389 1045285 1046832 1054511 1052270 1055296 1079082 1080739 1067592 1067326 1068104 1072749 1093798
18004 1093798 1116822 1128001 1145784 1154149 1153607 1172346 1177953 1188428 1195822 1224513 1269473 1317382
17992 1317382 1363280 1407174 1472678 1557513 1639312 1718554 1812033 1918462 2034619 2168833 2300445
17981 2300445 2432156 2587415 2761958 2947387 3104474 3265999 3425654 3580163 3769242
17972 3769242 4016822 4316768 4675531 5098914 5612986 6233036 7041602 8158203 9761407
17963 9761407 12091056 15227117 19124753 23612700 28494986 33544964 38557320 43527943
17955 43527943 49012470 55938963 64908471 75885920 88335780 101048814 112488975
17948 112488975 120867762 126242180 128418687 126677450 121160938 114067161 108463093 104332144
17940 104332144 99626190 93392670 86942465 80930376 76002221 73910284 75193796 76942730
17932 76942730 75998122 71580387 64763773 57840261 51294403 44473098 38060314 33377024
17924 33377024 30303831 28181156 26589786 25287591 24166282 23155151 22203877 21285902
17916 21285902 20416882 19570714 18783954 18063259 17381661 16779965 16263890 15860097 15553478
17907 15553478 15294784 15060950 14871158 14741030 14690653 14733478 14939262 15412111 16296683 17888121
17897 17888121 20692579 25656322 33829557 44437001 54076164 59992431 61293566 59666671
17889 59666671 56462272 50236495 40700442 31887887 26386432 23631398 22692390 23190724
17881 23190724 25287517 29640362 37011735 46368029 54503434 59119947 59567693 57493410
17873 57493410 53853515 47203947 37673179 29109929 23562758 20279625 18268857 16983008
17865 16983008 16109322 15466193 14945052 14444750 13954769 13445188 12911655 12384972 11857572
17856 11857572 11354155 10927776 10597122 10335324 10118375 9930413 9758694 9603622 9486075
17847 9486075 9412091 9413611 9508342 9713203 10160856 10996841 12518271 15227218 19495705 24455962
17837 24455962 28448219 30526487 30659225 29754103 27862452 24133456 19308305 15547652
17829 15547652 13392203 12394669 12173416 12631546 13930615 16458628 20381290 24763836
17821 24763836 28134826 29673970 29447359 28325920 26219857 22344823 17601589 13898474
17813 13898474 11587208 10178371 9305785 8733811 8328868 8011119 7752037 7512179 7255723
17804 7255723 6976335 6682253 6408926 6132187 5847479 5590140 5356749 5108205 4880737
17795 4880737 4691915 4510867 4348957 4218049 4096778 3992964 3890062 3769336 3681232 3601302
17785 3601302 3523579 3466863 3439810 3408447 3338717 3220644 3076860 2943034 2832646 2731894
17775 2731894 2645108 2567685 2509900 2462757 2410427 2378794 2382486 2392865 2406739 2396705 2330671
17764 2330671 2225601 2124392 2038676 1985222 1962697 1963520 1982194 1989810 1982811 1951762 1919364 1872349
17752 1872349 1811155 1731903 1649238 1580323 1514911 1459450 1418315 1400638 1413825 1439779 1466205
17741 1466205 1488298 1481396 1457513 1419712 1373982 1312651 1264908 1237128 1206426 1193110 1208058
17730 1208058 1248977 1313754 1400643 1496705 1560973 1568768 1508316 1400809 1265733 1165658 1100191
17719 1100191 1046891 1009181 972733 940475 941568 970098 1023014 1089326 1151004 1197545 1201880 1162461
17707 1162461 1084147 987216 892582 833275 802242 772130 749171 725785 708998 684384 661626
17696 661626 634440 614365 597949 593756 582009 557720 546629 546528 563091 553570 538055 532761
17684 532761 528658 516990 516671 535025 553832 555119 549426 544749 549202 548204 553323 576125 602657
17671 602657 645010 669542 651379 614202 567948 532656 500725 462816 435089 416245 395962
17660 395962 395808 391579 398963 418975 436480 481027 521573 534711 534436 496329 445845 392280 353820
17647 353820 340382 354934 354331 349108 332119 313268 299640 291700 290951 281261 267689 257854 248524
17634 248524 257454 260473 258229 249229 245913 234507 219105 216539 229138 239558 257580 251448 244368
17621 244368 233495 225835 202756 201021 210043 207282 198210 189443 187400 176002 164204 168130 177187
17608 177187 164298 156774 163427 186396 201662 204136 219382 231394 262814 314282 348012 375531
17596 375531 387296 424161 492266 564771 649792 743512 797533 812653 816423 849959 914146 988124
17584 988124 1029498 1024661 971094 913417 881845 871948 869604 832766 767804 693137 626047 580165
17572 580165 530891 500447 476961 433746 384562 335182 302931 298864 284051 283815 260885 232405
17560 232405 227743 222437 213444 206145 193350 170838 162897 163454 162816 165929 158215 149509 153224 160191
17546 160191 161590 151098 141910 136342 133813 124613 119688 117995 111758 107439 98988 93704 106079 107871
17532 107871 108781 105833 99345 90024 86793 81468 79195 83215 82515 74184 67371 64380 64412 77722 74108
17517 74108 75689 66737 53115 50087 49119 58304 54804 57538 55923 53863 53123 55080 56917 46120
17503 46120 61295 66947 67039 76016 81854 78059 70833 84903 79401 55799 52262 55692 41671 36003
17489 36003 31722 51483 62420 57155 52494 52344 54286 63213 69785 63557 53200 47038 34523 30509
17475 30509 39855 48083 40871 54890 57651 62075 68047 62261 58673 49866 49915 49919 58285 61473 56853
17460 56853 56318 60259 61712 54453 51720 48108 57713 52583 47087 40569 39559 25686 24480 34705
17446 34705 32602 33656 44975 51707 65702 79876 82824 114844 122016 96662 66861 62743 54487
17433 54487 44641 44822 49364 58211 83389 120626 150623 150851 156517 165334 150426 128146 110055
17420 110055 97786 82832 76456 90712 102151 105632 105136 121317 153269 171779 179136 170622 153524
17407 153524 147894 132947 104273 83565 72683 61133 52345 59866 55817 56791 63817 77165 75813
17394 75813 70013 75695 74195 73898 73189 68673 57128 55717 59944 75145 97253 116848 133731 163348
17380 163348 198098 221252 253506 306049 358965 405036 466401 555672 656435 723156 772668
17369 772668 794296 808242 791654 757878 718963 683929 658882 650770 636407 622910 616030 627256
17357 627256 645534 652649 655320 632092 591332 534372 462434 389541 314009 269091 242812 217461
17345 217461 200574 194442 194605 198986 190823 167778 165779 163858 160797 155445 148362 131880 111068
17332 111068 94045 94998 96256 95169 101066 97874 99632 106516 104307 102035 109959 108560 98872 96369
17318 96369 135860 172634 184949 202245 208601 199477 191907 165305 144609 126431 98244 76314
17306 76314 76435 82295 104316 119079 123985 137979 153966 156363 167202 170427 155148 138376 102417
17293 102417 79350 74966 72547 75647 76748 66286 65997 51304 40175 38197 31721 38963 48020
17280 48020 52259 53256 47984 37444 32609 15620 16785 22372 19232 14192 18733 19627 11708 22451
17266 22451 36439 47807 46744 42696 49754 45124 38377 37335 28061 26071 26662 32784 51272 59266
17252 59266 40040 24765 11147 712 2367 11956 19879 19150 10788 5173 16258 27666 28376
17239 28376 21580 8083 -15162 -12877 -4823 -1144 11207 17929 27539 29955 30086 17130 15239 22218
17225 22218 22087 16165 4818 -3400 10435 23313 27028 26288 15033 2007 4962 14025 7013 14790
17211 14790 20176 32215 43124 34864 23061 20189 11826 6615 -10751 -16341 3902 14585 19845
17198 19845 24878 12836 -11794 -2070 -2565 -3302 11005 7583 -10818 -11987 -20239 -29587 -31292 -14888
17184 -14888 -5429 12842 14944 21792 30823 26657 11964 1801 -9241 -18563 -17161 -2574 6733
17171 6733 5569 6667 21484 30956 33380 15261 2772 -12336 -10851 6400 -2124 -13457 -5823
17158 -5823 9581 28069 25195 13192 3417 4964 9542 12104 9904 5744 6790 8966 16301 8828
17144 8828 2506 -796 6680 5100 1359 -2183 2481 1974 10709 13508 17711 15349 19298 15382 14461
17129 14461 -2251 -7104 -5743 3332 -5055 -7364 -7243 8165 1974 -7707 -2936 -4515 -17938 -23376
17115 -23376 -14011 -14579 -10084 -10173 154 4456 351 702 -19 -20708 -22129 -15441 -1567 6817 15650
17100 15650 14215 10890 -1183 -5938 571 17956 19006 23662 21107 8784 -5555 5811 743
17087 743 5065 17800 14810 16556 8364 7480 10446 13413 8190 7688 -187 -5411 1424 63 3754
17072 3754 2907 12534 23861 20490 15081 12741 -1248 8045 18419 8520 10740 11816 4984 -2888
17058 -2888 -8852 -2511 1445 -5050 2522 -8128 -14444 -6663 -12858 -1191 13020 8557 7957 18170
17044 18170 30666 14968 6842 11350 9311 -8008 -2415 6593 14383 16582 3870 -2637 2416
17031 2416 11175 6167 -7088 -18609 -28893 -31166 -22241 -6163 -11053 -5855 9172 -4044 -235
17018 -235 -1990 -13728 -7416 -5702 -2739 12014 19605 18615 8980 6094 13267 9622 12907 16529 20558
17003 20558 23411 11877 2562 -932 -11148 -16621 -20951 -10482 -795 1308 -5154 -9744 -2069 5285
16989 5285 -5111 -16974 -1566 7225 -4925 -4832 -1113 -4393 -3983 7087 9244 15068 3188 -12110
16975 -12110 -14245 -7814 -5183 153 2074 -1108 2780 5091 8080 -644 -9535 353 -15071 -18241
16961 -18241 -28064 -26827 -11804 673 1807 -2312 -27711 -12485 -6536 -5885 -13691 -4230 -3874 -11322
16947 -11322 -21887 -19669 -22811 -23293 -36268 -20057 -5537 -2524 350 -6887 -12025 -11854 -14007 -20998
16933 -20998 -26923 -26506 -23485 -18869 -19158 -19438 -9128 -8926 -6540 -8882 -13971 -24493 -30426 -27642 -24739
16918 -24739 -8129 -3042 -2851 -1601 -9885 -17691 -11334 -2860 -720 -17579 -20053 -15320 -18345 -16002
16904 -16002 -9034 -2587 -10049 -7094 -5214 15599 22516 18359 -141 -6478 2780 1653 4022 5609
16890 5609 1378 4290 6804 8825 -4000 -6953 -3794 4224 2188 -12551 -26433 -13300 -18042 -19468
16876 -19468 790 3128 -10337 -16920 -15689 4706 21888 -2306 -17432 -23725 -31228 -29379 -27675
16863 -27675 -31737 -37712 -39762 -37644 -39181 -29943 -26390 -18710 -14168 -18486 -13920 -9001 -19160 -21124
16849 -21124 -28321 -28521 -14782 5719 20166 6531 8837 13037 10269 7818 18994 33943 27284
16836 27284 7466 -2950 -6549 -16231 -22414 -20848 -14083 -3815 5831 7153 15635 5758 -5994
16823 -5994 -12752 -9025 -12190 -11562 -9771 -7428 4771 -57 -7103 1142 1505 14219 10200 9324 13443
16808 13443 11809 -3075 -10126 -6860 -6108 2587 7028 15631 15472 -2780 -23065 -26201 -22971 -8693
16794 -8693 -11328 -20897 -30240 -15270 -16498 -16701 20 1355 -9033 -11183 -11544 -13746 -7366 -8148 -1187
16779 -1187 -10 13998 6597 -8863 -3160 7924 13200 227 -8316 1219 1756 2952 3249 -4100
16765 -4100 -9183 -6833 -8238 -9508 -10073 -4997 -5330 -21471 -29459 -29036 -37905 -28210 -31424 -34203 -22309
16750 -22309 -11435 -1715 -4993 -15062 -11896 -11155 -14652 -8613 7897 710 -3854 -14248 -26948
16737 -26948 -14305 -9186 -14834 -12768 -9611 -8711 -13006 -15556 -8305 -8830 -779 1945 1278 -4709 -6813
16722 -6813 -10050 -14017 -15511 -17662 -25482 -33030 -26092 -26261 -15731 -12029 -441 -3423 3138 12785
16708 12785 11757 6207 -4169 6424 18535 7445 -3174 -20815 -13407 -5870 -17130 -15194 -8417
16695 -8417 -8453 -23562 -19182 -23649 -21103 -10662 -17696 -1740 14138 -7584 -22758 -35130 -31522
16682 -31522 -17298 -14582 -12089 -14657 -15857 -13012 -9776 -12056 -7951 -5282 -23157 -20224 -5046 6007
16668 6007 6193 -7208 -17752 -16195 -20724 -18328 -2065 11863 8971 -5348 -7903 -4216 2965 4389
16654 4389 4379 969 -7602 -8689 -7780 -9440 -1073 19319 21291 26769 13645 5204 1423 3451 868
16639 868 -6435 1813 -3524 -17910 -18481 -5342 -952 -4414 -5851 2657 3713 5866 -794 -408 -6014
16624 -6014 -7372 -3066 -11435 -13751 -2385 1427 4942 9359 20439 17364 17920 7422 -16370 -20647
16610 -20647 -23454 -22915 -13127 4030 7102 5434 14720 17154 27644 32443 25110 22274 24580 13434
16596 13434 1880 -16011 -7456 9751 16101 20144 19488 21083 27892 35567 12996 3485 3075 -3269
16582 -3269 -11992 -23482 -16390 -18790 -9532 -4504 5223 5226 4254 5813 3638 -2542 -8703 -13297 -7508
16567 -7508 2213 945 -12185 -16112 -19779 -12298 -6391 -9201 -17421 -31230 -22219 -3700 15823 18658
16553 18658 22692 25155 20237 7514 6456 6337 13999 10271 -6376 -11444 -10939 -7074 -7036 4111 26137
16538 26137 25781 12596 -77 -10950 -27482 -24576 -21464 -23053 -10076 -1387 -111 9538 5341
16525 5341 -9412 -4185 2678 4960 7375 3250 12232 24820 23969 -2371 -18745 -18280 2772 17403
16511 17403 11863 19620 22036 12860 9007 -17475 -28282 -33436 -14974 -9201 -12958 -7915 785 4628
16497 4628 -899 57 13558 5262 16284 25440 23148 5362 -3017 9211 9838 8091 12945 3937
16483 3937 2602 -648 3407 -3009 -3907 -2090 3732 3259 1370 -838 5927 14244 8084 -7841 -18007
16468 -18007 -15872 -9851 -19443 -18764 -10202 -9674 -2738 5429 13809 7759 19485 24222 7749 -4638
16454 -4638 -8475 -9923 4262 3278 6416 3746 -11777 -3696 3882 8527 3439 2727 12022 11901 7758
16439 7758 3482 3020 13096 6462 17367 28922 9626 1313 -7271 -16456 -16981 -12307 -4474 9028
16425 9028 3358 7131 7093 12404 10420 -7041 -14403 -11102 -7122 -4229 -12691 -14295 -15695 -20500 -20442
16410 -20442 -5279 8536 6192 -356 -15230 -32715 -30227 -22282 -17912 -9743 -8857 -6370 -7212 -13303
16396 -13303 -13220 7055 10275 6137 1498 -681 2144 9581 -3685 -5227 -3801 -9962 -7253 -1999
16382 -1999 -843 -16191 -14305 -17750 -23717 -20326 -11602 -20582 -26372 -22614 -13536 -9727 -15416 -12750
16368 -12750 -20207 -31094 -22777 -21212 -24991 -5247 5720 331 -1423 -9217 -6902 -4875 -2394 785
16354 785 8643 1159 -8479 -10544 -19874 -24602 -16365 -18135 -21005 -24935 -25391 -14628 -12819 -14775 -11501
16339 -11501 -17559 -22907 -17572 -9188 10313 -3157 -3339 5220 2289 -858 -2133 -14056 -12739 -3730
16325 -3730 22831 22064 -219 -971 -2722 -8834 -20030 -29663 -15630 -3541 -4892 -7211 -2018 6165
16311 6165 3688 -2285 -8421 -5507 -6373 -13569 -9408 -363 8940 3829 11420 9273 9103 10472 13136
16296 13136 16512 14633 15358 13741 13031 -2367 -3373 10676 7995 14628 22096 29446 29359 17147 9510
16281 9510 9471 13589 17130 18807 22276 -11 -93 14068 4358 -4439 -4493 -1762 -8839 -11794 -8039 522
16265 522 2951 10230 15002 14492 15080 900 -2964 1728 -104 10484 16031 17019 24548 14589 5494
16250 5494 4851 786 9316 12740 6650 -3677 -4016 5967 10512 6093 -943 235 2617 -953 8531
16235 8531 6849 1972 -5469 -15908 1142 -3131 -12827 -15593 -14334 -18634 -10596 -9046 -11247 -21004
16221 -21004 -17165 -5019 -9203 -6972 -1924 -18474 -25679 -20344 -9056 -5867 -8208 -5460 -11309 -10872
16207 -10872 -10755 4458 2151 -12597 -9012 9290 4197 -23208 -31502 -14207 -1358 -5726 -4709
16194 -4709 -14383 -24715 -31567 -17921 -8815 -11837 -8426 -4325 -521 8124 18486 18384 8463 444
16180 444 408 1903 -6405 -949 13110 16299 10326 12815 11007 26401 38148 38160 39293 44240 49270
16165 49270 65587 73225 74729 82313 89671 81817 70693 64753 53610 48843 49357 50917 49116 54532
16151 54532 63274 57323 45314 37777 34368 37196 36738 30332 35497 42885 38064 28465 4982 -8219
16137 -8219 -6079 -2154 3050 -2627 -8327 11709 15695 26149 24457 18400 18395 24763 24390 1575 -5434
16122 -5434 -8964 3385 3127 -6448 -14077 -1535 1645 -5285 -22659 -28653 -19316 -12966 -6701 -4386
16108 -4386 -7672 -9982 10301 26437 19370 681 -15121 -6102 -18763 -19476 7398 -2009 -6567
16095 -6567 -3258 -25350 -31935 -14483 4832 4067 -199 -15444 -18278 -21669 -28082 -26861 -17587 4779
16081 4779 -979 -12557 -15605 -4272 18637 4672 -11112 -2948 12139 12810 8929 10010 11445
16068 11445 -226 660 3909 12769 23901 5654 -4607 5090 7850 9684 15791 12779 5360 -9312
16054 -9312 -2381 -3832 -3347 3269 -1888 -1209 4009 10672 7752 4298 4492 1701 -324 -2144 1387
16039 1387 16322 16439 15263 19065 18318 8215 -4787 -593 4638 5703 874 -664 4983 6906
16025 6906 1418 -3631 -22978 -10834 -2862 -4480 -4046 3674 7287 11279 10460 -1675 -6922 -10695
16011 -10695 -10067 -4624 6826 9747 -4326 -333 9170 3011 -5282 -2691 -9484 -4440 -4082 -3485 -11509
15996 -11509 -10172 -985 -5547 4467 7806 4879 5190 20621 15598 9757 10195 3247 -53 2326
15982 2326 13019 8395 7021 13897 21720 19172 15907 7656 7505 14754 12565 14645 13310 5733 240
15967 240 6317 5942 11056 3427 1389 2806 4336 1725 566 -3874 -1168 -9117 -9538 -3570 -16062
15952 -16062 -29113 -24823 -23062 -29491 -20085 -12437 -6873 -7848 -18297 -26440 -28230 -31480 -35764 -32690
15938 -32690 -22557 -15941 -13882 -11236 -3166 -879 -4835 12119 24153 28284 14318 830 1633
15925 1633 112 -4472 -9632 -2874 21930 18168 8143 -8720 -19014 -7786 -12187 -8417 -5680
15912 -5680 -10489 -2132 1251 -10425 -13520 -17858 -12599 -1790 9183 22811 24443 20910 22033 9711
15898 9711 -7555 -11419 -13317 645 18865 20461 15530 6791 3019 -7260 -4036 9065 -4012
15885 -4012 -16861 -9465 10707 15564 7333 4580 8683 5871 -7827 -14314 -19693 -18860 -24864 -25614
15871 -25614 -13983 -13315 -15033 -10426 -5616 -12235 -9787 -17631 -21898 -12168 -2918 5669 5094 1439 4464
15856 4464 5061 3287 1614 -549 -4272 -6583 -2305 -273 3868 12322 9945 -2137 -8131 -5964 2028
15841 2028 3788 -4812 -6392 -3725 -7204 -19181 -22468 -9063 -5937 -11648 -22093 -14540 -9359 -7441
15827 -7441 3830 6532 2366 -2495 -12613 -12052 6166 19622 16346 1576 -2823 2161 -251 -7767
15813 -7767 4267 20781 26205 28167 24734 14406 2199 6860 18752 17386 6782 -4413 -5251
15800 -5251 -2231 -4988 -6269 -12335 -26405 -17202 537 9404 5549 4887 3757 -5708 -19230 -15268
15786 -15268 -3187 7312 -4418 -10333 -600 7494 7032 -2483 266 3321 -551 2981 5532 -10249
15772 -10249 -13003 -8769 -7903 -14844 -3261 -801 -8235 -12909 -8130 -6741 -4640 -1451 -2993 -12532
15758 -12532 -9583 -19845 -18250 -13711 -24526 -37671 -36503 -28781 -17913 -15312 -9653 -15214 -10299
15745 -10299 2365 11952 4651 165 219 14952 20435 17449 7625 -10382 -14332 -66 4609 -1678
15731 -1678 -5800 -6656 -11767 -17720 -22017 -17264 -10116 -2 6393 -3415 -17053 -13953 -6325 -7131 -8405
15716 -8405 -6396 -8328 -16132 -13836 1845 822 4149 -5088 -5516 137 6095 8895 16907 20748 11691
15701 11691 -4560 -13625 -16831 -21693 -31459 -17618 4792 12705 18528 27513 22972 8635 5582
15688 5582 -3969 3130 18137 11666 12279 7761 6437 22839 27119 29994 28483 19239 11771 -4861
15674 -4861 -12532 -14260 -20717 -6506 11106 19169 19507 23258 13959 7351 4445 2159 6004 -994
15660 -994 -10875 -13390 -11468 -3324 698 -10114 -14459 -3045 -9246 -23520 -15627 -8932 -31868 -27927
15646 -27927 -16918 -29444 -28022 -16971 -11733 -864 16388 6205 -13080 -18135 -428 7092
15634 7092 1523 -3616 -591 -5344 -13180 -28005 -28369 -15296 -8629 -21444 -25304 -25374 -17325 -12940 -17770
15619 -17770 -5534 4575 12829 8138 -6358 -11542 -12472 -11119 -5282 4404 617 -5219 -5772 -2886
15605 -2886 -321 7929 -6117 -19352 -18616 -10811 4568 9392 11111 6140 -6629 -5441 1825 4049
15591 4049 -4639 -2849 761 -3399 -1480 1241 -14265 -21316 -10713 -1563 -4719 191 2611 -14175
15577 -14175 -33870 -30971 -13798 4142 19932 11539 3091 -5411 103 2392 6540 1849 -12169
15564 -12169 -9264 -10343 -19362 -11115 -4496 -6089 -11339 -3628 1824 -11613 -8269 -13235 -30997 -39013
15550 -39013 -27717 -14450 -4753 15036 18008 9375 -1315 -5634 5025 2555 1564 -1117 1470
15537 1470 1356 8688 17994 16737 14506 1868 -4292 -9972 -11759 -6832 -4839 -3705 -1437 -12546
15523 -12546 -11356 -17811 -17221 -12244 1815 5565 -2806 -16191 -16481 -16905 -23944 -14254 9520 15098
15509 15098 1132 -4091 2900 -2685 974 -2964 -9027 -13495 -5758 6460 14635 14608 13281 15165
15495 15165 14248 5542 -1463 -17151 -21607 -17091 -16025 3259 1914 -9368 -13474 -15757 -14609 -10275
15481 -10275 -8514 6806 13984 4582 -3729 2991 2482 -10259 -23729 -26679 -12624 -14758 -7042 341
15467 341 4525 4304 5627 -6697 -13139 -2508 2849 -3768 -3228 -2411 -14103 -20467 -28165 -27206 -11440
15452 -11440 -3148 -7510 -9812 -3205 5614 3954 -9466 -23299 -32736 -30735 -17032 -4740 1083
15439 1083 15967 11833 6121 10332 3341 74 -8584 -12768 -10043 -8544 -10332 -14608 -16629 -11197
15425 -11197 -5641 -12004 -11659 4826 5632 5487 10641 4689 -4261 -1371 -9230 -20542 -13991 5676
15411 5676 4942 2763 773 -11690 -13135 -9537 -19221 -12808 -3408 -6631 2059 9423 8316 -10055
15397 -10055 -17665 -14772 -12549 -235 -3774 -13356 -9021 -5889 -3971 -11782 -20570 -9910 -10421 -22253
15383 -22253 -8221 2367 2373 -7316 -15877 1892 13805 14626 12952 -506 -7354 -11526 -19075 -16138
15369 -16138 -7823 11482 8839 -11979 -23073 -24378 -21948 -17681 -9557 -12703 -12865 -11881 -5443 -10040
15355 -10040 -9344 -9210 -6309 10211 -3620 -16318 840 -4416 -19607 -16459 -11445 -1045 -1891 -3314
15341 -3314 -6934 1556 10862 -10310 -39310 -48089 -31469 -2606 13509 6847 -5266 -20375 -19749
15328 -19749 -8553 -14290 -13624 -12027 -10347 -13410 -12970 -15455 -3298 13832 6766 -10857 -9823 -2493
15314 -2493 463 456 10787 3614 599 4218 2530 1950 -8514 -15181 -7733 -13081 -11349 -4774 -471
15299 -471 -9923 -12596 -1791 526 -9378 -14007 -20297 -26059 -26377 -33175 -39643 -41466 -22427 -8282
15285 -8282 -8996 -6819 -13156 -18382 -19645 -20308 -18500 -24582 -20109 -23348 -23033 -13633 -16077 -17856 -3371
15270 -3371 11797 10545 -13179 -34401 -40367 -31561 -15693 -16184 -10689 -14347 -14318 -7244 -12837 -13244 -8110
15255 -8110 -20417 -26443 -23845 -11078 -12104 -17531 -23765 -17984 -17944 -9734 -22241 -15531 -2155 -4902
15241 -4902 -6718 -17404 -24617 -17893 -6980 -6943 -3 12019 -337 -19882 -11115 -4496 -11169 -6943
15227 -6943 -13422 -16854 -5352 2401 -6730 -22068 -31932 -24003 -5837 1081 3255 9087 25005 6874
15213 6874 -10241 -2118 1099 695 -2480 -5882 4495 3930 -3707 -25538 -22560 -15346 -7163 -6996 -15063
15198 -15063 -18252 -2085 9635 -568 -11984 -9144 -4995 6922 12346 6828 14356 18530 13189
15185 13189 12510 -4236 -8448 -10107 -12372 1603 -3922 -6510 -5979 -4498 1347 5826 17247 36877
15171 36877 36225 33145 23276 34657 53378 59437 64488 74572 68379 57658 66005 71219 74747 76669
15157 76669 101647 128049 167106 187162 186904 166902 140491 103469 89343 100964 138754 177991
15145 177991 222798 254667 259383 226714 173065 135433 138697 147941 143670 163962 192695 210149
15133 210149 184034 130156 99774 77800 62790 63685 53647 66581 78360 91096 90133 85498
15121 85498 63799 39249 44940 38371 36127 54145 61674 58371 55090 53394 36849 38178 25309
15108 25309 5022 5901 8774 10043 16980 28323 29526 27417 28636 14269 12399 16605 5980 1300
15094 1300 216 3596 7372 17711 919 -8365 -3926 3590 7478 8973 15517 17116 27441 20135
15080 20135 11654 -1809 6542 14242 17259 15561 16233 18347 19793 17013 21229 10428 4 -5135
15066 -5135 -10236 -9187 -9345 -3488 7561 12561 6540 5874 10468 7129 4185 -3057 -15661 -12714 -6144
15051 -6144 4373 20249 30177 22152 13296 10658 8163 -4187 -17709 -7878 -5464 -2775 2990 1606
15037 1606 -1129 -17634 -21916 1950 6884 10315 709 -7641 5723 7270 14600 23596 12368 7498
15023 7498 23485 29246 15977 10655 1196 -6700 -10721 -11367 -11236 -21306 -27760 -8841 -1197 -233
15009 -233 12052 8643 -9927 13071 24847 15013 2265 -963 -8466 -6255 -9091 -14887 -18627 -15110
14995 -15110 -2073 1960 -3467 23 4242 5104 16684 21102 10815 -1180 -8869 -9186 -3523 -1600
14981 -1600 -12460 -10356 -15107 -7649 -11117 -28175 -36708 -24341 -7070 -8375 2811 13950 26564
14968 26564 11453 5654 6416 14654 10271 5259 -2715 -257 -12808 -12457 -8303 5645 22877 19486
14954 19486 20208 18282 7689 2324 3272 -12871 -26478 -24760 -21332 3634 13020 17734 14524 24443
14940 24443 42285 28597 15409 18978 12979 12137 27189 50085 77974 98184 107313 108246 109652
14927 109652 124722 136150 146464 153620 165237 203942 234973 248651 233450 216788 211526 212305
14915 212305 222849 221201 208999 217451 232021 220620 203647 179921 152838 127304 123867 110546
14903 110546 89024 69352 61030 73065 74049 68162 60242 40787 36455 47735 44394 36858 37342
14890 37342 34846 35185 29797 30943 36837 28968 30745 34299 18769 23316 48568 51021 49191 36636
14876 36636 34878 32582 20508 18634 19199 13877 26120 23525 23731 20963 12282 24612 32343 12746
14862 12746 -4344 -7398 -6828 -9697 7090 16059 7224 7004 12044 15042 3680 -1248 6296 -11729
14848 -11729 -8634 1060 3561 -6527 2698 9322 6634 18664 13556 9404 -203 4762 16691 10361
14834 10361 4651 -3869 -12493 -12748 -12454 -12717 -19980 -20339 -7550 5903 -5691 -17188 -10906 -6166
14820 -6166 -7175 -15040 -16144 -12873 -17119 -23513 -14097 -2401 4163 9004 3558 2694 -4940 -3803 7543
14805 7543 7212 -777 1766 763 11153 16195 13849 1792 -3743 755 6826 1270 -2133 -96
14791 -96 -8381 -2550 -1026 3338 2766 844 1496 -3459 8917 12032 7623 -444 -4760 -16421 -21918
14776 -21918 -10961 -13552 -20279 -18464 -7773 -6047 -9143 -14901 -24525 -21385 -24013 -17884 -7115 -5391
14762 -5391 -8688 -14828 -4729 8482 -8733 -6120 6770 3941 2008 14434 20482 9495 7813
14749 7813 5790 4657 3588 -3536 -1631 -9978 767 2510 -853 -962 -11912 -9580 -1307 -485 8104
14734 8104 15925 25271 10338 -9182 -7248 -11178 -10945 -11888 -5785 4944 8902 -4296 -1407 5825
14720 5825 16232 16689 4793 9638 3629 -4372 -9717 -14201 -32792 -22886 -3569 3003 8565 3123
14706 3123 -8647 -18705 -13021 -6484 -1419 -5130 -1403 -12746 -21141 -18384 -7718 -4896 -16276
14693 -16276 -26287 -16519 -3157 7837 17425 16479 7464 -2918 -8534 -3420 4860 10505 10044 308
14679 308 -1346 -3340 -10388 -3461 -7169 1501 3118 7856 -7834 -17383 -12921 -11289 -16118 -11549 -1102
14664 -1102 -3669 -6496 2642 13055 12112 12736 18874 9305 -2858 -6372 -6597 -12519 1607 7922 16747
14649 16747 6781 18227 18983 19051 3169 15085 21866 15998 14257 11778 -3214 -10121 6547 11718
14635 11718 23793 16624 9515 4911 2437 1437 4628 -3038 -10230 -12226 -17241 -8197 16156 20141
14621 20141 15262 13464 -6298 -13649 -3401 4746 9727 6482 8289 6217 18272 9060 8979 9601
14607 9601 1669 -2778 4597 21341 23513 9652 2230 5705 -1766 -14262 -13923 -18553 -17823 -8449
14593 -8449 -2191 -6467 -7741 -1804 4403 5645 -3410 1998 11262 12297 -4521 -4716 -14531 -12118 -16899
14578 -16899 -9568 -14765 -14084 -9184 2539 -3046 -19989 -23448 -12298 -1111 -13084 -21374 -14287
14565 -14287 -9625 -14969 -21288 -22027 -21711 -18931 -26009 -18480 -470 -14612 -19285 -30132 -25365 -19691
14551 -19691 -21714 -17643 -23845 -20875 -18739 -24039 -22405 -8535 621 -6945 -3476 6321 7113 3047
14537 3047 2057 22470 32758 20634 531 -2846 -9187 2227 5499 -2359 1362 -8934 -4128
14524 -4128 2596 -1270 -14078 -23602 -25767 -11622 -10382 -16295 -18759 -11204 2708 13675 4100 -4534
14510 -4534 -5114 14259 6926 -6676 -13652 -5691 3208 2121 4317 2784 -11163 -15385 -14412 -12305
14496 -12305 -11278 -19910 -21641 -9126 -5384 -22540 -27530 -22660 -6300 8093 8712 9950 1680 -6795
14482 -6795 -7553 -7786 -13442 -17895 -19630 -20891 -26966 -28519 -11160 -1999 -934 -8639 -13866 -11436 -12111
14467 -12111 -4813 5023 6718 8539 3117 -16523 -24360 -18506 -5487 4685 3113 1912 9818 6979
14453 6979 -16280 -31228 -28710 -27684 -23400 -18301 -30168 -30338 -14669 -20142 -31206 -20923 -17230
14440 -17230 -15813 -12351 -16954 -12178 8322 11148 -13315 -20653 -7293 -15555 -20204 -11110 -8845 -12010
14426 -12010 -4104 -1226 -1624 -12254 -29507 -38281 -21373 -7351 9496 10215 23803 34032 25069
14413 25069 15663 4099 6564 7532 6198 3713 -3680 -5284 -3141 -9565 -4842 -19014 -24400 -31043
14399 -31043 -13981 -7911 -26304 -28893 -20826 -16769 -10732 -16048 -2521 9619 11885 3791 -760
14386 -760 -13416 -12964 -2443 5203 -1454 -1910 -7128 -8790 5812 8583 6291 10831 9643 6400 -3068
14371 -3068 -20225 -25062 -31866 -40251 -36968 -22397 -23101 -22390 -14798 -15119 -5454 5825 17152 22441
14357 22441 17463 5523 -9974 -10182 -2716 -1615 9223 18860 2441 -5012 -8686 -8197 -18992 -26472
14343 -26472 -13412 -10169 -12149 -20569 -18433 -15617 -17561 -27121 -28931 -16123 -5857 -417 7443 -3494
14329 -3494 -4239 -6857 2387 16332 15984 3681 -5197 10286 12171 9601 -132 -2018 -8046 -512
14315 -512 -12828 -33767 -33204 -23979 -14107 3 11306 11154 -3288 -11790 -2427 9232 16874 9156
14301 9156 4482 -2831 -9525 176 -1659 -14016 -14789 -4497 -3479 2786 9010 11103 -6373 -306
14287 -306 5829 10360 7388 -5160 -8302 2600 3302 3803 6186 -731 -1902 -15547 -28282 -26840
14273 -26840 -21247 -26463 -8000 18005 20168 7228 10145 2340 5259 6114 14924 14652 18536 24601
14259 24601 16268 -7843 -13190 -9118 -7076 2251 5025 -2589 -10670 -15367 -6995 -13259 -13731 -5377
14245 -5377 -7372 -3817 -5750 -7820 -3331 -14200 -31337 -31361 -21699 -24509 -17284 -16784 -16521 -15089 -19819
14230 -19819 -24669 -7317 4093 4258 2798 -4307 -936 6580 14727 3247 -5442 -4025 -10683 -23584
14216 -23584 -14319 -13302 -17044 -14752 -6036 -1003 -10790 -17954 -18430 -22663 -9475 -7995 -14705 -18491
14202 -18491 -19785 -781 4829 -3863 -11997 -19280 -31934 -29638 -19930 -12446 905 3294 4703 -4742
14188 -4742 -5553 -1972 -7183 -4202 -2882 -9002 -2377 -7363 -10128 -13828 -20343 -25782 -39170 -25173
14174 -25173 -5527 3127 -1337 -5354 -4499 961 -2343 -11108 -9576 -5963 1579 -2052 -2916 -3741 -4869
14159 -4869 -5729 -1365 -8836 -19803 -24128 -25286 -15312 -313 12832 13204 13026 3247 -2005 -2380 1415
14144 1415 -11889 -13836 -15908 -7365 11497 17874 15423 6479 -2885 -9641 -12709 -9986 -7645 -5178
14130 -5178 -1891 -10156 -14544 -11546 -155 4611 -1946 3266 10720 6877 -5135 -5488 -3196 547
14116 547 3355 5701 11028 8156 11587 9716 3389 -2452 1281 10072 10473 10326 24911 34297 28217
14101 28217 15633 3897 -3872 -1980 17294 10483 -1849 -9935 831 9665 16988 9854 8511
14088 8511 12965 18579 17400 20278 14840 -1979 -8314 -4815 -2052 -4604 -14069 -6151 -3347 -14005
14074 -14005 -12825 -1077 6541 918 -25050 -10155 -5492 8358 12024 10567 -8564 -3623 -6024
14061 -6024 -14339 -22687 -28666 -24443 -22361 -30097 -38195 -39255 -25048 -17935 -14990 -16471 -9729 -12908
14047 -12908 -9675 4316 2127 9983 13908 9273 2375 -6131 -11039 -16632 -18920 -23883 -15353 9951
14033 9951 7704 -2487 -1484 6451 17056 18565 8390 104 -11986 -29718 -29982 -29718 -29909 -14266
14019 -14266 9948 24613 23876 8975 -3009 -10610 -20068 -17698 -18103 -21529 -9575 -11214 -7922 -19542
14005 -19542 -20263 -14753 -8468 869 6965 -2064 -12053 -10156 -6942 -7019 -9172 -14342 -24484 -16062 -9217
13990 -9217 -4346 -896 -3923 -7232 4271 229 -11378 -12285 353 4753 1680 7339 -2255 -8706
13976 -8706 -5866 6114 4215 5583 3834 7067 12048 -1315 -11003 -11388 -12287 -17738 -32899 -26689
13962 -26689 -12634 -25054 -20628 -12382 -7599 -16085 -9680 -21647 -22536 -4157 -10482 -21116 -14913
13949 -14913 -16070 -20362 -16239 -17975 -26087 -27418 -14447 -8575 -7864 -9107 -14371 -9919 -7676 -4655
13935 -4655 -5380 -3442 -12246 -21975 -19075 -15862 -8880 -12329 -14375 1105 1682 -16999 -15877 6208
13921 6208 15551 5367 2625 -490 10014 16524 -6530 -22153 -16233 -21071 -38912 -47178 -41965
13908 -41965 -33468 -17655 -5232 -776 -5178 -8651 -12750 -2904 3940 3967 4827 -9353 -5486 4772
13894 4772 5606 6938 936 -212 -8246 -21814 -34861 -22656 -10054 -5266 958 4639 -6555 -14408
13880 -14408 -10662 -3342 291 15495 16782 3296 8895 3913 -4677 -6527 -3529 -14064 -14618 -8335
13866 -8335 -12700 -18937 -15208 -8353 -4306 22618 28535 22018 2583 -8654 -8265 -9505 -4921 3462
13852 3462 3870 20482 22392 7027 14724 13645 941 -8543 -20220 -24623 -10544 -2576 5356 6366
13838 6366 -2788 -12011 -10656 -9490 -14139 -14265 -761 3164 4376 7223 6 -2585 -22237 -23138 -13044
13823 -13044 -2929 -12529 -29295 -24980 -10270 -12193 -7335 -5148 -4627 -8706 -4005 14207 13458 1372
13809 1372 -2684 -538 -1310 -3390 -9916 -23846 -25154 -23332 -26771 -28339 -11333 -40 -11980 -13518
13795 -13518 -22315 -30708 -31238 -20736 -17709 -3243 7137 -5705 2051 12160 12358 5758 -9940
13782 -9940 -6402 -5772 -24203 -37517 -32683 -34104 -13267 5416 3085 -4069 -18459 -38849 -36775
13769 -36775 -32356 -19492 -2118 8377 9899 2442 -12270 -18686 -4959 1200 -7369 -2277 11911
13756 11911 103 -6618 -18560 -15588 -7394 -555 -3360 -1346 -3472 -4166 -2887 2380 4443 -9716
13742 -9716 -15406 -3436 1984 7462 7718 -1149 -5612 -4629 -17784 -26177 -21257 -12873 -16467 -117
13728 -117 963 -8653 -14789 -15228 -12218 -6481 -8951 -4126 -3412 -5707 -7931 -679 6157 20657 23141
13713 23141 10601 3721 -7678 -13640 -5497 6156 11973 10399 -2445 -20670 -20914 -6327 -10843
13700 -10843 -19325 -6853 -4929 -4145 -3659 -6261 -5601 -6575 -1743 3971 838 -11503 -24443 -27192 -31419
13685 -31419 -25912 -26579 -23938 -18013 -17310 -13012 -8708 -8391 -5768 -6715 450 -2679 -9017 -16970 -29850
13670 -29850 -19027 -5046 8032 17379 814 -8558 -9679 -15514 -17237 -29375 -21350 -19955 -29331
13657 -29331 -10581 -7402 927 -3156 -5038 -3659 676 16498 6699 -5244 2801 3735 -3928 -12755
13643 -12755 -16119 -15953 -11213 -5739 11423 6443 -2531 -26 12363 3578 -11213 -21617 -14057 -10563
13629 -10563 -12718 -18868 -14614 -1226 4386 6489 6108 15735 26881 18607 12077 8187 -9491 -25853
13615 -25853 -24700 -7775 -340 3911 9200 2067 -10607 -17748 -9103 -7819 6082 18864 16178
13602 16178 6719 11712 4406 11907 19079 19677 24258 9790 4464 4774 -2415 15775 7302 -182
13588 -182 8878 10185 9480 6328 12615 5287 -955 -3018 9100 15017 72 1925 -82 1630 -10360
13573 -10360 -16492 -21671 -42841 -29917 -19693 -21265 252 7172 -10545 -5934 -6142 -12752 -13307 -19906
13559 -19906 -17669 -10118 -6450 -20011 -13926 -10202 -19007 -22208 -21655 -4314 -8829 -1936 -4849 -19985
13545 -19985 -16130 -7023 -6521 -13930 -1004 -3311 -162 4874 5714 1531 -6085 -825 -1757 -15328 -9621
13530 -9621 -5664 -8293 -4072 -922 9954 5509 2086 6053 -446 7138 1525 -8203 -15181 -9593
13516 -9593 -2186 -6134 -18639 -38898 -43772 -22727 -6912 -5112 -8824 -36300 -33894 -21388 -7834
13503 -7834 -4515 -6787 -11346 -12347 -498 15322 10320 5920 -2313 -17866 -27348 -39486 -43996 -22385
13489 -22385 -32397 -31376 -28202 -20950 -10711 -11585 -14606 -17275 -28858 -30687 -29929 -26926 -4498 5886
13475 5886 1538 11805 7025 6227 2412 9034 14135 15007 9113 2489 -4510 -8938 -2435 1968 -7422
13460 -7422 -941 1679 -15874 -22583 -7023 5287 15102 17157 13269 1508 233 6331 -1928 -15193
13446 -15193 -7515 7499 13485 10264 181 -11635 -8442 115 1685 2950 4473 3176 4669 -13696
13432 -13696 -22471 -2623 12675 13680 9827 908 -8893 -14129 -13378 -20535 -16077 -17702 -12366 -19630
13418 -19630 -22636 -20852 -12092 1447 3346 -9448 -5615 4125 -22 -11762 -6567 -10279 -12257 -10217
13404 -10217 6942 -4103 -8835 -5099 1463 8263 6003 -2006 984 76 5207 11482 6349 4677
13390 4677 -279 9162 5412 20524 28279 12319 3442 -5060 -12394 -4145 -11517 -17523 -9621 5432
13376 5432 14485 15091 257 -11783 -18264 -17888 -11829 -9937 -15544 -16767 -11034 -16162 -21093 -20322 -8892
13361 -8892 -3118 -4075 5138 3139 -6021 -8536 -20641 -30230 -29509 -24569 -33469 -31308 -20116 -5215
13347 -5215 416 3952 -4211 6135 2448 -3647 -18054 -26333 -35404 -31762 -14873 -2243 -11934 -23376
13333 -23376 -19561 -15835 -17088 -3859 15462 14572 13588 16487 7647 -3195 925 16419 8426 5651
13319 5651 5406 -476 -8029 -10377 -10351 -14071 -207 9436 7820 2054 743 10238 5779 6050 11732
13304 11732 11622 6003 8404 19751 25468 19766 6435 5321 5082 6422 10439 14984 15953 5710
13290 5710 -22 -12950 -10457 897 -4759 -3905 9783 27377 10658 -12320 -22902 -15856 1417
13277 1417 16238 13415 9950 9253 11233 12121 20527 12515 4335 6341 7852 -476 -974 2012 -5230
13262 -5230 3165 4835 9432 2426 766 5263 7438 5221 8011 6708 -7495 -22285 -21960 -14777
13248 -14777 -8249 -3457 -7305 -10033 -10042 -10141 -6786 6137 11096 6793 15513 17276 17469 23037 21411 16722
13232 16722 13105 2346 -4302 4181 4959 -1457 8518 9273 5817 9498 -4598 -1261 -10064 -20358
13218 -20358 -5844 -3616 970 7655 573 -6041 -8648 -2511 5372 1967 -6963 -6139 46 10830
13204 10830 3745 4090 -6800 -10864 7161 14113 8181 11524 9861 928 -17052 -11742 -9609 -11379
13190 -11379 -12844 -18850 -16077 -829 2091 154 8681 8030 15457 3139 -7623 -1655 -1261 -11284
13176 -11284 -3334 1698 22175 33952 26022 16940 3561 -1359 -2902 -11105 -20290 -20805 -11845 -5898
13162 -5898 -5624 -3433 1268 8155 -8097 -4841 -1619 -110 11229 14817 12465 19242 18708 15640 -1178
13147 -1178 -12749 -16786 -17773 -7899 -5499 8882 18563 23291 20749 5242 -2441 -6894 -3283 -12461
13133 -12461 -28851 -16940 -4832 178 249 3643 7877 -2312 -9248 -6542 -7177 -19760 -21596 -15269
13119 -15269 -6437 -8774 -9260 -18442 -26650 -25482 -14778 -2730 -11869 -18160 -23650 -16533 -9631 -9939
13105 -9939 -11983 -30990 -24169 -5121 -16261 -6446 -1596 5264 14227 13505 7026 -21448 -26963 -16327
13091 -16327 -2308 -3137 -17283 -24190 -30402 -30139 9680 28248 16658 6513 -6089 -9213 -4356
13078 -4356 -4805 -18453 -7196 5193 10668 16818 15106 10730 21606 24910 22662 24527 28345 28592
13064 28592 14161 8098 10765 11008 17389 21830 5930 -7479 -10976 -14968 -21928 -10593 12246
13051 12246 8406 -3788 -10449 -13477 -16731 -20416 -7779 -346 9747 6219 -1617 -9305 -24900
13038 -24900 -15531 -3281 8013 12323 18783 18817 16262 16495 13634 21810 16430 -1039 -4489 7213
13024 7213 8259 -11819 -6751 -3652 -17687 -15856 -1676 -15207 -23179 -10998 -8842 1471 9590
13011 9590 8681 -3086 -7173 -2985 -2273 235 15048 13812 552 5238 9619 11730 232 -3773
12997 -3773 2427 7526 14941 14103 9608 6343 -11432 -6960 -18010 -19771 -14506 -26523 -19766 -12480
12983 -12480 -5589 -2719 15190 23360 7598 515 -4333 -9635 -9841 -8378 -4802 15068 20649 2330
12969 2330 -20101 -17915 -8867 4882 4798 -3557 -12847 -7962 -20284 -14925 -662 5013 4244 -16451
12955 -16451 -17317 3208 5645 -244 -7043 6047 5607 18690 26836 23740 13438 7433 8341 1722
12941 1722 5640 8328 32024 42059 20115 11250 4617 -2458 -6386 -19160 -16758 1931 23332
12928 23332 31528 24125 7945 -4981 212 -6324 -4969 -5135 -610 2552 870 2619 7956 71
12914 71 -6037 -8420 -11160 -10113 -19742 -31409 -18134 3184 13147 2763 -2056 -1179 5800 4988 2177
12899 2177 3566 9890 13292 18854 14587 20594 16123 10501 8465 12081 10700 3170 -4745 -2181 -10613
12884 -10613 -18391 -16293 -6599 10452 13448 -6765 -18600 -17162 -17256 -4208 979 -9734 -18114 -14132
12870 -14132 2530 2124 -9452 -13013 -3018 -7563 -18665 -21169 -23575 -7405 -4375 -9167 -18300 -10228
12856 -10228 859 4377 4845 -3332 -14322 -14149 -23076 -35171 -26984 -7406 -1164 -7678 -13534 -15419
12842 -15419 -7782 -8992 -15776 -16594 -10607 -7655 -14108 -2026 15857 18207 9403 8924 16484 4995
12828 4995 -1875 -3105 -4560 2282 -3398 -7008 -4816 -3853 -5202 -70 12817 9157 10227 16894 20187
12813 20187 14334 2153 8132 9746 14596 6261 1610 2601 -1200 -3784 -10551 -18674 -24680 -22617
12799 -22617 -1784 15118 17574 17953 10009 -7381 -15224 -20973 -21065 -20029 -11694 -10199 -1965 815
12785 815 -3390 -22373 -21370 -13385 -18990 -18276 -5882 6764 19548 19687 -743 6044 2628 -5236
12771 -5236 -7000 -2765 -5654 -8476 -2843 4516 103 -13357 -6771 -2889 -2176 6022 10666 3242 10249
12756 10249 15105 3576 -1392 2675 4413 23240 15907 -1333 -13902 -21632 -12772 -7404 -3833
12743 -3833 -3028 -6188 -5974 4344 9527 9073 8539 6639 -3387 -1448 -4143 -6883 -11769 -17854 -24881
12728 -24881 -24148 -5576 10645 2347 -4376 -2936 5267 12226 14998 14609 14103 11765 5091 -7766
12714 -7766 -10672 -9589 -2017 -574 6087 5365 -4569 -7070 -5786 -10481 -25042 -19334 -20302 -10514 -1483
12699 -1483 -8522 -14029 -9713 -13542 -9762 9994 10429 -9523 -11114 -11649 -17662 -13865 -5370 -4470 -3304
12684 -3304 889 1149 -2030 -498 11238 9683 -2322 -12408 -23554 -31935 -19628 -9511 -10297 -3000
12670 -3000 19211 24002 12166 5220 -6246 -15695 -24030 -20713 -14233 -6339 1633 4118 3340 -4057
12656 -4057 3476 8681 18884 28687 28743 6547 -10799 -8895 9015 2314 2565 4105 2196 7942
12642 7942 17789 28477 20316 16718 2161 -11729 -8952 -15796 -12004 -17857 356 12263 4164
12629 4164 -2645 -4966 -5563 -17322 -22905 -18006 -19047 -13908 -4230 -8928 -15431 -29502 -15706 5531
12615 5531 466 8702 4571 -9912 -7085 -4905 -7943 -6160 6102 6858 -3456 -8876 -16036 -20657
12601 -20657 -16466 -13716 -14749 -14763 -4301 -3165 -5358 -3093 -11916 2302 8045 -5863 -4627 -5876
12587 -5876 6624 -20 -15786 -11158 12675 9338 10883 4795 -8217 -7384 1555 10758 10233 18376
12573 18376 19975 5861 -4352 -6851 10816 4968 -2641 -15045 -20931 -16385 -10348 -12452 -11981 984
12559 984 3914 4979 5314 16653 8664 6638 1710 627 5725 8840 -2570 -10118 -4705 15411
12545 15411 25095 27517 34288 32200 30854 38071 21068 7622 16298 12643 25464 21021 730
12532 730 -695 8488 5866 -5146 876 12129 8403 16744 24836 22993 12120 942 -10901 -9143
12518 -9143 4096 15822 -1005 -5332 -1312 3252 20318 29706 30973 26384 24361 24132 12991 3466
12504 3466 4816 -989 290 -5405 -10750 -3483 3465 -3124 2361 4970 6411 8426 -600 -17892
12490 -17892 -17829 -14206 -10902 -13643 119 11718 1488 -5808 -6280 498 -8461 -9038 -9602 6243 18719
12475 18719 21452 18125 6488 -10032 -10727 -9740 3919 -24 4325 15858 17096 18257 20783 16306
12461 16306 19943 18395 16264 10801 7164 -618 -851 11345 4967 -5856 -5319 -8513 -12772 6283
12447 6283 25415 25769 10844 6873 24381 14134 10078 8116 8001 2931 15383 23492 29237 19042
12433 19042 306 -3591 1901 5326 1230 -9746 -11612 -8178 -2724 6705 23134 30853 32626 39251
12419 39251 34734 27704 14842 1279 8510 25510 33742 12996 7278 25271 20310 11528 8761
12406 8761 23389 32571 31249 19052 20819 7401 -1016 -9589 -4847 6522 -4492 -9854 5024
12393 5024 5617 -1831 -3547 8595 -486 -2752 13112 33675 38951 27786 23013 27033 21191 30090
12379 30090 29274 22060 23500 23471 23540 18249 10638 4965 3493 -5962 -13594 -3719 -1307 -3312 4829 10011
12363 10011 4128 8966 -14811 -16819 1727 3782 -10023 -11703 -1205 15668 23057 22125 15388
12350 15388 12722 17190 19042 18225 10391 12128 10952 -1024 -3753 1549 -385 6434 19123 38537
12336 38537 69644 114506 140646 151879 173280 169097 143597 127442 98184 77247 78495 69961
12324 69961 56213 42102 28116 15683 19654 30828 37002 39578 38005 27674 30200 40263 43654
12311 43654 35932 26948 28380 23912 38067 48102 40742 28512 16992 23499 29088 37857 45381
12298 45381 46074 29893 24158 22324 11512 7427 8014 7147 15994 6572 2161 8671 2306 131 -10167
12283 -10167 -13268 1211 15714 26576 23144 16317 13259 3627 -10776 -7481 6323 7199 10061
12270 10061 20385 12894 8015 6357 3142 8833 12939 8648 20427 37786 34352 21185 8877
12257 8877 11698 11619 13044 13119 12978 -1565 -15100 -2156 2719 -11501 -10288 2885 13475 18560
12243 18560 9699 3452 11887 10197 11547 12302 12478 18368 24561 20277 16213 9640 5642 -8774 -3398
12228 -3398 -3217 -295 3878 8480 17200 12821 9366 4875 11532 9225 10045 9825 3305 10309 21134
12213 21134 13633 18008 19950 19043 20835 27032 35889 34791 16439 12225 12567 10649 3173 2810 868
12198 868 -1874 -7141 6959 22773 19790 12255 769 -14011 -12418 -2267 1969 15929 30037
12185 30037 23176 11901 13756 8668 13256 4427 -5142 -3189 165 -2804 -5230 -170 -4719 -6239
12171 -6239 -2419 14528 27558 30692 20100 16934 6338 -5281 -461 9420 10815 7186 2818
12158 2818 8340 2423 2481 5151 5717 1738 -1439 4789 10938 -2960 -15891 -9486 -4211 -2805 14959
12143 14959 26124 13772 -2615 -1999 1411 9274 21675 16607 17763 20965 23665 21811 17620 10132
12129 10132 639 -1262 13989 27550 24704 6673 -4045 -9144 3869 2944 393 11898 11695
12116 11695 7664 52 -1502 3008 15059 18420 19860 25087 14889 10595 17122 15765 19089 15877
12102 15877 14805 28811 34392 22125 12035 4561 310 2008 1204 -11014 -15500 4887 23267
12089 23267 27733 43883 45968 48962 55294 39823 15852 9677 12178 20942 24661 25083 28945 19841
12075 19841 13706 19780 19702 4688 -1545 -11837 -14183 -15705 -12667 -8357 -2243 -160 -130 13262 23390
12060 23390 21044 15663 18328 12812 14823 22939 30493 35575 42824 41293 41540 35586 27041 45446
12046 45446 50087 35249 40768 40221 28864 34639 51080 50083 35988 21662 17921 15814 7915 1336
12032 1336 3089 11500 5191 358 7373 24717 36351 50031 50606 31084 11665 4256 -2115 6279
12018 6279 15404 15390 6934 -2211 8003 16230 5667 12349 11068 17626 20023 10741 22498 26794
12004 26794 19758 5540 -2953 -903 9715 8751 837 9982 23690 20172 12721 6215 18539 9803
11990 9803 7810 23801 20535 -1363 14212 24205 18204 29337 40011 33059 7256 13623 22596
11977 22596 21639 21277 11848 14844 19982 19450 15880 12630 12196 10475 6279 20868 38614 40768 28488
11962 28488 30686 29810 20503 14427 9865 13690 26059 26777 17351 19438 18712 11434 9108 16353 30182
11947 30182 33355 24495 8165 10867 2446 970 -2311 -3664 4069 13028 14511 18454 7106 4740
11933 4740 14590 15958 4278 7656 4479 -3203 2392 12233 13402 11586 -6353 -5288 -1614 -3165
11919 -3165 -6086 -14858 3373 14184 25761 17121 22424 24030 16665 18477 20870 21745 16428 10411
11905 10411 9317 3345 8200 17314 32918 32043 38131 35586 21956 32806 38196 31563 25450 30545
11891 30545 33025 27760 15591 21402 5230 -538 -1907 18385 37954 36233 27406 16203 14619
11878 14619 11780 18646 16987 10523 11829 5388 5009 8578 10405 11266 -5018 -10635 -8671 -9685 -3755
11863 -3755 -12449 -12711 -5028 15309 23923 16712 9002 -2901 4480 22272 15506 13544 15890 16384
11849 16384 14236 6246 -7273 -11634 246 17775 9459 -1076 -7384 -4692 -184 6993 8704
11836 8704 19727 27983 27232 38027 32546 27807 38404 28910 34235 24242 6296 1539 2608 2326
11822 2326 1263 5783 14079 12727 10760 12376 25499 22284 12451 9960 22448 22123 15607 18092
11808 18092 16299 16288 -1964 2753 17821 25113 21111 31747 29787 19828 28311 46339 38747 33700
11794 33700 37608 37423 29445 18336 10105 10187 21637 32203 26915 20471 15028 30020 29635 22628
11780 22628 30536 34026 28748 21749 23402 35630 28474 19230 30557 30089 15151 16974 15590 25641
11766 25641 25956 19261 13740 19191 11917 8740 11198 16875 26120 16345 8185 18647 21941 4818
11752 4818 -695 -9805 -15924 -2574 22650 32462 22202 11245 9944 5847 2989 7562 6541 11331
11738 11331 24414 21144 27553 28299 23219 25595 32720 33375 38155 46065 35237 19904 1169 16656
11724 16656 18212 15224 33459 37803 43165 40448 21467 23018 23552 23053 20482 23143 33953 30352
11710 30352 27119 2418 -11045 -8815 737 10974 10742 15984 21161 15091 9276 21220 25352 29240
11696 29240 28118 14786 6670 -3397 4654 15551 11294 15577 24426 31818 39243 40654 37555 23753
11682 23753 22398 17656 13493 19434 20178 21097 20991 19104 24130 36612 31890 18951 9692 14496 23064
11667 23064 20552 13271 -7752 -19505 -14680 3391 7533 5546 -273 -2242 2286 4704 4844 10730
11653 10730 12861 10358 5163 4654 12159 15124 5312 4415 14844 19264 23685 26610 39226 45014
11639 45014 32410 28572 14992 6929 5291 7519 6748 4598 -422 2993 12375 15594 38158 52779
11625 52779 22687 17359 17191 16272 7415 6795 9662 12722 7212 15892 16752 12523 24150 35023 37343
11610 37343 22406 13184 17908 15453 17829 13432 15175 15494 23891 37264 35330 15382 12294 14342
11596 14342 18174 27810 35487 44739 36207 29201 21772 -9 -13399 -16799 1047 14425 12562
11583 12562 14189 21495 15162 7535 19149 26819 39243 44426 47623 32364 28592 40820 41230 33320
11569 33320 25421 25931 31016 36161 36805 23361 13557 5772 10445 9142 12318 20567 26809 18825 10255
11554 10255 -4372 1490 11884 7342 11527 20052 16622 13379 8837 17890 12984 3737 4116 -6675
11540 -6675 8127 20049 9131 -11528 -7333 11474 17742 16522 15886 18612 6611 6596 14635 21111
11526 21111 14111 4011 1999 595 98 24406 28837 24994 15861 16976 30247 39667 48411 57843
11512 57843 54491 37641 17667 -390 -9542 -6695 7171 8494 16309 7267 8137 11827 11110 13758
11498 13758 11258 3755 3811 8248 433 -5329 2204 8310 11042 -47 7645 11745 18419 9239 1959
11483 1959 1542 15246 13944 16301 10177 6781 19432 25163 26796 30126 27147 30801 37124 27885
11469 27885 8850 5355 6932 7527 6682 21158 22740 24903 35434 29685 39164 46878 38183 20579
11455 20579 23529 29771 34278 50210 53006 30265 19078 21657 33239 30057 30065 20849 16030 20384
11441 20384 16058 19029 22533 20935 38033 30742 37832 51721 47192 26595 35910 38409 38912 33928
11427 33928 31889 34628 32933 28015 23995 20049 22714 25828 20376 24225 22901 7760 16876 11379
11413 11379 -1711 644 -828 19892 41162 38476 35422 21788 19480 35821 39852 32245 30054
11400 30054 32438 35414 31617 27892 26903 31113 37863 39317 50586 57421 47138 31428 33364 35285
11386 35285 40533 40339 34377 30495 8379 -6974 -8889 -3820 12705 15786 13518 16083 9596 15204
11372 15204 16469 25365 23493 28414 21221 21912 32975 30774 21336 18658 19148 19567 17744 26464 32061
11357 32061 27758 26947 39932 38929 23876 29747 22709 18290 27835 28879 19476 32090 39407 41420
11343 41420 44832 53777 35147 24076 36007 34318 36389 38038 35255 32596 16981 6588 34012
11330 34012 48437 53888 63981 58618 52794 55423 50249 33929 33667 38817 32421 31771 31098 27616
11316 27616 26398 44711 39636 24190 26001 22163 24896 25396 22172 15937 25247 32207 32010 41026
11302 41026 43682 46645 45256 37457 25552 28445 28686 16790 10722 14395 19807 21170 9451 9970
11288 9970 27603 31396 29725 36639 32272 33847 42621 39633 38309 31408 13631 18268 35535 49826
11274 49826 46349 47873 58657 63578 56290 48993 49882 59534 60847 53878 48369 44469 29355 32874
11260 32874 36533 32529 29106 23357 27426 30919 23526 7529 7365 15320 26077 36110 34560 33195
11246 33195 30209 35966 49167 47858 49783 51255 41578 42607 27574 16176 16604 31018 36611 31138
11232 31138 28699 33347 42159 41337 36365 43205 49477 66628 67280 71057 59604 56918 58000 62201
11218 62201 70523 69863 72098 62841 51746 44108 56321 54934 44081 54741 71953 58351 42052
11205 42052 37078 39183 44994 29724 22866 45116 41869 35223 48179 61495 60513 58340 47438
11192 47438 41344 27605 33027 32366 31739 42918 53866 52532 51488 56378 62891 64336 72705 90821
11178 90821 115087 115288 103356 92560 89831 93636 94869 96923 93662 105495 103625 88590 89562 79490
11164 79490 71735 62227 48497 47406 62201 68608 63153 58839 61590 63668 63834 64939 57280 53151
11150 53151 68476 81829 70883 59382 65933 72399 70010 66286 64492 64611 65814 72237 72881 63454
11136 63454 72879 85513 71332 70596 76111 79495 97771 96748 95304 97975 91343 93041 110678 118847
11122 118847 114407 116628 119717 119267 103225 107764 109281 103598 102797 84257 57332 54757 80508 90716
11108 90716 85304 72717 66803 70547 64513 48436 52567 62198 69969 78942 87101 99521 86616
11095 86616 82712 98069 104568 99653 85170 75703 86562 103016 99688 99203 88674 73896 76788
11082 76788 80496 83817 104533 107152 107435 104716 88686 82419 85726 97564 105745 99046 91399 91914
11068 91914 82552 89739 108547 108889 92127 92035 110115 117928 111419 100697 102171 95687 96799 95086
11054 95086 93618 95601 106750 103803 102222 103543 97736 99604 91316 73763 68513 79658 82661 71057
11040 71057 74228 77994 80247 79522 81331 67329 65062 65408 79514 97151 103394 102477 108595 97397
11026 97397 85943 92915 89725 72542 72591 87871 96264 110210 101527 94474 84454 77758 87220 94550
11012 94550 91567 98726 105552 103020 96005 75986 79381 95426 105265 115631 113857 107789 107674 107495
10998 107495 110627 108544 93688 102308 106883 105781 108699 111466 106156 97672 86929 94269 123842
10985 123842 125418 105515 96456 109158 99852 88254 87222 81394 91695 93709 85801 80392 94149
10972 94149 101599 103207 97081 82182 73856 77154 78611 75180 76409 90333 104444 103469 101441 94804
10958 94804 85687 92408 101878 107543 92038 94316 99682 110983 111580 109759 105474 108904 105020 110298
10944 110298 120232 115752 106021 92171 91247 97934 95729 100018 105153 121931 132073 135108 124138
10931 124138 106191 91134 85897 97396 113113 118887 118137 110408 104190 95771 90064 109025 116158
10918 116158 134308 158700 179247 200797 208530 195800 169202 137404 124037 119685 119241 115566
10906 115566 104192 98337 96154 95803 87952 76694 69662 64423 61260 57305 62513 73322 81699 81152
10892 81152 92620 94659 100315 117968 114098 106760 99714 98824 97736 95671 102895 108427 112022 105172
10878 105172 99189 93519 96850 113565 115023 112871 107485 121207 126564 135396 129127 118812 128774
10865 128774 139459 141588 142489 131417 122682 120338 122992 149518 161322 167239 166433 173255 179886 177758
10851 177758 184588 187204 198770 210090 241840 275504 284675 292532 329483 381548 441172 540300
10839 540300 693625 951070 1371903 1913161 2407706 2609372 2397057 1957645 1669886 1699842
10829 1699842 2008684 2424409 2687092 2576226 2094140 1526850 1120459 893109 775498
10820 775498 713873 666834 632689 609512 583492 577052 563186 547075 516186 470255 466390 458760
10808 458760 466132 455962 435243 417053 419800 411882 407755 421202 425999 437763 459991 460542 421997
10795 421997 382346 366927 366040 358397 343013 331803 337856 332246 323185 329206 327979 326934 326333 323812
10781 323812 311573 296132 285409 284007 280041 272312 278153 291922 291812 287139 281926 268822 265702
10768 265702 251723 245404 264763 280115 270157 270808 282375 271072 247382 239551 252863 257279 239576
10755 239576 252158 271532 275684 268110 255284 262463 276488 286212 283101 294439 315587 323994 312866
10742 312866 296031 279245 252868 255140 291965 340062 348378 350622 346044 359016 363854 393663
10730 393663 467216 572856 731280 955186 1284065 1799514 2542195 3477256 4358858 4794778
10720 4794778 4625034 4017714 3430991 3251127 3513273 3997932 4326402 4251810 3731651 2970229
10710 2970229 2264908 1776600 1480197 1290038 1164753 1087850 1024855 989949 975408 946015
10700 946015 924674 907204 892870 866548 827825 798023 774943 757707 743194 740469 752100 770056
10688 770056 771542 748245 716991 687225 676340 674009 673376 683327 671444 645851 622362 604348
10676 604348 596565 588640 572960 550026 537995 528410 506383 507774 515173 503765 505633 513828 529805
10663 529805 535621 532360 512565 502361 504869 511699 517908 533169 531495 523398 498849 481957 466774
10650 466774 458352 448954 439878 453691 459049 445759 420321 411593 393440 372987 352288 335016
10638 335016 335625 352063 370388 369196 371717 371990 366636 368489 378738 391316 381688 366606 360562
10625 360562 362388 356103 343920 339945 337821 328741 329785 340699 345861 328715 312079 308078 311507
10612 311507 333321 367337 404333 419131 408764 395906 380747 372803 367153 366157 379861 367538
10600 367538 350608 348533 350367 338441 331332 306950 271826 257348 275892 316308 337805 324126
10588 324126 301444 273382 244942 235460 278304 327659 349547 344769 319194 298908 278814 290850
10576 290850 343784 380159 386822 382945 394821 417040 422104 424989 439819 443907 457300 483303
10564 483303 557288 671750 806436 910053 937175 905141 844264 846245 892318 961660 1041763
10553 1041763 1079923 1034888 932636 841360 790714 776260 773638 772308 763234 753904 752836 770579
10541 770579 797591 831175 865310 895960 927369 978111 1036756 1095622 1136497 1156332 1171332
10530 1171332 1168514 1143431 1111765 1110808 1132551 1150280 1147260 1134302 1137359 1135391 1145794 1164434
10518 1164434 1203214 1227420 1234449 1262937 1300916 1337894 1364525 1385942 1447399 1542864 1699546
10507 1699546 1887241 2035883 2080557 2017774 1924359 1895870 1931605 1983693 2044692 2074595 2071822
10496 2071822 2058642 2051119 2064925 2114919 2173320 2186750 2143116 2068764 2003286 1965337 1946689
10485 1946689 1950690 1984190 2065078 2155381 2235628 2313144 2402732 2486865 2575313 2707479 2856494
10474 2856494 2989179 3110875 3243540 3416540 3598436 3774060 3909539 4021207 4165882
10465 4165882 4389176 4703879 5069386 5484818 5935769 6389270 6861469 7435195 8227567
10456 8227567 9382262 10996477 12868955 14475546 15442973 15799009 16238449 17478668 19729265
10447 19729265 22861168 26442886 29935461 33100123 36614560 41896507 50140208 62414989
10439 62414989 80887474 110154774 158958989 237694101 339706830 425148341 454335140
10432 454335140 412439328 331755168 279815877 286513785 344716601 420379796 464691572
10425 464691572 443686986 358575770 257733194 186569111 146131879 122780002 108108887
10418 108108887 98305317 91490102 86729402 83359880 80622890 77688441 74029585 69869495
10410 69869495 65784231 62216083 59432259 57336614 55489074 53310581 50542766 47451554
10402 47451554 44455544 41801044 39475265 37427780 35654535 34135196 32797516 31586984
10394 31586984 30434524 29271092 28107708 26987815 25952415 25042183 24212036 23441624
10386 23441624 22710560 22012464 21376016 20818684 20322424 19840485 19397112 18976823 18555692
10377 18555692 18139204 17715537 17276085 16805811 16287864 15703761 15083295 14475057 13916158
10368 13916158 13430899 12989326 12555826 12131268 11710834 11301831 10916620 10579990 10293153
10359 10293153 10039141 9777953 9491820 9229498 8977178 8726513 8474862 8248966 8047750
10350 8047750 7851758 7656498 7463303 7271827 7101793 6945925 6800157 6625545 6459492
10341 6459492 6307586 6171017 6045277 5918020 5808687 5684494 5575084 5476890 5374367 5285863
10331 5285863 5212456 5150007 5082538 5000928 4903447 4801836 4687356 4575394 4484749 4393646 4289813
10320 4289813 4174228 4076780 3955658 3832071 3735903 3641946 3562104 3476003 3416527 3383758 3340635
10309 3340635 3248955 3097106 2943418 2868303 2885350 2893830 2851739 2753470 2576944 2351685 2180703
10298 2180703 2106422 2054905 1979550 1889316 1790837 1691301 1617031 1564126 1489989 1410040 1347469
10287 1347469 1289136 1229051 1182352 1144394 1120302 1105055 1066788 1031080 991055 919820 870252
10276 870252 857477 877061 873320 852902 814070 778926 724846 706886 727378 758268 766913 740558
10264 740558 694473 647111 623771 623132 617617 608214 595086 594396 604957 619471 632355 662013 686765
10251 686765 717560 709787 684040 651091 631232 624341 612497 585121 538512 501214 527371 547452
10239 547452 559110 571273 581193 568367 526434 507391 496379 492596 478455 483795 502758 500359
10227 500359 509105 518410 536365 573711 628575 699622 770628 814874 818576 787643 757466 719637
10215 719637 670193 582132 516349 466772 440377 409146 391957 378769 358950 346720 323824
10204 323824 321094 331561 341735 368383 374173 380127 377701 370578 378296 404861 410542 404167 377984
10191 377984 352324 338994 332143 335806 353222 352586 350516 358566 363758 364848 382239 396965 396944 399988
10177 399988 401414 400778 391234 383358 373799 367579 369280 354082 337817 321318 307827 289837 273498
10164 273498 274693 274940 255032 239979 235779 222307 202916 202945 203209 195826 179130 153680 128004
10151 128004 125656 147032 148528 140260 131425 127526 122064 111084 117586 105466 106436 111007 108843 108384
10137 108384 99055 102855 117102 136158 156794 172568 182525 190792 199238 217633 212023 196616 181141
10124 181141 160832 155132 162880 186202 183156 167044 144243 113582 70813 52476 55242 88203
10112 88203 118741 146712 182395 212364 260775 363534 503138 632056 678466 648380 608916
10101 608916 648870 733331 808063 836050 827847 832108 860258 838510 756684 698381 713893 755052
10089 755052 749666 653315 501305 385715 326849 282993 246396 221970 191626 171545 165270
10078 165270 159952 147777 150266 163216 185487 205229 250616 346106 497787 639549 698481
10067 698481 625363 431720 305188 238820 200351 170297 150762 139931 127299 126565 132256 145743
10055 145743 158361 155953 143115 137237 145469 154830 172199 183729 171764 161106 149052 142748
10043 142748 143092 143816 165376 195919 215913 226684 237533 253244 295373 359994 439359 560685
10031 560685 746485 1065281 1570112 2141157 2522250 2534361 2187655 1794276 1649527 1811821
10021 1811821 2181874 2531106 2609880 2300110 1756104 1270168 966578 776995 679177 619108
10011 619108 567251 526474 499310 485683 482081 450295 421686 395050 371895 338264 309835 301125
9999 301125 287435 273050 270829 250445 233855 232211 220553 202784 199957 198649 189295 183627 185665
9986 185665 176118 165625 157472 138193 139191 138029 132918 133684 136378 124807 120118 116097 141197 159245
9972 159245 130192 114218 102575 99386 79653 76426 90479 106091 98305 83722 85405 91476 88198
9959 88198 86038 93433 99754 100314 97109 106154 98109 89750 94007 90093 88434 90145 97125 111455 120891
9944 120891 126350 135990 160718 207770 289926 384562 459627 493262 459897 386627 324500 295618
9932 295618 277936 301696 366448 449481 509475 506226 442333 366132 308322 252572 232985 229577
9920 229577 220728 211200 198418 171946 160714 161421 145752 133745 143827 145611 147934 144148 119408
9907 119408 103081 101744 93040 83918 74840 82523 92690 93963 84411 78706 84250 75768 60474 51754
9893 51754 58398 63708 51943 41172 47054 47464 46923 41839 37989 35338 52409 44126 34907 35451 38174
9878 38174 29031 21661 6824 -3662 11113 12227 -1753 5683 6081 -1052 -6193 -11458 5972 22641
9864 22641 13276 15543 17255 20018 30630 24654 34030 29171 14008 21292 27003 37550 43952 56080
9850 56080 52337 52874 33094 38364 34201 24568 12512 23755 21748 9704 -3760 -4898 16796
9837 16796 27362 13321 2150 -5858 -14888 -6403 3028 13755 13024 16116 15621 20569 23325 29768
9823 29768 42908 44029 45904 47583 44257 47784 42944 34110 36369 35183 28403 33847 35935 34687
9809 34687 28082 31596 35583 24581 1232 -1560 12707 10400 12451 6965 532 8877 13345 3575
9795 3575 -5974 -13584 -12932 -15359 -14656 -11347 -880 7084 -5119 -15598 -7650 -17891 -9054 -4684
9781 -4684 -5262 -8295 -12629 -5108 -13123 -6839 10070 6641 18441 10179 28254 41679 47343 39842
9767 39842 29978 16483 6180 4355 12745 16159 1355 -1992 16597 25371 17273 2957 6530
9754 6530 7713 10537 3084 -1394 -19735 -21497 -6277 -6843 -3953 10530 8605 8290 3476 11035 12979
9739 12979 1451 -172 -972 6768 3204 -639 12672 22058 25591 21186 18119 30812 41235 34010
9725 34010 29359 22681 17225 11721 671 -3681 -2135 -1735 -3182 9980 5432 4814 9774 18294 28789
9710 28789 25057 16000 12016 7728 10095 8640 6284 143 -13294 -8271 9198 7044 8767 -1218
9696 -1218 -5304 3610 6419 3169 4947 914 5555 11500 330 -8162 -2374 13794 16962 30175
9682 30175 36386 29236 9293 9870 11769 16763 21691 27043 27717 24671 27033 29574 27950 40851 34788
9667 34788 30691 27181 21438 21661 17271 14618 24474 22940 1214 2196 11436 13437 12300 7309 -4588
9652 -4588 -14255 -30520 -17296 6304 10684 10553 8346 8460 3084 -4318 -17923 -11080 -1101 3216
9638 3216 1219 14323 38741 45698 41365 37316 29847 24684 22861 17042 11113 7702 6450 5490 4642
9623 4642 2875 5761 13107 4877 -3779 2074 5034 -7367 -3861 3034 1875 -8981 -6698 8774
9609 8774 18678 24804 8984 -11004 -18075 -20410 -21612 -16522 -20196 -21422 -4835 -12723 -12577 -334
9595 -334 2990 -6186 -6770 4833 -1325 -14289 -20137 -20532 -15139 278 -7328 -22096 -33281 -21834
9581 -21834 -18908 -11523 -4287 6671 3339 -1198 -5284 -2777 1895 -5833 -11412 -21386 -14400 -6389
9567 -6389 -14081 -26097 -20532 -23707 -29791 -36737 -29955 -17303 -9017 -2758 -1544 -20268 -25839 -27182
9553 -27182 -29894 -35612 -40869 -43441 -32583 -25265 -18752 -29057 -17636 -20684 -21078 -465 -274 -9569
9539 -9569 -12743 -930 7000 -8127 -15728 -25095 -23834 -12864 -22871 -35069 -31019 -10091 -1433
9526 -1433 -14990 -21307 -20742 -18610 -13962 -25411 -25603 -28660 -25180 -24186 -25865 -23366 -18807 -7349 -23806
9511 -23806 -38424 -22855 -24581 -6192 -1993 -9423 -7906 -13321 -3950 -2393 -2626 4535 -3607 -6724
9497 -6724 -15249 -29402 -28284 -5744 885 -6172 -8680 -16924 -20917 -22615 -34604 -40457 -33034 -18726
9483 -18726 -10520 -8552 -17364 -23265 -24680 -21293 -17768 -25631 -31842 -26709 -10959 2246 927 -966
9469 -966 -17642 -25955 -26497 -19391 -19435 -23813 -32029 -31725 -25500 -23655 -17139 -1964 5324 -4424 -4288 -4915
9453 -4915 -21271 -19446 -13251 -13747 -14854 -18431 -21176 -25187 -16330 -22014 -20863 -23909 -8277 -5243 5755
9438 5755 11901 9300 7734 7404 3128 8131 10333 9818 5678 -3865 -9667 -11774 -17398 -21890 -12458
9423 -12458 -10152 -6525 -4299 -6072 -10191 -8997 -258 10399 -259 5725 18454 7463 672 4389
9409 4389 -2985 -10217 -9751 -16640 -15050 -10678 -5843 -7086 -15484 -15714 -23319 -16909 -8695 -10897 -1938
9394 -1938 8474 8249 628 -5609 2958 -7025 -6506 -2193 -1595 11678 8082 2868 5954 12665 6753
9379 6753 -11125 -5688 17187 28853 26634 17719 6341 1807 18476 32216 27817 18956 22897
9366 22897 28647 23940 14244 19561 30361 16018 795 -4895 -13177 -12695 174 -1377 -4437 -11347
9352 -11347 -22158 1388 34305 36777 25571 15871 4168 341 -2795 -7022 866 18807 23184
9339 23184 11271 1472 -4010 -9460 6199 16648 18850 29954 36424 35383 22214 17378 7873
9326 7873 -691 -16289 -8911 -14937 -9100 -1080 -2001 3275 7381 -1864 -6817 1329 -5641 -474 7769
9311 7769 8930 4192 2875 -9430 -12782 253 15068 23210 20779 20182 -3223 -17896 -5250 -2549
9297 -2549 1542 -2513 -11439 -3591 -6450 619 7037 10883 12855 22223 32986 25189 24839 17389 25763
9282 25763 33194 38117 41901 38956 33791 32841 37915 41558 42102 46991 54299 65017 67349 66753 71339
9267 71339 98386 141108 171217 187695 187902 159607 114810 61811 46572 57104 63168 65356 62526
9254 62526 57165 57416 66792 69546 68031 56078 48059 34315 39148 48351 37473 20455 27027 28803
9240 28803 24045 21408 24222 19342 15518 6543 8982 3343 -1372 -2268 -2243 4404 10945 12414 17451
9225 17451 19069 23475 21037 22093 10928 4522 9333 10777 4194 7274 9954 7050 4271 6569
9211 6569 7685 10219 11286 9361 9222 10972 8124 4488 8126 4205 12124 30846 50767 49610 29917
9196 29917 20120 27027 23999 28944 31589 22666 19335 26829 21762 35753 44381 48667 50688 50056 42042
9181 42042 36666 35743 31731 27253 28699 35509 37452 27075 26778 16325 7607 3596 6151 31125
9167 31125 43507 33818 23095 30845 40659 45619 48977 52423 44942 47926 57652 43813 36948 40942
9153 40942 54999 59752 56993 38338 39431 46517 51912 55756 50636 42672 47500 55738 53025 56079
9139 56079 64560 63090 69019 91615 90325 78096 71938 64931 64712 69239 57584 43557 36016 47583
9125 47583 46030 48149 55104 64982 64228 71730 68887 62463 67315 87386 94427 94945 92555 96802 88544
9110 88544 88142 86181 91793 94931 111229 109200 98448 101633 109551 124106 129865 137214 147396 162754
9096 162754 161077 160444 163632 175540 185574 201492 229083 246809 249050 274972 322344 377088 431513
9083 431513 489658 566048 676026 826792 1034308 1335558 1757618 2417311 3593563 5810939
9073 5810939 9652420 13937007 16038498 14864974 10355535 6345026 4200898 3086878
9065 3086878 2478292 2122557 1904913 1757948 1637075 1562348 1500000 1433570 1380639 1328127
9055 1328127 1276211 1210379 1140330 1089121 1041540 1009799 953942 900434 861963 819755 778717
9044 778717 744098 717913 689051 650259 605750 581049 560881 536645 522002 516742 517065 496799
9032 496799 469328 453191 440556 432000 426707 416171 413744 410795 403751 387858 377658 351937 336892
9019 336892 332035 316273 298095 295292 290816 280279 258488 255401 260712 252889 230016 212606 213205
9006 213205 207770 197183 200246 200917 197559 195616 184171 173296 173947 179906 162840 149988 154694 156789
8992 156789 146172 139147 145920 150271 133510 124866 138079 139585 134608 137766 139504 143568 147042 142959
8978 142959 143482 133709 117298 95518 98400 112593 118524 128635 127565 114560 98099 89016 93188
8965 93188 92692 95755 108138 100972 105050 111305 104139 99168 105193 107792 90987 100920 107538 103105
8951 103105 97677 102090 97340 98006 90510 79791 70552 69324 79195 74406 68036 73940 78650 75872
8937 75872 57215 57364 67759 66943 68384 64370 58304 44314 47737 50777 56840 69427 66874 69789
8923 69789 74724 71970 68740 67782 69111 63782 49280 44171 43921 47538 61215 67511 71711 63209 65825
8908 65825 76392 66534 64358 68515 50627 38676 55685 75997 78631 87617 72129 71154 82116
8895 82116 80397 83853 77837 63510 71542 76852 73717 72368 68142 67840 58872 52405 49002 50601 51554
8880 51554 48443 53423 57415 47594 40851 44520 40988 38999 53564 47974 33422 28582 40440 48874
8866 48874 51529 55451 56095 52139 53566 53957 45419 41112 35144 22666 25640 28026 40370 46499 35241
8851 35241 36216 50680 47009 43938 32574 30703 29489 29063 31510 36637 33620 44703 55633 45449
8837 45449 39930 57131 68076 67946 99463 139306 157385 156962 162602 210948 266201 309022 325292
8824 325292 300560 231642 173324 124760 89599 63347 60691 56396 63441 59061 60222 55260 48602
8811 48602 51489 50166 45917 40904 38391 35962 45810 51030 55982 56774 58554 63514 56866 59825 67398
8796 67398 69777 71486 97625 143537 211912 282623 334501 367617 332416 265524 210692 160346
8784 160346 119175 108485 114612 113200 107752 92814 89791 79584 80625 78854 89841 119136 140219
8771 140219 153756 162093 162449 135075 99327 85709 74565 58178 63252 73848 88227 95794 106074
8758 106074 107791 106631 110117 120665 120625 120647 116330 124382 150763 200692 256175 304735 330717 312731
8744 312731 257813 193986 158769 139184 133751 159960 200720 262873 350214 415144 451729 427076
8732 427076 358142 299940 297042 341214 449112 637654 919930 1230284 1398290 1312826 1005397
8721 1005397 693469 484025 360648 296964 261008 243466 229478 213670 218193 220407 221714
8710 221714 220753 218809 205305 194302 195562 203161 192267 180508 173638 170768 165422 166804 185884
8697 185884 170269 156927 166041 166472 167045 168603 168362 168153 165026 156789 143242 152065 161075 183243
8683 183243 203574 207507 203343 229815 265860 313079 377501 485233 641566 860239 1128956
8672 1128956 1410821 1615814 1611453 1377112 1057881 779271 596628 488369 436709 402603
8662 402603 388046 369562 373826 391427 401704 378818 352803 345778 352149 346703 341483 318872 299581
8649 299581 286109 271519 262908 263323 253185 247273 237297 238165 244372 233034 213427 213327 197584 181988
8635 181988 164452 155951 146421 133940 127290 131178 140972 138771 123314 109577 105099 97184 93562
8622 93562 80613 81253 90924 92796 93308 91015 81242 93940 98421 102426 101024 90095 83800 83241 69593
8607 69593 63678 58503 60057 68032 67857 61458 57378 44996 43543 45913 58838 62684 86094 92932
8593 92932 76677 59748 50158 48646 55056 60643 58164 62976 62570 62353 65292 53399 40839 35276
8579 35276 39062 36303 42357 53095 34106 25706 28316 20041 17957 18042 11014 19909 37516 39205
8565 39205 30069 29294 29113 28379 35591 31855 35663 33560 23848 20394 28065 32301 31502 19705 28887
8550 28887 56516 67578 68155 62346 55503 43320 35055 25783 13124 16844 18266 27836 31031 32764
8536 32764 23421 20454 20909 24914 20317 20384 20965 2126 -2917 1636 9171 14896 23666 32528 25994
8521 25994 8440 12668 23778 34897 34108 35157 50113 56994 70956 89009 98013 96316 78078
8508 78078 60007 41605 38044 45529 69958 81511 94794 131466 184021 248309 325027 369394
8496 369394 364150 317612 244333 183141 146990 116103 93187 74792 73182 78211 71564 66739 45546
8483 45546 39236 45480 32309 41724 55668 41228 24422 14806 10760 16158 25703 26215 14200 7196
8469 7196 14739 27694 28756 31759 25554 24829 32610 38460 40423 27051 39025 46565 33664 24919
8455 24919 30764 15430 6695 -3341 4129 16801 8104 6098 11737 23547 30776 18067 -3924
8442 -3924 -4419 1144 13580 31319 43384 46326 39158 44886 39584 31820 10202 1879 11475 11764
8428 11764 5081 -2312 -5643 -5071 483 926 6145 17108 16567 15762 1563 12102 13403 2965 -5216
8413 -5216 -7815 -8632 -18014 -25054 -30355 -8425 -8062 -13161 -14482 -11154 -18410 -16126 -14631 -14206 -4598
8398 -4598 13706 13253 6472 593 -1268 450 -2193 3272 10852 14248 13369 18892 10669 5063 11038
8383 11038 21879 5961 4013 -6691 134 16054 6580 11 490 -272 5035 584 13637 22708
8369 22708 14244 14908 7110 4154 5615 -2823 -5251 -6043 -6011 -2143 -5709 -7836 -330 885 -1871 8697
8353 8697 5116 -7922 -5006 11511 18844 7646 -2406 -9817 -7320 3303 -809 -233 -1416 -4981
8339 -4981 -11165 -6073 -14308 -19285 -10410 -13335 -7731 -4122 -13051 -15437 -8562 -3458 -6915 -15905 -13745
8324 -13745 -3935 55 4445 12599 -291 -16255 -22054 -17454 3520 8862 12661 21934 35075 41149
8310 41149 32534 15554 1950 1506 16950 19718 7767 -2352 -12419 -3515 8906 1873 -1870
8297 -1870 -8697 146 7847 3230 -8159 -5964 4012 7125 5841 11216 9130 6417 3426 -4092 -1263
8282 -1263 -12760 -8729 -4138 9631 12358 14865 10684 4593 -396 8191 -10949 -25 19418 24395
8268 24395 13861 15411 19170 30416 21304 -573 -13220 -9144 -10029 -22764 -15218 -7385 -2906 1268
8254 1268 8310 2017 -1758 -633 3930 -5389 -16600 -266 7887 13675 15527 10139 2503 -30
8240 -30 1462 1272 9492 14878 15975 12801 11637 -48 11211 10776 16556 19991 9600 18102 31957
8225 31957 31268 13254 2124 4463 6805 2021 7072 494 -1020 934 7898 9019 9164 7144 10381
8210 10381 4692 -1627 -320 -329 -3073 -8489 3598 6098 -13030 -22546 -19757 -10668 5985 10262 14571
8195 14571 15769 7758 9842 4122 -13256 -23521 -10213 -224 1187 -7730 -9957 -11714 -1483 10345
8181 10345 9370 -885 653 5890 6859 4691 5994 14376 17145 3782 8598 10883 20717 19870 14395
8166 14395 21627 13158 -4439 8683 15004 11038 5692 -6758 1643 10145 3544 2461 647 2422
8152 2422 -12488 -27907 -11661 3782 1293 -12887 -20533 799 9182 3091 3620 14532 21252
8139 21252 20251 25495 22038 24897 12669 -4412 6172 16985 13491 10110 317 -14511 -13593 -3239
8125 -3239 -6644 -2428 306 12556 22191 8645 -8877 -1171 -2880 -1114 10109 15002 15606 11925
8111 11925 15991 12473 18788 24803 31849 30888 35982 31399 13746 3688 3729 -2351 2471 24524 16453
8096 16453 7554 17475 17407 4357 -2280 -851 -929 13579 20767 22924 27502 20987 6559 1049 1314
8081 1314 -3530 1477 -1745 11639 21075 18345 12180 8201 13170 27939 35570 25138 14652 8839
8067 8839 13473 25923 23230 14376 11131 14005 20065 34716 32110 27596 38172 41131 24163 24446
8053 24446 30997 33579 43394 45248 30693 31389 34665 52547 63033 57643 58120 46808 31114 31246
8039 31246 25349 10333 10897 19751 22835 13950 -16 3396 14786 21966 18396 17535 40676 40826
8025 40826 25251 21744 25689 22265 12304 14014 17843 27224 21694 22746 21417 36258 23039 8776
8011 8776 17193 32834 44531 49043 47902 38137 40052 40188 46707 44115 38674 43965 44353 35474 22815
7996 22815 20413 26053 26680 21504 27558 28943 15591 23225 34117 30938 32920 29042 28256 11981
7982 11981 19122 26713 29739 31976 19921 24353 43716 42814 35198 40286 38761 26684 21488 36194
7968 36194 35499 28937 23686 24081 23560 21916 21406 30989 39868 36581 23906 21319 24145 36829 33211
7953 33211 29539 18435 18245 11750 8043 6216 2864 3610 12134 20914 10796 8556 20632 31695
7939 31695 26674 23922 16746 6048 9395 15382 31216 33674 28380 4913 1826 14026 20701 14847
7925 14847 8807 9486 21618 16745 -6616 6296 22215 2874 8277 30580 23047 10862 21022
7912 21022 23303 16049 -333 -2267 -8906 -14692 -9571 -10296 2655 5718 7435 15776 9149 12276
7898 12276 17905 14765 16864 27080 30582 23106 10570 7652 8312 3660 -9883 -12422 -13998 -25187
7884 -25187 -17918 -5996 -1827 -8605 -3663 -2034 -108 -8218 -9393 -12574 -13366 -8376 2124 76
7870 76 -5038 -5839 -8348 4634 17435 201 -6918 -6332 2045 12246 15816 12764 -2454 -20284
7856 -20284 -8536 -4697 -14397 -22357 -15520 -9854 -24143 -42046 -29030 -19446 -9161 -1654 -7827
7843 -7827 -6012 -5867 -3672 -620 -2462 -6257 -16851 -17299 -2903 1102 -9381 -11808 -11754 -12116 -3592
7828 -3592 7 -3811 -7067 -4215 -2020 7520 1154 -750 2433 -16728 -20519 -4741 16577 19036
7814 19036 17797 9623 5807 -11278 -13856 -15285 -14164 -6260 -5711 -8337 5641 14324 12273 -7664
7800 -7664 -21064 -21503 -14623 -10040 -10316 -7093 3675 -3284 -5720 572 14467 10129 8071 12737 13845
7785 13845 4237 -7206 -14053 -4435 -4617 -24246 -21275 -15617 -4368 -10369 3055 6201 -12011 -26428
7771 -26428 -27632 -8606 6178 6061 3 -7122 -7400 1166 9216 -3675 -12848 -21770 -16596 -488
7757 -488 3060 5143 5471 1120 -3890 -6360 -2744 14824 8707 -11828 -17185 -15205 -7913 12547 20968
7742 20968 17835 -6335 -5184 4290 9827 14783 22503 19512 22338 20674 2984 -219 5855 12940
7728 12940 14299 18918 5276 -10299 -495 7712 -6797 -26176 -22167 -2609 4268 6123 1818
7715 1818 -8728 -10377 -5367 -12054 -15859 -17101 -9782 -9076 -7376 -2493 -8071 -14507 -19410 -6841 -4851
7700 -4851 -4605 -3925 -8839 -2767 -9392 -20616 -16823 -3001 203 5554 11822 10692 11652 11060 12299
7685 12299 16838 23349 27615 13850 168 -15530 -17805 -21142 -19255 -17522 -9692 -11423 -17687 -26714
7671 -26714 -30144 -26774 -10416 6232 1431 -3042 6342 6380 2273 -6691 -2925 -3088 -10609 -18368 -16709
7656 -16709 -10189 -10448 -4439 6812 5786 4311 -5481 3144 4091 9467 8380 1246 -9222 -14375 -16458
7641 -16458 -14894 -17225 -13432 -11000 -21388 -30288 -19219 -26267 -22586 -21767 -13551 -8102 -10171 -13306
7627 -13306 -24768 -19520 -7465 -6088 -25973 -21732 -8875 3967 885 -1231 457 -2878 219
7614 219 -10638 -19493 -4606 2625 -613 -5552 -7711 -15440 -15842 -6794 -1843 -6462 847 8232 4437
7599 4437 -2754 2802 14872 15825 18348 17087 9339 -14131 -15329 -5146 3615 1539 -5210 5870
7585 5870 15961 6960 2469 -3986 -24125 -21964 -28225 -29375 -31969 -28734 -17513 -24016 -20617 -16478
7571 -16478 -6207 6324 -14101 -24248 -4571 -1937 -15773 -27467 -26706 -8116 -5567 -3895 -7502
7558 -7502 -6180 -1702 -13183 3375 13740 5675 -1810 -1152 -9558 -3170 -7655 -15769 -24149 -26073
7544 -26073 -26140 -21049 -12890 -21661 -28514 -33041 -28126 -13164 -4034 -13876 -10250 -6384 5146 -2571 -7905
7529 -7905 -10007 3554 6737 -942 -2645 -7098 -4892 -2899 -1599 1372 13659 18075 2159 -4850
7515 -4850 -4500 -5821 -3174 -22633 -24370 -11529 -13380 -18689 -25361 -14851 -425 -7344 -7454 -5131
7501 -5131 -4147 -2470 -361 -8193 -12562 -6676 -13194 -16448 -9519 -19865 -18527 -14720 -20711 -21147 -11728
7486 -11728 -8171 -12622 -10980 -4091 -15009 -20586 -16096 -26697 -31844 -3405 5842 -13009 -14721 -24631
7472 -24631 -24380 -21949 -15698 -19153 -20418 -23013 -24159 -16480 -18113 -15985 -18881 -14864 -24382 -15248 -18769
7457 -18769 -25915 -17819 -8288 -6147 -24723 -25540 -14689 -2177 -1238 1554 5851 12381 11919 -889
7443 -889 -18956 -28181 -29934 -29500 -12932 -17005 -6735 5422 1749 794 -14877 -26775 -31424 -36445
7429 -36445 -37244 -27818 -20312 -7427 2162 -5629 -14835 -11966 -7712 3928 12042 17031 11420 -5987
7415 -5987 -15147 -20431 -31820 -29900 -24257 -18691 -27755 -2789 -5599 -18115 -22897 -29842 -19001 -15830
7401 -15830 -10771 -630 -2491 -5229 98 4785 -1156 4783 11628 1945 -11035 -16563 -20642 -10297
7387 -10297 -2885 -4901 3055 13193 6493 -11789 -24313 -17050 -18749 -21063 -16620 -16229 -25215 -21617
7373 -21617 -4633 6358 12546 -10088 -12339 -5427 2760 -83 -8011 -3022 -1423 -11728 -18243 -26558
7359 -26558 -29693 -18229 -12561 -14027 -19328 -21103 -22005 -14154 4883 20873 12030 3506 9044 16138
7345 16138 12383 -6034 -26434 -40970 -30778 -20492 -13906 -9594 -23031 -20418 -34005 -43655 -33576
7332 -33576 -13724 -12240 -20937 -21981 -13017 -6408 -14552 -22587 -22774 -17293 -13570 -13676 967 8119 9488
7317 9488 2491 -4269 -1063 -14642 -30651 -19961 -12686 -23099 -19429 -15603 -9051 -16890 -27377 -25143
7303 -25143 -22157 -17789 -12225 -10781 -2288 -7012 -20606 -12461 -1072 -9561 -16208 -11961 -10992 -11261 -6637
7288 -6637 -11470 -15110 -12557 3702 8763 6211 -882 5239 471 -1249 3816 -1328 -14546 -20093
7274 -20093 -6221 4245 2806 -8 4678 -8275 -15825 -20330 -15762 -17408 -26469 -23557 -7456 -361
7260 -361 4479 4128 -6064 -26377 -26383 -25532 -25709 -19761 -12743 -10314 -5994 -979 -5044 -22534 -36032 -40684
7244 -40684 -36980 -17955 -4196 -3394 2599 3259 1911 -5788 -16282 -13637 -9100 4089 6887 12527
7230 12527 12499 -4861 -11455 -13366 -4453 11565 14768 -321 -20765 -30359 -24254 3714 16351 15551
7216 15551 13201 7412 -2588 -2129 -14204 -20181 -9499 -6189 1058 3999 -18537 -21926 -9254 -5578
7202 -5578 -15734 -13889 -3916 5315 1987 -8642 -13404 -3071 -1211 -6062 8190 10535 9594 9245
7188 9245 7253 6150 -5680 -20598 -22355 -25803 -27315 -34202 -31526 -26779 -11738 -10641 -7892 -5813
7174 -5813 2192 9496 9871 10343 15560 9829 9080 8642 -9385 7630 19087 13406 9186 -2121 -6379
7159 -6379 1907 7428 -1913 -909 4106 -6460 -10197 -9891 -14215 -4407 2384 -846 -4981 -3040 -5559
7144 -5559 -5893 3929 13499 8230 -520 -6070 903 -1016 -6403 -9196 -11485 -18950 -16407 -18240 -19352
7129 -19352 -13988 -535 -9467 -11662 -6669 -19084 -17963 -13508 -10150 -5460 -6944 -12741 -19826 -23963
7115 -23963 -16877 -8511 291 524 4477 -3341 -4484 -10214 2567 20299 9772 -5518 -20331 -25585
7101 -25585 -20349 -21641 -7373 2960 -2282 -15989 -21366 -36250 -37483 -34510 -27237 -28286 -12164
7088 -12164 -3700 -20494 -31233 -33768 -24289 -18190 -18415 -22506 -16207 -14456 -21778 -27764 -26757 -34492
7074 -34492 -34950 -28817 -28641 -28126 -19150 -17215 -4262 -329 -10927 3173 11199 10253 6466 1098 -3824
7059 -3824 -26819 -32548 -18334 -17292 -15557 -29931 -45552 -39566 -33872 -31551 -26532 -25617 -38331 -36909
7045 -36909 -27162 -35813 -36054 -28020 -25478 -36094 -43614 -37074 -21317 -17402 -7834 -8142 -17486 -20974 -38053
7030 -38053 -38083 -36286 -31338 -36512 -36930 -12245 10525 2163 -7481 -11399 -19610 -18838 -11552 -276 -5023
7015 -5023 -16728 -30350 -30203 -25647 -21253 -13983 -20698 -22380 -21093 -27557 -32003 -42446 -36635 -14446
7001 -14446 -4546 -19500 -17319 -22842 -23789 -14133 -23209 -20986 -8590 5738 12556 1784 595 5487
6987 5487 -2526 -9086 -7968 42 -6078 -12259 -9605 -15350 -13862 -4520 670 -17662 -23379 -7241
6973 -7241 5413 -15000 -28732 -21778 -10106 -7890 -5005 -2114 -7289 4878 -69 5180 8421 9839
6959 9839 1457 -9847 -10069 -5836 4997 -157 -17734 -31285 -28604 -21781 -10271 -6302 -3061 -1666
6945 -1666 -1978 -9843 -18305 -20786 -9851 -18887 -23424 -18190 -14137 -8143 -7251 -5768 -7097 -3161 2670
6930 2670 4077 -6966 -8449 -12366 -11561 -12119 -12907 -8602 -4790 -9912 -8204 -21360 -33430 -19993 -14604
6915 -14604 4282 12650 4572 13414 5230 4635 -5557 -10556 -5018 -2623 -7912 -9526 -8675 -4513 -22037
6900 -22037 -17349 -8232 -2494 602 3851 -11383 -17247 2092 7286 76 -1557 5637 11924 19132
6886 19132 5757 5074 -491 -13947 -9188 -12403 -29595 -30607 -18079 3783 -6331 -14630 -8294
6873 -8294 -3017 6389 4627 1469 -5044 -12887 -17666 -24045 -33160 -31735 -8109 -1231 -2467 -2221 -4393
6858 -4393 -6403 -1037 6921 1688 -9892 -17318 -14413 -964 4808 2192 -5363 -10053 -13834 -4435
6844 -4435 -3984 -1152 3834 204 4391 3417 8284 22839 19345 6588 -666 -8030 -13147 -28032 -34028
6829 -34028 -24339 -13947 -2935 -21855 -27279 -30818 -28515 -19715 -12019 14156 21559 19094 17369 1684
6815 1684 -15567 -7598 2706 -4859 -21218 -18905 -21164 -17995 -5679 -6431 -3554 14907 14364 -1591
6801 -1591 -6773 -4111 -3578 -12156 -10757 -366 2790 2814 5983 -588 -17259 -11320 286 6506 9778
6786 9778 11525 6827 -1195 -4375 -10725 -13112 -17086 -3893 -2259 -2513 -10015 -12906 -12718 -5322 -10168
6771 -10168 -11179 3392 17397 4765 16609 22434 10181 -7572 -18438 -20646 -136 13507
6759 13507 842 -14615 -4684 9344 9057 -14288 -28282 -11777 1026 683 5062 7444 -1332
6746 -1332 -11401 -25039 -24381 -21358 -21288 -14338 -1491 16378 26720 22527 11931 4158 7962 -1076
6732 -1076 -5781 -12876 -29246 -34414 -29058 -26692 -15611 -10571 -8424 -4246 3572 8904 9078 9169 14093
6717 14093 3048 8237 2852 -4068 -5171 -6848 -4593 -5347 -13504 -9755 -8593 3856 4049 8942 11127
6702 11127 11018 4112 -4549 2278 -7812 -8650 -17376 -21393 -7493 -584 959 8340 -4935 -563
6688 -563 8160 -6211 -2093 10747 2038 -2304 -2274 -6966 -22937 -20239 -946 1461 -7020 -7133 -15657
6673 -15657 -17876 -12613 1473 -6911 -6235 -6827 -15288 -16628 -12639 -11684 -17777 -7516 -721 -13365 -22040
6658 -22040 -23509 -16270 -10094 -7347 -7983 -13020 -11596 -1897 -9372 -6042 -14492 -20602 -15917 -6410 -4995
6643 -4995 -4589 -9485 -13849 -9171 2068 10678 -739 -14175 -26479 -27220 -22382 -13675 -10109 -17310
6629 -17310 -18351 -19017 -3949 2249 4310 3976 2306 -5637 -2068 4498 -936 2276 760 -5449 -24904
6614 -24904 -9886 -3932 -5011 2008 2335 -5808 -4015 -2318 -11723 -15339 -13442 -3402 -6814 -12580
6600 -12580 -11946 -5395 -8905 -7279 -3718 2516 6504 1441 1553 2319 3138 -2201 -8787 -23467 -31018
6585 -31018 -26925 -14843 -10041 8550 17507 9294 -1880 -9271 -6745 -4289 2460 -5086 1266 5948
6571 5948 8140 12928 6176 -4776 -15472 -15812 -17853 -16001 -5996 3729 -1656 -4676 -7491 -10777
6557 -10777 -24059 -24625 -21193 -10321 -5807 -6097 -3224 4835 8301 6017 3055 11753 913 -5424
6543 -5424 -4700 -6396 -3654 -2062 4618 12037 7531 114 -10299 -17377 -10089 -18197 -18905 -10285 3511
6528 3511 -439 -13495 -22304 -19837 -23118 -13584 -4445 3373 -1412 -7269 -5376 8708 22020 15583
6514 15583 8140 1962 891 -99 4421 -8851 -5789 4385 8082 5988 4332 -3619 -4046 -3513 -14543
6499 -14543 -20298 -14311 1091 6717 -3683 -21986 -32701 -23341 -20770 -19470 -17731 -15144 -13267 -19751
6485 -19751 -14598 -20797 -15665 -20293 -35701 -31286 -9690 -21302 -30692 -26141 -18557 -3219 7492
6472 7492 2343 8647 9202 14919 18914 8475 4655 -4383 -3480 -9532 -26808 -26407 -20027 -10586 -11596
6457 -11596 -12232 -5825 -1478 -3402 -1701 11783 -2269 -21111 -17005 -17383 -13361 -7841 -6634 -11021
6443 -11021 -17303 -3352 -3130 -8129 5148 5761 1266 7075 527 2360 4340 5712 -9583 -15230
6429 -15230 -10028 7513 13724 10223 6494 -3713 -7690 -8504 -224 2374 8698 9873 -857 -13488
6415 -13488 -17569 -9384 -10300 -986 -3231 -15245 -21813 -28415 -9881 9977 17579 8756 -5349 -1629
6401 -1629 2410 -2485 722 -11500 -21310 -30816 -29533 -22667 -21525 -8606 -15703 -27071 -22355 -18398
6387 -18398 -15044 -10067 5265 11981 16381 3817 -4178 -2502 -16787 -17908 -3822 -9450 -9738 -4294
6373 -4294 -977 948 4583 1914 8002 12362 10148 14123 7744 5467 -2172 997 10303 7403 12345
6358 12345 2852 1186 -4833 230 1936 -4101 -1057 -4523 -4540 -2007 -15251 -14824 -12095 -7985 -4523
6343 -4523 3213 -5574 -638 2123 -8776 -7631 -14092 -21298 -18510 302 944 -6499 -3833 -2483 7723
6328 7723 8480 5596 -4667 -6510 -6282 -15538 -28368 -23936 -24021 -19652 -3295 4723 5189 -11575 -25082
6313 -25082 -31365 -22492 -3360 -735 -15872 -29744 -18314 -14046 -22646 -20198 -1988 10856 3308
6300 3308 -1505 -4857 -8810 -17847 -16277 -13900 -13195 -12015 -12215 -5633 -1123 10918 -2938 -13092 -10215
6285 -10215 4562 14299 8279 15462 12324 21933 22075 11525 5083 608 -4371 -18131 -18578 -12126
6271 -12126 -12676 2461 -1097 -642 5560 11580 6885 -5996 -6439 -4682 -16512 -13382 -10004 -5399 -347
6256 -347 -17687 -25912 -20104 -4207 -9277 -8955 -1634 6805 6984 6217 2878 -1208 -535 -6040 -4202 435
6240 435 -3982 12430 18522 5774 1934 7906 5488 -10382 -3355 93 4680 4624 -9316 -28356
6226 -28356 -22173 -21524 -14201 -19330 -25539 -9269 4511 9046 1643 -4865 -8756 -7352 -7311 -2701 -5619
6211 -5619 1973 1605 -1294 8224 1760 4702 7882 -3390 -3459 13552 14448 3695 -12486 -7756 -4043
6196 -4043 -2950 6001 -1312 -11524 -16083 -17314 -8291 3600 11718 -815 -6901 8069 13126 9886
6182 9886 8472 8387 -20 -7302 7737 18792 17979 17485 11147 8937 4450 2091 -15376 -9808 -5357
6167 -5357 -7821 -7589 7079 15379 9175 8531 12889 2442 2914 8104 1624 -1038 -11649 -10488 -13972
6152 -13972 -14061 -6444 14915 15311 4080 5743 4932 -3734 -9431 -6622 -5665 6286 5297 -8446 -9861
6137 -9861 -5098 -20800 -20039 -27354 -9610 10721 4965 -5138 -7272 -6812 -9861 -4017 -13865 -27295
6123 -27295 -15062 -8868 -10936 -11162 -8385 -12812 -13005 -19315 -18910 -23669 -9410 -1053 -5161 -13405 -8800
6108 -8800 10194 20372 23408 25131 23295 20095 11813 8251 -14030 -31214 -22293 -1710 -1643 -314
6094 -314 10647 17589 22060 8552 -2792 -1352 -9870 -6219 -7355 714 23686 36051 31179 11085
6080 11085 870 -6465 -5239 -3430 -7878 -17323 -20876 -21577 -5506 -454 10304 17607 11003 6631
6066 6631 -780 9604 -3035 -13751 -17008 -3517 1789 -5088 10057 19941 6224 -3899 -2191
6053 -2191 -6236 -11242 -11073 -16831 -12399 -14828 -7220 -954 4482 5752 -8196 -21893 -21975 290 1594
6038 1594 231 4015 9615 15634 6464 -958 -6706 -12800 -7116 5098 3268 16396 21932 4646
6024 4646 -7745 -19188 -15390 -11178 -10339 -15795 -13372 -3983 -91 -23880 -48458 -42187 -12783 6212
6010 6212 8037 7350 3627 2115 11172 6441 3407 9729 13190 17614 9420 -1122 5124 10376 14429
5995 14429 9429 -7110 -17210 -7502 -9787 -3655 -749 5422 8782 8914 5103 8774 -166 -4435
5981 -4435 -1949 1686 152 932 -2196 -15287 -13420 -11518 -12809 7648 12745 2993 -8006 -8880 107
5966 107 2699 3353 2822 -7041 -12273 -12601 -9025 -6731 117 -7839 -4100 -1917 -7557 -12732 2919 11914
5950 11914 3969 1500 -5875 -7043 -130 838 -5907 -8548 -14886 -24171 -29509 -37317 -31103 -27682 -22454
5935 -22454 -9350 -4409 -9122 -10966 674 -5827 -1028 -1393 -11863 -17364 -13522 -7649 4837 5582
5921 5582 2887 -2565 -4187 -6832 4289 -3820 -9678 -23560 -23852 -11550 -13526 -25175 -35174 -31849
5907 -31849 -29448 -26807 -23133 -16429 -11198 -10824 -4696 -407 -10684 -4478 2761 15056 19670 5629
5893 5629 8488 7268 12522 -3476 -7600 -5549 -16031 -23890 -17767 -7043 -6509 -9417 -16101 -12698
5879 -12698 -22796 -28162 -29884 -26282 -19346 -14798 -467 1576 -4447 -15074 -9124 -9645 -2704 -4241
5865 -4241 7066 6506 -2501 -7620 -19845 -26963 -29828 -19274 -4328 -3449 -16317 -8190 -2094 -10363
5851 -10363 -16780 -7622 -3022 5570 8774 8337 -1400 4913 15296 10423 7509 -3534 -7768 158
5837 158 -10908 -14716 4643 168 2055 3220 -5738 1316 18438 7911 1950 4578 6363 6046
5823 6046 2501 -1915 2932 -9904 -21716 -29923 -21029 -23671 -17052 -14605 -24497 -15591 -9026 7216
5809 7216 9776 5675 -6663 -19053 -13241 -5770 -6926 -13708 -10316 -9836 -2486 6002 62 -2776 -2447
5794 -2447 -2586 -3965 -7415 -11589 -783 2535 -12091 -11659 2011 9703 7861 4991 10485 17283 9911
5779 9911 -470 3503 9969 -11460 -15567 -8735 -4621 -736 6211 -2349 16792 27348 30747 25810
5765 25810 8373 -9410 -12613 -25259 -24304 -8761 -4289 -8567 -29246 -25922 8709 17781 6205
5752 6205 -4140 -4947 -5517 1560 -2318 -5672 8255 -2938 -15477 -14901 -6832 4322 10636 -3880
5738 -3880 8698 506 -18161 -19672 -20902 -24601 -17889 -9005 -19788 -6219 -12030 -14125 -13971 -12096
5724 -12096 -12600 -13206 -3981 -7519 -14146 -13634 -20517 -20290 -18690 -17221 -16565 -16872 -21662 -20990 -26409 -18602
5708 -18602 -1012 319 -1796 12218 19091 13082 4522 4500 -15508 -19891 -32 -394 -8565 -7230
5694 -7230 -965 5979 5391 3179 4050 -6958 -20435 -21244 -20705 -16050 -4976 -3247 931 -352 -5650
5679 -5650 8351 29853 30873 3584 -9955 -16606 -13731 5995 10436 8326 -1944 -9570 -21188
5666 -21188 -21356 -3003 13345 16429 15069 5823 9227 7381 -1748 -21203 -7990 7472 14951 8585
5652 8585 12856 5114 -2933 -6922 -11989 -7431 6851 25288 24445 25292 7781 -3593 -5254 -1154
5638 -1154 -16338 -21412 560 -10775 -21341 -12022 -1291 -6921 -6158 -5494 -13854 -22320 -14951 -14225
5624 -14225 -17537 -3707 6559 15809 11683 12504 16900 17123 21942 22632 17114 16826 17039 20194 19130
5609 19130 9860 -699 -940 2704 8558 -9936 -17946 -20219 -5733 937 -11154 -2832 14992 21916
5595 21916 15054 4402 13715 2491 -10040 -26250 -21827 -19925 -12731 -10414 -10565 -14799 -18221 -11301
5581 -11301 -3726 6132 10714 12859 21989 35925 28973 14688 9424 2886 563 4227 -3621 -817
5567 -817 10222 16328 6828 9915 14936 4850 -3001 -3470 1479 10896 11064 6328 11083 19949 15279
5552 15279 -2808 -4505 -6740 909 3371 6155 17480 16712 14594 8494 7129 -685 -4366 -3723 -8708
5537 -8708 -5450 -13074 2270 13845 13896 9416 5619 3760 -279 -12960 -6841 5248 3822 -6511
5523 -6511 -11574 -9266 -7789 -4005 -13671 -19028 -14923 -16966 458 12364 -2469 -5371 -5556 -25381
5509 -25381 -18898 -11689 -10207 -2669 -12015 -21541 -21017 -10538 -303 -4685 -5040 1842 4020 3471 -17
5494 -17 -7606 -22398 -30058 -9915 13623 15124 -498 -16796 -20778 -15011 -7856 8926 243 -12683
5480 -12683 -6095 -460 8996 14081 6334 -9242 3569 5151 11312 10454 10537 18138 10357 2020 -5893
5465 -5893 -19166 -19811 -21439 -26341 -25347 -15236 -11475 -16816 -19058 -14892 -10624 -2700 3728 7361 6808
5450 6808 -5807 -4279 -11348 -24548 -27793 -13004 -6531 -4124 -9077 -11283 -18825 -25936 -26062 -23047
5436 -23047 -21201 -15183 -10727 6400 7927 9158 7088 1633 -4486 -7187 -8464 -14114 -18868 -16789
5422 -16789 -3689 8665 7911 -6168 -23132 -27735 -31924 -26924 -31504 -19436 -4987 -5551 1423 11132
5408 11132 16295 12416 -5320 -8353 10691 19765 7636 3265 4780 5667 1497 -7688 -8956 1873
5394 1873 12044 12525 4296 17700 21696 15669 10278 16129 21627 19646 1327 10288 2705 -1745
5380 -1745 -2389 6559 7695 -6047 -10769 70 2707 -20166 -43296 -30928 8089 11605 1915 -5101
5366 -5101 -6554 -15885 -11251 -11712 -14252 -5861 -12171 -19303 -14464 -4026 -1195 5171 7453 17974 6202
5351 6202 10469 6360 8746 7630 20106 23272 18785 12875 18424 21189 13480 7252 9782 -660
5337 -660 -14905 -2622 -1708 1383 6088 3640 -1815 -8741 -8182 18492 27471 10398 9491 9559 17746
5322 17746 31323 34531 24466 9823 -11522 -20592 -28025 -25687 -34602 -21944 -21030 -11000 -4855
5309 -4855 -2468 -8358 -2051 7706 246 10542 5665 6183 4906 -1551 875 14211 10527 -5283
5295 -5283 -8828 -10421 -14787 -15713 -3483 -3687 -18128 -28781 -22206 -7802 1097 -8870 -19452 -10116
5281 -10116 -6550 -22779 -17365 -9494 -18760 -7913 3496 10984 17714 20074 16700 -7103 -11110 -11894
5267 -11894 -12706 -1954 -2733 1667 -2988 -7322 7452 11863 11503 1224 4922 -255 13318 34267
5253 34267 32593 13178 5980 855 -8073 -7679 -9248 -9084 -20283 -16730 -14796 -4466 -828 -4657
5239 -4657 -2626 -7792 -1794 -2153 -5934 -4281 4368 4701 3056 11409 -1116 -11737 -10413 -2754 -2546
5224 -2546 -1687 -13050 -12974 3148 6318 -7343 -6661 -9546 -6382 -254 1150 -10025 -7770 -6547 -6354
5209 -6354 2869 -3877 -516 3842 -448 -5518 4030 1989 -3262 -1879 863 -16036 -34503 -48354
5195 -48354 -32489 -27529 -22676 -10778 783 3409 -10828 -23641 -19630 -22690 -30146 -12189 -12455
5182 -12455 -21577 -21688 -12085 -14403 -14410 -14239 -23559 -4695 7023 5659 -11097 -2659 -7336 -11109 -11731
5167 -11731 1612 -5712 -11333 -3788 2945 -5133 -9194 -3963 -2434 -4853 -11676 -6338 -11638 -5483
5153 -5483 -17149 -19185 -4827 -17207 -23312 -13684 3295 17418 16277 11689 9470 3951 5006 -1346
5139 -1346 -13184 -15190 387 16994 21241 13613 -9644 -17594 -18339 -13097 -2872 7988 15584 5141
5125 5141 -2175 801 -4682 -7844 -19026 -18281 -10397 -5086 2850 10749 7653 -2932 -8753 -11992 -95
5110 -95 1536 1949 989 -5137 -12003 -22900 -30296 -31583 -21923 -4534 16698 2315 5596 2330 5669
5095 5669 3200 4542 5154 8410 9190 -5861 4634 13576 1231 9166 16903 27190 17175 -2241
5081 -2241 -21898 -19637 -13620 2071 11701 13090 6034 979 872 1546 387 6068 8293 4681 716
5066 716 -11216 -11584 -4956 -509 -5705 -7491 -8585 -14448 190 10397 254 4444 28624 24966
5052 24966 13387 10355 1562 793 -7334 -26652 -14231 -7768 -10394 -12535 453 725 12199 14903
5038 14903 -3810 -6629 -1770 20018 21718 7296 4666 2179 9949 23794 18573 7813 20839
5025 20839 14740 -10702 -14261 -17709 -16078 -1871 18006 17041 24115 37551 24893 1994 -6788
5012 -6788 12272 8058 -10047 -9725 4607 2072 13508 14008 3956 5127 -55 -11850 -14850 -18598
4998 -18598 -13554 -6803 -6623 -11274 -14587 -18799 -24885 -25099 -17132 -1706 -2392 -18207 -22051 2399 626
4983 626 4929 27468 37168 33814 32167 22548 16222 8384 22212 14079 16256 17548 10800 9185 9796
4968 9796 -5343 -1744 10786 12367 7801 6716 -756 -6523 -737 -220 6548 16198 15479 8606 16875
4953 16875 25465 18721 9778 -3852 -15962 -27347 -19292 -5566 917 438 8546 -59 -3222 -3803
4939 -3803 -4353 1630 12290 10224 -6204 -18376 -17136 -4439 -4728 -22128 -32987 -18864 -6369
4926 -6369 -6063 -2125 -8228 -20345 -18510 182 -56 3708 13703 5429 6342 8189 13538 19602 15591
4911 15591 19664 19380 25648 34089 37706 28920 8285 4577 11184 13906 4909 2138 2367 5976 7033
4896 7033 9051 22472 19619 7014 997 -6267 -15981 -23757 -17039 -9530 -20999 -17831 -8065 -6832
4882 -6832 -12204 -17021 -17060 -16413 -8093 -368 3560 4819 -2202 -24345 -22429 -14652 -18618 -23738 -7029
4867 -7029 -12114 -15852 -1707 1441 2898 -7313 -27199 -22135 -15903 -18759 -21872 -17988 -4247 -3228
4853 -3228 -3265 -2927 -4608 9024 6156 -13690 -22011 -8211 1292 4656 -736 -4314 -12610 -20593 -3877
4838 -3877 -1371 -9678 -8953 6749 8897 -5337 4989 6400 645 -1764 -2103 -3070 1010 -1039 8399
4823 8399 7194 -15803 -14376 -14525 -16862 -6709 -10404 -15293 -12908 -28447 -26777 -18561 -5115 4416
4809 4416 5712 4238 2714 -509 -9123 -13393 1995 10539 9781 7621 -13913 -21273 -7443 -2614
4795 -2614 5225 -1435 -1508 -4737 -10225 -17114 -21209 -13621 -12705 3735 6658 -11545 -19354 -15087 -244
4780 -244 -2543 -22715 -20985 -22644 -14961 -3639 -2413 7205 17768 6609 -2901 -8245 -12578 -24944
4766 -24944 -26417 -35571 -43214 -31314 -28571 -13254 -4039 -8671 -10881 -10213 -16983 -19558 -19047 -6298
4752 -6298 4924 7726 8502 23819 31225 16513 9226 1491 1798 -5077 13178 21902 15527 20753
4738 20753 26009 24319 5477 -8023 -16184 -8139 3852 15599 11370 3150 5199 802 -4143 -9584
4724 -9584 -6622 1689 9064 -429 -8378 -2580 -12251 -13662 -4301 -5772 -13002 -15180 -17318 -22542 -13320
4709 -13320 -15175 -13227 -21178 -20351 -3012 4058 873 9912 11667 335 7779 3426 8654 11926
4695 11926 -1189 -3434 3510 5396 -4699 -3701 -7361 -13542 -10829 -3001 713 8910 13516 5457
4681 5457 5784 12194 8398 13352 7709 2318 19104 26062 11968 4749 4872 -236 -11277 -4893 181
4666 181 21456 36580 27297 25575 13917 10029 5539 10498 14430 6869 -3983 144 9786 11544
4652 11544 8502 -3697 -10613 -1215 1189 -7889 -13280 -17857 -5915 5867 13366 5101 -7744 -8524
4638 -8524 -3006 2298 5555 3434 -10619 -18844 -20638 -33029 -47808 -27632 2309 -1448 -7553 -14786
4624 -14786 -15798 -8580 -10656 -9567 -14355 -28393 -38279 -14018 7571 24758 22357 24707 28640 24308
4610 24308 24448 20309 10405 -4564 1316 8385 -7295 -11703 7054 17744 18404 16599 7078 -2858
4596 -2858 2950 17337 10357 488 -823 -296 -165 -122 -2084 -1145 7265 22273 20923 15940 19546 17837
4580 17837 8381 14497 11287 15133 13037 13949 11152 5127 -1893 -8273 -11427 -20966 -28010 -39888 -29374
4565 -29374 -14447 -10828 -3294 -1144 -165 1895 2559 -1530 10854 1847 -14113 -5923 -2947 -8534
4551 -8534 -2956 -2973 -1642 5706 933 4377 4736 -9447 -13644 -14771 1557 3321 13756 18023 7439
4536 7439 -5796 -6040 -10157 -9847 252 -7761 -10372 -4432 9629 15517 10064 8380 4170 9282 16835
4521 16835 26654 22016 22426 8514 -4869 -6554 -7085 -4306 5003 -3639 -22631 -21955 -13704 -7851 -9311
4506 -9311 -15836 -18596 -18981 -22446 -1496 8152 8896 -1449 -13716 -9916 -8059 2123 -1139 -18343
4492 -18343 -31632 -31235 -23955 -12894 -12174 -5199 4866 3158 -11015 -18504 -14975 -24718 -25561 -13560
4478 -13560 4877 15771 20459 13495 2170 2580 6631 7600 9599 8943 14112 13694 12915 17913 16912
4463 16912 -1803 -24695 -24481 -18719 -10506 -13934 -3589 16732 24872 7098 -1525 13537 15107
4450 15107 19224 17220 -1621 -10768 -13870 -18232 -6948 -559 2192 9158 2179 5959 5116 4575 -1135
4435 -1135 -11458 -15809 -3089 2938 -5055 -17784 -20744 -13243 331 2553 -2641 588 -7446 -20314
4421 -20314 -14205 -2577 3805 7381 5133 11706 -8995 -12113 -7578 -8263 -5076 848 -3392 -16473
4407 -16473 -3049 9711 8311 15007 10641 -2021 -3629 -8360 -1224 1314 15497 12272 8791 10467
4393 10467 683 -13614 -13273 -14758 -18691 -15204 -8496 -11379 7376 13197 12866 23383 27228 10907
4379 10907 -4093 -2328 -4480 -15605 -17551 -4401 4327 570 -10904 -18487 -23677 -12749 -13945
4366 -13945 -24008 -14829 -13218 -13329 -1856 2732 -3045 798 73 -3761 -10347 -8146 -14267 -20978 -15990
4351 -15990 -2989 -3535 8303 16029 13694 7938 3836 4776 -3643 4212 2262 -11468 -14803 -16822
4337 -16822 -18517 -22560 -18862 -31414 -31639 -22212 -20300 -17132 -3779 7766 13235 6250 -2858 12565
4323 12565 14897 1712 -1967 -625 3181 11887 17061 18837 18225 18993 20813 7664 -1566 -12909
4309 -12909 -12393 -24550 -28699 -26702 -17077 -12707 -9064 -10626 -15323 4437 11685 -682 -10118 -11460
4295 -11460 -14014 -13566 -16562 -12711 -1507 5413 -792 -7591 -4760 13648 16270 10167 -7589 -8667
4281 -8667 -8318 -4486 2034 14286 12566 6666 3054 -12186 -12422 -6012 -16634 -15675 -11282 5579 8547
4266 8547 2808 875 -11692 -12802 -329 4894 16299 23084 12809 624 -6872 -12517 -11599 -4896
4252 -4896 8112 14448 9172 7675 -1744 -12518 -9668 990 8877 19789 21348 18330 8557 2200
4238 2200 -1674 5286 -785 9856 15477 8280 2529 -6445 -5905 4048 2766 6406 12906 10669 11679
4223 11679 14268 17826 28658 26916 10643 -2460 -7620 -5865 3308 2493 4888 -1301 -8006 -8054 -8251
4208 -8251 -20592 -19577 -17033 -16076 -15729 -3412 3865 4136 -11409 485 20103 20141 11991 8611 9923
4193 9923 -4278 -8606 -2516 3667 -5157 -19086 -14596 5545 9017 22092 14595 7963 7292 9352
4179 9352 12041 8982 6000 17827 14711 7654 11016 15830 14964 28020 17230 4874 8893 11628
4165 11628 3799 -4766 -1243 5683 -6413 -19361 -27289 -17045 -15521 -19749 -32296 -19396 -6554
4152 -6554 -36 -14837 -9443 -6532 -7889 -7040 2108 -4564 -6335 -11509 -14931 -6683 -4873 995 6377
4137 6377 12417 23742 13656 1435 -3947 -15427 -10741 956 -1244 5695 3360 14855 8721
4124 8721 -7057 -18474 -25132 -19950 -23911 -22245 -19504 -9820 801 -33 -6737 -17002 -14534 -8780
4110 -8780 -10752 -2835 11078 14084 16401 5388 -18217 -19592 -10973 2532 16206 10143 -5942
4097 -5942 -13014 -17269 -16019 1137 12565 3927 -1174 -6518 -16162 -25983 -12855 3317 -2427 7833
4083 7833 10397 14686 9283 2213 10228 23010 23100 -1015 -6603 1105 -9927 -20313 -27734 -23637
4069 -23637 -8853 7478 8976 -1098 -698 -6013 -3489 8267 17306 19961 6229 -7947 -11555
4056 -11555 -6037 -13249 -15077 -27033 -26430 -10483 74 -1210 -8675 -13239 -180 7026 -472 -15513
4042 -15513 -16294 -1408 -1921 9608 16713 14314 3823 -1165 -4088 1147 6024 -1670 466 -577
4028 -577 12586 16893 9253 15937 12780 -756 -14755 -15903 -12367 -16066 -10822 -13590 -6615 -9529
4014 -9529 881 18156 15021 8971 13696 7968 14694 38200 28415 16493 8791 -4745 -9957 -3623
4000 -3623 8931 16543 12547 11836 10098 -2222 -13227 -14440 -16507 -15441 -15380 -15832 -29063 -11538 -5550
3985 -5550 -14179 -1857 1300 1876 -7065 -14744 -27181 -25323 -11573 1304 781 -442 -3821 -1819
3971 -1819 -10222 -16684 -21325 -7604 -5187 -13689 -9922 -11427 -14904 -1049 6034 1042 -9245 -8785
3957 -8785 -6611 2955 6398 -9335 -13967 -3047 3109 9850 1049 4241 7498 -20916 -35424 -25866
3943 -25866 -29457 -25448 -17722 -23340 -23211 -5266 -8361 -22016 -22911 -6344 -13711 -22944 -15528 -4164
3929 -4164 8468 15708 15919 5213 2556 -5569 2006 5165 10604 11582 9236 19724 20641 6419 -2094
3914 -2094 7040 -4856 -14501 -9664 -2137 3503 -1569 -5397 -9712 -15976 -2529 5873 -2418 -19803
3900 -19803 -20214 -17308 -20801 -20210 -10389 -11394 -13908 -10092 -3216 -6960 -6018 7268 11702 11722 3233 -8048
3884 -8048 -22267 -10959 11034 13095 6691 2972 -441 3650 -288 -603 -387 -3179 14359 20258
3870 20258 12279 -662 11016 26206 20380 26194 30829 21896 7981 -1403 -7279 -22065 -16483
3857 -16483 -7148 -6638 3740 -5084 -23782 -24847 -31461 -34698 -12409 4342 2195 -4503 -5856 -11322
3843 -11322 -7288 -20682 -10420 15328 16781 6961 -4059 1992 9485 5361 -2544 5352 5409 9112
3829 9112 -2966 -3354 -5547 -4343 -1712 2386 -7034 3460 10254 13507 10642 11074 -211 -13856
3815 -13856 -17389 -5335 11285 25585 19149 14766 7905 -585 -7290 6571 16269 13336 14514 5428
3801 5428 3568 -1149 -9807 -9440 -9838 -17934 -5818 12529 18285 15937 14931 9570 4306 -7264 -3182
3786 -3182 -14332 -19593 1916 12281 21775 1811 -20957 -25365 -18464 -19233 -16773 -11563 -16760 -26496
3772 -26496 -16503 -17980 -14036 -11178 -9881 -11657 -10323 -16597 -17803 -20799 -10108 -8286 -10048 -14422
3758 -14422 -14019 -6745 4752 15055 12230 5395 -2279 7686 11774 6697 1141 -10636 -9332 -266
3744 -266 -2444 -493 -8336 -19031 -20451 -13107 93 19452 26666 21399 -961 -20353 -19335 -5580
3730 -5580 714 -4300 -17054 -18797 -5205 -9409 -264 9335 4002 -11800 -18708 -8780 -10664 -9845
3716 -9845 -4012 -103 11955 18726 5420 10803 15124 9943 4814 197 2126 -2864 -15979 -13330
3702 -13330 -15312 -12205 -12689 -29640 -21678 -19889 -6513 3628 5596 3318 1412 -5044 -9542 -10598
3688 -10598 -2042 8017 9246 12367 20879 27798 22570 26768 12680 -8528 -8400 8167 5386 -7451
3674 -7451 -2284 -3177 -3749 9186 13644 12180 3137 -17502 -16511 -2925 3368 3818 7566 19888 20792
3659 20792 6995 -2761 -15122 -17415 -9305 -3506 -3233 -6035 3821 -2868 -24923 -19898 3291 18425
3645 18425 566 -12258 -12179 -9958 4545 13416 2147 -5208 -12736 -8876 -19164 -16233 -547 -10150
3631 -10150 -4494 516 -1262 5746 886 2010 6337 2724 9710 11952 870 1695 12003 15796
3617 15796 20167 12754 6207 22732 10058 -113 4431 13009 10713 -241 -5462 -14690 -9358 5911
3603 5911 -4701 -5671 -3015 -2075 -10184 -8669 -10102 -3594 -4963 -16372 -8743 -5863 -6848 4359 7060
3588 7060 7746 3719 1586 -2233 6948 5037 -596 3598 20557 36336 28549 14536 5694 3405
3574 3405 9616 14018 -1663 -15062 -17992 -7861 -5514 9742 4006 2001 11504 7401 11411 6792
3560 6792 -2542 -3768 567 -1055 12792 6805 11211 16011 9785 -7262 -13466 -13361 -4591 8549
3546 8549 8382 6564 -6204 -4880 12560 11059 -1442 -3803 1770 13381 22128 20368 15538 10992
3532 10992 1547 -4490 -3477 -10859 -10344 -1936 -4229 4757 12247 6802 -339 3896 -2645 -26949 -18477
3517 -18477 -11742 -5759 -23397 -17434 -7808 55 362 14015 8267 -5812 -793 9366 4782 -14132
3503 -14132 -26585 -25211 -15943 -6853 -10430 856 13968 9298 794 -1344 -744 8828 16888 9513
3489 9513 12463 27866 23215 21931 20441 18042 11326 370 -3340 95 -144 2453 17412 11069
3475 11069 10124 20980 13778 14992 5463 3057 7187 -4020 -18540 -14839 -1000 12724 14660 9277
3461 9277 798 5705 15720 23042 16215 8502 7379 -4507 1415 -3956 -11895 -29674 -26561 -10325
3447 -10325 -9554 1478 10963 12310 5308 5287 -10519 -13783 -15976 -19517 -16304 -9533 -1703 13216 27008
3432 27008 24791 16391 8641 -7233 -5090 -3660 -414 10204 12760 -8837 -14505 -9147 -1985 -6643
3418 -6643 -13846 -11375 -5832 -8034 -4388 -2200 4073 14342 -5577 -13126 -7327 2116 8589 11456
3404 11456 17723 20192 14875 998 2031 14518 10906 4374 -11390 -2263 2757 18935 29884
3391 29884 19885 18763 7317 9735 24588 26677 17518 18277 16674 13745 14126 1390 -3428 -1959
3377 -1959 -13150 -21792 -2319 12648 5684 7472 9331 10441 -4830 1767 8841 12445 18762 15444
3363 15444 -2342 -18952 -13357 -5412 -9120 -13831 -8566 -408 -3706 -5138 3869 5007 2961 9517
3349 9517 16429 12332 2412 -3181 272 -9664 -17145 -16570 -16056 -14700 -6413 3733 -6546 -693 903
3334 903 866 -3742 -3222 -407 8229 2135 -12858 -13903 -13131 -7456 10080 14277 -1868 -4637 3903
3319 3903 21381 26961 12271 -129 3655 -2983 -9258 -7060 4730 -972 -3801 -15809 -19653 -24905
3305 -24905 -18647 4223 10721 12052 16885 9812 -2497 -10770 -11387 -2819 -6741 -11676 -5324 6115
3291 6115 11773 8219 2982 -874 -478 -10720 -6891 9760 19684 14033 12616 1839 6961 12439
3277 12439 16537 10131 6935 4728 -1099 -19098 -27975 -15815 -19013 -23841 -17907 -15353 -5676 15892
3263 15892 -3100 -8129 -16870 -12969 2356 9670 15938 10661 11733 11865 6316 11347 10318 23
3249 23 -7273 -16954 -14159 -7539 -2006 -7278 -9637 -9403 -6567 1158 -4857 -6325 -6634 -1223 -722 7904
3233 7904 2478 4704 23460 31660 33688 38106 32539 18531 617 -9585 -829 -150 -6263 -8074
3219 -8074 -10207 -7382 -4863 -13156 -14752 -2708 2725 -10517 -15501 -9870 -12586 -8054 -4916 133
3205 133 -2363 -7002 -3123 -1839 -3088 5683 3904 11365 21367 9301 -726 2303 -6411 -5845 -3008
3190 -3008 -197 -779 -6022 -5877 1599 11900 16615 16794 16876 8576 7607 6078 30101 26121 2968 -2256
3174 -2256 973 -6660 -4910 -9094 379 -5629 -12957 -4899 14058 17606 2882 -4286 -2118 -181
3160 -181 10639 16717 15890 18645 16554 5375 -5782 -11322 -23842 -19147 -13656 -2683 4960 6409
3146 6409 5390 7266 8077 10254 13975 21629 29172 26033 16753 3504 -5131 5909 20184 16472
3132 16472 3705 5223 -3094 -17591 -14890 -19629 -15804 -7191 -14635 -16601 -11578 -7384 -12058 -13171
3118 -13171 -22291 -20131 -7270 -15024 -14459 -5620 -2950 -4408 5833 4148 2715 5128 6375 -307
3104 -307 -6500 -5396 13167 22406 19960 17421 10935 15987 8907 2639 7689 4126 6907 609 7141
3089 7141 21364 12939 -7845 -5825 8171 6433 1212 -5984 -12285 -12290 -13427 -8496 -2199 4771 1629
3074 1629 -9667 797 7478 5677 4361 -1796 -3223 -1431 -2521 -5318 -3304 -1515 3958 4022 10658
3059 10658 11612 -3540 -15007 -10654 -5531 2129 -2229 -4231 -5532 -3488 6892 14227 15733 25969
3045 25969 25059 10182 -3878 3027 14663 25797 32578 20439 1274 9753 21837 26702 9076
3032 9076 2617 -6447 -3630 5972 14199 26564 27224 29618 38909 28040 12982 9805 1057 -10510
3018 -10510 -7931 8553 4150 8225 15265 8692 4402 3466 -5187 -7720 5050 2793 -2415 637
3004 637 5478 -3610 2499 3814 7686 29949 43555 33631 13061 3309 19452 33836 32524 28134
2990 28134 11122 15785 20846 17985 14735 22651 10753 11805 393 4213 11625 1120 4041 11157
2976 11157 22316 22876 9172 22564 12728 408 4434 -2289 969 -9178 -26358 -25320 -18688
2963 -18688 -13290 -17435 -16459 -20810 -17736 -3050 6039 16052 22872 12266 9956 8522 4126 1565
2949 1565 1289 10584 25817 22047 6734 5462 7072 14357 26699 33075 17061 4562 -3996 1434
2935 1434 14977 10972 -9454 -3536 15312 21245 26960 26417 19043 20046 12512 1554 1921 12843
2921 12843 16667 7983 -4741 -2049 9221 25837 39397 52889 47044 32596 21819 18282 8087
2908 8087 8894 15206 18664 16577 453 5410 844 -597 -5056 -12791 -11114 -8951 -7814 -17087 -12340
2893 -12340 -5244 4934 3838 1198 -19455 -23769 -17890 -7439 -3028 1086 5313 8910 5204 3612
2879 3612 9332 15524 4140 -3609 -9591 -21522 -28038 -23694 -3471 2868 -8033 -754 6504 11928
2865 11928 5765 7828 5334 11838 13415 15697 16292 5796 -10941 -14018 -6697 7977 6291 5394
2851 5394 1972 -12176 -10086 3085 5578 -1412 -2104 -5588 5749 26214 29791 35234 39883 32589
2837 32589 25205 14556 17368 22897 12954 7393 1241 -1907 -16346 -7257 3905 5929 10967 15383
2823 15383 25683 20890 19128 14620 7113 1008 6356 15804 17483 11175 3701 7930 14688 14658 26164
2808 26164 16414 15982 21470 19242 20032 8559 49 -5490 8439 23492 29257 21805 18068 14665
2794 14665 1434 -14383 -7669 13536 13284 -10732 -10355 -442 -7235 -5896 -9978 -6684 -13114 -11034
2780 -11034 -7223 775 10163 4696 15715 28505 32822 22387 -1119 -8207 -5843 -93 14180
2767 14180 19554 14978 19628 29900 39997 38783 28962 15148 4122 3967 -2643 -6827 17830 18611
2753 18611 427 10615 12975 12402 15458 28679 16455 9963 -380 11409 9937 6669 4624
2740 4624 2752 -2137 7099 9078 6220 1838 -2889 -3878 5791 9041 2827 -1193 -13563 -10612 -16855
2725 -16855 -18869 -17976 -17398 -13544 -2077 -12628 -16655 -16915 -15084 -13580 -16709 -20105 -5891 9812
2711 9812 2677 -7288 -1065 20831 20709 25021 9201 -9590 4114 -1455 2932 3795 -3827 -7966
2697 -7966 -9893 -5801 6 2215 4996 5297 -82 -3037 2280 4195 11512 6285 11171 7164 -5946
2682 -5946 -4320 -1777 -3962 -1990 4340 14134 26419 14683 11269 8233 10655 12333 512 -7753
2668 -7753 -16002 -14032 2333 -12097 -13419 -6911 2906 4144 762 1270 2976 -5659 -5616 -16989 -32309
2653 -32309 -20676 -12413 -1031 6477 -7960 -13636 -16598 -3658 1657 -4198 -8141 -9919 -11060 -12235
2639 -12235 -9337 -8317 5857 14166 4320 -5242 -6052 56 4808 1221 -8148 14766 21472 14382
2625 14382 9589 -5869 -13640 -16663 -13470 -18064 -7738 3826 10956 12169 6430 5630 11288 -176
2611 -176 6659 15030 10906 -7719 -8817 2141 23747 26695 26432 28042 19388 -4424 -10577 -2163
2597 -2163 -491 16358 16781 10031 908 -981 -10260 -21766 -16936 -10960 -135 15312 20076 16327
2583 16327 6100 -4281 -11299 -3868 4428 3585 6728 -2210 1479 8990 1624 -8617 -14402 -17580
2569 -17580 -4390 12134 18444 24121 18398 23259 24311 7396 -8892 -18787 -7082 9719 -530
2556 -530 -7760 -18315 -10882 3434 -10124 -5368 5497 27023 24559 3989 -569 12054 25066
2543 25066 34637 26976 27093 20487 -3680 -11691 -5735 -3015 7764 -2138 -12254 -13407 -1269 7882
2529 7882 7626 7265 4209 4807 24009 43402 34169 24546 17606 23248 14305 1523 1226 1795 -3691
2514 -3691 -17065 -12237 -14563 -21537 -18665 -19590 -13947 -12651 -8935 -8129 -14936 -15320 -7076 -1274 4539
2499 4539 1781 230 9365 23195 41609 42186 35440 34521 22172 6389 4922 22637 32869 28035
2485 28035 13637 9317 10753 3015 -10060 -11506 -5938 420 4107 2215 -3792 -11772 -4781 4925
2471 4925 8106 -9728 -22987 -9177 377 -7865 -16070 -22773 -19257 -6531 -4666 -10540 -10893 -9574
2457 -9574 -11609 -15595 -12033 -9491 -13632 -7851 519 8449 10765 12246 23687 25862 10464 695
2443 695 -5027 -1688 -3975 4258 3415 -5757 2141 17807 15451 10345 21862 15527 14354 17134 12059
2428 12059 9447 5603 -3047 -349 4598 973 -2620 -3347 -5696 -5987 -6016 -7599 -4202 -8196 -9958 -2229
2412 -2229 2031 4289 -171 -5661 -3651 7624 25507 34728 35739 20917 9760 -13507 -17268 -10339
2398 -10339 -5203 6575 1101 -12005 -24437 -5894 2329 7466 4656 -777 -4861 -6454 -1889 -2340
2384 -2340 4162 1211 3274 11571 16557 15480 22197 24120 15199 14582 8078 17441 19226 -594 -8125
2369 -8125 -8168 3116 16447 16839 6171 24002 30684 27984 35798 49350 45495 29469 15198 19560
2355 19560 17430 15424 16216 7857 -4267 -16109 -8714 464 4301 381 -4057 4564 -3199 -7981
2341 -7981 6022 5647 2503 -16804 -15286 -12652 -21559 -6007 1995 -6499 -1629 21094 36221 31765
2327 31765 19683 18106 10764 5740 -738 1102 9321 8651 11244 12647 15909 10447 9141 10327 5187
2312 5187 2093 -3854 -24481 -14367 -2336 4415 -2629 -3502 -3810 -9747 -6557 720 -1375 -2377 -2049
2297 -2049 6896 5267 2409 9866 17055 9894 1885 2850 6443 7640 20483 25164 20328 21671 31709
2282 31709 22078 8776 -2530 -1819 2980 11507 31145 28637 26149 23816 17616 4193 1814 8930
2268 8930 13731 9668 -2131 -9848 -16275 -24581 -22137 -16613 -5286 16391 21633 28261 134 -26518
2254 -26518 -13268 -3529 -10306 -5914 -10687 -9232 -12491 -9881 -14545 -8538 1709 -5606 3809 16761
2240 16761 21172 18443 6243 -5516 3664 3349 808 4631 -8072 -18851 -21518 -18381 -17222 -17591
2226 -17591 -16117 -582 7893 10246 15685 6519 6566 11704 12178 12241 5543 2636 18027 36734 39898
2211 39898 38251 17829 2133 -9701 -16367 -2956 -10666 -17531 614 9273 15347 3447 1813
2198 1813 -9868 -18313 -2440 5254 23130 12132 1988 1891 -5334 -14820 -25936 -35022 -25792 -13189
2184 -13189 1580 9447 -982 -4810 -23607 -24302 -13258 -14905 -19436 -7824 -2296 -6943 -8492 -16010
2170 -16010 -15306 1823 -5340 -19579 -15975 -1326 7163 14417 18250 24716 14074 8828 11475 8594
2156 8594 10478 17023 3489 3109 9822 6799 1599 11155 10682 7830 16778 17309 11070 10665 6347 -5698
2140 -5698 614 -3907 -17027 -14482 -4472 2902 -155 2665 7035 11343 8866 9338 2406 720 -542
2125 -542 -1008 -880 -3174 -325 8480 3322 5280 3870 -2550 -20173 -17592 -7943 -8445 11911 21403
2110 21403 11355 -8857 -7959 -13476 -25035 -19310 -13688 -25175 -21625 -11776 -11419 217 3522 -221
2096 -221 4717 16444 33832 22439 25435 25849 19695 184 -2436 1183 -7820 -5083 5907 6855
2082 6855 -1495 -1732 -9050 -25257 -19191 -17461 -17345 -15153 -12139 -5166 -4846 -6252 4991 17866 21313
2067 21313 18472 14833 12190 8427 10278 22970 20171 11369 -133 -2847 -3893 6679 16167 16949
2053 16949 15707 6593 17607 22080 14261 -2422 -15976 -21582 -11455 -2812 -12496 -16274 -9403 -4292
2039 -4292 14205 19942 3211 -13823 -16641 9107 4686 5810 17646 13408 17554 24583 16707 24266
2025 24266 20730 13053 9208 4723 -82 3250 14830 10681 -2619 -6880 -8079 -12701 747 248
2011 248 -631 13317 5672 6238 -6011 -15147 -17538 -20583 511 14408 22835 14898 4842 18761
1997 18761 26072 18078 15112 9199 12428 19468 19576 19252 10783 -1643 -7212 -5431 -20442 -18844 -10940
1982 -10940 1402 16164 22027 17162 13880 -926 -2699 -6392 -5459 3725 10611 23779 24669 14249
1968 14249 8124 10349 5482 12626 7449 -2099 4999 18945 30525 41768 44380 26183 5029
1955 5029 11972 10581 -2531 -11384 -18837 -24162 -14750 -4245 -7890 -4912 6989 -7347 2163 13914
1941 13914 14597 17375 14037 3874 10791 15907 18925 10983 -2442 -10520 -8901 -4705 -9222 -4687
1927 -4687 3548 -10210 -19344 -28274 -17502 -12292 -10353 -16521 -25721 -23986 -6776 1195 -5285 -6656
1913 -6656 -8887 -413 4674 4191 9926 18310 15267 18415 24607 25842 25924 12484 1979 24239 23260
1898 23260 12059 -4755 -1950 7934 23568 31310 35273 36203 16925 -1687 1197 8854 11155 21910
1884 21910 30771 11912 7011 -10839 -7363 -1777 -7583 -11029 -4278 -5794 -7631 -1496 3106 705
1870 705 -1597 5184 2885 1322 -8478 -28085 -25956 508 4425 15442 24121 16653 6732 -432
1856 -432 -7467 -3633 -1780 -6299 -4816 1985 17397 -1088 -14518 -10347 -4202 -1045 -11428 -7445
1842 -7445 -376 11703 11293 5862 1848 -4334 -8764 -10771 -11490 -23989 -22877 -15403 -259 -3010 -14326
1827 -14326 -9295 -3745 -982 -3639 -12257 -3663 8917 10679 14682 8128 11476 14314 -4712 -8915
1813 -8915 -13329 -3525 -2382 -2569 11821 32251 34504 31550 19650 13739 25244 13392 3659 7436
1799 7436 7491 -228 5546 4240 5794 6164 7598 11056 12491 13720 11733 13531 13214 15874 -284 -11802
1783 -11802 -7115 -13001 -1676 -6376 -9385 -3241 -1945 849 -806 -2993 -6909 5080 22991 14714
1769 14714 -7544 -1517 7213 17597 21104 12617 3789 11819 -5478 -20122 -13307 -18270 -9967 -9992
1755 -9992 -13918 -269 -2187 -427 11271 8281 -3830 -16492 -12972 -6770 -10481 -12371 -13790 -25681
1741 -25681 -27684 -3678 17063 5730 -2981 -5341 359 10234 25876 29199 27230 17195 -3126
1728 -3126 -6991 -10819 -11177 -18005 -5525 12522 22666 30479 32794 36859 29129 3338 -4333 -1902
1714 -1902 -6772 -11265 -14347 -8614 -5073 -1652 -4064 -13230 -20137 -3853 9982 1079 -5778 -8621
1700 -8621 -11633 -14229 -3235 1739 -1510 -13520 -10057 -1150 -7774 -11690 -11718 -7262 1579 2280 13739
1685 13739 21247 21310 12936 -6304 -2801 11549 -9973 -17719 -14794 -13263 -15583 -9009 -2699 5971
1671 5971 8290 16551 15419 13995 31516 24939 11483 13442 12411 3624 -3006 839 8211 7716 -100
1656 -100 2689 9980 22188 29569 18033 3089 7592 1881 -12009 -20469 -21864 -19560 -12564 14446
1642 14446 9403 2240 -8525 -6947 6773 9655 -401 -20156 -12947 1264 -210 -3074 3400
1629 3400 6045 2533 7079 9317 4738 -10516 -17220 -7965 -7887 -13649 -10879 -14359 -4659 -12862 -26332
1614 -26332 -31860 -25498 -16158 -9960 -16163 -11541 5431 9828 4402 6633 17182 21274 22959 13124
1600 13124 -404 -10197 -19754 -19519 -22382 -8005 -95 6716 12183 13372 4377 4007 12642 19169 11593
1585 11593 9727 10214 13367 4328 -9080 -8441 -10165 -18527 -27011 -22799 5398 15405 5676 10359
1571 10359 16560 15750 12511 14673 14067 4074 -11856 -17573 -27635 -29771 -23052 -24687 -15197 -19830 -34478
1556 -34478 -29773 -10438 -415 -4814 1183 9769 6974 8480 10216 2189 10343 19164 18123 6215
1542 6215 6750 14874 4416 2295 -4684 -3917 -6266 -12300 -12947 -2440 9428 11352 13913 -1232 -1822
1527 -1822 6796 19420 15243 9655 -1082 -12372 -6901 5163 26908 27294 15111 1528 7130
1514 7130 -8422 -5871 6072 9806 13991 12155 5311 -7172 -3645 10237 22327 25941 12509
1501 12509 -1377 -6004 -1577 2202 -1905 -6859 -13335 -370 -649 11431 15043 15396 2697 -6412
1487 -6412 762 4972 4421 18284 11563 360 15461 24234 5760 -5548 -3674 8602 22088
1474 22088 -168 -10390 -12293 -912 8053 -1545 -79 -11393 -5942 6912 -349 -12928 -14713
1461 -14713 -2427 9265 19740 20341 20931 21602 5820 -4170 -7188 -1881 22154 32377 21770 -286
1447 -286 10847 22990 25869 16668 9681 9458 20546 17583 7371 3328 -3653 -781 8059 5206
1433 5206 -3677 -3040 4875 9320 17292 19792 18020 13320 5040 -5673 -12924 -10159 -6428 -14412 -7403
1418 -7403 -4088 -11375 -5796 3744 3480 -14585 -15953 -8775 -7167 1416 12078 7107 9103 16067 9622
1403 9622 -4330 -9014 -7405 -5724 -6636 12989 26666 19733 16760 12162 19338 19997 10332 12950 23451
1388 23451 15505 25321 23850 18321 10740 -7561 -7955 -8179 -15296 -9624 -10847 -1609 1377 -11697 -28590
1373 -28590 -7473 -6867 -15521 -6033 -12912 -16354 -18112 -16991 3415 11903 9497 4148 300 -9208
1359 -9208 201 9997 11533 9996 1338 8615 4450 -9206 -2585 7907 415 -10010 -2174 11428
1345 11428 24435 21598 18959 15479 7503 8517 11850 -48 -2930 2019 17476 22676 17481 1128
1331 1128 -3543 -14197 -28952 -25242 -24705 -14886 513 -6600 -11879 -3197 -8679 -8512 -6857 -10012 1222
1316 1222 3121 -1683 -801 2268 -1695 -447 6925 11843 15622 15267 9906 4394 -7009 -6203 -7517
1301 -7517 10211 11006 -3236 -10100 -12872 -8623 -7981 -13941 -10994 985 1986 -1657 -10388 1095
1287 1095 11524 15525 25634 19452 9692 -9566 -16621 -20856 -15877 -14473 1846 14937 16001 -2639
1273 -2639 -7244 -5382 -1071 -5920 -7849 3325 11614 19944 5989 2212 9073 6353 6541 10727 19388
1258 19388 19308 17026 804 -11914 -10270 -2769 -7399 5 10984 6046 -12537 -13764 306 600
1244 600 11102 16909 18451 3853 -5090 -700 -2829 -3331 -3778 8368 15852 26348 20508 20527 18934
1229 18934 12358 4018 506 -3397 -8601 -4993 9966 6749 9733 9716 14295 10030 2076 3316 -7217
1214 -7217 -20707 -23746 -14783 3110 6685 -13019 -21283 -25212 -18064 -12249 -15041 -11363 -1676 743
1200 743 -1307 -7280 -12495 -18901 -20648 -6806 -8617 -14475 -18231 -2754 -9627 -12683 -15160 3820
1186 3820 13615 14696 8554 13180 21065 13509 7315 -3611 -12917 -6054 -4249 -5204 -4878 -7079 -7239
1171 -7239 -11032 -11817 -3005 8296 7755 -1305 -9427 -30962 -35883 -30504 -23123 -21464 -12410 -7374 -22463
1156 -22463 -26580 -15026 -10291 -11747 11645 16202 20340 13267 11136 13439 5972 -6839 -12521 -20853
1142 -20853 -26635 -20721 -12674 -9937 -5598 -4316 7185 -7945 -22130 -25606 -27291 -29220 -27424 -26557
1128 -26557 -19317 -6319 -7560 -24228 -37552 -26375 -10804 -3363 -3200 -3065 8270 2152 -157 -7470
1114 -7470 -3589 6945 19391 5863 -4564 -13072 -1749 6958 13059 3830 2160 8928 7771 5350
1100 5350 -2691 4094 15428 19229 8989 4635 3584 4831 2067 -7156 -5007 -17389 -27833 -31179
1086 -31179 -26265 -12226 -8709 -3099 1631 -1089 241 3751 4566 -4682 -5454 -7211 -6673 1480 -13707
1071 -13707 -23672 -23336 -24431 -22331 -5043 8937 9598 7971 27133 26561 8170 -1813 3809 2222
1057 2222 -3056 -12308 -14251 -5927 -4170 4560 -5413 -3726 -3840 -15526 -15543 -21872 -21864 -5145 3570 2844
1041 2844 9233 4457 2519 -5766 -8501 -3713 -15374 -7713 3306 10123 10079 -4795 -5987 -6759 5543
1026 5543 24992 23216 6954 -6208 -22019 -16798 -6382 1889 -6985 -8772 -8023 1313 8455 10095
1012 10095 12746 1590 -3777 4576 5703 12519 30728 21371 10320 12161 14213 9991 15340 29093
998 29093 14521 3285 17984 21204 15927 9992 778 8822 9987 -1693 -15606 -24289 -19127 -16684
984 -16684 6567 10969 10595 10321 1177 -6973 -13559 -16324 -8661 2861 3950 13116 -3125 -4878 5014
969 5014 -3530 -6147 -3302 10368 14958 -1774 -19323 -19857 -2138 5214 -1807 -13239 -16095 -20093
955 -20093 -5222 -2341 -2325 -7994 -9108 5864 13973 2012 -8854 -10610 -4006 -4082 8279 4444 3537
940 3537 9928 3411 -13507 -131 24172 19012 2456 -9356 -363 11160 -37 -9976 -3028
927 -3028 706 18284 19938 17404 6985 1088 2547 -2224 -9547 3244 16784 18851 3522 -3147
913 -3147 -6018 -1366 5342 8643 25439 38348 41065 15312 3487 10652 17685 15278 -137 -10820
899 -10820 -6978 -540 -1284 -3405 475 15760 7017 -2550 460 11089 9180 -1503 7533 21926
885 21926 18241 9290 7338 5563 -781 -10608 -11027 -4641 3086 -73 -2255 -183 8351 -1090 1414
870 1414 20436 29734 12676 16626 5786 -7978 -1776 -9757 -24735 -36253 -20459 -15890 -24381
857 -24381 -20114 -6216 -9968 -14165 -13162 -17222 -7313 9347 16483 14090 26045 23580 10595 7330
843 7330 5749 -6280 -11981 -20023 -14048 -14639 -6496 491 8625 2979 -5580 -3107 2683 6593 16107
828 16107 12376 7360 16810 17903 9625 -6645 -3134 -3782 2970 -1593 1720 12012 16724 4709
814 4709 5340 3618 -8045 5739 19287 23617 13990 5344 15511 18522 13430 13375 10480 -5999 -3052
799 -3052 1526 18432 19001 30020 33317 25597 24051 24778 18005 12242 19229 16230 12120 12540 16019
784 16019 17470 18545 29382 27792 11143 16228 23611 25718 3640 -6484 11835 13888 19568 27634
770 27634 19065 2052 -4902 2087 4125 5404 12196 17404 9438 10551 21532 29565 32211 30229
756 30229 28982 26041 31794 24746 17211 15528 15742 13118 9446 21494 40980 28414 12328 9182
742 9182 6190 1654 10994 10645 9446 3375 12875 14695 18820 10240 8069 23216 39572 37304 34787
727 34787 31838 22132 8177 -1491 -6033 -6684 -10738 -4074 -195 3366 10011 9576 5090 4274 3090
712 3090 -574 -8241 -16369 -20483 -30198 -16984 1051 13416 3593 -10439 -2708 7356 7868 -1187
698 -1187 3129 2576 -7845 -5637 -1338 -13372 -6349 2893 20612 13442 2188 -773 7649 -311
684 -311 -8351 -5431 -9226 -7154 -7491 -10669 -3556 7814 7669 -1598 -17556 -16630 -21633 -818 248
669 248 -7432 1148 2199 553 8025 33075 36117 30646 24023 28931 23523 24871 24680 23154 8331
654 8331 -2943 4467 9621 1927 13993 13991 17284 19952 23984 32775 36988 27516 16336 14732 26718
639 26718 19501 21847 28073 22046 23890 21389 21901 34656 27621 14961 24722 27109 17452 19266 28418
624 28418 30890 27093 27585 30805 28655 33612 17866 14473 26582 21719 13412 18007 16713 6025
610 6025 7715 -127 -1064 3173 5216 12855 12958 1164 -1898 4131 7278 8140 4809 7107 -1169 11502
594 11502 16948 22021 17280 14498 14673 20840 26299 4770 7321 9242 16666 29112 21638 12925 3442
579 3442 2796 12437 25959 27882 23497 17575 -780 1929 5862 8898 -4234 5699 19213 17363
565 17363 3254 -9531 -4420 11806 19252 23622 24636 14494 482 2902 8368 12286 4427 7531
551 7531 21107 15087 11095 7829 -3706 5846 23496 20593 6315 -12408 -5650 2980 2457 5537
537 5537 3078 6292 10501 2723 1990 8123 4767 -5130 -5414 2353 6472 10329 12730 18825 26779 23822
521 23822 32793 32258 21720 25193 39741 34873 28975 43199 41393 25109 18059 11449 15161 18422
507 18422 17507 20310 13050 1868 -1912 8656 18950 18148 15936 18677 26518 22969 8378 3665
493 3665 -3718 -3031 10497 36123 38270 28412 15972 1901 -3252 -2237 7295 14028 24065 31578
479 31578 30406 14695 13542 23175 28623 18873 19271 13990 1261 8017 14990 18293 23208 5042
465 5042 -16615 907 20885 19343 20025 30475 20725 17375 17838 25851 21478 19081 23144 21042 1449
450 1449 -717 5382 3361 4786 -122 -9261 -1589 5047 4103 1670 1723 4611 14358 15581 11448 16855
434 16855 19877 25350 14375 13651 -1186 -5385 -707 11708 20797 19298 12532 7128 8094 8700 9006
419 9006 4069 9556 19192 19003 19606 22675 23763 13128 6355 8017 -1841 -5221 1322 12757 11877
404 11877 13101 -1946 -2059 23799 40102 30399 3370 1202 8537 5825 6349 7778 -3532 -6973
390 -6973 -2545 -4261 3352 -1187 -4518 -1057 11514 18620 9362 7457 18000 32179 19691 6385
376 6385 -2448 -9329 3193 22201 24657 17091 10826 21093 32223 23524 17186 -632 -7510 -2835
362 -2835 -3519 9799 20192 13281 14346 18717 15488 9609 8678 12359 20133 13117 23 3337 14860
347 14860 13525 2704 9878 20289 24983 28386 25718 17991 15693 11838 -2646 -2245 14029 6192
333 6192 -870 8793 17593 17687 8994 -516 -14111 -8738 550 17997 18400 3581 -863 2685 13525
318 13525 17530 20423 16779 18156 30347 26792 15776 10468 -1023 4838 13663 21789 28431 18194
304 18194 16228 20541 20574 3511 -11731 -11233 -183 8258 3325 1785 2914 12746 14512 12221 14434
289 14434 20866 4990 -7618 -493 13723 20099 19926 11516 5459 5843 12596 9976 -3453 -13390
275 -13390 -3346 2295 9096 18395 9317 11224 16200 17490 12597 2916 -5769 -7932 -2322 6430 7790
260 7790 5184 15238 25720 24348 23736 19975 8452 2466 9470 4080 5834 5942 7989 13055 14097
245 14097 23738 24828 21873 7157 -4135 -4871 2557 9211 18705 26316 15731 19810 24108 25337
231 25337 25921 13765 15517 15452 20890 18434 7143 8280 1584 7170 9544 13347 12835 513 10257
216 10257 11248 13521 10278 4319 15220 25673 21270 26767 19768 10253 21159 19849 12398 3563
202 3563 2824 5797 -4645 5044 14991 17275 14139 5364 7777 17830 20188 19320 15997 19269 9003
187 9003 999 -178 10291 14343 12411 4152 -3073 -9439 -9201 -9604 -7971 -1998 11955 20715 19705
172 19705 12945 7101 7783 10040 7622 9937 22397 28583 15647 10694 3184 7919 14997 18452 15144
157 15144 20763 16280 6258 -1397 -5986 1087 3498 15738 12424 9329 12020 14259 20017 17586
143 17586 17286 16837 21538 24608 19256 14738 11314 4531 7628 19162 14166 5307 3757 4163 3743 11055
127 11055 13201 8055 13920 19000 8687 5158 9684 15093 27376 23706 16622 18638 23816 24807 14172
112 14172 17022 23848 22536 19071 12238 14297 5940 2605 16785 32494 29387 24595 23097 24967
98 24967 27705 27343 25011 18361 9884 10079 16676 24577 23725 13512 7764 8849 5993 -746 4897 8439
82 8439 3353 532 -68 4572 1947 144 7712 9311 7499 6163 6811 5298 5008 11604 10869 6687
66 6687 3758 777 7512 12826 17335 22437 23061 18106 7971 7351 10078 10000 11237 8804 6539 2262
50 2262 4947 9056 5547 347 2322 4494 6844 3687 7455 10245 18582 32597 23213 18980 21512
35 21512 24168 21391 10400 8238 5403 12111 17154 9818 10794 5357 819 683 3268 6740 1825
20 1825 -672 -5200 -8177 -4557 1867 11959 11425 15948 6636 -2799 6538 9663 14165 16169 21226
5 21226 20593 22479 22628 20529 8763
0 8763
$$ Imaginary data points
##PAGE= N=2
##DATA TABLE= (X++(I..I)), XYDATA
32767 116267 120039 120575 118317 108504 106305 107590 121253 128379 133978 135168 129183 122456 121561 123983
32753 123983 131151 138845 131834 126122 132747 138286 141027 141034 143404 140441 145383 136546 133937 140675 147143
32738 147143 147101 147644 149686 149660 155310 163233 161489 152632 149004 144599 138039 134066 139300 137638 143110
32723 143110 157430 163018 168324 169423 162457 147441 146437 145543 154564 159488 155222 162478 172351 172474
32709 172474 172247 173814 177333 174858 175776 178746 184418 181198 176458 182072 178216 175606 180678 179046 180125
32694 180125 177758 170498 173269 179141 180590 174141 167042 169506 182320 191280 190480 197300 205782 208752
32680 208752 205251 206905 215280 202318 192313 189340 189127 197838 203375 202823 211351 213961 206997 205205
32666 205205 212087 219150 228313 231466 224424 218119 211003 208271 207331 205489 206332 209409 222216 226853
32652 226853 213319 213397 225312 239567 240927 238785 226378 233555 243294 244410 235668 232716 224290 219991
32638 219991 220302 217655 224650 233535 239044 239610 238754 232408 232683 252431 257539 249650 252284 251462 253912
32623 253912 256062 251894 247378 245034 248599 258769 247776 236269 249931 255568 255051 257344 260232
32610 260232 253474 245067 243217 246520 248786 260765 271331 278724 283722 278325 279238 283007 282584 272509
32596 272509 264555 273095 285786 298990 300350 298836 293970 283800 285472 284979 284171 284936 288120 284115
32582 284115 288498 289396 290530 284661 287863 285296 284579 288923 299584 307997 310467 302796 287947 308813
32568 308813 319321 317354 311637 299066 292890 281996 296755 303440 303618 308483 315881 311560 310595 310439
32554 310439 317425 321971 315247 318439 318270 326019 326284 330892 337837 333523 338840 331406 316900 316782 316536
32539 316536 316273 324188 330564 327216 316309 322569 330416 330055 321621 313196 314705 330872 331454 325534
32525 325534 326214 326628 329890 326412 332903 352397 353560 344816 331806 334244 340446 348365 349766 340289
32511 340289 344053 353576 363399 367581 359679 348485 351906 350216 344907 354660 352989 345569 360693 374353
32497 374353 380976 374277 373658 382030 373764 372144 368150 366798 369074 369201 360049 350112 350260 350020 346112
32482 346112 350056 351898 360423 363644 359823 358677 354781 349641 353015 359085 371792 367121 363232 372117
32468 372117 366200 354753 344294 355265 365722 363991 361707 353156 352794 365855 364910 353056 349636
32455 349636 348827 358799 374233 382327 381568 369678 357937 356535 366835 368051 374183 377947 383495 385687
32441 385687 374193 381188 383115 372872 367321 357228 377250 383968 376498 370618 366621 381462 380709
32428 380709 375099 370756 381090 389490 395096 396846 397368 395663 396337 397034 396136 392944 397877 402080 399057
32413 399057 389877 382880 392127 394036 397887 396687 400566 398727 396665 399008 405367 410334 391891 371876
32399 371876 377705 385358 395928 403622 414105 415744 407814 383588 378542 384540 394599 397678 392751
32386 392751 387154 399905 415222 409845 402373 397341 403500 411634 402256 399395 393954 393248 386672 393261
32372 393261 407721 418373 412480 397965 395090 401347 416505 427369 424206 413209 407854 417347 415986
32359 415986 410038 410623 406103 414345 414071 412018 410839 414526 409984 412894 415844 410762 406900 407377 406066
32344 406066 400780 386885 394545 411065 427330 432500 424848 401456 398777 412576 420629 426600 427130
32331 427130 411672 430807 433830 422580 418401 403465 400058 407975 405504 413552 428075 433684 427181
32318 427181 420053 422943 432237 437514 429566 436352 438957 425525 423840 431920 438560 440297 433516 418723
32304 418723 414902 406840 404654 400663 396692 395612 407155 414286 414428 403583 405907 413372 416425 410703
32290 410703 415748 418980 414410 408894 409192 414052 415030 417460 418868 417856 431177 429757 424893 429436
32276 429436 427882 423968 421384 417367 403885 411509 423535 418167 420566 435984 445049 441451 431283
32263 431283 430147 430714 434609 433354 442955 436979 438529 434683 437020 432032 427444 431493 434638 427347
32249 427347 431010 435413 436782 436125 427826 420761 419666 419756 433861 435500 434402 431448 436710 429559 434820
32234 434820 431097 436315 453536 459497 458418 443901 434090 433831 436734 441775 433160 436429 436016 414338
32220 414338 403832 391648 381623 396272 420870 437903 423387 430422 433861 427796 427608 429731 440763
32207 440763 440353 443489 444136 441671 444354 445381 443988 449595 458780 458623 439751 447438 454169 451453 448553
32192 448553 436174 423360 434781 439066 434424 444711 441585 427504 440320 451778 444246 439039
32180 439039 438310 428209 439465 430544 433973 438183 443253 437604 439650 454062 448640 433942 426113
32167 426113 429395 436767 436197 435618 432875 420603 437941 445527 448680 446220 437805 437116 440756 440583 439485
32152 439485 443929 450823 452134 448598 445198 438678 448249 455275 456359 451518 443448 438177 440063 431573
32138 431573 431066 436292 442053 453066 448076 448329 441915 434897 455555 461064 459016 454122 449519 445440
32124 445440 442400 450130 449440 438772 445939 449336 446500 445291 457983 458551 453271 444720 440201 443894
32110 443894 448152 452102 451494 439652 440851 447421 433477 432511 435685 436488 429252 430128 428754 440469
32096 440469 456689 459491 447141 427464 424538 443130 448499 445483 445353 447648 446246 452778 465249
32083 465249 477717 475074 469190 464834 448214 441718 451697 451548 444301 433073 419956 420668 438205
32070 438205 443814 444044 434287 445948 446988 450126 451986 437613 415856 421455 434458 440620 434520
32057 434520 426622 412380 414973 422111 429394 430746 423128 433847 445030 451988 442757 443901 458041
32044 458041 468732 460933 446201 436301 439683 445915 445187 448888 452367 440764 437970 441051 445447 437936
32030 437936 422196 425370 437422 446110 449739 448173 440076 455160 465665 464731 469822 462338 451042
32017 451042 446355 459480 455032 450548 438228 431786 439332 450263 451119 449914 452476 454025 464707
$$ [...]
##END NTUPLES=NMR SPECTRUM
##END=
