##TITLE=Analysis number 322074
Compound Code mo 07255
Project Code adrs
Chemist Name synnovation
##JCAMPDX= 6.0         $$ Bruker NMR JCAMP-DX V2.0
##DATA TYPE= NMR SPECTRUM
##DATA CLASS= NTUPLES
##ORIGIN= Bruker BioSpin GmbH
##OWNER= nmr
$$ XWIN-NMR		Version 3.5
$$ Tue Sep 12 09:59:31 2006 GMT Daylight Time (UT+1h)  MAYBRIDGE\nmr@NMR_250MHZ
##.OBSERVE FREQUENCY= 250.131544655141
##.OBSERVE NUCLEUS= ^1H
##.ACQUISITION MODE= SIMULTANEOUS (DQD)
##.ACQUISITION SCHEME= undefined
##.AVERAGES= 16
##.DIGITISER RES= 18
##SPECTROMETER/DATA SYSTEM= dpx250
##.PULSE SEQUENCE= zg30
##.SOLVENT NAME= CDCl3
##.SHIFT REFERENCE= (INTERNAL, CDCl3, 0, 16.522)
##AUDIT TRAIL= $$ (NUMBER, WHEN, WHO, WHERE, WHAT)
$$ ##TITLE= Audit trail, XWIN-NMR		Version 3.5
$$ ##JCAMPDX= 5.01
$$ ##ORIGIN= Bruker BioSpin GmbH
$$ ##OWNER= nmr
$$ C:\u/data/dgb/nmr/ADRS/550/pdata/1/auditp.txt
$$ ##AUDIT TRAIL=  $$ (NUMBER, WHEN, WHO, WHERE, WHAT)
(   1,<2006-09-12 09:59:05.75 +100>,<MAYBRIDGE\nmr>,<NMR_250MHZ>,
      <created by zg, POWCHK disabled, PULCHK disabled
       configuration hash MD5:
       E2 DF 36 D8 04 B2 41 60 5A D7 A3 38 5A 4B D0 FE
       data hash MD5: 64K
       BD C4 A4 DD 8B 30 97 16 7C D8 0D D5 4E 0A 68 4E>)
(   2,<2006-09-12 09:59:20.69 +100>,<MAYBRIDGE\nmr>,<NMR_250MHZ>,
      <Start of raw data processing
       ef LB = 0.3 FT_mod = 6 PKNL = 1 SI = 32K 
       data hash MD5: 32K
       C4 85 1F 7D 29 B2 9D 1F B9 AE 23 54 01 59 9A B3>)
(   3,<2006-09-12 09:59:22.33 +100>,<MAYBRIDGE\nmr>,<NMR_250MHZ>,
      <apk 
       data hash MD5: 32K
       F5 53 8C AD 9C 5A 2F B5 47 58 94 81 31 6B 99 A3>)
(   4,<2006-09-12 09:59:23.19 +100>,<MAYBRIDGE\nmr>,<NMR_250MHZ>,
      <abs ABSG = 5 
       data hash MD5: 32K
       5A BD 64 33 58 B1 CC BB BC C5 63 36 85 5D CE D2>)
$$ ##END=
$$ 
$$ hash MD5
$$ C6 CE BD 62 C5 62 46 9F 74 A5 83 31 F4 26 80 11
##$RELAX= 
##$RELAX= 
##$RELAX= 
##$RELAX= 
##$RELAX= 
##$RELAX= 
##$RELAX= 
$$ Bruker specific parameters
$$ --------------------------
##$DU= <C:\u>
##$EXPNO= 550
##$NAME= <ADRS>
##$PROCNO= 1
##$TYPE= <nmr>
##$USER= <dgb>
##$AMP= (0..31)
100 100 100 100 100 100 100 100 100 100 100 100 100 100 100 100 100 100 
100 100 100 100 100 100 100 100 100 100 100 100 100 100 
##$AQSEQ= 0
##$AQ_mod= 3
##$AUNM= <au_zg>
##$AUTOPOS= <27 >
##$BF1= 250.13
##$BF2= 250.13
##$BF3= 250.13
##$BF4= 250.13
##$BF5= 500.13
##$BF6= 500.13
##$BF7= 500.13
##$BF8= 500.13
##$BYTORDA= 1
##$CFDGTYP= 0
##$CFRGTYP= 5
##$CHEMSTR= <none>
##$CNST= (0..31)
1 1 145 1 1 1 1 1 1 1 1 1 1 1 1 1 1 1 1 1 1 1 1 1 1 1 1 1 1 1 1 1 
##$CPDPRG= <>
##$CPDPRG1= <>
##$CPDPRG2= <>
##$CPDPRG3= <>
##$CPDPRG4= <mlev>
##$CPDPRG5= <mlev>
##$CPDPRG6= <mlev>
##$CPDPRG7= <mlev>
##$CPDPRG8= <mlev>
##$CPDPRGB= <>
##$CPDPRGT= <>
##$D= (0..31)
0 1 0 0 0 0 0 0 0 0.06 0 0 0 0 0 0 0.0002 0 0 0 0 0 0 0 0 0 0 0 0 0 0 
0 
##$DATE= 1158051544
##$DBL= (0..7)
120 120 120 120 120 120 120 120 
##$DBP= (0..7)
150 150 150 150 150 150 150 150 
##$DBP07= 0
##$DBPNAM0= <>
##$DBPNAM1= <>
##$DBPNAM2= <>
$$ [...]
##$SUBNAM7= <"">
##$SUBNAM8= <"">
##$SUBNAM9= <"">
##$SW= 20.6930455092707
##$SWIBOX= (0..15)
0 0 3 0 0 0 0 0 0 0 0 0 0 0 0 0 
##$SW_h= 5175.983436853
##$TD= 65536
##$TD0= 1
##$TE= 296.16
##$TE2= 300
##$TE3= 300
##$TEG= 300
##$TL= (0..7)
0 120 120 120 120 120 120 120 
##$TP= (0..7)
150 150 150 150 150 150 150 150 
##$TP07= 0
##$TPNAME0= <>
##$TPNAME1= <>
##$TPNAME2= <>
##$TPNAME3= <>
##$TPNAME4= <>
##$TPNAME5= <>
##$TPNAME6= <>
##$TPNAME7= <>
##$TPOAL= (0..7)
0.5 0.5 0.5 0.5 0.5 0.5 0.5 0.5 
##$TPOFFS= (0..7)
0 0 0 0 0 0 0 0 
##$TUNHIN= 0
##$TUNHOUT= 0
##$TUNXOUT= 0
##$USERA1= <user>
##$USERA2= <user>
##$USERA3= <user>
##$USERA4= <user>
##$USERA5= <user>
##$V9= 5
##$VALIST= <valist>
##$VCLIST= <CCCCCCCCCCCCCCC>
##$VD= 0
##$VDLIST= <DDDDDDDDDDDDDDD>
##$VPLIST= <PPPPPPPPPPPPPPP>
##$VTLIST= <TTTTTTTTTTTTTTT>
##$WBST= 1024
##$WBSW= 4
##$XGAIN= (0..3)
0 0 0 0 
##$XL= 0
##$YL= 0
##$YMAX_a= 274915
##$YMIN_a= -439774
##$ZGOPTNS= <>
##$ZL1= 120
##$ZL2= 120
##$ZL3= 120
##$ZL4= 120
##$ABSF1= 16.522
##$ABSF2= -4.171173
##$ABSG= 5
##$ABSL= 3
##$ALPHA= 0
##$AQORDER= 0
##$ASSFAC= 0
##$ASSFACI= 0
##$ASSFACX= 0
##$ASSWID= 0
##$AUNMP= <proc_1d>
##$AZFE= 0.1
##$AZFW= 0.1
##$BCFW= 0
##$BC_mod= 0
##$BYTORDP= 0
##$COROFFS= 0
##$CY= 12.5
##$DATMOD= 1
##$DC= 0
##$DFILT= <>
##$DTYPP= 0
##$F1P= 14.0000005364418
##$F2P= -0.99999901652339
##$FCOR= 0.5
##$FTSIZE= 32768
##$FT_mod= 6
##$GAMMA= 0
##$GB= 0
##$INTBC= 1
##$INTSCL= 1
##$ISEN= 128
##$LB= 0.3
##$LEV0= 0
##$LPBIN= 0
##$MAXI= 10000
##$MC2= 0
##$MEAN= 0
##$ME_mod= 0
##$MI= 0
##$NCOEF= 0
##$NC_proc= -5
##$NLEV= 6
##$NOISF1= 0
##$NOISF2= 0
##$NSP= 0
##$NTH_PI= 0
##$NZP= 0
##$OFFSET= 16.522
##$PC= 1
##$PHC0= 150.0637
##$PHC1= 5.314274
##$PH_mod= 1
##$PKNL= yes
##$PPARMOD= 0
##$PSCAL= 4
##$PSIGN= 0
##$REVERSE= no
##$SF= 250.13
##$SI= 32768
##$SIGF1= 0
##$SIGF2= 0
##$SINO= 400
##$SIOLD= 32768
##$SREGLST= <1H.CDCl3>
##$SSB= 0
##$STSI= 32768
##$STSR= 0
##$SW_p= 5175.98343685301
##$SYMM= 0
##$S_DEV= 0
##$TDeff= 65536
##$TDoff= 0
##$TI= <Analysis number 999999
Compound Code 99
Book Reference 9
Project Code 9>
##$TILT= no
##$TM1= 0
##$TM2= 0
##$TOPLEV= 0
##$USERP1= <user>
##$USERP2= <user>
##$USERP3= <user>
##$USERP4= <user>
##$USERP5= <user>
##$WDW= 1
##$XDIM= 32768
##$YMAX_p= 292851234
##$YMIN_p= -877028
$$ End of Bruker specific parameters
$$ ---------------------------------
##NTUPLES= NMR SPECTRUM
##VAR_NAME=  FREQUENCY,     SPECTRUM/REAL,   SPECTRUM/IMAG
##SYMBOL=    X,             R,               I
##VAR_TYPE=  INDEPENDENT,   DEPENDENT,       DEPENDENT
##VAR_FORM=  AFFN,          ASDF,            ASDF
##VAR_DIM=   32768,         32768,           32768
##UNITS=     HZ,            ARBITRARY UNITS, ARBITRARY UNITS
##FACTOR=    0.157963299565203, 1,           1
##FIRST=     4132.6476996994, 0,             0
##LAST=      -1043.33573715361, 0,           0
##MIN=       -1043.33573715361, -877028,     0
##MAX=       4132.6476996994, 292851234,     0
$$ Real data points
##PAGE= N=1
##DATA TABLE= (X++(R..R)), XYDATA
$$ [...]
16516B62572j59544p6576k5518j12324J1807M7782j2720J52988j36148k90713
16506c38394j86060J4328Q7863L62553K70159r6690j1664J50967Q2940p5433j12077
16495A48492j20272j41329p7630O410J36630P5119l5660q849k107j8838P9156
16484D1122K4548k7950l6728k25172r5042O1543J4825J02506Q3799R3189n6512
16473a9872p1458j03848l7482k4396k0114Q6813l2070R0302P2044k8673j8083
16462a06837K4773K52404J12405o9662J3470L3376j74066o7354m1331j66912j18238
16451c07972L5478J4062J33860L3754l28652p0229K3843J72659K85195k171m0109
16440e0282K92782q2852j50666r2025M802q6386O708J12978m6340j02618R074
$$ plain form
16516 262572 103028 26452 934 -111390 -99583 -51801 -64521 88467 -47681 -338394
16506 -338394 -524454 -510126 -422263 -59710 210449 113759 102095 253062 336002 260569 148492
16495 148492 28220 -113109 -190739 -184329 -47699 27420 -8240 -17089 -19196 -38034 41122
16484 41122 65670 37720 992 -224180 -319222 -257679 -242854 -140348 -56549 36640 -19872
16473 -19872 -91330 -195178 -232660 -257056 -277170 -190357 -222427 -132125 -60081 -88754 -106837
16462 -106837 -82064 170340 282745 213083 226553 259929 85863 18509 -22822 -189734 -307972
16451 -307972 -272494 -258432 -124572 -90818 -419470 -489699 -465856 -293197 -8002 -10173 -50282
16440 -50282 242500 159648 8982 -83043 -78241 -164627 -157919 -44941 -91281 -193899 -184825
16429a84825J65099j2681o4445k010p5074M1729M5891r1275r4620k04059j6242
16418d92512J20448J68031J15827o7993m9058N6353J52363q5138n2481m145J30769
16407g536R3261L3291j38037k38859J4921J04911J58976L0337j0294J86806K7914
16396B55691j28410k14769j5166R2119K39245K3183J30973r0454j10789k7647
16386A53976n9273r3928m3164j07302J11841O0663j66605j07318j69774n6550
16376d77434K71020K18502K6807j38159J0666N0964r7284k8250K25565P417k8631
16365D1183K94673m2130M798P7267J463j32023k24224k06324j58869O6682K0084
16354b57420R2228K26486j41171j02666J26856J11801L5892L0508k2831k3904
$$ plain form
16429 -184825 -19726 -32407 -96852 -98862 -173936 -132207 -86316 -177591 -272211 -476270 -492512
16418 -492512 -372064 -204033 -88206 -156199 -205257 -148904 3459 -81679 -134160 -138305 -7536
16407 -7536 85725 119016 -19021 -257880 -242959 -138048 20928 51265 40971 227777 255691
16396 255691 127281 -87488 -102654 -10535 228710 251893 382866 292412 181623 153976
16386 153976 94703 775 -42389 -149691 -37850 22813 -143792 -251110 -420884 -477434
16376 -477434 -206414 12088 38895 -99264 -88598 -37634 -134918 -163168 62397 69814 41183
16365 41183 335856 293726 298524 375791 377254 245231 21007 -185317 -344186 -277504 -257420
16354 -257420 -165192 61294 -79877 -182543 -55687 56114 92006 122514 99683 75779
16344G5779q0509k01026o3870J66785J15770Q6330J2232j54010q8895K24042J28886
16333B21514Q6424j25792j19097j16077l4282k09947N5935J44456j68504j34757
16323d00127K27854P2937L1627l6195M9415J43639j17925J31552O2089J60982
16313C25848J05669k5699l99592j40761J61681R1447j573k53050p7409J7360m2701
16302b38780o8157P6038P5275J89814R9986l3734J80528J88071O3521j38152j25742
16291B68668J1958M6203j37927Q0749Q755j1511n2455k06754j995p1529J2967
16280e2871J00221M5726j89013q8414j06241K44545N7990m206J2292n7523j59387
16269a96881j46879J30752K63766j65L1512L6703k60745j16538l10268r0431K26216
$$ plain form
16344 75779 -4730 -205756 -269626 -102841 12929 99259 111491 -42519 -131414 92628 221514
16333 221514 307938 182146 63049 -53028 -87310 -297257 -241322 -96866 -265370 -400127
16323 -400127 -172273 -99336 -67709 -103904 -54489 89150 -28775 102777 164866 325848
16313 325848 431517 405818 6226 -134535 27146 118593 117020 -136030 -213439 -196079 -238780
16302 -238780 -306937 -230899 -155624 34190 134176 100442 280970 469041 532562 394410 268668
16291 268668 280626 326829 188902 269651 278406 266895 214440 7686 5691 -65838 -52871
16280 -52871 47350 93076 -95937 -184351 -290592 -46047 11943 7737 20029 -37494 -196881
16269 -196881 -343760 -213008 50758 50593 82105 118808 -141937 -258475 -568743 -659174 -432958
16258d32958K04765j02872N6525o5925N6518N3649j02030m8245J32597p5809o3904
16247c87689J59108K03756J3636q7632L9517R484r5308k0169K11717J55400k38773
16236c6953j95562n288l8200J98581K92277j58751q8449J87170L9315j17090R22
16225G7972j36609p8693q4058j35342j83646K28007K40839J14590N6684J9183
16215A18927j4762j54035l8149P1727k31846l0981J38623N9062r1N180J80483
16204A04138J27239J2966q1206j19368q8776j82872j49818k06617m5716K30581
16194c99449K58922J33598j41712o0452L21193K09290J14856j07766j58477n4798
16184A15205K5082m6870O323J2772k86711j35167N8091J04353M4279o8644r8928
$$ plain form
16258 -432958 -228193 -331065 -274540 -340465 -283947 -230298 -332328 -380573 -247976 -323785 -387689
16247 -387689 -228581 -24825 -11189 -98821 -59304 -49820 -145128 -165297 46420 201820 -36953
16236 -36953 -232515 -237803 -276003 -77422 214855 56104 -32345 154825 194140 77050 77972
16225 77972 -58637 -137330 -221388 -356730 -540376 -312369 -71530 43060 99744 118927
16215 118927 104165 -49870 -88019 -16292 -248138 -279119 -140496 -81434 -81525 -76345 104138
16204 104138 231377 244343 163137 43769 -45007 -227879 -377697 -584314 -630030 -399449
16194 -399449 -140527 -6929 -148641 -209093 112100 321390 436246 328480 170003 115205
16184 115205 140287 93417 99740 112512 -174199 -309366 -251275 -146922 -102643 -171287 -270215
16173b70215l775L9170n1808q1183P9682J49321J24092J74453J3769m8772j7088
16162A07646r3968j3860L196L1867Q1302k35162q5490k7245K3994K7361K5519
16151a54840J25857P5467J82634J16374j10462j17718m2317k01787j71231L5189
16141b62834K24211O9268r864O6055P4732j48182n9830J04576K4936j86608j3412
16130a16952k3611K67190K7663l1968q8143o8184j06540Q5692j32589m0281M9180
16119a78543j00234j8705J6111j35354r0408P002j1659J37560Q4749j25919K10764
16108b04636J92650J16865k58415r195K13146K8933j10359j49950j19614J65681
16098a34894L55118Q6290M5421R5968j73100r1973k09772j06407O177K06857J03714
$$ plain form
16173 -270215 -273990 -234820 -286628 -367811 -288129 -138808 -14716 159737 173506 124734 107646
16162 107646 13678 -182 3014 34881 116183 -118979 -204469 -231714 -207720 -180359 -154840
16151 -154840 -28983 46484 229118 345492 235030 117312 74995 -126792 -298023 -262834
16141 -262834 -38623 30645 20781 86836 161568 13386 -46444 58132 83068 -103540 -116952
16130 -116952 -140563 126627 154290 122322 34179 -34005 -140545 -54853 -187442 -227723 -178543
16119 -178543 -278777 -297482 -281371 -416725 -507133 -500131 -511790 -374230 -289481 -415400 -204636
16108 -204636 -11986 104879 -153536 -162731 50415 79348 -31011 -180961 -300575 -134894
16098 -134894 220224 306514 351935 447903 274803 182830 -26942 -133349 -127172 79685 183399
16087A83399j14045M0982J1638l16134m7337N3386m8499K5956n1372K2018J08304
16076a31704m0006N0561Q0703m1431o3930l0880m6595J90027K53426P0191M9979
16065C40341r2928p6778j02909j52333j35721j22136Q8661J51892Q5939O0126
16055D4154n9316j49103n5902K2409Q5398L8926K7090K90209M3601m5701L3096
16044B74861o2941j77676j24329M961m7440j66628k2203r5670O8055J29913k5841
16033b44938r0156p239K44961r0725r8861N1650J48478n5004n1415M4935m4830
16022a93144j3260J49071J42953J25420J74807j32480k12088m6471k9692l5977
16012g0861R7102k15040j13031o6502m8914P4138r3288M6775N1666O8787K47511
$$ plain form
16087 183399 69354 110336 121974 -194160 -241497 -188111 -236610 -210654 -262026 -240008 -131704
16076 -131704 -171710 -121149 -40446 -81877 -145807 -176687 -223282 -33255 220171 290362 340341
16065 340341 247413 170635 67726 -84607 -220328 -342464 -253803 -101911 -15972 44154
16055 44154 -15162 -164265 -220167 -197758 -112360 -73434 -46344 243865 287466 241765 274861
16044 274861 211920 34244 -90085 -85124 -132564 -299192 -321395 -417065 -349010 -219097 -244938
16033 -244938 -335094 -342333 -97372 -188097 -286958 -235308 -86830 -141834 -193249 -148314 -193144
16022 -193144 -206404 -57333 85620 211040 385847 253367 41279 -5192 -34884 -70861
16012 -70861 26241 -188799 -301830 -368332 -417246 -343108 -436396 -389621 -337955 -269168 -21657
16001b1657n4032q0619K02019J48595m4325n4264j55407l11979m9281L05221J3649
15990a02080q3175l529K18774K08873J60051j10372r1462k53067j6337J68544
15980I6220k806r8017l9173m8577J36747j2491r9862j3312q5601l7027K14116
15969A0217Q8013j41631L8907K2813j11250k95269j18437K29124r0317M8882L47837
15958B8889J57702k0695k27107k19949J06965K15043j16682k721M1677j35464
15948a72342r7233P6875R8101O4797K15997q8541j62294n676J00109N383j20974
15937h5798n2271J76182M2912l1623p8444l4654n6584J2592O5756r5387j16628
15926b53947p2642Q3435J92978q0061J3339M0590O892o3922R979Q1800K2869K1909
$$ plain form
16001 -21657 -75689 -156308 45711 194306 149981 95717 -59690 -371669 -420950 -115729 -102080
15990 -102080 -185255 -188784 29990 238863 398914 288542 197080 -55987 -72324 96220
15980 96220 93414 -4603 -43776 -92353 44394 31903 -67959 -81271 -166872 -203899 10217
15969 10217 98230 -43401 -4494 18319 -92931 -388200 -506637 -277513 -367830 -318948 28889
15958 28889 186591 165896 -61211 -281160 -174195 40848 -75834 -78555 -36878 -172342
15948 -172342 -269575 -192700 -94599 -29802 186195 97654 -64640 -70316 29793 35176 -85798
15937 -85798 -138069 38113 81025 49402 -29042 -63696 -120280 -107688 -41932 -137319 -253947
15926 -253947 -326589 -243154 -50176 -130237 -116898 -76308 -69416 -133338 -123359 -41559 -18690 3219
15914C219K13399J0364o0435k40778p3671N9022J17447r2977k4696j41257J1006
15903b19357Q6073j8835J34928j9366Q9549J43858j82293k45387j28912J0078
15893c49664K47297P9898l7547q3821O7916m6381j18848L5698J33851o8191K25862
15882H6070k5161j06859N3194l3078n7693q892P7469j09438r6258P9505L7113
15871a04028n8802O3149J67846J22190j45668k77325p06m2150k5807m857J1047
15860b95111L591J44128O705J29787J72632l0489N9690j23802j11864o7901J34385
15849B1751J6656k25530q2656n4235J1908j52140P0231L09106Q4963J3839J2342
15838B6235j54678j90593J23400k02591M1513K70260k0135M4383J04788O8475
$$ plain form
15914 3219 216618 226982 166547 -74231 -147902 -88880 28567 -64410 -89106 -230363 -219357
15903 -219357 -133284 -152119 -17191 -36557 52992 196850 14557 -230830 -359742 -349664
15893 -349664 -102367 -22469 -60016 -143837 -75921 -122302 -241150 -205452 -71601 -139792 86070
15882 86070 60909 -45950 7244 -25834 -83527 -92419 -14950 -124388 -220646 -141141 -104028
15871 -104028 -162830 -99681 68165 190355 44687 -232638 -233344 -275494 -301301 -306158 -295111
15860 -295111 -291520 -147392 -140687 -10900 161732 131243 190933 67131 -44733 -112634 21751
15849 21751 38407 -187123 -269779 -324014 -312106 -464246 -394015 -84909 54 13893 26235
15838 26235 -128443 -319036 -195636 -398227 -356714 -86454 -106589 -62206 42582 111057
15828A11057j08815j6761J82207R7194q8222P1587p466j3234l04177r2003J02867
15817f5766L6385Q9303Q3575N1387P5754l968j5570j20614M1928o856j9747L7091
15805A82902j57490M6006j38575J1748M7207l2827K5152R8520l4001j22618K19796
15794A45820J79752J7520p158j7490p5769o3635j32633p414K14165N5886k85173
15783B3871L4585J54280p079o8860n6713J00025P4420j66636k5862K6535l6448
15772E2118j0390j03807M1592j41817j14901J16796K33415q9609j82937l0449
15762b29989j3387R6047K23310K62031K4998L0701p8195q1010j32828j02288k15438
15751b16048n4107N4064R569n0603L5776N3685J8267J95974n1140j88003m1966
$$ plain form
15828 111057 2242 -14519 167688 264882 176660 248247 240781 227547 -76630 -168633 -65766
15817 -65766 -29381 59922 143497 194884 270638 266670 251100 130486 172414 165558 145811 182902
15805 182902 25412 71418 -67157 -55409 -8202 -41029 -15877 82643 48642 -73976 145820
15794 145820 325572 343092 335934 318444 242675 179040 46407 38993 253158 309044 23871
15783 23871 58456 212736 205657 136797 80084 180109 254529 87893 62031 88566 52118
15772 52118 41728 -62079 -20487 -162304 -277205 -160409 73006 -16603 -199540 -229989
15762 -229989 -243376 -147329 75981 338012 363010 393711 315516 234506 101678 -610 -216048
15751 -216048 -270155 -216091 -206522 -257125 -221349 -167664 -149397 46577 -4563 -192566 -234532
15740b34532J07618R2675j19291l3004M0847l3522P4699J03823j4863K33572K6641
15729B44663k28539n6667p4165Q2547R2354L8189P0561l1189p3284J83043p4605
15718A72908j76063J05643J38900K19010j68070l24695k7567k49717J9142k2683
15708c13192R8642J70763k678j03902j75774J057n0541K1470L41477K5013o9432
15697e7097R0824K58071K54894k65116j54451J9632k443N3259j70275j48130Q201
15686a12631O128j7997L4980l5065K2804l2763K60076K19878q1874j49471j54460
15675d0395k15810N3169J18126j143m419Q4494J07741J22627k92135p286j41153
15664b16184j72556K20240J30651m1591L7856K5445k23082j21127K65153L3570
$$ plain form
15740 -234532 -126914 -34239 -153530 -186534 -145687 -179209 -104510 -687 -15550 218022 244663
15729 244663 16124 -40543 -114708 -32161 60193 98382 168943 137754 64470 247513 172908
15718 172908 -3155 102488 241388 460398 292328 -32367 -59934 -309651 -290509 -313192
15708 -313192 -214550 -43787 -46465 -150367 -326141 -325084 -375625 -354155 -12678 12335 -57097
15697 -57097 33727 291798 546692 281576 127125 146757 144314 197573 27298 -120832 -112631
15686 -112631 -106503 -124500 -89520 -124585 -101781 -134544 125532 345410 263536 114065 -40395
15675 -40395 -256205 -203036 -84910 -86053 -90472 -5978 101763 224390 -67745 -75031 -216184
15664 -216184 -388740 -168500 -37849 -79440 -41584 -16139 -239221 -360348 -95195 -61625
15654f1625o0754J38211O1709N6421j47068k32309q6101J04190O7250O1382j72825
15643b71519o8659P3798M123O0828O4854q0913r4407M9208L9429p4631r3053m2327
15631d33269J80343J66115j0269M4542j67487J29434N5924J9898J04887l8426
15621E1692k17388k9102P5224j0148k3988j60271j05212L5352M9484R9394J23479
15610a11484o0723l8777N888O9190L4510J33232O9371j4159j61003j80752R7650
15599a57057l9738P2175M0739N3815J4987M6867J13848j75311k90937K7023J3579
15588b80010K29221P9621J48740Q7856k25398p0137K0628J0713M5024j11682j42258
15577b07682M4116J46854P9478M6177J8201k12497o6085R2182j05442J19507k5686
$$ plain form
15654 -61625 -122379 15832 77541 133962 -13106 -245415 -331516 -227326 -160076 -98694 -271519
15643 -271519 -340178 -266380 -262257 -201429 -136575 -217488 -311895 -262687 -223258 -297889 -390942 -433269
15631 -433269 -252926 -86811 -97080 -52538 -220025 -90591 -34667 -14769 90118 51692
15621 51692 -165696 -194798 -119574 -129722 -153710 -313981 -419193 -383841 -334357 -234963 -111484
15610 -111484 -172207 -210984 -205096 -135906 -101396 31836 101207 87048 -73955 -254707 -157057
15599 -157057 -196795 -124620 -83881 -30066 -15079 31788 145636 -29675 -320612 -293589 -280010
15588 -280010 -50789 28832 177572 265428 40030 -30107 -9479 1234 46258 -65424 -207682
15577 -207682 -163566 -16712 62766 108943 127144 -85353 -151438 -59256 -164698 -45191 -70877
15566g0877j56695P3024j05J64760K4051o5853m7060N8116o7270L53239K38241
15555E03571k71343l06583M1827J24271J202m8854J00679J14984M4882j63556
15545A41080j40078p4277K38838K931j99129j82650j4214J32552O1989R0127j85666
15534a28497p4441p0563N4168J34758J91747J7565p4341j71325j44818P4434M7411
15523a43902j8441J80468J50028j55476k5644Q3940l1853Q9435n0041j78600j621
15512a01707R8800j8775k19036o3675l471P4883O5298M3501J86227K1310k98491
15501b15136M853J209k9883P3640k0122J42554K2065j25237J18544J29986M812
15490A07285M320j97422j30950l4645J17221J09377K86545J06461q0519k14219
$$ plain form
15566 -70877 -227572 -154548 -154653 10107 34158 -31695 -78755 -20639 -87909 265330 503571
15555 503571 232228 -74355 -32528 91743 92945 44091 144770 259754 304636 141080
15545 141080 1002 -73275 165563 168494 -30635 -213285 -227499 -94947 -32958 57169 -128497
15534 -128497 -202938 -273501 -219333 -84575 107172 124737 50396 -120929 -265747 -191313 -143902
15523 -143902 -162343 18125 168153 12677 -12967 70973 39120 128555 78514 -100086 -101707
15512 -101707 -2907 -21682 -240718 -304393 -307864 -232981 -167683 -124182 62045 83355 -215136
15501 -215136 -210283 -209074 -238957 -165317 -185439 -42885 -20820 -146057 -27513 102473 107285
15490 107285 111605 -85817 -216767 -251412 -134191 -24814 261731 368192 287673 73454
15480G3454N3840J48835q3984j05973j31477k67492k49419o277K61302J54581
15470a52610o7424j31542M2258M1807J14218L1998j7545L2498P3142n0282P1926
15459a1556M1706j45675K4040O7111L0166O7308K06075j47633k36498j82290k0450
15448c07696L4737n4755j37566K2682J23404K23384Q8119M7730J58685P1005J977
15437B71706O9563n3734k16899n8010r7122o5284L1498r5328p2778J92955J4226
15426g9207K07916K21233l3611p2669j54300j60723R3938K61193j44593o1639
15416G7538M57j10871j18084o5179M7000L2072J04374m3550k46812J75966J24247
15405b2842K2313o6047j04575J65689K16429N1411j71437j24094j17708N3393
$$ plain form
15480 73454 127294 276129 192145 86172 -45305 -312797 -562216 -568493 -307191 -152610
15470 -152610 -220034 -351576 -309318 -267511 -153293 -121295 -138840 -106342 -33200 -83482 -11556
15459 -11556 30150 -115525 -91485 -24374 5792 73100 279175 131542 -104956 -287246 -307696
15448 -307696 -272959 -327714 -465280 -442598 -319194 -95810 -7691 40039 198724 269729 271706
15437 271706 341269 287535 70636 12626 -84496 -149780 -118282 -213610 -286388 -93433 -79207
15426 -79207 128709 349942 316331 243662 89362 -71361 22577 283770 139177 77538
15416 77538 77995 -32876 -150960 -216139 -169139 -137067 -32693 -76243 -323055 -147089 -22842
15405 -22842 -529 -66576 -171151 -5462 210967 262378 90941 -33153 -150861 -97468
15395i7468Q3216J26703j46882k40868n7947j36969j11980J82944K65271J91014
15385E7034j05111k66430N9449M2933K0309R1548M7340Q4948J3528J26368l0366
15374A41550L1605j79534k81327m5333J79559L04401J09665O0440k44952j70377
15364i4303j89130J40857K2475l3546N5519n4805o9488L9609m435K3722J19614
15353d3911R3435Q1619j48768k58589j47989J29499K85771J38408K25288j35702
15343B19061j76014L9960j8679R9122J10156k02476j41836J21292O0753J01590
15333B12929Q9102q6012r8829J49701q3440j83660R9756J05117p8697j11522n1168
15322c6723j31949m0250o246J25172Q6643k6092J52997j9133j02883k08876P5074
$$ plain form
15395 -97468 -14252 112451 -34431 -275299 -333246 -470215 -582195 -399251 -133980 57034
15385 57034 -48077 -314507 -255058 -212125 -191816 -100268 -52928 32020 45548 171916 141550
15374 141550 173155 -6379 -287706 -333039 -153480 150921 260586 321026 76074 -94303
15364 -94303 -283433 -142576 -120101 -153647 -98128 -152933 -222421 -182812 -187247 -163525 -43911
15353 -43911 49524 131143 -17625 -276214 -424203 -294704 -8933 129475 354763 219061
15343 219061 43047 83007 64328 163450 273606 71130 -70706 50586 111339 212929
15333 212929 302031 216019 117190 266891 183451 -209 99547 204664 125967 14445 -36723
15322 -36723 -168672 -208922 -215168 -89996 -3353 -29445 123552 104419 1536 -207340 -132266
15311a32266K20261N0234J19280N2410j02111l45409L3417M1639m237J62600N0261
15300A46079j27688P0105K84172k2261j15668L9118K4922k9165j51653j68015
15290e0054n2084M5696M7849J45401m2369J8204j1164k71374j41418m0385r039
15279c60737J24940p624K47927N7835O0581r2535k00284o9700L28056M0220r8026
15268C0653k67819j21938q1780K12733K53580J8294N3816j15398M2242L9676j64801
15257a00742K83710M6790K6365k5463l27341j49653q118k2259K53784J37844N9788
15246A74705J13738M8191m6105k26899j94285r0136N9840j20011j63575M4136
15236d00401K68289J04845o0005l4360P3674j48530o4414K1544o0P5840Q1682
$$ plain form
15311 -132266 87995 138229 257509 309919 207808 -137601 -104184 -62545 -66782 95818 146079
15300 146079 18391 88496 372668 350407 234739 273857 298779 269614 117961 -50054
15290 -50054 -102138 -56442 -8593 136808 94439 112643 101479 -169895 -311313 -351698 -360737
15279 -360737 -235797 -243421 4506 62341 122922 30387 -169897 -239597 88459 128679 30653
15268 30653 -237166 -359104 -440884 -228151 25429 43723 97539 -17859 24383 64059 -100742
15257 -100742 182968 229758 256123 230660 -96681 -246334 -254452 -276711 -22927 114917 174705
15246 174705 288443 336634 290529 63630 -130655 -220791 -160951 -280962 -444537 -400401
15236 -400401 -132112 -27267 -87272 -121632 -47958 -196488 -260902 -239358 -239418 -163578 -81896
15225h1896L55066j55599r7956J03624J05167Q2033k86917l08853J55093K69264
15215A39026q0939j46718J1539J82521J62864l7555k83376l7511J78285o0559
15205B7577j1319k481j41941j90187n0629K49139P1061l5505r9807N8924k72617
15194c97785L0435P9340J15116j0405l5413r383J10814M9422j6458j3446N8704
15183c9059J36401Q8211j26844P7490j12102j96193K7143N6287l234l0356j41062
15172b63318J46918K75020j1377Q3107J25586r2200l06455j34670R100k3696N8192
15161a33793J29420n9075Q7917K82314J45627j25477k71142o4849l719P7410o939
15150E7694J16J29653J9838q7754j60641J26111P8771J25953j80461N2233O2346
$$ plain form
15225 -81896 273170 117571 19615 123239 228406 310439 23522 -285331 -130238 139026
15215 139026 58087 -88631 -77092 105429 268293 230738 -52638 -90149 88136 27577
15205 27577 16258 13777 -128164 -318351 -368980 -119841 -48780 -84285 -184092 -125168 -397785
15194 -397785 -367350 -288010 -172894 -183299 -218712 -228095 -117281 -67859 -84317 -97763 -39059
15183 -39059 97342 185553 58709 136199 24097 -172096 -144953 -88666 -91900 -122256 -263318
15172 -263318 -116400 158620 147243 230350 355936 263736 -42719 -177389 -168289 -191985 -133793
15161 -133793 -4373 -63448 24469 306783 452410 326933 55791 -9058 -12777 64633 57694
15150 57694 57810 187463 207301 119547 -41094 85017 163788 289741 109280 161513 223859
15139B23859O012k32697l3866K63542j13193q6767j18297p6740L11P415j711j00395
15127b62527k7901K60818J12614J02749j41547q0852K524K57749L0715j86299
15117F8043q6046R4303J07448R1199o4938M2299O5667j76603k40851m2522L44943
15106B02942M4346k54696m9323q7157J27870J20436M0288j10631j590J2485k05501
15095a60531Q639P5443J55744j90844K72274J31316m7999J096p6546k9224J70271
15084C09639j23413j34294m749O6461j2046J38890O0217k15012j54383Q5688J30097
15073A47095J28852o9063O6062p4200j12191m8503L5388q3083p3278l260J02505
15062A6324j1401l7689j09098k9639K28805m6716M3261n991l59635J84869R9249
$$ plain form
15139 223859 229871 -2826 -36692 226850 113657 26890 -91407 -168147 -167836 -160421 -162132 -262527
15127 -262527 -290428 -29610 83004 185753 44206 -36646 -34122 223627 254342 68043
15117 68043 -18003 76300 183748 274947 210009 252308 317975 141372 -99479 -142001 202942
15106 202942 247288 -7408 -56731 -143888 -16018 104418 144706 34075 32485 44970 -160531
15095 -160531 -151892 -76449 79295 -111549 160725 292041 244042 245138 168592 139368 309639
15084 309639 186226 51932 47183 113644 101598 240488 300705 85693 -68690 16998 147095
15073 147095 275947 206884 272946 198746 86555 38052 73440 -9643 -82921 -86181 16324
15062 16324 4923 -32766 -141864 -171503 57302 10586 53847 47856 -311779 -126910 -27661
15051b7661J03867M6818O2575q3626j9537J801j32634m4768r0893J33177J5198
15040c5683l6768J77283m8741o4806P5265q0049M8919r8301r2532r8089L4070
15029b19432L6555J2445J87563L34367K9364r1696j71029K1046R1861j82133n229
15018D3682O1073j19589j3832m8365l4456r2336p8465k57978J0056K10924O1376
15007b57910J18094o8418K56358J71487j72787j00413j19354p8916O2670J48022
14997d1167J72905M9932K29963o8219j42760J58866L7610j93166Q8150j96478
14987I5636l14684Q2557j34962P3161N7800J36765j3829J02896j43810j59006
14977b17476K5140R567j56455J5262J23104M8323J93697J57518k06204k16378
$$ plain form
15051 -27661 76206 123024 185599 101973 82436 84237 -48397 -93165 -184058 -50881 -35683
15040 -35683 -72451 104832 56091 -8715 66550 -13499 35420 -62881 -155413 -253502 -219432
15029 -219432 -182877 -170432 17131 351498 380862 289166 118137 139183 231044 48911 43682
15018 43682 104755 -14834 -28666 -77031 -111487 -203823 -282288 -540266 -530210 -319286 -257910
15007 -257910 -139816 -208234 48124 219611 46824 -53589 -172943 -251859 -189189 -41167
14997 -41167 131738 181670 411633 343414 200654 359520 397130 203964 292114 95636
14987 95636 -219048 -136491 -271453 -198292 -140492 -3727 -17556 85340 -58470 -217476
14977 -217476 -192336 -182769 -339224 -323962 -200858 -152535 41162 198680 -7524 -223902
14967b23902O4692Q1208J0282n7342J07934K06109m8207j85952j50518n0685R0778
14956a55603J42973J63282j08653j78849j49365P5790J2994r2423o0838M6324
14946c04368J07451K4551j68199M5440L6956P0573J62019r7048j39061l5626J69027
14935a28285o0347o1371M9409J051m1846R3683Q7416p8553j47457j24172M5148
14924c65324K08778R6257K07347j65841J948j12971j57236N9006J50839M9482
14914b7715J84209J22026k91063j42472J98239j18786j54985l1044O8735p917
14904b00773j49142k05145j04059L0460L62116K16314J37781n5775Q2308p6967
14894C7118k6402m7388r9706R8814k7024j06N7489J4679P1576O2458j91264k15893
$$ plain form
14967 -223902 -159210 -78002 -67720 -125062 -17128 188981 140774 -45178 -195696 -246381 -155603
14956 -155603 -12630 150652 41999 -136850 -286215 -210425 -197431 -289854 -350692 -304368
14946 -304368 -196917 -172366 -340565 -295125 -258169 -187596 -25577 -122625 -261686 -297312 -128285
14935 -128285 -188632 -250003 -200594 -199543 -241389 -147706 -60290 -138843 -286300 -410472 -365324
14924 -365324 -156546 -60289 147058 -18783 -16835 -129806 -287042 -228036 -77197 -27715
14914 -27715 156494 278520 -12543 -155015 43224 -75562 -230547 -261591 -192856 -200773
14904 -200773 -349915 -555060 -659119 -628659 -266543 -50229 87552 31777 114085 37118
14894 37118 10716 -36672 -136378 -37564 -64588 -64694 -7205 7474 79050 141508 -49756 -265649
14882b65649J23633J03088O1847M1193j45189J44369J03140j5781j09335j80441
14872a39125j23295K8636J1452J56537R8972k49966j07918K02123O3618o2042
14862a21008K9161m2173K4411j235N3164j2912l4687k0601P7050J05471j44541
14851h7900k10206p0535P7050R0444J65449j55945o7522q7467M4708J02496L9535
14840a59893m1358J80719J51590j20420L6185J7021Q1362j14065r4936r2970J7586
14829a39179J43267J95749j84975L0278O0182Q7151P2806j46465j67478R0618
14819D1954l0741Q4681J02878k96617o5264K19869K58255j05777q8109m2642j57321
14808g8834m1306P5505J5751k55898o642K21866J15692k8077m9672m2281K36421
$$ plain form
14882 -265649 -142016 -38928 22919 64112 -81077 63292 166432 150651 41316 -139125
14872 -139125 -262420 -233784 -222332 -65795 33177 -216789 -324707 -122584 -58966 -121008
14862 -121008 -91847 -134020 -109609 -110844 -57680 -70592 -105279 -125880 -48830 56641 -87900
14851 -87900 -298106 -368641 -291591 -201147 -35698 -191643 -259165 -346632 -301924 -199428 -159893
14840 -159893 -201251 -20532 131058 10638 46823 63844 145206 31141 -63795 -156765 -139179
14829 -139179 4088 199837 14862 45140 105322 192473 265279 118814 -48664 41954
14819 41954 11213 95894 198772 -97845 -163109 56760 315015 209238 121129 78487 -78834
14808 -78834 -120140 -44635 -28884 -284782 -291424 -69558 46134 18057 -31615 -73896 162525
14797A62525M3343L10380j4905k64720k00167K3045R8349K9322j0498J65134K2658
14786C64466j78780j23574m6457n142O4548Q6579j679j04020K1182N1301J21698
14775B50122j21404p6986l7622q8359K10501m4397k68387j83926K28686K14992
14765H3220Q6013o467p6070o0862j02268M5091N7780p237N7140k73485k44677
14754d41822J37532K13117J45634k09291k12250M5724J78223J4680L6436J76332
14744H4315L7648r7934j268L1153M4689q870j4415r7428K0200N3549J3163m2902
14732B1900l7754r241L0897L7472Q562J08388j95370j01038r8751j2542K5530
14721b21947J05753K03576j4898j36876j10626J83314o4600K1941K7019J5941
$$ plain form
14797 162525 205868 516248 501343 236623 36456 59501 157850 187172 176674 341808 364466
14786 364466 185686 62112 15655 10513 75061 161640 159961 55941 77123 128424 250122
14775 250122 128718 51732 14110 -74249 136252 91855 -176532 -360458 -131772 83220
14765 83220 169233 162766 86696 25834 -76434 -31343 26437 19200 76340 -197145 -441822
14754 -441822 -304290 -91173 54461 -154830 -367080 -321356 -143133 -128453 -92017 84315
14744 84315 121963 24029 22761 53914 98603 89733 75318 -22110 -1910 51639 64802 21900
14732 21900 -15854 -25095 5802 43274 51836 160224 -35146 -136184 -234935 -247477 -221947
14721 -221947 -116194 87382 72484 -64392 -175018 8296 -56304 -34363 -7344 8597
14711H597j04510j46087r3256l456Q6368J91624P3825M3251j6486q5023j37328
14700a82481J7129n5112J99951J45361M1442j28271j63615j1292m4727R946k1114
14689a92783J37722m9982J22648P5741j9763K2039J9032L5953J5176P0054m7885
14678A87952k16526j54535O9625K03044j50055l6687n2252N6702P4010P7366j57635
14667i8991J17067q2606j43112K05558J10229k50813p4750o8152O3502r5734J3526
14656c04276L83502K88401k38794q9327K28632q0351p8196j62876j11977k89984
14646d55246j82669P5698L48735J73925L5656K7028J15091J04520q7918R4711
14636B49531n9871j0909j84236L7453j01663j19851N6054l4547L24008O6157k02002
$$ plain form
14711 8597 -95913 -242000 -335256 -338712 -252344 -60720 13105 56356 39870 -45153 -182481
14700 -182481 -165352 -220464 -20513 124848 166290 38019 -125596 -136888 -181615 -171669 -192783
14689 -192783 -55061 -105043 17605 93346 73583 95622 114654 150607 165783 235837 187952
14678 187952 -28574 -183109 -113484 89560 -60495 -97182 -149434 -92732 -18722 58644 -98991
14667 -98991 18076 -64530 -207642 -2084 108145 -142668 -217418 -285570 -222068 -317802 -304276
14656 -304276 79226 367627 128833 39506 268138 187787 109591 -53285 -165262 -455246
14646 -455246 -637915 -562217 -213482 -39557 -3901 23127 138218 242738 154820 249531
14636 249531 189660 178751 -5485 31968 -69695 -189546 -133492 -168039 155969 222126 20124
14625B0124J20049k1354M5868J51572l9687R2655p3665j12082J6843J23076j01505
14614B21894K6810L5671R1237l7142m1625k93763r053k8624m7502j01872r6360
14603b80329l3544K09598l0462k12933q7533J92919L42964j7365r1993j65947
14593a74625J07175N131o489M1662J9481j629Q5740o5580j67050j93709j84965
14582e34858Q6489M85528J10701o3249k7282m1431o3060L6178J01183o639l5462
14571D8098l0051j8400K9596k07199q6187M9920K39022p2284l3115r9445O3161
14560a16884J13503j6558j03425J1747J91798o5761l7945P7121J65146j24750
14550I3992j7505l2565Q8013r3469j41974j09153j42728m0866L30488K16525j89364
$$ plain form
14625 20124 140173 118819 164687 316259 276572 369227 295562 183480 200323 323399 221894
14614 221894 248704 284375 375612 338470 296845 3082 -5971 -34595 -82097 -183969 -280329
14603 -280329 -313873 -104275 -134737 -347670 -435203 -242284 100680 83315 -8678 -174625
14593 -174625 -67450 -62319 -68808 -27146 -7665 -9294 76446 10866 -156184 -349893 -534858
14582 -534858 -448369 37159 147860 84611 57329 15898 -47162 -10984 90199 83560 48098
14571 48098 18047 -353 29243 -177956 -264143 -214223 24799 -47485 -80600 -180045 -116884
14560 -116884 -3381 -19939 -123364 -111617 80181 14420 -23525 53596 218742 93992
14550 93992 76487 43922 131935 38466 -103508 -212661 -355389 -396255 -65767 150758 -38606
14539c8606k34844K1995j52567P6315K91102O1241j21679p629J11801k7699j4269
14528c4839P5530k574p3385j48522J05124n44J46630j23221q9282k2204j48816
14517c16103L3592K1432N2473J60570N8370p7577R1374Q5809J8122r0477P2993
14506A10578J07039q853m4553J0562j05444l24270k84059L3191K60039J94886
14496e0884r6801L1185J02258J33442J28966K13360m3213k54351q5749K7297P1828
14485A77338J70437P7295j76459j04274L3865J30357j02949j13750j49712k10116
14475b67968J09531L10777J29486N0186K774O9268J27426k83360j03800M8094
14465A92414o8541j9064q3677R7507M4142n2240j37246m2890J01901o930P6773
$$ plain form
14539 -38606 -273450 -251455 -404022 -327707 -36605 24636 -97043 -104672 7129 -20570 -34839
14528 -34839 40691 38117 -35268 -183790 -78666 -79210 67420 -55801 -145083 -167287 -316103
14517 -316103 -282511 -261079 -208606 -48036 10334 -67243 24131 109940 128062 37585 110578
14506 110578 217617 208764 164211 174773 69329 -254941 -539000 -505809 -245770 -50884
14496 -50884 -147685 -116500 -14242 119200 248166 461526 418313 163962 78213 105510 177338
14485 177338 347775 425070 248611 144337 178202 308559 205610 91860 -57852 -267968
14475 -267968 -158437 152340 281826 332012 334786 404054 531480 248120 144320 192414
14465 192414 123873 104809 21132 118639 162781 110541 -26705 -69595 32306 25376 102149
14454A02149l6322p0068P0673j22542j9583L06327O2857k5456j48886j30541R4944
14443H3552j31745N2142J04749j78935r0630J92326J35267k2782k62787l3647
14433a52490o1145P1265o4210J88962R8401l4682p0087J43897K4624j63046k66494
14422b85005n0788J37078P9251J53409P1993k7104R485j45331j78930J25092P2782
14411c8068m5603J73896P2894k13413q0461L5290J4357m6898L0216m4088M3937
14400i7941l1644j897n0237P2626J00691N9514j39156K213j92957j35172Q3173
14389c30787P6427J81514M1777k05243r900J08028J29940N9943J69931R5290k41115
14378G5805j49347n6428R6964R1812R4055j4247J8697k45999l2209O94k46515
$$ plain form
14454 102149 65827 -4241 66432 -56110 -75693 230634 293491 268035 119149 -11392 83552
14443 83552 -48193 3949 108698 -70237 -160867 31459 166726 143944 -118843 -152490
14433 -152490 -213635 -142370 -206580 -17618 80783 46101 -23986 119911 144535 -18511 -285005
14422 -285005 -335793 -198715 -119464 33945 105938 78834 88319 -57012 -235942 -110850 -38068
14411 -38068 -83671 90225 163119 -50294 -130755 -95465 -81108 -128006 -97790 -141878 -97941
14400 -97941 -129585 -131482 -181719 -109093 -8402 51112 -88044 -85831 -278788 -413960 -330787
14389 -330787 -254360 -72846 -31069 -236312 -246212 -138184 -8244 51699 221630 316920 75805
14378 75805 -73542 -129970 -33006 58806 152861 138614 157311 -88688 -120897 -120203 -366718
14367c66718j54790N9124L7367K0368L6316J41496j4336J08996J3292j65357j52698
14356d36940J61109R3840j405Q4554K64152L2941k3353k5571l3234j73977k08812
14345b66696O8550k2773J58300m8770R0026M5869j44006j4275K05640K12561j53446
14334A30980j75015J12710J8234n1063N8884j7174j38946n418K1038j03907K0310
14323a29367R3512J41455J8062j63400j66088N3622O3654m833N5607J04340q0268
14312a3704q4792o1446m1404R7423l9379O1849J07838J93142J75206J37916j22073
14301D10576m45069j38146R120P8892J55456r9212p3536K14087K19705p8396k80642
14290b7165m5224K18566J02845J90837j40259k51329k6264J19810J44015l7459
$$ plain form
14367 -366718 -521508 -462384 -425017 -404649 -368333 -226837 -241173 -132177 -118885 -284242 -436940
14356 -436940 -275831 -181991 -183396 -98842 165310 198251 174898 149327 116093 -57884 -266696
14345 -266696 -198146 -220919 -62619 -111389 -21363 24506 -119500 -133775 71865 284426 130980
14334 130980 -44035 68675 86909 35846 94730 77556 -61390 -66808 -45770 -149677 -129367
14323 -129367 -35855 105600 123662 -39738 -205826 -152204 -88550 -93383 -37776 66564 -13704
14312 -13704 -98496 -159942 -201346 -103923 -143302 -81453 26385 219527 394733 532649 410576
14301 410576 -34493 -172639 -163519 -84627 70829 -28383 -101919 112168 331873 253477 -27165
14290 -27165 -72389 146177 249022 439859 299600 48271 22007 141817 285832 248373
14280B48373j28669r9040K66275m5652p5082o9328m234J08899m6971q1827K7303
14269A00047J04540j76106n8640N923N284J6776K5627J59836J48385j37026j93971
14258F75m1349M8859o183p1122J6949J47771l917j83888j00241m9506N6916J60228
14246b4808K14330O0722j22357k16286l6664K08442J57184j20920n5662o1957
14236B024o914P768j72816P0501J93494K2921J04438K593Q5031l8181j53014l1440
14224H6405o8754k8651K36357O2197N2468m9735j50028j72419l3371J52415m8688
14213C8196R704k7558P0519O4106M2308j13416j17664N8989m313r8287n7504j4190
14201a49110M2177p4612j18370J9268K3930o900q9232L7999j32920L5556J98263
$$ plain form
14280 248373 119704 20664 286939 241287 166205 96877 92643 201542 154571 72744 100047
14269 100047 204587 28481 -30159 -24236 -18952 -2176 23451 183287 331672 194646 675
14258 675 -40674 8185 2002 -69120 -52171 95600 91683 -92205 -192446 -241952 -185036 -24808
14246 -24808 189522 250244 127887 -88399 -125063 83379 240563 119643 63981 2024
14236 2024 -4890 2878 -169938 -99437 94057 116978 221416 224009 309040 270859 117845 86405
14224 86405 17651 -11000 225357 287554 340022 290287 140259 -32160 -65531 86884 38196
14213 38196 47900 20342 90861 154967 197275 83859 -33805 25184 20871 -77416 -134920 -149110
14201 -149110 -106933 -181545 -299915 -280647 -256717 -263617 -352849 -314850 -447770 -412214 -213951
14190b13951J92559K492l85783k87265K75214Q7475L5894R7131K62640J73799
14180B40205l09047j32223L4360r4784J42107J2875J10103n908j18694J44776
14170B3770Q6846m7467k6740K09519q9529k44651P4862R1886Q4497j05750Q8420
14159A45663K49491R0564p6108L3514P5098j0149l22945k50014j1929J12353n1701
14148a6163l9654r1234J16996m3718m2223j20193l6586j17415R719j2562P4658
14137c18375K28845l2562k1264R606k12174k6631K09900n4507j21403J94400J94270
14126E0105k755j50180o5599L5954J85584J49046M3753m47889m9854j4625M6238
14115b20222l176J81350K26844P8176N008J0465j66632o2672j28781J54065J0156
$$ plain form
14190 -213951 -21392 -18900 -404683 -691948 -416734 -329259 -293365 -196234 66406 240205
14180 240205 -68842 -201065 -166705 -261489 -119382 -106507 3596 -2312 -121006 23770
14170 23770 110616 63149 36409 245928 156399 -88252 -13390 78496 162993 57243 145663
14159 145663 395154 485718 409610 443124 518222 508073 185128 -64886 -76815 35538 -16163
14148 -16163 -55817 -147051 -30055 -73773 -115996 -236189 -272775 -390190 -380471 -393033 -318375
14137 -318375 -89530 -122092 -143356 -133750 -345924 -372555 -162655 -217162 -338565 -144165 50105
14126 50105 47350 -102830 -168429 -132475 53109 202155 245908 -201981 -251835 -266460 -220222
14115 -220222 -223398 -42048 184796 262972 267980 278445 111813 49141 -79640 74425 84581
14104H4581k6257k41197R476K65421j37011J3346L2214O3298j81657j11141J16831
14093a12096J43742J08864m7098K3661n111j51789M591R394J09599J4729j66753
14082f8267j1598L4006n1787j47074j63920m7259J51752R3563j426o5020J08498
14071a68532m0375l2035p3388J66794J78669J11462J98914n7363j21506R577K8643
14060B00860r5602k0200j39983J22725J59134M1376j15443m7577L6579k9423L177
14049A15623J06313p9180p8827m6764j43764j9644j14009n0241k7194l7972J94192
14038a81467K5158j68264J05634J02459l5532P4544J69009R8504J44599j2825
14028C21819m4578j30452j37988N1431q1481p8456J19072M083P7965n1839q2660
$$ plain form
14104 84581 58324 -182873 -173397 92024 -44987 -31641 573 63871 -117786 -228927 -112096
14093 -112096 31646 140510 93412 117073 111962 -39827 -35236 -25842 83757 98486 -68267
14082 -68267 -79865 -45859 -97646 -244720 -408640 -455899 -304147 -210584 -212010 -277030 -168532
14071 -168532 -208907 -240942 -314330 -147536 31133 142595 341509 284146 162640 172217 200860
14060 200860 105258 85058 -54925 67800 226934 268310 152867 105290 141869 112446 115623
14049 115623 221936 142756 63929 17165 -126599 -146243 -260252 -310493 -337687 -375659 -181467
14038 -181467 -156309 -324573 -218939 -116480 -152012 -77468 91541 190045 334644 321819
14028 321819 277241 146789 8801 60232 -21249 -99705 19367 23450 101415 49576 -33084
14017c3084Q6953K0210J29077k00514k10579Q863J55895p7563n2859j62385M4232
14006b91754n5800K55043M8628k41919k1467J37267o334l9449K3064J0661M5652
13995a36408j03317Q0244J37344M164j32500k01890p2007p0306N4968J09785J97324
13984a32599K60504o2722n3362j52645m9430J1147j13303J2001L26859J99159
13974B45609p2685k8642J28612q4685j00226J11570K78150j68367o8321p8652
13964A62363q5838n9072j37398O7055j75274k7898R7662J04307P6228l83451j17394
13953d78710J99692m4741m1140L7694J19482J30395q345m3419M3226J88782Q5328
13942A88244o1455k08297P9580k5015J597L3277J41196j15351l4106k4786m5790
$$ plain form
14017 -33084 53869 74079 203156 2642 -207937 -199074 -43179 -120742 -173601 -335986 -291754
14006 -291754 -347554 -92511 -43883 -285802 -307269 -170002 -176336 -215785 -192721 -182060 -136408
13995 -136408 -239725 -159481 -22137 -17973 -150473 -352363 -424370 -494676 -439708 -329923 -132599
13984 -132599 127905 65183 11821 -140824 -190254 -179107 -292410 -280409 46450 245609
13974 245609 172924 144282 272894 188209 87983 199553 477703 309336 241015 162363
13964 162363 76525 17453 -119945 -52890 -228164 -256062 -158400 -54093 22135 -361316 -478710
13953 -478710 -279018 -323759 -364899 -327205 -207723 -77328 -85673 -129092 -85866 102916 188244
13942 188244 126789 -81508 -1928 -26943 -25346 7931 149127 33776 -330 -25116 -70906
13931g0906J02655j75901j19268K7270J29639J86594K845m5604K17967K19465
13921D74756o6683k53510l62406j21792P8556P4625K3668J02530k8488j12164
13911a90908R2286j47681p7107l6190M5749L2134N2581J39629J09063J12932k30593
13900i8105r3694p1719j66758J90298N120K16933m6813j25863J35978P7164L376
13889B5917p9631J64335K05361j90781j38049r0733N8531n321J367R1522j23391
13878h0873L6329q7413n4716k0546J14172q0164L6164P6195R3286O1415M3635
13867A37484M9879j30137m0745O0805q23j04595J20538j80786p6014q9541p4568
13856c28503K11551L26361Q2622p4178j35397r2004j74163R7795N9737M4061m466
$$ plain form
13931 -70906 31749 -144152 -263420 -236150 -106511 80083 82928 37324 255291 474756
13921 474756 408073 154563 -207843 -329635 -251079 -176454 -152786 -50256 -78744 -190908
13911 -190908 -98622 -246303 -323410 -359600 -313851 -281717 -229136 -89507 19556 132488 -98105
13900 -98105 -191799 -263518 -430276 -239978 -234858 -17925 -64738 -190601 -54623 22541 25917
13889 25917 -53714 110621 315982 125201 -12848 -103581 -45050 -50371 -49004 42518 -80873
13878 -80873 -44544 -131957 -186673 -207219 -93047 -173211 -137047 -60852 32434 93849 137484
13867 137484 187363 57226 16481 77286 76463 -28132 92406 -88380 -164394 -253935 -328503
13856 -328503 -116952 209409 292031 217853 82456 -9548 -183711 -85916 -26179 17882 13416
13845A3416K09178P0342j82916M2479L2285l03525k30894n2359K83292J42452
13835B3750r1701J5529L3570K54130J17654p7845k36344p5845m2376k21250M0738
13824b59990P7638J19809q8233j21407P2668n5723M2214J22322j87292j88183
13814d66177J3243J37354m3704O3915J98680j40534j65142o0466K5767N1339J62700
13803b23025K25784k1860p6739J28585K2688n4471r1058k5688q2614m6763k67519
13792e12680l5739J86009O0326K8376P1419l77797N7127O1315L586J95741r6749
13781c59066k7716M5082J34042O2428Q9173m9246o796R3259K3218J53871j70676
13770a2427j33731J29620K3731j48022O4114J47821K61278l2051p7493p4530j10667
$$ plain form
13845 13416 222594 292936 110020 152499 184784 -118741 -349635 -401994 -118702 23750
13835 23750 -67951 -52422 -18852 235278 352932 275087 38743 -37102 -79478 -300728 -259990
13824 -259990 -182352 -62543 -150776 -272183 -199515 -255238 -213024 -90702 -277994 -466177
13814 -466177 -452934 -315580 -359284 -295369 -96689 -237223 -402365 -462831 -437064 -385725 -223025
13803 -223025 2759 -19101 -95840 32745 55433 962 -90096 -115784 -198398 -245161 -512680
13792 -512680 -548419 -362410 -302084 -273708 -202289 -580086 -522959 -461644 -458058 -262317 -359066
13781 -359066 -386782 -341700 -207658 -145230 -56057 -105303 -112099 -18840 4378 158249 -12427
13770 -12427 -146158 -16538 7193 -140829 -76715 71106 332384 300333 222840 148310 37643
13759C7643L9040J2039o4849j74749k78407R7189P5781o1497J06665J42504K30376
13748A61735o9637Q0514j52607r9761n1454L1058J90731m32k49490j87871O7857
13737b79357J17463J05466Q1743O231K391j15563j49617r254J82231o0334M0568
13726g8032o6153K452O3121j6701r3597K97761K69471o1045n7897J2641k3978
13715B48043k49909J88657K70195m9661j42574N5779n0027j40653M3239l3646
13705A39443l8332J80898j61795j41200j59964o2277j42044J84256J34363Q124
13695e8528j06151O021J15713J27524l8071l36844O5455J68906k2309l20j10599
13684a89203o9676N3378J04675J12955n4260K4466l1239o7458J75058j54551r6570
$$ plain form
13759 37643 76683 88722 23873 -150876 -429283 -332094 -256313 -317810 -211145 -68641 161735
13748 161735 92098 172612 20005 -79756 -131210 -100152 90579 90147 -159343 -347214 -279357
13737 -279357 -161894 -56428 25315 31546 33937 -81626 -231243 -240497 -58266 -118600 -78032
13726 -78032 -144185 -141733 -78612 -95313 -188910 108851 378322 317277 259380 272021 248043
13715 248043 -1866 186791 456986 407325 264751 320530 270503 129850 173089 139443
13705 139443 101111 282009 120214 -20986 -180950 -243227 -385271 -201015 -66652 -58528
13695 -58528 -164679 -158658 -42945 84579 46508 -290336 -224881 -55975 -78284 -78604 -189203
13684 -189203 -258879 -205501 -100826 12129 -42131 -17665 -48904 -116362 58696 -95855 -192425
13673a92425K2340J2052j5512M3142R7137k3658o3227q2860q573Q7792J89207
13662F5415O2513l00497j70113j1804K69209R0817l03944k01550J71955J81012
13652a46987K26553K6636j06117j53774L5527j47777N5810K2203j48579R8916
13642b37589J16734j11368n6151J36736n0560J41518m6697q8491O7502K50303
13632A21937r9439j1218r0219j18492J83796j9800o9181J7700K22825J70904j43019
13621A65794Q1746k04021m9101O7965j74708J27437k3341j43150k59551L5904
13611c75026R8086J98298J39295K4873K9827r5118N9118M562K1846N9356J32821
13600B97938J6737j76348m5436N9736k78095k22838J12961J10034O1893O5147
$$ plain form
13673 -192425 -170085 -158033 -173545 -130403 -33266 -56924 -120151 -203011 -211584 -123792 65415
13662 65415 127928 -172569 -342682 -354486 -85277 5540 -298404 -499954 -327999 -146987
13652 -146987 79566 106202 85 -153689 -118162 -265939 -210129 -187926 -336505 -237589
13642 -237589 -120855 -232223 -288374 -151638 -202198 -60680 -107377 -195868 -128366 121937
13632 121937 22498 11280 -78939 -197431 -13635 -33435 -102616 -84916 137909 308813 165794
13621 165794 247540 43519 -5582 62383 -112325 15112 -8229 -151379 -410930 -375026
13611 -375026 -276940 -78642 60653 85526 115353 20235 79353 83915 105761 165117 297938
13600 297938 314675 138327 92891 152627 -125468 -348306 -235345 -125311 -63418 1729
13590A729m8298L0829J13282M5400K8181r4204O6388k4639j75263o8242j34990
13579b59827q1167K01519J27406K5482R732j15748K642j83004r8419J16712K9176
13568b25496j64560J39435J76466K0855j06323N6912j2766J0918M3552K50821
13558A89814m1291J01740J38039n7873k29183p1456j81108j10106O0305n2379
13548b53498j11968J49025K5026R9642J89319m8557j23359j74652p8776J73712
13538a54086m3074j30477J46512R6767Q6950j88554J04714K746N8226J39938N7809
13527A77471q1355q3454J23993P3147N878O0263j18358j65511l0115r8661j62545
13516b99247M3270Q5028J33876O9819J01909Q2547k09573L6356J50098j18838
$$ plain form
13590 1729 -46569 -15740 97542 142942 171123 76919 143307 118668 -56595 -124837 -259827
13579 -259827 -340994 -139475 -12069 13413 23145 -92603 -89961 -272965 -371384 -254672 -225496
13568 -225496 -390056 -250621 -74155 -53300 -159623 -102711 -115477 -104559 -61007 189814
13558 189814 148523 250263 388302 330429 101246 29790 -151318 -261424 -201119 -253498
13548 -253498 -365466 -216441 -191415 -91773 97546 48989 -74370 -249022 -327798 -154086
13538 -154086 -197160 -327637 -181125 -84358 2592 -185962 -81248 -78502 -20276 119662 177471
13527 177471 96116 12662 136655 209802 215680 275943 157585 -7926 -38041 -136702 -299247
13516 -299247 -255977 -170949 -37073 32746 134655 217202 7629 43985 194083 75245
13506G5245j57997q6381j51667O6453J03436J68401P1730j95210j79125K49185
13496c5930Q3059r3284J83635q7831j583k61584P6388m1197r0463J68815O7559
13485c2416o7856j43934j64571P3711J07844J82030J61765J50311l6701O1520
13475B91703J3624l43410j19993P5501N1502J96241N7221n4961k35333k55096
13465c23001K4776K6823J2216r0484J3980J54329J34545K3705n6488Q4310q5000
13454h0289j17722L1808M6256N3886K39241J34562j52167k61121P546K01291M0618
13443A43909q7326M8330M9197O0754q0919n8476J98392q1106k33226r104L1754
13432a7821m1201p0052j12012Q308N7760Q7338P8323R5584K3439J76682J8605
$$ plain form
13506 75245 -82752 -169133 -320800 -254347 -150911 17490 89220 -105990 -285115 -35930
13496 -35930 47129 -46155 137480 49649 48066 -213518 -137130 -178327 -268790 -99975 -32416
13485 -32416 -100272 -244206 -408777 -335066 -227222 -45192 116573 266884 230183 291703
13475 291703 305327 -38083 -158076 -82575 -31073 165168 222389 167428 -67905 -323001
13465 -323001 -298225 -271402 -259186 -349670 -335690 -181361 -46816 -23111 -79599 4711 -80289
13454 -80289 -198011 -166203 -119947 -66061 173180 307742 155575 -105546 -98000 103291 143909
13443 143909 56583 104913 154110 214864 133945 75469 273861 192755 -40471 -49575 -17821
13432 -17821 -59022 -129074 -241086 -232778 -175018 -87680 -9357 86227 109666 286348 304953
13421C04953J5152k17904j06671K05750o4047j92444k3189J29921J19583l04707
13411a33603q160k0945j84055L9655M8515l3286J26907J30449j3808l81326k95874
13400g25531j1747R2549J73819J16818J69231J05652k7768o2956m5440M2057J49205
13389b4111l937K896K03797p647j23864r3718o0251J310k8981P1099J00004m1184
13377d587q1628m8737J85937j77791l4037K7216N7628K3223J05185O0618r9123
13366A3904k07175l7785J74573O1723j3746q9669p9077j3288J00906R2305J0260
13355A2931m9213j29562L8551Q4419j19990n6967j99666l2235K42097K848L0224
13344a76563k6174M0141L9918K7339p0565L7249q345j58982k03612K05783J33375
$$ plain form
13421 304953 320105 102201 -4470 201280 137233 -55211 -78400 51521 171104 -133603
13411 -133603 -141763 -162708 -346763 -307108 -258593 -291879 -164972 -34523 -48331 -429657 -725531
13400 -725531 -737278 -644729 -470910 -354092 -184861 -79209 -106977 -169933 -215373 -173316 -24111
13389 -24111 -28048 -25152 178645 170998 47134 -46584 -106835 -105525 -134506 -63407 36597 -4587
13377 -4587 -86215 -134952 50985 -126806 -160843 -133627 -75999 -52776 52409 113027 13904
13366 13904 -193271 -231056 -56483 5240 -8506 -98175 -177252 -190540 -89634 2671 12931
13355 12931 -36282 -165844 -127293 -42874 -162864 -219831 -419497 -451732 -209635 -206787 -176563
13344 -176563 -202737 -162596 -122678 -95339 -165904 -128655 -137000 -295982 -499594 -293811 -160436
13333a60436l8659J02619N9126k8059o9604k25369q719P1622J68505K09113J82240
13322B62379R5235P382j73905j96430k05270m1116j12379R4819n8034J14092j68006
13311c81233J63235J3003j2536p2765L8713o5187M7635q0730j01562J61031J76984
13300a13412L47m9558K09356O1301J8253O4558j78962j17853J91194M5233j05509
13289B4948L471r4996l3224k9526k00584K5422j7063j35194M8721L6442K7744
13278c43839K53457K78648j5864j64452p4907r2627j71816o3416M8009J85671
13268a61136Q9787q6972j04039l814k1937J19606K17210K25137r0943j2829K7202
13257A97272k6599j14737j87150N9209J36901j28642P7923j31902j76767M5721
$$ plain form
13333 -160436 -199095 -96476 -37350 -65409 -135013 -360382 -369101 -297479 -128974 80139 262379
13322 262379 357614 364996 191091 -5339 -210609 -251725 -364104 -269285 -327319 -213227 -381233
13311 -381233 -217998 -204995 -217531 -290296 -251583 -316770 -269135 -349865 -451427 -290396 -113412
13300 -113412 -113065 -162623 46733 108034 126287 190845 11883 -105970 85224 130457 24948
13289 24948 28419 -66577 -99801 -129327 -329911 -304489 -321552 -456746 -408025 -371583 -343839
13278 -343839 -90382 188266 172402 7950 -66957 -159584 -331400 -394816 -346807 -161136
13268 -161136 -71349 -158321 -262360 -266174 -288111 -168505 48705 273842 182899 170070 197272
13257 197272 170673 55936 -131214 -72005 64896 -63746 14177 -117725 -294492 -248771
13247b48771J33638J37531K3345j38096N779N9921K07142l8565j52176j75288
13237a85540j20466J05115R280l5426J57326O0870j5436K3653M9554O3902j08587
13226D245m7586O3504J93996J80054k914k7087j22261j45741j11431N6729J43900
13215A85408Q0585R7338p8573j99446j29571J12653K12403R2153q1704o6246j62826
13204F2174K2191J13805J7746j74094j89475k4185o1057K0756k2035n0147J41143
13193a43178J93339r0345j67358n0351R7126j04061q1185J18009O2559J05526
13183e9919J64305j28404j98267n4931L9140J72670K14778J77541q3718k59002
13173a5807p1324j6537N1283o8727O2302n0652o7646K30191m2798k90250j09889
$$ plain form
13247 -248771 -115133 22398 45743 -92353 -86574 -26653 180489 141924 -10252 -185540
13237 -185540 -306006 -200891 -191611 -227037 -69711 -8841 -24277 -624 48930 112832 4245
13226 4245 -43341 20163 214159 394213 391299 364212 241951 96210 -15221 41508 185408
13215 185408 265993 363331 284758 85312 -44259 68394 280797 372950 291246 225000 62174
13204 62174 84365 198170 215916 41822 -147653 -171838 -232895 -212139 -234174 -284321 -143178
13193 -143178 50161 -40184 -207542 -257893 -160767 -264828 -346013 -228004 -165445 -59919
13183 -59919 104386 -24018 -222285 -277216 -238076 -65406 149372 326913 243195 -15807
13173 -15807 -87131 -103668 -52385 -121112 -58810 -109462 -177108 53083 10285 -279965 -389854
13162c89854R0976K21204K21121r6660J3230j35798m1454K34471P7344j85261
13152I319j79554q732K34027N7226O3486j12480J16855m5706m6724j52124J05161
13141D0754j06086q2103K01479p1461R3339k2320J06324n8850k32771k40289L7261
13130c34723J67356j03303j27987O9965R3848k3931Q0144J07282K6993J76986
13120A32630J09922j00712L245K07150Q4240p4054j24049J01928q4270k91338
13110c5308m04415J19604J60856j9666J03351N6275r0305J05129l5190p7643M0552
13099g6760J34236o4797k07522O00K36349m6961j55058J13747M8733j13158o5580
13088a96171R5741J2617j04669J63967J70872J14893m1276o7267r5891J44709
$$ plain form
13162 -389854 -298878 -77674 143447 46787 60017 -75781 -117235 117236 194580 9319
13152 9319 -170235 -178967 55060 112286 175772 63292 180147 134441 87717 -64407 40754
13141 40754 -65332 -147435 54044 -17417 75922 53602 159926 101076 -131695 -371984 -334723
13130 -334723 -167367 -270670 -398657 -328692 -234844 -258775 -178631 -71349 -44356 132630
13120 132630 242552 141840 145085 352235 436475 362421 238372 340300 256030 -35308
13110 -35308 -439723 -320119 -159263 -178929 -75578 -19303 -109608 -4479 -39669 -117312 -76760
13099 -76760 57476 -7321 -214843 -214243 22106 -24855 -179913 -66166 -17433 -130591 -196171
13088 -196171 -100430 -87813 -192482 -28515 142357 257250 215974 148707 52816 197525
13078A97525M2850o5451k25713r4730r3503J81344L62426N626r365k5678q1847
13067A93484o7161k578j06721n3543J18847m8430j95553q1708j02821K04715K18538
13056G7069L2086R5903k45493k20909j58354J731K01830J41089j0113P958k6753
13045a03956L3031O881J19940k952o3468k5653P5726j7814J9569j28605j7367
13034a04668m2975N8580K38024J36868Q0616J27937O2493j82416k94197j20801
13024d0539L0739J7516j40032O3177J57877R5109P6939k8055j04185N2121P9606
13013B60273j91709k54281k4471J56839K6654q0276j48200p9851Q2899P2825m1323
13002b20621k7966J87625K33032j43078o9124l4033o5595K10707P5903j38524
$$ plain form
13078 197525 240375 174924 -50789 -145519 -239022 -57678 304748 310374 301009 275331 193484
13067 193484 126323 123745 17024 -36519 82328 33898 -161655 -243363 -346184 -141469 77069
13056 77069 109155 205058 -40435 -261344 -419698 -417967 -216137 -75048 -85161 -77203 -103956
13045 -103956 -70925 -64044 55896 52944 -10524 -36177 39549 21735 41304 -87301 -104668
13034 -104668 -147643 -89063 148961 285829 366445 494382 556875 374459 80262 -40539
13024 -40539 -9800 7716 -132316 -69139 88738 183847 260786 232731 128546 180667 260273
13013 260273 68564 -185717 -210188 -53349 -26695 -106971 -255171 -335022 -252123 -179298 -220621
13002 -220621 -248587 -60962 172070 28992 -40132 -74165 -139760 70947 146850 8326
12992H326R7418J14318j83776m8869L1403J75844j19224j57485j26194q5128J58047
12981a35320J74291J00620L0027K543k48342n1644L2040K78841M3309J00446j8004
12970C08807j9404N1184Q6731k31021k77744p7010K07064K40654J7925j7422M8923
12959C38687o7986k55399j89620J01124K84004p9616j73453J16717J84185r0285
12949A68358p1874R6747K4636m8346j60994k15772N4282K4357J12841J82165j15690
12938E0710p9064J17584q3504o4762J34514j38191j0294N6994j6908n7030Q9838
12927a13O9065J8991M5897j22828r1174J80435l2963j55073N4477J14791j3326
12916F8179J7251q9675J6677J52474J5225p1472O0450j02281m2906P8712M1484
$$ plain form
12992 8326 105744 220062 36286 -12583 18820 194664 75440 -82045 -208239 -293367 -135320
12981 -135320 38971 139591 169618 172161 -76181 -127825 -95785 183056 226365 326811 308807
12970 308807 289403 340587 427318 196297 -81447 -158457 48607 289261 307186 289764 338687
12959 338687 270701 15302 -174318 -73194 210810 131194 -42259 74458 258643 168358
12949 168358 96484 193231 217867 169521 8527 -207245 -152963 -128606 -15765 166400 50710
12938 50710 -28354 89230 5726 -59036 75478 -62713 -73007 -16013 -32921 -89951 -113
12927 -113 68952 87943 133840 11012 -80162 100273 67310 -87763 -33286 81505 68179
12916 68179 85430 -4245 12432 164906 180131 108659 169109 66828 23922 102634 144118
12905A44118M7258N1341J55092j71385j72830j8706J32752j51789l212N2273q3646
12894a8734m7051q4325J43344k8821J1934J38413j55171q9826n5562j02114n2417
12883c40330j58839J17285J0715K19799K72010J96605J3862R8981j34937N7480
12873C52631K49031J86610J71527J63722P4122M3530M5884M2400n6775n0388j20653
12862A101641j30871p8510k2213j93286j373n6668K38354L1891k53717j87946
12852D47302J1689r5888J677M8000J18321J00098R1004J12670J19225j06125j93869
12841F54104J9997J31631J54570J60183l3955L27950K68575J46852L15874K7289
12831B173070J80969Q3070j54402k19517l52066j49998j72136L4732l7328j7768
$$ plain form
12905 144118 191376 242717 397809 226424 53594 34888 167640 15851 12639 64912 -18734
12894 -18734 -65785 -150110 -6766 -35587 -23653 114760 -40411 -130237 -185799 -287913 -340330
12883 -340330 -499169 -381884 -371169 -151370 120640 317245 331107 430088 295151 352631
12873 352631 601662 788272 959799 1123521 1197643 1241173 1287057 1329457 1272682 1222294 1101641
12862 1101641 970770 892260 870047 676761 675388 618720 857074 888965 635248 447302
12852 447302 458991 363103 364780 412780 531101 631199 722203 834873 954098 847973 654104
12841 654104 674101 805732 960302 1120485 1086530 1414480 1683055 1829907 2145781 2173070
12831 2173070 2354039 2437109 2282707 2063190 1711124 1561126 1388990 1423722 1386394 1368626
12821A368626m9826p230K7182o8687q9150J727o2483k320n3259R2347o3025o2099
12809A031803n914K57651p583N3572L5829N2661J17287K51963K028j39676k07294
12798A442327p0513k05551k67698j21087n8962l1961m6626p6400j25768o8029
12788C69732R1158o3753j25492k34725r3420P658J7897p3724J4411L3684O4818
12777H244l6313R0085o9157j62841K23487K52375j03477P5157O278l9576J37053
12766C81315l843k1923k28304j26346K8275J10421l2957j75680J21152K03684
12756B55794k16419j05306K00104p8743N3917K22944R7507P8177K7985k04663
12746C31297p1035J91424L6421q7486m2623l7046K1736J8005m8383r0929r9975
$$ plain form
12821 1368626 1318800 1311570 1338752 1270065 1180915 1182642 1120159 1117839 1064580 1156927 1093902 1031803
12809 1031803 1025889 1283540 1275957 1329529 1365358 1418019 1535306 1787269 1789297 1649621 1442327
12798 1442327 1371814 1166263 898565 777478 718516 686555 639929 563529 437761 369732
12788 369732 460890 397137 271645 36920 -56500 -48842 -30945 -104669 -90258 -56574 8244
12777 8244 -28069 62016 -7141 -169982 53505 305880 202403 277560 283838 244262 381315
12766 381315 377472 355549 127245 899 29174 139595 106638 -69042 52110 255794
12756 255794 39375 -65931 134173 55430 109347 332291 429798 507975 535960 331297
12746 331297 260262 451686 488107 400621 357998 320952 342688 360693 312310 221381 121406
12735A21406k58954R3483L3901j95513K8854J55246J78684q8243j2495K69869
12725C26238P2165p504L1748k41696m4023j52465J9739J47940K13220o6249L1833
12714C30946N015j79204J6492J31673J1334J35697J91204r8627R91j03345r521
12703D32655p877j8079j59476j73097K02517J23070o2390R3103m0965k8670l8855
12692C21936m2237J08019P9035o5006j49166J60577Q9267j89174o1047k0228l2707
12681A99269J88050K15627j64645j53655j05298o7635J3703l7962o6743j76868
12671a56157K08656L04543J35362J46967K3918o3433Q4242j3825j91677L4320
12661E12916K50810N9453j22572j42783J9120k8693j19564l2854n3304J94101
$$ plain form
12735 121406 -137548 -44065 -10164 -205677 -176823 -21577 157107 68864 56369 326238
12725 326238 398403 390899 422647 180951 136928 -15537 4202 152142 365362 299113 330946
12714 330946 335961 156757 173249 304922 316256 451953 643157 544530 545521 442176 432655
12703 432655 424778 406699 247223 74126 276643 399713 337323 430426 389461 360791 321936
12692 321936 279699 387718 466753 401747 252581 413158 502425 313251 252204 231976 199269
12681 199269 387319 602946 438301 284646 179348 111713 125416 87454 20711 -156157
12671 -156157 52499 357042 492404 639371 663289 599856 684098 670273 478596 512916
12661 512916 763726 823179 700607 557824 576944 548251 428687 395833 342529 536630
12651E36630l5895j95062N6319J55036J27690O3013k25563l29918k80897O8023
12641f0624J04144O8149j39733K39172p475j53316K7936M0557J71873R1109j79565
12630B02227k1264Q8059J01443J58670n7115j87073J49842M8714n5435j7218J5446
12619D26296q0584M989n403m4875J2895K117L0788j3113m4369K49002K21550j08145
12607F51148k6754M0084q029m1002j81456O1884K9919o4411l7515J23407N6685
12596F03960j89664j22454k7577L9642J4020O5264j18101L1370R4210K1527J04625
12585E16822n3232p5890M439K15988j56048q7274o7692L8248O2917J91268J66035
12574G55581J61531j12898j17397p7885L9910j61976L1691K22351j8299P8759
$$ plain form
12651 536630 500735 305673 361992 517028 644718 707731 482168 152250 -128647 -60624
12641 -60624 43520 111669 -28064 211108 203633 50317 78253 118810 290683 381792 202227
12630 202227 180963 269022 370465 529135 472020 284947 434789 483503 428068 410850 426296
12619 426296 345712 350701 345298 300423 313318 315435 346223 333110 288741 537743 759293 651148
12607 651148 624394 664478 656449 615447 433991 495875 525794 461383 423868 547275 603960
12596 603960 414296 291842 264265 303907 317927 383191 265090 296460 390670 412197 516822
12585 516822 463590 387700 392139 608127 452079 364805 297113 335361 398278 589546 755581
12574 755581 917112 804214 686817 608932 648842 486866 518557 740908 722609 801368
12564H01368J84222R7300K7218j31922p1831q1327j06657k0037J01938O8345J12504
12553I81121j03781P2741j9219J14536J6088r3179j02298o4205j62940J76303
12543H15167O1053K25809J11141j55164O053j8544n7855l3464m2255K14866k4176
12532A102631m5585J39305M1056j58725n23J13843l3575j71252r5672K62708M14789
12521A569000l1694n2102r2530j79495l2220o1599j07703k997J63794K49300M9432
12510A471186k0373M4146j32375P8149R8850R6508J19400j99833k01025j04889
12500A249744J50858K34796J61447M1972j3164J14215L247j70076m8069L7714
12490A762684K2123m8822j00405k27808m7736J91279R1267N3275J9856K12656
$$ plain form
12564 801368 985590 1082890 1110108 978186 906355 825028 718371 698334 800272 868617 981121
12553 981121 877340 950081 930862 1045398 1061486 968307 866009 801804 638864 815167
12543 815167 876220 1102029 1213170 1058006 1064059 1045515 987660 954196 911941 1126807 1102631
12532 1102631 1057046 1196351 1237407 1078682 1078159 1192002 1158427 987175 891503 1154211 1569000
12521 1569000 1537306 1485204 1392674 1213179 1180959 1119360 1011657 1008660 1172454 1421754 1471186
12510 1471186 1450813 1494959 1362584 1440733 1539583 1636091 1755491 1555658 1354633 1249744
12500 1249744 1400602 1635398 1796845 1838817 1825653 1939868 1943115 1773039 1724970 1762684
12490 1762684 1784807 1735985 1635580 1407772 1360036 1551315 1642582 1695857 1715713 1928369
12480A928369L36513L2325j17565K60212K62186p9381J989J76737J94897J93772
12470C190054N8516j2859K18981L72788L99621K24963K86302K16588J16492K39296
12460E310742K81990O89949N90807P76583R27526J009246J436346J510724J977919
12451A4511832K420110K996187L638109M441994O092570Q028445J0744849J4748393
12443F7622489J9389451K3981500K7334555K7984852K6115953K2399314J4741424
12436B29569538K728867j0883650k1349343k5514687k4242202k0220225j5700954
12429A14387344j1611546p927405m065099p96228K179158M936776P370438R456433
12421A13929871J1313759J2073095J1298418R121863O987247N666697N109571
$$ plain form
12480 1928369 2264882 2297207 2179642 2439854 2702040 2622659 2624648 2801385 2996282 3190054
12470 3190054 3248570 3235711 3454692 3827480 4227101 4452064 4738366 4954954 5071446 5310742
12460 5310742 5592732 6282681 6873488 7650071 8577597 9586843 11023189 12533913 14511832
12451 14511832 16931942 19928129 23566238 28008232 34100802 42129247 52874096 67622489
12443 67622489 87011940 110993440 138327995 166312847 192428800 214828114 229569538
12436 229569538 232298405 221414755 200065412 174550725 150308523 130088298 114387344
12429 114387344 102775798 94848393 90783294 89987066 92166224 97103000 104473438 113929871
12421 113929871 125243630 137316725 148615143 157737006 164724253 170390950 175500521
12414A75500521M979512N780614P832369J0785376J4579145J7525162J8168843
12407B55151542J5945946J1357820L694971n835409j4723787j9980499k0499325
12400B25111259j7399697j2309234p366407l174994r8150J791831K037474R4737
12392A88686819l144187n932834p911693q791918r402360j0210902r887888p929976
12384A25475061m399852o42414L127331P828144J3233809J9194976K4638504K7782212
12376B16237771K7571057K3816860J7343129P882417m395057j8966229l0139579
12369B39350369l3997931l1772277k6452034k0890628j6157142j2667485j0213298
12362H7199574q018979o624300n232300m588938l881758l525271l184263k626098
$$ plain form
12414 175500521 180480033 186260647 194093016 204878392 219457537 236982699 255151542
12407 255151542 271097488 282455308 286150279 280314870 265591083 245610584 225111259
12400 225111259 207711562 195402328 188035921 184860927 184762777 186554608 188592082 188686819
12392 188686819 185542632 179609798 171698105 162906187 153503827 143292925 133405037 125475061
12384 125475061 121075209 120432795 123560126 131388270 144622079 163817055 188455559 216237771
12376 216237771 243808828 267625688 284968817 292851234 288456177 269489948 239350369
12369 239350369 205352438 173580161 147128127 126237499 110080357 97412872 87199574
12362 87199574 79180595 72556295 67323995 62735057 58853299 55328028 52143765 49517667
12354D9517667k318470k091642j841956j935981j891432j562221j145767j299209
12346C5430989j290399j272273j161967r71451j007943r07918q59201r47635j010635
12337B6001567p39427p21103o44537n02380o05363n84714n54678p09939m84990
12328B0454436n75201n26880p53415m64426m75977n12786o36551o02232k10209
12319A5696759l30024n78377k29154k19413r2024j09544l03399m72451l60786
12310A3001587m10407o27094m28681j2078j67780k49766l20548m90899l05233
12301I989101j26561l6382J51211j41156j75084j74216l59695k21941p2640l34455
12291H498182m80302j60979j4124n5426k96745M5202R6896R0575N1522q7888J12823
$$ plain form
12354 49517667 47199197 45107555 43265599 41329618 39438186 37875965 36730198 35430989
12346 35430989 34140590 32868317 31706350 30734899 29726956 28819038 27959837 27012202 26001567
12337 26001567 25262140 24541037 23896500 23394120 22788757 22204043 21649365 20939426 20454436
12328 20454436 19879235 19352355 18598940 18134514 17658537 17145751 16509200 15906968 15696759
12319 15696759 15366735 14788358 14559204 14339791 14247767 14138223 13834824 13362373 13001587
12310 13001587 12591180 11964086 11535405 11523327 11355547 11105781 10785233 10294334 9989101
12301 9989101 9862540 9826158 9977369 9836213 9661129 9486913 9127218 8905277 8832637 8498182
12291 8498182 8017880 7856901 7842777 7787351 7490606 7535808 7632704 7723279 7774801 7686913 7799736
12280G799736P21j34338l35124l33443q1038r8577k18922k25433l89158j97102
12270E787322k38679r4313j58611k10586J77687n2701j17286r1229R7615J25850
12260E225069M7190K0977l4263q4674k72111N7968L31416Q2492K47255J31367
12250E752686Q5673N4783r8311J038O0550l25644n44604k98556l82040k83007
12240D022568p0054j23172j45335R3138R8426j0594j25771j57397j44793j27653
12230C309363j53933J06905j51108q1243m13484p8573m632q4874l8777J22424
12220B532068K25375K22131J02607R3702o574K23242J4752m4704j74758k22257
12210B965584l10008l08007k38815M9238j06350j52334j55568j22924j24478K3116
$$ plain form
12280 7799736 7800457 7666119 7330995 6997552 6916514 6817937 6599015 6373582 5984424 5787322
12270 5787322 5548643 5454330 5295719 5085133 5262820 5210119 5092833 5001604 5099219 5225069
12260 5225069 5272259 5293236 5258973 5174299 4902188 4960156 5291572 5374064 5621319 5752686
12250 5752686 5838359 5893142 5794831 5795869 5856419 5530775 4986171 4687615 4305575 4022568
12240 4022568 3952514 3829342 3684007 3777145 3875571 3864977 3739206 3581809 3437016 3309363
12230 3309363 3155430 3262335 3111227 3029984 2616500 2537927 2533295 2448421 2409644 2532068
12220 2532068 2757443 2979574 3082181 3175883 3169309 3392551 3407303 3362599 3187841 2965584
12210 2965584 2655576 2347569 2108754 2157992 2051642 1899308 1743740 1620816 1496338 1519454
12200A519454N0059M2451j04392k75926o9768r4897K7634k966l7251q8868J59607
12189A125137o0572k21485j40222r5820P0214J27994K51853J7160o433j49115
12179I18711J06117j23501l9033O1533O525K8249J97768j55886L483J71829k09813
12168I65982k05308P7651P3910n035Q8041P73J22447J3520k20959j62740j20486
12157F27796J03898K35314J34637j00731l45342j90107L28305K1355j78816o1434
12147E74875l8556p7870N2820J50993J04533M6771l7614k22719j3360j13104M3411
12136D70180Q7912P3953O2217J3750L7835j25266o4621n0836M455J61346O1294
12125G32219Q0593k19316k74992J33877q5685j57969m2896J71289J05553N0367
$$ plain form
12200 1519454 1569513 1611964 1507572 1231646 1161878 1066981 1094615 1091649 1054398 965530 1125137
12189 1125137 1064565 843080 702858 607038 677252 805246 1057099 1074259 1067826 918711
12179 918711 1024828 901327 862294 923827 930352 958601 1156369 1000483 1003966 1175795 965982
12168 965982 760674 838325 912235 907200 995241 996014 1118461 1131981 911022 748282 627796
12157 627796 731694 967008 1101645 1000914 655572 465465 793770 815125 636309 574875
12147 574875 536319 458449 511269 662262 766795 813566 775952 553233 539873 426769 470180
12136 470180 558092 632045 694262 708012 745847 620581 555960 505124 509579 670925 732219
12125 732219 812812 593496 318504 452381 366696 208727 165831 337120 442673 493040
12115D93040l7694k6096p8474K7221j30549j44659J49303R1656m5774k48428P4146
12104A23692L04419P0146m8609Q8678J20122o1279j01875k2350j3344p7968P5897
12093D57529J4626o4557J37815k1262o0980J9912k6946q7043p7565p8562j5464
12082A97503J76395O6107j27574J16056P5598n4305j55843J7290k4773m5052J19947
12071C61349q2535j64509L9675J42930J15155Q164k29510j31103J05030K5527
12061A90173o2873L3050j36159J14924M2780j6055J14862j6994j809J76161J61907
12050E99967k27834K9948Q7068K5985j2421p8153j50596k1511j05907k0145p1495
12039E4906O8754m1267N5230j70478K7352P2803J39800J34522n8497L8886K53253
$$ plain form
12115 493040 455346 429250 350776 377997 247448 102789 252092 343748 297974 49546 123692
12104 123692 428111 498257 449648 538326 658448 597169 495294 472944 459600 381632 457529
12093 457529 472155 407598 545413 524151 463171 483083 456137 369094 291529 212967 197503
12082 197503 373898 440005 312431 428487 504085 449780 293937 311227 286454 241402 361349
12071 361349 278814 114305 153980 296910 412065 420229 190719 59616 164646 190173
12061 190173 127300 160350 24191 139115 181895 165840 280702 263708 261899 438060 599967
12050 599967 372133 402081 489149 515134 502713 424560 273964 252453 146546 126401 54906
12039 54906 123660 82393 137623 -32855 -5503 67300 207100 341622 283125 322011 575264
12028E75264j08846o3914o6492j60358K69386J56590p5444j90817L8542n0231
12018C23680k7878O5450k747L85419J6290j02513m5907N7713Q0695J65811K13534
12007A129547P6968O8886j02704n6314o0502J75645l5741p1720l6103r5726r5616
11996H96620q5225M7196R574k69897L5217L712j98959K1675L64321m6622K3390
11985H01002J35751k8453n5714k21474J99277J92381K5382M2167N2560K5079J31880
11974A299838N705P2806J73510j09458j03031j75967j81394J79680K40126o3087
11964A338728q3694o9146j24998J538l4533n1147j24901l1847J36221P6449j22905
11953I09765j42600J0739L0645Q529P4922k7939R2341q3569l9274R6430L26881
$$ plain form
12028 575264 466418 402504 336012 175654 445040 601630 526186 335369 373911 323680
12018 323680 295802 361252 358505 743924 760214 657701 611794 669507 750202 916013 1129547
12007 1129547 1206515 1275401 1172697 1116383 1055881 1231526 1195785 1124065 1087962 992236 896620
11996 896620 811395 858591 868165 598268 633485 637197 438238 459913 824234 777612 801002
11985 801002 936753 908300 852586 631112 830389 1022770 1048152 1090319 1142879 1167958 1299838
11974 1299838 1305543 1378349 1551859 1442401 1339370 1163403 982009 1161689 1401815 1338728
11964 1338728 1255034 1185888 1060890 1062428 1027895 976748 851847 820000 956221 1032670 909765
11953 909765 767165 777904 808549 817078 892000 864061 956402 872833 833559 929989 1256870
11942A256870J35342l9336J5039J43966J88884Q9774j15092j0600q0990k56481
11932A327376k654m0294k9038j23955j77698j92979k27648R678K05665J18156
11922H66609j4472M073J2235l2003l0155l13645k19799J96238R1403L1236L4248
11911F25968K1830n6555R9008m8248J49344j55837Q609P1103j48578j42781J90578
11900F14441J63961k5109J8198n932o1083R7482K55732L09839K52082J67102L9537
11889A826250j88686j45027k01537k19874j62244L0140J0713l416O6183L6871
11879A049373r4527n2506j70449J73928J15348J89592q8677j62474J21384M60988
11869A541980J09974q1916k07638j79886N6496M0826J6674P8834K2340L8992K07411
$$ plain form
11942 1256870 1392212 1352876 1367915 1511881 1700765 1790539 1675447 1664847 1583857 1327376
11932 1327376 1324722 1284428 1255390 1131435 953737 760758 533110 542788 748453 866609
11922 866609 852137 856210 868445 836442 806287 492642 272843 469081 560484 591720 625968
11911 625968 647798 591243 690251 642003 791347 635510 644119 715222 566644 423863 614441
11900 614441 778402 753293 771491 765559 704476 801958 1057690 1367529 1619611 1786713 1826250
11889 1826250 1637564 1492537 1291000 1071126 908882 939022 949735 946319 1012502 1049373
11879 1049373 954846 902340 731891 905819 1021167 1210759 1122082 959608 1080992 1541980
11869 1541980 1651954 1570038 1362400 1182514 1239010 1279836 1296510 1375344 1397684 1436676 1644087
11858A644087L985P9278q0329j52769n9622p0516O6297m3230k31141j42498N4719
11847A068261N3437p7158o531P475j59055R9802q101N112k94517j55214j18090
11836D15421K9014J62675K17542O0832R3545M9545J18430O1764M3541Q4366K0493
11825A357168j36836q8543n6601j27900k33154o6264J10294j84154k46009q0785
11815B47216P443j23124L3494P7614O402k2386k9632r7679J01962J01346O1655
11804C64311J95176j48957q3708L3829N3224j42850L10332r5508j01396N2083
11794D36536K6796P3996k00077j79242k06754M969J40709K28812J46887N857q9792
11783C88697j43024k19114l0759M4556Q7479j7770K49899O6557O9520o2456j56533
$$ plain form
11858 1644087 1648072 1727350 1647021 1494252 1434630 1364114 1430411 1387181 1156040 1013542 1068261
11847 1068261 1121698 1044540 1038009 1045484 886429 986231 978130 983242 688725 533511 415421
11836 415421 444435 607110 824652 885484 979029 1028574 1147004 1208768 1252309 1336675 1357168
11825 1357168 1220332 1131789 1075188 947288 714134 647870 758164 574010 328001 247216
11815 247216 254659 131535 165029 242643 249045 226659 197027 99348 201310 302656 364311
11804 364311 559487 410530 326822 360651 413875 271025 581357 485849 384453 436536
11794 436536 463332 537328 337251 158009 -48745 -43776 96933 325745 472632 478489 388697
11783 388697 245673 26559 -4200 40356 127835 110065 359964 426521 496041 433585 277052
11772B77052j86247o6856J50067l1859N3959n1516P5226M3287K4934O9220j86672
11761A70595J39900J70760o2585n3406j61672j21141P6496r1755r9435M2346n2798
11750d2695Q2637Q2339j94384J86532L29805O3050j16397r1648p8098K9677P6907
11739C27725J48602j12663p1359l2386l693j46932l4107P9366R0142J34388j15639
11728B63444J32092o5835o3471K00856M8011K2375L1289P3125m2312j13973r0192
11717C95409j09112j49277N247n4352K7168K8846j88759j36229K52805K41342
11707C13088Q8880l181J5685M351N8096R2132p5537k91935q1431n250R9575j86564
11695B7909J20542K04041N0234l7108J92056p6563k00365k36035K18373J16408
$$ plain form
11772 277052 90805 23949 174016 142157 196116 144600 219826 263113 288047 357267 170595
11761 170595 310495 481255 418670 365264 203592 82451 158947 67192 -32243 10103 -42695
11750 -42695 39942 122281 -72103 114429 444234 507284 390887 299239 221141 250818 327725
11739 327725 476327 363664 292305 259919 256226 109294 75187 154553 244695 379083 263444
11728 263444 395536 329701 266230 467086 515097 537472 568761 641886 599574 485601 395409
11717 395409 286297 137020 142267 87915 115083 143929 -44830 -181059 71746 313088
11707 313088 401968 398787 414472 418823 476919 569051 493514 201579 120148 114898 214473 27909
11695 27909 148451 352492 402726 365618 557674 481111 280746 44711 263084 379492
11685C79492q5836N7425l7994M0925l4585n0742P8563P1301m15j16583p3244J05574
11673C33881n784J10689j2841L7110k79282l6828J25248K49406J96031n3820k12723
11662D51087j63890J280m0636J57460K42359O1256j32116j17382K01887O9058
11652G30363m9180P1628l8529p9225k324N8226n6581j2300J36661M8578j53288
11641F54029j00594j7959j42300q452R3114k0406j82468M2831l0665j34131p008
11630A45991J96642N9907k03530j21674K34801R8509j55650k9524J70182m6909
11620C48745m1907J40939K64795o9650k59078j7473j22031Q5142m4226N3112J86957
11609E25325k9165j14287L156J04627J12601j7815k5546M7719L5922P7216l6663
$$ plain form
11685 379492 293656 351081 313087 354012 319427 268685 347248 418549 418134 301551 228307 333881
11673 333881 328097 438786 425945 463055 183773 146945 272193 521599 717630 663810 451087
11662 451087 287197 288477 247841 405301 647660 708916 576800 459418 661305 730363
11652 730363 681183 752811 714282 635057 632733 690959 634378 622078 758739 807317 654029
11641 654029 553435 535476 393176 384724 477838 457432 274964 317795 287130 152999 145991
11630 145991 342633 402540 199010 77336 312137 410646 254996 225472 395654 348745
11620 348745 306838 447777 712572 642922 383844 366371 244340 329482 285256 338368 525325
11609 525325 496160 381873 385029 489656 602257 584442 558896 606615 642537 719753 683090
11598F83090l1365P2863K26143K23494O8477J42266K57181J36992j62867j92681
11588A423593j81708K6696l1963K6510n0546j03971J6086K4087l7780K2666N0753
11577A184423j13959l81396l0401M5500M3017l3955J66923l1802P0141J43608
11567A062099K7635P182K75559M2764j27375l8329O4123M5688j81990r9176J1250
11556A089430q3196M9741K86125J04282n2771K6412m0426j81339K4602J12266
11546A335126L110N4665m20r6348O5344J50345R2056P5920n7726l2109L3204O1960
11534A685127K6318M9139o9172P6859J02431j55145L1334k08835k03017r192n00
11523A325347K3824J30936J03994Q8691L0711R0601p8962J99423J30423j6434
$$ plain form
11598 683090 651725 724588 950731 1174225 1242702 1384968 1642149 1779141 1616274 1423593
11588 1423593 1241885 1268581 1236618 1263128 1212582 1108611 1124697 1148784 1111004 1133670 1184423
11577 1184423 1070464 689068 658667 704167 747184 713229 880152 848350 918491 1062099
11567 1062099 1089734 1096916 1372475 1415239 1287864 1249535 1313658 1359346 1177356 1078180 1089430
11556 1089430 1006234 1055975 1342100 1446382 1393611 1420023 1379597 1198258 1222860 1335126
11546 1335126 1338236 1392901 1392481 1296133 1361477 1511822 1603878 1679798 1622072 1589963 1623167 1685127
11534 1685127 1711445 1760584 1691412 1768271 1870702 1715557 1746891 1538056 1335039 1325847 1325347
11523 1325347 1349171 1480107 1584101 1672792 1703503 1794104 1715142 1914565 2044988 2028554
11513B028554n1724p6850J10384N8440Q3495J00163K28405N0115R7474J16056
11503B744512K43291J53132P2196R3642M74085N72838M06841J94157J32437L70915
11493E458046N31192M35122L16073N13972N72638Q72205Q31981J060574J264348
11484A1856151J460212J567247J896371K317347K714716L410166M594422N807905
11476C5624537P672121J0655815J5027177K0149436K5684708L0827805L2620254
11469A78261853L1281560K7176879K0402285R353720o081196k1050823k8683692
11462B10660586k9737140k6616031k0858532j5088229j0064721n465081j638306
11455A01192546J458805M978523P955457R913722J1148363J1248181J0119608
$$ plain form
11513 2028554 1976830 1899980 2010364 2068804 2152299 2252462 2480867 2530982 2628456 2744512
11503 2744512 2987803 3140935 3213131 3306773 3780858 4353696 4760537 4954694 5087131 5458046
11493 5458046 5989238 6424360 6740433 7254405 7827043 8699248 9531229 10591803 11856151
11484 11856151 13316363 14883610 16779981 19097328 21812044 25222210 29816632 35624537
11476 35624537 43296658 53952473 68979650 89129086 114813794 145641599 178261853
11469 178261853 209543413 236720292 257122577 266476297 260395101 239344278 210660586
11462 210660586 180923446 154307415 133448883 118360654 108295933 102830852 101192546
11455 101192546 102651351 107629874 115585331 125499053 136647416 147895597 158015205
11448A58015205P861935N031087J471972j219873k101813r12151K014181O247251
11440A76407794J1370090J6746875J9928488K0260505J8316169J5031919R155551
11433B87217391K38122r797226j7151501j8848615j6385906j2350840p981740
11426B04939685m219016k434020k391549l633219n898041q531877j1059875j2312461
11418A54459627j2241034j1066902r382493p066151m358344j683692J335159N239849
11410A15236019R462430J4531105J9908057K3968306K5344920K3252451J8575240
11403B50278528J1749199J516455j1849192k5177269l1327072k9550916k5177710
11396A40462023k0075619j5557247j2254399r975517p753050o182711m751082
$$ plain form
11448 158015205 165877140 170908227 172380199 171160326 169058513 168146362 170160543 176407794
11440 176407794 187777884 204524759 224453247 244713752 263029921 278061840 287217391
11433 287217391 287455513 277658287 260506786 241658171 225272265 212921425 204939685
11426 204939685 200720669 198286649 195895100 192261881 186363840 177831963 166772088 154459627
11418 154459627 142218593 131151691 121769198 114703047 110344703 108661011 109996170 115236019
11410 115236019 124698449 139229554 159137611 183105917 208450837 231703288 250278528
11403 250278528 262027727 263544182 251694990 226517721 195190649 165639733 140462023
11396 140462023 120386404 104829157 92574758 82599241 74846191 68663480 63912398
11389F3912398l737876l363433l101356k606026k171642j968447j841567j862038
11381D3260013j555744j367236j685540j672878j490839j313480j419012j313795
11373C1441489j281421j020988r03382p50948p44291r00288q62675p36103n73283
11364B3668110o90334o37567p37221n66450m62667m10206m69244n04755n16232
11355A8673434n11406n09047n07498P7084k00123n71597l74520l43839j48093
11346A5584395k49276k22226k86926l48809l98271l46531l28176k70106l89879
11337A2744195l32377j65621l86446l79555m25193n59903k81099o8844j78749
11328I966408l12983j69418j30818j83748l34036l63100j53984q5249k00779q1434
$$ plain form
11389 63912398 60174522 56811089 53709733 51103707 48932065 46963618 45122051 43260013
11381 43260013 41704269 40337033 38651493 36978615 35487776 34174296 32755284 31441489
11373 31441489 30160068 29139080 28235698 27484750 26740459 25840171 24977496 24241393 23668110
11364 23668110 22977776 22340209 21602988 21036538 20573871 20163665 19694421 19189666 18673434
11355 18673434 18162028 17652981 17145483 17222567 17022444 16450847 16076327 15732488 15584395
11346 15584395 15335119 15112893 14825967 14477158 14078887 13732356 13404180 13134074 12744195
11337 12744195 12411818 12246197 11859751 11480196 11055003 10495100 10214001 10145157 9966408
11328 9966408 9653425 9484007 9353189 9169441 8835405 8472305 8318321 8233072 8032293 7950859
11318G950859m1054r775J27771J38447m4859l38000m65994j85074k02043j86346
11308F743932k32006k14487j54915j61120j97388j02390j03800k41905j75451
11299E160470k77415j22958k1826l4477k905k25980j54091J30j35791o0533M4723
11288D169347J7139j11586j11269q0201l33908l25962n7092K43417K17156R2819
11278C719860k05123k7450k0034k19559j54778n2634Q3850j54036k280l9427k25496
11267B702893o1462k29081j9429J53707J74128j03904k99225j82335m359j68308
11257A962625P7009J95534l1941j58367j6615k41172j31100j28473n8196R2465
11247A561769k36382k5859L4715J42106k90050q3310L37194J56151k29514k51327
$$ plain form
11318 7950859 7909805 7900030 8027801 8166248 8121389 7783389 7317395 7132321 6930278 6743932
11308 6743932 6511926 6297439 6142524 5981404 5784016 5681626 5577826 5335921 5160470
11299 5160470 4883055 4760097 4738271 4703794 4700889 4474909 4320818 4320948 4185157 4124624 4169347
11288 4169347 4186486 4074900 3963631 3883430 3549522 3223560 3166468 3409885 3627041 3719860
11278 3719860 3514737 3487287 3467253 3247694 3092916 3040282 3124132 2970096 2967816 2928389 2702893
11267 2702893 2641431 2412350 2392921 2546628 2720756 2616852 2317627 2135292 2130933 1962625
11257 1962625 2039634 2235168 2203227 2044860 2028245 1787073 1655973 1527500 1469304 1561769
11247 1561769 1325387 1299528 1334243 1476349 1186299 1102989 1440183 1596334 1366820 1115493
11237A115493M5169J13853m4236n2411q852K668l8895m5883j4379n5886p2952
11226I43689p6770K0212J75734l994q7284j05060J44258l8254l8896q0163Q2992
11215I36464q0507k98452n3847J01624j53349j26754K984J37522K81718J14966
11205H62369M1057o2534j38249M4850l5508q8737o7078L5908J66100J52861J17394
11194A028433o804O966J63564p9695k42571k4945J85063l9113j09189k16510N97
11183F65796L2835n1336K08226O2192j23122q2702l03009j6688K74750j33058
11173E33884M3009j9048k31133l9014J08658L3272L2442R8677L20039k546m8722
11162H29518m7023l6494N3410M7608k8877k34640r5736M0571J31132J52694l4326
$$ plain form
11237 1115493 1160662 1274515 1230279 1177868 1169016 1171684 1132789 1086906 1072527 1016641 943689
11226 943689 866919 887131 1062865 1058871 971587 866527 1010785 972531 933635 853472 936464
11215 936464 855957 557505 503658 605282 451933 325179 328163 465685 747403 862369
11205 862369 903426 840892 702643 747493 711985 623248 556170 592078 758178 911039 1028433
11194 1028433 1021629 1028595 1192159 1112464 869893 844948 1030011 990898 881709 665199 665796
11183 665796 698631 647295 855521 917713 794591 711889 408880 392192 666942 533884
11173 533884 576893 557845 326712 287698 396356 429628 462070 560747 880786 878240 829518
11162 829518 782495 746001 799411 847019 818142 583502 487766 528337 659469 812163 777837
11151G77837j7192M5304Q1595p2629j54683j35083K9410J42863K14288Q0915n2560
11140I40065k27934j93343k11443K9510N851O2248q0369l4062J34749j64056J37546
11129C98762J6405J25994k0878n2320J71810J87579p6759k6769J31368K0711P3670
11118I49573j94652j11698J3848r4580J06482k5491k25848m7163K59090Q3537
11108G13098j42423k59923k19780P6267J46894n86M6311J53063n7056p1392n8016
11097C26457L3131J06115J73473Q479J1494k50412j69789j01231J15719L733L3405
11086B90574R6052J39424J17776m588k34884j3175j67265M0834N2961k32348j21980
11075c6619O4215Q6756J6277K8780j78425R8415J39170K806L0206j07940m5426
$$ plain form
11151 777837 760645 805949 887544 814915 660232 525149 554559 697422 911710 992625 940065
11140 940065 712131 518788 307345 336855 342706 404954 324585 290523 425272 261216 398762
11129 398762 415167 541161 520283 467963 639773 827352 750593 723824 855192 875903 949573
11118 949573 754921 643223 657071 562491 668973 643482 417634 370471 629561 713098
11108 713098 570675 310752 90972 167239 314133 313547 359858 512921 455865 384473 326457
11097 326457 359588 465703 639176 647655 659149 408737 238948 137717 253436 257169 290574
11086 290574 386626 526050 643826 639238 404354 391179 223914 264748 317709 85361 -36619
11075 -36619 27596 114352 130629 159409 -19016 79399 218569 221375 251581 143641 98215
11064I8215N4833Q2758j06886Q1738O2748j7730O4528o8343k4383Q8149L09349
11053F24976l2684j24771P2912J6464J10710m930j50560N6434J86256P8748L616
11042H37171j0884J41020K22939J25659j2637J87556J9678N7522P4879O3079o650
11031A699332R236k42517o0770j39762j88824j22097j2261n1478J88019n2952
11021A025926M5294P9081K62248j7182k44593j24988M6126j00837J24805K53962
11011A349842j31682j75109j8448P6492K00860J47859K39619K03047q2221j70350
11001A639909N0327q2903k62329j42961k24126O8390l44205j70431Q9640M6132
10991F67443J78895j28763k0189q3397j49306K0452K76090L2364j44491j55577
$$ plain form
11064 98215 153048 235806 128920 210658 273406 255676 320204 251861 227478 315627 624976
11053 624976 592292 467521 540433 556897 667607 662677 512117 568551 754807 833555 837171
11042 837171 826287 967307 1190246 1315905 1303268 1490824 1510502 1568024 1642903 1705982 1699332
11031 1699332 1708568 1466051 1405281 1265519 1076695 954598 942337 890859 1078878 1025926
11021 1025926 1071220 1150301 1412549 1395367 1150774 1025786 1071912 971075 1095880 1349842
11011 1349842 1218160 1043051 1024603 1101095 1301955 1449814 1689433 1892480 1810259 1639909
11001 1639909 1690236 1607333 1345004 1202043 977917 1046307 702102 531671 621311 667443
10991 667443 846338 717575 697386 613989 464683 485135 761225 793589 649098 493521
10981D93521J70913J69517R3393m0309J67915K37567K12060K0298Q3440o6856
10971A541459k07677k43122l27782l3022J98852o099n5779j58872r0204J4944
10961F32698k07847r0143j64246J15108K66808p4865j61443k9420N4304k6752
10951C14202p7039p0604o7243j23559J56656J18009M084M9266N5539O8115j77280
10940B50146r6899n188M3227Q9230o3895j12429L8072o2916j89942M3716J43555
10929G6677J66896K23168j47563p7431K464q2972Q2900k63263J76571J31700J0509
10918B99656O0517J33480j95485j11588j06926j13591Q6449O6034J15548J24113
10908C58207r1009p1739j2076O1208r3208J53171J54563j19735q2763j01267Q2932
$$ plain form
10981 493521 664434 833951 927344 887035 1054950 1292517 1504577 1524875 1608315 1541459
10971 1541459 1333782 1090660 762878 729856 928708 922609 866830 707958 617754 632698
10961 632698 424851 334708 170462 285570 552378 477513 316070 286650 340954 314202
10951 314202 237163 166559 99316 -24243 132413 250422 254506 303772 359311 427426 250146
10940 250146 153247 148059 191286 280516 216621 104192 142264 79348 -110594 -66878 76677
10929 76677 243573 466741 319178 241747 244211 161239 244139 -19124 157447 289147 299656
10918 299656 360173 493653 298168 186580 79654 -33937 52512 118546 234094 358207
10908 358207 267198 195459 183383 244591 151383 304554 459117 339382 256619 155352 238284
10897B38284j6282N5638m7450j5249J76160R3712j46079j03433K3366n1226O8494
10886B75935Q8908J197k14821J6080J25490j7783j74222O6538l8152j10606R0162
10875A08726k0622p2983J0995R7220L08202P0606r0118k80836k09948Q014L7971
10864c2773N3475j81532j3490M5985j4854J89701M4711k9224m0788n0673l1589
10853f1051o1647J37403L3694j39543j05952J45556K31161j19518k28063J8851
10843a49109J39193o1495j7875Q9993k7254Q3309K36021J4801k6481L2072j3870
10832B99305j12715j28810j17053p6318J20520N0093j9443m8275l1262j20981
10822a84939J14773L0931Q2124j02223k039j20436o0324K5100j20160J58962K64035
$$ plain form
10897 238284 222002 277640 230190 214941 391101 484813 338734 235301 258667 207441 275935
10886 275935 364843 366040 151219 167299 292789 275006 100784 167322 129170 18564 108726
10875 108726 88104 15121 26116 123336 431538 502144 412026 131190 -78758 -70744 -32773
10864 -32773 20702 -160830 -174320 -128335 -143189 46512 91223 61999 21211 -29462 -61051
10853 -61051 -122698 14705 48399 -91144 -197096 -51540 179621 60103 -167960 -149109
10843 -149109 -9916 -71411 -89286 707 -26547 56762 292783 307584 281103 313175 299305
10832 299305 186590 57780 -59273 -135591 -15071 35022 15579 -32696 -63958 -184939
10822 -184939 -70166 -39235 42889 -59334 -61373 -181809 -242133 -217033 -337193 -178231 85804
10811H5804Q9123k46338j96450J12737R5254J04188j33244j56844q006N0708k4913
10800b27981J41397J05349j44003K6249O1874M331M4305q1553J48555K14237K31300
10789E24060L2656j07500p4600k16478R8550O9070J27405j4673l2845j85585k72707
10778e2647k10168M5202k9443P7221k16j78596k6313J29357J24420K23913M8399
10767A51129j45167J84193J09406l5244j40412o979O2503m7993j2378k4161N3143
10756A48040O6562M2208j16077n5040k1706o5152Q5360n51K13976N938j4563O5309
10744C54304j46371k81478j90931J35375o2494j91821l5133J74852J74596P8648
10734I547L5990m4083J10862l0828L9265k1186q0032L380O02J17774P6883j39199
$$ plain form
10811 85804 174927 -71411 -267861 -155124 -59870 44318 -88926 -245770 -253776 -203068 -227981
10800 -227981 -86584 18765 -125238 -98989 -37115 -32784 11521 -70032 78523 292760 524060
10789 524060 556716 449216 374616 158138 256688 325758 453163 438490 405645 220060 -52647
10778 -52647 -262815 -217613 -247056 -169835 -170051 -348647 -374960 -245603 -121183 102730 151129
10767 151129 5962 190155 299561 264317 123905 116926 179429 131436 119058 94897 148040
10756 148040 214602 256810 140733 85693 63987 -1165 84195 83644 297620 303558 288995 354304
10744 354304 207933 -73545 -264476 -129101 -191595 -383416 -418549 -243697 -69101 9547
10734 9547 45537 1454 112316 81488 120753 99567 19535 22915 23517 141291 218174 78975
10722G8975k61435q2258l0893K39321J31888j17625j87383r8787J35224Q0939
10712a12034P9418m2774j06586R0540J17417j2569j9634m2998R2075m3153k1461
10701b1759L7240N5887M0761k6975N8046R600j3636j3522j46697j40881J31015
10690c0921K40953M2807J5104M2791L5673n2094j64361k60580J5988J34863j2537
10679G686o3387k3783J17086K2674j95106J80003J10312j24270k19889r2455j47877
10668d29006J70341K02665O9846O2212J43952m8626j05627k2809J2181J545r3369
10657c6695K27618O8006p5116j54636m7116N8919r289R284l5711J90857J46737
10646C42858N5622p7284K20580r3411l29029k99866q2206P7902J18652j31514
$$ plain form
10722 78975 -182460 -264718 -295611 -56290 75598 -42027 -229410 -328197 -192973 -112034
10712 -112034 -32616 -75390 -181976 -91436 25981 13412 -6222 -49220 42855 -298 -21759
10701 -21759 15481 71368 112129 85154 143200 152800 139164 125642 -21055 -161936 -30921
10690 -30921 210032 252839 267943 310734 346407 294313 129952 -130628 -114640 20223 7686
10679 7686 -55701 -79484 37602 60276 -134830 45173 155485 31215 -188674 -281129 -429006
10668 -429006 -258665 -56000 13846 76058 220010 171384 65757 42948 55129 56674 -36695
10657 -36695 190923 258929 183813 29177 -17939 40980 31691 40975 5264 196121 342858
10646 342858 398480 321196 541776 448365 119336 -180530 -262736 -184834 -66182 -197696
10636a97696R5377L4645q1341Q5309J58018J71167p4839k36367k8200K11162K10118
10625C47353P1805k52380j08228j57226p195j33460n2653P708m9047J22893J72722
10614c7708k0385j23078Q8250Q8597P6830j236P2986n0664P9238j78944k68838
10603b74952j11862J16351M8210j2695l5654j5347O0496J12367P6649J43169K24297
10592C31029n4539j22656N8562K6120l2273J00361j13010j21883j53345k5943
10582a07577p6526K1371n5926j3520j01033J46062J39056j15569j40569j8254
10572c22485J0903J83518Q7196p4136J0799N5332R1723J52260K27656q7917j71047
10561A63802j92669j46019p518m322q4091K49928R7512K828j4730m0503j12123
$$ plain form
10636 -197696 -102319 -67674 -149015 -63706 94312 265479 190640 -45727 -73927 137235 347353
10625 347353 419158 166778 58550 -98676 -105871 -239331 -291984 -284276 -333323 -210430 -37708
10614 -37708 -58093 -181171 -92921 -4324 72506 71270 144256 93592 172830 -6114 -274952
10603 -274952 -386814 -270463 -222253 -234948 -270602 -285949 -225453 -113086 -36437 106732 331029
10592 331029 276490 153834 212396 238516 206243 306604 193594 71711 -81634 -107577
10582 -107577 -184103 -162732 -218658 -232178 -333211 -187149 -48093 -163662 -304231 -322485
10572 -322485 -311582 -128064 -40868 -115004 -104205 -48873 42850 195110 422766 334849 163802
10561 163802 -28867 -174886 -182404 -186726 -270817 -20889 76623 79451 64721 24218 -87905
10550h7905P9444J04047K2971q3647J51418k19427j36206k35961M9604M58381
10540A02719J15731j32649j94762j67168N4452q319K14532J82206j18113r3928
10530d5299J27112k20984j4730K93297N2529k57693j55856Q1374L49N865j5749
10519a49785J48141j07520j74597j23046N636J71883O0483J6090o7660Q4781m4664
10508a80258n9899J04283j14209k4136Q2615N9646j05152K55613k1159k85173
10498b87829K768K33491K53919N0336j11901j82892l7835l7241M754n2086J28427
10487c6089J17323J48342j77501m6898n308J61748L3068p8609k69866k8213K2085
10476a59918J36321N0575Q1619j34066j97720Q5694N8579m6177J99856J21490
$$ plain form
10550 -87905 -8461 95586 118557 34910 186328 -33099 -169305 -405266 -355662 102719
10540 102719 218450 85801 -108961 -276129 -221677 -229996 -15464 166742 48629 -45299
10530 -45299 81813 -139171 -153901 139396 191925 -65768 -221624 -140250 -139901 -134036 -149785
10519 -149785 -1644 -109164 -283761 -406807 -401171 -229288 -168805 -152715 -220375 -135594 -180258
10508 -180258 -240157 -135874 -250083 -274219 -191604 -131958 -237110 18503 -2656 -287829
10498 -287829 -285061 -51570 202349 252685 140784 -42108 -79943 -117184 -112430 -164516 -36089
10487 -36089 81234 229576 52075 5177 -131 161617 194685 116076 -153790 -182003 -159918
10476 -159918 -23597 26978 108597 -25469 -223189 -137495 -78916 -125093 74763 196253
10466A96253j3774n6621R7662K6265L1979J29114j62582j93906j58425J29732
10456B5697J59021l7661j26661k2327n3968j7475J71935L1871N9026n2892J10750
10445B47316O583j14798m9564N8544O9805j6232M7051l7257k9973k10454l25982
10434c54961l31722J24717K80965K50049J78498J50672j29982r6222j42499j19350
10424a89835R6415M3111j48947p3281o8674K78492J53927p3505j56460L3425N4867
10413e0465j32880q8316M9036J90709K55661O7231j49423j34645p4252k07245
10403b74589K36916L87672j27179n3870M7703O0363Q2410K5241j40794k04977
10393C8896l0003J20551l6326R463Q1508j82381r4048P2262J49445k6864j00011
$$ plain form
10466 196253 182479 125858 223520 249785 281764 410878 248296 54390 -104035 25697
10456 25697 184718 147057 20396 -1931 -55899 -73374 98561 130432 189458 136566 247316
10445 247316 253899 139101 89537 148081 217886 201654 248705 211448 181475 -28979 -354961
10434 -354961 -686683 -561966 -281001 -30952 147546 298218 168236 72014 -70485 -189835
10424 -189835 -93420 -50309 -199256 -272537 -341211 -62719 91208 17703 -138757 -105332 -50465
10413 -50465 -183345 -271661 -222625 -31916 223745 290976 141553 6908 -67344 -274589
10403 -274589 -37673 349999 222820 168950 216653 277016 359426 384667 243873 38896
10393 38896 8893 129444 93118 102581 184089 1708 -92340 -20078 129367 102503 2492
10382B492j52142n7030J16709o1309q4018m6335p418J58022J66620P751m2j53726
10370a10426k14861K46798K28886O6193n8365j29671j12848K2909K833K08803
10360A50251l2630J8781K01377L6045o9891j57028j11216J12620o1222j48677
10350f1590J19430J78063j5692j47630m3564j94779j41448K29712J47721j05049
10340c4826J93080L10718N645k0326l5375l04690k62948k9034N7691o7702j24206
10329c11973r9591N9659j1444J46620J79247J31747l95j20824l605M8417O4599
10318H2457J5275m3936J88941K08127o8909j37189j73165J9956p6939M5564N9211
10307A19393l5400j92746j6284n7196K72801K15389l9692o3945o0647p8546J63695
$$ plain form
10382 2492 -149650 -206680 -89971 -151280 -235298 -281633 -289051 -131029 35591 43342 43300 -110426
10370 -110426 -325287 -78489 150397 216590 158225 28554 -84294 -61385 -58552 150251
10360 150251 117621 136402 337779 373824 303933 146905 35689 148309 87087 -61590
10350 -61590 57840 235903 220211 72581 29017 -165762 -307210 -77498 70223 -34826
10340 -34826 158254 468972 474617 454291 418916 114226 -148722 -177756 -120065 -187767 -311973
10329 -311973 -411564 -351905 -363349 -216729 -37482 94265 93870 -26954 -30559 17858 82457
10318 82457 97732 53796 242737 450864 381955 244766 71601 91557 14618 60182 119393
10307 119393 83993 -108753 -125037 -182233 90568 305957 266265 202320 141673 63127 226822
10296B26822j22676J1105k5638r3629Q1722l9289j89179q0841J30109j00679o8097
10285b70270J23427J23622j10985M2773J37002m7953j35810L0160N4467j78639
10275b32206m1389K17156J44132o1904j90302p5888J56887L6372M5341k5517k81616
10264c08934M3358P9046O1767R704k2218p8258o7913J29817M0590J94569N7513
10253A39041r6179K4135l4114n6041j7744M363M0145p3532J63256K1448j54774
10242c9996k31157M8448J12419k311k0867R1762Q794Q3298J24727p2287j5935
10231H6895O3619J56479r1004k84713j34713j14277J25826P8812j82234M2489
10221b52821J58368L6314j92994P32N8623q8175J10788K27297J43060j89623j69381
$$ plain form
10296 226822 104146 115251 89613 -4016 77706 38417 -150762 -231603 -101494 -202173 -270270
10285 -270270 -146843 -23221 -134206 -91433 45569 -2384 -138194 -108034 -53567 -232206
10275 -232206 -273595 -56439 87693 25789 -164513 -240401 -83514 -47142 -1801 -27318 -308934
10264 -308934 -265576 -186530 -124763 -115059 -137277 -215535 -283448 -153631 -113041 81528 139041
10253 139041 42862 66997 32883 -23158 -40902 -36539 3606 -69926 93330 114778 -39996
10242 -39996 -271153 -222705 -110286 -112597 -133464 -41702 -32908 50390 175117 102830 86895
10231 86895 150514 306993 215989 -68724 -203437 -317714 -191888 -113076 -295310 -252821
10221 -252821 -94453 -58139 -251133 -250401 -191778 -279953 -169165 58132 201192 11569 -157812
10210a57812J1878j28798J11373l3090p7136M6303k3124L33141J14958j70759
10200B6934R1815J55679l2940L0828j66702m7642J40152n4951k77215m9031P0241
10189a12832J85578L20173L8048k01611k57847q5984r6203o190J15403n4585n9100
10178b15150N4006J16127j7416Q7401n8874l15992q4857J78479J19455k0765l3980
10167a91566Q1039j29519j24270l4779L5666P1276K2767O1519P4853J05036Q173
10156a9805m2661J06627J86156J12643q2035j58127j90125q6365p387l180K13619
10145B9360J62620J70650J03708n899l12820l13505N4472L9766P3197J64215j32243
10134C3521J4362J6646J11325O0728j85267O4797m1880L0606N9101r335j8463
$$ plain form
10210 -157812 -145934 -274732 -163359 -196449 -273585 -227282 -250406 82735 197693 26934
10200 26934 118749 274428 241488 272316 105614 57972 198124 143173 -134042 -183073 -112832
10189 -112832 72746 392919 430967 229356 -28491 -114475 -210678 -216868 -101465 -156050 -215150
10178 -215150 -161144 -45017 -62433 24968 -33906 -349898 -434755 -256276 -136821 -157586 -191566
10167 -191566 -110527 -240046 -364316 -399095 -363429 -292153 -269386 -207867 -133014 -27978 -19805
10156 -19805 -62466 44161 230317 342960 260925 102798 -87327 -173692 -181079 -184259 29360
10145 29360 191980 362630 466338 460439 147619 -165886 -111414 -71648 1549 165764 33521
10134 33521 47883 64529 175854 236582 51315 116112 74232 104838 163939 154604 136141
10123A36141L4864O4676m042p4028J18322k59452j59510J42861J06606j03489
10113B949j18744j29204J62336P8121Q3059J9831j08667n9213l0326p869p2341
10102a80068K15847q3652j56828J30577M3688K6050j24759j92176K0095l6057
10092c37283N8291j4783j9450K16830J7882J54441O4977k448K33865N2422q2251
10081C42493j09542j57412j50500j28432J20559q9643j53841R8028L7181K44204
10071E3095K97606R44J15602m7402j29453J16904M06664Q9201K24918K43415l3770
10060A337724P7369K86094J54532J71242O28782O45320Q79495J567816K653259
10051H401633M889244R011345J1406863Q715548N788644Q408084P450305L815317
$$ plain form
10123 136141 171005 235681 231639 157611 275933 16481 -143029 -168 106438 2949
10113 2949 -115795 -244999 -82663 -4542 78517 98348 -10319 -69532 -99858 -107727 -180068
10102 -180068 35779 -47873 -204701 -74124 -30436 -4386 -129145 -321321 -301226 -337283
10092 -337283 -278992 -293775 -313225 -96395 -78513 75928 140905 138457 372322 424744 342493
10081 342493 232951 75539 -74961 -203393 -82834 -172477 -326318 -228290 -191109 53095
10071 53095 350701 351645 467247 419845 290392 407296 813960 903161 1128079 1371494 1337724
10060 1337724 1415093 1701187 1855719 2026961 2655743 3301063 4180558 5748374 8401633
10051 8401633 13290877 22302222 33709085 42424633 48213277 56621361 64071666 67886983
10043F7886983j5659707j8579065j0125353n506907l587693k471314k029078j422707
10035H505159r57839p67563n14097m45713l90189k73458l71326j20613k03555
10026D460806m3313m7800l32407k38980n0189q2434l20224k68763j26182j49793
10016B800721k86269k37031J58944n4953k5842o2735k05446n4094l4001o6590
10006A932704j12639k5015J0519l8036p5530K1994j2627J3300Q626N4895l6360
9995A741831k63042k02838K7723q2431j94472j92655q4223J18341J12070o7840
9985I12464m5851J4264J51964q4645j60856J9136j82237J81563q5735j67826j40180
9974D12061m7870J57643Q0375J06922J13956l2819l9491k62351j01748Q9572K37441
$$ plain form
10043 67886983 52227276 33648211 23522858 18015951 14428258 11956944 9927866 8505159
10035 8505159 7547320 6779757 6265660 5819947 5429758 5156300 4784974 4664361 4460806
10026 4460806 4417493 4369693 4037286 3798306 3748117 3665683 3345459 3076696 2950514 2800721
10016 2800721 2514452 2277421 2436365 2381412 2355570 2292835 2087389 2033295 1999294 1932704
10006 1932704 1820065 1795050 1805569 1767533 1692003 1713997 1701370 1714670 1723296 1778191 1741831
9995 1741831 1478789 1275951 1303674 1221243 1026771 834116 749893 868234 980304 912464
9985 912464 866613 880877 1032841 948196 787340 806476 624239 805802 720067 552241 412061
9974 412061 364191 521834 602209 709131 823087 790268 750777 488426 386678 476250 713691
9963G13691o255o385J2735N3304o5076M3520l5078j8794k4184j86637k4666J13482
9951E69657K0385l7687J11407Q9919k72152K3809O6782J053q49j98126j09055
9940B65143N9217K2411l0127M711L8771k296j20001l2997J42279J72744j08646
9929D11209r4515j88214m3435J03459p4148j57592N3735J67082J00880R7660J23378
9918D99499o8503p6247j33667K028q0183J10200n7947L373J16845R646j3063R8134
9906D10115p867O0971J2265j37221P9783N8281j18750l8919j07184r7530j65143
9895e1199R1262R6111J0845J93874R178j6002J93290j88866k36845q0868N2175
9884G2955J33060J31199j12175n8532m6262O0216j3939o4299M7246J2410j50044
$$ plain form
9963 713691 707436 701051 713786 767090 702014 745534 710456 691662 667478 480841 456175 569657
9951 569657 590042 552355 663762 753681 481529 505338 572120 573173 572324 374198 265143
9940 265143 324360 346771 316644 321355 360126 357830 237829 204832 347111 519855 411209
9929 411209 316694 128480 85045 188504 114356 -43236 10499 177581 278461 376121 499499
9918 499499 430996 354749 221082 223110 142927 253127 195180 198553 315398 325044 311981 410115
9906 410115 402248 463219 475484 338263 418046 476327 357577 318658 211474 113944 -51199
9895 -51199 40063 136174 147019 340893 350071 334069 527359 338493 101648 20780 72955
9884 72955 206015 337214 225039 166507 120245 180461 166522 102223 149469 161879 11835
9873A1835J47954L3707o9056P5747p583k78878m6048M6846K17616m3610p1197
9862A7333p7833k5365r871m4595J79114j61708n4902q6929K14705l542M5817J69119
9850A61343K05977l55471J12513m0019j18715L969k65658k842J19227m59K03726
9839B3591J0823q0795p8150L7780O658L078k5436R899J04068J79874O7678m6127
9827B12941k4830K0674J50018n8196l8157j10226k37889j42618J09199O3222K07833
9816A51971r5526r7899P8631J58194q1367K0381m760J27603J17653K49445P9848
9805G04174j1735j44380k89286J3684J10340M1528j53875j96747l456J83596j08777
9794A45066j8593K8829k6591R2723J85937j77031k85995O9164P5833j68105Q4513
$$ plain form
9873 11835 159789 193496 124440 200187 192604 -86274 -132322 -85476 132140 88530 17333
9862 17333 -60500 -85865 -95736 -140331 38783 -122925 -177827 -264756 -50051 -53593 -7776 161343
9850 161343 367320 11849 124362 84343 -34372 -30403 -296061 -298903 -179676 -180135 23591
9839 23591 34414 -46381 -124531 -86751 -80093 -77015 -102451 -92552 11516 191390 259068 212941
9827 212941 188111 208785 358803 300607 262450 152224 -85665 -228283 -119084 -55862 151971
9816 151971 56445 -41454 37177 195371 114004 134385 129625 257228 374881 624326 704174
9805 704174 692439 548059 258773 272457 382797 424325 270450 73703 70247 253843 145066
9794 145066 126473 155302 128711 221434 407371 230340 -55655 13509 89342 -78763 5750
9783E750q309O6986o010q1830k04635j38977K69271J20507o1076j04319l0661
9772a73303J90163R1472P939k4686j11097K55451J64867j09608j93875r6984M3786
9761D4125O0618K67251J12453j93430l28072N504j3014L340J98562K1962k7893
9750A51406Q3564l768J1010p186J1000J21440J02242r6245j30883m4121p7429
9739A21030N5365N6978p581P9636Q7204j01995k95733J7115J22801J00310n3101
9728A82029o8972o6285J016m6525p4684n8039J06505K35017k1881M3676r849J56717
9716C78725j63293k53288k8249o2711O6583J30046J65709J3166k08639J7128q3056
9705b7879K587O7862K14072J26193J9856j27604q8850j8365q4017k0069j91382
$$ plain form
9783 5750 -2559 64427 58417 -23413 -228048 -367025 -97754 22753 -38323 -142642 -173303
9772 -173303 16860 108332 116271 91585 -19512 235939 400806 291198 97323 339 44125
9761 44125 104743 371994 484447 291017 -37055 -31551 -44565 -41225 157337 179299 151406
9750 151406 234970 231202 242212 235026 246026 367466 469708 373463 242580 198459 121030
9739 121030 176395 233373 225792 305428 392632 290637 -5096 12019 134820 235130 182029
9728 182029 113057 46772 47788 1263 -73421 -131460 -24955 210062 188181 231857 222008 378725
9716 378725 215432 -37856 -66105 -128816 -62233 67813 233522 246688 38049 55177 -27879
9705 -27879 -25292 42570 256642 382835 402691 275087 186237 167872 83855 63786 -127596
9694a27596O2158J01905q6774Q0630J5122p6955j34946L9403J32820M3193J6355
9683F5315q1395M4292J76576J08611j70641j86052j28123j04818K07261K22168
9673A53194J56524o626k09106M1900O368m0217J05436K9377J41932n70k01656
9662A76556k12239J653M7610Q5867J07771J67987j38962j09416p0363j5796K2435
9651F3103O4394Q1208J2592N8926J2657l5411j40442O4480J77113N9630j25568
9640B92682q813P340O286m5097r2657K337N2335L6761j2041k1070M5947J88434
9628D52444p628l05654j95267k673K29265j34939p2986j6948R2088R357n7195
9617a0136K8932K3061O3207L70370Q4187R447j90359p6484K5865k0366R0945K33574
$$ plain form
9694 -127596 -65438 36467 -50307 30323 45445 -31510 -166456 -127053 5767 48960 65315
9683 65315 -16080 28212 204788 313399 142758 -43294 -171417 -276235 -68974 153194
9673 153194 309718 303092 93986 135886 142254 102037 207473 236850 378782 378212 176556
9662 176556 -35683 -34030 13580 99447 207218 375205 236243 126827 56464 40668 63103
9651 63103 127497 208705 221297 280223 292880 257469 117027 181507 358620 418250 292682
9640 292682 283869 291209 297495 252398 159741 162078 214413 251174 239133 218063 264010 452444
9628 452444 444816 139162 -56105 -58778 170487 35548 -37438 -54386 37702 47059 -10136
9617 -10136 18796 41857 105064 475434 559621 569068 378709 302225 328090 307724 398669 632243
9605F32243L5495j75256j02644J8930j64556k8389j4079n2922J19293O1045m6630
9594B82530J30896L1708K4239j83028q3720K7977J4571r5864J57495j50105p2852
9583H3847L3960O1229K81671K707q2902j31961m6749r6532o9539j9639J05539
9572A21631k5606P1147J89086p5790k2584J29455P3354j81140j66289N0794J68534
9561C32592P1363j16709m0866k9872k4680P9736M3928k611o756j41797N6684J44971
9549C65983k7516N6179p1671o763L4687j35117J04810J17743o9087J34087o4954
9538D38381L2620r7126j39855J14687K84013k41736k14181L34400J35149R6911
9528G43263j4614o9865m0930r4397O1488N1480J890n2017j73673J01223O6997
$$ plain form
9605 632243 667738 492482 389838 408768 244212 215823 201744 148822 268115 329160 282530
9594 282530 413426 445134 469373 286345 202625 230602 245173 149309 306804 156699 83847
9583 83847 117807 179036 460707 463414 380512 248551 201802 105270 35731 16092 121631
9572 121631 96025 167172 356258 280468 257884 387339 460693 279553 113264 164058 332592
9561 332592 403955 287246 246380 216508 191828 271564 315492 312881 306125 164328 221012 365983
9549 365983 338467 394646 322975 316212 350899 215782 320592 438335 369248 503335 438381
9538 438381 471001 373875 234020 348707 632720 390984 176803 511203 646352 743263
9528 743263 728649 658784 617854 523457 584945 636425 638315 586298 412625 513848 580845
9517E80845O7156j73647K8178J6670l6298k17600j36728J74463J69926J19993
9507E92958n5951J9078J7773j32316R4651J82233k03428J21665J36906j55790
9497F17779k14899j77315j2904K51776K4605K361p700K0451J12152r0626J44018
9486F69698k20952j47518p462k97K8018J18125p848J19805J19476m3294l3577
9475E94174J4643M3265L1429m5439O3326L7563k9798o7833O0552m5717j69092
9464D87073j44091k02441J71344L09831J25967N0121J57394R7071o5120q5877
9454I01272L1835l9468j45548p9330L7744n6922K48544j3390J4845r9349q1474
9443G18759J7218N5102n7260j703n9936K70470m2093n9686l7001O4596l5385P085
$$ plain form
9517 580845 648001 474354 502532 519202 482904 265304 128576 303039 472965 592958
9507 592958 537007 556085 573858 441542 536193 718426 514998 636663 773569 617779
9497 617779 402880 225565 212661 464437 489042 491403 483703 504154 616306 525680 669698
9486 669698 448746 301228 293766 293469 321487 439612 431764 551569 671045 627751 594174
9475 594174 608817 652082 683511 638072 701398 738961 709163 641330 701882 656165 487073
9464 487073 342982 140541 311885 621716 747683 797804 955198 1052269 987149 901272
9454 901272 933107 893639 748091 668761 706505 649583 898127 884737 899582 800233 718759
9443 718759 735977 791079 733819 732116 672180 942650 900557 840871 803870 868466 833081 840166
9431H40166M9821j07370p8320R7743K1415J0043J77136j70868l9803l7550M2482
9420H04895K03211Q1793J3632L4448J99987p2235j69128j68911j3130J03578k9729
9409I88411J18076M2306J33306j16496n9001J51996K5488k6395j04543R766J25347
9398A288261K35641J29523J0996J23149K5300N0073j6437j33868p7060o2921q4449
9387A488208L25816J31424L8620J0073k56340j38547K2338n858j8915M5529j13871
9376A528477J916K27423K21460J74183J20926j24937p7433L19194n0034k23277
9366B117898j41653j16673P8097L6699J51168L20930Q9797j04135R7680K06725
9356B736533Q3923j92052J1573K10778J42591m4070j6775J34107o1187O9939O8642
$$ plain form
9431 840166 889987 782617 704297 802040 823455 833498 1010634 839766 799963 762413 804895
9420 804895 1008106 1089899 1103531 1137979 1337966 1265731 1096603 927692 914562 1018140 988411
9409 988411 1106487 1148793 1282099 1165603 1106602 1258598 1284086 1257691 1153148 1162914 1288261
9398 1288261 1523902 1653425 1664421 1787570 1812870 1862943 1846506 1712638 1635578 1572657 1488208
9387 1488208 1814024 1945448 1984068 1994141 1737801 1599254 1621592 1615734 1596819 1642348 1528477
9376 1528477 1530393 1757816 1979276 2153459 2274385 2149448 2072015 2391209 2341175 2117898
9366 2117898 1976245 1859572 1937669 1974368 2125536 2446466 2536263 2432128 2529808 2736533
9356 2736533 2820456 2628404 2639977 2850755 2993346 2949276 2932501 3066608 3005421 3075360 3144002
9345C144002j27383J86841J34551r1077j94555K41209J633O8043J75536R019J32401
9334C680220K96814J28217R2900J59157P9620l3388m7500J12921K61588J76398
9324D906947K31728j7052Q5633L75827M4143J5049K24431L24378L46599J4580
9314F552263K6700J34044K60104L71867L40603L59419L59238L19982L45666L66183
9304I436069L27538J79453M12846O51275N26887M19941L78117M98438O90056O66426
9294A4187046P23171P49784P65165R30732J054970J052872J091054J229235J267883
9285B3051912J432888J548012J393703J697278J801667K026256K266019K452356
9277C7670091L015139K954669L293384L716877L833078M250995M855858N146189
$$ plain form
9345 3144002 3016619 3203460 3338011 3246934 3052379 3293588 3295221 3363264 3538800 3547819 3680220
9334 3680220 3977034 4105251 4198151 4357308 4436928 4403540 4356040 4468961 4730549 4906947
9324 4906947 5138675 5121623 5207256 5583083 5627226 5642275 5866706 6191084 6537683 6552263
9314 6552263 6578963 6713007 6973111 7344978 7685581 8045000 8404238 8724220 9069886 9436069
9304 9436069 9763607 9943060 10355906 11007181 11534068 11954009 12332126 12830564 13520620 14187046
9294 14187046 14910217 15660001 16425166 17355898 18410868 19463740 20554794 21784029 23051912
9285 23051912 24484800 26032812 27426515 29123793 30925460 32951716 35217735 37670091
9277 37670091 40685230 43639899 46933283 50650160 54483238 58734233 63590091 68736280
9269F8736280N602655O217722O294283O649676O851377O885109O720822O501719
9261A20459643O050944N195954M207112L148229J523463O9176j220679k394488
9253A37039354l405337m430348n033858n527009n607705n758334n676422n590729
9245I6009612n467433n129089m789002m507086m201172l798376l604419l523461
9237F0989574k962517k751074k769874k374054k130991k146286k015496j807509
9229D2031773j599332j723434j595180j441259j450026j561172j130588r03796
9221C0626986j028045j229005r22264r14197r88006q20475q48967p22522q29499
9212B2324006n35305m08013o41450n98757p31686n79806l95247m42251m49556
$$ plain form
9269 68736280 74338935 80556657 86850940 93500616 100351993 107237102 113957924 120459643
9261 120459643 126510587 131706541 135913653 139061882 140585345 140654521 139433842 137039354
9253 137039354 133634017 129203669 124169811 118642802 113035097 107276763 101600341 96009612
9245 96009612 90542179 85413090 80624088 76117002 71915830 68117454 64513035 60989574
9237 60989574 58027057 55275983 52506109 50132055 48001064 45854778 43839282 42031773
9229 42031773 40432441 38709007 37113827 35672568 34222542 32661370 31530782 30626986
9221 30626986 29598941 28369936 27447672 26533475 25545469 24724994 23876027 23153505 22324006
9212 22324006 21788701 21380688 20739238 20140481 19408795 18828989 18433742 17991491 17541935
9203A7541935o74109o04099m15204o56075m20110k83897j26821j46987l56157
9194A3858476l68058o76134m31732l73614k02494k38004l35972j61216k29883
9185A0841369k31682q502j85487l92508k37914m57302k04609o0927k78958l92470
9175H391010k26444j76254j64225m9045j19938J6547k16341j82986O3226k63380
9165G072170l42498l49788O4736J78175l08816j97918j67133k4307j91388j35229
9155E598004j394j56787j47197l5033k02758j94350q2197j40159o688p4902j18776
9144D437763p4344k2165J04196k7710k54844j33678o277M6386p6875j51426o3054
9133C777972o4653j07541P435o3677k30064J26706J32419k35737j21500l8196
$$ plain form
9203 17541935 16867826 16263727 15848523 15192448 14772338 14488441 14361620 14214633 13858476
9194 13858476 13490418 12814284 12382552 12008938 11806444 11568440 11232468 11071252 10841369
9185 10841369 10609687 10601185 10415698 10023190 9785276 9327974 9123365 9062438 8783480 8391010
9175 8391010 8164566 7988312 7824087 7775042 7655104 7671651 7455310 7272324 7335550 7072170
9165 7072170 6729672 6379884 6444620 6622795 6313979 6116061 5948928 5924621 5733233 5598004
9155 5598004 5596610 5439823 5292626 5257593 5054835 4860485 4778288 4638129 4631441 4556539 4437763
9144 4437763 4363419 4341254 4445450 4417740 4162896 4029218 4022941 4069327 3992452 3841026 3777972
9133 3777972 3713319 3605778 3613213 3549536 3319472 3446178 3578597 3342860 3221360 3183164
9123C183164R4179O8517j05593j87021j02449k32560k30628N6949L7562P9997
9113B662117Q9394k13286j49972j2629M294J0556P8762J23555J25980j23423o5914
9102B529434m3263k22738n8934J5978j952q2241q3290j75779k00145L2171J63219
9091A872460L42m4085J3065j43346j51501p6208O920l3190L5784K5375j63746
9080A341870j25244J0571K8808K3750k1331L3603p8806P841J75023J06365k19005
9069A283445j54453J4820J09358N1898M4844r553k21714L812j93106j43176N2773
9058H38948j09176K7917J0282J09230K0838J47598J18236L3097q4757j80390K11831
9047A143654P3464l8140j10084p5739O818N8735j37762j81489j4142L2207O5464
$$ plain form
9123 3183164 3277343 3345860 3240267 3053246 2950797 2718237 2487609 2544558 2582120 2662117
9113 2662117 2751511 2538225 2388253 2375624 2379918 2390474 2469236 2592791 2718771 2595348 2529434
9102 2529434 2486171 2263433 2204499 2220477 2218525 2136284 2052994 1877215 1677070 1709241 1872460
9091 1872460 1872802 1828717 1841782 1698436 1546935 1470727 1477647 1444457 1480241 1505616 1341870
9080 1341870 1216626 1227197 1256005 1279755 1258424 1292027 1213221 1221062 1396085 1502450 1283445
9069 1283445 1128992 1143812 1253170 1305068 1349912 1340359 1118645 1122457 929351 786175 838948
9058 838948 729772 757689 767971 877201 898039 1045637 1163873 1196970 1112213 931823 1143654
9047 1143654 1217118 1178978 1068894 993155 999973 1058708 920946 739457 725315 757522 822986
9036H22986R9100Q723N9472J5730J44041j27342l696R685j55230N674J37143j91684
9024H24602j63705j82180J06974J23047Q8009j7250n9441K33885M4787l18997
9014F79731j29427L1766M3986o8456j9775n6392j3553J2464J19456j27270n7937
9003D14593J38878K4598M6951N6854p6837n2984J99072m2660l2590N3786J38986
8992H68647l5921j00008m9192P3508k81075k2882n618K39732K1901j6452Q6589
8981G79229k1982J0573j23976j04889J77746P2764n6618j65032j35666J7931J41035
8970E91115J0934o7247J4508L8032j57488J0365J68934j6098K3725l9694j65411
8959D11675j2327j04696Q4027P1135N8886Q7718j08238n3948q7328r1843O2373
$$ plain form
9036 822986 922086 930809 990281 1006011 1150052 1022710 1019014 1028699 873469 879143 1016286 824602
9024 824602 660897 478717 585691 708738 796747 779497 720056 953941 998728 679731
9014 679731 550304 582070 626056 557600 537825 481433 467880 480344 599800 472530 414593
9003 414593 553471 578069 625020 681874 605037 552053 751125 708465 675875 729661 868647
8992 868647 832726 732718 683526 757034 475959 453077 447459 687191 709092 692640 779229
8981 779229 757247 767820 643844 538955 716701 789465 732847 567815 432149 450080 591115
8970 591115 602049 534802 549310 587342 429854 440219 609153 593055 616780 577086 411675
8959 411675 399348 294652 378679 449814 508700 596418 488180 434232 346904 255061 317434
8948C17434L242n9464l4490J17864j10871O8238Q3086r1174L3123j92510j48631
8937a4153J77822J2589J92700n9997k7176J58765L6677o287Q0222K07162K7128
8926G85452j41751j21417j33726j85991j72005K3697q847l0267J24464o339k2531
8915A10739M405j82022R682M2397j41530n1977J83507J26354J17320J12526n9781
8904B71620q6662J9655J16697q5252J2084L858j87634l7941K58635N9935j36055
8893B08940q8698m3426j49447j71161J57888K40328J06737J56008R9151m8854
8883D67466k60933o7598J5610K1476J47104J34823j16642j23002R9474r6392l9784
8872A81602L1572j43139J47797K03199j38465r9830k13136n708o6122j9284J83959
$$ plain form
8948 317434 320676 261212 226722 344586 233715 301953 385039 293865 326988 134478 -14153
8937 -14153 163669 176258 368958 308961 281785 440550 477227 470940 551162 758324 785452
8926 785452 643701 522284 388558 202567 30562 54259 45412 15145 139609 133270 110739
8915 110739 115144 -66878 -57196 -14799 -156329 -208306 -24799 101555 218875 331401 271620
8904 271620 184958 204613 321310 236058 248142 252000 64366 26425 285060 344995 208940
8893 208940 120242 76816 -72631 -243792 -85904 154424 261161 417169 516320 467466
8883 467466 206533 138935 154545 176021 323125 457948 341306 218304 317778 221386 181602
8872 181602 213174 70035 217832 421031 282566 182736 -30400 -36108 -102230 -121514 62445
8861F2445K2875M9994L9315k9380J00246j8583k27971K4992m0935J04504K00410
8850B87912L21601j24596j69977J17832p201K09779L3846j03831j20606j0742
8840D34017p5354L6528l0449R037J41788P0280j78923k59724j24523l2703J20171
8829A10145m6605K42780P0737j2586L140P4974j57546j16073p3911k26976J45859
8818A3938J49679q8536P6819R3296L6466j45019j6835R5818q3498r7950j3270
8807B0908J08130k27885J5441J39904N4068j7155R0906j16357J82058J3647n2883
8796B10782O0173j03941j65422k6106j4650M1352Q9649K5339l7526O058J04150
8785A89858M9599K5138j63965p3143Q0834K00341n0785K4274O6164j62333j77975
$$ plain form
8861 62445 85320 135314 174629 145249 245495 226912 -1059 23933 -17002 87502 287912
8850 287912 609513 484917 314940 432772 425571 635350 669196 565365 444759 434017
8840 434017 358663 395191 364742 373779 515567 585847 406924 147200 22677 -10026 110145
8829 110145 63540 306320 377057 364471 367611 442585 285039 168966 95055 -131921 13938
8818 13938 163617 75081 151900 245196 281662 136643 119808 215626 132128 34178 20908
8807 20908 129038 -98847 -83406 56498 110566 93411 184317 67960 250018 263665 210782
8796 210782 270955 167014 1592 -24514 -39164 2188 91837 117176 79650 85708 189858
8785 189858 239457 264595 100630 27487 108321 308662 257877 282151 348315 185982 8007
8774H007j479J59002n9710j64552m2398K15284J22986q2162O7869l4975Q2457
8763B70329N7828R5410L3729N381k43954k94789K08929J85808K21743r9597k80999
8752A59818n2388K0127n7075n9655R9761J2827J84202K0423k85638j88447N4221
8741i1824L1597N2031P8367J07367J23019O0563l8698M7026Q7507J00779q8273
8730D69461j14667n8527l08004j78641K91128K21392k20981j29918n2083M0058
8720d0782k7316O1774M3122j2855r5843r8639J92073Q9039Q6920O5391p7105N2671
8708B38450M3178O1251o0166j50866k89957j56099K17400M3133l6643j31043J69041
8697e2321Q9578p6179M9359L5114j07974P1396j3223J00399K13357l8660m0744
$$ plain form
8774 8007 6528 165530 105820 -58732 -101130 114154 237140 154978 222847 187872 270329
8763 270329 328157 423567 457296 462677 218723 -76066 132863 318671 540414 440817 159818
8752 159818 107430 127557 70482 10827 110588 123415 307617 328040 42402 -146045 -91824
8741 -91824 -60227 -8196 70171 177538 300557 361120 322422 369448 456955 557734 469461
8730 469461 354794 296267 -11737 -190378 100750 322142 101161 -28757 -80840 -40782
8720 -40782 -68098 -6324 36798 23943 -71900 -170539 21534 110573 197493 262884 185779 238450
8708 238450 281628 342879 282713 131847 -158110 -314209 -96809 -53676 -90319 -221362 -52321
8697 -52321 37257 -38922 10437 45551 -62423 8973 -4250 96149 309506 270846 230102
8686B30102j1934k7355J32650M876J0436j79863j69274q2888M0869J74297K1485
8675A43401m1170n3797K6250n9737J63669L5654J83790j25928p7868l3762j0469
8664A50033L1931J54138k4376m5566l7906j96407j40507J33783K0736J94424J0792
8653B51075p5188j81219J86580J33847N5309n8298J23052N0363j69195k5897q6121
8642B04308q9906k6716n8490J37898R8891p0887N026O0242j9137r753O8014k2206
8630B77284n3310j33107r3046O2259p0551o1750Q8957J49260j00068N6957R601
8619A32486J2276j55382j21061k4147M6047j2824o6557J95102j57346O3488P508
8608h0410J98121J53812j02936n0675j73033j24660K75309K28858n4401j99113
$$ plain form
8686 230102 218168 190813 323463 328339 338775 158912 -10362 -93250 -52381 121916 143401
8675 143401 102231 48434 74684 14947 178616 214270 398060 272132 194264 160502 150033
8664 150033 181964 336102 311726 266160 228254 31847 -108660 25123 45859 240283 251075
8653 251075 175887 -5332 181248 315095 370404 312106 435158 485521 316326 290429 204308
8642 204308 114402 87686 29196 167094 265985 195098 200124 260366 241229 231476 299490 277284
8630 277284 223974 90867 -2179 60080 -10471 -72221 16736 165996 65928 122885 132486
8619 132486 144762 -10620 -131681 -155828 -109781 -122605 -189162 5940 -151406 -87918 -80410
8608 -80410 117711 271523 168587 117912 -55121 -179781 95528 324386 269985 70872
8598G0872p1552l6179o5219j31364q017R2259K83899J91091k31279j19080Q5995
8587F1426m559l8441M609J31013j06999j9991L4586M0328o8607j76700M5789J32274
8575C4728J48496q8951J55584K00382P1878q7066r0182j30899j26946j94414L7583
8564f9807O4005j92022j19825J94066R1903K14524J15019j57325r3887k65767
8554b19116p5224J75733R8906R0691r9565j31300N5235J34795n2900J6366O5282
8543E8903J7052K6620O1533k9036j11430k6403p730q3439j72590R2681J72684
8532a155J81505J11537j86927j18416n9944O2845Q6517M5008o064l5848k61395
8521a82337J04765J51638q645J29007K18528O9775k04353k10474J25660k6062
$$ plain form
8598 70872 -680 -36859 -102078 -233442 -241459 -149200 134699 325790 94511 -24569 61426
8587 61426 56867 18426 23035 154048 47049 27058 61644 101972 33365 -143335 -97546 34728
8575 34728 183224 94273 249857 450239 522117 435051 344869 213970 87024 -107390 -69807
8564 -69807 -5802 -197824 -317649 -123583 -31680 182844 297863 140538 46651 -219116
8554 -219116 -294340 -118607 -19701 70990 -28575 -159875 -104640 30155 -22745 -6379 58903
8543 58903 75955 102575 164108 135072 23642 -2761 -10491 -93930 -266520 -173839 -1155
8532 -1155 180350 291887 104960 -13456 -73400 -10555 75962 120970 114906 79058 -182337
8521 -182337 -77572 74066 65421 194428 412956 482731 278378 67904 193564 167502
8511A67502r6954J9167J99564L7366o7251N627k94741p3779N9170O7536q6308
8500f3101j18003J23785J43049k6594k35558O372K11695J93836o5643j10022j65694
8489a05878j02371K0483R6909m3161r1680J84766J45980r7730K5121R5000M1441
8478A68880j10713R253N5044l0049j84787J9440J58482O0317r211o9378p9307
8467a2029O4287K7842k6531J81993j45122j83745j5866P0286J29972J70161k15480
8456D5768L7186l0092j50166K6140J82937J31829k63140j24149J34454J5965M9005
8445E5737j724j13719M0041m5580J20410K58527R900p2812o2472j09156j3432
8434F5720k62026q4814J96211m9758j24551M7334J24774J15001n0991r4441P2822
$$ plain form
8511 167502 70548 89715 289279 326645 259394 265021 -29720 -103499 -44329 23207 -63101
8500 -63101 -181104 -57319 85730 59136 -176422 -170050 41645 235481 169838 59816 -105878
8489 -105878 -208249 -187766 -90857 -134018 -225698 -40932 105048 7318 32439 127439 168880
8478 168880 58167 67420 122464 92415 -92372 -72932 85550 145867 136656 67278 -12029
8467 -12029 52258 80100 53569 235562 90440 -93305 -109171 -38885 91087 261248 45768
8456 45768 82954 52862 -97304 -71164 111773 243602 -19538 -143687 -9233 6732 55737
8445 55737 54013 -59706 -19665 -65245 55165 313692 323592 250780 188308 79152 65720
8434 65720 -196306 -281120 -84909 -134667 -259218 -211884 -87110 27891 -23100 -117541 -44719
8423d4719N07J73914J6052J68510Q992O4373Q4502m9189P2512k21205l8927m5125
8411A90197k67628j48922k08874m2102J04726L11199J17788K4474m7140j41516
8401a07798J03993J66656K8643p3232j15719J04810J03978M7234J1885J3427N417
8390B89294k66720n0289J30771j96369j19578j51176P0317K29169l3538j0002
8380a08121J96092L12238r890L5980J8253j88744r9952j84551k37746L2274J66354
8369f7813P7350r0784r3579P9443J65646j19063k5279k967o5536J59453L4205
8358E1076p7707l659p2110r909n180m0827j32695j94548K86739J86998j0447o3038
8346h5307Q6771J11507j8507J15144n6438k54363j38522K07601L6415r3362k02796
$$ plain form
8423 -44719 -44212 129702 145754 314264 323256 387629 472131 422942 495454 274249 235322 190197
8411 190197 -77431 -226353 -435227 -477329 -372603 -61404 56384 80858 33718 -107798
8401 -107798 -3805 162851 191494 118262 2543 107353 211331 258565 270450 283877 289294
8390 289294 22574 -27715 103056 -93313 -212891 -364067 -293750 -64581 -98119 -108121
8380 -108121 87971 400209 390319 426299 444552 255808 155856 -28695 -266441 -234167 -67813
8369 -67813 9537 -81247 -174826 -95383 70263 -48800 -74079 -77046 -142582 16871 51076
8358 51076 -26631 -30290 -102400 -112309 -117489 -158316 -291011 -485559 -198820 -11822 -22269 -85307
8346 -85307 1464 112971 94464 209608 153170 -101193 -239715 -32114 4301 -89061 -291857
8335b91857l0363n3888M8235J24773J48523J69605K8723p483L2159J09340M3931
8324C21698j84362K4826p1640n1310O6072p9593j18424O2359R6892K4129J68969
8313B59616j4421j55999o4123m0704Q6846N3718R8176l5272n0087j49324l6580
8302d8154p7776m954J53767j08L5799k6699J81528q3023k5108j55024j31164n1198
8290b32114o3575k6745m8788J66418K61345M3507j52001o3609J88808r4727r837
8279c1318o2284k4185J88133J37930n1236j29718p3789J20664j9364J15770j23589
8268D7014N8593R58o036k47292R872l7350J75390R9860J18991j69031j77583K6400
8256a00214J16839q1519P0488L5181n9130P0078r0802R2635J44715J2185O8119
$$ plain form
8335 -291857 -322220 -376108 -327873 -203100 -54577 115028 143751 136268 168427 277767 321698
8324 321698 137336 162162 90522 39212 105284 25691 -92733 -30374 66518 90647 259616
8313 259616 245195 89196 25073 -15631 71215 124933 223109 187837 137750 -11574 -48154
8302 -48154 -125930 -130884 22883 22775 58574 31875 213403 130380 105272 -49752 -180916 -232114
8290 -232114 -295689 -322434 -371222 -204804 56541 100048 -51953 -115562 73246 -21481 -31318
8279 -31318 -93602 -117787 70346 208276 157040 27322 -46467 74197 54833 170603 47014
8268 47014 105607 106565 100529 -146763 -136891 -174241 1149 101009 220000 50969 -126614 -100214
8256 -100214 16625 -64894 5594 40775 -18355 51723 -39079 53556 198271 210456 278575
8245B78575m1543j68393j54236m5843J07639L3096L0333J44014k1721k22215r7765
8234a58059K63392R9601o5932k7413J06304M244o9265l26834l49642r2430K79854
8223c36180K90341J33292N0501N787j5932j56578k7947Q2594N4983j21260j86999
8212b27398M5370j11538r4086J15476K19939J27584J59887J8226n2851L6879n7729
8201A79759p8574j45761n0324K41923J92483M2868M6173p932j23016p8245k1562
8190A97792O0620Q2368K2745n4920O9739j80929L7241p3196k7512n8621O8957
8179A44284L51257r7024j77996j47956P0803R3503J93183J0571k1974k24260j56039
8168C8352j16457j14413l268J07419R0150K8318J71434M5477j54084j19954M5087
$$ plain form
8245 278575 237032 68639 -85597 -131440 -23801 9295 39628 183642 161921 -60294 -158059
8234 -158059 105333 204934 139002 111589 217893 222137 152872 -173962 -523604 -616034 -336180
8223 -336180 -45839 87453 137954 143741 127809 -28769 -56716 25878 80861 -40399 -227398
8212 -227398 -182028 -293566 -387652 -272176 -52237 75347 235234 253460 200609 237488 179759
8201 179759 101185 -44576 -94900 147023 339506 382374 428547 420615 297599 219354 197792
8190 197792 258412 340780 363525 308605 378344 197415 234656 161460 133948 75327 144284
8179 144284 495541 398517 220521 72565 143368 236871 430054 440625 418651 194391 38352
8168 38352 -78105 -192518 -195786 -88367 1783 30101 201535 247012 92928 -27026 18061
8157A8061M8094m4355J4986K4594M0298j0336r1738n9062J9665K54015J9987j23880
8145A10329j57906J0259J30760j97080j06030J20597K26795J37418n2198j80746
8135D2198p4474r3975p8379P9721K45752p4097j01022N9960l3008q865q5169n331
8123a26689L68870J06862p0185j32553l22987l4350R3832P2405n0285J12503l6411
8112a8988p8450j13629J38556J72256P826J5917M2331m345o3567j64879J7065
8101d9907J03824R9562J10082P4741k54680k0512P6968j0689J16570L1063r2348
8090A84674j47709j6203m4243k13643l2851K35377K11919j70045r0513m4647k70965
8079c98849p9498J02163J00852K03188K12869P2627p4369R0970K05247J9566j46339
$$ plain form
8157 18061 66155 21800 36786 61380 101678 91342 -396 -59458 -39793 214222 234209 110329
8145 110329 -47577 -37318 93442 -103638 -209668 -89071 137724 275142 222944 42198
8135 42198 -32276 -126251 -204630 -124909 120843 46746 -54276 5684 -27324 -36189 -121358 -126689
8123 -126689 242181 349043 278858 146305 -176682 -211032 -117200 -44795 -95080 17423 -18988
8112 -18988 -97438 -211067 -72511 99745 107571 123488 165819 161474 97907 -66972 -49907
8101 -49907 53917 153479 263561 338302 83622 63110 140078 129389 245959 277022 184674
8090 184674 36965 20762 -23481 -237124 -269975 -34598 177321 7276 -83237 -127884 -398849
8079 -398849 -478347 -376184 -275332 -72144 140725 213352 138983 229953 435200 454766 308427
8068C08427o8018r9417j66782k3395M4947M1932r580J79083r9987m9935p7099
8057a9824j21442P1045N6118K14802J38388P6163j28592K1229Q2391j95663k67119
8046g2504j40740M454K13009m2351j29699J06859o1943j21285K3684K00269M4121
8035B3874R4997J73572r2614j29135J07776N937j45250J11597J12895l9574R4381
8024C18456Q4251l3881L2393l0379n0887O5256l383k20468k91542n4257J01784
8013h2657N9402R8359k81577q400J55373j8116l37768M2200L45910K05794j00693
8002G7827p2282k4608J59056K15495K7659j31981j57351r6046M2605K2035l70
7991F2039K33570J08855n6606j74980j32682K0083p1505j32681J27902J59820
$$ plain form
8068 308427 240409 140992 -25790 -49185 -4238 37694 28114 207197 107210 57275 -19824
8057 -19824 -141266 -70221 -14103 200699 339087 415250 286658 307887 390278 194615 -72504
8046 -72504 -213244 -208790 4219 -38132 -167831 -60972 -122915 -244200 -220516 -20247 23874
8035 23874 118871 292443 199829 70694 178470 184407 39157 150754 263649 224075 318456
8024 318456 402707 368826 401219 370840 319953 385209 381826 161358 -130184 -184441 -82657
8013 -82657 -23255 75104 -206473 -214873 -59500 -77616 -415384 -373184 -27274 178520 77827
8002 77827 5545 -19063 139993 355488 383147 251166 93815 -2231 40374 62409 62039
7991 62039 295609 404464 347858 172878 40196 60279 -11226 -143907 -16005 143815
7981A43815N8368j06943l28455J86548K37027J04688L3630p9923J7839M3711j2128
7970B98177j68087j10006J6425J93320O1200j03188L1710M5473l5618j11679m7077
7959G0650j88222j27339J44867J59022K2687J24898R1687j36912j5782M7241K4298
7948B17095k74467m4528q1726N3628L53592K30445n8024j71268k50184k4823m023
7937e4283N954j61372j12025J09458Q1769K1485N3619n816k0747j6760o6752J6022
7925a49448j05406n0272p5874J56517J09496k3514P1450j6799j68614q4773M5389
7914b91848J9775K19385N6006N5857j2853j41293o8040J02080P920o0079j25527
7903b38617J02101J02810q5060m2377J50625k718m0400j22903O2373L09371J58660
$$ plain form
7981 143815 202183 95240 -233215 -46667 190360 295048 328678 248755 266594 310305 298177
7970 298177 130090 20084 36509 229829 291029 187841 219551 265024 229406 117727 70650
7959 70650 -117572 -244911 -100044 58978 81665 206563 298250 161338 145556 192797 217095
7948 217095 -57372 -101900 -183626 -129998 223594 454039 396015 224747 -25437 -50260 -54283
7937 -54283 -48329 -209701 -321726 -212268 -130499 -109014 -55395 -61211 -81958 -98718 -165470 -149448
7925 -149448 -254854 -305126 -381000 -224483 -114987 -138501 -67051 -83850 -252464 -337237 -291848
7914 -291848 -272073 -52688 3318 59175 46322 -94971 -163011 -60931 -53011 -113090 -238617
7903 -238617 -136516 -33706 -118766 -161143 -10518 -13236 -53636 -176539 -114166 195205 353865
7892C53865q4514K1105J01407k7938k88356j86698M7103J91639J06020j12675
7882A20958q2113k6433j8637Q8294J31372j22656q1841p2161p4791J33743J01174
7871I6909q6807k92102o4768O5733Q0527k4384L5248R1631J79489l3047p5976
7860b7547j77179J94639J82375n1105j48920M2440j6399p9465J70817j44127k19957
7849b74428J23396p490j73520P3316J75853J63536J09920p256n7355M1285o1200
7838A06057q5985Q2384k2177l7895n9978o5683k8519j89834K9668K71749J28032
7827A27819j29129J53084J04927J1466k53161Q3432J17408j16011P0661Q6354
7817B56850j56877j27738Q8836M3076m3925k0799j07580o4941l4450K19658J10098
$$ plain form
7892 353865 269351 290456 391863 363925 75569 -111129 -64026 127613 233633 120958
7882 120958 38845 12412 -6225 82069 213441 90785 8944 -63217 -138008 -4265 96909
7871 96909 10102 -282000 -346768 -281035 -200508 -224892 -189644 -98013 81476 48429 -27547
7860 -27547 -204726 -10087 172288 121183 -27737 14703 -1696 -81161 89656 -54471 -274428
7849 -274428 -151032 -158522 -332042 -258726 -82873 80663 190583 183327 125972 167257 106057
7838 106057 20072 102456 80279 42384 -17594 -83277 -111796 -301630 -271962 -213 127819
7827 127819 -1310 151774 256701 268167 15006 98438 215846 99835 170496 256850
7817 256850 99973 -27765 61071 104147 60222 39423 -68157 -133098 -167548 52110 162208
7806A62208j23717J48540m7875R2388o1393r2190l8913K60260j06192l13140j31565
7795b51589O9627K21172Q3108l24382k44270Q806L36553J56379k1580j36667O2555
7784d0288O2662o0480p4569M2678j26448l32687O6950M48499K38330K4542o7223
7773A81966j78383j12348J36738j20869k25260J51264K12135m4303k3137k84204
7763c06401p2937j0878K08411J59267J9800j02699m8305o5253N8508J41359J3610
7752e518l53068j50738M1594L29086K06238P5369O8825J30306j35401k79786j38255
7741b11348R8686p2411J49789k6089j42314K8189K13530J00940P9030K7729j07920
7730A37811m042O6365k0745p8210j13187L5689N1835q5364J5111Q0293j02808
$$ plain form
7806 162208 38491 187031 139156 231544 170151 77961 39048 299308 193116 -120024 -251589
7795 -251589 -181962 39210 122318 -202064 -446334 -437528 -100975 55404 33824 -102843 -40288
7784 -40288 22374 -38106 -112675 -69997 -196445 -529132 -462182 -13683 224647 249189 181966
7773 181966 3583 -108765 27973 -92896 -318156 -166892 45243 940 -22197 -306401
7763 -306401 -379338 -390216 -181805 -22538 -2738 -105437 -153742 -218995 -160487 -19128 -5518
7752 -5518 -358586 -509324 -467730 -138644 67594 142963 211788 342094 206693 -73093 -211348
7741 -211348 -112662 -185073 -35284 -61373 -203687 -175498 38032 138972 218002 245731 137811
7730 137811 133769 200134 179389 101179 -12008 23681 75516 -9848 5263 85556 -17252
7719a7252q1468K6305p7272o6532K5419o9839n2691p3932k6263K67096P1088K5905
7707d9436m247j90773P7321M3142l7080J07062K643R8535J6075J5524J19237j22331
7695G5672j53949J23388J10414J81637j00690k88023l4441l4648N6561K750P9292
7684A7963k2609P9812k08542j64444j40708J40431K25735O4860j32497o1925k8064
7673b29988j66375J60252N8142J1294J73872L4479j76917P784M7139K6171r8239
7662a52386O0187J73704J03294p2745j7713j3809k26204k02874l3066L2044P5292
7651b74276J90874O9158J73162j31895j05917Q6618j1220p3931J65201r020R816
7640H8570j12036p3310J63247J82133L485j77867k27635Q2008J98184J13056k3851
$$ plain form
7719 -17252 -98720 -72415 -149687 -216219 -190800 -260639 -313330 -387262 -413525 -146429 -75341 -49436
7707 -49436 -53683 -244456 -167135 -123993 -161073 -54011 -51368 47167 63242 78766 198003 75672
7695 75672 -78277 45111 155525 337162 236472 -51551 -85992 -120640 -64079 -61329 17963
7684 17963 -4646 75166 -133376 -297820 -438528 -298097 -72362 -7502 -139999 -201924 -229988
7673 -229988 -396363 -236111 -177969 -166675 7197 41676 -135241 -127457 -80318 -54147 -152386
7662 -152386 -92199 81505 184799 112054 94341 80532 -145672 -348546 -381612 -349568 -274276
7651 -274276 -83402 -14244 158918 27023 -78894 7724 -3496 -77427 87774 78754 88570
7640 88570 -23466 -96776 66471 248604 252089 74222 -153413 -71405 126779 239835 215984
7629B15984L3252k07954q4187J2522R504j63160m0960R6897J01990k3743P0334
7618B0479j81282j7814M10006J05503m2419j72870k28271J20664L25299l9434
7608B99861j14408n8426o6252L8598N6437J01178j40869q4079j23617m3761J15419
7597a9919J42956m7283k02482q025K208o6592J88483K11833j164k45275j38709
7586a83969P099l7793K8950l5525O8014l8620K7391j18067o2816o9119R7351R0310
7574b26794J34740R893j13501Q6081K39216J03964n9107K415N2014p4998k51050
7563i7127l7174R1242M920k7658J29795R2145j85779o5266P7409j04463j5227
7552a37183R8010j75963n0201J40045J69866Q6254P9188j14983j37251O1501j76237
$$ plain form
7629 215984 249236 41282 -42905 -30383 -20879 -184039 -224999 -128102 -26112 -49855 20479
7618 20479 -160803 -178617 231389 336892 294473 121603 -106668 13996 339295 299861
7608 299861 185453 127027 60775 99373 155810 256988 116119 32040 -91577 -135338 -19919
7597 -19919 123037 75754 -126728 -134753 -132545 -199137 -10654 201179 200015 -45260 -183969
7586 -183969 -176870 -214663 -185713 -221238 -153224 -191844 -164453 -282520 -345336 -414455 -317104 -226794
7574 -226794 -92054 -82161 -195662 -109581 129635 233599 174492 176907 228921 153923 -97127
7563 -97127 -134301 -43059 -38139 -65797 63998 156143 -29636 -94902 -17493 -121956 -137183
7552 -137183 -39173 -215136 -265337 -125292 44574 130828 210016 95033 -42218 19283 -156954
7541a56954j99015L9445J09355Q6180Q5021j07848Q1040o5776k95957L48L43171
7530h0990L20789j45958j26973j99157r3701M1538J55500K42323r1875j09326
7520h7830j5540j82709J03754L42966Q3671N7834J83033M0588k1586k02659j62311
7509A39211j63516O966J91329N3086l6522j8702j5635j6244M9333L8052k5219
7498B02139j19794k6821J11127j00652j9073m389j04988l2062o4609q8829R7507
7487a50444J63781p3335p5026L1599N6547J3555J04058k1588L2898j15593K8862
7476d686M2362J1925J7256M4914j45884n3859J20836l1928J26882O804k4237p7418
7464C2967l8182j70064L1126J01917j17359p0848m0022J47349M2062K43806J47919
$$ plain form
7541 -156954 -355969 -316524 -207169 -120989 -35968 -143816 -62776 -128552 -424509 -424161 -80990
7530 -80990 239799 93841 -33132 -232289 -325990 -284452 -128952 113371 21496 -87830
7520 -87830 -103370 -286079 -182325 160641 244312 302146 485179 525767 504181 301522 139211
7509 139211 -24305 -17339 173990 227076 190554 171852 156217 139973 189306 227358 202139
7498 202139 82345 55524 166651 65999 46926 42537 -62451 -94513 -159122 -247951 -150444
7487 -150444 13337 -59998 -135024 -103425 -46878 -33323 70735 49147 82045 -33548 -4686
7476 -4686 37676 49601 66857 111771 -34113 -87972 32864 936 127818 134622 110385 32967
7464 32967 -5215 -175279 -144153 -42236 -159595 -230443 -270465 -123116 -81054 162752 310671
7453C10671n8417P0631J3827j10431m04508j60812J8856K32673K02816J59398
7443B74704p5187l24484k6461J3993M8735J35469K26083J5701k85350n6080J51377
7432I8500J5662M71p6135p173p5077K2364J22625J22955j6846J0324n6421j88126
7420b6877n8707L7164K32016L8480j26629J00462K8286k33189p7489J2573m2365
7409a16275K03659p3302l5391l6609K56958m38j46872q4274m9447J2967N311q6025
7397a49738K6419k8668j16620j17337j34581j644K24086K65232K56074R8070k84238
7386C7055j20513j09407J0929R1870J08737K40586J5951j31845j08742P7649l7013
7375G5257o1838J81470m9839k5070l429m6240p3301J36758J31870k44684k17318
$$ plain form
7453 310671 252254 322885 336712 226281 -178227 -339039 -320183 -87510 115306 274704
7443 274704 199517 -124967 -151428 -137435 -88700 46769 272852 288553 3203 -52877 98500
7432 98500 114162 114633 38498 31325 -43752 -21388 101237 224192 207346 217670 161249 -26877
7420 -26877 -85584 -48420 183596 222076 95447 195909 224195 -8994 -86483 -73910 -116275
7409 -116275 87384 14082 -21309 -57918 199040 198602 51730 -32544 -81991 -69024 -63713 -149738
7397 -149738 -123319 -151987 -268607 -385944 -520525 -522169 -298083 -32851 223223 321293 37055
7386 37055 -83458 -192865 -181936 -90066 18671 259257 275208 143363 34621 112270 75257
7375 75257 13419 194889 145050 119980 116551 70311 -2990 133768 265638 20954 -196364
7364a96364j13059M2898J28252L96190K85751j25009j63385l35929k7741n9456
7354a67852n2894j46902K8599R5865l7783p415J93567Q3995j27465j04280K44103
7343A538K42173n0951l90549k33324L619L17158j17188j16829J51259j71958q7125
7332d52177J91023P3609q322k7729j57856J08018L94661P0174q0090N2109j1037
7321A52383l27141q0653R6972J13283N9557O027P4634K82418m2387p9013j11109
7310A44971j92561l01809j03981P7865K84932J17643k2534l4041j70809R4784
7300a05540M4210j908j14397j13989Q1062R6493R9613N6306L8723k62223j3703
7289a95353J8656n500M5720J52341P7377k20198q8215p1841M1484P3561J5455
$$ plain form
7364 -196364 -309423 -266525 -138273 257917 543668 418659 255274 -80655 -108396 -167852
7354 -167852 -220746 -367648 -339049 -243184 -280967 -288382 -94815 -10820 -138285 -242565 1538
7343 1538 243711 192760 -197789 -431113 -427494 -110336 -227524 -344353 -193094 -365052 -452177
7332 -452177 -261154 -187545 -195867 -223596 -381452 -273434 121227 191401 111311 163420 152383
7321 152383 -174758 -255411 -158439 -45156 14401 20428 95062 377480 335093 256080 144971
7310 144971 -47590 -349399 -453380 -375515 -90583 27060 4526 -29515 -200324 -105540
7300 -105540 -61330 -63238 -177635 -291624 -210562 -114069 -14456 41850 80573 -181650 -195353
7289 -195353 -176697 -182197 -136477 15864 93241 -126957 -215172 -287013 -245529 -171968 -156513
7278a56513j17954j96313p9370J78048K53517Q3620L0503Q1597q1559j10467k7364
7267a42255L7194r8199j46356J19029M5693M3019K1338j7979M2191j08577k29060
7256d33962K6311J68889j4139J03677J92108J50475p1922J35485N062J4880j53786
7245A23078j74414k8133k568L3729L13475P563n4370r8486j64028j1616p7695
7234a33465m3448k5920N6018J2204P216o132k8817J20594J11927l9614O7456J33531
7222B31550N7816j58487l57850j62110N7973J56555J08018j53170j36007L4972
7212c20740p2255N5602l3443J23828K21135J54610K8777O9501j49899o4103M3060
7201E6073n1156R6421J34936J03554k92777l883K7783j51400J1782j68132J2022
$$ plain form
7278 -156513 -274467 -470780 -550150 -372102 -118585 -34965 -4462 77135 -4424 -114891 -142255
7267 -142255 -105061 -203260 -349616 -230587 -184894 -141875 -120537 -138516 -96325 -204902 -433962
7256 -433962 -407651 -238762 -252901 -149224 42884 193359 121437 256922 261984 276864 123078
7245 123078 -51336 -79469 -82037 -48308 265167 272730 218360 119874 -44154 -55770 -133465
7234 -133465 -176913 -202833 -146815 -134611 -127395 -133527 -162344 -41750 70177 30563 98019 231550
7222 231550 289366 130879 -226971 -389081 -331108 -174553 -66535 -219705 -355712 -320740
7212 -320740 -392995 -337393 -370836 -247008 -25873 128737 157514 227015 77116 13013 56073
7201 56073 4917 101338 236274 339828 47051 43168 70951 -80449 -68667 -236799 -224777
7190b24777J05817Q0694P1828q3411j51324n9767K39145K61986l7636j16034q4008
7179B513L42826M4134R7133L6043m0756j40069j04196j13530k96726K111J60864
7168i653Q6607K004M8452j09147p405J65589Q305j26038J04859j01741j70203
7157a08371l6324q0398p342R6456J18368J03851j09055r0518K48109j9768Q6997
7146B02005j19869m7906N0612j07739J50432J60075k320j78350j79589N4221N3288
7135C4860J1003l5855j34500j41779N1200J06961J55025N7098R568j15240j26558
7124a28217j18805N7873J24308p053M1644J60881p3668j35722j15760N8196p887
7113a44210J71296L08483N4463m7702l37339k91958k55284o063l3117N5971J11641
$$ plain form
7190 -224777 -118960 -38266 33562 -49849 -201173 -260940 -21795 240191 202555 86521 2513
7179 2513 345339 389473 486606 522649 481893 341824 237628 124098 -172628 -170517 -9653
7168 -9653 76954 78958 127410 18263 10858 176447 184752 58714 163573 61832 -108371
7157 -108371 -144695 -225093 -232435 -135979 -17611 86240 -22815 -113333 134776 115008 202005
7146 202005 82136 34230 84842 -22897 127535 287610 285290 106940 -72649 -18428 34860
7135 34860 45863 10008 -124492 -266271 -215071 -108110 46915 104013 113581 -1659 -128217
7124 -128217 -247022 -189149 -64841 -71894 -30250 130631 56963 -78759 -194519 -136323 -144210
7113 -144210 27086 335569 390032 342330 4991 -286967 -542251 -548314 -581431 -525460 -413819
7102d13819O9929p5821j81574N8791N0514J44640J54877j025K36909J05475j27464
7091B1432n4199K3417Q3737L2829j06370O2835J49737j12244n4720q8016j20080
7080a61642j33755R5268J92108L7191k8683J49339J67428q6494q2959L4156j17864
7069F4093n9304k7407K3623k69106P9267K24892P6218M2531q1295N9917J31117
7058B64546j70275m3455p5358j43050l5614j29064p9355J24836J62944J95271
7048G1426j60133j58346M5080J5566J6338Q8437J46043P9924j82198n989k2280
7037f6132j18343J17967J43768o4101j19865j04886j9191l0910J49927k0135m642
7026a36543J44361L4729O8931p0115k04177l6072q4835m0904J00858J40854m7363
$$ plain form
7102 -413819 -343890 -419711 -601285 -542494 -491980 -347340 -192463 -193488 43421 148896 21432
7091 21432 -32767 -9350 74387 107216 846 63681 213418 101174 46454 -41562 -161642
7080 -161642 -295397 -200129 -8021 29170 487 149826 317254 230760 147801 181957 64093
7069 64093 4789 -22618 1005 -268101 -188834 36058 112276 154807 73512 133429 264546
7058 264546 94271 50816 -24542 -167592 -203206 -332270 -411625 -286789 -123845 71426
7048 71426 -88707 -247053 -201973 -186407 -170069 -81632 64411 144335 -37863 -43852 -66132
7037 -66132 -184475 -66508 77260 13159 -106706 -211592 -230783 -261693 -111766 -131901 -136543
7026 -136543 7818 42547 111478 41363 -162814 -198886 -283721 -324625 -223767 -82913 -130276
7015a30276m773J25288p1219N1473o6308K46406J090l5660L3459K8685k31467
7004e3302j43400L427J02883J28939O5836r4071j61584j35684n5957L4175o8576
6993c77314j51839K34411K08990l3398k98457n3561j05664K65681K50468l2323
6983i3006m8210j21497J05620J80045J05397p3401j45030j05344k06942R7046
6973c05322K64980j6942m4334k3476R3855l3178j21206J00006P6943L7475r9780
6962g0979j938J58325L6389R0398j26513J19199K00953j46474k13307N6103m5233
6951E6923k41468N9383K7592l6115R4042J69436N7989L9655M1682q5776j87685
6940d342j48804n3693k0910Q2109o8920q8897J29928J14789o7255K12930l0828
$$ plain form
7015 -130276 -135049 -9761 -80980 -29507 -95815 150591 151681 116021 149480 178165 -53302
7004 -53302 -196702 -193275 -90392 38547 104383 10312 -151272 -286956 -342913 -308738 -377314
6993 -377314 -529153 -294742 -85752 -119150 -417607 -471168 -576832 -311151 -60683 -93006
6983 -93006 -141216 -262713 -157093 22952 128349 54948 -90082 -195426 -402368 -305322
6973 -305322 -40342 -57284 -101618 -125094 -31239 -64417 -185623 -85617 -8674 28801 -70979
6962 -70979 -72917 85408 121797 212195 85682 204881 405834 259360 46053 102156 56923
6951 56923 -184545 -125162 -97570 -133685 -39643 129793 187782 227437 269119 183343 -4342
6940 -4342 -153146 -206839 -227749 -145640 -214560 -303457 -173529 -58740 -125995 86935 56107
6929E6107M1525J87008o9459k64145j08814N7927M5534L3224k695o2729j84064
6918b70581K0858J27994K7509J48247J6324j38045N7800L7902k5798M7945n4169
6907d014m3897j6233k6366M0670L9403r5534j35069R5118J32716K9413J2370j02200
6895g3623p6241Q7026K35839K02257q4248k23903m0887J48545J00797n3740p9292
6884A42530m8511p0033q571j95743k80686J72111N4546k4306j13362j02947K44426
6873b30546K71293J15677j13143P2922p8058n169k49326n2358J61519q4795J71291
6862b0693J06448q8764J23043l1895n7733J71124o8820r2244n2465j01275P173
6851a06101N1264P6884p0020k0416N7507m9477j05124j3912J9664o8824n4489
$$ plain form
6929 56107 97632 284640 215181 -48964 -157778 -99851 -54317 -21093 -23788 -86517 -270581
6918 -270581 -249723 -121729 -94220 54027 70351 -67694 -9894 28008 2210 50155 -4014
6907 -4014 -47911 -64144 -90510 -49840 -10437 -105971 -241040 -145922 -13206 16207 28577 -73623
6895 -73623 -149864 -62838 173001 375258 291010 67107 26220 174765 275562 221822 142530
6884 142530 94019 23986 15415 -180328 -461014 -288903 -234357 -258663 -372025 -474972 -230546
6873 -230546 40747 156424 43281 116203 38145 32976 -216350 -268708 -107189 -191984 -20693
6862 -20693 85755 -3009 120034 88139 30406 201530 132710 40466 -11999 -113274 -106101
6851 -106101 -54837 22047 -47973 -68389 -10882 -60359 -165483 -179395 -159731 -228555 -283044
6840b83044n0858J37753K60707O1781j99152j43844M5535J51950o7233r4731j31574
6829c12710l7800J01852K1233J72884Q7904m4638j00992j82406O7001J37217J38680
6818D8225k38252O0604k7990q9809k62466J4668N0783J06465j58606j01548J35982
6807d61944J5954J65751K06289O6124j27460K55580J72766M8155j00870r6155
6797A44190K7130m6555R755r7576o5197p2293j01052R094J7849J60400P2795J29767
6785A88307k366j43970l6866j71158o0024M4776R8998k1818q180M3470n7445q5998
6773b12274Q4854J89279o440m3171l2709M0742j93368j15754j07185J07966K36223
6762e1837m8068k05809J6647K3148O0232K82041O259p0181j19427K5155L4363
$$ plain form
6840 -283044 -333902 -196149 64558 126339 -72813 -216657 -171122 -19172 -86405 -181136 -312710
6829 -312710 -350510 -248658 -227425 -54541 33363 -11275 -112267 -294673 -227672 -90455 48225
6818 48225 -190027 -129423 -157413 -247222 -509688 -495020 -444237 -337772 -496378 -597926 -461944
6807 -461944 -445990 -280239 -73950 -7826 -135286 120294 293060 341215 240345 144190
6797 144190 171320 124765 134520 36944 -28253 -100546 -201598 -192504 -174655 -14255 58540 188307
6785 188307 185941 41971 5105 -166053 -226077 -181301 -82303 -104121 -112301 -68831 -126276 -212274
6773 -212274 -127420 61859 55419 12248 -20461 20281 -173087 -288841 -396026 -288060 -51837
6762 -51837 -99905 -305714 -289067 -265919 -205687 76354 82613 12432 -106995 -81840 -47477
6751d7477j80070k1572J16170M2800O3651O5690J83581L5216k80761J1263N7879
6740D6370j76442j16415p0808J64205p0401Q3551k1870l5267p2750m8164J20648
6729a97343J61286n9114o1627K1527k7910J03240L157j20978P4606J62677j07252
6718d7731L5044J10469J92238J9602k72977N4708J12142o5168j5874m4841m6579
6707C1033m6580j2908Q8605q4185j33005n2407k09041q9967L9943J44226J42710
6696a81576J4237Q063J01075O9130k18121k13960O2556J35135m5847q0685L2956
6685c17037l8935R4226P4851J06024O7897O1985J27396J9523j09028k83467j08645
6674c05210L41470K63871k34649j39449p9027j20174O0270R2073o7612q7276j11438
$$ plain form
6751 -47477 -227547 -249119 -132949 -90149 -26498 39192 222773 257989 -22772 -11509 46370
6740 46370 -130072 -246487 -317295 -153090 -223491 -139940 -161810 -197077 -269827 -317991 -197343
6729 -197343 -36057 -95171 -156798 -135271 -163181 -59941 -56784 -177762 -103156 59521 -47731
6718 -47731 -12687 97782 290020 309622 36645 91353 203495 138327 122453 77612 31033
6707 31033 -15547 -28455 60150 -24035 -157040 -209447 -418488 -508455 -468512 -324286 -181576
6696 -181576 -167339 -159276 -58201 10929 -207192 -421152 -358596 -223461 -269308 -349993 -317037
6685 -317037 -355972 -261746 -186895 -80871 -12974 49011 176407 195930 86902 -196565 -305210
6674 -305210 36260 300131 65482 -73967 -152994 -273168 -212898 -120825 -188437 -275713 -387151
6663c87151J26072J85246O5715l0875Q7453J76465k21372l9408p5575j83336K30478
6652f6288P9646k788L3543L7266k30j97941j32666J35347R0017k0040j20413p500
6640a72047p7185K12057J90285j11424J2066k8319L628R4529j45287j62170J52211
6629c1656Q1348J3456j5344q111M49J8640N0488l7124m7524K9800N3464J19260
6617B27146M5574J13925j26483j72580l04746J38683J27873j0496n6164p822J13618
6606H8528O7752M848m5800j61860J2082n0709J54470J78736k93452j88210J20159
6595a13456J08163k6370p3920L0122N5089l1650O0970k8798m02747j69214K19019
6584c72792J54935p602k0411K55434q4844q9950M6862O7610o7775L8872K12380
$$ plain form
6663 -387151 -261079 -75833 -10118 -40993 46460 222925 1553 -37855 -113430 -296766 -66288
6652 -66288 13358 10570 44113 81379 81149 -116792 -249458 -114111 -24094 -44134 -164547 -172047
6640 -172047 -249232 -37175 153110 41686 53752 25433 29061 123590 -21697 -183867 -31656
6629 -31656 49692 63148 47804 39693 40142 58782 109270 72146 24622 54422 107886 227146
6617 227146 272720 386645 260162 87582 -217164 -78481 49392 38896 -17268 -25090 88528
6606 88528 156280 161128 115328 -46532 -34450 -85159 69311 248047 -45405 -233615 -113456
6595 -113456 -5293 -31663 -105583 -75461 -20372 -52022 8948 -19850 -422597 -591811 -372792
6584 -372792 -217857 -225459 -245870 9564 -75280 -165230 -118368 -50758 -118533 -79661 132719
6573A32719R0131k64570j87173J91517J26787J709k55733j19213j4307K7516P9882
6562a90735j04693Q4111J32873l6719k2386J4056J9565j60590K0547N5433J34787
6551e3751J39958J3565L0978j14231K8376O6895P3152j23058k04701L02052J10459
6540B69694k40708k53475n3086J62682k75892O6029K91427J96623n7722r8428
6530G144j59070j4163k2072J83522Q1303r9878j49423K9385L0803K7321r6307
6519a81435J14241p2906m2871k4960k836M1725O4855k7356m0301P2985k0762M9526
6507g0095J83301J2891j22077o2922K56392J34448k26087j38298K2602r1498p1076
6496a72419j23712P8736J08719l9717p1980O4932j6968r727o9405r7888J33365
$$ plain form
6573 132719 222850 -41720 -228893 -37376 89411 91120 -164613 -283826 -298133 -270617 -190735
6562 -190735 -295428 -211317 -78444 -115163 -137549 -123493 -103928 -264518 -243971 -188538 -53751
6551 -53751 86207 99772 130750 16519 44895 111790 184942 61884 -142817 159235 269694
6540 269694 28986 -224489 -277575 -114893 -390785 -324756 -33329 163294 105572 7144
6530 7144 -151926 -166089 -188161 -4639 76664 -23214 -172637 -143252 -112449 -85128 -181435
6519 -181435 -67194 -140100 -182971 -207931 -210767 -169042 -104187 -131543 -171844 -98859 -119621 -70095
6507 -70095 113206 126097 4020 -58902 197490 331938 105851 -32447 -9845 -101343 -172419
6496 -172419 -296131 -217395 -108676 -148393 -220373 -155441 -172409 -182136 -251541 -349429 -216064
6485b16064K08087K8737j04146j05251J9392R9988j20766j80834L8586J60308
6475a71963Q312p8811M8090M6129j49087J0155J86482j85863O2274p005K21290
6464i997k6443j6177j6019l874J2428j00477j16196J9182K72150J29524R5668
6453B39769j95665k0093k8127r1566k6894q1495O5272J89604l6289j87919L5063
6442a38340j032q4504P1050j15399o9962Q2835L001J69459m9131l170m3202j2773
6430a91168N6349j70714j61764J60272Q5309n0717j22401K7414J94314R1231q220
6419i0095r1053r6981k0717K00819J72692j42008j30715N3372m8386j97642J37668
6408b53046m2724J30533K06433J17505j70767k94177J16572L03365J48429l1282
$$ plain form
6485 -216064 -7977 20760 -83386 -188637 -169245 -69257 -190023 -370857 -332271 -171963
6475 -171963 -163651 -242462 -194372 -148243 -297330 -287175 -100693 -286556 -224282 -231287 -9997
6464 -9997 -36440 -52617 -68636 -72510 -60082 -160559 -276755 -257573 14577 144101 239769
6453 239769 44104 24011 -4116 -95682 -122576 -204071 -138799 50805 14516 -173403 -138340
6442 -138340 -139372 -223876 -152826 -268225 -338187 -255352 -252351 -82892 -132023 -135193 -178395 -191168
6430 -191168 -134819 -305533 -467297 -307025 -221716 -272433 -394834 -367420 -173106 -81875 -90095
6419 -90095 -181148 -278129 -298846 -98027 74665 -67343 -198058 -144686 -193072 -390714 -253046
6408 -253046 -295770 -165237 41196 158701 -12066 -306243 -189671 113694 262123 230841
6398B30841j61888j07318n8419p1099j91202J27365J12020j4808j45178j20146
6388c99832Q1378J00415J85837O2017j85854k02978J37284J38652J22286Q9677
6378A28882J48530l25495p8909K07622l6340P0662m8899J89971n4572k31907k63632
6367b94087j1296R4662K2139L7330J51252J36352q5084p2356p2359k1021r9773
6356b14241K3436j01806m6009J86451l6207J6046J35275J73792j32960J2349L78968
6345C95094p3060k83203j92492K02500J05581j30220m9768p6269l2669O8170K2009
6334d4327n2228O2812k36725j72269L8788O6229k5255J57923O8536Q7982K24330
6323A75796n5398q0486j25875k3218J46270j13683j82379Q4819O3424M2878q1598
$$ plain form
6398 230841 68953 -38365 -96784 -167883 -359085 -231720 -119700 -134508 -279686 -399832
6388 -399832 -318454 -218039 -32202 29815 -156039 -359017 -221733 -83081 39205 128882
6378 128882 277412 -48083 -126992 80630 44290 114952 66053 256024 201452 -30455 -294087
6367 -294087 -305383 -210721 -188582 -151252 0 136352 51268 -21088 -93447 -114468 -214241
6356 -214241 -190805 -292611 -338620 -152169 -188376 -172330 -37055 136737 3777 16126 395094
6345 395094 322034 38831 -153661 48839 154420 24200 -25568 -101837 -134506 -66336 -44327
6334 -44327 -96555 -33743 -270468 -442737 -403949 -337720 -362975 -205052 -136516 -48534 175796
6323 175796 120398 39912 -85963 -109181 37089 -76594 -258973 -174154 -110730 -67852 -149450
6312a49450q2755j6590J25843J73138o9774J25480L0650n2760j30735Q7029M9674
6301H9750j07931L3475J24557N648j2151p5278j56611J88909J54428m3701L6706
6290B37801q386k60507j85505J72770P5945J50772k9512j71151j61884n4692j15195
6279c49544j82169J89092K54712r4781k47981j31624L2290J26179J85219o7878
6269b86485q4170J50982J77381K01523L8544j94657p0546M2166j346k56151Q1835
6258b00924P7360O8677j23294N6374N827j28827l2446N1848K27928J01908M9775
$$ plain form
6312 -149450 -232205 -248795 -122952 50186 -19588 105892 136542 83782 -46953 40076 89750
6301 89750 -18181 15294 139851 145499 133348 58070 -98541 90368 244796 201095 237801
6290 237801 229415 -31092 -216597 -43827 32118 182890 153378 -17773 -179657 -234349 -349544
6279 -349544 -531713 -342621 -87909 -182690 -430671 -562295 -530005 -403826 -218607 -286485
6269 -286485 -370655 -219673 -42292 159231 197775 3118 -67428 -25262 -26608 -282759 -200924
6258 -200924 -123564 -54887 -178181 -121807 -115980 -244807 -277253 -225405 2523 104431 154206
$$ [...]
##END NTUPLES=NMR SPECTRUM
##END=
