##TITLE=Analysis number 322441
Compound Code nrb 00889
Project Code adrs
Chemist Name cyclan
##JCAMPDX= 6.0         $$ Bruker NMR JCAMP-DX V2.0
##DATA TYPE= NMR SPECTRUM
##DATA CLASS= NTUPLES
##ORIGIN= Bruker BioSpin GmbH
##OWNER= nmr
$$ XWIN-NMR		Version 3.5
$$ Tue Sep 26 13:52:30 2006 GMT Daylight Time (UT+1h)  MAYBRIDGE\nmr@NMR_250MHZ
##.OBSERVE FREQUENCY= 250.131544655141
##.OBSERVE NUCLEUS= ^1H
##.ACQUISITION MODE= SIMULTANEOUS (DQD)
##.ACQUISITION SCHEME= undefined
##.AVERAGES= 16
##.DIGITISER RES= 18
##SPECTROMETER/DATA SYSTEM= dpx250
##.PULSE SEQUENCE= zg30
##.SOLVENT NAME= CDCl3
##.SHIFT REFERENCE= (INTERNAL, CDCl3, 0, 16.522)
##AUDIT TRAIL= $$ (NUMBER, WHEN, WHO, WHERE, WHAT)
$$ ##TITLE= Audit trail, XWIN-NMR		Version 3.5
$$ ##JCAMPDX= 5.01
$$ ##ORIGIN= Bruker BioSpin GmbH
$$ ##OWNER= nmr
$$ C:\u/data/dgb/nmr/ADRS/1380/pdata/1/auditp.txt
$$ ##AUDIT TRAIL=  $$ (NUMBER, WHEN, WHO, WHERE, WHAT)
(   1,<2006-09-26 13:52:02.91 +100>,<MAYBRIDGE\nmr>,<NMR_250MHZ>,
      <created by zg, POWCHK disabled, PULCHK disabled
       configuration hash MD5:
       E2 DF 36 D8 04 B2 41 60 5A D7 A3 38 5A 4B D0 FE
       data hash MD5: 64K
       94 81 A4 DA 4B FE 53 E7 8B EB 14 64 1F 24 72 F5>)
(   2,<2006-09-26 13:52:19.32 +100>,<MAYBRIDGE\nmr>,<NMR_250MHZ>,
      <Start of raw data processing
       ef LB = 0.3 FT_mod = 6 PKNL = 1 SI = 32K 
       data hash MD5: 32K
       82 EE A6 8B 2F B1 A8 C5 74 57 39 2F C5 23 2B 27>)
(   3,<2006-09-26 13:52:20.90 +100>,<MAYBRIDGE\nmr>,<NMR_250MHZ>,
      <apk 
       data hash MD5: 32K
       45 20 BD 70 C6 03 66 5B B5 BD 35 8B 80 C5 72 60>)
(   4,<2006-09-26 13:52:21.69 +100>,<MAYBRIDGE\nmr>,<NMR_250MHZ>,
      <abs ABSG = 5 
       data hash MD5: 32K
       54 EB 41 FA 5C 01 F5 B9 EC 42 D7 E5 6F 7C 59 78>)
$$ ##END=
$$ 
$$ hash MD5
$$ B7 B1 DB 4B B1 E2 AC 50 1B 29 3C 36 24 D1 AC 9B
##$RELAX= 
##$RELAX= 
##$RELAX= 
##$RELAX= 
##$RELAX= 
##$RELAX= 
##$RELAX= 
$$ Bruker specific parameters
$$ --------------------------
##$DU= <C:\u>
##$EXPNO= 1380
##$NAME= <ADRS>
##$PROCNO= 1
##$TYPE= <nmr>
##$USER= <dgb>
##$AMP= (0..31)
100 100 100 100 100 100 100 100 100 100 100 100 100 100 100 100 100 100 
100 100 100 100 100 100 100 100 100 100 100 100 100 100 
##$AQSEQ= 0
##$AQ_mod= 3
##$AUNM= <au_zg>
##$AUTOPOS= <36 >
##$BF1= 250.13
##$BF2= 250.13
##$BF3= 250.13
##$BF4= 250.13
##$BF5= 500.13
##$BF6= 500.13
##$BF7= 500.13
##$BF8= 500.13
##$BYTORDA= 1
##$CFDGTYP= 0
##$CFRGTYP= 5
##$CHEMSTR= <none>
##$CNST= (0..31)
1 1 145 1 1 1 1 1 1 1 1 1 1 1 1 1 1 1 1 1 1 1 1 1 1 1 1 1 1 1 1 1 
##$CPDPRG= <>
##$CPDPRG1= <>
##$CPDPRG2= <>
##$CPDPRG3= <>
##$CPDPRG4= <mlev>
##$CPDPRG5= <mlev>
##$CPDPRG6= <mlev>
##$CPDPRG7= <mlev>
##$CPDPRG8= <mlev>
##$CPDPRGB= <>
##$CPDPRGT= <>
##$D= (0..31)
0 1 0 0 0 0 0 0 0 0.06 0 0 0 0 0 0 0.0002 0 0 0 0 0 0 0 0 0 0 0 0 0 0 
0 
##$DATE= 1159275121
##$DBL= (0..7)
120 120 120 120 120 120 120 120 
##$DBP= (0..7)
150 150 150 150 150 150 150 150 
##$DBP07= 0
##$DBPNAM0= <>
##$DBPNAM1= <>
##$DBPNAM2= <>
$$ [...]
##$SUBNAM7= <"">
##$SUBNAM8= <"">
##$SUBNAM9= <"">
##$SW= 20.6930455092707
##$SWIBOX= (0..15)
0 0 3 0 0 0 0 0 0 0 0 0 0 0 0 0 
##$SW_h= 5175.983436853
##$TD= 65536
##$TD0= 1
##$TE= 296.16
##$TE2= 300
##$TE3= 300
##$TEG= 300
##$TL= (0..7)
0 120 120 120 120 120 120 120 
##$TP= (0..7)
150 150 150 150 150 150 150 150 
##$TP07= 0
##$TPNAME0= <>
##$TPNAME1= <>
##$TPNAME2= <>
##$TPNAME3= <>
##$TPNAME4= <>
##$TPNAME5= <>
##$TPNAME6= <>
##$TPNAME7= <>
##$TPOAL= (0..7)
0.5 0.5 0.5 0.5 0.5 0.5 0.5 0.5 
##$TPOFFS= (0..7)
0 0 0 0 0 0 0 0 
##$TUNHIN= 0
##$TUNHOUT= 0
##$TUNXOUT= 0
##$USERA1= <user>
##$USERA2= <user>
##$USERA3= <user>
##$USERA4= <user>
##$USERA5= <user>
##$V9= 5
##$VALIST= <valist>
##$VCLIST= <CCCCCCCCCCCCCCC>
##$VD= 0
##$VDLIST= <DDDDDDDDDDDDDDD>
##$VPLIST= <PPPPPPPPPPPPPPP>
##$VTLIST= <TTTTTTTTTTTTTTT>
##$WBST= 1024
##$WBSW= 4
##$XGAIN= (0..3)
0 0 0 0 
##$XL= 0
##$YL= 0
##$YMAX_a= 398042
##$YMIN_a= -554934
##$ZGOPTNS= <>
##$ZL1= 120
##$ZL2= 120
##$ZL3= 120
##$ZL4= 120
##$ABSF1= 16.522
##$ABSF2= -4.171173
##$ABSG= 5
##$ABSL= 3
##$ALPHA= 0
##$AQORDER= 0
##$ASSFAC= 0
##$ASSFACI= 0
##$ASSFACX= 0
##$ASSWID= 0
##$AUNMP= <proc_1d>
##$AZFE= 0.1
##$AZFW= 0.1
##$BCFW= 0
##$BC_mod= 0
##$BYTORDP= 0
##$COROFFS= 0
##$CY= 12.5
##$DATMOD= 1
##$DC= 0
##$DFILT= <>
##$DTYPP= 0
##$F1P= 14.0000005364418
##$F2P= -0.99999901652339
##$FCOR= 0.5
##$FTSIZE= 32768
##$FT_mod= 6
##$GAMMA= 0
##$GB= 0
##$INTBC= 1
##$INTSCL= 1
##$ISEN= 128
##$LB= 0.3
##$LEV0= 0
##$LPBIN= 0
##$MAXI= 10000
##$MC2= 0
##$MEAN= 0
##$ME_mod= 0
##$MI= 0
##$NCOEF= 0
##$NC_proc= -5
##$NLEV= 6
##$NOISF1= 0
##$NOISF2= 0
##$NSP= 0
##$NTH_PI= 0
##$NZP= 0
##$OFFSET= 16.522
##$PC= 1
##$PHC0= 153.4231
##$PHC1= 6.336833
##$PH_mod= 1
##$PKNL= yes
##$PPARMOD= 0
##$PSCAL= 4
##$PSIGN= 0
##$REVERSE= no
##$SF= 250.13
##$SI= 32768
##$SIGF1= 0
##$SIGF2= 0
##$SINO= 400
##$SIOLD= 32768
##$SREGLST= <1H.CDCl3>
##$SSB= 0
##$STSI= 32768
##$STSR= 0
##$SW_p= 5175.98343685301
##$SYMM= 0
##$S_DEV= 0
##$TDeff= 65536
##$TDoff= 0
##$TI= <Analysis number 999999
Compound Code 99
Book Reference 9
Project Code 9>
##$TILT= no
##$TM1= 0
##$TM2= 0
##$TOPLEV= 0
##$USERP1= <user>
##$USERP2= <user>
##$USERP3= <user>
##$USERP4= <user>
##$USERP5= <user>
##$WDW= 1
##$XDIM= 32768
##$YMAX_p= 430264221
##$YMIN_p= -815776
$$ End of Bruker specific parameters
$$ ---------------------------------
##NTUPLES= NMR SPECTRUM
##VAR_NAME=  FREQUENCY,     SPECTRUM/REAL,   SPECTRUM/IMAG
##SYMBOL=    X,             R,               I
##VAR_TYPE=  INDEPENDENT,   DEPENDENT,       DEPENDENT
##VAR_FORM=  AFFN,          ASDF,            ASDF
##VAR_DIM=   32768,         32768,           32768
##UNITS=     HZ,            ARBITRARY UNITS, ARBITRARY UNITS
##FACTOR=    0.157963299565203, 1,           1
##FIRST=     4132.6476996994, 0,             0
##LAST=      -1043.33573715361, 0,           0
##MIN=       -1043.33573715361, -815776,     0
##MAX=       4132.6476996994, 430264221,     0
$$ Real data points
##PAGE= N=1
##DATA TABLE= (X++(R..R)), XYDATA
$$ [...]
18412i5814j04617K34288L6099n5646m4899k43456k95521M8547j9520O9517J84187
18401b86835J57994K12969Q7431k16842m3744Q2632P663k44000j90613p5017K87860
18390b20502J70289l954J94841J52791j44543r8234l379J25450k15324j96261
18380b38826m0851J48506J98927j67519K02449p4677m0765L1897j65491j89992
18370c36342m053K00317J32575L8257Q307k19282n1576P2668K67587J35805p4218
18359A70045k313j68773r2119O1025o1334k83175l4263L37511K71745k1161j89646
18348a2458q1343L7552R4452k7880O3536q5659j45198K2874J22933l6661k24428
18337b72280j27414r266J58227M6604J00308L0500r181P6806O6216l11428j87881
$$ plain form
18412 -95814 -200431 33857 69956 14310 -30589 -274045 -569566 -521019 -540539 -471022 -286835
18401 -286835 -128841 84128 171559 -45283 -89027 -6395 1268 -242732 -433345 -508362 -220502
18390 -220502 -50213 -54167 140674 293465 148922 50688 47309 172759 -42565 -238826
18380 -238826 -279677 -131171 67756 -99763 102686 28009 -12756 19141 -146350 -336342
18370 -336342 -340395 -140078 -7503 30754 39061 -180221 -231797 -159129 108458 244263 170045
18359 170045 167732 -1041 -93160 -32135 -93469 -376644 -410907 -73396 198349 177188 -12458
18348 -12458 -93801 -56249 38203 10323 73859 -11800 -156998 -134124 -11191 -47852 -272280
18337 -272280 -399694 -408960 -250733 -204129 -103821 -73321 -82502 -5696 60520 -250908 -438789
18326d38789J96193R6244j44381J20111J55086k1420R5695k53455j46033J61018
18316a79731J11453n3220J26693J30564k22592Q6597J97809j8655j9669N7947
18306B17196P7309q8752j66438j43770N2579L13949J09379l242K3591J7299l8491
18295C70609j28246k12336j01513K67364l2622j13357j17490P0645O0366K7377
18285I0797J30391J48653j02125j28349O8346k5157L3424N081j80907k21520M1407
18274a39959K07160R8996K6373p921j68987q0459R2444k37586o4064K06059K0435
18263d7509K95365K72846j07397j74130j53322j10159K97705P9602q8419q9951
18253A74631J4281j22166j40404j51486l7023J42740O9370j65043k63841K16464
$$ plain form
18326 -438789 -242596 -146352 -290733 -170622 -15536 -36956 58739 -194716 -340749 -179731
18316 -179731 -68278 -121498 5195 135759 -86833 -236 197573 178918 159249 217196
18306 217196 294505 205753 39315 -104455 -51876 262073 371452 368210 391801 409100 370609
18295 370609 242363 30027 -71486 195878 163256 49899 -67591 3054 63420 90797
18285 90797 221188 369841 267716 139367 207713 182556 215980 221061 40154 -181366 -139959
18274 -139959 67201 166197 192570 184649 15662 -64797 27647 -209939 -274003 -67944 -47509
18263 -47509 247856 520702 413305 239175 85853 -24306 273399 353001 264582 174631
18253 174631 188912 66746 -73658 -225144 -262167 -119427 -50057 -215100 -478941 -262477
18243b62477K20695N0247L0116M5492P6025j63863J63281L02859j92002L7056
18233C07429l7981k55028j83117J08538Q1310r8434J54686J55394j36870j13289
18223a7362L3454K5063j20326L9438J14740j0690j26763j76389J3107O207j1540
18212b31061j02567R5941J03338J10547k2717M4599L6717Q2138k2325k02753M23280
18201C15137K63560j55463k70170J05871R0721L1581J13359j31172J09783K07730
18191F80937j25116j51796j28495R2265j84999N4327K48475j1297k57496j58540
18181E8265l8388P4760J15450l0995m07837p4905L46059k493j49292O6101L5898
18170g377l6969K68191K87096o7132j7201k15363j57480J35786l3616O2267K70880
$$ plain form
18243 -262477 -41782 8465 38581 84073 160098 -3765 159516 462375 270373 307429
18233 307429 269448 14420 -168697 -60159 21151 -77283 77403 232797 95927 -17362
18223 -17362 16092 41155 -79171 -39733 75007 64317 -62446 -238835 -225728 -219521 -231061
18212 -231061 -333628 -237687 -134349 -23802 -46519 -1920 34797 116935 94610 -108143 315137
18201 315137 578697 423234 153064 258935 349656 381237 494596 363424 473207 680937
18191 680937 555821 404025 275530 367795 182796 237123 485598 474301 216805 58265
18181 58265 19877 94637 210087 179092 -228745 -303650 42409 39916 -109376 -43275 -7377
18170 -7377 -44346 223845 510941 443809 426608 211245 53765 189551 155935 218202 489082
18159D89082k7022l93925k52266j32903L84834M07925r7756M0147L7606J24954
18149E80676J36978j31655P7051J55826Q0265j06649j85356n0905J16891K07897
18139H81019j56980l44467J91792J99058J01686J51956R4096K57871K4958k052
18129A398937K40922M15331k2189j13126L59293N25784J76787L81022M10000N51984
18119D324745N74588Q41019J032508J498375J954721K725266L832371N622330
18111B2405923Q412744J3320029K0878021K9950801M0064727N1382814L5280815
18104B21695874q36982l4546603n4503634m3220777k7142463j6639495j0595857
18097C4210063p208414m869059l280904k693407j722344j005750o64564n46954
$$ plain form
18159 489082 462060 68135 -184131 -317034 67800 475725 377969 418116 455722 580676
18149 580676 717654 585999 663050 818876 899141 792492 607136 556231 673122 881019
18139 881019 724039 379572 571364 770422 872108 1024064 1118160 1376031 1400989 1398937
18129 1398937 1639859 2055190 2033001 1919875 2279168 2804952 2981739 3362761 3772761 4324745
18119 4324745 4899333 5740352 6772860 8271235 10225956 12951222 16783593 22405923
18111 22405923 30818667 44138696 65016717 94967518 135032245 186415059 221695874
18104 221695874 220858892 186312289 131808655 88587878 61445415 44805920 34210063
18097 34210063 27001649 22132590 18851686 16158279 14435935 13430185 12765621 12218667
18089A2218667j57293o9472M6255L03000L26768M99402N23563M20083N34975Q10510
18079A5456458R02577J287980J513153J635465K113539K473703K186321P81261
18071B8350457j377064l181057k997504k327490j621210j237759j318176p03056
18063A3587141p32730p89681p69547l96526m31266q24156n70203n09104k10935
18054H352993k66913m59649l95231k44087m15982n27030j83776J5728M7940p0662
18044E853331j75829j51682j23325j47739k62418j37131J9280j64879m66137k9502
18034D213969n2709k12661k97188j04612k2901m211j0912j22649j80096n0215
18024C155815n6008j95676K3621l5582k6717j61868r6118J32321p8344k1917r5609
$$ plain form
18089 12218667 12061374 11991902 12038157 12341157 12667925 13167327 13690890 14110973 14645948 15456458
18079 15456458 16359035 17647015 19160168 20795633 22909172 25382875 27569196 28350457
18071 28350457 26973393 23792336 20794832 18467342 16846132 15608373 14290197 13587141
18063 13587141 12854411 12064730 11295183 10898657 10467391 9643235 9073032 8563928 8352993
18054 8352993 8086080 7626431 7231200 6987113 6571131 6044101 5860325 5876053 5923993 5853331
18044 5853331 5677502 5525820 5402495 5254756 4992338 4855207 4874487 4709608 4243471 4213969
18034 4213969 4161260 3948599 3651411 3546799 3523898 3519687 3508775 3386126 3206030 3155815
18024 3155815 3099807 2904131 2927752 2892170 2865453 2703585 2607467 2739788 2661444 2639527 2543918
18013B543918j61480K8212o4811j15808k03891j56347m6584r9936j40698j45669
18003A436906K01159L3543j87350j1350p9874L7511N5614j29569O5704n997j68734
17992A247563j47128K77273R786n9567k7161J51001r3991r9530R6260k7115M7469
17981A374860O7110N2113k74176p0955q7465k15550k67753l2592J45758R5913
17971G87263J4148j68070J3670j02371R6634K22746m8868q2260K3690l7852J62260
17960H80990N3760j85235r0086k42718k2638J23341n4785n7104N5047P7487j89814
17949C48245N9613K25089l7089j836o0180k16347o067K01828J45305n8626m0984
17938E58951N9571n1495J36858j03709m36239R2950N6641J89870J01131N3907
$$ plain form
18013 2543918 2382438 2410650 2345839 2230031 2026140 1869793 1823209 1723273 1582575 1436906
18003 1436906 1638065 1671608 1484258 1472908 1393034 1430545 1486159 1356590 1422294 1416297 1247563
17992 1247563 1100435 1377708 1387494 1327927 1300766 1451767 1357776 1258246 1354506 1327391 1374860
17981 1374860 1441970 1494083 1219907 1148952 1061487 845937 578184 545592 691350 787263
17971 787263 801411 633341 647011 544640 641274 864020 815152 732892 756582 718730 880990
17960 880990 934750 749515 659429 416711 394073 517414 462629 405525 460572 538059 348245
17949 348245 407858 632947 595858 594022 533842 317495 311428 513256 658561 599935 558951
17938 558951 618522 567027 703885 600176 163937 256887 313528 503398 604529 658436
17928F58436k43458k4317m9726P6376J13697j86562j94149k03382J87507J22627
17918B57049j20683J8692j7118m1979n3426M1451M5532j30763k57686j5692P9017
17907a95606M08635L62044j03286p8599j81546m2979J68654J40822o1525J9618
17897D36232m9132O6374j25965N9070J94571m2414n1707r8517j56963j28216J14414
17886B17747j996r9333J25901k8515k29185m4511L9263J82352Q5734l8903q981
17875A99573O6267P7186J7166K00601l3575j61285O8103r02j64985o3402p086
17864A97661R444N9386n6152O2366j12247j77786q9236K76424J31647K46598O8033
17853F16138p6087l7515J38430l32219l51270k9125O3412R4426l4929R4569J74953
$$ plain form
17928 658436 414978 390661 340935 417311 531008 344446 150297 -53085 134422 257049
17918 257049 136366 155058 137940 95961 42535 83986 129518 -1245 -258931 -274623 -195606
17907 -195606 213029 575073 471787 393188 211642 168663 337317 478139 416614 436232
17897 436232 387100 453474 327509 386579 581150 538736 487029 388512 231549 103333 217747
17886 217747 215751 116418 242319 213804 -15381 -59892 -20629 161723 247457 208554 199573
17875 199573 265840 343026 360192 560793 527218 365933 434036 433134 268149 204747 197661
17864 197661 207105 266491 210339 272705 160458 -17328 -106564 169860 301507 548105 616138
17853 616138 540051 502536 640966 308747 -42523 -71648 -8236 86190 51261 145830 320783
17842C20783M3177K13327J28756j45688k11580j26798K777J78882o8261k07388
17832A27987l5704m2299L2888L2937K2989P9310K10627k47499j22232K5246J45533
17821B29783Q5017J65295K12591L26916M20855J63092l40831m27532m33955k77402
17811A23829j43944K22380J79895L6016j71414j86909l727L3052j79713j73196
17801b63731J64244K65123K23785r2915r2100K09128J95259l23883k27060J71297
17791B29147J20629j1781k66306k89811r8473M5613K193L10534J61602l8589j36054
17780B8704K6432n8591M4851J40270l51277l11340K27614K58929J12768p3006
17770D5354O9291K93490K95120j06803j1467J13788l172J34887k55064k99789
$$ plain form
17842 320783 363960 577287 706043 560355 348775 221977 224754 403636 335375 127987
17832 127987 92283 49984 82872 115809 138798 218108 428735 181236 59004 84250 229783
17821 229783 314800 480095 692686 1019602 1440457 1603549 1262718 835186 401231 123829
17811 123829 -20115 202265 382160 418176 246762 59853 56126 89178 -90535 -263731
17801 -263731 -99487 165636 389421 296506 204406 413534 608793 284910 57850 229147
17791 229147 349776 337995 71689 -218122 -316595 -270982 -268789 41745 203347 164758 28704
17780 28704 55136 -3455 41396 181666 -169611 -480951 -253337 5592 118360 45354
17770 45354 114645 408135 703255 596452 584985 698773 695601 830488 575424 275635
17760B75635j62537k904L5930J04934J62227n6082o9350k87301j5956P1548k29237
17749a73093p9939J08356J35781J53194L06094Q4605j28582j99183k76229P3819
17739D823K17378J67210j94410O0700k7194k21529J03957J27029J33873P1829
17729D43666l83823k06488K3709j2817J00726l5896O4313M8712n3539k6070L86396
17718C48889j4821N0305O2333J00292Q7152q7907j18097O2046j54086m0745j02367
17707A92994k6099j19350j46933J3073p8660j22348R3810P5090J09432R9514J4763
17696A05286n4101N4100J51821j43891j89448K17955J48002j27198R5090Q6871
17686C44487o2086k76738O9774J96241J11712j99703j75073J29208R4599l333
$$ plain form
17760 275635 113098 110194 146124 251058 413285 357203 287853 552 -15404 56144 -173093
17749 -173093 -253032 -144676 -8895 144299 450393 534998 406416 207233 -68996 4823
17739 4823 222201 389411 195001 255701 228507 6978 110935 237964 371837 443666
17729 443666 59843 -146645 -122936 -135753 -35027 -70923 -6610 42102 -11437 -37507 348889
17718 348889 334068 384373 446706 546998 634150 546243 428146 490192 336106 295361 192994
17707 192994 166895 47545 -99388 -86315 -164975 -287323 -193513 -118423 -8991 90523 105286
17696 105286 51185 105285 257106 113215 -76233 141722 289724 162526 257616 344487
17686 344487 282401 5663 75437 271678 383390 183687 8614 137822 232421 229088
17676B29088m4208j38012j17067j16888l3311K16266K01354o7783R0817j69238
17666E1018j03747K20537J48291j06151p9526m2007r3871l8843O4916J29087P3720
17655B23424J44154K10056j06226j0879j18518L1114J080p4587l389k30389l15154
17644b49314j15388K03684O0597k8685k33058J00971M24852K25693J61677K29325
17634G80354j40666j65966q5201k0661J4747J4112J71240K8098j08687k55763
17624B31607m3739K4996Q5800M5005J01680L05036P5213k52080J03013r7071r9538
17613D79922j79408j87772k6057J02637K1417n77n3565M5651J63387p6963K503
17602B91175j67136p433l6158J48383k35016p5604K74924K00739J8736j00849
$$ plain form
17676 229088 184880 46868 -70199 -187087 -220398 -4132 197222 129439 220256 51018
17666 51018 -52729 167808 316099 209948 130422 88415 -5456 -44299 20617 149704 223424
17655 223424 367578 577634 471408 460529 342011 373125 374205 299618 296229 65840 -249314
17644 -249314 -364702 -161018 -100421 -129106 -362164 -261193 163659 389352 551029 780354
17634 780354 639688 473722 388521 367860 382607 396719 567959 596057 487370 231607
17624 231607 187868 212864 298664 343669 445349 750385 825598 573518 676531 579460 479922
17613 479922 300514 112742 86685 189322 210739 210162 156597 202248 365635 288672 291175
17602 291175 124039 116606 80448 228831 -6185 -81789 193135 393874 412610 311761
17592C11761j3276j95380p6211K41109R7952j31034R3780j57332j58120M0864
17582E4113K34934K25648j41938j1288M6711O8725n3381L317j6236N7886M518
17571D73009j32566P4413m7977j77791N8072K03833R428j1293L02295M7804R5925
17560H95152K59379j7085k57239l6722R9817L23004l30358j53828o6633j69028
17550E46459L1243J59384k17062r9715m4291j36253k65977J5489K40957p4658
17540A55576R8149K22252r8287k81726K6543l2502J00019L5588J0115J20986P7369
17529D34082j08563R3309K2889j23621j73484K2413Q4548j06587q8119p5846L7369
17518A8390J86480J33944o1926J65775K47290p8905K16758J10747N2992O688j79638
$$ plain form
17592 311761 298485 103105 26894 268003 365955 234921 328701 171369 13249 54113
17582 54113 289047 514695 372757 361469 408180 476905 423524 426841 410605 468491 473009
17571 473009 340443 414856 366879 189088 247160 450993 460421 449128 751423 799227 895152
17560 895152 1154531 1137446 880207 843485 943302 1266306 935948 782120 715487 546459
17550 546459 577702 737086 520024 420309 376018 239765 -26212 -10723 230234 155576
17540 155576 253725 475977 377690 95964 122507 90005 190024 225612 235727 356713 434082
17529 434082 325519 418828 441717 318096 144612 167025 251573 144986 56867 -18979 18390
17518 18390 204870 338814 276888 442663 689953 611048 827806 938553 991545 998233 818595
17507H18595r5051l3319J36862J18958J69126l99829K5933j27053M5099L1471
17497F90792l27850N6442L15968K35061l19032l57542K94K07525J93315J87801
17487H82774j26364m23154k86046q7331Q8664L67936L9427j36299O5262M1650
17477D26519j34782n7556J55281q2887p8091J50637K71828J23150r0387j28298
17467E55414n867r5917J61302O588M0227j39120j26672J79110L7810p58o9902
17456E42215k76205L2399J96521J45664p7726K38452J37947r7355q5418O9741
17446H26235j25080O893j13464K06883j9145J19128M06217N35337M1974j11400
17436A773578l05686l97399q9247L9302k11938k10232k36823n2425J84668Q9119
$$ plain form
17507 818595 723544 690225 827087 946045 1115171 715342 741275 614222 659321 690792
17497 690792 362942 419384 735352 970413 651381 293839 294133 501658 694973 882774
17487 882774 756410 333256 47210 -40121 48543 416479 455906 319607 384869 426519
17477 426519 291737 234181 389462 306575 228484 379121 650949 774099 683712 555414
17467 555414 549547 453630 614932 621520 661747 522627 395955 575065 612875 612117 542215
17456 542215 266010 298409 494930 640594 562868 801320 939267 841912 756494 826235
17446 826235 701155 708048 594584 801467 782322 901450 1307667 1843004 1884978 1773578
17436 1773578 1467892 1070493 981246 1020548 808610 598378 361555 309130 493798 582917
17426E82917j20967K4152R1829j01337K37287L8394n4381r3437J42272L4738r4941
17415F86526l7466j17468J60938J2592j43621L72404K94039J99353J73947M3386
17405A644630r557j41521k1L36637j24817j90054o2703L68653L28151K13238k7322
17394B335314j35696j86090k39112j89908R6447J01045n487k0257r973J42040
17384A888323K576j49128J68333K09055O9082r6788l8899L60464L55852M43422
17374C212292L52551P82185O25392J093620J372376K248926K982488M420975O782215
17365B3873020R589422J2803143J5387665J1965878J844078q072620j5270315
17358E2120271j3832855r119813n845051m377197l166485k225202k001636j541312
$$ plain form
17426 582917 461950 486102 577931 476594 713881 752275 697894 604457 746729 781467 686526
17415 686526 649060 531592 692530 705122 561501 933905 1227944 1427297 1601244 1644630
17405 1644630 1635073 1493552 1493531 1830168 1705351 1515297 1452594 1821247 2149398 2362636 2335314
17394 2335314 2199618 2013528 1774416 1584508 1680955 1782000 1776513 1756256 1746283 1888323
17384 1888323 1890899 1741771 1910104 2119159 2188241 2091453 2052554 2413018 2768870 3212292
17374 3212292 3564843 4347028 4972420 6066040 7438416 9687342 12669830 17090805 23873020
17365 23873020 33462442 46265585 61653250 73619128 75463206 67390586 52120271
17358 52120271 38287416 29167603 23322552 18945355 15778870 13553668 11552032 10010720
17350A0010720j120588m79398K0048j63394p2548J32871J70093J52410k82133
17341H368081m22837r2129K84413K97459K61811L73637N55617P66339N35504Q06743
17331A1734638R77528P40998R27040J92857l95377l09797l06573R9564M70687
17322A4131565O40257Q01135J483842K200899L229699N173652P872013J1633912
17314D7166974J7362590K4330910L1797041L5031404K7218648R374845j5380326
17307A76902086l0694853l5001347k7873388j8695822j2751227r236600p259999
17300C5388850n768218m380605l030012k123900j591365o78587j63771k2304q8822
17291A7541266p9153r4248p6663K78044L42492O32505P39565J063883R54079J142881
$$ plain form
17350 10010720 8890132 8410734 8430782 8267388 8194840 8327711 8497804 8650214 8368081
17341 8368081 7945244 7853115 8137528 8434987 8696798 9070435 9626052 10392391 10927895 11734638
17331 11734638 12712166 13453164 14380204 14573061 14177684 13867887 13561314 13660878 14131565
17322 14131565 14771822 15572957 17056799 19257698 22487397 27661049 35533062 47166974
17314 47166974 64529564 88860474 120657515 155688919 182907567 192282412 176902086
17307 176902086 146207233 111205886 83332498 64636676 51885449 42648849 35388850
17300 35388850 29620632 25240027 22210015 20086115 18494750 17816163 17652392 17630088 17541266
17291 17541266 17462113 17367865 17291202 17569246 17911738 18544243 19283808 20347691 21301770 22444651
17281B2444651J685832K227467K434464K019785J178423M1395j165403k105981
17273B8760633j619945j495587j155349p21062k94924L1585N42356J572339K827160
17264B8447206M293962P102828J0837804J5960122K1282728K6586675K4441438
17257A38952763P718425j0923658k6196216k7173913j9598381j2863710q955578
17250D0959732o526937n405242m364524l227655k217754j601545j096356n47589
17242A5972130l84476m04591m08096r3643J15284P0639m139O11L04943K54319
17232A5422981M93848Q84899Q09056R26881J165985J250136J364959J047316R6832
17223B3462893j102946j806621j900581j774387j237530j090682p69098p64360
$$ plain form
17281 22444651 24130483 26357950 28792414 30812199 31990622 32032017 30866614 28760633
17273 28760633 27140688 25645101 24489752 23768690 23473766 23505351 24047707 25620046 28447206
17264 28447206 32741168 39843996 50681800 66641922 87924650 114511325 138952763
17257 138952763 146671188 135747530 109551314 82377401 62779020 49915310 40959732
17250 40959732 34432795 29027553 24663029 21435374 19217620 17616075 16519719 15972130
17242 15972130 15587654 15183063 14774967 14681324 14796608 14867247 14863108 14863719 15168662 15422981
17232 15422981 15916829 16801728 17610784 18537665 19703650 20953786 22318745 23366061 23462893
17223 23462893 22359947 20553326 18652745 16878358 15640828 14550146 13781048 13016688
17215A3016688o18856o07891m70573m69200o38623k42143j60336m52279k79561
17206I077226k60437k83207m64404k86233k25713m59743j23698j33733j5802k28905
17196F595351n84079k79512r7603J40770L2212J15806r9958o976n1181j76406
17186E588424k84988k76008l48011j92255l6226l21631j86113j61277l68594M3558
17176C456879J26379J03552j50623j02323J50036j3777J32337o4325j12924O741
17166C531952j07590q5377j03285m2427J39009N8561j31853p4826p0782J5887
17156C129269k76080n77969O3478M4709O1903J14233J02202k02046j99502r4154
17146B166043l441k7896L9291j17412J05852J88762m9311j31081J1699J46097
$$ plain form
17215 13016688 12397832 11789941 11319368 10850168 10211545 9969402 9809066 9356787 9077226
17206 9077226 8816789 8533582 8069178 7782945 7557232 7097489 6973791 6840058 6824256 6595351
17196 6595351 6011272 5731760 5634157 5774927 5807139 5922945 5822987 5816011 5764830 5588424
17186 5588424 5303436 5027428 4679417 4487162 4450936 4129305 3943192 3781915 3413321 3456879
17176 3456879 3583258 3686810 3536187 3433864 3583900 3570123 3702460 3638135 3525211 3531952
17166 3531952 3424362 3338985 3235700 3193273 3332282 3390843 3258990 3184164 3113382 3129269
17156 3129269 2853189 2275220 2338698 2383407 2445310 2559543 2661745 2459699 2260197 2166043
17146 2166043 2162602 2134706 2173997 2056585 2162437 2351199 2301888 2170807 2182506 2328603
17136B328603P7564j78137p9744k69819j57212R6369j8386Q1715q2372m6208K16718
17125A969091J74794j09459j62874j92293J00533J94171J36576r7958k5785j6940
17115A969856o7296L7672K65760m5730j43854O1132j67830M223J45829n3113Q9104
17104B095753j51259J38338j02767j28735J04455O692p5895K12828K09371r1692
17094B217089j01785l1343O0834L82849j89737l84590k03240j89633J06647L17938
17084A985029J95064J22285P8329J18008L3821k8640j817M17262K60930M71253
17074C651524M14050q8111N0367N0568J72769L26119J17129K96972L37682J65382
17064E494451J85083N46571P66531Q22319R29194J125889J358979J858726L053709
$$ plain form
17136 2328603 2406167 2228030 2148286 1878467 1721255 1817624 1799238 1880953 1798581 1752373 1969091
17125 1969091 2143885 2034426 1871552 1679259 1779792 1973963 2110539 2012581 1986796 1969856
17115 1969856 1902560 1940232 2205992 2160262 2016408 2077540 1909710 1913933 2059762 2006649 2095753
17104 2095753 1944494 2082832 1980065 1851330 1955785 1962477 1886582 2099410 2308781 2217089
17094 2217089 2115304 2083961 2144795 2527644 2337907 1953317 1750077 1560444 1667091 1985029
17084 1985029 2180093 2302378 2380707 2498715 2532536 2503896 2502079 2919341 3180271 3651524
17074 3651524 4065574 3977463 4027830 4078398 4251167 4577286 4694415 4991387 5329069 5494451
17064 5494451 5679534 6226105 6992636 7814955 8744149 9870038 11229017 13087743 16141452
17055A6141452M865602O969273J0179765J4318450J8892179K3297268J8664020
17048A13328009N164020q252219j7304266j2880462l062975O488057J4927884
17041I8408048K2587348K4612032R601445r019004k7052465l1071141k3314549
17034F4751714j5386098j0092696o677106m484681k837035j543409r18097q13021
17026B1999571p82058k30815J02879L66434O88891J047027J353488J581933J801766
17017B7929116J740362J746352R91168M38611K28354O9165r5166j33113L47357
17008C3262206R94416J129379N66630l10133l99534O58847K134952L438844O208106
16999D7683713J0172534J4159690J8167506J4370908K475635r033599j5887902
$$ plain form
17055 16141452 21007054 27976327 38156092 52474542 71366721 94663989 113328009
17048 113328009 118492029 110239810 92935544 80055082 76992107 83480164 98408048
17041 98408048 120995396 145607428 155208873 146189869 119137404 88066263 64751714
17034 64751714 49365616 39272920 32595814 28111133 25274098 23730689 22812592 21999571
17026 21999571 21217513 20986698 21089577 21456011 22144902 23191929 24545417 26127350 27929116
17017 27929116 29669478 31415830 32406998 32845609 33073963 33143128 33047962 32914849 33262206
17008 33262206 34256622 35386001 35952631 35642498 35242964 35901811 38036763 41475607 47683713
16999 47683713 57856247 72015937 90183443 104554351 107029986 97996387 82108485
16992H2108485j2188417m850815K163606P915906J3162868J4804364N075399o615440
16984A01575956j7716748j9868938j4657548r384508o187193m469130k831729
16977B6460162j770326j179769m21794l11040l89306m3332J33354J89993L04609
16968B2972551Q12611J021558J256611J433632J680571J580211Q50329k46743
16960C1361331n32591m70758K70725J184865J954713K658030L940149N015658
16952D5382122O407111Q844279J2950746J7257324J9591559J7414259Q885206
16945A36732606k220171j1459536j4617222j1604318n088270K070013P761831
16938A01574933R772208O403675j898892j0610373j6484366j7346027j4628759
$$ plain form
16992 82108485 69920068 65069253 67232859 75148765 88311633 103115997 108191396 101575956
16984 101575956 83859208 63990270 49332722 39948214 33761021 29291891 26460162
16977 26460162 24689836 23510067 23088273 22777233 22387927 22344595 22477949 22667942 22972551
16968 22972551 23785162 24806720 26063331 27496963 29177534 30757745 31608074 31361331
16960 31361331 30828740 30357982 30628707 31813572 33768285 36426315 40366464 45382122
16952 45382122 51789233 60633512 73584258 90841582 110433141 127847400 136732606
16945 136732606 134512435 123052899 108435677 96831359 91743089 93813102 101574933
16938 101574933 111347141 117750816 115851924 105241551 88757185 71411158 56782399
16931E6782399j0405743o940046m819867l602234k249603j328167r82458k69746
16923B6184535p222M46199L37863N71176O06369L44133P57199J251835J387975
16914C1880062J285241O76086j66454m36654o86996l97168m7407K23783Q11846
16905C3142339J180018J345802J520704J770892L209082N598186Q487653J1730495
16897F7985171J4467894J4226762R334874J174876o694937j1065501j0338176
16890G9090963n772777L85950N359498Q124691P061342J684498n994382j2347537
16882G7592246j4404952j2780128r727301o949959m758407l203135j903267j332469
16874B2532628r48554o77436n32336j49269R8734J63287J74721K83886L89648
$$ plain form
16931 56782399 46376656 39436610 34616743 31014509 28764906 27436739 26454281 26184535
16923 26184535 26177313 26623512 26961375 27532551 28138920 28483053 29240252 30492087 31880062
16914 31880062 33165303 33841389 33674935 33238281 32551285 32154117 32106710 32330493 33142339
16905 33142339 34322357 35668159 37188863 38959755 42168837 47767023 56254676 67985171
16897 67985171 82453065 96679827 106014701 107189577 100494640 89429139 79090963
16890 79090963 73318186 73704136 79063634 87188325 94249667 95934165 89939783 77592246
16882 77592246 63187294 50407166 40679865 33729906 28971499 25768364 23865097 22532628
16874 22532628 21584074 20906638 20374302 20225033 20323767 20487054 20661775 20945661 21335309
16865B1335309Q84924Q32732P14317N46611j10249o58364q57529p38523m17930
16856B1531298j98526j9011j58614k20717m62510j070199j130506j276086j114312
16847A5880817j008221q93183l25520p08059q09727n60883p10195n88884l41092
16838I935053k22968l55280k25578j9518K4304n4371m0476j28434m34919n05142
16828G972671k85965j3013m75834m55113r4089q4314l84906n10841k62987J13429
16818E519038J72023o6846o1710j10622k90044k79202q2605n8555k33827L2464
16808D540114l71720j96222l0459k59332k71381j81523o5565J36192q6334l9497
16798C174273P2748j18702l44946L6268K28689J54044j80928k35170J393o2124
$$ plain form
16865 21335309 22220233 23052965 23767282 24313893 24203644 23545280 22687751 21949228 21531298
16856 21531298 21332772 21313761 21155147 20934430 20471920 19401721 18271215 16995129 15880817
16847 15880817 14872596 13979413 13653893 12945834 12136107 11575224 10865029 10276145 9935053
16838 9935053 9712085 9356805 9131227 9111709 9136013 9081642 9041166 8912732 8477813 7972671
16828 7972671 7686706 7673693 7197859 6742746 6648657 6564343 6179437 5668596 5405609 5519038
16818 5519038 5691061 5624215 5562505 5451883 5161839 4882637 4800032 4741477 4507650 4540114
16808 4540114 4168394 3972172 3941713 3682381 3411000 3229477 3163912 3300104 3213770 3174273
16798 3174273 3247021 3128319 2783373 2819641 3048330 3202374 3021446 2786276 2787669 2725545
16788B725545L3016R2592J57757j10219k50601r9128j03341n1981r928j54207
16778B229505j60505r1701J91271l29830k36029J2500J39629K9924j64113N0114
16768A670765J34612k9917k67029j81376J88941J83397P6524q2812J8127j96233
16758A514999o1394O465k05416k47109J67412L10333r0249k62106p1694K3107
16748A084348j54034j93800J66837K02115j05884n423J39402j04120k70049q3613
16738F75779N6588J10439P6337j62241j76707j27611M9881Q4226K45489j22346
16728G09834o7815L02421j97281J5273J06365j9573o886o8339J56533R0994j40338
16717H81188p2745k38162r5288K40778j85860m4065K0957M0321L71872o3575k12842
$$ plain form
16788 2725545 2758561 2851153 3008910 2898691 2648090 2548962 2445621 2393640 2383712 2229505
16778 2229505 2069000 1977299 2168570 1838740 1602711 1615211 1754840 1784764 1620651 1670765
16768 1670765 1805377 1775460 1508431 1327055 1515996 1699393 1775917 1693105 1711232 1514999
16758 1514999 1453605 1460070 1254654 1007545 1174957 1485290 1395041 1132935 1061241 1084348
16748 1084348 930314 736514 903351 1105466 999582 994159 1133561 1029441 759392 675779
16738 675779 732367 842806 919143 756902 580195 452584 502465 586691 832180 709834
16728 709834 642019 944440 747159 762432 868797 849224 842338 773999 930532 1021526 881188
16717 881188 808443 570281 474993 715771 529911 485846 506803 547124 918996 855421 642579
16706F42579O6244p8607j93819M7209J63101K7548j76731Q6665Q2154J2780l09428
16695C69695J06660J03442j82375R3728K60672j36802L868k4111k68103p3638
16685B53036J47265J12326L0728k56162j18678l5831o8404N3208M7750K15175
16675C80413N19275L2680k20458k81078k5844J29668K8389m70843j76563O3366
16665b0995P4364K50663Q7819j34757J10968Q1366j31565K68857J54960m1367
16655G00313K7612j58484k14446J853m4264q2200L8683o4169j10357j5361J67045
16644B46225K9236J35173J05331N4553J6265Q926l20967j03617M4832J18206J13015
16633D47178l9381O165K16410l04873j50573J22028j06764l2003P480m4154j24470
$$ plain form
16706 642579 708823 630216 436397 483606 646707 674255 497524 584189 666343 679123 369695
16695 369695 476355 579797 397422 491150 751822 615020 618888 594777 326674 253036
16685 253036 400301 512627 543355 287193 168515 132684 64280 117488 165238 380413
16675 380413 899688 932368 711910 430832 404988 534656 563045 92202 -84361 -20995
16665 -20995 53369 304032 391851 257094 368062 449428 317863 586720 741680 700313
16655 700313 727925 569441 354995 356848 312584 230384 269067 204898 94541 79180 246225
16644 246225 275461 410634 515965 570518 586783 595709 274742 171125 215957 334163 447178
16633 447178 407797 413962 630372 325499 174926 296954 190190 158187 165667 121513 -2957
16622b957O85j81699R7186L31128J9174L801K1831R2701J16002N2335O8915J92758
16610H11860K2562j23747M6795J2245k75094j63746j17547k66279j51125Q5732
16600a18344J42147K4243p5615J60906j81357k8957N9174m0678M6121K88617r761
16589B66496j64827J60682P156r3725l5256k07958J4275m2624P1404J07952J29079
16578B12654k0281o2729K51305k3665l6698k73528P7299Q6507L2382k27023j81354
16567a65131K12626N0061q3105N9234L0244Q3841Q7707O9113p8414j94596O7693
16556A39273J66892j19342p1000j19436k80479O6812j6547k444j7087M6116J79820
16545b7422J54046K62599j7039J12901j6220p2332k48540j05826K07283K80868
$$ plain form
16622 -2957 -2272 -183971 -86785 244343 263517 267318 289149 381850 497852 550187 619102 811860
16610 811860 834422 710675 757470 769715 494621 330875 213328 -52951 -204076 -118344
16600 -118344 23803 48046 -27569 133337 -48020 -76977 -17803 -58481 -12360 276257 266496
16589 266496 101669 262351 269507 175782 140526 -67432 -53157 -95781 -24377 83575 212654
16578 212654 192373 129644 380949 357284 320586 47058 124357 210864 243246 16223 -165131
16567 -165131 47495 97556 14451 73685 103929 187770 275477 344590 266176 71580 139273
16556 139273 306165 186823 115823 -3613 -284092 -217280 -233827 -236271 -253358 -207242 -27422
16545 -27422 126624 389223 372184 485085 468865 396533 147993 42167 249450 530318
16535E30318P5391j0456q9397j70599r0518j19563K58838J83736j1966R2878J4425
16524F63087J60014j28003k89245k3354j52323L3108L3535k00923R5927J14657
16514C06480j8047n200j54154J80651J09616j48308l8499M0900L45560R2184k25906
16503D85277o3815j79446R1218J07692q770j09522l49172N4821J15632K00872
16493C44787K11453R4833m8338j54626k55007L2359M2620J70528J10879J1992
16483E61480r1012J76272L42654l0927l65151j09191J34676K06252j37144Q6827
16473G74736K38802k74127k02921J9597l4122j55189K8174j21243j30021K03908
16463C47594J26424N1809J04488j61283l50142j058l3684P7196O6395P0770J31689
$$ plain form
16535 530318 605709 595253 505856 335257 244739 125176 384014 567750 555784 648662 663087
16524 663087 823101 695098 405853 382499 230176 263284 296819 95896 191823 306480
16514 306480 288433 283233 129079 309730 419346 271038 232539 273439 618999 711183 485277
16503 485277 421462 242016 333234 440926 432156 322634 -26538 28283 143915 344787
16493 344787 556240 651073 602735 448109 193102 225461 268081 438609 549488 561480
16483 561480 470468 646740 989394 958467 593316 484125 618801 825053 687909 774736
16473 774736 1013538 739411 536490 556087 521965 366776 394950 273707 143686 347594
16463 347594 474018 525827 630315 469032 118890 117832 84148 161344 227739 298509 430198
16452D30198O3135j19129j01001j04094J14547J22000n7279j69078J53430L07172
16442F39901L44505J70151K6092j7337r0428k50643j05896j68154j70820k58000
16432A19371K32913M71413J54138k92645m19347j2877n2812k3871k5312L0344
16422A81315j72305o0884q964J29109P7300N5317r0990j16942o0302K7662n5244
16411i4928n235K02430j05272j61491k9243p4979Q9903K45762L15830M0011j03991
16400C18797P0751q0445l74910r4619q2439J17690K89976k3938l51871N7711L27682
16389A74385J97228J94355J77188J433p2994j16676n2551L3646j1878M0615m8480
16378E16271M1097P9461j15887j34646o1020N6122k74000j75622j30764r1048
$$ plain form
16452 430198 493333 374204 273203 169109 283656 405656 348377 179299 332729 639901
16442 639901 984406 1154557 1180649 1163312 1072884 822241 716345 548191 377371 119371
16432 119371 352284 823697 977835 685190 265843 252966 200154 176283 150971 181315
16422 181315 9010 -51874 -60838 68271 145571 200888 109898 -7044 -67346 -39684 -94928
16411 -94928 -100163 102267 -3005 -164496 -193739 -268718 -178815 66947 382777 422788 318797
16400 318797 389548 309103 -65807 -160426 -242865 -125175 164801 140863 -211008 -153297 174385
16389 174385 371613 565968 743156 744589 671595 554919 502368 536014 524136 564751 516271
16378 516271 557368 636829 520942 386296 325276 381398 107398 -68224 -198988 -290036
16368b90036J50626R2192M0713J10787r1211j57245k7485K03934J50516J00374
16358B83165q7503l06023J09218J22102n9463j84515M5572R1352K7572J65436
16348B06913M02992J09869m0639m30155k69940J19654n407k23971J20803J09043
16338I9162J39263J15767k49186M0867m6940J09630J07662j0071j27470r5326
16328H3358j28218n2644L5912p2997J46181j30708K31089M3961M2193j35716j51412
16317h9001K17229j7061k11217J51436r3522k3211K06114j01601j7942R3554J58256
16306B73034k58687j52304r151m2250J01764K13283J31436R8539K8764j79635
16296B04793o9135o3300j22695j22117K8747J90418q7347N2741P8048O4327L3491
$$ plain form
16368 -290036 -139410 -47218 -6505 104282 13071 -144174 -171659 32275 182791 283165
16358 283165 195662 -110361 -1143 120959 61496 -123019 -77447 13905 41477 206913
16348 206913 609905 719774 679135 248980 -20960 98694 93287 -130684 -9881 99162
16338 99162 238425 354192 105006 145873 98933 208563 316225 306154 178684 83358
16328 83358 -44860 -97504 -61592 -134589 11592 -119116 111973 155934 198127 62411 -89001
16317 -89001 128228 111167 -100050 51386 -42136 -65347 140767 39166 21224 114778 273034
16306 273034 14347 -137957 -147108 -189358 -87594 125689 257125 355664 384428 204793
16296 204793 135658 72358 -50337 -172454 -143707 46711 -40636 12105 90153 154480 187971
16285A87971q7806o5353R7180J74906k04840j15542O9942R4904Q0853M3422j11613
16274A64024L2361j34452p1794J71836P3044m8930j52102l6687J37720J88440
16264C23460k7277r1948J3447j48625J7865p1932j64753R8216L17681J50318l8517
16253C77935j19213J56858j2641k7052j56072R1094R1126L9373n6958K2310J32896
16242E39656j48008k21748k06447l9088N9759J76744r2259K3738K7007Q5483j92174
16231A2663j11434J97118l0425n5597J24295j02125j30555J3661J13288J98324
16221B29213r6224k49207l419K7620J87909L51850o1598j60326N2533J77306q3493
16210C72164j89405J81763Q6823j25258j76949j56297p288l8026m9241J15522
$$ plain form
16285 187971 100165 34812 131992 306898 102058 -13484 56458 151362 232215 275637 164024
16274 164024 196385 61933 -9861 161975 235019 186089 33987 -2700 135020 323460
16264 323460 296183 204235 217682 69057 86922 14990 -149763 -51547 266134 416452 377935
16253 377935 258722 415580 402939 375887 219815 310909 402035 441408 384450 406760 539656
16242 539656 391648 169900 -36547 -75635 -15876 160868 68609 92347 119354 204837 12663
16231 12663 -98771 98347 67922 12325 136620 34495 -96060 -82399 30889 229213
16221 229213 132989 -116218 -119637 -92017 95892 447742 386144 225818 278351 455657 372164
16210 372164 182759 364522 451345 326087 149138 -7159 -14447 -52473 -101714 13808
16200A3808K45959j7112k17926q6904J49684j26660j64258K714N4604O3341J63723
16189H0973q4256J2805j07304k14554Q1977K14789K7157O3362j10356k47689J21501
16178a61595L03105n1958n3971j20261m992J68944L0104k80675o7991J20709M6647
16167g1934m9374M6140J07440J30208k27541j1434K36348j99109j20492K55321
16157I5573j6973j28921P0555K72266J1071n3523q3027p37j01433J34142r514
16146A89479k14225j87173k01862k69427L52076L41042J71286j68442j36517l1693
16136a55456j83090J674N3519P4752J84911J12991k43328k48772n5603j793K38013
16125b22182J1514J59729J16302r0486j46098j89226N914j9746J22866K23312
$$ plain form
16200 13808 259767 242655 24729 -62175 87509 -39151 -203409 -200695 -146091 -82750 80973
16189 80973 -3283 9522 -97782 -312336 -230359 -15570 11587 74949 -35407 -283096 -161595
16178 -161595 141510 89552 35581 -84680 -89672 79272 109376 -171299 -239290 -118581 -71934
16167 -71934 -121308 -75168 32272 162480 -65061 -76495 159853 -39256 -159748 95573
16157 95573 78600 -50321 20234 292500 303571 250048 167021 166284 64851 198993 189479
16146 189479 -24746 -211919 -413781 -683208 -331132 9910 181196 12754 -123763 -155456
16136 -155456 -338546 -336872 -283353 -208601 -23690 89301 -154027 -402799 -458402 -460195 -222182
16125 -222182 -210668 -50939 65363 -25123 -171221 -360447 -354533 -374279 -251413 -28101
16115b8101j1728r2143j88711J08862J87353R4178J52162k19579j84366L59804
16105A77731q6080j44373j44751l05772j8891L30532P9535q2082l412P5474r2427
16094b14516J94706J1847k15617r6298J86995J33038M4906J6260j75361J00566
16084a3474K98046M2042k21317j8417j06083j34317p7378n3308o0514J27843J9378
16073a97499J19865J29021m938o7008J37637J74226P5789q8000M3846p8987k12566
16062C1386l03567p0761k5362m0280L1168K42596Q1538j22876n376K9315O3461
16051h8758L5515j22430J36165J17940j07437M3869k94219L3397j8795N4704o4084
16040b74133p571L1669K51277p4947J12059j63252J58268K2088L8151P5275P7736
$$ plain form
16115 -28101 -39829 -131972 -320683 -211821 -24468 69710 221872 2293 -182073 177731
16105 177731 91651 -52722 -197473 -503245 -522136 -191604 -112069 -194151 -197563 -122089 -214516
16094 -214516 -19810 -7963 -223580 -319878 -132883 155 45061 61321 -114040 -13474
16084 -13474 284572 326614 105297 86880 -19203 -153520 -230898 -284206 -344720 -216877 -197499
16073 -197499 -77634 51387 46449 -20559 117078 291304 367093 279093 322939 243952 31386
16062 31386 -272181 -342942 -368304 -408584 -377416 -134820 -53282 -176158 -181534 -152219 -88758
16051 -88758 -53243 -175673 -39508 78432 -29005 14864 -279355 -245958 -264753 -210049 -274133
16040 -274133 -281704 -250035 1242 -73705 38354 -124898 33370 55458 93609 168884 246620
16029B46620j25929r5136J03322J47926l4402j51292J04946O2387j49515j24052
16019a5125j26270l7634N38L2710J20156L0334l6979J4161j31187p6660m2108
16008b68064n69J67293J56724q2885k13030l1533q0721p6947J31092J26840k65751
15997d37551o4527K27132M5260J03349j00729K43126Q3529k37040j60652O8730
15987b29373l469Q3585R9104q6815P4601L9389q7646j75831K34907L78461n1963
15976B74950j24818p5809O1530j00255n4314p9160P6706K8489m0974Q0889k40135
15965a92901j56038o7509l842J94478J71625N2588j46566r7091J24192K68629
15955A47565J24997p4595k4132K5872l5527j13446n2445L1449j72729k7733K84967
$$ plain form
16029 246620 120691 25555 128877 276803 242401 91109 196055 258442 108927 -15125
16019 -15125 -141395 -179029 -178491 -145781 -25625 4709 -32270 -18109 -149296 -225956 -268064
16008 -268064 -268633 -101340 55384 -27501 -240531 -272064 -352785 -429732 -298640 -171800 -437551
15997 -437551 -502078 -274946 -229686 -126337 -227066 16060 99589 -137451 -298103 -229373
15987 -229373 -232842 -149257 -50153 -136968 -62367 -22978 -110624 -286455 -51548 326913 274950
15976 274950 150132 74323 135853 35598 -18716 -97876 -21170 7319 -33655 47234 -192901
15965 -192901 -348939 -416448 -420290 -225812 -54187 -1599 -148165 -245256 -121064 147565
15955 147565 272562 197967 173835 199707 164180 50734 -1711 29738 -142991 -170724 114243
15944A14243J05283l42212k17597J43751O4250P2692J04675O6407k30774Q7881
15934c1401K70051j18430j23137P7138j09353j0107K2996p3426M3558K02616j04685
15923D5820j52555k11800k6113J66495K25062M1999K8054O0418l28354j44357
15913b95331L5818K31219R6279r3993J91271K56554L9668k9587j71624k06953
15903E3321k76152K0397k5523J31754j7546o6958K70643M41965J99736j10404
15893F21233m04742l99253j64429n639J6559J13950J62582K48936J22207j43159
15883A68245j58290L1404J96605P075J15755k3031l9129k8795j85290j0159l0491
15872D3899O3207j24588j96205J80030R9227k48809p2586Q173p6310L4844J95702
$$ plain form
15944 114243 219526 -122686 -340283 -196532 -132282 -59590 45085 111492 -119282 -31401
15934 -31401 238650 120220 -2917 74221 -35132 -45239 -22243 -95669 -52111 150505 45820
15923 45820 -106735 -318535 -344648 -178153 46909 88908 116962 177380 -150974 -295331
15913 -295331 -259513 -28294 67985 -26008 165263 421817 461485 431898 260274 53321
15903 53321 -222831 -202434 -227957 -96203 -113749 -180707 89936 531901 731637 621233
15893 621233 216491 -182762 -347191 -352830 -336271 -222321 -59739 189197 311404 168245
15883 168245 9955 41359 237964 245039 360794 337763 298634 269839 84549 74390 43899
15872 43899 107106 -17482 -213687 -33657 65570 -183239 -255825 -247652 -323962 -289118 -93416
15861i3416J86318K39749j04083l0693m5747J01386m6175j688L3203N398k33579
15850A0673r3483J83222j18950j78959P2561K1016K87121J4241L1233o2654k17523
15839e1502k08421J03800P6277R1951j07340K6131N6526L5465J08853j84816k84011
15828c37087Q4784K0156k00937l766K32167k01631j22723J51041K14882O3879
15818i9235J8330J02643p6912k8340j84878n2942N3468j9023J55190k1123J19871
15807c2951K67315k8897Q8179j5512J71996r3572j83729l35358j61927Q501K99872
15796a6083J94108P410l4411j61080j91358J28438K00777j03075p3089K59104
15786B10741p1639k60015j41805J82206Q1074M6328o799r0374J85023R9825N6906
$$ plain form
15861 -93416 92902 332651 228568 197875 152128 253514 207339 205651 238854 244252 10673
15850 10673 -82810 100412 -18538 -197497 -124936 -103920 183201 197442 228675 166021 -51502
15839 -51502 -259923 -156123 -79846 12105 -95235 -69104 -12578 22887 131740 -53076 -337087
15828 -337087 -252303 -232147 -433084 -436850 -204683 -406314 -529037 -377996 -163114 -99235
15818 -99235 -80905 21738 -55174 -83514 -268392 -321334 -267866 -286889 -131699 -152822 -32951
15807 -32951 234364 205467 293646 278134 450130 356558 172829 -162529 -324456 -315955 -16083
15796 -16083 178025 185435 151024 -10056 -201414 -72976 127801 24726 -48363 210741
15786 210741 139102 -120913 -262718 -80512 562 46890 40091 -50283 134740 234565 291471
15775B91471k2922j52046r8833n2053J65194L0605k52693q8539q4630J30615K2832
15764a10999J22471Q667j23895n7168M918l5942m3572j81278J05632L29740K95893
15753C14467J07762l2289l08248k05414k07152K50206K43172k03639L5052R8052
15743I1969j20258o7289j92668k4491K47968J17886J24528L28023p6634q1721
15733C47313k16160P0869m0296j36071r1999j68918j21656L33770J24666p2400
15723B9118j55166J82443K21413j90112J4621o7647J6782J50474Q7830j10150
15713A79606N3590p6839k50936j4431K23845r8816j03535k62171J10431J10606
15703a28650k9989m60r550P18j65508O5300N9297J36953L44921m5411q6498p061
$$ plain form
15775 291471 268549 116503 17670 -34383 130811 161416 -91277 -179816 -264446 -133831 -110999
15764 -110999 11472 20139 -103756 -160924 -156006 -191948 -235520 -416798 -311166 18574 314467
15753 314467 422229 389940 81692 -123722 -330874 -80668 162504 -41135 -6083 91969
15743 91969 -28289 -95578 -288246 -312737 -64769 53117 177645 505668 429034 347313
15733 347313 131153 202022 161726 25655 -66344 -235262 -356918 -23148 101518 29118
15723 29118 -126048 56395 277808 87696 102317 34670 51452 201926 289756 179606
15713 179606 233196 156357 -94579 -109010 114835 16019 -87516 -349687 -239256 -128650
15703 -128650 -158639 -159099 -168649 -167931 -333439 -268139 -208842 -71889 273032 227621 141123 134062
15691A34062k7755M9147K467P1939j41080J16648J89288k12341P0525n0809j23948
15680G8143J09156j65524m2429L811J54111m8305n665J35689Q0589j38083J13682
15669B75175J8038L3150k89946j76199Q689J34546J34792j1686n1531j90593r7371
15658b12936L4181J17937J9320M2793m3082p80J88702J28858j63739k22262q4751
15647a95759j48388p1576J52688J91131l8085k33488M3506K64329K30450j92r1914
15636A02702p8021j32279N6686p4244q7847J12262M7746n726J35061k40187p4308
15625b38155r6525j87190P9055n8047N8017J20987j97707K59003J57310M9386
15615e3866j37945R0527J90616J76266o4206k45592K2687N2136n0758j59130k14853
$$ plain form
15691 134062 106307 155454 157921 229860 88780 205428 394716 182375 252900 202091 78143
15680 78143 187299 21775 -20654 -16843 137268 88963 83298 218987 299576 161493 275175
15669 275175 293213 326363 36417 -139782 -131093 3453 138245 126559 75028 -115565 -212936
15658 -212936 -178755 -60818 -41498 1295 -41787 -42567 146135 274993 111254 -111008 -195759
15647 -195759 -344147 -415723 -263035 -71904 -109989 -343477 -299971 -35642 194808 194616 102702
15636 102702 24681 -107598 -50912 -125156 -213003 -100741 -52995 -58721 76340 -163847 -238155
15625 -238155 -334680 -521870 -442815 -500862 -442845 -321858 -519565 -260562 -103252 -53866
15615 -53866 -191811 -101284 89332 265598 201392 -44200 -21513 30623 -20135 -179265 -394118
15604c94118R2380K20252J83114j19331o1441k11155j0719K59609Q3636J4037
15594E6264J2571l32789j63655J11879j03879j26077J17916K63683K28477j35149
15584g0759j94597K28771J11174M7896P6629R0665j67446O0281n8516J44816Q8850
15573C57764l31717j26410J23890J33005J0292k9287Q733n1743J67606l2687k55750
15562b6304n771j01258M3712J22092j5623N5715j5603J22304P1888L45J4934n2175
15550B14256J5751p174j4295k19532j41565p6039K2691j14202p2780J07287o493
15539b92095K7607j4033J88517O6615P6122m2286o7446O5350n2636N9881R811
15528B5407l63301N7807J83096k0570q6029K04609l643j85112k9317p8961o9069
$$ plain form
15604 -394118 -301738 -81486 101628 -17703 -79144 -290299 -301018 -41409 42227 56264
15594 56264 68835 -263954 -427609 -315730 -419609 -545686 -427770 -164087 64390 -70759
15584 -70759 -265356 -36585 74589 122485 199114 289779 122333 182614 124098 268914 357764
15573 357764 26047 -100363 23527 156532 166824 137537 146270 94527 262133 229446 -26304
15562 -26304 -32075 -133333 -89621 32471 16848 72563 56960 179264 251152 251497 266431 214256
15550 214256 230007 222833 208538 -10994 -152559 -228598 -205907 -320109 -392889 -285602 -292095
15539 -292095 -264488 -278521 -90004 -23389 52733 10447 -56999 8351 -44285 15596 25407
15528 25407 -337894 -280087 -96991 -117561 -203590 1019 -2624 -187736 -217053 -296014 -365083
15517c65083J22990J54634J3723K1288M0693r6170N1166J62628m3845j20274J29975
15506G1725N4539J49559r764k16763j40047L0371k10825P5263L55740K40861l2740
15495C67919k45244j39433J57163l4302l8000J18604j7389j0410j25716m52347
15485d19155j18733R7101J57612R3901K48651m14332q9287k475K93822J8126j15433
15474b50202l0673l4905j61931k5441M09765l96197k54477L47384K45218o9700
15464b21159J56863j3605o8674R9436O1630k01786j96355J05448M6260j55970
15454c87912J43818J79078q435j81895j66025L8103J31943K0790l6118j14143
15444c80796o2015p8605Q0264R4592J38539P0766J5993J94125r428M5469j03140
$$ plain form
15517 -365083 -242093 -87459 -73736 -52448 -11755 -107925 -56759 105869 62024 -58250 71725
15506 71725 126264 275823 266059 49296 -90751 -60380 -271205 -195942 159798 400659 367919
15495 367919 122675 -16758 140405 106103 68103 186707 169318 158908 33192 -419155
15485 -419155 -537888 -440787 -283175 -189274 59377 -354955 -444242 -446717 -152895 -134769 -250202
15474 -250202 -280875 -315780 -477711 -503152 -93387 -489584 -744061 -396677 -151459 -221159
15464 -221159 -64296 -77901 -146575 -47139 14491 -187295 -383650 -278202 -231942 -387912
15454 -387912 -244094 -65016 -73451 -255346 -421371 -383268 -251325 -230535 -266653 -380796
15444 -380796 -442811 -521416 -441152 -346560 -208021 -137255 -121262 72863 63435 108904 5764
15433E764j21595q7640J2141q1081o9193J40846K25516J6947Q4643J74135J18023
15422D18506r4563q6555j76209l9984O7542j68860j60920R853l8946N0615J72215
15411d7306p7258q351j1152k0405R2928k39277q9692J14538K22375k50030k17625
15400e31255P9245O411K93210N0933j53451M7166J36745P4374l2140K629j09841
15389a35974L4075L8027n1618N4967j75441K2222K94616J50312j30555k89665
15379a89034L440J15795M498j68956p4072j27421J83871N3053N6056j53791Q9296
15368b07265R9642r4316q4863J55145j8632n6925K67989J98134n1867k75990j6269
15357h5217J845R7181K59820m9320j77152j07200K7296P8196m5684k85623k2220
$$ plain form
15433 5764 -115831 -203471 -191330 -272411 -341604 -200758 24758 41705 126348 300483 418506
15422 418506 323943 237388 61179 21195 88737 -80123 -241043 -231190 -270136 -219521 -47306
15411 -47306 -124564 -132915 -144067 -164472 -71544 -310821 -400513 -285975 -63600 -313630 -531255
15400 -531255 -452010 -445599 -152389 -101456 -254907 -207741 -70996 3378 -28762 -26133 -135974
15389 -135974 -101899 -63872 -115490 -60523 -235964 -213742 80874 231186 100631 -189034
15379 -189034 -185594 -69799 -65301 -234257 -308329 -435750 -251879 -198826 -142770 -296561 -207265
15368 -207265 -107623 -201939 -286802 -131657 -150289 -207214 60775 258909 207042 -68948 -85217
15357 -85217 -83372 13809 273629 224309 47157 -60043 -32747 45449 -235 -285858 -308078
15346c08078J4478J10210R4047j6012p0494j0610J36508N1247k45348l377j13112
15335c60541J9839Q7268J04402m2144j93483O5655P8876J62065m3247P2757L5100
15324a3453M0675L6646L3840j95638j96555j15759J00150n1713k27502J51255
15314d38054K65272J17073L19420J13433j38813j9155P9792M3472k91725k65317
15304b14602o219p8433j36257K69201K43372J00722n9123j65495j60100l01589
15294e08523j1019J26979K3935o151m4805R8291J24374J9829K36594K50214k01730
15283A07988k48906M832L7533l5350R6591P9675R1418o7097P8485k7217J34833
15272B52785J50493q80n77557l22428r8563Q5590K01539N8623N4668j29007k5129
$$ plain form
15346 -308078 -293600 -183390 -89343 -105355 -175849 -186459 -49951 1296 -244052 -247429 -360541
15335 -360541 -340702 -253434 -149032 -191176 -384659 -319004 -240128 -78063 -121310 -48553 -13453
15324 -13453 27222 63868 97708 -97930 -294485 -410244 -310094 -361807 -589309 -438054
15314 -438054 -172782 -55709 263711 377144 238331 219176 298968 342440 50715 -214602
15304 -214602 -220821 -299254 -435511 -166310 77062 177784 118661 -46834 -206934 -508523
15294 -508523 -519542 -392563 -368628 -374779 -419584 -321293 -196919 -177090 59504 309718 107988
15283 107988 -140918 -136086 -98553 -133903 -37312 42363 133781 66684 145169 117952 252785
15272 252785 403278 402398 -175159 -497587 -596150 -510560 -309021 -250398 -195730 -324737 -349866
15261c49866K30360J21486j08538r0477l7727M4301N574J78385j8849J85980J63241
15250C23870K23747R9639l35471k94044k409j32129Q9979p0710n0974J39814q4878
15239i3566j13729P2653L7342M20568K11516k93933k63449k46403L9823K58677
15229B9499Q5934J6537l6073q5502J36155M9583j54299q5702J67501O024K34502
15218C64159K75950k66039k97671N9223m4829k18691J08924J54566o1439J0407
15208H4560P7817J726l39366k6887L18498R194r4793M284P7877P1783N5122j39022
15196A00793K6874R530J24308Q8390l7676J65536O073j39907l9096k79493j07832
15185h2500k0912K0310K23186J17246k66174Q0216N4382o9916l58132n0232K07390
$$ plain form
15261 -349866 -119506 1980 -106558 -197035 -234762 -190461 -184887 -6502 -25351 160629 323870
15250 323870 547617 647256 311785 17741 15332 -116797 -26818 -97528 -148502 -8688 -93566
15239 -93566 -207295 -134642 -97300 323268 534784 240851 -22598 -269001 -229178 29499
15229 29499 115433 131970 95897 10395 146550 196133 41834 -43868 123633 129657 364159
15218 364159 640109 374070 76399 135622 90793 -127898 -18974 135592 74153 84560
15208 84560 162377 164103 -175263 -202150 116348 125542 30749 35033 112910 184693 239815 100793
15196 100793 127667 137197 261505 349895 312219 477755 483828 343921 304825 25332 -82500
15185 -82500 -103412 -83102 140084 257330 -8844 71372 125754 55838 -302294 -352526 -145136
15174a45136j24309j020O8041Q1416N861j4141K38591K81901j9530j18426j79800
15163G3448j40306j75589R9712J82395Q964j6241m8768N7448n1104J28832j33251
15152a4460R4128K11495k3376q3602k06893L3874M2405K6840J18668J85472j51795
15141B32756k27376n4910k5800K82287j03040j26058k16556o7010J2647J1805
15131b81255N7687j38483j92R5256K41381J16530J62628j15866k65416o8251j85466
15120c81447N7415o8911r292N3996K57663J45595R2375n3810j65808M0670Q2070
15109E0516o2189J8122K21623J00117j16579p6494Q4037J9294k13774j80733Q5116
15098g0944L9664j10623R2589J11091j52440l8476K53715Q3961k65751k65865
$$ plain form
15174 -145136 -269445 -270465 -202424 -121008 -115147 -129288 109303 391204 371674 253248 73448
15163 73448 -66858 -242447 -142735 39660 48624 32383 -16385 41063 -10041 118791 -14460
15152 -14460 79668 291163 267787 184185 -22708 11166 53571 80411 199079 384551 232756
15141 232756 5380 -49530 -75330 206957 103917 -22141 -238697 -305707 -293060 -281255
15131 -281255 -223568 -362051 -362243 -266987 -25606 90924 253552 137686 -127730 -195981 -381447
15120 -381447 -324032 -392943 -402235 -348239 -90576 55019 147394 93584 -72224 -31554 50516
15109 50516 -11673 6449 228072 328189 211610 135116 219153 238447 24673 -156060 -70944
15098 -70944 -31280 -141903 -49314 61777 -90663 -129139 124576 208537 -57214 -323079
15088c23079k78484r4719N5318K57706J54436J33787J52702p0222L3104j00894
15078h0345Q5534K74923M3159j130k9920j83141J64417J04703o7558J00738M0950
15067D52330k95879k17934j57690J48173k2826l2028q6086J23369N4460j75704
15057b09815O0352j21484M6343R9746K18705p0327j65360J26852l5435j02041
15047a52464J324j37391J18506K95565n6093j29235j55454o0333O4508L7089O7690
15036a06288J24354k25347j21598j84429j59977K39159J90369K78781L4484k18237
15026a48729K1941K20495k2328J4239r6836K7164N6166j1207K9785r5637O8234
15015F3287k41263j08439J29652j11662J17570K35372k43691j86010J61919Q7281
$$ plain form
15088 -323079 -601563 -696282 -640964 -383258 -228822 -95035 57667 -12555 20549 -80345
15078 -80345 5189 280112 323271 322141 292221 109080 273497 378200 310642 411380 452330
15067 452330 156451 -61483 -219173 -71000 -93826 -125854 -211940 -88571 -34111 -209815
15057 -209815 -149463 -270947 -224604 -124858 93847 23520 -141840 -14988 -50423 -152464
15047 -152464 -151140 -288531 -170025 125540 69447 -59788 -215242 -275575 -211067 -173978 -106288
15036 -106288 18066 -207281 -328879 -513308 -673285 -434126 -243757 35024 69508 -148729
15026 -148729 -126788 93707 71379 85618 -11218 15946 72112 60905 90690 -4947 63287
15015 63287 -177976 -286415 -156763 -268425 -150855 84517 -159174 -345184 -183265 -95984
15005i5984J68240K08495K42571j59742l57275L1530J22842o4642j12743k44942
14995b61650L7881j7626k7806K3747J00547p8903k907J61446J55421O6958o2575
14984I4533J32988j27169k07641O1392q2789J0413J55108J43790j41839K1129
14974E9915R0964q5365q6139k37194n1231J15932R0886N4388J65796k69708j65431
14963c17187R7668j75695Q1184j45445J36703L63457K47452j74447k45630J10093
14953b1847j06147K8059j82892q52J40182j29046L3419L23033o8559k46614K52285
14942B1021K42300j42563j20514j39500M733J35770K0250M6517R756L44798J69902
14931E92470l6214j42164j51016l01109O270K9216j22208P2055P5317K50771J35198
$$ plain form
15005 -95984 72256 280751 523322 363580 6305 37835 160677 96035 -16708 -261650
14995 -261650 -223769 -241395 -269201 -245454 -144907 -223810 -226717 -65271 90150 157108 94533
14984 94533 227521 100352 -107289 -45897 -128686 -118273 36835 180625 38786 59915
14974 59915 150879 65514 -20625 -257819 -309050 -193118 -102232 -47844 117952 -151756 -317187
14963 -317187 -219519 -395214 -314030 -459475 -322772 40685 288137 113690 -131940 -21847
14953 -21847 -127994 -99935 -282827 -283679 -143497 -272543 -239124 83909 15350 -231264 21021
14942 21021 263321 120758 244 -139256 -134523 1247 21497 68014 77770 422568 592470
14931 592470 556256 414092 263076 -38033 -31763 -2547 -124755 -52700 22617 273388 408586
14920D08586n0324j69482j1909N9446j4827l06314k00076K8207J67888N3361l4015
14909f9459N5324K62012k0600p4311O4780P8914j04869p5882n0334J2661K13562
14898B91798m399l07692P8553q5893k09813J04403J91253j03338l6560j1227K3101
14887f9814N7974k48617L48908k9953k10198j55268m2778R8998j35342q7060J71487
14876c01663J59426K41511K36525j97693k25335K65610K49048k49371l55388j02268
14866b79598L52245N5578m1673j46813r5971J08942J81747p3216O4698o6081m3730
14855A6128J80241l9617j86154Q876K38850l7291l15011j17576L1222M1264L13572
14844A34504J54544m9870r2525p7803J80915k49361j97389Q7121L51204J64392
$$ plain form
14920 408586 358262 188780 176871 236317 221490 -84824 -284900 -256693 -88805 -35444 -69459
14909 -69459 -14135 247877 227277 152966 217746 296660 191791 115909 65575 78236 291798
14898 291798 287399 -20293 58260 -27633 -237446 -133043 58210 -45128 -81688 -92915 -69814
14887 -69814 -11840 -260457 88451 58498 -151700 -306968 -349746 -250748 -386090 -473150 -301663
14876 -301663 -142237 99274 335799 138106 -87229 178381 427429 178058 -177330 -279598
14866 -279598 72647 128225 86552 -60261 -156232 -47290 134457 61241 125939 59858 16128
14855 16128 196369 156752 -29402 -20526 218324 181033 -133978 -251554 -220332 -179068 134504
14844 134504 289048 239178 146653 68850 249765 404 -196985 -109864 241340 405732
14834D05732r6406J62091M1819l37955k82232M8001J78897j09035m5348J95990
14824A61554m8790k13359k33375j3163p370P2744R686J85027P5899o7975j98639
14813b77761k0313Q9680J40224J73554P7505m29743r1545J76177L00001Q7798
14803B25577j41921N4411J52150K3944k05132o779p5046J21231P4084P8261Q6711
14792C87491o6436j22004j71447o3551J4877P2358o6084j15379J311J5402K3934
14781h9528J40258J67061R1191K8193J2996k22510j4028j77061k37586N8467L05571
14770F3024J8226j08405J21620m2821k05002j87653O7942J96805J2585j0357J00692
14759B6656J07359O0604j86971o7554L8232P4009k46567Q3899n4880L2085J00208
$$ plain form
14834 405732 309326 471417 513236 175281 -106951 -58950 119947 10912 -34436 161554
14824 161554 112764 -100595 -333970 -347133 -354503 -281759 -272073 -87046 -11147 -79122 -277761
14813 -277761 -298074 -208394 -68170 105384 182889 -246854 -338399 -162222 137779 225577
14803 225577 83656 138067 290217 314161 109029 102250 27204 148435 222519 300780 387491
14792 387491 321055 199051 27604 -35947 -21070 51288 -14796 -130175 -128864 -113462 -89528
14781 -89528 50730 217791 308982 337175 350171 127661 113633 -63428 -301014 -242547 63024
14770 63024 81250 -27155 94465 51644 -153358 -341011 -273069 -76264 -63679 -74036 26656
14759 26656 134015 194619 7648 -59906 -21674 52335 -194232 -110333 -165213 -133128 -32920
14748c2920J22545k0273j94038j57609M8699K28365m4398k15031l2478L12802
14738A5664K64177J78150j65296l62378o4580J23974o5078k57653O9864K95235
14728C2079L22621q5666m7333m6570m7899R5612p1683k42909l35834P5143M069
14717c48370j6586J34325P5183J52458R2317k31693k73243Q712M2939l345N6871
14706c10432J22901M7239N8095M3389r5686K668P0067R9535n1838l6632k9449
14695h0143J24748j12870j29390j69646J28317K33334Q4965O6211j39599k46830
14685b40903j09520M9703P6962M61865K34843j04243j31045m3232m0146L013j43703
14674A3594j2727J04143M8457J44458O7679q2677j57884l13201j25347O9115l5726
$$ plain form
14748 -32920 89625 69352 -124686 -282295 -233596 -5231 -49629 -264660 -297138 15664
14738 15664 279841 457991 292695 -69683 -134263 -10289 -75367 -333020 -263156 32079
14728 32079 354700 269034 221701 175131 127232 222844 151161 -91748 -427582 -352439 -348370
14717 -348370 -364956 -230631 -155448 -2990 89327 -142366 -415609 -406897 -363958 -367303 -310432
14706 -310432 -187531 -140292 -82197 -38808 -134494 -131826 -61759 37776 -14062 -50694 -80143
14695 -80143 44605 -68265 -197655 -367301 -238984 -5650 79315 145526 5927 -240903
14685 -240903 -350423 -300720 -223758 238107 472950 368707 237662 194430 154284 157297 13594
14674 13594 867 105010 153467 297925 365604 282927 125043 -188158 -313505 -244390 -280116
14663b80116Q2691L39009o9895k89989k10641j9608L7764K37023M50472N7305
14653C34015k39462l31079r033K16262n9733n3920M64318K57225j95821r4669
14643B88103j31274k36931J66982k1806M138J45027K00224j60152j28866l46064
14633b20619K10370L40510j21281j95166j25239o1391M156N0793j0755m3405l1029
14622b03056K00928j245o5716N9648L0896M8564L3999j7107L4633n0383j38656
14611f7495J17456L51418j03260k02384k16572l1705j3216j78636K6207L3722
14601b84465N0116j1017l8954Q1800J10730J269J22718l7843J28661L2856J4160
14590A70031J91405J95884j23382k06073k15488j1893J13811L0017K3193N599
$$ plain form
14663 -280116 -197425 141584 71689 -218300 -428941 -448549 -410785 -173762 276710 334015
14653 334015 94553 -236526 -245559 -29297 -89030 -142950 321368 578593 382772 288103
14643 288103 156829 -80102 86880 65074 69212 214239 414463 254311 125445 -220619
14633 -220619 -10249 330261 208980 13814 -111425 -172816 -168660 -117867 -128622 -172027 -203056
14622 -203056 -2128 -3373 -69089 -9441 21455 70019 104018 86911 121544 71161 -67495
14611 -67495 49961 401379 298119 95735 -120837 -152542 -165758 -344394 -318187 -284465
14601 -284465 -234349 -245366 -284320 -202520 -91790 -90521 32197 -5646 123015 155871 170031
14590 170031 361436 557320 433938 227865 12377 484 114295 144312 167505 173104
14580A73104J78465j8483l13107r9515j5121o4664j7504p7260K34570j55935r6455
14569b71905N4430J68199K3503J08075J52231r6692j66978M5788o5035m4894J49655
14558E6377R9727J53043l4286k85215o1454j24791P8037K15733K47057j57706
14548A86522m28773r7554Q8702L57709K6134M7363L0444K2622j80086J5479j10279
14537d1717J06198l6449L429J91646k26594j16833M9422J61990K19443j82402
14527A28133k38676K22730K2769j31619J90933J35303k7077k31724j62251n5185
14517a46664K780N554j24388N8825R0584J03772k2458N060L10828R0173q7913
14506B86153j10001m0809j05584J6046J20665J24898o5188j26012J3257K23453
$$ plain form
14580 173104 351569 333086 19979 -79536 -94657 -159321 -176825 -254085 -19515 -175450 -271905
14569 -271905 -217475 -49276 -25773 82302 234533 137841 -29137 16651 -48384 -93278 56377
14558 56377 156104 309147 274861 -10354 -71808 -196599 -118562 97171 344228 186522
14548 186522 -242251 -339805 -251103 106606 132740 180103 210547 233169 53083 68562 -41717
14537 -41717 64481 28032 31461 223107 -3487 -120320 -70898 91092 310535 128133
14527 128133 -110543 112187 134956 3337 194270 329573 302496 70772 -91479 -146664
14517 -146664 -143884 -138330 -262718 -203893 -113309 -9537 -31995 -26935 283893 374066 286153
14506 286153 176152 135343 29759 45805 166470 291368 226180 100168 113425 336878
14496C36878o3650j06568j34877m646J65328m1566j57912k34292K59755N8493
14486G6943J47129K26946j38530q7745j36259j3625J81949J3909j91168j75504
14476i5955O6820Q1543m9907r870p8245L694J87678o0426n1385n0104n6191L3091
14464g9257o6382P555n0256j42102P4214Q5457j84169J19215K40633j61568j40002
14453b96662j1264O8357m4094L24366K84746K6367j3528m1575j7251k40897l11270
14442b72705L6191J85861n6880L5836J10671M9543R2562J36152J0778r4067M0552
14431B74494j53741k12121o9598J56042O4449k3272j09698P6562J01139L94184
14421D98440K70542j17325k85073R095N4879N732r8907k25820k15184k01639j3880
$$ plain form
14496 336878 273228 166660 31783 27137 192465 150899 -7013 -241305 18450 76943
14486 76943 224072 451018 312488 224743 88484 74859 256808 270717 79549 -95955
14476 -95955 -29135 52408 2501 -7369 -85614 -81920 105758 45332 -6053 -56157 -112348 -79257
14464 -79257 -145639 -138084 -188340 -330442 -256228 -170771 -354940 -235725 4908 -156660 -296662
14453 -296662 -307926 -239569 -283663 40703 325449 351816 338288 296713 279462 38565 -272705
14442 -272705 -236514 -50653 -107533 -71697 38974 88517 181079 317231 328009 233942 274494
14431 274494 120753 -91368 -160966 -4924 59525 36253 -73445 3117 104256 498440
14421 498440 768982 651657 366584 375679 430558 436290 337383 111563 -103621 -305260 -319140
14410c19140Q341J33159J59241L2916M9868J51410N3317j49544j2227j70501r1248
14399a54408L2591R8065o9711m1904N2706K04598M5793j25857n4329p0726K5545
14388e7637r2474M9318n0731K02435M0773n0430R3067J69787q0569j1578m7801
14377A64160M9005l03258N6604j06898K08187M7273n8491J06821O5669j25484
14367A03588K5458k6640j29430j6204k5442J57116J68864J90120k77891k50742
14357h1203j64620r4289M0362J82686J51448j2340j29467l39662j4841K48427
14347b13499M160j34585J82338l6170P6333J46181K53843K141j63750J02859J14563
14336C34414J955J19962K8177n5306j27271j25063R808J39349J4177j07977m8395
$$ plain form
14410 -319140 -310799 -177640 -18399 14517 64385 215795 269112 119568 107341 -63160 -154408
14399 -154408 -121817 -23752 -93463 -135367 -82661 121937 167730 41873 -12456 -83182 -57637
14388 -57637 -150111 -100793 -151524 50911 91684 41254 134321 304108 223539 211961 164160
14377 164160 213165 -90093 -33489 -140387 67800 115073 56582 163403 229072 103588
14367 103588 129046 102406 -27024 -43228 -68670 88446 257310 447430 169539 -81203
14357 -81203 -245823 -340112 -299750 -117064 34384 22044 -107423 -447085 -461926 -213499
14347 -213499 -209339 -343924 -161586 -197756 -121423 24758 278601 280742 116992 219851 334414
14336 334414 336369 456331 484508 429202 301931 176868 186676 326025 340202 232225 183830
14325A83830j01237k23051Q4040N8786J00094P6933J96761j09632j29555j12186
14315B4783J14536Q8473k66328l09992K66271J40370k40826J7524P758K70233
14305A12802L8484K9912m0978o0517n2621O3460l0279J9476J63517K820l5317
14294B10759L9060K46480R0125k15404j51890k64414j1306l3922m1374K46336
14284A14450K96961l37149l15932Q1170J59599K0189R2822K08474J01237k01691
14274B20130j60290J11981J66126k37364k28440J10201l6785Q5964l8897j07005
14264a14379L8711j02674p8318K20310K84417J66566J09457q2593j38465j48535
14254A54497L3512P7705M6106j73326k69948k12949j93738M6095M04246L89511
$$ plain form
14325 183830 82593 -140458 -56418 2368 102462 179395 376156 266524 136969 24783
14315 24783 139319 227792 -38536 -348528 -82257 58113 -182713 -165189 -157431 112802
14305 112802 151286 181198 140220 79703 27082 90542 60263 79739 243256 246076 210759
14294 210759 249819 496299 586424 371020 219130 -45284 -56590 -90512 -131886 114450
14284 114450 411411 74262 -241670 -160500 -901 19288 112110 320584 421821 220130
14274 220130 59840 171821 337947 100583 -127857 -17656 -54441 31523 -7374 -114379
14264 -114379 -75668 -178342 -256660 -36350 248067 414633 524090 441497 303032 154497
14254 154497 188009 265714 311820 138494 -131454 -344403 -538141 -492046 -87800 301711
14244C01711n3345k41669R0182j34211R0007P0781q6303R7420q6639k92802q5760
14233c30628p4084L63824L09978J37561j38764r3400Q8631l3310L3843n4016j27086
14222H2549j05306l5548M039o14J03889m6050L4168p1232J01672R4217J5794O7085
14210B44663J11616q7643q0019r4098k06638Q9982J98040j11501m5186O4077K07044
14199B90337K05041n6639j55925j89679J00717j98234j46168o6116o7620N7845
14189b26441L1997R1191P7593J26419j23558Q0283K38730Q8918l83825j68970
14179a67663M5120Q0070l18973K22503J630J31295M6683L3125J08913q667m6072
14168A27964j48264k4495J88922O3733j79462n6651K84331M6742j37266j87680
$$ plain form
14244 301711 248366 6697 96879 -37332 52675 123456 37153 134573 47934 -244868 -330628
14233 -330628 -404712 -40888 269090 406651 267887 174487 263118 229808 263651 209635 82549
14222 82549 -22757 -58305 -54266 -54880 49009 2959 37127 -34105 67567 161784 177578 244663
14210 244663 356279 268636 188617 94519 -112119 -22137 175903 64402 19216 83293 290337
14199 290337 495378 438739 282814 93135 193852 -4382 -150550 -216666 -284286 -226441
14189 -226441 -194444 -103253 -25660 100759 -22799 57484 296214 385132 1307 -167663
14179 -167663 -122543 -42473 -361446 -138943 -137313 -6018 40665 73790 182703 174036 127964
14168 127964 -20300 -44795 144127 207860 28398 -28253 256078 302820 165554 -22126
14158b2126q6467j62r3881m7080J86837l906J3899K03303p3565l9500J05954J07209
14146B50515k1139L930L5610J65716j94350l29650K07333M5683J25006j27111
14136A61543j65078J58764j75352j44075N8652J00546j22451K37992P4782J0023
14126A95346l4963q5195K54981k17402o639J41272K96058q6089j48700j69675
14116A38994R7799J55294K01565m8920j12781J18485j2886j31534N3060P8862
14106E37938l14684j91575j40528K64293N2517k329o2064L2280o9873j13050J11593
14095A04518K24457j30446j15012j03920l6588M3778l1705j85232p4163j11738
14085d16051q7529J07537J78468K99986M6529K36929K31943o5143j42817k10982
$$ plain form
14158 -22126 -108593 -108755 -202636 -249716 -62879 -66785 -52886 150417 76852 37352 143306 250515
14146 250515 229376 233306 268916 434632 240282 -89368 117965 163648 288654 161543
14136 161543 -3535 155229 -20123 -164198 -105546 -5000 -127451 110541 185323 195346
14126 195346 160383 75188 330169 112767 106128 247400 543458 457369 308669 138994
14116 138994 236793 392087 593652 544732 431951 550436 537550 406016 459076 537938
14106 537938 223254 31679 -108849 155444 207961 205632 143568 175848 105975 -7075 104518
14095 104518 328975 198529 83517 -20403 -56991 -13213 -44918 -230150 -304313 -416051
14085 -416051 -503580 -396043 -217575 82411 128940 365869 597812 532669 389852 178870
14075A78870m6485J44811J8834j86430l88914M1131N5223J24977K57827K05621
14065D05465n137k26376n2946L11847n0071k31991J32839K01222j37457j40467
14055B06928J42406R2063k94327J0942J22528J82367O3738j40428P2213J53364
14045F11794j24752M9057R8961j57012R1873k7426p3320j33354L2702j48782o0507
14034A59234j3476l01614k18778K26642K1293P1994Q7914r6188K44375K318O294
14023A90008R2499K09415J92986r9510l25455O2381p3020j53430m3158J0814R6446
14012A59976K72657L9888n9904J55356j5921j11283o9788n1342k3571j42900r8378
14001E4790j13244L38318K79618J51072n231j67030l9414K0968p8786q5746k49006
$$ plain form
14075 178870 132385 277196 296030 109600 -279314 -238183 -182960 -57983 199844 405465
14065 405465 400328 173952 121006 432853 382782 150791 283630 484852 347395 206928
14055 206928 349334 441397 147070 158012 280540 462907 526645 386217 458430 611794
14045 611794 487042 536099 635060 478048 569921 542495 469175 335821 368523 219741 159234
14034 159234 145758 -155856 -374634 -147992 -126699 -54705 33209 -62979 181396 183714 190008
14023 190008 282507 491922 684908 585398 259943 322324 249304 95874 52716 63530 159976
14012 159976 432633 472521 412617 567973 552052 440769 370981 319639 296068 153168 54790
14001 54790 -58454 279864 559482 710554 705323 538293 498879 519847 441061 355315 106309
13990A06309j31542L9238K30148K0696J40203k20574j93197K27602P3318l6021
13980B56180k31657p4903j7777J411K65363J84392Q086m5701l4690k8835L3440
13969C15309K50491j19638K56989N69459j02100j55303r706k96133j13974p8990
13959E16404j04914o8363J7097J45741m06980r7728p814o5469J85616j6866O3516
13948A60240K9078o8835j88826L28404L26641L73400N8790K30517M8232J00929
13938A398570o4766l11693J49268M1086o2564J22404L2177j45405R5666K37650
13928A492393K64558J16256J63329L10022K83307k1692m36803j44371r7853j68362
13918A760784P0050n2301J26742k31231r8284j892K0899n2246J775j20475k34481
$$ plain form
13990 106309 -25233 14005 244153 264849 405052 184478 -8719 218883 292201 256180
13980 256180 24523 -50380 -68157 -66746 198617 383009 391095 345394 310704 281869 315309
13969 315309 565800 446162 703151 1272610 1170510 1015207 1005501 709368 595394 516404
13959 516404 411490 343127 360224 505965 98985 1257 -6557 -72026 113590 96724 160240
13948 160240 189318 120483 -68343 260061 586702 960102 1018892 1249409 1297641 1398570
13938 1398570 1333804 1022111 1171379 1212465 1149901 1272305 1304482 1159077 1254743 1492393
13928 1492393 1756951 1873207 2036536 2346558 2629865 2608173 2171370 2026999 1929146 1760784
13918 1760784 1830834 1778533 1905275 1674044 1575760 1573868 1594767 1542521 1544296 1423821 1189340
13907A189340j55031o5139R6250K1595k639k47307j10290j41046o701N3801K48411
13896H81244J49800o4492j70433J45320N46410J37685q7346J60812q2279q3756
13886A532965k3147O7966n3479j0521l2599J05850J46084j01220j12665j23671
13876A395563j21598J6176J03225k28313l01019k11186j42772J17912K75411Q1532
13866I84931K15810j76445p0532K51548j36191l48639k44472K23064O1355L3366
13856G93795K82757J70763J06656N1610k61390R2888l3023j87286j67689r2250
13846G56831l4837O8662P5586K51617m1413J97705P4559Q3125j09624j44720k62707
13835I14784l39839L630J89836M87136J46424j18280Q2506l6304j6536J2783j82553
$$ plain form
13907 1189340 1034309 969170 1065420 1087015 1084376 837069 726779 585733 579032 632833 881244
13896 881244 1031044 966552 796119 941439 1487849 1625534 1538188 1699000 1616721 1532965
13886 1532965 1509818 1577784 1524305 1513784 1481185 1587035 1733119 1631899 1519234 1395563
13876 1395563 1273965 1290141 1393366 1165053 864034 652848 510076 627988 903399 984931
13866 984931 1200741 1024296 953764 1205312 1069121 720482 476010 699074 760429 793795
13856 793795 1076552 1247315 1353971 1405581 1144191 1237079 1204056 1016770 849081 756831
13846 756831 721994 790656 866242 1117859 1076446 1274151 1348710 1431835 1322211 1177491 914784
13835 914784 574945 578575 768411 1255547 1401971 1283691 1366197 1329893 1313357 1326140 1143587
13824A143587m3299P5151J04278k94882J61707M3015P3061k7793l08143k71131
13814F55551j60145l3121j43409n4685j73771L71321L70679J75114Q8768K38129
13804A334431O8458K10284J91642j25288k92762j13917k57017o6034m3745L3878
13794I39930R417k72819k31253J51513K96880N3109k03028j81278K3209J59342
13784G45022M1928k44282M9961j19514m8458j44526J18061J96001m2018r3426
13774D58749K29249K94452J18217k50820p7330J84639p7861j57150J40957J50046
13764A013148j37482k38370j36169O2947j04737j45496K16834J32849j66889J51501
13754F48136k7391j00767j2342Q647k7104J07049L2989J19289K33660J41311k43580
$$ plain form
13824 1143587 1100288 1175439 1279717 984835 1146542 1189557 1262618 1234825 926682 655551
13814 655551 495406 462285 318876 264191 90420 461741 832420 1007534 1096302 1334431
13804 1334431 1402889 1613173 1804815 1679527 1386765 1272848 1015831 949797 906052 939930
13794 939930 949347 676528 445275 596788 893668 946777 743749 562471 585680 745022
13784 745022 786950 542668 592629 473115 424657 280131 398192 594193 552175 458749
13774 458749 687998 982450 1100667 849847 772517 957156 879295 722145 863102 1013148
13764 1013148 875666 637296 501127 564074 459337 313841 530675 663524 496635 648136
13754 648136 620745 519978 507636 516283 489179 596228 629217 748506 982166 1123477 879897
13743H79897n1223j44773n5346j47157j9688m4710l37183J2001K38542K32073
13733E62433j13288K2006R2595j24751m4468j1735j6080q9061P0053o3265j07684
13722A76755K7068k3591J23464R5505K88352J11916O7574J7679J53975m9112J46517
13711A136102j27923n06839K032K88699Q5326j01850j90678j61312K61997l6350
13701F49204k12737P5306m4827N2733Q0993N6859r8876K0511J12763R7082K06915
13690I95926o7867k48669l1696J98993O7489L4468J43106J10690P6963K26780
13680A506183K0919l03319k77623r5571J33806M11919j32045k45141K1924P8131
13670A119183j51289R6464L9127J22573j2407K36312K15585l34939l44984j61238
$$ plain form
13743 879897 828674 683901 628555 481398 461710 417000 79817 91818 330360 562433
13733 562433 449145 471151 563746 438995 394527 382792 366712 277651 347704 284439 176755
13722 176755 203823 180232 303696 399201 687553 799469 867043 884722 1038697 989585 1136102
13711 1136102 1008179 501340 503372 792071 877397 775547 584869 423557 685554 649204
13701 649204 436467 511773 466946 519679 600672 657531 558655 579166 691929 789011 995926
13690 995926 928059 679390 647694 846687 914176 948644 1091750 1202440 1279403 1506183
13680 1506183 1527102 1223783 946160 850589 984395 1396314 1264269 1019128 1041052 1119183
13670 1119183 967894 1064358 1103485 1226058 1213651 1449963 1665548 1330609 985625 824387
13660H24387o8524J16571O5787J35553K0825j78576l5263J05560n1149M8337J78460
13649A161968L3149r6666O6021J07911J50182J88009j02784P5282l18528l03529
13639I61015J50120l614J01957Q0389L69653R0515k7835J06975J26362o7378o5217
13628A822942R4177m6741r9054j24553J03932J43966k5288P7232l68523j85714
13618A392376q0162K05989L19685J29353j46913O8549l4835J4787j7749K82665
13608B133745K57006J27186K44476K62591L59220K54073L27208M50321O65025
13599E080851R21461J249856K094135L092916L582379L830688L280788J761827
13591B4894901o17871k951385m207418l328809k529819k173945j463592q60651
$$ plain form
13660 824387 755863 872434 938221 1073774 1094599 916023 880760 986320 935171 983508 1161968
13649 1161968 1195117 1098451 1164472 1272383 1422565 1610574 1507790 1583072 1264544 961015
13639 961015 1111135 1107521 1209478 1289867 1659520 1750035 1722200 1829175 1955537 1888159 1822942
13628 1822942 1917119 1870378 1771324 1646771 1750703 1894669 1869381 1946613 1578090 1392376
13618 1392376 1312214 1518203 1837888 1967241 1820328 1888877 1854042 1868829 1851080 2133745
13608 2133745 2390751 2517937 2762413 3025004 3384224 3638297 3965505 4415826 5080851
13599 5080851 6002312 7252168 9346303 12439219 16021598 19852286 23133074 24894901
13591 24894901 24277030 21325645 17118227 13789418 11259599 9085654 7622062 6761411
13583F761411p69469p54299n17281j75668J16908m0342J36373n3651k52666k47428
13573D203888L9692J23134J40599J75341K69774L30367K33739L15317J65111J65179
13563F162141K67109n6103J65948L81321J68996j30342l88989k00076k72096M4127
13553F142036q1313k87322j73927l7500N9791J40536K45591l1418p3769J04241
13543F006946r6025N6119m5795r0613j64675j70036J3271N3127O990p1964K56742
13532E754087J65754J17135K16836J95637K01907K89965L56263L13294L32972
13523G943850M52456N10969M47237O07271N31548M88857P90233Q57866J209954
13514A3840241J719297K378817K727912L504247N008953P035523R642839J4121729
$$ plain form
13583 6761411 5991942 5237643 4720362 4544694 4661602 4621260 4757633 4703982 4451316 4203888
13573 4203888 4243580 4366714 4507313 4682654 4952428 5282795 5516534 5831851 5996962 6162141
13563 6162141 6429250 6373147 6539095 6920416 7089412 6959070 6570081 6370005 6097909 6142036
13553 6142036 6060723 5773401 5599474 5561974 5621765 5762301 6007892 5976474 5902705 6006946
13543 6006946 5910921 5967040 5921245 5830632 5665957 5495921 5509192 5562319 5569309 5497345 5754087
13532 5754087 5919841 6036976 6253812 6449449 6651356 6941321 7297584 7610878 7943850
13523 7943850 8396306 8907275 9354512 9961783 10493331 10982188 11772421 12630287 13840241
13514 13840241 15559538 17938355 20666267 24170514 29179467 36214990 45857829 59979558
13506E9979558J9940509K4941473K7554854K4359627J2962922k608744j7216336
13499A49913863k5766701k6701089k1716133j5952541j0744525o922108m378701
13492C7732065l193252k002224p65899L06526J123265K406901L844296N544655
13484D4996333P605519R143844R528737P231571L031770l25954j178975J146715
13476H1179560N127191Q406246J0032574Q145093M225439O70846M29973M550003
13468A22766925J0437583J8586912K7912135L7913394M7267127N3927330N5841420
13461C74652826M2206374J3405021k0394701m5081760m8172765l5681688k0717959
13454B60215348j0004524o462337n847053o968656j0926801j6455396k1195488
$$ plain form
13506 59979558 79920067 104861540 132416394 156776021 169738943 167130199 149913863
13499 149913863 124147162 97446073 75729940 59777399 49032874 42110766 37732065
13492 37732065 34538813 32536589 31770690 32077216 33200481 35607382 39451678 44996333
13484 44996333 52601852 61745696 71274433 78506004 81537774 81211820 80032845 81179560
13476 81179560 86306751 94712997 104745571 112890664 117116103 117786949 118216922 122766925
13468 122766925 133204508 151791420 179703555 217616949 264884076 318811406 374652826
13461 374652826 416859200 430264221 409869520 364787760 316614995 280933307 260215348
13454 260215348 250210824 243748487 237901434 230932778 220005977 203550581 182355093
13447A82355093k2046446j7797295j0895755m049453K521436R315746J6062686
13440A55466012K2716111K6284151J9535502N286475q203428j3526510o736667
13433B00821646N316624J7292702K7334726L2800041K8783268J8459264P269929
13426C38078200K245575Q82898n706190j5815416k2742881j9819256p830679O317685
13418B75609936J5349031J4932850L523781j4073249k9794774l7116772l5473342
13411A92957461k8064647j9701826j3395906q651618n093498l245617k027051
13404A12777298j875770j971337j521320m81545M95629J613282K605546K949454
13396A14591237L180549M304322O031951Q688637J2167195J6963335K2594768
$$ plain form
13447 182355093 160308647 142511352 131615597 127566144 130087580 139403326 155466012
13440 155466012 178182123 204466274 224001776 229288251 221084823 207558313 200821646
13433 200821646 206138270 223430972 250765698 283565739 312349007 330808271 338078200
13426 338078200 340323775 341206673 335500483 319685067 296942186 277122930 269292251 275609936
13418 275609936 290958967 305891817 309415598 295342349 265547575 228430803 192957461
13411 192957461 164892814 145190988 131795082 123143464 118049966 114804349 112777298
13404 112777298 110901528 108930191 107408871 106927326 107422955 109036237 111641783 114591237
13396 114591237 117771786 122076108 128108059 136796696 148963891 165927226 188521994
13389A88521994K8674208L3167867L1405302K1105395Q049078j343049m061199
13382C05519596p622039j6625991k6379194l0095150k3549943j1876510k37831
13375A89132938R528063J4896657Q268007n908023j9975724k6600130k2358035
13368A46983753j4241008p082940j648718L079245P597146J0511705J1288103
13361A56487286P288446j00858o672370r044400o084631q06919N275992J0883120
13353A57225666J6016683J9992906J9554324Q078412q145739k2575716k6706373
13346A63440163k1563790j4772729q694818l802336J30422L301549N270080N691285
13338A28999826L510112p80338n169326p432421o272956k915804M19954K617809
$$ plain form
13389 188521994 217196202 250364069 281769371 302874766 310923844 309580795 305519596
13382 305519596 297897557 281271566 254892372 224797222 201247279 189370769 189132938
13375 189132938 198661001 213557658 221825665 215917642 195941918 169341788 146983753
13368 146983753 132742745 125659805 124011087 127090332 134687478 145199183 156487286
13361 156487286 163775732 163674874 157002504 147958104 141873473 141066554 146342546 157225666
13353 157225666 173242349 193235255 212789579 220867991 212722252 190146536 163440163
13346 163440163 141876373 127103644 118408826 114606490 114736912 118038461 123308541 128999826
13338 128999826 132509938 131729600 126560274 119127853 112854897 109939093 110359047 112976856
13330A12976856J440543k986994p481683j0462139r831341p564278n339697l920730
13322F6830537k551388j460069j346398q15501q34918j409210k197963k375023
13314E3840067k013336j704600j593602j673707j026929q76028p99839o24321
13306D3527705q15425p00471j294919j254575j042772j196046j064690r34488
13298C5224319p90102j072550j344320j239076j503105j239300j168362r47072
13290B5920432p38448p96476q83703p43916p11837o94533l85992l67541o13922
13281A9984064p22332p55116n98281n82710o58314l67800j81502j43955l35470
13272A5638584n84559n75216l78564l83880l62254l29925k42441r9551l50465
$$ plain form
13330 112976856 114417399 111430405 103948722 93486583 83655242 76090964 70751267 66830537
13322 66830537 64279149 62819080 61472682 60657181 59822263 58413053 56215090 53840067
13314 53840067 51826731 50122131 48528529 46854822 45827893 44951865 44152026 43527705
13306 43527705 42712280 42011809 40716890 39462315 38419543 37223497 36158807 35224319
13298 35224319 34434217 33361667 32017347 30778271 29275166 28035866 26867504 25920432
13290 25920432 25181984 24385508 23501805 22757889 22046052 21351519 20965527 20597986 19984064
13281 19984064 19261732 18506616 17908335 17325625 16667311 16299511 16118009 15974054 15638584
13272 15638584 15054025 14478809 14100245 13716365 13354111 13024186 12781745 12682194 12331729
13263A2331729m23585j69555k50470l02360k90850l66240m15346k50196k74246
13254I588881k16037j86182p4790j74698l45788k22888o6937l53604l43877j33218
13244G470862p4359n4961K7828L9387j62024k14705k08029p5026o7474k11756
13234F469743j72543j61442j07207m43432j61298l9332j48034p0364J59020L5425
13224E360536q5768k82584k76027j89094k05903l37163q1988M0155J65084L807
13214D111055L7113q111M7402n2139j53734l14988q2977m6398j4064j25977k9739
13203C367443p5881r4566n4225L7363j06482k0057R7193j55394j29636k46301
13193B619457k06990k018J01877K15900K09583O2881O0685j04086j10862m5887
$$ plain form
13263 12331729 11908144 11738589 11488119 11185759 10894909 10528669 10113323 9863127 9588881
13254 9588881 9372844 9186662 9111872 8937174 8591386 8368498 8301561 7947957 7604080 7470862
13244 7470862 7396503 7341542 7369370 7408757 7246733 7032028 6823999 6748973 6681499 6469743
13234 6469743 6297200 6135758 6028551 5585119 5423821 5384489 5236455 5166091 5325111 5360536
13224 5360536 5274768 4992184 4716157 4527063 4321160 3983997 3902009 3942164 4107248 4111055
13214 4111055 4148168 4140057 4187459 4135320 3981586 3666598 3583621 3537223 3523159 3397182 3367443
13203 3367443 3291562 3196996 3142771 3180134 3073652 3053595 3150788 2995394 2865758 2619457
13193 2619457 2412467 2410449 2512326 2728226 2937809 3000690 3061375 2957289 2846427 2800540
13183B800540j39253k58104K434n8599l47117j04386R8701o4144L6953K8007N3631
13172B048663l9617J92116l8534J0301P1041J2981J81852K02259k06900l85279
13162B048883j55844J81559q8769J98575q0812k29190k47453P2118J18537J2893
13152A830497k5501J67439R2349n7077o9821n6475n9595J01879m5895J88502l8277
13141B028025J2618j33919l28642k72436Q3442J16452P803r4964R8403J09445
13131A626227k31200j27578J9330J62684O3000r3834m0061k38744k34169J00654
13121A006309K50861j54467k79854J6501Q0289M44953R3726K2455K442n3681o3112
13110A366422j64545p4806j5621K9738k53536k29675N7740M610J66497M6747L4280
$$ plain form
13183 2800540 2661287 2403183 2405617 2347018 1999901 1895515 1994216 1930072 1967025 1995032 2048663
13172 2048663 2009046 2201162 2162628 2172929 2243970 2256951 2438803 2641062 2434162 2048883
13162 2048883 1893039 2074598 1985829 2184404 2103592 1874402 1626949 1699067 1817604 1830497
13152 1830497 1804996 1972435 2064784 2007707 1937886 1881411 1821816 1923695 1877800 2066302 2028025
13141 2028025 2040643 1906724 1578082 1305646 1389088 1505540 1513343 1418379 1516782 1626227
13131 1626227 1395027 1267449 1286779 1449463 1512463 1418629 1378568 1139824 905655 1006309
13121 1006309 1257170 1102703 822849 839350 919639 1364592 1458318 1480773 1483215 1429534 1366422
13110 1366422 1201877 1127071 1111450 1141188 887652 657977 715717 720327 886824 933571 967851
13099I67851p2616r9038J3043j17158n7996K26551J3020l6677J36521L88026j88833
13088A172694j78746P8163L4300N1584j91137k60500m6364R0686p417r1325j03772
13077E48166N6866J02816p925o4504J52648K4412j54141j53519o9076p1470r140
13066C55133k6899j57183M33335J61014Q5825p0637j30341j48450Q7480L44028
13056I33305J42976j16560p8633j99923j75982K4060J66306J02895J36898j34780
13046H00562l24775k35109Q8586R0139J53030J08988k89311p6228N1219j8971
13036C48130J9806L71460J60645L5383J90882j1969M2845r6980p9109k03892P7447
13025H54648M6715Q8929j25398j39436P9362Q976J78526j53950J8133o3266J25921
$$ plain form
13099 967851 895235 796197 809240 692082 634086 860637 873657 836980 973501 1361527 1172694
13088 1172694 993948 1072111 1106411 1157995 966858 706358 659994 750680 743263 651938 548166
13077 548166 605032 707848 699923 635419 788067 812479 658338 504819 435743 364273 355133
13066 355133 328234 171051 604386 765400 851225 780588 650247 501797 589277 933305
13056 933305 1076281 959721 881088 681165 505183 529243 695549 798444 935342 800562
13046 800562 475787 240678 329264 419403 572433 681421 392110 315882 367101 348130
13036 348130 367936 739396 900041 935424 1126306 1114337 1157182 1060202 981093 777201 854648
13025 854648 901363 990292 864894 725458 804820 813796 992322 838372 856505 793239 919160
13014I19160j44198k18620k03762l351M3012K65682j56803q3883J46545J04114
13004F67896K60433J05907K81580L46494J32880J35113l5953k4022q830m9914
12994A811584K27994L23031R0821o2154J14554J10844j93820l36304j75333k24860
12984A686357k88545r9649M4189J05995J15478j69530k56756o4918m8956J21338
12974A145003L10298J5074k82971j14179r4182J69991O5476K37387K314k74184
12964A180027k12326J5902J65849J22257L6209l7517k96944m2656N4613l7846
12954I47568J71125j01141K55446K57867L45777L74438k8507J18157j8642q3538
12944B238550k39081k86757j12737k06251j82558j22569q6355q1670J07031O7679
$$ plain form
13014 919160 774962 556342 352580 349229 392241 657923 501120 417237 563782 667896
13004 667896 928329 1034236 1315816 1662310 1795190 1930303 1894350 1870328 1861498 1811584
12994 1811584 2039578 2362609 2453430 2391276 2505830 2616674 2422854 2086550 1911217 1686357
12984 1686357 1397812 1298163 1342352 1448347 1563825 1394295 1137539 1072621 1023665 1145003
12974 1145003 1455301 1470375 1187404 1073225 979043 1149034 1214510 1451897 1454211 1180027
12964 1180027 967701 983603 1149452 1271709 1307918 1270401 973457 930801 985414 947568
12954 947568 1118693 1017552 1272998 1530865 1876642 2251080 2222573 2340730 2322088 2238550
12944 2238550 1999469 1712712 1599975 1393724 1211166 1088597 1002242 920572 1027603 1095282
12934A095282J589L0451j77010J9736j66948j29023K60834L01984L09983J34932
12924A681810K11356K47648k2160K9207K12012p1193q5198J3699J1397j85102
12914B043476j91141j24965j65753p6950r1353p4048O8010j83903j52564K40222
12904A291031Q4480Q064j19580j53886j31297j00088R2708m4100L97729K33650
12894A558711L4377P368J30815L20544J63445j06688j80173O974j96222P3515
12884A812666P1477M4369J2576K79455J25188K1364K42916m3234m17503m35165
12874A714109j43344N5465r3575m31523q3671L94631J35897j2340K48558K51095
12864B035302j13916q3788j85246J39631k46986k17620k00084l03478q080o3266
$$ plain form
12934 1095282 1096871 1127322 950312 970048 803100 674077 934911 1236895 1546878 1681810
12924 1681810 1893166 2140814 2118654 2147861 2359873 2288680 2203482 2217181 2228578 2043476
12914 2043476 1852335 1727370 1561617 1484667 1393314 1319266 1387276 1203373 1050809 1291031
12904 1291031 1375511 1383575 1263995 1110109 978812 878724 971432 927332 1325061 1558711
12894 1558711 1593088 1600456 1731271 2051815 2215260 2108572 1928399 1935373 1739151 1812666
12884 1812666 1884143 1928512 1941088 2220543 2345731 2367095 2610011 2566777 2149274 1714109
12874 1714109 1570765 1626230 1532655 1101132 1017461 1412092 1547989 1535649 1784207 2035302
12864 2035302 1921386 1837598 1652352 1791983 1544997 1327377 1127293 823815 815735 752469
12854G52469r8991N0983J48734J49912j1931j61787k55612J13870Q3097K71050
12844A041794J26681j50534J73460K67004o9652n6951O9441l6958o1183j84655
12834A118447k64620j33439j18808O6984J21405L7795l4925m3103j81707j05374
12824D62655R8071K34931k9660j66053k75460k1384J50727r4654J43768K16652
12814G19593j68306O0914J7737o9991K0312J68311L8350j23879L0791K10582K79365
12803A183779j13576l16934j84244j32010j16005o283K06306R3948l95544k77645
12793e8208J06648K08386P7701p5800k13358k461J75530J14595L5086j81118j28257
12782E8744K70239O9564k22021J04302r0733k32605k1528J72191J48676j89051
$$ plain form
12854 752469 653478 704461 853195 1003107 991176 829389 573777 687647 770744 1041794
12844 1041794 1168475 1017941 1191401 1458405 1388753 1331802 1401243 1364285 1303102 1118447
12834 1118447 853827 720388 601580 668564 789969 827764 792839 749736 568029 462655
12824 462655 560726 795657 765997 599944 324484 303100 453827 359173 502941 719593
12814 719593 551287 612201 629938 559947 580259 748570 786920 663041 693832 904414 1183779
12803 1183779 1070203 753269 569025 437015 321010 314727 521033 614981 219437 -58208
12793 -58208 48440 256826 334527 258727 45369 42908 218438 333033 368119 187001 58744
12782 58744 328983 398547 176526 280828 190095 -42510 -64038 108153 256829 67778
12772F7778j67536Q3970j8860J09874N538r270j6205J90392l6290q5532q1769
12761D2090K20865O7893J58428k33344l32576J88206L31420J6139j21304J04241
12751D42058O8522q44j78250k7662J76391r2565k92101q2838J90928R4194j98425
12740I9408k72835n2147K18742J63037P9969k2775J30718j81534J4552J3240J29822
12729C20197J38761K77415N62516K16204L33756L06173J28820k32658q3875k83443
12719A683866n72987k49387j07160l81327n810J28486K99958l5626P7099M7344
12709H84456P5268j77401r0570l9408j57779K9543n2504l5281K95130J17039l93876
12698D54617K348K66193J37065j06477j5588R2271J98936k8797n5627L11373N54551
$$ plain form
12772 67778 -99758 -15788 -34648 75226 80764 71494 55289 245681 209391 123859 42090
12761 42090 262955 330848 489276 255932 -76644 111562 442982 459121 337817 442058
12751 442058 510580 509736 331486 303824 480215 387650 95549 12711 203639 297833 99408
12740 99408 -173427 -225574 -6832 156205 236174 213399 344117 162583 177135 190375 320197
12729 320197 458958 736373 1298889 1515093 1848849 2155022 2283842 2051184 1967309 1683866
12719 1683866 1110879 861492 754332 373005 367195 495681 795639 760013 837112 884456
12709 884456 959724 782323 691753 652345 494566 524109 471605 436324 731454 848493 454617
12698 454617 456965 723158 860223 753746 738158 830429 1029365 1000568 944941 1256314 1810865
12687A810865O19791O98194N00819R5620j93975l49823o77931n64900n24708m68520
12677I45432j40970K017k18432P5672J74791k24132k5802j4908J55425R7734j14107
12666G12720m2329P3240M039r5799M9353o4859j07400P8744R8582O4986K34199
12655A005476p1954Q9754L2242Q0668k25692k0415K14597J36703J61788L83853
12645A787020M18719J36196j41497l92130p87467r9702j28572j88877q261l4039
12635E61390J89389k3322J24567o694j07058j36559j49290m843R2274J4661j04636
12624D49879M5313O7234k11955j4970K21559J03709j03828J12468P2094Q0744
12614H22247l5732j48634J14576j07234k3514q7930p2082R9591j78076J10535
$$ plain form
12687 1810865 2430656 3128850 3629669 3725289 3531314 3181491 2503560 1938660 1413952 945432
12677 945432 804462 806479 588047 663719 838510 614378 588576 573668 729093 826827 712720
12666 712720 670391 743631 747670 651871 701224 636365 528965 607709 706291 771277 1005476
12655 1005476 933522 1023276 1055518 1136186 910494 890079 1104676 1241379 1403167 1787020
12645 1787020 2205739 2341935 2200438 1808308 1020841 921139 792567 603690 595429 561390
12635 561390 750779 727457 852024 845330 738272 601713 452423 447580 539854 554515 449879
12624 449879 495192 562426 350471 335501 557060 660769 556941 669409 741503 822247
12614 822247 786515 637881 752457 645223 621709 533779 461697 561288 383212 493747
12604D93747R1051j00540k184J31075K06967n7983L2183l0584j11359o9049O9425
12593F52749r8147j26021j27132j14715J87707K67870O384n7634m7916K98912
12583H42057R9796k88669l47205j23967K44817P4109K12506J4027j32890k8849
12573E65732L73389L05542j88331j64818M2824j66088j83557j9205l95635J3466
12563A83319J35231M9694J3684R6671J04630K7109p3307R3830j74383p2727Q7774
12552D71525K13435J71710q5668j7871J87548l65768p8622J86298J67525J02578
12542I52690q4400j35442O5137K70432K0038j62931K30626J06363j11089L46K70932
12531A422702N7054j12181q7894J22214K76881j02625j06405j75274k48952j16382
$$ plain form
12604 493747 584798 484258 482074 613149 820116 762133 794316 763732 652373 583324 652749
12593 652749 554602 428581 301449 186734 374441 642311 648695 591061 543145 842057
12583 842057 941853 653184 305979 182012 426829 500938 713444 727471 594581 565732
12573 565732 939121 1244663 1056332 891514 934338 768250 584693 565488 169853 183319
12563 183319 318550 368244 381928 478599 583229 610338 537031 630861 456478 383751 471525
12552 471525 684960 856670 771002 753131 940679 574911 496289 682587 850112 952690
12542 952690 868290 732848 797985 1068417 1088455 925524 1156150 1262513 1151424 1151770 1422702
12531 1422702 1479756 1367575 1279681 1401895 1678776 1576151 1469746 1294472 1045520 929138
12521I29138o2526k9046j46313J69520M4544n2549n3334j60433j06358j06311
12511D26332J425J75003K11812J20134o9831K0651J36228k0246K32774K2040J46298
12500A402620K42379j49511j97673n2323K45578L0808L2619J33012K08127j9612
12490A876024J0329J54136m1815j21726K9473J94270K1958K10114R4264j07031
12480B319996J74392K31843J05597j26522j67741Q4560m6279J85396L0858J92565
12470B984665n2388L24134M6020n8254L44343N08721O45448N87128L34697N52884
12460F217398P97393Q74411J082134J502785K039875K399970L073718M469124
12452B2456808O237239R195045J3555425J9316210K6539031L3854101L6731575
$$ plain form
12521 929138 866612 837566 691253 860773 905317 852768 799434 639001 532643 426332
12511 426332 427757 602760 814572 934706 864875 885526 1021754 1001508 1234282 1256322 1402620
12500 1402620 1644999 1495488 1297815 1245492 1491070 1521878 1554497 1687509 1895636 1876024
12490 1876024 1886353 2040489 1998674 1876948 1906421 2100691 2122649 2332763 2427027 2319996
12480 2319996 2494388 2726231 2831828 2705306 2537565 2622125 2575846 2761242 2792100 2984665
12470 2984665 2932277 3256411 3302431 3244177 3588520 4097241 4742689 5329817 5664514 6217398
12460 6217398 7014791 7889202 8971336 10474121 12513996 14913966 17987684 22456808
12452 22456808 28694047 37889092 51444517 70760727 97299758 131153859 167885434
12445A67885434K8778608R387977j5183455l2620617l7622801l1282338k2089247
12438F7253561j5124089j0222282o995105m869546l279508k464936j646585j210178
12430B1441332q14879m76534j17526j9150L65840O28241R83599J109914J256921
12421B4357758J464939J731924K588313K878117L156286M419054N768710P359147
12413E3724248R641939J1726281J4742387J7868860J8087757J7622844J5806746
12406A59221062J0859912R804892J1998312K0431807L0874730K9393120J4206673
12399B86790508q621920k9411489l6397855l6923564l2700215k8325219k3389441
12392I1020805j7009812j1849216q120084n500451l868267k927629k050840j220097
$$ plain form
12445 167885434 196664042 206052019 190868564 158247947 120625146 89342808 67253561
12438 67253561 52129472 41907190 34912085 30042539 26763031 24298095 22651510 21441332
12430 21441332 20626453 20149919 20032393 20013243 20379083 21007324 21990923 23100837 24357758
12421 24357758 25822697 27554621 30142934 33021051 36177337 40596391 46365101 53724248
12413 53724248 63366187 75092468 89834855 107703715 125791472 143414316 159221062
12406 159221062 170080974 179885866 191884178 212315985 243190715 272583835 286790508
12399 286790508 278168588 248757099 212359244 175435680 142735465 114410246 91020805
12392 91020805 74010993 62161777 54041693 48541242 44672975 41745346 39694506 38474409
12384C8474409n79963j85461J53753P83546J080232J293719J824821K117694K273792
12375D7236542K000277J876906J715500J871430K181676K735665L751666L710970
12367F7080632L324417L817224N689634R450847J4508095K0357099K6272742K7347848
12359A77848538J9145838K032472j8132178l0356200l2554021k6460482j8620148
12352G2903819j2857361r082735o277295m281119l399681l108818k332979j641137
12344B9922694j182805q44421o61779p07839m93599j53996Q8223k12598L93109
12335B6146989M33612N15493N47657O07277R75408J219474J101775J089383R99336
12326C3636404K92764m50501j887507k639075k236996j904647j704728j579625
$$ plain form
12384 38474409 37894446 37708985 37862738 38646284 39726516 41020235 42845056 44962750 47236542
12375 47236542 49236819 51113725 52829225 54700655 56882331 59617996 63369662 67080632
12367 67080632 70405049 74222273 79911907 89362754 103870849 124227948 150500690 177848538
12359 177848538 196994376 199026848 180894670 150538470 117984449 91523967 72903819
12352 72903819 60046458 50963723 44686428 40405309 37005628 33896810 31563831 29922694
12344 29922694 28739889 27895468 27233689 26525850 26032251 25878255 25966478 25753880 26146989
12335 26146989 26580601 27096094 27643751 28251028 29226436 30445910 31547685 32637068 33636404
12326 33636404 33929168 33478667 31591160 28952085 26715089 24810442 23105714 21526089
12318B1526089j234604j367298j018826q90285o47022n72670m85387n89840m82156
12309A4238001m83436o10258m14117m01443m77479l63227k46371n20907k29465
12300A0491298o5469l46884k72176j48963j77077k95772m31108P0754j09366k26742
12290H488495k32694k08064l90060m61001k60740k13334k78070k50280J7499k55081
12280E956670k14730l9742j41544m347j72383j01352l62893j18581r950p7092
12270D714056j59560M6852j55471k63198j16896j45507j07890q9138k16446J23757
12260C630559J21576p3444j27721n3039k54111n4341r8482j55087L7379J15364
12250C088653j68923o1963q5029k25889j02965k52563k425j39092j6775j06935
$$ plain form
12318 21526089 20291485 18924187 17905361 17015076 16368054 15795384 15309997 14720157 14238001
12309 14238001 13754565 13144307 12730190 12328747 11851268 11488041 11241670 10720763 10491298
12300 10491298 10425829 10078945 9806769 9657806 9480729 9184957 8753849 8824603 8715237 8488495
12290 8488495 8255801 8047737 7657677 7196676 6935936 6722602 6444532 6194252 6211751 5956670
12280 5956670 5741940 5702198 5560654 5556307 5383924 5282572 4919679 4801098 4791148 4714056
12270 4714056 4554496 4601348 4445877 4182679 4065783 3920276 3812386 3723248 3506802 3630559
12260 3630559 3752135 3678691 3550970 3497931 3243820 3189479 3090997 2935910 2973289 3088653
12250 3088653 2919730 2857767 2772738 2546849 2443884 2191321 2188896 2049804 2033029 1926094
12240A926094p0480N0563q486j3503J14250O6801p9252j21501l2284O0199j3550
12229A878851j38825j08757J47260O5739j95338k6457k05737J23470j16975j37431
12219A285800l0399K60759q8080l20032k26848j86397J63428K00834P7310k61545
12209H74830r5395J23552j18316k48086J78368P8972O3331N8060p1372j55207
12199F88737J01053K9710q9228j29043J65024K69530j24358J4110J75624m1863
12189A059296k48387L0603q7435m9118k75694j09327P5888M21878K42716j77967
12179H82453k28029O6579J36220j60195M9615j60175o1806R6158p1985P6026L7036
12168F61897J57939J26261r379j55251q1918O730p2268n2050M5696l2118j31455
$$ plain form
12240 1926094 1855614 1906177 1897691 1884188 1998438 2065239 1985987 1864486 1832202 1892401 1878851
12229 1878851 1740026 1631269 1778529 1844268 1648930 1622473 1416736 1540206 1423231 1285800
12219 1285800 1255401 1516160 1428080 1108048 881200 694803 858231 1059065 1136375 874830
12209 874830 779435 902987 784671 536585 714953 793925 857256 915316 843944 688737
12199 688737 789790 819500 730272 601229 766253 1035783 911425 925535 1101159 1059296
12189 1059296 810909 841512 754077 704959 429265 319938 395826 817704 1060420 882453
12179 882453 654424 721003 857223 697028 746643 586468 524662 620820 548835 624861 661897
12168 661897 819836 946097 936718 781467 699549 706279 634011 581961 627657 595539 464084
12157D64084Q8475l0143l18633R0376J48121j54795L096L06451J32256k52338
12147D76950l75138r7667L72602q968l7719o0052O6787J67722K5213m2833j67235
12136C19662q1585M1104K85966N6461j9132k48270l6585L001J09966j3766j18196
12125B98626M21Q6279j4655r6029M89J32831R2508j1899j53042K30951O9059J56832
12113G92371L3763k67457k26882r1048Q4184J23413O9105r6671q2738J93498k10525
12102C21013j41771j14940j4814P2370o9513p2985L9214J97424j66669J16388
12092A65717O8714Q6360K06724l339l8563P322J63992k81944r1326p1905J09287
12081C21039J15658K248j8252k47425j37944m3723o562l1572O6305p4944m6126
$$ plain form
12157 464084 552559 522416 203783 294159 442280 287485 290581 597032 729288 476950
12147 476950 101812 4145 376747 367779 330060 270008 336795 504517 529730 486897 319662
12136 319662 238077 279181 565147 621608 602476 354206 317621 320622 430588 416822 298626
12125 298626 299047 385326 370671 274642 275131 407962 500470 488571 335529 566480 635539 792371
12113 792371 826134 558677 331795 240747 324931 448344 517449 420778 338040 531538 321013
12102 321013 179242 64302 49488 121858 52345 -20640 18574 215998 49329 165717
12092 165717 234431 320791 527515 524176 485613 492935 656927 374983 283657 211752 321039
12081 321039 436697 438945 420693 173268 35324 -8399 -14961 -46533 19772 -55172 -101298
12070a01298K64659L0254J41747J16985J5973j08550j55912p1257k78675q3792
12060b29866J17008K7743l1701J3995K75367K49202o7893l5148Q6520j34259n3915
12049B17053r1041J93691n6378j39184L5030j59852p9755l9057K9298K54932K03349
12038C68086J95828l9349j97142j19415r690n8511k28586Q1983J28005r5435j09603
12027h3829J83728N7411q6204M3792N57k16051j23389k2624J81987J77512P7085
12016A89975q1119K7195k01065p2571J86017J5230L9594j68614k777L04964K84074
12005E20903m03524n21858N6859J51765J04395K86334J9864j15651l2864j54779
11995h8556n8031J74766r0004l0835K16639p612p3183k24685k14612J00590L85609
$$ plain form
12070 -101298 163361 193615 335362 452347 468320 359770 203858 132601 -146074 -229866
12060 -229866 -112858 -85115 -116816 -102821 172546 421748 353855 318707 405227 270968 217053
12049 217053 126012 319703 263325 124141 159171 -681 -80436 -119493 -90195 164737 368086
12038 368086 563914 524565 327423 208008 198318 139807 -88779 -6796 121209 25774 -83829
12027 -83829 99899 157310 71106 114898 115455 -100596 -223985 -246609 -64622 112890 189975
12016 189975 108856 136051 -65014 -137585 48432 63662 103256 -65358 -68135 236829 520903
12005 520903 117379 -404479 -347620 -195855 -91460 194874 214738 99087 66223 -88556
11995 -88556 -146587 28179 -61825 -92660 123979 116367 43184 -181501 -396113 -295523 90086
11984I0086J13967j62797O4215K03071k44618k9903j4337L4054J53615J21600
11974C28953M3353j09502k86082K46309J93001j14478o8248J16901K45501J09149
11964G04857l07975o9078K95310L85672J60125K6178K260M872q0905l8352j31537
11953I51427j24927j86377k29001j62723J85587n2103K24193j78092j85048J16669
11943C59605k65321j99200l4636j55774J12594K75178K54739L9032j41354j10961
11933A33902N6606J80488J73070n5968j14424j88991Q3951P3291J22527K03087
11923F67539J66547k2529J33361j6802J57345J28869P945K1632L10727L7354R803
11912A601791j11245r8640l2911l02797l89824o1218Q6224R349q4796k84833q7897
$$ plain form
11984 90086 204053 41256 105471 308542 63924 34021 19684 53738 207353 328953
11974 328953 372306 262804 -23278 223031 416032 301554 233306 350207 595708 704857
11964 704857 396882 327804 623114 1008786 1168911 1195089 1197349 1202221 1121316 1082964 951427
11953 951427 826500 640123 411122 248399 433986 381883 606076 427984 242936 359605
11943 359605 94284 -104916 -139552 -295326 -182732 92446 347185 386217 244863 133902
11933 133902 190508 370996 544066 488098 373674 184683 268634 341925 464452 667539
11923 667539 834086 811557 944918 928116 1085461 1214330 1222275 1243907 1554634 1591988 1601791
11912 1601791 1490546 1391906 1358995 1056198 666374 605156 691380 700729 615933 331100 243203
11901B43203J73486J57480p5245l01468j01232K40185J17706J25755r2715N2014
11891E39169L8583j17380k00609p0139j33059M4635M00269L33682j470k74858
11881E58823j14066j5439P3766J28608j28189n6839K59646K88275K45404J20928
11871A360917k36579o1480m0511j66011k06845l05465j76898j00403j03319q0109
11861a16703J52782K20934k38536K1911P4373P2818K25969l8155j84765J7355
11851B07983K27048j52632j38547q091J66107O5417j02272k91634l49412J00603
11841b75430L81100J82489j2786M7709p5711j52428O6915J75384l66439m56098
11831d85295P3782L34486K63543J24706j3403j47114M3663N2549J47345J53449
$$ plain form
11901 243203 416689 574169 498924 197456 96224 336409 454115 579870 487155 539169
11891 539169 577752 460372 259763 189624 56565 101200 501469 835151 833681 558823
11881 558823 444757 429318 503084 631692 503503 446664 706310 994585 1239989 1360917
11871 1360917 1124338 1062858 1022347 856336 649491 344026 167128 66725 -36594 -116703
11861 -116703 36079 257013 18477 40388 114761 187579 413548 375393 190628 207983
11851 207983 435031 282399 143852 135761 301868 367285 265013 -26621 -376033 -275430
11841 -275430 105670 288159 275373 323082 247371 94943 161858 337242 -29197 -485295
11831 -485295 -411513 -77027 186516 311222 297819 150705 194368 246917 394262 547711
11821E47711P7442j45137n8583O7812r6968l47279O0387J70522j7499N8143n6932
11810B59619j7738L76170j17452k92008r8742J25777R064n3379K44387j14365
11800C21333j83695k02023q314R7476J60878J09584k24114k16541M5723J00563
11790H70k04408q8811J15019J63380K76895K44118K19184l2565P2710p7279l13305
11779C75808n7512L6127R0854j32648j07868k19762K27442J89114L3147j04679
11769C30023p0725j28427q8247J91436p4438m9015j71198K8171l6640q7875p9148
11758b36083M1596K46516J72637j11533j04754K0809j45312P3411L0495r4649
11748a06867R9237J39506R9322N5683P129k44210j17890q727J35823M1049n7245
$$ plain form
11821 547711 625153 480016 421433 489245 392277 44998 105385 275907 258408 316551 259619
11810 259619 241881 618051 500599 208591 109849 235626 244690 191311 435698 321333
11800 321333 137638 -64385 -72699 24777 185655 295239 71125 -145416 -99693 870
11790 870 -203538 -292349 -177330 -13950 262945 507063 726247 693682 766392 689113 375808
11779 375808 318296 354423 445277 312629 204761 -15001 212441 401555 434702 330023
11769 330023 259298 130871 42624 234060 159622 110607 -60591 -32420 -69060 -156935 -236083
11758 -236083 -194487 52029 224666 113133 8379 29188 -116124 -42713 -12218 -106867
11748 -106867 -7630 131876 231198 286881 294010 49800 -68090 -76817 59006 100055 42810
11737D2810N2134J1919p3644k70499l00919o2612L65828K76885K99661j20225
11727B21338k91110j27741J4658J50512j5859j8999J94968r7959J83923J89738
11717D03469q6739R1713j71538N7793R087K7713R4749j20127o9954J72823J4208
11706D23197q1366n0893J57143r6209r0658k72188j65151N2608J38976m0084k2702
11695d7327K14369j1618j33612q0932N7501m0321m4779J01564K22414j31866l50332
11684b44939J12479J69654J27700N8357O2111j13833j69174l0819L08872J19409
11674C99817K4825j42764j51017k40780k11404J1878J0228J04343l8320K59934
11664B6740J65757j30920k00058r3609J96868R0348k4161k51410j9752o1542o7768
$$ plain form
11737 42810 94944 106863 33219 -237280 -538199 -600811 -234983 41902 341563 221338
11727 221338 -69772 -197513 -182855 -32343 -48202 -67201 127767 29808 213731 403469
11717 403469 316730 408443 236905 294698 303785 331498 426247 306120 236166 408989 423197
11706 423197 341831 290938 448081 351872 261214 -10974 -176125 -123517 15459 -24625 -47327
11695 -47327 167042 155424 21812 -59120 -1619 -41940 -86719 14845 237259 105393 -244939
11684 -244939 -132460 37194 164894 223251 285362 171529 2355 -28464 280408 399817
11674 399817 424642 281878 130861 -109919 -321323 -309445 -299217 -194874 -233194 26740
11664 26740 192497 61577 -138481 -232090 -35222 55126 30965 -220445 -240197 -301739 -369507
11653c69507J28286J62803m7490k72932N8320J93609P8237j31542K63943j70218
11643a06491l05160k34868n9174J72641L63299J78817L26953N5722k53557J72193
11633C10375j11497j71520P2366J32135R1804k3506J83791j23883j96574l11437
11623a47946J67710J0624l9966J5602p0035L11345N3688l51554l38478r6640R9768
11612c85882l0397K1092N555J86365J10172J33098L23690J97123n1560l38780
11602A70476j70674M0216K1770Q0857R6264J2689l2344K4684k96459j61915J7801
11591a96635J24596o0803K2365J52627L0317j36602K4808J15821L6891k18297
11581a04912j52723L1764J17211R9881L9603j2312j43010J70613J19236k34320
$$ plain form
11653 -369507 -241221 -78418 -125908 -398840 -340520 -146911 -68674 -200216 63727 -106491
11643 -106491 -411651 -646519 -705693 -533052 -169753 9064 336017 391739 138182 310375
11633 310375 198878 27358 99724 231859 323663 300157 483948 360065 163491 -147946
11623 -147946 19764 30388 -9578 6024 -64011 247334 301022 -50532 -389010 -485650 -385882
11612 -385882 -416279 -395187 -389632 -203267 -93095 40003 363693 560816 509256 170476
11602 170476 -198 40018 61788 142645 238909 251598 219254 243938 -52521 -214436 -196635
11591 -196635 -72039 -132842 -110477 42150 72467 -64135 -39327 76494 113385 -104912
11581 -104912 -257635 -225871 -108660 -8779 30824 18512 -124498 46115 165351 -68969
11571f8969k87382K3517K67625J94430k53251j81170R8145K02803k8218J06440
11561G3970J48569J44011L1976k14674r1756O9574J6300j19160r3255J62445J92811
11550C20811k42035O7950J61828j1320o8112j06547J1921J34096k7189j8459r2153
11539A30791J10350K0561k20441j32055k1851n3J48707K38461R9402j04663n38036
11528b68827j59530L54289J18570O7874K5928L31037P0805J11k9203n7044j77443
11517B76567m6461j14064l9693j82614J06530K03938n5162J19847j0079j8354
11507B40455J6886J1075r437j29484j61370K0807j08R4225J09099j54287q3344
11496d5483L24435j03184j88706k51002N5025J99580Q3519l5517k78300l6722
$$ plain form
11571 -68969 -356351 -332834 -65209 129221 -124030 -305200 -207055 -4252 -32470 73970
11561 73970 222539 366550 398526 183852 92096 161670 177970 58810 -34445 128000 320811
11550 320811 78776 146726 308554 297234 229122 122575 134496 268592 241403 222944 130791
11539 130791 241141 261702 41261 -90794 -112645 -112698 36009 274470 373872 269209 -268827
11528 -268827 -428357 -74068 44502 112376 138304 469341 540146 540257 511054 454010 276567
11517 276567 230106 116042 76349 -106265 265 204203 149041 268888 258809 240455
11507 240455 257341 268416 258979 129495 -31875 -11068 -11176 83049 192148 37861 -45483
11496 -45483 278952 175768 -12938 -263940 -208915 -9335 74184 38667 -239633 -276355
11486b76355M6660K93752m7316p232k11840J66064J18310j1179P568j51039j91083
11475b63690K33289L41341k9304k8160l5568l26090j84511K53753R6981J07203
11465A65244j92764J58110M5309k9305j90293L739K0668J77811J65947r209Q5377
11454D00634R0471l4720J2244k9054j75141p0652M3759j4238K7111R7735q7782
11443B60367k49553j00809J79597J93008o0245j9809N7211l21976m7626J73298
11433F3463Q581J44474K07702j73303n5861M8337j10480l4512n2975L5564p855
11422G3135M9285o5071O912l1405M2715n3417j39713n8823N7978p794J99022K16160
11410B88984m8246k80699k29954r2567J85342M55614P6228M8588j8285J84552
$$ plain form
11486 -276355 -229695 64057 16741 9509 -202331 -36267 82043 70864 78432 -72607 -263690
11475 -263690 -30401 310940 281636 253476 217908 -108182 -292693 -38940 58041 165244
11465 165244 -27520 130590 175899 146594 -43699 -39960 -19292 158519 324466 315257 400634
11454 400634 491105 456385 468629 439575 264434 193782 237541 223303 250414 348149 260367
11443 260367 10814 -89995 89602 282610 222365 202556 259767 -62209 -109835 63463
11433 63463 72044 216518 424220 250917 195056 243393 132913 98401 45426 80990 73135
11422 73135 122420 57349 64261 32856 75571 22154 -117559 -176382 -118404 -126198 72824 288984
11410 288984 240738 -39961 -269915 -362482 -177140 278474 354702 403290 385005 569557
11400E69557m4666j68826j35891m967P3694m4597k12708j4104l5001n2024J78862
11389A09329L77284J71059r8497j57475k32097L6934R8020j98394n7097j2853
11379C6213k8798p3946k2967j50517N0647J02259J48520k0331L9757q7432M9591
11368D2996q9243J0218k18762n1632K36052N1110j82713J67147q9934O6104r6421
11357a55078O5144k1168o6096J14131k1226K1560l4425J60540j4288q0825K91022
11346B59291J997m1448l6418q9722j20510K8285m9936j62004M7526K55393J52811
11335B45265J13332K1126j88742j72066j01562L3483P1965J0952l9242o7346R3434
11324B0599k0597m5645K90224J31318j36229k05663r8481N0627M5966K0855r1013
$$ plain form
11400 569557 524891 356065 220174 215207 288901 244304 31596 17492 -17509 -69533 109329
11389 109329 486613 657672 559175 401700 169603 206537 304557 106163 49066 36213
11379 36213 7415 -66531 -89498 -240015 -189368 -87109 61411 41080 80837 -6595 42996
11368 42996 -46247 -36029 -254791 -306423 -70371 -19261 -201974 -34827 -124761 -58657 -155078
11357 -155078 -89934 -111102 -177198 -63067 -84293 -62733 -97158 63382 49094 -31731 259291
11346 259291 261288 219840 183422 93700 -26810 1475 -48461 -210465 -162939 92454 245265
11335 245265 358597 379723 190981 18915 -82647 -49164 22801 33753 -5489 -72835 20599
11324 20599 2 -45643 244581 375899 239670 34007 -64474 -13847 32119 52974 -38039
11313c8039j9213L95714N0973j67054j49748k03769j17238n0316J7846R3953M0874
11302a46017J0906k1827j4395J8308J01466l12825R2981J59062j94056J26811
11292a79586O8343J48535j49559Q2995J11529j19057k73609p8436P7779L12073
11282A007P8551J594J76144N1544k01454j46542r8628j00110K52204k5291k59463
11271b70444J21262K66788J68030J20833j11185r9739p1085j39203j7441j86337
11261b18521n0808J21257K34101K76073k27356j67330q0683J60596K51216Q3717
11251C82262m6059j38699l07799j18334j24502Q7264k9210p3258J65670L5222
11241a67443J85608K56119p7146j10626k13360j311J10556j76144L994J66091
$$ plain form
11313 -38039 -57252 338462 389435 222381 72633 -131136 -248374 -298690 -280844 -186891 -146017
11302 -146017 -135111 -156938 -171333 -153025 -51559 -364384 -271403 -112341 -306397 -179586
11292 -179586 -111243 37292 -112267 -29272 82257 -36800 -310409 -388845 -311066 1007
11282 1007 79558 81152 257296 308840 107386 -39156 -137784 -237894 14310 -10981 -270444
11271 -270444 -149182 117606 285636 406469 295284 195545 124460 -14743 -32184 -218521
11261 -218521 -269329 -148072 86029 362102 134746 -32584 -113267 47329 298545 382262
11251 382262 336203 197504 -110295 -228629 -353131 -265867 -295077 -368335 -202665 -167443
11241 -167443 18165 274284 197138 86512 -126848 -128159 -17603 -193747 -189753 -23662
11231b3662l0059j89280k4357J12807Q3916j38290J86910K7929J13888R2598Q8446
11220C00846k62198j64459J28609J34082m8969n4003q9136k4512J09269J66425
11210A95954p1315k72669j69928j03069j59710K75932K32976J39552L0237j21546
11200b3586j24445o1963M7026J27491M4779K8260K6893P6558j07774j12804n5106
11189a34671J47389Q2372J70408n3908m2412j75122j3896k4582j22429P6620j7526
11178a07757k03595M9701K20791K45134J00708j88259M7417j68993j31332K14192
11168G8007K655k64178q751Q1496J30879j77280J0642K82678j01138L5460o7895
11157B575L6712K05440k28367k17451m5656J04331K53J29219k3571r0212R3381
$$ plain form
11231 -23662 -53721 -243001 -267358 -154551 -70635 -208925 -22015 5914 119802 212400 300846
11220 300846 38648 -125811 2798 136880 87911 33908 -55228 -79740 29529 195954
11210 195954 124639 -148030 -317958 -421027 -580737 -304805 -71829 67723 97960 -23586
11200 -23586 -148031 -209994 -162968 -35477 9302 37562 64455 141013 33239 -79565 -134671
11189 -134671 12718 95090 265498 211590 169178 -5944 -19840 -44422 -166851 -90231 -107757
11178 -107757 -311352 -261651 -40860 204274 304982 116723 164140 -4853 -136185 78007
11168 78007 80662 -183516 -192267 -110771 20108 -157172 -146530 136148 35010 70470 2575
11157 2575 39287 244727 16360 -201091 -246747 -142416 -142163 -12944 -36515 -126727 -33346
11146c3346j76580q7987J02212K33316J93306l37172k7294L0015j1327L3970p7741
11135a58628P7843J03664j20198p9892M9122J19589K15529j02762M4901K43190
11125C92358o4774k89140n3255J16034p7790m1678k29078r587J91467J0590j27159
11114a82012n0851q235R7973J90737K62766M8519K8588j23230k48512p0062K8760
11103b5559m5966l9721L98405M31640l22117p5710L083j67336k33728j37576p904
11092b22489j59203j14398J28247K0762L3214N4849j6132j71425j20172j92894
11082g59641N2632N59120J54208p9967J17239J9836K16516K34454J09031K30912
11072H54340j01012k66681k22757q2623n6136j6847j01657J61297J28892j15763
$$ plain form
11146 -33346 -209926 -297913 -195701 37615 230921 -106251 -133545 -103530 -114857 -80887 -158628
11135 -158628 -80785 22879 -97319 -177211 -128089 -8500 207029 104267 149168 392358
11125 392358 327584 38444 -14811 101223 23433 -18245 -247323 -256910 -65443 -54853 -182012
11114 -182012 -232863 -241098 -143125 47612 310378 358897 387485 264255 15743 -54319 -25559
11103 -25559 -71525 -111246 287159 718799 396682 320972 324055 156719 -77009 -214585 -222489
11092 -222489 -381692 -496090 -367843 -347081 -313867 -259018 -275150 -446575 -566747 -759641
11082 -759641 -707009 -147889 6319 -73648 43591 63427 279943 514397 623428 854340
11072 854340 753328 486647 263890 181267 125131 108284 6627 167924 296816 181053
11062A81053m6793O4571n8916k67354j26128j5595j05125m0462p045J3756l2410
11051d40448Q9917J56579J50846j04217q5658R5332K16170M5971k41495p840l8091
11040a62934k55901J07436J19591K57143m976k07307j99563K6910K79648J23141
11030H3188n344k01128J69373R0157L034J9994P0789m569J22299L9626M7637j93107
11018B41949j18652J20230j61915k92110j7855J95388o8537j0192J88277K04317
11008B80900J15395q4199o1480J36173n523j46065J12371J35889o2876j99015
10998B21570j96007K42337K13373j61879M8372L5148m3010q1593j17033k09893
10988d8615p0333K29255J59432J38121m7039m10115l09399l2983J31537J45238
$$ plain form
11062 181053 134260 198831 139915 -127439 -253567 -269162 -374287 -414749 -421794 -408038 -440448
11051 -440448 -350531 -193952 -43106 -147323 -232981 -137649 78521 124492 -117003 -124843 -162934
11040 -162934 -418835 -311399 -191808 65335 60359 -146948 -346511 -319601 -39953 83188
11030 83188 77844 -123284 46089 136246 139280 159274 230063 225494 347793 387419 435056 241949
11018 241949 123297 243527 81612 -210498 -228353 -32965 -101502 -111694 76583 280900
11008 280900 396295 312096 250616 386789 381266 235201 347572 483461 420585 221570
10998 221570 25563 267900 481273 319394 367766 402914 359904 278311 161278 -48615
10988 -48615 -118948 110307 269739 407860 360821 -49294 -358693 -391676 -260139 -114901
10978a14901p555o4703J64205J58289K4842k1272K19847r2961j10842k1463n0781
10967H2705q221k00537r9634J39272J64612K87336q5393j21392j42271q6408k66390
10956c36321r1390J67777K41227Q8293j29235j30658j06735K59896m0114O9281
10946g979K6983K42365R7841M0206l908J7972l53483q4434J05420O2046k7838
10935A15191p6688j03133p8148K29937J52190M0398j49623j59433P5202Q0029
10925A25922O2307N0355k09668p5757K94405K78045j41591k73219j22725J8147
10915F221K5227J46141k1214l32862L84L7692J04068j7620m8758P7472J50395
10904A27146J2578k6036j70054m2994m1490k5575q4610n5257J62216J42808l6152
$$ plain form
10978 -114901 -122456 -187159 -22954 135335 160177 138905 358752 265791 154949 133486 82705
10967 82705 74484 -126053 -225687 -86415 78197 365533 280140 158748 16477 -69931 -336321
10956 -336321 -427711 -259934 -18707 69586 -59649 -190307 -297042 -37146 -77260 -7979
10946 -7979 19004 261369 359210 399416 395508 413480 59997 -24437 80983 143029 115191
10935 115191 38503 -64630 -142778 87159 239349 279747 130124 -29309 45893 125922
10925 125922 188229 238584 28916 -46841 247564 525609 384018 110799 -11926 6221
10915 6221 31448 177589 156375 -176487 -176103 -138411 -34343 -51963 -100721 -23249 127146
10904 127146 139724 113688 -56366 -99360 -140850 -166425 -251035 -306292 -144076 -1268 -37420
10893c7420l6420j26808m1801J96199O7978k05082p0186J14494K03023q6638o2076
10882h4737j10033j40029J33295K65569J98052j30299k49943k52857l100K98711
10872g5371J89944J16942k09147l55954J90214o0080j74147r8467K011Q6828K04401
10861a82826J42254r937l2782J0176k07697k05543J80057L0192j49826j41329
10851e67261k210J76061r8626k01296J42564K70748j51563n5963K33209n5256
10841c09593j82121j93998R6116Q1696K9555R019l587K74072K16257P7068P7588
10830A72072k37299M9452l0823j46186L7894R4060j28663m8567K80107R0759N4984
10819A87790l4799j19852J91717J49909m12j17737L5322M1564p7111j3320j23327
$$ plain form
10893 -37420 -73840 -200648 -242449 -46250 21728 -183354 -253540 -139046 63977 -22661 -84737
10882 -84737 -194770 -334799 -201504 64065 262117 131818 -118125 -370982 -374082 -75371
10872 -75371 114573 231515 22368 -333586 -143372 -203452 -377599 -476066 -474055 -387227 -182826
10861 -182826 -40572 -50509 -83291 -73115 -280812 -486355 -306298 -276106 -425932 -567261
10851 -567261 -569471 -393410 -492036 -693332 -550768 -280020 -431583 -487546 -254337 -309593
10841 -309593 -491714 -685712 -589596 -507900 -478345 -469326 -472913 -198841 17416 94484 172072
10830 172072 -65227 -15775 -46598 -192784 -154890 -60830 -189493 -238060 42047 132806 187790
10819 187790 152991 33139 224856 374765 374353 256616 291938 333502 256391 243071 119744
10808A19744j18286k8244K11826K40654k9014j9191q9136j02943j50868j81049
10798a46507P7236q503K0035n41O0624J4903P8884q4319j92690N7022m0353l52949
10786e17158j11832j21181L32957L30492R0585R823j06664J99019J20418j8085
10776B08374J01893O5476j72730j61967p6078J65231j02828k37498j51974J58901
10766b03200J46586K1109k4828j32990K232K00130J05785N1438J9889Q1119l1423
10755B35847j21071r4489k9350k41797j29519J47081J50277O967J02683m6591
10745a9962l7001K34498n2853K4217o8572J31842j64445k82271o0263J11142Q2427
10734a01241l6244J19958L311r947K2198r2723j57237J32706K07032j13695k6398
$$ plain form
10808 119744 1458 -26786 185040 425694 396680 377489 288353 185410 34542 -146507
10798 -146507 -69271 -77774 -57739 -58280 2344 17247 96131 11812 -180878 -123856 -164209 -517158
10786 -517158 -628990 -750171 -417214 -86722 3863 13686 -92978 106041 226459 208374
10776 208374 310267 375743 203013 41046 -35032 130199 27371 -210127 -362101 -203200
10766 -203200 -56614 -35505 -60333 -193323 -191091 9039 114824 166262 186151 267270 235847
10755 235847 114776 20287 -9063 -250860 -380379 -233298 -83021 -76054 26629 -19962
10745 -19962 -56963 177535 124682 148899 80327 212169 47724 -234547 -294810 -183668 -101241
10734 -101241 -137485 -17527 -14216 -24163 -1965 -94688 -251925 -119219 87813 -25882 -52280
10723e2280Q2456r0570p0554J77588p1336q3890j01201J51695m1811j38237J3942
10712b24198J22226J4634k77837j20544K39694J68167j28889j50540L27226K09057
10702A78996k6701M9307L11378j98262l85618j15975l13940j55016m1408J19862
10692e77377J38291j10581N4669L62057M0982j85647K2899N2359k53158N100J87469
10681b62937J97189r1676m4012J426K22990R1720j28601j93221R4651J70315O8520
10670A26364j78857m4209l7891J01109J17926K5523r9124j49769N93j1216J68638
10659A9087m7686k13419K37984q5782j85242q3054m4598K21065K67949M2575l85745
10648b56866r6843N0024L1253K10808J98293j00918j76265j87968L14642P703
$$ plain form
10723 -52280 30176 -60394 -130948 46640 -24696 -108586 -209787 -58092 -99903 -238140 -224198
10712 -224198 -101972 -87338 -365175 -485719 -246025 -77858 -206747 -357287 -30061 178996
10702 178996 152295 201602 512980 314718 -70900 -186875 -500815 -655831 -697239 -577377
10692 -577377 -439086 -549667 -494998 -132941 -91959 -277606 -254707 -202348 -455506 -450406 -262937
10681 -262937 -65748 -157424 -201436 -200010 22980 114700 -13901 -207122 -112471 57844 126364
10670 126364 -52493 -96702 -134593 -33484 84442 109965 10841 -138928 -138335 -149551 19087
10659 19087 -28599 -242018 -4034 -89816 -275058 -358112 -402710 -181645 86304 128879 -256866
10648 -256866 -353709 -303685 -272432 -61624 136669 35751 -140514 -328482 -13840 -6137
10638f137k1560J65887J76989p4029k79492k47814L9405K30138p1407o7476J52726
10627b770P3492k3186q7563r4590j59727j70942J8170L8757n1867q0981J35446
10616d05761Q8346J65517j9745j44806p5203J94009N3669R4447J64867q9032n9378
10605c3070J0343j12831j2693q6234j15743J11509K25230n7679P8369J80224j16010
10594G1415o3770J4440R1268J16381j85412L3622L2568k65554j09352q9789n8843
10583d13026J83606L22128r7308K9734Q5411n146K65327O1829l19244k85621j00459
10572b72769Q3317q478J84588p8504J31492K07665k5400k266m671j10036j579
10561A03359q9288j42447l6862k06431J00980J63690r4713O4459J69986J5459
$$ plain form
10638 -6137 -27697 138190 315179 241150 -38342 -286156 -246751 -16613 -88020 -155496 -2770
10627 -2770 70722 47536 -40027 -134617 -294344 -465286 -447116 -408359 -460226 -541207 -405761
10616 -405761 -317415 -151898 -171643 -316449 -391652 -197643 -143974 -49527 115340 26308 -33070
10605 -33070 -22727 -135558 -148251 -234485 -350228 -238719 -13489 -71168 7201 187425 71415
10594 71415 7645 22085 113353 229734 44322 77944 110512 -155042 -264394 -354183 -413026
10583 -413026 -229420 92708 -4600 25134 110545 105399 370726 432555 113311 -172310 -272769
10572 -272769 -189452 -197930 -13342 -91846 39646 247311 221911 219645 214974 104938 103359
10561 103359 14071 -128376 -165238 -371669 -270689 -106999 -201712 -137253 32733 48192
10551D8192n4520R2856O9555k03493j89490J5339j4474R6575J07048k8976Q7491
10540B6103K04604K1811m533N4983j54972j13268j35464K12744J5264k9709j48190
10529e0627q3955O6930L6884L60749L07529j85974j77753j97044m1959n1082N1789
10518C5487P0987k08835p9039R8410P8516n8140o1416J1213j04341j5594J44551
10507h8201J54521P1497o8755m828M0629q9947J07145j77566L6345K33704o1948
10496A52596l3144J83604j84081n3818p0367J38992M5720J87560J57573l25029
10486A99606K3075k6826k29869j15728L0487M5860K13992k63355l8948M9413J91762
10475G9469J05251N8370j84156j64173l6997O9229K8612j96497O1697K95180Q6500
$$ plain form
10551 48192 -6328 86528 156083 -47410 -236900 -221561 -236035 -139460 -32412 -61388 26103
10540 26103 230707 252518 247985 302968 147996 34728 -100736 112008 127272 97563 -50627
10529 -50627 -134582 -67652 -30768 329981 637510 451536 273783 76739 34780 -16302 35487
10518 35487 106474 -102361 -181400 -82990 -4474 -62614 -124030 -112817 -217158 -232752 -88201
10507 -88201 66320 137817 69062 64234 104863 14916 122061 -55505 -19160 214544 152596
10496 152596 119452 303056 118975 65157 -5210 133782 179502 367062 524635 199606
10486 199606 222681 195855 -34014 -149742 -119255 -73395 140597 -122758 -161706 -112293 79469
10475 79469 184720 243090 58934 -105239 -142236 -73007 -44395 -240892 -179195 115985 202485
10464B02485l1178k63101l6466J22768k14284J98201J91697j44151m9948J35307
10454A11330J1316j35352K08780m8594l72772J13063K07976j64317o3860R8914
10444c3516j28259j65315K5869J43519N7360J59102o354k6922l0269P7745j37911
10433f4951l0072K03092L2760k5920J96009K11138j18660m6319R9529j51899j65554
10422A39153k98443M9507j1097r5507M0153J11316J56049m8621J61745J85890
10412C90145q7001n9199p1723M509j03512j25360q1909J40814K7927J12737j81414
10401c3986j68383j56525l9626K55823J73794j31365j42746J03615L30185o4170
10391A26616j7596N904k6891J33302O8519m6144j85384Q6769j11441j12374K94270
$$ plain form
10464 202485 171307 -91794 -128260 -5492 -219776 -21575 170122 25971 -23977 111330
10454 111330 122646 -12706 196074 147480 -225292 -112229 95747 -68570 -132430 -33516
10444 -33516 -161775 -327090 -301221 -157702 -100342 58760 52406 25484 -4785 72960 -64951
10433 -64951 -95023 108069 140829 114909 310918 522056 403396 357077 456606 304707 139153
10422 139153 -159290 -109783 -120880 -216387 -176234 -64918 91131 42510 204255 390145
10412 390145 303144 243945 172222 176731 73219 -52141 -134050 6764 34691 147428 -33986
10401 -33986 -202369 -358894 -398520 -142697 31097 -100268 -243014 -139399 190786 126616
10391 126616 109020 114924 88033 221335 289854 243710 58326 145095 33654 -78720 215550
10380B15550K6181j39489J16212k18544k93753j8733J9002O5595L14053J21665
10370B07739j24439k93538j42378O2839P6155J71322K4124K48002J4176k01088
10360D2914N662k85051r9854n5202J86807K26550K12230m641q2142o1185P4892
10349A60980j07355j30917l4458K95906j61270l00335k4598J23638o7472k44465
10339d90346K4378K86024r8090K3620o2676m9878l1213L4019J44127K60728j49911
10328a09218j86733M5581J79435J94490N3987K912L13275L9635k09890k48646
10318G4828J2909L1758K35609j69534k16122o4666j43046J36630J71061K07836
10308B77263P9714l87711j78214K42489k01825j53661j04519j46732K4995K55292
$$ plain form
10380 215550 241731 102242 218454 -90 -293843 -312576 -293574 -227979 86074 207739
10370 207739 83300 -210238 -352616 -289777 -213622 -42300 -18176 229826 244002 42914
10360 42914 48576 -236475 -336329 -391531 -204724 21826 234056 229415 147273 86088 160980
10349 160980 53625 -77292 -111750 184156 22886 -277449 -302047 -178409 -245881 -490346
10339 -490346 -465968 -179944 -278034 -254414 -317090 -366968 -398181 -364162 -220035 40693 -109218
10328 -109218 -295951 -250370 -70935 123555 177542 180454 493729 533364 323474 74828
10318 74828 87737 119495 355104 185570 -30552 -95218 -238264 -101634 69427 277263
10308 277263 356977 -30734 -208948 33541 -168284 -321945 -426464 -573196 -548201 -292909
10298b92909m1206j54548J79064J06676l3680J4200K5204p3722k5505J95264J46497
10287D5335K256o8329k00095r7046o5124O9905J00792J32934L056J99054J39770
10276B62508j2492j50123J04576J8980o7100q3707j65285j02099M8229J55208
10266H695j6276m9882j61324k1445M3736P2582K7046L928J03649J7112J04691
10255A32512O4494j21554N1479p6528j51215R0135j25716k46344j91916n5240
10245f29893J94644L61878J06118J96934J34246j97164j38972m8906L01733L22620
10235F03238M6787k10545j91313o3677j66637q7837J3249J98927O6626O7483K10489
10224D86790j23591j59846r2289k24039j2481r2715O546J68999J88522K27272
$$ plain form
10298 -292909 -334115 -488663 -309599 -202923 -236603 -222403 -197199 -270921 -296426 -101162 45335
10287 45335 47591 -20738 -220833 -317879 -383003 -313098 -212306 -79372 -76316 122738 262508
10276 262508 250016 99893 204469 223449 156349 72642 -92643 -194742 -146513 8695
10266 8695 -7581 -57463 -218787 -240232 -196496 -123914 -96868 -92940 10709 27821 132512
10255 132512 197006 75452 126931 50403 -100812 -10677 -136393 -382737 -574653 -629893
10245 -629893 -435249 -73371 32747 229681 363927 166763 27791 -21115 280618 603238
10235 603238 650025 439480 248167 184490 17853 -69984 -56735 142192 208818 276301 486790
10224 486790 363199 203353 111064 -112975 -125456 -218171 -211625 -42626 145896 373168
10214C73168K4971k9673J02608j62849k33561k20196k991K71111J25355R569m4093
10203B13419K01309k32292l16540J129J53934J52561J1264j39331n0828J13771
10193A08396J06130p084L1052k23411k35990j21249R8247K27935K6915j22083
10183a11142Q9325o1184J74105J73883K27659L9932j12018l73012j36591P4943
10173a4100J85545j01048o7439p1113K6201M2213N5224J60960l746o3773k84612
10162a35688l51266M8619J98030m238l78O5713R9150k7634R6780N8009j80146
10151a33049k30886J31224J51256Q2777J92621j02515j71289O1529J59428L88454
10141E29550M6435j76933m52844k65410P4857Q1684j254J09615J75863j09407
$$ plain form
10214 373168 398139 368466 471074 308225 74664 -145532 -148523 122588 247943 257512 213419
10203 213419 414728 182436 -134104 -132975 20959 173520 184784 45453 -5375 108396
10193 108396 214526 207442 238494 15083 -220907 -342156 -243909 -15974 10941 -111142
10183 -111142 -21817 -83001 91104 264987 492646 532578 420560 47548 -89043 -14100
10173 -14100 171445 70397 2958 -68155 -41954 259 55483 216443 212697 148924 -135688
10162 -135688 -486954 -438335 -240305 -244543 -244921 -179208 -80058 -107692 -10912 47097 -133049
10151 -133049 -363935 -232711 -81455 1322 193943 91428 -79861 -18332 141096 529550
10141 529550 575985 399052 -53792 -319202 -244345 -162661 -163915 -54300 121563 12156
10131A2156j33625k10678q0720L8397l0093j69388J12632J51947Q8969j6994j77915
10120d15312J44406K72704J05286Q2355k70864L5811j58779p3903P4962J8033
10110a85301J12828M4291j00355j75160j04514J93236j0015k9269O8464R3487
10100i2308k79366r8127j42987R2699N7833L01490j01736l7617J81019J45407
10090B6307O4281J64260j1051n147N5730j35520k86853J433o8524J91360R185
10079E461n9098p5006j14210J69296k8281k6237J19596J02082N9008j41116Q1591
10068I3086m3954j0844O8393P3098j68559p1841K0794K20486l41102L8265N6182
10057f5996O4907r9315K0661L64255J5995m8082k99299j56597K29830Q8618j63303
$$ plain form
10131 12156 -121469 -332147 -412867 -374470 -404563 -573951 -461319 -309372 -220403 -237397 -415312
10120 -415312 -270906 1798 107084 189439 -81425 -45614 -204393 -278296 -203334 -185301
10110 -185301 -72473 -28182 -128537 -303697 -408211 -214975 -224990 -254259 -185795 -92308
10100 -92308 -371674 -469801 -612788 -520089 -462256 -160766 -262502 -300119 -119100 26307
10090 26307 90588 254848 243797 238650 294380 158860 -127993 -126560 -195084 -3724 5461
10079 5461 -53637 -128643 -242853 -73557 -101838 -128075 -8479 93603 152611 11495 93086
10068 93086 49132 38288 106681 179779 11220 -60621 -39827 180659 -160443 -122178 -65996
10057 -65996 -1089 -100404 -79743 284512 300507 252425 -46874 -203471 26359 114977 -48326
10046d8326j77667j64931Q3053J42338J18983N520j94084p3888R5399o0793K46144
10035b8252J0339j53031k6271j91483Q7049K29929o2829k68758J15395k665o0871
10024c51448J61861K96429J7130p9390J45432j34895m9775o8531j84385J84680
10014f2892M7688J86948R2225l9447K17802j57015j65765Q0671l6973J3082l68428
10003a92104k51299J24603L67174J7634j3865r0651m2131J41462r4234j12535
9993a45946j7338L0199k16208J97536J31850j02181k31703j19544J60639Q1450
9983b31246K10690J41729j847l7678p0508l48996o0822K54218O7679j05143k66194
9972d48118j08388m6911K06150M9419j46874J44177R3813Q4328J70177K8894l0712
$$ plain form
10046 -48326 -225993 -390924 -307871 -165533 -46550 -41030 -235114 -309002 -213603 -274396 -28252
10035 -28252 -17913 -170944 -197215 -388698 -301649 -71720 -134549 -403307 -287912 -290577 -351448
10024 -351448 -189587 106842 123972 44582 190014 55119 5344 -63187 -247572 -62892
10014 -62892 -15204 171744 263969 224522 442324 285309 119544 200215 163242 176324 -192104
10003 -192104 -443403 -318800 48374 66008 52143 -38508 -80639 60823 -33411 -145946
9993 -145946 -163284 -133085 -349293 -151757 -19907 -122088 -353791 -473335 -312696 -231246
9983 -231246 -20556 121173 119326 81648 11140 -337856 -398678 -144460 -76781 -181924 -448118
9972 -448118 -556506 -603417 -397267 -347848 -494722 -350545 -256732 -172404 -2227 26667 -4045
9961d045L712J9952j7191j98662L8255j9447l60627N5467J45580P3779j00607
9950c63834o2463K49838M3150j01772J28277J76315l4900Q985o8073r8626K42777
9939A19674J73561P1498O4040J54740m3523k00329k89146l71297K46159L41529
9929B66906j29383l63301j03363K33239k4022R2997J51539o4525o270L2498J83542
9918B69857K23372J53707l11254l06446k65096o5130O4375L20789m25j10448K5735
9907i64r6732L27478L85045L2618j43866P7657k00341j60676l82981k11782o1382
9896d35926J04357K66807K05769k5028k41730p6655J1631J17909J66726N1985
9886A45845J40096K40468J07969j31363o7374j11218j55086l00476n3503L81755
$$ plain form
9961 -4045 -333 19619 2428 -196234 -157979 -177426 -538053 -482586 -337006 -263227 -363834
9950 -363834 -426297 -176459 -133309 -235081 -106804 69511 34611 43596 -24477 -123103 119674
9939 119674 293235 364733 428773 583513 539990 339661 50515 -320782 -74623 266906
9929 266906 137523 -225778 -329141 -95902 -119924 -26927 124612 60087 53817 86315 269857
9918 269857 493229 646936 335682 29236 -235860 -300990 -236615 84174 83749 -26699 -964
9907 -964 -97696 229782 614827 647445 503579 581236 380895 220219 -162762 -374544 -435926
9896 -435926 -331569 -64762 141007 115979 -125751 -202406 -190775 -72866 93860 145845
9886 145845 285941 526409 634378 503015 435641 324423 169337 -131139 -184642 197113
9876A97113k1980j73134r5278K53299K56955l4040l0016j79237O9269j51916j54188
9865f3153Q7746n5387k17266R564Q6501k89885q7339J24803M15715K56568Q3802
9854C51669q9558J69617j7847R1070J13538O0976k38905n7077L2387R0904m3804
9843D62970m50885l1885J12869r3802j1828K3407j34621j62082J079J3362j35006
9832d06422n0155K82447K32421J70069p4066O9603q7515j85984j86559r9923O0529
9821b75555j0440L31679O833J37741p3865J50389p5796n37092l684N59236K56442
9810D65888j79109p1058m5557m6082r6092j22625N7039Q1727j17123l3640k5525
9799a32157j77337l77937L45199K86626R5661R4506j94637j23358n1546j8923
$$ plain form
9876 197113 175133 1999 -93279 160020 416975 382935 352919 173682 242951 91035 -63153
9865 -63153 24593 -30794 -248060 -238496 -151995 -441880 -529219 -404416 11299 267867 351669
9854 351669 262111 431728 413881 504951 618489 679465 440560 383483 415870 506774 462970
9843 462970 12085 -19800 93069 -733 -12561 10846 -123775 -285857 -284778 -271416 -406422
9832 -406422 -456577 -174130 58291 228360 154294 223897 136382 -49602 -236161 -336084 -275555
9821 -275555 -285995 45684 52517 190258 116393 266782 190986 -346106 -349790 209446 465888
9810 465888 286779 215721 170164 124082 27990 -94635 -37596 44131 -72992 -106632 -132157
9799 -132157 -309494 -687431 -342232 -55606 40055 134561 -60076 -183434 -234980 -253903
9789b53903P5979m4027M3375n6555p5009p5871J00272J68940R0305K2794P7287
9778G3587J17352k04315k22307M703J13854j79298o3861O3924j64098K3587J82640
9767b54232n4652j04411K09688J28034J96289n9901j25733p4668o0093q4316P138
9756b76857L49043n1984j51733L7812J30119K77560q4665l52905M4134J0331n5822
9745a24967j3100K06830k6265K26155K37112k6158q6664j00737k92729K1617J32661
9734A53755N7210j47628J45099m6929j97486k58248J80431J62624q3694n035L08324
9723B68423P1343k47153l20686n1615j16636K38380K93983Q0905j07517j88222
9713g8795j28156J2165K06697L41181p6767k56585r6800n3352O9994J01441j31568
$$ plain form
9789 -253903 -177924 -221951 -178576 -235131 -310140 -386011 -285739 -116799 -26494 -3700 73587
9778 73587 190939 -13376 -235683 -230980 -117126 -296424 -360285 -296361 -460459 -436872 -254232
9767 -254232 -308884 -413295 -203607 -75573 120716 60815 -64918 -139586 -199679 -283995 -276857
9756 -276857 72186 20202 -131531 -93719 36400 313960 229295 -123610 -79476 -69145 -124967
9745 -124967 -138067 68763 42498 268653 505765 479607 392943 292206 -523 21094 153755
9734 153755 210965 63337 208436 161507 -35979 -294227 -113796 48828 -34866 -39901 268423
9723 268423 339766 92613 -228073 -279688 -396324 -157944 136039 216944 109427 -78795
9713 -78795 -206951 -194786 11911 353092 276325 19740 -77060 -130412 -60418 41023 -90545
9702i0545j18848j35802l3034q1900j65655Q5128J42723K81905J66299K10655
9692B60926p1838q7485K21181q6730O7954N4436l9248l85694J1844L27781q0551
9681A92576k75957j6580P3551k7726J11321l5862k49209n6959J74614j4549j44562
9670b69342K1919N7809P2454k01903k05674J88293q3743J47603J86052J5977q4601
9659a55156j73564r2201p3083q4452J50381K52961p4007k55452J2887L58106Q8987
9648d4593j99383J7747J39541M3810m3444Q7111q4836M7871P1279J43037m3773
9637A34367q1366J01777j15686J1063P8539p2578O6240J95878N6427k27433p1735
9626G5493N1621k4715J6483j97072K3537K26953J05623l22394j74410j33533j869
$$ plain form
9702 -90545 -209393 -345195 -378229 -460129 -625784 -540656 -397933 -116028 50271 260926
9692 260926 189088 101603 322784 236054 304008 358444 319196 -66498 -54654 273127 192576
9681 192576 -83381 -99961 -26410 -54136 57185 21323 -227886 -284845 -110231 -124780 -269342
9670 -269342 -247423 -189614 -117160 -319063 -524737 -336444 -420187 -272584 -86532 -70555 -155156
9659 -155156 -328720 -420921 -494004 -578456 -428075 -175114 -249121 -504573 -491686 -133580 -44593
9648 -44593 -243976 -226229 -86688 -42878 -86322 789 -84047 -36176 35103 178140 134367
9637 134367 53001 154778 39092 50155 128694 56116 122356 318234 374661 147228 75493
9626 75493 127114 102399 118882 -78190 -54653 172300 277923 -44471 -218881 -352414 -354283
9615c54283L95124K58543J77936P2895k81105M5490J47771J56557k36267l01892
9605H0769j20135p056Q8742J41856R2811j92007k81569P1265R213N7893J94744
9594A36526J34235J4912k17316j02463N2697p8011R5216J18433r5382r1196n281
9583c7630M63M3764m2862j06402j14620J11577m2610k5696j19711J28087K93180
9572H7540K3772p5827j8040K31729Q9187j25891j36014k57998r4707K50275j68433
9561a94407j25274K43833K69807j33713N0992r2005j13241k3575M8946p6077o1294
9550b06008M3409O3939j32172r7834n8067Q8512K65906R28l8850k35927j76640
9539d82804p802K75655K66363R2458J26082l50784j11517J06002J2533k24640
$$ plain form
9615 -354283 40841 299384 477320 550215 269110 314600 462371 618928 382661 80769
9605 80769 -39366 -46422 42320 184176 276987 84980 -196589 -125324 -116111 -58218 136526
9594 136526 270761 285673 68357 -34106 18591 -59420 35796 154229 58847 -32349 -37630
9583 -37630 -37167 6597 -36265 -142667 -257287 -145710 -188320 -214016 -333727 -205640 87540
9572 87540 111312 35485 17445 249174 338361 212470 76456 -181542 -276249 -25974 -194407
9561 -194407 -319681 -75848 193959 60246 111238 19233 -94008 -117583 -68637 -144714 -206008
9550 -206008 -162599 -98660 -230832 -328666 -386733 -298221 -32315 -31387 -70237 -306164 -482804
9539 -482804 -490606 -214951 51412 143870 269952 -80832 -192349 -86347 -73814 -298454
9529b98454j00763J20057R4693N1072k3730K8977J31251J8278J60395J266N5673
9518B38715p4685k13097O5780m6026j60443J06721j49359j39420J02191R5315
9508a74308k8615r9326J15603J45352J52781K2158j62434L8637o2891J46325J75898
9497B69180j01423k52948j26271O6810K27269K02450L4619k4076j99227N1958
9487A48341J6817N1060n4037j04930K10879K52069j22404k66077m6957M5002O889
9476A36652p2342J1051M0142r2133l52409J96217Q7284J47361N7699q5920j39887
9465f6285P0346L3264k8083j9477J50907L07146l33366k91511j84583K45656r4371
9454b10357o4929Q3427J09649N562J97867J75950r0699j70590m8317k49875L01074
$$ plain form
9529 -298454 -399217 -279160 -184467 -133395 -157125 -128148 3103 21381 181776 183042 238715
9518 238715 164030 -49067 16713 -29313 -189756 -83035 -232394 -371814 -269623 -174308
9508 -174308 -202923 -302249 -186646 -41294 111487 133645 -28789 9848 -53043 93282 269180
9497 269180 167757 -85191 -211462 -144652 82617 285067 319686 295610 96383 148341
9487 148341 165158 216218 162181 57251 268130 520199 397795 131718 84761 129763 136652
9476 136652 64310 75361 115503 23370 -329039 -132822 -45538 101823 159522 73602 -66285
9465 -66285 4061 37325 9242 -10235 140672 447818 114452 -177059 -361642 -115986 -210357
9454 -210357 -275286 -191859 -82210 -76648 121219 297169 206470 35880 -12437 -262312 38762
9443C8762L09534j40060l6359j44687p1276Q4608R6026J06253j25984J01717R5656
9432C14190j94061j86574l6418P3428K5929j91368J02544K38430j05192p2094
9422c1186Q676j63457L8966R78N6076N05l64996k32215K09090J89828K74113M188
9410i434j15754J28981J9040j98287j9856K6111K47895J24791P5762k13973k09127
9399a43851J8715L3403L5158j2840J03123m5156j06633p4754R2756J08145l8983
9388c0917n9450L9701K20662J14772J29886k43645j26298K6995Q3140j84982r9345
9377a29481J2849M7569j54240p2203p0250k48502L8218L33853J36525k2896K7629
9366a00929Q8226P7725K02568K20897j51298N2220L6019p6594j09996J2061O2072
$$ plain form
9443 38762 348296 208236 171877 27190 -44086 40522 136548 242801 116817 218534 314190
9432 314190 120129 -66445 -102863 -29435 -3506 -194874 -92330 146100 40908 -31186
9422 -31186 -22510 -185967 -147001 -146023 -89947 -89442 -454438 -686653 -477563 -287735 -13622 -9434
9410 -9434 -125188 3793 22833 -175454 -195310 -169199 78696 203487 279249 65276 -143851
9399 -143851 -125136 -91733 -56575 -69415 33708 -11448 -118081 -192835 -100079 8066 -30917
9388 -30917 -90367 -50666 169996 284768 414654 171009 44711 71706 154846 -30136 -129481
9377 -129481 -116632 -69063 -223303 -295506 -365756 -614258 -576040 -242187 -105662 -128558 -100929
9366 -100929 -12703 65022 267590 488487 337189 389409 425428 348834 238838 250899 312971
9355C12971M5754k40145j11713J01557J9529k6712n4429J3554J69348M8297j13184
9344A64827J52474m3815m314j40546O315l7732N6200j34438n2520K35475Q4533
9333B86459l28069k10961R601K29235P4220J60259p8842j66000l3514j37547m2946
9322b38105R8012l446N9666J45918q2214K3355O1671O3390p5422J7791K4460Q0643
9310A75719q893m5007j48212N4474J26297L22940Q043j91823l5831R9065n3509
9299C03263P163j14510N6253p151k09261K2532J18894J73459k2690Q486O917j9615
9287C23740j10348L9532Q7259K1338j59671k01429k56869P6368M867L6849J26982
9276a1382L5000N9236m7114j40892k41184j65819J55978K02576j0844l770K86391
$$ plain form
9355 312971 358725 118580 6867 108424 127953 101241 46812 60366 229714 278011 164827
9344 164827 317301 273486 269172 128626 134941 97209 153409 18971 -33549 201926 286459
9333 286459 -41610 -252571 -242970 -13735 60485 220744 141902 -24098 -57612 -195159 -238105
9322 -238105 -140093 -143539 -83873 62045 -20169 3186 64857 128247 52825 70616 95076 175719
9310 175719 166826 121819 -26393 28081 154378 477318 485361 293538 257707 356772 303263
9299 303263 310426 195916 252169 245018 35757 58289 177183 350642 327952 336438 343355 323740
9287 323740 213392 252924 340183 361521 201850 421 -256448 -180080 -175213 -138364 -11382
9276 -11382 23618 82854 35740 -105152 -346336 -512155 -356177 -153601 -164445 -168215 118176
9265A18176l8660k52513j43351p1936J05504J93602J12027J33417k4174n0000
9255H2092O3750K20191j12712l32415m1696N9819J54306q5911n1641J20053N0723
9244A26559L2440l9039k02084J03861j395m5498o7453q4689j6071J73644K03778
9233A84053J41359l34052l39435j87468M24573J83534j63568j61653N3116K41077
9223D1536J01371J23767j47372k61110M1591J5497k6467J00879J1889J09660j08996
9212B245k41471j17910M7257L75575K75984k53810j70816O4146o436J33877J06711
9201B15352j80816Q6080K78528J42793K8440m41058k84695m8885J64490L7498
9191b273K13971J04717o8475n8732J96247L9110n6527l13049l10374M1457K74805
$$ plain form
9265 118176 79516 -172997 -316348 -388284 -282780 -89178 22849 156266 132092 82092
9255 82092 145842 366033 253321 -79094 -120790 -60971 93335 7424 -44217 75836 126559
9244 126559 158999 119960 -82124 21737 20342 -25156 -92609 -177298 -193369 -19725 184053
9233 184053 325412 -8640 -348075 -535543 -110970 72564 -91004 -252657 -199541 41536
9223 41536 142907 266674 119302 -141808 -100217 -84720 -111187 -10308 1581 111241 2245
9212 2245 -239226 -357136 -309879 65696 341680 87870 -82946 -18800 -25236 108641 215352
9201 215352 34536 120616 399144 541937 570377 129319 -155376 -204261 -39771 -2273
9191 -2273 211698 316415 247940 189208 385455 424565 368038 54989 -255385 -213928 60877
9180F0877N7872j95138K5674n4722P9774J04400J70417M0897N6810K840m039J60669
9168E06331j0888j88697j95802L9335n8181k69052J1135J71341j66280r8187N2065
9157b06880J05131o7058O4034K64635L12537j40418k89090o5262j9865m0132j06842
9146a89210m6423J52997L57068q9882j35206O3415M9330K58236K73458Q2236k38278
9135E37741j94153l0888P2228R6074k26787r607p8951K56322J55090J0820l0185
9124E57704j06253N3708K62959q4263j63577j72497L28286J43159R0364P1708
9114I81298r939j3938K2592J30476r1813r7665k0935J47612J4543M483j69707
9103H97007Q3467J29912K4838L9235J44230L01330K06480l38800p9210L90476
$$ plain form
9180 60877 118749 -76389 -50715 -105437 -25663 78737 249154 290051 346861 349701 345662 506331
9168 506331 495443 306746 110944 150279 92098 -176954 -165819 5522 -160758 -258945 -206880
9157 -206880 -101749 -168807 -104773 159862 472399 331981 42891 -22371 -42236 -82368 -189210
9146 -189210 -235633 -82636 274432 184550 49344 112759 162089 420325 693783 776019 537741
9135 537741 343588 312700 384928 481002 254215 244608 165657 421979 577069 587889 557704
9124 557704 451451 505159 768118 683855 520278 347781 676067 819226 909590 981298
9114 981298 971359 957421 980013 1110489 1018676 921011 900076 1047688 1062231 1066714 897007
9103 897007 980474 1110386 1135224 1174459 1318689 1620019 1826499 1487699 1408489 1798965
9093A798965L87706K23045L74949M12900K94913L44010M36687N90102O36086R54189
9083F453552J428746J362368J927773L173282M488937O756643R873151J3983816
9075D9448268J7763186K0635413J7666568N866300p920704j9155641k1372463
9068F2930927j6749206j1606874p897912n606885m032111k649407j695691j635895
9060A1056946r72499r54118o69419l53239l28197J04616K82857L15636O0726j4199
9050H529110J33320L58625L19146M62607P86656N97311P35167R44045J007630
9041A3873617R07692P28695K8839r74627j205232j367291j364797q12620n00999
9032I313277m54147q12158o78951m64456l28961k85796l76815k84471k01981m0892
$$ plain form
9093 1798965 2186671 2409716 2784665 3197565 3492478 3836488 4273175 4863277 5499363 6453552
9083 6453552 7882298 9244666 11172439 14345721 18834658 25591301 35464452 49448268
9075 49448268 67211454 87846867 105513435 111379735 103459031 84303390 62930927
9068 62930927 46181721 34574847 26676935 21070050 17037939 14388532 12692841 11056946
9060 11056946 10084447 9130329 8460910 8107671 7779474 7884090 8166947 8482583 8543309 8529110
9050 8529110 8662430 9021055 9340201 9802808 10589464 11186775 11921942 12865987 13873617
9041 13873617 14781309 15510004 15538843 14564216 13358984 11991693 10626896 9814276 9313277
9032 9313277 8859130 8046972 7368021 6903565 6574604 6288808 5911993 5627522 5425541 5384649
9022E384649j77838j69907l77061l62770q8993j01783k68248k36740l05832j7780
9012C277697j07529j0773j40081k22747J66899j40846K1589K56807J10401j3214
9002C198203m78528k84851n1333j54974J50963p9412k15448j46390o069j05525
8992A826636p5277P6081J60760k063r1801j91114q8099j04448j49712j74410j57787
8981A028766n5182L08762L58642j8396q9806j94925j34912Q6025m5770r4285p3851
8970A075068J374K7391j61796j13004k4315Q0029J36047n541q4544K4140j66090
8959G88759K31463R2602k73913j98103j05655J63032J91720p8310O5784O8317
8949I45696j9219O8769k02078k15589K70513J87077j06498j17672N4254j31643
$$ plain form
9022 5384649 5206811 5036904 4659843 4297073 4208080 4106297 3838049 3601309 3295477 3277697
9012 3277697 3170168 3159395 3019314 2796567 2963466 2822620 2844209 3101016 3211417 3198203
9002 3198203 2719675 2434824 2383491 2228517 2379480 2300068 2084620 1938230 1932161 1826636
8992 1826636 1751359 1827440 1988200 1986137 1894336 1703222 1615123 1510675 1360963 1186553 1028766
8981 1028766 973584 1282346 1640988 1622592 1532786 1337861 1202949 1288974 1243204 1148919 1075068
8970 1075068 1076442 1103833 942037 829033 804718 884747 1020794 1015253 930709 954849 788759
8959 788759 1020222 1112824 838911 640808 535153 698185 889905 811595 877379 945696
8949 945696 926477 995246 793168 577579 848092 1035169 928671 810999 865253 733610
8939G33610l09151p4403n666R6386K32447j69277l39981k08080R2551K83516L9818
8928C71770j40027K4483p2449N2478o809j2328J31944m9068L2367J20261J26126
8917E78748j69054J20818k06448k4690J28610R6258r0212p0759J15595j48563
8907C30303M3433J55385j44159k82348J54747k633p2637J42864N0823K02423j78416
8896C99785K5487J54730k71529j83350J46334J78943M8999K81764K0548l2048
8886G69663J06131L249j75107r620K98430L32652p7402j75381Q5204L25402P6960
8875A560181M0371J86110L26901Q92832J269570J401921J649155K160344L094364
8866A2581749L624808K646584M21274j607193l593500l544744k608308k206508
$$ plain form
8939 733610 424459 350056 344390 440776 673223 503946 163965 -44115 48436 331952 371770
8928 371770 231743 256226 183777 236255 229446 217118 349062 299994 332361 452622 578748
8917 578748 409694 530512 324064 299374 427984 524242 434030 363271 478866 330303
8907 330303 373736 529121 384962 102614 257361 254728 182091 324955 375778 578201 399785
8896 399785 425272 580002 308473 125123 271457 450400 499399 781163 801711 769663
8886 769663 875794 879043 703936 694316 992746 1325398 1247996 1072615 1157819 1483221 1560181
8875 1560181 1600552 1786662 2113563 3006395 4275965 5677886 7327041 9487385 12581749
8866 12581749 16206557 18853141 19274415 17667222 14073722 10528978 7920670 5714162
8858E714162j125637p05553p39676n78073l85950p7562k14558j15964N8556O3662
8848A893407O4493k8359Q610l3594j38456j63420J36565K92324j00915k57814
8838A672841m6069K91118K27636L38911L5326J4494j1871j43437J66560q7970
8828B457539l66555n61115l87747J77387L3714k4454r44n8887l5673k41821L1528
8817A022972J61684P7693K0585j50298J38377J02196j52888K7211J46786j92931
8807A201387p7896k28681l9212J56546J0769j97029j47004K3302J01178J44670
8797I48030j22817j98327j99742J0667J50075k9964R678k86561k8600q9438Q0369
8786B43370J68954m0602J83506K828j47465O0734M4902k29220m1459N7617Q3011
$$ plain form
8858 5714162 4588525 3882972 3143296 2565223 2179273 2101711 1887153 1771189 1829745 1893407
8848 1893407 1957900 1929541 1938151 1904557 1766101 1602681 1739246 2031570 1930655 1672841
8838 1672841 1626772 1917890 2145526 2484437 2519763 2534257 2522386 2378949 2545509 2457539
8828 2457539 2090984 1529869 1142122 1319509 1353223 1328769 1327825 1268938 1233265 991444 1022972
8817 1022972 1184656 1262349 1282934 1132636 1271013 1373209 1220321 1247532 1394318 1201387
8807 1201387 1123491 894810 855598 1012144 1022913 825884 678880 702182 803360 948030
8797 948030 825213 626886 427144 437811 587886 557922 567600 281039 252439 163001 243370
8786 243370 412324 371722 555228 558056 410591 471325 516227 287007 245548 303165 386176
8775C86176k83362J51504K21390P5465K9550p0004k2289j85840l61456l20586
8765c79452j08937J50754L19170K84367k5513j56836q9244l0969Q843J83871r8286
8754E7768q1965N500j26755j6260r8594q6449O6455K79824j6790q7117N3287K93974
8742B42878R3622n3675p3129j04236n6741j28078K5350J28707K4610j78108R7913
8731A9113J47246j55238N7851N7106Q0336J22373K37389o3967L5545j32657j08173
8720B96924j53528K02336M7901j79437J05514n5354J7542R8380j30361j84263
8710F5654j02839j36295J69758n7476n8348J14048k02634L4163R0779J8663J90381
8699A25854L5654P2881j66062q160J22201K4814l0659K9864J01283P8098j69212
$$ plain form
8775 386176 102814 254318 475708 551173 580723 510719 488430 302590 -58866 -379452
8765 -379452 -488389 -337635 -18465 265902 240389 83553 -5691 -36660 -27817 156054 57768
8754 57768 -24197 -18697 -145452 -161712 -260306 -346755 -280300 -476 -17266 -104383 -51096 242878
8742 242878 336500 282825 209696 105460 48719 -79359 -54009 74698 99308 -78800 19113
8731 19113 166359 11121 68972 126078 206414 328787 566176 502209 537754 405097 296924
8720 296924 143396 345732 393633 214196 319710 264356 281898 380278 249917 65654
8710 65654 -37185 -173480 -3722 -61198 -119546 -5498 -208132 -173969 -83190 -64527 125854
8699 125854 161508 234389 68327 60167 182368 207182 176523 206387 307670 385768 216556
8688B16556r6584K37595K03405k4508k6794j13940j22183j6675r5086j1048k0914
8677A29824q9669j34668k8811Q4873J15999k1364n643m7453Q3045P8388j18913
8666D5608J35389K39856N0109j79118n3034J07469J2054k7560J33810m6547j10340
8655C07696J00764l775j15456N1258o7369k09010J71088J90526o4181j92120j35027
8644C4394n9598K033k53910J09752J12332O1726r6191L4706J7902o4558O099L6101
8632e9212P8459j87158j92759m4271K7010q3460L76335J14088J34618K31484R2063
8621D87197P9575j56866k39620j04663J87280J47002j15212o4047J32439j43518
8611B09567q3548n7393Q0019L8337R1494J59898l7335M8276K01910k6186M7314
$$ plain form
8688 216556 119972 357567 560972 536464 509670 395730 273547 256872 161786 150738 129824
8677 129824 40155 -94513 -123324 -38451 77548 56184 50541 3088 86133 164521 45608
8666 45608 180997 420853 470962 291844 238810 346279 358333 330773 464583 418036 307696
8655 307696 408460 404685 289229 340487 273118 64108 235196 425722 361541 169421 34394
8644 34394 -25204 -23171 -277081 -167329 -54997 6729 -89462 -54756 -36854 -101412 -95313 -59212
8632 -59212 19247 -167911 -360670 -404941 -377931 -461391 -85056 29032 163650 395134 487197
8621 487197 566772 409906 170286 65623 252903 399905 284693 220646 353085 209567
8611 209567 126019 68626 148645 186982 278476 438374 401039 449315 651225 625039 672353
8600F72353Q0946J4892j48408k89613j19693L5817J85051m0599n0144r0326K37034
8589D87310k33264Q327k3780k91413J07335k9679j99797r4385J62364J22074O5628
8578H0720k3962R9366j80200n2872L08408J69301N4421n107j17422n4280j63553
8567A14820j10361J38061L2482O9712J659L7497J31235O0468j46674k3710J15002
8556D20191l4198j08000r3295J74226N3792l1478j00943j54680K685K9303P2583
8545B30186J78931k8546j32643l20410r6221J5696L23228J36622k60316k47518
8535b00991J81727K0253j44881j5314k8346j59611L149k06600k6088N9343L64240
8524a53119K77791P1488K08619l3973j64458l5126L7338J17241j03878j44957
$$ plain form
8600 672353 753299 768191 619783 330170 210477 246294 431345 390746 340602 250276 487310
8589 487310 254046 262373 238593 -52820 54515 24836 -174961 -269346 -106982 15092 80720
8578 80720 56758 156124 -24076 -76948 231460 400761 455182 450075 332653 278373 114820
8567 114820 4459 142520 175002 244714 246373 283870 415105 475573 328899 305189 420191
8556 420191 385993 277993 184698 358924 412716 381238 280295 125615 128300 157603 230186
8545 230186 409117 380571 247928 -72482 -168703 -153007 170221 306843 46527 -200991
8535 -200991 -19264 989 -143892 -159206 -187552 -347163 -344014 -550614 -576702 -517359 -153119
8524 -153119 124672 196160 404779 370806 206348 171222 208560 325801 221923 76966
8514G6966j9160j15273R648K17910Q4063j09954j61987m3754Q8251J00284o3365
8503F3629k6677J55716K05429Q7102Q346j64731l7702j39035r3304r1824j49641
8492a82692Q948J78621k9524m2373j17565k25177r3250K64908L87234M7486j5986
8481A80630k20644k20607j0516M7642M744J04842j7917j4692K2956j70236K3744
8470b70054J94451M23151J51237j56498k15936O327j39113l8663P3128R0551j06898
$$ plain form
8514 76966 57806 -57467 -47819 170091 254154 144200 -17787 -61541 26710 126994 63629
8503 63629 36952 192668 398097 485199 493545 328814 291112 152077 58773 -33051 -182692
8492 -182692 -173744 4877 -24647 -67020 -184585 -409762 -503012 -238104 149130 196616 180630
8481 180630 -40014 -260621 -271137 -223495 -218751 -113909 -131826 -146518 -123562 -293798 -270054
8470 -270054 -75603 347548 498785 342287 126351 132678 -6435 -45098 28030 118581 11683
$$ [...]
##END NTUPLES=NMR SPECTRUM
##END=
