##TITLE=Analysis number 322386
Compound Code rf 01827
Project Code adrs
Chemist Name prosynth
##JCAMPDX= 6.0         $$ Bruker NMR JCAMP-DX V2.0
##DATA TYPE= NMR SPECTRUM
##DATA CLASS= NTUPLES
##ORIGIN= Bruker BioSpin GmbH
##OWNER= nmr
$$ XWIN-NMR		Version 3.5
$$ Mon Sep 25 08:21:59 2006 GMT Daylight Time (UT+1h)  MAYBRIDGE\nmr@NMR_250MHZ
##.OBSERVE FREQUENCY= 250.131544655141
##.OBSERVE NUCLEUS= ^1H
##.ACQUISITION MODE= SIMULTANEOUS (DQD)
##.ACQUISITION SCHEME= undefined
##.AVERAGES= 16
##.DIGITISER RES= 18
##SPECTROMETER/DATA SYSTEM= dpx250
##.PULSE SEQUENCE= zg30
##.SOLVENT NAME= CDCl3
##.SHIFT REFERENCE= (INTERNAL, CDCl3, 0, 16.522)
##AUDIT TRAIL= $$ (NUMBER, WHEN, WHO, WHERE, WHAT)
$$ ##TITLE= Audit trail, XWIN-NMR		Version 3.5
$$ ##JCAMPDX= 5.01
$$ ##ORIGIN= Bruker BioSpin GmbH
$$ ##OWNER= nmr
$$ C:\u/data/dgb/nmr/ADRS/1210/pdata/1/auditp.txt
$$ ##AUDIT TRAIL=  $$ (NUMBER, WHEN, WHO, WHERE, WHAT)
(   1,<2006-09-25 08:21:21.73 +100>,<MAYBRIDGE\nmr>,<NMR_250MHZ>,
      <created by zg, POWCHK disabled, PULCHK disabled
       configuration hash MD5:
       E2 DF 36 D8 04 B2 41 60 5A D7 A3 38 5A 4B D0 FE
       data hash MD5: 64K
       62 1F 8B 15 DB 37 99 95 47 6A C3 F9 03 E1 CA CB>)
(   2,<2006-09-25 08:21:48.53 +100>,<MAYBRIDGE\nmr>,<NMR_250MHZ>,
      <Start of raw data processing
       ef LB = 0.3 FT_mod = 6 PKNL = 1 SI = 32K 
       data hash MD5: 32K
       2F 03 E8 5E 17 73 F1 E8 63 07 8A 92 08 D1 0E 92>)
(   3,<2006-09-25 08:21:50.51 +100>,<MAYBRIDGE\nmr>,<NMR_250MHZ>,
      <apk 
       data hash MD5: 32K
       F3 1D 00 B7 49 05 71 B4 1D 97 B8 79 6C 18 5B 08>)
(   4,<2006-09-25 08:21:51.48 +100>,<MAYBRIDGE\nmr>,<NMR_250MHZ>,
      <abs ABSG = 5 
       data hash MD5: 32K
       D4 50 92 4B 11 9C D3 F3 F8 A9 BE BD C8 D4 4D DF>)
$$ ##END=
$$ 
$$ hash MD5
$$ 6D 86 AF FE 3B 09 B0 7F 3F 49 E6 83 2C D3 A9 6D
##$RELAX= 
##$RELAX= 
##$RELAX= 
##$RELAX= 
##$RELAX= 
##$RELAX= 
##$RELAX= 
$$ Bruker specific parameters
$$ --------------------------
##$DU= <C:\u>
##$EXPNO= 1210
##$NAME= <ADRS>
##$PROCNO= 1
##$TYPE= <nmr>
##$USER= <dgb>
##$AMP= (0..31)
100 100 100 100 100 100 100 100 100 100 100 100 100 100 100 100 100 100 
100 100 100 100 100 100 100 100 100 100 100 100 100 100 
##$AQSEQ= 0
##$AQ_mod= 3
##$AUNM= <au_zg>
##$AUTOPOS= <2 >
##$BF1= 250.13
##$BF2= 250.13
##$BF3= 250.13
##$BF4= 250.13
##$BF5= 500.13
##$BF6= 500.13
##$BF7= 500.13
##$BF8= 500.13
##$BYTORDA= 1
##$CFDGTYP= 0
##$CFRGTYP= 5
##$CHEMSTR= <none>
##$CNST= (0..31)
1 1 145 1 1 1 1 1 1 1 1 1 1 1 1 1 1 1 1 1 1 1 1 1 1 1 1 1 1 1 1 1 
##$CPDPRG= <>
##$CPDPRG1= <>
##$CPDPRG2= <>
##$CPDPRG3= <>
##$CPDPRG4= <mlev>
##$CPDPRG5= <mlev>
##$CPDPRG6= <mlev>
##$CPDPRG7= <mlev>
##$CPDPRG8= <mlev>
##$CPDPRGB= <>
##$CPDPRGT= <>
##$D= (0..31)
0 1 0 0 0 0 0 0 0 0.06 0 0 0 0 0 0 0.0002 0 0 0 0 0 0 0 0 0 0 0 0 0 0 
0 
##$DATE= 1159168879
##$DBL= (0..7)
120 120 120 120 120 120 120 120 
##$DBP= (0..7)
150 150 150 150 150 150 150 150 
##$DBP07= 0
##$DBPNAM0= <>
##$DBPNAM1= <>
##$DBPNAM2= <>
$$ [...]
##$SUBNAM7= <"">
##$SUBNAM8= <"">
##$SUBNAM9= <"">
##$SW= 20.6930455092707
##$SWIBOX= (0..15)
0 0 3 0 0 0 0 0 0 0 0 0 0 0 0 0 
##$SW_h= 5175.983436853
##$TD= 65536
##$TD0= 1
##$TE= 295.16
##$TE2= 300
##$TE3= 300
##$TEG= 300
##$TL= (0..7)
0 120 120 120 120 120 120 120 
##$TP= (0..7)
150 150 150 150 150 150 150 150 
##$TP07= 0
##$TPNAME0= <>
##$TPNAME1= <>
##$TPNAME2= <>
##$TPNAME3= <>
##$TPNAME4= <>
##$TPNAME5= <>
##$TPNAME6= <>
##$TPNAME7= <>
##$TPOAL= (0..7)
0.5 0.5 0.5 0.5 0.5 0.5 0.5 0.5 
##$TPOFFS= (0..7)
0 0 0 0 0 0 0 0 
##$TUNHIN= 0
##$TUNHOUT= 0
##$TUNXOUT= 0
##$USERA1= <user>
##$USERA2= <user>
##$USERA3= <user>
##$USERA4= <user>
##$USERA5= <user>
##$V9= 5
##$VALIST= <valist>
##$VCLIST= <CCCCCCCCCCCCCCC>
##$VD= 0
##$VDLIST= <DDDDDDDDDDDDDDD>
##$VPLIST= <PPPPPPPPPPPPPPP>
##$VTLIST= <TTTTTTTTTTTTTTT>
##$WBST= 1024
##$WBSW= 4
##$XGAIN= (0..3)
0 0 0 0 
##$XL= 0
##$YL= 0
##$YMAX_a= 356726
##$YMIN_a= -491598
##$ZGOPTNS= <>
##$ZL1= 120
##$ZL2= 120
##$ZL3= 120
##$ZL4= 120
##$ABSF1= 16.522
##$ABSF2= -4.171173
##$ABSG= 5
##$ABSL= 3
##$ALPHA= 0
##$AQORDER= 0
##$ASSFAC= 0
##$ASSFACI= 0
##$ASSFACX= 0
##$ASSWID= 0
##$AUNMP= <proc_1d>
##$AZFE= 0.1
##$AZFW= 0.1
##$BCFW= 0
##$BC_mod= 0
##$BYTORDP= 0
##$COROFFS= 0
##$CY= 12.5
##$DATMOD= 1
##$DC= 0
##$DFILT= <>
##$DTYPP= 0
##$F1P= 14.0000005364418
##$F2P= -0.99999901652339
##$FCOR= 0.5
##$FTSIZE= 32768
##$FT_mod= 6
##$GAMMA= 0
##$GB= 0
##$INTBC= 1
##$INTSCL= 1
##$ISEN= 128
##$LB= 0.3
##$LEV0= 0
##$LPBIN= 0
##$MAXI= 10000
##$MC2= 0
##$MEAN= 0
##$ME_mod= 0
##$MI= 0
##$NCOEF= 0
##$NC_proc= -5
##$NLEV= 6
##$NOISF1= 0
##$NOISF2= 0
##$NSP= 0
##$NTH_PI= 0
##$NZP= 0
##$OFFSET= 16.522
##$PC= 1
##$PHC0= 151.7798
##$PHC1= 13.32773
##$PH_mod= 1
##$PKNL= yes
##$PPARMOD= 0
##$PSCAL= 4
##$PSIGN= 0
##$REVERSE= no
##$SF= 250.13
##$SI= 32768
##$SIGF1= 0
##$SIGF2= 0
##$SINO= 400
##$SIOLD= 32768
##$SREGLST= <1H.CDCl3>
##$SSB= 0
##$STSI= 32768
##$STSR= 0
##$SW_p= 5175.98343685301
##$SYMM= 0
##$S_DEV= 0
##$TDeff= 65536
##$TDoff= 0
##$TI= <Analysis number 999999
Compound Code 99
Book Reference 9
Project Code 9>
##$TILT= no
##$TM1= 0
##$TM2= 0
##$TOPLEV= 0
##$USERP1= <user>
##$USERP2= <user>
##$USERP3= <user>
##$USERP4= <user>
##$USERP5= <user>
##$WDW= 1
##$XDIM= 32768
##$YMAX_p= 438738483
##$YMIN_p= -636287
$$ End of Bruker specific parameters
$$ ---------------------------------
##NTUPLES= NMR SPECTRUM
##VAR_NAME=  FREQUENCY,     SPECTRUM/REAL,   SPECTRUM/IMAG
##SYMBOL=    X,             R,               I
##VAR_TYPE=  INDEPENDENT,   DEPENDENT,       DEPENDENT
##VAR_FORM=  AFFN,          ASDF,            ASDF
##VAR_DIM=   32768,         32768,           32768
##UNITS=     HZ,            ARBITRARY UNITS, ARBITRARY UNITS
##FACTOR=    0.157963299565203, 1,           1
##FIRST=     4132.6476996994, 0,             0
##LAST=      -1043.33573715361, 0,           0
##MIN=       -1043.33573715361, -636287,     0
##MAX=       4132.6476996994, 438738483,     0
$$ Real data points
##PAGE= N=1
##DATA TABLE= (X++(R..R)), XYDATA
$$ [...]
23411a16124K28308L9056o4289m7636j75713M370r9164m5051L4012J14318L5027
23400i2886J08490J0629j22418J5207k670n6287Q8344j11960J1780Q174J2248
23389a31349J35193J6580j02918l897M8099o4247J9574J06270o0511j01970j047
23378a40223j1846q1458N9906M1224m4045J10039L40593J33890j67920q8042k0726
23367A31392P4963j22891j0791j32538n5241p4825J6058J59737m1138n8389O8942
23356d4721O4783J4742p8045j66349P3069M4562l0969Q6529p2683j46355M5115
23345b10322L503j203P4148k2970k30414R4518J35218n5310j53124J4172J2531
23334c39253O1193N4024N0640n0402p4675O3904M0226J10394q0142j63504j4717
$$ y = [-116124, 112184, 151240, 86951, 39315, -136398, -132028, -231192, -276243, -242231, -127913, -92886, 15604, 26233, -96185, -80978, -83648, -139935, -51591, -163551, -151771, -143597, -131349, 3844, 20424, -82494, -86391, -38292, -102539, -82965, 23305, -37206, -139176, -140223, -152069, -233527, -173621, -132397, -176442, -66403, 274190, 408080, 240160, 152118, 131392, 206355, 83464, 72673, -59865, -115106, -189931, -173873, -14136, -55274, -113663, -44721, 20062, 34804, -43241, -209590, -136521, -91959, -122928, -36399, -109082, -255437, -210322, -206819, -208022, -133874, -156844, -387258, -292740, -157522, -212832, -365956, -351784, -339253, -278060, -224036, -173396, -223798, -298473, -234569, -194343, -83949, -164091, -327595, -342312]
23323c42312O1803J87772K14402R9169K2379r8396j32652P151J25498j7239p1167
23312E6408L3740J03736L3884j75710q4992q1398J74M260l3209J09323L779j25176
23300a55181M4480O8355Q8089p1887o8956k9217M5616N9573R1204J4663j47962
23289f1223M160L7906J28419j06511m652J18791J13165j7146J9732P2344J02804
23278D07789k62974k73850p0553K19894O4311N4079r2629j10433M7109J21245
23268A03988j26916k41422R1542J99928L2416j00226m8310n0456J16893L8543
23258A5980j108P1371p8030q0017J09018j33394j84300J68913J22481l5923j00707
23247a25716J05762m2682l7690L1372L0417K8517n7831j02566P0483Q8272m242
$$ y = [-342312, -280509, -92737, 121665, 220834, 243213, 144817, 12165, 19316, 144814, 127575, 56408, 90148, 193884, 227768, 52058, -32934, -114332, -114158, -109898, -143107, -33784, -30005, -155181, -110701, -42346, 45743, -26144, -95100, -124317, -78701, -19128, 72076, 86739, -61223, -57063, -19157, 109262, 2751, -1901, 116890, 230055, 212909, 232641, 304985, 407789, 144815, -129035, -199588, 20306, 84617, 138696, 46067, -64366, -17257, 103988, -22928, -264350, -172808, 27120, 59536, -40690, -89000, -139456, -22563, 15980, 14872, 86243, 8213, -71804, 37214, -96180, -280480, -111567, 10914, -25009, -125716, -19954, -62636, -100326, -68954, -38537, -10020, -67851, -170417, -99934, -11662, -15904]
23236a5904L6223J09223J27788n360l6242o3540j38608j49145j40024J79754J13285
23225A7450k40958K8667J02906K2546j2382J0316Q2259k6636j51931l3952n140
23214b06855K14260J01971O9168j03645j31846J2866N1281p879k3664o7540Q6110
23203e773N4604K5967j11254j54582M2518J04130K05286M3151R0032r7327k2349
23192A74403j42087N4815n1075l24112q9945J34431J39592p5592m593M3903j64469
23181c04729Q4060J36601J4123J7229J09314J9947r2232L1006l1068q8115n6900
23170a60764m1685L7202j13977j39018J63709K78176J9421j13174p5203J50053
23160D740j4504n8679r1385l5167J32873J61405j12778q2744q7247j94350r5013
$$ y = [-15904, 20319, 129542, 257330, 251970, 215728, 152188, 13580, -135565, -275589, -95835, 17450, -223508, -194841, -91935, -69389, -81771, -71455, 10804, -15832, -167763, -201715, -206855, 7405, 109376, 178544, 74899, -56947, -44081, 7200, -679, -24343, -91883, -5773, 48831, 74798, -36456, -191038, -148520, -44390, 160896, 204047, 294079, 196752, 174403, 32316, 87131, 36056, -288056, -378001, -243570, -103978, -179570, -184163, -140260, -304729, -220669, -84068, -69945, -52716, 56598, 76545, -15687, 15319, -15749, -103864, -160764, -202449, -165247, -279224, -418242, -254533, 23643, 43064, -70110, -145313, 4740, -9764, -68443, -159828, -194995, -62122, 99283, -13495, -96239, -183486, -377836, -472849]
23149d72849J74391J66021N0518l3762K08238R9315q8368j52754k02723O4086
23139a87887M6650p5649Q3637J04444r193l1287p057o0594j08523R6455J63070
23128A4066n9707J25935L0723J50428M6161n4171j90141n5046P8034k31388j55416
23117c00522J79091L2465q9016n3842Q8834J9574Q794J91865q5046j04625m6838
23106a59266M6835n596m1044n7719J7931n2914k6480K51428J45349j9461l2631
23095F6432Q666J18205K7089n9031j3118j57704j52481M9065M2373J7491N4364
23084A351J12112j35871q2901N6385p8102n3137j43189j8705O5267J22893m8640
23073b02537j03449m2180Q8571l9194M3725j0845q7153K00446K01182p2231L5139
$$ y = [-472849, -298458, -132437, -81919, -115681, 92557, 191872, 103504, -49250, -251973, -187887, -141237, -216886, -133249, -28805, -37998, -69285, -76342, -136936, -245459, -149004, 14066, -45641, 80294, 111017, 261445, 307606, 253435, 63294, 8248, 86282, -145106, -300522, -121431, -88966, -177982, -231824, -142990, -123416, -114622, 77243, -7803, -112428, -159266, -112431, -118027, -159071, -216790, -198859, -251773, -278253, -26825, 118524, 99063, 66432, 75098, 193303, 220392, 161361, 148243, -9461, -161942, -112877, -70504, -53013, 1351, 113463, -22408, -105309, -48924, -127026, -180163, -323352, -342057, -276790, -153897, -202537, -305986, -348166, -259595, -298789, -255064, -265909, -353062, -152616, 48566, -23665, 11474]
23062A1474P6628M217j15630j30191j0740K21784k4933n1643q1147q2776J63944
23051a9013J49212N0253K7914j05018n0473j68687j00948m1170o900p1903O2717
23040b74016J34962L6481J17556J37950J62833L8981j69762j24780O4920q6532
23030C8593j67115J63667j8367m2698K5188P4131l8224k29007j92709J23076L4885
23019b28580K1111P980J04645J16857p136J5423k44504j5578k6878N3513p448
23008b10595k620l3503o6256O0068K71701m7181K0830j34506k23745J23660K54995
22997A2848J9637J59787n0527l3632L4324j16166k4166p3898r4073n1019N5719
22986a61166L0792o0197j96962K03320J0775R3361L6274K0657m1789K21927P7233
$$ y = [11474, 88102, 92319, -23311, -153502, -164242, 57542, 32609, -19034, -100181, -182957, -19013, 130199, 180452, 208366, 103348, 52875, -115812, -216760, -257930, -264830, -336733, -274016, -139054, -102573, 14983, 152933, 315766, 354747, 184985, 60205, 125125, 38593, -128522, 35145, 16778, -25920, -732, 73399, 35175, -193832, -386541, -263465, -228580, -207469, -199489, -94844, 22013, 14877, 30300, -214204, -229782, -256660, -203147, -210595, -213215, -246718, -312974, -252906, 18795, -28386, -7556, -142062, -365807, -242147, 12848, 32485, 192272, 141745, 108113, 142437, 26271, 2105, -71793, -165866, -216885, -161166, -130374, -190571, -387533, -184213, -173438, -80077, -43803, -23146, -64935, 156992, 234225]
22975B34225j49113o1950J05839o4911k7872k0784j00015K0728L6912o3479R801
22964h0619K2451J06537j8585q4531Q1386o8612O552l4814l3022m5331m8144K07645
22952A0913N8563j80336j14732Q0663P3650M2304M9284K1204P5952j446k0902
22941I5117j27892j18104L5268L1497J98296K64999k0390j54602N6524N5095j17898
22930A97910k03620j0176J4500J08570R4046K7523K0212M728o3684j30742o2931
22919c664l1833J56145j2901k72478p4776J53748N4628J1050k3776P8681j60749
22908a25925j40439L0961j0106J33392K45514o8329r2820J12736j417k1824M956
22897F6699j53594k02991j6761L2163J06082J72498j0042j15396J2847J27211
$$ y = [234225, 85112, 23162, 129001, 64090, 36218, 15434, -84581, -63853, -26941, -90420, -80619, -58168, 48369, 29784, -54747, 26639, -41973, -35421, -70235, -103257, -148588, -196732, 10913, 69476, -110860, -225592, -144929, -71279, -28975, 20309, 41513, 117465, 116019, 95117, -32775, -150879, -115611, -84114, 114182, 379181, 358791, 204189, 260713, 315808, 197910, -5710, -15886, -1386, 107184, 201230, 228753, 248965, 253693, 190009, 59267, -3664, -35497, 120648, 107747, -164731, -239507, -85759, -31131, -20081, -43857, 34824, -125925, -266364, -235403, -245509, -112117, 133397, 65068, -27752, 84984, 83567, 61743, 66699, -86895, -289886, -306647, -274484, -168402, 4096, -5946, -121342, -108495, 18716]
22887A8716m8905k562Q6050J02063J28622n383J81340J1079k60590j91593j98559
22876a79722m4043m031N753Q0590J03633q3461M129L9248k09664j66745K00541
22865b53772J74330k9587j12198Q4201J41154l7270o1190q3578m3302J18747J31991
22854B9526r8907p7675K5239L9554k58785O687P7316q4k9083J6875o4296j51959
22842d85592J48182J82117O7761j4470J95091Q6129M487j49630k40416Q3429J18358
22831d554M8055j26614N8313n6452j0458J18644o6130N8498J2395j22259O8461
22820b2101j08008o3365J59289K29221j6036p2402j7082m9741j13476q0332j41062
22809b95095K4082n7682Q1325J16931P1434M1845m173l15031R3904L17015J70830
$$ y = [18716, -30189, -32751, 53299, 155362, 283984, 278601, 459941, 471020, 210430, 18837, -179722, -223765, -227796, -222043, -141453, -37820, -121281, -117152, -77904, -287568, -454313, -253772, -79442, -109029, -221227, -137026, 4128, -33142, -94332, -177910, -221212, -102465, 29526, -69381, -147056, -121817, -82263, -341048, -334361, -257045, -257129, -286212, -269337, -333633, -485592, -337410, -155293, -87532, -102002, 93089, 179218, 183705, 34075, -206341, -122912, -4554, 43501, -83113, -24800, -81252, -91710, 26934, -39196, 19302, 31697, -90562, -22101, -130109, -193474, -34185, 195036, 179000, 106598, 89516, 39775, -73701, -154033, -295095, -271013, -328695, -247370, -130439, -59005, -17160, -21333, -336364, -242460, 74555, 245385]
22798B45385J5909o7958J4453N6778n5838J153j63663j69402l5128l1802J61111
22787b9002J30888J4289r2010J22858j39654o2975N1678J30190R5139j58727k41788
22776a79114o7875J33719j41234j12919J07758J6420Q3672N1759P7661L166j1685
22765c8672j638M9729J13449J27636l2116j32247k4171J6805m1701l54M5284j0135
22753G1869r844k5887j33759j39133J6766J63977k9410k38010J05658N4396o2025
22742b25402L9847l649J14782J87581J57108m3509j23103j99916p9625O5018J19223
22731H355M5808k7775J9372Q3665R274j08110m4066J45551r8413j33020Q3105
22720a6254L9570o911M7885J3866P812k7773L1330M9044m0948j02239j47400q2180
$$ y = [245385, 261294, 193336, 207789, 264567, 208729, 209882, 46219, -123183, -158311, -190113, -29002, 101886, 116175, 24165, 147023, 7369, -55606, -3928, 126262, 221401, 62674, -179114, -246989, -113270, -254504, -367423, -259665, -243245, -159573, -107814, -30153, -26987, -38672, -40310, 9419, 122868, 250504, 218388, 86141, 61970, 78775, 37074, 36720, 82004, 71869, 62025, 36138, -97621, -236754, -219988, -56011, -85421, -323431, -217773, -163377, -225402, -185555, -189204, -74422, 113159, 270267, 226758, 103655, -96261, -175886, -110868, 8355, 54163, 26388, 45760, 129425, 138699, 30589, -13477, 132074, 33661, -99359, -16254, 23316, 16405, 64290, 78156, 85968, 58195, 89525, 138569, 97621, -4618, -152018, -234198]
22708b34198J40501J00717q340R0246m453k27662p679J72071P8115k4944m8015
22697B6359j95026k70802Q1666K18873o6071j26290J91255r4271j64987n8256
22687d57550L2099n0433J65243Q5637l4658q5085R2227J46646m7526m5226M8696
22676a49930n369K5472J5011R6374J69401l5114L0810l3330l5787L9621k11808
22665i4649q5859k30233J27488m0990j16919K54755J93628l9122p3909p3362Q2700
22654i6472Q7818Q0320O7212k26581j23357N2914l2193J7736P1307K937p1908
22643a70267L4868r744j17053R3103K29938J17864j05489j52019J83148K10921
22633C15270o4704Q235j5828j6321j96166k07555J07887J56310r3435L8401J25385
$$ y = [-234198, -93697, 7020, -1320, 88926, 84473, -143189, -150868, 21203, 99318, 74374, 26359, -168667, -439469, -357803, -138930, -205001, -331291, -140036, -234307, -399294, -457550, -425451, -475884, -310641, -225004, -259662, -344747, -252520, -105874, -153400, -198626, -149930, -155299, -129827, -114816, -18442, 150959, 115845, 146655, 113325, 77538, 117159, -94649, -180508, -410741, -283253, -324243, -441162, -186407, 7221, -31901, -105810, -179172, -96472, -8654, 71666, 138878, -87703, -211060, -158146, -190339, -172603, -101296, -98359, -170267, -135399, -145143, -262196, -169093, 60845, 178709, 73220, -78799, 104349, 315270, 250566, 258801, 242973, 226652, 30486, -177069, -69182, 87128, -6307, 32094, 157479]
22622A57479j40936j23893K12885J05227p551o9641j64183k33994j21920M7296
22612c39231J32601P5980Q762J43776Q3556n2287m6869J1033j41675K442m1664
22601a63576J24878J03452K6638q9684R412j82333j18407J05240j06957L5424
22591b55913o9806j12848J03125K756Q6842J60214L5520j26568M9034P1885J0514
22580d5245o5679J92938r997L5508r9873N1174o2473j10588K786l7827J42616
22569f660Q3368N2296p812k42939k48751J7681J95212m1185j1584J66004m8764
22558i3134p662L2321n1469P9698P4936j24481o0466O7536L2790k7751j0211k12809
22546c00702N3529k2857L786n2172j7923q324J22494p32n5823J5866J45792K2854
$$ y = [157479, 16543, -107350, 105535, 210762, 203211, 133570, -30613, -264607, -386527, -339231, -206630, -130650, -121888, 21888, 105444, 53157, 6288, 17321, -124354, -121912, -163576, -38698, 64754, 91392, 1708, 11120, -171213, -289620, -184380, -291337, -255913, -325719, -438567, -335442, -332686, -245844, -85630, -50110, -176678, -127644, -55759, -45245, -110924, 82014, 72017, 107525, 7652, 58826, -3647, -114235, -111449, -149276, -6660, 76708, 129004, 121192, -121747, -370498, -352817, -157605, -198790, -210374, -44370, -93134, -100796, -68475, -119944, -40246, 34690, -89791, -150257, -82721, -49931, -77682, -87893, -300702, -247173, -270030, -266244, -318416, -336339, -344663, -222169, -222901, -278724, -262858, -117066, -94212]
22534i4212q7365P2767Q4605Q1067m0225j21208j48628J37456J7794j07541J04147
22523a01343R5043R1330j59537j67516L8183L5133L6168P5672J09006j95870m1807
22512a85538O3651l9052J19935P9776r2349O6551o189j45815q1313j6778J20117
22501a17004P0657J21072k08107j391M1447J88078L5977j00084j20261L6851m3813
22490i6578j55082J1900K00953P3671P590l9318k5812O9332Q9774J68590j54310
22479A50710m8578J8732K1198J3673j01136j53481k92456r6180K71381J53681
22469f2456j4899m5173m0433M5677j23718J53590k3739K6799N2538N4714k9082
22458f182M2932O1562j3327k0428j02869n1893K0140q4929r6971o6648O7051J16065
$$ y = [-94212, -181577, -108810, -24205, 56862, 16637, -104571, -253199, -115743, -97949, -205490, -101343, -6300, 85030, -74507, -242023, -203840, -168707, -132539, -56867, 52139, -143731, -185538, -121887, -160939, -41004, 38772, -53577, 12974, 6785, -139030, -220343, -237121, -117004, -46347, 74725, -133382, -134773, -93326, 94752, 130729, 30645, -89616, -52765, -96578, -251660, -239760, -38807, 34864, 42454, 3136, -22676, 46656, 136430, 305020, 150710, 102132, 120864, 142062, 155735, 54599, -98882, -391338, -487518, -216137, -62456, -77355, -122528, -162961, -117284, -241002, -87412, -111151, -84352, -31814, 22900, -6182, 36750, 98312, 84985, 64557, -38312, -90205, -70065, -154994, -251965, -318613, -251562, -135497]
22446a35497N0815K7119N1540j203r0856r5477L6469O9378j49557q6052L7811
22435b85510J32290K77825K01088k300j27858j05608k0644q7224k48263k6002
22425b92206J02094O9051J80981J15147n7147j00705r5780j11224N4072n576J30167
22414a1126m1276O3869j8400N7666O5255k03532q2138O2302j36930N216K536r2084
22402c28642J0320P1399J85727O1078j52911K2722l3207n0742J26731R685M8564
22391b9276m0598k6106J02979Q6884r4782P167o9132l6860J78558q7113N5132
22380D6853O9635m8799l6146j0688n8107l8149o9700K26933P60k33016k9881J09882
22368g0423J79192O8617J18856n0084r1870r7760J22221j93481q1032N9462r5865
$$ y = [-135497, -84682, -57563, -6023, -7226, -98082, -193559, -157090, -87712, -237269, -323321, -285510, -153220, 124605, 325693, 323393, 195535, 89927, 69283, -17941, -266204, -292206, -190112, -121061, 59920, 175067, 117920, 17215, -78565, -189789, -135717, -141293, -11126, -52402, 11467, -6933, 50733, 115988, -87544, -169682, -107380, -244310, -239094, -236558, -328642, -318322, -246923, -61196, -118, -153029, -130307, -163514, -214256, -87525, -77840, -29276, -69874, -95980, 6999, 93883, -899, 6268, -62864, -99724, 78834, -8279, 46853, 116488, 67689, 31543, 20855, -37252, -75401, -145101, 81832, 82592, -150424, -180305, -70423, 108769, 177386, 296242, 246158, 154288, 56528, 178749, -14732, -95764, -36302, -132167]
22357a32167j447j5211j3259n2998p4249J33420m5460n5186j45509j60128L33936
22346b28258P3256q4897P5225j31449j12195N3242K54324J09638K8966j13980
22336g6128N7283Q6717o3055j58648J7734P784N0424J34987o9104m7100r3061
22325a52167j05658N1088J25506R948o0399J26021p989Q6156p9287j32344M8803
22314i0322N782r9285O2834M0700j68422m5462J23243k9098j03203N5658O8153
22303a79422Q2527O342k16553J01219j215j34868l8971O6361O0303l7837k7367
22292c19481P5357R1134R5959J12279j0610k5234Q9668L1656k7965O6412o433
22281A72742J26424j58633r0006j38037N0010M4168J15166O7678N3911j02396
$$ y = [-132167, -133614, -148825, -162084, -215082, -289331, -155911, -201371, -256557, -402066, -562194, -228258, -155002, -239899, -164674, -296123, -408318, -355076, -100752, 8886, 37852, -76128, -18845, 67872, 4817, -153831, -136097, -128313, -77889, 57098, -12006, -59106, -152167, -257825, -206737, -81231, -71283, -131682, -5661, -13650, 72506, -6781, -139125, -90322, -84540, -183825, -120991, -80291, -248713, -294175, -170932, -200030, -303233, -247575, -179422, -96895, -90553, -307106, -205887, -207102, -341970, -380941, -314580, -254277, -292114, -319481, -244124, -152990, -57031, 55248, 44638, 19404, 109072, 140728, 112763, 179175, 172742, 299166, 140533, 50527, -87510, -37500, 6668, 121834, 189512, 243423, 141027]
22271A41027k08049o9310K25422J7514j67986O0338M1805Q5j03397Q8069O4043
22260H9561N9670o1566j11614k3546o4532j07799k52762m9459J98417J71803J7913
22249a33914J4450q4120K41337r1380k5523J35991j58477M0876R7402m7713l2365
22238d3436m1763r2279N8410P6048Q7882K31667J0432o4919O7358j08484p727
22227A73189n1456J6141L8883m5985j52789j24582p9056o817K12412R4968m5187
22216B9721o8581J36300J16183n9882K1219N8762p0279j12402N5873J9387l589
22205A22712j64128K7578J9943Q29j6616J6204K4492k44756P9311J03307k11871
22194b42995q1071K05254J68786q6488K9762p385l1728m7480J06717K18335O5469
$$ y = [141027, -67022, -136332, 89090, 106604, -61382, -1044, 40761, 40846, -62551, 25518, 89561, 149231, 87665, -23949, -47495, -112027, -219826, -472588, -522047, -323630, -151827, -133914, -119464, -203584, 37753, -53627, -79150, 56841, -101636, -60760, 36642, -11071, -43436, -85199, -177478, -119068, -43020, 44862, 276529, 286961, 222042, 289400, 180916, 173189, 121733, 137874, 176757, 130772, -22017, -146599, -225655, -232472, -20060, 74908, 29721, -38860, 97440, 213623, 153741, 174960, 233722, 163443, 51041, 106914, 126301, 122712, -41416, -13838, 6105, 6934, -9682, 6522, 31014, -213742, -134431, -31124, -242995, -324066, -118812, 49974, -36514, -6752, -14137, -45865, -93345, 13372, 231707, 297176]
22183B97176j84599j94300J57240Q2887j51618M161j27051M8777Q1607q7388j58347
22172b31455J9273N0162J4542r1924J056K031K3303J97199p0647k55150j09434
22161d51044j4469p6543p019J89155n8687J82899J83747N943K1550l717k00572
22150b28757L6337K2564O0067j47483r523J3451J2823J8157J39378j77407j6923
22139b77316J52398r0333j03045J22652J03646J06251J1337p6120j22027N2957
22129a19600J84793Q1357J4152P2414R9275m1513j66068j94210o0513n4144J01668
22118h2389L7795J5234R3562q8950j07095j04025K102j7017J2394k0917q9772
22107c49078J49733J29044O6577P1959M6096p7473j96182j59096o5766M8391R6164
$$ y = [297176, 112577, -81723, 75517, 158404, 6786, 10947, -116104, -67327, 14280, -73108, -231455, -212182, -162020, -147478, -239402, -238346, -236315, -213012, -15813, -86460, -341610, -451044, -465513, -542056, -549075, -359920, -418607, -235708, -51961, -46018, -24468, -28185, -228757, -192420, -169856, -109789, -257272, -266795, -253344, -240521, -222364, -82986, -260393, -277316, -124918, -215251, -318296, -195644, -91998, 14253, 25590, -50530, -172557, -119600, 65193, 146550, 160702, 233116, 332391, 290878, 124810, -69400, -129913, -184057, -82389, -44594, -29360, 64202, -24748, -131843, -235868, -233766, -250783, -238389, -259306, -349078, -199345, -70301, -3724, 68235, 114331, 36858, -159324, -318420, -384186, -335795, -239631]
22096b39631K383J13410J0086K5465J19804j21781O3887R0498K7265j34124k19628
22085b62366o7483r489o5037M149J4379J1745j14103j09964K50258J63269K0250
22074a64392J12550j3415n7859K5108j33444N7023J03248n8276k8510k0042l8042
22063b16051n8986q8743L1191M6049O4983N0231J4524Q0772n8967m1927K3752
22052a53172O0164K0613M1849p977Q029q4717r9003l9150R523P3892K3658J77472
22040C1181k6303j62077q5475k2233O8180r7673m4988L16271J17613j3081j29183
22029d7768P219J31987Q9983k8601n245o4960N3565k06974o4372M2738K9849O5330
22017B751j48805j63932o5751J22852Q6712J52062k2677j34792j73366J29341
$$ y = [-239631, -237248, -123838, -113752, -88287, 31517, -90264, -26377, 64121, 91386, -42738, -262366, -329849, -339338, -404375, -400226, -385847, -374102, -488205, -598169, -347911, -184642, -164392, -51842, -65257, -123116, -98008, -231452, -174429, -71181, -129457, -157967, -178009, -216051, -275037, -363780, -332589, -286540, -221557, -171326, -156802, -76030, -134997, -176924, -153172, -93008, -72395, -30546, -38523, -30494, -115211, -214214, -253364, -243841, -169949, -146291, 31181, 4878, -157199, -242674, -264907, -196727, -294400, -339388, -23117, 94496, 81415, -47768, -40549, 91438, 181421, 152820, 147575, 82615, 136180, -70794, -135166, -92428, -62579, 2751, -146054, -309986, -375737, -252885, -166173, -14111, -36788, -171580, -344946, -215605]
22007b15605P8497j76082m5824J15095J56809J59680K6400j56030j09492l187
21997a69739o919J08510l9091r6533l8180J87404o0166j9286J20797k9325q7826
21986a30354J49835J25102j30766j01262j43576K6931R7256j50479K7026M8198
21976a82089O5500M4969j9277L6439p3663j06916J78616M7429p740j19481J71170
21965C4957J42489J6722n6240j93055j35867P0930J77522N4259k04888k3464O2852
21954e3783K7151j39818j35322k02637O7602K32471K53428P9713P671P6464j64089
21943D8851j90678P496K0004J03487M6680q6800N3002L0837m4678j42773j85689
21932c40261q5377J0372J56471N1067J06150J17162M2810p271o7185N2443J55683
$$ y = [-215605, -137108, -313190, -359014, -243919, -87110, 72570, 98970, -57060, -166552, -169739, -176658, -68148, -107239, -203772, -241952, -54548, -114714, -134000, -13203, -42528, -130354, 19481, 144583, 13817, -87445, -231021, -204090, -106834, -257313, -230287, -182089, -116589, -71620, -90897, -54458, -128121, -235037, -56421, -8992, -16732, -136213, 34957, 177446, 194168, 137928, -55127, -190994, -120064, 57458, 111717, -93171, -116635, -53783, -26632, -166450, -301772, -504409, -436807, -204336, 49092, 128805, 136476, 212940, 48851, -141827, -134331, -114327, -10840, 35840, -50960, 2042, 32879, -11799, -154572, -340261, -425638, -415266, -258795, -207728, -101578, 15584, 58394, 51123, -16062, 36381, 192064]
21921A92064m8975j97012l2940j13566j49095R0835Q4402j43336j18841K11602
21911b24862M1670J44063J42608N0007j81794j95655l6231N7641K06336L6010
21901C9793q3941r3665j40999J22221J19581J32602q9998j04899k4487r5568k6516
21890b45876N7178J02684j31458l8425n3347J4390J36419J96020J41329q8602
21880I0312J6554k050J31536j32921j84606q4356j04449Q0145J97080J07775k28236
21869a13216n3707L4935o9518l5158Q1503J36483J20274k3052j11348m9779J9006
21858f3577N3168m2589L8172o5682k37329J38678O6755j1737m5719j7921Q5604
21847a02177j56110j48680m0549J56541J01018K4438l7402J53286J46242m8285
$$ y = [192064, 143089, -53923, -86863, -200429, -349524, -258689, -174287, -317623, -436464, -224862, -183192, -39129, 103479, 153486, -28308, -223963, -260194, -202553, 3783, 39793, -44148, -137813, -278812, -156591, -37010, 95592, 5594, -99305, -123792, -219360, -245876, -188698, -86014, -217472, -255897, -309244, -294854, -158435, 37585, 178914, 90312, 106866, 104816, 236352, 103431, -81175, -165531, -269980, -189835, 7245, 115020, -113216, -166923, -131988, -201506, -236664, -155161, -18678, 101596, 78544, -32804, -82583, -63577, -10409, -52998, -14826, -80508, -317837, -179159, -112404, -124141, -169860, -187781, -102177, -258287, -406967, -447516, -290975, -189957, -165519, -202921, -49635, 96607, 48322]
21837D8322j0521j67410m4429K929N52M9680M3390n4144j07943J9319L0045q2962
21825b73172o1798Q2179J8844k3581q3734m6246J34601P5161K27697N6903n5592
21814E1262j9686j05103k7741n6086m9367K1616k364J54808n002j86881j29146
21803c53690j04642Q4002L53459J58224j50132j43294r2762M888O2292K85817
21793A04162O1221j48887j23335j13847o1535J09023Q9236J12457m5373j67536
21783a84414l2759J53075J18452k6511j10209L1099O1426O8819J25353p7257j93970
21772f6896j84352M4127L2205N5449k7548L4270J04012P2957m3421p3903j19335
21761a72435O4472j5655m9344j19732L4843R9315J07496o7533R4661J45654n3844
$$ y = [48322, 37801, -129609, -174038, -171109, -170557, -120877, -77487, -131631, -239574, -220255, -190210, -273172, -334970, -252791, -233947, -257528, -341262, -387508, -252907, -177746, 49951, 106854, 51262, 31576, -73527, -101268, -157354, -206721, -185105, -187469, -32661, -37663, -224544, -353690, -458332, -374330, -20871, 137353, -12779, -156073, -248835, -243947, -181655, 104162, 165383, 16496, -106839, -220686, -282221, -173198, -83962, 28495, -16878, -184414, -217173, -64098, 54354, 27843, -82366, -51267, 10159, 78978, 204331, 127074, -66896, -251248, -207121, -174916, -119467, -147015, -112745, -8733, 64224, 20803, -53100, -172435, -107963, -123618, -172962, -292694, -257851, -158536, -51040, -118573, -23912, 121742, 67898]
21750F7898l9746j189r2341j38487J38242M9915J39113J07335q8301N5792J98118
21739C96349p8718k46120o2217K04711o382k78364k3893J6411o6391J3264J18854
21728a2496J91855O4767n3860j42955r3171P6095J74153m1625j45053k3988L5516
21717B9238n5271L7551J22205J452K03955K6597k48298l17744j61792M6808J10532
21706b04767J07110N1821j15647n476K23437O417j3898j93784J0514Q5013j39066
21695a88326R282q5519r0742J01041J63868K3263l8997j46139p0300M076J23181
21684a95312l2377j1377J28814N0950p5960r4700J22j6212N5185q4677n6305P9263
21672b52586l098K51726O4236J6549O4334L1027j27141q0872M5571K4945m2275
$$ y = [67898, 28152, 26963, -65378, -203865, -65623, -15708, 123405, 230740, 142439, 198231, 396349, 317631, 71511, 9294, 214005, 207623, -70741, -94634, -78223, -144614, -131350, -12496, 179359, 244126, 190266, 47311, -45860, 30235, 204388, 162763, 17710, -6278, 29238, -26033, 11518, 133723, 135175, 339130, 365727, 117429, -200315, -362107, -315299, -204767, -97657, -45836, -161483, -166959, 56478, 62895, 48997, -144787, -134273, -49260, -188326, -179044, -264563, -355305, -254264, -90396, -67133, -106130, -252269, -322569, -318493, -195312, -227689, -239066, -110252, -59302, -135262, -229962, -229840, -246052, -190867, -275544, -331849, -252586, -255684, -3958, 60278, 76827, 141161, 172188, 45047, -35825, 9746, 34691, -7584]
21661g584k3293R6520k9097j53823K2436l0276M2038J47689J54605r4306q9815
21650C5094J6393J62810j96185j81148o3362J04850N1830j25013q9826O8807Q8888
21639a26862K2316J12211J1956K269O0294Q9968o666Q6149J6629j22644O503L668
21627A55791n6222n6153J6002L6666m0549j79488l6666L0557J71129P6102K0059
21616A37228j88049j28910p1467P6470O2646P7849J02937j46992j08281J7826
21606a68743o6996P6357J39643K0772m6695P6093j08976j44554J18052J20819
21596A5772R3163p2222r3436j2473j26957J63616p112P1617J6710p1353j55246
21585a77921l625M5881m0220j82747j9690l1405L9407K60879K67519o3201j09994
$$ y = [-7584, -30877, 65643, 36546, -117277, -94841, -125117, -83079, 64610, 219215, 124909, 35094, 51487, 214297, 18112, -163036, -226398, -121548, -69718, -194731, -284557, -215750, -126862, -104546, 7665, 19621, 21890, 82184, 172152, 165486, 251635, 268264, 145620, 152123, 155791, 99569, 43416, 59418, 96084, 55535, -123953, -160619, -130062, 41067, 117169, 137228, -50821, -179731, -251198, -174728, -112082, -34233, 68704, -78288, -186569, -168743, -235739, -159382, -19739, 1033, -45662, 30431, -78545, -223099, -105047, 15772, 108935, 36713, -56723, -69196, -196153, -32537, -39649, 31968, 48678, -22675, -177921, -181546, -135665, -175885, -358632, -378322, -409727, -370320, -109441, 158078, 94877, -15117]
21574a5117j39334Q1197N1617j3970O9252j08840M6557M055j56j72056k4195K12683
21562h307J33650P1432Q4048j34138r1304L9411l8651J2441J586p7140O9282K4666
21550H6976p2685P592p8179m0485o3970R7097N8451k09132j55028n5489j3167
21539d38019J44093J86508J21751j3317k5305r8648p6735m2040N7496J49637r0523
21528a25102j12340J9704J26365p0681k24075L777R8999J10240J52892J30038
21518A09817j33976j16350J07142M2006j80286K8513j3557N5029K7239J26864
21508E2441k8658M0846N1760n8371Q806M6172R5615M1463k2756J37590K6430o0384
21496C30954p8808K4672j59860j19914r9542j54078P5556J18641q3975j41720
$$ y = [-15117, -154451, -73254, -21637, -35607, 33645, -75195, -28638, -24583, -24739, -196795, -220990, -8307, 125343, 196775, 280823, 146685, 55381, 94792, 56141, 68582, 70168, -6972, 62310, 86976, 14291, 21883, -56296, -96781, -160751, -63654, -5203, -214335, -369363, -424852, -438019, -293926, -107418, 14333, 1016, -24289, -122937, -199672, -241712, -184216, -34579, -125102, -237442, -217738, -91373, -162054, -386129, -382352, -283353, -173113, -20221, 109817, -24159, -140509, -33367, 8639, -171647, -143134, -156691, -101662, -74423, 52441, 23783, 64629, 116389, 58018, 66824, 112996, 208611, 250074, 227318, 364908, 391338, 330954, 252146, 276818, 116958, -2956, -102498, -256576, -181020, -62379, -146354, -288074]
21486b88074L6274P3804J28099M4721n07m1540j16297j3902Q0643J37990J48438
21475A89649o576o4229J597N261N474L8444n8769j45151n7520L3307r9666j45413
21463c03592Q7546K35805L4646l8749q9984p4347m6388J73559J00568l009Q3353
21452A59408M9908j50399n2001M2136n0580k6014j5109L5927Q2290K6271Q3376
21441A85213M0567J9728k8792P6414K8125r4759n9875O7690l9304r6741j19114
21430b0848j00173m0490j7401j48145j0234R553q6377J76382J63443K9068k2069
21419f7291m472j13879l3821N3195O1745O036j10309q944O8102L09765Q8773k41722
21407G178n8505Q9360P8297j56131j11889j32262O5014J68331r0591l9724j01221
$$ y = [-288074, -251800, -177996, -49897, -5176, -5683, -47223, -163520, -177422, -96779, 41211, 189649, 183073, 118844, 120441, 125702, 131176, 169620, 110851, -34300, -91820, -58513, -158179, -303592, -216046, 19759, 54405, 15656, -74328, -148675, -195063, -21504, 79064, 76055, 159408, 209316, 58917, 6916, 49052, -1528, -27542, -42651, -6724, 75566, 101837, 185213, 225780, 245508, 216716, 293130, 321255, 226496, 166621, 234311, 195007, 98266, -20848, -121021, -161511, -178912, -327057, -337291, -327738, -414115, -237733, -74290, -45222, -67291, -71763, -185642, -219463, -166268, -104523, -98487, -208796, -217740, -149638, 160127, 248900, 7178, -51327, 38033, 116330, -39801, -151690, -283952, -218938, -50607, -141198, -180922, -282143]
21396b82143j9872J22095P8637r3704n0417P8923M2340n6177J3076k3011q9799
21385b80052Q7706R2025J3634P8288n2016k2347J98230R4075j04459o8857j462
21374C4765J7367P7602k24344k5882O1231K6951m9897N7424R3401m5149j52279
21363a28810J47408J34224n0185O7329j18024j41108L4189L9068k8722N9095P2651
21352H7115k28747J02420O9284J23898J88231n0123r6465Q2828J35587r6796R1010
21341D08242q5478q7r5394r8641j2237p0984r4279n1213J56685l0547j73794J14429
21329c3298K3379O2146J34246p4561q8252q1288j52114K7743n6705K5793K2991
21318a89920k4042q511J30543j34814J15958J93822L9209j03970M8478J62387
$$ y = [-282143, -302015, -179920, -101283, -194987, -245404, -166481, -124141, -180318, -167242, -190253, -280052, -192346, -100321, -86687, -8399, -60415, -82762, 115468, 209543, 105084, 36227, 34765, 52132, 129734, -94610, -120492, -59261, -32310, -82207, -24783, 68618, 23469, -128810, 18598, 152822, 102637, 169966, 51942, -89166, -54977, -15909, -44631, 14464, 87115, -141632, -39212, 30072, 153970, 342201, 292078, 195613, 278441, 414028, 317232, 408242, 322764, 322677, 227283, 128642, 116405, 45421, -48858, -100071, 56614, 26067, -147727, -33298, -9919, 52227, 186473, 111912, 23660, -57628, -209742, -181999, -238704, -212911, -189920, -213962, -222473, -91930, -226744, -110786, 83036, 122245, 18275, 66753, 229140]
21308B29140N1121q1080j93864k16118J53683J60250M7184j21525j57604k15596
21298c44409j02454M7108J6222J80831J06351j31698j19405q6105J13437J26438
21288a93684J1582R433m6175q0806m9148J1137M8848J56850J42109n1737J56k2600
21276f4035M1762j24822J07472J80860q1341p4829M549Q999J41693j4660m8411
21265G7237l7456l4404j8829p4002j76705p6863K17780P6194n1369l790J30630
21254B8423K2202Q5950J2731M4440j95708j69233P1712j1634P5947l1628k4260
21243i1058Q1143j62291j38290m5431q2279L6629K4842R5641P5593L2996K6324
21232a46181j28023j4243J54735J46947J14046R5727r8466J4255m3312J3767R1680
$$ y = [229140, 280261, 199181, 5317, -210801, -57118, 103132, 150316, 28791, -128813, -344409, -446863, -399755, -383533, -202702, -96351, -228049, -347454, -433559, -320122, -193684, -182102, -172669, -218844, -299650, -348798, -337661, -288813, -131963, 10146, -41591, -41435, -64035, -22273, -147095, -39623, 141237, 59896, -14933, -10384, -1385, 140308, 125648, 77237, 39781, 5377, -13452, -87454, -264159, -341022, -123242, -47048, -98417, -102207, 28423, 50625, 136575, 149306, 193746, -1962, -171195, -99483, -111117, -35170, -66798, -91058, -9915, -172206, -310496, -355927, -438206, -401577, -376735, -281094, -205501, -172505, -146181, -274204, -288447, -133712, 13235, 127281, 223008, 124542, 138797, 95485, 109252, 200932]
21221B00932o1466L4856q5944j63505K0294N4923j23708Q5105K4796n1587J7677
21210d7627j46301j97820j4847J24302k3455K15448n8010j2335K8560K1159R0739
21199b0187O7015l7903l6182p5124R8501K68243M815k36051K0161j4860p3402
21188c4974j25095k5844J74558J72802K5598m9792j07329j19824R7030J25701
21178A32831j66819J9766J93358m5760k7632J21960j21512j80680n2410j01565
21168b28463j63861J22675J42834J33664q4076q2986L6368P8954J05132N1322
21158A11563p3616K5453j92429j10175J60161Q3379m4625o4937l2846m419J1087
21147a31404l3799N0024K4175j98246j42205J10056J15265P5457O6904M7134K38509
$$ y = [200932, 139466, 174322, 88378, -75127, -54833, 90, -123618, -38513, -13717, -65304, -47627, -193928, -391748, -406595, -282293, -305748, -90300, -148310, -160645, -132085, -110926, -20187, 46828, 8925, -27257, -102381, -3880, 264363, 269178, 33127, 53288, 38428, -34974, -160069, -185913, -11355, 161447, 187045, 137253, 29924, -89900, 7130, 132831, -33988, -14222, 179136, 133376, 105744, 227704, 106192, -74488, -126898, -228463, -392324, -269649, -126815, 6849, -77227, -160213, -123845, -44891, 60241, 111563, 37947, 63400, -129029, -239204, -79043, 4336, -40289, -105226, -138072, -142491, -131404, -165203, -115179, -91004, -289250, -431455, -321399, -206134, -130677, -63773, -16639, 221870]
21136B21870K4764l6147P619K56721j95369q3856O0575K0504r2131o5927p1460
21125D7163J16082k1984J17098P508j05526j37159k080J02408L920q2780n2501
21114g851J52951L11436p4793q2291J46996j2131j08940l94273j79217J11430
21104a36683J8332p1730M7365J35734K7519k3552j03225k8412q1273j15731J18728
21093b12928J23561k7932n4158j68166J62631O8809J28818j1689j03689P4960
21083a9783L236r108n3807p0571J01969Q168O6557P7126j30125j04792J46583
21072A5453K06084J1690N0921q7759J0935j953k8531Q9420J5442j24146J32908
21061B90464K8911j93943n5726M9448r6722J16911J15123m0450P6788K4471p6881
$$ y = [221870, 246634, 210487, 218106, 474827, 279458, 195602, 256177, 276681, 184550, 118623, 47163, 163245, 141261, 258359, 265867, 160341, 23182, 21102, 123510, 127430, 44650, -7851, 145100, 456536, 381743, 299452, 446448, 434317, 325377, -68896, -248113, -136683, -118351, -190081, -142716, -6982, 20537, -3015, -106240, -134652, -215925, -331656, -212928, -89367, -117299, -171457, -339623, -176992, -108183, 20635, 8946, -94743, -19783, -16547, -25655, -79462, -150033, -48064, -39896, 26661, 103787, -26338, -131130, 15453, 221537, 233227, 284148, 196389, 207324, 205371, 176840, 266260, 281702, 157556, 290464, 319375, 125432, 69706, 119154, 22432, 139343, 254466, 214016, 290804, 315275, 238394]
21050B38394k8777k44311N6169J80573j9877L6345R2236j25458J6973k2510l4547
21039A45210j75423j32970J6583K2124J89340O5976l1294N7038j32487n0247p3705
21028i9855j09920J24636q511L7357p3670j17243M9934O4680K39569k3093j06023
21017b2139J17871J42791j1585j43407j00746k8234j7790N738q853j0152J74792
21006I8286J61021m1025j58548p7907p1091P0135J95730q690j66545N6737J03122
20995A61225m3744j20525k3707L0344M5287K4581o6433K3643J45941j17174N1369
20984A10807N2638J0431Q1504P1328L1086n1333j19933m9857j89049K3189J52987
20973A23798K3322R9325J20253q8573p8950j9620o7937k13659o0724K71682l246
$$ y = [238394, 209617, -34694, 21475, 202048, 182171, 218516, 310752, 185294, 202267, 179757, 145210, -30213, -163183, -146600, -124476, 64864, 130840, 99546, 156584, 24097, -26150, -99855, -209775, -85139, -93650, -56293, -129963, -247206, -197272, -132592, 106977, 83884, -22139, 95732, 238523, 226938, 83531, -17215, -45449, -63239, -57501, -66354, -76506, 98286, 259307, 218282, 59734, -18173, -89264, -19129, 176601, 167911, 1366, 58103, 161225, 117481, -3044, -26751, 3593, 48880, 73461, 7028, 30671, 176612, 59438, 110807, 163445, 173876, 255380, 326708, 357794, 306461, 186528, 136671, -52378, -29189, 123798, 147120, 246445, 366698, 278125, 199175, 179555, 111618, -102041, -162765, 108917, 105671]
20962A05671o128K1498j30008O3761J81034J74380l9230p79j11869j69279j7380
20951G1671L55j03001q8043J17667J00637M6169k5087q3856l6233P6464O2701
20940A39444o5538k939p7908n3187N4254J80525R5000j4037N1644j3062k3386
20929B70810q0417j29201m2547m2477J46048N1702r6083k6539P920l8122J11791
20918A32885P1360m1762Q3762l1568o1308n9237p2417L4801J00618J48011r262
20907B95883o0557k09064j4338K12179J44692K7829m1121N6425K62062j36701
20897E37289l85711j89896m9677j42228l929K3419J56754O5227J4764M5534J01501
20886A73047J34339j5861q6316p4980p1083p2976P4087R9892J64508J43145L6310
$$ y = [105671, 99543, 121041, -8967, 54794, 235828, 410208, 370978, 370199, 258330, 89051, 71671, 72026, -30975, -119018, -1351, 99286, 145455, 120368, 36512, 279, 76743, 139444, 73906, 70967, -6941, -60128, -5874, 174651, 269651, 255614, 307258, 294196, 270810, 190393, 61192, 18645, -23832, 122216, 173918, 77835, 51296, 59216, 21094, 132885, 204245, 162483, 246245, 214677, 153369, 94132, 21715, 56516, 157134, 305145, 295883, 235326, 26262, 11924, 224103, 368795, 396624, 355503, 411928, 673990, 537289, 151578, -38318, -87995, -230223, -234152, -210733, -53979, 11248, 26012, 71546, 173047, 307386, 291525, 205209, 130229, 59146, -13830, 60257, 160149, 324657, 467802, 504112]
20875E04112R61L6139k61266m4640m0042N593O3264M3188N1628r9344j91024K6593
20863I5162L6296Q5246O0714P1343K813j03471l3824j43131j08013K10888J00612
20852B74635J32017K4755q2448j32784n0267M3547q566P8348J61860j7999q4629
20841C38469p7385n0939p2648n041m7914J16369J23447J4238q1994j49886J08337
20830B15053K13590o6544k22026J73890R0022r9506l5473J5924R3688Q9972q5771
20819C82819j42716R1959k2774l460M3337o4925O481k2451k80087L2843J76489
20808A97515K32286L2996p1813k9341j14611j73641m7796J59537J86023P1614
20798D42769k39273o0149Q0746R9233L8419L0682j00258m9756o3174K21088M7762
$$ y = [504112, 505073, 541212, 279946, 235306, 195264, 200857, 264121, 307309, 358937, 259593, 68569, 95162, 131458, 216704, 277418, 348761, 351574, 248103, 214279, 71148, -36865, 174023, 274635, 406652, 431407, 348959, 216175, 165908, 209455, 200889, 279237, 441097, 423098, 338469, 261084, 210145, 137497, 132456, 84542, 200911, 324358, 338596, 256602, 106716, 215053, 428643, 362099, 140073, 313963, 403985, 304479, 269006, 284930, 378618, 468590, 382819, 240103, 332062, 309288, 305828, 349165, 284240, 290721, 268270, -11817, 21026, 197515, 429801, 462797, 390984, 361643, 247032, 73391, 25595, 185132, 371155, 442769, 203496, 143347, 224093, 323326, 361745, 392427, 292169, 242413, 179239, 400327, 448089]
20787D48089j23415j9059k9316O3765K3572P8991j70181q4692j60719O2140m0805
20776D8370J17692K01231J72859N2697n9292r9622j29324r2228j22104j52387
20766f2108o9124J7376K68388K60063q8611j55350n7131K02804J63073J34880
20756F14260r9607j47188l6045q7998j1424J27100N671k17901L674J1007J09475
20745B71024n7597J61719J08782j72619o5676J93738J35375k9363l0134j05468
20735D09781k02316J1785Q8297J13824J15763o2926O6193O6315j04259j91001
20725C11456o7305m6320M4127Q9418m1627K9609K0766r1875M1509Q7790J14921
20714D92469n6699l9567J43648K7739l430K9419m4795J70236P0967J23072k1889
$$ y = [448089, 324674, 305615, 276299, 340064, 363636, 442627, 272446, 187754, 27035, 89175, 48370, 166062, 367293, 540152, 592849, 533557, 433935, 304611, 212383, 90279, -62108, -131232, -113856, 154532, 414595, 325984, 170634, 113503, 316307, 479380, 614260, 514653, 367465, 331420, 243422, 231998, 359098, 364769, 146868, 150542, 161549, 271024, 213427, 375146, 483928, 311309, 245633, 439371, 574746, 545383, 515249, 409781, 207465, 219250, 307547, 421371, 537134, 474208, 540401, 606716, 502457, 311456, 244151, 197831, 241958, 331376, 289749, 319358, 340124, 248249, 289758, 377548, 492469, 435770, 396203, 539851, 567590, 564160, 593579, 548784, 719020, 789987, 913059, 891170]
20703H91170r3806j41188k79615q53R4060l2412O0764P8786J18229l9065j94946
20692D61124K0792L7249j54090K2078M9950J28919J09788p1786J09841J87144
20682I01009Q8220k7122j9983j70072k28235N9236l389p8695m4465M4399q425
20671E12478O1657J95002k9359Q021j28651p8230o4683K04048R1944o8378K929
20660G06778J56339n9127j18929j16094j26963m107O1530o3851K5011K6404l0878
20649D56113J02908J32901P2507j97286J15361j0979j02892k13565J10581J67968
20639F33617N9197P242j19886O306N8588m4400R7542Q6422p0767P1221K07647
20628I92729K54674m8096k71468j98953k6636P8296N2199j17330j17620l7186
$$ y = [891170, 797364, 656176, 376561, 375708, 469768, 437356, 498120, 576906, 695135, 656070, 461124, 481916, 519165, 365075, 387153, 437103, 566022, 675810, 604024, 713865, 901009, 989229, 962107, 942124, 772052, 543817, 603053, 599664, 520969, 476504, 520903, 512478, 574135, 769137, 739778, 747799, 619148, 540918, 476235, 680283, 772227, 703849, 706778, 863117, 803990, 685061, 568967, 442004, 437897, 499427, 435576, 460587, 486991, 456113, 559021, 691922, 764429, 567143, 682504, 671525, 568633, 355068, 465649, 633617, 692814, 700056, 580170, 586476, 645064, 600664, 698206, 784628, 713861, 785082, 992729, 1247403, 1199307, 927839, 728886, 702250, 780546, 832745, 715415, 597795, 560609]
20618E60609j05530l01032l3282Q3550K74875O0310m6637j99778L8565J33395
20608D65045N0975r7268J48907J34243q118l1095J96861q660q2263k05569N2110
20597F15168P3878l7570j32904J7900Q4682P8925j12105j43359k7727L4302J58884
20586F10074K26572J46620m1128r3864P595J67045m4512q0165j38708q4908P1608
20575G46229J2414Q3178N3704J09183j51484q7877R7052o013n9699P3196n465
20564H64418j69938l7023n5040O5836K04446J06633L6820j92331l0856k8430K58595
20553A023130R1064l5697Q5245n5331p9144K9209J24192M5456n3556j55439q7521
20542I31608j7007K07994R4245O5673k2612N4655n6519k19206j38345N6269K0018
$$ y = [560609, 455079, 154047, 120765, 204315, 479190, 539500, 492863, 293085, 331650, 465045, 516020, 418752, 567659, 701902, 693784, 662689, 859550, 850890, 768627, 563058, 615168, 689046, 651476, 518572, 536472, 621154, 700079, 587974, 444615, 416888, 451190, 610074, 836646, 983266, 942138, 848274, 855869, 1022914, 978402, 898237, 759529, 674621, 746229, 758643, 841821, 895525, 1004708, 853224, 765347, 862399, 856386, 796687, 869883, 864418, 694480, 657457, 602417, 668253, 872699, 979332, 1016152, 823821, 792965, 764535, 1023130, 1114194, 1078497, 1163742, 1108411, 1029267, 1058476, 1182668, 1228124, 1174568, 1019129, 931608, 914601, 1122595, 1216840, 1282513, 1259901, 1314556, 1258037, 1038831, 900486, 956755, 976773]
20531I76773Q128J59536J69196p6134r3794O3020J42175K56608J9366k36351j12311
20520A276212L1178r7656m3535K17242O8999j179J85279K3329p2778j30026j84676
20509A272389J4268J72701J43411Q0023L1607O9402q1820R0849N1603j4922k8443
20498A801068j08983j01209J01907J58343M0500M7745j44809j61770m4302M7583
20488A636073O8812J7157j33966M4556q4540K2923K04292R9338L9024o8873Q0419
20477A925215r888m1964o55j56320j41462j11603J96191J95193J34813J17207
20467B106727O0693j53548j23032k3163K5470l2296L538o2253J77774J30243r3380
20456B016773m8928p369N9439R5366j7704M4495N9505j20002J14469j6127k4530
$$ y = [976773, 984901, 1144437, 1313633, 1237499, 1143705, 1206725, 1348900, 1605508, 1624874, 1388523, 1276212, 1307390, 1209734, 1166199, 1383441, 1452440, 1451261, 1636540, 1659869, 1587091, 1457065, 1272389, 1286657, 1459358, 1602769, 1682792, 1714399, 1783801, 1701981, 1792830, 1844433, 1829511, 1801068, 1692085, 1590876, 1692783, 1851126, 1891626, 1939371, 1794562, 1632792, 1588490, 1636073, 1704885, 1722042, 1588076, 1632632, 1548092, 1571015, 1775307, 1874645, 1913669, 1844796, 1925215, 1915327, 1873363, 1872708, 1716388, 1574926, 1463323, 1659514, 1854707, 1989520, 2106727, 2167420, 2013872, 1890840, 1867677, 1893147, 1860851, 1864389, 1802136, 1979910, 2110153, 2016773, 1967845, 1960476, 2019915, 2115281, 2097577, 2142072, 2201577, 2081575, 2196044, 2179917, 2155387]
20445B155387P190j00064m831j6736J34542J24959Q2091o8882k17524O4177J15758
20434B276067J27364k3081J23199O9998k68485k2860K85902N4385r2634M3028
20424B572883P1432q8925m0801Q9279M2866R4102Q7127O3073j9607J10550K6303
20413C008282J21858R8443j15536j01736O9935m2978k7180J44252m680R1311n3895
20402C188076m8665L1713N8672j401Q3682K8958q7088P6180Q8500J56373J1462
20391C586462m9898m0851J12988J182P0804J16076Q1557J24214J02221j3617j9315
20380D071823Q4826j32373p5078Q7759O8598R465j4910J99058L2243j74124J49324
20369D306611J40484K7230J63050K5393k45062m2592n8692J17768J48182M5180
$$ y = [2155387, 2162577, 2062513, 2057682, 2040946, 2175488, 2300447, 2382538, 2313656, 2096132, 2160309, 2276067, 2403431, 2380350, 2503549, 2573547, 2305062, 2282202, 2568104, 2622489, 2529855, 2572883, 2644315, 2555390, 2514589, 2603868, 2646734, 2740836, 2827963, 2891036, 2871429, 2981979, 3008282, 3130140, 3228583, 3113047, 3011311, 3081246, 3038268, 3011088, 3155340, 3150660, 3241971, 3188076, 3139411, 3171124, 3229796, 3228395, 3312077, 3341035, 3253947, 3330127, 3418627, 3575000, 3586462, 3536564, 3495713, 3608701, 3609883, 3680687, 3796763, 3878320, 4002534, 4104755, 4091138, 4071823, 4156649, 4024276, 3949198, 4036957, 4105555, 4115020, 4100110, 4299168, 4331411, 4157287, 4306611, 4447095, 4474325, 4637375, 4662768, 4417706, 4375114, 4316422, 4434190, 4582372, 4627552]
20359D627552k506N6221o7268Q0123K49608K52504J71972J20307j4562J0198J74370
20348E658519N3165m9642j21170N4324p773o6050J58756L41150J03560Q7929n9041
20337F153727J39164N3135O7104R0085M8600r854K16401J72499N6426J0765R9396
20326G097448J32022N9894K49392o0074j08888J38346K73517K37447o2170K02784
20316H159718L03508j250J4641K5831J07474L7720o3705K129K45045K16317J86475
20305I233903L68959J31687J62775O2905M4254J88096J43586r3044N9843K80589
20295A0583553J98945K8807J68643J03641J78606L24996K70669J16520o3135M8947
20285A1960192J26041J29514J99496R4303N3195J28324K85322L39802K14939K40272
$$ y = [4627552, 4625046, 4681267, 4613999, 4694122, 4943730, 5196234, 5368206, 5488513, 5473951, 5484149, 5658519, 5711684, 5662042, 5540872, 5595196, 5587423, 5521373, 5680129, 6021279, 6124839, 6212768, 6153727, 6292891, 6346026, 6413130, 6503215, 6551815, 6541961, 6758362, 6930861, 6987287, 6998052, 7097448, 7229470, 7289364, 7538756, 7478682, 7369794, 7508140, 7781657, 8019104, 7956934, 8159718, 8463226, 8461976, 8476617, 8502448, 8609922, 8647642, 8583937, 8586066, 8831111, 9047428, 9233903, 9602862, 9734549, 9897324, 9960229, 10004483, 10192579, 10336165, 10243121, 10302964, 10583553, 10782498, 10811305, 10979948, 11083589, 11262195, 11587191, 11857860, 11974380, 11911245, 11960192, 12086233, 12215747, 12415243, 12509546, 12562741, 12691065, 12976387, 13316189, 13531128, 13771400]
20275A3771400J55469J71722K22399K47124J58543M03320J47443K28964M03571
20266A5909955K62411O8144K02395K32912J94321K16361J38403K96278K69032
20257A7790212K16410P5003K10797K25890K29106K45463L84532M29544K93953
20248B0100910J67240K77153K14226K60153L99355L92332J76370K29272M08401
20239B2625412K58704L34739K74297K80815M01349N17637L32853R2497J79902
20230B5298205J49344M32812L35331Q6868L62478K82116J13030N01413M55156
20221B8016753N2844L0647J12065K37693L09448L52697L83792J71971Q7203J59134
20211B9914247P9615J44041J67043K28541J62209J94644j6202J55688K11168J68259
$$ y = [13771400, 13926869, 14098591, 14320990, 14568114, 14726657, 15129977, 15277420, 15506384, 15909955, 16172366, 16240510, 16442905, 16675817, 16870138, 17086499, 17224902, 17521180, 17790212, 18006622, 18081625, 18292422, 18518312, 18747418, 18992881, 19377413, 19806957, 20100910, 20268150, 20545303, 20759529, 21019682, 21419037, 21811369, 21987739, 22217011, 22625412, 22884116, 23218855, 23493152, 23773967, 24175316, 24692953, 25025806, 25118303, 25298205, 25447549, 25880361, 26215692, 26302560, 26665038, 26947154, 27060184, 27561597, 28016753, 28069597, 28100244, 28212309, 28450002, 28759450, 29112147, 29495939, 29667910, 29755113, 29914247, 29993862, 30137903, 30304946, 30533487, 30695696, 30890340, 30874138, 31029826, 31240994, 31409253]
20201C1409253j20441K2560K22345K3868M236N5596Q7064R8975K3526j27371q3643
20190C1615968R4833J5970L839j60025k28820j68739j30782k01173o5228J1585
20180C0787428k12819m21958j30796Q6069j22044k05773j26855k32740k39955
20171B9180557k60955j72064j35463l16686l68412k41870j90737k19841q5046
20162B7189483j57217k71864k24134m593k49760m58828j95892j65103j73956k11829
20152B5076307l55744k76188k09176j18555j58664l95054l71674l54145k31234
20143B2605873j03263l21718k01924m13643k49555k07927k41947l31282l70929
20134B0163685k12179j98998j80228j76942j24663n2056l72631m49880k41274
$$ y = [31409253, 31288812, 31311372, 31533717, 31557585, 31561821, 31617417, 31704481, 31803456, 31826982, 31699611, 31615968, 31710801, 31726771, 31730610, 31570585, 31341765, 31173026, 31042244, 30841071, 30775843, 30787428, 30574609, 30152651, 30021855, 30107924, 29985880, 29780107, 29653252, 29420512, 29180557, 28919602, 28747538, 28612075, 28295389, 27926977, 27685107, 27494370, 27274529, 27189483, 27032266, 26760402, 26536268, 26531675, 26281915, 25823087, 25627195, 25462092, 25288136, 25076307, 24720563, 24444375, 24235199, 24116644, 23957980, 23562926, 23191252, 22837107, 22605873, 22502610, 22180892, 21978968, 21565325, 21315770, 21107843, 20865896, 20534614, 20163685, 19951506, 19752508, 19572280, 19395338, 19270675, 19218619, 18845988, 18396108, 18154834]
20125A8154834j53869l13792j96196j51364k06772n3005j34457k04215l14321
20116A6426843k23608k76311j08254j27132k30486k74448j33917k12257k05846
20107A4634584j55192k22573k96957K0786J9728k62222k03793l87845k17801r2525
20097A2836190k35684k55633O2932j76234k16841l01985p4210j75485j27727J47843
20087A1483166O9646j72038k59967r4825j58351j71927r7822r0290j72727n5118
20077A0279747j39346j74766k49815P0068k7821p4804j59191l28228j8714j41026
20067I036104j94614k69503j12380L6344J5827j22098l5459n7510r1379m2724
20057H162608p1331q8228j62981k59307r6110J3534j91026j2832j03253r9768
$$ y = [18154834, 18000965, 17687173, 17490977, 17339613, 17132841, 17079836, 16945379, 16741164, 16426843, 16203235, 15926924, 15818670, 15691538, 15461052, 15186604, 15052687, 14840430, 14634584, 14479392, 14256819, 13959862, 13980648, 14000376, 13738154, 13534361, 13146516, 12928715, 12836190, 12600506, 12344873, 12407805, 12231571, 12014730, 11712745, 11638535, 11463050, 11335323, 11483166, 11552812, 11380774, 11120807, 11025982, 10867631, 10695704, 10597882, 10507592, 10334865, 10279747, 10140401, 9965635, 9715820, 9785888, 9758067, 9683263, 9524072, 9195844, 9177130, 9036104, 8841490, 8571987, 8459607, 8495951, 8511778, 8389680, 8354221, 8296711, 8205332, 8162608, 8091277, 8003049, 7840068, 7580761, 7484651, 7498185, 7307159, 7294327, 7191074, 7091306]
20047G091306o2445n9114l6282r6692k40980q5138M8201j1955k58483j56142Q546
20036F140822M1991K13355o8499k21379k00811l1391l8503p3190o0046Q6009M8208
20025E836566n2699k71433j03971j84728O9467J14140N6470O1685m2667j47192
20015E335638j61918j93656j56923n8712l8287j12617k2548p4328M276J76030
20005D696955m2366n4824j208j66733j74191J00403j70830q3822n7328K052J57391
19994D205499j46728j61195K8541k5337J2535k1203L8877k5413j66984J09857
19984C848449K07498n5384j80341k8304k28751l7346L5841l9356o0578j08213
19974C353515J382j59970n0211R2865q1885J04861J97381j12792j01877R159P1902
$$ y = [7091306, 7028861, 6969747, 6933465, 6836773, 6595793, 6510655, 6558856, 6546901, 6288418, 6132276, 6140822, 6182813, 6396168, 6327669, 6106290, 5905479, 5874088, 5835585, 5762395, 5702349, 5788358, 5836566, 5783867, 5512434, 5408463, 5223735, 5293202, 5407342, 5463812, 5525497, 5482830, 5335638, 5173720, 4980064, 4823141, 4764429, 4726142, 4613525, 4590977, 4516649, 4520925, 4696955, 4654589, 4599765, 4598557, 4431824, 4257633, 4358036, 4187206, 4103384, 4046056, 4048108, 4205499, 4058771, 3897576, 3926117, 3900780, 3913315, 3892112, 3930989, 3905576, 3738592, 3848449, 4055947, 4000563, 3820222, 3791918, 3563167, 3525821, 3561662, 3522306, 3461728, 3353515, 3354897, 3194927, 3144716, 3237581, 3155696, 3260557, 3457938, 3345146, 3243269, 3252428, 3324330]
19963C324330l6607Q3244r7809j83024R741r0009j13288j07907R9638J01381n0849
19952B938841r6154k9887l4542L05357J85682J0918j33642k13700p3095j26561
19942B733217p7173j7800O7209j6346n0200l2724j9134o3368L0361p6433l8612
19931B438997J04491M7905j25282k0295J4957l7136L3107J8580r888j52678j83320
19920B129438j13208J75301L26420J16188l81341k47460j37055O2863K50932M1557
19910B223635l4713K1065q2859l1599K0150j37090K9457j01019M071L6615m6410
19899A901303J6387j7134j27503R4924J18811o0365N9615j30144j78496j0616
19889A666782J01815J8897Q7787J06646l4330j00244K1443j44307j74314J20622
$$ y = [3324330, 3287723, 3370967, 3273158, 3090134, 3099875, 3009866, 2896578, 2788671, 2888309, 2989690, 2938841, 2842687, 2812800, 2778258, 3083615, 3269297, 3280215, 3146573, 2932873, 2859778, 2733217, 2656044, 2638244, 2705453, 2689107, 2638907, 2606183, 2587049, 2523681, 2554042, 2477609, 2438997, 2543488, 2591393, 2466111, 2445816, 2460773, 2423637, 2456744, 2475324, 2465436, 2312758, 2129438, 2016230, 2191531, 2517951, 2634139, 2252798, 2005338, 1868283, 1931146, 2182078, 2223635, 2188922, 2209987, 2127128, 2095529, 2115679, 1978589, 2008046, 1907027, 1911098, 1947713, 1901303, 1917690, 1900556, 1773053, 1867977, 1986788, 1926423, 1986038, 1855894, 1677398, 1666782, 1768597, 1787494, 1875281, 1981927, 1947597, 1847353, 1868796, 1724489, 1550175, 1670797]
19879A670797K0182M0201K9014l3041j54539q1578Q2654J7744j37767O8402j50521
19868A371548L0913J80507l0362n2390p9508L4384K33732p357l6550k4259J3153
19857A633811J22712n0224o3069k08532j36207K41999Q7063n6682j53382M9036
19847A466525j19478J8311P9275k197L720R9215m9226r5789j7994L7727j57570
19836A262519K23716J027m7339r2164j21784j02503j3389j6469P433J02841l3637
19825A170251k06051O1737K23499O5235j15325q9229Q42J26042j35443m8845p474
19814A045239L5840l6643K1328l402l2346L2905n6140J9222O4329m397O7270P5371
19802A228576o3816o3011j3720M9194n8935l9738N1074Q3556j50375j33462J8912
$$ y = [1670797, 1690979, 1731180, 1760194, 1727153, 1572614, 1491036, 1573690, 1591434, 1453667, 1522069, 1371548, 1402461, 1582968, 1552606, 1500216, 1420708, 1455092, 1688824, 1681467, 1644917, 1620658, 1633811, 1756523, 1706299, 1643230, 1434698, 1298491, 1540490, 1627553, 1570871, 1417489, 1466525, 1347047, 1365358, 1444633, 1442436, 1446156, 1545371, 1496145, 1400356, 1382362, 1420089, 1262519, 1486235, 1487262, 1439923, 1347759, 1225975, 1123472, 1110083, 1093614, 1101047, 1203888, 1170251, 964200, 1025937, 1249436, 1314671, 1199346, 1110117, 1110959, 1237001, 1101558, 1052713, 1045239, 1081079, 1044436, 1065764, 1062362, 1030016, 1062921, 1006781, 1026003, 1090332, 1085935, 1153205, 1228576, 1164760, 1101749, 1088029, 1137223, 1078288, 1038550, 1089624, 1173180, 1022805, 889343, 908255]
19791I08255q9079n5065P5602K4180K9102o6334k4682R5296J36894R6300j2478
19780A117991j24427r9494J01039o1535k56780K2724O567J01623J82833L4952
19770A025493j49759J61338m377r384l1243q8326O3610R6982j49285M315J0750
19759I30114j38383N9117j5984K7870J0638Q8215j18726j48636k4424L0588p4765
19748F25624J79527J57009o8236j32761M1463q3493r7131o4810l545j43768J4914
19737D24793J66159J50719Q681J6488P188m6326k0793J03598n7730r0095r1116
19726E71566m5084K00518N7967k29969n9594O2395K89138K18167M1903N417j07468
19715A004956q0343r6868L3399P3126R2916j78869q6812k3963q600j46389q0105
$$ y = [908255, 819176, 764111, 839713, 863893, 892995, 826661, 801979, 897275, 1034169, 1130469, 1117991, 993564, 894070, 995109, 933574, 676794, 699518, 706085, 807708, 990541, 1025493, 875734, 1037072, 1032695, 1023311, 992068, 903742, 967352, 1064334, 915049, 919364, 930114, 791731, 850848, 834864, 862734, 873372, 961587, 842861, 694225, 669801, 700389, 625624, 805151, 962160, 893924, 761163, 802626, 719133, 622002, 557192, 553647, 409879, 424793, 590952, 741671, 750352, 766840, 774028, 727702, 706909, 810507, 752777, 662682, 571566, 526482, 727000, 784967, 554998, 495404, 557799, 846937, 1065104, 1107007, 1112424, 1004956, 924613, 827745, 861144, 934270, 1027186, 848317, 761505, 737542, 728942, 582553, 502448]
19704E02448j1667J80369Q2893q2434M346m647K3901J03857K596L271P7546j79466
19692G03013l04133K5165k1476M2869Q1759K49084J14543o7274k36307j49909
19682D37334J08331J97910p2041q8637J13368j11208j38629O7564J74502p2520
19672F15974k51238K55497J1386j50648K1880J82797n1936q6321k11502m9782
19662B86107J67556L9617R465J64907J10059N9072J17750r3754j55958m6167p9935
19651E78719P6361k2427J08988o6972J74421j08812J0907j42686n7705j58221
19641C92573n5158O9716j11530J1973O011m321L0969n2383j61020M3110J57025
19630C26965K03446R0825k2041j40970j89458j7650J32627J01450J38923K2711
$$ y = [502448, 490781, 671150, 754043, 671609, 675955, 671308, 695209, 799066, 801662, 804933, 882479, 703013, 398880, 424045, 402569, 445438, 527197, 776281, 890824, 823550, 587243, 437334, 545665, 743575, 671534, 582897, 696265, 585057, 446428, 513992, 688494, 615974, 364736, 620233, 631619, 480971, 502851, 685648, 633712, 547391, 335889, 286107, 453663, 493280, 502745, 667652, 777711, 836783, 954533, 860779, 704821, 658654, 578719, 655080, 632653, 741641, 674669, 849090, 740278, 751185, 608499, 550794, 392573, 337415, 407131, 295601, 307574, 313585, 309264, 340233, 287850, 126830, 169940, 326965, 530411, 621236, 599195, 458225, 268767, 251117, 383744, 485194, 624117, 646828]
19620F46828n2467j16177k45866p6072l9503J97338K01826P5325j14394j18118
19610C58720N3056P4453N0838M5194l1202n1207L1064q0163p8582n6506J6025
19599C31690n4984k0164N7903J6263O191L3386K01866J67599p0620n6786j63269
19588D49075p2308J99823J46173k53239o5230R4694J47746K50178K4668k84420
19578F37160k34472j23934n9679Q645l1109J3622J29642J28868m9202n3561j03619
19567B62361k53918J01981O8420l3512J1966J64770J11846O6901K1049M204K2162
19556E48230N2380m2291N0740M791j15718Q973L597p757j50680l1737K7532j67920
19544A80140J4722p215M5087k2735Q4862O3543l2005k5169r8114M036l7617o7087
$$ y = [646828, 594361, 478184, 232318, 156246, 116743, 314081, 515907, 591232, 476838, 358720, 411776, 486229, 537067, 582261, 551059, 499852, 530916, 450753, 372171, 315665, 331690, 276706, 256542, 314445, 330708, 336899, 370285, 572151, 739750, 669130, 612344, 449075, 376767, 576590, 722763, 469524, 404294, 498988, 646734, 896912, 921580, 637160, 402688, 278754, 219075, 227720, 196611, 210233, 339875, 468743, 419541, 365980, 262361, 8443, 110424, 178844, 145332, 157298, 322068, 433914, 500815, 521864, 526068, 548230, 600610, 558319, 609059, 613850, 498132, 507105, 510702, 502945, 352265, 320528, 348060, 180140, 194862, 187647, 232734, 209999, 294861, 358404, 326399, 301230, 203116, 207152, 169535, 102448]
19532A02448K3266M1684Q088m1446K6452J8272K387L420L1242j00047j66252K55884
19520B05398J59447r6807o4840O7136r0660Q152o2055K5700J15773R8631l3549
19509C32326p5083Q1394Q1974j18862k560J04021J19541J16626p6063O880M4835
19498F15029j63470k16102o9135R4507Q5754N5596J07151N5837j54964k22637
19488A87566R233Q7974j49363Q9479O8818j4191Q0479n9709L3869L2987j41142
19477B26000k0555P2587O9295j37432o1025q0757J26433j3982p646p0509j12290
19466i881r4748P668j19701R3184R5929Q9029J30599L4877P4278Q235J2832j68809
19454A53492j25908O7425r262j21387J0165N5089m4746J1611q1603o1868O9437
$$ y = [102448, 125714, 167398, 175486, 134040, 160492, 178764, 181151, 184571, 215813, 115766, -50486, 205398, 364845, 268038, 203198, 270334, 179674, 187826, 125771, 151471, 267244, 365875, 332326, 257243, 338637, 420611, 301749, 299189, 403210, 522751, 639377, 563314, 570194, 615029, 451559, 235457, 166322, 260829, 346583, 402179, 509330, 565167, 410203, 187566, 196799, 284773, 135410, 224889, 293707, 279516, 359995, 300286, 334155, 367142, 226000, 205445, 278032, 347327, 209895, 148870, 68113, 194546, 180564, 172918, 102409, -9881, -104629, -96961, -216662, -123478, -27549, 61480, 192079, 226956, 301234, 309469, 322301, 153492, 27584, 95009, 85747, -35640, -25475, 29614, -15132, -3521, -85124, -146992, -77555]
19443g7555l2605J06767M5566k1197M8340k10033k4318P9260J48438K35662M4869
19432C43194j31453Q7505J97106P5584j92841o9178j04657j00308m2258p091J60574
19421B16177P7415R8074o1727K5693n1909k70916j4299O2572N1812J9675n604
19410A46963J19196m3993j72845j02103k1950K34690N045j16159l639J5044j2738
19399D7511j35641L4043Q6520j92575j8024J11690P0100J05618O3271R3783k9363
19388B36933j31170k10176N6459o6167J11575J46932K8142j0654k0736P155n885
19377A42408Q430J3475K9131j08147J03180l9420j97635j02265j05099Q0639m589
19366a79892K3176j05550j20940K25474r6454n5530k5012P8931k494J63362K94844
$$ y = [-77555, -110160, -3393, 42173, 20976, 69316, -140717, -165035, -85775, 62663, 298325, 343194, 211741, 299246, 496352, 571936, 379095, 309917, 205260, 104952, 62694, 55603, 216177, 293592, 391666, 329939, 355632, 303723, 32807, 18508, 81080, 132892, 152567, 146963, 266159, 222166, 49321, -52782, -74732, 159958, 165003, 48844, 45205, 60249, 47511, -88130, -54087, 32433, -160142, -178166, -66476, 3624, 109242, 172513, 266296, 236933, 105763, -104413, -47954, -114121, -2546, 144386, 172528, 161874, 141138, 148293, 142408, 150838, 164313, 193444, 85297, 188477, 149057, -48578, -150843, -255942, -175303, -179892, -156716, -262266, -383206, -157732, -254186, -309716, -334728, -255797, -258291, -94929, 199915]
19355A99915Q7705j51663j72215n2197L2369j7910J05508Q8735j5622o8091m4481
19344g947m8377O0228N4055J44813L2452P2981N1815m5924k38919O5147Q8568
19333B28892O0326j34441m1130J1915J31497R5005j31074r5904L6788M8039j65203
19322D4710r5315n2703L6156L7069l412j67107m8590N3241K3914K43953J88589
19311B60505P393k02774j59489j26550R4513K12095j409N8306J37995M8844k54721
19300G4708p5333k3934J9138l6000N8598m3983O7118J85213J83504q244k6115
19289C74670k2682Q115n638k05152j06981l8777J3018o1324q9956k108J06539
19278c0276q8172q2018o0345O721n986l7692J93211J60742P1759q7415k0585q2513
$$ y = [199915, 287620, 135957, -36258, -88455, -56086, -73996, 31512, 120247, 104625, 36534, -7947, -56324, 3904, 57959, 202772, 235224, 308205, 360020, 314096, 75177, 140324, 228892, 289218, 154777, 113647, 125562, 257059, 352064, 220990, 125086, 161874, 209913, 44710, -50605, -103308, -67152, -30083, -33495, -200602, -249192, -195951, -172037, 71916, 260505, 267898, 65124, -94365, -220915, -126402, 85693, 84284, 142590, 280585, 329429, 74708, -625, -24559, -5421, -41421, 17177, -26806, 40312, 225525, 409029, 400785, 374670, 351988, 360103, 354465, 149313, 42332, 3555, 16573, -44751, -134707, -136815, -30276, -118448, -200466, -260811, -254090, -260076, -297768, -104557, 56185, 127944, 40529, 19944, -62569]
19266f2569p5226O9035J21607n0237j04031k0315k7939K20005J95373r0725k32595
19255e7617j06932m5480L8858R5099m7898J80605J97186J08192n8399O0422O805
19244C70841J3740K14884p7692q0333k673j773M685J61279O3952R1230J32662
19233H90802r0O5255R8047l92j25247r8422k52552j8512K96455J07286J80831
19222A143461K7804j30526q8482m3857j33169j4001n9314N835N2550P9921m8542
19211G91680M6060M3666q5698l9606J1712r1733l4072m6628n2641l9616P9530
19200E82654O8582K8623J19971q8144K4765J46700J30050j711j89489r7363J14518
19189H39156R2711r392K94124P5287L6458J34687j49339j69595m0066n5684Q7380
$$ y = [-62569, -137795, -68760, 52847, 2610, -101421, -121736, -149675, 70330, 265703, 174978, -57617, -164549, -210029, -171171, -76072, -123970, 56635, 253821, 362013, 303614, 364036, 370841, 384581, 599465, 521773, 441440, 438767, 436994, 441679, 602958, 666910, 758140, 890802, 890712, 955967, 1054014, 1053622, 928375, 829953, 577401, 558889, 855344, 962630, 1143461, 1171265, 1040739, 952257, 908400, 775231, 761230, 701916, 707751, 760301, 840222, 791680, 837740, 881406, 795708, 756102, 767814, 676081, 642009, 595381, 542740, 503124, 582654, 651236, 679859, 799830, 711686, 736451, 883151, 1013201, 1011490, 822001, 724638, 839156, 931867, 922475, 1216599, 1291886, 1328344, 1463031, 1313692, 1144097, 1104031, 1048347, 1135727]
19178A135727Q1798L8436n5064j89603J92049j4000j78704j58384O844M9852j63560
19167G45391J8743j40285j90944j20290J1364k2505j18919M7118J16642j01168
19157B45147j05092o0892j8517J16911J66046L8349j34829j73792k1745P1588
19147A23174L5452J45638K919j23653j28832l5352M4362N2362J7624K1422O3315
19136B18431p2083q5882j72279M8201j00737o9523J39202P2510J7395l7281J69729
19125A27683M2278j1210L5381j44205R7817J72357r1327j23852m3673K7028k1474
19114F6803L164l7619p7522m412r4682K3649J55008j1511K17830J4079j67602
19103H7185k09712R6656Q5154J36093j07319j5524k0460J18103k21255q7503M4635
$$ y = [1135727, 1217525, 1255961, 1200897, 1011294, 1203343, 1189343, 1010639, 852255, 859099, 908951, 745391, 764134, 623849, 432905, 312615, 323979, 301474, 182555, 229673, 346315, 245147, 140055, 79163, 60646, 177557, 343603, 381952, 247123, 73331, 51586, 123174, 158626, 304264, 307183, 183530, 54698, 19346, 63708, 116070, 133694, 155116, 218431, 146348, 60466, -111813, -63612, -164349, -233872, -94670, -22160, -4765, -42046, 127683, 169961, 158751, 194132, 49927, 147744, 320101, 228774, 104922, 61249, 88277, 66803, 69967, 32348, -45174, -49586, -144268, -120619, 34389, 22878, 240708, 254787, 87185, -122527, -25871, 59283, 195376, 88057, 72533, 52073, 170176, -51079, -138582, -93947]
19092i3947l6630P2933j70630l1251o1353l3495J99873K7612J75137J36101K9560
19081B13910n7660l593o4109q0330l1226J16911P0268J06377k6106O1342j2628
19070B93156k20314k15867j94468q990J49448P9577M8555J407J9112L930J583
19059d2871l2022Q4689L6562j8407p0093K3237M4618j8896Q6436N5218k13223
19048f4752j00754J2031j5878l6369J2462L5489M7321K09951J40707n702j6253
19037B18253j10350o7212m1J1995l8811J51595N3404k3193R6868L6183J36681
19026D65372n2197J0802N6417k5688L834L1857M8123P9758K75696J52472J23416
19015A169862M4780k9878M4581R3809q5362l2657j57944l41425k8904q2013o1202
$$ y = [-93947, -130577, -57644, -228274, -259525, -320878, -354373, -154500, -126888, 48249, 184350, 213910, 156250, 152657, 88548, 8218, -23008, 93903, 164171, 270548, 244442, 305784, 293156, 72842, -143025, -337493, -346483, -197035, -117458, -68903, -67496, -48384, -44454, -42871, -74893, 9796, 46358, 27951, -42142, -18905, 25713, 6817, 93253, 148471, -64752, -165506, -153475, -169353, -205722, -193260, -157771, -110450, 99501, 240208, 234506, 218253, 107903, 40691, 40650, 52645, 13834, 165429, 218833, 195640, 292508, 328691, 465372, 413175, 423977, 480394, 454706, 458540, 490397, 538520, 618278, 893974, 1046446, 1169862, 1214642, 1184764, 1229345, 1323154, 1237792, 1205135, 1047191, 705766, 676862, 594849, 533647]
19004E33647m0906n9207M8193J2133N367J76458J8371R445j15898j74010m2274
18993C71319P3276J63426O5982k8837o0375q6256j11300M5847L7049O2982j9948
18982E13165k860K1028K6753o5215L9680R5909M0927J47662L65829K29984N5340
18971A468202j388j75855l9498q8373L8445r1894r8105q4658J14593P065j0693
18960A037841Q3749l938q2459j24684O9557N7985j66208j93674j06409p6988p2720
18949D22052J01140J41057L2088j60324k06620n1977Q8096K4029n0984Q4112P9027
18938E01696k6043O9154r1980m0527J09937L4053O3452R7851j35568k31197J6395
18927C67223k5984J79570J88262n3831N4601L2061p4821j22606p6781j87860Q6734
$$ y = [533647, 492741, 433534, 481727, 493860, 499227, 675685, 694056, 703501, 587603, 413593, 371319, 444595, 608021, 674003, 645166, 584791, 498535, 387235, 433082, 470131, 533113, 513165, 510305, 531333, 558086, 492871, 532551, 628460, 669387, 817049, 1182878, 1412862, 1468202, 1466814, 1290959, 1251461, 1163088, 1201533, 1109639, 1011534, 926876, 1041469, 1048534, 1037841, 1121590, 1117652, 1035193, 910509, 980066, 1038051, 871843, 678169, 571760, 494772, 422052, 523192, 664249, 696337, 536013, 329393, 277416, 365512, 389541, 338557, 422669, 501696, 475653, 544807, 452827, 412300, 522237, 556290, 619742, 717593, 582025, 350828, 367223, 341239, 520809, 709071, 655240, 709841, 741902, 667081, 544475, 467694, 279834, 366568]
18916C66568O3429j71893O0173j2675k3588j7450j43115J41956K79751j24030
18906D19126k01277J2403K40378R9026j17914l4844J22886l4418j56422Q3497
18896D32441l62l6534O2408n0945j30728m4588J03279J59562J19325p4282P4990
18885F14566k4529P0323J19127j3992J1153k7983P9865K82230J64551j50373j0164
18874A114774J7945O3132R8918O3035j35868k07123m8023o9012j63302j50359
18864E84117j21320J24613Q3172k0662J10747J16523q1030k7073J44120J35358
18854A048565J9562k3523q6671p4891J50568K87843L84956J39784j71907j60953
18844A513333k53423J2260J22110o446o2194l2595p0804J78734K02070K9691j700
$$ y = [366568, 429997, 258104, 318277, 305602, 282014, 264564, 121449, 263405, 543156, 419126, 217849, 230252, 470630, 569656, 451742, 416898, 539784, 505366, 348944, 432441, 432079, 395545, 457953, 407008, 276280, 231692, 334971, 494533, 613858, 539576, 614566, 590037, 660360, 779487, 765495, 776648, 748665, 828530, 1110760, 1275311, 1124938, 1114774, 1132719, 1195851, 1294769, 1357804, 1221936, 1014813, 966790, 897778, 734476, 584117, 462797, 587410, 670582, 649920, 760667, 877190, 796160, 769087, 913207, 1048565, 1068127, 1044604, 957933, 883042, 1033610, 1321453, 1706409, 1846193, 1674286, 1513333, 1259910, 1272170, 1394280, 1387834, 1325640, 1293045, 1222241, 1400975, 1603045, 1632736, 1631036]
18833A631036J34601J96186m1834J20911j56033j27207R2416n3515j63245P2253
18823A705569j60455j53759r5681K5198K06887L4333K5921k6003j88190k1023
18813A352797R0348J82678P2025m0820l8725J13388J24781J22057q6013p5960
18803A816556J55895O9627r5749j06152J09095o0489M7008J05792J39824K27317
18793B408724K50363P3594R6129K06238m9713M603j62970j03820R591Q5970J2551
18782B831260N2516J45655J50987J92152M78666L73411M21377N68324N20917L80739
18772F116004Q8643Q1383K76839K16299N5657O7901N1466J33108M60962M42368
18762G990630O18392Q81701J393689J592843J371928J104161Q13924N79984N07351
$$ y = [1631036, 1765637, 1961823, 1919989, 2040900, 1884867, 1757660, 1850076, 1796561, 1633316, 1705569, 1545114, 1391355, 1295674, 1320872, 1527759, 1562092, 1588013, 1562010, 1373820, 1352797, 1443145, 1625823, 1697848, 1657028, 1618303, 1731691, 1856472, 1978529, 1892516, 1816556, 1972451, 2042078, 1946329, 1840177, 1949272, 1888783, 1935791, 2041583, 2181407, 2408724, 2659087, 2732681, 2828810, 3035048, 2985335, 2989938, 2826968, 2723148, 2732739, 2818709, 2831260, 2883776, 3029431, 3180418, 3372570, 3851236, 4224647, 4646024, 5214348, 5735265, 6116004, 6204647, 6286030, 6562869, 6779168, 6834825, 6902726, 6954192, 7087300, 7548262, 7990630, 8609022, 9490723, 10884412, 12477255, 13849183, 14953344, 15767268, 16347252, 16854603]
18753A6854603j77080n71913m74816O6048P23508J128758J740854K389183L104306
18744B4783451L937914N242961P080390R089335J2927996J8488806K3308688J9864638
18736A24724179J1550040N976833K911844J203768p474397j7501172j3343863
18729A08047232k391119Q691022J5861397J9713329K1097505J6978395J1335961
18722A99333722K753650p197919j2977778j9347562k3005573k0002142j3317210
18715A06239188o974873l485259j434442J050917L934026O273900N150049M376242
18707A15129748P861769J2535933J2689483O589282J661832J447887L897842K817140
18699A64630916m047168n553442R1673O948341J1258158Q253002J713940O41509
$$ y = [16854603, 16677523, 16105610, 15630794, 15696842, 16420350, 17549108, 19289962, 21679145, 24783451, 28721365, 33964326, 41044716, 50134051, 63062047, 81550853, 104859541, 124724179, 136274219, 142251052, 145162896, 146366664, 138892267, 121391095, 108047232, 105656113, 114347135, 130208532, 149921861, 171019366, 187997761, 199333722, 202087372, 194889453, 181911675, 162564113, 139558540, 119556398, 106239188, 99264315, 95779056, 94344614, 95395531, 99329557, 105603457, 110753506, 115129748, 122991517, 135527450, 148216933, 154806215, 156468047, 157915934, 161813776, 164630916, 160583748, 155030306, 155121979, 162070320, 173328478, 181581480, 183295420, 183936929]
18691A83936929L281328L597722l434925j0884416j2023884q977717n283993m342951
18683A45868093m456555j711848L720608P805666J0984204J6402729K2150193
18676B00763090K5749357J8145128M465676k923927m729258p441370k1694219
18669B12334477l5661122l2283047k2561034j4842658j0203751p353457n394034
18662H4035374m267252k926961j845236j574544k580200m489766n135846m302472
18654E6913097l872321m033133m115563l226351k403074j826531j660770j375718
18646C4399636j236635r58432q06749o92983o5628L11143K02766m10457p10077
18637C0032584p67023o57693j253676j779394j680307j271482q37100p87441n98447
$$ y = [183936929, 187218257, 190815979, 187381054, 176496638, 164472754, 155495037, 150211044, 145868093, 141411538, 139699690, 143420298, 151225964, 162210168, 178612897, 200763090, 226512447, 244657575, 249123251, 246199324, 241470066, 234028696, 212334477, 176673355, 144390308, 121829274, 106986616, 96782865, 89429408, 84035374, 79768122, 76841161, 74995925, 73421381, 70841181, 66351415, 61215569, 56913097, 53040776, 49007643, 44892080, 41665729, 39262655, 37436124, 35775354, 34399636, 33163001, 32204569, 31397820, 30704837, 30639209, 30950352, 31153118, 30742661, 30032584, 29265561, 28607868, 27354192, 25574798, 23894491, 22623009, 21785909, 20998468, 20400021]
18628B0400021m24278k55005j42012p6675l75070n99142m53927l26055k70824
18619A7477033o08279q08888n87192n65112o33289p03728o59724m59878m45006
18610A2005937l36485k63691k69788k45682j91119l46203m70333m64363k77329
18601I140944j30078r8654k17591m02872m00535j98633j40344k31931j46851k39465
18591F933990o437o9761k49197l42193j56295j29848k82715k93508j12374n0114
18581E241548P9198j803j16195j30951n1682j05212k57517k28575k11795k6149
18571D190867k11510r9981p2569q058J05596j16842q1551j57978l6102L4795q4055
18560C462612j15661j8388p5710j64975L4337P9788p2866m6202P0387L8570q4172
$$ y = [20400021, 19975743, 19720738, 19578726, 19502051, 19126981, 18527839, 18073912, 17747857, 17477033, 16868754, 16059866, 15472674, 14907562, 14274273, 13570545, 12910821, 12450943, 12005937, 11669452, 11405761, 11135973, 10890291, 10699172, 10352969, 9882636, 9418273, 9140944, 9010866, 8912212, 8694621, 8291749, 7891214, 7692581, 7552237, 7320306, 7173455, 6933990, 6927553, 6857792, 6608595, 6266402, 6110107, 5980259, 5697544, 5404036, 5291662, 5241548, 5320746, 5318943, 5202748, 5071797, 5020115, 4914903, 4657386, 4428811, 4217016, 4190867, 3979357, 3879376, 3806807, 3798749, 3904345, 3787503, 3705952, 3547974, 3511872, 3546667, 3462612, 3346951, 3328563, 3252853, 3087878, 3122215, 3202003, 3129137, 3082935, 3153322, 3191892, 3107720]
18549C107720o5780k73870j31608j1299M0512j19258k88239J08038J93638j6297
18539B543557k51138j61186j72894n2695j1187J12816j8815j20446q5791j4623
18529A767598j52760j67082m5240O776j00911K85553K61542k2613J03252R2116
18519B028231k24604j31680J39636N6787J11226p3368j38794n5836o4449J16465
18509A763614J48168k9252R5046J56337k8182P4149K3357j43850o1037Q8816n2626
18498B034540j19505N8661K05808J32991R421k52866q2839J44910k30421j88283
18488A712417P2062J0512j2970M9298J66208J51515J39806l9385j55387j04129
18478A989947K11314l3973k27423n0506P6236K3988J65315L8452j09846K7722
$$ y = [3107720, 3041940, 2768070, 2636462, 2625163, 2665675, 2546417, 2258178, 2366216, 2559854, 2543557, 2292419, 2131233, 1958339, 1905644, 1894457, 2007273, 1988458, 1868012, 1782221, 1767598, 1614838, 1447756, 1402516, 1409292, 1308381, 1593934, 1855476, 1832863, 1936115, 2028231, 1803627, 1671947, 1811583, 1868370, 1979596, 1906228, 1767434, 1711598, 1647149, 1763614, 1911782, 1882530, 1977576, 2133913, 2105731, 2179880, 2203237, 2059387, 1998350, 2087166, 2034540, 1915035, 1973696, 2179504, 2312495, 2321916, 2069050, 1986211, 2131121, 1900700, 1712417, 1784479, 1794991, 1782021, 1831319, 1997527, 2149042, 2288848, 2249463, 2094076, 1989947, 2201261, 2167288, 1939865, 1889359, 1965595, 1989583, 2154898, 2193350, 2083504, 2111226]
18468B111226n7604j3528J37497L17373L13702J93975K04780R7371j2281O4110
18458C356621O627j58201J8781J84509J52874q8631j4667R2645P3439J84172J54653
18447C962822K38046K88173q8210l2888p6466j613L82502O86534R21826R84594
18437G265320O92106M96848L28819o2866k45907p27180p13848l69079J32508P42959
18427G539680J152914J288807P93401O67151M24624K07225M1191q18677j156743
18418A0139573q73000p49732k58257O699r4473k8679J24343L03985L24266M59973
18408I354698M11431N16896N68588N88118R05037J762685K367225L434129N016530
18399B4925337N937942M839423L560655K531662K117825J688382k12498n45499
$$ y = [2111226, 2053622, 2040094, 2177591, 2494964, 2808666, 3002641, 3207421, 3304792, 3292511, 3356621, 3363248, 3205047, 3223828, 3408337, 3561211, 3472580, 3457913, 3550558, 3623997, 3808169, 3962822, 4200868, 4489041, 4400831, 4367943, 4291477, 4289864, 4672366, 5358900, 6280726, 7265320, 7957426, 8454274, 8783093, 8720227, 8474320, 7747140, 7033292, 6664213, 6796721, 7539680, 8692594, 9981401, 10774802, 11441953, 11866577, 12073802, 12114993, 11296316, 10139573, 9266573, 8516841, 8258584, 8265283, 8170810, 8142131, 8266474, 8570459, 8894725, 9354698, 9766129, 10283025, 10851613, 11439731, 12344768, 14107453, 16474678, 19908807, 24925337, 30863279, 35702702, 39263357, 41795019, 43912844, 45601226, 45388728, 44843229]
18391D4843229K808268P201382R618139P878360N878681N070446N635058N692271
18383I4625834J107176l472160l169217j230103P39614J955910J789599L734255
18375I6080908J0483861K0811725L4000039M5872681N1235926N3127042M9013779
18368C60625961L7492360K2465586J197101j6085947k4935812l1845895k7812912
18361C21100442r827030R944991K3230723K9320359K7387150K1996398J5585450
18354D38738483p27999k0645337l4611129m3717017m2263945l6936476l5352362
18347B24484218l1643847k3639492j5828993r250840l627230K203047Q639646
18340A51336509J3453578J3017030J1475551J2031934J2037122R583075K296365
$$ y = [44843229, 47651497, 54852879, 64471018, 72349378, 78228059, 83298505, 88933563, 94625834, 95733010, 92260850, 89091633, 87861530, 88601144, 90557054, 92346653, 96080908, 106564769, 127376494, 161376533, 207249214, 258485140, 311612182, 360625961, 398118321, 420583907, 421781008, 405695061, 380759249, 348913354, 321100442, 311273412, 321218403, 344449126, 373769485, 401156635, 423153033, 438738483, 438010484, 417365147, 382754018, 339037001, 296773056, 259836580, 224484218, 192840371, 169200879, 153371886, 144121046, 140493816, 142696863, 151336509, 164790087, 177807117, 189282668, 201314602, 213351724, 222934799, 225231164]
18333B25231164m978594n289555j861364j977919m281886l063426k11857N342612
18325B08909175J1695230J0512628O585008N369797J721475k513648j1232980
18318B31046685j8251208j8659846k1719490k3157930j8296368j3732462j0411505
18311A06817876q776927q455758p176794m771260k535566o26932J014852J103561
18303G6593052P38090O70865Q41208j2797j643293k400175r08408J436671K329567
18294G7644780N61287o33973q11809n06600j424331n213511p417602o128469m368844
18285E1700928l962678l686514k976952k030146j220841r12499m40305K16988
18277C6687981J37577l42541m13017m14442l96248o07549r07016k84200K56268
$$ y = [225231164, 220252570, 214963015, 213101651, 211123732, 206841846, 203778420, 203566563, 208909175, 220604405, 231117033, 237702041, 243071838, 244793313, 242279665, 231046685, 212795477, 194135631, 172416141, 149258211, 130961843, 117229381, 106817876, 98040949, 89585191, 82408397, 77637137, 75101571, 74474639, 75489491, 76593052, 77331142, 78002007, 78843215, 78830418, 77187125, 74786950, 73878542, 75315213, 77644780, 78206067, 77572094, 76760285, 76253685, 74829354, 69615843, 62198241, 56069772, 51700928, 47738250, 44051736, 41074784, 39044638, 37823797, 36911298, 36470993, 36687981, 36825558, 36483017, 36070000, 35655558, 35259310, 34651761, 33744745, 33460545, 33716813]
18268C3716813L13213J051779J315683O90617m66817j400507j489470j425555
18260C2305756k096429l083342k822024j962085j356723j066597p81549o55785
18252A8481222n04396m98922m47063n58418m21595m48681m60653m11506o82509
18243A4047479o74826m09429m33855m59301l47733l75477l98905k43713k5764
18234A0678476k46889m37055m94085k05517n0290j37918j37197j76973k09284
18225H583268j73277k11785j93153J5006j34407k06340j77959j05506j02422r0065
18215G203360o9077k17249k78121l0125K0265r7229l20441k26608j61947j34925
18205E687903k01486o0436n572M319m8191J25229q122j93557j40675o1507k0384
$$ y = [33716813, 34030026, 35081805, 36397488, 37088105, 36621288, 35220781, 33731311, 32305756, 30209327, 27125985, 24303961, 22341876, 20985153, 19918556, 19137007, 18481222, 17976826, 17477904, 17030841, 16472423, 16050828, 15602147, 15141494, 14729988, 14047479, 13372653, 12963224, 12529369, 12070068, 11722335, 11346858, 10947953, 10704240, 10678476, 10431587, 9994532, 9500447, 9294930, 9244640, 9106722, 8969525, 8792552, 8583268, 8409991, 8198206, 8005053, 8020059, 7885652, 7679312, 7501353, 7395847, 7293425, 7203360, 7134283, 6917034, 6638913, 6608788, 6629053, 6531824, 6211383, 5984775, 5822828, 5687903, 5486417, 5425981, 5420409, 5424728, 5376537, 5501766, 5493644, 5300087, 5159412, 5097905, 5077521]
18194E077521j18343p7699j35991j29443n7367j46283N87n5608p3332j22556j21172
18183D040314p2946j98361R261M005J08712J55029j0474j54788J33070j11330
18173C902492j80965p4269j54827j28559k10975Q2368P555J0042l0364m9804r4578
18162C078116J20770J21055j05500j5379O2255J14932m493Q1521M1063P038N5996
18151C557374m5242n5921l85693j99301M7187J13307Q2509k9487m847N1528j05994
18140C025420l8912J42526J16103N7677j68006k59485N3243J78126J16095K2152
18130C244939J89937R6889J45049K31507J8843J09199J52935K93341K77265K77638
18120E037542L15976M35154O76773J108422J244066J474304K065175K780315M055385
$$ y = [5077521, 4959178, 4881479, 4745488, 4616045, 4558678, 4412395, 4412982, 4357374, 4284042, 4161486, 4040314, 3967368, 3769007, 3778268, 3782273, 3890985, 4046014, 4035540, 3880752, 4013822, 3902492, 3721527, 3647258, 3492431, 3363872, 3152897, 3235265, 3242820, 3252862, 3222498, 3172694, 3078116, 3198886, 3319941, 3214441, 3199062, 3261317, 3376249, 3371756, 3453277, 3494340, 3501378, 3557374, 3512132, 3456211, 3070518, 2871217, 2918404, 3031711, 3114220, 3084733, 3079886, 3131414, 3025420, 2986508, 3129034, 3245137, 3302814, 3134808, 2875323, 2928566, 3106692, 3222787, 3244939, 3434876, 3531765, 3676814, 3908321, 3927164, 4036363, 4189298, 4482639, 4759904, 5037542, 5353518, 5788672, 6465445, 7573867, 8817933, 10292237, 12357412, 15137727, 19193112]
18111A9193112O194650J0199005J7701383K8004898K9457725J6187641Q951389
18104A35889803L089104K231241k918259k6252447l1801705k1343146j3458401
18097D5436190q676867n886758m356166l162076k208031j863821j635541j413632
18089A6233298j307278j129067q52414p33542l74641l92137n18902n65383l37207
18080A0022727l70424l72622l29103l08884k62036k34741l87986l78168j28335
18071G250428j24332j78057l0453n0341j25579k0810J35031N2748j1749l5354
18061F861532N6989j43337k81532j80038j87683l47092k39117k69320l77843m51523
18051D441036l36189j26463R293j80225k47919l7038l6721k19105l958p6839j60114
$$ y = [19193112, 25387762, 35586767, 53288150, 81293048, 110750773, 126938414, 135889803, 138978907, 141210148, 138291889, 112039442, 80237737, 58894591, 45436190, 36759323, 30872565, 26516399, 23354323, 21146292, 19282471, 17646930, 16233298, 14926020, 13796953, 12944539, 12210997, 11836356, 11444219, 10925317, 10359934, 10022727, 9652303, 9279681, 8950578, 8641694, 8379658, 8144917, 7756931, 7378763, 7250428, 7126096, 6948039, 6917586, 6867245, 6741666, 6720856, 6855887, 6908635, 6896886, 6861532, 6918521, 6775184, 6493652, 6313614, 6125931, 5778839, 5539722, 5270402, 4892559, 4441036, 4104847, 3978384, 3987677, 3807452, 3559533, 3522495, 3485774, 3266669, 3262711, 3185872, 3025758]
18040C025758l4573j17064j2768p035J7813O0476J4280J1561j66328k08046j06465
18029B477609K6788O1389j61074q9644p2761j26645k87407q1602l2476J32771
18019A846948R182L4120l7325M0925k4531j53197k582K00735J20922J07632R4811
18008B237640J56796p5058j45608P0601Q0383L26932L90541J52236J83855K13172
17998C591490J50989R233J4180J49543K07858L13765O1724J31527j37931k57252
17988D235126j30667j87794k72573k68235p1494j23545m15419l15808p7462k22807
17978B149322p7668O4134j03220l02920p4267j7317K4101O1068j34009m3931N5736
17967A601029N7411K0313n8889j73912J1499K07145j0328j8290o863K8955Q7549
$$ y = [3025758, 2991185, 2874121, 2861353, 2854318, 2872131, 2932607, 2946887, 2958448, 2792120, 2584074, 2477609, 2504397, 2565786, 2404712, 2315068, 2242307, 2115662, 1828255, 1746653, 1714177, 1846948, 1856130, 1890250, 1852925, 1893850, 1869319, 1716122, 1713540, 1914275, 2035197, 2142829, 2237640, 2394436, 2319378, 2173770, 2244371, 2324754, 2651686, 3042227, 3194463, 3378318, 3591490, 3742479, 3751712, 3765892, 3915435, 4123293, 4437058, 4498782, 4630309, 4492378, 4235126, 4104459, 3916665, 3644092, 3375857, 3304363, 3180818, 2765399, 2449591, 2372129, 2149322, 2071654, 2135788, 2032568, 1729648, 1655381, 1638064, 1662165, 1723233, 1589224, 1545293, 1601029, 1658440, 1678753, 1619864, 1445952, 1457451, 1664596, 1654268, 1635978, 1629115, 1658070, 1745619]
17956A745619J08175J53225J44253J04186j29658O1088p3012K17285k5821L5477
17946B340817o0341m1184R6166N4272J1718n7061j2108Q011q5392j33081j4413
17935B107404k43277k05388j71747j04328j14779Q157J43317l30074j53361L3734
17925I69658Q8416P1383j64996j76274o3537J48131J60220J13293l2651o7752
17915A045891P9979J24941M7681j35705M0452J4206J74662O3694q9696L0775J80599
17904A577479j4544p5767r8429l9973K508r8057J26302J89680Q2145n2335k29802
17893A369207j87629j4980J14685k8763j37887k06163j45699M7029j16769j7265
17883F75766P3649K25156K08287P6537L9186j12677J22J57054J09144m1794J16674
$$ y = [1745619, 1853794, 2007019, 2151272, 2255458, 2125800, 2186888, 2113876, 2331161, 2305340, 2340817, 2280476, 2239292, 2335458, 2389730, 2401448, 2344387, 2332279, 2340290, 2254898, 2121817, 2107404, 1864127, 1658739, 1486992, 1382664, 1267885, 1276042, 1419359, 1089285, 935924, 969658, 1058074, 1129457, 964461, 788187, 724650, 872781, 1033001, 1146294, 1113643, 1045891, 1125870, 1250811, 1298492, 1162787, 1203239, 1217445, 1392107, 1455801, 1366105, 1396880, 1577479, 1562935, 1487168, 1388739, 1348766, 1351274, 1253217, 1379519, 1569199, 1651344, 1599009, 1369207, 1181578, 1166598, 1281283, 1252520, 1114633, 908470, 762771, 809800, 693031, 675766, 749415, 974571, 1182858, 1259395, 1298581, 1185904, 1186026, 1343080, 1452224, 1410430, 1527104]
17872A527104p9905q2655J6449J19241J30271N3171j10536J43477J32048K05395
17862B054060L1512j46788k3587P1277j51562k52478k31501j15795j46077k31222
17852H57839Q1581J29282J2465j08352R3633O197R3848R3801n4022j12564r5032
17841I98676N5815j50173j06935l8600j20364m8052J53395J31735J98237N6364
17831A130098l7984J01786P1348P0889K6562J30890R1575P4251R8385J11883l10828
17820A558855j76666r8563r802j5739R5971R6055j56119n7757k9170j63689R5535
17809A138911L84538j42305k45370k86796j67083N0669K20033N8435m8465j35434
17799H27133J55776N4315k37312l12378q0147N0079J50760Q9672J14588K8561
$$ y = [1527104, 1447199, 1364544, 1380993, 1500234, 1630505, 1683676, 1573140, 1716617, 1848665, 2054060, 2085572, 1938784, 1915197, 1986474, 1834912, 1582434, 1350933, 1235138, 1089061, 857839, 939420, 1068702, 1081167, 972815, 1066448, 1072645, 1166493, 1260294, 1206272, 1093708, 998676, 1054491, 904318, 797383, 758783, 638419, 590367, 743762, 875497, 1073734, 1130098, 1092114, 1193900, 1265248, 1336137, 1362699, 1493589, 1585164, 1659415, 1757800, 1869683, 1558855, 1382189, 1283626, 1273824, 1258085, 1354056, 1450111, 1293992, 1236235, 1207065, 1043376, 1138911, 1523449, 1381144, 1135774, 848978, 681895, 732564, 952597, 1011032, 962567, 827133, 982909, 1037224, 799912, 487534, 407387, 457466, 608226, 697898, 812486, 841047]
17789H41047j06694j07313N1268L7563r275q106J53601P7236J12332P0948l6920
17778A075687j86875j34050j39676o735L5513n6106J3569J62670J9129n0517r1996
17767F40613o3565K2887K2402p2625k32561j46747Q5993O4165J05556K0725n6234
17756C90609q6241j02949M8157j00790L772J17124Q8134m3270J05110j56979j11476
17745A51201Q2430J22579p8652l0385j612m5419P1569J17148Q3041K3862j5462
17734D80300r1579j09596K1642L0101m6051j23735m6782l1606m4963Q7321m3012
17723H2040j34457k4144N8169J84552J55853L5549j77452k0093J1797K21557Q793
17712D02164r4173p9660o1454O684P4688J2437n0358q624K6732J36493O6044J14595
$$ y = [841047, 734353, 627040, 678308, 715871, 706596, 698490, 852091, 929327, 1041659, 1112607, 1075687, 888812, 754762, 615086, 608351, 643864, 587758, 601327, 763997, 783126, 732609, 640613, 577048, 599935, 622337, 549712, 317151, 170404, 256397, 320562, 426118, 446843, 390609, 304368, 201419, 249576, 148786, 152558, 269682, 357816, 314546, 419656, 262677, 151201, 233631, 356210, 277558, 247173, 245561, 200142, 271711, 388859, 471900, 495762, 480300, 388721, 279125, 300767, 330868, 284817, 161082, 114300, 82694, 37731, 125052, 82040, -52417, -76561, -18392, 166160, 322013, 357562, 180110, 160017, 171814, 393371, 402164, 307991, 228331, 166877, 173561, 248249, 260686, 210328, 201704, 228436, 364929, 430973, 545568]
17700E45568l7446k83695o883k4431l4214r8159M0569r0455M7618J11261j14516
17689E5217N1596P3193N3187r205o6875L908r3223k60K9105J84851P6537o3763
17677B94268P9712Q7666m1704k28901k17617l0912J34737P7341J31372j81160
17667A04802r7173R6112K54888o9361j44787l834L4266K97322j53722o0185o5602
17656A92726l1827j81806o3948K17720P3655j34880o4988P1888K43760K08608
17646E30908j65966j02475j6696p8770j37315M234K7115o1632P4122J94266j02771
17635A65020P576J737j14279j53667j20890o0639K4934Q4961k9934Q5897J45948
17624C6664O8664p3485N780J72579J25961k92135k36380J02962J21998P5337j5046
$$ y = [545568, 508122, 224427, 217544, 193113, 158899, 60740, 101309, 10854, 58472, 169733, 55217, 106813, 180006, 233193, 223988, 157113, 161021, 67798, 67538, 96643, 281494, 358031, 294268, 373980, 461646, 419942, 191041, -26576, -57488, 77249, 154590, 285962, 104802, 7629, 103741, 358629, 289268, 144481, 140647, 174913, 472235, 318513, 258328, 192726, 160899, -20907, -84855, 132865, 206520, 71640, 6652, 78540, 322300, 530908, 364942, 262467, 245771, 167001, 29686, 33920, 61035, -597, 73525, 267791, 165020, 172596, 174333, 60054, -93613, -214503, -275142, -250208, -165247, -195181, -109284, 36664, 105328, 31843, 37623, 210202, 336163, 44028, -192352, -89390, 32608, 107945, 92899]
17613I2899j62229k6024L4856m1795J72409M662J34961J43495K5118l6503J8789
17602C60638o7344k4685m4782j08735O9943O4113O2479j05531l4719P3223q4403
17591A60197J03429J70641J56328k47381j21765k7017j47347K9100Q5864J59734
17581C21783l314q1181j21604Q3140N0648j41495l7046L5420R0237o4136Q0635
17570B13087Q792j66533o5789P3285J59811L3638j29423j14324l3763l8412K87117
17559B27486J04763j89877j4649P8685j5158N9349Q618p8480J25830N3036L7681
17548C97284M7000k72117l4353M2523N3484r0588j9146j3544n7910Q1334J37064
17537B71031J41661J8310j40207l5939j92750j66333J47627K10960R1158l4028
$$ y = [92899, -69330, -95354, -60498, -102293, 70116, 74778, 209739, 353234, 378352, 341849, 360638, 293294, 268609, 223827, 115092, 185035, 249148, 311627, 206096, 171377, 244600, 160197, 263626, 434267, 590595, 343214, 221449, 194432, 47085, 76185, 162049, 321783, 318469, 237288, 115684, 198824, 249472, 107977, 70931, 106351, 196588, 132452, 213087, 221879, 55346, -10443, 62842, 222653, 256291, 126868, 12544, -21219, -59631, 227486, 332249, 142372, 127723, 206408, 191250, 250599, 259217, 180737, 306567, 359603, 397284, 444284, 172167, 137814, 180337, 233821, 143233, 124087, 110543, 52633, 133967, 271031, 412692, 431002, 290795, 254856, 62106, -104227, 43400, 254360, 345518, 311490]
17527C11490r7594n6541J19576k9392m7500J9643o4821J9245O9165j68268P3145
17516A48148J20666j97911k60575J28395K92188o7631J3739m7303n7141r0935
17506a8360Q8556j00492J0922L15898K17573m7405k10979j9388r4515j23449r6998
17495g8637O5144k2102M7270R8102j0596j03540j12673p7973o2442l9799K249
17484b94997J05828J51338N4709J49582R1660j09627m0787N1333k2991l5282j55502
17473e4736L6719J36819J12550R1814k15976J20643n266l2186m2475p5850j39448
17462f7392N337J10527Q7857j9219p4283k41850m3960j086Q9156J17971n1672
17451h8614J7809J0430j732N9113J4010p0299j12308K27704O2765M4481K47565
$$ y = [311490, 213896, 157355, 276931, 247539, 200039, 219682, 154861, 174106, 243271, 75003, 148148, 268814, 70903, -189672, -61277, 230911, 163280, 177019, 129716, 72575, -18360, 70196, -30296, -19374, 296524, 514097, 466692, 255713, 236325, 141810, 18361, -78637, -13493, -35595, 11675, 109777, 99181, -4359, -117032, -195005, -257447, -297246, -294997, -189169, -37831, 16878, 166460, 258120, 148493, 107706, 159039, 136048, 100766, -54736, -18017, 118802, 231352, 323166, 107190, 227833, 222567, 190381, 147906, 72056, -67392, -62055, 48472, 136329, 117110, 42827, -199023, -242983, -244069, -154913, -36942, -88614, -70805, -60375, -62107, -2994, 11016, -59283, -171591, 56113, 118878, 163359, 410924]
17440D10924J53971L05905P4610n8480j02744k62284l08711p6489l3704j10893
17430g895j19041J14295M2759J8200J14870j654r0548o3484K5918J14619J47052
17419B95091o9700J4572Q3553k46990j78664K15945J31739p7690j50514L3258
17409E0600P9595K22046J36487L3164m019j80756k75438k84673j84644Q9097L33661
17398A5120K9619r8147J1392K6783L4814J62873o197O700J8621Q4434r3563j39864
17386E2585Q2628N1441M8924m6960m695q9697k45344n2501J61313J37871J53870
17375B49435p2063j46817J11363j21183Q4626n8239N8936p8615k5373N667J71240
17364A78977j19853k18188N7402O8496K9496P1669j9494j42512P5063K1874r1071
$$ y = [410924, 564895, 870800, 945410, 886930, 784186, 521902, 213191, 136702, 102998, -7895, -126936, -12641, 30118, 48318, 163188, 161534, 70986, 7502, 33420, 148039, 295091, 225391, 239963, 323516, 76526, -102138, 113807, 245546, 167856, 17342, 50600, 130195, 352241, 488728, 521892, 517873, 337117, 61679, -222994, -407638, -318541, 15120, 44739, -53408, -42016, -15233, 19581, 182454, 176257, 182957, 201578, 286012, 192449, 52585, 135213, 186654, 235578, 188618, 183923, 94226, -151118, -203619, -42306, 95565, 249435, 177372, 30555, 141918, 20735, 105361, 47122, 106058, 27443, 2070, 7737, 178977, 59124, -159064, -101662, -33166, -3670, 67999, 48505, -94007, -18944, 2930, -88141]
17353h8141k0684l519R6193Q9144m1868L0906j83503j29673L8980J12192m011
17342a03984J09061M7076K0758J63144J16304p4868r9420o6340j17438k73158
17332b78865P9793K12974P0404m9292P3787l6276n3074p7423k72557m7963K15167
17321a63325N7309m460P3678K2809N354Q4848Q8967M0175Q4723j13941j15958
17310F0179o5927r0813m1231J37527O239J07538L6977l3452R5106m633j36688
17299G0822q0628r1095J48176J64098j05267l8851P5518M0251Q4269O3932k9425
17288C01800l6677j12283j87276j52378J01257J31726L6756q2479O2171J33525
17278A96142N9142k2572J7465m2138J27950j33092j91576L0661J4180k3922l5309
$$ y = [-88141, -108825, -112344, -16151, 72993, 31125, 62031, -121472, -251145, -212165, -99973, -103984, 5077, 52153, 72911, 236055, 352359, 277491, 178071, 111731, -5707, -278865, -199072, 13902, 84306, 35014, 108801, 72525, 19451, -57972, -330529, -378492, -163325, -106016, -110476, -36798, -13989, -8635, 76213, 165180, 205355, 290078, 176137, 60179, -5748, -96561, -137792, -265, 5974, 113512, 150489, 117037, 212143, 207510, 70822, -9806, -100901, 47275, 211373, 106106, 67255, 142773, 183024, 267293, 331225, 301800, 265123, 152840, -34436, -186814, -85557, 46169, 82925, 446, 62617, 196142, 255284, 232712, 250177, 208039, 335989, 202897, 11321, 41982, 56162, 32240, -3069]
17267c069l6021K39120k33563j88575j26461J9379R0837J22805L5145J3961Q9197
17256B2755J55136P9061k46739j20709j72927J75695J08491O7966k9081p4658
17246c5010L4772m581r3911k80116n7635J98964K47270O9047l6151P2282l645
17235A11286q3191r2236K4952K26937p3264j66438j1029m9164N4293J48570q2233
17224H483L2795j16002J01243L9499M2926J19115K0720j83792r3051k8429l3348
17213h9841Q880m7488M1841Q2010J4873J2773o7422r4236R31o1203O6701L6879
17201i5302j18757J05252L0222J01299J12139P7160r6341k75136K2924Q8682N3335
17190E477J33806j3274j76577J5954k402j63482m3188J94329R4939L1243n0318
$$ y = [-3069, -39090, 200030, -33533, -222108, -348569, -329190, -238353, -115548, -80403, -66442, 22755, 177891, 256952, 10213, -110496, -283423, -107728, 763, 68729, 39648, -35010, -238, -4819, -98730, -378846, -436481, -237517, 9753, 78800, 42649, 114931, 111286, 28095, -64141, -39189, 187748, 114484, -51954, -62983, -112147, -57854, 90716, 8483, 41278, -74724, 26519, 66018, 108944, 228059, 248779, 64987, -28064, -56493, -89841, -80961, -128449, -86608, -4598, 10275, 23048, -44374, -138610, -137679, -198882, -132181, -95302, -214059, -108807, -78585, 22714, 134853, 212013, 115672, -159464, -136540, -47858, 5477, 139283, 126009, -50568, -34614, -37016, -200498, -243686, -49357, 45582, 76825, 26507]
17179B6507j37651L8172j28234o5846L3664r6970J55877J69765J82681J38403
17169C16368j55403j31136J40455J17279O2064p8427p2715K8799O321N3491k7187
17158B59909o5418k04561m706r4939J43246K09161n1003j03971o4431n9589k26114
17147b62416L9143J10438r3506k3484Q2345P4547Q0412j9575L011P3529J19202
17136A83646P0728k109k09062q2837M1672L0636N8725j54684M6020j7777q4437
17125a19479j2326J47493J21683n8384J00279J73739R385j49878k33177q3627
17115a04292p1168p161J25160n554J15723J83682P7552j24010m9661L2555j13636
17104E9190n3265N4569P8293M751k1895k54099m6826J96425R8705k07646M8812
$$ y = [26507, -111144, -72972, -201206, -267052, -233388, -330358, -174481, -4716, 177965, 316368, 160965, 29829, 170284, 287563, 349627, 271200, 198485, 227284, 233605, 287096, 259909, 194491, -10070, -14776, -109715, 33531, 242692, 191689, 87718, 23287, -36302, -262416, -223273, -112835, -206341, -229825, -147480, -72933, 7479, -12096, -9085, 64444, 183646, 254374, 252265, 43203, -39634, 2038, 32674, 91399, -63285, -17265, -35042, -119479, -131805, 15688, 137371, 78987, 179266, 353005, 362390, 212512, -20665, -104292, -175460, -182621, -57461, -63015, 52708, 236390, 313942, 189932, 140271, 172826, 59190, 5925, 60494, 138787, 143538, 121643, -132456, -179282, 17143, 115848, -91798, -42986]
17093d2986K48861J55273k0517r3070N6151J14341j23269j15750n5950l3983j44631
17082e5530R8532J32153j15843n2455O5800N0699o4324j00484J6236j20989r5739
17071b41944j8003j7551L7665n0262l6765R5012J90748P6143N7253O3399r5552
17060F0143p0868o2157r3954K5483P541O1283J07471l069k2208J82325k9971p6711
17048H5308Q7025j04194r2681j56095j25253J2670J31885P9748K4763P8724J35453
17037A57353r1710l0363R953J02112O1012j43638q0759L5524p3972J29168k7827
17026D6853r0860J21455O4301M0530j26381m1904j30309N2940j0608m2090L1807
17015h4266O5575J81550r4811k09897l600Q877M5902l6163J62461o8224j01514
$$ y = [-42986, 205875, 361148, 340631, 247561, 303712, 418053, 294784, 179034, 123084, 89101, -55530, 43002, 175155, 59312, 6857, 72657, 123356, 59032, -41452, -25216, -146205, -241944, -259947, -277498, -239833, -290095, -326860, -231848, -41100, 35043, 92296, 155695, 60143, -10725, -72882, -166836, -141353, -133812, -72529, 34942, 31873, 9665, 191990, 162019, 85308, 172333, 68139, -24542, -180637, -305890, -293220, -161335, -81587, -56824, 21900, 157353, 65643, 35280, 45233, 147345, 208357, 64719, -16040, 19484, -54488, 74680, 46853, -44007, 77448, 141749, 182279, 55898, 13994, -116315, -63375, -73983, -116073, -84266, -18691, 162859, 68048, -141849, -145449, -136572, -90670, -126833, 35628, -32596, -134110]
17004a34110n4059M3489J55391J72288J00913m9382q2619k3466P274j06120M8725
16993G8324o0489k02702k5193q2116n3530J58776j35040P2872O4784N9984K6483
16982i7847P8773l4389p8829l8744j2734M2506J9249K14696Q2590r9746k33871
16971a58346j51122K0835P2683J81638R7701M9355j14523K55442n1163j78898
16961B3602P6372J79552j38929j91318J3760J11165j9014J22481N3790L1247Q7265
16950C49973l9119j97532r7400j12976o8589P1676O8953L7187J2767r1786K1695
16939d5151K5292P9523k1381L8089m8527k7317j94783k62392J02409K89614J42753
16928G8129k1653j48972L2284J5254j42291o0983N9870K24527o9960r6811j45559
$$ y = [-134110, -188169, -144680, 10711, 182999, 283912, 234530, 151911, 128445, 135719, 29599, 78324, 17835, -184867, -210060, -292176, -345706, -186930, -321970, -249098, -184314, -124330, -97847, -19074, -53463, -132292, -171036, -183770, -141264, -122015, 92681, 175271, 75525, -158346, -309468, -288633, -215950, -34312, 63389, 112744, -1779, 253663, 202500, 23602, 99974, 279526, 140597, -50721, -36961, 74204, 55190, 177671, 231461, 262708, 349973, 310854, 113322, 15922, -97054, -165643, -93967, -25014, 12173, 24940, -66846, -45151, -19859, 59664, 38283, 76372, 27845, 528, -194255, -456647, -354238, -64624, 78129, 56476, -92496, -60212, -44958, -187249, -248232, -188362, 36165, -33795, -130606, -276165]
16917b76165k3535M0878o2248j6642M7811J47138k6657J22677J6458l2764O8389
16906E340K39148j49796J3483q8984q7175l841m4068k16279J72984Q7640r5431
16895a66979j61306m8245J08713R5427K00845k5244m8302k40915J3078L24120
16885E1192J57635P4357n1831j05907j62075j4975L1933P2049j44988j10091J27330
16874g5371J82752J79410O16j70178r8512J61182o7895L3474n1686l4258o9295
16863i761J40487k7103o7914p1232j26232j99540J0751K18486J19872M7086Q6413
16852A21313J39388j06061l02889J51041Q3293l777k7188R072k14620j58280K3070
16841b85638M4380L5377J65383n3208q6716J8472Q1262l4869k0755J69713K35981
$$ y = [-276165, -299700, -258822, -321070, -337712, -289901, -142763, -169420, -46743, -30285, -63049, 5340, 244488, 94692, 108175, 19191, -67984, -71825, -115893, -332172, -159188, -71548, -166979, -328285, -376530, -267817, -172390, 28455, 3211, -45091, -286006, -272928, 51192, 208827, 283184, 231353, 125446, -36629, -51604, -19671, 52378, -92610, -202701, -75371, 107381, 286791, 287407, 117229, 18717, 179899, 112004, 145478, 93792, 59534, -9761, 130726, 103623, 35709, -35523, -161755, -361295, -350544, -132058, -12186, 34900, 121313, 260701, 154640, -148249, 2792, 86085, 82308, 55120, 64192, -150428, -308708, -285638, -241258, -205881, -40498, -93706, -180422, -161950, -80688, -115557, -136312, 33401, 269382]
16830B69382L9772j24678j56384j08955j22082K7729j05452L2771J24963J50649
16820B7715N8387j38108R989J28194R240p1670k13851j40819p3682J55768K31911
16809a6926K6650J890O2232Q6998j06556j36560l9151M6595n9556J6417k133Q4501
16797c5599J70797P3967N4737k72042J17026Q7945k10147l5854M0928N3165l726
16786D1197K1292j11374k45684L0254l800o9088L5598J04852K31143K62130j01672
16775A94848o6630J16869N0216j7989j13959j86792J3771J00422l0951n1990j17985
16764a10170K6494j5848q5752j68919n7311P1922K76814J78421j7938m9012j67553
16753a18852o2179r0921o5842J29614J62308k1425R6873J0010n7017j4428M9060
$$ y = [269382, 309154, 184476, 28092, -80863, -202945, -175216, -280668, -247897, -122934, 27715, 86102, -52006, -42017, 86177, 95417, 23747, -190104, -330923, -404605, -248837, -16926, 9724, 11614, 73846, 160844, 54288, -82272, -121423, -74828, -134384, -117967, -120100, -35599, 135198, 209165, 263902, -8140, 108886, 196831, -13316, -49170, -8242, 44923, 41197, 62489, -48885, -294569, -264315, -268115, -337203, -301605, -196753, 34390, 296520, 194848, 128218, 245087, 295303, 277314, 163355, -23437, -9666, 90756, 59805, 7815, -110170, -83676, -99524, -185276, -354195, -411506, -339584, -62770, 115651, 97713, 48701, -118852, -181031, -271952, -337794, -208180, -45872, -67297, 29576, 39586, -17431, -31859, 17201]
16742A7201J1262k3146K227l480M1875l7143j68439m0025K1654O200l3850K0984
16730a84680Q4917Q797o1488n6284J18513Q9147j00148M9677J67802J1927n4337
16719G3843p8476n6338l0571j66J27992k3723M706J9411j23181Q9147O1965m5383
16707A9226n791j79396J3087K07747o2037k97105l0993j16J26981J24980J7959
16696f5458n4515l3809Q6966j18382j70485J91257L36033O5521m186q8491j26025
16685A8426j5852J09474j3949j93619p7927P2298j62392m0319K47653J14696k8508
16674B9981K0457j66838J32313r0692P3166K7089k9586q0566Q2039k1981N0672
16663B6054L2477N3662M028l4784k5674j20774j18350K9407R3756Q474q4172O4377
$$ y = [17201, 28463, 5317, 7544, 4064, 45939, 8796, -159643, -199668, -178014, -171814, -205664, -184680, -99763, -90966, -152454, -208738, -90225, -1078, -101226, -51549, 116253, 128180, 73843, -4633, -60971, -91542, -91708, 36284, 12561, 17267, 36678, -86503, 2644, 64609, 19226, 13435, -165961, -152874, 54873, -7164, -304269, -335262, -335378, -208397, -83417, -65458, -119973, -153782, -66816, -185198, -355683, -164426, 171607, 237128, 232942, 144451, 18426, 2574, 112048, 98099, -95520, -173447, -101149, -263541, -303860, -56207, 58489, 29981, 50438, -116400, 15913, -74779, -1613, 25476, -4110, -84676, -2637, -24618, 26054, 58531, 112193, 116221, 81437, 55763, -65011, -183361, -153954, -60198, -51724, -135896, -71519]
16651g1519J28881J84149k76m2425n4201j35440j1205j86064k0392J99108J24011
16640A14627p8396j09099R7671R995N8260M4820K4085l8355P4043q9655R489o7362
16628E0123L084N421j5968k297Q6162o216n4660j7651p3226O2641M0192q1994
16616d389M9284m7373R0336j10893p9084r6633j75947J77694J89531m5523Q9569
16605C6572j15943k3145J08019K6811k27852o8548j3443P0253O5339k3124o238
16594a71299Q6997P6322K2479K686N612o4979m2323o5702n7193J72043P9695p6232
16582c1894p5462k5202J25533M2852J5077j2998K087p0344N5106J68159n0984
16571A41930r8394k42578J02967O1142k3796O5305k6269N2119J54630R4268R336
$$ y = [-71519, 57362, 241511, 241235, 198810, 144609, 9169, -2036, -188100, -208492, -9384, 114627, 36231, -72868, 24803, 34798, 93058, 137878, 161963, 123608, 197651, 107996, 117485, 50123, 53207, 58628, 42660, 40363, 126525, 120309, 65649, 47998, -25228, 37413, 77605, -4389, 44895, -2478, 87858, -23035, -102119, -198752, -374699, -197005, -7474, -52997, 36572, -79371, -102516, 5503, 32314, -195538, -264086, -277529, -207276, -141937, -165061, -171299, -84302, -7980, 14499, 17185, 22797, -42182, -84505, -150207, -207400, -35357, 44338, -31894, -107356, -132558, -7025, 35827, 50904, 37906, 39993, -30351, 24755, 192914, 141930, 43536, -199042, -96075, -34933, -58729, 6576, -19693, 32426, 187056, 281324, 290660]
16560B90660l7970m1669j6244l8848K22820J4575j94129j28571k40812l2188l2919
16549b35295J12144J31611J23466n3731j4560J1815j69255N4137J53148j05415
16539H065n7399J36222L73K8473r3460n9108J0106j23997j47156J79687O6649
16528e1545M7127n9957J7751N1203K11732O470n1154J2490L0470L7512o6645j21062
16516F4392k59318j4696J65578M8311j01288o9573m2497J00969J15595J30843
16506A38316L3267K4074J1466L0464j51202j02915P4168M5232m0086j80247L3628
16495h3835J32726J16425j03230K7535Q0030J77956k3057j73829l4168k1789m0904
16484E3860j04035o005M4473N2035N1978j2770j6073k11261j04677J63038k1930
$$ y = [290660, 252690, 211021, 194777, 155929, 378749, 393324, 199195, 70624, -170188, -202376, -235295, -123151, 8460, 131926, 78195, 63635, 75450, -93805, -39668, 113480, 8065, -49334, 86888, 87261, 115734, 22274, -36834, -26728, -150725, -297881, -118194, -51545, -4418, -64375, -46624, 4579, 216311, 222781, 171627, 184117, 214587, 252099, 185454, 64392, -194926, -209622, -44044, 4267, -97021, -166594, -209091, -108122, 7473, 138316, 171583, 195657, 207123, 237587, 86385, -16530, 57638, 102870, 62784, -117463, -83835, 48891, 165316, 62086, 89621, 169651, 347607, 324550, 150721, 116553, 94764, 53860, -50175, -56180, -11707, 40328, 92306, 79536, 63463, -147798, -252475, -89437, -111367]
16473a11367J5018O4431J46206R6120l3857j25426J82708J86010p5834Q357P5781
16462D28147k49476m5615J23300j12930L86J8045q4414l6085m6829l2512O3883
16451B5900J09221j66396r2876P5814j8099R196Q4134M6221Q8284J06807j53151
16440A15055j3970O1887R8380j15737j83552m215j95331J3184j68J0035P9529
16429a34903j3641M6646J45604Q1710q037Q0161P742M9759n6327J48206J549j80557
16417A67912J2196n2595R882k8260p5346o2752r6818k02341N2636L26523N4399
16406A05436N080m9788Q535R6097k8699j84235k8020J03755Q6617J08419j06662
16395A16535l2024O1498m3677l4920m3495k0302L6702L1955O9404K6977K016J08076
$$ y = [-111367, -96349, -31918, 114288, 210408, 176551, 51125, 233833, 419843, 344009, 352366, 428147, 178671, 133056, 256356, 143426, 143812, 161857, 77443, 41358, -5471, -37983, 25900, 135121, -31275, -124151, -48337, -66436, -57240, 26894, 73115, 161399, 268206, 115055, 101085, 162972, 261352, 145615, -37937, -42152, -237483, -224299, -224467, -214432, -134903, -148544, -101898, 43706, 125416, 117379, 197540, 205282, 255041, 198714, 346920, 348469, 167912, 180108, 127513, 137395, 109135, 33789, -28963, -125781, -328122, -275486, 51037, 105436, 110516, 60728, 69263, 165360, 136661, -47574, -75594, 28161, 114778, 223197, 116535, 84511, 146009, 102332, 67412, 23917, 3615, 40317, 72272, 141676, 168653, 170669, 278745]
16383B78745K8825J2999p6039j72184n7475o0523n3344P3988J05667J5657j2580
16372H3736o7708P4352K4368l2081j27788P3448M3911k9507r734o4072j06808
16361a37883J15289K29669o9796l8582j3182J19455K04406O2654k65032r2678
16351A14320q1580J551K097J71764q0072r0457K5282M9304L795N1804k11772k19703
16339b63667J42114J51397M5574j09810r4331o4953R854L3172Q4102M6281j89059
16328b09326k6818L0976J0491J23351m9845j01961n2948q3169J37123J59330J3611
16317d9185J90757K6930j28465o6674R7881q7085o4225O9233J9886N1189m95P0359
16305A30106J22733O2864O903n8250p9709j44569K1226P7246k6419R783j33743
$$ y = [278745, 307570, 320569, 244530, 72346, 14871, -45652, -98996, -25008, 80659, 96316, 83736, 16028, 90380, 114748, 82667, -45121, 28327, 72238, 42731, 32997, -31075, -137883, -22594, 207075, 137279, 98697, 85515, 204970, 409376, 472030, 206998, 114320, 32740, 34291, 36388, 208152, 128080, 37623, 62905, 112209, 116004, 167808, -43964, -263667, -121553, 29844, 75418, -34392, -128723, -193676, -183822, -150650, -66548, -20267, -209326, -236144, -205168, -194677, -71326, -121171, -223132, -276080, -359249, -222126, -62796, -49185, 141572, 168502, 40037, -26637, 71244, -15841, -80066, -10833, 9053, 60242, 59747, 130106, 252839, 315703, 322606, 264356, 184647, 40078, 61304, 138550, 112131, 121914, -11829]
16294a1829J2447O945j09468Q1408J27962R4100R4507L8701r712o861J08817L3180
16282D60197p148k22962j57412j23420p4922Q4850j7167J29386R6237j18788J4418
16271F3269P3115N7337k8973j55983j24944O9776J26249j14426q0664q5858J30246
16260g0856R2289K8643j64727N5055n3997P2087J99509R6923o3698j01347J93270
16249B83151K084j78225j89960j17238J4077Q4894J49517k5938J8340J13955N1151
16238B05808Q7456k35652j3789k4536p9418O2463M2003k803k2165J02295m4612
16227G7050n2244n7324J25226J51127J10688p5061j60320L2055K2362N3120J04450
16216C31129j38073p5983k2735j31484P2168O5667k13467m5883l3864n215Q8827
$$ y = [-11829, 618, 7563, -101905, -20497, 107465, 201565, 296072, 334773, 325061, 318200, 427017, 460197, 453049, 230087, 72675, -50745, -125667, -40817, -57984, 71402, 167639, 48851, 63269, 136384, 193721, 164748, 8765, -116179, -46403, 79846, -34580, -115244, -201102, -70856, 21433, 50076, -114651, -59596, -113593, -41506, 158003, 254926, 191228, 89881, 283151, 285235, 107010, -82950, -200188, -186111, -101217, 48300, 22362, 40702, 154657, 205808, 293264, 57612, 43823, 19287, -60131, 2332, 44335, 41532, 19367, 121662, 77050, 24806, -32518, 92708, 243835, 354523, 279462, 119142, 151197, 173559, 226679, 331129, 193056, 117073, 94338, -37146, 35022, 100689, -112778, -158661, -192525, -197740, -108913]
16205a08913J5593q6314j14700o7669J29603l3589j03088j8981M8929J58425K12488
16194C1784j23865k14999Q3558J38773J7048J43288n038m2892j59112j61754R8434
16183a94775N8156M6873O428O7301J05559j6054q2738J18659k0110j80229P9285
16172a1645l1433q824N434r3293j75212R8253K64712M849k18216r8470R8026J36901
16160b8918r5976R1582R8635j60460n0750R4867L2408O1555o756L6287l3519J75339
16148B14294k828j02033j65314J6958L5108L9058N2880j25314m1278M7419J24396
16137I3346j42867r4261j35575j562k0638J30670J03374P6494j326Q1722q6822
16126B555K7702J9520J39068q6655j14173N2589n497j29231p827N6095p1054q8005
$$ y = [-108913, -93320, -179634, -294334, -362003, -232400, -265989, -369077, -388058, -339129, -180704, 31784, -92081, -307080, -223522, -84749, -67701, 75587, 70549, 27657, -131455, -293209, -194775, -136619, -89746, -83318, -16017, 89542, 73488, -9250, 109409, 89299, -90930, -11645, -43078, -51902, -46468, -139761, -314973, -216720, 47992, 52841, -165375, -263845, -165819, -28918, -124894, -33312, 65323, -95137, -145887, -51020, -18612, 42943, 36187, 72474, 38955, 214294, 211466, 109433, -55881, -38923, -3815, 35243, 88123, -37191, -78469, -31050, 93346, -49521, -143782, -279357, -280919, -301557, -170887, -67513, 8981, 7655, 89377, 2555, 30257, 49777, 188845, 102190, -11983, 40606, 35109, -94122, -101949, -45854, -116908, -204913]
16114b04913J78012r0808p9498M5991J9598L3247m1887j01633q1701J69924O8083
16103h5585P9993P7041j25457k18682j47550k456l4239q8384J49832J27592L15854
16092D7959J72535j48677k13569r4835K57129J82023n8541R3869j91623k15676
16082a69406n0103O0310J08639O5303q0535k2885J18663K9118m4590M4554j06667
16071d7599L8013L4149p95J39129j44578k00770J51261J5146o4409l1913j22488
16060b34854M4843K3692J0959n456M6896j81281o9929J21356K25854J80761J8468
16049A81309j79504j49831m8700m5383J3538R1208J67488m9151j76366j69117
16039c64509O4676M7272J05700N9260p6026j2619p8842K3866J21580J81516m484
$$ y = [-204913, -26901, -117709, -197207, -151216, -131618, -98371, -140258, -241891, -323592, -153668, -85585, -5592, 71449, -54008, -272690, -420240, -422696, -456935, -545319, -395487, -267895, 47959, 220494, 71817, -141752, -236587, 20542, 202565, 144024, 237893, 46270, -169406, -219509, -159199, -50560, 14743, -65792, -88677, 29986, 59104, 14514, 59068, -47599, -9586, 24563, 23768, 162897, 18319, -182451, -31190, -16044, -80453, -112366, -234854, -190011, -166319, -155360, -160816, -113920, -295201, -365130, -243774, -17920, 162841, 181309, 1805, -148026, -196726, -242109, -228571, -137363, 30125, -19026, -195392, -364509, -299833, -252561, -146861, -87601, -163627, -176246, -255088, -231222, -109642, 71874, 67390]
16028F7390r6340r3386o3806J72381K6970m2734j53727M4220K25770n2304j73173
16017a38739L1270k7309m2419M0739O9641K3215n1929j51494J2701J23592j94126
16006c04858m8519K22586J57265L0848p2116m1030j17781J18604J58412J16460
15996B19871r1942q2970J2123L7454k4204J40964q5795l93694n67J50649n5281
15985a73392p8782J50739J08107k11814j48013J45616L7595j25481j09046L4959
15975c69512R1729J4326m3368O4254J60519O3108j08615r3663J16525M1703m9803
15964a12797M7371L873J19925k4917j45006J24457p300j1109l5897R1741J51412
15953B01753j75243l3698N5406J03705j66448J2366l1925n4453m6372L5136j8625
$$ y = [67390, -28950, -122336, -186142, -13761, 13209, -29525, -183252, -139032, 86738, 34434, -138739, -107469, -134778, -177197, -136458, -66817, -43602, -95531, -247025, -234324, -110732, -304858, -353377, -130791, 26474, 57322, -14794, -55824, -173605, -55001, 103411, 219871, 127929, 44959, 57082, 94536, 70332, 211296, 125501, -268193, -268760, -118111, -173392, -252174, -101435, 6672, -205142, -353155, -207539, -169944, -295425, -404471, -369512, -277783, -263457, -306825, -242571, -82052, -18944, -127559, -221222, -104697, -62994, -112797, -65426, -61553, 58372, 33455, -111551, 12906, 5606, -5503, -41400, 50341, 201753, 26510, -7188, 48218, 151923, -14525, -2159, -34084, -88537, -134909, -99773, -118398]
15942a18398N6314o3826j85719J6385J46092j76764j68825J61867K04156J79208
15932E0490K43584K1040o4101j21677N3342N4955k8206j31101o1783n3767j24177
15921a61401j71311J10297J04754K2013K15310L5838p1631R3084P2143P2850J1419
15910C33365p7282j71011r2197m9337l0166n8433L7384R2382O2499O5153o9474
15899D2883k21436J40310J06001q1975K6441j00499r9971R2265q85j63606k90302
15888e50774O2866K6134k0440M13645J24616J20094P1525m2313j47458j85063
15878a27168r1658R9682J64120J21713k9249q139O1787o4032P988j03557M8452
15867G9939k210m254l4972j79978Q6869N6163P3386J58572k2748k19023j82969
$$ y = [-118398, -62084, -125910, -311629, -295244, -149152, -325916, -494741, -332874, -128718, 50490, 294074, 315114, 251013, 129336, 182678, 237633, 209427, 78326, 16543, -37224, -161401, -332712, -222415, -117661, -95648, 119662, 155500, 83869, 176953, 249096, 321946, 333365, 256083, 85072, -7125, -56462, -86628, -145061, -107677, -15295, 47204, 112357, 42883, -178553, -38243, 67758, -14217, 12224, -88275, -188246, -95981, -96866, -260472, -550774, -487908, -461774, -482214, -68569, 56047, 176141, 247666, 205353, 57895, -127168, -218826, -119144, 44976, 166689, 137440, 129301, 191088, 127056, 135044, 31487, 79939, 77729, 73475, 38503, -141475, -54606, 1557, 74943, 233515, 210767, -8256, -191225]
15856a91225M6794J46331J56978J17617q7337j87238q7565q3310M5746j36284
15846b59493l5208J20669R2392l7844p2915J470Q1579R4714O5770K8753J7158
15835I7045q7009k18620j10308j36292N561J19085J05120p3124p9190R8596P5232
15824b03904J34681p6620q2271M6197O4828M4205K7617O1946o6670j06447M9277
15813a07161R5809L3533p9552J0120J03056m8111q3289q0528J6691J1118J08513
15802a9801O1951K3784N432J22731J07267k5442K0788j99907k33313j46551J14511
15791a68550P8585J5704j4616O4521l659j07539L653L2462j64522R4487K4411
15780a45063l7962R7687Q1924r0852J6450J7681J86877n9844j87593p1313n0635
$$ y = [-191225, -144431, 1900, 158878, 276495, 189158, 1920, -85645, -168955, -123209, -259493, -294701, -174032, -81640, -119484, -192399, -190929, -109350, -14636, 51134, 79887, 97045, 10036, -208584, -318892, -455184, -449623, -330538, -225418, -298542, -377732, -279136, -203904, -69223, -145843, -228114, -181917, -117089, -72884, -45267, 16679, -49991, -156438, -107161, -11352, 22181, -57371, -47251, 55805, 7694, -75595, -156123, -139432, -128314, -19801, 42150, 65934, 71366, 194097, 301364, 275922, 296710, 96803, -136510, -283061, -168550, -89965, -74261, -88877, -24356, -28015, -135554, -131901, -99439, -263961, -169474, -145063, -183025, -85338, -3414, -94266, -77816, -60135, 126742, 66898, -120695, -192008, -242643]
15769b42643J52529l2438j40539j37649R4922n7130L8276M7148m8753N1217J78983
15758i6077K1035k29548m6754J35458R8047J15269k7123q9455O6035j5002J4600
15747e3515l8789R3508j04244o5020Q7987o6785R1710J30367P5398K2309j32791
15736D0135j2222J9736j07186p8718j02913J23917O8385j7758o0912k7366k7829
15725a82731N7006K36747k0374q5439J12531P677j35665K4901N4541J9916J8210
15714A07320l2487N1840n2722j7289L0449m3192q0407o1536k596n7958j357K5673
15702a34262q6493L8982p648P162K2565o1783o5988j6801r0130R0762J0476j58969
15690d52127O2682J7518Q2275K714p098J28413J42330j46328r1035K5349q0271
$$ y = [-242643, -90114, -122552, -263091, -400740, -305818, -362948, -324672, -277524, -326277, -275060, -96077, -75042, -304590, -351344, -215886, -117839, -2570, -29693, -119148, -53113, -68115, -53515, -92304, 1204, -103040, -168060, -80073, -146858, -55148, 75219, 150617, 172926, 40135, 27913, 47649, -59537, -138255, -241168, -117251, -48866, -66624, -127536, -154902, -182731, -125725, 111022, 90648, 5209, 117740, 125417, -10248, 14653, 69194, 89110, 107320, 74833, 126673, 73951, 56662, 87111, 43919, -36488, -98024, -100620, -158578, -159935, -134262, -220755, -181773, -189421, -182259, -159694, -221477, -287465, -304266, -394396, -303634, -293158, -452127, -389445, -371927, -289652, -286938, -294036, -165623, -23293, -169621, -260656, -235307, -315578]
15679c15578P6593J71738O5363P1770J8481K2845R7302k2294n4812q1945o4748
15668a5285j69624j029J3906J40284R0716N1139J54471K1075j16341o5178Q8498
15657A92632j33767j61671J4929J6617j0880K2281J42410k3059k80361j85514
15647d06383N8109P0194j2015k779j2476J22984J36522M9474j2240J66745K8325
15636A86460q9591k01333k4944N1397j04792j73244Q4895J1513L3020M7165j99938
15625c79392P2472M3893l5226L0724J50464J07720J7050R2862j45670j77329J575
15614b20857l6680J61713J44720j03149N9138l6057l3539m3239r8474P359J08999
15603i0066J89220M9430j23594l1408l8786J1905o891J39248j5360m5127R8991
$$ y = [-315578, -238985, -67247, -1884, 69886, 88367, 111212, 208514, 186220, 131408, 49463, -15285, -184909, -185938, -172032, -31748, 58968, 110107, 264578, 285653, 169312, 104134, 192632, 58865, -102806, -87877, -71260, -82140, -59859, 82551, 59492, -220869, -406383, -348274, -278080, -290095, -292874, -305350, -182366, -45844, 3630, -8610, 158135, 186460, 96869, -104464, -129408, -78011, -182803, -356047, -271152, -259639, -226619, -179454, -379392, -306920, -263027, -298253, -267529, -117065, -9345, 7705, 100567, -45103, -222432, -220857, -257537, -95824, 48896, -54253, 4885, -31172, -64711, -107950, -206424, -199065, -90066, 99154, 148584, 24990, -6418, -45204, -33299, -40190, 99058, 83698, 38571, 137562]
15592A37562N6040J4244j06035l3174Q6877q6816j08411j14290j0602K61111J41986
15581B38492o5055j05577J14886K8487j16790j2971K8453l5075k71034j88868
15571c85052K11199J99592J53939p3186k43247j1997j17608q9152K8022J83642
15561a43848J01380j3118n5558Q285J26025M0293j33788n0049j01486r974J0224
15550b21614J79641N9170j60822p9051M8324J19264N0392J74394J52994p2807
15540B49885m6773j01908K7461j21377k90923m8464R2653K24563N4110O0897R1657
15529A91781j00284j39803j19830N5679j8506r3483j29714m9062m5066Q8399K14852
15518a45037K1899J95076q8605j69338N6696K3078J9588O2937M4205J20345k1908
$$ y = [137562, 193602, 207846, 101811, 68637, 155514, 68698, -39713, -154003, -164605, 96506, 238492, 173437, 67860, 182746, 211233, 94443, 81472, 109925, 74850, -196184, -385052, -173853, 25739, 179678, 106492, -136755, -148752, -266360, -355512, -327490, -143848, -42468, -55586, -111144, -102859, 23166, 63459, -70329, -120378, -221864, -231838, -221614, -41973, 17197, -143625, -222676, -174352, -55088, -4696, 169698, 322692, 249885, 203112, 101204, 128665, 7288, -283635, -332099, -239446, -14883, 39227, 100124, 191781, 91497, -48306, -168136, -112457, -130963, -224446, -354160, -403222, -448288, -359889, -145037, -123138, 71938, -16667, -186005, -129309, -106231, -86643, -23706, 20499, 140844, 118936]
15507A18936q2716j24394j43009k19152J33033J90771k4643j5297K6651K28081
15497H8261m087j39758j19052j01166K09957j8994J69688J00953j27997j85088
15487a27283K1973N8424K9990K778o280N4057N4613J0857K5255j02823j79222
15476a57661j12565N0773K06983Q9027j06914j23959M3014M6575m6065o0898l7021
15465b08711m6233n986M3559P3652J26313K4817p1200J57l3045J0109l3705M9584
15453g0689J58924J22214j40906j62991P5339O7169K003P6136L4894J26642k6765
15442B61970k72841j22060Q4177j35811j1717j05033R3973J62051K14233n0193
15432A18749j4956J1681o0866k8790J3671L1663l6595j96330q19K6437J13630
$$ y = [118936, 36220, -88174, -231183, -450335, -317302, -126531, -151174, -166471, -139820, 88261, 84174, -55584, -174636, -275802, -65845, -84839, 84849, 185802, 57805, -127283, -105310, -46886, -16896, -14118, -20398, 33659, 88272, 99129, 124384, 21561, -157661, -270226, -219453, -12470, 76557, -30357, -154316, -111302, -64727, -110792, -171690, -208711, -254944, -260930, -217371, -143719, -17406, 7411, -63789, -63632, -96677, -86568, -120273, -70689, 88235, 210449, 69543, -93448, -18109, 49060, 51063, 127199, 162093, 288735, 261970, -10871, -132931, -48754, -184565, -196282, -301315, -207342, -45291, 168942, 118749, 103793, 115474, 54608, 25818, 39489, 71152, 34557, -161773, -162592, -136155, -22525]
15421b2525q0113j18928J24650K2243M3902j71904J53758K2901O4035Q6682n1133
15410G3568o1060L4188M0805P8944o3870q6999k08396q3974Q6527j7061K0611
15399a86717J31131q053j0605J21847o9975p2522q0407R3427L118r4429R7071
15388g6114L1747k04164j28283j55952J90086J84682N3132j7544J76209m1805
15378A1994k48520k8330K10692J64000N8732Q1305J7159j23955j90151l939Q7803
15367C6790J38414Q088K1588r3889L0043J37215q7377j72128j41596J2834q699
15356a18717k8799L5608J2826Q5407q6792J74561q2922j12790M4008O514M969
15345f6127o5714J16122M5425n5130p945P3111j48188K4114o6852p1521P6179
$$ y = [-22525, -102638, -221566, -96916, -74673, -30771, -202675, -48917, -26016, 38019, 124701, 73568, 12508, 46696, 87501, 166445, 102575, 15576, -192820, -276794, -190267, -207328, -186717, -55586, -63639, -74244, 47603, -22372, -94894, -175301, -81874, -78756, -173185, -76114, -44367, -248531, -376814, -532766, -342680, -157998, -104866, -122410, 53799, 11994, -236526, -264856, -54164, 109836, 168568, 249873, 267032, 143077, -47074, -51013, 36790, 175204, 183292, 204880, 110991, 141034, 278249, 190872, 18744, -122852, -110018, -118717, -147516, -111908, -99082, -13675, -100467, 74094, -8828, -121618, -77610, -71096, -66127, -131841, -15719, 29706, -25424, -33369, 39742, -108446, -84332, -151184, -222705, -146526]
15334a46526J66007j69459p4233N7519J48382n2746N0351O3314J4843m7708l7479
15323b7735j99549j51036J70142J41119J44192L0216j37135k27187l5673J72030
15313a20616J48309o6507p49J08850J16192M4942j53698j56794j22069J16156
15303h5984J93949J65208j62598k1257P5441J61577N2201p0926j04043j18285
15293H5283J40912J42941l4279J07887K346k16243l72271q0193k8324P8667J29555
15282d3719J06839M471q8128K11043J4493l2716o2272J08474o8470k47847Q04
15271i7028Q6868l9712o3740k6175O5039j48300m3289N3669k6847J26296J42092
15260B8873N5677J1615j5746K3154r1333N249j8646J52327P9760r9075j07176
$$ y = [-146526, 19481, -149978, -224211, -166692, -18310, -71056, -20705, 42609, 57452, 9744, -27735, -227284, -378320, -208178, -67059, 77133, 107349, -29786, -256973, -292646, -120616, 27693, -38814, -39563, 69287, 185479, 230421, 76723, -80071, -202140, -85984, 107965, 273173, 110575, 89318, 164759, 326336, 378537, 307611, 203568, 85283, 226195, 369136, 334857, 442744, 445090, 228847, -143424, -223617, -251941, -173274, -43719, 63120, 67591, -20537, 190506, 204999, 172283, 110011, 218485, 150015, -97832, -97028, -10160, -49872, -113612, -139787, -74748, -223048, -266337, -212668, -239515, -113219, 28873, 84550, 96165, 80419, 103573, 12240, 17489, -1157, 151170, 230930, 131855, 24679]
15249B4679j6737k06284p1335J07170K05774J3993j84208J2531J20864n2551M2766
15238c338P1354r5432p3351L6370J28639J14887j4613R8187M365j21223l07052
15227a61207Q7826J08823j14858N9524l171o3771N1872K4632r1446R7672M8462
15216D4358m272N3146m3636o5283j7281m447o15j9768N2562l756k6808r3636N8855
15203g0581L2896J36943p1986j11464r061j7994P5618J42149J57276m1664o7396
15192A54736M9035j7435n464K0465O6658m1298j64481n8077J7752M7308m3770
15181B5429k4977Q9175k8662k7075O5899R1605r9591j19845M2147J21760p9230
15170E6635p9551k20068O0661J44462K67655Q9650m5897k4271k42175L9317L6007
$$ y = [24679, 7942, -198342, -269677, -162507, 43267, 57260, -126948, -114417, 6447, -46104, -3338, 68016, -27416, -100767, -64397, 64242, 179129, 164516, 262703, 267068, 145845, -161207, -73381, 35442, -79416, -19892, -23063, -86834, -34962, -10330, -101776, -4104, 44358, 40086, 93232, 49596, -15687, -32968, -37415, -38030, -57798, -5236, -8992, -35800, -129436, -70581, -37685, 99258, 27272, -84192, -93253, -111247, -35629, 106520, 263796, 222132, 154736, 203771, 186336, 180872, 201337, 267995, 226697, 62216, 4139, 21891, 69199, 25429, 452, 89627, 60965, 33890, 99789, 191394, 91803, -28042, 14105, 135865, 56635, -22916, -242984, -182323, -37861, 229794, 319444, 273547, 249276, 7101, 46418, 82425]
15159H2425j9780K2002j08034Q8476N9574j07255j35258M0032J3874j77430l7618
15148b78992J38599N7571K1520O1535J33459p0789p6901J51558l5258j50789Q925
15137c9562K57721J78741l962j39785k54915n3643K9139J63332R5863j3167o7241
15126A52521r8082M2072O5270N7512Q0054k22602k06078J57103J22266R8525K32590
15115D81151j6899j42976j09549j79023J8883J74744j01513J09835q3020j60384
15105h751n8909Q114K19732J73153J03494k12532k01459r5715J97198Q8346n8576
15094A54095J07133K34681n0450k37249j2171P1934j9753K7265J23492m7762k16666
15083A34549p467o872R660j52852n4556O0523N5333J50937L9148q7030q7553n8825
$$ y = [82425, 62645, 84647, -23387, 65089, 124663, 17408, -117850, -77818, -63944, -241374, -278992, -140393, -82822, -61302, 233, 133692, 62903, -13998, 137560, 102302, -48487, -39562, 218159, 396900, 392938, 253153, -1762, -55405, -26266, 137066, 232929, 219762, 152521, 54439, 96511, 161781, 219293, 299347, 76745, -129333, 27770, 150036, 248561, 481151, 464252, 321276, 211727, 32704, 51587, 226331, 124818, 234653, 151633, -8751, -67660, -59546, 160186, 333339, 436833, 224301, 22842, -72873, 124325, 212671, 154095, 261228, 495909, 445459, 208210, 196039, 267973, 248220, 275485, 398977, 351215, 134549, 127082, 120210, 129870, -22982, -77538, -17015, 38318, 189255, 228403, 141373, 53820, -5005]
15071e005k9311j8161J38629Q2727Q9763q0818n2099O9021O4785q993j6918K08812
15059D42432k6080j34681L326j50376p2282j36491K6870J76552R3305n8788l9048
15048A24739j52679r4127J04675J47704K96p5250K28584J94101P2665r4991k36535
15037B19182j04918m0855Q9066J08046J35823j31767j83653N3949k4712j12147
15027H014l677K04034K08925o2587L5549m8895L2063K05071J5385k29087k13379
15016A51416R4120J78838k5832j05348j56077k1122O5367J56213j2833r0238J18329
15005C52833L936m3257l4903L1186j37473k8334Q0483J71074N2679j44167j04500
14994A99557o3786K20024M8287m8589j99643l491K4667J45k3994O6445R8449J50469
$$ y = [-5005, -34316, -52477, 86152, 168879, 258642, 177824, 125725, 194746, 259531, 250538, 233620, 442432, 416352, 281671, 284997, 134621, 62339, -74152, -47282, 129270, 222575, 163787, 124739, -27940, -122067, -17392, 130312, 130608, 55358, 283942, 478043, 550708, 455717, 219182, 114264, 73409, 162475, 270521, 406344, 274577, 90924, 144873, 120161, 8014, 4337, 208371, 417296, 354709, 390258, 341363, 373426, 578497, 593882, 364795, 151416, 245536, 424374, 398542, 293194, 137117, 115995, 181362, 337575, 324742, 234504, 352833, 356769, 313512, 278609, 309795, 172322, 143988, 224471, 395545, 448224, 304057, 199557, 135771, 355795, 404082, 355493, 155850, 152359, 177026, 177171, 153177, 219622, 318071, 468540]
14982D68540q2583m0641k8866n9491m47j80111r3080O940K04048K26760M2021
14971D63090Q0571o5106N2543q0400q6355K1317K0192q3898r6759P6329O6107
14960C67631j05370P6289J41254O6363j90043q5036J52318O9178j35417j05082
14950B52085J00010N3807o5182p7755J17288O4044j32965N1527Q3941j37727k89414
14939A9659J26813J57473O7841N6084K809r9769J0703k3224K5061P8517P3316
14928D95283p2667j43095J794J228j65281J19873J8923j745K17301q288k132M336
14916D65530n343q7829L4469L887m3680j73106P1280J12187j16831m0853R8138
14905C17849N6796J36226K925M2293j3433j13073j31739n7499O4017J63324p6171
$$ y = [468540, 385957, 345316, 316450, 256959, 256512, 76401, -16679, -9739, 194309, 421069, 463090, 543661, 478555, 531098, 450698, 364343, 385660, 405852, 321954, 225195, 301524, 367631, 262261, 338550, 479804, 546167, 356124, 271088, 423406, 492584, 357167, 252085, 352095, 405902, 340720, 262965, 380253, 444297, 311332, 362859, 446800, 309073, 19659, 146472, 303945, 371786, 427870, 430679, 330910, 341613, 318389, 343450, 421967, 495283, 422616, 279521, 281315, 282543, 117262, 237135, 256058, 254313, 471614, 463326, 461194, 465530, 460187, 372358, 406827, 410714, 367034, 193928, 265208, 377395, 260564, 219711, 317849, 374645, 510871, 513796, 556089, 542656, 429583, 297844, 240345, 304362, 467686, 391515]
14894C91515j8824m1929q4570q5784o7339J06719R2955J26018O3672R6540p7657
14883E01316m0314K356L4206n8439J15516L9765L9154P6939Q7871j45635l07296
14872C45439r9920L6704J02701K16312O5538o6458n0336J49591O0684o2666k0205
14861F77384j19066o1750j8461k01191J44717K16615O843k35770k5770m2476J13477
14850D54552L76751R4868k14332j96798j97576l6028J62804N6519r1990O6272
14840D75042Q9177j27608m0741J70625Q8161O4530J08096m4530j530k4513m3492
14829G13217l2196m324q8335k5874J668K40795O016r1089O3658K6610L4522J95254
14817A039922P3348j03864j22236O0883K9565j70174j30225l7819O8875J50203
$$ y = [391515, 372691, 330762, 246192, 160408, 93069, 199788, 292743, 418761, 482433, 578973, 501316, 461002, 463358, 497564, 439125, 554641, 594406, 633560, 710499, 798370, 652735, 345439, 245519, 282223, 384924, 601236, 666774, 600316, 549980, 699571, 760255, 697589, 677384, 558318, 496568, 478107, 276916, 421633, 638248, 645091, 409321, 383551, 341075, 454552, 831303, 926171, 711839, 515041, 317465, 281437, 444241, 500760, 408770, 475042, 564219, 436611, 395870, 566495, 654656, 719186, 827282, 782752, 781222, 756709, 713217, 681021, 676697, 588362, 562488, 564156, 804951, 810967, 719878, 783536, 810146, 844668, 1039922, 1113270, 1009406, 887170, 948053, 977618, 807444, 677219, 639400, 708275, 858478]
14807H58478n5025j59675q1655K2521p9354J70757O4735p480O6059o4114O2336
14796G97583j49595j00640J28960J23374j04558k05292L6559Q2361K07474K62144
14786A078370M3962r0868p2182n5534j22672R9009J16239j64409N7217J91145
14776A080277N8819P8517j02400k1209n9386j53591j5952o823J2095K09837Q0791
14765A160975p3601m307m0986j39608j46614L9167J51317O9552K5160M6075p3762
14754A013368K3210K20405r809j43397N3638P3903o246k15517k9240Q5487J33170
14743A198972k1034J1432n1184l0689J74855L2833l0028P7933J5879j42042j2061
14732A224866K3340M2995m7744k23933J2863L15947j9383n64J24984r5474l5999
$$ y = [858478, 803453, 643778, 562123, 584644, 505290, 676047, 740782, 733302, 799361, 735247, 797583, 647988, 547348, 676308, 799682, 695124, 489832, 526391, 608752, 816226, 1078370, 1122332, 1031464, 959282, 903748, 781076, 880085, 996324, 831915, 889132, 1080277, 1139096, 1217613, 1115213, 1094004, 1034618, 881027, 865075, 858252, 870347, 1080184, 1160975, 1087374, 1083067, 1042081, 902473, 755859, 795026, 946343, 1015895, 1041055, 1087130, 1013368, 1036578, 1256983, 1247174, 1103777, 1157415, 1231318, 1225072, 1009555, 980315, 1065802, 1198972, 1177938, 1189370, 1138186, 1107497, 1282352, 1315185, 1285157, 1363090, 1378969, 1236927, 1224866, 1248206, 1291201, 1243457, 1019524, 1032387, 1348334, 1328951, 1328387, 1453371, 1357897, 1321898]
14721A321898J93964K3519r5589j70237k28095P1492J82164j0653O2854l2684
14711A318633j67014J44279N1943O9528j0589j15524Q5049O6162O0052K010j28294
14700A376235k5384J62020J28938j0660k4985K6528j26219l6338N3427J38506
14690A662068J58984N3301O8587L7071q6233j59503M9891J19410J58498j77091
14680A884983j41021k3300K2666J65970J01645M2433l9720m2818Q0394J14879
14670B166111K393J8005j52579m7593J02046o5143p9221L0077Q7049J29388J93015
14659B383548k2910j13263M3064Q3375J6552K0911L9171k09039R033K90851J70677
14648B711970J48003J78495L5698j23998L8538J58078P3280M594o0197k39697
$$ y = [1321898, 1515862, 1539381, 1443792, 1273555, 1045460, 1116952, 1299116, 1288463, 1351317, 1318633, 1151619, 1295898, 1347841, 1417369, 1406780, 1291256, 1376305, 1442467, 1502519, 1504529, 1376235, 1350851, 1512871, 1641809, 1631149, 1606164, 1632692, 1506473, 1470135, 1523562, 1662068, 1821052, 1874353, 1942940, 1980011, 1893778, 1734275, 1784166, 1903576, 2062074, 1884983, 1743962, 1720662, 1743328, 1909298, 2010943, 2053376, 2013656, 1970838, 2051232, 2166111, 2168504, 2186509, 2033930, 1986337, 2088383, 2023240, 1944019, 1974096, 2061145, 2190533, 2383548, 2360638, 2247375, 2290439, 2373814, 2390366, 2411277, 2450448, 2241409, 2250442, 2541293, 2711970, 2859973, 3038468, 3074166, 2950168, 2988706, 3146784, 3220064, 3224658, 3164461, 2924764]
14638B924764j60803m0708k9463M0068L2570R6504M5565N7184J41167p9464j44659
14627B882725N0266J75898J13826O135j57199q4663k1001r9465J2734O567J09916
14616B995739q883O5568P0148p943L1679p4198N766J33398J04214K165o1636N3245
14604C309262L4558J7444j33420N5952M2668P0087j42483o105K65221J0873j9762
14593C504295J62699K18005J75220N7513r8612l740N0767j0197j78309N5199q3521
14582C849319O3609R1972j3406J1821o6785J10722M9433K03359J49580j84185
14572D265439q799K0932Q5737P6j74573R5854J06587J4060J18517J00393J05313
14561D729536J24611K8570k197p759o4274o8161Q7933K4766J9341J66202R4457
$$ y = [2924764, 2763961, 2723253, 2693790, 2733858, 2766428, 2862932, 2908497, 2965681, 3106848, 3027384, 2882725, 2932991, 3108889, 3222715, 3228850, 3071651, 2986988, 2965987, 2866522, 2879256, 2885823, 2995739, 2986856, 3052424, 3122572, 3114629, 3146308, 3072110, 3077876, 3211274, 3315488, 3317653, 3256017, 3309262, 3343820, 3361264, 3227844, 3283796, 3326464, 3396551, 3254068, 3247963, 3513184, 3524057, 3504295, 3666994, 3884999, 4060219, 4117732, 4019120, 4015380, 4066147, 4055950, 3877641, 3932840, 3849319, 3912928, 4004900, 3991494, 4003315, 3936530, 4047252, 4096685, 4300044, 4449624, 4265439, 4256640, 4277572, 4363309, 4363385, 4188812, 4284666, 4391253, 4405313, 4523830, 4624223, 4729536, 4854147, 4882717, 4880520, 4872761, 4808487, 4740326, 4828259, 4853025, 4872366, 5038568, 5133025]
14550E133025R2549J14897M2750R5569J09868m1908K1210J67064L3988J07612
14540E876624n0355j28194N4255K79065J16856N2316Q2597J48030O2228Q0646
14530F574068J05159J08051J07424j00755K3887N2330J51789J88301k0842n9222
14520G130190J59241J80627L09759J42401O3111M0423K6407O6768O0978K38375
14510H418280J1792O4302O0546J20743K79626J23467J25536O0585J36246M04484
14500I805607J81931j05450R0002L14470J2410J8111J41658K72194K30939K94532
14490A1256404K32914J30596P4061R3486K17137K28762K55671O5883K9868L17359
14480A2902141L14837K39979J62570J24623J82578J60750J58633J90763K61335
$$ y = [5133025, 5225574, 5340471, 5383221, 5478790, 5588658, 5546750, 5567960, 5735024, 5769012, 5876624, 5826269, 5698075, 5752330, 6031395, 6148251, 6200567, 6283164, 6431194, 6493422, 6574068, 6679227, 6787278, 6894702, 6793947, 6817834, 6870164, 7021953, 7210254, 7189412, 7130190, 7289431, 7470058, 7779817, 7922218, 7985329, 8025752, 8052159, 8118927, 8179905, 8418280, 8430072, 8494374, 8554920, 8675663, 8955289, 9078756, 9204292, 9264877, 9401123, 9805607, 9987538, 9882088, 9972090, 10286560, 10298970, 10317081, 10458739, 10730933, 10961872, 11256404, 11489318, 11619914, 11693975, 11787461, 12004598, 12233360, 12489031, 12554914, 12584782, 12902141, 13216978, 13456957, 13619527, 13744150, 13926728, 14087478, 14246111, 14436874, 14698209]
14471A4698209L61187L13557K34547K63334L07977K30555L20621M00575K83464
14462A7414026J79787J08153L25766N35283N16359J39941J78245M01168O22195
14453B0420923N21961L33175K52414L51603K96387M53710M73994M03533M29601
14444B3937301L19969K65883N17062N75359N25091N86087P28894N14067N89224
14435B8558937P56914P00313O90930M22389N16296O73103P74553Q61345Q37826
14426C4792606O52972Q41675P45638R15445Q33835Q47349Q80333P81694P60045
14417D2051592R15223J140696J130275J069590R00821J127126J079086J200299
14409E0614708J119584J111297J148476J173930J212123J191334J198160J148471
$$ y = [14698209, 15059396, 15372953, 15607500, 15870834, 16178811, 16409366, 16729987, 17130562, 17414026, 17593813, 17701966, 18027732, 18563015, 19079374, 19219315, 19397560, 19798728, 20420923, 20942884, 21276059, 21528473, 21880076, 22176463, 22630173, 23104167, 23507700, 23937301, 24257270, 24523153, 25040215, 25615574, 26140665, 26726752, 27455646, 27969713, 28558937, 29315851, 30016164, 30707094, 31129483, 31645779, 32318882, 33093435, 33954780, 34792606, 35445578, 36287253, 37032891, 37948336, 38782171, 39629520, 40509853, 41291547, 42051592, 42966815, 44107511, 45237786, 46307376, 47208197, 48335323, 49414409, 50614708, 51734292, 52845589, 53994065, 55167995, 56380118, 57571452, 58769612, 59918083]
14401E9918083J359517J411666J315596J490012J338484J259486J332364J334014
14393G0759222J324908J387251J311624J441582J584928J442806J436205J312468
14385H2000994J166948J398376J317238J234223J309468R61725J080289J024349
14377I1493610R47422R07987R91128Q87504O84371O40831P06323M09357J59937
14368I7828470L33515L60753L58205J12429p8462p7432k79191j58881k43055m86776
14358I7669575m77299n43056o72723p61866p13389r37953p31528p55735j023642
14349I1052384q61926r65774j098078j181267j077506q75242j106358j255982
14341H2630251j489506j411638j021478r64549j002983j276014j239940j301880
$$ y = [59918083, 61277600, 62689266, 64004862, 65494874, 66833358, 68092844, 69425208, 70759222, 72084130, 73471381, 74783005, 76224587, 77809515, 79252321, 80688526, 82000994, 83167942, 84566318, 85883556, 87117779, 88427247, 89388972, 90469261, 91493610, 92441032, 93349019, 94340147, 95227651, 95912022, 96552853, 97259176, 97668533, 97828470, 98161985, 98522738, 98880943, 98993372, 98914910, 98837478, 98558287, 98399406, 98156351, 97669575, 97192276, 96649220, 95976497, 95214631, 94501242, 93563289, 92831761, 92076026, 91052384, 90190458, 89224684, 88126606, 86945339, 85867833, 84992591, 83886233, 82630251, 81140745, 79729107, 78707629, 77743080, 76740097, 75464083, 74224143, 72922263]
14333G2922263j164838j050528j190206j254769j343842j255704j131773j054741
14325F3475862j015369r29303j218220j065973j105797j107161r00255r91129
14317E5142655q85005q54671r18674j037540r50759p88464o88966q92781r76094
14308D7149701r97749q34993o96507q46079r66857r08072p29096n13928o50601
14299D0005819p07156p44601o92894n07415n87750o51396o04770o71906m44832
14290C4393099n70790p75437n65464l36273n78898o54006o53562m87413m73542
14281B9297714o52668m31924k20726j54515m90712m64218m40722l99041n51370
14272B5491818l98943k53844l07462n31574m49193l58084k78195j81162k41537
$$ y = [72922263, 71757425, 70706897, 69516691, 68261922, 66918080, 65662376, 64530603, 63475862, 62460493, 61531190, 60312970, 59246997, 58141200, 57034039, 56133784, 55142655, 54257650, 53402979, 52484305, 51446765, 50496006, 49707542, 49018576, 48125795, 47149701, 46151952, 45316959, 44620452, 43774373, 42807516, 41899444, 41170348, 40656420, 40005819, 39298663, 38554062, 37861168, 37353753, 36766003, 36114607, 35509837, 34837931, 34393099, 33822309, 33046872, 32481408, 32145135, 31566237, 30912231, 30258669, 29771256, 29297714, 28645046, 28213122, 27992396, 27837881, 27347169, 26882951, 26442229, 26043188, 25491818, 25092875, 24839031, 24531569, 23999995, 23550802, 23192718, 22914523, 22733361, 22491824]
14263B2491824l39811l85974m14691n42867j35095j05729m56530k89860k67906
14254A9553361k46551m35744j58074l17837l29079m03636l14948l35790j58097
14245A6853605j43839k68754k75458k36684j8221k18898k14893k07512m21809
14236A4847537j99626j47284k8587q9197k25269k94933k9780j36493j05775j69751
14226A3420842l15437k43328k43488k88720j78453k42773j82091j23069k62918
14217A1340565J7611p7279n808j62458j86104k23551j05724r5972O192l03347
14207A0204125k69348j2274r0306k20644k72172K6160n5224M4727K7101j20087
14197I262058j44054j7864m4727K510j74737k52327j59019k55875j5267j25214
$$ y = [22491824, 22152013, 21766039, 21351348, 20808481, 20673386, 20567657, 20111127, 19821267, 19553361, 19306810, 18871066, 18712992, 18395155, 18066076, 17662440, 17347492, 17011702, 16853605, 16709766, 16441012, 16165554, 15928870, 15910649, 15691751, 15476858, 15269346, 14847537, 14647911, 14500627, 14472040, 14382843, 14157574, 13862641, 13832861, 13696368, 13590593, 13420842, 13105405, 12862077, 12618589, 12329869, 12151416, 11908643, 11726552, 11603483, 11340565, 11358176, 11280897, 11275089, 11112631, 10926527, 10702976, 10597252, 10501280, 10507472, 10204125, 9934777, 9922503, 9832197, 9611553, 9339381, 9365541, 9310317, 9355044, 9382145, 9262058, 9118004, 9100140, 9055413, 9057923, 8883186, 8630859, 8471840, 8215965, 8200698, 8075484]
14187H075484q9052N969Q2029q972j24599l35936j03465l9426j5502J17784j38937
14176G425377j90343j12695j4467J18517P8279k72015j99144q0347r3257j8329
14166F641576j39771q6161r8949o0336P8863l1897j84305j58282q4609j76608
14156E699521j27561J44996J8501l9121J17546q1851m6869l8752n5799r5911j07555
14145E387145J53451J57713j367k44688j82760j95456j12996J75987n4163p3548
14135E009318q2646j02915k3700r0285j28617k1315Q7802K0593m7577M95J29786
14124D750939M7325j11726j9532M5870j7328k7763L3022m8748j25877j46419k32603
14113D147160j6705J08995j6854m0276r8737Q6615p6251M7817Q5804j4218j7510
$$ y = [8075484, 7986432, 7992401, 8074430, 8065458, 7940859, 7604923, 7501458, 7462032, 7446530, 7564314, 7425377, 7235034, 7122339, 7107872, 7226389, 7304668, 7032653, 6833509, 6753162, 6659905, 6641576, 6501805, 6415644, 6316695, 6256359, 6335222, 6303325, 6119020, 5960738, 5876129, 5699521, 5571960, 5716956, 5735457, 5696336, 5813882, 5732031, 5685162, 5646410, 5590611, 5494700, 5387145, 5540596, 5698309, 5696942, 5452254, 5269494, 5074038, 4961042, 5137029, 5082866, 5009318, 4926672, 4823757, 4800057, 4709772, 4581155, 4559840, 4647642, 4668235, 4620658, 4621153, 4750939, 4798264, 4686538, 4667006, 4712876, 4695548, 4667785, 4700807, 4652059, 4526182, 4379763, 4147160, 4130455, 4239450, 4222596, 4182320, 4083583, 4170198, 4093947, 4141764, 4227568, 4213350, 4195840]
14102D195840K7717m226r429m0309j80745J2768m3466n6759J99804K3623n1910
14091D072908K06843O0451n282M2365n5325j71551j20324j16387P1411m6625j03777
14080C834707M38j44141j78470j19412n9617Q0348Q0219p5883m4835k13496l729
14069C156129N9016q4945R8704k5935j22131m464j08002l2075J52240J18568j5264
14058C191841r928j45906j39930J0428k6542o8880o3363O2075L9492q1645j20845
14047B646797j16877j4802J8980k04262L3148j5662l1840P7114L9696L4560P7360
14036B544212r5351j03575j01159n4883o3719p0279O3131Q3452J97j14069J48179
14025B236136p6439n0036O6270m8525L3229J23311m3273j04941M2324J47092l2436
$$ y = [4195840, 4223557, 4219331, 4209902, 4169593, 3988848, 4001616, 3958150, 3901391, 4101195, 4124818, 4072908, 4279751, 4340202, 4334920, 4377285, 4321960, 4150409, 4030085, 3913698, 3985109, 3938484, 3834707, 3835145, 3691004, 3512534, 3393122, 3333505, 3413853, 3494072, 3418189, 3373354, 3159858, 3156129, 3215145, 3130200, 3228904, 3202969, 3080838, 3076374, 2968372, 2936297, 3088537, 3207105, 3191841, 3181913, 3036007, 2896077, 2906505, 2879963, 2811083, 2747720, 2809795, 2849287, 2767642, 2646797, 2529920, 2515118, 2534098, 2329836, 2362984, 2347322, 2315482, 2392596, 2432292, 2466852, 2544212, 2448861, 2345286, 2244127, 2189244, 2125525, 2055246, 2118377, 2201829, 2202026, 2087957, 2236136, 2159697, 2109661, 2175931, 2127406, 2160635, 2283946, 2240673, 2135732, 2178056, 2325148, 2292712]
14014B292712l3785n2205j35044j93291q692l528P2494J22527J14224O075q3653
14003B097834r1361J09968j2155j53870Q5343J76207o5659k10569j94792k03390
13993A537556n2064K13426N7311j0909R1134N1820N2167k42247j26858J53873
13983A725209J43743L1530o5698q8034K636K2600j38323K28618J27685k08037
13973A781929j64378p1550K8826J16794P4565K2409j58591j01111j32294Q731
13963A405330K522R1155M7579L9270R1267J9324q9773j12506o5516j0498Q8419
13952A506573P1853M1063J7687k52j19402Q889o8345j94048j06899J09250J58250
13941A424619j11453J4507J6264p9050k4707J94275J60878R2622r3078j08872
$$ y = [2292712, 2258927, 2206722, 2071678, 1878387, 1869695, 1866167, 1938661, 2061188, 2175412, 2181487, 2097834, 2006473, 2116441, 2104286, 1950416, 2035759, 2211966, 2146307, 1935738, 1740946, 1537556, 1485492, 1698918, 1756229, 1745320, 1836454, 1888274, 1940441, 1698194, 1571336, 1725209, 1868952, 1900482, 1834784, 1746750, 1749386, 1771986, 1633663, 1862281, 1989966, 1781929, 1617551, 1546001, 1574827, 1691621, 1766186, 1788595, 1630004, 1528893, 1396599, 1405330, 1407852, 1499007, 1546586, 1585856, 1677123, 1696447, 1606674, 1494168, 1428652, 1418154, 1506573, 1578426, 1619489, 1637176, 1636924, 1517522, 1526411, 1458066, 1264018, 1157119, 1266369, 1424619, 1313166, 1327673, 1343937, 1264887, 1240180, 1434455, 1595333, 1687955, 1594877, 1486005]
13931A486005j48706o3511J8942L4753j12481J76720J15815J5572L0086j22556
13921A430639m2626J25177K82537K3636m964l49015k28647J58039J08547j5494
13911A487829j28531k90330n422J54486J30497l0500L6566p9264k4470J32562
13901A383423P5750Q0977o76q1400r2356r2482l8000L2573M6365k0944j246j31015
13889A160969L8937p2034j01563N3176J57444J45968Q272m7040m6227j78051O7889
13878A187740N8239Q3976j56282N9729L7650o7675j05199n0110J31814K0057n9499
13867A140440j01852j12918R3613N5467J6690Q170J62728q7109k14316J37684
13857A098597P2360j25610n4896J32828J1211K8896O7673k6093q2703n7043J00223
$$ y = [1486005, 1337299, 1273788, 1292730, 1327483, 1215002, 1391722, 1507537, 1523109, 1553195, 1430639, 1388013, 1513190, 1795727, 1819363, 1814399, 1465384, 1236737, 1394776, 1503323, 1487829, 1359298, 1068968, 1063546, 1218032, 1348529, 1318029, 1354595, 1275331, 1250861, 1383423, 1459173, 1540150, 1539474, 1458074, 1365718, 1273236, 1235236, 1267809, 1314174, 1293230, 1291984, 1160969, 1199906, 1127872, 1026309, 1079485, 1236929, 1382897, 1391169, 1344129, 1297902, 1119851, 1187740, 1245979, 1329955, 1173673, 1233402, 1271052, 1203377, 1098178, 1048068, 1179882, 1199939, 1140440, 1038588, 925670, 1019283, 1074750, 1091440, 1099610, 1262338, 1175229, 960913, 1098597, 1170957, 1045347, 990451, 1123279, 1134490, 1163386, 1231059, 1204966, 1122263, 1065220, 1165443]
13846A165443j2443j82507n3357J59195J49304R4905N049k08637q5469O5944J20852
13835A218279l1071j266k7460j70742m7347j00035R099m25K9050Q8808j25821
13824H41069j17704Q5437l4040K8801K08494N341j72081j95141J0159J57842M6201
13813H64378Q4591P9368P6512k9723o2336J60638q3292k03742J04467p7774j12636
13802H00451M064p676J8542Q2700K9805J54643j78217k6913o3637P114J41018
13791I61894j7810j81043j0196r7538J29535r4866R954r18K8698L2444j40050
13780F20104m6175j17641o213P6148O498J71122j25210J81705K24709j50665k77954
13769E56428j635k6254j6086K6455K2543N6606j03121k9861O8010J02553m93M2288
$$ y = [1165443, 1153000, 970493, 917136, 1076331, 1225635, 1320540, 1325589, 1116952, 1031483, 1097427, 1218279, 1187208, 1185942, 1158482, 987740, 940393, 840358, 849457, 849032, 878082, 966890, 841069, 723365, 808802, 774762, 803563, 1012057, 1017398, 845317, 650176, 660335, 818177, 864378, 948969, 1028337, 1104849, 1075126, 1012790, 1173428, 1090136, 886394, 990861, 913087, 800451, 804515, 796839, 815381, 898081, 927886, 1082529, 904312, 877399, 813762, 820876, 961894, 944084, 763041, 752845, 655307, 784842, 689976, 699930, 699012, 727710, 760154, 620104, 573929, 456288, 450075, 526223, 532721, 703843, 578633, 760338, 985047, 834382, 556428, 554793, 528539, 512453, 538908, 561451, 618057, 514936, 485075, 553085, 655638, 655145, 697433]
13757F97433k5281q8355J0049n2161N7292J6846q4058K1865O9658m7511K3348
13746E99125k3382P4567j1624J9678P9828m6136N2861J05210m7565j39061J0755
13735F74256J2512q4882j84965K13039m1830k28387j32689j26176R512K15138
13725C25528J40608J36681k1600l6769R6118O5278m7290J7360J93723p2047j10620
13714F86970j38996n4869r090l7866r401M6761O7359j4178J5467N078J9436l0105
13702E46566q8142p6039L9320J82428K04513L4107j31391r3824Q7600r7474n6065
13691E51599Q7354J0882j80031m6384J19674M1577n7514P6080J11658J2653p6036
13680F51512j87421j671J41241m146j09232Q2410J02801q7706n6667P0986P608
$$ y = [697433, 672152, 583797, 593846, 541685, 598977, 615823, 531765, 553630, 623288, 575777, 599125, 575743, 650310, 638686, 658364, 738192, 692056, 744917, 850127, 802562, 663501, 674256, 686768, 601886, 416921, 629960, 588130, 359743, 227054, 100878, 110390, 325528, 466136, 602817, 581217, 544448, 640566, 705844, 658554, 675914, 869637, 797590, 686970, 547974, 493105, 484015, 446149, 436748, 483509, 550868, 536690, 552157, 557235, 576671, 546566, 458424, 382385, 421705, 604133, 808646, 842753, 711362, 617538, 705138, 607664, 551599, 638953, 649835, 469804, 423420, 543094, 584671, 527157, 603237, 714895, 727548, 651512, 464091, 462420, 603661, 599515, 490283, 572693, 675494, 587788, 531121, 602107, 609715]
13669F09715L8517M8133K7903M3358K6630p6946o4734m0728j664n0428j07492
13658D52264K7869m8820O1336J8915r9268K7583N8262o5907q9473n4219M3314
13647C31856O01j6049J25944O9141L4466J9812l0644q324q3916o5420K7946K219
13635D07632K7443j7489K1925J38311J0849o4586j43688k02126m1727J26137O8957
13624C31638L1815M2458J06017j70254r7758r5741R1889k7171k06071J32578K45904
13613C85304J0600Q5910p0874k49351j83707o1324K04701J89907J15999j6904
13603D10261o4126J09233Q7514Q9352o7348k03306L3522N7949j51661j26479j63705
13592A1206J05522J91535R3162K5690Q7938J05307m8379K4422j02533q8625N666
$$ y = [609715, 648232, 696365, 724268, 767626, 794256, 717310, 652576, 611848, 610184, 559756, 452264, 480133, 431313, 492649, 511564, 412296, 439879, 498141, 432234, 342761, 288542, 331856, 332457, 316408, 442352, 511493, 545959, 565771, 535127, 526803, 442887, 377467, 405413, 407632, 435075, 417586, 439511, 577822, 588671, 524085, 380397, 178271, 136544, 262681, 331638, 363453, 405911, 511928, 341674, 243916, 148175, 240064, 212893, 6822, 139400, 385304, 395904, 481814, 410940, 161589, -22118, -83442, 121259, 311166, 427165, 410261, 346135, 455368, 542882, 632234, 564886, 361580, 395102, 453051, 301390, 174911, 11206, 116728, 308263, 401425, 427115, 515053, 620360, 571981, 596403, 493870, 405245, 410911]
13581D10911p0563o5092L1168o0883n8580q5569J0106Q6419M1019J04778L4264
13570C77978J87383M8509L8630n1168j60678l8795K04230J25905m1288j83728
13560E06978j53342j68664p7377N8023K62804J44274K6657J19434j69646l6122
13550E13019n9038j2223l9653m9730J53728q7482j45492j07199l6015K24387J00112
13539D54414j54455J7166Q036J09362n1374o7045Q2313j7880q6184N6671j70012
13528A81012j19941j13331J1700J07454N8554J31538K72698R7074r2295j20492
13518D13971n2293O7410J30625L9818j28549k12747j14918m4389R6158K1976q0610
13507A36452K21562J69486P8053J77966l3825p7186j37475R0651P489j30417j24557
$$ y = [410911, 340348, 275256, 306424, 245541, 186961, 101392, 111498, 197917, 238936, 343714, 377978, 565361, 613870, 652500, 601332, 440654, 401859, 606089, 731994, 690706, 506978, 353636, 184972, 107595, 165618, 428422, 572696, 599353, 718787, 549141, 513019, 453981, 441758, 402105, 352375, 506103, 418621, 273129, 165930, 129915, 354302, 454414, 299959, 317125, 325161, 434523, 383149, 316104, 398417, 380537, 294353, 351024, 181012, 61071, -52260, -40560, 66894, 125448, 256986, 529684, 626758, 534463, 413971, 361678, 429088, 559713, 599531, 470982, 258235, 143317, 98928, 195086, 217062, 136452, 358014, 527500, 605553, 783519, 749694, 672508, 535033, 625684, 633173, 502756, 378199]
13496C78199J695j14893M8743K0982J56520K102k31323j31578R215J78848q9963
13485B28547L1415n0241r3916K2292K01317P6599P0153j69868l1258J63724R7026
13474E45790p7266p4461p5384J7976k3957J19404L0334j05701M3563L3158l7741
13463C95715K3520m2741n8287m0415K06482R3284j49554j13507j10216M5204Q5441
13452C34926P4159j23494o5614P9542o7691j52457M9645J3903q2773J01610J49341
13441C11097J17583k3896j7022J21242J23575L3968k2991j09866r7860j14730
13431C21100M1843L0838p3542o7181J13082Q3115j06838k03860J51207j8256r9650
13420A71858Q995J8610k1002j71071m8492R6933L5876J37260m5244j52991k33124
$$ y = [378199, 379894, 265001, 313744, 334726, 491246, 493348, 262025, 130447, 139662, 318510, 228547, 259962, 209721, 115805, 138097, 339414, 416013, 486166, 316298, 285040, 448764, 545790, 468524, 394063, 318679, 336655, 312698, 432102, 462436, 356735, 400298, 433456, 395715, 419235, 376494, 318207, 277792, 484274, 577558, 428004, 314497, 204281, 249485, 334926, 409085, 285591, 219977, 299519, 231828, 79371, 129016, 142919, 60146, 161756, 311097, 428680, 404784, 387762, 509004, 632579, 666547, 643556, 533690, 435830, 321100, 362943, 393781, 320239, 253058, 366140, 449255, 342417, 138557, 289764, 271508, 171858, 180853, 199463, 178461, 7390, -41102, 55831, 91707, 228967, 183723, 30732, -202392]
13409b02392n9375J30292Q3095k5953m9367M1407R8335M2201J31493Q4673l4319
13398B40090o0807L8186j08754o3591L0239n2489Q4835O7683K033j9362J285K24894
13386C84242K000p1570j55537j57337Q172R5848L2399O1450J12301j82155j1092
13375A18721R21J69317J07731r0297j70948j15566J8676J52106J54669o2869q1448
13364B01013J10989Q155k872J69754Q4228j12506J2248R6702J3798j38363j19086
13353C24060o6595k02992j11480R9530J88712j9932p7199L7320j5442J74982K51239
13342E82203j07262k24814p2869K5830k7890K1896O922J80040O5030n8852j69512
13331B20722j16213L9908J20650j68978j46294J01699J99171Q6785k12697q0343
$$ y = [-202392, -261767, -131475, -48380, -74333, -123700, -82293, 16042, 58243, 189736, 274409, 240090, 179283, 217469, 108715, 45124, 75363, 22874, 107709, 175392, 177425, 158063, 159348, 384242, 386242, 314672, 159135, 1798, 9970, 105818, 138217, 199667, 311968, 129813, 118721, 119642, 288959, 396690, 306393, 135445, 19879, 38555, 190661, 345330, 282461, 201013, 312002, 320157, 317285, 487039, 571267, 458761, 471009, 567711, 581509, 443146, 324060, 257465, 54473, -57007, 42523, 231235, 211303, 134104, 171424, 155982, 330964, 582203, 474941, 250127, 177258, 203088, 175198, 197094, 204016, 384056, 449086, 390234, 220722, 104509, 144417, 265067, 96089, -50205, 51494, 250665, 337450, 124753, 44410]
13321D4410J16795n5487j04829n0304K7945J95723O5298q9152k6093L7677j76677
13310a4694l8352m8931l1308R3771N5430q6794J14205L61500R569j94508l9956
13299A79932l1150j11045P275l0780j18547q8625J05630J9882P4266P6294n9576
13288B3556Q9175O300P2738M5943m1547l265K3070o7568O7061J70256p0387L7616
$$ y = [44410, 161205, 105718, 889, -49415, -21470, 174253, 239551, 150399, 124306, 161983, -14694, -53046, -101977, -133285, -39514, 15916, -70878, 43327, 404827, 414396, 219888, 179932, 148782, 37737, 45012, 14232, -104315, -192940, -87310, -67428, 6838, 83132, 23556, 112731, 119031, 191769, 237712, 196165, 192900, 215970, 148402, 215463, 385719, 315332, 352948]
$$ [...]
##END NTUPLES=NMR SPECTRUM
##END=
