##TITLE=Analysis number 322177
Compound Code rh 01431
Project Code adrs
Chemist Name fudan
##JCAMPDX= 6.0         $$ Bruker NMR JCAMP-DX V2.0
##DATA TYPE= NMR SPECTRUM
##DATA CLASS= NTUPLES
##ORIGIN= Bruker BioSpin GmbH
##OWNER= nmr
$$ XWIN-NMR		Version 3.5
$$ Fri Sep 15 11:35:05 2006 GMT Daylight Time (UT+1h)  MAYBRIDGE\nmr@NMR_250MHZ
##.OBSERVE FREQUENCY= 250.131544655141
##.OBSERVE NUCLEUS= ^1H
##.ACQUISITION MODE= SIMULTANEOUS (DQD)
##.ACQUISITION SCHEME= undefined
##.AVERAGES= 16
##.DIGITISER RES= 18
##SPECTROMETER/DATA SYSTEM= dpx250
##.PULSE SEQUENCE= zg30
##.SOLVENT NAME= DMSO
##.SHIFT REFERENCE= (INTERNAL, DMSO, 0, 16.522)
##AUDIT TRAIL= $$ (NUMBER, WHEN, WHO, WHERE, WHAT)
$$ ##TITLE= Audit trail, XWIN-NMR		Version 3.5
$$ ##JCAMPDX= 5.01
$$ ##ORIGIN= Bruker BioSpin GmbH
$$ ##OWNER= nmr
$$ C:\u/data/dgb/nmr/ADRS/790/pdata/1/auditp.txt
$$ ##AUDIT TRAIL=  $$ (NUMBER, WHEN, WHO, WHERE, WHAT)
(   1,<2006-09-15 11:34:23.69 +100>,<MAYBRIDGE\nmr>,<NMR_250MHZ>,
      <created by zg, POWCHK disabled, PULCHK disabled
       configuration hash MD5:
       E2 DF 36 D8 04 B2 41 60 5A D7 A3 38 5A 4B D0 FE
       data hash MD5: 64K
       7C 36 43 63 02 EA 09 51 34 ED 3F 04 2C 7A 61 39>)
(   2,<2006-09-15 11:34:41.41 +100>,<MAYBRIDGE\nmr>,<NMR_250MHZ>,
      <Start of raw data processing
       ef LB = 0.3 FT_mod = 6 PKNL = 1 SI = 32K 
       data hash MD5: 32K
       F4 88 F8 1F 70 77 56 F8 12 5C E7 0A 2B 7D 95 17>)
(   3,<2006-09-15 11:34:44.53 +100>,<MAYBRIDGE\nmr>,<NMR_250MHZ>,
      <apk 
       data hash MD5: 32K
       2D 32 DD 1D D8 26 EB 59 7F 17 21 C5 9F E7 2B D8>)
(   4,<2006-09-15 11:34:46.68 +100>,<MAYBRIDGE\nmr>,<NMR_250MHZ>,
      <abs ABSG = 5 
       data hash MD5: 32K
       BA 59 0F A2 90 4D AB 6E 70 D3 50 C7 7E CD 8B 28>)
$$ ##END=
$$ 
$$ hash MD5
$$ A6 33 E4 ED CE 6C 49 87 15 03 BE 39 72 AD 93 06
##$RELAX= 
##$RELAX= 
##$RELAX= 
##$RELAX= 
##$RELAX= 
##$RELAX= 
##$RELAX= 
$$ Bruker specific parameters
$$ --------------------------
##$DU= <C:\u>
##$EXPNO= 790
##$NAME= <ADRS>
##$PROCNO= 1
##$TYPE= <nmr>
##$USER= <dgb>
##$AMP= (0..31)
100 100 100 100 100 100 100 100 100 100 100 100 100 100 100 100 100 100 
100 100 100 100 100 100 100 100 100 100 100 100 100 100 
##$AQSEQ= 0
##$AQ_mod= 3
##$AUNM= <au_zg>
##$AUTOPOS= <47 >
##$BF1= 250.13
##$BF2= 250.13
##$BF3= 250.13
##$BF4= 250.13
##$BF5= 500.13
##$BF6= 500.13
##$BF7= 500.13
##$BF8= 500.13
##$BYTORDA= 1
##$CFDGTYP= 0
##$CFRGTYP= 5
##$CHEMSTR= <none>
##$CNST= (0..31)
1 1 145 1 1 1 1 1 1 1 1 1 1 1 1 1 1 1 1 1 1 1 1 1 1 1 1 1 1 1 1 1 
##$CPDPRG= <>
##$CPDPRG1= <>
##$CPDPRG2= <>
##$CPDPRG3= <>
##$CPDPRG4= <mlev>
##$CPDPRG5= <mlev>
##$CPDPRG6= <mlev>
##$CPDPRG7= <mlev>
##$CPDPRG8= <mlev>
##$CPDPRGB= <>
##$CPDPRGT= <>
##$D= (0..31)
0 1 0 0 0 0 0 0 0 0.06 0 0 0 0 0 0 0.0002 0 0 0 0 0 0 0 0 0 0 0 0 0 0 
0 
##$DATE= 1158316462
##$DBL= (0..7)
120 120 120 120 120 120 120 120 
##$DBP= (0..7)
150 150 150 150 150 150 150 150 
##$DBP07= 0
##$DBPNAM0= <>
##$DBPNAM1= <>
##$DBPNAM2= <>
##$DBPNAM3= <>
$$ [...]
##$SUBNAM7= <"">
##$SUBNAM8= <"">
##$SUBNAM9= <"">
##$SW= 20.6930455092707
##$SWIBOX= (0..15)
0 0 3 0 0 0 0 0 0 0 0 0 0 0 0 0 
##$SW_h= 5175.983436853
##$TD= 65536
##$TD0= 1
##$TE= 295.16
##$TE2= 300
##$TE3= 300
##$TEG= 300
##$TL= (0..7)
0 120 120 120 120 120 120 120 
##$TP= (0..7)
150 150 150 150 150 150 150 150 
##$TP07= 0
##$TPNAME0= <>
##$TPNAME1= <>
##$TPNAME2= <>
##$TPNAME3= <>
##$TPNAME4= <>
##$TPNAME5= <>
##$TPNAME6= <>
##$TPNAME7= <>
##$TPOAL= (0..7)
0.5 0.5 0.5 0.5 0.5 0.5 0.5 0.5 
##$TPOFFS= (0..7)
0 0 0 0 0 0 0 0 
##$TUNHIN= 0
##$TUNHOUT= 0
##$TUNXOUT= 0
##$USERA1= <user>
##$USERA2= <user>
##$USERA3= <user>
##$USERA4= <user>
##$USERA5= <user>
##$V9= 5
##$VALIST= <valist>
##$VCLIST= <CCCCCCCCCCCCCCC>
##$VD= 0
##$VDLIST= <DDDDDDDDDDDDDDD>
##$VPLIST= <PPPPPPPPPPPPPPP>
##$VTLIST= <TTTTTTTTTTTTTTT>
##$WBST= 1024
##$WBSW= 4
##$XGAIN= (0..3)
0 0 0 0 
##$XL= 0
##$YL= 0
##$YMAX_a= 350548
##$YMIN_a= -357866
##$ZGOPTNS= <>
##$ZL1= 120
##$ZL2= 120
##$ZL3= 120
##$ZL4= 120
##$ABSF1= 16.522
##$ABSF2= -4.171173
##$ABSG= 5
##$ABSL= 3
##$ALPHA= 0
##$AQORDER= 0
##$ASSFAC= 0
##$ASSFACI= 0
##$ASSFACX= 0
##$ASSWID= 0
##$AUNMP= <proc_1d>
##$AZFE= 0.1
##$AZFW= 0.1
##$BCFW= 0
##$BC_mod= 0
##$BYTORDP= 0
##$COROFFS= 0
##$CY= 12.5
##$DATMOD= 1
##$DC= 0
##$DFILT= <>
##$DTYPP= 0
##$F1P= 14.0000005364418
##$F2P= -0.99999901652339
##$FCOR= 0.5
##$FTSIZE= 32768
##$FT_mod= 6
##$GAMMA= 0
##$GB= 0
##$INTBC= 1
##$INTSCL= 1
##$ISEN= 128
##$LB= 0.3
##$LEV0= 0
##$LPBIN= 0
##$MAXI= 10000
##$MC2= 0
##$MEAN= 0
##$ME_mod= 0
##$MI= 0
##$NCOEF= 0
##$NC_proc= -3
##$NLEV= 6
##$NOISF1= 0
##$NOISF2= 0
##$NSP= 0
##$NTH_PI= 0
##$NZP= 0
##$OFFSET= 16.522
##$PC= 1
##$PHC0= 137.0992
##$PHC1= 7.352008
##$PH_mod= 1
##$PKNL= yes
##$PPARMOD= 0
##$PSCAL= 4
##$PSIGN= 0
##$REVERSE= no
##$SF= 250.13
##$SI= 32768
##$SIGF1= 0
##$SIGF2= 0
##$SINO= 400
##$SIOLD= 32768
##$SREGLST= <1H.DMSO>
##$SSB= 0
##$STSI= 32768
##$STSR= 0
##$SW_p= 5175.98343685301
##$SYMM= 0
##$S_DEV= 0
##$TDeff= 65536
##$TDoff= 0
##$TI= <Analysis number 999999
Compound Code 99
Book Reference 9
Project Code 9>
##$TILT= no
##$TM1= 0
##$TM2= 0
##$TOPLEV= 0
##$USERP1= <user>
##$USERP2= <user>
##$USERP3= <user>
##$USERP4= <user>
##$USERP5= <user>
##$WDW= 1
##$XDIM= 32768
##$YMAX_p= 335066790
##$YMIN_p= -108324
$$ End of Bruker specific parameters
$$ ---------------------------------
##NTUPLES= NMR SPECTRUM
##VAR_NAME=  FREQUENCY,     SPECTRUM/REAL,   SPECTRUM/IMAG
##SYMBOL=    X,             R,               I
##VAR_TYPE=  INDEPENDENT,   DEPENDENT,       DEPENDENT
##VAR_FORM=  AFFN,          ASDF,            ASDF
##VAR_DIM=   32768,         32768,           32768
##UNITS=     HZ,            ARBITRARY UNITS, ARBITRARY UNITS
##FACTOR=    0.157963299565203, 1,           1
##FIRST=     4132.6476996994, 0,             0
##LAST=      -1043.33573715361, 0,           0
##MIN=       -1043.33573715361, -108324,     0
##MAX=       4132.6476996994, 335066790,     0
$$ Real data points
##PAGE= N=1
##DATA TABLE= (X++(R..R)), XYDATA
$$ [...]
15262h84r437J204K2274R4j5562r822Q74m121l815J124k782K013O286Q456j284
$$ -884 -10321 -9117 13157 13251 -2311 -12133 -11259 -15380 -19195 -18071 -20853 -18840 -12554 -4098 -5382
15247e382N77m043n768L260J3635N838o110N26j627J484J318M006n115j4422N36
$$ -5382 -4805 -8848 -14616 -11356 2279 8117 2007 2533 906 2390 3708 7714 2599 -11823 -11287
15232a1287J3416l952q514M929l138r545j2608K18L538N536O284l592J2274m674
$$ -11287 2129 -1823 -10337 -5408 -8546 -18091 -30699 -30481 -26943 -21407 -15123 -18715 -6441 -11115
15218a1115j0461Q741P692J593K821L688L359l791l724j0971K59J0179L695k0236
$$ -11115 -21576 -12835 -5143 -3550 -729 2959 6318 2527 -1197 -12168 -11909 -1730 1965 -18271
15204a8271q237J7037R652j1655P193J0780j323j0990J290J397l632M332Q301
$$ -18271 -26508 -9471 181 -11474 -4281 6499 5176 -5814 -4524 -3127 -6759 -2427 5874
15191E874J1119r938j0081J421q300K441r968N487Q364K540l89o473q033o895
$$ 5874 16993 7055 -3026 -1605 -9905 -7464 -17432 -11945 -3581 -1041 -1430 -7903 -15936 -22831
15177b2831P881J2519J3570j406m893j262p068M139m893J83K076O93L998L492
$$ -22831 -14950 -2431 11139 9733 4840 3578 -3490 649 -4244 -4061 -1985 -1292 2706 6198
15163F198K45l073k055J0479m917p393P563N207K760O586j5873L096p244j3595
$$ 6198 6443 3370 1315 11794 6877 -516 7047 12254 15014 21600 5727 8823 1579 -12016
15149a2016o547J385n097J532J2012o795q47J0671o922q567R320o2j9262J92J1676
$$ -12016 -18563 -17178 -22275 -20743 -8731 -15526 -16373 -5702 -12624 -21191 -11871 -11933 -31195 -31003 -19327
15134a9327j123r79O26N104Q590j229R590L036j1009m483m05L254P370P660m881
$$ -19327 -20450 -21429 -20803 -15699 -7109 -8338 1252 4288 -6721 -11204 -11609 -8355 -985 6675 1794
15119A794k0923m208M314J662K056J272m586j7090L666K2206R857M672j5774j1912
$$ 1794 -19129 -23337 -19023 -17361 -15305 -14033 -18619 -35709 -32043 -9837 20 4692 -11082 -22994
15105b2994K1765o972q702p110o337N677J2875P515J2250J3941q080o487n311
$$ -22994 -1229 -8201 -16903 -24013 -30350 -24673 -11798 -4283 7967 21908 13828 7341 2030
15092B030J2119J294j257O92q658J4550k122j3510j0039L11l462L421j0154N821
$$ 2030 14149 15443 14186 14878 6220 20770 18648 5138 -4901 -4590 -8052 -4631 -14785 -8964
15078h964N211Q031J668J7752O033j0691j5225j3144M057l274J1892k679p034
$$ -8964 -3753 4278 5946 23698 29731 19040 3815 -9329 -5272 -8546 3346 667 -6367
15065f367Q490P060m447q43J10r101p384L184o619O969N905j075n707J639K64
$$ -6367 2123 9183 4736 3893 4003 -5098 -12482 -9298 -15917 -8948 -3043 -4118 -9825 -8186 -7922
15050g922R201M400J975J514n552j635L767J5335j226o434L197J196p074N690
$$ -7922 1279 5679 7654 9168 3616 1981 5748 21083 19857 13423 16620 17816 10742 16432
15036A6432q297o623J3223K066k136m661p467Q610M54p858m140N646M9k0418k21
$$ 16432 8135 1512 14735 16801 14665 10004 2537 11147 11601 3743 -397 5249 5298 -15120 -15341
15021a5341J5345N803m38p176r268j414K163j1225P370J4981K259p187n996J631
$$ -15341 4 5807 5369 -1807 -11075 -12489 -10326 -21551 -14181 800 3059 -4128 -10124 -8493
15007h493j037q797j08J0553Q555r27J018J5619p192q418r250j697J8849J2487
$$ -8493 -9530 -18327 -18435 -7882 673 -254 764 16383 9191 773 -8477 -10174 8675 21162
14993B1162p371j3655K468k133P261r44n674l319p187J058K738P069L092q011
$$ 21162 13791 136 2604 471 7732 6788 1114 -2205 -9392 -8334 -5596 1473 4565 -3446
14979c446j6890j7705J7156J5741o626n635K717J0896J6068j2915j5495j331L542
$$ -3446 -20336 -38041 -20885 -5144 -11770 -17405 -14688 -3792 12276 -639 -16134 -17465 -13923
14966a3923K1780L958k359j2221k387L514K01m396Q023m948j3647J434J897K1228
$$ -13923 7857 11815 9456 -2765 -5152 -1638 -1437 -5833 2190 -2758 -16405 -14971 -13074 8154
14952H154L934q671j1596N818K927O40p222M33M250R371j796m30j4872l928r985
$$ 8154 12088 3417 -8179 -2361 566 1206 -6016 -5583 -1333 8038 6242 5812 -9060 -12988 -22973
14937b2973P776Q325O98o7Q149J4049p700j7911j131P795J2855l003j4143j3202
$$ -22973 -15197 -6872 -6174 -6241 1908 15957 8257 -9654 -10785 -2990 9865 6862 -7281 -20483
14923b0483J0685o52j3670o587N070O457P501P104J267j2110k0100J9321J2454
$$ -20483 -9798 -10450 -24120 -30707 -25637 -19180 -11679 -4575 -3308 -15418 -35518 -16197 -3743
14910c743O676j4188m198P864J363j112j52K40m543m552j774M818J851m225k200
$$ -3743 2933 -11255 -15453 -7589 -6226 -7338 -7490 -7250 -11793 -16345 -18119 -13301 -11450 -15675 -17875
14895a7875N573k132Q255L600L834J1379M604n890j3064n025K409j1580j1865
$$ -17875 -12302 -14434 -6179 -2579 1255 12634 17238 11348 -1716 -6741 -4332 -15912 -27777
14882b7777l861J6897Q865j3655p867J9007J064k485O44R188l830l612K753p498
$$ -27777 -31638 -14741 -5876 -19531 -27398 -8391 -7327 -9812 -9168 20 -3810 -7422 -4669 -12167
14868a2167M407q532j0871J1141J0783k854k774J567m921n676J0404n669l131
$$ -12167 -7760 -16292 -27163 -16022 -5239 -8093 -10867 -9300 -14221 -19897 -9493 -15162 -18293
14855a8293Q818R212r265j5097j23N054J921M441J6693J0188j6649o660n433n102
$$ -18293 -9475 -263 -9528 -24625 -24748 -19694 -17773 -13332 3361 13549 -3100 -9760 -15193 -20295
14841b0295K574K5509R257k4825j0471J0277l453r367J950J8666L772j3337j3899
$$ -20295 -17721 7788 17045 -7780 -18251 -7974 -11427 -20794 -18844 -178 3594 -9743 -23642
14828b3642l169N137j1081L647K2172k056r507P75N9R195q34o634j10o252j9506
$$ -23642 -26811 -21674 -32755 -29108 -6936 -8992 -18499 -17724 -17665 -8470 -9304 -15938 -16048 -22300 -41806
14813d1806J211O947J4872l682k0247R998P987j2885j18J94J95n90N444R826N345
$$ -41806 -40595 -33648 -18776 -22458 -42705 -32707 -24720 -37605 -37723 -37529 -37334 -37924 -32480 -22654 -17309
14798a7309J785q425R29M583J0286M98k045m70R754q369j2732n485O745Q295p959
$$ -17309 -15524 -23949 -23020 -18437 -8151 -7653 -9698 -10168 -414 -8783 -21515 -27000 -20255 -11960 -19919
14783a9919J0545N151O124N792q621q846Q891K894l269l65l256o590J531R053
$$ -19919 -9374 -4223 1901 7693 -928 -9774 -883 2011 -1258 -1623 -4879 -11469 -9938 -885
14769h85p271j6862J7445M491o674n840p977J3249K2155J934m137j7171o943J658
$$ -885 -8156 -25018 -7573 -3082 -9756 -15596 -23573 -10324 11831 13765 9628 -7543 -14486 -12828
14755a2828l791O85M064J773O203M107q238J899M840O610L466m161q230K192N858
$$ -12828 -16619 -15934 -11870 -10097 -3894 213 -8025 -6126 -1286 5324 8790 4629 -3601 -1409 4449
14740D449r844r590m281K793J2536L5p740k83L086q91K08J2779Q553m82n902r592
$$ 4449 -5395 -14985 -19266 -16473 -3937 -3902 -11642 -11925 -8839 -9730 -9522 3257 11810 11328 5426 -4166
14724d166q806m575p167K2678J0317j752o807K137K923N224l355l40L845k370
$$ -4166 -12972 -17547 -24714 -2036 8281 6529 -278 1859 4782 10006 6651 6311 10156 7786
14710G786k369M725p691m658N656P546l578j10P727K954j0147j2990N126J113
$$ 7786 5417 10142 2451 -2207 3449 10995 7417 7307 15034 17988 7841 -5149 -23 1090
14696A090q647q040m491J0491J4378K838J747p862m197j1373m402Q411N690J3657
$$ 1090 -7557 -15597 -20088 -9597 4781 7619 9366 1504 -2693 -14066 -18468 -10057 -4367 9290
14682I290K519N57p258k1347j2843K067J8177P456M07p877J1973J2022j0098q238
$$ 9290 11809 12366 5108 -16239 -29082 -27015 -8838 -1382 -975 -8852 3121 15143 5045 -3193
14668c193n125N164j954O389P285M91q072r094J063O877J3174L411J238k066m383
$$ -3193 -8318 -3154 -5108 1281 8566 9057 985 -8109 -7046 -169 13005 16416 17654 15588 11205
14653A1205m496j6147j1208l627L195P502J1789j292J093j0157N574M681r987
$$ 11205 6709 -9438 -20646 -24273 -21078 -13576 -1787 -3079 -1986 -12143 -6569 -1888 -11875
14640a1875o403o058J0246J7692K273j0417r139Q371J1429J579m076o817k592
$$ -11875 -18278 -24336 -14090 3602 5875 -4542 -13681 -5310 6119 7698 3622 -3195 -5787
14627e787J5801l634J086q058J166p510r534J661P441J2654J0874k050j3954M183
$$ -5787 10014 6380 7466 -592 574 -6936 -16470 -14809 -7368 5286 16160 14110 156 4339
14613D339m53p405r997L188J3617J1948q86Q68j1002p832K99J4984m001K080o624
$$ 4339 3886 -3519 -13516 -10328 3289 15237 14351 15219 4217 -3615 -3316 11668 7667 9747 3123
14598C123Q137k761j0462p692m86P884O432q323q037K085R446k860k528J5509
$$ 3123 11260 8499 -1963 -9655 -10141 -2257 4175 -4148 -12185 -10100 -654 -3514 -6042 9467
14584I467K075o967m588l742O60l145K601J5736J2619j0569j6468q685j942k664
$$ 9467 11542 4575 -13 -3755 -3095 -6240 -3639 12097 24716 14147 -2321 -11006 -12948 -15612
14570a5612M996J4286L647j498J1083n835p036j22K511J503n999r892L64p627
$$ -15612 -10616 3670 7317 5819 16902 11067 4031 3909 6420 7923 1924 -7968 -7604 -15231
14556a5231n23l955j1175O865K1076R895j5645L758J2548k045j8871p158Q619
$$ -15231 -15754 -19709 -30884 -24019 -2943 6952 -8693 -4935 7613 5568 -13303 -20461 -11842
14543a1842K270r472j870J359K166K751j2248N686J5829j1922k675R586O200j0327
$$ -11842 -9572 -19044 -20914 -19555 -17389 -14638 -26886 -21200 -5371 -17293 -19968 -10382 -4182 -14509
14529a4509l891n129p021J2042N84j571R948N711J36j665k965p065p760q394J789
$$ -14509 -18400 -23529 -30550 -18508 -17924 -19495 -9547 -3836 -3700 -5365 -8330 -15395 -23155 -31549 -29760
14514b9760J9198N618p555L605n461q143J843L847J7362L735o598K409N223p332
$$ -29760 -10562 -4944 -12499 -8894 -14355 -22498 -20655 -16808 554 4289 -2309 100 5323 -2009
14500b009q561q088O13J4249Q397m910M485J3730p790l894J7320J116j4503p517
$$ -2009 -10570 -18658 -18045 -3796 4601 -309 4176 17906 10116 6222 23542 24658 10155 2638
14486B638J487r765r168k607P247Q147j1770J861K270K363m539p760J706n7K213
$$ 2638 4125 -5640 -14808 -17415 -10168 -2021 -13791 -11930 -9660 -7297 -11836 -19596 -17890 -17947 -15734
14471a5734J071J1238k270j0028o707R684J2569l352j5151l041L641J849J1324
$$ -15734 -14663 -3425 -5695 -15723 -22430 -12746 -177 -3529 -18680 -21721 -18080 -16231 -4907
14458d907J4094l081j4474M938n233m952j372J2487M878k208k86l982n224P15
$$ -4907 9187 6106 -8368 -3430 -8663 -13615 -14987 -2500 2378 170 -116 -4098 -9322 -8607
14444h607O183R743k197p996p008qL006K0901K472k784j649Q02r858m998k20L959
$$ -8607 -2424 7319 5122 -2874 -9882 -9890 -6884 14017 16489 13705 12056 12858 3000 -1998 -2218 1741
14428A741Q145j2411p464q215l185k976m834J0904l743N91k795o989N755J3184
$$ 1741 9886 -2525 -9989 -18204 -21389 -24365 -29199 -18295 -22038 -21447 -24242 -31231 -25476 -12292
14414a2292p862q754J4361J5661j834P614j0704j2376l167K4692K2041k093j6791
$$ -12292 -20154 -28908 -14547 1114 -720 6894 -3810 -16186 -19353 5339 27380 25287 8496
14401H496o698R824L317J422j9816j0761j0749j159J4334L384M411J0179l686
$$ 8496 1798 11622 14939 16361 -3455 -14216 -24965 -26124 -11790 -8406 -3995 6184 2498
14388B498q658N39K736l426j1578l439N29J1681n91k910P789o787k055K593j1862
$$ 2498 -6160 -5621 -2885 -6311 -17889 -21328 -20799 -9118 -9709 -12619 -4830 -11617 -13672 -11079 -22941
14373b2941k557j397P567r489J6277j3753o641R793J0345j20P585j628L420P162
$$ -22941 -25498 -26895 -19328 -28817 -12540 -26293 -32934 -23141 -12796 -12916 -5331 -6959 -3539 3623
14359C623j1582o31N259N629R84r930O157K638n0m65r587o565O741J3660r505
$$ 3623 -7959 -8590 -3331 2298 3282 -6648 -491 2147 2097 1632 -7955 -14520 -7779 5881 -3624
14344c624m692K537N439o566M732J885j2070J175R425n99r051J3252J2651J549
$$ -3624 -8316 -5779 -340 -6906 -2174 -289 -12359 -11184 -1759 -2358 -11409 1843 14494 16043
14330A6043l339q437j0268M451J2230o671m419m612P98k483J8514O896o947J684
$$ 16043 12704 4267 -6001 -1550 10680 4009 -410 -5022 -4224 -6707 11807 18703 11756 13440
14316A3440k695O66m818n662j0658P98R689J81n038m904l410n358R141k744O137
$$ 13440 10745 11411 6593 931 -9727 -8929 760 941 -4097 -9001 -12411 -17769 -8628 -11372 -5235
14301e235P26k677R27L995M567L79j7454J550P083J9772m292k5150o580O160J1589
$$ -5235 -4509 -7186 -6259 -2264 2303 2682 -14772 -13222 -6139 13633 9341 -15809 -22389 -16229 -4640
14286d640J789K056l076j5170j649P351J8379J1352n729r50r681m899J601n60
$$ -4640 -2851 -795 -3871 -19041 -20690 -13339 5040 16392 10663 9713 32 -4867 -3266 -3826
14272c826q026M110n329j0208J0582J8132J664o458K367l680p70q975q287M666
$$ -3826 -11852 -7742 -13071 -23279 -12697 5435 7099 641 3008 -672 -1442 -10417 -18704 -14038
14258a4038J6550J4333p497j2420M723p441j4937p769R68J0408K207P423J0849
$$ -14038 2512 16845 9348 -3072 1651 -5790 -20727 -28496 -27528 -17120 -14913 -7490 3359
14245C359N042J5819N34n280k930M622N590j0084l326j1404j0199Q944J81q166
$$ 3359 8401 24220 24754 19474 16544 21166 26756 16672 13346 1942 -8257 687 868 -7298
14231g298k036N200J3212j1269p964K555p247m966R928J2120N754J945J192j4162
$$ -7298 -9334 -4134 9078 -2191 -10155 -7600 -14847 -19813 -9885 2235 7989 9934 11126 -3036
14217c036n084p048n126j140J0899J0548L455j2097o691K039J4194o394k043K633
$$ -3036 -8120 -15168 -20294 -21434 -10535 13 3468 -8629 -15320 -13281 913 -5481 -7524 -4891
14203d891K852m074J0494O996L550k470j5289j1139R084K1594L314P27n436j8554
$$ -4891 -2039 -6113 4381 11377 14927 12457 -2832 -13971 -4887 16707 20021 20748 15312 -3242
14189c242o029p629K095n195k561o16L168l037O818K2137R396m837m01J2901j3244
$$ -3242 -9271 -16900 -14805 -20000 -22561 -23177 -20009 -23046 -16228 5909 15305 10468 10067 22968 9724
14174I724k4982M802j814j0027K641J0098Q882K2218j150j7401J376J471j2823
$$ 9724 -15258 -10456 -12270 -22297 -19656 -9558 -676 21542 20392 2991 4367 5838 -6985
14161f985K01m404l720Q653o044j8340p710M884J1520K340l765J3797j237J43
$$ -6985 -6784 -11188 -14908 -6255 -12299 -30639 -38349 -33465 -21945 -19605 -23370 -9573 -10810 -10667
14147a0667K802j4388K303O528K755q264k779J3343R749J052J268j44j9925q552
$$ -10667 -7865 -22253 -19950 -13422 -10667 -18931 -21710 -8367 1382 2434 3702 3558 -16367 -24919
14133b4919K126O335N231j725m912Q946L552N221M771j2910j6775o247J726N709
$$ -24919 -22793 -16458 -11227 -12952 -17864 -8918 -5366 -145 4626 -8284 -25059 -31306 -29580 -23871
14119b3871O726J0608O439j484Q74J3425K108J017r962k2665J6315J1724O33j7930
$$ -23871 -17145 -6537 -98 -1582 -708 12717 14825 15842 5880 -16785 -470 11254 11887 -6043
14105f043j7440l349L542R008m169L137J0315K476o886N814o675q420J465K998
$$ -6043 -23483 -26832 -23290 -14282 -18451 -15314 -4999 -2523 -9409 -3595 -10270 -18690 -17225 -14227
14091a4227J967O073j983j1362n847J478N850n302p696J1031Q9k631J2004J1035
$$ -14227 -12260 -6187 -8170 -19532 -25379 -23901 -18051 -23353 -31049 -20018 -19929 -22560 -10556 479
14077D79j0830O09j576R236o230M405J559N699n545m63l232o871j7044M448J2403
$$ 479 -10351 -9742 -11318 -2082 -8312 -3907 -2348 3351 -2194 -2657 -5889 -12760 -29804 -25356 -12953
14062a2953M413J300J812m849j1027r513o01n36Q195O260n047L26L567K4250N115
$$ -12953 -8540 -7240 -5428 -10277 -21304 -30817 -31418 -31954 -23759 -17499 -22546 -22220 -18653 5597 10712
14047A0712k0831r283O62K507L711l85l680q56J5550l564L850J0271j0909o333
$$ 10712 -10119 -19402 -18740 -16233 -12522 -12907 -16587 -17443 -1893 -5457 -1607 8664 -2245 -8578
14033h578P582R845L48m319l109j8541N031N475k035l232j1417Q039j79j567j859
$$ -8578 -996 8849 9197 4878 1769 -16772 -11741 -6266 -8301 -11533 -22950 -14911 -15090 -16657 -18516
14018a8516q170p68P270L365N135J0552K579J070J7756m236n628j84j1050L401
$$ -18516 -26686 -27454 -20184 -16819 -11684 -1132 1447 2517 20273 16037 10409 10225 -825 2576
14004B576L678n630k882j9183L708J5971r943l807N432L944M042n226l230j062
$$ 2576 6254 624 -2258 -21441 -17733 -1762 -11705 -15512 -10080 -6136 -2094 -7320 -10550 -11612
13990a1612K714J3394J820j717J092j0305k395J7084K660j2647n711J157p766
$$ -11612 -8898 4496 6316 4599 5691 -4614 -7009 10075 12735 88 -5623 -4466 -12232
13977a2232p910N227M955Q557o82j5107J0794J0944o808K194j0567M994M643j760
$$ -12232 -20142 -14915 -9960 -1403 -2085 -17192 -6398 4546 -2262 -68 -10635 -5641 -998 -2758
13963b758j058j6507J728p152l902K290K5200R356N559p361j4044j3276o665m033
$$ -2758 -3816 -20323 -18595 -25747 -29649 -27359 -2159 7197 12756 5395 -8649 -21925 -28590 -32623
13949c2623K722P171J0397J968M188q393m726J3784R007k425J762l706k328K220
$$ -32623 -29901 -22730 -12333 -10365 -6177 -14570 -19296 -5512 3495 1070 2832 -874 -3202 -982
13935i82j2648l039l691J1176J0824r46n789n362j7607J306J9428J5743R83l905
$$ -982 -13630 -16669 -20360 -9184 1640 694 -5095 -10457 -28064 -26758 -7330 8413 9396 5491
13921E491n692J467o871o781j3525J4823N13p773J0175M120l644N956K986L53
$$ 5491 -201 1266 -5605 -12386 -25911 -11088 -10575 -18348 -8173 -4053 -7697 -1741 1245 1598
13907A598k146n944k341j123K896L417K580l607R492k056j0218k899K928L269
$$ 1598 -548 -6492 -8833 -9956 -7060 -3643 -1063 -4670 4822 2766 -7452 -10351 -7423 -4154
13893d154K862n276K233M339L796m566J135K302k081j540M620R190N361p613j2238
$$ -4154 -1292 -6568 -4335 4 3800 -766 369 2671 590 -950 3670 12860 18221 10608 -1630
13878a630j2394J0256J2795L796k715N330Q365O071J876j0614j0173k090R361
$$ -1630 -14024 -3768 9027 12823 10108 15438 23803 29874 31750 21136 10963 8873 18234
13865A8234p145o791Q121k169K674J976p511j3439P26m976O675J0574L130K641
$$ 18234 11089 4298 12419 10250 12924 14900 7389 -6050 -5324 -10300 -3625 6949 10079 12720
13851A2720j0079l10N78k763o654N013J8163R213j4388r793o776m959M806Q213
$$ 12720 2641 2331 2909 146 -6508 -1495 16668 25881 11493 1700 -5076 -10035 -5229 2984
13837B984N912m476K026L683j155j7834j1463L78M543J4214o145j0411p261j0745
$$ 2984 8896 4420 6446 10129 8974 -8860 -20323 -19945 -15402 -1188 -7333 -17744 -25005 -35750
13823c5750k447K0849Q404J967o557O784O59j274J907L901q781j5280j4143J4323
$$ -35750 -38197 -17348 -8944 -6977 -13534 -6750 -6091 -7365 -5458 -1557 -10338 -25618 -39761 -25438
13809b5438J7226P052J92j0905j0095l991R74j331o570J0572J9081J2043J4536
$$ -25438 -8212 -1160 -968 -11873 -21968 -25959 -24985 -26316 -32886 -22314 -3233 8810 23346
13796B3346J242p622l340q923l158J287j749j988q305L651J666k899J0964n073
$$ 23346 24588 16966 13626 4703 1545 2832 1083 -905 -9210 -5559 -3893 -6792 4172 -901
13782i01m392Q27P941q778j5241j1879P147J5265O436n369q29R690l378q542P599
$$ -901 -5293 -4466 3475 -5303 -20544 -32423 -25276 -10011 -3575 -8944 -9773 -83 -3461 -12003 -4404
13767d404Q251l348k097J498j412j984l667j8178J97N849J387J26J315P29M887
$$ -4404 3847 499 -1598 -100 -1512 -3496 -7163 -25341 -25144 -19295 -17908 -17782 -16467 -15738 -10851
13752a0851j964m343k226K186L977J7356N989R460l622o668j1134M7o448n927
$$ -10851 -12815 -17158 -19384 -17198 -13221 4135 10124 19584 15962 9294 -1840 -1793 -8241 -14168
13738a4168O076N675k063q577L860J4248L812L978Q389j430j0947n104j0434l850
$$ -14168 -8092 -2417 -4480 -13057 -9197 5051 8863 12841 21230 19800 8853 3749 -6685 -10535
13724a0535J0150m857J820m407N126Qj488J119p344j1662K095O783j1028j0288
$$ -10535 -385 -5242 -3422 -7829 -2703 -2695 -4183 -3064 -10408 -22070 -19975 -13192 -24220 -34508
13710c4508j435O642N871Q657J2333Q104j0240j4262o851P670N76p197J396J3831
$$ -34508 -35943 -29301 -23430 -14773 -2440 5664 -4576 -18838 -25689 -18019 -17443 -24640 -23244 -9413
13696i413j054j2002O272R965Q289o916l236n977m003Q777k533m959j1697L490
$$ -9413 -10467 -22469 -16197 -6232 2057 -4859 -8095 -14072 -18075 -9298 -11831 -16790 -28487 -24997
13682b4997J8825o89M982N737J145m504q703r124p528J0500n798Q048K267P802
$$ -24997 -6172 -6861 -1879 3858 5003 499 -8204 -17328 -24856 -14356 -20154 -12106 -9839 -2037
13668b037J353p092m343O833K132O213J0317k300j1082N379K962j649L09k356
$$ -2037 -684 -7776 -12119 -5286 -3154 3059 13376 11076 -6 5373 8335 6686 6995 4639
13654D639O269o200M13m568j0328n438J3257M205j2669q985P040O890J954p930
$$ 4639 10908 4708 5121 553 -9775 -15213 -1956 2249 -10420 -19405 -12365 -5475 -3521 -11451
13640a1451l207j705J68J0299K261J0273m526j0126j768M257M395O205l488o208
$$ -11451 -14658 -16363 -16195 -5896 -3635 6638 2112 -8014 -9782 -5525 -1130 5075 1587 -4621
13626d621j3860m396R310Q411j984O937N716r679j3034j1499K1925N142o949J604
$$ -4621 -18481 -22877 -13567 -5156 -7140 -203 5513 -4166 -17200 -28699 -6774 -1632 -8581 -6977
13612f977k982J721L645j3374q82J2876K0648Q65O892j2605l377j679J791r202
$$ -6977 -9959 -8238 -4593 -17967 -18849 -5973 14675 15540 22432 9827 6450 4771 6562 -2640
13598b640l414q71l54J6844P88J09k454n881p099j1861M57J4021Q105p657l748
$$ -2640 -6054 -6925 -7279 9565 10353 10462 8008 2127 -4972 -16833 -16376 -2355 5750 -1907 -5655
13583e655P281K5379p534j4588n408q094N833N658L882j362j1950k567j437Q552
$$ -5655 1626 27005 19471 4883 -525 -8619 -2786 2872 6754 5392 -6558 -9125 -10562 -2010
13569b010j305M354L247k79J6200L043j4332k3736J0353K2866j864j1071m735
$$ -2010 -3315 1039 4286 4007 20207 23250 8918 -14818 -4465 18401 16537 5466 731
13556G31J5365L610j1405o838M079L117N511j1636k0193M548J4923P504j6512
$$ 731 16096 19706 8301 1463 5542 8659 14170 2534 -17659 -13111 1812 9316 -7196
13543g196n992J3051K2504P02j4605j06M362K14l289O167K769J355j9301N49L790
$$ -7196 -13188 -137 22367 23069 8464 8358 12720 12934 9645 15812 18581 19936 635 1184 4974
13528D974j544n811n097m208J400m197j431O996r124N734Q800N453l565L3R236
$$ 4974 3430 -2381 -7478 -11686 -10286 -14483 -15914 -8918 -18042 -12308 -3508 1945 -1620 -1587 7649
13513G649j2149m283R213M428R172M24L091N375Q720l401l71k985j597L67r520
$$ 7649 -4500 -8783 430 4858 14030 14454 17545 22920 31640 28239 27868 24883 23286 23653 14133
13498A4133o754R373m386o703j2919r995o311N602M304M856o930O308J221k702
$$ 14133 7379 16752 12366 5663 -7256 -17251 -23562 -17960 -13656 -8800 -15730 -9422 -8201 -10903
13484a0903n252j297M57m713J0297K1634N661m539P864j7550q372J5883o326q304
$$ -10903 -16155 -17452 -16995 -21708 -11411 10223 15884 11345 19209 1659 -6713 9170 2844 -5460
13470e460j978n35l569k74j2042J1922J4768m897l77k756O676J1291Q180J004
$$ -5460 -7438 -7973 -11542 -11816 -23858 -11936 2832 -2065 -2442 -5198 1478 12769 20949 21953
13456B1953j0041r003r171j886J95K422O26l612o121j07k308K053J2075l664M165
$$ 21953 11912 2909 -6262 -8148 -7953 -5531 -4905 -8517 -14638 -14745 -17053 -15000 -2925 -6589 -2424
13441b424P905j1968N082K2714p439j6360l481P040q529o056r098q405J2327l886
$$ -2424 5481 -6487 -1405 21309 13870 -2490 -5971 1069 -7460 -13516 -22614 -31019 -18692 -22578
13427b2578P528M897K337P052l043p607o53M787r22K606o671j6680j069R111P203
$$ -22578 -15050 -10153 -7816 -764 -3807 -11414 -12067 -7280 -8202 -5596 -12267 -28947 -30016 -20905 -13702
13412a3702P490j04L159L620o618l412J0495j2397j0073J3440J7640k356M470
$$ -13702 -6212 -6316 -3157 463 -6155 -9567 928 -11469 -21542 -8102 9538 7182 11652
13399A1652j1238Q910J2253N636q760j1536M248N509Q59q929m888K954j3766J0597
$$ 11652 414 9324 21577 27213 18453 6917 11165 16674 17533 8604 3716 6670 -7096 3501
13385C501J0501j4029J81K0939l024l971O333o813j9242j0107K484N025l210q709
$$ 3501 14002 -27 154 21093 18069 14098 20431 13618 -5624 -15731 -13247 -8222 -11432 -20141
13371b0141l223l82L249j352k084Q108k212j785L325O943k990q336j011n829N019
$$ -20141 -23364 -23746 -20497 -21849 -23933 -15825 -18037 -19822 -16497 -9554 -12544 -20880 -21891 -27720 -22701
13356b2701j456J2319Q098L954n372q424j4275n061J0076K558J0580p534N745
$$ -22701 -24157 -11838 -3740 214 -5158 -13582 -27857 -32918 -22842 -20284 -9704 -17238 -11493
13343a1493j2376l444J3082n004l943j771O330N642m790P132l464j704R471o258
$$ -11493 -23869 -27313 -14231 -19235 -23178 -24949 -18619 -12977 -17767 -10635 -14099 -15803 -6332 -12590
13329a2590l514O487o196m607j303P920o873p025K508K564p5k000J0693Q952j428
$$ -12590 -16104 -9617 -15813 -20420 -21723 -13803 -20676 -27701 -25193 -22629 -22704 -24704 -14011 -5059 -6487
13314f487R455Q009k546m752m005j1367j3045M757o317q434J0357J6070k883L016
$$ -6487 2968 10977 8431 3679 -326 -11693 -24738 -19981 -26298 -34732 -24375 -8305 -11188 -8172
13300h172R458p316O314M898r209J778N284k429j1249J482m758j3702r82R078
$$ -8172 1286 -6030 284 5182 -4027 -2249 3035 606 -10643 -9161 -13919 -27621 -28603 -19525
13286a9525M245P99Q250m092O217k713q953p88P022j574r350P939J569J835N924
$$ -19525 -15280 -14481 -6231 -10323 -4106 -6819 -15772 -16560 -9538 -11112 -20462 -12523 -10954 -9119 -3195
13271c195M229k0039O364K917K52k327Q18j6842k310l366Q453P239K640j721l654
$$ -3195 1034 -19005 -12641 -9724 -9472 -11799 -10981 -27823 -30133 -33499 -25046 -17807 -15167 -16888 -20542
13256b0542J0239P9j4269j1129R430P644j3370O365J4667q079K111Q628J168N23
$$ -20542 -10303 -10224 -24493 -35622 -26192 -18548 -31918 -25553 -10886 -18965 -16854 -8226 -7058 -6535
13242f535o965n212J486q652m339J0506Q031j2573R043K0843K331L09L415j7275
$$ -6535 -13500 -18712 -17226 -25878 -30217 -19711 -11680 -24253 -15210 5633 7964 8273 11688 -5587
13228e587j6906N666J3653l032l570k913K89j0184N015P102Q061N760k679j4727
$$ -5587 -22493 -16827 -3174 -6206 -9776 -12689 -12400 -22584 -17569 -10467 -2406 3354 675 -14052
13214a4052o96j95p206m318L991P17j91O173p98M963J5582p443j3749l475N497
$$ -14052 -14748 -14943 -22149 -26467 -22476 -21759 -21950 -15777 -16575 -11612 3970 -3473 -17222 -20697 -15200
13199a5200j5953k849P94r838K0550J6364l892P10r078l16q594M590J3510r795
$$ -15200 -31153 -34002 -33208 -43046 -22496 -6132 -10024 -9314 -18392 -18708 -27302 -22712 -9202 -18997
13185a8997K502Q008J3853K364p263j446n068j2087j3730O713J9638O815J70R75
$$ -18997 -16495 -8487 5366 7730 467 -979 -6047 -18134 -31864 -25151 -5513 1302 1472 2447
13171B447J1028J237q456l001q640k284l3N542L392J135O298p422N789O163o617
$$ 2447 13475 14712 6256 3255 -5385 -7669 -7702 -2160 1232 2367 8665 1243 7032 13195 6578
13156F578l544j0004l466k910p414O030l889m28j0196Q017J0398o989j0242Q950
$$ 6578 3034 -6970 -10436 -13346 -20760 -14730 -18619 -19047 -29243 -21226 -10828 -17817 -28059 -19109
13142a9109N527M341l269N957N915l299q439o503j157N632m064r178j23R275J3007
$$ -19109 -13582 -9241 -12510 -6553 -638 -3937 -12376 -18879 -20036 -14404 -18468 -27646 -27769 -18494 -5487
13127e487L927l986k478R781R38m052K496L268N550J000j7570j8811R183R169
$$ -5487 -1560 -5546 -8024 1757 2695 -1357 1139 4407 9957 10957 -6613 -25424 -16241 -7072
13113g072R004k09j3440J307J920J0756m858o341n105M906k512N605L703l170
$$ -7072 1932 1723 -11717 -10410 -8490 2266 -2592 -8933 -14038 -9132 -11644 -6039 -2336 -5506
13099e506n277J599k624k0126j1223k771J405K5030O112O410l27P844L394q051
$$ -5506 -10783 -9184 -11808 -31934 -43157 -45928 -44523 -19493 -13381 -6971 -7298 546 3940 -4111
13085d111j52j361K973J765j064O098J2405R878K869m464m063l159L796q955M011
$$ -4111 -4263 -5624 -2651 -886 -1950 4148 16553 26431 29300 24836 20773 17614 21410 12455 16466
13070A6466R639j087p527o672j3885q295J553n350m525R50J4186L37l032j0533
$$ 16466 26105 25018 17491 10819 -3066 -11361 -9808 -15158 -19683 -18733 -4547 -4210 -7242 -17775
13056a7775J958k283L389K60J0283M783j4648J0930m808j6113L017J6557l7j0669
$$ -17775 -15817 -18100 -14711 -14451 -4168 615 -14033 -3103 -7911 -24024 -21007 -4450 -4487 -15156
13042a5156p293o012J730J2542Q153Q701J568l615j991k641J852R768K73o044
$$ -15156 -22449 -28461 -26731 -14189 -6036 2665 4233 618 -1373 -4014 -2162 7606 7879 1835
13028A835l388M474R002k959Q338J484j3100j4185o558l614K951k495M15Q822
$$ 1835 -1553 2921 11923 8964 17302 18786 5686 -8499 -15057 -18671 -15720 -18215 -17800 -8978
13014h978Q940j1082j7877L652O719o454J017K5338J991m711O620J5153j2617
$$ -8978 -38 -11120 -28997 -25345 -18626 -25080 -24063 1275 3266 -1445 5175 20328 7711
13001G711j3692K769n914M84K225p793N246K571j1799j3451P596N507j767R098
$$ 7711 -5981 -3212 -9126 -8642 -6417 -14210 -8964 -6393 -18192 -31643 -24047 -18540 -20307 -11209
12987a1209L473J171n398o163k712J1229L216k067P751lM374n078N082O628j2735
$$ -11209 -7736 -6565 -11963 -18126 -20838 -9609 -6393 -8460 -709 -712 3662 -1416 3666 10294 -2441
12972b441k6980j1721P704J7789P284K56M795R48o641j268L021j3399m138P317
$$ -2441 -29421 -41142 -33438 -15649 -8365 -8109 -3314 -2366 -9007 -10275 -7254 -20653 -24791 -17474
12958a7474K582r760l291O021n29J546J2255K149o920o875j2624j0027P200K0860
$$ -17474 -14892 -24652 -27943 -21922 -22451 -20905 -8650 -6501 -13421 -20296 -32920 -42947 -35747 -14887
12944a4887o041j098O658J904J3236K455k161j5151q787Q2l209k194L327J5943
$$ -14887 -20928 -22026 -15368 -13464 -228 2227 66 -15085 -23872 -23790 -26999 -29193 -25866 -9923
12930i923M410j207J2477K925j1162O815j2144q951n927P949O542N481N371j4037
$$ -9923 -5513 -6720 5757 8682 -2480 4335 -7809 -16760 -22687 -14738 -8196 -2715 2656 -11381
12916a1381O82K059o814J0853q510p879k380j0049O987N422K181r927q726Q745
$$ -11381 -10699 -8640 -15454 -4601 -13111 -20990 -23370 -33419 -26432 -21010 -18829 -28756 -37482 -28737
12902b8737O823R063l464m853n115J8273L608j1413p088N108n594M209Q697k445
$$ -28737 -21914 -12851 -16315 -21168 -26283 -8010 -4402 -15815 -22903 -17795 -23389 -19180 -10483 -12928
12888a2928L249J4442K82o475o301o397J729L096r307O477L883O711j342l939
$$ -12928 -9679 4763 5045 -1430 -7731 -14128 -12399 -9303 -18610 -12133 -8250 -1539 -2881 -6820
12874f820K096k390j1908j0459O601q965L423J693J1558J0594n440M930J4483
$$ -6820 -4724 -7114 -19022 -29481 -22880 -31845 -28422 -26729 -15171 -4577 -10017 -5087 9396
12861I396q115o343J554j0233l829m217l333K482O667j696L290p312R035j295
$$ 9396 1281 -5062 -3508 -13741 -17570 -21787 -25120 -22638 -15971 -17667 -14377 -21689 -12654 -13949
12847a3949n248o854o586J0507R120N614j5574j1452J2248J7059N089l51m375
$$ -13949 -19197 -26051 -32637 -22130 -13010 -7396 -22970 -34422 -22174 -5115 -26 -377 -4752
12834d752J2189o029r094j8156j8645O581O709J1418M9R943Q66J0969q701n058
$$ -4752 7437 1408 -7686 -25842 -44487 -37906 -31197 -19779 -19730 -9787 -8921 2048 -6653 -11711
12820a1711j8942J3434J6702R237M124m904l856p835K007l41n212m138J4586M248
$$ -11711 -30653 -17219 -517 8720 12844 7940 4084 -3751 -1744 -2085 -7297 -11435 3151 7399
12806G399J719l53O165j0693j074q928L172q177M16l756K756J2846J489L83l286
$$ 7399 9118 8765 14930 4237 3163 -5765 -2593 -10770 -10354 -14110 -11354 1492 2981 3364 78
12791G8J1172p394q882N650J5254j0130n99J530K326j046l935o984M069M70J281
$$ 78 11250 3856 -5026 624 15878 5748 5149 6679 9005 7959 4024 -2960 1109 1579 2860
12776B860j17p600J733m078n193R67J967l581p355J061N657l223K284R637J444
$$ 2860 2743 -4857 -3124 -7202 -12395 -11428 -9461 -13042 -20397 -19336 -13679 -16902 -14618 -4981 -3537
12761c537j4771O603J3865l492N28R80J442K873J565P5q53Q672K641n270j1675
$$ -3537 -18308 -11705 2160 -1332 -804 176 1618 4491 6056 6131 5278 13950 16591 11321 -354
12746c54r436l342o097R971P905j0617L361K562l397j0412Q915J0023K195n446
$$ -354 -9790 -13132 -19229 -9258 -1353 -11970 -8609 -6047 -9444 -19856 -10941 -918 1277 -4169
12732d169n837r6l477r73Q219N458l148K971q598r378J0131j039j0560l237l996
$$ -4169 -10006 -10102 -13579 -14552 -6333 -875 -4023 -1052 -9650 -19028 -8897 -9936 -20496 -23733 -27729
12717b7729m692J312P464m023L978J2291J1427N545Q432N060n757j0260j1790
$$ -27729 -32421 -31109 -23645 -27668 -23690 -11399 28 5573 14005 19065 13308 3048 -8742
12704h742j529r592l831M276K791m333j0999J442j017l68J1172R531o334j016
$$ -8742 -10271 -19863 -23694 -19418 -16627 -20960 -31959 -30517 -31534 -31902 -20730 -11199 -17533 -18549
12690a8549M773J6750j3315J129J1643L671P797l791p266n349r982J504q120K224
$$ -18549 -13776 2974 -10341 -9212 2431 6102 13899 10108 2842 -2507 -12489 -10985 -19105 -16881
12676a6881N638o358o322M821J2969P903L841j1554Q714N607o204l215j1244L862
$$ -16881 -11243 -17601 -23923 -19102 -6133 1770 5611 -5943 2771 8378 2174 -1041 -12285 -8423
12662h423Q789o957m183P566O95Q87l501L315Q612N393j3260j169O495o266k277
$$ -8423 366 -6591 -10774 -3208 -2513 -1626 -5127 -1812 6800 12193 -1067 -2236 4259 -2007 -4284
12647d284l114o443M413m718l380j4957M728R521Q003p295n855J2452J1095o202
$$ -4284 -7398 -13841 -9428 -14146 -17526 -32483 -27755 -18234 -10231 -17526 -23381 -10929 166 -6036
12633f036m013J796r652p200Q650J7063m958n019K955j2281p303p173O76R524
$$ -6036 -10049 -8253 -17905 -25105 -16455 608 -4350 -9369 -6414 -18695 -25998 -33171 -32495 -22971
12619b2971K4292k458j0684n272J6307k201l492K61l087j0123p454P654n795m757
$$ -22971 1321 -1137 -11821 -17093 -786 -2987 -6479 -6218 -9305 -19428 -26882 -19228 -25023 -29780
12605b9780N731n183K197R433J7043K881K394J1885n231L274m249j5810k468R84
$$ -29780 -24049 -29232 -27035 -17602 -559 2322 4716 16601 11370 14644 10395 -5415 -7883 -6899
12591f899j013L581m732K598l126p30P670q753L553m155R695J3432L295Q981j5068
$$ -6899 -7912 -4331 -9063 -6465 -9591 -10321 -2651 -11404 -7851 -12006 -2311 11121 14416 23397 8329
12576H329r788m215K655j624p278l750k931L016l099L317L51K309J9657k401j4620
$$ 8329 -1459 -5674 -3019 -4643 -11921 -15671 -18602 -15586 -18685 -15368 -15017 -12708 6949 4548 -10072
12561a0072j2994j175M838K865P741r830o162M886n240j1718K958N427n513M742
$$ -10072 -23066 -24241 -19403 -16538 -8797 -18627 -24789 -19903 -25143 -36861 -33903 -28476 -33989 -29247
12547b9247R074J4167P19o125R085o459k767J623n925k60P184m64l428k2720m351
$$ -29247 -20173 -6006 -5287 -11412 -2327 -8786 -11553 -9930 -15855 -16115 -8931 -9395 -12823 -35543 -39894
12532c9894Q901R965M880M975N037O957n585j635O650r489k603J1481K126O235
$$ -39894 -30993 -21028 -16148 -11173 -6136 821 -4764 -6399 251 -9238 -11841 -360 1766 8001
12518H001j0645k686J4070K501m521o589R973L696j2723j442R928K46O578Q080
$$ 8001 -2644 -5330 8740 11241 6720 131 10104 13800 1077 -365 9563 9809 16387 24467
12504B4467o294o755l154J610q703m9q939J772M784L571N90L318J0389P741o381
$$ 24467 18173 11418 8264 9874 1171 1122 -7817 -6045 -1261 2310 2900 6218 16607 24348 17967
12489A7967k614j0304j02P588k412q63O909m103n149R304n923m106m864j167L892
$$ 17967 15353 5049 4947 12535 10123 9260 16169 12066 6917 16221 10298 6192 1328 161 4053
12474D053p012Q466J3778r24r857l095j803o514n127j747J992j850m104M001P150
$$ 4053 -2959 5507 19285 18361 8504 5409 3606 -2908 -8035 -9782 -7790 -9640 -13744 -9743 -2593
12459b593n017k507j565N333K203O17J8504j725m56j6451l307N202O198Q824r577
$$ -2593 -7610 -10117 -11682 -6349 -4146 -3529 14975 13250 12794 -3657 -6964 -1762 4436 13260 3683
12444C683q496k541K882M700l295m489q76o113Q368J1395R429J84p027l283j0292
$$ 3683 -4813 -7354 -4472 228 -3067 -7556 -8432 -14545 -6177 5218 14647 14831 7804 4521 -5771
12429e771p69j1332j946m08J5660L51k0238n876J5557J4975J4780J6120o36KJ318
$$ -5771 -6540 -17872 -19818 -20226 -4566 -4215 -24453 -30329 -14772 203 14983 31103 30467 30469 31787
12414C1787q844j1611q240N13J5559P29J889k007J407m99j6069p237O439K276
$$ 31787 22943 11332 3092 3605 19164 19893 21782 19775 21182 20683 4614 -2623 3816 6092
12400F092N509m600j0743K199J1617Q98n395p830j4984L745k588J3391J4232O641
$$ 6092 11601 7001 -3742 -1543 10074 10972 5577 -2253 -17237 -13492 -16080 -2689 11543 18184
12386A8184Q818R003p193l734J102j840N475L519j3282o203m107q556Q417J2409
$$ 18184 27002 36005 28812 25078 26180 24340 29815 33334 20052 13849 9742 1186 9603 22012
12372B2012m235p2K310O79J381M760J5964M829k770k367J676J1427J0691K405
$$ 22012 17777 17705 20015 20694 22075 26835 42799 47628 44858 42491 44167 55594 66285 68690
12358F8690M899J1411j283j7116j8249l178j319o25J0627p215j7627j5004n590
$$ 68690 73589 85000 83717 66601 48352 45174 43855 43230 53857 46642 29015 14011 8421
12345H421N342J788N451l492J597J5107m171q366k203M409j0049N408J0856K776
$$ 8421 13763 15551 21002 17510 19107 34214 30043 21677 19474 23883 13834 19242 30098 32874
12331C2874L487m70R294n14j534p613j5099q078j299L730O303P273p856j5068
$$ 32874 36361 35891 45185 44671 43137 35524 20425 12347 11048 14778 21081 28354 20498 5430
12317E430L315R865j5582O45L38M909k540m37Q370J3780K8277q94J824L3141L2915
$$ 5430 8745 18610 3028 3673 4011 8920 6380 5943 14313 28093 56370 55476 57300 90441 123356
12302A23356N0921K5932J5931J2976J7612L8149K0748k1383n0793o3375m7105
$$ 123356 174277 200209 216140 229116 246728 284877 305625 284242 233449 170074 122969
12291A22969k1818r144k1280n589M10q523J292j0682M153Q658l713J0686r404
$$ 122969 101151 92007 70727 65138 65548 57025 58317 47635 51788 60446 56733 67419 58015
12278E8015n446N000J3588r12m509N01j0851J867r243k7719J1589K9261l971j4874
$$ 58015 52569 57569 71157 70245 65736 66237 55386 57253 48010 20291 31880 61141 57170 42296
12264D2296m825K534j3274J0730P520L912Q771m612l451J870O921J984q061j0030
$$ 42296 37471 40005 26731 37461 44981 48893 57664 53052 49601 51471 58392 60376 52315 42285
12250D2285l555p25N854J111j85m091j0930q731J979J8615N981R280N955L342
$$ 42285 38730 38005 43859 44970 44785 40694 29764 21033 23012 41627 47608 56888 62843 66185
12236F6185O312q639j3940o754m887j3321M835R205N810J2437K1836o804p767
$$ 66185 72497 63858 49918 43164 38277 24956 29791 38996 44806 57243 79079 72275 64508
12223F4508k946o820p772q261j389M298J2254J3644k971J3484N325K121o169n125
$$ 64508 61562 54742 46970 38709 37320 41618 53872 67516 64545 78029 83354 85475 79306 74181
12209G4181l395N934o677J711n492K535O880J187m822q982N680m1j3681M495J4148
$$ 74181 70786 76720 70043 71754 66262 68797 75677 76864 72042 63060 68740 68699 55018 59513 73661
12194G3661M426j0375k928m963J4496J2562j566n493j1192J149K989j501k917
$$ 73661 78087 67712 64784 59821 74317 86879 85313 79820 68628 69777 72766 71265 68348
12181F8348J6931J1639r097l695l004j1228R846j677m06j744j748J00L006l005
$$ 68348 85279 96918 87821 84126 81122 69894 79740 78063 77657 75913 74165 74265 77271 74266
12167G4266k311L231P033j0065M086J2995R065J6552J895j385j2036M597k689
$$ 74266 71955 75186 82219 72154 76240 89235 98300 114852 116747 115362 103326 107923 105234
12154A05234l094j6456n459N220Q358K346L906R90j1822r005J6491R229R436Q561
$$ 105234 102140 85684 80225 85445 93803 96149 100055 101045 89223 80218 96709 105938 115374 123935
12140A23935L205P73m88q216L091q656L782R390L829j2124J446J8245K865k043
$$ 123935 127140 127913 127425 119209 122300 113644 117426 126816 130645 118521 119967 138212 141077 139034
12126A39034N357K49J3966Q295r50o050p69J2753O743P826K730K412J1290K862
$$ 139034 144391 144640 158606 166901 165951 159901 159132 171885 178628 186454 189184 191596 202886 205748
12112B05748J0198j133K557p747n689R731L038K387Q414k619j207o649j0119N623
$$ 205748 215946 214813 217370 209623 203934 213665 216703 219090 227504 224885 223678 217029 206910 212533
12098B12533J1046p017J2080P077N053P639m876N779K0811J3107L85J827J4598
$$ 212533 223579 216562 228642 235719 240772 248411 243535 249314 270125 283232 283617 285444 300042
12085C00042p81p39J2422q061M313J3148N851J2695K152m14j22J6381K2042N755
$$ 300042 299261 298522 310944 302883 307196 320344 326195 338890 341042 340628 340506 356887 378929 384684
12071C84684k014K260L220J0540J1739J1250M098o006J3242N112N666O02K532
$$ 384684 382670 384930 388150 398690 410429 421679 425777 419771 433013 438125 443791 444393 446925
12058D46925P800J4584k978M296k039N367K2468K9740R950J0716R009J1403K687
$$ 446925 454725 469309 466331 470627 468588 473955 496423 526163 536113 546829 555838 567241 569928
12045E69928O657j249J3318J9113K2191K633O324O392J7061K8406N957J798K880
$$ 569928 576585 575336 588654 607767 629958 632591 638915 645307 662368 690774 696731 698529 701409
12032G01409J4013J6769L5143K2181L4914J5564J2711J8409J8952K3056K6914
$$ 701409 715422 732191 767334 789515 824429 839993 852704 871113 890065 913121 940035
12021I40035K4691M0548K8459K0838K1816K3287N2175M2476M3265M9651M0334
$$ 940035 964726 1005274 1033733 1054571 1076387 1099674 1151849 1194325 1237590 1287241 1327575
12010A327575L8580N2129O1524L8910M2378O2064P6809Q1481R0359P4556P1664
$$ 1327575 1366155 1418284 1479808 1518718 1561096 1623160 1699969 1781450 1871809 1946365 2018029
11999B018029Q3241Q7626R6539R2468J10567J05958J13871J33682J39118J70476
$$ 2018029 2101270 2188896 2285435 2377903 2488470 2594428 2708299 2841981 2981099 3151575
11989C151575J80025J81320J96840K13228K20625K37099K63674K86492L11659
$$ 3151575 3331600 3512920 3709760 3922988 4143613 4380712 4644386 4930878 5242537
11980E242537L20515L52760L91848M21614M33098M69915N11398N54320N97526
$$ 5242537 5563052 5915812 6307660 6729274 7162372 7632287 8143685 8698005 9295531
11971I295531O30588O77569O81131O94663P16724P19094P06896O67306O29826
$$ 9295531 9926119 10603688 11284819 11979482 12696206 13415300 14122196 14789502 15419328
11962A5419328N81811N16245M02202L08502K13262Q7303l3127j46035k97360l77266
$$ 15419328 16001139 16517384 16919586 17228088 17441350 17528653 17495526 17349491 17052131 16674865
11952A6674865m29892m96096n59815n85042n96937o25228o26148o20255n80196
$$ 16674865 16244973 15748877 15189062 14604020 14007083 13381855 12755707 12135452 11555256
11943A1555256n59559n31934n15177m99500m67674m41945m06174l86122l67358
$$ 11555256 10995697 10463763 9948586 9449086 8981412 8539467 8133293 7747171 7379813
11934G379813l47832l18003k84602k69710k57558k48246k32095j92387j82348
$$ 7379813 7031981 6713978 6429376 6159666 5902108 5653862 5421767 5229380 5047032
11925E047032j99445j87673j69491j62388j59104j36617j19320j11858j14442
$$ 5047032 4847587 4659914 4490423 4328035 4168931 4032314 3912994 3801136 3686694
11916C686694j09204j06021j03922j01089r5951q4257q9458r1991r1376r2072
$$ 3686694 3577490 3471469 3367547 3266458 3170507 3086250 2996792 2904801 2813425 2721353
11906B721353q0451q4994p6711o6349p8452o5304n7781n5410n4459n4412m6125
$$ 2721353 2640902 2555908 2479197 2412848 2334396 2269092 2211311 2155901 2101442 2047030 2000905
11895B000905n1842o9651n5245m2828m2075n2430m2810m3775k2327m4162m2474
$$ 2000905 1949063 1879412 1824167 1781339 1739264 1686834 1644024 1600249 1577922 1533760 1491286
11884A491286j9831k0501l0559l4017l0946j1661k9312k9891l7982l3375k3354
$$ 1491286 1471455 1450954 1420395 1386378 1355432 1343771 1314459 1284568 1246586 1213211 1189857
11873A189857j5715m0776l0370m3213j8966j5847k2754k4862k7308k4450l4837
$$ 1189857 1174142 1133366 1102996 1059783 1040817 1024970 1002216 977354 950046 925596 890759
11862H90759l0820k8658k4784O80L933j7066j6496r237q581k5967l5588j478M545
$$ 890759 859939 831281 806497 807177 811110 794044 777548 768311 759730 733763 698175 696697 701242
11849G01242k5811k4735k7523k2348k55q584o558j0144p707j1669r11o919j5219
$$ 701242 675431 650696 623173 600825 600570 591986 585428 575284 567577 555908 554997 548078 532859
11836E32859q365l797n748p846L70j442j4487o265o896m882j6247m951p803j5836
$$ 532859 524494 520697 514949 507103 507473 506031 491544 485279 478383 473501 457254 452303 444500 428664
11822D28664J4626K978k3752k1443r433M81j4271j6442o830N430J1845L909p101
$$ 428664 443290 446268 422516 401073 391640 392121 377850 361408 354578 360008 371853 375762 368661
11809C68661k0700j8479m354M470j911o816j1065j1709R354j066p706r525n40
$$ 368661 347961 329482 325128 329598 327687 320871 309806 298097 307451 306385 298679 289154 288614
11796B88614l157j8564O150N118J369l919k0121j1843K26K522K032J3995j59m280
$$ 288614 285457 266893 273043 278161 279530 275611 255490 243647 243873 246395 248427 262422 262263 257983
11782B57983p941j2161m240o308j0352K71p883j3018p00M045N999L845j4359m286
$$ 257983 250042 237881 233641 227333 216981 217252 209369 196351 195651 199696 205695 209540 195181 190895
11768A90895R078J0413R015J595k0666k7993j5965K977Q559m95q84L853N224j4814
$$ 190895 199973 210386 219401 220996 200330 172337 156372 159349 167908 167413 166529 170382 175606 160792
11754A60792j8144p234J015J0902j019l133J4625j3362j4553R20O020p862m883
$$ 160792 142648 135414 136429 147331 146312 143179 157804 144442 129889 130809 136829 128967 124084
11741A24084Q816J3128r170l484J719J356L7k655r09P473k950j5838l722k51J3525
$$ 124084 132900 146028 136858 133374 135093 136449 136486 133831 132922 140395 137445 121607 117885 117634 131159
11726A31159m41k0203r41J2234j1933j745P552J2577j0956k2218Q03O927L320
$$ 131159 130718 110515 109574 121808 109875 108130 115682 128259 117303 95085 95888 102815 106135
11713A06135L235r94k0271j0983r4J3294J2403l370q652K154J2183p939j1349
$$ 106135 109370 108376 88105 77122 77028 90322 102725 99355 90703 92857 105040 97101 85752
11700H5752K180J697P674L846m143p825j4868p79O80j902O488L174N930J5355
$$ 85752 87932 89629 97303 101149 97006 89181 74313 73534 74214 72312 78800 81974 87904 103259
11686A03259l061j2573j0854j1938J2878J0309q753n363j821K796n513j187p979
$$ 103259 100198 87625 76771 64833 77711 88020 79267 73904 72083 74879 69366 68179 60200
11673F0200q52O53M565J21R026r261K451O196l907p343j278J5868M710K156j7115
$$ 60200 59348 60001 64566 64687 73713 64452 66903 73099 69192 61849 60571 76439 81149 83305 66190
11658F6190j9394j0793K868J3523J2672r145k0099P48Q832q04k763R79P016K655
$$ 66190 46796 36003 38871 52394 65066 55921 35822 36570 45402 44598 41835 42814 49830 52485
11644E2485L062j6446R202K4109Q693O277J1643J149R759m3o221N068N406r47
$$ 52485 55547 39101 48303 72412 81105 87382 99025 100174 109933 109890 103669 108737 114143 113196
11630A13196k8183n612p074k1256j9919j740P383L414J3228J2543k245j653j2469
$$ 113196 85013 79401 72327 51071 31152 29412 36795 40209 53437 65980 63735 62082 49613
11617D9613j6820o187j217K534l728k966P394O050J0867J0491r953j1319m929
$$ 49613 32793 26606 25389 27923 24195 21229 28623 34673 45540 56031 46078 34759 29830
11604B9830K376p492Q209Q072M778j6517r953N061J7882J0517n796M40n014N825
$$ 29830 32206 24714 32923 40995 45773 29256 19303 24364 42246 52763 46967 47407 42393 48218
11590D8218r712J522M506J1298j171j958O658R265r749j2719j1895q621J432P355
$$ 48218 38506 40028 44534 55832 54661 52703 59361 68626 58877 46158 34263 25642 27074 34429
11576C4429k951q034M455J616p812m571N000p406J4282j22j1455L95N418J441
$$ 34429 31478 23444 27899 29515 21703 17132 22132 14726 29008 28886 17431 17826 23244 24685
11562B4685M11O143L823J9295L248M378n291p877Q893O036m042q335j0154N369
$$ 24685 25096 31239 35062 54357 57605 61983 56692 48815 57708 63744 59702 51367 41213 46582
11548D6582j0463J6950L1192J6104J4334K4241M4079Q3716J25667J55809J56616
$$ 46582 36119 53069 84261 100365 114699 138940 183019 266735 392402 548211 704827
11537G04827J40763J13535J01348J12683J07918N0021n5577j52130k10214k10341
$$ 704827 845590 959125 1060473 1173156 1281074 1331095 1275518 1123388 913174 702833
11527G02833j71983j27181q7125n2254l1101k6694j3973j3326j7215j5233j0797
$$ 702833 530850 403669 316544 264290 233189 206495 192522 179196 161981 146748 135951
11516A35951j2459M240j017o47j0254j2603j7315p569n467N738J0337J0154n042
$$ 135951 123492 127732 126715 126068 115814 103211 85896 78327 72860 78598 88935 99089 94047
11503I4047n776P188J0120j6916k5022n514j673J1j0355j4739N457p037Q41R583
$$ 94047 88271 95459 105579 88663 63641 58127 56454 56465 46110 31371 36828 29791 30632 40215
11489D0215N611J10k44J35J4805J613k2260j0421J2376L35p353L86p661P451N896
$$ 40215 45826 45936 45692 45827 60632 62245 39985 29564 41940 42275 34922 35308 27647 35098 40994
11474D0994k943J286k575n587n986r790Q214P83O873P788L982l081r499O909L825
$$ 40994 38051 39337 36762 31175 25189 15399 23613 24396 31269 39057 43039 39958 30459 37368 41193
11459D1193j4769j830L453m355l07j0394j3032K342J537k845J3391m757r512J635
$$ 41193 26424 24594 28047 23692 23385 12991 -41 2301 3838 993 14384 9627 115 1750
11445A750O828M984O98r626m035L912k025j5116o798P400R042Q814m012r134J389
$$ 1750 8578 13562 14260 4634 599 4511 2486 -12630 -19428 -12028 -2986 5828 1816 -7318 -5929
11430e929O571m973m199n522J5164O978k796L873J512K748m929Q87N286k898K024
$$ -5929 642 -4331 -8530 -14052 1112 8090 5294 9167 10679 13427 8498 9385 14671 11773 13797
11415A3797K418p066o680M336N76j3410p668J2628M14N072O715N679J3235j837
$$ 13797 16215 9149 2469 6805 7381 -6029 -13697 -1069 -655 4417 11132 16811 30046 28209
11401B8209k4819n543K58P053L97j5864n65J0267j382j303J5294N405N950n715
$$ 28209 3390 -2153 -1895 5158 5555 -10309 -10874 -607 -1989 -3292 12002 17407 23357 17642
11387A7642J4087K5547J8720p570j4594N205L330q810o806q741p36j5012k1406
$$ 17642 31729 57276 75996 68426 53832 59037 62367 53557 46751 38010 37274 22262 856
11374H56j0184k527j472N959J3738M219K774J1588j2802k0046J0735J2932n803
$$ 856 -9328 -11855 -13327 -7368 6370 10589 13363 24951 12149 -7897 2838 15770 9967
11361I967o376N1J060O04J612k776O641M603m948j1992j86l464q148m989P225
$$ 9967 3591 3642 4702 5306 6918 4142 10783 15386 10438 -1554 -1740 -5204 -13352 -18341 -11116
11346a1116J1099o319j2280K907O09K074m806o823o430J1265Q690k5J1875R782
$$ -11116 -17 -6336 -18616 -15709 -15100 -13026 -17832 -24655 -31085 -19820 -11130 -11155 720 10502
11332A0502l904n400o18J1494M02J5550M66q632L24j1555j6160l708J8937P670
$$ 10502 6598 1198 580 12074 12476 28026 28492 19860 20184 8629 -7531 -11239 7698 15368
11318A5368L143p371Q388m422n798l49p175M33J5080J4765m265p368K09l431j3307
$$ 15368 18511 11140 19528 15106 9308 8959 1784 2217 17297 32062 27797 20429 20638 17207 3900
11303C900J163L609M533j845J271N08p902Q88L93j441j2248R363P557J0860N506
$$ 3900 5063 8672 13205 11360 12631 13139 5237 6125 6518 5077 -7171 2192 9749 20609 26115
11288B6115J4630m170M972M194j82Q91j0029K539N369m23k9097j7520O101J2970
$$ 26115 40745 36575 41547 45741 45559 46450 36421 38960 44329 43906 14809 -2711 3390 16360
11274A6360O148j2574K091o694j151L373K266j722l34J1150J807M208J54j191
$$ 16360 22508 9934 12025 5331 4180 7553 9819 8097 7763 18913 20720 24928 25082 23891
11260B3891N614K483p579n32L796o215J48k104j2701j772R326M262L944K048N672
$$ 23891 29505 31988 24409 23877 27673 21458 21606 19502 6801 5029 14355 18617 22561 24609 30281
11245C0281j574q85j1847j3406o30J1511p094R579J8347M49p20r345l984n488
$$ 30281 28707 27822 15975 2569 1939 13450 6356 15935 34282 34731 34011 24666 20682 15194
11231A5194Q094J1063K5838J7763J2158J7622M798K5258M0339L3725L1288L8462
$$ 15194 23288 34351 60189 77952 90110 107732 112530 137788 178127 211852 243140 281602
11219B81602L9537N4761O4000Q8056J17035J43265K17546L44441N98522J003066
$$ 281602 321139 375900 439900 527956 644991 788256 1005802 1350243 1948765 2951831
11209B951831J364850J396476J281904J343385J407926J213376R76440P52687
$$ 2951831 4316681 5713157 6995061 8338446 9746372 10959748 11936188 12688875
11201A2688875r1052r90926j271377j762498k209351j819767j123716o75414m40408
$$ 12688875 12597823 11606897 10335520 8573022 6363671 4543904 3420188 2744774 2304366
11192B304366l11992k37441j85631j47761j26446r6667q2763q0429o6304p4476
$$ 2304366 1992374 1754933 1569302 1421541 1295095 1198428 1115665 1035236 968932 894456
11182H94456n5391n0894n3444m1824l3951j2070r863j8236l2377l6032j8397j1509
$$ 894456 839065 788171 734727 692903 658952 646882 637019 618783 586406 550374 531977 520468
11170E20468k0088j7552j5025j1447q694l785K544l460j9675j8833k0493l8607
$$ 520468 500380 482828 467803 456356 447662 443877 446421 442961 423286 404453 383960 345353
11158C45353j7560o707j5969j0839L989n522j2783k6212M937n38m524q165j8116
$$ 345353 327793 321086 305117 294278 298267 292745 279962 253750 258687 258149 253625 245460 227344
11145B27344j1276k095P916J286j6997p824n935j6800m922P192m269j3804j3578
$$ 227344 216068 213973 221889 223175 206178 198354 192419 175619 170697 177889 173620 159816 146238
11132A46238l410R11J5806R707j157j3940k4269Q64m127r336p42j0583r595N100
$$ 146238 142828 143739 159545 169252 168095 154155 129886 130750 126623 117287 116545 105962 96367 101467
11118A01467J350J4732J465j0145j0535K522m110q930j587m942l599N220j982
$$ 101467 102817 117549 119014 108869 98334 100856 96746 87816 86229 81287 77688 82908 80926
11105H0926l00k0826r196n371J5533J3636l906m252j000n244o856O092k167j6799
$$ 80926 80626 59800 50604 45233 60766 74402 70496 66244 65244 60000 53144 59236 57069 40270
11091D0270o57l118j1111j2818l327J0870K208J7282J4235l440l580j2597l204
$$ 40270 39613 36495 25384 12566 9239 20109 22317 39599 53834 50394 46814 34217 31013
11078C1013o818J3451J3910J238N335J012L646M798O70q213j3183J1354J6514
$$ 31013 24195 37646 51556 52794 58129 59141 62787 67585 68255 60042 46859 58213 74727
11065G4727O145j1540j4305q148j5914O49J897J5689R236M575J618j0079p759
$$ 74727 80872 69332 55027 46879 30965 31614 33511 49200 58436 63011 64629 54550 46791
11052D6791p366R09O365n848o568O331L516O617K067m713k115J6150K980N084
$$ 46791 39425 40334 46699 40851 34283 40614 44130 50747 52814 48101 45986 62136 65116 70200
11038G0200O977k412Q911J4521N852j2139j5774j3810N039J4648J4112k359k1873
$$ 70200 77177 74765 83676 98197 104049 91910 76136 62326 67365 82013 96125 93766 71893
11025G1893k98R427N291k892r541k841j87j49k569j3324k068J1280J426q084n56
$$ 71893 71595 81022 86313 83421 73880 71039 70852 70703 68134 54810 52742 64022 65448 57364 56808
11010E6808L720k53J0004l613p821J2388L342k427p20j5243p134Q885j153k0074
$$ 56808 60528 60275 70279 66666 58845 71233 74575 72148 71428 56185 49051 57936 56783 36709
10996C6709j0995L422o517P765Q264L114J8403j539o275K248o719n774P661l489
$$ 36709 25714 29136 22619 30384 38648 41762 60165 58626 52351 54599 47880 42106 49767 46278
10982D6278j683K256o289N859J5645N819J4836K131P054J7538J5586J7822L4358
$$ 46278 44595 46851 40562 46421 62066 67885 82721 84852 91906 109444 125030 142852 177210
10969A77210M4208M7394M3885N4925P0997J10367J42704J98715L21416N39146
$$ 177210 221418 268812 312697 367622 438619 548986 691690 890405 1211821 1750967
10959A750967R24567J196959J097153Q38716J022818J565118J664531J136400
$$ 1750967 2675534 3872493 4969646 5808362 6831180 8396298 10060829 11197229
10951A1197229M25900m43285r50841o92605n26458j211892j937678j682627j016558
$$ 11197229 11623129 11179844 10229003 9536398 9009940 7798048 5860370 4177743 3161185
10942C161185o06229m02543l06668k45363j67025j25337j00366r8403r4911o5376
$$ 3161185 2554956 2152413 1845745 1600382 1433357 1308020 1207654 1109251 1014340 948964
10932I48964n7887m8456m6982l5341l2065l9848l2808l4266l3441j0937l1761
$$ 948964 891077 842621 795639 760298 728233 688385 655577 621311 587870 576933 545172
10921E45172l3262j0721j4271k2161j2774R19o331j3724j5048j8389j9691j7010
$$ 545172 511910 501189 486918 464757 451983 452902 446571 432847 417799 399410 379719 362709
10909C62709m854j116j9270k6374j6133o127q783j1222j682j95l31j2148j3920
$$ 362709 357855 356739 337469 311095 294962 288835 280052 268830 267148 266953 266622 254474 240554
10896B40554k58J543o369m982j7455j9818n012R163O118p423o229k7615o509M11
$$ 240554 240296 241839 235470 230488 213033 193215 188203 197366 203484 196061 189832 162217 155708 156119
10882A56119R51p215p494p876j0394j2307j1864J5100N835j0076l287p192p015
$$ 156119 157070 149855 142361 134485 124091 111784 99920 115020 120855 110779 107492 100300 93285
10869I3285n843j1510m921j1745k560m218Q589N109R226n222n504k75m561o47
$$ 93285 87442 75932 71011 59266 56706 52488 61077 66186 75412 70190 64686 64411 59850 59203
10855E9203r269k443k895J884j174R81N890R97o000j644l706r321N688p196M84
$$ 59203 49934 47491 44596 46480 45306 46287 52177 53174 47174 45530 41824 32503 38191 30995 31479
10840C1479O083m120o585m029p184M77J8099J721j1227J94q51k818O524J2405
$$ 31479 37562 33442 26857 22828 15644 16121 34220 35941 24714 24908 24057 21239 27763 40168
10826D0168n464K604n197r406p904K881P402L550P244n383L80K240L019J264j4618
$$ 40168 34704 37308 32111 22705 14801 17682 25084 28634 35878 30495 30875 33115 36134 37398 22780
10811B2780j4690j777j422p500l866m441O898J5350n136q622p681O984P443l21
$$ 22780 8090 6313 4891 -2609 -6475 -10916 -4018 11332 6196 -2426 -10107 -3123 4320 3999
10797C999N767j498q761n741K021O80k755m487l414J0149J2524o931n580k211
$$ 3999 9766 8268 -493 -6234 -4213 -3533 -6288 -10775 -14189 -4040 8484 1553 -4027 -6238
10783f238L030L333O883K449J345l961o820M010K070K604p739k902R035J9921
$$ -6238 -3208 125 7008 9457 10802 6841 21 4031 6101 8705 966 -1936 7099 27020
10769B7020J8532n143Q860J7608j312q874j4373M549m659j6307j7183m662M722
$$ 27020 45552 40409 49269 66877 65565 56691 42318 46867 42208 25901 8718 4056 8778
10756H778N07N004q738o497K488P210o367k882r411j341J2101O986J119j1636
$$ 8778 9285 14289 5551 -946 1542 8752 2385 -497 -9908 -11249 852 7838 8957 -2679
10742b679L525Q894P960l665n524p609l451N45J4918O228J596n241n832m24L372
$$ -2679 846 9740 17700 14035 8511 902 -2549 -2004 12914 19142 20738 15497 9665 9241 12613
10727A2613m525l398N666o192j4244J4669R030R743O770O001L768n205k3385m409
$$ 12613 8088 4690 10356 4164 -10080 4589 13619 23362 30132 36133 39901 34696 11311 6902
10713F902J690J8579M09j0967N376J1464l9P63k614N685l523J1852n576q129o050
$$ 6902 8592 27171 27580 16613 21989 33453 33414 34177 31563 37248 33725 45577 40001 31872 25822
10698B5822j1069n451J0889J5532Q937q592j0192l256J755N254Q922j6011m826
$$ 25822 14753 9302 20191 35723 44660 36068 25876 22620 24375 29629 38551 22540 17714
10685A7714L388P158M609J326R046l24J062r715r078N388J0397m443P7J008Q423
$$ 17714 21102 28260 32869 34195 43241 42917 43979 34264 25186 30574 40971 36528 36605 37613 46036
10670D6036r864p697q825J030K433q014N148R1k45P515P870N67j004n781j3472
$$ 46036 36172 28475 19650 20680 23113 15099 20247 20338 20093 27608 35478 36045 35041 29260 15788
10655A5788L034J700J120J2637J7051n228M698P842Q472Q274j2174j0381N533
$$ 15788 18822 20522 21642 34279 51330 46102 50800 58642 67114 75388 63214 52833 58366
10642E8366L367J0014K4584O445J4387J4897J0649K8035M4541R532J9682L2407
$$ 58366 61733 71747 96331 102776 117163 132060 142709 170744 215285 224817 244499 276906
10630B76906M5844M4761M8262P2356J32302J55196J97727K70060L37929L72168
$$ 276906 322750 367511 415773 488129 620431 775627 973354 1243414 1581343 1953511
10620A953511L52492L33875L29307L53199L27077K85606J96218J35340J60124
$$ 1953511 2306003 2639878 2969185 3322384 3649461 3935067 4131285 4266625 4426749
10611D426749K96736M36406N32947N37287M92735N09432N52987N09405L58802
$$ 4426749 4723485 5159891 5692838 6230125 6722860 7232292 7785279 8294684 8653486
10602H653486Q8228j46880j53837R5185L61127N09622N11132M57200M76800M92725
$$ 8653486 8741714 8594834 8440997 8536182 8897309 9406931 9918063 10375263 10852063 11344788
10592A1344788L82426R2017l64025p73412q30631n68323k68913p9149k3714J5769
$$ 11344788 11727214 11819231 11455206 10681794 9851163 9282840 9013927 8934778 8911064 8926833
10582H926833Q4454J06919K363k03541n28996p66414p87547n99943l95112k73032
$$ 8926833 9011287 9118206 9120569 8917028 8388032 7621618 6834071 6234128 5839016 5565984
10572E565984j91078j32729r3052r6493j62791k48718l74219m65380m61355l93124
$$ 5565984 5374906 5242177 5149125 5052632 4889841 4641123 4266904 3801524 3340169 2947045
10562B947045l22790k54419j96634j49150j36922j28473j05303p2181p9161o4917
$$ 2947045 2624255 2369836 2173202 2024052 1887130 1758657 1653354 1581173 1502012 1437095
10552A437095o4567o5656n4179n8692k5880k7524m5515m5532m4240m2549j7614
$$ 1437095 1372528 1306872 1252693 1194001 1168121 1140597 1095082 1049550 1005310 962761 945147
10541I45147k7396l3180l4912l0971j0893j6061l794j5886k8827l6859m1037j7971
$$ 945147 917751 884571 849659 818688 807795 791734 787940 772054 743227 706368 665331 647360
10529F47360j0420j4136j6751k387k956j7133k5278k0620j1574Q64J767k0641
$$ 647360 636940 622804 606053 603666 600710 583577 558299 537679 526105 526969 528736 508095
10517E08095p741j5954q955n897r488n089r2r237j0363m926n543j7316k6955j3282
$$ 508095 500354 484400 475445 469548 460060 454971 454879 445642 435279 430353 424810 407494 380539 367257
10503C67257k3641r852j1128r453q563m110j0555j6823p186j2115o902N655o450
$$ 367257 343616 333764 322636 313183 304620 300510 289955 273132 265946 253831 246929 252584 246134
10490B46134j0970K164L233k3921j9047j2658J38R015J511k94R411K858o584j4938
$$ 246134 235164 237328 240561 216640 197593 184935 185073 194088 195599 195305 204716 207574 200990 186052
10476A86052o544R532j0150j4248m269Q203R38k269j2882j0268J1757L63p728
$$ 186052 179508 189040 178890 164642 160373 168576 169514 167245 154363 144095 155852 156215 148487
10463A48487m368j3239l744o932o709M688k650k455j2045k968Q742K1073N454
$$ 148487 144119 130880 127136 120204 113495 118183 115533 113078 101033 98065 106807 127880 133334
10450A33334q304q470k13q387k4181J3269J3761Q04o651k0929j5236J2306N189
$$ 133334 125030 116560 116347 107960 83779 97048 110809 111613 104962 84033 68797 81103 86292
10437H6292L615n317k7728p452R16M634j834J818K25o347k120L069N122r168J218
$$ 86292 89907 84590 56862 49410 50326 54960 53126 54944 55169 48822 46702 49771 54893 45725 46943
10422D6943Q263k466m421J0431o963j2482q747o938O97P208M358o791O469O137
$$ 46943 55206 52740 48319 58750 51787 39305 30558 23620 24317 31525 35883 29092 35561 41698
10408D1698j1079J259L829m623o539r208L203R144O483J1376j0154m665L283j370
$$ 41698 30619 31878 35707 31084 24545 15337 18540 27684 34167 45543 35389 30724 34007 32637
10394C2637k45j904n054L609P910j2409l583P119M776o749P796m688o506J0896
$$ 32637 32392 30488 25434 29043 36953 24544 20961 28080 32856 26107 33903 29215 22709 33605
10380C3605J0289p732m290k789L613j8177P141N956j2696J0101N054m715k857
$$ 33605 43894 36162 31872 29083 32696 14519 21660 27616 14920 25021 30075 25360 22503
10367B2503N892J41M591m809o917J1236M493j4991J1103k092q01K9M700j772p384
$$ 22503 28395 28536 33127 28318 21401 32637 37130 22139 33242 31150 30349 30378 35078 33306 25922
10352B5922K782r36O83j918J54J523q976R177J1964k135q947k448n444j0440q74
$$ 25922 28704 27768 28451 26533 26687 28210 19234 28411 40375 38240 29293 26845 21401 10961 10087
10337A0087n387r809M485N788m812O682p17Q737q011l618P088l878j2818l282
$$ 10087 4700 -5109 -624 5164 352 7034 6317 15054 7043 3425 10513 6635 -6183 -9465
10323i465J3247j8k150J062q984M24M793K193M42P471N520j677p808j149o005
$$ -9465 3782 3764 1614 2676 -6308 -5884 -1091 1102 1544 9015 14535 12858 5050 3901 -2104
10308b104O869R290O133p132o38J29J240k327p272m378P296r88P381r107L962
$$ -2104 4765 14055 20188 13056 12418 12547 13787 11460 4188 -190 7106 6118 13499 4392 8354
10293H354R385M986p132Q62J3485N805J1552q921R080J0903P992Q185J3395J259
$$ 8354 17739 22725 15593 16455 29940 35745 47297 38376 47456 58359 66351 74536 87931 89190
10279H9190l1184j5652k03j5947k2913j5278N831p91k060J3056J682J970j0435
$$ 89190 58006 42354 42151 26204 3291 -11987 -6156 -6947 -9007 4049 5731 7701 -2734
10266b734o219J266K803Q317J114O583N31p305n451m415r222m102K631Q656M845
$$ -2734 -8953 -7687 -4884 3433 4547 11130 11661 4356 -1095 -5510 -14732 -18834 -16203 -7547 -2702
10251b702j0689J2251O737j814o38J2299M007m104j3230j1225J7280J7114J9227
$$ -2702 -13391 -1140 5597 3783 3145 15444 19451 15347 2117 -9108 8172 25286 44513
10238D4513P479n178j3109m38k169k587j57K883J3494J0591O438j2558j5386J1479
$$ 44513 51992 46814 33705 33267 31098 28511 28354 31237 44731 55322 61760 49202 33816 45295
10224D5295q248j5234j1052j717J850J2119P891O068J7290M16R456j0791M063
$$ 45295 37047 21813 10761 9044 10894 23013 30904 36972 54262 54678 64134 53343 57406
10211E7406J1197K0119J038K120m804j9544q3P254J0676p758j2170k2302K683
$$ 57406 68603 88722 89760 91880 87076 67532 67449 74703 85379 77621 65451 43149 45832
10198D5832K668J602K065J721Q915r82J1539J0924k1523M225J4984R443l737m036
$$ 45832 48500 50102 52167 53888 62803 61821 73360 84284 62761 66986 81970 91413 87676 83640
10184H3640K339k992M731R865K339J4308k438k959j2340l822J2021J7927Q604
$$ 83640 85979 82987 87718 97583 99922 114230 111792 108833 96493 92671 104692 122619 131223
10171A31223J0773j1096J482O7o791P0j2245j8746k1695O582L450L855J5356K16
$$ 131223 141996 130900 132382 132449 125658 125728 113483 94737 73042 79624 83074 86929 102285 102501
10157A02501N519P436O6M518J0531j1430p971J1783R825o123n612M728P942j4527
$$ 102501 108020 115456 115522 120040 130571 119141 111170 122953 132778 126655 121043 125771 133713 119186
10143A19186r274j159m283Q408m45m492n798j522j5036j1783l238n360J0354J4341
$$ 119186 109912 108753 104470 112878 112433 107941 102143 100621 85585 73802 70564 65204 75558 89899
10129H9899l09j5201k7010l770O583m091J666k884p667l300j2644n46O930k681
$$ 89899 89590 74389 47379 43609 50192 46101 47767 44883 37216 33916 21272 20726 27656 24975
10115B4975O685j206q1N797J3607j3579j2551n121j4139q882k42L349J4574R234
$$ 24975 31660 30454 30373 36170 49777 36198 23647 18526 4387 -4495 -4737 -1388 13186 22420
10101B2420j08R197j7160j6315j4723M778K586J5214J6032k796M846l1J0470J3179
$$ 22420 22312 31509 14349 -1966 -16689 -11911 -9325 5889 21921 19125 23971 23940 34410 47589
10087D7589J3528K178N704P138j358l233l30J8368J2115j1972j5278j0057j7963
$$ 47589 61117 63295 68999 76137 74779 71546 71216 89584 101699 89727 74449 64392 46429
10074D6429k0651o600J3430R307J8184Q396k2210j6031N671K686k512l641j561
$$ 46429 25778 19178 32608 41915 60099 68495 46285 30254 35925 38611 36099 32458 30897
10061C0897K3493K1456K0420L2378L4698J3824K1468K6462K3232L4157M598k1456
$$ 30897 54390 75846 96266 128644 163342 177166 198634 225096 248328 282485 287083 265627
10049B65627n9001p5114l1698p181j9934n184l214m86J681j0433j0042l281j1562
$$ 265627 206626 131512 99814 92633 72699 67515 64301 63815 65496 55063 45021 41740 30178
10036C0178J240P880k867m709L297q632J004J4519O746q200j3343M490J926j800
$$ 30178 31418 39298 36431 31722 35019 26387 27391 41910 48656 40456 27113 31603 33529 31729
10022C1729J3160O092J820J0545P25Q637K9842J8613J0399J017K279R147k4027
$$ 31729 44889 50981 52801 63346 64071 72708 102550 121163 131562 132579 134858 144005 119978
10009A19978j6646q560p904r394q806o686j9546j8590J5025O432J802p640J2957
$$ 119978 103332 94772 86868 77474 68668 61982 42436 23846 38871 45303 47105 39465 52422
9996E2422M939n439J440q052K235R704P476J9878L0169K8455J5154K1995K0017
$$ 52422 57361 51922 53362 45310 47545 57249 64725 84603 114772 143227 158381 180376 200393
9983B00393q869K442J1299L709l504n180k5477l2267l2336k7768j8165m444J506
$$ 200393 191524 193966 205265 208974 205470 200290 174813 142546 110210 82442 64277 59833 61339
9970F1339p53j8687j0691M749L471m140o731L167J080J207l738J343O509Q146
$$ 61339 60586 41899 31208 35957 39428 35288 28557 31724 32804 34011 30273 31616 38125 46271
9956D6271j632o708K330j3006J8714J2371n043l01j1364k332J1212l024j2032
$$ 46271 44639 37931 40261 27255 45969 58340 53297 52996 41632 39300 50512 47488 35456
9943C5456o027K829J0778j8R734K6417L909J8094L8223N5545P7375K7087m078
$$ 35456 29429 32258 43036 43018 52752 79169 83078 101172 139395 194940 272315 299402 295324
9930B95324L0217O2045M8100K9628l2189j38028q3420n2964l5090j2297l101n799
$$ 295324 325541 387586 435686 465314 433125 295097 211677 158713 123623 111326 108225 102426
9918A02426k0475j6113m288p373L385J0798J0383j5506m19m283j0176q17J5217
$$ 102426 81951 65838 61550 54177 57562 68360 78743 63237 62818 58535 48359 47542 62759
9905F2759m407j1744m279J2948J4664R615o763m985L102O159k232n060r449p246
$$ 62759 58352 46608 42329 55277 69941 79556 72793 67808 70910 77069 74837 69777 60328 53082
9891E3082J001J3891J4609J065L568p97j5327o816k61n707j1118m654l796l459
$$ 53082 54083 67974 82583 83648 87216 86419 71092 64276 64015 58308 47190 42536 38740 35281
9877C5281J030P188O422O951k698L984N029K1r839R029J9058m071k49j482j2836
$$ 35281 36311 43499 49921 56872 54174 58158 63187 63208 53369 62398 81456 77385 77136 75654 62818
9862F2818j0862n596j1936q485R867l5q291J392K687p694r420q442k947P222K530
$$ 62818 51956 46360 34424 25939 35806 35771 27480 28872 31559 23865 14445 6003 3056 10278 12808
9847A2808P57K9945K0700J26j1817M180J568n297P368o830k9187j2630Q865O550
$$ 12808 13565 43510 64210 64336 52519 56699 58267 52970 60338 53508 24321 11691 20556 27106
9833B7106k622M488l844l804m550j652m822j2503k812O685L487N627R801O69p375
$$ 27106 24484 28972 25128 21324 16774 15122 10300 -2203 -5015 1670 5157 10784 20585 21254 13879
9818A3879q732M881P442k367K045N08r035m031J3307o728J621N616K462M042J2521
$$ 13879 5147 10028 17470 15103 17148 17656 8621 4590 17897 11169 12790 18406 20868 24910 37431
9803C7431q431p058n585j3058P865k312n958J707M929J345n461q877R589N851
$$ 37431 29000 21942 16357 3299 11164 8852 2894 4601 9530 10875 5414 -3463 6126 11977
9789A1977L500K137p851n482n093o389R398J2379j546R219J1585k027m627r815
$$ 11977 15477 17614 9763 4281 -812 -7201 2197 14576 13030 22249 33834 31807 27180 17365
9775A7365j0659L124O130J8765J824j7172j0029n655K969l807l500n647L035P073
$$ 17365 6706 9830 15960 34725 36549 19377 9348 3693 6662 2855 -645 -6292 -3257 3816
9761C816j767o554m028L323o995k663J3324p705j794J2335P280o424k358L600
$$ 3816 2049 -4505 -8533 -5210 -12205 -14868 -1544 -9249 -11043 1292 8572 2148 -210 3390
9747C390N592j7878j0553M904Q918J3264j1162k415K979M633J082K391O5l304
$$ 3390 8982 -8896 -19449 -14545 -5627 7637 -3525 -5940 -2961 1672 2754 5145 5210 1906
9733A906o527M086K349Q805K575J555J980J4112p086j1163L58r30Q619l627o37
$$ 1906 -4621 -535 1814 10619 13194 14749 16729 30841 23755 12592 12950 12020 20639 17012 16375
9718A6375J2044p804n836p008o164M717q612n190R225J085k90N531K487p135o791
$$ 16375 28419 20615 14779 7771 1607 6324 -2288 -7478 1747 2832 2542 8073 10560 3425 -3366
9703c366o206L026o469K632N366J9455l523o195O470m505j0273M223n458j1509
$$ -3366 -9572 -6546 -13015 -10383 -5017 14438 10915 4720 11190 6685 -3588 635 -4823 -16332
9689a6332K672J3992l444J715j0443K785J5039J3507J0560m159j3792K815L464
$$ -16332 -13660 332 -3112 -1397 -11840 -9055 5984 19491 30051 25892 12100 14915 18379
9676A8379n123o597O632l164J512O146J2200J4492L372J226N44L909L068o09l024
$$ 18379 13256 6659 13291 10127 11639 17785 29985 44477 47849 49075 49619 53528 56596 55987 52963
9661E2963J2972o681o594O777J9928J5476j9239J3706N4727O4016O7675L5733
$$ 52963 65935 59254 52660 59437 79365 94841 75602 89308 144035 208051 275726 311459
9649C11459k840K0222N3488N5729J9786j9514j10301j06352o1408m6004k6343
$$ 311459 308619 328841 382329 438058 457844 438330 328029 221677 160269 114265 87922
9638H7922m214n864j0759j6961R118k92j5209q505K115R057k684j7333j4439J1317
$$ 87922 83708 77844 67085 50124 59242 58950 43741 35236 37351 46408 43724 26391 11952 23269
9624B3269Q238M1r620J230n22J265J6346M088k875j1365l110N896j1798o470n843
$$ 23269 31507 31548 21928 23158 22636 23901 40247 44335 41460 30095 26985 32881 21083 14613 8770
9609H770P262J8020o01j654n899K84L060J0641N489j7827j5089O987Q706n595
$$ 8770 16032 34052 33451 31797 25898 26182 29242 39883 45372 27545 12456 19443 28149 22554
9595B2554m480K309j1447l396q919R86Q348P315o210K492r917k708J6864K617
$$ 22554 18074 20383 8936 5540 -3379 -2393 5955 13270 7060 9552 -365 -3073 13791 16408
9581A6408J130j0233O739M227n840j7013o149J2382J8148L322r30j8127j6888
$$ 16408 17538 7305 14044 18271 12431 -4582 -10731 1651 19799 23121 22191 4064 -12824
9568a2824J611J820M309K3l383K0080J8902J5759q168j7666J86j277p188r143
$$ -12824 -11213 -9393 -5084 -5061 -8444 11636 30538 46297 38129 20463 20649 19372 12184 3041
9554C041l478J6598p40R473N30q508j485j766J7710K157j3960j5069o698K705
$$ 3041 -437 16161 15421 24894 25424 16916 15431 13665 31375 33532 19572 4503 -2195 510
9540E10J1194K167r380Q45n42M868K850l173k234K452q383q735P064J2879O316
$$ 510 11704 13871 4491 5336 4794 9662 12512 9339 7105 9557 1174 -7561 -497 12382 18698
9525A8698j1594j576J3702K374j7435j0138J6104K871J0557K070j910r363J3954
$$ 18698 7104 5528 19230 21604 4169 -5969 10135 13006 23563 25633 23723 14360 28314
9512B8314j508R430j681j2127l314m237J5995P417Q79o349q701p500J313l532
$$ 28314 26806 36236 34555 22428 19114 14877 30872 38289 39168 32819 24118 16618 17931 14399
9498A4399Q370O869J5150l586n931L130K296O113L1672J3020R210L6859M2086
$$ 14399 22769 29638 44788 41202 35271 38401 40697 46810 78482 91502 100712 137571 179657
9485A79657O5947O2339N1334M1344N3847L5426K5776J8449p149l4997l2913m9653
$$ 179657 245604 307943 359277 400621 454468 489894 515670 534119 526970 491973 459060 409407
9473D09407n0018m9534o1700n3508n0417l0034M288N017L422j2709k254P721Q620
$$ 409407 359389 309855 248155 194647 144230 114196 118484 123501 126923 114214 111960 119681 128301
9460A28301q341Q772R406r998k1098o442k1702j3944j0540j4050j3187l188Q67
$$ 128301 119960 128732 138138 128140 107042 100600 78898 64954 54414 40364 27177 23989 24856
9447B4856O744K846n405k515k234N703Q778j0475q736J4692R852j5406L754O441
$$ 24856 31600 34446 29041 26526 24292 29995 38773 28298 19562 34254 44106 28700 32454 38895
9433C8895N87J141l256O804J769K917L965J9065L285Q362J7405J6463Q801K5274
$$ 38895 39482 40623 37367 44171 45940 48857 52822 71887 75172 83534 100939 117402 126203 151477
9419A51477L2946M3209K8956L2994K9443M2786N4609P5255R9777J38107J66542
$$ 151477 184423 227632 256588 289582 319025 361811 416420 491675 591452 729559 896101
9408H96101K10800K14489K06657J96656K32088K99162L51494L50136K48253J08406
$$ 896101 1106901 1321390 1528047 1724703 1956791 2255953 2607447 2957583 3205836 3314242
9398C314242O3269P8146Q0898M5762p1098k07101l02649l64292l69705l59727
$$ 3314242 3377511 3455657 3536555 3582317 3511219 3304118 3001469 2637177 2267472 1907745
9388A907745l51629k91688k10982j45045j15711q1543o6913n6258m9488l8940
$$ 1907745 1556116 1264428 1053446 908401 792690 711147 644234 587976 538488 499548
9378D99548k8994m9438l8118k3857p336r274m819l928j7788k5692k2685k1030
$$ 499548 470554 421116 382998 359141 351805 342531 337712 333784 315996 290304 267619 246589
9366B46589k1257j1325j1078j4809k463J733m652j586O591j2554j8522o571n386
$$ 246589 225332 214007 202929 188120 185657 187390 182738 181152 187743 175189 156667 150096 144710
9353A44710O07l88m838J0641m77r939l960J3003j4404o562P343l955r348j9944
$$ 144710 145317 144929 140091 150732 150255 140316 136356 149359 134955 128393 135736 131781 122433 102489
9339A02489j5908j8494j0804O356J1734p20r929o97K678N889J0276Q431R6k127
$$ 102489 86581 68087 57283 63639 75373 74653 64724 64027 66705 72594 82870 91301 91397 89270
9325H9270p018P56M637J6689j445r61j2001L16n544J39M882J544J890J1929J577
$$ 89270 82252 83008 87645 104334 102889 101928 89927 90243 84699 84838 89720 91264 93154 105083 106660
9310A06660J46L0569K6384K673O614j839n95J8369R285o852j4393O426J7851N065
$$ 106660 106806 137375 163759 166432 173046 171207 170612 188981 198266 191414 177021 183447 201298 206363
9296B06363p392M861k923k2435j7801j2725K0056J7008L006n947N485P236J2408
$$ 206363 198971 203832 200909 178474 160673 147948 168004 185012 188018 182071 187556 194792 207200
9283B07200J5235J0538J889J8328M0572L6618L0824J9831L8070L7936K6583K6011
$$ 207200 222435 232973 234862 253190 293762 330380 361204 381035 419105 457041 483624 509635
9271E09635K3467N513k230k7900n5499n1461m7196n2316l0003l72L270R11O638
$$ 509635 533102 538615 536385 508485 452986 401525 354329 302013 272010 271638 274908 275819 282457
9258B82457J2767K1939P002K1542M912O828J077j6076r245l205j0612j0719k5409
$$ 282457 295224 317163 324165 345707 350619 357447 358524 342448 333203 329998 319386 308667 283258
9245B83258l3774k6823j8013j9197j4651j8580m028j3512m821N054N54j2198j9286
$$ 283258 249484 222661 204648 185451 170800 152220 148192 134680 129859 134913 135467 123269 103983
9232A03983q772o033j3065m829j0075p176r568j0449r084l21j3912q170O737J7331
$$ 103983 95211 89178 76113 71284 61209 54033 44465 34016 24932 24611 10699 2529 9266 26597
9218B6597l459j734L204R683J1923J1523j041M051M659k1348P39P983K904j0796
$$ 26597 23138 21404 24608 34291 46214 57737 56696 60747 65406 44058 44797 52780 55684 44888
9204D4888j0470r258m828p259j5201k1245k3485j2561l526o667O880j1381m907
$$ 44888 34418 25160 20332 13073 -2128 -23373 -46858 -59419 -62945 -69612 -62732 -74113 -79020
9191g9020l187k355j0552n255R32q286K963l564O344J4213J1379J944M035Q055
$$ -79020 -82207 -84562 -95114 -100369 -99437 -107723 -104760 -108324 -101980 -87767 -76388 -74444 -70409 -62354
9177f2354J6065K0364M432K2574P590J888j9692j7271P933j2416q747j931J7679
$$ -62354 -46289 -25925 -21493 1081 8671 10559 -9133 -26404 -18471 -30887 -39634 -41565 -23886
9164b3886Q644P383L0040J1011J0592Q955L331K351L759P965J5324J1351J0843
$$ -23886 -15242 -7859 22181 33192 43784 52739 56070 58421 62180 70145 85469 96820 107663
9151A07663J6479Q093K926j2884k6964k2086p216L88r98k7911k4225m442p967
$$ 107663 124142 132235 135161 122277 95313 73227 66011 66399 65401 37490 13265 8823 856
9138H56k1681j20q674r121J943J1248q800L982M2990N8825P5237P7945Q3744P8802
$$ 856 -20825 -20945 -29619 -38740 -36797 -25549 -34349 -30367 12623 71448 146685 224630 308374 387176
9124C87176O0374L9148K7750K6191L5453K9679J2998J4542m036j5115j4909j9994
$$ 387176 447550 486698 514448 540639 576092 605771 618769 633311 629275 614160 599251 579257
9112E79257k0203j2214j1045o472J58N914K737q589k4797n593Q489R806n455J4696
$$ 579257 559054 546840 535795 529323 529481 535395 538132 529543 504746 499153 507642 517448 511993 526689
9098E26689P245j702K075R763N612l990L518N36k164N608K1196J5584L44J5756
$$ 526689 533934 532232 534307 544070 549682 545692 549210 549746 547582 553190 574386 589970 590314 606070
9084F06070J6502M171K1655K3400J0597J0717J757Q011J3258J6477Q594q009N167
$$ 606070 622572 626743 648398 671798 682395 693112 694869 702880 716138 732615 741209 733200 738367
9071G38367M116j1346n958l037j9808j7773M314J994L703n264j942K8246L1721
$$ 738367 742483 731137 725179 722142 702334 684561 688875 690869 694572 689308 687366 715612 747333
9058G47333P101R864K6985J8080K1585K6475L1662K8151M3031M1837K0733R461
$$ 747333 754434 764298 791283 809363 830948 857423 889085 917236 960267 1002104 1022837 1032298
9046A032298K9199M7176M5377O2312P6000O5062O6616Q6788R0330Q8953J00717
$$ 1032298 1061497 1108673 1154050 1216362 1292362 1357424 1424040 1510828 1601158 1690111 1790828
9035A790828J12614J10935R2215J01013J19024J35748J50482J82235K20769K63716
$$ 1790828 1903442 2014377 2106592 2207605 2326629 2462377 2612859 2795094 3015863 3279579
9025C279579L07402L51756M08316M95446N90683P08693Q64941R85725J132017
$$ 3279579 3586981 3938737 4347053 4842499 5433182 6141875 7006816 7992541 9124558
9016I124558J298646J513597J757422K032882K394648K839553L480196M479565
$$ 9124558 10423204 11936801 13694223 15727105 18121753 20961306 24441502 28921067
9008B8921067O191132R018415J3410018J9492115K6646075L3339345L7244051
$$ 28921067 35112199 44130614 57540632 77032747 103678822 137018167 174262218
9001A74262218L6941864L3669456K9878574K6362812K1267456J2684410j661343
$$ 174262218 211204082 244873538 274752112 301114924 322382380 335066790 333405447
8994C33405447k0411278l5735846m4868549m5207896l8963432l0370763k2012081
$$ 333405447 312994169 277258323 232389774 187181878 148218446 117847683 95835602
8987I5835602j5566737j1151626q226746o258292m942604m056397l435484l006254
$$ 95835602 80268865 69117239 60890493 54632201 49689597 45633200 42197716 39191462
8979C9191462k645893k367703k131293j956978j844402j740716j592436j410848
$$ 39191462 36545569 34177866 32046573 30089595 28245193 26504477 24912041 23501193
8971B3501193j243801j083936r66301q66056p76631p04661o40598n82305n10966
$$ 23501193 22257392 21173456 20207155 19341099 18564468 17859807 17219209 16636904 16125938
8962A6125938m61585m16028m37812m29966m04374l95060l88547m01779l93714
$$ 16125938 15664353 15248325 14810513 14380547 13976173 13581113 13192566 12790787 12397073
8953A2397073l91233l94928l80403l71122l51858l27908l24692l28065k98805
$$ 12397073 12005840 11610912 11230509 10859387 10507529 10179621 9854929 9526864 9228059
8944I228059k76777k55721k61481k42787k33941k34353k18467k02920k14046k03325
$$ 9228059 8951282 8695561 8434080 8191293 7957352 7722999 7504532 7301612 7087566 6884241
8934F884241j88397j96730j81440j71054j67724j67432j47271j56414j61430j49676
$$ 6884241 6695844 6499114 6317674 6146620 5978896 5811464 5664193 5507779 5346349 5196673
8924E196673j38499j35462j34862j31608j08865j14746j09623j15770j15947j11402
$$ 5196673 5058174 4922712 4787850 4656242 4547377 4432631 4323008 4207238 4091291 3979889
8914C979889r5323r3306q6841r0982j05646r1686q1629q9868q5511r2995p4828
$$ 3979889 3884566 3791260 3704419 3613437 3507791 3416105 3334476 3244608 3159097 3066102 2991274
8903B991274p0026q5044n8250o4937m7763n1383p1756p1989o1609o5848n9580
$$ 2991274 2921248 2836204 2777954 2713017 2665254 2613871 2542115 2470126 2408517 2342669 2283089
8892B283089p3960o9721n1396m3637n6424m6433m4693m0856n6386m4505o1881
$$ 2283089 2209129 2139408 2088012 2044375 1987951 1941518 1896825 1855969 1799583 1755078 1693197
8881A693197n5142n0344m7759m8425m3265j8430l040o799L582O066L7183M3799
$$ 1693197 1638055 1587711 1539952 1491527 1448262 1429832 1426792 1419993 1423575 1429641 1466824 1510623
8869A510623O6401Q5382O0571L4109M221p654m6452m3797k9312l0024n1059k8910
$$ 1510623 1577024 1662406 1722977 1757086 1761307 1753653 1707201 1663404 1634092 1604068 1553009 1524099
8857A524099k1933l3670l7246m6960n5326l6670l5513n0771o9953m9665k8025
$$ 1524099 1502166 1468496 1431250 1384290 1328964 1292294 1256781 1206010 1136057 1086392 1058367
8846A058367l1850l4339m902J4099j28M848Q198Q490M714J6368J7749P683r6k3609
$$ 1058367 1026517 992178 987276 1001375 1001247 1006095 1014293 1022783 1027497 1043865 1061614 1069297 1069201 1045592
8832A045592n2127n4688l8985k9401m3182l5975l1206j2454j7163k1836k4576
$$ 1045592 993465 938777 899792 870391 827209 791234 760028 747574 730411 708575 683999
8821F83999j1563k2563l067q50m479m303q465L753J2059O148Q646J5038P292r797
$$ 683999 672436 649873 646806 645956 641477 637174 628709 632462 644521 650669 659315 674353 681645 671848
8807F71848q403o705r995j5804o260q11q144l846N331Q307j5666j8296k6966j8381
$$ 671848 663445 656740 646745 630941 624681 623870 615726 611880 617211 625518 609852 591556 564590 546209
8793E46209r814k0638m665o33j6557j2795l049p390k387j7786j3595m937R272
$$ 546209 536395 515757 511092 510459 493902 481107 478058 470668 468281 450495 436900 431963 441235
8780D41235L122P958k4457n263J3689m536J972J4040K154k469l544j27j6846o169
$$ 441235 444357 452315 427858 422595 436284 431748 433720 447760 449914 447445 443901 443774 426928 420759
8766D20759J1889J036L60K0256K30q101n535j5314k2245r150O027M077m645J081
$$ 420759 432648 433684 434044 454300 454530 446429 440894 425580 403335 394185 400212 404289 399644 400725
8752D00725L861J0977Q454N00l902l714m068l319N206L848L45p518j3752m649
$$ 400725 404586 415563 424017 424517 420615 416901 412833 409514 414720 418568 418913 411395 397643 392994
8738C92994Q024n778j0823L286m709j0865j6453J965O943p1J2758J186l435L38
$$ 392994 401018 395240 384417 387703 382994 372129 355676 357641 364584 364513 377271 378457 375022 375360
8724C75360k721n654o692K278j2293j524l940l415j1N788L393k4525j5642J0431
$$ 375360 372639 366985 360293 362571 350278 348754 344814 341399 341388 347176 350569 326044 310402 320833
8710C20833l682j7135j9062o796L714N613K738m619m990n384r391j7125j3540
$$ 320833 317151 300016 280954 274158 277872 283485 286223 281604 276614 271230 261839 244714 231174
8697B31174L125Q187j3372R4J461P404N048j8990p957k6067k0245O482J5982M764
$$ 231174 234299 242486 229114 229208 230669 238073 243121 224131 216174 190107 169862 176344 192326 197090
8683A97090n45J0631J3934j3945O237P745M131N44n741j7080k696r706q23P247
$$ 197090 196545 207176 221110 207165 213402 221147 225278 225822 220081 203001 200305 190599 189776 197023
8669A97023K425J060J864p73M045p71k887j0069N173P922N296j337j3796j1987
$$ 197023 199448 200508 202372 201599 205644 204873 201986 191917 197090 205012 210308 208971 195175 183188
8655A83188j593j2367j709J3645P758j821k588k960k0804k1189J0784J0606n286
$$ 183188 181595 169228 167519 181164 188922 187101 184513 181553 160749 139560 150344 160950 155664
8642A55664p413M195J685J2363R199M192O858J9574k999j1352m377N300P981p46
$$ 155664 148251 152446 154131 166494 175693 179885 186743 206317 203318 191966 187589 192889 200870 200124
8628B00124J4411M505j0525J377L568r092j6160p654L018O128L382J1486N383
$$ 200124 214535 219040 208515 209892 213460 204368 188208 180554 183572 189700 193082 204568 209951
8615B09951J0792J8618J5428J876Q867l647M731J9871K9152L1889N6514P5489
$$ 209951 220743 239361 254789 256665 265532 261885 266616 286487 315639 347528 404042 479531
8603D79531P6690J10407J61386J98866K02439J79644J78516J58426J37641J07724
$$ 479531 556221 666628 828014 1026880 1229319 1408963 1587479 1745905 1883546 1991270
8593A991270M8766l9204j47047k24515k52348k37183j88591j39148r9882p6959
$$ 1991270 2040036 2000832 1853785 1629270 1376922 1139739 951148 812000 712118 635159
8583F35159n3976j9340j2027r150n534k9841k7463k2690j5418j9967k3710j1322
$$ 635159 581183 561843 549816 540666 535132 505291 477828 455138 439720 419753 396043 384721
8571C84721o079j2576j3240q000O821j7730k0891j0889Q231N630L861J023N70
$$ 384721 378642 366066 352826 344826 351647 333917 313026 302137 310368 315998 319859 320882 321452
8558C21452k0048k6424j4205n315j4100m547k057j2692m351P242K891P981K163
$$ 321452 301404 274980 260775 255460 241360 236813 234756 222064 217713 224955 227846 235827 237990
8545B37990k107p003J0383J2669J1374j2709j3753o192r109p114J446j6920k7436
$$ 237990 235883 228880 239263 251932 263306 250597 236844 230652 221543 214429 215875 198955 171519
8532A71519k0328ok869M074J4610m57N577R292N084j0914r055P439J5339R150
$$ 171519 151191 151185 148316 152390 167000 166543 172120 181412 186496 175582 166527 173966 189305 198455
8518A98455M319n748l473q78P33m212q878O646j965M097M928j279q124l594l819
$$ 198455 202774 197026 193553 192675 193408 189196 180318 186964 184999 189096 194024 192745 184621 181027 177208
8503A77208K10J5018J6030j2976J5908Q476J4252J4888l290n553J014L80l626
$$ 177208 177418 192436 208466 195490 211398 219874 234126 249014 245724 240171 241185 241565 237939
8490B37939j8223j0329o756j7175m942o127r635Q73J6332J528o365j043P855n389
$$ 237939 219716 209387 202631 185456 180514 174387 164752 165625 181957 183485 177120 176077 183932 178543
8476A78543j8546j1477j1343L063j113l734R05N031L936m645J524J0780K2831
$$ 178543 159997 148520 137177 140240 139127 135393 136298 141329 145265 140620 142144 152924 175755
8463A75755n060j2047o697o111Q075J7132J0777J2280J0199J8226j0442q47M557
$$ 175755 170695 158648 151951 145840 153915 171047 181824 194104 204303 222529 212087 211240 215797
8450B15797j909J2614j1380o818J0882J5272J451m583N277J2341K8150K9986K9610
$$ 215797 213888 226502 215122 208304 219186 234458 235909 231326 236603 248944 277094 307080 336690
8437C36690N0822N3386L6051M791K4297K4685L433l4016m7435m9838o2765m7504
$$ 336690 387512 440898 476949 481740 506037 530722 534155 500139 452704 402866 340101 292597
8425B92597k4383l3747k6915p461R661M650n553q8n532k594q149J2250J1623j434
$$ 292597 268214 234467 207552 200091 209752 214402 208849 208761 203229 200635 192486 204736 216359 214925
8411B14925n860l100j6928q007R43j274l687j7979K779m212r49k4384j808l843
$$ 214925 209065 205965 189037 181030 181973 180699 177012 159033 161812 157600 156651 132267 130459 126616
8397A26616P572R273m430n749Q149r97J553q808r143J547J0164J3852n651n428
$$ 126616 134188 143461 139031 133282 141431 140434 141987 133179 124036 125583 135747 149599 143948 138520
8383A38520r082K266J8437j0607j5745m295J0385J34k375p03m370K920K535j4240
$$ 138520 129438 131704 150141 139534 123789 119494 129879 130013 127638 126935 122565 125485 128020 113780
8369A13780o210P5j3664L711N943j019j406R529J3203J5815M593R80m810j1379
$$ 113780 107570 107645 93981 97692 103635 102616 101210 110739 123942 139757 144350 145330 140520 129141
8355A29141o549j151j7927M770K2505J7686N589J3920K1465J6704k279Q886J8477
$$ 129141 122592 121441 103514 108284 130789 148475 154064 167984 189449 206153 203874 212760 231237
8342B31237J2023Q140j372j9477k4936l1189k9107j2552r584j093j2605j739O918
$$ 231237 243260 251400 250028 230551 205615 174426 145319 132767 123183 122090 109485 107746 114664
8329A14664J2478N281o335O200N983j6997j6188p676j94O796q749k40O626R856
$$ 114664 127142 132423 126088 132288 138271 121274 105086 97410 97216 104012 95263 95023 101649 111505
8315A11505R346L318n890n852Q376m841L086O969N692J3029J2582K8270M8498
$$ 111505 120851 124169 118279 112427 120803 115962 119048 126017 131709 144738 157320 185590 234088
8302B34088M0221J3890j5006J6651M5339L0038K9735l5570q9512o8032l1343J656
$$ 234088 274309 288199 273193 289844 335183 365221 394956 359386 269874 201842 170499 172155
8290A72155k113j82J297r042j0987j0156K190P417P616j975q156j1320q143n293
$$ 172155 170042 169860 171157 162115 151128 140972 143162 150579 158195 156220 148064 136744 128601 123308
8276A23308m017j1409q254J6728J6448q061j497j2158j1993n461N643M440Q64
$$ 123308 119291 107882 99628 116356 132804 124743 123246 111088 99095 93634 99277 103717 104581
8263A04581O209L313j382J2945K0564J4783K6608o812J3838J9939J3774N889q754
$$ 104581 110790 114103 112721 125666 146230 161013 187621 180809 194647 214586 228360 234249 225495
8250B25495m3158m3937k2594p347R707j1492k1850r007J3424J5119O232n889n471
$$ 225495 182337 138400 115806 108459 118166 106674 84824 75817 89241 104360 110592 104703 99232
8237I9232J0093M112j177M886p628M002n891P290J127j6507j3324j133O46O716
$$ 99232 109325 113437 112260 117146 109518 113520 107629 114919 116046 99539 86215 85082 85728 92444
8223I2444m144P49P166q649j7517K859L345j1696p49M790K2389P008j6842K883
$$ 92444 88300 89049 96215 87566 70049 72908 76253 64557 63808 68598 90987 97995 81153 84036
8209H4036o734K989N407K780k753J344m487j2752P130K651j3886l260P669k195
$$ 84036 77302 80291 85698 88478 85725 87069 82582 69830 76960 79611 65725 62465 70134 67939
8195F7939N196M563Q434m75M360j0979o221Q802P3j2231J187j1216n013j1278
$$ 67939 73135 77698 86132 85657 90017 79038 72817 81619 81692 69461 70648 59432 54419 43141
8181D3141J1935J0428K492R803q647m550R133P515N948O967N218k3798k5491k593
$$ 43141 55076 65504 67996 77799 69152 64602 73735 81250 87198 94165 99383 75585 50094 47501
8167D7501N30Q387M045j344R96N58J6196M940J915j0281j2071n30q891N792K768
$$ 47501 48031 56418 60463 59119 60115 60673 76869 81809 83724 73443 61372 60842 51951 57743 60511
8152F0511m430P704R693m868o891q127R295P671O917q906J295K343k889q827M366
$$ 60511 56081 63785 73478 68610 61719 53592 62887 70558 77475 68569 69864 72207 69318 60491 64857
8137F4857m247P33m386M21J1752m015n637n676o788M292j3330O348J2406M235
$$ 64857 60610 61343 56957 57378 69130 65115 59478 53802 47014 51306 37976 44324 56730 60965
8123F0965J389J1087j3549k0641R863Q34n48J387J24L471Q178R861l701j99j0138
$$ 60965 62354 73441 59892 39251 49114 49948 49400 50787 50911 54382 62560 72421 68720 68521 58383
8108E8383k108M159o36J283N826L94J905p863K335q208k198l557L594Q126J1765
$$ 58383 56275 60434 59798 61081 66907 67301 69206 61343 63678 55470 53272 49715 53309 61435 73200
8093G3200M487j15k335j1328n565l910N469k863K100J1474J629K369K0657J280
$$ 73200 77687 77572 75237 63909 58344 54434 59903 57040 59140 70614 72243 74612 95269 96549
8079I6549j3539j5386N77l975J336K371j589o244R899P935J804p336l910k599
$$ 96549 83010 67624 68201 64226 65562 67933 66344 60100 69999 77934 79738 72402 68492 65893
8065F5893J949l173J195L032l505j070K616k088k855j0297Q012M732Q859m374
$$ 65893 67842 64669 65864 68896 65391 64321 66937 64849 61994 51697 59709 64441 73300 68926
8051F8926r056j9924o424J1422P443L375R679p844J093J0072O977J0506N408j741
$$ 68926 59870 39946 33522 44944 52387 55762 65441 57597 58690 68762 75739 86245 91653 89912
8037H9912r628L460r78j798Q989R37R635k106j8920j751p5j5509k428J4084k3
$$ 89912 80284 83744 82766 80968 89957 90894 100529 98423 79503 77752 77677 62168 59740 73824 73801
8022G3801o93R355q334J812k277j3711J017K0737P07j3308p886p960M406j769
$$ 73801 73108 82463 74129 75941 73664 59953 60970 81707 82414 69106 61220 53260 57666 55897
8008E5897O936J6550k301j0935k162J0316J1271k105n865m495L302q099j0627
$$ 55897 62833 79383 77082 66147 63985 74301 85572 83467 77602 73107 76409 68310 57683
7995E7683l681N100m908J1056J0004K573N638J6596m005n876j2483j1436M198
$$ 57683 54002 59102 54194 65250 75254 77827 83465 100061 96056 90180 77697 66261 70459
7982G0459r469l594Q384j795k784J734R183J593O821o818o719q329r571L720Q581
$$ 70459 60990 57396 65780 63985 61201 62935 72118 73711 80532 73714 66995 58666 49095 52815 61396
7967F1396k031P593j388L034K504o224j3826n948Q638J0445J1012m880q484q425
$$ 61396 59365 66958 65570 68604 71108 64884 51058 45110 53748 64193 75205 70325 61841 53416
7953E3416R64L329R710L778K502J579j8192j5877m124O92m344N767J7020l8M833
$$ 53416 54380 57709 67419 71197 73699 75278 57086 41209 37085 37777 33433 39200 56220 56182 61015
7938F1015j7488L340j293j2266J8833J5083K771p066O701L378k931j1031j6054
$$ 61015 43527 46867 45574 33308 52141 67224 69995 62929 69630 73008 70077 59046 42992
7925D2992J2848K0045n885k2463N662N350j86P743n026n638j8973n248J1311O060
$$ 42992 55840 75885 70000 47537 53199 58549 58363 66106 61080 55442 36469 31221 42532 48592
7911D8592j8055k3791J4808K1610J2395n67m846j0381M79o199j2106n479N026
$$ 48592 30537 6746 21554 43164 55559 54992 50146 39765 40244 34045 21939 16460 21486
7898B1486R539M972J2377R646J6779o814k767q891j4999J892P564l307p966n195
$$ 21486 31025 35997 48374 58020 74799 67985 65218 56327 41328 43220 50784 47477 39511 34316
7884C4316M13j108R129J9956M691p589j38l582M588m725j0441k5429j3101R173
$$ 34316 34729 33621 42750 62706 67397 59808 59670 56088 60676 55951 45510 20081 6980 16153
7870A6153L011L394R389O067n299j7392j2627j2539J8514J0979O491K682m347
$$ 16153 19164 22558 31947 38014 32715 15323 2696 -9843 8671 19650 26141 28823 24476
7857B4476K174J7154J6432M434N807K438j9114n181m295J6284J3923k2230j2412
$$ 24476 26650 43804 60236 64670 70477 72915 53801 48620 44325 60609 74532 52302 39890
7844C9890O052l6K029j0964j5014j729M483P92J1384J3691j2253j742P726j1307
$$ 39890 45942 45906 47935 36971 21957 20228 24711 25503 36887 50578 38325 36583 44309 33002
7830C3002n447j0549N993p46j341m424O601J0391m555q062l55L375K09r880L699
$$ 33002 27555 17006 22999 22253 20912 16488 23089 33480 28925 20863 20508 23883 24092 14212 17911
7815A7911Q796J4340M911N222j1379o041J466r145N549J7593j9355N011J7496
$$ 17911 26707 41047 45958 51180 39801 33760 35226 26081 31630 49223 29868 34879 52375
7802E2375M521k219o703q804q982j7171q489m203l903q83J0656K0541J8400J887
$$ 52375 56896 54677 47974 39170 30188 13017 4528 325 -3578 -4461 6195 26736 45136 47023
7788D7023l384q680j331r81r921j6196K072J8670k46O023P348j4558j4399j265
$$ 47023 43639 34959 33628 32647 22726 6530 8602 27272 27026 33049 40397 25839 11440 10175
7774A0175J883n435o725J883O279J2995L206J5198o683J44q486q57O32J313Q285
$$ 10175 12058 6623 -102 1781 8060 21055 24261 39459 32776 32920 24434 23577 24209 25522 33807
7759C3807O958L372q445n064j4989J125R967k989L531P87N218o541p857M687L473
$$ 33807 40765 44137 35692 30628 15639 16764 26731 23742 27273 28060 33278 26737 18880 23567 27040
7744B7040m774k896k651j2566m148L245M125K1276Q329k748M117p380j7279o21
$$ 27040 22266 19370 16719 4153 5 3250 7375 28651 36980 34232 38349 30969 13690 13069
7730A3069L383K543J1111K501J1623j832j8752O17r591j3366R57K3059L723K193
$$ 13069 16452 18995 30106 32607 44230 42398 23646 24263 14672 1306 2263 25322 29045 31238
7716C1238k846j051j3083K557O37P83P370r621K320J1670l747q888o302j0267
$$ 31238 28392 27341 14258 16815 17452 18235 25605 15984 18304 29974 26227 17339 11037 770
7702G70J50J3062Q923p683m933p069O715J0645m92J942n897N0O740L16q87o843
$$ 770 920 13982 22905 15222 10289 3220 9935 20580 20088 22030 16133 16183 22923 23239 22352 15509
7686A5509o488K678j0679k852N952m618J340J1118J0309J3167L392j7076j0742
$$ 15509 9021 11699 1020 -1832 4120 -498 842 11960 22269 35436 38828 21752 11010
7673A1010J229m442M380P534J3714n61l954j640q167j1827q356j37J0646J0799
$$ 11010 12239 7797 12177 19711 33425 32864 28910 27270 19103 7276 -1080 -1217 9429 20228
7659B0228k138j2930L22O2N83J6812J0767n013j4470o960J4229M516k731P28o119
$$ 20228 18090 5160 5482 5544 6127 22939 33706 28693 14223 7263 21492 26008 23277 24005 17886
7644A7886J21Q20K006o421j0299O474k602n253J2549k388k527o271O399M950o404
$$ 17886 18007 18827 20833 14412 4113 10587 7985 2732 15281 12893 10366 4095 10494 15444 9040
7629I040n108r572n026N16J6259N615J688O625j686j1027O567k401m154J1982
$$ 9040 3932 -5640 -10666 -10150 6109 11724 13412 20037 18351 7324 13891 11490 7336 19318
7615A9318l474l138L092M816L9J024j820p296p564Q201J3317L74j6400K396k597
$$ 19318 15844 12706 15798 20614 20653 21677 19857 12561 4997 13198 26515 26889 10489 12885 10288
7600A0288J809J3470P970j334q569k765j200M044j741n617m177R970P458p599
$$ 10288 12097 25567 33537 32203 23634 20869 19669 23713 21972 16355 12178 22148 29606 22007
7586B2007o376j081m478J5140J6559p377N891J7429r238j7228J7q130P702j594
$$ 22007 15631 14550 10072 25212 41771 34394 40285 57714 48476 31248 31265 23135 30837 29243
7572B9243l07L072j2215n787l394N198Q391r356j8l133M753M382j493k827L714
$$ 29243 28936 32008 19793 14006 10612 15810 24201 14845 14827 11694 16447 20829 19336 16509 20223
7557B0223m63l650j043M691N791l421j005o942m137o483R203J2657n254j2527
$$ 20223 19760 16110 15067 19758 25549 22128 21123 14181 10044 3561 12764 25421 20167 7640
7543G640q823K306K443J0701J0826k042j6233O93M558J0171J4590o358k1077J2510
$$ 7640 -1183 1123 3566 14267 25093 23051 6818 7511 12069 22240 36830 30472 9395 21905
7529B1905K23p24o312k2610j629K423L737J613L183j88j043R665j521o68J019
$$ 21905 22128 21404 15092 -7518 -9147 -6724 -2987 -1374 1809 1621 578 10243 8722 8054 9073
7514I073M761M844p972K500k63q102K30n169M757J4713J743j9593j7215J0441
$$ 9073 13834 18678 10706 13206 12943 4841 5071 -98 4659 19372 21115 1522 -15693 -5252
7500e252J9558O545l136k4879l709J8499r373O571J7845L934l774J2053M3k1262
$$ -5252 14306 20851 17715 -7164 -10873 7626 -1747 4824 22669 26603 22829 34882 34925 13663
7486A3663n961K592N287j009Q792J0882K987J124p803p770j0590K58m617j2308
$$ 13663 7702 10294 15581 14572 23364 34246 37233 38357 30554 22784 12194 12452 7835 -4473
7472d473M811L347r946j513L562M950J3783M996n698r186j1343P686J2708N003
$$ -4473 338 3685 -6261 -7774 -4212 738 14521 19517 13819 4633 -6710 976 13684 18687
7458A8687m90l860J33Q210R173q608j1272K937l783n33J147j1772J865Q014o780
$$ 18687 18197 14337 14470 22680 31853 23245 11973 14910 11127 10594 11741 -31 1834 9848 3068
7443C068J554P536M890o214K948k257j6904r322j395K78k144J2747K54q748K318
$$ 3068 4622 12158 17048 10834 13782 11525 -5379 -14701 -16096 -15818 -17962 -5215 -4961 -13709 -11391
7428a1391J1037J7255M521Q612k045o702j5098L579N523p222r606o599R221J4075
$$ -11391 -354 16901 21422 30034 27989 21287 6189 9768 15291 8069 -1537 -8136 1085 15160
7414A5160J965L087j1055p389K591R900l899j4102n126J0397J1169M513l289p134
$$ 15160 17125 20212 9157 1768 4359 14259 10360 -3742 -8868 1529 12698 17211 13922 6788
7400F788k84J1429J7973j5985p442J412M825K188j2580k647p95P560O599n400
$$ 6788 6504 17933 35906 19921 12479 13891 18716 20904 8324 5677 4882 12442 19041 13641
7386A3641o735q694N442J1818P233m056j5462R707R597Q310j832k431k0121L326
$$ 13641 6906 -1788 3654 15472 22705 18649 3187 12894 22491 30801 28969 26538 6417 9743
7372I743J1426j359k714j784m579K736o243m691n430L207L735r784j1392l87J5151
$$ 9743 21169 19810 17096 15312 10733 13469 7226 2535 -2895 312 4047 -5737 -17129 -17516 -2365
7357b365J1826j0354l76L536m750J501j923J7158N268p128j5634R052J1172N749
$$ -2365 9461 -893 -1269 2267 -2483 -982 -2905 14253 19521 12393 -3241 5811 16983 22732
7343B2732l305J226j0013p001K712P187M167j3578l867R986J3045J564O03n031
$$ 22732 19427 20653 10640 3639 6351 13538 17705 4127 260 10246 23291 24855 25458 20427
7329B0427k167j7964j3314J576R800J3790O147q702j0489M857J436q564m230L185
$$ 20427 18260 296 -13018 -11442 -1642 12148 18295 9593 -896 3961 5397 -3167 -7397 -4212
7315d212j037L572l863j145J3960J5343m128j5783L388o735j459J0189K80k497
$$ -4212 -5249 -1677 -5540 -6685 7275 22618 18490 2707 6095 -640 -2099 8090 8370 5873
7301E873R949O165o681k542j844j1611P509R013r59r719J072K973O172j300k4411
$$ 5873 15822 21987 15306 12764 10920 -691 6818 15831 14872 5153 6225 9198 15370 14070 -10341
7286a0341j1684J4597J9703k687l779N333J5169o263j2080j0956p417j81M641
$$ -10341 -22025 -7428 12275 9588 5809 11142 26311 20048 7968 -2988 -10405 -10586 -5945
7273e945Q845M361k751J1843M69o459j1812N43R720Q9P999K420p095J3930J3042
$$ -5945 2900 7261 4510 16353 16822 10363 -1449 -906 8814 8903 16902 19322 12227 26157 39199
7258C9199p901N326p1j2223j816m904j4286j5736p408O101m88Q929J6013J762
$$ 39199 31298 36624 36553 24330 22514 17610 3324 -12412 -19820 -13719 -14207 -5278 10735 12497
7244A2497K131l817k1548r943R65P844m813L15o70n71K7725R800l235L383o746
$$ 12497 14628 10811 -10737 -20680 -19715 -11871 -16684 -16369 -17039 -17610 10115 19915 16680 20063 13317
7229A3317N341m020j4968P808n948N210J1553j3586j4629j1023J3213R845J8548
$$ 13317 18658 14638 -330 7478 1530 6740 18293 4707 -9922 -20945 -7732 2113 20661
7216B0661M003J0152j85k2530j6435n853M971Q27m638n42N976N606P469q834p452
$$ 20661 24664 34816 34631 12101 -4334 -10187 -5216 -4389 -9027 -9569 -3593 2013 9482 648 -6804
7201f804N316N042N501P640M047m699l859r187J494o603j840j698N130N39j4436
$$ -6804 -1488 3554 9055 16695 20742 16043 12184 2997 4491 -2112 -3952 -5650 -520 19 -14417
7186a4417J2936M16k499R830J0044K161k942q772j4862O494K703J3475J0242l05
$$ -14417 -1481 -1065 -3564 6266 16310 18471 15529 6757 -8105 -1611 1092 14567 24809 24504
7172B4504K953j922j9545k2066N087K2260l431n464k637K31Q83j7135N628j745
$$ 24504 27457 25535 5990 -16076 -10989 11271 7840 2376 -261 -30 853 -16282 -10654 -12399
7158a2399J2147J9167j799r749j4488N435J0016J0095J3476o029j0577j3768j2247
$$ -12399 -252 18915 17116 7367 -7121 -1686 8330 18425 31901 25872 15295 1527 -10720
7145a0720r026P61J1502J9276P584J1234k993r01n745j2874l967l956p218j0273
$$ -10720 -19746 -18985 -7483 11793 19377 30611 27618 26717 20972 8098 4131 175 -7043 -17316
7131a7316Q740j077k389k342L384P710m56J8221K5162o813j2743o098n252Q52
$$ -17316 -8576 -9653 -12042 -14384 -11000 -3290 -3746 14475 39637 32824 20081 13983 8731 9583
7117I583l110J261M093m791j4384j141p513J6143J6866L463j161j0631k4452m136
$$ 9583 6473 7734 11827 7036 -7348 -8489 -16002 141 17007 20470 19309 8678 -15774 -19910
7103a9910K607J6560J7419k497k057Q839j1234j1329k580J8061p792j2325N573
$$ -19910 -17303 -743 16676 14179 12122 20961 9727 -1602 -4182 13879 6087 -6238 -665
7090f65Q768j0551n11M868M128q525K901j6555K433J5624N611j6427j3434N28
$$ -665 8103 -2448 -2959 1909 6037 -2488 413 -16142 -13709 1915 7526 -8901 -22335 -21807
7076b1807J8573J3680J649j6167J223K935j3642N732P469O050n994k5665J6514
$$ -21807 -3234 10446 12095 -4072 -2849 86 -13556 -7824 -355 5695 -299 -25964 -9450
7063i450Q471k830K386K250N158p963j5780L682J5390L31J3049P875q383J946
$$ -9450 -979 -3809 -1423 827 5985 -1978 -17758 -14076 1314 1645 14694 22569 14186 16132
7049A6132k951K939j2311l737m44n766L769o181K242J0057O219J3043P728N31
$$ 16132 13181 16120 3809 72 -372 -6138 -2369 -8550 -6308 3749 9968 23011 30739 31270
7035C1270m801q187j518o324J39O163j2340j8849q86Q750R891J672j159P796m528
$$ 31270 26469 18282 16764 10440 10579 16742 4402 -14447 -15333 -6583 3308 4980 3821 11617 7089
7020G089j2959O493J1424K223l664m424N402Q525k373k99j2972j6662K155J3960
$$ 7089 -5870 623 12047 14270 10606 6182 11584 20109 17736 17437 4465 -12197 -10042 3918
7006C918K782j6693j332Q658o364M801P910j4519M265k202j3650o291M20K094
$$ 3918 6700 -9993 -11325 -2667 -9031 -4230 3680 -10839 -6574 -8776 -22426 -28717 -28297 -26203
6992b6203J7951J7574L556m639l780P923r222K235K534l214R754N591k802j4395
$$ -26203 -8252 9322 12878 8239 4459 12382 3160 5395 7929 4715 14469 20060 17258 2863
6978B863O855L825N223m775j956p803K905n044l569L407j1699r545L810J6116
$$ 2863 9718 13543 18766 13991 12035 4232 7137 2093 -1476 1931 -9768 -19313 -15503 613
6964F13J363j863L585O977q780K135J2939J1685k256L533L469o549j9454j4105
$$ 613 1976 113 3698 10675 1895 4030 16969 28654 26398 29931 33400 26851 7397 -6708
6950f708n24M885J64N066m468r553Q206J5037k187j4576K74J3891M786r590j1283
$$ -6708 -7232 -2347 -2183 2883 -1585 -11138 -2932 12105 9918 -4658 -4384 9507 14293 4703 -6580
6935f580L079Q039J3704k548j0240j1498p685Q333J2928J4800j4220j7423j861
$$ -6580 -3501 4538 18242 15694 5454 -6044 -13729 -5396 7532 22332 8112 -9311 -11172
6922a1172J0614J118p631j0109p82J0782N767j4464l930J1587P652J3049r360
$$ -11172 -558 560 -7071 -17180 -17962 -7180 -1413 -15877 -19807 -8220 -568 12481 3121
6909C121j2076M106K137l946O217R799P636o185j2852K54k294O431R246N115L225
$$ 3121 -8955 -4849 -2712 -6658 -441 9358 16994 10809 -2043 -1789 -4083 2348 11594 16709 19934
6894A9934m864k460o342J4216l908j4268j2118L084Q497M247o38J5036K615o019
$$ 19934 15070 12610 6268 20484 16576 2308 -9810 -6726 1771 6018 5380 20416 23031 17012
6880A7012m651j0744O507n514m350L713P136r204O102p64j1164k0632P062K974
$$ 17012 12361 1617 8124 2610 -1740 1973 9109 -95 6007 5243 -5921 -26553 -19491 -16517
6866a6517q86K012R769l582K727J382M845k797r530J013n562o377n030J0758O649
$$ -16517 -17403 -15391 -5622 -9204 -6477 -5095 -250 -3047 -12577 -11564 -17126 -23503 -28533 -17775 -11126
6851a1126M77J1925J2849n802O334L010j3583k673P107J3973N125k888n281r131
$$ -11126 -10649 1276 14125 8323 14657 17667 4084 1411 8518 22491 27616 24728 19447 10316
6837A0316Q217k5980r371J1279K2575J923K759P999p826O739j5845j7000j763
$$ 10316 18533 -7447 -16818 -5539 17036 18959 21718 29717 21891 28630 12785 -4215 -5978
6824e978r43m850R461O708j0607q04l348J6043N910N705P653k726j0740n205M087
$$ -5978 -6921 -11771 -2310 4398 -6209 -7013 -10361 5682 11592 17297 24950 22224 11484 6279 10366
6809A0366p846o943m251q644l743L153j190j0091M686l695K848J502J3446J1300
$$ 10366 2520 -4423 -8674 -17318 -21061 -17908 -19098 -29189 -24503 -28198 -25350 -23848 -10402 898
6795H98L013m389p775j0083J1081K367J6951P1k1102p440n492J0870N360M732
$$ 898 3911 -478 -8253 -18336 -7255 -4888 12063 12134 -8968 -16408 -21900 -11030 -5670 -938
6781i38L740P729R146j521q450j5676j3961J3192Q785J0917J37p637j0481k214
$$ -938 2802 10531 19677 18156 9706 -5970 -19931 -6739 2046 12963 13100 5463 -5018 -7232
6767g232j829j0588r079K1300J5475q085l960j415Q154J983L95r034j087L136
$$ -7232 -9061 -19649 -28728 -7428 8047 -38 -3998 -5413 2741 4724 5119 -3915 -5002 -1866
6753a866l573Q313j221R4j256k214K871j1655K080J0229l345q479r139r157J4605
$$ -1866 -5439 2874 1653 1747 491 -1723 1148 -10507 -8427 1802 -1543 -10022 -19161 -28318 -13713
6738a3713R569p160j0032q434k126J0573N140O395J7140o749j620j1171j4193
$$ -13713 -4144 -11304 -21336 -29770 -31896 -21323 -16183 -9788 7352 603 -1017 -12188 -26381
6725b6381J1906O624r221n60p639O876J8211K965p002k156J1839j0158j5709K3424
$$ -26381 -14475 -7851 -17072 -17632 -25271 -18395 -184 2781 -4221 -6377 5462 -4696 -20405 3019
6711C019J5834n720p039n098p716J2217j669j592J6167m750n916k140o001L974
$$ 3019 18853 13133 6094 996 -6720 5497 3828 2236 18403 13653 7737 5597 -404 3570
6697C570R786K627p753j0659k096M49O008k465M606L34L233o958O624P829M653
$$ 3570 13356 15983 8230 -2429 -4525 -4076 1932 -533 4073 4407 7640 682 7306 15135 19788
6682A9788l009r599n087j5433K816K656P176k123l537K1335K0187N973j0603k672
$$ 19788 16779 7180 2093 -13340 -10524 -7868 -692 -2815 -6352 14983 35170 41143 30540 27868
6668B7868j3921n702k829j4780j5121K029M713J152j420J3491J688l005L154q825
$$ 27868 13947 8245 5416 -9364 -24485 -22456 -17743 -16591 -18011 -4520 -2832 -5837 -2683 -11508
6654a1508j565J4755r85j0128M984J228n312N846o844j684k953q20n828N968J0586
$$ -11508 -13073 1682 697 -9431 -4447 -3219 -8531 -2685 -9529 -11213 -14166 -14986 -20814 -14846 -4260
6639d260m932n550j749J8230M869m71q992j1141P489J7391j3659N101K990P269
$$ -4260 -9192 -14742 -16491 1739 6608 6137 -2855 -13996 -6507 10884 -2775 2326 5316 12585
6625A2585m24p380k4398k997J5644N671O061k902L513j0103m844Q499j658j3757
$$ 12585 12161 4781 -19617 -22614 -6970 -1299 4762 1860 5373 -4730 -9574 -1075 -2733 -16490
6611a6490M393J5299M122m265n112N925Q356Q943k076O759o553j5519l501R259
$$ -16490 -12097 3202 7324 3059 -2053 3872 12228 21171 19095 25854 19301 3782 281 9540
6597I540K820n191l023n296k953J2154k85j829J5576R481j13j6473j8840R793
$$ 9540 12360 7169 4146 -1150 -4103 8051 7766 5937 21513 30994 30881 14408 -4432 5361
6583E361J160j0412m501o904m375j839M702Q639P275J3902L603j0314r498J3369
$$ 5361 6521 -3891 -8392 -15296 -19671 -21510 -16808 -8169 -894 13008 16611 6297 -3201 10168
6569A0168P630L529n574R396q18o248q840j5222o301R75L246Q096J0549p186J2900
$$ 10168 17798 21327 15753 25149 24331 18083 9243 -5979 -12280 -11305 -8059 37 10586 3400 16300
6554A6300J6191o266k389m730j3622o22J8625N597j4922q516q556P56R376j5950
$$ 16300 32491 26225 23836 19106 5484 4862 23487 29084 14162 5646 -2910 -2154 7222 -8728
6540h728j0638m881Q553J4672L804l09j938N431N023j5380J522O047O362K8l073
$$ -8728 -19366 -24247 -15694 -1022 2782 2473 535 5966 10989 -4391 -2869 3178 9540 9568 6495
6525F495J815J6966o559n320p75m945r809m79M317k549J0428l963j0250N343l273
$$ 6495 8310 25276 18717 13397 12622 7677 -2132 -2611 1706 -843 9585 5622 -4628 715 -2558
6510b558n653N181M974m615j0780K761J3246L691o777K820m710k427j2983j4686
$$ -2558 -8211 -3030 1944 -2671 -13451 -10690 2556 6247 -530 2290 -2420 -4847 -17830 -32516
6496c2516P799j563L528J0383J487O489P982M286k519n242n941L965j657K1232
$$ -32516 -24717 -26280 -22752 -12369 -10882 -4393 3589 7875 5356 114 -5827 -1862 -3519 17713
6482A7713O706P576j0276j5309L407o422j7477J8508K6804L566j2676k4672l048
$$ 17713 24419 31995 21719 6410 9817 3395 -14082 4426 31230 34796 22120 -2552 -5600
6469e600j141q813J4540P736l618m583J7239J0122L708J402j1844j2946q1L650
$$ -5600 -6741 -15554 -1014 6722 3104 -1479 15760 25882 29590 30992 19148 6202 6121 9771
6455I771n432R791O084M627j354m045K560j371j882j0518j9992l62K0388Q349
$$ 9771 4339 14130 20214 24841 23487 19442 22002 20631 18749 8231 -11761 -12123 8265 16614
6441A6614m141j1049J108o110o186N644o167L90k487Q921m193J2194j1084M748
$$ 16614 12473 1424 2532 -3578 -9764 -4120 -10287 -9897 -12384 -3463 -7656 4538 -6546 -1798
6427a798N904j2847j2267J9481j564L378l239j9841M888R082J8182J2622p50k0996
$$ -1798 4106 -8741 -21008 -1527 -3091 287 -2952 -22793 -17905 -8823 9359 21981 21231 235
6413B35j3004P124j489r854O543L617N921k037J2536j466p159K285j320j0915
$$ 235 -12769 -5645 -7134 -16988 -10445 -6828 -907 -2944 9592 8126 967 3252 1932 -8983
6399h983j5023n151R187K911q948k634J282j3821j1425J64Q129J2513J3549J3040
$$ -8983 -24006 -29157 -19970 -17059 -26007 -28641 -27359 -41180 -52605 -52441 -44312 -31799 -18250 -5210
6385e210M921m51k025q888L96o886J078Q111J1511P311j1520j7848K798J717J1206
$$ -5210 -289 -740 -2765 -11653 -11257 -18143 -17065 -8954 2557 9868 -1652 -19500 -16702 -14985 -3779
6370c779N331m147K095m043p980m263Q893j806n957K833J0462n872J743P900K833
$$ -3779 1552 -2595 -500 -4543 -12523 -16786 -7893 -9699 -15656 -12823 -2361 -8233 -6490 1410 4243
6355D243r192K284o5J917J7681J231K339o574j6542j6755K720J6672Q125j476
$$ 4243 -4949 -2665 -2730 -813 16868 18099 20438 13864 -2678 -19433 -16713 -41 8084 6608
6341F608P373J618q768k715P445L843r092Q192p814n38N90J0658J7603l464j3208
$$ 6608 13981 15599 6831 4116 11561 15404 6312 14504 6690 6152 6742 17400 35003 31539 18331
6326A8331m888k1789k3145J4896J1530L446j675P574n935L496j0263P980J3612
$$ 18331 13443 -8346 -31491 -16595 -5065 -1619 -3294 4280 -1655 1841 -8422 -442 13170
6313A3170k750O096k862l384j0985j9073r824J400K7799J0597j6937M378J4949
$$ 13170 10420 16516 13654 10270 -715 -19788 -29612 -28212 -413 10184 -6753 -2375 12574
6300A2574J712L497K640j971l236k2555j3892J0897P276k964P110k273j2204J916
$$ 12574 14286 17783 20423 18452 15216 -7339 -21231 -10334 -3058 -6022 1088 -1185 -13389 -11473
6286a1473N332j238L882K406Q309j728p065l878J4495O42j566j6182j0908Q444
$$ -11473 -6141 -7379 -3497 -1091 7218 5490 -1575 -5453 9042 9684 8118 -8064 -18972 -10528
6272a0528J3690M645M44m810o501k512J275q059j0816J1440k493l573R278l739
$$ -10528 3162 7807 8251 3441 -3060 -5572 -4297 -12356 -23172 -11732 -14225 -17798 -8520 -12259
6258a2259L646J748P23k95J5690p53l781q649N097J8299j0587j2819M225k106
$$ -12259 -8613 -6865 -6142 -6437 9253 8500 4719 -3930 1167 19466 8879 -3940 285 -1821
6244a821M278q305P968L618j17j504n502O410m424m158l874K3087Q074p732j9999
$$ -1821 2457 -5848 2120 5738 5621 4117 -1385 5025 601 -3557 -7431 15656 23730 15998 -4001
6229d001j1864N443J284R058J235j3080k0078O219P167J5545P558Q116L069P151
$$ -4001 -15865 -10422 -9138 -80 1155 -11925 -32003 -25784 -18617 -3072 4486 12602 15671 22822
6215B2822q157j0030M10r189K2930J766j4614j0869J1649J457L6R487m845m671
$$ 22822 14665 4635 5045 -4144 18786 20552 5938 -4931 6718 8175 8211 17698 12853 8182
6201H182j882K448k864J3148N346k438l084p420r939p222K063P085o650p707P672
$$ 8182 6300 8748 5884 19032 24378 21940 18856 11436 1497 -5725 -3662 3423 -3227 -10934 -3262
6186c262Q602l510j1947P664J0018J0599q019n41N781j4136r935P216R723o075
$$ -3262 5340 1830 -10117 -2453 7565 18164 10145 9604 15385 1249 -8686 -1470 8253 2178
6172B178k883L333Q716J0356n003k0586q05n627R363J2577o622k2442M228O044
$$ 2178 -705 2628 11344 21700 16697 -3889 -4694 -10321 -958 11619 4997 -17445 -13217 -7173
6158g173n641Q365Q700q872r532r076L257J7734J0516M830M448N20k616q665n397
$$ -7173 -12814 -4449 4251 -4621 -14153 -23229 -19972 -2238 8278 13108 17556 18076 15460 6795 1398
6143A398R522J4342l234j4352m684j1353o713M076N797P142K214p890j5014l569
$$ 1398 10920 25262 22028 7676 2992 -8361 -15074 -10998 -5201 1941 4155 -3735 -18749 -22318
6129b2318J9835R363L216l015j0659m010J2609J164O246P186j1650p605N78P141
$$ -22318 -2483 6880 10096 7081 -3578 -7588 5021 6185 12431 19617 7967 362 940 8081
6115H081l262j3938o58q600Q974P689J1969j186k852J042j4896O555R804m251
$$ 8081 4819 -9119 -9777 -18377 -9403 -1714 10255 9069 6217 7259 -7637 -1082 8722 4471
6101D471M788j2472j498n514L20J574M303P316J0386m273J1673l97k1857l373
$$ 4471 9259 -3213 -4711 -10225 -9905 -8331 -4028 3288 13674 9401 21074 20677 -1180 -4553
6087d553n904L409J2850N269L765j3929l523n905n496J0446M364O385P622m715
$$ -4553 -10457 -7048 5802 11071 14836 907 -2616 -8521 -14017 -3571 793 7178 14800 10085
6073A0085p429l876O620O1j1075j0554r715l531P964K266R781P403J1779J257
$$ 10085 2656 -1220 5400 5461 -5614 -16168 -25883 -29414 -21450 -19184 -9403 -2000 9779 11036
6059A1036l77j259o251k001Q586J2985j7140J106j1539l015k239Q523P994q591
$$ 11036 10659 9400 3149 1148 9734 22719 5579 6685 -4854 -7869 -10108 -1585 6409 -2182
6045b182j2502M86J0694k007j9465P738j873P041L960p67p086r85j882O247M909
$$ -2182 -14684 -14198 -3504 -5511 -24976 -17238 -19111 -12070 -8110 -8877 -15963 -16948 -18830 -12583 -7674
6030g674L547O662l979m476R357L762K860n815o888O576M000P939k64L029N462
$$ -7674 -4127 2535 -1444 -5920 3437 7199 10059 4244 -2644 3932 7932 15871 15607 18636 24098
6015B4098p033j3007j1371K078J00k333j1382l985P891J3147K000n006K448j267
$$ 24098 17065 4058 -7313 -5235 -5135 -7468 -18850 -22835 -14944 -1797 203 -4803 -2355 -3622
6001c622o138P94q2L024M103r468M054J7745j4894k148m163l751J1689N370O200
$$ -3622 -9760 -8966 -9048 -6024 -1921 -11389 -7335 10410 -4484 -6632 -10795 -14546 -2857 2513 8713
5986H713N988L207j0939R686Q749p140m52n944p525p388j2232O349O761M041J507
$$ 8713 14701 17908 6969 16655 25404 18264 17812 11868 4343 -3045 -15277 -8928 -2167 1874 3381
5971C381r664N556j0319J1677O436M365Q93j6555j1191N00J3857R216j0847N949
$$ 3381 -6283 -727 -11046 631 7067 11432 12325 -4230 -15421 -14921 -1064 8152 -2695 3254
5957C254L407R73J112p580Q060k523R860J0866R53k825j0613j4917n42L345J3825
$$ 3254 6661 7634 8746 1166 9226 6703 16563 27429 28382 25557 14944 27 -515 2830 16655
5942A6655m334K016o187p423j1431N491P496Q362J3482j1364j7643j4900M880
$$ 16655 12321 14337 8150 727 -10704 -5213 2283 10645 24127 12763 -4880 -19780 -14900
5929a4900J1424O655j1375p746J54j8663M938J7584O112J727n845n961M297N783
$$ -14900 -3476 3179 -8196 -15942 -15788 -34451 -29513 -11929 -5817 -4090 -9935 -15896 -11599 -5816
5915e816Q326K7461N365n494L587p349p803j1120O960p390j2330M028Q749j44
$$ -5816 2510 29971 35336 29842 33429 26080 18277 7157 14117 6727 -5603 -1575 7174 7030
5901G030q480L921N859J0011m08N437l404k0259o606P518K939k065k644k005j4231
$$ 7030 -1450 2471 8330 18341 17933 23370 19966 -293 -6899 619 3558 1493 -1151 -3156 -17387
5886a7387N298J7758K248j0748q018O956k043M039J1165k709j3078N389J5989
$$ -17387 -12089 5669 7917 -2831 -10849 -3893 -5936 -1897 9268 6559 -6519 -1130 14859
5873A4859n374J18O91o435n909N347j2904m131l295K219M290J1026J1737J93p169
$$ 14859 9485 9603 10294 3859 -2050 3297 -9607 -13738 -17033 -14814 -10524 502 12239 12432 5263
5858E263m817o127o599M545k611l229l249P914N110q13k969J3645M956j4289n304
$$ 5263 446 -5681 -12280 -7735 -10346 -13575 -16824 -8910 -3800 -4613 -7582 6063 11019 -3270 -8574
5843h574l263j1269N197R691n135k454J0358Q883j2090N519M144q559J103j952
$$ -8574 -11837 -23106 -17909 -8218 -13353 -15807 -5449 3434 -8656 -3137 1007 -7552 -6449 -8401
5829h401j1485q23J8690J6398L612j4832O343N058r582m432N098q05J0420j2014
$$ -8401 -19886 -20709 -2019 14379 17991 3159 9502 14560 4978 546 5644 4839 15259 3245
5815C245q428m234K486K359l46P933J173J73J270J934j0786M591L485r962O08
$$ 3245 -5183 -9417 -6931 -4572 -4918 3015 4188 4361 5631 7565 -3221 1370 4855 -5107 -4499
5800d499k534k172K571j1681L402P640J6548J8864n445k2047n153p178j5779m11
$$ -4499 -7033 -9205 -6634 -18315 -14913 -7273 9275 28139 22694 647 -4506 -11684 -27463 -27874
5786b7874P724N606J97J684P363K419j194n521n66n618N5M101j175O509K772O570
$$ -27874 -20150 -14544 -14347 -12663 -5300 -2881 -4075 -9596 -10162 -15780 -15725 -11624 -12799 -6290 -3518 3052
5770C052m060j413O097O624M268M678q766p637j12K104k050l657J1701P182o729
$$ 3052 -1008 -2421 3676 10300 14568 19246 10480 2843 2731 4835 2785 -872 10829 18011 11282
5755A1282O830m067k3109p668J0196j132L386M532k444n384l603K914J3293J4252
$$ 11282 18112 14045 -9064 -16732 -6536 -7668 -4282 250 -2194 -7578 -11181 -8267 5026 19278
5741A9278j2551k1349M270J1773p10K261m997O86R842L192K36j1645O950l980
$$ 19278 6727 -14622 -10352 1421 711 2972 -2025 -1339 8503 11695 11931 286 7236 3256
5727C256O914J1201j1908k4587L690J2258j0075j887J2861Q982k823j8140l868
$$ 3256 10170 21371 9463 -15124 -11434 824 -9251 -11138 1723 10705 7882 -10258 -14126
5714a4126R095o63J3154j0678Q66J3842r44k751j4878n794O957O646n355p257
$$ -14126 -5031 -5694 7460 -3218 -2352 11490 10546 7795 -7083 -12877 -5920 726 -4629 -11886
5700a1886M90k360m978p937J2457M058l148q532L810J3172j753m498Q483M258
$$ -11886 -11396 -13756 -18734 -26671 -14214 -10156 -13304 -21836 -18026 -4854 -6607 -11105 -2622 1636
5686A636L42k666j3227L145k406q371m930m745J9089R986N753J0965m757j0759
$$ 1636 1978 -688 -13915 -10770 -13176 -21547 -26477 -31222 -12133 -2147 3606 14571 9814 -945
5672i45N405P959J809l917R26m556p435Q488o872K152j113M06j2887m834P080
$$ -945 4460 12419 14228 10311 11237 6681 -754 7734 862 3014 1901 2307 -10580 -15414 -8334
5657h334n73q741L357O189j615J811j226J882N254J7537J8313l01n170j433j8609
$$ -8334 -8907 -17648 -14291 -8102 -9717 -7906 -9132 -7250 -1996 15541 33854 33553 28383 26950 8341
5642H341L39J3740j2295j2405m706R468J0955o377j1410J4647Q643j0054j810
$$ 8341 8680 22420 10125 -2280 -6986 2482 13437 7060 -4350 10297 18940 8886 7076
5629G076k530n129O690J0479Q85j3892j3027o583J0310J6348M508j6069n584P200
$$ 7076 4546 -583 6107 16586 17471 3579 -9448 -16031 -5721 10627 15135 -934 -6518 682
5615F82J461k950m89q63J094j2530j600K348J0075j618q713J2974O582M827j0396
$$ 682 2143 -807 -1296 -2159 -1065 -13595 -15195 -12847 -2772 -4390 -13103 -129 6453 11280 884
5600H84j250o5p858j0100J0034O46J698q594k306n155J4166J7000l387n983J4569
$$ 884 -366 -431 -8289 -18389 -8355 -7709 -6011 -14605 -16911 -22066 -7900 9100 5713 -270 14299
5585A4299o230K355K669L140q623n280k074N195O514o682P928L792j6772n877
$$ 14299 8069 10424 13093 16233 7610 2330 256 5451 11965 5283 13211 17003 231 -5646
5571e646K256M085K304p2l70O094J0526K744k2378l500J0104R312M746j297l428
$$ -5646 -3390 695 2999 2927 2557 8651 19177 21921 -457 -3957 6147 15459 20205 18908 15480
5556A5480j0084o050Q29j2094r28q90L928K844l478R170K714K93R374j778j866
$$ 15480 5396 -654 175 -11919 -12847 -13737 -9809 -6965 -10443 -1273 1441 1734 11108 9330 7464
5541G464m357o919O216j849K016P721O975k1231j0878O361o841j7058r12J9852
$$ 7464 3107 -3812 2404 555 2571 10292 17267 -3964 -14842 -8481 -15322 -32380 -33292 -13440
5527a3440J8734L514k442j4844j94J03l959M095k593k65l423n736J55J7042j895
$$ -13440 5294 8808 6366 -8478 -8672 -8569 -12528 -8433 -11026 -11291 -14714 -20450 -20295 -3253 -5148
5512e148J550p878M452O261Q950J692M923k811J0587j4701j0465k460J742J4740
$$ -5148 -3598 -11476 -7024 -763 8187 9879 14802 11991 22578 7877 -2588 -5048 -3306 11434
5498A1434K648p444p321l880q20k240J0419L067r157N698k761r876N05l164N937
$$ 11434 14082 6638 -683 -4563 -5383 -7623 2796 5863 -3294 2404 -357 -10233 -9728 -12892 -6955
5483f955K862o052J224Q910M337k900p459k674N71P053M337r567O774P316j4341
$$ -6955 -4093 -10145 -8921 -11 4326 1426 -6033 -8707 -8136 -1083 3254 -6313 461 7777 -6564
5468f564N361k471q033l250R37M983M092J089q503l375Q937k177M878R413J060
$$ -6564 -1203 -3674 -11707 -14957 -14020 -9037 -4945 -3856 -12359 -15734 -6797 -8974 -4096 5317 6377
5453F377j177J996m041l275Q03K733j0376p433R508O783Q683J140k919M206j1936
$$ 6377 5200 7196 3155 -120 683 3416 -6960 -14393 -4885 1898 10581 11721 8802 13008 1072
5438A072m815N676N568J369r794Q310J7083j2738q753p177K28k434L095m811q71
$$ 1072 -3743 1933 7501 8870 -924 7386 24469 11731 2978 -4199 -3971 -6405 -3310 -8121 -8992
5423h992j2029l692J205J5763J8415r439j8751q558j2551M262j2790J6549J0370
$$ -8992 -21021 -24713 -23508 -7745 10670 1231 -17520 -26078 -38629 -34367 -47157 -30608 -20238
5410b0238J1080J2583k159r340j7433J1853K4757p39m327m856j7690N329L941
$$ -20238 -9158 3425 1266 -8074 -25507 -13654 11103 10364 6037 1181 -16509 -11180 -7239
5397g239J0331L951j5022J679Q674j356j0231j0907q02l419p75j0312R973J746
$$ -7239 3092 7043 -7979 -6300 2374 1018 -9213 -20120 -20922 -24341 -25116 -35428 -25455 -23709
5383b3709P721Q181k623M259k511J323j013L772L744l754m755N549k480R156l500
$$ -23709 -15988 -7807 -10430 -6171 -8682 -7359 -8372 -4600 -856 -4610 -9365 -3816 -6296 2860 -640
5368f40r744K125J0646P590J059l788J543J2061l020j858j6224j5926j248R544
$$ -640 -10384 -8259 2387 9977 11036 7248 8791 20852 17832 15974 -250 -16176 -17424 -7880
5354g880J3710K920P383K586q106j8410J0187n97j815Q749j233j0820m627J818
$$ -7880 5830 8750 16133 18719 10613 -7797 2390 1793 -22 8727 7494 -3326 -7953 -6135
5340f135R100J3761J0531q353p950j848L195j7139j5446l350J0314J7290N081
$$ -6135 2965 16726 27257 18904 10954 9106 12301 -4838 -20284 -23634 -13320 3970 9051
5327I051q272j9528n972L230R130m715J676J5391N49L291j208k280l676o26M308
$$ 9051 779 -18749 -24721 -21491 -12361 -17076 -15400 -9 540 3831 2623 343 -3333 -3959 349
5312C49j1870P053J4741K91o419J0505J1923Q194j1735j0740N131K382o467q645
$$ 349 -11521 -4468 10273 10564 4145 14650 26573 34767 23032 12292 17423 19805 13338 4693
5298D693j399K233L833n586n674o807O787N565n407n079J445L354K793k748j3966
$$ 4693 3294 5527 9360 3774 -1900 -8707 -1920 3645 -1762 -6841 -5396 -2042 751 -1997 -15963
5283a5963l472N570p35m497M614r80l379L236r278j3252l138J2007J3890J7915
$$ -15963 -19435 -13865 -14600 -19097 -14483 -15463 -18842 -15606 -24884 -38136 -41274 -29267 -15377 2538
5269B538L655m575K43j0574O442p927l623O844j5180R414J8475Q590n234M217
$$ 2538 6193 1618 1861 -8713 -2271 -10198 -13821 -6977 -22157 -12743 5732 14322 9088 13305
5255A3305R390L992q072k7220q636P680J5813M514q362j832N942J370q69j197
$$ 13305 22695 26687 18615 -8605 -17241 -9561 6252 10766 2404 572 6514 7884 7015 5818
5241E818p720j1041K795P55j1509L538k11J1316k46Q775j197J024p740k617P395
$$ 5818 -1902 -12943 -10148 -9393 -20902 -17364 -17575 -6259 -6505 2270 1073 2097 -5643 -8260 -865
5226h65M263L777j1646q049o640J2778O796J124P65M960L303J67j34n608k555
$$ -865 3398 7175 -4471 -12520 -19160 -6382 414 1538 2303 7263 10566 10733 10599 4991 2436
5211B436J74m443K0177l608p828M058P159j0648r417k246R255Q383q288r43j362
$$ 2436 2610 -1833 18344 14736 6908 10966 18125 7477 -1940 -4186 5069 13452 5164 4221 2859
5196B859O986j649J887J4252K722j4497q108l198Q921O887k821r522j2626J2005
$$ 2859 9845 8196 10083 24335 27057 12560 4452 1254 10175 17062 14241 4719 -7907 4098
5182D098J4335r241q612L254Q947J0820L433R986p744j0192l641j3198Q662P074
$$ 4098 18433 9192 580 3834 12781 23601 27034 37020 29276 19084 15443 2245 10907 17981
5168A7981k862n246O903o110m964J0833P154m846m672q554o027n416k506J1894
$$ 17981 15119 9873 16776 10666 5702 16535 23689 18843 14171 5617 -410 -5826 -8332 3562
5154C562R201J045L789j7054j2189J3472j9p438n090L440O293J3919m060j3374
$$ 3562 12763 13808 17597 543 -11646 1826 1807 -5631 -10721 -7281 -988 12931 8871 -4503
5140d503k559p671j3252N662Q658K0529M540j7883L63k295r108j243n322n328
$$ -4503 -7062 -14733 -27985 -22323 -13665 6864 11404 -6479 -6116 -8411 -17519 -18762 -24084 -29412
5126b9412J0084P612M052k475O1J3575J828k485M562k201o400P647j5042l426
$$ -29412 -19328 -11716 -7664 -10139 -10078 3497 5325 2840 7402 5201 -1199 6448 -8594 -12020
5112a2020J127k768k038j792N604k400l447K529j845L795l93J7197J8905r35j2966
$$ -12020 -10893 -13661 -15699 -17491 -11887 -14287 -17734 -15205 -17050 -13255 -13648 3549 22454 21519 8553
5097H553j7763l210J3803R476O711o761j052p562r945n320j4437j1535M897K571
$$ 8553 -9210 -12420 1383 10859 17570 10809 9757 2195 -7750 -13070 -27507 -39042 -34145 -31574
5083c1574m954R583J7529L1m572P393J0000R883j740P888l137k0201k2137j436
$$ -31574 -36528 -26945 -9416 -9385 -13957 -6564 3436 13319 11579 19467 16330 -3871 -26008 -27444
5069b7444O291q101K823J0410l918Q827M423l416K047J5357n905r998L482K499
$$ -27444 -21153 -29254 -26431 -16021 -19939 -11112 -6689 -10105 -8058 7299 1394 -8604 -5122 -2623
5055b623J480l116j1211r998k252Q649K2685P353r508p225O319n82N223O65p158
$$ -2623 -1143 -4259 -15470 -25468 -27720 -19071 3614 10967 1459 -5766 553 -29 5194 5859 -1299
5040a299P325M606l613L215p353J0187r058m746k557j0836m027J989N12p76M307
$$ -1299 6026 10632 7019 10234 2881 13068 4010 -736 -3293 -14129 -18156 -16167 -15655 -16431 -12124
5025a2124L917K457L711p34K765j1290j392p994P252P222J796l033j0923J0744
$$ -12124 -8207 -5750 -2039 -2773 -8 -11298 -12690 -20684 -13432 -6210 -4414 -7447 -18370 -7626
5011g626J3246p116k895o750P752l730n911P323R140k972N380J63m606q710j5193
$$ -7626 5620 -1496 -4391 -11141 -3389 -7119 -13030 -5707 3433 461 5841 6004 1398 -7312 -22505
4996b2505K938J3837R762P546m884j3373l713k82J6226J1781j7742j0657N239
$$ -22505 -19567 -5730 4032 11578 6694 -6679 -10392 -10674 5552 17333 -409 -11066 -5827
4983e827J1911R741J2564k251l759r828k5296j3024P979L019K646N403m351q32
$$ -5827 6084 15825 28389 26138 22379 12551 -12745 -25769 -17790 -14771 -12125 -6722 -11073 -11905
4969a1905j153k137K508Q998P169J286n12k02K079K453R998r906j3911L903k185
$$ -11905 -13058 -15195 -12687 -3689 3480 4766 4254 4052 6131 8584 18582 8676 -5235 -1332 -3517
4954c517L119l692q421j291m029j935N464Q958o837m37p331P614J101l644J667
$$ -3517 -398 -4090 -12511 -13802 -17831 -19766 -14302 -5344 -12181 -12618 -19949 -12335 -11234 -14878 -13211
4939a3211L304m89L184N384k364m659q126L012P566J4130K346j2141l730P186
$$ -13211 -9907 -10396 -7212 -1828 -4192 -8851 -16977 -13965 -6399 7731 10077 -2064 -5794 1392
4925A392K806j127m763n630j3824J8948J7844o030j577O658J527j158o465q329
$$ 1392 4198 3071 -1692 -7322 -21146 -2198 15646 9616 8039 14697 16224 15066 8601 272
4911B72m721O781R57j0510L953K58j623q310j455P265Q749m595n556Q106q648
$$ 272 -4449 2332 3289 -7221 -3268 -3010 -4633 -12943 -14398 -7133 1616 -2979 -8535 -429 -9077
4896i077l292l137q374j318R736Q386Q811K482O456L085M625j83o745n641p857
$$ -9077 -12369 -15506 -23880 -25198 -15462 -7076 1735 4217 10673 13758 18383 18200 11455 5814 -2043
4881b043m208K6K917l285K859N34K992m258R594O112r131j5018r084M081L894
$$ -2043 -6251 -6225 -3308 -6593 -3734 -3200 -208 -4466 5128 11240 2109 -12909 -21993 -17912 -14018
4866a4018J0162J3384N592J3097M226r953j7134o135J742j0976J551r37J81J1883
$$ -14018 -3856 9528 15120 28217 32443 22490 5356 -779 963 -10013 -8462 -9399 -9218 2665
4852B665Q625n622r127n280o735L503M802Q474J857k3375n359J6020J2579q86
$$ 2665 11290 5668 -3459 -8739 -15474 -11971 -7169 1305 3162 -20213 -25572 -9552 3027 2141
4838B141j166n52j2304j5854q711R289O288o282J4317K266L617j1459p336L767
$$ 2141 975 423 -11881 -27735 -36446 -27157 -20869 -27151 -12834 -10568 -6951 -18410 -25746 -21979
4824b1979J5666O485J0623M019j4356m219m559M876K966M319q465k613L882o818
$$ -21979 -6313 172 10795 14814 458 -3761 -8320 -3444 -478 3841 -4624 -7237 -3355 -10173
4810a0173k102J2715q136p437J9375O100j0710O842n477K018j626q506j3046N185
$$ -10173 -12275 440 -7696 -15133 4242 10342 -368 6474 997 3015 1389 -7117 -20163 -14978
4796a4978J9190J5662l957j5847l057J1102q107j2971P451L275M388L289J07p534
$$ -14978 4212 19874 15917 70 -2987 8115 8 -12963 -5512 -2237 2151 5440 5547 -1987
4782a987O282O279j096K070K644j171j7886p777J05J3424r896r249R032R238m3
$$ -1987 4295 10574 9478 11548 14192 13021 -4865 -12642 -12537 887 -9009 -18258 -9226 12 -31
4767c1p459K752P588j2560j6562o20N532R211k995P677j1485M316J626N722k874
$$ -31 -7490 -4738 2850 -9710 -26272 -26892 -21360 -12149 -15144 -7467 -18952 -14636 -13010 -7288 -10162
4752a0162o080J5552n994j6730n532P043J2046k855r846n525O348J1734L682q051
$$ -10162 -16242 -690 -6684 -23414 -28946 -21903 -9857 -12712 -22558 -28083 -21735 -10001 -6319 -14370
4738a4370r286Q00N155J5838P727J7372n081l15M124m519r388o138o222k411n052
$$ -14370 -23656 -22856 -17701 -1863 5864 23236 18155 17840 21964 17445 8057 1919 -4303 -6714 -11766
4723a1766j0849m456j2739J791J225K0174L020P23M050M587k484j19K035J428
$$ -11766 -22615 -27071 -39810 -38019 -36794 -16620 -13600 -12877 -8827 -4240 -6724 -6843 -4808 -3380
4709c380L850m731o238J1361O016N967j076l808N899l360j8009j844M139k991
$$ -3380 470 -4261 -10499 862 6878 12845 11769 7961 13860 10500 -7509 -9353 -5214 -8205
4695h205p436m018j212p876J299O889N917o155K904J3033p422p879J2980l882
$$ -8205 -15641 -19659 -20871 -28747 -27448 -20559 -14642 -20797 -17893 -4860 -12282 -20161 -7181 -11063
4681a1063L870J46L916M770n393J72O892J260o084L220l05L675Q634L162k53j1016
$$ -11063 -7193 -7047 -3131 1639 -3754 -3582 3310 4570 -1514 1706 1401 5076 13710 16872 16619 5603
4665E603m611n49l859r483n239P069n05l656m163J2546J0229P017O532j1564m217
$$ 5603 992 443 -3416 -12899 -18138 -11069 -11574 -15230 -19393 -6847 3382 10399 16931 5367 1150
4650A150q73l361K328P572j536k754O120O495o491m895j0712J757J7128j5160
$$ 1150 277 -3084 -756 6816 5280 2526 8646 15141 8650 3755 -6957 -5200 11928 -3232
4636c232j5961P185k269k76o20j4566L77J6115J7248J0435l202l895l730l860
$$ -3232 -19193 -12008 -14277 -14553 -15173 -29739 -29362 -13247 4001 14436 11234 7339 3609 -251
4622b51n139j738N643m885k233P280J1605J0124j631K716o104o24j5634j2975
$$ -251 -5390 -7128 -1485 -6370 -8603 -1323 10282 20406 18775 21491 15387 14763 -871 -13846
4608a3846q043L048N774K751l650N71k793m888j2215k295J0091J9695M916o506
$$ -13846 -21889 -18841 -13067 -10316 -13966 -13395 -16188 -21076 -33291 -35586 -25495 -5800 -884 -7390
4594g390p109K071r655q356J677J8969R350M837l259j3516k461J0352J1538P56
$$ -7390 -14499 -12428 -22083 -30439 -28762 -9793 -443 4394 1135 -12381 -14842 -4490 7048 7804
4580G804J91l825J169q707j2065n071L506J694M989K0329o34j1223M823M393K376
$$ 7804 7995 4170 5339 -3368 -15433 -20504 -16998 -15304 -10315 10014 9380 -1843 2980 7373 9749
4565I749O379j648o769j3544l034p217L140K335l732J1335J516q30k300K723k089
$$ 9749 16128 14480 7711 -5833 -8867 -16084 -12944 -10609 -14341 -3006 -1490 -2320 -4620 -1897 -3986
4550c986j1491j3024J246M615j057J818j2902N978K035o080J237J9275J2727K460
$$ -3986 -15477 -28501 -27255 -22640 -23697 -21879 -34781 -28803 -26768 -32848 -31611 -12336 391 2851
4536B851J480J8235m689j0090N418J1092O95l618q793M223J2807j0607j1513r602
$$ 2851 4331 22566 17877 7787 13205 24297 24992 21374 12581 16804 29611 19004 7491 -2111
4522b111q798L19J6382p094j2828n041K1955J6936M023m183J51j386j859k240
$$ -2111 -10909 -10590 5792 -1302 -14130 -19171 2784 19720 23743 19560 19711 18325 16466 14226
4508A4226j1056l863N21J871M431k2467K599J3704M732j0241j9892O454N213j217
$$ 14226 3170 -693 -172 1699 6130 -16337 -13738 -34 4698 -5543 -25435 -18981 -13768 -14985
4494a4985R236K946k708m552k659R035O86J714o660j6195m072J4951J3071p31
$$ -14985 -5749 -2803 -5511 -10063 -12722 -3687 -3001 -1287 -7947 -24142 -28214 -13263 -192 -923
4480i23K317j3317j206P748K743K134n891j3537q352R619J3289J3290m465j8220
$$ -923 1394 -11923 -13129 -5381 -2638 -504 -6395 -19932 -28284 -18665 -5376 7914 3449 -14771
4466a4771O651J0529N08l298Q188m71m850P481K0331n087j1818O07j0736J2567
$$ -14771 -8120 2409 2917 -381 7807 7336 2486 9967 30298 25211 13393 14000 3264 15831
4452A5831k562o07j1494J1124L223m69l765Q893j937j418j0873K363P726l77L998
$$ 15831 13269 12662 1168 12292 15515 15046 11281 20174 18237 16819 5946 8309 16035 15658 19656
4437A9656j2043K881L709k0798n460K399r338m428M230K683j1144j563K1280K3498
$$ 19656 7613 10494 14203 -6595 -12055 -9656 -18994 -23422 -19192 -16509 -27653 -29216 -7936 15562
4423A5562P927k0147k38m420j6404N419K0734q146j830J062q66K953k621Q529
$$ 15562 23489 3342 3104 -1316 -17720 -12301 8433 287 -1543 -481 -1347 1606 -1015 7514
4409G514k776n431P19m10N131Q110k329R706o271j4630r395o272J3553n932l711
$$ 7514 4738 -693 26 -384 4747 12857 10528 20234 13963 -667 -10062 -16334 -2781 -8713 -12424
4394a2424j5072M528K0111l280k822p05r416P856R608j344m969J0297Q054J9027
$$ -12424 -27496 -22968 -2857 -6137 -8959 -9664 -19080 -11224 -1616 -2960 -7929 2368 10422 29449
4380B9449j794j8340m580r58j577O333k904m292N885N290o40Q737j5222j0131
$$ 29449 27655 9315 4735 3777 2200 8533 5629 1337 7222 12512 11872 20609 5387 -4744
4366d744r956K422K098L83N223l653R2P352O300m656K738o08o35r603j5592m75
$$ -4744 -14700 -12278 -10180 -9797 -4574 -8227 -8135 -783 5517 861 3599 2991 2356 -7247 -22839 -23314
4350b3314J7916J822o634m231J757O745l304J0608N965O894j3403j1618n209j467
$$ -23314 -5398 -3576 -10210 -14441 -12684 -5939 -9243 1365 7330 14224 821 -10797 -16006 -17473
4336a7473J2118O721j6455j1870J0430Q997M682n287l003P588O35j5615J8328
$$ -17473 -5355 1366 -15089 -26959 -16529 -7532 -2850 -8137 -11140 -3552 -2917 -18532 -204
4323b04J1946j4263m150r946j13k081j87R505O431R79r466m487P297r756N05Q367
$$ -204 11742 -2521 -6671 -16617 -16730 -18811 -18998 -9493 -3062 -2083 -11549 -16036 -8739 -18495 -17990 -9623
4307i623M108k218J869P186J5434p686K577Q42L83N682j0968o61K156k062j007
$$ -9623 -5515 -7733 -5864 1322 16756 9070 11647 12489 12872 18554 7586 6925 9081 7019 6012
4292F012k3303M622J088N602J778l453m117P740J1123J782j4054q290j4437J0797
$$ 6012 -17291 -12669 -11581 -5979 -4201 -7654 -11771 -4031 7092 8874 -5180 -13470 -27907 -17110
4278a7110J9612J9283r299j0555J255j0373l31J33l626m551K502N450j495O436
$$ -17110 2502 21785 12486 1931 3186 -7187 -7518 -7385 -11011 -15562 -13060 -7610 -9105 -2669
4264b669J3241o582o576R926j1260j4592n36j170J4480K603K413N901K217j4172
$$ -2669 10572 3990 -2586 7340 -3920 -18512 -19048 -20218 -5738 -3135 -722 5179 7396 -6776
4250f776m845N113Q860o516l305o546K451J8104L879N99k314q409j846M975n515
$$ -6776 -11621 -6508 2352 -4164 -7469 -14015 -11564 6540 10419 11018 8704 295 -1551 3424 -2091
4235b091qm869M580P339R995J5102K306l585j1485L860q076l357K817o957P17
$$ -2091 -2099 -6968 -2388 4951 14946 30048 32354 28769 17284 21144 13068 9711 12528 5571 6288
4220F288l951L103p12r775k978N22J449L361m153p703l335j454j65q244J5060
$$ 6288 2337 5440 4728 -5047 -8025 -7503 -6054 -2693 -6846 -14549 -17884 -19338 -19503 -27747 -12687
4205a2687n110N255L814l85N722o298l188K213Q045P295L281M161r669o117j7635
$$ -12687 -17797 -12542 -8728 -9113 -3391 -9689 -12877 -10664 -2619 4676 7957 12118 2449 -3668 -21303
4190b1303m611J5675R524q637j1336j945J7167K733l145Q146m137J346l809r63
$$ -21303 -25914 -10239 -715 -9352 -20688 -22633 -5466 -2733 -5878 2268 -1869 -523 -4332 -5295
4176e295k813j2825k282Q640J9539k002p453o799J2606k455k961q630J6429J5574
$$ -5295 -8108 -20933 -23215 -14575 4964 2962 -4491 -11290 1316 -1139 -4100 -12730 3699 19273
4162A9273n667n835J84k481q806r163n409j417j964K1025J7409J155j3214j5239
$$ 19273 13606 7771 7955 5474 -3332 -12495 -17904 -19321 -21285 -260 17149 18304 5090 -10149
4148a0149q142O953Q187o308n131k940n660N951m019J62r253K48J7524L301J1299
$$ -10149 -18291 -11338 -3151 -9459 -14590 -17530 -23190 -17239 -21258 -21096 -30349 -30101 -12577 -9276 2023
4133B023J23j7125j2101j2157J6500K2048O75M42L431L800r638j1866J6936J6709
$$ 2023 2146 -14979 -27080 -39237 -22737 -689 -14 428 3859 7659 -1979 -13845 3091 19800
4119A9800l808j6175o95J0996j2739l667L128k551n313N197j827L576J137O584
$$ 19800 15992 -183 -878 10118 -2621 -6288 -3160 -5711 -11024 -5827 -7654 -4078 -2941 3643
4105C643j149l174l857l148N403J6464l343M702q223K267j1423Q004J0268j2277
$$ 3643 2494 -680 -4537 -7685 -2282 14182 10839 15541 7318 9585 -1838 6166 16434 4157
4091D157n796r640l677k642p048P390R77O780J106k014j250K208L549m546j243
$$ 4157 -1639 -11279 -14956 -17598 -24646 -17256 -16279 -9499 -8393 -10407 -11657 -9449 -5900 -10446 -11689
4076a1689M764J0519N146M906p616o893M370L581j230p819n51k107K842q400r851
$$ -11689 -6925 3594 8740 13646 6030 -863 3507 7088 5858 -1961 -2512 -4619 -1777 -10177 -20028
4061b0028l732J9177K159p7n676K677O588J2076O637p23m635j6002j35J2623P5
$$ -20028 -23760 -4583 -2424 -2501 -8177 -5500 1088 13164 19801 19078 14443 -1559 -1694 10929 11004
4046A1004j189j41Q028M353K683q473n822j5679n297o519J5564o097o10M851n401
$$ 11004 9815 9674 17702 22055 24738 16265 10443 -5236 -10533 -17052 -1488 -7585 -8195 -3344 -8745
4031h745j0287r837l06J8512Q933p454j46P95J2457R316J01l524p285k85O429
$$ -8745 -19032 -28869 -29175 -10663 -1730 -9184 -9330 -8535 3922 13238 13339 9815 2530 2245 8674
4016H674j1743j832p335l871J4064K0136j5196r547P530N01j0868j364p648O776
$$ 8674 -3069 -4901 -12236 -16107 -2043 18093 2897 -6650 880 1381 -9487 -10851 -18499 -11723
4002a1723M264J2114O047j2133j0475J7036J5866q942r605P760R156j4990j5710
$$ -11723 -7459 4655 10702 -1431 -11906 5130 20996 12054 2449 10209 19365 4375 -11335
3989a1335m169J1980R858j1407r522K179L139J540N032j7682o466J7578K5031
$$ -11335 -15504 -3524 6334 -5073 -14595 -12416 -9277 -7737 -2705 -20387 -26853 -9275 15756
3976A5756R936q32j7179R45j617l506m825L232p708r144l491Q856j031J934R220
$$ 15756 25692 24860 7681 8626 7009 3503 -1322 1910 -5798 -14942 -18433 -9577 -10608 -8674 546
3961E46o057j0452K657R305o18j86M149J919j3687r34J0785J046p169J1029N429
$$ 546 -5511 -15963 -13306 -4001 -4619 -4805 -656 1263 -12424 -13358 -2573 -1527 -8696 2333 7762
3946G762l653M710K890q672k2845J0119Q052K616J1895m829j1545m421j4204J640
$$ 7762 4109 8819 11709 3037 -19808 -9689 -1637 979 12874 8045 -3500 -7921 -22125 -20485
3932b0485J8480L460j2283m153k743n909k997o198O026O807L194n936j918L14
$$ -20485 -2005 1455 -10828 -14981 -17724 -23633 -26630 -32828 -26802 -19995 -16801 -22737 -24655 -24341
3918b4341k965Q277Q031j1002J211J39Q558R780j130o515N08J150Q240o682m046
$$ -24341 -27306 -19029 -10998 -22000 -20789 -20650 -12092 -2312 -3442 -9957 -9449 -8299 -59 -6741 -10787
3903a0787R652r40j2451O625Q385J2969Q0k995m906K527M260o000j1805k844q759
$$ -10787 -1135 -2075 -14526 -7901 484 13453 13533 10538 5632 8159 12419 6419 -5386 -8230 -16989
3888a6989J185j1941P84L99j775N016N487P899J508K1229m933j3324R558j041
$$ -16989 -15804 -27745 -26961 -26562 -28337 -23321 -17834 -9935 -8427 12802 7869 -5455 4103 3062
3874C062q839j303Q678j505J316M182j2485l9R957j573k516k0183K460K452M446
$$ 3062 -5777 -7080 1598 93 1409 5591 -6894 -6933 3024 1451 -1065 -21248 -18788 -16336 -11890
3859a1890r33L287l220j0553R765J2144l39J739j872J8594o486j1699p186P905
$$ -11890 -12823 -9536 -12756 -23309 -13544 -1400 -1739 0 -1872 16722 10236 -1463 -8649 -744
3845g44m494j0916J1331j0496j3059N927J1011O498L306K103Q551r411o144n460
$$ -744 -5238 -16154 -4823 -15319 -28378 -22451 -11440 -4942 -1636 467 9018 -393 -6537 -11997
3831a1997K028O792l594K918p939k0128p626O906J2131J5278M168J294P097L029
$$ -11997 -9969 -3177 -6771 -3853 -11792 -31920 -39546 -32640 -20509 -5231 -1063 231 7328 10357
3817A0357M984j3741j092j3575m045K397N084k747Q479P281j42j1190j3506J3435
$$ 10357 15341 1600 508 -13067 -17112 -14715 -9631 -12378 -3899 3382 3240 -7950 -21456 -8021
3803h021J4696j0446m074r071L638M350J2094O746l810j0951j964j273r538k863
$$ -8021 6675 -3771 -7845 -16916 -13278 -8928 3166 9912 6102 -4849 -6813 -8086 -17624 -20487
3789b0487J3986O388p328O549r073p808N241N281p036K556P969R029L449Q073
$$ -20487 -6501 -113 -7441 -892 -9965 -17773 -12532 -7251 -14287 -11731 -3762 5267 8716 16789
3775A6789O152j197j1900k877j8107k487R636K941J356r686j2823J2673N854L402
$$ 16789 22941 21744 9844 6967 -11140 -13627 -3991 -1050 306 -9380 -22203 -9530 -3676 -274
3761b74o88m03k429M63N428M165N882J610M197Q53M961l664j1983L575r77q481
$$ -274 -962 -1365 -3794 -3331 2097 6262 12144 13754 17951 18804 23765 20101 8118 11693 10716 2235
3745B235j2945o828P063P689O827j2209n240O597N595j34p939o734J682J916M427
$$ 2235 -10710 -17538 -10475 -2786 4041 -8168 -13408 -6811 -1216 -1350 -9289 -16023 -14341 -12425 -7998
3730g998j3512J1138P714P712J805m081m022j2390j2456J2079N195L378J3158
$$ -7998 -21510 -10372 -2658 5054 6859 2778 -1244 -13634 -26090 -14011 -8816 -5438 7720
3717G720k68K043m915o026o252j423L759O824L993n674j469K377J116o023l048
$$ 7720 7452 9495 4580 -1446 -7698 -9121 -5362 1462 5455 -219 -1688 689 1805 -4218 -7266
3702g266n275J016j461N883O859j540N22O14J595r459k11J7676p39j304J804k793
$$ -7266 -12541 -11525 -12986 -7103 -244 -1784 -1262 -648 947 -8512 -8723 8953 8214 6910 8714 5921
3686E921j2333J67J704M9N146P056j6205k944K983j913L64K3813M464j1228j3819
$$ 5921 -6412 -6245 -4541 -4492 654 7710 -8495 -11439 -8456 -10369 -10005 13808 18272 7044 -6775
3671f775j87M353n086j5148l034J6061O517O749o05J820m639r51j3882n907j6104
$$ -6775 -6962 -2609 -7695 -22843 -25877 -9816 -3299 3450 2845 4665 26 -925 -14807 -20714 -36818
3656c6818j937J4108J5687J8518O327j6285l903K447N057Q439P559j398o006m090
$$ -36818 -38755 -24647 -8960 9558 15885 -400 -4303 -1856 3201 11640 19199 17801 11795 7705
3642G705Q376r747O52J546k494K554j255P355l406M179Q314p814j0677P981O193
$$ 7705 16081 6334 6986 8532 6038 8592 7337 14692 11286 15465 23779 15965 5288 13269 19462
3627A9462M554k216l905ql314k2517o514R048J004j476P634R424L215j608L07
$$ 19462 24016 21800 17895 17887 14573 -7944 -14458 -5410 -4406 -5882 1752 11176 14391 12783 13090
3612A3090j1436L131K010j872J293q669o594p996m00J847r793P028N524J1559
$$ 13090 1654 4785 6795 4923 6216 -2453 -9047 -17043 -17443 -15596 -25389 -18361 -12837 -1278
3598a278O833r78L280M262K132M16J09O26j6946j0304q38J1579m263m186M304
$$ -1278 5555 4577 7857 12119 14251 14667 14776 15402 -1544 -11848 -12686 -1107 -5370 -9556 -5252
3583e252q060L672R684K0173p398p835j065p050M10O779r140M628p201K253l87
$$ -5252 -13312 -9640 44 20217 12819 4984 3919 -3131 -2721 4058 -5082 -454 -7655 -5402 -5789
3568e789P235J246j7095l417J0942K141J958J8525l471n618r799j3433l685N00
$$ -5789 1446 2692 -14403 -17820 -6878 -4737 -2779 15746 12275 6657 -3142 -16575 -20260 -19760
3554a9760J3921O325j0700k1443o214J1727J6771J5210p364r674J4467k155m866
$$ -19760 -5839 486 -10214 -31657 -37871 -26144 -9373 5837 -1527 -11201 3266 1111 -3755
3541c755J2871O968P666j324j3569j3180k099p365k128k321P859L626L333L378
$$ -3755 9116 16084 23750 22426 8857 -4323 -6422 -13787 -15915 -18236 -10377 -6751 -3418 -40
3527d0R029k785J035j2937J852J1028l915j091j296M91m4j4383r991J227K116
$$ -40 8989 6204 7239 -5698 -3846 7182 3267 2176 880 1371 1327 -13056 -23047 -21820 -19704
3512a9704J0058L949J200j2794P172k951P138m50M013M595q096m023J0603J1699
$$ -19704 -9646 -5697 -4497 -17291 -10119 -13070 -5932 -6382 -2369 2226 -5870 -9893 710 12409
3498A2409p894j702k963j373M099J4519m38j459n389j2755L152J4114k590l647
$$ 12409 4515 2813 -150 -1523 2576 17095 16657 15198 9809 -2946 206 14320 11730 8083
3484H083l61K0835J4938r309k5175p489q959j0778q246J6059J658r010Q962J7858
$$ 8083 7722 28557 43495 34186 9011 1522 -7437 -18215 -26461 -10402 -8744 -17754 -8792 9066
3470I066M113q545j0316J0992J891J0816J310m858R92J214j0490p314p320j364
$$ 9066 13179 4634 -5682 5310 7201 18017 19327 14469 15461 16675 6185 -1129 -8449 -9813
3456i813L720j1423R967Q114j3910M183O304m278N39O533L209K221o72m219J741
$$ -9813 -6093 -17516 -7549 565 -13345 -9162 -2858 -7136 -6597 -64 3145 5366 4694 475 2216
3441B216n067L061o704m069N384j28j7488o124J2045J1697o975n107J6984O548
$$ 2216 -2851 210 -6494 -10563 -5179 -5307 -22795 -28919 -16874 -5177 -12152 -17259 -275 6273
3427F273K594K591m465k911J475R530K944l296N869O722k5017j1185R122j0294
$$ 6273 8867 11458 6993 4082 5557 15087 18031 14735 20604 27326 2309 -8876 246 -10048
3413a0048n871K339n057J332N959J0763J900r743j956m74N987J0123n773K192
$$ -10048 -15919 -13580 -18637 -17305 -11346 -583 1317 -8426 -10382 -10856 -4869 5254 -519 1673
3399A673J503j2969j3832P611J3274O271n643j1602N118Q887j292q814Q970J0931
$$ 1673 3176 -9793 -23625 -16014 -2740 3531 -2112 -13714 -8596 291 -1001 -9815 -845 10086
3385A0086j3325K872O906j867L249j152p571n164J601q91K552N561J0324N694
$$ 10086 -3239 -367 6539 4672 7921 6769 -802 -5966 -4365 -5256 -2704 2857 13181 18875
3371A8875L55K765N592j1629j8376o228j1612R033M944k130J979J329M18p330
$$ 18875 19230 21995 27587 15958 -2418 -8646 -20258 -11225 -6281 -8411 -6432 -5103 -4685 -12015
3357a2015q140j697o882L549J259K82O898R879J0690j113M360q98j515l510q125
$$ -12015 -20155 -21852 -28734 -25185 -23926 -23644 -16746 -6867 3823 2710 7070 6172 4657 1147 -6978
3342f978l579j2348Q404J4592L649P258Q826P256k273r494j0404m499K215q222
$$ -6978 -10557 -22905 -14501 91 3740 10998 19824 27080 24807 15313 4909 410 2625 -5597
3328e597k247J3653K09j7786j9781J1557J6156L096R437l345o693m437m795K979
$$ -5597 -7844 5809 6018 -11768 -31549 -19992 -3836 -740 8697 5352 -1341 -5778 -10573 -7594
3314g594O542R57M061J0248p822L996K143k255l020J545k735m588n897K833j0116
$$ -7594 -1052 -95 3966 14214 6392 10388 12531 10276 7256 8801 6066 1478 -4419 -1586 -11702
3299a1702q241Q540J8861K5555j907o049q554r980l192o640j0764R912M247q468
$$ -11702 -19943 -11403 7458 33013 31106 25057 16503 6523 3331 -3309 -14073 -4161 86 -8382
3285h382k307n727q396J5536J6243k159l197q879p006P51J3594l270r032J65M173
$$ -8382 -10689 -16416 -24812 -9276 6967 4808 1611 -7268 -14274 -13523 71 -3199 -12231 -12066 -7893
3270g893q458m018M240N498j3695j2976K0108K24m994k325L5P323M037j859N436
$$ -7893 -16351 -20369 -16129 -10631 -24326 -37302 -17194 -16970 -21964 -24289 -24254 -16931 -12894 -14753 -9317
3255i317P707j6856k017K891J0220M279N366L903j2063K233J3030m311j1581j2308
$$ -9317 -1610 -18466 -20483 -17592 -7372 -3093 2273 6176 -5887 -3654 9376 5065 -6516 -18824
3241a8824n898M059J1227J1742Q657J3270q249j8855J468q25m546N035l027o275
$$ -18824 -24722 -20663 -9436 2306 10963 24233 15984 -2871 -1403 -2228 -6774 -1739 -4766 -11041
3227a1041J2677J6969l46j4078J2384J1169j4351p789Q700J140j0054q732o032
$$ -11041 1636 18605 18259 4181 16565 27734 13383 5594 14294 15434 5380 -3352 -9384
3214i384p509p244k012p11J9234m28r523J292J4048J562j5457j6199l280j071
$$ -9384 -16893 -24137 -26149 -26860 -7626 -8054 -17577 -16285 -2237 -675 -16132 -32331 -35611 -36682
3200c6682J0564P533J84L122n893J0408J1814j4171r408k2263L66J2717K8820
$$ -36682 -26118 -18585 -18401 -15279 -21172 -10764 1050 -13121 -22529 -44792 -44426 -31709 -2889
3187b889J0160j1418o0n976O84K368m204j3710n066M739J1287P698J1081K302
$$ -2889 7271 -4147 -4207 -10183 -9499 -7131 -11335 -25045 -30111 -25372 -14085 -6387 4694 6996
3173F996j64M537K658p548j2635k3973j0548J8911O856P62j34L037N506M887N718
$$ 6996 6832 11369 14027 6479 -6156 -30129 -40677 -21766 -14910 -14148 -14282 -11245 -5739 -852 4866
3158D866m03k486P477m07r552r222L704O501p198r268J1729k035O567P29j1119
$$ 4866 4463 1977 9454 9047 -505 -9727 -6023 478 -6720 -15988 -4259 -6294 273 1002 -10117
3143a0117j676J185Q395k175k185j2815m278Q090J2619M275k837r716P898N344
$$ -10117 -11793 -10608 -2213 -4388 -6573 -19388 -23666 -15576 -2957 1318 -1519 -11235 -3337 2007
3129B007J847M428L366j796j0732k531m856j3052j1236M015K4688N034q464P01
$$ 2007 3854 8282 11648 9852 -880 -3411 -8267 -21319 -32555 -28540 -3852 1182 -7282 -6581
3115f581M944K20l607L288J0461N378r189j13j705n823K478N13m908j7348J0849
$$ -6581 -1637 -1417 -5024 -1736 8725 14103 4914 4801 3096 -2727 -249 264 -4644 -21992 -11143
3100a1143J181o298O161O919l455p371L738J6349k557j1959n159J5645J971l166
$$ -11143 -9962 -16260 -10099 -3180 -6635 -14006 -10268 6081 3524 -8435 -13594 2051 4022 856
3086H56j2914J3239J7723l291j1204m818N447l175K456j4237j1943j0941J5243
$$ 856 -12058 1181 18904 15613 4409 -409 5038 1863 4319 -9918 -21861 -32802 -17559
3073a7559J1910m75J914K576L96j6086J259K439Q811Q904j2737k9529k824Q210
$$ -17559 -5649 -6124 -4210 -1634 -1238 -17324 -16065 -13626 -4815 4089 -8648 -38177 -41001 -32791
3059c2791Q275J460J1109P764n077L858L37J1882j318j4698K047J1316N660j7091
$$ -32791 -24516 -23056 -11947 -4183 -9260 -5402 -5065 6817 5499 -9199 -7152 4164 9824 -7267
3045g267M572J8232M594j9741O731N242L625O192J325n965n537m516j3337J726
$$ -7267 -2695 15537 20131 390 7121 12363 15988 22180 23505 17540 12003 7487 -5850 -4124
3031d124j1333r717J426R888n180N28l326j5737J0469J3377P333p143O19O941
$$ -4124 -15457 -25174 -23748 -13860 -19040 -18512 -21838 -37575 -27106 -13729 -6396 -13539 -12920 -5979
3017e979J2437L764K980k658j0345j6024p70P374R588P998q39j609j852J3123
$$ -5979 6458 10222 13202 10544 199 -15825 -16595 -9221 367 8365 7526 5917 4065 17188
3003A7188J5425q126j4126n391K121J057l496k080r847m576q85O921k523M69M627
$$ 17188 32613 24487 10361 4970 7091 8148 4652 2572 -7275 -11851 -12736 -5815 -8338 -7869 -3242
2988c242m23o69L921N932J0896o404M344o641k755o43q180K369o618J951O595
$$ -3242 -3665 -4334 -413 5519 16415 10011 14355 7714 4959 4316 -3864 -1495 -8113 -6162 433
2973D33J9564P748j2687R727j2527p455L218N892q995p596n459l539J6937K1065
$$ 433 19997 27745 15058 24785 12258 4803 8021 13913 4918 -2678 -8137 -11676 5261 26326
2959B6326N380n155l329M72l0269j3755l09R42J0207M934J0933Q44J120n695J492
$$ 26326 31706 26551 23222 23694 -6575 -20330 -20639 -19697 -9490 -4556 6377 7221 8341 2646 4138
2944D138m344k0792p001O253Q36M255J1686N540M280l457q769J909J0813l829
$$ 4138 -206 -20998 -27999 -21746 -20910 -16655 -4969 571 4851 1394 -7375 -5466 5347 1518
2930A518P075O556m991q020L346J298j2464p135J2792J8961j1097q33J1181q012
$$ 1518 8593 15149 10158 2138 5484 6782 -5682 -12817 -25 18936 7839 7006 18187 10175
2916A0175o912k69m355k174J0280m801n812l126k608q6J5840O663q848O06q102
$$ 10175 3263 2994 -1361 -3535 6745 1944 -3868 -6994 -9602 -9688 6152 12815 3967 4573 -3529
2901c529o96K189m82O583P346j1461j6657M60N024Q03k411m630m093P424K0844
$$ -3529 -4225 -2036 -2518 4065 11411 -50 -16707 -16247 -11223 -10420 -12831 -17461 -21554 -14130 6714
2886F714N313p452J2087J3352j7224j5794O004K996J0230l68j1976q24K591j490
$$ 6714 12027 4575 16662 30014 12790 -3004 3000 5996 16226 15858 3882 3058 5649 4159
2872D159r578r249N512J2708m1N100N04j1027l308J4455j41M863k15m349N188
$$ 4159 -5419 -14668 -9156 3552 3511 8611 9115 -1912 -5220 9235 9094 13957 13742 9393 14581
2857A4581q705k570L070q358L192m876O069O90O391j45j590o581j2201k131q554
$$ 14581 5876 3306 6376 -1982 1210 -3666 2403 3093 9484 9339 7749 1168 -11033 -13164 -21718
2842b1718M552P263Q709J2188j239J882j0972j4329O318Q537K481J8417Q159j633
$$ -21718 -17166 -9903 -1194 10994 9755 11637 665 -13664 -7346 1191 3672 22089 30248 28615
2828B8615n720q603L307L289k153l047l608m466L963J086o781k0630K283N779
$$ 28615 22895 14292 17599 20888 18735 15688 12080 7614 11577 12663 5882 -14748 -12465 -6686
2814f686Q806p287n430J6408Q397r791Q31J363J6844Q64j4049m75L760M203q588
$$ -6686 2120 -5167 -10597 5811 14208 4417 5248 6611 23455 24319 10270 9795 13555 17758 9170
2799I170j0354j7909M979q69R242R756J741j0315m819L637K429N072j1094p597
$$ 9170 -1184 -19093 -14114 -14983 -5741 4015 5756 -4559 -9378 -5741 -3312 1760 -9334 -16931
2785a6931o757J7474L190q532p210P510j5650K029P469Q114j3973N261K1446M280
$$ -16931 -23688 -6214 -3024 -11556 -18766 -11256 -26906 -24877 -17408 -9294 -23267 -18006 3440 7720
2771G720K798k421m685r921M232J702j5485Q296P003J0772N002O97o084n566L990
$$ 7720 10518 8097 3412 -6509 -2277 -575 -16060 -7764 -761 10011 15013 15710 9626 4060 8050
2756H050J614O693Q770M221J704j2875p248m04K000p847j1040J968J5038J0895
$$ 8050 9664 16357 25127 29348 31052 18177 10929 10525 12525 4678 -6362 -4394 10644 21539
2742B1539n610j4163r005l021M472R787K02q978J1944R177J9p906j3826M495J2284
$$ 21539 15929 1766 -7239 -10260 -5788 3999 4201 -4777 7167 16344 16363 8457 -5369 -874 11410
2727A1410l05Q860p878p655O500q239j3693j1634r642j59J8550J0797j728J0503
$$ 11410 11105 19965 12087 4432 10932 2693 -11000 -22634 -32276 -32435 -13885 -3088 -4816 5687
2713E687O758J32j38l365j1417j0671N259P457o382J1173N595j796j8518M09L994
$$ 5687 12445 12577 12439 9074 -2343 -13014 -7755 -298 -6680 4493 10088 8292 -10226 -9817 -5823
2698e823J778O05Q502P847J0092q960o782N54j8469k0917N036J1056O743k015
$$ -5823 -4045 -3440 5062 12909 23001 14041 7259 7813 -10656 -31573 -26537 -15481 -8738 -10753
2684a0753R158J0252O742j1990q497M929j573O478N509p41q640J0681q035m726
$$ -10753 -1595 8657 15399 3409 -5088 -159 -1732 4746 10255 9514 874 11555 3520 -1206
2670a206r142J085L052j2388m093R897J2615j2359p036J4285O500j130N90m63
$$ -1206 -10348 -9263 -6211 -18599 -22692 -12795 -180 -12539 -19575 -5290 1210 80 670 207
2656B07j449N058Q905k634j3169j3603J0356O483J0817k973K875L791r68L522
$$ 207 -1242 3816 12721 10087 -3082 -16685 -6329 154 10971 7998 10873 14664 13696 17218
2642A7218j827J845R485m122p158p291P632J849p986P156M203j0637K612k309
$$ 17218 15391 17236 26721 22599 15441 8150 15782 17631 9645 16801 21004 10367 12979 10670
2628A0670k682L39o588K635k877j0783K150l69Q080l092J3956R48r467j5128N487
$$ 10670 7988 8327 1739 4374 1497 -9286 -7136 -7505 575 -2517 11439 12387 2920 -12208 -6721
2613f721R581L950N427j196J3431J402Q530j0592j9411J1566K655p995r256J187
$$ -6721 2860 6810 12237 11041 24472 25874 34404 23812 4401 15967 18622 10627 1371 2558
2599B558o097o190l336O70j00j1601q8P86K976J3730R70q098j0682p714L658L077
$$ 2558 -3539 -9729 -13065 -12395 -12495 -24096 -24184 -23398 -20422 -6692 -5722 -13820 -24502 -32216 -28558 -25481
2583b5481Q082O208L79m694J453J3070J2334j9277j7941Q000O554K175O950m56
$$ -25481 -17399 -11191 -10812 -15506 -14053 -983 11351 -7926 -25867 -17867 -11313 -9138 -2188 -2644
2569b644J195J2964L398j707l825q647j1829R71j249J559O416o95n292R411L407
$$ -2644 -1449 11515 14913 13206 9381 734 -11095 -10124 -11373 -9814 -3398 -4093 -9385 26 3433
2554C433N432m516J0405O448j522j2801j9783M292P153O669K949j3872J3226m936
$$ 3433 8865 4349 14754 21202 19680 6879 -12904 -8612 -1459 5210 8159 -5713 7513 2577
2540B577r145J302L766M177j687N77k498M853o728n379j067K184J0228q910J023
$$ 2577 -6568 -5266 -1500 2677 990 1567 -931 3922 -2806 -8185 -9252 -7068 3160 -5750 -4727
2525d727K52m81m229J698p625j3769M403K0291J1711o005m175o734P897N190N356
$$ -4727 -4475 -4956 -9185 -7487 -15112 -28881 -24478 -4187 7524 1519 -2656 -9390 -1493 3697 9053
2510I053l603j0505K876P644J1770o71j0228N62l409r352j6343L70J083j3046
$$ 9053 5450 -5055 -2179 5465 17235 16564 6336 6898 3489 -5863 -22206 -21836 -20753 -33799
2496c3799q915j413J275R064R341m80J5312K5796n346j3530j709o260R627J0420
$$ -33799 -42714 -44127 -42852 -33788 -24447 -24927 -9615 16181 10835 -2695 -4404 -10664 -1037 9383
2482I383J190n174O499m437k902p709n348J365K052r598r478O198K7124r65j1648
$$ 9383 10573 5399 11898 7461 4559 -3150 -8498 -7133 -5081 -14679 -24157 -17959 9165 8200 -3448
2467c448M945K97j5231n86O229p748R66M862k783M237J0980Q532k270K13l723
$$ -3448 1497 1794 -13437 -14023 -7794 -15542 -14576 -9714 -12497 -8260 2720 11252 8982 9195 5472
$$ [...]
##END NTUPLES=NMR SPECTRUM
##END=
