##TITLE=Analysis number 322055
Compound Code rjc 00692
Project Code adrs
Chemist Name stores
##JCAMPDX= 6.0         $$ Bruker NMR JCAMP-DX V2.0
##DATA TYPE= NMR SPECTRUM
##DATA CLASS= NTUPLES
##ORIGIN= Bruker BioSpin GmbH
##OWNER= nmr
$$ XWIN-NMR		Version 3.5
$$ Tue Sep 12 08:14:51 2006 GMT Daylight Time (UT+1h)  MAYBRIDGE\nmr@NMR_250MHZ
##.OBSERVE FREQUENCY= 250.131544655141
##.OBSERVE NUCLEUS= ^1H
##.ACQUISITION MODE= SIMULTANEOUS (DQD)
##.ACQUISITION SCHEME= undefined
##.AVERAGES= 16
##.DIGITISER RES= 18
##SPECTROMETER/DATA SYSTEM= dpx250
##.PULSE SEQUENCE= zg30
##.SOLVENT NAME= CDCl3
##.SHIFT REFERENCE= (INTERNAL, CDCl3, 0, 16.522)
##AUDIT TRAIL= $$ (NUMBER, WHEN, WHO, WHERE, WHAT)
$$ ##TITLE= Audit trail, XWIN-NMR		Version 3.5
$$ ##JCAMPDX= 5.01
$$ ##ORIGIN= Bruker BioSpin GmbH
$$ ##OWNER= nmr
$$ C:\u/data/dgb/nmr/ADRS/450/pdata/1/auditp.txt
$$ ##AUDIT TRAIL=  $$ (NUMBER, WHEN, WHO, WHERE, WHAT)
(   1,<2006-09-12 08:14:27.96 +100>,<MAYBRIDGE\nmr>,<NMR_250MHZ>,
      <created by zg, POWCHK disabled, PULCHK disabled
       configuration hash MD5:
       E2 DF 36 D8 04 B2 41 60 5A D7 A3 38 5A 4B D0 FE
       data hash MD5: 64K
       15 25 3D BF A5 F5 41 5D E1 1D 27 5F E8 FF EC C4>)
(   2,<2006-09-12 08:14:40.42 +100>,<MAYBRIDGE\nmr>,<NMR_250MHZ>,
      <Start of raw data processing
       ef LB = 0.3 FT_mod = 6 PKNL = 1 SI = 32K 
       data hash MD5: 32K
       8E D1 1E 0E A0 28 3A 9D 04 63 DB A1 48 89 D9 21>)
(   3,<2006-09-12 08:14:42.18 +100>,<MAYBRIDGE\nmr>,<NMR_250MHZ>,
      <apk 
       data hash MD5: 32K
       69 C3 11 7B E9 36 73 C4 1D 61 67 3D C3 94 DF A6>)
(   4,<2006-09-12 08:14:43.04 +100>,<MAYBRIDGE\nmr>,<NMR_250MHZ>,
      <abs ABSG = 5 
       data hash MD5: 32K
       AB 98 0B C4 D8 47 20 1D 2B BB 64 07 8D 6E 1B 65>)
$$ ##END=
$$ 
$$ hash MD5
$$ 01 8F BD CD 22 75 E8 FA 10 85 15 17 44 18 E5 77
##$RELAX= 
##$RELAX= 
##$RELAX= 
##$RELAX= 
##$RELAX= 
##$RELAX= 
##$RELAX= 
$$ Bruker specific parameters
$$ --------------------------
##$DU= <C:\u>
##$EXPNO= 450
##$NAME= <ADRS>
##$PROCNO= 1
##$TYPE= <nmr>
##$USER= <dgb>
##$AMP= (0..31)
100 100 100 100 100 100 100 100 100 100 100 100 100 100 100 100 100 100 
100 100 100 100 100 100 100 100 100 100 100 100 100 100 
##$AQSEQ= 0
##$AQ_mod= 3
##$AUNM= <au_zg>
##$AUTOPOS= <17 >
##$BF1= 250.13
##$BF2= 250.13
##$BF3= 250.13
##$BF4= 250.13
##$BF5= 500.13
##$BF6= 500.13
##$BF7= 500.13
##$BF8= 500.13
##$BYTORDA= 1
##$CFDGTYP= 0
##$CFRGTYP= 5
##$CHEMSTR= <none>
##$CNST= (0..31)
1 1 145 1 1 1 1 1 1 1 1 1 1 1 1 1 1 1 1 1 1 1 1 1 1 1 1 1 1 1 1 1 
##$CPDPRG= <>
##$CPDPRG1= <>
##$CPDPRG2= <>
##$CPDPRG3= <>
##$CPDPRG4= <mlev>
##$CPDPRG5= <mlev>
##$CPDPRG6= <mlev>
##$CPDPRG7= <mlev>
##$CPDPRG8= <mlev>
##$CPDPRGB= <>
##$CPDPRGT= <>
##$D= (0..31)
0 1 0 0 0 0 0 0 0 0.06 0 0 0 0 0 0 0.0002 0 0 0 0 0 0 0 0 0 0 0 0 0 0 
0 
##$DATE= 1158045266
##$DBL= (0..7)
120 120 120 120 120 120 120 120 
##$DBP= (0..7)
150 150 150 150 150 150 150 150 
##$DBP07= 0
##$DBPNAM0= <>
##$DBPNAM1= <>
##$DBPNAM2= <>
$$ [...]
##$SUBNAM7= <"">
##$SUBNAM8= <"">
##$SUBNAM9= <"">
##$SW= 20.6930455092707
##$SWIBOX= (0..15)
0 0 3 0 0 0 0 0 0 0 0 0 0 0 0 0 
##$SW_h= 5175.983436853
##$TD= 65536
##$TD0= 1
##$TE= 296.16
##$TE2= 300
##$TE3= 300
##$TEG= 300
##$TL= (0..7)
0 120 120 120 120 120 120 120 
##$TP= (0..7)
150 150 150 150 150 150 150 150 
##$TP07= 0
##$TPNAME0= <>
##$TPNAME1= <>
##$TPNAME2= <>
##$TPNAME3= <>
##$TPNAME4= <>
##$TPNAME5= <>
##$TPNAME6= <>
##$TPNAME7= <>
##$TPOAL= (0..7)
0.5 0.5 0.5 0.5 0.5 0.5 0.5 0.5 
##$TPOFFS= (0..7)
0 0 0 0 0 0 0 0 
##$TUNHIN= 0
##$TUNHOUT= 0
##$TUNXOUT= 0
##$USERA1= <user>
##$USERA2= <user>
##$USERA3= <user>
##$USERA4= <user>
##$USERA5= <user>
##$V9= 5
##$VALIST= <valist>
##$VCLIST= <CCCCCCCCCCCCCCC>
##$VD= 0
##$VDLIST= <DDDDDDDDDDDDDDD>
##$VPLIST= <PPPPPPPPPPPPPPP>
##$VTLIST= <TTTTTTTTTTTTTTT>
##$WBST= 1024
##$WBSW= 4
##$XGAIN= (0..3)
0 0 0 0 
##$XL= 0
##$YL= 0
##$YMAX_a= 487422
##$YMIN_a= -475375
##$ZGOPTNS= <>
##$ZL1= 120
##$ZL2= 120
##$ZL3= 120
##$ZL4= 120
##$ABSF1= 16.522
##$ABSF2= -4.171173
##$ABSG= 5
##$ABSL= 3
##$ALPHA= 0
##$AQORDER= 0
##$ASSFAC= 0
##$ASSFACI= 0
##$ASSFACX= 0
##$ASSWID= 0
##$AUNMP= <proc_1d>
##$AZFE= 0.1
##$AZFW= 0.1
##$BCFW= 0
##$BC_mod= 0
##$BYTORDP= 0
##$COROFFS= 0
##$CY= 12.5
##$DATMOD= 1
##$DC= 0
##$DFILT= <>
##$DTYPP= 0
##$F1P= 14.0000005364418
##$F2P= -0.99999901652339
##$FCOR= 0.5
##$FTSIZE= 32768
##$FT_mod= 6
##$GAMMA= 0
##$GB= 0
##$INTBC= 1
##$INTSCL= 1
##$ISEN= 128
##$LB= 0.3
##$LEV0= 0
##$LPBIN= 0
##$MAXI= 10000
##$MC2= 0
##$MEAN= 0
##$ME_mod= 0
##$MI= 0
##$NCOEF= 0
##$NC_proc= -3
##$NLEV= 6
##$NOISF1= 0
##$NOISF2= 0
##$NSP= 0
##$NTH_PI= 0
##$NZP= 0
##$OFFSET= 16.522
##$PC= 1
##$PHC0= 143.7188
##$PHC1= 4.399282
##$PH_mod= 1
##$PKNL= yes
##$PPARMOD= 0
##$PSCAL= 4
##$PSIGN= 0
##$REVERSE= no
##$SF= 250.13
##$SI= 32768
##$SIGF1= 0
##$SIGF2= 0
##$SINO= 400
##$SIOLD= 32768
##$SREGLST= <1H.CDCl3>
##$SSB= 0
##$STSI= 32768
##$STSR= 0
##$SW_p= 5175.98343685301
##$SYMM= 0
##$S_DEV= 0
##$TDeff= 65536
##$TDoff= 0
##$TI= <Analysis number 999999
Compound Code 99
Book Reference 9
Project Code 9>
##$TILT= no
##$TM1= 0
##$TM2= 0
##$TOPLEV= 0
##$USERP1= <user>
##$USERP2= <user>
##$USERP3= <user>
##$USERP4= <user>
##$USERP5= <user>
##$WDW= 1
##$XDIM= 32768
##$YMAX_p= 433370269
##$YMIN_p= -52859
$$ End of Bruker specific parameters
$$ ---------------------------------
##NTUPLES= NMR SPECTRUM
##VAR_NAME=  FREQUENCY,     SPECTRUM/REAL,   SPECTRUM/IMAG
##SYMBOL=    X,             R,               I
##VAR_TYPE=  INDEPENDENT,   DEPENDENT,       DEPENDENT
##VAR_FORM=  AFFN,          ASDF,            ASDF
##VAR_DIM=   32768,         32768,           32768
##UNITS=     HZ,            ARBITRARY UNITS, ARBITRARY UNITS
##FACTOR=    0.157963299565203, 1,           1
##FIRST=     4132.6476996994, 0,             0
##LAST=      -1043.33573715361, 0,           0
##MIN=       -1043.33573715361, -52859,      0
##MAX=       4132.6476996994, 433370269,     0
$$ Real data points
##PAGE= N=1
##DATA TABLE= (X++(R..R)), XYDATA
$$ [...]
15957C7832K057N922P173n15r341j2695J0235K584L347J937r331o036j455K0009
15943E1723q684j1716o849j6956j4679O921J1498J8816J3526j590J2219p625r390
15930C7214j0339m055J134N666J0676j862l033j3701J2173P193R858M219O834
15917F1977L757j0976j6350j2525Q991J8781R021j0450n319N739J1024J4152j5301
15904F2521j067O831l377J882m306k1418j3531q529o864n121J5625J1313M594
15891C8553r565l210J377L039N847J3562J1232M70k4977n107L062Q720O370P686
15877E7059K143k573q375j5122n614r86j0411J3261K540N159k172J412m422O730
15863C8629J0932n387R66K589j5376j1817q014J2973R624k732R172J646M39l461
$$ plain form
15957 37832 39889 45811 52984 52469 43128 30433 40668 43252 46599 48536 39205 33169 31714 51723
15943 51723 43039 31323 24474 7518 -7161 -240 11258 30074 43600 42010 54229 46604 37214
15930 37214 26875 22820 23954 29620 40296 38434 35401 21700 33873 41066 50924 55143 61977
15917 61977 65734 54758 38408 25883 34874 53655 62676 52226 46907 52646 63670 77822 62521
15904 62521 61454 68285 64908 66790 62484 41066 27535 19006 12142 7021 22646 33959 38553
15891 38553 28988 25778 27155 30194 36041 49603 60835 61305 36328 31221 34283 43003 49373 57059
15877 57059 59202 56629 48254 33132 27518 26532 16121 29382 31922 37081 34909 36321 31899 38629
15863 38629 49561 44174 45140 47729 32353 20536 12522 25495 35119 32387 41559 43205 43644 40183
15849D0183j557j0059j162P398m17q41k521k252j1297O287N69Q411J1305j7405
15835B6642P625Q837L50K553N642M56j5807Q591J5596J4668l881r397j0663R83
15821E2195o926p15l192m747P02N078L785J2397N22P321J3558K529L12p815j5094
15806E9910J051K430m281n440J0885R799o258n824k855K500N265M76n962l545
15792E8151K266m145J1680N450n751j2670O27R589P230j449K56r536j081k147
15778E8470j441l253q68n918J731J2904Q969P137K769J533j9449p54O947M411
15764G3188r137q03n389l723L497K446m444L61Q086J2351M26q207m277j838P61
15749F3298J17j0257r065J2436J5031l886Q17j549m36O947k837r597j090L077
$$ plain form
15849 40183 38626 28567 27405 34803 34386 33545 31024 28772 17475 23762 24331 32742 44047 26642
15835 26642 34267 43104 43454 46007 51649 52105 36298 44889 60485 75153 71272 61875 51212 52195
15821 52195 45269 44554 41362 36615 37317 42395 46180 58577 59099 66420 79978 82507 82819 75004 59910
15806 59910 60961 63391 59110 53670 64555 74354 68096 62272 59417 61917 67182 67658 61696 58151
15792 58151 60417 56272 67952 73402 67651 54981 55608 65197 72427 70978 71234 61698 60617 58470
15778 58470 57029 53776 52908 46990 48721 61625 70594 77731 80500 82033 62584 61830 68777 73188
15764 73188 64051 63248 57859 54136 57633 60079 55635 55996 64082 76433 76859 68652 64375 62537 63298
15749 63298 63415 53158 44093 56529 71560 67674 68491 66942 66506 73453 70616 61019 59929 63006
15735F3006m146j547J2956O055R939n622j1081K990L550q680n778J2543p573Q205
15721G4817j091l225o014P406P28r399M309K1429N467r443j0466q997p788K664
15707F0397J2829j286N318o024o765j4425j50K248Q489J6471K005l377M528n287
15693G4971j5787K508K0157k75p522l616o009j5527J214R548j419MP972K534O94
15678F9447K622K813L667m862n214j2326n168P674J2825M313l936k695O95j0016
15664E9839m41J0008L81r363J6905J2671o613j2789N553L553q86J4994Q091j0082
15650I1821q176R254n331k547L945P08P180P987J0327j1884j4663L689J1054j1781
15636I1583j0972n763o493Q416R420p354r026k421M004O635J23N629K508L895
$$ plain form
15735 63006 58860 57313 70269 76324 86263 80641 69560 72550 76100 67420 61642 74185 66612 74817
15721 74817 73726 70501 64487 71893 72621 63222 67531 88960 94427 84984 74518 65521 57733 60397
15707 60397 73226 71940 77258 71234 64469 50044 49894 52142 60631 77102 79107 75730 80258 74971
15693 74971 59184 61692 81849 81574 74052 70436 64427 48900 50114 59662 58243 58247 66219 68753 69447
15678 69447 72069 74882 78549 73687 68473 56147 50979 58653 71478 75791 71855 69160 69855 59839
15664 59839 59398 69406 69787 60424 77329 90000 83387 70598 76151 79704 78818 93812 101903 91821
15650 91821 83645 92899 87568 85021 88966 89674 96854 104841 115168 103284 88621 92310 103364 91583
15636 91583 80611 74848 68355 76771 86191 78837 69811 67390 71394 78029 78152 83781 86289 90184
15622I0184J69j8058p948N250K752Q462N268K330n817p547O324O40J86M766J4582
15607A01543J571k785N703j4813p487J9913J2841O728j6022l391j1406L0J157
15594I3582k395j2221L059Q295J1563m548q397j654j931m642l590N163O547J0290
15580I9121L292K268R32j433j279l544O840m993l659k829l069P756N74l370j7215
15565G9392M453J4606J0009p443k162J4515P044j3483l869J991r011n954p539
15552H2549j7j007K101J2801k305Q423K135p483M342J579n612L907O81M677m567
15537A02204n929P4p200l020l339m417J4869O217N201J0164n12J690k037j5244
15523I8721j515L090J4825L086r296n757o628J2000R953r424O69M745P231q475
$$ plain form
15622 90184 90353 72295 64347 69597 72349 80811 86079 88409 82592 75045 81369 82009 82195 86961 101543
15607 101543 103114 100329 106032 91219 83732 103645 116486 123214 107192 103801 92395 92425 93582
15594 93582 91187 78966 82025 90320 101883 97335 88938 87284 85353 80711 77121 82284 88831 99121
15580 99121 102413 104681 105613 104180 102901 99357 106197 101204 97545 94716 91647 99403 99977 96607 79392
15565 79392 83845 98451 108460 101017 98855 113370 120414 106931 103062 105053 96042 90088 82549
15552 82549 82532 81525 83626 96427 94122 102545 104680 97197 101539 103118 97506 101413 102094 106771 102204
15537 102204 96275 96349 89149 86129 82790 78373 93242 99459 104660 114824 114312 116002 113965 98721
15523 98721 97206 100296 115121 118207 108911 103154 96526 108526 118479 109055 109724 114469 121700 113225
15509A13225j687J7186O381R119n969j5578O346J2396q501q705O962J1884j6122
15496A26937R529L798o963K126n419q486n628J3649R654Q030P794j6425o208M909
15482A37297n633q278k120O43m374Q649L776l684M680j626j174l882n773J84M107
15467A22792K0932N133k03n539K066r719j0738p823L593J2478J0245Q26k950l632
15453A37461N955L837L074m011j0870L825N016n765m376K149L730m051k868k4
15439A33082J5928J2686O789P0J595p743J136j166N035m650r883k915j1245L997
15425A42716J0283M202m44R792Q381n107N979K048j5752j5452Q88R512Q097Q560
15411A73703n25r2L00o528j053J285o357R825J8092k742k704P147K90J095p388
$$ plain form
15509 113225 111538 128724 135105 144224 138255 122677 129023 141419 132918 124213 131175 143059 126937
15496 126937 136466 140264 133301 135427 130008 121522 115894 129543 139197 147227 155021 138596 132388 137297
15482 137297 131664 123386 121266 121909 117535 126184 129960 126276 130956 129330 128156 124274 118501 118685 122792
15467 122792 143724 148857 148654 143115 145181 135462 124724 116901 120494 132972 143217 144043 141093 137461
15453 137461 143416 147253 150327 146316 135446 139271 144287 138522 134146 136295 140025 135974 133106 133082
15439 133082 149010 161696 168485 168555 170150 162407 163543 162377 167412 162762 152879 149964 138719 142716
15425 142716 152999 157201 156757 166549 174930 169823 175802 177850 162098 146646 147534 157046 165143 173703
15411 173703 173178 173086 173386 166858 165805 167090 160733 170558 188650 185908 183204 190351 190641 191736 184348
15396A84348j1940L876j296K274p765n552M651Q441O665r952l352k228K688n619
15382A65239o29J1856J6459P707N82k108R980p05j0946j1023m581o919K665k02
15368A77375K762J884l871K779J4195j933j0874M844P971O475J4250o282j6995
15355A92580J0389P375L267J279j4211J0301J2052L263p349p126L813q405k1764
15342A85464Q338J8770J0257K582J3674K154J1097m969k936j4097R989Q099L330
15329B51752n097k0474L086P072J266P34l74q719J66K043J0317n798q652j0126
15315B17196K781J2023L64j1145J0247P170l48r40J0410k285n602j986J1693J3812
15301B63390J2010M814N343j843j4107j4450K198K978N772n315N226m851j1509
$$ plain form
15396 184348 172408 176284 174988 177262 169497 163945 168596 177037 183702 173750 170398 168170 170858 165239
15382 165239 164610 176466 192925 200632 201214 199106 209086 208381 197435 186412 181831 174912 177577 177375
15368 177375 180137 182021 178150 180929 195124 193191 182317 187161 195132 201607 215857 209575 192580
15355 192580 202969 210344 213611 214890 200679 210980 223032 226295 218946 211820 215633 207228 185464
15342 185464 193802 212572 222829 225411 239085 241239 252336 247367 244431 230334 240323 248422 251752
15329 251752 246655 226181 229267 236339 237605 238339 237965 229246 229412 231455 241772 235974 227322 217196
15315 217196 219977 232000 232364 221219 231466 238636 238288 237348 247758 245473 239871 237885 249578 263390
15301 263390 275400 280214 285557 283714 269607 255157 257355 260333 266105 260790 266016 261165 249656
15288B49656j463J3938J0021Q523l226N45O513r126m042J6840J4486J0449j1676
15275C01438m062P5k90m816O065O914O766j1257q70j387j227m013R36N958k748
15260B97482R961K798k0156r25p563R829J8908K292J4376J513l714L713j37M272
15246C32649M423q298o108r399R975K38p0P045O342J1785K028j0516o515O23R431
15231C43633n269p077P766N72l322M293Q892j855L737K195M220m742r963J1460
15217C54540R632J3613J3781k548j0891j505q030q17O38l579Q21J9864K676o463
15203C81732Q571N909Q260k591p536r432O431J2887p002q100J3562M955k625P202
15189D12223N801K589O885J6086n1k076j900K656K505o219n138j523N80q525O890
$$ plain form
15288 249656 248193 262131 272152 280675 277449 277994 284507 275381 271339 288179 302665 313114 301438
15275 301438 297376 297451 297161 292345 298410 305324 312090 300833 299963 298576 297349 293336 294272 300230 297482
15260 297482 307443 310241 290085 289160 281597 291426 310334 312626 327002 328515 324801 328514 328377 332649
15246 332649 337072 328774 322666 313267 323242 323480 323410 330455 336797 348582 350610 340094 333579 334202 343633
15231 343633 338364 331287 339053 339625 336303 340596 349488 347633 351370 353565 357785 353043 343080 354540
15217 354540 364172 377785 391566 389018 378127 376622 368592 367775 368413 364834 365655 385519 388195 381732
15203 381732 390303 396212 404472 401881 394345 384913 391344 404231 397229 389129 402691 407646 405021 412223
15189 412223 418024 420613 427498 443584 443533 441457 439557 442213 444718 438499 433361 431838 432418 423893 430783
15174D30783J2509j475o762j9266J2884K9131J1947r3j1067n729J6127R123p232
15161D70880K201m822M349J2942N43k441J8718J2164p691r708r28K567o061N844
15147D98557N429Q786N894o273P551r55M941K190q498J517p892N91J867J2651
15133E26356J1222O253R662l744J0900P315K43N603r33k026j1150J0726K766J5842
15119E89035J8776J3671k995j8486q855l54J4534Q431k964j0038n539L242M766
15106F03224k787K953K41O052K454N816R11M351P362l262J8988P917n619K905
15092F51506L435k783l64j19j0816J6083J2853N411L739M088J0172J086L843J1520
15078G09654J085L230R102Q766J5833K451J0073K3023R105M303J3309K4986K2812
$$ plain form
15174 430783 443292 441817 435055 415789 428673 457804 469751 469658 458591 452862 468989 478112 470880
15161 470880 473081 468259 472608 485550 486093 483652 502370 514534 506843 497135 496207 498774 492713 498557
15147 498557 503986 512772 518666 512393 519944 518989 523930 526120 517622 519139 511247 511838 513705 526356
15133 526356 537578 543831 553493 549749 560649 567964 568207 573810 572877 570851 559701 570427 573193 589035
15119 589035 607811 621482 618487 600001 591146 590792 605326 613757 610793 600755 595216 598458 603224
15106 603224 600437 603390 603631 609683 612137 617953 618864 623215 630577 627315 646303 654220 648601 651506
15092 651506 654941 652158 651794 651675 640859 656942 669795 675206 678945 683033 693205 694291 698134 709654
15078 709654 710739 713969 723071 731837 747670 750121 760194 783217 792322 796625 809934 834920 857732
15065H57732L0539M2271M1354L1213L3967M8001L2533L3285K3442J3175J8585
15054A206097J5719R158R746j0628k659j1580j8831j2407j3288k7256l0721l2637
15042A080713l2042k3919k5594j5313l61j7765j0666l55j16j9277p014J6154J5294
15029I59739k474K805K825k879j7099j2090J311N035J2947P365p525Q733P552
15016I66245N011J4726L069L524O526j0094r148R3K0950P249O321K0668J5270
15003A050410P467J2855N804J962q787L051J3767J0781j788M39J522J6078R862
14990A123423J2646R620Q020k428j1039P666O624N854n567J1505J5124l22j665
14977A179461l200J4229K4238m71k186R890J575N816J2378J0426O510O830q49
$$ plain form
15065 857732 888271 930542 971896 1003109 1037076 1085077 1117610 1150895 1174337 1187512 1206097
15054 1206097 1221816 1230974 1240720 1230092 1227433 1215853 1197022 1184615 1171327 1144071 1113350 1080713
15042 1080713 1048671 1024752 999158 983845 983484 965719 955053 954698 954582 935305 928291 944445 959739
15029 959739 957265 960070 962895 960016 942917 930827 932138 937173 950120 957485 949960 958693 966245
15016 966245 971256 985982 989051 992575 999101 989007 979859 979952 1000902 1008151 1014472 1035140 1050410
15003 1050410 1057877 1070732 1076536 1078498 1069711 1072762 1086529 1097310 1095522 1095961 1097483 1113561 1123423
14990 1123423 1136069 1145689 1153709 1151281 1140242 1147908 1154532 1160386 1154819 1166324 1181448 1181126 1179461
14977 1179461 1176261 1190490 1214728 1214257 1212071 1221961 1223536 1229352 1241730 1252156 1258666 1265496 1264647
14964A264647K54J8172P690J784J2726N465J766N353J4908P860P946P88J213m737
14950A345835P994l46K930J1227J1489q93K386J2751K5997K6409P735q994j3406
14937A431114j0446m280J1674R486K0601n00Q690K239L457J4361Q160p206J2690
14924A500040J4495P521J1491M787L973j281J6404J8144J2092k872J0871J5121
14912A610786L3777K6402q980j1506N362J1179J3197N682P214N455L259J2482
14900A714309L1125J8840J4201J3972M735L577J4451J6550J0107L63j265l617
14888A837348M544Q621J1404J6503K0149J3116J9278J886J3485J8375J3323J6654
14876A994686J7345K266M085J9533J6324Q969j576O710M518N427K9171K3504N424
$$ plain form
14964 1264647 1264901 1283073 1290763 1292547 1305273 1310738 1312504 1317857 1332765 1340625 1348571 1349359 1350572 1345835
14950 1345835 1353829 1353483 1356413 1367640 1379129 1378236 1380622 1393373 1419370 1445779 1453514 1444520 1431114
14937 1431114 1420668 1416388 1428062 1437548 1458149 1457649 1466339 1468578 1472035 1486396 1494556 1487350 1500040
14924 1500040 1514535 1522056 1533547 1538334 1542307 1541026 1557430 1575574 1587666 1584794 1595665 1610786
14912 1610786 1644563 1670965 1661985 1650479 1655841 1667020 1680217 1685899 1693113 1698568 1701827 1714309
14900 1714309 1745434 1764274 1778475 1792447 1797182 1800759 1815210 1831760 1841867 1842230 1840965 1837348
14888 1837348 1841892 1850513 1861917 1878420 1898569 1911685 1930963 1932849 1946334 1964709 1978032 1994686
14876 1994686 2012031 2014297 2018382 2037915 2054239 2063208 2061632 2068342 2072860 2078287 2107458 2130962 2136386
14863B136386Q79J1122J8435J9676K0714L053J9385J2751J130K0887K5057Q776
14851B298251l164R835J5573K3322P294j149L275J0246K0194K3166K0466J4913
14839B442222J7665K3535J3491J5102J9191Q782l064J9548L5874J4343M523J6441
14827B627653J0305O900J0417K2390K1772J6649J8441J3263J4816K6151K3724
14816B812481J3309J6234K7661K3800J4370J5915K9472K1829J3390K3722K0516
14805C032699R436Q670J9104K3566L3988R425N473J6040K1129J3797K4140J5895
14793C233362J3590K3625K3627R806J1339J5350J0485R834Q200J0218L5478K5746
14781C430660M983J2848J4545K6371K4394J3797M643Q159J9822K7713K106O564
$$ plain form
14863 2136386 2137265 2148387 2166822 2186498 2207212 2210265 2229650 2242401 2243531 2264418 2289475 2298251
14851 2298251 2295087 2304922 2320495 2343817 2351111 2349962 2353237 2363483 2383677 2406843 2427309 2442222
14839 2442222 2459887 2483422 2496913 2512015 2531206 2539988 2536924 2556472 2592346 2606689 2611212 2627653
14827 2627653 2637958 2644858 2655275 2677665 2699437 2716086 2734527 2747790 2762606 2788757 2812481
14816 2812481 2825790 2842024 2869685 2893485 2907855 2923770 2953242 2975071 2988461 3012183 3032699
14805 3032699 3042135 3050805 3069909 3093475 3127463 3136888 3142361 3158401 3179530 3193327 3217467 3233362
14793 3233362 3246952 3270577 3294204 3304010 3315349 3330699 3341184 3351018 3359218 3369436 3404914 3430660
14781 3430660 3435643 3448491 3463036 3489407 3513801 3527598 3532241 3540400 3560222 3587935 3590041 3596605
14769C596605J7948K2058K7605J2445J2356O412J1459L4218K9727R178j504L145
14757C781652P607K5121N597J5742K491K3605J0584K4705J9923J6571K1164O568
14745C961330P48J0435J3782J1983O022R499K1800K1510J7569J6868J5101R682
14733D116329L3035K3201J5873J0232J1883J7154J0375J4082J5100K2347J3712
14722D303323L563N446K2542J5699J246J5947J1188Q149R716J832J5856K5173
14710D439680L0398j382j2967J3837J5084l038J650N598K3125K6807q086m060
14698D526646n89J5743J0058k695m000J2151Q938J3380J2301J1703R086q414M620
14685D608928O365P190J7721J9508J1766J8073J3555P792l08l248j948J1663o806
$$ plain form
14769 3596605 3614553 3636611 3664216 3676661 3689017 3695429 3706888 3741106 3770833 3780011 3778507 3781652
14757 3781652 3789259 3814380 3819977 3835719 3838210 3861815 3872399 3897104 3917027 3933598 3954762 3961330
14745 3961330 3962078 3972513 3986295 3998278 4004300 4013799 4035599 4057109 4074678 4091546 4106647 4116329
14733 4116329 4149364 4172565 4188438 4198670 4210553 4227707 4238082 4252164 4267264 4289611 4303323
14722 4303323 4306886 4312332 4334874 4350573 4351819 4367766 4378954 4387103 4396819 4398651 4414507 4439680
14710 4439680 4470078 4468696 4455729 4469566 4484650 4481612 4483262 4488860 4511985 4538792 4530706 4526646
14698 4526646 4526057 4541800 4551858 4549163 4545163 4557314 4566252 4579632 4591933 4603636 4612722 4604308 4608928
14685 4608928 4615293 4622483 4640204 4659712 4671478 4689551 4703106 4710898 4710590 4707342 4705394 4717057 4710251
14672D710251M970K102o755o412j84M432M090P463j5717l1666q681J445m085m534
14658D656719m474k675j3591j0121j4974k475N237M947m778j8713j4253k1188
14646D559661j7499j0883j4239j6000k480l309j3540r735p761j0510O556p911
14634D452350k2689j9592q247j095j1483j6270k2795m932j0820K914N493J4344
14622D357178M751p548n942o347K711k838j7482N884J993j4104q837l178n594
14609D300647j2970k3182m349N60l307K212J2296K082J3485J0802j248K941k76
14596D299693R873K7758L2789K7208L6992M0649L5137L9293N7650N4903O5824
14585D727769N4893O0621P3680Q1299Q2942J10835J22289J21596J53814J89741
$$ plain form
14672 4710251 4715221 4717323 4710568 4704156 4703972 4708404 4712494 4719957 4704240 4672574 4663893 4665338 4661253 4656719
14658 4656719 4652245 4649570 4635979 4625858 4610884 4608409 4613646 4618593 4613815 4595102 4580849 4559661
14646 4559661 4542162 4531279 4517040 4501040 4498560 4495251 4481711 4471976 4464215 4453705 4460261 4452350
14634 4452350 4429661 4410069 4401822 4400727 4389244 4372974 4350179 4345247 4334427 4337341 4342834 4357178
14622 4357178 4361929 4354381 4348439 4342092 4344803 4341965 4324483 4330367 4332360 4318256 4309419 4306241 4300647
14609 4300647 4287677 4264495 4260146 4260706 4257399 4259611 4271907 4273989 4287474 4298276 4297028 4299969 4299693
14596 4299693 4309566 4337324 4370113 4397321 4434313 4474962 4510099 4549392 4607042 4661945 4727769
14585 4727769 4782662 4843283 4916963 4998262 5081204 5192039 5314328 5435924 5589738 5779479
14575E779479K10493K29973K75403L47371L87218M66903N59918O87779Q42783
14566I787320J064175J341243J709804K192454K768746L423746M099717M751142
14558C1138347N352170N798773O058828O049866N736532N176037M464766L643808
14550G3419127K759926J825257R45718R4154p45713j580713k369825l127191l871490
14541F7349250m547119n053288n348966n437538n313909m981601m459273l838922
14533B8368634l208846k596552k068222j660318j353363j158362j009173q69904
14525A4443894p61854o91212o33209n68520n19794m75235m32529l94195l59908
14516I607438l40782l22325k98360k72159k49443k38485k32240k18755k11270
$$ plain form
14575 5779479 5989972 6219945 6495348 6842719 7229937 7696840 8256758 8944537 9787320
14566 9787320 10851495 12192738 13902542 16094996 18863742 22287488 26387205 31138347
14558 31138347 36490517 42289290 48348118 54397984 60134516 65310553 69775319 73419127
14550 73419127 76179053 78004310 78950028 79044182 78298469 76717756 74347931 71220740 67349250
14541 67349250 62802131 57748843 52399877 46962339 41648430 36666829 32207556 28368634
14533 28368634 25159788 22563236 20495014 18834696 17481333 16322971 15313798 14443894
14525 14443894 13682040 12990828 12357619 11789099 11269305 10794070 10361541 9967346 9607438
14516 9607438 9266656 8944331 8645971 8373812 8124369 7885884 7653644 7434889 7223619
14507G223619k04407j86959j79332j72350j67284j70809j42252j26703j36469
14498E737054j48841j25370j03028j04251j18164j12877j16662j03050j11961
14489D692850r6576r4309j03793p6926o2334q2363q8429p7755o9177q3062p7774
14478C780352p5738p2381o3536n1709l7898m8962m7993m7745n0588m0227l9968
14467C203607n2539n8585m0285k9480l5127l2270m7279l9235m9139l8163l0010
14456B751495l7885m3931l1054k9158m1750l9493k0165k3079k4034l4601k8952
14445B397393k8879k5221m0124l7289k5383j6857q211k4088m0066l5908l6299
14434B079068l2671j8050j8624k9884j9974k4948l4711l6125l6447k8181k5885
$$ plain form
14507 7223619 7019212 6832253 6652921 6480571 6313287 6142478 6000226 5873523 5737054
14498 5737054 5588213 5462843 5359815 5255564 5137400 5024523 4907861 4804811 4692850
14489 4692850 4596274 4501965 4398172 4321246 4258912 4176549 4088120 4010365 3941188 3858126 3780352
14478 3780352 3704614 3632233 3568697 3516988 3479090 3430128 3382135 3334390 3283802 3243575 3203607
14467 3203607 3151068 3092483 3052198 3022718 2987591 2955321 2908042 2868807 2819668 2781505 2751495
14456 2751495 2713610 2669679 2638625 2609467 2567717 2528224 2508059 2484980 2460946 2426345 2397393
14445 2397393 2368514 2343293 2303169 2265880 2240497 2223640 2215429 2191341 2151275 2115367 2079068
14434 2079068 2046397 2028347 2009723 1979839 1959865 1934917 1900206 1864081 1827634 1799453 1773568
14423A773568l5876k0747k0375l0579j9323j4080j8018j2126l3409l6818k3298
14412A508919k7340j3116k220n760k4186j4527q093j3096m048k659r48j693j2979
14399A378254k4176k1144O734q376j2588o210k185J3702k564k6210j6313j5677
14387A263247l925k180L285n851j4171m061Mj3133k0875q064q60j2473K22j069
14373A180096l577k2499j4660j4282o13P303J0055K323j9681j0338O553P073Q867
14360A136620n963r357P623Q697L280j8768j5994j6698N11j0081j7312p897n945
14347A048716M853k490j6334j6545l928J4404o56O984k073K936R441r953l0641
14334A004714k220r66l5356j1336k193j5724k4906j5783o986J317m892L95j7055
$$ plain form
14423 1773568 1737692 1716945 1696570 1665991 1646668 1632588 1614570 1602444 1569035 1532217 1508919
14412 1508919 1481579 1468463 1466243 1460483 1436297 1421770 1413677 1400581 1396533 1393874 1392926 1391233 1378254
14399 1378254 1354078 1332934 1339668 1331292 1318704 1312494 1310309 1324011 1321447 1295237 1278924 1263247
14387 1263247 1259322 1257142 1260427 1254576 1240405 1236344 1236348 1223215 1202340 1194276 1193416 1180943 1181165 1180096
14373 1180096 1176519 1154020 1139360 1125078 1124465 1131768 1141823 1144146 1124465 1114127 1120680 1127753 1136620
14360 1136620 1130657 1121300 1128923 1137620 1140900 1122132 1106138 1089440 1089951 1079870 1062558 1054661 1048716
14347 1048716 1053569 1051079 1034745 1018200 1014272 1028676 1028020 1035004 1032931 1035867 1045308 1035355 1004714
14334 1004714 1002494 1001528 966172 954836 952643 936919 912013 896230 889244 890561 885669 886064 869009
14321H69009j3883j0619J2002Q367j0465j0810L161K028k739j4868o298j1488
14309H13397q539L987j3874q337l428M975m71k956l942M215k785m119k2593p376
14295G48154M106j48j0700L096j726j6143l2654k2039m784P035J1776K134j2786
14282F75321j4695l265N295J300K007O62p282l057L165k2147j2332o996j5855
14269F02121K979l180O954p781N361M935m047j1907j5805M371K440j3297L250
14256E76394M537j0970P852o765j1367j5725j824j0279l028P329o099J6337J5604
14243E61996o695j4268j6767j189P726n471j2606j302R919N130M843j0529q269
14230E12518j432q099r229R45N926j3075m115r683p664L088J3772q197r044p685
$$ plain form
14321 869009 855126 844507 856509 864876 854411 843601 846762 848790 846051 831183 824885 813397
14309 813397 804858 808845 794971 786634 783206 788181 787710 784754 780812 785027 782242 778123 755530 748154
14295 748154 752260 752112 741412 744508 742782 726639 693985 671946 667162 674197 685973 688107 675321
14282 675321 660626 657361 662656 663956 665963 666625 659343 656286 659451 637304 624972 617976 602121
14269 602121 605100 601920 608874 601093 606454 611389 607342 595435 579630 584001 586441 573144 576394
14256 576394 580931 569961 577813 571048 559681 543956 542132 531853 528825 536154 530055 546392 561996
14243 561996 555301 541033 524266 523077 530803 525332 512726 511424 521343 526473 531316 520787 512518
14230 512518 511086 502987 493758 494703 500629 487554 483439 473756 466092 469180 482952 474755 465711 458026
14216D58026N539N56j3616p212MJ1366P852J0030q724m024j546p683j2249j458
14202D36861J1800R344O107j5610k541j1569j2677j0208K139k30M715J6701j5059
14189D19773k0215n797M118M615J554J254M12J060l582l709p397j0110l390J0801
14175C89387J527K11j76l242k564j7270q623r480L053n059P150R310N372j7048
14161C52548k8652l335N971P61N6M294J7057P287p764l209j1228K777j842k295
14147C32426N086o64q309j2085K009J2761J3270J5031q067k1562q737l047J340
14134C19452j976q220m063N633O83q272Q089N828K996n694o167j2522k5369J0691
14120B81089J8028J078m382J499N530j7506L520j560l499r92m591p575N830q528
$$ plain form
14216 458026 463565 464121 450505 443293 443297 454663 462515 472545 463821 459797 458251 450568 438319 436861
14202 436861 448661 458005 464112 448502 445961 434392 421715 411507 413646 413416 418131 434832 419773
14189 419773 399558 393761 397879 402494 404048 405302 405714 406774 403192 399483 392086 381976 378586 389387
14175 389387 390914 391125 390949 387707 385143 367873 359250 349770 352823 347764 354914 364224 369596 352548
14161 352548 323896 320561 326532 327293 327349 331643 348700 355987 348223 345014 333786 336563 334721 332426
14147 332426 337512 336848 328539 316454 318463 331224 344494 359525 351458 329896 321159 318112 319452
14134 319452 317476 309256 305193 310826 311509 303237 311326 317154 320150 314456 308289 295767 270398 281089
14120 281089 299117 300195 295813 297312 302842 285336 288856 287296 283797 282805 278214 270639 276469 267941
14106B67941p97q091q51J4012o98J508P095j0073r445j139M5n54R733m798N12
14091B64400j0689J096q567J4722K1659m622j6675j0967Q614N704j1637J002O462
14078B60502n423j3722N980p612l550r58j0047O015J384O093J1939J042j4513
14065B37130j743J773N773j0029N41k248k681J4373N916L204L062r18O181K4295
14051B84629K0064J3045K1869K4565L6981M0620L7991K8665J4601J5762K1637
14040E60429K8709K822r387J0275J6620j0927j9710p871j6791k1074l4541k9037
14028D69517l1123l3505l9948k7580j1875n847K03j9592k5169r784m627Q088N75
14015B69333j6606j8577q474r138N33N330n471n548Q73K08j922L440j0915j1416
$$ plain form
14106 267941 267144 259053 258202 272214 271516 273024 280119 270046 260601 259462 259507 258953 268686 263888 264400
14091 264400 253711 254807 246240 260962 282621 277999 261324 250357 258971 264675 253038 254040 260502
14078 260502 255079 241357 247337 239725 236175 235217 225170 231185 232569 238662 250601 251643 237130
14065 237130 235387 237160 242933 232904 233445 231197 228516 242889 248805 252009 255071 254153 260334 284629
14051 284629 304693 317738 339607 364172 401153 441773 479764 508429 523030 538792 560429
14040 560429 589138 591960 582573 592848 609468 598541 578831 570960 554169 533095 498554 469517
14028 469517 438394 404889 364941 337361 325486 319639 319842 300250 275081 265297 260670 268758 269333
14015 269333 252727 234150 225676 216538 217071 222401 216930 211382 212255 212463 210541 213981 203066 191650
14001A91650N667j5202J82J0037j536j2709o611J472O292j672N322l30r945m238
13987A68379J4376R814K069n530M130p437p017m047j3129n02Q345J3481N93n773
13973A77752o846J816j662r304K209p417o400m467o125o851K590Q198P7p118K850
13958A39302J4493j3057q793o452J879J4694N869j916l13j1188K25M175K870P467
13944A49255J846j3263p255n437R279L772j1111J1732J696p246K154q36k593J0417
13930A42410j386j1917j8025j3338K781K283J6634O765j908J5264o783j2288q881
13917A11611o713j0833O478O814K410L778K0822J0r929k324J411O375j520j3675
13903A14715k325L136O920m598N04j1391r029P71n451l295O723N808J8820J5421
$$ plain form
14001 191650 197317 182115 182297 192334 190798 178089 171478 172950 179242 177570 182892 182562 172617 168379
13987 168379 182755 192569 194638 189108 193238 185801 178784 174737 161608 161106 169451 182932 183525 177752
13973 177752 170906 172722 171060 161756 163965 156548 150148 145681 139556 132705 135295 143493 143570 136452 139302
13958 139302 153795 140738 131945 125493 127372 142066 147935 146019 145706 134518 134743 138918 141788 149255
13944 149255 151101 137838 130583 125146 134425 138197 127086 138818 140514 133268 135422 134586 131993 142410
13930 142410 141024 129107 111082 97744 100525 102808 119442 126207 124299 139563 132780 120492 111611
13917 111611 104898 94065 100543 107357 109767 113545 134367 134377 124448 122124 123535 129910 128390 114715
13903 114715 112390 115526 122446 117848 118352 106961 97932 98703 93252 89957 96680 102488 121308 136729
13889A36729m69j2344n808j1971r794j431L887L784q041k943l761N861K883O081
13875A02663o419j806L486N311M11o038j3642J5749P744j0602Q803O198O713J3899
13861A32470j1595j7420j4083m264J0299k308O937j999J866k863K202m9P875J2101
13847A19169j0580q144o305j7304L27l025p287P160J1636J4630N459j2034r535
13834H4167o417K55J0007j3778n103J4752j156o87k103q875j3299J321R864k931
13820F6017J0065j0121J321j7300L552R742Q99P348L485K965j2125j0742J307
13807E6413j4438M064K1170Q401O747K700J4213l159j1367j427p369J965J1556
13794H9469J285p732j2360q415k198J970J6047j319j7342l833P489j066O033l745
$$ plain form
13889 136729 136260 123916 118108 106137 96343 94912 98799 102583 94542 91599 87838 93699 96582 102663
13875 102663 96244 94438 97924 103235 103646 97608 83966 99715 107459 96857 105660 111858 118571 132470
13861 132470 120875 103455 89372 85108 95407 93099 100036 98037 99903 97040 99242 99193 107068 119169
13847 119169 108589 100445 94140 76836 77163 74138 66851 74011 85647 100277 105736 93702 84167
13834 84167 77750 78005 88012 74234 69131 83883 82727 82040 79937 71062 57763 59084 68948 66017
13820 66017 76082 65961 67282 49982 53534 63276 64175 71523 75008 77973 65848 55106 56413
13807 56413 41975 46039 67209 75610 82357 85057 99270 96111 84744 83317 75948 77913 89469
13794 89469 90754 83022 70662 62247 60049 62019 78066 76747 59405 55572 63061 61995 68028 64283
13780F4283l814J807J624N224K550o392p399J078J2403J479l729j7452p463J4537
13766E8736J2569N384j697j2969j2051j3282Q06J7636n240K93m62o273r86O004
13752D8468J5181o641r759M150J0049o662j2585j6858M406K994L896P036q293
13739C5382K732K11k5778K306J3049N674j3027m147L67O455O464J1423J4960j0211
13725D5860n860J4615j771k969o04r476k164k395L484l134p609O397O521R300
13711E0195p84n643o547l707k792R539J4407m578n034R14Q445M033j227m831r022
13696D3368R750J0818p844L138N025o277m991K865n560k4990P87J7252o778J0612
13682D7175L577o102q597O313n35j1037j1885N746J7041K0818n108r082j572m768
$$ plain form
13780 64283 60469 62276 63900 69124 71674 65282 57883 58961 71364 72843 69114 51662 44199 58736
13766 58736 71305 76689 74992 62023 49972 36690 37496 55132 49892 50185 49723 43450 42464 48468
13752 48468 63649 57008 47249 51399 61448 54786 42201 25343 29749 32743 36639 43675 35382
13739 35382 38114 38325 12547 14853 27902 33576 20549 16402 16769 23224 29688 41111 56071 45860
13725 45860 40000 54615 52844 49875 49271 39795 37631 35236 38720 35586 27977 34374 40895 50195
13711 50195 49411 43768 37221 33514 30722 40261 54668 50090 45056 45970 54415 58448 57221 52390 43368
13696 43368 53118 63936 56092 59230 64255 57978 52987 55852 50292 25302 26089 43341 36563 47175
13682 47175 50752 44650 36053 42366 41831 30794 18909 24655 41696 62514 57406 48324 46752 41984
13668D1984O08k99j8527j3012M922J9378J989J0308Q082q723k544j1520j6499
13655A6147k323j413J1486M743p409L153k357M788M991l677q538J6100P429j323
13641D1797J1361m691n134o729O426q128j3068q520r54J9282R689p163N804Q01
13627D0773k733l055N67K99J636m467J195l433Q743P399k399k869r2j4090K429
13612B9903L764J2821q083j7764r345o486L81J6055M510q231j0185k291J724M783
13598A1556J4786K1140j113m923j3644p86o614p661L420P918J0605j88O659J175
13584D2330j7617j690m378p191J95P082M444j210n262J0090J2941l938j0152m056
13570B1588r043J4729J1754M523J164k049r828j487O041j2808K4j174l390n270
$$ plain form
13668 41984 42592 42293 23766 10754 15676 35054 37043 47351 55433 46710 44166 32646 16147
13655 16147 13824 12411 23897 28640 21231 24384 22027 26815 31806 28129 19591 35691 43120 41797
13641 41797 53158 48467 43333 36604 43030 34902 21834 13314 12360 31642 41331 34168 39972 40773
13627 40773 38040 34985 35552 35851 37487 33020 34215 30782 39525 46924 44525 41656 41564 27474 29903
13612 29903 33667 46488 38405 20641 11296 4810 5191 21246 25756 17525 7340 5049 6773 11556
13598 11556 26342 47482 46369 41446 27802 27016 20402 12741 16161 24079 34684 34496 41155 42330
13584 42330 24713 23023 18645 11454 11649 18731 23175 21965 16703 26793 39734 35796 25644 21588
13570 21588 12545 27274 39028 43551 44715 42666 32838 31351 37392 24584 24608 23434 20044 14774
13556A4774j1622M861J6745M969J725j0510j946J744J4791J072K35K653L86j2115
13542B7762p877L637k738K804j962O074J0682R795r283j6813l128k308M873o200
13528A5318q047J4395J2160j2453j4492J0396K1729j213j4197p772o613J734n591
13515E354R367J562j869j139K694N494n147Q35k717o257n722J2336n528m305l41
13500D617l527J966J8809J3873l709j4188M236J5425k289k109N167O892J521j3589
13486C3095o147M134j648l47m781j302J1609j1236j3671L859J0789m911j4173
13473E270m628L536N515R085J367r772p243p276r01R252Q37K644M282L451j2445
13458B974J524R879k580n097k949r414K701R087P067j193q571K887L653l869P119
$$ plain form
13556 14774 3152 8013 24758 29727 31452 20942 18996 20740 35531 36603 36838 39491 39877 27762
13542 27762 19885 23522 20784 23588 21626 27700 38382 48177 38894 22081 18953 16645 21518 15318
13528 15318 7271 21666 33826 21373 6881 17277 39006 37793 23596 15824 9211 10945 5354
13515 5354 14721 16283 14414 13275 15969 21463 16316 17151 14434 8177 2455 14791 9263 4958 4617
13500 4617 1090 3056 21865 35738 32029 17841 22077 37502 35213 33104 38271 45163 46684 33095
13486 33095 26948 31082 29434 29087 24306 23004 34613 23377 9706 13565 24354 19443 5270
13473 5270 642 4178 9693 18778 20145 10373 3130 -4146 -5047 4205 5042 7686 11968 15419 2974
13458 2974 4498 14377 11797 6700 3751 -5663 -2962 6125 13192 11999 3428 6315 9968 6099 13218
13443A3218P88j1349j807N26k86O669N482N608rN421m465O619O961j4967m089
13428A4320j040q376o449J0146J7332J1299K891k008P717k2020j8244j255Q200
13415A2513R104n978j0954m722j3438m976J7117R091m386j783N550m09j656j632
13401C441P922L257j6543O805O551Q573m470l465O68L986J923J8296J1871j539
13387D7276o995J464n90j4776j3780k50K258j8500j401J3016J0098n169l795j4259
13373e403r078K888K8630J3176p761l940M436n139k605j2751r564o583m580R359
13359h915L289l793j742k549R419Q304J1794J994o691m174m333P207j276q962
13345d28j1785J2157L22n957j585M304K234J049l890O823J7557K083p139q343
$$ plain form
13443 13218 14006 2657 850 1376 1090 7759 13241 18849 18840 24261 19796 26415 33376 18409 14320
13428 14320 13280 4904 -1545 8601 25933 37232 40123 38115 45832 23812 5568 4313 12513
13415 12513 21617 15639 4685 -37 -13475 -18451 -1334 7757 3371 1588 7138 6729 5073 3441
13401 3441 11363 14620 -1923 4882 11433 20006 15536 12071 12739 16725 18648 36944 48815 47276
13387 47276 40281 41745 41155 26379 12599 12349 14607 -3893 -5294 7722 17820 12651 8856 -5403
13373 -5403 -14481 -11593 17037 30213 22452 18512 22948 17809 15204 2453 -7111 -13694 -18274 -8915
13359 -8915 -5626 -9419 -11161 -13710 -4291 4013 15807 17801 11110 6936 2603 9810 8534 -428
13345 -428 -12213 -56 266 -5691 -7276 -2972 -738 311 -3579 3244 20801 22884 15745 7402
13331G402j564j7952R556J3440j7579N56N74o423P810L539k599j61M333J6715
13317A7647R149j3739k2842Q835J441p114K829Q178o808P880k526j556kK663o124
13302b089R932m670L850L032j1677j399M156m979j4873l364Q547K345l177O148
13288h218j75J2675K220J0091Q493J098m557j0419o54Q969p868n398R45J1897
13274A9099l608k1937q838p988M964J6494K1270m95j0991o355r771j2175j616
13261b1947J1982J9051k987o129j259P420p900j2739P761p973M959k097k48J6166
13247D060J7284j9894j0042J2332j29l957K263k224J242j3685M609j65Q604J1900
13233A2198m222K107O97o600l336J3386k466j5187l670O440P422K209J231j171
$$ plain form
13331 7402 5838 -12114 -2558 10882 -6697 -6141 -5567 -11990 -4180 -641 -3240 -3401 932 17647
13317 17647 26796 13057 -9785 -950 491 -6623 -3794 4384 -2424 5456 2930 1374 1372 4035 -2089
13302 -2089 7843 3173 7023 10055 -1622 -3021 1135 -3844 -18717 -22081 -13534 -11189 -14366 -8218
13288 -8218 -8393 4282 6502 16593 25086 26184 21627 11208 10554 19523 11655 6257 7202 19099
13274 19099 15491 -6446 -15284 -23272 -18308 -1814 19456 18961 7970 1615 -8156 -20331 -21947
13261 -21947 -9965 9086 6099 -30 -1289 6131 -1769 -14508 -6747 -14720 -9761 -11858 -12106 4060
13247 4060 21344 1450 -8592 3740 3611 -346 1917 -307 935 -12750 -8141 -8306 298 12198
13233 12198 7976 10083 10780 4180 844 14230 11764 -3423 -7093 -653 6769 8978 10209 9038
13219I038o588n929j1642J0217Q648L111J350K631p333P040Q791R23n548j8878
13205d169N50O536J0071J3021O918j4035o085j3680M713R120r590l807O203M83
13191F249r057P067K083j2708q685j38M236o400O727K755N431L949o855j163k750
13176i259q197o818J292K050J289O652l037j3521J2364K509j871M764p34o094
13162a8611J7965K2316J0465j2126j6659N933O524L43k2544Q359O72j4163k812
13149a4338O53J1386P647Q663k576o919j1005l400R732J4644r63m73J512o652
13135G911q997j1446j97N469R158J0502L408P890j3935R197r957j1199J828J0607
13121A0239j0760j5124m472O007R825N482P622Q953m130j415k740L286J4489M977
$$ plain form
13219 9038 2450 -3479 -15121 -4904 3744 6855 8205 10836 3503 10543 19334 20257 14709 -4169
13205 -4169 -3619 2917 12988 26009 32927 18892 12807 -873 3840 12960 3370 -437 5766 6249
13191 6249 -2808 4259 6342 -6366 -15051 -15189 -10953 -17353 -10626 -7871 -2440 1509 -5346 -6509 -9259
13176 -9259 -17456 -24274 -22982 -20932 -19643 -12991 -16028 -29549 -17185 -14676 -16547 -11783 -12517 -18611
13162 -18611 -646 21670 32135 20009 3350 9283 15807 16150 -6394 1965 2637 -11526 -14338
13149 -14338 -13685 -2299 5348 14011 11435 4516 -6489 -9889 -157 14487 13524 13051 14563 7911
13135 7911 -1086 -12532 -12729 -7260 1898 12400 15808 23698 9763 18960 9003 -2196 -368 10239
13121 10239 -521 -15645 -20117 -14110 -4285 1197 8819 17772 13642 12227 9487 12773 27262 32239
13107C2239j1674j2554J2852N427j1467n005p815r65R381j3914q183M483p047
13094a4242Q144P511n415o453O047J4906n522j3316P689O438o39J636n158O516
13080H142L395L978o888k911m625M064N02M608L65K144j4002j4518K790J7449
13066D493K2640M009p947j8289k6410J567K4834K850o589j567r857j5614L514
13053b2366K6095K914p479j998K143j196k4641p028P032P615K226J3832Q377J0141
13039A5667k841J4948n803j4403M023k815p540p992r771o46k95p463Q701J9752
13025C522J8111P12j5598j2216O014J788l650O73q985r863J992l129m822k628
13011b8079Q505K5092O561o851L231P676m122j7908l030M281J1386J8268k711
$$ plain form
13107 32239 20565 8011 20863 26290 14823 9818 2003 1038 10419 -3495 -11678 -7195 -14242
13094 -14242 -6098 1413 -4002 -10455 -4408 10498 4976 -8340 -651 5787 5148 6784 1626 8142
13080 8142 11537 15515 8627 5716 1091 5155 5657 10265 10630 12774 -1228 -15746 -12956 4493
13066 4493 27133 31142 23195 4906 -21504 -19937 4897 7747 1158 -409 -10266 -25880 -22366
13053 -22366 3729 6643 -836 -2834 -691 -1887 -26528 -33556 -26524 -18909 -16683 -2851 5526 15667
13039 15667 12826 27774 21971 7568 11591 8776 1236 -6756 -16527 -17173 -17468 -24931 -16230 3522
13025 3522 21633 22345 6747 -5469 545 2333 -1317 -644 -9629 -19492 -17500 -20629 -25451 -28079
13011 -28079 -19574 5518 12079 5228 8459 16135 12013 -5895 -8925 -4644 6742 25010 22299
12998B2299k4918j1223j060K898K171j0422Q245J2177j519q209J074J3799l446
12985A866m953Q179l624o182J087J940K360N167J694L610o350j2685j6454J704
12971b2641l166J1023J4560M222R095P256m816n188L096L74m710p755j870k773
12957c293Q532q354J055P418M300K702j504n080k363Q904q124j6050J0876J967
12943I86J757j547O20J1190J7488o938m776j7118o353P782Q971j293j7115m198
12929a0544J2982N406q844j6261L106N216O602N022L461k305p653j4023k536J1344
12915i027J8517J740K034q34L39J6300k400j3859l332o895J2735L168j2621p472
12901a607O524J2772l042j1642q709R089R289P388n541N30P692N319p089j4838
$$ plain form
12998 22299 -2619 -13842 -14902 -12004 -9833 -20255 -12010 167 -1352 -9561 -8487 5312 1866
12985 1866 -3087 5092 1468 -4714 -3627 -1687 673 5840 7534 11144 4794 -7891 -24345 -22641
12971 -22641 -25807 -14784 -224 3998 13093 20349 15533 10345 13441 13815 9105 1350 -520 -3293
12957 -3293 5239 -3115 -2060 5358 9658 12360 10856 5776 3413 12317 4193 -11857 -981 986
12943 986 2743 1196 1816 13006 30494 23556 18780 1662 -4691 3091 12062 10769 -6346 -10544
12929 -10544 2438 7844 -1000 -17261 -14155 -8939 -2337 2685 6146 3841 -3812 -17835 -20371 -9027
12915 -9027 9490 11230 13264 12430 12769 29069 26669 12810 9478 2583 15318 18486 5865 -1607
12901 -1607 4917 17689 14647 3005 -5704 3385 12674 20062 14521 15051 22743 28062 20973 6135
12887F135j2080N053K338q410k546l887P6M347K6042l680l725l351j2957j579
12873h224o83k883m353J3958K642j2229N819m264j2108k343J3814J0222m469j1499
12859a6600k753L565J80Q20O91j0912R449J3349L608j4682j3537j742L62m49K1576
12844g075J5281J511j1833j4882O464J134M45j0471N044J4889m826P500J5404
12831A8585p275l206r20N747J362K533K09j5293O70M409r1j769r509o383r239
12816b0170P8k227M874J156k516Q836m561O48k10L319K661J2706K236N782o785
12801E827j3383l343q456L096J0444J5338L178m403r337M305j497M166Q641P448
12787B2024j1593j6j842J972k456P873l723N062p136j7737j8315l512k468J0922
$$ plain form
12887 6135 -5945 -892 1446 -6964 -9510 -13397 -13321 -8974 17068 13388 9663 6312 -6645 -8224
12873 -8224 -8907 -11790 -16143 -2185 457 -11772 -5953 -10217 -22325 -24668 -10854 -632 -5101 -16600
12859 -16600 -19353 -15788 -15608 -14788 -14097 -25009 -15560 -2211 1397 -13285 -26822 -28564 -28202 -28651 -7075
12844 -7075 8206 9717 -2116 -16998 -10534 -9400 -8955 -19426 -14382 507 -4319 3181 18585
12831 18585 11310 8104 7184 12931 14293 16826 17035 1742 2412 6821 6730 4961 -4548 -10931 -20170
12816 -20170 -20092 -22319 -17445 -16289 -18805 -9969 -14530 -13882 -14092 -10773 -8112 4594 6830 12612 5827
12801 5827 -7556 -10899 -19355 -16259 -5815 9523 12701 8298 -1039 3266 1769 5935 14576 22024
12787 22024 10431 10415 8573 10545 8089 15962 12239 17301 10165 -7572 -25887 -29399 -31867 -20945
12773b0945J1983Q10m457K40Q643P485n848Q4o04o757m954p72K90l1M159M082
12757f592P242P296j639o36O68M140J8165m103r240j230k1030o395R208k169O0
12742f255m094J3435Q967n317m902J1859M387j2125j2328O04k81J6339K491j807
12728A0973r208N592J1885J0078q521k454N85L966p56j3647l404O469r623n754
12714c819J894j2529p853N432r904Q885J7701J2932q854m92j747r188J2441L93
12700E292o621O552m197m899P60n579n354P912J5886J9717j743l025r223j1941
12686C537k629K842l90Q621k70m316p3N420p586l728K146M683J5650K974j2698
12671A4183q424J626m992n550o28J848L534J0037N758q953j3044M857K714Q26
$$ plain form
12773 -20945 -8962 -8152 -12609 -12369 -3726 3759 -2089 -2005 -2609 -9366 -14320 -15092 -14802 -14833 -10674 -6592
12757 -6592 650 7946 6307 5671 6339 10479 28644 24541 15301 14071 -6959 -13354 -4146 -6315 -6255
12742 -6255 -10349 3086 12053 6736 1834 13693 18080 5955 -6373 -5769 -6050 10289 12780 10973
12728 10973 1765 7357 19242 29320 20799 18345 18930 22896 22140 8493 5089 11558 1935 -3819
12714 -3819 -1925 -14454 -22307 -16875 -26779 -17894 -193 12739 3885 3393 1646 -7542 4899 5292
12700 5292 -1329 5223 1026 -3873 -3113 -8692 -14046 -6134 9752 29469 27726 24701 15478 3537
12686 3537 908 3750 3360 11981 11711 7395 7322 12742 5156 1428 3574 8257 23907 26881 14183
12671 14183 5759 7385 2393 -3157 -3785 -1937 1597 11634 17392 8439 -4605 252 2966 3792
12657C792l024r855J261j854n797K051N46N921J2430K68n909m143P23K616K067
12642A093r074j472j0047R987O135o065J3661K068n039p528M19m599r43k763J5849
12627A682J0203j9357j8527J069N108N287J5870P221R316r301j6851l946J3364
12614A138J2237j594j3248k307Q569J776j0796O85p134k459Q473P601J0505J091
12600A4537n439j3977j909K448J2901K986n64q01J504m65r216p894J655Q777k3820
12585a9277j1953K673j207K017J8760J5126k22p267j981J8403p212j3149M099
12572a190J604o058J3895K0250l768r648j086l262j2086J57K122p880q36N159
12558b627m488J777q122l852J6515L512j4586j1632k251M764O244J3693r247Q67
$$ plain form
12657 3792 768 -9087 -7826 -9680 -15477 -13426 -12880 -6959 5471 5739 -170 -4313 -3590 -974 1093
12642 1093 -7981 -9453 -19500 -9513 -3378 -9443 4218 6286 1247 -6281 -5862 -10461 -11404 -14167 1682
12627 1682 11885 -7472 -25999 -24930 -19822 -14535 1335 8556 17872 8571 -8280 -12226 1138
12614 1138 13375 11781 -1467 -3774 4795 6571 -4225 -3540 -10674 -13133 -4660 2941 13446 14537
12600 14537 9098 -4879 -6788 -4340 8561 11547 10983 10182 11686 11221 2005 -5889 -4234 4543 -19277
12585 -19277 -31230 -28557 -29764 -27747 -8987 6139 5917 -1350 -3331 15072 7860 -5289 -1190
12572 -1190 414 -5644 8251 28501 24733 15085 13999 10737 -1349 -1192 930 -6950 -7786 -2627
12558 -2627 -7115 -5338 -13460 -17312 -797 2715 -11871 -23503 -25754 -20990 -14746 -1053 -10300 -9433
12544i433Q808J3198k457r978J0789M659J1251k669o299o951j2632j4905K623
12531a3996m875K496O036M826M587R918j5528J163O49K877J1591k024j489n552
12517F79q660J402J4711j25k390p615J302J5573p575j7592r919P920R313J756
12503a220l174L416K656m004p799L036J6128l052j7130j1569q641M190K5897O144
12489D878j9730N774J1641q274K551N352M093J1441J299j0030l918k980o919l975
12475h797R889Q097N260L446K42p595p97M649q31l036q437j6048r372J0978J0766
12460a586M183N837j5700j5134J2105J0736O294n393j5039J463J4647O229l863
12447D779j0558O024O83j0097m234Q348O533j4373p048R177P543J914j6468J0791
$$ plain form
12544 -9433 -625 12573 10116 138 10927 15586 26837 24168 17869 10918 -1714 -16619 -13996
12531 -13996 -18871 -16375 -10339 -5513 -926 8992 -6536 -5373 -4724 -1847 9744 7720 6231 679
12517 679 -7981 -6579 8132 8007 5617 -1998 -696 14877 7302 -10290 -20209 -12289 -2976 -1220
12503 -1220 -4394 -978 1678 -2326 -10125 -7089 9039 5987 -11143 -22712 -31353 -27163 -1266 4878
12489 4878 -14852 -9078 2563 -5711 -3160 2192 6285 17726 19025 8995 5077 2097 -4822 -8797
12475 -8797 1092 9189 14449 17895 18137 10542 9745 14394 13563 10527 2090 -13958 -23330 -12352 -1586
12460 -1586 2597 8434 -7266 -22400 -10295 441 6735 1342 -13697 -12234 2413 8642 4779
12447 4779 -5779 245 928 -9169 -13403 -5055 1478 -12895 -19943 -10766 -3223 -1309 -17777 -6986
12433f986N097j4217m929K3464L768J656o400k188L116n446j1345J9647R919r896
12419E260N981r660n887R614J0241m589n640m996j835J7057O605j0030k2911l844
12405a4634P977N764M00L743q32l349l653o649j2213K121o211Q641J1696R348
12391B149J0251L272q927j8744l340n523n061Q771Q252m36J7339Q318o646k0795
12377a1120j4690r10J6293J4879L913Q43J239q704q488l780j1310j2001m984J8394
12363b0426N685m8J541Q161J07q018q127P059J1799q760J4844J578k764p385r702
12348a4456j1732J0987J0644L347l392K653k683l054L985J315J966q426r083r328
12334b7257O471P174j0127l963N729j863m422K5767P495j1357K1N35j9221J4587
$$ plain form
12433 -6986 -1889 -16106 -21035 2429 6197 7853 1453 -735 2381 -3065 -14410 5237 15156 5260
12419 5260 11241 1581 -4306 5308 15549 10960 5320 324 -1511 15546 22151 12121 -10790 -14634
12405 -14634 -6657 -893 -493 3250 2418 -931 -4584 -11233 -23446 -21325 -27536 -18895 -7199 2149
12391 2149 12400 15672 6745 -11999 -15339 -20862 -25923 -17152 -8900 -9336 8003 16321 9675 -11120
12377 -11120 -25810 -26720 -10427 4452 8365 9208 10447 1743 -6745 -10525 -21835 -33836 -38820 -20426
12363 -20426 -14741 -14789 -13248 -5087 -4980 -12998 -21125 -14066 -2267 -11027 3817 5395 2631 -4754 -14456
12348 -14456 -26188 -15201 -4557 -1210 -4602 -1949 -4632 -7686 -3701 -2386 -420 -8846 -17929 -27257
12334 -27257 -20786 -13612 -23739 -27702 -21973 -23836 -28258 -2491 5004 -6353 -6332 -5797 -25018 -10431
12320a0431J2219R239P101p767j1329j61J1228P503p886n317j7162o586J523M480
12306a3346M617J821M723q231j9125K1705J4615j0236p531m75j162Q158k354j808
12292h629n559M022J9977l123j4341K398o594o366o215O369J7958N108j0931J6411
12278A0485M349mn825J441p581O203m236j72K408k1615r365J3476R564O629P062
12263A2819J2432p696n185j0252p829M815n868p09K836n559k682o180p81J3499
12249f340P747J2747N684j0082L812K388k956j3180m458L015J5532R846q827j3363
12235A565O298N717Q339k54j9456n491P020P408p19J61r128l7o429j3253N272
12220a2987j325q788O180Q929J4481R864k864k0603o818J1622O805l63P810j34
$$ plain form
12320 -10431 1788 11027 18128 10361 -968 -1129 10099 17602 9716 4399 -12763 -19349 -17826 -13346
12306 -13346 -8729 -6908 -2185 -10416 -29541 -7836 6779 -3457 -10988 -11463 -12625 -4467 -6821 -8629
12292 -8629 -14188 -10166 9811 6688 -7653 -5255 -11849 -18215 -24430 -18061 -103 5005 -5926 10485
12278 10485 14834 14830 9005 10446 2865 9068 4832 4660 7068 -14547 -23912 -10436 -872 5757 12819
12263 12819 25251 17555 12370 2118 -5711 -896 -6764 -7473 -4637 -10196 -12878 -19058 -19839 -6340
12249 -6340 1407 14154 19838 9756 13568 15956 13000 -180 -4638 -1623 13909 23755 14928 1565
12235 1565 7863 13580 21919 21665 2209 -3282 3738 11146 10427 10588 1460 1423 -5006 -18259 -12987
12220 -12987 -14312 -23100 -16920 -7991 6490 16354 13490 -7113 -13931 -2309 4496 4133 11943 11809
12206A1809j1347o759j6480l34K655O008P735q256J584M569J1910P485l152q890
12192a463n732K532N31L22N8J918o301l197O982O789j252M380J1614J621j1001
12177G801r981K280j3949J779J1656l69j9196o63J0156R608J6440J5846r167j5459
12163F782K403j510r031o483m322J0460n38p12R039o47P784J1767n201k0108l236
12148c553J1737o30k0037R086q59o052K275J1584R0j1589k565N374J2541O651
12134A4053o795n812l708n45J1322K1043j352r632m010k378m801J662q598R218
12120I667J4458m826k4759o042R370j1072q406k712J4363R556j3759q918p47J237
12106b2590J0361P942P117N445J947q225r71R00l883j0106o218J4244J3796k694
$$ plain form
12206 11809 462 -6297 -22777 -23111 -20456 -14448 -6713 -14969 -13385 -8816 3094 10579 7427 -1463
12192 -1463 -7195 -4663 -4132 -3810 -3752 -1834 -8135 -11332 -4350 2439 1187 5567 17181 18802 7801
12177 7801 -2180 100 -13849 -12070 -414 -783 -19979 -20642 -10486 -878 15562 31408 22241 6782
12163 6782 9185 7675 -1356 -7839 -12161 -1701 -2239 -2951 6088 5441 13225 24992 19791 -317 -3553
12148 -3553 8184 7554 -12483 -3397 -4256 -10308 -8033 3551 3641 -7948 -10513 -5139 7402 14053
12134 14053 7258 1446 -2262 -2807 8515 29558 28206 18574 14564 12186 7385 9047 449 9667
12120 9667 24125 19299 -5460 -11502 -2132 -13204 -21610 -24322 -9959 -403 -14162 -23080 -23827 -22590
12106 -22590 -12229 -4287 2830 8275 10222 1997 1026 1926 -1957 -12063 -18281 -4037 9759 7065
12092G065j3463l504J2599J2907K525m937j1939j0342j0940n090K6357J2859J223
12079A5320m829j3320j59J3609J3215j498q334J641J1037l624j2448r127m557
12066c074j5422J2805k780O187R089Q188r843j7029k044j619m66K0793P133l66
12052A1552j0457n420o048p142m843M327K169n744j0049P183J2463J0113o713
12039h609j1186o194J3839J8108J732o43J0098m96j0100j0215q77O061P019M406
12025A2943N244j6266L84J640P278J3108L226j4933l799j5154q753N549J5445
12012E912K0051n89j2843K089K4134l385j8308K616o90O553j2021P6p791n364
11998D40N261Q602k083j4612l55M067j1344L802N069r74K901n803j305N258J7084
$$ plain form
12092 7065 -6398 -9902 2697 15604 18129 13192 1253 -9089 -20029 -25119 1238 14097 15320
12079 15320 10491 -2829 -2988 10621 23836 22338 14004 15645 26682 23058 10610 1483 -3074
12066 -3074 -18496 -5691 -8471 -2284 6805 14993 5150 -11879 -13923 -15542 -16008 4785 11918 11552
12052 11552 1095 -4325 -10373 -17515 -22358 -18031 -15862 -21606 -31655 -24472 -12009 -1896 -8609
12039 -8609 -19795 -25989 -12150 5958 7690 7047 17145 16649 6549 -3666 -4543 1518 8537 12943
12025 12943 18187 1921 2305 3945 11223 24331 27557 12624 8825 -6329 -15082 -9533 5912
12012 5912 25963 25374 12531 14620 38754 35369 17061 19677 18987 25540 13519 13595 5804 440
11998 440 5701 14303 12220 -2392 -2747 1320 -10024 -6222 -1153 -2127 774 -5029 -6334 -1076 16008
11983A6008P308r72L17j5267j7342j7168r39K053L011J1332N590J1521J092j1129
11969d585J0028J0335j5134l694J324o851j2688O949K0107J0419jL23K70j391
11955A5411k282q979q21N815o968r507l70Q432Q26R465j350n353Q439N277P05
11940A8740o034k679L654p793q498J1038m872l417j546J517j4979r231j341p988
11926c3429J1387Q828N690Q276J2457o327o777l53K712J700K782j44m953j8721
11912a6872j3640O898J1766p779m385J027k166K034M747P041J2848K872J8288
11899B2679J3345j4173j3664j1685n025n067k65J0716o38j418Q623j046K12P879
11885A0473J3039K866j4199j4759j612q390R998M95j0083r632L357K2064J7310
$$ plain form
11983 16008 23316 22344 22661 7394 -9948 -27116 -28055 -26002 -22991 -11659 -6069 5452 6544 -4585
11969 -4585 5443 15778 644 -3050 -1726 -8577 -21265 -14316 5791 16210 16209 16532 16802 15411
11955 15411 13129 4150 3329 9144 2176 -7331 -7701 731 1557 11022 9672 4319 12758 18035 18740
11940 18740 12706 10027 13681 5888 -2610 8428 3556 139 -1407 110 -14869 -24100 -25441 -33429
11926 -33429 -22042 -13214 -7524 752 13209 6882 105 -248 2464 4164 6946 6802 1849 -16872
11912 -16872 -30512 -23614 -11848 -19627 -24012 -22985 -25151 -23117 -18370 -11329 1519 4391 22679
11899 22679 36024 21851 8187 -3498 -8523 -13590 -13855 -3139 -3777 -5195 3428 2382 2594 10473
11885 10473 23512 26378 12179 -2580 -4192 -12582 -2584 -2089 -12172 -21804 -18447 3617 20927
11872B0927o647l309L857j4362L980P831M426n308m876J489J14M049m92j2232
11858e53k688J472J552R825N789j5348k413P548O822R790m796r792j357J0657
11844A6508M458J205K135k014q34o477q218K797j2251l86J1483j603j6676L305
11830f568n991O497k307O882j814J9359J1982j3306P008j399q099J460R773K817
11816B6294j3207j8102N086r453r278N060M096K0m462J1470J0771J244K573J078
11802A3190K396Q241m06q384l682j6860M820J1441o520Q892j716L370j7604k473
11788e295n556P283R123k269M670l051L701M55K947M445n01N776K533r823p778
11773F660o754M614O934j1914k3462j933J8319J1686L501n206Q90K206k363M933
$$ plain form
11872 20927 14280 10971 14828 466 4446 12277 16703 11395 6519 8008 8122 12171 11679 -553
11858 -553 -3241 -1769 -217 9608 15397 49 -2364 5184 12006 21796 17000 7208 5851 16508
11844 16508 20966 22171 24306 22292 21458 14981 6763 9560 -2691 -3077 8406 6803 -9873 -6568
11830 -6568 -12559 -6062 -8369 -1487 -3301 16058 28040 14734 21742 20343 12244 13704 23477 26294
11816 26294 13087 -5015 71 -9382 -18660 -13600 -9504 -9484 -13946 -2476 8295 9539 12112 13190
11802 13190 15586 23827 23421 15037 11355 -5505 -685 10756 4236 13128 11412 14782 -2822 -5295
11788 -5295 -10851 -3568 5555 3286 7956 4905 8606 9061 12008 16453 15952 21728 24261 14438 6660
11773 6660 -94 4520 11454 -460 -23922 -25855 -7536 4150 7651 2445 3335 5541 3178 8111
11759H111N658m939j867R881p694j5008m457J424M527l172Q44J1902K715j2109
11745d184m212o809O910o04R003Q875J1214k155r061o421j023N3O448J273M019
11730A3326p436j2237K846J2474P216M584L557o943j032J1431j266q641l107j8399
11716c627J631J0046L820o04K456J468j1485O588M392K123L107K704q013O639
11702B1245r73L784p586j0997j4862j696J5495J7535l807n570L531L360m171k389
11688A2899j1038p378J2497j0213o947j9R263j010q011P810k147j46J743P482
11674D785q259J368J8319J6111j274M082J2882K395j7020j7079l973j532J3112
11661B3917j2830j4914l108j77J6383r30j7896K257J5979J6739P534l766j5253
$$ plain form
11759 8111 13769 8830 6963 16844 9150 -5858 -10315 -8891 -4364 -7536 -6692 5210 7925 -4184
11745 -4184 -8396 -15205 -8295 -8899 104 8979 20193 18038 8977 2556 1533 1586 8034 9307 13326
11730 13326 5890 -6347 -3501 8973 16189 20773 24330 17387 16355 27786 26520 17879 14772 -3627
11716 -3627 -1996 8050 11870 11266 13722 15190 3705 10293 14685 16808 19915 22619 14606 21245
11702 21245 20272 24056 16470 5473 -9389 -11085 4410 21945 18138 12568 16099 19459 15288 12899
11688 12899 1861 -5517 6980 -3233 -10180 -10199 -936 -1946 -9957 -2147 -4294 -4440 -2697 4785
11674 4785 -3474 -2106 16213 32324 31050 35132 48014 50409 33389 16310 12337 10805 23917
11661 23917 11087 -3827 -6935 -7112 9271 8341 -9555 -7298 8681 25420 32954 29188 13935
11648A3935J890n093L585R137R525j0246o602m227N779R845j1513k3340J0342
11635C017K0335L637j4849n721J1781J4981j085q673r862M528N621q23j1678r654
11621A555n596J1714P823J1457n436j6324r251J345j553J2816q053J6319J3807
11608C0623N519j4017l442m090j2831n100J744J652m584L118m492J828R227R012
11594A4167m441m251J5629j151q325P827l828Jj60n888p286l598o219n242o084
11579a8849R078J4853O13M298K76R127q451K02J4011J0409n733j888r779J299
11565A9466J646P17j0192j3005l09R545N607q028M34J4037m926o952J6289o70
11551B3659Q185k2062n876L162J1199K638P993k108K085o144j2044j3178l643
$$ plain form
11648 13935 15825 10732 14317 23454 32979 22733 16131 11904 17683 27528 16015 -7325 3017
11635 3017 23352 26989 12140 6419 18200 33181 32096 23423 13561 18089 23710 22887 11209 1555
11621 1555 -4041 7673 15496 26953 21517 5193 -4058 -2713 -4266 8550 497 16816 30623
11608 30623 36142 22125 18683 14593 1762 -3338 -1594 58 -4526 -1408 -5900 -4072 5155 14167
11594 14167 9726 5475 21104 19953 11628 19455 15627 15628 15468 9580 2294 -1304 -7523 -12765 -18849
11579 -18849 -9771 5082 5695 9993 10269 19396 10945 11147 25158 35567 29834 27946 18167 19466
11565 19466 21112 21829 11637 -1368 -1677 7868 13475 5447 5881 19918 14992 8040 24329 23659
11551 23659 31844 9782 3906 7068 18267 20905 28898 26790 28875 22731 10687 -2491 -6134
11538f134J2744J2287n593J571m297L740l451n985N682j1271K530l265J924L034
11524C516q262q467J9123J7535L650j1108j5186O7R69j009O132J9731Q064j0534
11510B4221j6433o618l442J089K033O256J2145j269p214k669J4846J6534j1823
11497B7656k77K037l990k488J246J578n209j0471m543q05M029j303R044L691k400
11482A7795r992K4020j25j1759m435n12P773n061l086L424J0926K849j3111j1622
11468G084L755L840J560J265n249n447j0368M094J396J4640p891N415l817r829
11454D48n463O966O731l325K260r121o29O582R830n950K612K6631p146j2692o295
11439A1439o225N775J5588J2280j78K846K482j734o059j5612k831j3029J320J261
$$ plain form
11538 -6134 6610 18897 13304 14875 10578 14318 10867 4882 10564 -707 1823 -1442 482 3516
11524 3516 -4746 -13213 5910 23445 27095 15987 801 868 1837 828 6960 26691 34755 24221
11510 24221 7788 1170 -2272 -1183 850 7106 19251 17982 10768 8099 22945 39479 27656
11497 27656 27379 29416 25426 22938 24184 25762 20553 10082 5539 4734 8763 7460 16504 20195 17795
11482 17795 7803 31823 31698 19939 15504 14992 22765 17704 14618 18042 28968 31817 18706 7084
11468 7084 10839 14679 16239 17504 12255 6808 -3560 534 1930 16570 8679 14094 10277 448
11454 448 -5015 1951 8682 5357 7617 -1504 -2133 4449 14279 8329 10941 37572 30426 17734 11439
11439 11439 5214 10989 26577 38857 38679 41525 44007 42273 36214 20602 17771 4742 6062 7323
11425G323j498Q649O110o395R325P225o055N813k666l868O814r97Q802p230r069
11410B2283J746l778o771j0012J4292M688P717J059N867q28l269j0583q978n388
11396H045j1963J4408O8p926L707P38J454J1897R286J0051P99J2423P620j9047
11382D1560q937q45n618J0381q090m141J552J1200J730o018J946p27j3366M302
11368B4929O947P701j0047j3835n586M676p689Q80J3005j523o625m697J2591J7429
11354C8156O241L528j674o510l711L15O905j25p468p935P11n099l526j305k909
11339A5594k232n351n156j6057J2300J032O666L309l642r986m244J1440J1020
11326A4693p895j4122o361O085K0285O714n070Q283K66m942l991o13j2088K224
$$ plain form
11425 7323 5825 14474 20584 14189 23514 30739 24684 30497 27831 23963 30777 29780 38582 31352 22283
11410 22283 24029 20251 13480 3468 17760 22448 30165 31224 37091 36263 32994 22411 13433 8045
11396 8045 -3918 10490 10558 2632 6339 7077 8531 20428 29714 39765 40564 52987 60607 41560
11382 41560 32623 31778 26160 36541 28451 24310 25862 37062 38792 32774 34720 33993 20627 24929
11368 24929 31876 39577 29530 15695 10109 14785 7096 7976 20981 19458 12833 8136 20727 38156
11354 38156 44397 47925 46251 39741 36030 36345 43250 43125 35657 27722 28433 23334 19808 18503 15594
11339 15594 13362 8011 2855 -13202 -902 130 6796 10105 6463 -3523 -7767 3673 14693
11326 14693 6798 -7324 -13685 -7600 12685 19399 14329 22612 22878 17936 13945 13332 1244 3468
11312C468L073O263n092m956O968N16j675P957M340J927n384N545N37p802n071
11297A0614R324j271q187m673Q387M851J0995O560m429j1719j875R200P843J8303
11283E3923l542J665j0923j7001l19R981K071j24N486P5j8645N685J2997J636
11269D2965J27J6246K5447R611M186J194Q94J0933p085r403j4536k0006r093L153
11255E4633k753J600j8940p391L720O613L634q960n053p063j5253k609K693m736
11241A35J9716R823p042J040J6112P889j8179m639J2055O120k282K627L791j0541
11227C6625j6424J912M461R42Q292R164p938o602j1159l061J2684O232m807n203
11213B5118q071n322J1124M648J81o841q440o04j7386M822K756J5075q541r966
$$ plain form
11312 3468 6541 12804 7712 2756 9724 10240 8565 16522 20862 22789 17405 22950 23487 15685 10614
11297 10614 19938 18667 10480 5807 14194 19045 30040 36600 32171 20452 18577 27777 35620 53923
11283 53923 50381 52046 41123 24122 23803 33784 35855 35731 41217 41292 22647 28332 41329 42965
11269 42965 43092 59338 84785 94396 98582 99776 100670 111603 104518 95115 80579 60573 51480 54633
11255 54633 51880 53480 34540 27149 30869 37482 41116 32156 27103 20040 4787 2178 4871 135
11241 135 19851 29674 22632 23672 39784 47673 29494 24855 36910 43030 40748 43375 47166 36625
11227 36625 20201 22113 26574 27516 35808 44972 37034 30432 19273 16212 28896 35128 30321 25118
11213 25118 17047 11725 22849 27497 27678 20837 12397 11793 -5593 -771 1985 17060 8519 -1447
11199a447K5961P048m478J566m387n555L316q771o607J2386J7015J0953l666k24
11185D3110p512M351m674J389N837L096o602j4003o417O876P469Q77l327R122
11171C9592J0081J456l203n582p726j818j382j128k802P522n26n257J088O498
11157C6813k772K005n245r659L035n129O067Q013n78J473J785N620J0538K0359
11143G2325P250J3291l880j1479J4227O311r361o425n079j3944j8773k61m493
11130C9709L068J6086m550l813l089M665m350o650q320k2859L655K3183Q864O622
11116E2221r025n280M934J095M736o756N651j6848j6980J9879j72j6955J591P502
11102B5593J6540Q508J143K37M893m424k489j056k0966j1870M243J4629N032K750
$$ plain form
11199 -1447 24514 31562 27084 28650 24263 18708 22024 13253 6646 19032 36047 47000 43334 43110
11185 43110 35598 39949 35275 36664 42501 45597 38995 24992 18575 25451 32920 33797 30470 39592
11171 39592 49673 51129 47926 42344 34618 32800 31418 30290 27488 35010 34484 29227 30315 36813
11157 36813 34041 36046 30801 21142 24177 19048 25115 33128 32550 34023 35808 41428 51966 72325
11143 72325 79575 92866 88986 77507 91734 98045 88684 82259 77180 63236 44463 44202 39709
11130 39709 42777 58863 54313 50500 47411 52076 47726 41076 32756 9897 13552 36735 45599 52221
11116 52221 43196 37916 42850 43945 48681 41925 47576 30728 13748 33627 33455 16500 18091 25593
11102 25593 42133 50641 51784 52021 56914 52490 50001 48945 27979 16109 20352 34981 40013 42763
11088D2763k036Q6j1101j1612N361N519r261j1271O502R580m24k5K026Q457j217
11073C3347j271m052L308j745p263p035J1268l443k938l230P448j783J589l718
11059B0482M899K3523q201j5762K585Q848l809p18L998Q006J0648n008j016k826
11045D5649q954m3o87l555k149K526j7582J2816M604j737j0045j72K0493r719
11031C1445O361l282N347J0703M78M024j1248j1888J4597j458r187o577r049o933
11017A3333R636J2572j0733n085Q04N402R531p17q430j0420J1073O782L076j58
11003C6666L828n84N412o639J3905j424j1614k444o218r406P722m543L749J4220
10989D2630O620J69q236j9017O1J0204P219M879k2703q572J1790J6032J0747K201
$$ plain form
11088 42763 40727 40813 29712 18100 23461 28980 19719 8448 14950 24530 24106 24081 26107 34564 33347
11073 33347 32076 28024 31332 29587 22324 15289 26557 23114 20176 16946 24394 22611 24200 20482
11059 20482 25381 48904 40703 24941 27526 36374 32565 31847 35845 43851 54499 49491 48475 45649
11045 45649 36695 36652 35965 32410 30261 32787 15205 28021 32625 30888 20843 20671 41164 31445
11031 31445 37806 34524 39871 50574 51052 55076 43828 31940 46537 45079 35892 29315 20266 13333
11017 13333 22969 35541 24808 19723 20527 25929 35460 34743 26313 15893 26966 33748 36824 36666
11003 36666 40494 39910 45322 38683 52588 51164 39550 37106 30888 21482 29204 24661 28410 42630
10989 42630 49250 49419 41183 22166 22227 32431 39650 44529 21826 13254 25044 41076 51823 54024
10975E4024l829j370n161L286J93K335N72j107J5753P37N536N31m363P080P495
10960H1712j2889j4927j6620J682J1024L847L591J3160J857L059m392j146r840
10947F0118j9093o231L688P440J4133N370J817l690P046J770j0636o738J2387
10934F7381N943M539R32n842j1315j1397J662j1167m079J1750J2486R056j3047
10921E6902j0427l991j6322K246J3217j240J2132Q221N223J293L172R396L3j097
10907G8758m031m797j6365P682O795k413l874M738P535r258j3199j2508J185n128
10893C5120N79L244J6111J3134P50o914j3055N105r284l601k599J3939j5029j1872
10879B5628J2955J4423O910N89P075j303j9521k819Q020L269L144j2002o358n972
$$ plain form
10975 54024 50195 48825 43664 46950 47143 49478 50050 48943 64696 65433 70969 71500 67137 74217 81712
10960 81712 68823 53896 37276 38958 49982 53829 57420 70580 72437 75496 71104 69958 60118
10947 60118 41025 34794 38482 45922 60055 65425 67242 63552 70598 72368 61732 54994 67381
10934 67381 73324 77863 78795 72953 61638 50241 51903 40736 36657 48407 60893 69949 56902
10921 56902 46475 42484 26162 28408 41625 40385 52517 60738 65961 67254 70426 79822 79855 78758
10907 78758 74727 69930 53565 61247 68042 65629 61755 66493 74028 64770 51571 39063 40248 35120
10893 35120 35699 38943 55054 68188 68938 62024 48969 54074 44790 41189 38590 52529 37500 25628
10879 25628 38583 53006 59916 60505 67580 66277 46756 43937 51957 55226 58370 46368 40010 34038
10865C4038k444P744O023j636k38Q619K089m481J651J834J0531N051K90j5459
10851E3612r542K0373J6902p696m514r272j0949M228R556J401p541q385Q946M797
10837F1916P526j940j1616j4426L280K417J8091J3721K495J913j4463o970r473
10824E2471m702m754K107M295j853q664M629P66P228Q606r323j2588R904Q157
10810E6279K058j576l628n615N810P641p896N957N102l646k817K3490J6138J5593
10796A12890J5477j5355J8728K2748J9142P028p324N289k259o84j705j9360j8427
10783A36188j6742k2372l342M246j665j4759r750p060J1297Q867l501Q028p211
10770H2224j0102P067M299k527j1466o075J944P523M315o975m660r720j906P452
$$ plain form
10865 34038 31594 39338 45361 43725 43487 52106 54195 49714 51365 53199 63730 68781 69071 53612
10851 53612 44070 64443 81345 73649 69135 59863 48914 53142 62698 64099 56558 48173 57119 61916
10837 61916 69442 67502 55886 41460 44740 47157 65248 78969 81464 83377 68914 61944 52471
10824 52471 47769 43015 45122 49417 47564 38900 43529 44295 51523 60129 50806 38218 48122 56279
10810 56279 58337 56761 53133 47518 53328 60969 53073 59030 64132 60486 57669 81159 97297 112890
10796 112890 128367 113012 131740 154488 173630 180658 173334 178623 176364 175680 173975 154615 136188
10783 136188 119446 97074 93732 97978 96313 81554 71804 64744 76041 84908 81407 89435 82224
10770 82224 72122 79189 83488 80961 69495 63420 65364 72887 77202 70227 65567 55847 53941 61393
10756F1393J4135M491J3017O912J4577J8372Q035j3110j0137P27r690j1504j4958
10743H2260j1416k016Q459Q598r800j5719J0259Q092j712r0p736J6522J0670j9898
10729G6473j9482J1203J5770m193n286R261L899J58L439L117M737O531J0593q891
10715A07329j0839n899k70L144R858j79J071r821j6181Q730M969O051j0575j3575
10701G3813r745K3082O161j0771j4134J0143J4223R118K991j8466k0916J723J1973
10688G9195J5778j968k418Q93J74P609J1054O41J259J0129n575k834j851j606
10674A10480q293j202q123N784J2993J0177N404J3091o900J7790J8225J0672k063
10661A78035j286K110R217j1093j7280L12O004N30j2437j1069p863M238Q846j0717
$$ plain form
10756 61393 75528 80019 93036 99948 114525 132897 140932 127822 117685 118412 108722 97218 82260
10743 82260 70844 68828 77287 85885 76085 60366 70625 78717 77005 76915 69179 85701 96371 76473
10729 76473 56991 68194 83964 79771 74485 83746 87645 87803 91242 94359 99096 105627 116220 107329
10715 107329 96490 90591 90321 93465 103323 103144 104215 94394 78213 86943 91912 97963 87388 73813
10701 73813 64068 87150 93311 82540 68406 78549 92772 101890 104881 86415 65499 67222 79195
10688 79195 94973 93005 90587 91480 91654 99263 110317 110958 112217 122346 116771 113937 112086 110480
10674 110480 102187 100985 92862 98646 111639 121816 127220 140311 133411 151201 169426 180098 178035
10661 178035 176749 178859 188076 176983 159703 160015 166019 166549 154112 143043 135180 139418 148264 137547
10647A37547k5946l841P54o690n915k695M613J7780k067n685M663P246o87m989
10633A14088P52P00j131O204M062q90J133j1682p725L586L526R147k814J350l84
10618A19922k996R633k1234l959N966R431j2714k892R988R559J0514Q283o125
10605A33376j2619K280L696O837M12P663j5643k1444K672J4040j4751j1723J294
10592I6090Q309L405K856n338m94R993j693j2765J957K548j000J2594k178j2533
10578A01751P171J3668M068j0596j728O737o273J07j403O866o998N84J194M720
10564A19868j6205j565R73J571J64M66L132J8594P277J0974Q711N74M971m254
10550A55251m047j4679L977m529R462R382o929j5186j779J1686J2446J0382L3707
$$ plain form
10647 137547 111601 107760 108514 101824 95909 93214 97827 115607 113540 107855 112518 119764 119077 114088
10633 114088 114840 115540 114409 120613 124675 123785 124918 113236 105511 109097 112623 121770 118956 120306 119922
10618 119922 116926 126559 105325 101366 107332 116763 104049 101157 111145 120704 131218 139501 133376
10605 133376 120757 123037 126733 133570 133982 141645 126002 104558 107230 121270 106519 94796 96090
10592 96090 104399 107804 110660 105322 104828 114821 113128 100363 102320 104868 103868 116462 114284 101751
10578 101751 108922 122590 126658 116062 114334 121071 114798 114905 113502 120368 113370 113954 115148 119868
10564 119868 103663 102098 103071 104642 104806 105272 108404 126998 134275 145249 153960 154534 159505 155251
10550 155251 151204 136525 140502 135973 145435 154817 147888 132702 130923 142609 155055 165437 199144
10537A99144L5079K3041J4442J1242P717J6770N465l3015m3496l4153j8921l127
10525A80188P686K046J1615j2223q353P755n721M027J8362Q951J8067J5954Q858
10512B57212J3767K0864K2938m44j5350j6642l470o761k1151l5137j6024K897
10500B02699J912M160o8j1883o442M870J0434O214r168J0731K533n635N737O852
10486B22946j3837j2739j1023o495M736J5418p520j657j4286P286Q157M597J557
10473A97140k195L400K356K9P409J9882p283r087J645m717j4160J953L398Q223
10459B07993K1221J1249p69K2898L2216M4414K9066M2181M5415L3255L7634J6237
10447E43010j7805j5397j2107j9898j7546l3684k7577k4403j2773j2661j1620
$$ plain form
10537 199144 234223 257264 271706 282948 290665 307435 312900 279885 236389 202236 183315 180188
10525 180188 187874 189920 201535 189312 180959 188714 182993 187020 205382 214333 232400 248354 257212
10512 257212 270979 291843 314781 314337 298987 282345 278875 272114 250963 215826 199802 202699
10500 202699 204611 208771 208703 196820 190378 195248 205682 211896 202728 213459 215992 210357 216094 222946
10486 222946 209109 196370 185347 178852 183588 199006 191486 189829 175543 182829 190986 195583 197140
10473 197140 194945 198345 200701 200730 208139 228021 220738 211651 213296 208579 194419 196372 199770 207993
10459 207993 229214 240463 239694 262592 294808 339222 368288 410469 455884 489139 526773 543010
10447 543010 525205 509808 497701 477803 460257 426573 398996 374593 361820 349159 337539
10436C37539j9691j4213k0316j3078p134k1053k8727o815J3742J6830P348k152
10424B42280K887m9L461j2367j0289k246N36j072l348k3103j2139M838J5108K0532
10410B25029J6183l08l510n668l514p696q14M615J125O867l944m54n881k8535
10396A93495j0586K187M770J3583J2764J7216K932M43n590p080J6146L3117k558
10383B70839o235q711n335o916p523J5080Q878j6917n199l95J775J1972J1026
10370B62339o202j8465j1077n363n606o556Q604K738n271j238j5920j049J1500
10357B08434J1898j0412r827l835M880m411p779L43R056J6726J8086n562q303
10344B19294N175q481k848O07R095N388o718p690Q789l320L695K582M294J3637
$$ plain form
10436 337539 317848 303635 283319 270241 263107 242054 213327 206512 220254 237084 244432 242280
10424 242280 245167 245118 248579 236212 225923 223677 224213 223141 219793 196690 184551 189389 204497 225029
10410 225029 241212 240904 237394 231726 228212 220516 219702 224317 225442 232309 228365 227911 222030 193495
10396 193495 182909 185096 189866 203449 216213 233429 236361 236804 231214 224134 240280 273397 270839
10383 270839 264604 255893 250558 243642 236119 251199 260077 243160 237961 237566 239341 251313 262339
10370 262339 256137 237672 226595 221232 215626 209070 217674 220412 215141 213903 197983 196934 208434
10357 208434 220332 209920 200093 196258 201138 196727 188948 189291 198347 215073 233159 227597 219294
10344 219294 224469 215988 213140 213747 222842 228230 221512 213822 222611 219291 222986 225568 229862 243499
10330B43499M629j0909k412P318K3059K317r161P543j03q328m859P187N123K447
10316B67350J1133r755p029o287K675J1386M852P378k784m976J31k920L634J4592
10302B89380J5016K051Q32L603J2039j5785J3199K243p087J966N851J688P777
10289C32773O867J3799J7243j979P255n478p921J7139J4880O335k685r015j467
10276C87746O873m076j6064L902N854l032j2575J3292K7574J9984J4221J2816
10264D56515J3061J5850K98M242j1256o129j2451j6327n358j0402j2119p240L364
10251D12048R570m153j0463P878P669j0962K880J080m654K3847J1567J2583L1968
10238D90858J7821K7063K9163K9434K0016K4524K0045K0758J5305j3240m0954
$$ plain form
10330 243499 248128 237219 234807 242125 265184 267501 258340 265883 265780 257452 252593 259780 264903 267350
10316 267350 278483 268728 261699 255412 258087 269473 274325 281703 278919 273943 274074 271154 274788 289380
10302 289380 304396 306447 307279 310882 322921 307136 320335 322578 315491 317457 323308 324996 332773
10289 332773 339640 353439 370682 368703 375958 370480 362559 379698 394578 400913 398228 389213 387746
10276 387746 394619 390543 374479 378381 384235 381203 368628 381920 409494 429478 443699 456515
10264 456515 469576 485426 485724 489966 478710 472581 460130 443803 438445 428043 415924 408684 412048
10251 412048 421618 417465 407002 414880 422549 411587 414467 415547 410893 434740 446307 458890 490858
10238 490858 508679 535742 564905 594339 614355 638879 658924 679682 694987 681747 640793
10227F40793m1640l3275k6675j7524n961q368l304J427Q826O199o279J150J4597
10214E29966L720N185R307M039K527N193J5608L2469K5661N5362P9832Q7752J46235
10201A002856K02271K75074L36009K96023K30658K12651K11084J29575r4341l58566
10191B443294m46707l48492k14118j24999p5406m5476j3168k3888l4909m8373
10181A067758m6721n5806q0640n6276j1142j3371j3019j315K270j8593j067j1202
10169G60876k1472j3740j9279l880n251M448o387m506J3868L476k079J338j480
10156G05932N004R156l630J764J2689J3363j740q002j0811K3405K5317J038q32
10143G72653m38M223J3490J9273J4245K4968J9631O734J6800Q636m039m268j3824
$$ plain form
10227 640793 599153 565878 539203 521679 515718 507350 504046 505473 514299 520498 514219 515369 529966
10214 529966 533686 538871 548178 552217 554744 559937 575545 608014 633675 689037 768869 856621 1002856
10201 1002856 1205127 1480201 1816210 2112233 2342891 2555542 2766626 2896201 2801860 2443294
10191 2443294 1996587 1648095 1433977 1308978 1233572 1188096 1174928 1151040 1116131 1067758
10181 1067758 1021037 965231 884591 828315 817173 803802 790783 789468 791738 773145 772078 760876
10169 760876 739404 725664 706385 702505 697254 701702 695315 690809 704677 708153 706074 707412 705932
10156 705932 710936 720092 716462 718226 730915 744278 742538 734536 723725 747130 772447 773485 772653
10143 772653 772215 776438 789928 809201 823446 848414 868045 874779 891579 900215 896176 891908 878084
10130H78084j8335j1136j5211l724N406J713J731K190M795J00L346M830K07j1903
10116H42093K225K899N054N284J4957J5821L422Q182J5407J1579o324O65K223
10103I23487M61K936J0543m100K396J3202O596J323J1955Q636J499R653M243J4033
10089A006863J7559K3424L5921N557J0358J4957O03O8L535M007j2125j1714k0063
10076A078950j3161k0174r247J438j4075l078k341R096J8840J4573P666J0786
10064A079273K0294J4848J5120J5968J9196K5813J5544o941j4612j0483L049J3516
10052A190585J5366m081R97j553K998r617k0251j9498k0640j2176l868J3419J1888
10039A143569J6182K1697P251J0207k397j2328j3508j0429j1093N376M031J816
$$ plain form
10130 878084 859749 848613 833402 829678 835084 836797 838528 840718 845513 845613 848959 853789 853996 842093
10116 842093 844318 847217 852271 857555 872512 888333 891755 899937 915344 926923 920599 921264 923487
10103 923487 923948 926884 937427 933327 935723 948925 955521 956844 968799 977435 978934 988587 992830 1006863
10089 1006863 1024422 1047846 1083767 1089324 1099682 1114639 1115242 1115310 1118845 1122852 1110727 1099013 1078950
10076 1078950 1065789 1045615 1036368 1037806 1023731 1020653 1018312 1027408 1046248 1060821 1068487 1079273
10064 1079273 1099567 1114415 1129535 1145503 1164699 1190512 1206056 1199115 1184503 1174020 1177069 1190585
10052 1190585 1205951 1201870 1202867 1201314 1204312 1194695 1174444 1154946 1134306 1122130 1118262 1131681 1143569
10039 1143569 1159751 1181448 1188699 1198906 1196509 1184181 1170673 1160244 1149151 1154527 1158558 1160374
10027A160374J8113N550J5944K216k149J8704L3057K5957L3937O4405J13102J42439
10015A631649J52715J86814K05706K29212K30573J98262J09141O8j21204j95114
10005B627822k87715l05555k48331j91965j57508j13731r0138n8632m6767m7976
9995A079504m9878k3378k2823q380j2282j3674Q123K4641K862k5375k4648R039
9983I43731L2579J3435K806J0206J1539J0285j6702l2005j3836j9572j8183n631
9971I18652J1312P220J0521J3254P289j1419j0336j176q512j1172j2627r866k300
9958I00840j2725j8590R25k805o367N380l794o596L300j937j684J588Q388j408
9944H64515K608J4987L135N474O355J0279K4034L8045L2548K4515M0143N6633
$$ plain form
10027 1160374 1178487 1184037 1199981 1202197 1200048 1218752 1251809 1277766 1311703 1376108 1489210 1631649
10015 1631649 1784364 1971178 2176884 2406096 2636669 2834931 2944072 2944140 2822936 2627822
10005 2627822 2340107 2034552 1786221 1594256 1436748 1323017 1232879 1174247 1127480 1079504
9995 1079504 1029626 1006248 983425 975045 962763 949089 957212 981853 984715 959340 934692 943731
9983 943731 976310 989745 992551 1002757 1014296 1024581 1007879 975874 962038 942466 924283 918652
9971 918652 929964 937184 947705 960959 968248 956829 946493 945317 936805 925633 913006 903140 900840
9958 900840 888115 869525 870450 867645 861278 866658 862864 856268 859568 857631 855947 857535 865923 864515
9944 864515 867123 882110 885245 890719 897074 907353 931387 969432 1001980 1026495 1066638 1123271
9932A123271R6445N7387k04j0096M0559Q5572Q4485O9742j1309j04442j20070
9921A311340m3399l391N025J1674R850p974j2683m733o022m603K644Q341J5901
9908A281970K099R080J034J7386J9489L969r257M591k1592j5956r044j3163k151
9895A268455O194N713j7785j3147j1865N352O212q526j3150j5103j0608J3182
9883A214924K1049O470J466L436K2557J2094J8783L9258N4772O2013N7189N5509
9871A569520M4446M8829L0236M0062M9140M3512N0827M4084K9704R545K3376M2762
9859B026043M8358J4674j0255j7058L797l777P672L2146L9790M0728M1546O8576
9847B292240J06751J26483J19649R5173N9559O2323P1700J00371J04874J13561
$$ plain form
9932 1123271 1219716 1277103 1276899 1266803 1307362 1392934 1477419 1547161 1535852 1431410 1311340
9921 1311340 1267941 1264550 1269575 1281249 1291099 1283125 1270442 1265709 1259687 1255084 1257728 1266069 1281970
9908 1281970 1284069 1293149 1294183 1311569 1331058 1335027 1325770 1330361 1308769 1292813 1283769 1270606 1268455
9895 1268455 1274649 1280362 1262577 1249430 1237565 1242917 1249129 1240603 1227453 1212350 1201742 1214924
9883 1214924 1235973 1242443 1243909 1247345 1269902 1281996 1300779 1340037 1394809 1456822 1514011 1569520
9871 1569520 1613966 1662795 1693031 1733093 1782233 1825745 1876572 1920656 1950360 1959905 1983281 2026043
9859 2026043 2074401 2089075 2078820 2061762 2065559 2061782 2069454 2101600 2141390 2182118 2223664 2292240
9847 2292240 2398991 2525474 2645123 2740296 2799855 2862178 2933878 3034249 3139123 3252684
9837C252684J31694J48645J75494K33040K60118K76620K74293K71555K92863L29948
9827E646954M10442M59466M87299M66779M99810N85071P24584Q60854R87407J100676
9817A2229342J206790J397786J657912J947283K206900K465342L028754M186283
9809C0326392N867813Q159535J1555952J6979721K5672495L8266846N2211451
9802A89040205N8691788N0488778L7755649L5243626L7258290K4891933j6582316
9795D16787953o7775887q6227684p0434511m7497202l0515989j9783145j3311175
9788H1242360r529295p272559n809901m775081m029068l492821l042972k577623
9780D0713040k122903j791913j761437j874048j788643j511964j226464j038556
$$ plain form
9837 3252684 3384378 3533023 3708517 3941557 4201675 4478295 4752588 5024143 5317006 5646954
9827 5646954 6057396 6516862 7004161 7470940 7970750 8555821 9280405 10141259 11128666 12229342
9817 12229342 13436132 14833918 16491830 18439113 20646013 23111355 26140109 30326392
9809 30326392 36194205 44353740 55909692 72889413 98561908 136828754 189040205
9802 189040205 247731993 298220771 335976420 371220046 408478336 433370269 416787953
9795 416787953 349012066 262784382 192349871 144852669 114336680 94553535 81242360
9788 81242360 71713065 64440506 58630605 53855524 49826456 46333635 43290663 40713040
9780 40713040 38590137 36798224 35036787 33162739 31374096 29862132 28635668 27597112
9772B7597112r02097q11914p85094q32511r38290r57897r52346r67369j004682
9763A9444912j008421r33714q10812p14466o32150n76282n45037n28523m94484
9754A3201023m49008m23564l95373l58247l39851l31516l09464k77613k63855
9745A0052532k27409k36240k55418k67879k45316k51300k45784k02793j66915
9736G953478j45682j60867j82805j79707j91092k08436k11893k02917j99815j79842
9726F090422j51517j50429j25015j18250j13714j19268j05817p2319n4343o1046
9716E018704q5611r0021r1280r4183r1344r5059q5633p5707p8971r7020j00155
9705D033720r9870r0593p7688q0547o5848p0461o4975p2521o2130n1099m9504
$$ plain form
9772 27597112 26695015 25883101 25098007 24265496 23327206 22369309 21416963 20449594 19444912
9763 19444912 18436491 17502777 16691965 15977499 15345349 14769067 14224030 13695507 13201023
9754 13201023 12752015 12328451 11933078 11574831 11234980 10903464 10594000 10316387 10052532
9745 10052532 9825123 9588883 9333465 9065586 8820270 8568970 8323186 8120393 7953478
9736 7953478 7807796 7646929 7464124 7284417 7093325 6884889 6672996 6470079 6270264 6090422
9726 6090422 5938905 5788476 5663461 5545211 5431497 5312229 5206412 5134093 5079750 5018704
9716 5018704 4933093 4843072 4751792 4657609 4566265 4471206 4385573 4309866 4230895 4133875 4033720
9705 4033720 3933850 3843257 3765569 3685022 3619174 3548713 3483738 3411217 3349087 3297988 3248484
9694C248484m7946m1994j9735o368j1847m3956l7898m1441o3244n1459n9645n6016
9682B766935m9031n0301o5510n0920k8300r819J6515O199K472P106m925l4985
9670B505436o7584j01160r3116m9048k1608k1870j5102j3820J3951L4644K1092
9659B191815M3946O1812R7749J00348J00974J04112Q4141Q3803Q2332Q3042Q7796
9648C121870J03918J40981J58974J76212K01096K33588K48646K54227K76804L01071
9638E217387L14218L57534L90008M04596M54815N24985N97375O84382Q36573J023157
9628A0805030J217675J440443J698300J945016K187100K436943K820635L418718
9620B7969860M222418N381851P158123R937618J4172992K0435683K8855948L7582803
$$ plain form
9694 3248484 3200538 3158544 3138809 3132441 3120594 3076638 3038740 2997299 2934055 2882596 2822951 2766935
9682 2766935 2717904 2667603 2602093 2551173 2522873 2513054 2529569 2535768 2538240 2545346 2540421 2505436
9670 2505436 2437852 2336692 2243576 2194528 2172920 2151050 2135948 2122128 2136079 2170723 2191815
9659 2191815 2235761 2297573 2395322 2495670 2596644 2700756 2784897 2868700 2951032 3034074 3121870
9648 3121870 3225788 3366769 3525743 3701955 3903051 4136639 4385285 4639512 4916316 5217387
9638 5217387 5531605 5889139 6279147 6683743 7138558 7663543 8260918 8945300 9781873 10805030
9628 10805030 12022705 13463148 15161448 17106464 19293564 21730507 24551142 27969860
9620 27969860 32192278 37574129 44732252 54669870 68842862 89278545 118134493 155717296
9612A55717296M2685502M3361518M3412637M1157870L2778115J7913297m422962
9605C72603273k4096094l7675729n2244841n6176732m5859648l2365568k1988872
9598A02195789j5103000j0679609p880431o174042n138409m458142l889127l411755
9590D5461274l028440k691530k380425k153455j978670j845380j727510j571874
9582B8083990j397349j234858j134937j060668r89140r35377q65292q15480p68806
9573A8882083p29360p10020o83704o57878o23493n89264n44760n09782m88012
9564A3345810m55229m34086m16164l90716l70719l60574l43746l28682k86987
9555I958907k70183k77335k95557k81744k91316k88325k79001k65301k48642k36697
$$ plain form
9612 155717296 198402798 241764316 285176953 326334823 359112938 377026235 372603273
9605 372603273 348507179 310831450 258586609 202409877 156550229 124184661 102195789
9598 102195789 87092789 76413180 68532749 62358707 57220298 52762156 48873029 45461274
9590 45461274 42432834 39741304 37360879 35207424 33228754 31383374 29655864 28083990
9582 28083990 26686641 25451783 24316846 23256178 22267038 21331661 20466369 19650889 18882083
9573 18882083 18152723 17442703 16758999 16101121 15477628 14888364 14343604 13833822 13345810
9564 13345810 12890581 12456495 12040331 11649615 11278896 10918322 10574576 10245894 9958907
9555 9958907 9688724 9411389 9115832 8834088 8542772 8254447 7975446 7710145 7461503 7224806
9545G224806k44319k23554k11833j89801j91822j85398j83646j88916j75890j63384
9535E266243j80805j52391j21562j06867j10066r1211p5294p7221q5337r1176
9525D174313j00435r9025r3238q9306r8402r3824r0072q6174p6904q2332j03307
9514C161294r2579p9014p9351q3224q4982o1801n7336n7824o1990n6485m3845
9503B402863l5926l5434m5522l6789m5620n9295o7978n3337o5130q3242q0278
9492A794312q7634r4870q0170p4233o9037p0963n7624l6982j9124k7092k4667
9481A151916m0618p3417r9780j04311r6167o9886n1157m3107j9046p752j1737
9470E34938j6540p298o938q440o484M431l34l529n563j8991o934P523k0445j8513
$$ plain form
9545 7224806 6980487 6756933 6545100 6355299 6163477 5978079 5794433 5605517 5429627 5266243
9535 5266243 5085438 4933047 4811485 4704618 4594552 4503341 4428047 4350826 4265489 4174313
9525 4174313 4073878 3974853 3881615 3792309 3693907 3600083 3510011 3423837 3346933 3264601 3161294
9514 3161294 3068715 2989701 2910350 2827126 2742144 2680343 2623007 2565183 2503193 2446708 2402863
9503 2402863 2366937 2331503 2285981 2249192 2203572 2144277 2076299 2022962 1957832 1874590 1794312
9492 1794312 1706678 1611808 1531638 1457405 1388368 1317405 1259781 1222799 1203675 1176583 1151916
9481 1151916 1111298 1037881 938101 833790 737623 667737 616580 573473 554427 546675 534938
9470 534938 518398 511100 504162 495722 489238 493669 493335 489806 484243 465252 458318 465841 445396 426883
9456D26883J4245j7510j6800j784O866k562j5033k1120o788j2963M895M695j0177
9443C52847k227k0563r463j0308j8357K793J6829j875J1289J4163M570j2687r076
9430C17935Q25k338n560q844J5326P543J7355J4264K5614M9849M8580M5972N7617
9417E84138M7978K6583j900k6704l6744l5592k0050j5032j5025O719k401L7842
9405E49812M8462O9098J03214J65068K47396L21982L04805K45008K19182K02282
9395B476309J72376j2908k94153m72084m38839l11677k01904j26114r2412o6461
9385F32133m7558m3980m2521k9362l1055k6835j6073k1503j5356j3906k066L327
9373C45245r043r337j2235l369j822P92J2792j4359r323R360M2k658j6286m942
$$ plain form
9456 426883 441128 423618 406818 405034 411900 409338 394305 373185 366397 353434 358329 363024 352847
9443 352847 350620 330057 320594 310286 291929 294722 311551 309676 320965 335128 339698 327011 317935
9430 317935 318760 316422 310862 302018 317344 324887 342242 356506 382120 431969 480549 526521 584138
9417 584138 632116 658699 656799 630095 593351 557759 537709 522677 507652 514371 511970 549812
9405 549812 598274 667372 770586 935654 1183050 1505032 1809837 2054845 2274027 2476309
9395 2476309 2648685 2635777 2341624 1869540 1430701 1119024 917120 791006 698594 632133
9385 632133 584575 540595 498074 468712 437657 410822 394749 373246 357890 343984 341918 345245
9373 345245 336202 326865 314630 311261 309439 310231 323023 308664 299341 308701 308743 306085 289799 284857
9359B84857j595K964r75N26k6425j7924j558j9914k8688j2005o272l436n338k4904
9345A39313k0429q318n740p599o403l873Q236k215n917j0399p7O384J4322K402
9331I9687k954j7824j3928N789j11m949j0648n290k936M955L411j073l647m139
9317D6343n706r25j717Q2N833J680j1959K982K323j2604k724J2051j500j0855
9303B3304j754J5407M477p792M051R060K804p184m531m081o184J1793j982l351
9289C4037Q840m820j708j3279J2439L468q350j920O381J0014K765N215j6140p975
9275B8967j262J0880J8173m95j727K099j2046L042J010K159m915l442L44M313
9261D7100j3996r6o528J489J6267N871l671P12l275q587j0011O161J0221O462
$$ plain form
9359 284857 283262 286226 285251 285777 259352 241428 239870 219956 191268 179263 172991 169555 164217 139313
9345 139313 118884 110566 104826 97227 90824 86951 95187 92972 87055 76656 76579 82963 97285 99687
9331 99687 96733 78909 64981 70770 70659 65710 55062 49772 46836 51791 55202 54129 50482 46343
9317 46343 40637 39712 37995 38077 43910 45590 33631 36613 38936 26332 23608 35659 34159 23304
9303 23304 21550 36957 41434 33642 37693 46753 49557 42373 37842 33761 27577 39370 37388 34037
9289 34037 42877 38057 36349 23070 35509 38977 30627 28707 35088 45102 47867 53082 36942 28967
9275 28967 27705 38585 56758 56263 54536 56635 44589 47631 48641 50800 45885 42443 42787 47100
9261 47100 33104 33008 26480 27969 44236 50107 46436 47148 43873 35286 25275 31436 41657 48119
9247D8119M734O740M400L434o350j7069M489M98j2083Q377R056P62j1831Q984
9233E2260Q616k097o772r02n938J414n981n008L483J3430O529J0103J6418k884
9219H2671L782J6545K8245Q605q451K0493L7921M8579M3441M8275O7438R0397
9207D87941J10489J72883K20387K42116K55777K44950J98934J36334K8247q5855
9197B012203j66055k59417l22607k90688k12036j57330j00990o1502l3123l7009
9187C71446n6360k3955k9955m1467k2011q737r529j3507k032q959k2664n864m142
9174A22264k284j1397j4725L541J458O749j0268j8993O10J2757L406p021j1512
9161G4585j975M925p344j1842J0657P16n695j4584o722Q477N204k1975j409K0753
$$ plain form
9247 48119 52853 59593 63993 67427 61077 44008 48497 48995 36912 45289 54345 55107 43276 52260
9233 52260 60876 58779 52007 51105 45167 46581 40600 35592 39075 52505 59034 69137 85555 82671
9219 82671 86453 102998 131243 139848 131397 151890 189811 238390 281831 330106 397544 487941
9207 487941 598430 771313 991700 1233816 1489593 1734543 1933477 2069811 2098058 2012203
9197 2012203 1846148 1586731 1264124 973436 761400 604070 503080 441578 408455 371446
9187 371446 315086 291131 261176 219709 197698 188961 179432 165925 163893 154934 132270 126406 122264
9174 122264 119980 108583 93858 97399 98857 105606 95338 76345 76955 89712 93118 86097 74585
9161 74585 72610 77535 70191 58349 69006 69722 64027 49443 42721 51198 56402 34427 33018 53771
9147E3771K1844n284j2535j4569o318j852m334J1144M967k762j627j5794o672
9134A9979j428Q292K561j0165n757K089q624q254N099m617J3293J2881j621o374
9120A7354J239J136J868m629J030j4136k533P11j44J8996j0671p520l197m380
9106d876P165J0303q02P59O406L960N66M217K210L11R04L43r050j4406j3500N613
9090A23O296J60j620o568O918k049p125J6922L614j7446q034R928R981J3183N536
9075B9819p556k869j174L025J2649r115o589j8425q22J2633J0569Q088J443O98
9061C2374k153L248m815P392J050q050m689K513K495J4n602j0009j1606j945J8424
9046A8641J6540k568L230K429r420p178Q385J976J853k784j829O677M064q126
$$ plain form
9147 53771 75615 70331 57796 43227 36909 35057 30723 41867 46834 44072 42445 26651 19979
9134 19979 18551 26843 29404 19239 13482 15571 6947 -1307 3792 -825 12468 25349 23728 17354
9120 17354 18593 19729 21597 16968 17998 3862 1329 2040 1896 20892 10221 2701 -496 -4876
9106 -4876 2289 12592 11790 12549 18955 22915 23481 27698 29908 30219 31123 31466 22416 8010 -5490 123
9090 123 6419 6579 4959 -1609 5309 3260 -3865 13057 16671 -775 -8809 1119 11100 24283 29819
9075 29819 22263 19394 18220 21245 33894 24779 18190 -235 -1057 11576 22145 30233 31676 32374
9061 32374 30221 33469 28654 36046 37096 29046 24357 26870 29365 29379 23777 13768 2162 217 18641
9046 18641 35181 32613 35843 38272 28852 21674 30059 32035 33888 31104 29275 35952 40016 31890
9032C1890q956q041k908m912M429K915L503Q760L190j54n335r806q954L193J4310
9017B3124k546M645m988m062K234n114q543P525J1758p51r42j478j1013J215J589
9002A2653P497P511K221J8199L528j5562K589K0256J9237J8887K335L279K0549
8989A23179K2610K2595L0839M4973M4774N1763N1021L7761L3660L4324J771j4314
8977D84956l0722o5275p9769o2908l9042j3251l1801l0579j2937o598k1445m14
8965I0215L747l59r790n700j3850p190j1474j893M768n01N968j463J51O151r057
8950D9723N590r54q855M741P985n984j0401k286K0045J4445J1530L098j1223L473
8936H0927M65N236q305q444j40K952J1909n579k0137p066j0196r24m401m906q375
$$ plain form
9032 31890 22934 14893 11985 7073 11502 14417 17920 26680 29870 29716 24381 14575 5621 8814 23124
9017 23124 20578 25223 20235 16173 18407 13293 4750 12275 24033 23282 22340 20862 9849 11064 12653
9002 12653 20150 27661 29882 48081 51609 36047 38636 58892 78129 97016 99351 102630 123179
8989 123179 145789 168384 199223 244196 288970 340733 391754 429515 463175 497499 499270 484956
8977 484956 454234 388959 309190 246282 207240 193989 162188 131609 118672 112074 90629 90215
8965 90215 93962 93603 83813 78113 64263 57073 45599 43706 48474 47973 53941 52478 52629 58780 49723
8950 49723 55313 54359 45504 50245 58230 52246 41845 39559 59604 74049 85579 88677 77454 80927
8936 80927 81392 86628 78323 69879 69739 72691 84600 79021 58884 51818 41622 40698 36297 31391 23016
8921B3016l467K403J5273J3690j1319J402J2759P196K776j4924n882p63M03l707
8907C8856J425k1567m339O486J897R574j5204k1391J3193J2473N621r24o144K290
8893B2246K882R015l297k567J1032q449j48L516J481K232J099n362n800L715J137
8878C2732K730o427j120l015j4879j1235O677K1356l643r325J4790O687j0423
8865B4905j3748j4594j5474m34Q10J830R11L755P421J7699P448o206j1350J801
8851D774K012j3307k072l736J1231k448J193n191K601q299N968P412P847P085
8837A5070L405n950p45q084p102J2392K276j380p17l563m687P287P881N37Q225
8822B4845N250j7115q349P223R292O574r219m559l831l099J1725n216k384M414
$$ plain form
8921 23016 19549 21952 37225 50915 39596 40998 53757 60953 63729 48805 42923 42160 42563 38856
8907 38856 40281 18714 14375 20861 22758 32332 17128 -4263 8930 21403 27024 26100 19956 22246
8893 22246 25128 34143 30846 28279 39311 30862 30714 34230 35711 37943 39042 33680 27880 31595 32732
8878 32732 35462 29035 27915 24900 10021 -1214 5463 26819 23176 13851 28641 35328 24905
8865 24905 11157 -3437 -18911 -19345 -18535 -16705 -15794 -12039 -4618 13081 20529 14323 2973 4774
8851 4774 6786 -6521 -8593 -12329 -1098 -3546 -2353 -7544 -4943 -13242 -7274 138 7985 15070
8837 15070 18475 12525 11780 3696 -3406 8986 11262 9882 9165 5602 915 8202 16083 16620 24845
8822 24845 30095 12980 4631 11854 21146 27720 18501 13942 10111 7012 18737 13521 11137 15551
8808A5551r850M196J013O560N721j6174q455J12M573J096k683N600Q379j520l556
8793A0563M8J7834K1074K660j5686J964J8937J4731J0086q10p676m14J8318R093
8779A00722j4060j3049j5558k1879j1834j008j0786j5814k209M335J6835J392
8767A7087R958N333r27j853p103j4959K551M808N849o305j4694l952k804Q506
8753A495J4574q518l163q17L254j314p811N03N451J4023o207j2010M011k960K218
8738B729J2161P453m778m127o677q411N849Q689p069j271p558M615L115M281M845
8723A3846J742R718P589k671r234q685r440j6081J1594M495k10j446L789N480
8709A0486k614R129N361j4115j4781k031M806K491m408O023N907J0346l609k517
$$ plain form
8808 15551 5701 9897 10910 17470 23191 7017 -1438 -1326 3247 4343 1660 7260 15639 14119 10563
8793 10563 10611 28445 49519 52179 36493 38457 57394 72125 82211 81401 73725 73311 91629 100722
8779 100722 86662 73613 58055 36176 24342 23334 12548 -3266 -5475 -1140 15695 17087
8767 17087 27045 32378 31451 29598 22495 7536 10087 14895 20744 14439 -255 -4207 -7011 1495
8753 1495 16069 7551 4388 3571 6825 5511 -2300 -1797 3654 17677 11470 -540 3471 511 2729
8738 2729 14890 22343 17565 13438 6761 -1650 4199 12888 5819 4548 -3010 1605 4720 9001 13846
8723 13846 15588 25306 32895 30224 20990 12305 2865 -13216 -1622 2873 2663 1217 5006 10486
8709 10486 7872 17001 22362 8247 -6534 -8565 -3759 -1268 -5676 347 6254 16600 12991 10474
8695A0474j4143p559N358M905k326R47J0691J6944M724J536l153r306o685p091
8681E316j8204L066R127n106q161K938k761j838O377l492l489J6448o783o475
8667a3037m157M482J1297j631j3919L315r220L867j884P728O348p94o518k388
8653a6511M280N932n621n051k327M503J1831Q784p395p096Q551Q29j195N53p903
8638g836p251n429p339n121L688p807O254Q287O813j0291N905P773J2410O3j2748
8623a2629m730p35J4920J3371p631j1081N563R201J0656j981k705K15N613m622
8609A3425o212R75l925j9155K469J4536O058j3183l953P511K347l944q941m055
8595a6047K107J670K410M962M02M317K99q196j801K587J2677r221m7Q4M80J841
$$ plain form
8695 10474 -3669 -11228 -5870 -965 -3291 -2344 8347 25291 30015 31551 28398 19092 12407 5316
8681 5316 -12888 -9822 -695 -5801 -13962 -11024 -13785 -15623 -9246 -12738 -16227 221 -6562 -13037
8667 -13037 -17194 -12712 -1415 -3046 -16965 -13650 -22870 -19003 -20887 -13159 -6811 -7605 -14123 -16511
8653 -16511 -12231 -6299 -11920 -16971 -19298 -14795 -2964 5820 -1575 -8671 -120 709 -486 67 -7836
8638 -7836 -15087 -20516 -27855 -32976 -29288 -37095 -30841 -22554 -15741 -26032 -20127 -12354 56 119 -12629
8623 -12629 -17359 -18094 -3174 10197 2566 -8515 -2952 6249 16905 14924 12219 12434 18047 13425
8609 13425 7213 8188 4263 -14892 -12423 2113 8171 -5012 -8965 -1454 893 -3051 -11992 -16047
8595 -16047 -13940 -12270 -9860 -4898 -4496 -179 120 -8076 -9877 -7290 5387 -3834 -3881 -3797 -3317 -1476
8579a476J3880l27J3784J244n921K203k901j7388k66n726J2903L816j1805j4040
8565a2020L369Q322l13j2749n866J845Q271K638j584P420J309l962R147J3424
8551A9251N003l459j1819j7908K637J4543K478N006k335K754K479n854N731j256
8537A7251o032L24l184J097j3940M489K022L639k315M859p165j723r13L13k114
8522c392K985J4602P281j0995K120k867n205q900m279K789o623o868l767J2791
8508a0328K432N233J7162P976l559j006j2926o711J3799R930j242K67q885j0663
8494A479J730J705o122o03o28l592j1585m016j2420Q678J9175J0980j893j90m259
8479a561l064j669O26J3134J3112r974q66j318J2725J6541Q263M198R942J4478
$$ plain form
8579 -1476 12404 12077 25861 27105 21184 23387 20486 3098 2832 -2894 10009 13825 2020 -12020
8565 -12020 -8651 -329 -642 -13391 -19257 -17412 -9141 -6503 -8087 -667 642 -3320 5827 19251
8551 19251 24254 20795 8976 -8932 -6295 8248 10726 15732 13397 16151 18630 12776 18507 17251
8537 17251 11219 11543 8359 9456 -4484 5 2027 5666 3351 8210 1045 -678 -1591 -1278 -3392
8522 -3392 -407 14195 21476 10481 12601 9734 4529 -4371 -8650 -5861 -12484 -19352 -23119 -10328
8508 -10328 -7896 -2663 14499 22475 18916 17910 4984 -1727 12072 22002 20760 21027 12142 1479
8494 1479 3209 4914 -1208 -1811 -2439 -6031 -17616 -21632 -34052 -25374 -6199 4781 2888 2698 -1561
8479 -1561 -4625 -6294 -5668 7466 20578 10604 9738 8420 21145 37686 45949 50147 60089 74567
8465G4567J3435R225j1631L64j5134k0221j4649m486j2320r459J4282Q998k739
8452C0232n997j0276L742P87o650r22j1265J976n613Q211k389k105m911l98J0254
8437D676M252l869Q741J0559m483q947M50N398N30P30j523l435P321k315N410
8422B3495J6486K3588M2571L7242P478J8502K8546J6629L444k9416n5428l9832
8410I3305k1834k6505m117M601m93n556M682m612m4K895n929K106j0663L442R741
8395D1019m098m811m949l796j3398o578J2860M206J0541N15l214r168K312K432
8381B3873N485j056j1181N119P654J0489L072K977O516K2652K339J3815J9423
8368A11177J2062K0923M6689L3526R724N331R820K3342L0035O825j1707l7116
$$ plain form
8465 74567 88002 97227 85596 85960 70826 50605 35956 31470 19150 9691 23973 32971 30232
8452 30232 24235 13959 17701 18488 11838 10916 -349 1627 -3986 4225 1836 -269 -5180 -5578 4676
8437 4676 8928 5059 13800 24359 19876 10929 11379 16777 17307 18037 16514 13079 20400 18085 23495
8422 23495 39981 63569 106140 143382 150860 169362 197908 214537 217981 188565 133137 93305
8410 93305 71471 44966 40849 45450 44957 39401 44083 39471 39427 42322 36393 38499 27836 31278 41019
8395 41019 36921 32110 27161 23365 9967 3389 16249 20455 30996 31511 28297 19129 21441 23873
8381 23873 29358 28302 17121 22240 29894 40383 43455 46432 52948 75600 77939 91754 111177
8368 111177 123239 144162 190851 224377 234101 239432 249252 272594 302629 309454 297747 260631
8356B60631o5426n0919l3869k2470j909j2880k3311o396O435J4470K651M918j5303
8343E6622j8170j233m558l533k656J5380O408m580M955m586K6j010O561n296r845
8328C4485J3838N153q248n570J564j06J4047N681J0661L1314M8636P7066P0495
8315B99016O2272M0240N2360P5054O2240j8626j04589j27773r7299n5116m0511
8304A47268j4368n747j4909k2430r624j1771q838m710n692m201l757j2605J2840
8291D1456J307q087J087P938n631L248O633j8113p710p605J1601L850j1560K097
8277B0511N691J168J1675J4333L629R104J9922K2316J7947J6331L9035L5133L1401
8264B48196J7350Q623k4574m1786m2324l9006l5802r420k0729j4395J2292l382
$$ plain form
8356 260631 195205 144286 110417 87947 86038 73158 49847 43451 49886 64356 67007 71925 56622
8343 56622 38452 37219 32661 29128 26472 41852 48260 43680 48635 44049 44075 43065 49626 44330 34485
8328 34485 48323 53476 45228 39658 41222 41116 55163 60844 71505 102819 151455 228521 299016
8315 299016 361288 401528 453888 528942 591182 572556 467967 340194 242895 187779 147268
8304 147268 132900 127153 112244 89814 80190 68419 59581 54871 49179 44978 41221 28616 41456
8291 41456 42763 34676 35763 43701 38070 41318 47951 29838 22128 14523 26124 29974 18414 20511
8277 20511 26202 27370 39045 53378 57007 66111 86033 108349 126296 142627 181662 216795 248196
8264 248196 265546 274169 249595 207809 165485 126479 90677 81257 60528 46133 58425 55043
8252E5043j4359l367j1277o649R524k904l348M534Q360m203m509J1010l330j3686
8238B0839j7824K856R463K720j4956j4427L57J4082Q389L364k481j7147l53J3829
8224H711Q283M17j0800j4767M77m453m692M701K739o626j1154M356j794L302Q811
8209a2489J1376J2227K87l815q377O27L943j36k084j0063O43Q947J3079j076m752
8194H337K172p22j1667J366p39Q249R27N097q544q523r264J868M292j2204N480
8179a3875k949j335R869Q318N723m008l589l294n655k106Q80j2772j0056J221
8165c3628Q243J2152N476J834L312K371Q67L633o880l781K335r157n686K079R676
8150g154J0728j905M116O63M685q52p171j8530m628j1287j113J2854m336r416
$$ plain form
8252 55043 40684 37317 26040 19391 28915 26011 22663 27197 35557 31354 26845 37855 34525 20839
8238 20839 3015 5871 15334 18054 3098 -11329 -10972 3110 11499 14863 12382 -4765 -5118 8711
8224 8711 16994 17411 6611 -8156 -7679 -12132 -16824 -12123 -9384 -16010 -27164 -22808 -24602 -21300 -12489
8209 -12489 -1113 11114 11401 7586 -791 -164 3779 3643 1559 -8504 -7861 1086 14165 13089 8337
8194 8337 10509 9787 -1880 -514 -1253 6996 7923 13020 4476 -4047 -13311 -11443 -7151 -19355 -13875
8179 -13875 -16824 -18159 -8290 28 5751 1743 -1846 -5140 -10795 -12901 -12021 -24793 -34849 -33628
8165 -33628 -25385 -13233 -7757 -5923 -2611 -240 627 4260 -2620 -6401 -4066 -13223 -18909 -16830 -7154
8150 -7154 3574 1669 5785 6448 11133 10281 3110 -15420 -20048 -31335 -32448 -19594 -23930 -33346
8136c3346j751R432J4791L835m539l204j2978q99J7857R019J0134R164j495j3039
8122B981m79j1880j0155j881J4413J181j3356O956P093K538L410o531J127M673
8108I0Q476k945l958q483n322m652l852k347K618J5782j0024q440R082J984j2611
8093b4602Q428J6645l954m765j2418k92o725l870N590Q753L59j0426M602K334
8079b0341k221J932j1816N918P160J1957k895o796Q715P343O416P98j3188n187
8065a2205j1783O259Q334o479N188J1529j3333N546j95n844R016q205q716m879
8051b5767J1805J1861Q001j5698j614J6346l704q015m722l042k090J1036N038
8038e65j0927L837O290R049n198j2279J2559M887K46k202j2183k898J62n147P308
$$ plain form
8136 -33346 -35097 -25665 -10874 -7039 -11578 -14782 -27760 -28659 -10802 -1783 8351 17515 16020 2981
8122 2981 2502 -9378 -19533 -21414 -7001 -5820 -19176 -12220 -5127 -2589 821 -5710 -4583 90
8108 90 8566 5621 1663 -6820 -12142 -16794 -20646 -22993 -20375 -4593 -14617 -23057 -13975 -11991 -24602
8093 -24602 -16174 471 -3483 -8248 -20666 -20958 -27683 -31553 -25963 -17210 -16851 -27277 -22675 -20341
8079 -20341 -22562 -20630 -32446 -26528 -19368 -7411 -10306 -17102 -8387 -1044 5372 6170 -7018 -12205
8065 -12205 -23988 -17729 -9395 -15874 -10686 843 -12490 -6944 -7139 -12983 -3967 -12172 -20888 -25767
8051 -25767 -13962 -2101 5900 -9798 -11412 4934 1230 -6785 -11507 -14549 -16639 -5603 -565
8038 -565 -11492 -7655 -1365 7684 2486 -9793 2766 7653 7899 5697 -6486 -9384 -9222 -14369 -7061
8023g061K410j19j4848J330N570k84j3089q276J9397K2373o277n649Q045N762
8009I284j6033n038J314P23R661o08l946j5336l555J71L346J0472R984Q18L742
7994D999m111K297L076p781k659J104O499p481j1810l129J147M558J7107J1309
7980A5125q423r549J053l398J753L834l872J3352m44J269K851q717n535n55l207
7965d463N35N447q31P49k772k755J117J3366k827Q6O682j2141k765M300L721r155
7949a706p465k289m005l94P809J0911O335l018j3160P555P78k93P532K599j180
7934A0009n98n879o992O012O517O47R929j168j0034n690o87j7976k1918m775Q920
7919c3683L594j431m830k880J7072O705J863M387J488k63M017k174j104r099O044
$$ plain form
8023 -7061 -4651 -4770 -19618 -18288 -12718 -13002 -26091 -34367 -14970 7403 1126 -4523 3522 9284
8009 9284 -6749 -11787 -10473 -9750 -89 -697 -4643 -19979 -23534 -23363 -20017 -9545 439 1257 4999
7994 4999 888 3185 6261 -1520 -4179 -3075 3424 -4057 -15867 -18996 -17849 -13291 3816 15125
7980 15125 6702 -2847 -1794 -5192 -3439 395 -3477 9875 9431 10700 13551 4834 -701 -1256 -4463
7965 -4463 -3928 1519 688 1437 -1335 -4090 -2973 10393 7566 7652 14334 2193 -572 3728 7449 -1706
7949 -1706 -9171 -11460 -15465 -15859 -8050 2861 9196 6178 -6982 573 1351 1058 8590 11189 10009
7934 10009 9411 3532 -3460 2552 9069 9716 19645 18477 8443 2753 2066 -15910 -37828 -42603 -33683
7919 -33683 -30089 -31520 -36350 -39230 -22158 -15453 -13590 -9203 -7715 -7978 -3961 -6135 -7239 -16338 -10294
7904a0294K30N009K0708j0453k2908K821N935P815P476q292j7928j3951p153L577
7890c7408K9799J8223n293q755j4048j1329K568j760o61N05p490J3695Q427m803
7876a8330N24M711j3311l342P858Q320Q344j2252p136O906J4929N701q606k2969
7862b8653O914L272J1115J0674j818m262J0734j1906j218P570q739m645J0172
7849g90l680q640k118Q638j730J456J0941l791n569p023P209J066O053M877M95
7834G394r96R672j2216j5083j239p697O757P200o944J0129m926j0582n38J2684
7820f385n593m562j149j1684m199K56J076J5670J6132L750J722n56k319j6830
7806a4671m79O7L905l260N335L673j622L864k99r258j736j608k410j791o491p196
$$ plain form
7904 -10294 -10064 -5055 15653 5200 -17708 -14887 -8952 -1137 6339 -1953 -19881 -33832 -40985 -37408
7890 -37408 -7609 10614 5321 -3434 -17482 -28811 -26243 -28003 -28664 -28159 -35649 -21954 -13527 -18330
7876 -18330 -17806 -13095 -26406 -29748 -21890 -13570 -5226 -17478 -24614 -17708 -2779 2922 -5684 -28653
7862 -28653 -21739 -18467 -7352 3322 1504 -2758 7976 -3930 -5148 2422 -6317 -10962 -790
7849 -790 -4470 -13110 -15228 -6590 -8320 -6864 4077 286 -5283 -12306 -5097 -4031 2022 6899 7394
7834 7394 6398 16070 3854 -11229 -12468 -20165 -13408 -6208 -13152 -3023 -7949 -18531 -19069 -6385
7820 -6385 -11978 -16540 -17689 -29373 -33572 -33316 -32240 -16570 -438 3312 5034 4478 2159 -14671
7806 -14671 -15150 -15083 -11178 -14438 -9103 -5430 -7052 -3188 -3487 -12745 -14481 -16089 -18499 -20290 -26781 -33977
7790c3977J1705L648O478m952L879J1259j2265j768J0185k048Q72K923Q69j7500
7776b0692j3487Q407m05J2404l443L045P588j946j1739j2759k641J4376N608M516
7762a1168P975N355j6169p698J0932J6136j930J800L200l148j8056n739q05n426
7748b4741Q106k11l274M483M541oJ3288k166n5Q237P410J774j4512l650l153r205
7732a3134R68l436r603J477j7149j1406J1523K2344J2234N13J0959k043N533p494
7718A286J226J253p01k0109o498r818N910K237o028K40L032R360j633j1365J471
7703c0137P734N281J0500R679m609r229j5255N225L143N259J906k148j138k443
7689a6232r862j4365k3o87J1610N802m741J2636j868j5708p83N858J5847L432
$$ plain form
7790 -33977 -22272 -18624 -12146 -17098 -13219 -1960 -14225 -15993 -5808 -7856 -6984 -4061 -3192 -20692
7776 -20692 -34179 -25772 -26177 -13773 -17216 -14171 -6583 -8529 -20268 -33027 -35668 -21292 -15684 -11168
7762 -11168 -3193 2162 -14007 -21705 -10773 5363 3433 5233 8433 5285 -12771 -18510 -19315 -24741
7748 -24741 -16635 -16846 -20120 -15637 -11096 -11102 2186 20 -35 8202 15612 17386 2874 -776 -3929 -13134
7732 -13134 -12166 -15602 -25205 -23728 -40877 -52283 -40760 -18416 -6182 -5669 5290 3247 8780 1286
7718 1286 2512 3765 3064 -17045 -23543 -33361 -27451 -25214 -31242 -31002 -27970 -18610 -20243 -31608 -30137
7703 -30137 -22403 -17122 -6622 3057 -1552 -10781 -26036 -20811 -17668 -12409 -10503 -12651 -13789 -16232
7689 -16232 -26094 -40459 -40482 -41169 -29559 -23757 -28498 -15862 -17730 -33438 -34221 -28363 -12516 -9084
7675i084j1581l946O580L537r10m482Q931K26L996p317n498R113j0412r054j3091
7660d2992q227P436J6982J7186J5180j1726m257J3112J2933n607j8284j1997O327
7647a3934J6694k60r59N950p743j0661m495O210N522P073n129j3743N110l825
7633a4190M424m373P305J8166O789m932j2314p041m637n275N566k427J4590J119
7619B770l866j2629j4035M918J8558M736Q726l856K324l085O35J661m39n236p150
7604e968J838P164J2526o701j0460l959L604O183M42M273l299J02O510j4214k7164
7589b9123L694J3399k062r19J366O721K38j5128L69J2129k026M263R19o421K464
7574a0117N155N036j102k681q54k281j388p788o492J4812j666o365p23J4465l087
$$ plain form
7675 -9084 -20665 -24611 -18031 -14494 -15404 -19886 -10955 -10729 -6733 -14050 -19548 -10435 -20847 -29901 -42992
7660 -42992 -51219 -43783 -26801 -9615 5565 -6161 -10418 2694 15627 10020 -8264 -20261 -13934
7647 -13934 2760 2500 1541 7491 -252 -10913 -15408 -9198 -3676 3397 -1732 -15475 -10365 -14190
7633 -14190 -9766 -14139 -6834 11332 18121 13189 875 -6166 -10803 -16078 -10512 -12939 1651 2770
7619 2770 -1096 -13725 -27760 -22842 -4284 452 9178 5322 7646 4561 5196 6857 6418 1182 -5968
7604 -5968 -4130 3034 15560 8859 -1601 -5560 -1956 4227 4669 8942 5643 5745 12255 -1959 -29123
7589 -29123 -25429 -12030 -14092 -15011 -13645 -6924 -6686 -21814 -21445 -9316 -11342 -7079 -6160 -12581 -10117
7574 -10117 -4962 74 -1028 -3709 -4563 -6844 -8232 -16020 -22512 -7700 -9366 -15731 -16454 -1989 -5076
7559e076j2429k648N950j67K064q384p635K026J0779Q12k893k481O031R977q060
7544a2134j1042J109K899q553L64L530K5753J0889m456r224J576N626k674o274
7530b611M540n744n225j3030R152J3818k580j902j8073l51j257p040O915J6165
7516g223J2688J574J2988m695j9051j4864m832n651p30J1875J7414N586l387N80
7502B272Q274j573j8127j103r59l645m71O770j5660n096j931J1850P054P190J3261
7487H106k0802j2737j342K94M300q940J556J157m308m28J0377P751N649k175j1833
7472b3375N76J0606K172l400K116O444K161m59N257M771J703j5783j460P993o909
7457g587K798P469R90j530P029o533n869j2939O54N736R791J3126j3429j1820
$$ plain form
7559 -5076 -17505 -20153 -14203 -14370 -12306 -20690 -28325 -26299 -15520 -14708 -17601 -20082 -14051 -4074 -12134
7544 -12134 -23176 -22067 -19168 -27721 -27357 -23827 1926 12815 8359 -865 711 6337 3663 -2611
7530 -2611 1929 -3815 -9040 -22070 -12918 900 -1680 -3582 -21655 -22006 -23263 -30303 -23388 -7223
7516 -7223 5465 7039 20027 15332 -3719 -18583 -23415 -29066 -29796 -17921 -507 5079 1692 2272
7502 2272 10546 8973 -9154 -10257 -11216 -14861 -15332 -8562 -24222 -29318 -31249 -19399 -12345 -5155 8106
7487 8106 -12696 -25433 -26775 -26481 -22181 -31121 -29565 -28408 -32716 -33144 -22767 -15016 -9367 -11542 -23375
7472 -23375 -22799 -12193 -10021 -13421 -11305 -4861 -2700 -3159 2098 6869 8572 -7211 -8671 -678 -7587
7457 -7587 -4789 2680 3670 2140 9169 2636 -3233 -16172 -15518 -9782 9 13135 -294 -12114
7443a2114j1115J795o82k052p120N215J3245L67j2933Q310L526p661j0694P482
7429b4431Q895J7216j675l720O626J081m015m161L094K0673M967j6336j2544R242
7415D912P817J001p753p500N266n911O680N876K481k6100j4996K190L883l529
7401b5683J536L939j0162j061O121n553O429J2961N090K339R79J12j2655r535
7387b5143J957m398j2681l957J5814n508M77J1851N967O455L580J0582o459j6896
7373a8359j146M343J3998J0258j2861n792L776k326O82n989k189J5889k672K959
7359E71M8l321O608L931N792J1734j5156M129j4276j0761M25o799L31P052q64
7344a0556O462o2o087l108k742n269j2730K918J7817n839Q428J032k989P338J3915
$$ plain form
7443 -12114 -23229 -21434 -22116 -24168 -31288 -26073 -12828 -12461 -25394 -17084 -13558 -21219 -31913 -24431
7429 -24431 -15536 1680 5 -3715 2911 3992 -23 -4184 -1090 19583 24550 8214 -4330 4912
7415 4912 12729 13730 5977 -1523 3743 -2168 4512 10388 12869 -13231 -28227 -26037 -22154 -25683
7401 -25683 -24147 -20208 -30370 -31431 -25310 -30863 -24434 -11473 -6383 -4044 -3065 -2953 -15608 -25143
7387 -25143 -23186 -27584 -40265 -44222 -28408 -33916 -33439 -21588 -15621 -9166 -5586 4996 -1463 -18359
7373 -18359 -19505 -15162 -1164 9094 -3767 -9559 -5783 -8109 -7427 -13416 -15605 284 -2388 571
7359 571 619 -2702 3906 7837 13629 25363 10207 14336 60 -10701 -10276 -17075 -16744 -9692 -10556
7344 -10556 -4094 -4156 -10243 -13351 -16093 -21362 -34092 -31174 -13357 -19196 -10768 -9736 -12725 -5387 8528
7329H528p319m039M789J453j147J4996O671r293j0565n394j1262Q678O180q101
7315e825j3754R015L298k958R535j8k06o364L833R538Q477j3839k2268k741L410
7300b0867L739r386j4318J4321J1737J096J0875j844p689K686n19n949k494Q71
7286a7741J1484K068j2119j1515k678M01j483o090K0589R564P738R027P908k495
7272A4658j3683L784R186N02j808J091l019p395j0619j1953k346J5366m405R37
7258i704l094R509M640j426j4651j3454j6181L227J5641J3445J372j4093o692
7245c1461M657l52l695J3884J3655j246Q146L58j5980j6454P88k67Q03K378J2538
7230a2248j773n993r732k699K162J2481P162Q043Q529l569j747J889j048L014
$$ plain form
7329 8528 1209 -2830 1959 3412 2265 17261 23932 14639 4074 -1320 -12582 -3904 2276 -5825
7315 -5825 -19579 -10564 -7266 -10224 -689 -707 -913 -7277 -3444 6094 14571 732 -21536 -24277 -20867
7300 -20867 -17128 -26514 -40832 -26511 -14774 -13678 -2803 -4647 -12336 -9650 -10169 -16118 -18612 -17741
7286 -17741 -6257 -4189 -16308 -27823 -30501 -30100 -31583 -37673 -17084 -7520 218 9245 17153 14658
7272 14658 975 4759 13945 14447 12639 13730 10711 3316 -7303 -19256 -21602 -6236 -10641 -9704
7258 -9704 -12798 -3289 1351 -75 -14726 -28180 -44361 -41134 -25493 -12048 -10676 -24769 -31461
7245 -31461 -26804 -27156 -30851 -16967 -3312 -4558 3588 3946 -12034 -28488 -27700 -27967 -27164 -24786 -12248
7230 -12248 -14021 -20014 -29746 -32445 -30283 -17802 -10640 -2597 5932 2363 616 2505 1457 4471
7216D471l915J754m269j1406j676L957m691l911J160M631M188r778P170K916J418
7201g981R601j0870o76m063k12p79m81j0944l432J4529K84j2625j067j258j029
7186c1003J0179R95P095P196n081j3813r19O94j7718k060J7492K0062J2700N603
7172A1422j9567j2379l090J1289J7749k784j441L609l226Q261P726l546L269r635
7158G657n175P568M371j9984m707O767J953o011p691o612K551N275N957J2872
7144D791J905j3948j0278Q562j714k47j546K575o269j2462K942P902J328j5846
7130c2305L751P305j875R753J436n764j37R254M11j9171n350O882M021l052Q278
7115a6563O022N406P615n446N657P120k4442j3238k303J0209O475p510k1497Q091
$$ plain form
7216 4471 556 2310 -1959 -13365 -15041 -11084 -15775 -19686 -18526 -13895 -9707 -19485 -12315 -9399 -7981
7201 -7981 1620 -9250 -9926 -13989 -14201 -14980 -15461 -26405 -29837 -15308 -15024 -27649 -28716 -29974 -31003
7186 -31003 -20824 -19829 -12734 -5538 -10619 -24432 -25351 -24657 -42375 -44435 -26943 -6881 5819 11422
7172 11422 -8145 -20524 -23614 -12325 5424 2640 1199 4808 1582 9843 17569 14023 17292 7657
7158 7657 2482 10050 14421 -5563 -10270 -3503 -1550 -7561 -15252 -21864 -19313 -14038 -8081 4791
7144 4791 6696 -7252 -17530 -8968 -10682 -10929 -12475 -9900 -16169 -28631 -25689 -17787 -16459 -32305
7130 -32305 -28554 -21249 -23124 -13371 -11935 -17699 -17836 -8582 -8171 -27342 -32692 -25810 -21789 -24841 -16563
7115 -16563 -10541 -5135 2480 -2966 2691 9811 -14631 -27869 -30172 -19963 -13488 -20998 -42495 -34404
7101c4404M356P215J3848J0590O330j858l711L011l425o50j3155j5164m481o39
7087c2137Q53M145J9456Q401L1L140j5266p680q621J0574J2931Q234l238k3008
7073b2185J214o798l95R265J5147J1151q239k3467l833J1628K209j4471j163L364
7059b6573J6482k85L172j45q062o28K38J4806N303J0189K806k4207p08R843P107
7044I338j4119j873O027L71j1867J013m49P751n728j7460J3392K0952o350j6212
7030a5214J237j471O815j2610K633Q508m94k882r946m160l439K081J4796J0239
7016c907L196j910q601O594p462N548o798N316R541m223j2679R399J3213N574
7002A2801J412j8639r622N317o028O13J0755J05J961N265n594p490j9004K885
$$ plain form
7101 -34404 -30048 -22833 -8985 1605 7935 6077 2366 5377 1952 1302 -11853 -27017 -31498 -32137
7087 -32137 -31284 -27139 -7683 718 749 3889 -11377 -19057 -27678 -17104 -4173 4061 823 -22185
7073 -22185 -20971 -27769 -28164 -18899 -3752 7399 -840 -24307 -28140 -16512 -14303 -28774 -29937 -26573
7059 -26573 -10091 -10376 -7204 -7349 -15411 -16039 -15801 -995 4308 14497 17303 -6904 -7612 2231 9338
7044 9338 -4781 -6654 -627 -256 -12123 -11110 -11559 -3808 -9536 -26996 -13604 7348 998 -15214
7030 -15214 -13977 -15448 -8633 -21243 -18610 -10102 -10596 -13478 -23424 -27584 -31023 -28942 -14146 -3907
7016 -3907 -711 -2621 -11222 -4628 -12090 -6542 -13340 -8024 1517 -2706 -15385 -5986 7227 12801
7002 12801 14213 -4426 -14048 -8731 -14759 -14146 -3391 -3286 -1325 3940 -1654 -9144 -28148 -25263
6988b5263J6552L393q25k415K62j840K880J2734m544o799o162Q952P876N835L843
6973A4479p854j4003m681j435J6362p483j4786m403N809M040j0189R347P686L785
6959c326m163J670l342J1782P604q432o218M77J2616l744j486J049J634K850m771
6944D200J017j676j1991l022Q747j7552r610Q810J2243Q251l346j604J2009P181
6930A3657j1128j6454j3798J1534K1038M816N001L161k754j2067j1256r835m07
6917a8492j488J2314n370j859j79m97K393L479J0114o300j33k963m735l551R45
6902a6322m162L547N801O986o67j049n248J9408Q282r396j3735l337m64P233k161
6887e284J980l120O335p622j1595l511m439p774J2475n84O59J5937j011m565j3973
$$ plain form
6988 -25263 -8711 -5318 -6143 -8558 -8296 -10136 -7256 5478 934 -5865 -12027 -3075 4801 10636 14479
6973 14479 6625 -7378 -12059 -13494 2868 -4615 -19401 -23804 -17995 -13955 -24144 -14797 -7111 -3326
6959 -3326 -7489 -5819 -9161 2621 10225 1793 -4425 -3948 8668 4924 3438 4487 6121 8971 4200
6944 4200 5217 3541 -8450 -11472 -2725 -20277 -29887 -21077 -8834 -583 -3929 -5533 6476 13657
6930 13657 2529 -13925 -27723 -16189 4849 9665 14666 17827 15073 3006 -8250 -18085 -18492
6917 -18492 -19980 -7666 -13036 -14895 -15074 -15571 -13178 -9699 415 -5885 -6018 -8981 -13716 -17267 -16322
6902 -16322 -20484 -16937 -11136 -4150 -4817 -5866 -11114 8294 16576 7180 -6555 -9892 -10356 -3123 -5284
6887 -5284 -3304 -6424 -89 -7711 -19306 -22817 -27256 -35030 -22555 -23139 -22480 -6543 -7554 -12119 -26092
6872b6092K180J704K582l066Q929N488J8852J1359j5105j4411j0716j012K034
6859a7274Q176j1872L375k528q32J0033P212k855K163M170n374p125q57J0301
6845c287Q974P759o223p505Q573j8624J384P479K875O513l059o430n477r2q250
6830a5390l153J0501K1265p796r706p505j2627R12l786k264M217J071J2967Q489
6816b805j4406j0613O351O01O427J551p02N560J3650K345j3718j4629p807K711
6802b5484N504J0669Q383j684J50j3723N173N77j1445j3213O358J6010K587n912
6788a6050K9O848k042l996j0957p165k192M145N022J5354J0204P20K51m750O337
6773A758R91k066J441j860n662L176j1790j9371l600J5152K0057O687n915k169
$$ plain form
6872 -26092 -23912 -22208 -19626 -22692 -13763 -8275 10577 21936 6831 -7580 -18296 -19308 -17274
6859 -17274 -9098 -20970 -17595 -20123 -20955 -10922 -3710 -6565 -4402 -232 -5606 -12731 -13588 -3287
6845 -3287 5687 13446 7223 -282 8291 -10333 -8949 -1470 1405 7918 4859 -1571 -7048 -7140 -15390
6830 -15390 -18543 -8042 13223 5427 -4279 -11784 -24411 -23499 -27285 -29549 -25332 -24261 -11294 -2805
6816 -2805 -17211 -27824 -21473 -20872 -14445 -12894 -13596 -8036 5614 7959 -5759 -20388 -28195 -25484
6802 -25484 -19980 -9311 -928 -2612 -2462 -16185 -11012 -10435 -21880 -35093 -28735 -12725 -10138 -16050
6788 -16050 -16021 -9173 -11215 -15211 -26168 -33333 -35525 -31380 -26358 -11004 -800 -80 171 -4579 1758
6773 1758 2749 683 2124 264 -5398 -2222 -14012 -33383 -36983 -21831 -1774 4913 -1002 -3171
6759c171J426n765j5562J894n131j2781N351O533r98N482R861R78l402o916o707
6744b8908m95K208n617M62l548R688k57M203P060O582P189J0485M869j203j2290
6729D28j2341L871K908p083m201k169N507P843R772r827j2573L289R164o013o695
6714a8120O827N706M088N807o848q329m927j0713l836q074R825Q50R452J8226
6700f6n220J2745J9487N2j531j3155j3733k409Q839k56k685J879o775M558P086
6685H816J92j0682j5788m337J7107L513p43J0626q760j03q48k938n397o436Q372
6670g406M019j373j898j757l54O547p599n759r037n087k926J0225J6438J1087
6656E120l075l475m856o661J1980R143j0531n930Q553j9006j3P534o567j727J9637
$$ plain form
6759 -3171 -1745 -7510 -23072 -21178 -26309 -39090 -33739 -27206 -28204 -22722 -12861 -11883 -15285 -22201 -28908
6744 -28908 -29403 -27195 -32812 -32350 -35898 -26210 -26467 -22264 -15204 -8622 -1433 9052 13921 12718 428
6729 428 -11913 -8042 -5134 -12217 -16418 -18587 -13080 -5237 4535 -5292 -17865 -14576 -5412 -11425 -18120
6714 -18120 -11293 -5587 -1499 4308 -2540 -10869 -15796 -26509 -30345 -38419 -28594 -27744 -18292 -66
6700 -66 -5286 7459 26946 26998 25467 12312 -1421 -3830 5009 4753 2068 3947 -2828 1730 8816
6685 8816 9008 -1674 -17462 -21799 -4692 -1179 -1922 8704 -56 -159 -1007 -3945 -9342 -15778 -7406
6670 -7406 -3387 -4760 -6658 -8415 -8769 -2222 -9821 -15580 -24617 -29704 -32630 -22405 -5967 5120
6656 5120 2045 -1430 -6286 -12947 -967 8176 -2355 -8285 268 -18738 -18751 -11217 -17784 -19511 126
6641A26K172j0287l300K747n232K020Q787j1758K139J003q496r47O240K367j0532
6626b2951P0J0771M863J6570m929m719M71o110J1067K990P65o630L582Q761k271
6611A2300p912k931K19M112k467n91j0888k1107j1465L276l447K8253M151K1811
6597A3314k235o633R277Q00j2084k3519N117O734j3811m287N054O160Q677Q310
6583H74m285M660L820j1782j4023P637R300j662q657K972j33K049m277m177Q04
6568a6880M334o04J411K57q112J371J3778Q766n41N312p173J0666M308m572p928
6553D393p194n150j7237n296K2326Q191k76j2651J301j195J989M877k494P534
6539h82o43m476r324M143L309p825K332P775j3838j3480L627P623P380j8018M937
$$ plain form
6641 126 2298 -7989 -11289 -8542 -13774 -11754 -2967 -14725 -12586 -11583 -20079 -21026 -14786 -12419 -22951
6626 -22951 -22881 -12110 -7247 9323 4394 -325 146 -5964 5103 8093 8858 2228 5810 14571 12300
6611 12300 4388 1457 1676 5788 3321 2730 -8158 -29265 -40730 -37454 -40901 -12648 -8497 13314
6597 13314 11079 4446 13723 14523 2439 -21080 -15963 -9229 -23040 -27327 -22273 -16113 -7436 874
6583 874 -3411 1249 5069 -6713 -20736 -13099 -3799 -5461 -14118 -11146 -11279 -9230 -13507 -17684 -16880
6568 -16880 -12546 -13150 -11739 -11482 -19594 -18223 -4445 4321 3780 9092 1919 12585 16893 12321 4393
6553 4393 -2801 -7951 -25188 -30484 -8158 33 -243 -12894 -11593 -12788 -10799 -5922 -8416 -882
6539 -882 -1525 -6001 -15325 -11182 -7873 -15698 -13366 -5591 -19429 -32909 -29282 -21659 -14279 -32297 -27360
6524b7360J4509K442M955J697l141p529P840R891j1442N759Q28n837J504j906
6510g790q72R849J96r668o695k937k346J895J2335K131n625l227L452k286J6581
6495D993J2242r047j3122J697R318K871k110o856l637r445j4846o295J266R577
6481b3394M094o382J0773J7351R973J2708q517p945n643J138l865O360O318l101
6467I868n517o597m806Q7n527j594M450O07j797O561p171k574L661m229j798J975
6451a4401Q743R290q892l945k491k515r4l584p946j2823o40J4828n688O526J1830
6436a1802R878n443j0165o218J6237J427m464K526L049O402n467M373M528j0535
6422e674p734q836l565M782Q928M164j795m407j1866N232O029N580K911n638l989
$$ plain form
6524 -27360 -12851 -10409 -5454 -3757 -6898 -14427 -6587 3304 -8138 -2379 -1551 -7388 -5884 -7790
6510 -7790 -8662 1187 1383 -8285 -14980 -17917 -20263 -18368 -6033 -3902 -9527 -12754 -9302 -11588 4993
6495 4993 17235 8188 -4934 -3237 6081 8952 6842 -14 -3651 -13096 -27942 -34237 -32971 -23394
6481 -23394 -19300 -25682 -14909 2442 12415 25123 16606 8661 3018 4156 291 6651 12969 9868
6467 9868 4351 -2246 -7052 -6965 -12492 -14086 -9636 -9029 -10826 -4265 -11436 -14010 -10349 -14578 -16376 -14401
6451 -14401 -5658 3632 -5260 -9205 -11696 -14211 -14305 -17889 -25835 -38658 -39298 -24470 -30158 -23632 -11802
6436 -11802 -1924 -7367 -17532 -23750 -7513 -6086 -10550 -8024 -4975 1427 -4040 333 4861 -5674
6422 -5674 -13408 -22244 -25809 -21027 -12099 -7935 -9730 -14137 -26003 -20771 -14742 -9162 -6251 -11889 -15878
6407a5878M385N742o746r115N88L246o462r459q33J0146Q720J7047p802l111j772
6392a1304M990K75q965q894R893J5624R20k5568l532J7743N071j7691N491N718
6378a0229P99R756N174O665J488n382j610K486N048n428q967r266J385J6831J4062
6363B2812K866j1470j4695M427P305r151q890m856Q58r468r623K5377J2011O34
6349H137m983m500L859p260P198J0078O66j4343j791k316Q362O206l923j3040
6335g650J143j4311r603L348K845J2577m809j115J4810K1276L313j2569r404K943
6321B794j1948o575j180M674J401J4710L646M081O332j3970k450o389l58R93Q288
6306D049M479p61j6648m370P081k550J0758K398p940J507j116n698m119J853j1650
$$ plain form
6407 -15878 -11493 -5751 -12497 -21612 -21024 -17778 -24240 -33699 -34532 -24386 -15666 1381 -6421 -9532 -11304
6392 -11304 -6314 -6039 -15004 -23898 -14005 1619 2539 -23029 -26561 -8818 -3747 -21438 -15947 -10229
6378 -10229 -9430 326 5500 12165 13653 8271 6661 9147 14195 8767 -200 -9466 -8081 8750 22812
6363 22812 25678 14208 -487 3940 11245 2094 -6796 -11652 -10794 -20262 -29885 -4508 7503 8137
6349 8137 3154 -1346 2513 -4747 2451 12529 13195 -1148 -2939 -5255 3107 9313 5390 -7650
6335 -7650 -6507 -20818 -30421 -27073 -24228 -11651 -16460 -17575 -2765 18511 21824 9255 -149 2794
6321 2794 -9154 -15729 -16909 -12235 -10834 3876 7522 11603 17935 3965 1515 -4874 -5232 -4239 4049
6306 4049 8528 7767 -8881 -13251 -6170 -8720 2038 4436 -3504 -1997 -3113 -8811 -12930 -11077 -22727
6291b2727O979q84P499L258R517l149r359n465L732M642L547Q006O471j3139j3550
6276a4622L107L160k991N852O637p391j3721l110j80J7258J5102j0456k424N309
6262A530n844j0594K6051J1015p489q484p021j8779Q976J3687n999M851M889P912
6248A4701j0327M840L221M177O670m809j1670q439l286P491j0115j7498K511J7372
6234e161O490m871j506J308K666p140J184R706k171q475P613L978N495Q273k99
6219A7090m316j1285k435K442j556r817j0238n016K2204L05N314P113n723j3358
6205i276j520J1376N130k015M979k479j2481P68m840o433l097J2305J1649o965
6191b899J2222P697j2177p162j9412L155J9789J345p794R712J943J782l822O794
$$ plain form
6291 -22727 -15748 -16632 -9133 -5875 3642 493 -8866 -14331 -10599 -5957 -2410 5596 12067 -1072 -14622
6276 -14622 -11515 -8355 -11346 -5494 1143 -6248 -19969 -23079 -23259 -6001 9101 -1355 -3779 1530
6262 1530 -4314 -14908 11143 22158 14669 6185 -836 -19615 -10639 3048 -2951 1900 6789 14701
6248 14701 4374 9214 12435 16612 23282 18473 6803 -1636 -4922 2569 -7546 -25044 -22533 -5161
6234 -5161 1329 -3542 -5048 -3740 -1074 -8214 -7030 2676 505 -7970 -357 3621 9116 17389 17090
6219 17090 12774 1489 -946 1496 -60 -9877 -20115 -25131 -2927 -2622 2692 9805 4082 -9276
6205 -9276 -10796 580 5710 3695 8674 6195 -6286 -5518 -10358 -16791 -19888 -7583 4066 -2899
6191 -2899 9323 17020 4843 -2319 -21731 -18576 1213 2558 -5236 4476 6419 8201 4379 11173
6177A1173K331j352k67k100K2j4108j0986j1065N455Q44k334J1024N58M163O843
6162B01N278L936N389k30j8642j083n640p262N305N206N801N80L500j1758J124
6147h295P318j958Q65N122k605j1169k797P6j6333j4932J687L0098J5972J4264
6133A7313l085r437q749j0120o871l848J2577L104N156P95o836k736P72j503j871
6118a5339R940j0968m998O449M954J341m999j2687J16P324J3363N407p54K144
6104A293j0568j8464r241R960J0441R812k100r315o690n192J0952R907P01l610
6090a2114o193J815P54o467P888Q627P289n516p195L367p5R360K483k710P113
6075H426j5522Q380J5782j2552j2687K187j2164j0507O453M474q884M532J307
$$ plain form
6177 11173 13504 12152 11885 9785 9807 -4301 -15287 -26352 -20897 -20053 -22387 -11363 -10805 -6642 201
6162 201 5479 9415 14804 14574 -4068 -5151 -10791 -18053 -12748 -7542 -1741 -1161 2339 -9419 -8295
6147 -8295 -977 -2935 -2070 3052 447 -10722 -13519 -13443 -29776 -44708 -43021 -12923 3049 17313
6133 17313 14228 4791 -3958 -14078 -20949 -24797 -12220 -9116 -3960 -3165 -10001 -12737 -11965 -13468 -15339
6118 -15339 -5399 -16367 -21365 -14916 -9962 -8621 -13620 -26307 -26191 -18867 -5504 -97 -851 1293
6104 1293 -9275 -27739 -36980 -27020 -16579 -6767 -8867 -18182 -24872 -30064 -19112 -9205 -8504 -12114
6090 -12114 -18307 -16492 -15738 -22205 -14317 -5690 1599 -3917 -11112 -7745 -7820 1540 4023 1313 8426
6075 8426 -7096 1284 17066 4514 -8173 -5986 -18150 -28657 -22204 -17730 -26614 -22082 -20775
6062b0775J0330J0886q69o533l33J5271Q572j1129j0200p889P215L132R718q486
6048a090o745J3623J4643K965j299m973j152j0225k0266k820R190O077k010n715
6034i797n884Q988J4583L635k903j0696j8611J0777J4010O99k058r31k961J0533
6020I384L997j1862j0643L059j3224O114J3877J773L768L482L343m018j3093R79
6006c064M713k381j081J4899J7988j521p113j1706j1192j56K11J0967N342j9938
5992d032j8858K054L008P421J820m757O473J1166J368k1477p722Q113L771o242
5978a7894O477r708L358P039j1362k054K321K613K404l396M374Q792J1177l253
5964H88K436R867j7582r714P850J7143K2493k243j8569o001K521J2036K039j2647
$$ plain form
6062 -20775 -10445 441 -428 -6961 -7294 7977 16549 5420 -4780 -12669 -5454 -2322 7396 -1090
6048 -1090 -7835 5788 20431 23396 22097 17124 15972 5747 -14519 -17339 -8149 -2072 -4082 -9797
6034 -9797 -15681 -6693 7890 11525 8622 -2074 -20685 -9908 4102 4801 2743 1812 -1149 9384
6020 9384 13381 1519 -9124 -6065 -19289 -13175 702 2475 6243 9725 13068 9050 -4043 -3064
6006 -3064 1649 -732 -1813 13086 31074 29553 22440 10734 -458 -614 -403 10564 15906 -4032
5992 -4032 -22890 -20836 -17828 -10407 -8587 -13344 -6871 4295 5663 -15814 -23536 -15423 -11652 -17894
5978 -17894 -11417 -21125 -17767 -10728 -22090 -24144 -21823 -19210 -16806 -20202 -15828 -7036 4141 888
5964 888 3324 13191 -4391 -14105 -6255 10888 33381 31138 12569 6568 9089 21125 23164 10517
5950A0517j400L21n510O81J2181K255o238p048N586l874j4964p002Q536N559k058
5935b458q006j0380P722K077q355O946K541r23M491J0642R288j1361l171M303
5921C356Q611L433j27Q855K885o724k747l319l356j7608j3357J083p416N703K3961
5906C233J2181k612j944K317q171o02L489j5389O426O504k978j177M679k3042
5892a7086j1349K328J4451j850N163L240j0774N362O283R628m06L05l433j2244
5878a0382j1152J5384K4009r322j2690J0889j732j4892J567l737Q497R656j0890
5865d795k500n76k989O133l163M198l459j2063R356Q462k1109j0664M662J3270
5851a5237J0222N029j328p854k281J1521L032M78l22j972q12n425L872p063p097
$$ plain form
5950 10517 9117 9438 3928 4609 16790 19045 12807 5759 11345 7471 -7493 -14495 -5959 -400 -2458
5935 -2458 -10464 -20844 -13122 -11045 -19400 -12454 -9913 -10836 -6345 4297 13585 2224 -947 3356
5921 3356 11967 15400 15273 24128 27013 20289 17542 14223 10867 -6741 -20098 -19015 -26431 -20728 3233
5906 3233 15414 12802 10858 13175 5004 4402 7891 -7498 -1072 5432 2454 1277 5956 -17086
5892 -17086 -28435 -26107 -11656 -13506 -8343 -5103 -15877 -10515 -4232 5396 4990 5295 1862 -10382
5878 -10382 -21534 -6150 17859 8537 -4153 6736 5004 -9888 -8321 -12058 -3561 6095 -4795
5865 -4795 -7295 -7871 -10860 -4727 -7890 -3692 -7151 -19214 -9858 -1396 -22505 -33169 -28507 -15237
5851 -15237 -5015 14 -1314 -9168 -11449 72 3104 3582 3260 1288 476 -4949 -1077 -8140 -15237
5836a5237j791l580J2196p74q343K0754N298o307j1537M708J1754M059j6661j1384
5822a6845o130R178N700o563q086M034j472O693J1333L298J3777J934j9037L133
5808I47M842J4903o047j5089j7930J916J0548J2803p032q01m843L913P786R810
5794A5726P754j1288n481m155m222n190J252O164j2889j0242Q230N381K572k043
5780h431m475J3261J1047P260j492M816J969p427o991j6418j4055K747M792J3697
5766C00j1495j0124Q947Q252p293L425l101m806J954K51j830L195j484J957J5464
5751C612j502r27J0433R188j3527K560J157o368j654K454K51n046o394o380k784
5736a4927J174J0395P601j7427l703N706N942N139n011l702j984M712J4521J715
$$ plain form
5836 -15237 -17028 -20608 -8412 -9186 -17529 3225 8523 2216 -9321 -4613 7141 11200 -5461 -16845
5822 -16845 -22975 -13797 -8097 -14660 -22746 -18712 -20184 -13491 -2158 1140 14917 16851 -2186 947
5808 947 5789 20692 14645 -444 -18374 -16458 -5910 6893 -139 -940 -5783 -1870 5916 15726
5794 15726 23480 12192 6711 2556 -1666 -6856 -5604 560 -12329 -22571 -14341 -8960 -6388 -8431
5780 -8431 -12906 355 11402 18662 17170 21986 23955 16528 9537 -6881 -20936 -18189 -13397 300
5766 300 -11195 -21319 -12372 -4120 -11413 -7988 -11089 -15895 -13941 -13690 -15520 -12325 -13809 -11852 3612
5751 3612 2110 1183 11616 20804 7277 9837 10994 4626 2972 5426 5677 631 -5763 -12143 -14927
5736 -14927 -13753 -3358 4243 -13184 -16887 -11181 -5239 -100 -5111 -8813 -10797 -6085 8436 10151
5722A0151n187j2720m250j0344K550N299J3310j220l221j0770M648Q5j0743J2928
5708i484P227j1810R844k813K574r503m860L644L029l573q212L80J1570J0499
5694a488L764O767M408n773r003q121p507m115k51L028j55J780l677J6618L083
5679f42L659P819K962O678m559k1810k0893J824K2989L825j3947P162P79j1866
5665a6020j3270Q31J0175J6776Q784L907o321m273j349J876j85J1683J0756j0046
5651A3324O179j0795k604M549K214m088m710l92J296p123m952R492J361j40l120
5636D91R927K880j897o690j3213M766k312n678m640j789p911l515J547M529J160
5621b2345l234K665J4173K184k791k35N187Q704q228k1422L008L0487Q151k2498
$$ plain form
5722 10151 4964 -7756 -12006 -22350 -19800 -14501 -1191 -2411 -5632 -16402 -11754 -11669 -22412 -9484
5708 -9484 -2257 -14067 -4223 -7036 -4462 -13965 -18825 -15181 -12152 -15725 -23937 -23557 -11987 -1488
5694 -1488 2276 9043 13451 7678 -1325 -9446 -16953 -21068 -21319 -18291 -18446 -16666 -20343 -3725 -642
5679 -642 3017 10836 13798 20476 15917 -5893 -26786 -24962 -1973 1852 -12095 -4933 -4154 -16020
5665 -16020 -29290 -28459 -18284 -1508 7276 11183 4862 589 -760 1116 931 12614 23370 13324
5651 13324 19503 8708 6104 10653 12867 8779 4069 3677 4973 -2150 -7102 2390 3751 3611 491
5636 491 10418 13298 11401 4711 -8502 -3736 -6048 -11726 -16366 -18155 -26066 -29581 -28034 -23505 -22345
5621 -22345 -25579 -22914 -8741 -6557 -9348 -9583 -4396 4308 -3920 -25342 -22334 8153 16304 -6194
5607f194j2272l650J3274J7540P411N498M786m710j5786l01K291j4222m937J7266
5593E994K288j0325r133M246Q87o27O33J0395L592k188R582J2745K072k6667j8474
5578a4980q63M565J159J669J2702R184j0174K083j272j569K892k61j2028J1130
5564D237L93j6542K175J4393l592n108L590M331j8617n266n413M058K6636R234
5550A4509p727q826j0713N169p252k688K574k823K1992M347m410R079m360k58
5536H613o106j339L318o33k051l738l779Q140j965j5101L489N573N539p209n134
5521a2383j347k398K316N014O923o617k876R830M215j1797j5301n543L613J4331
5507a2020J0145j2237J385O343P58n771k39O323Q239L223n915j900P34p85m452
$$ plain form
5607 -6194 -18466 -22116 -8842 8698 16109 21607 26393 21683 5897 5596 7887 -6335 -11272 5994
5593 5994 8282 -2043 -11176 -6930 -6043 -6670 -6037 4358 7950 5762 15344 28089 30161 3494 -14980
5578 -14980 -15843 -11278 -10119 -8450 4252 13436 3262 5345 4073 2504 5396 5135 -6893 4237
5564 4237 4630 -11912 -9737 4656 1064 -4044 -454 3877 -14740 -20006 -25419 -21361 5275 14509
5550 14509 6782 -2044 -12757 -7588 -14840 -17528 -14954 -17777 4215 8562 4152 13231 8871 8613
5536 8613 2507 1168 4486 3853 1802 -1936 -5715 2425 460 -14641 -11152 -5579 -40 -7249 -12383
5521 -12383 -13730 -16128 -13812 -8798 -1875 -8492 -11368 -1538 2677 -9120 -24421 -29964 -26351 -12020
5507 -12020 -1875 -14112 -12727 -6384 -5626 -11397 -11636 -5313 2926 6149 234 -1666 -932 -1717 -6169
5492f169N031k467M875J3917J33j2632m637M22J338J205P304p635j5861J55J519
5477a3502K126J0076Q609r461j5171k333o511j1598J1131K3795J3509j0285j0225
5464i840m267J9065p450o63K0358N058l0310k6386P747O988q358R996M421l644
5450a7285o39M898Q423k610k5005m177J1800J5357R877m129n642J2556J4617Q106
5436B6147j6262j9517j019J1669K035R747N760P20j1559j2939L852O154j2670
5423g882j6335Q344R931j240o106n84q850q039l646Q887J0951J9182O846n317
5409F142n14K336j2306K696k164J852L641L481P732l545j1728K147N157k028j1314
5394h415k566r8K183n72J7723K965m284J824o48q443o302r143J0538J8036J6215
$$ plain form
5492 -6169 -1138 -3605 1270 15187 15320 2688 -1949 -1527 -189 1016 8320 685 -15176 -15021 -13502
5477 -13502 -11376 -1300 7309 -2152 -17323 -19656 -26167 -37765 -26634 -2839 10670 385 -9840
5464 -9840 -14107 4958 -2492 -3155 17203 22261 -8049 -34435 -26688 -19700 -28058 -18062 -13641 -17285
5450 -17285 -17924 -13026 -4603 -7213 -32218 -36395 -24595 -9238 639 -3490 -9132 3424 18041 26147
5436 26147 9885 -9632 -10651 1018 3053 12800 18560 19280 7721 -5218 -1366 4788 -7882
5423 -7882 -24217 -15873 -5942 -7182 -13288 -13872 -22722 -30761 -34407 -25520 -14569 4613 11459 6142
5409 6142 5628 7964 -4342 -1646 -3810 -1958 1683 5164 12896 9351 -2377 -230 4927 2899 -8415
5394 -8415 -10981 -11079 -8896 -9468 8255 11220 6936 8760 8112 -331 -6633 -15776 -5238 12798 29013
5379B9013l792p607j2669k399m535p354M120N882L346P395J2993k946j9254j2860
5365a0667J9325J5038j562q554l642L72j154m061m88L993k768J444M345n574k692
5350C355q046p334m865o00R240J4850J71j5493N613k825q106M858P32P274K930
5335A754O905l322K621N957L469K391J157j0693j3416K463l401P893J484j623
5321C639n24j5351j0102Q924K975j505j324L442J1630m25l967J78q933L638R84
5306f721r87N074J293j1168p425R680J1062K703j5792m353l259m887J1345Q370
5292e065J3969M885j0028K582o487M364O201L790Q835J852l674k752J3456L336
5278C5264K092L266j2442q569k2115q136P859N396J930K908R53J652k790q890
$$ plain form
5379 29013 25221 17614 4945 2546 -1989 -9343 -5223 659 4005 11400 24393 21447 2193 -10667
5365 -10667 8658 23696 22134 13580 9938 10310 9156 5095 4607 8600 5832 7276 11621 6047 3355
5350 3355 -4691 -12025 -16890 -17490 -8250 6600 6771 -8722 -3109 -5934 -14040 -9182 -8450 -1176 1754
5335 1754 8659 5337 7958 13915 17384 19775 20932 10239 -3177 -714 -4115 3778 5262 3639
5321 3639 3115 -12236 -22338 -13414 -10439 -11944 -13268 -9826 1804 1379 -2588 -2410 -11343 -7705 -6721
5306 -6721 -7708 -2634 -1341 -12509 -19934 -10254 808 3511 -12281 -16634 -19893 -24780 -13435 -5065
5292 -5065 8904 13789 3761 6343 -144 4220 10421 14211 23046 24898 21224 18472 31928 35264
5278 35264 37356 40622 28180 19611 -2504 -10640 -2781 2615 4545 7453 8406 10058 7268 -1622
5264a622n145n943P726M55K864R454M987p510M34j627l558q491M349K109l025
5249d543p931J0386J6434p551j314P647j0728k217K442m864J414Q388M970j672
5235A0861j4689P0m682j930j484l477L64O614j1325j4532J2656O679k781J1766
5221e890J622N606K677o110m452M031m189j699J3664j833r866J735N534K676N962
5206I468q727j4070Q317O759o589q47M492Q924J1039J1419m353O865k822r074
5192B0801j0673N837q3k539M351Q577o112j4732p171R09L973L135l255M259M521
5177A1798R011j98j2274R100k855K324j2881m359m527R247o12j2947j704J3414
5163B537J7800P617j047o765r028k4489l823J1035n506J7146j947K383j1415j5905
$$ plain form
5264 -1622 -6767 -12710 -4984 -4529 -1665 7789 12776 5266 5700 4073 515 -7976 -3627 -1518 -4543
5249 -4543 -12474 -2088 14346 6795 5481 13128 2400 183 2625 -2239 -825 7563 12533 10861
5235 10861 -3828 -3758 -8440 -10370 -11854 -15331 -14967 -8353 -19678 -34210 -21554 -14875 -17656 -5890
5221 -5890 -4268 1338 4015 -2095 -6547 -2516 -6705 -8404 5260 3427 -6439 -4704 830 3506 9468
5206 9468 741 -13329 -5012 1747 -4842 -5689 -1197 7727 18766 30185 25832 32697 29875 20801
5192 20801 10128 15965 15882 13343 17694 26271 20159 5427 -1744 -835 3138 6273 3018 7277 11798
5177 11798 20809 20611 8337 17437 14582 16906 4025 -334 -4861 4386 3774 -9173 -10877 2537
5163 2537 20337 27954 26907 20142 11114 -13375 -17198 -6163 -11669 5477 3530 5913 -5502 -21407
5149b1407l540J2763J1419Q677N909l378j3381K17J1575j433o243j2908K986Q875
5135A31l636R098P331j6391l288j5183j0614M872J1175J6069j527k2462n11N389
5121a9547n396J6983N151J3453P388l638m16M409j076L026l517p699P378M367
5107B0866n61j6978q404J3594J1001j0956r103J1435L946j0170j0431P536l294
5094a519j7026p281J7916J4715j644j3518r132m013l740J8755P868J7077q918
5081I540n13n639J3349Q551J40j2288j5417l402L472m754O324R852l4l134O307
5066A2354l447m894k940N004J9885p610m41j3621j2028k179n501P744O025o837
5052h486o176J811L181L158k422J4644q003P76J878M854m43k1310q790R900M127
$$ plain form
5149 -21407 -24947 -12184 -765 7912 13821 10443 -2938 -2721 8854 7421 1178 -11730 -8744 131
5135 131 -3505 5593 12924 -3467 -6755 -21938 -32552 -27680 -16505 -436 -1963 -24425 -24936 -19547
5121 -19547 -24943 -7960 -2809 10644 18032 14394 13978 18387 17311 20337 16820 9121 16499 20866
5107 20866 20305 3327 -5077 8517 19518 8562 -541 10894 14840 4670 -5761 1775 -1519
5094 -1519 -18545 -25826 -7910 6805 5161 -8357 -17489 -21502 -25242 -6487 1381 18458 9540
5081 9540 9027 3388 16737 25288 25428 13140 -2277 -5679 -2207 -6961 -637 9215 9181 6047 12354
5066 12354 8907 4013 1073 6077 25962 18352 17911 4290 -7738 -9917 -15418 -7674 -1649 -8486
5052 -8486 -14662 -12851 -9670 -6512 -8934 5710 -2293 -1517 361 5215 4772 -16538 -25328 -15428 -11301
5037a1301O411J1557j541l498J715l026n71q425Q995L481J971j768j1532J656
5023e876O443O801J4443o639k858J4252q470J631k842l315J1606O044o453K875
5009B7642j8324p548J763m306P605l754R43N485J6456R291K342n069j3844l130
4995A5552m762j1188O064R305l399o405N109L695q777J245O155m831m43j2284
4981d964l733q187r302P332J8698R075M217k2006j0985J0590k804j0693j086j715
4967b5563K673k724J4094J5050k879L860q69o463q602o303J1499J7791J6816n344
4953B3036k3676n803q985j709J152m992L201J3065QM109Q904j121q101Q717K321
4938A0126r483L585n658J1955l825L104Q865p875r167Q176M992L374L540K360
$$ plain form
5037 -11301 -4890 6667 5126 1628 3343 317 -254 -8679 316 3797 5768 4000 -7532 -5876
5023 -5876 567 7368 21811 15172 12314 26566 18096 19727 16885 13570 25176 31220 24767 27642
5009 27642 9318 1770 3533 -773 6832 3078 4021 9506 25962 35253 37595 32526 18682 15552
4995 15552 10790 -398 5666 14971 11572 5167 10276 13971 5194 6439 12594 7763 7320 -4964
4981 -4964 -8697 -16884 -26186 -18854 -156 8919 13136 -8870 -19855 -9265 -12069 -22762 -23848 -25563
4967 -25563 -22890 -25614 -11520 3530 651 4511 3642 -2821 -11423 -17726 -6227 11564 28380 23036
4953 23036 -640 -6443 -15428 -17137 -15985 -20977 -17776 -4711 -4703 -594 8310 7189 -912 7805 10126
4938 10126 643 4228 -1430 10525 6700 9804 18669 10794 1627 9803 14795 18169 21709 24069
4924B4069k190j1891j0827j6296r581J1871J3779R37J1679R631j0739q676j0291
4911h525m027J5738O492r950j750o696K908m120o121L670l797k839r83P626j494
4896a3868N654P334J957P551J2055k779n953M218J0286j5203l3587p644J7617
4883a2362J2684m542J175O098k075j794K401R785J4001n601r831j6582O34O692
4869F83P286N621N755j8596l628N996o375J4471K935k154m871k404K700o222k670
4854a473l149K1340K2619O207j7048j2940j216l310j375k030o710l766k114R599
4840D634K6417l7j4642q719l639j3323L793r406k1904j834J6121P047J118J1896
4826b478Q817r045k521n903q559Q864J2919J0158l790j9713J393Q739k405R172
$$ plain form
4924 24069 21879 9988 -839 -17135 -26716 -14845 -1066 -129 11550 21181 10442 1766 -8525
4911 -8525 -12552 3186 9678 -272 -2022 -8718 -5810 -9930 -16051 -12381 -16178 -19017 -20000 -12374 -13868
4896 -13868 -8214 -880 1077 8628 20683 17904 11951 16169 26455 11252 -22335 -29979 -12362
4883 -12362 322 -4220 -3045 3053 978 -816 1585 11370 25371 19770 9939 -6643 -6009 683
4869 683 7969 13590 19345 749 -2879 3117 -3258 11213 14148 11994 7123 4719 7419 1197 -1473
4854 -1473 -4622 16718 39337 45544 28496 15556 14340 11030 9655 7625 915 -2851 -4965 4634
4840 4634 31051 31014 16372 7653 4014 -9309 -5516 -14922 -36826 -38660 -22539 -15492 -14374 -2478
4826 -2478 6339 -2706 -5227 -11130 -19689 -10825 2094 12252 8462 -11251 -9858 -1119 -3524 5648
4812E648K148j2385n530J2853N426N342P96j3068o057M843J8826n425p465q027
4798b075K15J0924p525Q625J989L126k051q835l324q308j1628l383J6373m801
4784a0678j3949l874j950J0112J8313M831p805M409K904M573m179l177l902L527
4770h45J8363R591m085q958j6055j090N785p793J5468L516j1144j2979L998M908
4756a320J610r318l353J2137n041j138J8147j327j1243l793Q840Q634J0519r569
4742A3785k63n977J898k17k555P93k651q97J1991J4699N15j068j5064l998k480
4727H511P163N628q848m4O369K978o561P934N424n686o587q756m375M560K240
4712I950r567M325O422q98n891j815L297j6611j522R998M731M386N585J2137O731
$$ plain form
4812 5648 7796 -4589 -10119 2734 8160 13502 14298 1230 -4827 16 18842 13417 5952 -2075
4798 -2075 -1860 9064 1539 10164 12153 15279 13228 4393 1069 -7239 -18867 -22250 -5877 -10678
4784 -10678 -24627 -28501 -30451 -20339 -2026 2805 -5000 -591 2313 6886 2707 -470 -4372 -845
4770 -845 17518 27109 23024 14066 -1989 -3079 2706 -5087 10381 13897 2753 -10226 -6228 -1320
4756 -1320 290 -9028 -12381 -244 -5285 -6423 11724 10397 -846 -4639 4201 12835 23354 13785
4742 13785 13522 7545 9443 9226 6671 7464 4813 3916 15907 30606 31121 30053 14989 10991 8511
4727 8511 15674 21302 12454 12410 18779 21757 15196 23130 28554 22868 16281 7525 3150 7710 9950
4712 9950 383 4708 11130 10232 4341 2526 5823 -10788 -12310 -2312 2419 6805 12390 24527 31258
4697C1258l832j766m633m860j0910l226j0320l613J719J1164k440P2o269J8287
4683A0631N358p418o0m544O8R696j0416j0095j019R45m865O495J2053J1036r578
4668H287j5169j9225R76M332J3771P106j1453J2138M436J0557L634M8p662K698
4654A4474O871l774j6399j7048K952j819j176L951O485L279K764J693J351P998
4640A1602l147j3406L841L706p300N207K778q154j1845n187R014q459O773P098
4626g479l617J920J3620P580p042n046N615R972J110j1404J0534j2788J004K229
4612F208K130k175L386O159r445q217P608P278J310J311p674m274N454J0715R828
4597B9602L836j0429q152k587q732j0483O193l592n199j0737q20p50J2473N853
$$ plain form
4697 31258 27426 25660 21027 16167 5257 2031 -8289 -11902 -10183 981 -1459 -1387 -7656 10631
4683 10631 15989 8571 8511 3967 4035 13731 3315 -6780 -7799 -6854 -11719 -5224 6829 17865 8287
4668 8287 -6882 -26107 -25131 -20799 -7028 78 -11375 763 5199 15756 19390 19438 11776 14474
4654 14474 21345 17571 1172 -15876 -12924 -14743 -15919 -11968 -5483 -2204 560 2253 3604 11602
4640 11602 8455 -4951 -1110 2596 -4704 503 3281 -4873 -16718 -21905 -12891 -21350 -14577 -7479
4626 -7479 -11096 -9176 4444 12024 4982 -64 5551 15523 16633 5229 15763 2975 3979 6208
4612 6208 8338 6163 9549 15708 6263 -1954 5654 12932 14242 15553 7879 3605 9059 19774 29602
4597 29602 33438 23009 14857 12270 3538 -6945 -752 -4344 -9543 -20280 -21100 -21850 -9377 -3524
4583c524P93R837O946J1791J558K605j5869j4551r124j742j82j862l08J0553J599
4568a480j1874ON121P40N17o614Q039P517o491q77Q195j338j8506n493K494J668
4552a8376L038L107J1560j0262r729N003N734J807j759J1759N811J0498j5212
4539B979o198r930r613k025j481j0249o01K0802J3261m98k262L874J3125j377
4525I807j311j6022j2144R219j1878o368P794N376Q722J0946L53j7882j4809k214
4511c0411K0558K147o414j0667P116K0603J1093M628r508q4k298o020m061J368
4497a950l885N725P456N454j2063q656l203J2356R335N998j2777k182J550r562
4483f404P534J0897r271N298K523M61j1268r471n790J1454J091n800R60Q023q283
$$ plain form
4583 -3524 -2731 7106 14052 25843 27401 30006 14137 -414 -9538 -11280 -11462 -13324 -13632 -3079 -1480
4568 -1480 -13354 -13348 -8227 -7487 -6970 -13584 -5545 1972 -4519 -5396 2799 1461 -17045 -22538 -20044 -18376
4552 -18376 -15338 -12231 -671 -10933 -20662 -15659 -9925 -8118 -9877 1882 7693 18191 2979
4539 2979 -3219 -13149 -22762 -24787 -26268 -36517 -37118 -16316 -3055 -3553 -5815 -1941 11184 9807
4525 9807 8496 -7526 -19670 -10451 -22329 -28697 -20903 -15527 -6805 4141 4494 -13388 -28197 -30411
4511 -30411 -9853 -7706 -14120 -24787 -17671 2932 14025 18653 9145 9061 6763 743 -3318 -1950
4497 -1950 -5835 -110 7346 12800 737 -7919 -11122 1234 10569 16567 3790 1608 3158 -6404
4483 -6404 1130 12027 2756 8054 10577 11038 -230 -9701 -15491 -4037 -2946 -8746 -7786 237 -8046
4468h046N810L764N069j266j249j6821p078J5411Q345M34m459j2154p86J4889
4454A863q229m988J1282J5168p461L81J642o28q949n588L972Q19k653m411J6448
4439H668J1369n116k6040P17J0254j1876j4506N118M763J3474R273O634j0712
4426B020j8575n69M777N201M510J298o470N536q3N870r20j7288J912L790n178
4411a4169L752J7950P522j235O210q205j1679l55J65j3034L355K649R265j711
4397D80m114j6407N674R937j578N032N097m925J198j4750q415R219Q622p800j4127
4382b6857J2140K0740J1274n2o56l00j3164r522J2936J4778m138N21o829l777
4368G094N247J090J3148r135r260l174M371j4117p453q752j002J9554R514j155
$$ plain form
4468 -8046 -2236 1528 6597 5331 4082 -12739 -19817 -4406 3939 4373 -86 -12240 -13026 1863
4454 1863 -6366 -11354 -72 15096 7635 8016 9658 9030 81 -5507 -1535 -716 -3369 -7780 8668
4439 8668 20037 14921 -11119 -10402 -148 -12024 -26530 -21412 -16649 -3175 6098 12732 2020
4426 2020 -16555 -17124 -12347 -7146 -2636 -1338 -7808 -2272 -2355 3515 2595 -14693 -12781 -8991 -14169
4411 -14169 -10417 7533 15055 13820 20030 11825 146 -209 -44 -13078 -9723 -7074 2191 480
4397 480 -3634 -20041 -14367 -4430 -6008 -976 4121 -804 394 -14356 -22771 -13552 -4930 -12730 -26857
4382 -26857 -14717 6023 17297 17245 16589 16289 3125 -6397 6539 21317 17179 17700 10871 7094
4368 7094 12341 13431 26579 17444 8184 5010 9381 -4736 -12189 -20941 -21943 -2389 7125 5970
4354E970J3495n56k945J625K915K194o327j1161Q12k815J0809R602r510J0277
4340B4385M556m357m278o217Q938Q845j5939k82p7O634n31n127M458j8729k0313
4325a8034n154k598R817J1516M745o336l01R204J1029j2604j786k445o474K095
4311g326j168L383j879M386J021L662K4296M034j7193P460M571l298j0440J372
4297A2881j522l557J2416l18j1707j6351R401J0168J232n046J055k347p825L458
4283A938K696j0813p985L584J4631N066K299M171j092j886o052j6207l951R99
4269a2602j636L52Q016m616P823r340K0528j017n322N416n24l796l791p035j114
4254h658p65J852j827j305O279p237J0629K509m00o559j3174r21J0931N755J0560
$$ plain form
4354 5970 19465 18909 15964 17589 20504 22698 16371 5210 6022 3207 14016 23618 14108 24385
4340 24385 28941 24584 20306 14089 23027 31872 15933 15651 15574 22208 21677 16550 21008 2279 -18034
4325 -18034 -23188 -25786 -15969 -4453 292 -6044 -6345 2859 13888 1284 -502 -2947 -9421 -7326
4311 -7326 -8494 -5111 -6990 -2604 -1583 2079 26375 30409 13216 20676 25247 21949 11509 12881
4297 12881 11359 7802 20218 19900 8193 -8158 1243 11411 12643 7597 8652 6305 -1520 1938
4283 1938 4634 -6179 -14164 -10580 4051 9117 11416 15587 14495 12609 6557 -9650 -13601 -12602
4269 -12602 -14238 -13886 -5870 -10486 -2663 -12003 8525 7508 2186 7602 7078 3282 -509 -7544 -8658
4254 -8658 -9423 -7571 -9398 -10703 -4424 -11661 -1032 1477 1077 -5482 -18656 -19577 -8646 -2891 7669
4239G669k525j9356R55J0427J0675M20j3660R33K543O38j717N258J5766N015p870
4224A5171j2899p52O025j0332m408N793p46M455r488M5O347k739M185l041Q615
4209F231J0441k853Q030K86j5810m242l196o902J704J890P822k418J6082M439
4195B1504L489n08m5r768l187J0421q715J811J2592j453j323o493q567J822K439
4180A4019o075j5717p916J966J2476R681P071J708j1239J950O443p201q497L383
4166B052R146K0808J2574j247j3123j183r622J390q726j3048j107M326n38n654
4152c952n257J3815K1733Q839j6556j2198k424k142K585j0008j4867Q290L034
4139i108P206J1032k418j305P165J2839J69j3190l183j0372j2387R70r67k767
$$ plain form
4239 7669 5144 -14212 -13257 -2830 7845 8265 -5395 -4462 -1919 -1281 -2998 2260 18026 23041 15171
4224 15171 2272 1520 7545 -2787 -7195 -1402 -2148 2307 -7181 -7136 -789 -3528 657 -2384 6231
4209 6231 16672 13819 21849 22135 6325 2083 -1113 -8015 -6311 -4421 3401 983 17065 21504
4195 21504 24993 24485 24440 14672 11485 21906 13191 15002 27594 26141 24818 18325 9758 11580 14019
4180 14019 7944 -7773 -15689 -13723 -1247 8434 15505 17213 5974 7924 14367 7166 -1331 2052
4166 2052 11198 32006 44580 43333 30210 29027 19405 20795 12069 -979 -2086 2240 1702 -3952
4152 -3952 -9209 4606 26339 35178 18622 6424 4000 1858 4443 -5565 -20432 -12142 -9108
4139 -9108 -1902 9130 6712 5407 12572 25411 25580 12390 9207 -1165 -13552 -12582 -13549 -16316
4125a6316p783J6825Q486R926O754P067r45m599l35r620L238j561j4336q7M637
4110A351m739p603R537J0497o388k6225K397J5897O223r914j667J770r569j4260
4096c2693p091P510J8877J358M567J376J5938P3j0290k720R384P596j836r353
4082B696n488K41O202L222N745j708j0138n105k230J0261o942M807O756J6517
4068B4836j662j8037j2970k202L203Q473O221r98L164j1867j4641o618J662q75
4054b2311O741Q399J4395L828J087n313M680m8p953j4093q63J2022r26L675N182
4039H502p864L831J878O929j1237j2172q232J36R713R409r34R372N272j135o334
4024G134j0940o884M398n075J333L406m491k159K037J9519j457j0032l761K724
$$ plain form
4125 -16316 -24099 -7274 1212 11138 17892 24959 24014 19415 19080 9460 12698 11137 -3199 -3286 1351
4110 1351 -3388 -10991 -1454 9043 2655 -23570 -21173 -5276 947 -8967 -10634 -8864 -18433 -32693
4096 -32693 -39784 -32274 -13397 -12039 -7472 -6096 9842 9915 -375 -3095 6289 13885 12049 2696
4082 2696 -2792 -2551 3651 6873 12618 10910 772 -4333 -6563 3698 -3244 1563 8319 24836
4068 24836 23174 5137 -7833 -10035 -6832 1641 7862 6864 10028 -1839 -16480 -23098 -21436 -22311
4054 -22311 -15570 -7171 7224 11052 12139 6826 11506 11458 3505 -10588 -11451 571 -355 3320 8502
4039 8502 638 4469 6347 13276 2039 -10133 -18365 -18229 -8516 893 -41 9331 14603 13468 7134
4024 7134 -3806 -10690 -6292 -11367 -10034 -6628 -11119 -13278 -11241 8278 6821 -3211 -6972 -4248
4010d248M121J467m747j055j95K297L510M622K174o066J5162R112K999J2813o543
3995C5423r753j9391q894n154m424L189J1925J7583j212o090l865J3376j2251
3982A0462p789K786N527K358j479n933J5703J6311k0280j7432L008R743L634j1888
3968D731j8711O48J5797o035o146M17j557m234O437p633j030N129j4427M684p389
3953b9319N010O681N120p98j986n227Q787J5893m161j1582j815L699m188j685
3939a5571K1368P244j2553q748r663O81O659J346o296o593K0174J9449p36p986
3925H775n754l378N88k706J0412M123L824J959o411k1333m976J616M402n905K17
3910a4547o174o732L443J4148J6802J586o584j2039O175K1649L818j0397q611
$$ plain form
4010 -4248 -127 1340 -3407 -4462 -4657 -2360 1150 5772 7946 1880 17042 26154 29153 41966 35423
3995 35423 25670 6279 -2615 -7769 -12193 -9004 2921 20504 19292 13202 9337 22713 10462
3982 10462 2673 5459 10986 13344 11865 5932 21635 37946 17666 234 3242 12985 16619 4731
3968 4731 -13980 -13332 2465 -3570 -9716 -9299 -10856 -15090 -8653 -16286 -17316 -12187 -26614 -21930 -29319
3953 -29319 -24309 -17628 -12508 -13306 -15292 -20519 -11732 4161 0 -11582 -13397 -9698 -13886 -15571
3939 -15571 5797 13041 488 -8260 -17923 -17242 -10583 -9237 -15533 -22126 -1952 17497 16761 8775
3925 8775 3021 -357 231 -2475 7937 12060 15884 17843 11432 -9901 -14877 -13261 -8859 -14764 -14547
3910 -14547 -20721 -27453 -24010 -9862 6940 8526 1942 -10097 -3922 17727 21545 11148 2537
3897B537L303K455L959l9K680l192k067l540rR54l162l134m99M663K316J3134
3881B0359j4976j654j517q628J2338L701j4698p280j0641l548J0503R013Q077
3868A049q069Q353M370j3305j0350J689l748P55J574l028k341M881J7697O777
3854F304k113Q105j0345j8390R93O085O779Q431L920j1770l594K817N462l376
3840f92L585R450l452j7586j6017l910J6978J2362J559o026j2269l043J4088R002
3826D029j228M745j139l719j7642l014M212J1791l568j7283j0437J1669J8748
3813b836J178n535j294O56J1596p269j174p165q570M130J814R353j708j3589K23
3798b0190N290Q323P088N293q35P838N818K041p418K271k01L971O867j9065k646
$$ plain form
3897 2537 5840 8295 12254 12215 14895 11703 9636 6096 6087 7041 3879 745 246 4909 7225 20359
3881 20359 5383 3729 2212 -6416 5922 9623 -5075 -12355 -22996 -26544 -16041 -7028 1049
3868 1049 -7020 1333 5703 -7602 -17952 -16263 -20011 -19256 -17682 -20710 -23051 -18170 -473 6304
3854 6304 4191 12296 1951 -16439 -15446 -9361 -2582 5849 9769 -2001 -5595 -2778 2684 -692
3840 -692 2893 12343 8891 -8695 -24712 -28622 -11644 718 2277 -3749 -16018 -19061 -4973 4029
3826 4029 2801 7546 6407 2688 -14954 -17968 -13756 -1965 -5533 -22816 -33253 -21584 -2836
3813 -2836 -1658 -7193 -8487 -7831 3765 -3504 -4678 -11843 -20413 -16283 -14469 -5116 -6824 -20413 -20190
3798 -20190 -14900 -6577 511 5804 4969 12807 18625 20666 13248 15519 15318 19289 26156 7091 4445
3783D445M149J3791p778n805m662Q239q839p582Q513J57M556j023R590j523j6962
3768g34l999M01R041r638m901J6166J0548K591o624K780k191r131N600n705q329
3753d125J4843j133r768J0994Q55r383k056j1529K197J398P27Q217Q814N489l007
3738A2533o298J4430j3266j0435o631j595K88R074J155j3167Q649n61m158M008
3724e974j242L095Q009J937j9879j550O268P079l33J683j1730P167J3495r467
3710a442O169J0720N038r289l011M302K670j1133l002j485L128n033R741Q248
3696A5621O151M787j3368o042p675j959O660R609l540o178P084M188r69q319L694
3681I744j694r511O735R395p40j141J102o016j3004m489J5762J3604q450o948
$$ plain form
3783 4445 8594 22385 14607 8802 4140 12379 3540 -4042 4471 4628 9184 8161 17751 16228 -734
3768 -734 -4733 -4332 4709 -4929 -9830 6336 16884 19475 12851 15631 13440 4309 9909 4204 -4125
3753 -4125 10718 9585 -183 10811 11666 2283 227 -11302 -9105 -7707 -6980 1237 10051 15540 12533
3738 12533 6235 20665 7399 -3036 -9667 -11262 -10974 -1900 -745 -13912 -5263 -5824 -9982 -5974
3724 -5974 -7216 -4121 3888 5825 -14054 -15604 -9336 -2257 -2590 -907 -12637 -5470 8025 -1442
3710 -1442 4727 15447 20485 11196 8185 12487 15157 4024 1022 -463 2665 -2368 7373 15621
3696 15621 21772 26559 13191 7149 -526 -2485 4175 13784 10244 4066 11150 15338 14369 6050 9744
3681 9744 8050 -1461 5274 14669 13929 12788 13890 7874 -5130 -9619 6143 19747 11297 4349
3667D349N274m942P784r878j2277m926k774J2998q85k320J1654J1461j646r241
3653D631k558m355n481M265l727P370N458l495K958p21O555R875k453j4694j9
3638C609J1045j0547p367L813J865m699o198j0678O418J7602N025o703o968J4365
3624A0582j0017m125j815N517R049m31L15K932j1648q884L985l055N59K0480J1018
3609B4462r379k4954L988R455r109k424j052N899n413j87R985J1067M266j188
3595A5416M155m017n285k5661j107J6436K2826J4579J052q067j6573j8271O699
3582B182J698n394p25l766q23r266O461L020r929m199L71J7504Q136j1376P871
3567A765j041n351q69J2231k751p836j0960n345J5870j238M159l488o874N05M565
$$ plain form
3667 4349 9623 4681 12465 2587 -9690 -14616 -17390 -4392 -5277 -7597 4057 15518 13872 4631
3653 4631 2073 -2282 -7763 -3498 -7225 145 5603 2108 5066 4345 10900 20775 18322 3628 3609
3638 3609 14654 4107 -3260 553 2418 -2281 -8479 -19157 -12739 4863 9888 3185 -3783 10582
3624 10582 565 -3560 -5375 142 9191 8760 9075 12007 359 -8525 -4540 -7595 -7036 13444 24462
3609 24462 15083 -9871 -5883 3572 -5537 -7961 -9013 -3114 -8527 -8714 1271 12338 16604 15416
3595 15416 19571 15554 10269 -15392 -16499 -63 22763 37342 38394 30327 13754 -4517 2182
3582 2182 3880 -1514 -2239 -6005 -6828 -16094 -9633 -6613 -16542 -20741 -20370 -2866 5270 -6106 1765
3567 1765 724 -4627 -5496 6735 3984 -3852 -14812 -20157 -4287 -5525 -1366 -4854 -11728 -11223 -6658
3552f658Q935J2243q704j1154N221N530L233j5804m606p932O289P188J4513m386
3538C908j9787j0255J8302J5210J0454J0345R007N360j3456j2354n998j8225n904
3525a3393n055j4237J6458J9995L795j417L701L152J042j2591j083K280j0481
3512g834k2796K126J3957K7867J7822j316m653k7564j0467P243M744m223o662
3499a1756p893J1468r9l447n95J3157L675M521J6708k382j761j663k189j2928
3485D816J0674P040r354q574n938R701K590R885J2906j0571k1909l056n620N615
3471a795m220K681O016J3816k117p379j1321j064n617L473R008K527p38k330J300
3456B240k012o793Q026Q576j2795m080J141N5O876j4772q267R091J093M112J3027
$$ plain form
3552 -6658 2277 14520 5816 -5338 -117 5413 8646 -7158 -11764 -19696 -13407 -6219 8294 3908
3538 3908 -15879 -26134 -7832 7378 17832 28177 37184 42544 29088 16734 10736 -7489 -13393
3525 -13393 -18448 -32685 -16227 3768 7563 6146 9847 12999 14041 1450 367 2647 -7834
3512 -7834 -30630 -28504 -14547 13320 31142 29826 25173 -2391 -12858 -5615 -871 -5094 -11756
3499 -11756 -19649 -8181 -8280 -11727 -12322 835 4510 9031 25739 23357 21596 19933 17744 4816
3485 4816 15490 22530 13176 4602 -1336 8365 10955 20840 33746 23175 1266 -1790 -7410 -1795
3471 -1795 -6015 -3334 2682 16498 14381 7002 -4319 -5383 -11000 -7527 1481 4008 3270 940 2240
3456 2240 228 -6565 1461 10037 -2758 -6838 -5697 -5642 1234 -13538 -21805 -12714 -11621 -7509 5518
3441E518J168m697j3082q596O687J8829M012n25q797J283p93J971R595j0968M455
3426F060O842l757p046P203l174o075j8347o211r162J1117K9650L4j1920q386
3412a3172k089J861J8146O857l38r542o383J5501J755J150J0037n668m987l635
$$ plain form
3441 5518 6686 1989 -11093 -19689 -13002 5827 9839 9314 517 1800 1007 2978 12573 1605 6060
3426 6060 12902 9145 2099 9302 6128 53 -18294 -24505 -33667 -22550 7100 7134 -4786 -13172
3412 -13172 -15261 -13400 4746 11603 11265 1723 -4660 10841 12596 13746 23783 18115 13128 9493
$$ [...]
##END NTUPLES=NMR SPECTRUM
##END=
