##TITLE=Analysis number 322410
Compound Code s 01215
Project Code adrs
Chemist Name prosynth
##JCAMPDX= 6.0         $$ Bruker NMR JCAMP-DX V2.0
##DATA TYPE= NMR SPECTRUM
##DATA CLASS= NTUPLES
##ORIGIN= Bruker BioSpin GmbH
##OWNER= nmr
$$ XWIN-NMR		Version 3.5
$$ Mon Sep 25 13:15:34 2006 GMT Daylight Time (UT+1h)  MAYBRIDGE\nmr@NMR_250MHZ
##.OBSERVE FREQUENCY= 250.131544655141
##.OBSERVE NUCLEUS= ^1H
##.ACQUISITION MODE= SIMULTANEOUS (DQD)
##.ACQUISITION SCHEME= undefined
##.AVERAGES= 16
##.DIGITISER RES= 18
##SPECTROMETER/DATA SYSTEM= dpx250
##.PULSE SEQUENCE= zg30
##.SOLVENT NAME= CDCl3
##.SHIFT REFERENCE= (INTERNAL, CDCl3, 0, 16.522)
##AUDIT TRAIL= $$ (NUMBER, WHEN, WHO, WHERE, WHAT)
$$ ##TITLE= Audit trail, XWIN-NMR		Version 3.5
$$ ##JCAMPDX= 5.01
$$ ##ORIGIN= Bruker BioSpin GmbH
$$ ##OWNER= nmr
$$ C:\u/data/dgb/nmr/ADRS/1290/pdata/1/auditp.txt
$$ ##AUDIT TRAIL=  $$ (NUMBER, WHEN, WHO, WHERE, WHAT)
(   1,<2006-09-25 13:14:59.65 +100>,<MAYBRIDGE\nmr>,<NMR_250MHZ>,
      <created by zg, POWCHK disabled, PULCHK disabled
       configuration hash MD5:
       E2 DF 36 D8 04 B2 41 60 5A D7 A3 38 5A 4B D0 FE
       data hash MD5: 64K
       D5 35 AF C6 FB EC 1A 25 16 1C F5 87 5B A2 14 AA>)
(   2,<2006-09-25 13:15:22.60 +100>,<MAYBRIDGE\nmr>,<NMR_250MHZ>,
      <Start of raw data processing
       ef LB = 0.3 FT_mod = 6 PKNL = 1 SI = 32K 
       data hash MD5: 32K
       0F 73 CB 26 70 76 48 03 42 3F 56 31 75 F1 1D C2>)
(   3,<2006-09-25 13:15:24.56 +100>,<MAYBRIDGE\nmr>,<NMR_250MHZ>,
      <apk 
       data hash MD5: 32K
       D8 30 49 00 AD 19 99 E9 6A 57 3C BE D1 32 03 96>)
(   4,<2006-09-25 13:15:25.32 +100>,<MAYBRIDGE\nmr>,<NMR_250MHZ>,
      <abs ABSG = 5 
       data hash MD5: 32K
       D1 58 7F 0D E9 BE F3 EC 81 56 FF EC AE 53 D8 C8>)
$$ ##END=
$$ 
$$ hash MD5
$$ 03 49 A0 AD B9 E5 AD 97 FF 82 D4 B2 B6 83 CA 17
##$RELAX= 
##$RELAX= 
##$RELAX= 
##$RELAX= 
##$RELAX= 
##$RELAX= 
##$RELAX= 
$$ Bruker specific parameters
$$ --------------------------
##$DU= <C:\u>
##$EXPNO= 1290
##$NAME= <ADRS>
##$PROCNO= 1
##$TYPE= <nmr>
##$USER= <dgb>
##$AMP= (0..31)
100 100 100 100 100 100 100 100 100 100 100 100 100 100 100 100 100 100 
100 100 100 100 100 100 100 100 100 100 100 100 100 100 
##$AQSEQ= 0
##$AQ_mod= 3
##$AUNM= <au_zg>
##$AUTOPOS= <31 >
##$BF1= 250.13
##$BF2= 250.13
##$BF3= 250.13
##$BF4= 250.13
##$BF5= 500.13
##$BF6= 500.13
##$BF7= 500.13
##$BF8= 500.13
##$BYTORDA= 1
##$CFDGTYP= 0
##$CFRGTYP= 5
##$CHEMSTR= <none>
##$CNST= (0..31)
1 1 145 1 1 1 1 1 1 1 1 1 1 1 1 1 1 1 1 1 1 1 1 1 1 1 1 1 1 1 1 1 
##$CPDPRG= <>
##$CPDPRG1= <>
##$CPDPRG2= <>
##$CPDPRG3= <>
##$CPDPRG4= <mlev>
##$CPDPRG5= <mlev>
##$CPDPRG6= <mlev>
##$CPDPRG7= <mlev>
##$CPDPRG8= <mlev>
##$CPDPRGB= <>
##$CPDPRGT= <>
##$D= (0..31)
0 1 0 0 0 0 0 0 0 0.06 0 0 0 0 0 0 0.0002 0 0 0 0 0 0 0 0 0 0 0 0 0 0 
0 
##$DATE= 1159186496
##$DBL= (0..7)
120 120 120 120 120 120 120 120 
##$DBP= (0..7)
150 150 150 150 150 150 150 150 
##$DBP07= 0
##$DBPNAM0= <>
##$DBPNAM1= <>
##$DBPNAM2= <>
$$ [...]
##$SUBNAM7= <"">
##$SUBNAM8= <"">
##$SUBNAM9= <"">
##$SW= 20.6930455092707
##$SWIBOX= (0..15)
0 0 3 0 0 0 0 0 0 0 0 0 0 0 0 0 
##$SW_h= 5175.983436853
##$TD= 65536
##$TD0= 1
##$TE= 296.16
##$TE2= 300
##$TE3= 300
##$TEG= 300
##$TL= (0..7)
0 120 120 120 120 120 120 120 
##$TP= (0..7)
150 150 150 150 150 150 150 150 
##$TP07= 0
##$TPNAME0= <>
##$TPNAME1= <>
##$TPNAME2= <>
##$TPNAME3= <>
##$TPNAME4= <>
##$TPNAME5= <>
##$TPNAME6= <>
##$TPNAME7= <>
##$TPOAL= (0..7)
0.5 0.5 0.5 0.5 0.5 0.5 0.5 0.5 
##$TPOFFS= (0..7)
0 0 0 0 0 0 0 0 
##$TUNHIN= 0
##$TUNHOUT= 0
##$TUNXOUT= 0
##$USERA1= <user>
##$USERA2= <user>
##$USERA3= <user>
##$USERA4= <user>
##$USERA5= <user>
##$V9= 5
##$VALIST= <valist>
##$VCLIST= <CCCCCCCCCCCCCCC>
##$VD= 0
##$VDLIST= <DDDDDDDDDDDDDDD>
##$VPLIST= <PPPPPPPPPPPPPPP>
##$VTLIST= <TTTTTTTTTTTTTTT>
##$WBST= 1024
##$WBSW= 4
##$XGAIN= (0..3)
0 0 0 0 
##$XL= 0
##$YL= 0
##$YMAX_a= 342259
##$YMIN_a= -526411
##$ZGOPTNS= <>
##$ZL1= 120
##$ZL2= 120
##$ZL3= 120
##$ZL4= 120
##$ABSF1= 16.522
##$ABSF2= -4.171173
##$ABSG= 5
##$ABSL= 3
##$ALPHA= 0
##$AQORDER= 0
##$ASSFAC= 0
##$ASSFACI= 0
##$ASSFACX= 0
##$ASSWID= 0
##$AUNMP= <proc_1d>
##$AZFE= 0.1
##$AZFW= 0.1
##$BCFW= 0
##$BC_mod= 0
##$BYTORDP= 0
##$COROFFS= 0
##$CY= 12.5
##$DATMOD= 1
##$DC= 0
##$DFILT= <>
##$DTYPP= 0
##$F1P= 14.0000005364418
##$F2P= -0.99999901652339
##$FCOR= 0.5
##$FTSIZE= 32768
##$FT_mod= 6
##$GAMMA= 0
##$GB= 0
##$INTBC= 1
##$INTSCL= 1
##$ISEN= 128
##$LB= 0.3
##$LEV0= 0
##$LPBIN= 0
##$MAXI= 10000
##$MC2= 0
##$MEAN= 0
##$ME_mod= 0
##$MI= 0
##$NCOEF= 0
##$NC_proc= -5
##$NLEV= 6
##$NOISF1= 0
##$NOISF2= 0
##$NSP= 0
##$NTH_PI= 0
##$NZP= 0
##$OFFSET= 16.522
##$PC= 1
##$PHC0= 141.4098
##$PHC1= 17.93805
##$PH_mod= 1
##$PKNL= yes
##$PPARMOD= 0
##$PSCAL= 4
##$PSIGN= 0
##$REVERSE= no
##$SF= 250.13
##$SI= 32768
##$SIGF1= 0
##$SIGF2= 0
##$SINO= 400
##$SIOLD= 32768
##$SREGLST= <1H.CDCl3>
##$SSB= 0
##$STSI= 32768
##$STSR= 0
##$SW_p= 5175.98343685301
##$SYMM= 0
##$S_DEV= 0
##$TDeff= 65536
##$TDoff= 0
##$TI= <Analysis number 999999
Compound Code 99
Book Reference 9
Project Code 9>
##$TILT= no
##$TM1= 0
##$TM2= 0
##$TOPLEV= 0
##$USERP1= <user>
##$USERP2= <user>
##$USERP3= <user>
##$USERP4= <user>
##$USERP5= <user>
##$WDW= 1
##$XDIM= 32768
##$YMAX_p= 544296041
##$YMIN_p= -629200
$$ End of Bruker specific parameters
$$ ---------------------------------
##NTUPLES= NMR SPECTRUM
##VAR_NAME=  FREQUENCY,     SPECTRUM/REAL,   SPECTRUM/IMAG
##SYMBOL=    X,             R,               I
##VAR_TYPE=  INDEPENDENT,   DEPENDENT,       DEPENDENT
##VAR_FORM=  AFFN,          ASDF,            ASDF
##VAR_DIM=   32768,         32768,           32768
##UNITS=     HZ,            ARBITRARY UNITS, ARBITRARY UNITS
##FACTOR=    0.157963299565203, 1,           1
##FIRST=     4132.6476996994, 0,             0
##LAST=      -1043.33573715361, 0,           0
##MIN=       -1043.33573715361, -629200,     0
##MAX=       4132.6476996994, 544296041,     0
$$ Real data points
##PAGE= N=1
##DATA TABLE= (X++(R..R)), XYDATA
$$ [...]
$$ plain form
17335 -122172 -97156 -3735 88020 95565 86600 -73324 -134469 -133749 -99235 -6868 -20503 -56510
17323 -56510 -154357 -226289 -271644 -227269 -217677 -202691 -133276 -187248 -271068 -236304 -270196 -275414
17311 -275414 -114578 -15571 12241 174630 84352 -26684 52831 -33845 -122054 3811 110665
17300 110665 -3958 -14731 -21782 -58478 -168112 -120208 -34128 12143 -133574 -180742 -161382
17289 -161382 -69550 -46616 46252 32782 -9865 -5054 -159153 -282188 -306483 -239917 -194427
17278 -194427 -176145 -235798 -121451 -57548 -16504 -73038 -9137 -40576 -169328 -184869 -82148
17267 -82148 -13426 -129431 -135801 -147892 -110154 -27073 -5696 -42635 -45213 -144152 -280149 -295104
17255 -295104 -156029 -147015 -132233 -44511 17296 -15363 -61738 -134393 -128447 -39782 -16827 29114
$$ packed form
17335a22172K5016R3421R1755P545q965j59924o1145P20L4514R2367j3635l6007
17323e6510r7847p1932m5355M4375R592J4986O9415n3972q3820L4764l3892n218
17311b75414J60836R9007K7812J62389r0278j11036P9515q6676q8209J25865J06854
17300A10665j14623j0773p051l6696j09634M7904Q6080M6271j45717m7168J9360
17289a61382R1832K2934R2868j3470m2647M811j54099j23035k4295O6566M5490
17278a94427J8282n9653J14347O3903M1044n6534O3901l1439j28752j5541J02721
17267h2148O8722j16005o370j2091L7738Q3081K1377l6939k578r8939j35997j4955
17255b95104J39075R014J4782Q7722O1807l2659m6375p2655N946Q8665K2955M5941
$$ plain form
17243 29114 106788 229513 206796 91698 -4892 -225041 -275413 -216079 -184335 -155077 -87789
17232 -87789 -83560 -199103 -248416 -202179 -212275 -193092 -210176 -201685 -114994 -181046 -275541 -248155
17220 -248155 -86626 -95834 -203044 -272623 -139013 -58520 -67819 -90456 -126145 -210227 -307398
17209 -307398 -195649 -60823 17822 50277 45851 -48291 -206261 -184323 -68087 -146299 -162033
17198 -162033 -60737 -101293 22405 84722 -44478 -156105 -214767 -307188 -381927 -354007 -188244
17187 -188244 -22364 17704 56010 -25423 -64628 -126216 -213496 -287092 -297802 -354226 -333183
17176 -333183 -137247 37207 -88382 -147383 -29652 82672 -45555 -196270 -317519 -159076
17166 -159076 -183442 -144276 6284 111569 52164 99463 161843 63882 -192765 -308312 -165945
$$ packed form
17243B9114P7674J22725k2717j15098r6590k20149n0372N9334L1744K9258O7288
17232h7789M229j15543m9313M6237j0096J9183j7084Q491Q6691o6052r4495K7386
17220b48155J61529r208j07210o9579J33610Q0493r299k2637l5689q4082r7171
17209c07398J11749J34826P8645L2455m426r4142j57970K1938J16236p8212j5734
17198a62033J01296m0556J23698O2317j29200j11627n8662r2421p4739K7920J65763
17187a88244J65880M0068L8306q1433l9205o1588q7280p3596j0710n6424K1043
17176c33183J95936J74454j25589n9001J17731J12324j28227j50715j21249J58443
17166a59076k4366L9166J50560J05285n9405M7299O2380r7961k56647j15547J42367
$$ plain form
17155 -165945 -33370 -75769 -154274 -333397 -466604 -364949 -270063 -202559 -56735 -100279
17145 -100279 -137790 -250899 -313538 -267442 -241574 -244024 -275799 -315906 -267047 -194476 -90053
17134 -90053 -80214 -223967 -255679 -142699 -116585 -87986 -137759 -103044 -90723 -216630 -273976
17123 -273976 -236759 -270987 -234507 -222907 -330280 -269735 -186155 -228356 -388967 -223074 -20694
17112 -20694 -94336 -115564 -102322 -167806 -230604 -115100 -61086 -162075 -264154 -204225 -253618
17101 -253618 -137896 -135843 -271567 -329033 -388357 -406211 -351068 -286621 -156579 -16773 -11185
17090 -11185 -90274 -45928 31376 -40277 -68607 -135573 -191020 -168158 -182623 -197624 -200152 -96326
17078 -96326 -107309 -142122 -143557 13534 121817 159559 193953 201577 193011 179758 188702 162735
$$ packed form
17155a65945J32575m2399p8505j79123j33207J01655R4886O7504J45824m3544
17145a00279l7511j13109o2639M6096K5868k450l1775m0107M8859P2571J04423
17134i0053R839j43753l1712J12980K6114K8599m9773L4715J2321j25907n7346
17123b73976L7217l4228L6480J1600j07373O0545Q3580m2201j60611J65893K02380
17112b0694p3642k1228J3242o5484o2798J15504N4014j00989j02079N9929m9393
17101b53618J15722K053j35724n7466n9324j7854N5143O4447J30042J39806N588
17090a1185p9089M4346P7304p1653k8330o6966n5447K2862j4465j5001k528J03826
17078i6326j0983l4813j435J57091J08283L7742L4394P624q566j3253Q944k5967
$$ plain form
17066 162735 85042 -49210 -104621 -52393 -8623 -37836 -76112 -50735 -36293 -176919 -192082
17055 -192082 -139757 -87429 -211520 -258285 -172543 -97012 -9734 44492 -120649 -205245 -265976
17044 -265976 -277560 -162561 53296 101434 139333 12641 -185403 -204869 -254811 -320988 -338927
17033 -338927 -298180 -250548 -185744 -132207 -88376 -139707 -236590 -271031 -172857 -121899 -62057
17022 -62057 -69666 13591 120391 115982 161129 35663 -102925 -243977 -264662 -205301 -136328
17011 -136328 -129707 -99028 -179330 -206494 -159558 -154056 -75169 -187366 -170996 -41725 -120120
17000 -120120 -244950 -141007 -58316 -229187 -276158 -177055 -140808 -78139 127025 75841 30244
16989 30244 78292 130914 53175 -55051 7154 105463 63353 13993 -70990 -134971 -217561
$$ packed form
17066A62735p7693j34252n5411N2228M3770k9213l8276K5377J4442j40626j5163
17055a92082N2325N2328j24091m6765Q5742P5531Q7278N4226j65141q4596o0731
17044b65976j1584J14999K15857M8138L7899j26692j98044j9466m9942o6177j7939
17033c38927M0747M7632O4804N3537M3831n1331r6883l4441R8174N0958N9842
17022f2057p609Q3257J06800m409M5147j25466j38588j41052k0685N9361O8973
17011a36328O621L0679q0302k7164M6936N502P8887j12197J6370J29271p8395
17000a20120j24830J03943Q2691j70871m6971R9103L6247O2669K05164n1184m5597
16989C0244M8048N2622p7739j08226O2205R8309m2110m9360q4983o3981q2590
$$ plain form
16978 -217561 -211355 -275180 -284271 -113282 -247018 -318503 -256552 -403660 -541287 -402315 -388797
16967 -388797 -282842 -197565 -140246 -131003 -115796 -150852 -189136 -259522 -280723 -229902 -127913
16956 -127913 -63241 -27923 1120 85328 -55175 -149352 -102746 -124243 -220701 -105394 -100294
16945 -100294 -195248 -186729 -136820 -141982 -113683 -37983 -68653 -191267 -203024 -172664 -209657 -264097
16933 -264097 -288103 -339905 -242118 -277451 -325140 -139229 47602 36200 -13365 13895 -30930
16922 -30930 -112487 -51529 -86098 -237941 -326279 -315668 -304558 -256777 -97131 -83170 -147470
16911 -147470 -142341 -94551 -85795 -88289 -82018 -71730 -119922 -154664 -41817 26638 21484 -32108
16899 -32108 40276 -32408 -132572 -195946 -194745 -217122 -171899 -89325 -43538 -29210 -144706
$$ packed form
16978b17561O206o3825r091J70989j33736p1485O1951j47108j37627J38972J3518
16967c88797J05955Q5277N7319R243J5207l5056l8284p0386k1201N0821J01989
16956a27913O4672L5318K9043Q4208j40503r4177M6606k1497r6458J15307N100
16945a00294r4954Q519M9909n162K8299P5700l0670j22614j1757L0360l6993n4440
16933b64097k4006n1802R7787l5333m7689J85911J86831j1402m9565K7260m4825
16922c0930q1557O0958l4569j51843q8338J0611J1110M7781J59646J3961o4300
16911a47470N129M7790Q756k494O271J0288m8192l4742J12847O8455n154n3592
16899c2108P2384p2684j00164o3374J201k2377M5223Q2574M5787J4328j15496
$$ plain form
16888 -144706 -315672 -299034 -171119 -181877 -228289 -122633 -203455 -196887 -71796 -63099 -92656
16877 -92656 -116774 -216077 -263672 -172949 -68588 -37611 -147614 -208979 -276745 -198243 -213928
16866 -213928 -391705 -349714 -196592 -101550 -31062 19856 173722 22145 -242699 -191058
16856 -191058 -71387 -43361 -77349 -97507 -52438 -39528 -67978 -253917 -284466 -103607 -211506
16845 -211506 -197467 -68204 -99032 -92093 -109953 -151068 -345738 -418595 -347320 -150592 -77635
16834 -77635 -92590 -135142 -136918 -136534 -210777 -245248 -207867 -117139 -92956 -109125 -84761 -78394
16822 -78394 -224199 -114054 -105060 -123663 -138075 -277727 -418073 -289709 -198057 -54653 -82004
16811 -82004 -31044 -28229 -93930 -124045 2835 -134297 -320495 -225682 37182 77778 20993
$$ packed form
16888a44706j70966J6638J27915j0758m6412J05656q0822O568J25091Q697k9557
16877i2656k4118r9303m7595R0723J04361L0977j10003o1365o7766P8502j5685
16866b13928j77777M1991J53122R5042P0488N0918J53866j51577k64844N1641
16856a91058J19671K8026l3988k0158M5069J2910k8450j85939l0549J80859j07899
16845b11506J4039J29263l0828O939j7860m1115j94670p2857P1275J96728P2957
16834g7635j4955m2552j776L84p4243l4471L7381R0728K4183j6169K4364O367
16822g8394j45805J10145Q994j8603j4412j39652j40346J28364R1652J43404k7351
16811h2004N0960K815o5701l0115J26880j37132j86198R4813K62864M0596n6785
$$ plain form
16800 20993 -235161 -298889 -238159 -149229 -85348 -80124 -91467 -261798 -290384 -185919 -213954
16789 -213954 -256465 -170053 -38244 -72223 -249054 -230616 -151681 -69431 -23227 -245707 -285837
16778 -285837 -154156 -10030 -137438 -149715 -171091 -163588 -198707 -165289 -50223 59619 32617
16767 32617 -52711 -58063 52002 -39477 -58665 -105616 -152302 -123841 -123383 -244418 -288921 -184093
16755 -184093 -66826 -22796 -82400 -214221 -211954 -277800 -170334 -28627 32467 -67320 -125190
16744 -125190 -12341 72243 20054 19400 -81432 -220739 -190680 -171950 -344979 -317615 -133072
16733 -133072 34457 57101 -35252 -13693 62148 66072 31244 -80675 -118072 -172268 -230550
16722 -230550 -32107 112093 95923 -120075 -191625 -198345 -148969 -149974 -176946 -157118 -99905
$$ packed form
16800B0993k56154o3728O0730Q8930O3881N224j1343j70331k8586J04465k8035
16789b13954m2511Q6412J31809l3979j76831J8438P8935Q2250M6204k22480m0130
16778b85837J31681J44126j27408j2277k1376P503l5119L3418J15066J09842k7002
16767C2617q5328n352J10065r1479j9188m6951m6686K8461M58j21035m4503J04828
16755a84093J17267M4030n9604j31821K267o5846J07466J41707O1094r9787n7870
16744a25190J12849Q4584n2189o54j00832j39307L0059J8730j73029K7364J84543
16733a33072J67529K2644r2353K1559P5841L924l4828j11919l7397n4196n8282
16722b30550J98443J44200j6170k15998p1550o720M9376j005k6972J9828N7213
$$ plain form
16711 -99905 -67698 -35986 80677 177485 200437 139359 3154 -145344 -136753 -30677 -92121
16700 -92121 -238199 -192184 -159562 -193616 -122908 12953 82038 -47161 -95195 -165730 -259254
16689 -259254 -260232 -154488 -215452 -319345 -156262 -88380 -114438 -164414 -214870 -123395 -169200
16678 -169200 -83564 -106905 -244358 -217950 -197180 -295233 -282836 -156602 -104059 -141883 -206969
16667 -206969 -224000 -276386 -204323 -100556 -42872 -190446 -251134 -326423 -340647 -276527 -278971
16656 -278971 -300137 -324803 -101920 -41420 -44060 -70504 -128523 -234644 -282401 -214394 -22748
16645 -22748 -98976 -174507 -163904 -81027 -61671 -132901 -98393 -90296 39485 -1741 -63859 -52143
16633 -52143 -7545 -74342 76642 118582 41414 118123 137918 164150 46355 -83384 -198077
$$ packed form
16711i9905L2207L1712J16663R6808K2952o1078j36205j48498Q591J06076o1444
16700i2121j46078M6015L2622l4054P0708J35861O9085j29199m8034p0535r3524
16689b59254r78J05744o0964j03893J63083O7882k6058m9976n0456R1475m5805
16678a69200Q5636k3341j37453K6408K0770r8053J2397J26234N2543l7824o5086
16667b06969j7031n2386P2063J03767N7684j47574o0688p5289j4224O4120k444
16656b78971k1166k4666K22883O0500k640k6444n8019j06121m7757O8007J91646
16645b2748p6228p5531J0603Q2877J9356p1230L4508Q097J29781m1226o2118J1716
16633e2143M4598o6797J50984M1940p7168P6709J9795K6232j17795j29739j14693
$$ plain form
16622 -198077 -182863 -67547 -110298 -263844 -315938 -284045 -169493 -125326 -172973 -220255 -210548
16611 -210548 -245271 -149688 -124482 -220966 -184065 -114310 -31681 -56738 -148319 -95348 -42221
16600 -42221 -62536 -101823 -82649 -159531 -255160 -109720 -84418 -148624 -254834 -174752 -242216
16589 -242216 -255188 -237384 -146973 -191468 -223661 -364482 -351622 -484797 -405004 -317877 -161714
16578 -161714 -49350 67380 33564 -535 85127 220136 209111 127431 73371 -24648 -91137
16567 -91137 -24008 -9837 -20373 -79941 -110932 -132761 -146434 -211527 -285569 -260840 -268051 -195235
16555 -195235 -60342 -40478 40257 97111 86995 62417 63711 -26599 32366 945 -157723
16544 -157723 -224834 -221726 -50158 -36575 -76892 39720 59883 -48799 -228569 -183191 -172832
$$ packed form
16622a98077J5214J15316m2751j53546n2094L1893J14552M4167m7647m7282R707
16611b10548l4723R5583K5206r6484L6901O9755Q2629k5057r1581N2971N3127
16600d2221k0315l9287J9174p6882r5629J45440K5302o4206j06210Q0082o7464
16589b42216j2972J7804R0411m4495l2193j40821J2860j33175P9793Q7127J56163
16578a61714J12364J16730l3816l4099Q5662J35009j1025q1680n4060r8019o6489
16567i1137O7129J4171j0536n9568l0991k1829j3673o5093p4042K4729p211P2816
16555a95235J34893J9864Q0735N6854j0116k4578J294r0310N8965l1421j58668
16544a57723o7111L108J71568J3583m0317J16612K0163j08682j79770M5378J0359
$$ plain form
16533 -172832 -224533 -260358 -343010 -363902 -347680 -175609 -34363 -19157 -48363 -91413 -74945
16522 -74945 -23253 6116 -15247 -41995 -169353 -118347 -119488 -251058 -352334 -336304 -200006
16511 -200006 -22202 48864 -89800 -162568 -157046 -133128 -178869 -169937 -121833 -93359 -184154
16500 -184154 -180954 -99430 82531 128256 87799 22682 -2073 -44814 11230 54913 18380
16489 18380 -124096 -278946 -300667 -146618 -197937 -249985 -38205 -82313 -144612 -132342 -181820
16478 -181820 -290517 -262523 -308123 -252537 -199407 -83214 -146487 -205495 -170745 -105819 -73265
16467 -73265 -159622 -236365 -116424 -130520 -205442 -244984 -187341 -109842 -169289 -154698 -82735
16456 -82735 -81902 -99183 -81956 -47207 -49143 -42215 60964 -72252 -158177 -183850 -288385 -238678
$$ packed form
16533a72832n1701l5825q2652k0892J6222J72071J41246J5206k9206m3050J6468
16522g4945N1692K9369k1363k6748j27358N1006j141j31570j01276J6030J36298
16511b00006J77804P1066j38664p2768N522K3918m5741Q932M8104K8474r0795
16500a84154L200Q1524J81961M5725m0457o5117k4755m2741N6044M3683l6533
16489A8380j42476j54850k1721J54049n1319n2048K11780m4108o2299J2270m9478
16478a81820j08697K7994m5600N5586N3130J16193o3273n9008L4750O4926L2554
16467g3265q6357p6743J19941j4096p4922l9542N7643P7499n9447J4591P1963
16456h2735Q33j7281J7227L4749j936O928J03179j33216q5925k5673j04535M9707
$$ plain form
16444 -238678 -95385 -161007 -295014 -327838 -179659 -93070 -46022 -93425 -110339 -191913 -238828
16433 -238828 -261782 -296893 -221676 -141935 -63889 100163 40665 -141522 -166486 -247917 -156996
16422 -156996 -121625 -41732 -147326 -192574 -222419 -93545 -24948 -135610 -179824 -69899 -9797
16411 -9797 25712 78505 37674 -189054 -350991 -430468 -409124 -379844 -420066 -295973 -260810
16400 -260810 -196736 -236681 -253769 -181569 -95992 -126983 -222174 -172892 -147733 -126009 -1619
16389 -1619 -82095 -167861 -138241 -196479 -177102 -128477 -224721 -341437 -394319 -247522 -227343
16378 -227343 -379712 -373793 -203894 -81234 -53827 14585 83271 27561 -72580 -130638 -59351
16367 -59351 -20532 -107025 -126826 -119468 -211965 -215661 -213649 -79827 -16893 -50341 -40912 -67202
$$ packed form
16444b38678J43293o5622j34007l2824J48179Q6589M7048m7403j6914q1574m6915
16433b38828k2954l5111P5217P9741P8046J64052n9498j82187k4964q1431R0921
16422a56996L5371P9893j05594m5248k9845J28874O8597j10662m4214J09925O0102
16411i797L5509N2793m0831k26728j61937p9477K1344K9280m0222J24093L5163
16400b60810O4074l9945j7088P2200Q5577l0991r5191M9282K5159K1724J24390
16389a619q0476q5766K9620n8238J9377M8625r6244j16716n2882J46797K0179
16378b27343j52369N919J69899J22660K7407O8412O8686n5710j00141n8058P1287
16367e9351L8819q6493j9801P358r2497l696K012J33822O2934l3448R429k6290
$$ plain form
16355 -67202 -28154 -136726 -161046 -181832 -163301 -255296 -222147 -254964 -385340 -381574 -299800
16344 -299800 -134952 -97193 -114654 -147799 -19406 47349 26498 -82386 -10516 -2223 -35756
16333 -35756 -45869 -96169 -194747 -214027 -116547 -88458 -159373 -279036 -143667 -230377 -391164
16322 -391164 -281353 -172437 -181321 -232210 -191750 -198667 -168304 -170822 -222250 -344361 -264248
16311 -264248 -284288 -262085 -294415 -240829 -124467 -77328 -61053 -59929 -85859 -177923 -181036 -107168
16299 -107168 -18610 78690 26051 -58297 -180999 -295210 -231937 -208718 -322609 -162451 94186
16288 94186 85315 -49836 -187753 -87712 13404 -86893 -76341 46433 119080 27319 -108159
16277 -108159 -136249 -175474 -155527 -41217 -62780 -10717 44583 -118466 6469 148845 123072
$$ packed form
16355f7202L9048j08572k4320k0786J8531r1995L3149l2817j30376L766Q1774
16344b99800J64848L7759j7461l3145J28393O6755k0851j08884P1870Q293l3533
16333c5756j0113n0300r8578j9280R7480K8089p0915j19663J35369q6710j60787
16322c91164J09811J08916q884n0889M0460o917L0363k518n1428j22111Q0113
16311b64248k0040K2203l2330N3586J16362M7139J6275J124k5930r2064l113P3868
16299a07168Q8558R7300n2639q4348j22702j14211O3273K3219j13891J60158K56637
16288I4186q871j35151j37917J00041J01116j00297J0552J22774P2647r1761j35478
16277a08159k8090l9225J9947J14310k1563N2063N5300j63049J24935J42376k5773
$$ plain form
16266 123072 76363 -35651 7973 -40189 -91862 -44473 -90828 7279 41534 109488 102348
16255 102348 152528 158338 -14435 2068 39118 -118621 -209188 -253190 -148538 -120757 -127302
16244 -127302 15347 -31079 -97814 -107695 -18547 -29869 110379 144500 40644 -65460 -82260
16233 -82260 -168271 -215347 -185074 -56848 38420 -67043 -135374 -70968 12059 -137133 -329782
16222 -329782 -332341 -334496 -444868 -437228 -441734 -360053 -271437 -269115 -246715 -88582 -3698 -4822
16210 -4822 32100 -93912 -306051 -407971 -380601 -283080 -152434 -117843 -206366 -233948 -118464
16199 -118464 -103544 -131651 -77788 -39561 -158628 -257943 -210659 -262221 -330498 -282336 -80698
16188 -80698 8949 -180623 -341304 -331407 -321896 -327144 -306157 -132424 -68784 -66662 -155303 -201658
$$ packed form
16266A23072m6709j12014M3624m8162n1673M7389m6355R8107L4255O7954p140
16255A02348N0180N810j72773J6503L7050j57739r0567m4002J04652K7781o545
16244a27302J42649m6426o6735r881Q9148j1322J40248L4121j03856j06104j6800
16233h2260q6011m7076L0273J28226R5268j05463o8331O4406Q3027j49192j92649
16222c29782k559k155j10372P640m506Q1681Q8616K322K2400J58133Q4884j124
16210d822L6922j26012k12139j01920K7370R7521J30646L4591q8523k7582J15484
16199a18464J4920k8107N3863L8227j19067r9315M7284n1562o8277M8162K01638
16188h0698Q9647j89572j60681R897R511n248K0987J73733O3640K122q8641m6355
$$ plain form
16176 -201658 2562 76661 25118 -35976 -120704 -133583 -106655 -37671 -167591 -191179 -137044
16165 -137044 -205850 -183386 -118846 -74958 -90582 -12068 -5157 -89382 -229008 -288806 -167833
16154 -167833 -144709 -181197 -194814 -211378 -174218 -29144 -53079 -102238 -200425 -253888 -129016
16143 -129016 2344 -41338 -79416 -147819 -237481 -190804 -19677 95929 54373 -35386 -102275
16132 -102275 59158 48254 -29044 -80997 -49359 31229 -108312 37799 131262 235499 247156
16121 247156 67256 -112443 -117372 -79900 -237346 -251233 -205888 -255313 -275036 -306179 -363648
16110 -363648 -399974 -296734 -174044 -3960 88256 71522 -9334 -57247 38841 143882 51087
16099 51087 -258873 -231902 -179653 -171423 -56049 2709 17173 -24484 -141621 -330123 -174482
$$ packed form
16176b01658K04220P4099n1543o1094q4728j2879K6928O8984j29920k3588N4135
16165a37044o8806K2464O4540M3888j5624P8514O911q4225j39626n9798J20973
16154a67833K3124l6488j3617j6564L7160J45074k3935m9159r8187n3463J24872
16143a29016J31360m3682l8078o8403q9662M6677J71127J15606m1556q9759o6889
16132a02275J61433j0904p7298n1953L1638Q0588j39541J46111R3463J04237J1657
16121B47156j79900j79699m929L7472j57446j3887M5345m9425j9723l1143n7469
16110c63648l6326J03240J22690J70084R2216j6734q0856m7913R6088J05041r2795
16099E1087l09960K6971N2249Q230J15374N8758J4464m1657j17137j88502J55641
$$ plain form
16088 -174482 -56396 -6343 -27257 -16418 -85220 -258460 -310481 -187544 -41274 -109293 -237266
16077 -237266 -194747 -219066 -328035 -388530 -259003 -171987 -107279 -6570 -39642 -60883 -80686
16066 -80686 -92541 -147165 -161932 -173786 -245555 -213521 -142701 -142735 -232479 -357521 -335482 -254772
16054 -254772 -176884 -230435 -259553 -253651 -196719 -142482 -188193 -150681 -185815 -201039 -237861 -312875
16042 -312875 -228435 -292457 -346731 -169819 -57269 -21274 61062 43080 -88562 5101 66773
16031 66773 -126948 -236295 -200773 -232605 -180742 -13470 62059 67351 167608 -8745 -145927
16020 -145927 -89268 -49445 -43903 43933 21480 32233 -13247 -23259 -15494 150513 232076 140669
16008 140669 144379 53353 -107861 -163180 -160522 -152575 -146500 -217345 -187632 -168334 -61976 -153577
$$ packed form
16088a74482J18086N0053k0914J0839o8802j73240n2021J22937J46270o8019j27973
16077b37266M2519k4319j08969o0495J29527Q7016O4708J00709l3072k1241j9803
16066h0686j1855n4624j4767j1854p1769L2034P0820l4q9744j25042K2039Q0710
16054b54772P7888n3551k9118N902N6932N4237m5711L7512l5134j5224l6822p5014
16042c12875Q4440o4022n4274J76912J12550L5995Q2336j7982j31642R3663O1672
16031F6773j93721j09347L5522l1832N1863J67272P5529N292J00257j76353j37182
16020a45927N6659L9823N542Q7836k2453J0753m5480j0012P765J66007Q1563r1407
16008A40669L710r1026j61214n5319K658P947O075p0845K9713J9298J06358r1601
$$ plain form
15996 -153577 -59988 39863 179820 57545 -82102 -122208 -106501 -160317 -126869 -146093 -93288
15985 -93288 -155595 -158052 -140855 21288 -105378 -186740 -244206 -208015 -119931 -11398 -5732
15974 -5732 -21835 14507 -19226 49990 -154575 -188256 -153146 -116596 -144964 -73480 -191651
15963 -191651 -366988 -336791 -140582 -27030 50100 27309 27346 3131 110839 201452 96375
15952 96375 -98452 -118838 105740 15851 -151218 -165348 -19204 24732 -78177 -204395
15942 -204395 -294841 -369850 -294120 -301142 -281341 -172095 -94549 -199444 -250447 -294098 -306918
15931 -306918 -280618 -299966 -209426 -216964 -335503 -265866 -231601 -161905 -193872 -21182 -189370
15920 -189370 -195063 -154651 -266438 -327863 -110403 -17438 -79852 -205075 -251949 -278936 -78942
$$ packed form
15996a53577R3589R9851J39957j22275j39647m0106J5707n3816L3448j9224N2805
15985i3288o2307k457J7197J62143j26666q1362n7466L6191Q8084J08533N666
15974e732j6103L6342l3733O9216k04565l3681L5110L6550k8368P1484j18171
15963a91651j75337L0197J96209J13552P7130k2791L7k4215J07708R0613j05077
15952I6375j94827k0386K24578q9889j67069j4130J46144M3936j02909j26218
15942b04395r0446p5009P5730p022J9801J09246P7546j04895n1003m3651j2820
15931c06918K6300j9348R0540p538j18539O9637L4265O9696l1967J72690j68188
15920a89370n693M0412j11787o1425K17460R2965o2414j25223m6874k6987J99994
$$ plain form
15909 -78942 -27096 85710 157909 116540 54569 -172913 -321588 -399639 -322563 -192920 -102616
15898 -102616 -40791 -39818 -130971 -165593 -161459 -288188 -228768 -158889 -185224 -158304 -60740 1441
15886 1441 107410 -35296 -30763 -112559 -233006 -132817 22568 113266 83450 139518 165634
15875 165634 140986 59029 31088 19522 -9735 -147395 -205559 -87077 -81133 -10514 -69482
15864 -69482 -116369 -64274 -23576 -30925 -32674 -33055 -16365 -2389 -121989 -195677 -101190 110614
15852 110614 40137 104619 131613 163842 185383 118941 -76922 -70684 -69766 -164739 -193416 -234644
15840 -234644 -278561 -232287 -272842 -334580 -360219 -292504 -262178 -250146 -147268 -20414 -62128
15829 -62128 -44058 -15897 -224211 -354738 -536694 -629200 -445848 -411115 -329230 -240187 -254869
$$ packed form
15909g8942N1846J12806P2199m1369o1971k27482j48675p8051P7076J29643R0304
15898a02616O1825R73r1153l4622M134j26729N9420O9879k6335K6920R7564O2181
15886A441J05969j42706M533q1796j20447J00189J55385R0698k9816N6068K6116
15875A65634k4648q1957k7941j1566k9257j37660n8164J18482N944P0619n8968
15864f9482m6887N2095M0698p349j749l81J6690J3976j19600p3688R4487K11804
15852A10614p0477O4482K6994L2229K1541o6442j95863O238R18r4973k8677m1228
15840b34644m3917M6274m0555o1738k5639O7715L0326J2032J02878J26854m1714
15829f2128J8070K8161k08314j30527j81956r2506J83352L4733Q1885Q9043j4682
$$ plain form
15818 -254869 -383161 -380681 -412614 -378545 -248444 -144628 -85028 -74860 -27400 -62815 -23833
15807 -23833 -48491 -13795 80933 89811 69116 69863 -80711 -248518 -328775 -227572 -144789 -164503
15795 -164503 -419849 -429696 -301198 -291432 -349271 -249493 -231128 -79892 42254 38628 -92135
15784 -92135 -221766 -231184 -99589 -19816 -102291 -74586 -79951 -78409 -62395 12373 -80416 -104145
15772 -104145 -87102 3402 -15465 -30641 38965 192215 135032 -146520 -159728 -124926 -85757
15761 -85757 -107226 -167544 -292959 -139825 -139254 -231349 -215455 -196943 -159630 -100634 -78593 -109975
15749 -109975 -202711 -123819 14079 23628 35466 -2693 -153215 -89980 -26067 -18649 15208
15738 15208 -106423 -212641 -264702 -145966 -7129 -1326 -149880 -265154 -251442 -195917 -292725
$$ packed form
15818b54869j28292K480l1933L4069J30101J03816N9600J0168M7460l5415L8982
15807b3833k4658L4696R4728Q878k0695P47j50574j67807q0257J01203Q2783j9714
15795a64503k55346r847J28498R766n7839R9778J8365J51236J22146l626j30763
15784i2135j29631r418J31595P9773q2475K7705n365J542J6014P4768r2789k3729
15772a04145J7043R0504j8867j5176O9606J53250n7183k81552j3208L4802L9169
15761h5757k1469o0318j25415J53134N71r2095J5894J8512L7313N8996K2041l1382
15749a09975r2736P8892J37898R549J1838l8159j50522O3235O3913P418L3857
15738A5208j21631j06218n2061J18736J38837N803j48554j15274J3712N5525r6808
$$ plain form
15727 -292725 -308597 -248247 -262464 -236853 -347442 -258655 -178023 -241273 -249370 -231149 -312202
15716 -312202 -264191 -174251 -227536 -248776 -246866 -316121 -160272 -83536 -79343 -18259 26471 -56026
15704 -56026 -38923 147647 60933 20961 8647 -78722 -119096 -111941 -136102 -61627 18537 -8428
15692 -8428 -6974 64762 37834 5689 -138424 -441032 -434714 -267380 -171852 -188250 -397479
15681 -397479 -357601 -308825 -338304 -219529 -213044 -208233 -103988 -76932 -180601 -237368 -231344
15670 -231344 -190257 -158471 -189190 -294376 -176643 5053 -5421 -187029 -255680 -227415 -135587
15659 -135587 -35408 -90689 -110874 -184257 -199386 -21723 147070 68510 -108366 -189524 -182311
15648 -182311 -284115 -259115 -242885 -378390 -361927 -340675 -308998 -313272 -320265 -389867 -399527 -300357
$$ packed form
15727b92725j5872O0350j4217K5611j10589Q8787Q0632o3250q097J8221q1053
15716c12202M8011Q9940n3285k1240J910o9255J55849P6736M193O1084M4730q2497
15704e6026J7103J86570q6714l9972j2314q7369m0374P155k4161P4475Q0164k6965
15692h428J454P1736k6928l2145j44113l02608O318J67334R5528j6398k09229
15681c97479L9878M8776k9479J18775O485M811J04245K7056j03669n6767O024
15670b31344M1087L1786l0719j05186J17733J81696j0474j81608o8651K8265R1828
15659a35587J00179n5281k0185p3383j5129J77663J68793p8560j76876q1158P213
15648a82311j01804K5000J6230j35505J6463K1252L1677m274o993o9602r660R9170
$$ plain form
15636 -300357 -257625 -312477 -363628 -271269 -108554 -120019 -148617 -60389 -123492 -235167 -207401
15625 -207401 -75351 37346 43656 -69279 -89758 28122 -71804 -201612 -132933 -69627 -96427
15614 -96427 -17844 -80843 -116575 -83891 -154808 -124198 -153161 -142871 -47230 -60250 -244355
15603 -244355 -261496 -247252 -142281 -57786 -91371 -49731 -46651 -49885 -48577 18250 108591 -25277
15591 -25277 -123205 -78260 109637 168462 -53085 -188461 -46561 79914 22432 36713 -23690
15580 -23690 -153939 -223070 -323380 -240233 -202864 -151824 -66930 22238 69294 -1054 -27388
15569 -27388 51724 -114704 -279944 -160744 126429 115680 18412 117898 117335 115068 46698
15558 46698 -105697 -148303 -179561 -133276 49296 120039 213044 137331 112769 60576 -25100
$$ packed form
15636c00357M2732n4852n1151R2359J62715j1465k8598Q8228o3103j11675K7766
15625b07401J32050J12697O310j12935k0479J17880r9926j29808O8679O3306k6800
15614i6427P8583o2999l5732L2684p0917L0610k8963J0290R5641j3020j84105
15603b44355j7141J4244J04971Q4495l3585M1640L080l234J308O6827R0341j33868
15591b5277r7928M4945J87897N8825k21547j35376J41900J26475n7482J4281o0403
15580b3690j30249o9131j00310Q3147L7369N1040Q4894Q9168M7056p0348k6334
15569b7388P9112j66428j65240J19200K87173j0749r7268R9486n63k267o8370
15558D6698j52395m2606l1258M6285J82572P0743R3005p5713k4562n2193q5676
$$ plain form
15547 -25100 -99941 -77783 79247 47782 -33338 -147907 -125652 -171883 -260333 -266466 -265815 -251976
15535 -251976 -141259 -99013 -107872 -38064 -122208 -263848 -353483 -253212 -141833 -117442 -213864
15524 -213864 -218759 -178353 -194128 -134787 -180875 -164411 15506 -117694 -205100 -222290 -155396
15513 -155396 -207002 -196736 -73282 1307 -47958 -131167 -153996 -95813 -169907 -205088 -20353
15502 -20353 -35502 -139879 -195320 -190032 -80437 59454 36792 82660 138392 -38518 -25585
15491 -25585 -58832 -157723 -226809 -274979 -225777 -181434 -42501 -67989 -155810 -292846 -344242
15480 -344242 -359259 -439852 -420813 -336242 -266663 -222653 -179100 -309522 -337330 -172775 -80217
15469 -80217 -98245 -75680 -90597 -1386 60035 -41849 -172952 -160446 -86231 -73548 31185
$$ packed form
15547b5100p4841K2158J57030l1465q1120j14569K2255m6231q8450o133O51J3839
15535b51976J10717M2246q859O9808q4144j41640q9635J00271J11379K4391r6422
15524b13864m895M0406j5775N9341m6088J6464J79917j33200q7406j7190O6894
15513a55396n1606J0266J23454P4589m9265q3209k2829N8183p4094l5181J84735
15502b0353j5149j04377n5441N288J09595J39891k2662M5868N5732j76910J2933
15491b5585l3247r8891o9086m8170M9202M4343J38933k5488q7821j37036n1396
15480c44242j5017q0593J9039Q4571O9579M4010M3553j30422k7808J64555R2558
15469h0217j8028K2565j4917Q9211O1421j01884j31103J2506P4215J2683J04733
$$ plain form
15458 31185 44360 432 -175523 -211637 -222590 -262267 -297417 -209966 -196712 -240002 -137172
15447 -137172 -63166 68849 46976 159484 76208 -49300 -76699 -98050 -86380 84011 3347
15436 3347 -142049 -57186 42783 -42254 -186409 -166878 -81856 -70552 -41445 -100010 -217076
15425 -217076 -228207 -178981 -274840 -334370 -275661 -284515 -161748 -213602 -192706 -109657 -110086 -98784
15413 -98784 59634 82951 150364 -21043 -80246 -30682 -9324 109453 142955 156334 32803
15402 32803 -89549 -216799 -178590 -154500 -167798 -233222 -154046 -179269 -177749 -122030 51268
15391 51268 131124 5622 -31439 -139232 -255218 -173290 -176905 -66869 122663 214342 82227
15380 82227 7134 58125 88023 224612 231186 161709 44090 -43165 -22480 82221 180809
$$ packed form
15458C1185J3175m3928j75955l6114j0953l9677l5150Q7451J3254m3290J02830
15447a37172P4006J32015k1873J12508q3276j25508k7399k1351J1670J70391q0664
15436C347j45396Q4863R9969q5037j44155J9531Q5022J1304K9107n8565j17066
15425b17076j1131M9226r5859n9530N8709q854J22767n1854K0896Q3049m29J1302
15413i8784J58418K3317O7413j71407n9203M9564K1358J18777L3502J3379j23531
15402C2803j22352j27250L8209K4090j3298o5424P9176k5223J520N5719J73298
15391E1268P9856j25502l7061j07793j15986Q1928l615J10036J89532R1679j32115
15380H2227p5093N0991K9898J36589O574o9477j17619q7255K0685J04701R8588
$$ plain form
15369 180809 121429 8101 12201 31740 40052 -64957 18435 25494 -18758 60455 -68330
15358 -68330 -224348 -194577 -242700 -242331 -146790 -135515 -184225 -202799 -256410 -319710 -369052 -183128
15346 -183128 38749 -143577 -227459 -197270 -198645 -158227 -257016 -249954 -207532 -283649 -303755
15335 -303755 -264314 -301297 -219212 -122750 -173257 -241146 -324616 -359032 -222381 -205960 -274602
15324 -274602 -366317 -296544 -312196 -256076 -309432 -293559 -181563 -94633 -62622 -148137 -143583
15313 -143583 -86874 -91033 -77051 -122 13283 -52346 6328 9517 -79129 -164702 -140797 -29722
15301 -29722 31674 -99523 -123709 -112823 -100745 -200649 -205468 -148850 -239730 -105561 33948
15290 33948 11885 118871 26104 -71240 -217269 -397378 -435757 -383693 -274320 -139018 -99750
$$ packed form
15369A80809n9380j13328M100J9539Q312j05009Q3392P059m4252P9213j28785
15358f8330j56018K9771m8123L69R5541J1275m8710j8574n3611o3300m9342J85924
15346a83128K21877j82326q3882L0189j375M0418r8789P062M2422p6117k0106
15335c03755L9441l6983Q2085R6462n0507o7889q3470l4416J36651J6421o8642
15324b74602r1715O9773j5652N6120n3356J5873J11996Q6930L2011q5515M554
15313a43583N6709m159J3982P6929J3405o5629N8674L189q8646q5573K3905J11075
15301b9722O1396j31197k4186J0886J2078r9904m819N6618r0880J34169J39509
15290C3948k2063J06986r2767r7344j46029j80109l8379N2064J09373J35302L9268
$$ plain form
15279 -99750 -110377 -43131 -10257 -28203 -152737 -71549 -36221 -291 -71176 -33473 -20040
15268 -20040 -65766 -46290 -72272 13261 -66495 -122171 -206909 -261888 -215610 -165036 -148584 -186544
15256 -186544 -122494 -87687 -28496 -44005 -156558 -144577 -39667 10909 3143 71199 -13869
15245 -13869 -152187 -334477 -361731 -274585 -270274 -323032 -336922 -281201 -196287 -139270 -193273
15234 -193273 -197979 -160306 -244740 -345180 -246215 -229010 -292636 -176008 -20626 -84260 -140301
15223 -140301 -302492 -343000 -64819 108101 137594 48541 50638 -74137 -124967 -155953 -127444
15212 -127444 -176020 -173682 -109258 -143845 -175192 -184949 -204553 -222862 -156887 -42455 -128854 -78420
15200 -78420 -82855 -156804 -93410 -122825 -310108 -379539 -215088 -160121 -125686 -130941 -73568 -18871
$$ packed form
15279i9750j0627O7246L2874j7946j24534Q1188L5328L5930p0885L7703J3433
15268b0040m5726J9476k5982Q5533p9756n5676q4738n4979M6278N0574J6452l7960
15256a86544O4050L4807N9191j5509j12553J1981J04910N0576p766O8056q5068
15245a3869j38318j82290k7254Q7146M311n2758j3890N5721Q4914N7017n4003
15234a93273m706L7673q4434j00440R8965J7205o3626J16628J55382o3634n6041
15223a40301j62191m0508K78181J72920K9493q9053K097j24775n0830l0986K8509
15212a27444m8576K338O4424l4587l1347r757j9604j8309O5975J14432q6399N0434
15200g8420m435p3949O3394k9415j87283o9431J64451N4967L4435n255N7373N4697
$$ plain form
15188 -18871 36852 -44195 -11405 -37668 -73261 -27902 -152109 -100281 -130670 -61765 -122594
15177 -122594 -259224 -277430 -181763 -46052 -126952 -114278 -22579 18351 -30787 -47391 -8803
15166 -8803 10826 -83696 -17806 14425 -34581 -72160 -165854 -129872 -67568 -230339 -337167
15155 -337167 -303068 -140115 -15814 12510 -6766 23688 14908 -100336 -77655 -9074 52746
15144 52746 94377 152831 29262 -132228 -145127 -134764 -148284 -104914 -98367 -175807 -184426 -136520
15132 -136520 -55970 -29587 -23999 -15886 -152879 -195128 -298312 -201084 -135943 -172961 -134398
15121 -134398 32013 126149 131458 -27666 -153196 -28801 125930 143946 74713 -5229 60915
15110 60915 167116 122021 87744 -51217 -7670 -20379 3678 95692 111887 -130130 -215714
$$ packed form
15188a8871N5723q1047L2790k6263l5593M5359j24207N1828l0389O8905o0829
15177a22594j36630j8206R5667J35711q0900J2674R1699M0930m9138j6604L8588
15166h803J9629r4522O5890L2231m9006l7579r3694L5982O2304j62771j06828
15155c37167L4099J62953J24301K8324j9276L0454q780j15244K2681O8581O1820
15144E2746M1631N8454j23569j61490j2899J0363j3520M3370O547p7440q619M7906
15132a36520Q0550K6383N588Q113j36993m2249j03184R7228O5141l7018L8563
15121a34398J66411R4136N309j59124j25530J24395J54731J8016o9233p9942O6144
15110F0915J06201m5095l4277j38961M3547j2709K4057R2014J6195k42017q5584
$$ plain form
15099 -215714 -196279 -336013 -213917 -163293 -163300 -212402 -218509 -227784 -236737 -108333 -45600 -104448
15087 -104448 -18522 1056 81 27541 13211 -128315 -264009 -310680 -243002 -165416 -130101
15076 -130101 -52504 -95602 -98563 -62190 -78211 -110513 -221690 -186562 -123433 -108160 -205138
15065 -205138 -181600 -216847 -198318 -278070 -363659 -386248 -367312 -283865 -247756 -214856 -197403
15054 -197403 -176378 -213568 -215002 -191488 -189294 -98227 -263607 -378496 -297196 -169876 -84111
15043 -84111 -110952 -70042 -143938 -203125 -188373 -174456 -114219 -61534 -36520 -82105 -42118 -185923
15031 -185923 -274898 -255040 -73835 57405 11232 -16337 7766 -143327 -311308 -314644 -225163
15020 -225163 -163563 -239883 -374736 -333468 -111158 -27780 46152 99077 13457 -1323 -60662
$$ packed form
15099b15714J9435j39734J22096N0624pm9102o107r275q953J28404O2733n8848
15087a04448Q5926J9578r75K7460j4330j41526j35694m6671O7678P7586L5315
15076a30101P7597m3098k961L6373j6021l2302j11177L5128O3129J5273r6978
15065b05138K3538l5247J8529p9752q5589k2589J8936Q3447L6109L2900J7453
15054a97403K1025l7190j434K3514K194R1067j65380j14889Q1300J27320Q5765
15043h4111k6841M0910p3896n9187J4752J3917O0237N2685K5014m5585L9987j43805
15031a85923q8975J9858J81205J31240m6173k7569K4103j51093j67981l336Q9481
15020b25163O1600p6320j34853M1268K22310Q3378P3932N2925q5620j4780n9339
$$ plain form
15009 -60662 -81814 -135710 -147815 -123260 -76502 -188428 -202502 -175045 -237040 -70934 31582
14998 31582 -20170 76687 213073 298407 203005 219341 243428 229796 196770 105004 -11626
14987 -11626 -17928 48253 104813 134362 60845 -26086 -29874 4367 42946 93044 19536 -170473
14975 -170473 -275901 -283171 -208424 -99951 -50564 -66565 -139510 -267451 -263761 -221005 -122788
14964 -122788 -32486 -49037 -133151 -17222 33394 604 -45705 6175 199033 163717 -839
14953 -839 -76067 -130759 -62559 35347 61543 -48861 -61982 -60909 -103120 -32138 -102036 -205164
14941 -205164 -86082 2880 51375 75268 -2191 -86489 -180819 -258042 -155331 -62451 7268
14930 7268 -1615 2549 -31178 -42046 -63110 -146416 10730 133941 196554 117423 114290 2139
$$ packed form
15009f0662k1152n3896j2105K4555M6758j11926j4074K7457o1995J66106J02516
14998C1582n1752R6857J36386Q5334r5402J6336K4087j3632l3026r1766j16630
14987a1626o302O6181N6560K9549p3517q6931l788L4241L8579N0098p3508j90009
14975a70473j05428p270P4747J08473M9387j6001p2945j27941L690M2756R8217
14964a22788R0302j6551q4114J15929N0616l2790m6309N1880J92858l5316j64556
14953h39p5228n4692O8200R7906K6196j10404j3121J073m2211P0982o9898j03128
14941b05164J19082Q8962M8495K3893p7459q4298r4330p7223J02711R2880O9719
14930G268q883M164l3727j0868k1064q3306J57146J23211O2613p9131l133j12151
$$ plain form
14918 2139 118 122056 40956 -43144 -87946 -27648 16318 -42485 -9146 36064 -57583 -40308
14906 -40308 -53201 3725 142033 109919 11488 -129896 -115767 -163942 -129035 -191195 -212805
14895 -212805 -61765 16466 16237 57494 -9283 -55678 -44704 -81366 -141095 -147961 -174407 44493
14883 44493 82111 50913 124857 153520 -119003 -208063 -87787 77179 8260 -68742 -100846
14872 -100846 -52052 69995 103707 93540 -25208 -50178 -55696 -63482 -143932 -66553 -28113
14861 -28113 -30214 -28385 60393 -13377 -35685 107084 161072 77897 172522 101983 -2328 63646
14849 63646 -27592 -230792 -215131 -263967 -310002 -245762 -199947 -43870 -22792 -83528 44099
14838 44099 136055 119770 28058 -10806 -63042 -124930 -205067 -267451 -188708 -188354 -147462 -57085
$$ packed form
14918B139k021J21938q1100q4100m4802O0298M3966n8803L3339M5210r3647J7275
14906d0308j2893N6926J38308l2114r8431j41384J4129m8175L4907o2160k1610
14895b12805J51040P8231k29M1257o6777m6395J0974l6662n9729o866k6446K18900
14883D4493L7618l1198P3944K8663k72523q9060J20276J64966o8919p7002l2104
14872a00846M8794J22047L3712j0167j18748k4970n518p786q0450P7379L8440
14861b8113k101J829Q8778p3770k2308J42769N3988q3175R4625p0539j04311O5974
14849F3646r1238k03200J5661m8836m6035O4240M5815J56077K1078o0736J27627
14838D4099R1956j6285r1712l8864n2236o1888q0137o2384P8743L54M0892R0377
$$ plain form
14826 -57085 -184512 -105637 -109824 -155031 -73543 -6332 -14441 790 93440 42761 -21841 -33900
14814 -33900 16648 173231 82179 -17780 -65042 -116424 -119148 -156893 -115627 -5412 -35436
14803 -35436 20000 49478 -98837 -150456 -108660 12329 -18786 -245822 -321077 -350553 -275364
14792 -275364 -162592 -26832 -72635 -149536 -259393 -373332 -397918 -352091 -226771 -93278
14782 -93278 -60225 -81719 -83863 -95069 -71739 -176891 -199261 -200864 -268502 -281594 -267194 -245476
14770 -245476 -167767 -157371 -127372 -138445 -186783 -266474 -311059 -130449 2759 24371 24970
14759 24970 73556 -147008 -186254 -39005 20419 -13546 -103637 -103838 -90042 -137367 -94264 -32417
14747 -32417 -9501 58445 39233 14643 -129749 -243525 -200911 -192014 -206631 -196750 -72691
$$ packed form
14826e7085j27427P8875m187m5207Q1488O7211q109J5231R2650n0679o4602j2059
14814c3900N0548J56583r1052r9959m7262n1382k724l7745M1266J10215l0024
14803c5436N5436K9478j48315n1619M1796J20989l1115k27036p5255k9476P5189
14792b75364J12772J35760m5803p6901j09857j13939k4586M5827J25320J33493
14782i3278L3053k1494k144j1206K3330j05152k2370j603o7638j3092J4400K1718
14770b45476P7709J0396K9999j1073m8338p9691m4585J80610J33208K1612N99
14759B4970M8586k20564l9246J47249N9424l3965r0091k01J3796m7325M3103O1847
14747c2417K2916O7946j9212k4590j44392j13776M2614Q897j4617R881J24059
$$ plain form
14736 -72691 2916 -26977 -43962 25465 8430 -10512 -139220 -209464 -191325 -96512 -96016 2978
14724 2978 -89728 -119675 -147108 -77790 -42202 18543 136508 49552 -36443 -59327 -114439 -43452
14712 -43452 27748 5378 -36489 -60948 7738 23306 165296 189314 4852 -117035 -213911
14701 -213911 -222666 -194725 -120939 43811 49075 -159927 -138495 24206 15590 -19206 -4527
14690 -4527 18771 -101120 -102451 -28761 70666 120102 86872 14247 -104554 -67801 82130
14679 82130 -26824 -200269 -255918 -182910 -155645 -88105 1743 26872 46116 160430 137790
14668 137790 43527 -78143 -55303 -156695 -119493 13739 30292 71766 43239 -56335 -99325
14657 -99325 -95820 -88025 -36479 20658 51691 28939 131500 319821 452884 365942 100193
$$ packed form
14736g2691P5607k9893j6985O9427j7035j8942j28708p0244J8139R4813M96R8994
14724B978r2706k9947k7433O9318L5588O0745J17965q6956q5995k2884n5112P0987
14712d3452P1200k2370m1867k4459O8686J5568J41990K4018j84462j21887r6876
14701b13911q755K7941P3786J64750N264k09002K1432J62701q616l4796J4679
14690d527K3298j19891j331P3690R9427M9436l3230p2625j18801L6753J49931
14679H2130j08954j73445n5649P3008K7265O7540Q9848K5129J9244J14314k2640
14668A37790r4263j21670K2840j01392L7202J33232J6553M1474k8527r9574m2990
14657i9325L505P795N1546N7137L1033k2752J02561J88321J33063q6942k65749
$$ plain form
14646 100193 -34529 -67135 -82114 967 -27211 -31236 9644 71597 -25204 -130753 -100537
14635 -100537 21189 53862 -20622 -166567 -72612 -98973 -135748 -50112 -52827 -54513 -60475 -25862
14623 -25862 6985 -23021 77206 222033 76433 40655 117382 37961 -91520 -15899 55423
14612 55423 94621 8125 -47066 13186 -105931 -119748 83428 171819 216133 155843 113135
14601 113135 -63769 -108795 -109805 -71124 93858 88517 33748 -5486 -43957 64379 130874
14590 130874 191684 161918 -34894 -112456 41589 103453 166907 17780 -3905 195759 145350
14579 145350 -100702 -210478 -161241 -83294 -84876 17359 4904 -58824 -205077 -320553 -293637
14568 -293637 -202404 -141591 -60646 -62233 25479 26986 -1144 -82959 -88795 -199912 -278878 -188910
$$ packed form
14646A00193j34722l2606j4979Q3081k8178m025M0880O1953r6801j05549L0216
14635a00537J21726L2673p4484j45945R3955k6361l6775Q5636k715j686n962L4613
14623b5862L2847l0006J00227J44827j45600l5778P6727p9421j29481P5621P1322
14612E5423L9198q6496n5191O0252j19117j3817K03176Q8391M4314o0290m2708
14601A13135j76904m5026j010L8681J64982n341n4769l9234l8471J08336O6495
14590A30874O0810k9766j96812p7562J54045O1864O3454j49127k1685J99664n0409
14579A45350k46052j09776M9237P7947j582J02235j2455o3728j46253j15476K6916
14568b93637R1233O0813Q0945j587Q7712J507k8130q1815n836j11117p8966Q9968
$$ plain form
14556 -188910 -67852 -59142 -60890 -24387 -48398 -35977 11298 -12812 -96661 -84056 73198
14545 73198 176447 260689 36295 -155313 -83696 17829 -65206 -77837 -195336 -218076 -103310
14534 -103310 -152590 -80286 35612 98975 45811 -85236 -120646 -152796 -107830 -77221 -57838
14523 -57838 2900 -75241 -129763 -124748 -156591 -150360 -215148 -246261 -259293 -152378 -112025 -129215
14511 -129215 -256963 -287690 -195406 -173901 -148635 -24689 -1528 30169 27216 -114020 -152539
14500 -152539 -192488 -143290 -8699 13242 -883 -30875 -386 86666 52972 -31665 38103
14489 38103 2521 -49728 -37350 -95568 -20207 -11848 -77913 -111158 -207882 -150711 46385 121150
14477 121150 240702 273623 223361 115114 207764 435797 383917 185767 131989 233188
$$ packed form
14556a88910J21058Q710j748L6503k4011J2421M7275k4110q3849J2605J57254
14545G3198J03249Q4242k24394j91608P1617J01525q3035j2631j17499k2740J14766
14534a03310m9280P2304J15898O3363n3164j31047l5410l2150M4966L0609J9383
14523e7838O0738p8141n4522N015l1843O231o4788l1113j3032J06915M0353j7190
14511a29215j27748l0727R2284K1505K5266J23946K3161L1697k953j41236l8519
14500a52539l9949M9198J34591K1941j4125k9992L0489Q7052l3694q4637O9768
14489C8103l5582n2249J2378n8218P5361Q359o6065l3245r6724N7171J97096P4765
14477A21150J19552L2921n0262j08247R2650K28033n1880j98150n3778J01199
$$ plain form
14467 233188 245068 73468 6899 71241 96187 4437 109814 228805 243891 207605 263646
14456 263646 243769 159541 227002 206995 147967 111394 -146561 -231818 -162321 104514 238653
14445 238653 287785 255695 162117 73361 76176 93531 157338 170293 249080 267463 344287 217715
14433 217715 94951 150350 296399 264434 170395 61983 50693 37701 -41033 123128 189028
14422 189028 216800 241695 308587 190291 36838 172111 300660 310169 219224 197844 112315
14411 112315 108155 109365 154383 163293 47832 -127280 -153541 -123402 -105160 -839 -130012
14400 -130012 -191731 -188813 -94149 90402 115541 117435 36918 -80877 -101542 78357 134751
14389 134751 166952 31160 -53184 -37830 30833 139931 175362 114627 -52635 -111968 35183
$$ packed form
14467B33188J1880j71600o6569O4342K4946r1750J05377J18991J5086l6286N6041
14456B63646j9877q4228O7461k0007n9028l6573k57955q5257O9497K66835J34139
14445B38653M9132l2090r3578q8756K815J7355O3807J2955P8787J8383P6824j26572
14433B17715j22764N5399J46049l1965r4039j08412j1290j2992p8734J64161O5900
14422A89028K7772K4895O6892j18296j53453J35273J28549R509r0945k1380q5529
14411A12315m160J210M5018Q910j15461j75112k6261L0139J8242J04321j29173
14400a30012o1719K918R4664J84551K5139J894q0517j17795k0665J79899N6394
14389A34751L2201j35792q4344J5354O8663J09098L5431o0735j67262n9333J47151
$$ plain form
14378 35183 73763 152326 191474 186078 227832 253152 160881 44148 -87509 -112556 -34332
14367 -34332 9456 50181 -12287 -53794 26652 58010 10226 67967 157729 270585 304824
14356 304824 285515 229714 301821 241853 222174 210353 214210 158995 152899 165351 208783 164552
14344 164552 96986 113163 180600 337919 259914 241966 161709 156947 371095 301145 241810
14333 241810 149068 117758 213712 183643 66228 70898 52318 121969 154574 104743 150900
14322 150900 117819 137898 196541 209899 219681 306855 281343 339717 292996 205843 130468 249528
14310 249528 259029 116649 106297 196645 148728 28361 107056 176587 177756 155096 186945
14299 186945 252246 412040 430689 290339 233351 383580 425607 385641 361786 293027 308530
$$ packed form
14378C5183L8580P8563L9148n396M1754K5320r2271j16733j31657k5047P8224
14367c4332M3788M0725o2468m1507Q0446L1358m7784N7741Q9762J12856L4239
14356C04824j9309n5801P2107n9968j9679j1821L857n5215o096J2452M3432m4231
14344A64552o7566J6177O7437J57319p8005j7948q0257m762K14148o9950n9335
14333B41810r2742l1310R5954l0069j17415M670j8580O9651L2605m9831M6157
14322A50900l3081K0079N8643J3358R782Q7174k5512N8374m6721q7153p5375J19060
14310B49528R501j42380j0352R0348m7917j20367P8695O9531J169k2660L1849
14299A86945O5301J59794J8649j40350n6988J50229M2027l9966k3855o8759J5503
$$ plain form
14288 308530 360675 250771 323290 329911 259087 150187 232921 221585 166180 198869 391769
14277 391769 448164 321264 229974 250355 345773 249578 267993 227217 189118 207211 193230
14266 193230 148991 104401 2407 145010 282203 314468 279657 247323 262818 350886 369442
14255 369442 276864 289478 294822 266033 255891 228600 224466 210087 252059 263694 208522 175173
14243 175173 315789 376363 429484 527947 426247 264833 153192 277987 458909 547521
14233 547521 587182 636094 517923 418393 369864 347848 462147 560038 584316 562452 496628
14222 496628 403894 406179 341288 346705 432661 441033 412978 382110 460066 375920 251588 192741
14210 192741 217142 302435 347531 320198 293616 214786 143656 195569 161058 250783 299599
$$ packed form
14288C08530N2145j09904P2519O621p0824j08900Q2734j1336n5405L2689J92900
14277C91769N6395j26900r1290K0381R5418r6195J8415m0776l8099J8093j3981
14266A93230m4239m4590j01994J42603J37193L2265l4811l2334J5495Q8068J8556
14255C69442r2578J2614N344k8789j0142k7291m134j4379M1972J1635n5172l3349
14243A75173J40616O0574N3121R8463j01700j61414j11641J24795J80922Q8612
14233E47521L9661M8912j18171r9530m8529k2016J14299R7891K4278k1864o5824
14222D96628r2734K285o4891N417Q5956Q372k8055l0868P7956q4146j24332n8847
14210A92741K4401Q5293M5096k7333k6582p8830p1130N1913l4511Q9725M8816
$$ plain form
14199 299599 359341 346233 350672 380862 330718 339539 374592 445277 468520 466128 468276 548446
14187 548446 560736 518251 405781 499237 587591 597996 666598 587452 558409 610396 543887
14176 543887 421398 479994 429080 400767 475378 517361 704432 689190 651858 722915 621651
14165 621651 428549 309094 331757 526128 590719 597555 531491 487932 526912 499680 507041
14154 507041 448146 553780 576226 523336 608952 659921 700924 564622 446820 405089 301103
14143 301103 348448 360749 440023 417386 361602 358820 296145 364978 518602 573424 571825 479920
14131 479920 400068 529146 545330 461407 268324 315003 567384 510809 511762 553270 606211
14120 606211 576075 540534 633114 640163 650688 686686 525127 569501 714455 693845 579041
$$ packed form
14199B99599N9742j3108M439L0190n0144Q821L5053P0685K3243k392K148Q0170
14187E48446J2290m2485j12470R3456Q8354J0405O8602p9146k9043N1987o6509
14176E43887j22489N8596n0914k8313P4611M1983J87071j5242l7332P1057j01264
14165F21651j93102j19455K2663J94371O4591O836o6064m3559L8980k7232P361
14154E07041n8895J05634K2446n2890Q5616N0969M1003j36302j17802m1731j03986
14143C01103M7345J2301P9274k2637n5784k782o2675O8833J53624N4822j599r1905
14131D79920p9852J29078J6184q3923j93083M6679K52381n6575R53M1508N2941
14120F06211l0136l5541R2580P049J0525L5998j61559M4374J44954k0610j14804
$$ plain form
14109 579041 661117 740861 709846 657201 733080 849598 765165 651792 664230 649321 658871
14098 658871 628623 583802 600978 655682 612247 686243 731993 813504 875098 975303 907266
14087 907266 886060 840831 853002 893232 917731 891749 744155 786820 893981 958111 957492
14076 957492 885732 803154 894638 1012912 1055747 1037328 1022533 998892 1025905 1039673 1012318
14065 1012318 922007 943770 970416 1032433 1001232 1058655 1114211 1106566 1060212 953155 973969
14054 973969 1115884 1210891 1051138 880408 815009 929283 1057362 1045074 1079365 1096816
14044 1096816 1155300 1076193 1097683 1117198 1145375 1034592 1049398 1078739 1259500 1278038 1195547
14033 1195547 1260350 1254504 1190633 1100638 1052713 1130596 1171592 1270265 1197519 1149578 1324401
$$ packed form
14109E79041Q2076P9744l1015n2645P5879J16518q4433j13373J2438j4909R550
14098F58871l0248m4821J7176N4704m3435P3996M5750Q1511O1594J00205o8037
14087I07266k1206m5229J2171M0230K4499k5982j47594M2665J07161O4130o19
14076I57492p1760q2578R1484J18274M2835j8419j4795k3641K7013J3768k7355
14065A012318r0311K1763K6646O2017l1201N7423N5556p645m6354j07057K0814
14054I73969J41915R5007j59753j70730o5399J14274J28079j2288L4291J7451
14044A096816N8484p9107K1490J9515K8177j10783J4806K9341J80761J8538q2491
14033A195547O4803n846o3871q9995m7925P7883M0996R8673p2746m7941J74823
$$ plain form
14022 1324401 1514109 1568207 1584292 1468194 1465085 1508864 1470555 1338499 1313364 1320512 1279238
14011 1279238 1246036 1299230 1286533 1276399 1287659 1351781 1401495 1417234 1408606 1599727 1695292
14000 1695292 1744556 1766126 1836901 1861288 1906385 2010685 2046367 2050223 2037276 2104962 2182361
13989 2182361 2153198 2268216 2217308 2196330 2245330 2185888 2117237 2033986 1932932 1883034 1883609
13978 1883609 1828656 1979199 2047558 1910479 1934154 2069148 2141868 2039067 2076626 2120744
13968 2120744 2221857 2215702 2164766 2129591 2161824 2326431 2527601 2503026 2460965 2364317 2344499
13957 2344499 2344228 2366042 2370993 2475940 2425847 2442730 2490495 2480986 2445272 2452307 2356433 2271927
13945 2271927 2347918 2321052 2324087 2307922 2317490 2249033 2419803 2568280 2622638 2586081 2589020
$$ packed form
14022A324401J89708N4098J6085j16098l109M3779l8309j32056k5135P148m1274
14011A279238l3202N3194j2697j0134J1260O4122M9714J5739q628J91121R5565
14000A695292M9264K1570P0775K4387M5097J04300L5682L856j2947O7686P7399
13989B182361k9163J15018n0908k0978M9000n9442o8651q3251j01054m9898N75
13978A883609n4953J50543O8359j37079K3675J34994P2720j02801L7559M4118
13968B120744J01113o155n0936l5175L2233J64607K01170k4575m2061r6648j9818
13957B344499k71K1814M951J04947n0093J6883M7765r509l5714P035r5874q4506
13945B271927P5991k6866L035j6165R568o8457J70770J48477N4358l6557K939
$$ plain form
13934 2589020 2472409 2563640 2581863 2563448 2592081 2568339 2610568 2828511 2899088 2925818 2914837
13923 2914837 2932772 3011977 3049677 3013556 3005126 3048899 3180697 3137424 2964822 3039598 3149961
13912 3149961 3303600 3356935 3412288 3412045 3355741 3351963 3380891 3488033 3553634 3587222 3515802
13901 3515802 3389922 3480557 3553365 3543119 3661988 3771059 3761567 3652561 3620868 3729541
13891 3729541 3898610 3929845 3835765 3807701 3904481 4003605 4089191 4202997 4210076 4159701 4192262
13880 4192262 4391198 4328688 4376915 4577608 4744851 4815279 4906818 4948414 4972447 4971789 5054839
13869 5054839 5108361 5218338 5258221 5368637 5323664 5409251 5501576 5488711 5437258 5676186 5695323
13858 5695323 5680940 5823954 5905851 5911009 5987431 6161829 6166171 6206185 6293240 6352394 6502386
$$ packed form
13934B589020j16611R1231J8223j8415K8633k3742M2229K17943P0577K6730j0981
13923B914837J7935P9205L7700l6121q430M3773J31798m3273j72602P4776J10363
13912C149961J53639N3335N5353k43n6304l778K8928J07142O5601L3588p1420
13901C515802j25880R0635P2808j0246J18869J09071r492j09006l1693J08673
13891C729541J69069L1235r4080k8064R6780R9124Q5586J13806P079n0375L2561
13880D192262J98936o2510M8227K00693J67243P0428R1539M1596K4033o58Q3050
13869E054839N3522J09977L9883J10416m4973Q5587R2325j2865n1453K38928J9137
13858E695323j4383J43014Q1897N158P6422J74398M342M0014Q7055N9154J49992
$$ plain form
13847 6502386 6654771 6726609 6915360 7026124 7098251 7416101 7444272 7514514 7625848 7813809
13837 7813809 7766697 7776485 7932076 7989247 7995634 8059052 8180641 8529131 8791167 8902624 8968402
13826 8968402 9135011 9157599 9271579 9548945 9687966 9888443 10015330 10342111 10548246 10722342
13816 10722342 11045130 11224543 11405944 11459675 11468419 11636930 11820272 12067767 12392614 12571812
13806 12571812 12818328 13014827 13137774 13417016 13721166 13956832 14216548 14368840 14592779
13797 14592779 14853334 15276591 15742542 15969081 16218261 16506743 16958603 17344804 17831281
13788 17831281 18201877 18401366 18685482 19013711 19526948 19976153 20394249 20816920 21323138
13779 21323138 21789236 22367466 22916524 23414967 23890876 24626656 25309894 25891207 26410252
$$ packed form
13847F502386J52385P1838J88751J10764P2127L17850K8171P0242J11334J87961
13837G813809m7112R788J55591N7171O387O3418J21589L48490K62036J11457O5778
13826H968402J66609K2588J13980K77366J39021K00477J26887L26781K06135J74096
13816A0722342L22788J79413J81401N3731Q744J68511J83342K47495L24847J79198
13806A2571812K46516J96499J22947K79242L04150K35666K59716J52292K23939
13797A4592779K60555M23257M65951K26539K49180K88482M51860L86201M86477
13788A7831281L70596J99489K84116L28229N13237M49205M18096M22671N06218
13779B1323138M66098N78230N49058M98443M75909P35780O83238N81313N19045
$$ plain form
13770 26410252 27150060 27805998 28351389 29021998 29778430 30399680 31276824 32142068 33022916
13761 33022916 33930377 34750098 35611298 36556881 37448047 38452855 39619025 40727239 41768181
13752 41768181 42910117 43960845 45040648 46303950 47503210 48725356 50036052 51384375
13744 51384375 52788048 54194169 55635704 57118998 58546455 60073842 61703921 63192307
13736 63192307 64710667 66327785 67906295 69457664 70952694 72474535 73978056 75568750
13728 75568750 77174345 78553548 79936291 81369470 82674367 84004484 85279015 86333895
13720 86333895 87558530 88509758 89361033 90296014 91109361 91617244 92129626 92649456 92947220
13711 92947220 93300585 93522160 93615152 93526892 93222137 92902427 92721051 92325455 91834971 91300210
$$ packed form
13770B6410252P39808O55938N45391O70609P56432O21250Q77144Q65244Q80848
13761C3022916R07461Q19721Q61200R45583Q91166J004808J166170J108214J040942
13752D1768181J141936J050728J079803J263302J199260J222146J310696J348323
13744E1384375J403673J406121J441535J483294J427457J527387J630079J488386
13736F3192307J518360J617118J578510J551369J495030J521841J503521J590694
13728G5568750J605595J379203J382743J433179J304897J330117J274531J054880
13720H6333895J224635R51228Q51275R34981Q13347N07883N12382N19830K97764
13711I2947220L53365K21575R2992q8260l04755l19710j81376l95596m90484n34761
$$ plain form
13701 91300210 90739262 90052376 89216552 88361344 87489083 86580049 85706971 84873499 83773721
13692 83773721 82663762 81665128 80743578 79671858 78506328 77228914 75959848 74736290
13684 74736290 73461729 72262060 71121770 69898421 68905394 67703241 66495668 65376080
13676 65376080 64141145 62902133 61692467 60534721 59625829 58469621 57297123 56199556
13668 56199556 55048729 54082651 53093465 52237412 51337437 50344074 49437277 48472921 47501997
13659 47501997 46637969 45658385 44598437 43716084 42939233 42200130 41508748 40790080 39974583
13650 39974583 39235632 38389199 37548097 36908324 36218787 35408892 34753239 34113019 33637865
13641 33637865 33108849 32475063 31910990 31338320 30827568 30304036 29773715 29302096 28799095
$$ packed form
13701I1300210n60948o86886q35824q55208q72261r09034q73078q33472j099778
13692H3773721j109959r98634r21550j071720j165530j277414j269066j223558
13684G4736290j274561j199669j140290j223349r93027j202153j207573j119588
13676F5376080j234935j239012j209666j157746r08892j156208j172498j097567
13668E6199556j150827r66078r89186q56053q99975r93363r06797r64356r70924
13659D7501997q64028r79584j059948q82353p76851p39103o91382p18668q15497
13650C9974583p38951q46433q41102o39773o89537q09895o55653o40220m75154
13641C3637865n29016o33786n64073n72670n10752n23532n30321m71619n03001
$$ plain form
13632 28799095 28155911 27641756 27225221 26809041 26312966 25976159 25528261 25039107 24685609
13623 24685609 24318524 23872078 23379586 22934262 22571761 22144042 21903081 21488781 21120011
13614 21120011 20699865 20408847 19897199 19496356 19193189 19066251 18883960 18586066 18289004
13605 18289004 17926397 17748380 17504142 17346868 17062055 16892502 16652113 16310552 16013250
13596 16013250 15733318 15350842 15152632 15056528 14860656 14534131 14301335 14282299 14061883 13689180
13586 13689180 13417059 13271155 13169889 13007085 12776637 12546069 12241251 11880485 11790003
13577 11790003 11626220 11423979 11296872 11195740 11098985 10990604 10882333 10921299 10779527 10537294
13567 10537294 10403237 10363523 10097862 9887095 9790551 9699846 9597493 9437948 9205799 9056941
$$ packed form
13632B8799095o43184n14155m16535m16180m96075l36807m47898m89154l53498
13623B4685609l67085m46446m92492m45324l62501m27719k40961m14300l68770
13614B1120011m20146k91018n11648m00843l03167j26938j82291k97894k97062
13605A8289004l62607j78017k44238j57274k84813j69553k40389l41561k97302
13596A6013250k79932l82476j98210r6104j95872l26525k32796j9036k20416l72703
13586A3689180k72121j45904j01266j62804k30448k30568l04818l60766r0482
13577A1790003j63783k02241j27107j01132r6755j08381j08271L8966j41772k42233
13567A0537294j34057l9714k65661k10767r6544r0705j02353j59545k32149j48858
$$ plain form
13557 9056941 8784364 8648183 8502651 8407829 8339678 8399601 8501549 8459788 8305161 8045504
13547 8045504 7855739 7720940 7497387 7366260 7388644 7333040 7173629 6930190 6952347 6901356
13537 6901356 6834740 6765396 6630106 6631372 6521743 6383045 6372856 6423210 6354225 6262912 6153232
13526 6153232 6049886 5964758 5950673 5783311 5660864 5592481 5411781 5335396 5415765 5343205
13516 5343205 5274030 5201223 5176850 5223811 5247041 5026287 4811816 4888727 4838139 4642577 4728590
13505 4728590 4758541 4889689 4801658 4704867 4692203 4593571 4506916 4445934 4535113 4378861 4224407
13494 4224407 4189217 4237508 4253738 4227933 4217577 4164742 4125431 4069147 4006491 3871019 3806747
13483 3806747 3786890 3724204 3790922 3845111 3791412 3696871 3680955 3620202 3541851 3499367 3399257
$$ packed form
13557I056941k72577j36181j45532r4822o8151N9923J01948m1761j54627k59657
13547H045504j89765j34799k23553j31127K2384n5604j59411k43439K2157n0991
13537F901356o6616o9344j35290J266j09629j38698j0189N0354o8985r1313j09680
13526F153232j03346q5128j4085j67362j22447o8383j80700p6385Q0369p2560
13516E343205o9175p2807k4373M6961K3230k20754k14471P6911n0588j95562Q6013
13505D728590K9951J31148q8031r6791j2664r8632q6655o0982Q9179j56252j54454
13494D224407l5190M8291J6230k5805j0356n2835l9311n6284o2656j35472o4272
13483C806747j9857o2686O6718N4189n3699r4541j5916o0753p8351m2484j00110
$$ plain form
13472 3399257 3448731 3521146 3391850 3459947 3412826 3235145 3190019 3190991 3312344 3353422 3250370
13461 3250370 3194801 3062556 3048549 2972887 2997209 3022363 3057441 3066367 3144734 3161157 3241711
13450 3241711 3179425 3097269 3049747 3000065 2957727 2908334 2813478 2835256 2964550 3154157 3188824
13439 3188824 3345255 3443727 3422187 3458511 3387076 3265464 3351037 3254586 2962609 2863146 2888567
13428 2888567 2707028 2661078 2482785 2435217 2477180 2511799 2599359 2468762 2433692 2357429 2387325
13417 2387325 2457533 2388676 2204434 2190950 2288923 2353824 2262889 2291040 2313260 2248273 2277305
13406 2277305 2259939 2093334 2011223 1916587 1988019 2012215 1948017 1980617 2008439 1929797 1783549
13395 1783549 1869116 1914211 1931194 1896621 1721511 1564010 1683897 1901261 1824475 1782965
$$ packed form
13472C399257M9474P2415j29296O8097m7121j77681m5126R72J21353M1078j03052
13461C250370n5569j32245j4007p5662K4322K5154L5078Q926P8367J6423Q0554
13450C241711o2286q2156m7522m9682m2338m9393r4856K1778J29294J89607L4667
13439C188824J56431R8472k1540L6324p1435j21612Q5573r6451k91977r9463K5421
13428B888567j81539m5950j78293m7568M1963L4619Q7560j30597l5070p6263K9896
13417B387325P0208o8857j84242j3484R7973O4901r0935K8151K2220o4987K9032
13406B277305j7366j66605q2111r4636P1432K4196o4198L2600K7822p8642j46248
13395A783549Q5567M5095J6983l4573j75110j57501J19887K17364p6786m1510
$$ plain form
13385 1782965 1884942 1909555 1846370 1767738 1887643 1804608 1744283 1716635 1755670 1830789 1784233
13374 1784233 1766349 1588684 1476595 1428325 1471876 1484117 1614951 1638470 1672475 1665275 1652267
13363 1652267 1651909 1512642 1480780 1565291 1541712 1508713 1458578 1404031 1228233 1200769 1234541
13352 1234541 1289867 1216191 1029250 947511 1064554 1108130 1138767 1247391 1349490 1313423
13342 1313423 1114850 1081667 1096023 1060834 1188812 1231113 1203944 1174280 1059562 908306
13332 908306 941879 1127610 1154469 1136919 1111663 1125941 1202864 1259533 1183552 1105652 1063050
13321 1063050 910570 1023249 1067508 1101731 1091196 1125543 1056119 1057733 1030566 1031708 1061580
13310 1061580 1160540 1278490 1218581 1039661 1203815 1258444 1264059 1311142 1042586 990275 1045435
$$ packed form
13385A782965J01977K4613o3185p8632J19905q3035o0325k7648L9035P5119m6556
13374A784233j7884j77665j12089m8270M3551J2241J30834K3519L4005p200j3008
13363A652267l58j39267l1862Q4511k3579l2999n0135n4547j75798k7464L3772
13352A234541N5326p3676j86941q1739J17043M3576L0637J08624J02099l6067
13342A313423j98573l3183J4356l5189J27978M2301k7169k9664j14718j51256
13332I08306L3573J85731K6859j7550k5256J4278P6923N6669p5981p7900m2602
13321A063050j52480J12679M4259L4223j0535L4347o9424J614k7167J142K9872
13310A061580R8960J17950n9909j78920J64154N4629N615M7083k68556n2311N5160
$$ plain form
13299 1045435 966036 953117 957754 1067935 1102937 1070113 988205 931541 846924 846428 903497 817562
13287 817562 715768 776799 846671 867157 809408 903807 879709 778706 818999 856854 834121
13276 834121 716706 752181 757856 813952 762397 738185 735818 621684 626214 650080 666782 647982
13264 647982 830620 817151 707359 635610 598654 811745 846264 836534 787912 801273 749519
13253 749519 682044 659649 679287 655311 681730 698547 753286 789887 779088 687815 599450
13242 599450 622937 693842 694706 664082 613212 543071 518382 636756 700252 664897 602459 558865
13230 558865 527964 633308 842755 834370 849470 862514 871226 797496 739646 828353 651092
13219 651092 708186 696836 583100 554171 602918 519382 518283 436011 436276 453476 404656 333567
$$ packed form
13299A045435p9399j2919M637J10181L5002l2824q1908n6664q4617m96N7069q5935
13287H17562j01794O1031O9872K0486n7749R4399k4098j01003M0293L7855k2733
13276H34121j17415L5475N675N6096n1555k4212k367j14134M530K3866J6702j8800
13264F47982J82638j3469j09792p1749l6956K13091L4519r730m8622J3361n1754
13253G49519o7475k2395J9638k3976K6419J6817N4739L6601j0799r1273q8365
13242E99450K3487P0905Q64l0624n0870p0141k4689J18374O3496l5355o2438m3594
13230E58865l0901J05344K09447q385J5100J3044Q712p3730n7850Q8707j77261
13219F51092N7094j1350j13736k8929M8747q3536j099q2272K65J7200m8820p1089
$$ plain form
13207 333567 460478 536506 685503 802732 677879 477000 504584 514441 443141 451584 516321
13196 516321 530781 514831 382670 377754 392290 439955 355699 527783 564733 504912 553298
13185 553298 489948 623868 642683 559255 511681 445950 359319 426833 541082 662521 610243
13174 610243 599307 568886 530783 382499 373572 457304 479021 420443 499340 589204 608245
13163 608245 650794 615141 629884 568666 537239 576103 481636 377032 300429 436811 500034
13152 500034 423235 365885 373805 593301 673857 596015 556637 484106 410706 480118 468860
13141 468860 338140 316434 400959 467472 418699 272916 279834 423877 503188 532295 562032
13130 562032 592307 662506 620084 536952 541436 458433 310852 267663 306906 487296 457369
$$ packed form
13207C33567J26911P6028J48997J17229j24853k00879K7584R857p1300Q443O4737
13196E16321J4460j5950j32161m916J4536M7665q4256J72084L6950n9821M8386
13185E53298o3350J33920J8815q3428m7574o5731q6631O7514J14249J21439n2278
13174F10243j0936l0421l8103j48284q927Q3732K1717n8578P8897Q9864J9041
13163F08245M2549l5653J4743o1218l1427L8864r4467j04604p6603J36382O3223
13152E00034p6799n7350P920K19496Q0556p7842l9378p2531p3400O9412j1258
13141D68860j30720k1706Q4525O6513m8773j45783O918J44043P9311K9107K9737
13130E62032L0275P0199m2422q3132M484q3003j47581m3189L9243J80390k9927
$$ plain form
13119 457369 529858 490765 471658 382312 314248 298545 169176 93782 100106 55721 22652
13108 22652 168079 246773 255062 230971 139586 62606 129575 383655 508132 519993 455862
13097 455862 404001 480034 517794 485683 569591 505639 302430 228468 146470 186610 206009
13086 206009 307111 403816 500762 504773 372931 261938 313659 364042 154902 61783 206009
13075 206009 130802 120124 126156 142873 238929 169906 91287 151869 229750 312165 286450 230320
13063 230320 300221 407199 407205 377869 415745 381239 324623 344459 416124 291805 182053 164464
13051 164464 230178 267668 228923 110447 84159 228314 293569 336726 370966 321901 283191
13040 283191 328524 453565 476068 360061 186887 163543 241936 219188 233686 238047 257129
$$ packed form
13119D57369P2489l9093j9107q9346o8064j5703j29369p5394O324m4385l3069
13108B2652J45427P8694Q289k4091r1385p6980O6969K54080J24477J1861o4131
13097D55862n1861P6033L7760l2111Q3908o3952k03209p3962q1998M0140J9399
13086B06009J01102R6705R6946M011j31842j10993N1721N0383k09140r3119J44226
13075B06009p5207j0678O032J6717R6056o9023p8619O0582P7881Q2415k5715n6130
13063B30320O9901J06978Ok9336L7876l4506n6616J9836P1665j24319j09752j7589
13051A64464O5714L7490l8745j18476k6288J44155O5255M3157L4240m9065l8710
13040B83191M5333J25041K2503j16007j73174k3344P8393k2748J4498M361J9082
$$ plain form
13029 257129 303832 254058 310291 408716 508851 390405 365686 371441 313112 186388 105583
13018 105583 142092 279583 285486 192969 105156 261676 444385 382849 422733 302251 99536
13007 99536 142849 290229 366045 343777 282973 209872 34833 -49088 -55254 30158 171023
12996 171023 272530 402482 486368 410462 337946 350023 262725 127269 243848 417204
12986 417204 512445 373803 302519 334528 235423 147234 273970 231127 184263 -3546 -48554
12975 -48554 87521 245653 256348 250907 307156 237533 171974 97397 84606 205134 292353
12964 292353 301128 247076 171716 21612 37840 210069 217816 274105 175202 -21916 57270
12953 57270 183590 216071 173505 187988 248036 101590 -139019 -146113 37781 217528 40638
$$ packed form
13029B57129M6703m9774N6233R8425J00135j18446k4719N755n8329j26724q0805
13018A05583L6509J37491N903r2517q7813J56520J82709o1536L9884j20482k02715
13007I9536M3313J47380P5816k2268o0804p3101j75039q3921o166Q5412J40865
12996A71023J01507J29952Q3886p5906p2516J2077q7298j35456J16579J73356
12986D17204R5241j38642p1284L2009r9105q8189J26736m2843m6864j87809m5008
12975d8554J36075J58132J0695n441N6249o9623o5559p4577j2791J20528Q7219
12964B92353Q775n4052p5360j50104J6228J72229P747N6289r8903j97118P9186
12953E7270J26320L2481m2566J4483O0048j46446k40609p094J83894J79747j76890
$$ plain form
12942 40638 -56874 28981 173782 216580 196136 233588 249512 252287 291847 203016 -4723
12931 -4723 -52734 88331 63504 128639 208317 16676 31214 87165 235908 293359 271546
12920 271546 126735 104577 173257 222445 210930 291780 333411 368351 346831 382493 388308
12909 388308 382163 353634 431105 440619 397092 349124 454570 530536 431926 362469 316003 232642
12897 232642 153310 -47121 -61734 -131294 -96499 -20771 118660 118763 233494 345372 131388
12886 131388 -46834 -3933 49740 -25493 -94913 -70609 -163467 -162306 -8133 -19096 43894
12875 43894 -28479 -74867 3998 187782 204602 139581 150666 -706 -114756 -52839 -104893
12864 -104893 -46089 115245 170705 84660 216720 252655 259273 205864 185671 120442 -46323
$$ packed form
12942D0638r7512Q5855J44801M2798k0444L7452J5924K775L9560q8831k07739
12931d723m8011J41065k4827O5135P9678j91641J4538N5951J48743N7451k1813
12920B71546j44811k2158O8680M9188j1515Q0850M1631L4940k1520L5662N815
12909C88308o145k8529P7471R514m3527m7968J05446P5966r8610o9457m6466q3361
12897B32642p9332k00431j4613o9560L4795P5728J39431J03J14731J11878k13984
12886A31388j78222M2901N3673p5233o9420K4304r2858J161J54173j0963O2990
12875D3894p2373m6388P8865J83784J6820o5021J1085j51372j14050O1917n2054
12864a04893N8804J61334N5460q6045J32060L5935O618n3409k0193o5229j66765
$$ plain form
12853 -46323 51878 104104 248194 304468 221403 218493 260323 286887 264083 304522 201687
12842 201687 88608 79463 38133 -8289 139880 157352 122495 90169 124764 207222 29955
12831 29955 -235026 -251776 -166993 -173587 -161865 -284033 -228789 -91046 -101796 -132003 -116114
12820 -116114 21139 69098 77776 111833 192028 87827 60817 113073 169036 224215 227549
12809 227549 283587 235195 123809 133314 135753 8981 -28756 24338 86026 111177 38930
12798 38930 -76263 -75737 40542 29875 -118244 -115652 -19376 137154 266856 141129 -4263
12787 -4263 37091 98034 50691 106970 189881 66068 -932 -90891 -143939 -173767 -119303 25830
12775 25830 67390 39342 133074 243350 290402 351987 241294 172751 63262 19190 39797
$$ packed form
12853d6323R8201N2226J44090N6274q3065k910M1830K6564k2804M0439j02835
12842B01687j13079r145m1330m6422J48169J7472l4857l2326L4595Q2458j77267
12831B9955k64981j6750Q4783o594J1722j22168N5244J37743j0750l0207J5889
12820a16114J37253M7959Q678L4057Q0195j04201k7010N2256N5963N5179L334
12809B27549N6038m8392j11386R505K439j26772l7737N3094O1688K5151p2247
12798C8930j15193N26J16279j0667j48119K592R6276J56530J29702j25727j45392
12787d263M1354O0943m7343N6279Q2911j23813o7000q9959n3048k9828N4464J45133
12775B5830M1560k8048R3732J10276M7052O1585j10693o8543j09489m4072K0607
$$ plain form
12764 39797 72318 96696 98050 64019 55194 143065 133046 -22670 -41337 75995 -13336 -1492
12752 -1492 131712 263394 182736 188338 208293 147447 -53255 -181645 -195940 -144436 -63826
12741 -63826 -78359 -137082 -104810 -82094 -207006 -254304 -218491 -180440 -37562 108879 40302
12730 40302 14663 28028 -68515 -106626 26753 86241 -47245 -160154 -62931 -74732 -11155
12719 -11155 -21279 4425 126164 143699 146712 103001 211446 212328 213042 138407 -14784 37744
12707 37744 164278 203604 135061 91829 113985 75332 167907 181307 148600 98197 94872 23859
12695 23859 -51641 -94695 -103832 -153454 -94689 -20558 -69953 -18217 82487 74371 47293 -58879
12683 -58879 14257 52128 54545 -45286 -88311 -71224 -6281 10396 34915 25455 73543 134723
$$ packed form
12764C9797L2521K4378J354l4031q825Q7871j0019j55716j8667J17332q9331J1844
12752a492J33204J31682q0658N602J9955o0846k00702j28390j4295N1504Q0610
12741f3826j4533n8723L2272K2716j24912m7298L5813L8051J42878J46441o8577
12730D0302k5639J3365r6543l8111J33379N9488j33486j12909R7223j1801O3577
12719a1155j0124K5704J21739J7535L013m3711J08445Q82P14p4635j53191N2528
12707C7744J26534L9326o8543m3232K2156l8653R2575J3400l2707n0403l325p1013
12695B3859p5500m3054r137m9622N8765P4131m9395N1736J00704q116k7078j06172
12683e8879P3136L7871K417r9831m3025J7087O4943J6677K4519r460M8088O1180
$$ plain form
12671 134723 146932 216103 280465 281334 260315 216499 207598 -29410 -122316 -92728 38549 102917
12659 102917 179424 304792 413389 446777 278013 115649 185976 268029 301024 274392 201078
12648 201078 16115 -165690 -71170 25912 99470 281543 283994 261417 217419 171871 235794
12637 235794 196838 134724 -40056 -2502 120516 144091 179581 163110 141684 195706 123046
12626 123046 134885 174613 57889 -37847 -182386 -124780 -13064 80202 136944 56405 -50966
12615 -50966 -100742 -50417 -57477 -36653 38463 9314 56900 55015 127036 182650 143657 68183
12603 68183 81337 47283 74242 1934 -13444 -82748 -86622 -140082 -158701 -157528 -97515 -145118
12591 -145118 -278170 -232779 -208111 -336643 -296126 -170357 -82569 -84999 48236 109802 181037
$$ packed form
12671A34723J2209O9171O4362Q69k1019m3816q901k37008r2906K9588J31277O4368
12659A02917P6507J25368J08597L3388j68764j62364P0327Q2053L2995k6632p3314
12648B01078j84963j81805R4520R7082P3558J82073K451k2577m3998m5548O3923
12637B35794l8956o2114j74780L7554J23018K3575L5490j6471k1426N4022p2660
12626A23046J1839L9728j16724r5736j44539N7606J11716R3266N6742q0539j07371
12615e0966m9776N0325p060K0824P5116k9149M7586j885P2021N5614l8993p5474
12603F8183J3154l4054K6959p2308j5378o9304l874n3460j8619J173O0013m7603
12591a45118j33052M5391K4668j28532M0517J25769Q7788k430J33235O1566P1235
$$ plain form
12580 181037 212219 201810 107950 1428 -33977 -22237 131999 175587 123754 63026 -10465
12569 -10465 -62624 36380 92407 184445 110532 16894 80494 140590 210689 143897 64204 147180
12557 147180 180294 130634 36012 42849 192807 196479 108693 235356 370030 412310 329636
12546 329636 324513 424731 561480 673905 672283 736877 622731 538705 591405 698977 786796
12535 786796 995599 1126188 1224649 1393433 1563919 1738151 1840619 2062425 2307484 2611090
12525 2611090 2996924 3759539 4671129 5653948 7034802 8771535 10790558 13090995 15680920
12516 15680920 18422132 20898351 22860847 24085946 24150741 23043553 20906193 18301998
12508 18301998 15533963 12921797 10747224 9116958 7906973 7147567 6935273 6761415
$$ packed form
12580A81037L1182j0409r3860j06522l5405J1740J54236M3588n1833o0728p3491
12569a0465n2159R9004N6027R2038p3913r3638O3600O0096P0099o6792p9693Q2976
12557A47180L3114m9660r4622O837J49958L672q7786J26663J34674M2280q2674
12546C29636n123J00218J36749J12425j622O4594j14146q4026N2700J07572Q7819
12535G86796K08803J30589R8461J68784J70486J74232J02468K21806K45059L03606
12525B611090L85834P62615R11590R82819J380854J736733K019023K300437K589925
12516A5680920K741212K476219J962496J225099O4795j107188k137360k604195
12508A8301998k768035k612166k174573j630266j209985p59406k12294j73858
$$ plain form
12500 6761415 6569817 6573108 6682106 6824480 6944879 6820106 6807863 6742578 6692230 6598702
12490 6598702 6292688 5914846 5661041 5430780 4950238 4459651 3999373 3698972 3596028
12481 3596028 3323679 3117491 3170487 3152267 2977339 2822171 2722894 2601132 2396522 2305181
12471 2305181 2073259 2136415 2208425 2135158 2107615 1894438 1732634 1740828 1633340 1554500 1594918
12460 1594918 1624382 1533866 1510280 1496619 1345586 1335845 1303068 1283219 1220713 1199847 1126825
12449 1126825 1149988 1208332 1169731 1053853 1084295 1053267 1074258 1003375 1046217 1182526 1078815
12438 1078815 774300 733743 725463 725845 592006 693636 880359 872258 699257 716513 617841
12427 617841 602377 605371 649899 657567 633489 652548 659993 691150 766523 843509 636604 584038
$$ packed form
12500F761415j91598L291J08998J42374J20399j24773j2243o5285n0348r3528
12490F598702l06014l77842k53805k30261m80542m90587m60278l00401j02944
12481C596028k72349k06188N2996j8220j74928j55168r9277j21762k04610r1341
12471B305181k31922O3156P2010p3267k7543k13177j61804Q194j07488p8840M0418
12460A594918K9464r0516k3586j3661j51033r741l2777j9849o2506k0866p3022
12449A126825K3163N8344l8601j15878L0442l1028K0991p0883M2842J36309j03711
12438A078815l04515m0557q280L82j33839J01630J86723q101j73001J7256r8672
12427F17841j5464K994M4528P668k4078J9059P445L1157P5373P6986k06905n2566
$$ plain form
12415 584038 601573 577931 517527 399212 386579 331489 287623 310965 257035 249540 262727
12404 262727 224044 233555 220618 11389 166830 343957 341517 184820 64887 158743 191670
12393 191670 109731 206419 221689 3225 -101095 -93736 60439 86473 38267 102997 122445
12382 122445 21307 -121732 -218653 -123128 -94849 -95492 -12176 -26311 74179 160923 133464
12371 133464 142851 186991 233308 203976 279766 323895 274717 116457 115335 242342 355350
12360 355350 183030 77212 77477 80952 -122673 -268945 -214394 -91103 50585 95261 -5207
12349 -5207 -82767 22628 6834 -85264 -206056 -151500 -53551 -48095 13764 86558 43203 -34739
12337 -34739 -63001 -81440 -5227 111765 134222 73657 95153 159932 194673 195567 234040 162451
$$ packed form
12415E84038J7535k3642o0404j18315j2633n5090m3866K3342n3930p495J3187
12404B62727l8683R511j2937k09229J55441J77127k440j56697j19933R3856L2927
12393A91670q1939R6688J5270k18464j04320P359J54175K6034m8206O4730J9448
12382A22445j01138j43039r6921R5525K8279o43Q3316j4135J00490Q6744k7459
12371A33464R387M4140M6317k9332P5790M4129m9178j58260j122J27007J13008
12360C55350j72320j05818K65L475k03625j46272N4551J23291J41688M4676j00468
12349e207p7560J05395j5794r2098j20792N4556R7949N456O1859P2794m3355p7942
12337c4739k8262j8439P6213J16992K2457o0565K1496O4779L4741Q94L8473p1589
$$ plain form
12325 162451 123348 44875 96519 24495 -24254 -78439 -126369 15354 88998 190593 274976
12314 274976 292567 307079 369846 477027 542466 436314 530906 679133 653401 731627 796644
12303 796644 798549 773063 683241 607790 622077 741891 673054 483192 389168 396356 368960
12292 368960 265462 201674 341995 401847 422767 324691 348968 384921 379116 138454 41477
12281 41477 165812 258959 191495 201564 166082 153786 128830 8135 -174420 -136150 100761
12270 100761 204974 275171 114976 -108551 -55231 -99805 -70817 -79483 29327 71123 -37013
12259 -37013 -77646 42900 182514 86022 50436 -57580 -63911 -116389 -92318 -76724 -98066
12248 -98066 -138941 -76310 123073 172815 267272 318682 554345 622181 588418 527911 528070 519113
$$ packed form
12325A62451l9103p8473N1644p2024m8749n4185m7930J41723P3644J01595Q4383
12314B74976J7591J4512O2767J07181O5439j06152R4592J48227k5732P8226O5017
12303G96644J905k5486q9822p5451J4287J19814o8837j89862r4024P188k7396
12292C68960j03498o3788J40321N9852K0920r8076K4277L5953n805k40662r6977
12281D1477J24335R3147o7464J0069l5482j2296k4956j20695j82555L8270K36911
12270A00761J04213P0197j60195k23527N3320m4574K8988q666J08810M1796j08136
12259c7013m0633J20546J39614r6492l5586j08016o331n2478K4071J5594k1342
12248i8066m0875O2631J99383M9742R4457N1410K35663O7836l3763o0507J59q957
$$ plain form
12236 519113 447889 381715 416694 454052 443398 453492 414703 575468 666002 698801 698219 734187
12224 734187 724901 733713 612840 520619 610985 678867 615276 579655 468610 452779 430330
12213 430330 498565 571481 440616 405505 436213 341278 342727 428988 532578 717057 819397
12202 819397 643274 566171 625208 661898 601133 529278 548660 691176 582755 419936 437729
12191 437729 438818 488182 442993 524887 629479 755841 757299 706800 507027 462609 684809
12180 684809 922366 850609 721476 633928 688032 903953 1011897 1083573 1123266 1065786 973266
12169 973266 1024194 1009135 1041037 1023021 906765 820206 851792 867194 992076 1076814 1018918
12158 1018918 1162874 1302755 1372614 1310942 1335874 1432471 1444152 1505834 1595374 1729019 1946694
$$ packed form
12236E19113p1224o6174L4979L7358j0654J0094l8789J60765R0534L2799n82L5968
12224G34187r286Q812j20873r2221R0366O7882o3591l5621j11045j5831k2449
12213D30330O8235P2916j30865l5111L0708r4935J449Q6261J03590J84479J02340
12202H19397j76123p7103N9037L6690o0765p1855J9382J42516j08421j62819J7793
12191D37729J089M9364m5189Q1894J04592J26362J458n0499j99773m4418K22200
12180F84809K37557p1757j29133q7548N4104K15921J07944P1676L9693n7480r2520
12169I73266N0928j5059L1902j8016j16256q6559L1586J5402J24882Q4738n7896
12158A018918J43956J39881O9859o1672K4932R6597J1681O1682Q9540J33645K17675
$$ plain form
12147 1946694 2056170 2246013 2676667 3025882 3326058 3616778 3960743 4067107 4396316
12138 4396316 5095523 5653075 6350029 7391363 8627129 9989964 11693563 13490176 15399439
12129 15399439 17516067 19830121 22273682 24953230 27798327 30910494 34587209 39240315
12121 39240315 45248680 53182290 63559927 76890704 94388015 117282453 146904346
12114 146904346 185290404 234753708 295544834 363959890 431398102 487964098 527256773
12107 527256773 544296041 536477996 505758261 457386571 398981690 340134948 287002640
12100 287002640 241348595 204422744 177239179 159089215 148023144 142214918 140029714
12093 140029714 140384535 142347534 145034182 147781634 150037362 151158639 150448284 148062281
$$ packed form
12147A946694J09476J89843M30654L49215L00176K90720L43965J06364L29209
12138D396316O99207N57552O96954J041334J235766J362835J703599J796613J909263
12129A5399439K116628K314054K443561K679548K845097L112167L676715M653106
12121C9240315O008365P933610J0377637J3330777J7497311K2894438K9621893
12114A46904346L8386058M9463304O0791126O8415056O7438212N6565996L9292675
12107E27256773J7039268p818045l0719735m8371690n8404881n8846742n3132308
12100B87002640m5654045l6925851k7183565j8149964j1066071n808226k185204
12093A40029714L54821J962999K686648K747452K255728J121277p10355k386003
$$ plain form
12085 148062281 143870280 138132861 131310287 123886273 115994399 108219565 100810318 93805913
12077 93805913 87556066 82030409 76984460 72452853 68630698 65247442 62212757 59449307
12069 59449307 56983195 54684881 52425891 50292552 48325161 46550611 44909127 43155227
12061 43155227 41402148 40006842 38620834 37365629 36044209 34710316 33381578 32307427
12053 32307427 31240028 30327238 29458904 28706559 27756863 26808191 25951430 25113703 24277233
12044 24277233 23565474 22962691 22374362 21802049 21059372 20273290 19801613 19449877 18990865
12035 18990865 18447792 17922994 17565537 17166475 16886326 16569096 16261216 15827535 15431679
12026 15431679 14991516 14618632 14173971 13834178 13499600 13282548 13164124 13019339 12730484
$$ packed form
12085A48062281m192001n737419o822574p424014p891874p774834p409247p004405
12077I3805913o249847n525657n045949m531607l822155l383256l034685k763450
12069E9449307k466112k298314k258990k133339j967391j774550j641484j753900
12061D3155227j753079j395306j386008j255205j321420j333893j328738j074151
12053C2307427j067399r12790q68334p52345r49696r48672q56761q37727q36470
12044B4277233p11759o02783n88329n72313p42677p86082m71677l51736m59012
12035A8990865n43073n24798l57457l99062k80149l17230l07880m33681l95856
12026A5431679m40163l72884m44661l39793l34578k17052j18424j44785k88855
$$ plain form
12017 12730484 12526876 12322977 12136878 11986676 11791268 11635444 11614884 11332149 11010086
12008 11010086 10741398 10600494 10447406 10380177 10256365 10084787 9951512 9879174 9648444 9413255
11998 9413255 9125183 8925377 8650834 8391093 8271361 8214579 8009083 7837798 7657010 7634437
11988 7634437 7563050 7364100 7211086 7029962 7056068 6924203 6508623 6238317 6185702 6158294
11978 6158294 6057449 5982629 5822818 5612556 5477804 5490640 5488809 5430277 5325331 5172904
11968 5172904 4955744 4861982 4914607 4892962 4803383 4716943 4593152 4472016 4334170 4373412
11958 4373412 4280609 4121043 4150007 4150610 4143530 4296344 4172030 4106969 4167968 4107846 3980571
11947 3980571 3782873 3668445 3500313 3527427 3503586 3470739 3467142 3308521 3199371 3156283
$$ packed form
12017A2730484k03608k03899j86099j50202j95408j55824k0560k82735l22063
12008A1010086k68688j40904j53088o7229j23812j71578j33275p2338k30730k35189
11998I413255k88072j99806k74543k59741j19732n6782k05496j71285j80788k2573
11988G634437p1387j98950j53014j81124K6106j31865m15580k70306n2615k7408
11978F158294j00845p4820j59811k10262j34752J2836j831n8532j04946j52427
11968E172904k17160r3762N2625k1645q9579q6440j23791j21136j37846L9242
11958D373412r2803j59566K8964O03p080J52814j24314o5061O0999o0122j27275
11947C980571j97698j14428j68132K7114k3841l2847l597j58621j09150m3088
$$ plain form
11937 3156283 3159664 3089352 3073748 2930461 2654751 2576231 2607622 2489418 2355791 2337843 2206437
11926 2206437 2238760 2223644 2012998 1908195 1904628 1951172 1890795 1707904 1563331 1466379 1519106
11915 1519106 1587835 1652014 1651611 1672397 1580860 1447251 1431473 1442738 1440065 1411020 1497618 1467377
11903 1467377 1402709 1304186 1413808 1519866 1449015 1395001 1357382 1256664 1206184 1154657 1155400
11892 1155400 1217840 1363201 1312459 1246570 1212036 1136987 1167867 1327899 1317729 1228430 1157045
11881 1157045 1173560 1197671 1210414 1136663 1111380 1038866 1135765 1140664 1104255 1043241 1171921
11870 1171921 1260685 1169497 1011275 930860 839532 951996 1170476 1119923 1065779 959643
11860 959643 830324 847288 874001 873294 950679 1046305 1033290 1051514 1136966 1140538 1072458 1085219
$$ packed form
11937C156283L381p0312j5604j43287k75710p8520L1391j18204j33627j7948j31406
11926B206437L2323j5116k10646j04803l567M6544o0377j82891j44573r6952N2727
11915A519106O8729O4179m03K0786r1537j33609j5778J1265k673k9045Q6598l0241
11903A467377o4668r8523J09622J06058p0851n4014l7619j00718n0480n1527P43
11892A155400O2440J45361n0742o5889l4534p5049L0880J60032j0170q9299p1385
11881A157045J6515K4111J2743p3751k5283p2514R6899M899l6409o1014J28680
11870A171921Q8764r1188j58222q0415r1328J12464K18480n0553n4144j06136
11860I59643j29319J6964K6713p07P7385R5626j3015J8224Q5452L572o8080J2761
$$ plain form
11848 1085219 884968 857317 874398 866058 861786 936670 934949 1028404 983603 878575 799409
11837 799409 831200 847547 791807 937085 979898 819340 782955 814163 899842 996942 982990
11826 982990 866300 850486 921811 992264 965087 1020046 1102343 1170104 1110201 966353 984659
11815 984659 864855 899841 1003012 978349 812749 785767 797322 739664 721528 811878 928928
11804 928928 988997 934592 761874 695304 663990 710377 791757 816188 784207 667356 695318
11793 695318 769386 841678 818461 737482 649321 626308 663471 549826 529239 565889 615166
11782 615166 729973 663009 501669 501299 614446 566261 465035 515851 599802 594278 667697
11771 667697 629353 642892 528475 585826 567080 488451 501595 443141 450833 408608 370047
$$ packed form
11848A085219k00251k7651J7081q340m272P4884j721R3455m4801j05028p9166
11837G99409L1791J6347n5740J45278M2813j60558l6385L1208Q5679R7100j3952
11826I82990j16690j5814P1325P0453k7177N4959Q2297O7761n9903j43848J8306
11815I84659j19804L4986J03171k4663j65600k6982J1555n7658j8136R0350J17050
11804I28928O0069n4405j72718o6570l1314M6387Q1380K4431l1981j16851K7962
11793F95318P4068P2292k3217q0979q8161k3013L7163j13645k0587L6650M9277
11782F15166J14807o6964j61340l70J13147m8185j01226N0816Q3951n524P3419
11771F67697l8344J3539j14417N7351j8746p8629J3144n8454P692m2225l8561
$$ plain form
11760 370047 481972 565905 563436 466445 435909 468271 446855 313487 320774 356877 371231
11749 371231 430493 315210 286026 283795 278911 265157 304917 254680 200035 201654 120635 88651
11737 88651 187623 318676 586857 571820 445716 478517 533896 561398 511318 600596 750792
11726 750792 769661 644591 551406 525271 654069 592843 469279 432915 372304 423400 506444
11715 506444 690624 702282 698963 688944 759558 801186 877766 786230 671178 798640 947021
11704 947021 952610 1041080 1217931 1523028 1933980 2375791 2700817 2847617 3000180 3116352
11694 3116352 3165658 3030729 2674190 2388140 2231195 1863322 1646327 1464542 1316174 1143578
11684 1143578 1137346 1164757 1184599 1162826 1185055 1216887 1196779 1061623 981736 1116308 1239164
$$ packed form
11760C70047J11925Q3933k469r6991l0536L2362k1416j33368P287L6103J4354
11749C71231N9262j15283k9184k231m884j3754L9760n0237n4645J619q1019l1984
11737H8651R8972J31053K68181j5037j26104L2801N5379K7502n0080Q9278J50196
11726G50792J8869j25070r3185k6135J28798o1226j23564l6364o0611N1096Q3044
11715E06444J84180J1658l319j0019P0614M1628P6580r1536j15052J27462J48381
11704I47021N589Q8470J76851L05097M10952M41811L25026J46800J52563J16172
11694C116352M9306j34929l56539k86050j56945l67873k16995j81785j48368j72596
11684A143578o232K7411J9842k1773K2229L1832k0108j35156p9887J34572J22856
$$ plain form
11673 1239164 1224023 1300941 1356944 1222247 1061503 949442 868005 791179 756922 805872 836375
11662 836375 873833 935631 925224 829084 618522 537528 539634 530622 452447 379889 246869
11651 246869 277704 344887 417647 394426 401633 479789 538864 604173 535999 523548 481731 381117
11639 381117 303427 321617 465938 440420 516820 551380 600641 663439 628622 473789 256837
11628 256837 418504 366494 222785 179686 224912 319836 389988 311278 302741 328989 343833
11617 343833 346752 235456 227244 211749 232312 136498 202030 145394 218210 360871 386385
11606 386385 368297 324750 347356 362066 331311 408880 414796 448204 568894 570587 434743
11595 434743 413994 324735 392902 343144 213580 274603 352477 293366 125870 182705 257518
$$ packed form
11673A239164j5141P6918N6003j34697j60744j12061q1437p6826l4257M8950L0503
11662H36375L7458O1798j0407r6140k10562q0994K106r012p8175p2558j33020
11651B46869L0835O7183P2760k3221P207P8156N9075O5309o8174j2451m1817j00614
11639C81117p7690J8190J44321k5518P6400L4560M9261O2798l4817j54833k16952
11628B56837J61667n2010j43709m3099M5226R4924P0152p8710q537K6248J4844
11617C43833K919j11296q212j5495K0563r5814O5532n6636P2816J42661K5514
11606C86385j8088m3547K2606J4710l0755P7569N916L3408J20690J693j35844
11595D34743k0749q9259O8167m9758j29564O1023P7874n9111j67496N6835P4813
$$ plain form
11584 257518 372994 479282 396896 293799 251721 216603 330204 314342 339662 410785 464655
11573 464655 478908 334903 168213 202715 320842 441415 436178 352683 293436 348794 428513
11562 428513 407269 428628 608799 588427 510194 415704 243259 283098 204952 90555 219913
11551 219913 442646 491230 475277 353419 234572 248174 384331 374696 252173 290054 251866
11540 251866 301212 457135 483475 341268 201397 261481 256899 154640 212651 346066 424914
11529 424914 335437 173204 190741 224286 136402 239698 246400 331441 352248 272421 181728
11518 181728 99479 179044 224142 232311 107513 302389 289976 260695 219075 128927 161206
11507 161206 188582 172373 334177 368491 195031 98079 132736 82875 64748 15312 -15708
$$ packed form
11584B57518J15476J06288q2386j03097m2078l5118J13601j5862K5320P1123N3870
11573D64655J4253j44005j66690L4502J18127J20573n237q3495n9247N5358P9719
11562D28513k1244K1359J80171k0372p8233r4490j72445L9839p8146j14397J29358
11551B19913K22733M8584j5953j21858j18847J3602J36157r635j22523L7881l8188
11540B51866M9346J55923K6340j42207j39871O0084m582j02259N8011J33415P8848
11529D24914q9477j62233J7537L3545q7884J03296O702Q5041K0807p9827r0693
11518A81728q2249P9565M5098Q169j24798J94876j2413k9281m1620r0148L2279
11507A61206K7376j6209J61804L4314j73460r6952L4657m9861j8127m9436l1020
$$ plain form
11496 -15708 46625 156480 145885 150978 183371 263657 209436 141241 135765 108513 294058 335514
11484 335514 336752 341718 187461 215644 223178 206093 68219 4294 -65387 -17532 95461
11473 95461 95396 272449 411769 311619 250851 196881 128484 101911 -32215 -105486 2041
11462 2041 109127 240776 347912 261098 224062 465887 404795 325083 292908 176816 161787
11451 161787 188991 158527 228899 218386 64440 10585 180739 325714 316256 257291 179412
11440 179412 115886 160832 145123 45823 191414 253233 262177 195743 226233 240256 358606
11429 358606 519274 463299 389180 409758 383716 390064 229105 71159 52692 111944 23941
11418 23941 76459 68876 -6007 9174 57482 209570 243176 149670 221594 212396 144258 233472
$$ packed form
11496a5708O2333J09855j0595N093L2393Q0286n4221o8195n476k7252J85545M1456
11484C35514J238M966j54257K8183P534j7085j37874o3925o9681M7855J12993
11473I5461o5J77053J39320j00150o0768n3970o8397k6573j34126p3271J07527
11462B041J07086J31649J07136q6814l7036K41825o1092p9712l2175j16092j5029
11451A61787K7204l0464P0372j0513j53946n3855J70154J44975r458n8965p7879
11440A79412o3526M4946j5709r9300J45591O1819Q944o6434L0490J4023J18350
11429C58606J60668n5975p4119K0578k6042O348j60959j57946j8467N9252q8003
11418B3941N2518p583p4883J5181M8308J52088L3606r3506P1924r198o8138Q9214
$$ plain form
11406 233472 142898 75232 41433 33424 182078 309327 230050 154877 291440 405078 445290
11395 445290 390726 359895 268818 174303 222170 251026 229148 98593 70474 178712 246105
11384 246105 84853 200092 214728 199289 185554 97807 33774 -36718 -58805 -100657 -89788
11373 -89788 17390 37373 -23903 108370 181659 296274 337295 221694 147959 197189 346745
11362 346745 369000 277192 263675 260617 210676 129656 176584 112368 117139 127153 138958 67259
11350 67259 35043 58050 107268 214839 171249 249215 339334 310082 400947 384429 302750
11339 302750 175766 94313 67678 -39992 -118754 -58209 68804 132045 148791 95306 57010
11328 57010 78470 117479 6701 -120657 -128770 -62638 -85123 54159 109728 188295 161924
$$ packed form
11406B33472r0574o7666l3799q009J48654J27249p9277p5173J36563J13638M0212
11395D45290n4564l0831r1077r4515M7867K8856k1878j30555k8119J08238O7393
11384B46105j61252J15239J4636j5439j3735q7747o4033p0492k2087m1852J0869
11373h9788J07178J9983o1276J32273P3289J14615M1021j15601p3735M9230J49556
11362C46745K2255r1808j3517l058m9941q1020M6928o4216M771J0014J1805p1699
11350F7259l2216K3007M9218J07571m3590P7966R0119k9252R0865j6518q1679
11339C02750j26984q1453k6635j07670p8762O0545J27013O3241J6746n3485l8296
11328E7010K1460L9009j10778j27358q113O6132k2485J39282N5569P8567k6371
$$ plain form
11317 161924 57069 83308 264268 262179 232230 286466 123045 230 -69272 -145194 -96883
11306 -96883 45925 188142 269499 367067 316640 361974 196232 164083 198572 166290 134221
11295 134221 67287 154281 279195 296085 212283 25184 85110 134814 113781 126295 170060
11284 170060 89259 209440 208497 267438 242286 182332 242754 288596 334741 228157 100540
11273 100540 141391 70498 143231 151012 204558 198564 276456 185843 116905 167076 170888 -13334
11261 -13334 -86147 -118660 -28892 148784 205603 232799 132025 -431 100099 200613 96994
11250 96994 -50649 19826 122272 71555 149542 190824 211065 228356 349024 296949 284834
11239 284834 244247 209159 173756 196803 177158 152475 100323 51792 151966 131456 115347
$$ packed form
11317A61924j04855K6239J80960k089k9949N4236j63421j22815o9502p5922M8311
11306i6883J42808J42217Q1357R7568n0427M5334j65742l2149L4489l2282l2069
11295A34221o6934Q6994J24914J6890q3802j87099N9926M9704k1033J2514M3765
11284A70060q0801J20181r43N8941k5152n9954O0422M5842M6145j06584j27617
11273A00540M0851p0893P2733P781N3546n994P7892r0613o8938N0171L812j84222
11261a3334p2813l2513Q9768J77676N6819K7196j00774j32456J00530J00514j03619
11250I6994j47643P0475J02446n0717P7987M1282K0241J7291J20668n2075j2115
11239B84834m0587l5088l5403K3047j9645k4683n2152m8531J00174k0510j6109
$$ plain form
11228 115347 130112 243879 239841 134479 95896 17286 -2508 179498 239517 161265 27038
11217 27038 43433 70723 118227 117597 98221 231415 179887 27635 16838 61945 99402 103868
11205 103868 37933 111783 110649 48882 96626 177862 38825 -6430 37511 85813 210785
11194 210785 159122 259377 336479 316082 269794 87372 81206 148319 167391 176254 138148
11183 138148 82543 9872 60883 141201 220647 261315 270638 347634 381125 394417 419936 276730
11171 276730 208235 185555 78737 -38413 11724 24014 94236 372737 429701 404438 328529
11160 328529 262946 162548 135938 210500 333827 303664 92124 79995 79676 82949 12340
11149 12340 56755 168656 150683 123677 136303 58531 -7008 -10825 -2982 5198 116122 169662
$$ packed form
11228A15347J4765J13767m038j05362l8583p8610j9794J82006O0019p8252j34227
11217B7038J6395K7290M7504o30j9376J33194n1528j52252j0797M5107L7457M466
11205A03868o5935P3850j134o1767M7744Q1236j39037m5255M3941M8302J24972
11194B10785n1663J00255P7102k0397m6288j82422o166O7113J9072Q863l8106
11183A38148n5605p2671N1011Q0318P9446M0668R323P6996L3491J3292K5519j43206
11171B76730o8495k2680j06818j17150N0137J2290P0222K78501N6964k5263p5909
11160C28529o5583j00398k6610P4562J23327l0163k11540j2129l19L273p0609
11149A2340M4415J11901j7973k7006J2626p7772o5539l817P843Q180J10924N3540
$$ plain form
11137 169662 111484 43358 -11173 29893 138077 116611 21866 -11626 50990 127285 156467
11126 156467 208682 215828 204604 244939 159857 192474 195889 240978 275574 370628 318218 211963
11114 211963 130486 112201 116855 126189 127185 168119 118522 187165 196314 108597 147606 174482
11102 174482 193356 122607 35880 -30693 60735 102107 88781 26403 -34844 -87515 -141946
11091 -141946 -66213 -39223 -99088 -59671 84517 217053 266207 323228 334563 314806 335331
11080 335331 175284 205976 411440 495591 460030 326184 326974 466978 621694 593803 317587
11069 317587 262516 185717 99087 22448 196476 167494 61102 31167 60348 102539 112702
11058 112702 153116 153479 67432 72012 50393 69983 87877 236463 149456 73379 -28584 17660
$$ packed form
11137A69662n8178o8126n4531M1066J08184k1466r4745l3492O2616P6295K9182
11126A56467N2215P146j1224M0335q5082L2617L415M5089L4596R5054n2410j06255
11114B11963q1477j8285M654R334R96M0934m9597O8643R149q7717L9009K6876
11102A74482J8874p0749q6727o6573R1428M1372j3326o2378o1247n2671n4431
11091a41946P5733K6990n9865L9417J44188J32536M9154N7021J1335j9757K0525
11080C35331j60047L0692K05464Q4151l5561j33846P90J40004J54716k7891k76216
11069C17587n5071p6799q6630p6639J74028k8982j06392k9935K9181M2191J0163
11058A12702M0414L63q6047M580k1619J9590J7894J48586q7007p6077j01963M6244
$$ plain form
11046 17660 95814 109714 129599 149418 -66035 -181577 -162808 -196697 -92752 -25261 97320
11035 97320 173456 13747 -28418 32069 25325 -22988 56407 89190 17168 -80561 -58416 26920
11023 26920 94865 102462 -18296 -3084 156111 249535 232515 223021 280985 302866 354690 251250
11011 251250 276792 212585 39861 -23453 -76032 -3417 -7238 -2455 -51111 123126 220343
11000 220343 231995 161168 -19954 -80811 76565 96402 -142978 -145436 -187612 -97130 51059
10989 51059 45621 -31735 -6238 99758 126726 38149 -37254 -13133 64434 174549 246450
10978 246450 287234 218287 281435 212430 83111 -70301 -96000 -81416 -21543 1446 40612
10967 40612 230352 317059 145018 166561 342425 391215 169759 120024 281997 277154 261979
$$ packed form
11046A7660P8154J3900J9885J9819k15453j15542J8769l3889J03945O7491J22581
11035I7320P6136j59709m2165O0487o744m8313P9395L2783p2022r7729K2145Q5336
11023B6920O7945P597j20758J5212J59195R3424j7020r494N7964K1881N1824j03440
11011B51250K5542o4207j72724o3314n2579P2615l821M783m8656J74237R7217
11000B20343J1652p0827j81122o0857J57376J9837k39380k458m2176R0482J48189
10989E1059n438p7356K5497J05996K6968q8577p5403K4121P7567J10115P1901
10978B46450M0784o8947O3148o9005j29319j53412k5699J4584N9873K2989L9166
10967D0612J89740Q6707j72041K1543J75864M8790k21456m9735J61973m843j5175
$$ plain form
10956 261979 240084 165514 160599 38898 -31890 106155 160770 12989 -32036 55597 121722
10945 121722 94178 66954 9697 6726 153424 156895 55549 -105579 -109210 -123377 -12172
10934 -12172 202767 307197 318174 184306 133798 161895 279766 319780 255140 147555 79054
10923 79054 -76830 -91685 106372 107169 -47986 1351 49 23967 -35442 4202 171467
10912 171467 284657 324383 250946 176736 125941 33555 176149 292230 249153 143953 118782
10901 118782 138589 74167 -51786 -98105 101962 229687 165982 118945 151367 196953 214045
10890 214045 32907 38199 96452 36889 -92539 -18810 -26229 -67231 84113 85753 56131
10879 56131 109962 14208 49674 25345 18071 58598 159581 127221 141043 178703 89026 87185
$$ packed form
10956B61979k1895p4570m915j21701p0788J38045N4615j47781m5025Q7633O6125
10945A21722k7544k7224n7257k971J46698L471j01346j61128l631j4167J11205
10934a2172K14939J04430J0977j33868n0508K8097J17871M0014o4640j07585o8501
10923G9054j55884j4855J98057P97j55155M9337j302K3918n9409L9644J67265
10912A71467J13190L9726p3437p4210n0795r2386J42594J16081m3077j05200k5171
10901A18782J9807o4422j25953m6319K00067J27725o3705m7037L2422M5586J7092
10890B14045j81138N292N8253n9563j29428P3729p419m1002J51344J640k9622
10879E6131N3831r5754L5466k4329p274M0527J00983l2360J3822L7660q9677j841
$$ plain form
10867 87185 87081 136883 65779 179975 159086 153946 282938 245565 220292 277370 419808 318303
10855 318303 165179 138110 23627 -10908 -58051 -36613 -92472 -24184 -40311 21849 50279
10844 50279 15275 105579 93473 107180 127520 163159 177979 231101 241668 184717 216845 122537
10832 122537 85157 173825 71817 -49657 40547 98470 36957 70082 -33056 -34917 -47924
10821 -47924 -145598 -203986 -96889 48294 189169 283539 244151 259553 239217 213585 277609
10810 277609 303782 339895 321790 224166 62725 41967 50467 97600 215660 134350 -16727
10799 -16727 -14743 -19662 -86821 -89011 -84993 -27871 -48907 -47348 64790 145082 234728 370299
10787 370299 296516 267975 236922 71657 -74450 -77994 -44100 -14557 46734 94373 80447
$$ packed form
10867H7185j04M9802p1104J14196k0889n140J28992l7373k5273N7078J42438j01505
10855C18303j53124k7069j14483l4535m7143K1438n5859O8288j6127O2160K8430
10844E0279l5004R0304j2106J3707K0340L5639J4820N3122J0567n6951L2128r4308
10832A22537l7380Q8668j02008j21474R0204N7923o1513L3125j03138j861j3007
10821d7924r7674n8388J07097J45183J40875R4370l9388J5402k0336k5632O4024
10810B77609K6173L6113j8105r7624j61441k0758Q500M7133J18060q1310j51077
10799a6727J984m919o7159k190M018N7122k1036J559J12138Q0292Q9646J35571
10787C70299p3783k8541l1053j65265j46107l544L3894K9543O1291M7639j3926
$$ plain form
10776 80447 212693 207609 233188 300484 180611 53654 -35024 35494 -16684 93366 72740
10765 72740 26046 140478 147478 108980 152012 93283 69466 -35210 96370 251746 374929
10754 374929 317474 373242 313617 202773 217036 86437 190072 257468 192971 58099 -59908
10743 -59908 43576 -56281 9506 125962 210353 191090 99604 174160 126193 21866 69755
10732 69755 151225 119941 26079 101950 120769 103367 60320 66569 1767 86710 294308 284665
10720 284665 73360 -160653 -144214 49833 229319 254192 184706 241366 267032 326694 306473
10709 306473 233923 151722 126735 17000 -124786 -61340 140987 106878 78585 143845 144812
10698 144812 38517 49165 89781 118442 -12097 -96837 -73062 -89304 71651 62882 -52435
$$ packed form
10776H0447J32246n084K5579O7296j19873j26957q8678P0518n2178J10050k0626
10765G2740m6694J14432P000l8498M3032n8729k3817j04676J31580J55376J23183
10754C74929n7455N5768n9625j10844J4263j30599J03635O7396o4497j34872j18007
10743e9908J03484r9857O5787J16456Q4391j9263r1486P4556m7967j04327M7889
10732F9755Q1470l1284r3862P5871J8819j7402m3047O249o4802Q4943K07598r643
10720B84665k11305k34013J6439J94047J79486K4873o9486N6660K5666N9662k0221
10709C06473p2550q2201k4987j09735j41786O3446K02327l4109k8293O5260R67
10698A44812j06295J0648M0616K8661j30539q4740K3775j6242J60955q769j15317
$$ plain form
10687 -52435 -77834 -214438 -96876 -140384 -114256 -36075 -22233 -87478 -150597 -23292 28459
10676 28459 193585 297895 188071 28779 129454 191510 172193 85125 86528 161221 148319
10665 148319 95071 105273 26160 15910 177531 290279 248204 250288 306797 408434 396255
10654 396255 359116 252516 181800 98896 43187 16027 32421 132261 172232 84150 -15684
10643 -15684 -21397 -6585 -63605 5066 87433 181033 345668 340413 199911 92307 -6392
10632 -6392 -59958 -150321 -96919 -370 13147 20203 50360 82449 106869 185288 235846 215946
10620 215946 212115 171928 64125 168115 200887 213333 232675 167708 195280 164187 91745
10609 91745 124212 127507 95514 38350 -28302 7560 49108 123741 195232 228351 156251 135110
$$ packed form
10687e2435k5399j36604J17562m3508K6128P8181J3842o5245o3119J27305N1751
10676B8459J65126J04310j09824j59292J00675O2056j9317q7068J403P4693j2902
10665A48319n3248J0202p9113j0250J61621J12748m2075K084N6509J01637j2179
10654C96255l7139j06600p0716q2904n5709k7160J6394R9840L9971q8082r9834
10643a5684n713J4812n7020O8671Q2367R3600J64635n255j40502j07604r8699
10632f392n3566r0363N3402R6549J3517P056L0157L2089K4420P8419N0558j9900
10620B15946l831m0187j07803J03990L2772J2446J9342o4967K7572l1093p2442
10609I1745L2467L295l1993n7164o6652L5862M1548P4633P1491L3119p2100k1141
$$ plain form
10597 135110 173023 26176 44978 56003 13238 -96750 -273442 -109002 7861 28132
10587 28132 109398 208379 261995 175648 198563 202053 303889 390623 210736 30200 -46894
10576 -46894 11095 131245 169057 197380 228684 253481 193082 68529 26779 34976 44576 -134810
10564 -134810 -277335 -231581 -111291 -5643 41103 137926 145686 127058 119017 115513 -10630
10553 -10630 -65030 63623 196174 238870 242582 210491 309877 256402 155851 167239 130394
10542 130394 172016 76401 -76973 154371 218619 133777 189285 196164 86010 88147 143502
10531 143502 131159 24912 -8369 86823 71436 49293 102880 250286 247795 208999 122918
10520 122918 171139 244788 181943 169060 15394 4774 227772 192083 89180 140522 236866
$$ packed form
10597A35110L7913j46847J8802J1025m2765j09988j76692J64440J16863K0271
10587B8132Q1266R8981N3616q6347K2915L490J01836Q6734j79887j80536p7094
10576d6894N7989J20150L7812K8323L1304K4797o0399j24553m1750Q197R600j79386
10564a34810j42525M5754J20290J05648M6746R6823P760j8628q041l504j26143
10553a0630n4400J28653J32551M2696L712l2091R9386n3475j00551J1388l6845
10542A30394M1622r5615j53374K31344O4248q4842N5508O879j10154K137N5355
10531A43502j2343j06247l3281R5192j5387k2143N3587J47406k491l8796q6081
10520A22918M8221P3649o2845j2883j53666j0620K22998l5689j02903N1342R6344
$$ plain form
10509 236866 291046 329897 164785 99988 241771 292662 286008 201547 52533 28713 163153
10498 163153 129475 186312 139943 69693 -11329 -188990 -137330 27345 8245 115232 137410
10487 137410 220775 276094 317082 148329 33015 50797 100116 81707 106920 145518 247467
10476 247467 241454 262545 248121 243084 235509 201486 26378 104112 108993 130638 132074 101004
10464 101004 46036 87337 83517 68054 -7617 39771 158703 98142 56833 39711 160641
10453 160641 -47174 -188305 -155429 -136993 -20477 23750 -26319 -22103 -63015 -226286 -214577
10442 -214577 -195017 -52583 199 -121440 -135387 3005 32405 97489 -10312 -16375 24803
10431 24803 13705 115732 154765 75992 161698 114057 47339 -46747 -269127 -265505 -100186
$$ packed form
10509B36866N4180L8851j65112o4797J41783N0891o654q4461j49014k3820J34440
10498A63153l3678N6837m6369p0250q1022j77661N1660J64675j9100J06987K2178
10487A37410Q3365N5319M0988j68753j15314J7782M9319j8409K5213L8598J01949
10476B47467o013K1091j4424n037p575l4023j75108P7734M881K1645J436l1070
10464A01004n4968M1301l820j5463p5671M7388J18932o0561m1309j7122J20930
10453A60641k07815j41131L2876J8436J16516M4227n0069M216m0912j63271J1709
10442b14577J9560J42434N2782j21639j3947J38392K9400O5084j07801o063M1178
10431B4803j1098J02027L9033p8773Q5706m7641o6718r4086k22380L622J65319
$$ plain form
10420 -100186 104652 230630 130784 44705 5766 -100789 -63023 -73566 -133287 -53246 54480
10409 54480 9319 -5993 102810 77201 115049 128234 245938 280337 295945 299862 232443
10398 232443 65010 58904 163746 271756 229235 84039 59467 82444 92845 214520 324492
10387 324492 157202 59134 94416 252133 209079 133087 173687 264050 159955 34103 -50950
10376 -50950 -6128 51155 111361 146393 78888 72060 -15935 -49503 -106562 -47495 -34410 -185110
10364 -185110 46682 294973 260714 158156 130727 189565 158423 307702 256657 371055
10354 371055 476394 493843 438547 495565 574005 677245 1001662 1099464 1159196 1422056 1657230
10343 1657230 1907243 2134736 2043520 1941826 1866392 1727260 1564718 1249858 1151786 1052991
$$ packed form
10420a00186K04838J25978r9846q6079l8939j06555L7766j0543n9721Q0041J07726
10409E4480m5161j5312J08803k5609L7848J3185J17704L4399J5608L917o7419
10398B32443j67433o106J04842J08010m2521j45196k4572K2977J0401J21675J09972
10387C24492j67290r8068L5282J57717m3054p5992M0600R0363j04095j25852q5053
10376e0950M4822N7283O0206L5032o7505o828q7995l3568n7059N9067J3085j50700
10364a85110K31792K48291l4259j02558k7429N8838l1142J49279n1045J14398
10354C71055J05339J7449n5296N7018P8440J03240L24417R7802N9732K62860K35174
10343A657230K50013K27493r1216j01694p5434j39132j62542l14860r8072r8795
$$ plain form
10333 1052991 829320 560826 510344 499830 424585 332486 462820 646595 479759 300271
10323 300271 255339 328795 454825 512081 521389 497234 536820 533954 462239 510627 579666 517186
10311 517186 424668 443376 299145 159241 160873 94030 47605 -31958 -84091 -41826 32765
10300 32765 125019 174693 200143 171496 134268 133110 181707 311907 171831 66936 112914
10289 112914 243895 294772 319099 329525 344902 342781 172359 114218 4263 57425 101354
10278 101354 62163 217669 278604 204514 147997 62799 -17683 -58398 5519 168142 211589
10267 211589 145469 80492 88463 18300 33063 143725 256812 305078 118510 14216 124660
10256 124660 63604 -1702 93466 252011 172092 133855 239473 223919 212839 107041 -79856
$$ packed form
10333A052991k23671k68494n0482j0514p5245r2099J30334J83775j66836j79488
10323C00271m4932P3456J26030N7256R308k4155L9586k866p1715M8388O9039o2480
10311E17186r2518J8708j44231j39904J632o6843m6425p9563n2133M2265P4591
10300C2765R2254M9674K5450k8647l7228j158M8597J30200j40076j04895M5978
10289A12914J30981N0877K4327J0426J5377k121j70422n8141j09955N3162M3929
10278A01354l9191J55506O0935p4090n6517q5198q0482m0715O3917J62623M3447
10267B11589o6120o4977P971p0163J4763J10662J13087M8266j86568j04294J10444
10256A24660o1056o5306R5168J58545p9919l8237J05618j5554j1080j05798j86897
$$ plain form
10245 -79856 -144343 -54998 -58762 -63571 -49564 57060 174807 242097 219491 230715 324745 371668
10233 371668 355158 341707 343456 259652 138200 -5679 37857 60622 111415 106378 83407
10222 83407 78503 95903 251411 347540 184038 131664 144134 130781 109038 216861 298610
10211 298610 293635 227247 125663 21482 60661 92425 117907 172976 173964 97907 4109 -21336
10199 -21336 -6479 -61291 -149302 -205330 -102863 -104611 -77831 -172766 -5414 165625 230449
10188 230449 235278 246784 223043 104894 54531 258859 363068 356319 327462 318919 306280
10177 306280 315616 272411 204814 235010 278769 270298 89111 -4459 58965 48149 32662 57888
10165 57888 261350 364277 372804 394965 304183 254791 286100 360067 470580 334353 229000
$$ packed form
10245g9856o4487Q9345l764m809J4007J06624J17747O7290k2606J1224R4030M6923
10233C71668j6510j3451J749q3804j21452j43879M3536K2765N0793n037k2971
10222H3407m904J7400J55508R6129j63502n2374J2470j3353k1743J07823Q1749
10211B98610m975o6388j01584j04181L9179L1764K5482N5069R88p6057r3798k5445
10199b1336J4857n4812q8011n6028J02467j748K6780r4935J67352J71039O4824
10188B30449M829J1506k3741j18149n0363K04328J04209o749k8857q543j2639
10177C06280R336m3205o7597L0196M3759q471j81187r3570O3424j0816j5487K5226
10165E7888K03462J02927Q527K2161r0782m9392L1309P3967J10513j36227j05353
$$ plain form
10154 229000 402070 376267 161563 172638 308901 451892 338658 245806 308066 344841
10144 344841 235797 262061 265307 166117 91624 109527 145832 273303 324307 395487 213267
10133 213267 247612 377395 478544 419515 294796 196631 176954 54549 2094 4834 630
10122 630 1789 -41671 -44338 43189 135665 284450 301838 181783 209825 300785 236549 67464
10110 67464 -32794 66123 140479 58660 162630 51821 77624 22695 32840 39802 82044
10099 82044 114705 136265 223688 149772 89792 164223 249606 252033 269231 308450 239411 96526
10087 96526 67454 128850 211077 221280 271484 246578 253890 216209 90901 -137480 -162587
10076 -162587 -129802 2890 25424 122689 168868 63546 221192 241770 251083 421588 498546
$$ packed form
10154B29000J73070k5803k14704J1075J36263J42991j13234r2852O2260L6775
10144C44841j09044K6264L246r9190p4493J7903L6305J27471N1004P1180j82220
10133B13267L4345J29783J01149n9029j24719r8165j9677j22405n2455K740m204
10122F30J159m3460k667Q7527R2476J48785J7388j20055K8042R0960o4236j69085
10110F7464j00258R8917P4356q1819J03970j10809K5803n4929J0145O962M2242
10099H2044L2661K1560Q7423p3916n9980P4431Q5383K427J7198L9219o9039j42885
10087I6526k9072O1396Q2227J0203N0204k4906P312l7681j25308k28381k5107
10076a62587L2785J32692K2534R7265M6179j05322J57646K0578R313J70505P6958
$$ plain form
10065 498546 501682 390108 282908 267620 175376 18540 -41446 105210 231832 217518 141844
10054 141844 179832 195763 262930 122106 208063 117702 36501 -47582 39499 192736 214437
10043 214437 150378 73318 47407 36700 135668 29034 -5777 23951 25502 33473 223152
10032 223152 307170 374489 215067 138960 111587 93536 102990 115958 208438 235953 194987
10021 194987 219366 179294 204129 187470 166352 149311 249194 297217 270334 256802 291079
10010 291079 384684 396659 363834 425889 489437 324982 153889 253135 318570 352111 251976
9999 251976 143220 153810 152329 98383 97316 139236 43531 -5854 -165072 -192894 -75458
9988 -75458 56879 93549 123624 101486 272651 313120 271590 253577 209212 166034 88095
$$ packed form
10065D98546L136j11574j07200j5288r2244j56836n9986J46656J26622j4314p5674
10054A41844L7988J5931O7167j40824Q5957r0361q1201q4083Q7081J53237K1701
10043B14437o4059p7060k5911j0707R8968j06634l4811K9728J551P971J89679
10032B23152Q4018O7319j59422p6107k7373j8051R454J2968R2480K7515m0966
10021A94987K4379m0072K4835j6659k1118j7041R9883M8023k6883j3532L4277
10010B91079R3605J1975l2825O2055O3548j64455j71093R9246O5435L3541j00135
9999B51976j08756J0590j481n3946j067M1920r5705m9385j59218k7822J17436
9988g5458J32337L6670L0075k2138J71165M0469m1530j8013m4365m3178p7939
$$ plain form
9977 88095 136059 290657 393817 410618 185226 161100 24808 -3611 -84687 -75968 49550
9966 49550 169121 179917 222165 133809 120560 97731 179984 211511 97202 134285 56859
9955 56859 2870 -7465 23362 38439 -16427 105654 71859 214894 283697 216206 224655 271440
9943 271440 390051 424559 224051 75451 29061 158866 209095 269113 323211 304758 263681
9932 263681 165784 109454 178593 230362 260559 278611 306696 187296 35820 103127 254001
9921 254001 380984 437784 389681 366030 401751 363476 316249 290982 199109 204986 96590
9910 96590 -59264 31126 197114 131770 123966 108756 89039 135353 136798 206661 160499 278773
9898 278773 357170 350814 208209 49713 5367 -16951 -38075 -74567 -64342 -56807 37541 174495
$$ packed form
9977H8095M7964J54598J03160J6801k25392k4126j36292k8419q1076Q719J25518
9966D9550J19571J0796M2248q8356j3249k2829Q2253L1527j14309L7083p7426
9955E6859n3989j0335L0827J5077n4866J22081l3795J43035O8803o7491Q449M6785
9943B71440J18611L4508k00508j48600m6390J29805N0229O0018N4098j8453m1077
9932B63681r7897n6330O9139N1769L0197J8052K8085j19400j51476O7307J50874
9921B54001J26983N6800m8103k3651L5721l8275m7227k5267r1873N877j08396
9910I6590j55854R0390J65988o5344p804j5210j9717M6314J445O9863m6162J18274
9898B78773P8397o356j42605j58496m4346k2318k1124l6492J0225P535R4348J36954
$$ plain form
9886 174495 264763 145777 119213 144430 98419 143036 159582 48723 94749 175314 233433
9875 233433 248658 220128 323451 261902 141169 153532 97939 12996 19286 136056 132298
9864 132298 54246 96051 133306 189494 210957 165578 164797 198874 258199 217436 116530 132417
9852 132417 143294 171495 109352 26496 -1187 85802 204432 193110 257824 215372 17405
9841 17405 80444 269136 287850 234997 159883 180815 62041 -10339 -22593 -9944 -54148
9830 -54148 -25691 53749 284733 299975 201461 231505 213683 96360 50419 49471 138393 231191
9818 231191 282574 352029 392885 282527 222588 192062 359630 318041 197609 193836 179399
9807 179399 186106 100945 112442 168272 135751 199191 330092 387832 384192 309917 200139 88575
$$ packed form
9886A74495R0268j18986k6564K5217m6011M4617J6546j10859M6026Q0565N8119
9875B33433J5225k8530J03323o1549j20733J2363n5593q4943O290J16770l758
9864A32298p8052M1805L7255N6188K1463m5379p81L4077N9325m0763j00906J5887
9852A32417J0877K8201o2143q2856k7683Q6989J18630j1322O4714m2452j97967
9841A7405O3039J88692J8714n2853p5114K0932j18774p2380j2254J2649m4204
9830e4148K8457P9440K30984J5242r8514L0044j7822j17323m5941r48Q8922R2798
9818B31191N1383O9455M0856j10358n9939l0526J67568m1589j20432l773j4437
9807A79399O707q5161J1497N5830l2521O3440J30901N7740l640p4275j09778j11564
$$ plain form
9795 88575 31544 -27498 -108845 -70160 49629 69686 82584 191665 102343 118968 135667
9784 135667 37501 42659 73609 65222 -50730 -93848 -5971 -723 -90877 -109474 -147905 4034
9772 4034 51805 58027 119361 94231 123262 97398 101577 100728 160294 229333 207304 109232 277052
9759 277052 258864 235378 221131 212874 201882 64055 92882 130995 107104 261265 396634
9748 396634 559321 461915 277359 271475 262332 134035 170618 366639 365677 369471 342803 233156
9736 233156 207564 138006 180227 256047 166086 87122 214754 153739 114114 192192 205554
9725 205554 285490 231346 339769 408172 310437 345844 382713 384042 420021 220659 126447
9714 126447 35872 71128 212780 301450 310073 295629 300609 217738 324122 467569 405355
$$ packed form
9795H8575n7031n9042q1347L8685J19789K0057J2898J09081q9322J6625J6699
9784A35667r8166N158L0950q387j15952m3118Q7877N248r0154j8597l8431J51939
9772D034M7771O222O1334k5130K9031k5864M179q49N9566O9039k2029r8072J67820
9759B77052j8188k3486j4247q257j0992j37827K8827L8113k3891J54161J35369
9748C96634J62687r7406j84556n884r143j28297L6583J96021r62L794k6668j09647
9736B33156k5592o9558M2221P5820q9961p8964J27632o1015l9625P8078J3362
9725B05554P9936n4144J08423O8403r7735L5407L6869J329L5979j99362r4212
9714A26447r0575L5256J41652Q8670Q623j4444M980q2871J06384J43447o2214
$$ plain form
9703 405355 419038 257196 241959 268022 301235 168096 161030 289379 303241 271334 226167
9692 226167 143956 102053 139010 206550 94372 103950 253029 348993 266610 143998 130968
9681 130968 273680 382082 443693 471145 287340 251515 258575 279563 284392 193572 146788
9670 146788 141802 191767 219528 229715 233863 264214 310282 214553 18866 65624 105510 85834
9658 85834 182187 299700 180127 -3066 -100560 -23532 95757 80732 80305 179793 318181
9647 318181 297405 223585 258190 200259 152898 153111 92754 212993 342568 321552 329622 178073
9635 178073 78055 -30728 -91814 -33337 -61332 49713 209711 294131 385075 347517 277721
9624 277721 168664 42922 47829 54274 133283 163266 173797 186684 114904 -48384 -81006
$$ packed form
9703D05355J3683j61842j5237K6063L3213j33139p066J28349J3862l1907m5167
9692B26167q2211m1903L6957O7540j12178R578J49079R5964q2383j22612j3030
9681A30968J42712J08402O1611K7452j83805l5825P060K0988M829r0820m6784
9670A46788m986M9965K7761J0187M148L0351M6068r5729j95687M6758L9886j9676
9658H5834R6353J17513j19573j83193r7494P7028J19289j5025m27R9488J38388
9647C18181k0776p3820L4605n7931m7361K13o0357J20239J29575k1016Q070j51549
9635A78073j00018j08783o1086N8477k7995J11045J59998Q4420R0944l7558o9796
9624B77721j09057j25742M907O445P9009K9983J0531J2887p1780j63288l2622
$$ plain form
9613 -81006 68156 161445 248367 252678 403682 484853 279281 228772 240268 214900 142062
9602 142062 269969 326745 306577 167078 108563 170370 215525 136088 115315 138673 173855
9591 173855 165936 104156 47507 50914 97746 156681 166277 221454 329886 342513 299943 114302
9579 114302 76926 26346 59446 188094 207187 106775 187706 278044 236254 290886 239837
9568 239837 141024 76722 101733 177228 168451 292918 360939 113041 58517 121853 95683
9557 95683 88505 141569 189740 196572 142283 155600 284006 209124 227424 302236 259065 138152
9545 138152 -22078 -94877 -24080 -9461 -12706 11819 107302 297163 341064 350972 338649 90916
9533 90916 -29983 -63958 6888 34515 120431 65113 11760 -60887 -106888 -35559 154668
$$ packed form
9613h1006J49162R3289Q6922M311J51004Q1171k05572n0509J1496k5368p2838
9602A42062J27907N6776k0168j39499n8515O1807M5155p9437k0773K3358L5182
9591A73855p919o1780n6649L407M6832N8935R596N5177J08432J2627m2570j85641
9579A14302l7376n0580L3100J28648J9093j00412Q0931R0338m1790N4632n1049
9568B39837r8813o4302K5011P5495q777J24467O8021k47898n4524O3336k6170
9557I5683p178N3064M8171O832n4289J3317J28406p4882J8300P4812m3171j20913
9545A38152j60230p2799P0797J4619l245K4525R5483J89861M3901R908j2323k47733
9533I0916j20899l3975P0846K7627Q5916n5318n3353p2647m6001P1329J90227
$$ plain form
9522 154668 299341 357780 289716 231525 137041 169974 214179 281567 243114 160869 240056
9511 240056 307993 214255 325389 391857 371244 262934 126537 85159 124993 128630 183002
9500 183002 182002 200958 171999 159358 331353 387904 352788 371764 358387 156104 92970
9489 92970 41858 50981 171525 353601 456869 497687 441561 325826 373876 344708 230210
9478 230210 207523 221864 286722 422861 435906 224093 168878 73308 34463 102057 202563
9467 202563 158045 136512 115912 106123 42108 37318 79000 79910 148046 -10874 -69532 36758
9455 36758 63370 -51481 -104355 -59943 9759 56217 -535 -102092 -36616 -97355 -114583
9444 -114583 -68158 137480 208509 191702 134070 -73867 23331 179541 149920 79644 90638
$$ packed form
9522A54668J44673N8439o8064n8191r4484L2933M4205O7388l8453q2245P9187
9511B40056O7937r3738J11134O6468k0613j08310j36397m1378L9834L637N4372
9500A83002j000J8956k8959j2641J71995N6551l5116J8976j3377k02283o3134
9489I2970n1112R123J20544J82076J03268M0818n6126j15735M8050k9168j14498
9478B30210k2687J4341O4858J36139J3045k11813n5215r5570l8845O7594J00506
9467B02563m4518k1533k0600r789o4015m790M1682R10O8136j58920n8658J06290
9455C6758K6612j14851n2874M4412O9702M6458n6752j01557O5476o0739j7228
9444a14583M6425K05638P1029j6807n7632k07937R7198J56210k9621p0276J0994
$$ plain form
9433 90638 103731 104782 133791 98311 219712 209732 132496 94877 47641 33966 86926 247954
9421 247954 351579 294202 227929 70197 47725 55974 52263 217571 116953 -6505 545
9410 545 162610 140426 75132 37030 -12190 44065 95415 191978 226050 158346 101467 29628
9398 29628 131423 286556 290063 249090 218838 155350 214278 245434 326585 397715 289691
9387 289691 210013 183092 116839 3835 79877 164101 141990 117025 186037 104148 164356
9376 164356 205336 226037 198353 220895 239509 114992 75809 20557 17329 46753 149747
9365 149747 259965 261679 208489 250257 171146 123574 182853 224118 298426 317198 331340 313617
9353 313617 263614 238945 317653 227487 248905 312947 219306 211913 138186 54742 86289 190407
$$ packed form
9433I0638J3093J051K9009l5480J21401r980p7236l7619m7236j3675N2960J61028
9421B47954J03625n7377o6273j57732k2472Q249l711J65308j00618j23458P050
9410E45J62065k2184o5294l8102m9220N6255N1350R6563L4072o7704n6879p1839
9398B9628J01795J55133L507m0973l0252o3488N8928L1156Q1151P1130j08024
9387B89691p9678k6921o6253j13004P6042Q4224k2111k4965O9012q1889O0208
9376A64356M0980K0701k7684K2542J8614j24517l9183n5252l228K9424J02994
9365A49747J10218J714n3190M1768p9111m7572N9279M1265P4308J8772J4142j7723
9353C13617n0003k4669P8708r0166K1418O4042r3641p393p3727q3444L1547J04118
$$ plain form
9341 190407 218727 151104 139294 236139 208092 174760 -3051 1227 147954 165991 175347 166254
9329 166254 219740 251885 329511 280792 124433 99201 143006 205263 213849 282035 326839 370834
9317 370834 353550 186381 231305 187826 81805 91137 181558 180084 207689 58969 141433
9306 141433 237309 140833 179087 334044 344815 245916 280017 282972 331964 294095 25613
9295 25613 -9319 71532 181178 131213 93531 80587 38989 24162 24783 -78092 -115364 -48594
9283 -48594 -48340 -16681 81934 196048 248694 181484 224590 254979 303211 351645 235899 81010
9271 81010 -28981 46486 154183 210344 179381 220728 190797 197647 219036 248207 208680 119636
9259 119636 301451 335914 214026 180641 205378 329385 275037 71968 79305 171531 235033
$$ packed form
9341A90407K8320o7623j1810R6845k8047l3332j77811M278J46727J8037R356r093
9329A66254N3486L2145P7626m8719j56359k5232M3805O2257Q586O8186M4804M3995
9317C70834j7284j67169M4924m3479j06021R332R0421j474K7605j48720Q2464
9306A41433R5876r6476L8254J54957J0771r8899L4101K955M8992l7869k68482
9295B5613l4932Q0851J09646m9965l7682j2944m1598j4827O21j02875l7272O6770
9283d8594K54L1659R8615J14114N2646o7210M3106L0389M8232M8434j15746j54889
9271H1010j09991P5467J07697N6161l0963M1347k9931O850K1389K9171l9527q9044
9259A19636J81815L4463j21888l3385K4737J24007n4348k03069P337R2226O3502
$$ plain form
9248 235033 206330 232858 266517 298077 150544 127562 218400 91297 58655 91118 26888
9237 26888 -59652 -38207 75277 30553 98890 173792 154536 127260 204904 205859 166005 206463
9225 206463 138860 57117 -15136 152470 286699 255833 203200 188036 203732 211024 280186
9214 280186 301027 241056 258433 244086 242457 219523 80371 86495 69626 64582 142580 147771
9202 147771 -1392 -67989 -28518 105978 -32718 -137548 14563 50091 27569 36484 92267
9191 92267 247261 214251 109644 187237 227339 288999 357544 195426 -66391 -92751 62690
9180 62690 241566 90448 -82761 -83135 6095 88774 72274 259790 251201 95759 139361
9169 139361 217534 48992 -45546 57188 78901 137996 166376 152279 107143 38890 -63613
$$ packed form
9248B35033k8703K6528L3659L1560j47533k2982R0838j27103l2642L2463o4230
9237B6888q6540K1445J13484m4724O8337P4902j9256k7276P7644R55l9854M0458
9225B06463o7603q1743p2253J67606J34229l0866n2633j5164J5696P292O9162
9214B80186K0841n9971J7377j4347j629k2934j39152O124j6869n044P7998N191
9202A47771j49163o6597L9471J34496j38696j04830J52111L5528k2522Q915N5783
9191I2267J54994l3010j04607P7593M0102O1660O8545j62118k61817k6360J55441
9180F2690J78876j51118j73209l74Q9230Q2679j6500J87516q589j55442M3602
9169A39361P8173j68542r4538J02734K1713N9095K8380j4097m5136o8253j02503
$$ plain form
9158 -63613 -26720 150524 166566 29993 36040 -10454 104324 185882 297148 403381 528414
9147 528414 361003 337643 333604 264605 242996 146526 136198 207922 157663 137745 271093
9136 271093 340747 324080 214562 247473 248732 233158 164300 193014 274220 275380 262942 101369
9124 101369 53421 75878 76583 109296 77653 25928 88240 106031 144164 267439 288132 267684
9112 267684 191061 126612 110802 114459 140552 228243 326439 251049 156088 77523 38765 101645
9100 101645 40184 62243 66626 110964 157380 179550 241075 260716 277677 336395 281965 279584
9088 279584 199705 149241 237769 150897 -10874 -25911 62062 -16552 73094 235336 267638
9077 267638 145109 45487 -18081 -50043 20017 68635 155969 140533 135354 91301 90840 184720
$$ packed form
9158f3613L6893J77244J6042j36573O047m6494J14778Q1558J11266J06233J25033
9147E28414j67411k3360m039o8999k1609r6470j0328P1724n0259j9918J33348
9136B71093O9654j6667j09518L2911J259j5574o8858K8714Q1206J160j2438j61573
9124A01369m7948K2457P05L2713l1643n1725O2312J7791L8133J23275K0693k0448
9112B67684p6623o4449j5810L657K6093Q7691R8196p5390r4961p8565l8758O2880
9100A01645o1461K2059M383M4338M6416K2170O1525J9641J6961N8718n4430k381
9088B79584p9879n0464Q8528q6872j61771j5037Q7973p8614Q9646J62242L2302
9077B67638j22529r9622o3568l1962P0060M8618Q7334j5436n179m4053m61R3880
$$ plain form
9065 184720 127898 24586 51439 109012 22261 19965 -56296 -105991 -111692 -81979 30992 -9530
9053 -9530 -47462 -8849 45355 196002 233150 180452 167020 145294 198359 232439 83681 -85975
9041 -85975 -117692 8163 16131 -115443 -73306 -54191 65569 -24034 -86393 9311 212301
9030 212301 181368 224864 255798 281959 380107 345891 263158 298281 356197 231119 214412
9019 214412 237113 196381 162760 200562 311357 353954 384150 300466 225108 172219 86736
9008 86736 170143 159953 5373 -118150 -52372 -15377 -70928 24714 143340 284882 285272
8997 285272 167181 91616 74531 -6928 -96113 -22762 -5651 -17212 -32916 6237 -9843
8986 -9843 8773 70040 58491 199222 370973 393829 224336 168504 69253 61196 -38617 7559
$$ packed form
9065A84720n6822j03312K6853N7573q6751k296p6261m9695n701K9713J12971m0522
9053i530l7932L8613N4204J50647L7148n2698j3432k1726N3065L4080j48758j69656
9041h5975l1717J25855P968j31574M2137J9115J19760q9603o2359R5704K02990
9030B12301l0933M3496L0934K6161R8148l4216q2733L5123N7916j25078j6707
9019B14412K2701m0732l3621L7802J10795M2597L0196q3684p5358n2889q5483
9008H6736Q3407j0190j54580j23523O5778L6995n5551R5642J18626J41542L90
8997B85272j18091p5565j7085q1459q9185P3351J7111j1561j5704L9153j6080
8986i843J8616O1267j1549J40731J71751K2856j69493n5832r9251q057r9813M6176
$$ plain form
8974 7559 122043 78387 184761 216963 154604 73334 -56589 -57319 -70208 -144613 -40383 -81233
8962 -81233 -37582 -50295 -35749 13495 66487 175568 71699 203669 271630 158072 88901
8951 88901 138615 147282 -44292 -56150 -39104 -50772 -64131 5404 -47191 -45959 -31940 60212
8939 60212 125598 198038 284370 237147 64443 54838 -130425 -84779 -133933 -134025 -79115 -10181
8927 -10181 68933 80995 197582 249252 205767 176003 104832 170629 145918 87789 172366 298531
8915 298531 348757 313758 315447 273550 214922 116865 98670 105391 167602 171591 148347 190023
8903 190023 271585 191849 169300 107752 87562 146196 31630 51397 131883 182212 60894
8892 60894 -126053 -55652 211833 337298 266597 236818 287054 280615 255829 105903 -38047
$$ packed form
8974G559J14484m3656J06374L2202o2359q1270j29923p30j2889p4405J04230m0850
8962h1233M3651j2713J4546M9244N2992J09081j03869J31970O7961j13558o9171
8951H8901M9714Q667j91574j1858J7046j1668j3359O9535n2595J232J4019R2152
8939F0212O5386P2440Q6332m7223j72704r605j85263M5646m9154r2N4910O8934
8927a0181P9114J2062J16587N1670m3485k9764p1171O5797k4711n8129Q4577J26165
8915B98531N0226l4999J689m1897n8628r8057j8195O721O2211L989k3244M1676
8903A90023Q1562p9736k2549o1548k0190N8634j14566J9767Q0486N0329j21318
8892F0894j86947P0401K67485J25465p0701k9779N0236o439k4786j49926j43950
$$ plain form
8881 -38047 -90820 -174920 -73470 160909 132983 121151 120298 140866 61655 -28876 -83016 -155162
8869 -155162 -194598 -140258 -86269 -23653 16778 -3550 -67783 -103863 127626 207597 268890
8858 268890 93851 -92761 33271 151355 79836 81248 105558 202270 299771 259580 195836
8847 195836 251134 170620 132648 174253 3855 -74386 -95052 -44540 62577 127433 47545
8836 47545 75445 22868 -101704 -114315 -80460 11922 125356 159772 77986 102428 145528
8825 145528 193061 126505 13208 96751 203679 351696 299939 270101 152882 -26240 -7188
8814 -7188 -2425 -113688 -228760 -206980 -123591 -171296 -81528 -29703 -55189 -70403 -33235 -94455
8802 -94455 -279780 -324211 -421624 -196679 -41430 -60232 -28906 -40355 -13689 57753 85205
$$ packed form
8881c8047n2773q4100J01450K34379k7926j1832q53K0568p9211r0531n4140p2146
8869a55162l9436N4340N3989O2616M0431k0328o4233l6080K31489P9971O1293
8858B68890j75039j86612J26032J18084p1519J412K4310R6712R7501m0191o3744
8847A95836N5298q0514l7972M1605j70398p8241k0666N0512J07117O4856p9888
8836D7545K7900n2577j24572j2611L3855R2382J13434L4416q1786K4442M3100
8825A45528M7533o6556j13297Q3543J06928J48017n1757k9838j17219j79122J9052
8814g188M763j11263j15072K1780Q3389m7705Q9768N1825k5486j5214L7168o1220
8802i4455j85325m4431r7413K24945J55249j8802L1326j1449K6666P1442K7452
$$ plain form
8791 85205 134254 96859 36190 72566 128092 191966 82475 -32956 15903 87167 -28106
8780 -28106 -3734 27150 112121 60956 -7866 -4367 103183 -5443 -575 74574 63431 117569
8768 117569 35609 67780 232567 285354 131396 18371 41425 32047 58955 38257 51060
8757 51060 -33899 -63727 -135395 -140129 -69159 -53736 -2122 -20887 -23079 21631 -38855 -8855
8745 -8855 78475 27665 -16846 -55167 -34889 -54086 -118970 -234171 -217204 -119094 7670 105724
8733 105724 -11742 -116857 -86074 91305 191199 272223 245272 236599 197470 165153 221420
8722 221420 227954 163022 68658 220985 151092 101062 -61421 -106607 8902 5707 71550
8711 71550 148920 220012 252571 178192 215446 247206 290344 271617 285547 272346 131746 -2459
$$ packed form
8791H5205M9049l7395o0669L6376N5526O3874j09491j15431M8859P1264j15273
8780b8106K4372L0884Q4971n1165o8822L499J07550j08626M868P5149j1143N4138
8768A17569q1960L2171J64787N2787j53958j13025K3054r378K6908k0698J2803
8757E1060q4959k9828p1668m734P0970J5423N1614j8765k192M4710o0486L0000
8745h855Q7330n0810m4511l8321K0278j9197o4884j15201J6967R8110J26764R8054
8733A05724j17466j05115L0783J77379R9894Q1024k6951q673l9129l2317N6267
8722B21420O534o4932r4364J52327o9893n0030j62483m5186J15509l195O5843
8711G1550P7370P1092L2559p4379L7254L1760M3138j8727J3930j3201j40600j34205
$$ plain form
8699 -2459 42427 89434 36844 147369 197182 180430 83284 77400 129723 272345 334335 255604
8687 255604 65430 -40884 -6690 102090 153264 162378 239062 232283 214250 236179 247277
8676 247277 205943 43623 -56932 -21796 -27666 6437 18299 2968 -43200 8396 77010
8665 77010 32060 87939 240861 237626 233330 223645 219399 120857 39836 23508 153290 97340
8653 97340 103990 87086 152736 112700 20950 15578 122678 85265 78705 68341 -48252 -43501
8641 -43501 71782 45905 -41423 -40290 60933 50889 -13184 1900 40180 -8175 -12005 -57024
8629 -57024 -94977 -100530 -6280 60780 52578 116063 200629 394900 317186 343763 259019 -7135
8617 -7135 -101325 -101458 -168397 -251660 -156391 52485 84639 47878 30329 -102160 -92830 82093
$$ packed form
8699b459M4886M7007n2590J10525M9813j6752r7146n884N2323J42622O1990p8731
8687B55604j90174j06314L4194J08780N1174R114P6684o779j8033K1929J1098
8676B47277m1334j62320j00555L5136n870L4103J1862j5331m6168N1596O8614
8665G7010m4950N5879J52922l235m296r685m246r8542q1021j6328J29782n5950
8653I7340O650j6904O5650m0036r1750n372J07100l7413o560j0364j16593M751
8641d3501J15283k5877q7328J133J01223j0044o4073J5084L8280m8355l830m5019
8629e7024l7953n553R4250O7060q202O3485Q4566J94271p7714K6577q4744k66154
8617g135r4190j33o6939q3263R5269K08876L2154l6761j7549j32489R330J74923
$$ plain form
8605 82093 30027 16743 -13100 24053 110675 106330 18873 95890 12920 -113766 -26433 -24179
8593 -24179 -93105 19925 102871 46787 -17842 -123228 -61735 69158 82004 -35396 -51913
8582 -51913 73722 11288 -80493 10232 47291 51994 -113805 -50689 46944 60822 -927 -13299
8570 -13299 -96569 -22913 162668 -9846 -91398 -31400 8848 6618 64012 -56591 -234727
8559 -234727 -319883 -322245 -273063 -243529 -221278 -242274 -182107 -109578 -168476 -186932 -159424 -113959
8547 -113959 -114466 8385 15178 -84057 -33140 39779 35853 -64540 -69119 77468 38348 -84811
8535 -84811 -71938 29338 35730 -12361 -119179 -216573 -218916 -209307 -121360 -123290 -83664 -272749
8523 -272749 -184630 -62914 -195654 -176822 99357 266118 277959 188933 180671 45233 -8151
$$ packed form
8605H2093n2066j3284k9843L7153Q6622m345q7457P7017q2970j26686Q7333K254
8593b4179o8926J13030Q2946n6084o4629j05386O1493J30893J2846j17400j6517
8582e1913J25635o2434r1781R0725L7059M703j65799O3116R7633J3878o1749j2372
8570a3299q3270P3656J85581j72514q1552N9998M0248k230N7394j20603j78136
8559b34727q5156k362M9182K9534K2251k0996O0167P2529n8898j8456K7508M5465
8547a13959n07J22851O793r9235N0917P2919l926j00393m579J46587l9120j23159
8535h4811J2873J01276O392m8091j06818r7394k343R609Q7947j930L9626j89085
8523b72749Q8119J21716j32740J8832K76179J66761J1841q9026q262j35438n3384
$$ plain form
8512 -8151 49921 64174 -52545 -79218 -64365 -27693 13036 58040 -3168 -41483 -106441 -10602
8500 -10602 25013 80955 135219 203847 83828 -23905 -46866 -14730 5388 19520 -25183
8489 -25183 -50793 9611 -87211 -143573 -86713 -49806 -12572 112245 44749 -2720 49500 64027
8477 64027 113999 -3327 -234646 -146201 -6229 -57572 -109034 -22426 54651 108158 103670
8466 103670 300757 138859 -17021 -179487 -195892 -64274 -23084 -57582 -147384 -131420 -129705
8455 -129705 -111320 46227 78838 97926 -14861 49657 21053 97550 137466 62962 63325 52446
8443 52446 -45222 -29994 45297 -17126 -58418 -74202 7146 22381 -9209 -143767 -148615 67328
8431 67328 41307 22999 15127 -97705 -109626 40788 44549 195667 157756 33635 132923
$$ packed form
8512h151N8072J4253j16719k6673J4853L6672M0729M5004o1208l8315o4958R5839
8500a0602L5615N5942N4264O8628j20019j07733k2961L2136K0118J4132m4703
8489b5183k5610O0404r6822n6362N6860L6907L7234J24817o7496m7469N2220J4527
8477F4027M9972j17326k31319Q8445J39972n1343n1462Q6608P7077N3507m488
8466A03670J97087j61898j55880j62466j6405J31618M1190l4498q9802J5964J715
8455a29705J8385J57547L2611J9088j12787O4518k8604P6497L9916p4504L63j0879
8443E2446r7668J5228P5291o2423m1292j5784Q1348J5235l1590j34558m848K15943
8431F7328k6021j8308p872j12832j1921J50414L761J51118l7911j24121R9288
$$ plain form
8420 132923 226891 137724 13404 -98426 -159038 29703 142167 215144 181911 188608 194833
8409 194833 135345 -64285 -83568 -8923 -48970 -138470 -38290 -115958 -178329 -55036 -27388
8398 -27388 12670 119275 98128 -26311 4592 24985 -66441 -86967 -87670 -144819 -80282 -117961
8386 -117961 -126187 -61372 -98326 -22553 163195 215411 215546 147360 44052 22952 38707 149205
8374 149205 90726 -6186 -176860 -224220 -156800 -70402 -28328 -25367 73409 56807 63860 -6519
8362 -6519 -20787 -121070 -199507 -162875 -61728 12744 -6671 5943 30996 115834 155458 38333
8350 38333 45317 150757 96321 138782 92391 126573 135944 168630 164325 -10362 -33989 -88121
8338 -88121 -49278 -149135 -284551 -200686 -1256 143066 62436 180 121509 153092 -22879
$$ packed form
8420A32923R3968q9167j24320j11830o0612J88741J12464P2977l3233O697O225
8409A94833n9488j99630j9283P4645m0047q9500J00180p7668o2371J23293K7648
8398b7388M0058J06605k1147j24439L0903K0393r1426k0526p03n7149O4537l7679
8386a17961q226O4815l6954P5773J85748N2216J35o8186j03308k1100J5755J10498
8374A49205n8479r6912j70674m7360O7420Q6398M2074K961R8776j6602P053p0379
8362f519j4268j00283p8437L6632J01147P4472j9415J2614K5053Q4838L9624j17125
8350C8333O984J05440n4436M2461m6391L4182R371L2686m305j74687k3627n4132
8338h8121L8843r9857j35416Q3865J99430J44322q0630o2256J21329L1583j75971
$$ plain form
8327 -22879 2723 47227 -94692 -209254 -247121 -112401 -156029 -204748 -207769 -158178 -163281 -48615
8315 -48615 86514 53684 -29752 -60788 -193655 -85274 35910 47125 73629 188687 300168
8304 300168 182655 224465 221413 62175 110650 141422 138875 86429 45442 -54742 -232141
8293 -232141 -191972 -168164 -191009 -150628 -95782 -43380 -36845 -67973 -21739 39900 -31847 -101520
8281 -101520 -62639 80657 185403 231002 87922 -44208 -61672 -185379 -164450 -106043 -5164
8270 -5164 -18118 45400 63921 37086 104462 -16065 63264 10932 -71509 6188 155345 72463
8258 72463 -5707 -39824 -73871 -72807 16712 84715 61950 13156 -50489 68004 173913 313959
8246 313959 299683 201972 121473 -7093 12869 23295 -175419 -446008 -473679 -293229 -263232
$$ packed form
8327b2879K5602M4504j41919j14562l7867J34720m3628m8719l021M9591n103J14666
8315d8615J35129l2830q3436l1036j32867J08381J21184J1215K6504J15058J11481
8304C00168j17513M1810l052j59238M8475L0772k547n2446m0987j00184j77399
8293b32141M0169K3808k2845M0381N4846N2402O535l1128M6234O1639p1747o9673
8281a01520L8881J43296J04746M5599j43080j32130j7464j23707K0929N8407J00879
8270e164j2954O3518J8521k6835O7376j20527P9329n2332q2441P7697J49157q2882
8258G2463p8170l4117l4047J064Q9519O8003k2765m8794o3645J18493J05909J40046
8246C13959j4276r7711q0499j28566J9962J0426j98714k70589k7671J80450K9997
$$ plain form
8235 -263232 -306536 -272498 -225314 -275791 -289461 -337103 -271770 -90745 -86418 -98039 -5066 11172
8223 11172 34286 182667 -18387 -146999 -41943 95462 43262 -96017 -250098 -189165
8213 -189165 -171633 -277198 -303948 -208574 -141872 -58027 -101347 -191304 -176823 -77736 -9558
8202 -9558 155731 132409 20668 -76806 -17064 56358 89241 104564 106157 59739 131662 219704
8190 219704 209792 161603 19298 -58330 27955 -40556 -178622 -97206 64251 95065 98693
8179 98693 91092 38722 97533 122104 -4906 -124508 -102410 25134 -18164 -13048 102802
8168 102802 26059 -47295 1854 -21108 5697 -45461 31994 112895 95001 40037 98464 -19740
8156 -19740 -80043 -50632 43332 7888 -105435 -310179 -260505 -77203 -11981 -59593 23235
$$ packed form
8235b63232m3304L4038M7184n0477j3670m7642O5333J81025M327j1621R2973J6238
8223A1172K3114J48381k01054j28612J05056J37405n2200j39279j54081O0933
8213a89165J7532j05565k6750R5374O6702Q3845m3320q9957J4481R9087O8178
8202i558J65289k3322j11741r7474N9742P3422L2883J5323J593m6418P1923Q8042
8190B19704r912m8189j42305p7628Q6285o8511j38066Q1416J61457L0814L628
8179I8693p601n2370N8811K4571j27010j19602K2098J27544m3298N116J15850
8168A02802p6743p3354M9149k2962K6805n1158P7455Q0901j7894n4964N8427j18204
8156a9740o0303K9411R3964l5444j13323k04744M9674J83302O5222m7612Q2828
$$ plain form
8145 23235 185192 13861 5163 104396 149112 240895 240178 35310 -169190 -133219 -60255 -2368
8133 -2368 -79830 -69695 30938 72252 176708 -2200 -2212 66762 90769 -53440 -198477 -247707
8121 -247707 -100683 -66758 -156556 -75762 -45096 -166658 -149018 -56004 34346 14991 17248
8110 17248 82296 -4528 106857 219284 75577 53596 75579 45153 -24285 45977 83383
8099 83383 19032 84323 11404 -133960 -37573 84915 114233 134778 190083 130868 146821
8088 146821 125413 -42319 -50771 -12777 438 -38995 76832 88900 104971 -15000 -122257
8077 -122257 -103512 22642 -32299 7545 61400 82295 136117 167733 125902 195030 146310
8066 146310 258279 294403 165911 44558 -57302 -172454 -89004 -101623 -219270 -210109 -59605
$$ packed form
8145B3235J61957j71331q698R9233M4716R1783p17k04868k04500L5971P2964N7887
8133b368p7462J0135J00633M1314J04456j78908j2O8974K4007j44209j45037m9230
8121b47707J47024L3925q9798Q0794L0666j21562J7640R3014R0350j9355K257
8110A7248O5048q6824J11385J12427j43707k1981K1983l0426o9438P0262L7406
8099H3383o4351O5291p2919j45364R6387J22488K9318K0545N5305n9215J5953
8088A46821k1408j67732q452L7994J3215l9433J15827J2068J6071j19971j07257
8077a22257J8745J26154n4941L9844N3855K0895N3822L1616m1831O9128m8720
8066A46310J11969L6124j28492j21353j01860j15152Q3450j2619j17647R161J50504
$$ plain form
8055 -59605 -15480 -50848 -117269 -233288 -113214 -42730 -145359 -124838 -80728 4039 -60438
8044 -60438 -73459 38522 144882 157552 108065 19297 -64719 -85120 -56593 -90022 -155567
8033 -155567 -219186 -247030 -173667 -2855 56432 107888 96041 118953 96176 33537 -64897
8022 -64897 -40840 -39943 -41114 -93903 -83072 10935 159293 200293 156203 221665 128597 136903
8010 136903 166530 27365 -6277 -57254 -123912 -226582 -314480 -338945 -133360 -102883 -104058
7999 -104058 -5637 -41628 -193142 -163262 -42126 -82823 -199962 -150015 -151147 -240104 -139800
7988 -139800 -31907 -63014 -62669 187406 140863 56139 -35452 -87682 -112233 -219522 -128641
7977 -128641 -13265 -33523 -130240 -200171 -265557 -300966 -151687 -171915 -81410 -52788 95248
$$ packed form
8055e9605M4125l5368o6421j16019J20074P0484j02629K0521M4110Q4767o4477
8044f0438j3021J11981J06360J2670m9487q8768q4016k0401K8527l3429o5545
8033a55567o3619k7844P3363J70812N9287N1456j1847K2912k2777o2639r8434
8022f4897K4057Q97j171n2789J0831R4007J48358M1000m4090O5462r3068Q306
8010A36903K9627j39165l3642n0977o6658j02670q7898k4465K05585L0477j175
7999a04058R8421l5991j51514K9880J21136m0697j17139M9947j132q8957J00304
7988a39800J07893l1107L45K50075m6543q4724r1591n2230k4551j07289R0881
7977a28641J15376k0258r6717o9931o5386l5409J49279k0228R0505K8622J48036
$$ plain form
7966 95248 77084 -25285 -34393 -111414 74985 124253 -39480 -197130 -107793 -111672 -77753
7955 -77753 -184577 -242751 -373081 -259705 -234468 -248061 -232709 -225904 -153548 -195027 -213658
7944 -213658 -68209 63133 165450 119892 61333 50193 -7532 -54686 -52807 40322 12392
7933 12392 42995 128749 73319 -155995 -305954 -294090 -239060 -201194 -202488 -189030 -53291
7922 -53291 -20599 22623 98728 96249 -33289 -15652 131583 25618 -60111 88978 8406
7911 8406 -61803 -86454 -321728 -309216 -125815 -85849 -62448 34389 -38939 46151 180307
7900 180307 117377 125396 36014 -86306 48470 161304 162095 203328 224585 100682 181951
7889 181951 173242 44368 -91746 -212342 -233557 -252343 -153758 -74308 -25793 19195 -103758
$$ packed form
7966I5248j8164j02369r108p7021J86399M9268j63733j57650Q9337l879L3919
7955g7753j06824n8174j30330J13376K5237j3593J5352O805P2356m1479j8631
7944b13658J45449J31342J02317m5558n8559j1140n7725m7154J879R3129k7930
7933A2392L0603Q5754n5430k29314j49959J1864N5030L7866j294J3458J35739
7922e3291L2692M3222P6105k479j29538J7637J47235j05965q5729J49089q0572
7911H406p0209k4651k35274J2512J83401L9966K3401R6837p3328Q5090J34156
7900A80307o2930Q019q9382j22320J34776J12834P91M1233K1257j23903Q1269
7889A81951q709j28874j36114j20596k1215j8786R8585P9450M8515M4988j22953
$$ plain form
7878 -103758 -78604 -61208 -41759 -38811 5900 27248 -75576 16147 126742 162184 56621
7867 56621 -46453 -88384 -106154 -99397 -50728 45456 110825 192056 177636 120734 66389 64237
7855 64237 6274 -101094 -205386 -213130 -147099 -21345 -44619 -29713 -74318 15593 41659
7844 41659 -60068 -52401 63718 68790 53345 -120205 -159053 -56839 120717 165053 36917
7833 36917 -63041 -1905 -186879 -286724 -211416 -149704 -260078 -361563 -269264 -107510 -138299
7822 -138299 -180100 -68259 131408 84952 27857 65658 199182 184889 31544 67142 -79250
7811 -79250 -88384 -54601 6384 19507 -9697 -21010 -111340 -79309 -39088 17014 97558 140303
7799 140303 152147 80880 54944 -12866 -6909 -167935 -292059 -234555 -200022 -256449 -212167
$$ packed form
7878a03758K5154J7396J9449K948M4711K1348j02824R1723J10595L5442j05563
7867E6621j03074m1931j7770O757M8669R6184O5369Q1231j4420n6902n4345k152
7855F4237n7963j07368j04292p744O6031J25754k3274J4906m4605Q9911K6066
7844D1659j01727P667J16119N072j5445j73550l8848J02214J77556M4336j28136
7833C6917r9958O1136j84974r9845P5308O1712j10374j01485R2299J61754l0789
7822a38299m1801J11841J99667m6456n7095L7801J33524j4293j53345L5598j46392
7811g9250r134L3783O0985J3123k9204j1313r0330L2031M0221N6102Q0544M2745
7799A40303J1844p1267k5936o7810N957j61026j24124N7504L4533n6427M4282
$$ plain form
7788 -212167 -152993 -192241 -200196 -195531 -105380 -154781 -150551 12617 -65011 -126398 -90588 26950
7776 26950 120402 76431 104127 112765 88159 111694 60380 -18070 -102413 -193526 -221455 -236892
7764 -236892 -114568 16496 42219 -52888 -41844 -73220 -59739 14816 12843 5170 -21117 -23846
7752 -23846 31564 24661 61962 222053 276687 178508 99521 7822 -96870 -150438 -168693 -113513
7740 -113513 -139331 -186354 -169328 -155983 -61615 55557 -29590 -174821 -287706 -270374 -141394
7729 -141394 -147542 -206559 -149441 -20416 7373 88305 92032 46454 3901 -103743 -176492 -155178
7717 -155178 -164495 -276680 -288448 -214267 -135473 -87405 2924 -40328 -90530 -167002 -324806
7706 -324806 -385353 -238043 -209922 -126885 31706 -40341 8243 56732 122340 122099 134846 93086
$$ packed form
7788b12167N9174l9248p955M665R0151m9401M230J63168p7628o1387L5810J17538
7776B6950R3452m3971K7696Q638k4606K3535n1314p8450q4343r1113k7929j5437
7764b36892J22324J31064K5723r5107J1044l1376J3481P4555j973p673k6287k729
7752b3846N5410o903L7301J60091N4634r8179p8987r1699j04692n3568j8255N5180
7740a13513k5818m7023J7026J3345R4368J17172q5147j45231j12885J7332J28980
7729a41394o148n9017N7118J29025K7789Q0932L727m5578m2553j07644p2749K1314
7717a55178r317j12185j1768P4181P8794M8068R0329m3252n0202p6472j57804
7706c24806o0547J47310K8121Q3037J58591p2047M8584M8489O5608k41J2747m1760
$$ plain form
7694 93086 108361 64186 -10812 30187 93355 -77072 -242903 -344416 -417122 -253667 -100726
7683 -100726 -136218 -72398 -52152 -36858 14749 43644 21773 1209 17893 26857 56341 117016
7671 117016 51632 32898 -87250 -144736 -191191 -170099 -57088 -122971 -80528 12164 53001
7660 53001 39146 -26314 119677 156039 212479 120427 -30882 -39972 34954 177676 190483
7649 190483 196559 325277 391762 254663 55872 -53199 -89457 5432 24600 58729 75208
7638 75208 129968 119622 -74176 -24078 28564 139844 274875 159841 69811 -37136 -100241
7627 -100241 -200263 -320926 -172278 -174911 -173738 -173000 -125644 -83831 -88824 -205686 -218757 -130936
7615 -130936 155474 220899 135459 174796 124992 68489 82577 23385 -97522 -182867 -105283
$$ packed form
7694I3086J5275m4175p4998M0999O3168j70427j65831j01513p2706J63455J52941
7683a00726l5492O3820K0246J5294N1607K8895k1871k0564J6684Q964K9484O0675
7671A17016o5384j8734j20148n7486m6455K1092J13011o5883M2443R2692M0837
7660E3001j3855o5460J45991L6362N6440r2052j51309r090P4926J42722J2807
7649A90483O076J28718O6485j37099j98791j09071l6258R4889J9168L4129J6479
7638G5208N4760j0346j93798N0098N2642J11280J35031j15034r0030j06947o3105
7627a00241j00022j20663J48648k633J173P38M7356M1813m993j16862j3071Q7821
7615a30936K86410O5425q5440L9337m9804n6503J4088n9192j20907q5345P7584
$$ plain form
7604 -105283 -10214 72844 81237 -16857 -63217 -104372 -151488 -253329 -389101 -299255 -133081
7593 -133081 -157167 2249 54274 44530 110486 19792 -103507 -95648 -58860 -89814 -162442 -200469
7581 -200469 -276547 -309197 -142845 29021 28064 87470 55076 120386 39428 -6383 30302 9335
7569 9335 -36782 -61375 -67371 -62573 102038 -673 -112891 -156216 -218261 -190709 -124003 -95344
7557 -95344 -16816 108300 9859 -171860 -229977 -67807 20866 13969 -267161 -339917 -191185
7546 -191185 -199684 -173772 -240200 -143739 -32612 88862 -16831 -132182 -46739 -117036 -129458
7535 -129458 -164405 -169132 -39907 -86300 -171809 -133983 -90162 -193400 -179141 -116502 -83955
7524 -83955 -181323 -93710 -24502 -108020 -214871 -113670 -33138 35805 160762 25540 -115011
$$ packed form
7604a05283R5069Q3058Q393r8094m6360m1155m7116j01841j35772Q9846J66174
7593a33081k4086J59416N2025r744O5956r0694j23299P859L6788l0954p2628l8027
7581b00469p6078l2650J66352J71866r57N9406l2394O5310q0958m5811L6685k0967
7569I335m6117k4593n996M798J64611j02711j12218m3325o2045K7552O6706K8659
7557i5344P8528J25116r8441j81719n8117J62170Q8673o897k81130p2756J48732
7546a91185q499K5912o6428R6461J11127J21474j05693j15351Q5443p0297j2422
7535a29458l4947m727J29225m6393q5509L7826M3821j03238J4259O2639L2547
7524h3955r7368Q7613O9208q3518j06851J01201Q0532O8943J24957j35222j40551
$$ plain form
7513 -115011 -101053 -16378 37600 -5897 -89036 -208828 -294879 -316846 -140703 42357 96736
7502 96736 -47076 -94738 30752 90066 168589 83760 -91388 -140253 -99925 -98656 -130857
7491 -130857 -80862 34813 123328 195136 106480 35803 -12043 15275 52276 8488 -21659
7480 -21659 -73560 4317 103752 49050 34485 21349 -27838 30801 24575 -54507 -106376 -110629
7468 -110629 -62951 -109096 -100098 -77211 453 -89561 -119594 -76079 -63977 -15307 -34021 -134841
7456 -134841 -22557 13551 -2505 81518 52523 30764 -59811 -119372 -103647 95546 129939
7445 129939 26518 63502 107419 61341 192004 76324 64571 128822 35654 -198171 -166114
7434 -166114 30085 170679 198555 116448 -24997 -132471 -160758 -148450 -226676 -85490 -107825
$$ packed form
7513a15011J3958Q4675N3978m3497q3139j19792q6051k1967J76143J83060N4379
7502I6736j43812m7662J25490N9314P8523q4829j75148m8865M0328J269l2201
7491a30857M9995J15675Q8515P1808q8656p0677m7846K7318L7001m3788l0147
7480b1659n1901P7877R9435n4702j4565j3136m9187N8639o226p9082n1869m253
7468a10629M7678m6145Q998K2887P7664r0014l0033M3515J2102M8670j8714j00820
7456a34841J12284L6108j6056Q4023k8995k1759r0575n9561J5725J99193L4393
7445A29939j03421L6984M3917m6078J30663j15680j1753O4251r3168k33825L2057
7434a66114J96199J40594K7876q2107j41445j07474k8287J2308p8226J41186k2335
$$ plain form
7423 -107825 -178612 40177 63075 -90930 -265705 -246235 -216024 -170466 -176902 -177140 -271273 -325376
7411 -325376 -329308 -336299 -226028 -217222 -144592 -126215 -71425 -70586 -160132 -128349 -83529 -56672
7399 -56672 -71462 15569 309 -41102 -47017 58454 104967 -42742 -230100 -343408 -231237
7388 -231237 -226902 -110739 57777 135905 166270 214152 180964 130859 43607 45541 23921 -151751
7376 -151751 -95911 28399 -8450 42456 -3039 -35655 -43712 -65488 -52234 -26505 30741 113169
7364 113169 139736 156228 29885 51682 36021 -29379 -115370 -125824 -122751 -79163 -110178 -118895
7352 -118895 -91051 -15636 30106 92105 235789 299178 229405 103741 50214 15379 83321
7341 83321 59600 -17139 -189512 -176584 67297 166025 196698 247285 241784 93495 -86293
$$ packed form
7423a07825p0787K18789K2898j54005j74775J9470L0211M5558o436k38r4133n4103
7411c25376l932o991J10271Q806P2630J8377N4790Q39q9546L1783M4820K6857
7399e6672j4790Q7031j5260m1411n915J05471M6513j47709j87358j13308J12171
7388b31237M335J16163J68516P8128L0365M7882l3188n0105q7252J934k1620j75672
7376a51751N5840J24310l6849N0906m5495l2616q057k1776J3254K5729N7246Q2428
7364A13169K6567J6492j26343K1797j5661o5400q5991j0454L073M3588l1015q717
7352a18895K7844P5415M5742O1999J43684O3389o9773j25664n3527l4835O7942
7341H3321k3721p6739j72373J2928K43881R8728L0673N0587n501j48289j79788
$$ plain form
7330 -86293 -50847 -94038 -124562 -133309 -40804 9633 152021 106263 31660 -54829 -67751 34018
7318 34018 73020 66093 -34158 36301 85209 178333 188846 119549 12595 -86295 1151 -58386
7306 -58386 -39543 96209 171445 52420 -179530 -169194 -137779 -52686 -31551 -86883 -93641
7295 -93641 4540 42280 40777 83605 86777 108795 -8927 -22838 138500 138113 133791 91015
7283 91015 140479 87903 15122 -87116 -214811 -181577 -180954 -131078 -90959 -93864 -216421 -264912
7271 -264912 -114905 -86557 -21421 22922 -176354 -270569 -200618 -96258 62794 95517 124358
7260 124358 176483 164492 107461 16666 -38451 -113682 -106248 -105965 -26789 -68473 -87326 -142506
7248 -142506 -73673 -98426 -99175 -152801 -258008 -284814 -166599 -62020 -84292 -94559 107
$$ packed form
7330h6293L5446m3191l0524q747R2505N0437J42388m5758p4603q6489j2922J01769
7318C4018L9002o927j00251P0459M8908R3124J0513o9297j06954r8890Q7446n9537
7306e8386J8843J35752P5236j19025k31950J0336L1415Q5093K1135n5332o758
7295i3641R8181L7740j503M2828L172K2018j17722j3911J61338l87m322m2776
7283I1015M9464n2576p2781j02238j27695L3234O23M9876M0119k905j22557m8491
7271b64912J50007K8348O5136M4343j99276r4215O9951J04360J59052L2723K8841
7260A24358N2125j1991n7031r0795n5117p5231P434K83P9176m1684j8853n5180
7248a42506O8833k4753p49n3626j05207k6806J18215J04579k2272j0267R4666
$$ plain form
7237 107 30247 59784 -16295 7313 53305 106437 177554 157297 95527 -14027 -86933 -53273
7225 -53273 72589 72750 -36150 -18860 68148 105666 102231 47951 114140 -12826 -128237 -191765
7213 -191765 -234743 -260532 -264012 -139818 -8031 -22328 -53702 -35045 -249479 -293544 -192298
7202 -192298 -127206 -46574 7162 -53358 -84656 -208338 -240221 -147666 12819 155405 84340
7191 84340 -44241 -71106 -277470 -353191 -215760 -180354 -179959 -142021 -117105 -187597 -70717
7180 -70717 80507 191507 209733 99202 35629 -72771 -90710 4195 81137 44066 7429
7169 7429 72717 151640 27282 -70952 -31383 -97562 -170601 -154639 -115634 85989 225044
7158 225044 149323 72140 26680 -9314 -46538 -66661 -178353 -302422 -243188 -112448 -111147
$$ packed form
7237A07L0140K9537p6079K3608M5992N3132P1117k0257o1770j09554p2906L3660
7225e3273J25862J61j08900J7290Q7008L7518l435n4280O6189j26966j15411o3528
7213a91765m2978k5789l480J24194J31787j4297l1374J8657k14434m4065J01246
7202a92298O5092Q0632N3736o0520l1298j23682l1883R2555J60485J42586p1065
7191H4340j28581k6865k06364p5721J37431L5406L95L7938K4916p0492J16880
7180g0717J51224J11000J8226j10531o3573j08400j7939R4905P6942l7071l6637
7169G429O5288P8923j24358r8234L9569o6179p3039J5962L9005K01623J39055
7158B25044p5721p7183m5460l5994l7224k0123j11692j24069N9234J30740J301
$$ plain form
7147 -111147 -74101 -281301 -437490 -484446 -353034 -218544 -179820 -172297 -34983 68443 -71187
7136 -71187 -94250 -69462 -38546 -184368 -175393 -185048 -153152 -244199 -248652 -62553 56306 126085
7124 126085 135200 41650 -77895 -126927 -124989 6501 -54962 -270944 -261126 -275571 -95440
7113 -95440 -103914 -261687 -309647 -82599 127736 157203 133485 59515 9223 33020 68303
7102 68303 -59416 -115654 -249023 -217284 -72452 37073 83062 142430 237699 172968 8053
7091 8053 -111132 -114928 -157540 -113152 -18429 -84249 -68088 -87915 -258352 -294274 -51087 18080
7079 18080 -100349 -176234 -122947 -82396 -78108 -26756 27236 67257 22902 20562 158918 181579
7067 181579 50826 -3060 30339 36526 128493 163567 121468 166345 97891 -24164 -35471
$$ packed form
7147a11147L7046k07200j56189m6956J31412J34490L8724P523J37314J03426j39630
7136g1187k3063K4788L0916j45822Q975r655L1896r1047m453J86099J18859O9779
7124A26085R115r3550j19545m9032J938J31490o1463k15982R818j4445J80131
7113i5440q474j57773m7960K27048K10335K9467k3718p3970n0292K3797L5283
7102F8303j27719n6238j33369L1739J44832J09525M5989N9368R5269o4731j64915
7091H053j19185l796m2612M4388R4723o5820J6161j9827j70437l5922K43187O9167
7079A8080j18429p5885N3287M0551M288N1352N3992M0021m4355k340J38356K2661
7067A81579j30753n3886L3399O187R1967L5074m2099M4877o8454j22055j1307
$$ plain form
7056 -35471 -12255 89130 -37262 -89145 -10306 110512 151505 65260 -174502 -264498 -187209
7045 -187209 -148865 -268363 -307924 -310105 -225079 -198077 -287427 -240501 -78145 -174266 -241874
7034 -241874 -111317 -239509 -291001 -175792 -266620 -278930 -208466 -123689 -108822 -44879 27627
7023 27627 244825 316608 204404 148667 129109 60377 1680 -56855 -13784 31081 -96442
7012 -96442 -110689 -105661 -78320 -113495 -179076 -195064 -206045 -266219 -237813 -79658 -86076 -76130
7000 -76130 21895 3185 -52771 32450 116292 57486 -43098 -102245 -226676 -255554 -160396
6989 -160396 -66030 -95670 -4052 -20090 -22501 13817 57610 16221 3192 128570 210690 113689
6977 113689 52583 39631 118108 179431 195546 98373 30387 -42539 -171066 -187926 -87813
$$ packed form
7056c5471K3216J01385j26392n1883P8839J20818M0993q6245k39762q9996P7289
7045a87209L8344j19498l9561k181Q5026K7002q9350M6926J62356r6121o7608
7034b41874J30557j28192n1492J15209r0828j2310P0464Q4777J4867O3943P2506
7023B7627K17198P1783j12204n5737j9558o8732n8697n8535M3071M4865j27523
7012i6442j4247N028K7341l5175o5581j5988j0981o0174K8406J58155o418R946
7000g6130R8025j8710n5956Q5221Q3842n8806j00584n9147j24431k8878R5158
6989a60396R4366k9640R1618j6038k411L6318M3793m1389j3029J25378Q2120r7001
6977A13689o1106j2952P8477O1323J6115r7173o7986p2926j28527j6860J00113
$$ plain form
6966 -87813 35159 6059 37871 -60279 32801 114613 92448 159689 112081 3449 36041
6955 36041 88858 189025 160387 -107953 -175340 -178002 -176935 -123969 -73503 -113795 -136390 -168561
6943 -168561 -25068 69025 -35396 -229553 -276043 -137485 -35345 26148 7868 127723
6933 127723 150681 124894 53856 -77626 -46638 23755 -127448 -179392 -132994 -30661 -30919
6922 -30919 68435 169725 92858 -138346 -277722 -268489 -86880 99592 -32289 -107039 -145776
6911 -145776 -197029 -200005 -206388 -229856 -259394 -221552 -293385 -319158 -169461 -101766 -52576 97507
6899 97507 181505 76328 -9258 -100093 -306046 -224229 -63453 43067 18104 -10335 -56345
6888 -56345 64817 37087 37042 49464 63225 -62808 -165835 -240545 -367231 -274290 -192002 -205330
$$ packed form
6966h7813J22972k9100L1812r8150R3080Q1812k2165O7241m7608j08632L2592
6955C6041N2817J00167k8638k68340o7387k662J067N2966N0466m0292k2595l2171
6943a68561J43493R4093j04421j94157m6490J38558J02140O1493j8280J19855
6933A27723K2958k5787p1038j31482L0988P0393j51203n1944M6398J02333k58
6922c0919R9354J01290p6867k31204j39376R233J81609J86472j31881p4750l8737
6911a45776n1253k976o383k3468k9538L7842p1833k5773J49697O7695M9190J50083
6899I7507Q3998j05177q5586r0835k05953Q1817J60776J06520k4963k8439m6010
6888e6345J21162k7730m5J2422J3761j26033j03027p4710j26686R2941Q2288j3328
$$ plain form
6876 -205330 -147783 -155755 -155246 -72364 -66008 -52209 -191437 -208221 -68222 -152881 -307556 -335154
6864 -335154 -262822 -167039 -118338 -62521 -26703 -15624 20224 21077 -58699 -68780 168474 268289
6852 268289 59585 51053 58534 13843 -184748 -148178 -89158 -204503 -223224 -233421 -206794
6841 -206794 -208746 -405840 -396694 -271935 -298726 -278858 -249393 -146282 -19090 -2214 -33561
6830 -33561 45614 41069 15265 -127874 -199295 -108073 7667 5577 -43832 -76050 -15069 46759
6818 46759 78959 69597 90026 -55304 -195247 -269716 -232479 -259738 -249802 -76697 33704
6807 33704 15729 -168501 -86048 19968 -47991 14093 -145733 -131991 -143261 -210350 -312466
6796 -312466 -190413 -152766 -142007 -133266 -130990 -210204 -187116 -183169 -2641 179965 44339
$$ packed form
6876b05330N7547p972N09Q2882O356J3799j39228j6784J39999q4659j54675k7598
6864c35154P2332R5783M8701N5817L5818J1079L5848Q53p9776j0081K37254R9815
6852B68289k08704q532P481m4691j98591L6570N9020j15345j8721j0197K6627
6841b06794j952j97094R146J24759k6791J9868K9465J03111J27192J6876l1347
6830c3561P9175m545k5804j43139p1421R1222J15740k090m9409l2218O0981O1828
6818D6759L2200r362K0429j45330j39943p4469L7237k7259R936J73105J10401
6807C3704j7975j84230Q2453J06016o7959O2084j59826J3742j1270o7089j02116
6796c12466J22053L7647J0759Q741K276p9214K3088L947J80528J82606j35626
$$ plain form
6785 44339 -8114 -67625 -47802 -117305 -239877 -193057 -101416 -130953 -178319 -80125 29234
6774 29234 35889 201041 241978 208068 92580 -72849 -95680 61841 132919 156182 -11615
6763 -11615 88021 212759 208039 229665 149193 85853 17535 9700 -75667 -200639 -191929 -10007
$$ packed form
6785D4339n2453n9511J9823o9503j22572M6820R1641k9537m7366R8194J09359
6774B9234O655J65152M0937l3910j15488j65429k2831J57521P1078K3263j67797
6763a1615R9636J24738m720K1626q0472o3340o8318p835q5367j24972Q710J81922
$$ [...]
##END NTUPLES=NMR SPECTRUM
##END=
