##TITLE=Analysis number 322142
Compound Code sb 02078
Project Code adrs
Chemist Name komarov
##JCAMPDX= 6.0         $$ Bruker NMR JCAMP-DX V2.0
##DATA TYPE= NMR SPECTRUM
##DATA CLASS= NTUPLES
##ORIGIN= Bruker BioSpin GmbH
##OWNER= nmr
$$ XWIN-NMR		Version 3.5
$$ Thu Sep 14 10:02:09 2006 GMT Daylight Time (UT+1h)  MAYBRIDGE\nmr@NMR_250MHZ
##.OBSERVE FREQUENCY= 250.131544655141
##.OBSERVE NUCLEUS= ^1H
##.ACQUISITION MODE= SIMULTANEOUS (DQD)
##.ACQUISITION SCHEME= undefined
##.AVERAGES= 16
##.DIGITISER RES= 18
##SPECTROMETER/DATA SYSTEM= dpx250
##.PULSE SEQUENCE= zg30
##.SOLVENT NAME= DMSO
##.SHIFT REFERENCE= (INTERNAL, DMSO, 0, 16.522)
##AUDIT TRAIL= $$ (NUMBER, WHEN, WHO, WHERE, WHAT)
$$ ##TITLE= Audit trail, XWIN-NMR		Version 3.5
$$ ##JCAMPDX= 5.01
$$ ##ORIGIN= Bruker BioSpin GmbH
$$ ##OWNER= nmr
$$ C:\u/data/dgb/nmr/ADRS/710/pdata/1/auditp.txt
$$ ##AUDIT TRAIL=  $$ (NUMBER, WHEN, WHO, WHERE, WHAT)
(   1,<2006-09-14 10:01:43.85 +100>,<MAYBRIDGE\nmr>,<NMR_250MHZ>,
      <created by zg, POWCHK disabled, PULCHK disabled
       configuration hash MD5:
       E2 DF 36 D8 04 B2 41 60 5A D7 A3 38 5A 4B D0 FE
       data hash MD5: 64K
       08 57 18 24 63 9A F2 CC 7D 43 97 1C 1F 78 55 90>)
(   2,<2006-09-14 10:01:59.05 +100>,<MAYBRIDGE\nmr>,<NMR_250MHZ>,
      <Start of raw data processing
       ef LB = 0.3 FT_mod = 6 PKNL = 1 SI = 32K 
       data hash MD5: 32K
       3B 35 CD E3 75 A4 D1 8F 35 E0 A1 AD A9 56 84 DB>)
(   3,<2006-09-14 10:02:00.68 +100>,<MAYBRIDGE\nmr>,<NMR_250MHZ>,
      <apk 
       data hash MD5: 32K
       CB E1 86 A2 BA B0 A4 F0 6B D8 EF 77 7E 6A F1 E7>)
(   4,<2006-09-14 10:02:01.49 +100>,<MAYBRIDGE\nmr>,<NMR_250MHZ>,
      <abs ABSG = 5 
       data hash MD5: 32K
       8C 1C C9 8B 36 C0 3A 41 FC 49 6B B4 1E F4 9B 48>)
$$ ##END=
$$ 
$$ hash MD5
$$ C5 8D 6E 8D 44 D3 6A D5 6B 2F A1 B3 9E 9F C5 F2
##$RELAX= 
##$RELAX= 
##$RELAX= 
##$RELAX= 
##$RELAX= 
##$RELAX= 
##$RELAX= 
$$ Bruker specific parameters
$$ --------------------------
##$DU= <C:\u>
##$EXPNO= 710
##$NAME= <ADRS>
##$PROCNO= 1
##$TYPE= <nmr>
##$USER= <dgb>
##$AMP= (0..31)
100 100 100 100 100 100 100 100 100 100 100 100 100 100 100 100 100 100 
100 100 100 100 100 100 100 100 100 100 100 100 100 100 
##$AQSEQ= 0
##$AQ_mod= 3
##$AUNM= <au_zg>
##$AUTOPOS= <32 >
##$BF1= 250.13
##$BF2= 250.13
##$BF3= 250.13
##$BF4= 250.13
##$BF5= 500.13
##$BF6= 500.13
##$BF7= 500.13
##$BF8= 500.13
##$BYTORDA= 1
##$CFDGTYP= 0
##$CFRGTYP= 5
##$CHEMSTR= <none>
##$CNST= (0..31)
1 1 145 1 1 1 1 1 1 1 1 1 1 1 1 1 1 1 1 1 1 1 1 1 1 1 1 1 1 1 1 1 
##$CPDPRG= <>
##$CPDPRG1= <>
##$CPDPRG2= <>
##$CPDPRG3= <>
##$CPDPRG4= <mlev>
##$CPDPRG5= <mlev>
##$CPDPRG6= <mlev>
##$CPDPRG7= <mlev>
##$CPDPRG8= <mlev>
##$CPDPRGB= <>
##$CPDPRGT= <>
##$D= (0..31)
0 1 0 0 0 0 0 0 0 0.06 0 0 0 0 0 0 0.0002 0 0 0 0 0 0 0 0 0 0 0 0 0 0 
0 
##$DATE= 1158224502
##$DBL= (0..7)
120 120 120 120 120 120 120 120 
##$DBP= (0..7)
150 150 150 150 150 150 150 150 
##$DBP07= 0
##$DBPNAM0= <>
##$DBPNAM1= <>
##$DBPNAM2= <>
##$DBPNAM3= <>
$$ [...]
##$SUBNAM7= <"">
##$SUBNAM8= <"">
##$SUBNAM9= <"">
##$SW= 20.6930455092707
##$SWIBOX= (0..15)
0 0 3 0 0 0 0 0 0 0 0 0 0 0 0 0 
##$SW_h= 5175.983436853
##$TD= 65536
##$TD0= 1
##$TE= 295.16
##$TE2= 300
##$TE3= 300
##$TEG= 300
##$TL= (0..7)
0 120 120 120 120 120 120 120 
##$TP= (0..7)
150 150 150 150 150 150 150 150 
##$TP07= 0
##$TPNAME0= <>
##$TPNAME1= <>
##$TPNAME2= <>
##$TPNAME3= <>
##$TPNAME4= <>
##$TPNAME5= <>
##$TPNAME6= <>
##$TPNAME7= <>
##$TPOAL= (0..7)
0.5 0.5 0.5 0.5 0.5 0.5 0.5 0.5 
##$TPOFFS= (0..7)
0 0 0 0 0 0 0 0 
##$TUNHIN= 0
##$TUNHOUT= 0
##$TUNXOUT= 0
##$USERA1= <user>
##$USERA2= <user>
##$USERA3= <user>
##$USERA4= <user>
##$USERA5= <user>
##$V9= 5
##$VALIST= <valist>
##$VCLIST= <CCCCCCCCCCCCCCC>
##$VD= 0
##$VDLIST= <DDDDDDDDDDDDDDD>
##$VPLIST= <PPPPPPPPPPPPPPP>
##$VTLIST= <TTTTTTTTTTTTTTT>
##$WBST= 1024
##$WBSW= 4
##$XGAIN= (0..3)
0 0 0 0 
##$XL= 0
##$YL= 0
##$YMAX_a= 295020
##$YMIN_a= -397044
##$ZGOPTNS= <>
##$ZL1= 120
##$ZL2= 120
##$ZL3= 120
##$ZL4= 120
##$ABSF1= 16.522
##$ABSF2= -4.171173
##$ABSG= 5
##$ABSL= 3
##$ALPHA= 0
##$AQORDER= 0
##$ASSFAC= 0
##$ASSFACI= 0
##$ASSFACX= 0
##$ASSWID= 0
##$AUNMP= <proc_1d>
##$AZFE= 0.1
##$AZFW= 0.1
##$BCFW= 0
##$BC_mod= 0
##$BYTORDP= 0
##$COROFFS= 0
##$CY= 12.5
##$DATMOD= 1
##$DC= 0
##$DFILT= <>
##$DTYPP= 0
##$F1P= 14.0000005364418
##$F2P= -0.99999901652339
##$FCOR= 0.5
##$FTSIZE= 32768
##$FT_mod= 6
##$GAMMA= 0
##$GB= 0
##$INTBC= 1
##$INTSCL= 1
##$ISEN= 128
##$LB= 0.3
##$LEV0= 0
##$LPBIN= 0
##$MAXI= 10000
##$MC2= 0
##$MEAN= 0
##$ME_mod= 0
##$MI= 0
##$NCOEF= 0
##$NC_proc= -4
##$NLEV= 6
##$NOISF1= 0
##$NOISF2= 0
##$NSP= 0
##$NTH_PI= 0
##$NZP= 0
##$OFFSET= 16.522
##$PC= 1
##$PHC0= 143.9208
##$PHC1= 2.521601
##$PH_mod= 1
##$PKNL= yes
##$PPARMOD= 0
##$PSCAL= 4
##$PSIGN= 0
##$REVERSE= no
##$SF= 250.13
##$SI= 32768
##$SIGF1= 0
##$SIGF2= 0
##$SINO= 400
##$SIOLD= 32768
##$SREGLST= <1H.DMSO>
##$SSB= 0
##$STSI= 32768
##$STSR= 0
##$SW_p= 5175.98343685301
##$SYMM= 0
##$S_DEV= 0
##$TDeff= 65536
##$TDoff= 0
##$TI= <Analysis number 999999
Compound Code 99
Book Reference 9
Project Code 9>
##$TILT= no
##$TM1= 0
##$TM2= 0
##$TOPLEV= 0
##$USERP1= <user>
##$USERP2= <user>
##$USERP3= <user>
##$USERP4= <user>
##$USERP5= <user>
##$WDW= 1
##$XDIM= 32768
##$YMAX_p= 444609906
##$YMIN_p= -416061
$$ End of Bruker specific parameters
$$ ---------------------------------
##NTUPLES= NMR SPECTRUM
##VAR_NAME=  FREQUENCY,     SPECTRUM/REAL,   SPECTRUM/IMAG
##SYMBOL=    X,             R,               I
##VAR_TYPE=  INDEPENDENT,   DEPENDENT,       DEPENDENT
##VAR_FORM=  AFFN,          ASDF,            ASDF
##VAR_DIM=   32768,         32768,           32768
##UNITS=     HZ,            ARBITRARY UNITS, ARBITRARY UNITS
##FACTOR=    0.157963299565203, 1,           1
##FIRST=     4132.6476996994, 0,             0
##LAST=      -1043.33573715361, 0,           0
##MIN=       -1043.33573715361, -416061,     0
##MAX=       4132.6476996994, 444609906,     0
$$ Real data points
##PAGE= N=1
##DATA TABLE= (X++(R..R)), XYDATA
$$ [...]
22894A90057k0007j04236r0677n3073N4385m1492o0589k3336P1736o487K9755
$$ 190057 170050 65814 -24863 -77936 -23551 -65043 -125632 -148968 -77232 -83719 -53964
22883e3964p6358M1470L4555O0769P8393j1308m9263m7251k026P825J21640k9665
$$ -53964 -130322 -88852 -54297 6472 84865 73557 24294 -22957 -24983 -17158 104482 74817
22871G4817j15804k3746j4098K3194q3494q0498o17N4357Q4540l4036l480j3909
$$ 74817 -40987 -64733 -78831 -55637 -139131 -219629 -220246 -165889 -81349 -115385 -118865 -132774
22859a32774l0782l4510R7558M5646p7327N8436K694K6061J09299P885j21723
$$ -132774 -163556 -198066 -100508 -54862 -132189 -73753 -71059 -44998 64301 72186 -49537
22848d9537m8827j9537K741R5177L2622m5170k4641j3013j1066O4456O568M5m6526
$$ -49537 -98364 -117901 -115160 -19983 12639 -32531 -57172 -70185 -81251 -16795 -10227 -10182 -56708
22835e6708p0113M6122J85449R0369P6073m6827J760q5440j40799J252N2029M4976
$$ -56708 -126821 -80699 104750 195119 271192 224365 226125 140685 -114 1138 53167 98143
22823I8143m7203j07426p8318o490J00269J17672M6389o3356J9341j4755k6248
$$ 98143 50940 -56486 -134804 -141294 -41025 76647 123036 59680 79021 64266 38018
22812C8018K8069q2621L7010J5079p6704l4047O8173R4430m3219j07270k433m0470
$$ 38018 66087 -16534 20476 35555 -41149 -75196 -7023 87407 44188 -63082 -65515 -105985
22800a05985l8687M064N2561N5038j4900o7138q555L2677k505K2874n1448L5885
$$ -105985 -144672 -140608 -88047 -33009 -47909 -115047 -123602 -90925 -93430 -70556 -122004 -86119
22788h6119J24926N0793l4900p1538r1443K3994l5550q716M5811j268M5786N702
$$ -86119 38807 89600 54700 -16838 -108281 -84287 -119837 -128553 -82742 -84010 -38224 -32522
22776c2522j18781J6153j0287L8407J1233r603Q730k2426r642O0137J3845l1404
$$ -32522 -151303 -135150 -145437 -107030 -95797 -105400 -96670 -119096 -128738 -68601 -54756 -86160
22764h6160o1660p0351Q7865R321r898J61652k5012J2062R0872p5848j6429M958
$$ -86160 -147820 -218171 -130306 -120985 -130883 30769 5757 17819 108691 32843 16414 21372
22752B1372o7616k6890J411r6754k7399J07030Q0065M2588n245o8610l7655L5528
$$ 21372 -46244 -73134 -71723 -168477 -195876 -88846 -8781 33807 28562 -40048 -77703 -42175
22740d2175R760J7603L6199k3000o815k1157R5059l6164q5616N2037k3675q3958
$$ -42175 -32415 -14812 21387 -1613 -8428 -29585 65474 29310 -56306 -4269 -27944 -111902
22728a11902m7775l9767j3515l5453L6204Q9498Q2792l2293K2202K1857j6227
$$ -111902 -159677 -199444 -212959 -248412 -212208 -122710 -39918 -72211 -50009 -28152 -44379
22717d4379l9562K3422K8259M1587J3738n2362J1298l6234j42804N244J17972
$$ -44379 -83941 -60519 -32260 9327 23065 -29297 -17999 -54233 -197037 -191793 -73821
22706g3821K9374L036n7046k5561N5147N5057J3069k7198Q706j1434L8179j8799
$$ -73821 -44447 -41411 -98457 -124018 -68871 -13814 -745 -27943 -19237 -30671 7508 -11291
22694a1291P7155L6391k8593j67649L6259J50804R8431M5897p9255o4569P8020
$$ -11291 65864 102255 73662 -93987 -57728 93076 191507 237404 158149 93580 171600
22683A71600j2629j0100M3675j3822j08411K4421O633j68935n3449P5224Q9356
$$ 171600 158971 148871 192546 178724 70313 94734 101367 -67568 -121017 -45793 43563
22672D3563J04r6255m6658N5944Q7821Q455q2509N395l5736p7368n7992l9540
$$ 43563 43667 -52588 -99246 -43302 44519 52974 -29535 -24140 -59876 -137244 -195236 -234776
22660b34776N2701P0185J14649J09365p4472j06313n3267K2958l0339j4739L7648
$$ -234776 -182075 -111890 2759 112124 37652 -68661 -121928 -98970 -129309 -144048 -106400
22649a06400J12865N7235K0915Q9094L368j45320l1861L4427N2578r413m5432
$$ -106400 6465 63700 84615 173709 177077 31757 -104 34323 86901 77488 32056
22638C2056J2133J9241k6656N7661J4745r6797j9042k6370p3206P455N3128r61
$$ 32056 44189 63430 36774 94435 109180 12383 -6659 -33029 -106235 -98780 -45652 -46613
22626d6613j03108k06098j3044K24197J96945J44642r9550l6965P0077K3570o496
$$ -46613 -149721 -355819 -368863 -144666 52279 196921 97371 60406 130483 154053 147557
22615A47557N2925j10534p9750N5482j0359J9330J3707r4609j08196J6441O6967
$$ 147557 200482 89948 10198 65680 55321 74651 88358 -6251 -114447 -98006 -31039
22604c1039L5807l1087J27718M5209n5542l9077o614o3455N845N2007j1020k4627
$$ -31039 4768 -26319 101399 146608 91066 51989 45375 -18080 -12235 39772 28752 4125
22592D125l8613Q998j1218j3845K9018m0772P716O1473k2536k4842l938k8063
$$ 4125 -34488 -25490 -36708 -50553 -21535 -62307 -54591 6882 -15654 -40496 -44434 -72497
22580g2497P1736M1725J6173j4840m4649j1728j024p2874j0311q355p342Q3816
$$ -72497 -761 40964 57137 42297 -2352 -14080 -15104 -87978 -98289 -106644 -113986 -30170
22568c0170N8158k3350p4343l5164j2892L7747k5515j02026j7383M3139N4610
$$ -30170 27988 4638 -69705 -104869 -117761 -80014 -105529 -207555 -224938 -181799 -127189
22557a27189Q0958Q2560l9996j09342L1976J47975K946l5929r2442L586K9162
$$ -127189 -46231 36329 -3667 -113009 -81033 66942 69888 33959 -58483 -54897 -25735
22546b5735K8078J34305M5650o8925l5523M0462K0852n1441p0441R8248Q0720
$$ -25735 2343 136648 182298 113373 77850 118312 139164 87723 17282 115530 196250
22535A96250n3574j54459q7803m3332j3488O8769K4766m8978m444N8853O8130
$$ 196250 142676 -11783 -99586 -142918 -156406 -87637 -62871 -111849 -116293 -57440 10690
22524A0690k8092q9717J5301q17j3196J4727r924N0600L4938o3905m7504K6022
$$ 10690 -17402 -107119 -91818 -92635 -105831 -91104 -101028 -50428 -15490 -79395 -126899 -100877
22512a00877N0090k7866L4116R733l3451J46016M0270j09554K7711M1993j53694
$$ -100877 -50787 -78653 -44537 -34804 -68255 77761 118031 8477 36188 78181 -75513
22501g5513j13064O8957R6990p8810m8866Q8644J5868l8403L2080O3064O381k7105
$$ -75513 -188577 -119620 -22630 -101440 -150306 -61662 -45794 -84197 -52117 10947 17328 -9777
22489i777j9104p8690j23231K3221N9839l713l6623K1847P7598J5561m4792Q916
$$ -9777 -28881 -107571 -230802 -207581 -147742 -151455 -188078 -166231 -88633 -73072 -117864 -108948
22477a08948O928O6773N9999l1570l3973J6839R7071n0810k6414n645O4267Q7260
$$ -108948 -102020 -35247 24752 -6818 -40791 -23952 73119 22309 -4105 -9750 54517 141777
22465A41777p0329q1010K7779K0468n5055j8579R378J1241l0183O9618j1396j2213
$$ 141777 71448 -9562 18217 38685 -16370 -34949 -25571 -14330 -44513 25105 13709 1496
22453A496N3834P3610k2001r0391j8732J8149L8409M8817J066j21385k8688L5698
$$ 1496 55330 128940 106939 16548 -2184 15965 54374 103191 104257 -17128 -45816 -10118
22441a0118k6133O3139Q1488m303o6905n2705j0319l4769R5133P2707N0032j11247
$$ -10118 -36251 26888 108376 104073 37168 -15537 -25856 -60625 34508 107215 157247 46000
22429D6000p8669n523n1409o9119P75O4330K1445P5251O8736L8820r6531j3468
$$ 46000 -32669 -38192 -89601 -158720 -157945 -93615 -72170 3081 71817 110637 14106 638
22417F38L4130m3795k9075j0155q3465l0352L3618J62803O2374j12428J106r469
$$ 638 34768 -9027 -38102 -48257 -131722 -162074 -128456 34347 96721 -15707 -14601 -24070
22405b4070L4449m0008j49509q0670n5327K6540L7741M0088K8936O6164K839K5705
$$ -24070 10379 -29629 -179138 -259808 -315135 -288595 -250854 -210766 -181830 -115666 -112827 -87122
22393h7122k8716O667N7184n9888J21584l8658j06609L2429P6990K408k1173L1477
$$ -87122 -115838 -109171 -51987 -111875 9709 -28949 -135558 -103129 -26139 -23731 -44904 -13427
22381a3427L7223k8113q7250k3360m133J5824O8477O5888Q119l366l7419O701
$$ -13427 23796 -4317 -91567 -114927 -119060 -103236 -34759 31129 39248 35882 -1537 5164
22369E164m9098l6225p690j03392m4097L2653J18579R7341p3483K7489L9572k025
$$ 5164 -43934 -80159 -87849 -191241 -235338 -202685 -84106 13235 -60248 -32759 6813 4788
22357D788L8489j6723L4413P5368m8173n1295N2724J9145n8986k577J2086q8933
$$ 4788 43277 26554 60967 136335 88162 36867 89591 108736 49750 47173 59259 -29674
22345b9674O5720o3368r3647J04198N4644j04013j4308K9509L1425L5563L5776
$$ -29674 36046 -27322 -120969 -16771 37873 -66140 -80448 -50939 -19514 16049 51825
22334E1825l835j9135m088J3119k6474m7476J2315j30351O034O9254M8760L0235
$$ 51825 47990 28855 24767 37886 11412 -36064 -23749 -154100 -148066 -78812 -30052 183
22322A83l340N9703J4973Q427k1634j8873L8553L5098j0417j53259j52841N0253
$$ 183 -3157 56546 71519 79946 58312 39439 77992 113090 102673 -50586 -203427 -153174
22310a53174J19334L6524J2569K5590j5570k5686k7976m906l9702j1642P6652
$$ -153174 -33840 2684 15253 40843 25273 -413 -28389 -33295 -72997 -84639 -7987
22299g987J07408J2997j8026r8326n5567p4286o0693m678J01823J0751m7101P3212
$$ -7987 99421 112418 94392 -3934 -59501 -133787 -194480 -199158 -97335 -86584 -133685 -60473
22287f0473O11o2614m1651L1541k909M1102O9451m6697j4702N0075M3057L7477
$$ -60473 -59862 -122476 -164127 -132586 -135495 -94393 -24942 -71639 -86341 -36266 6791 44268
22275D4268j16655p7666r1544J7557R8649M6007o7549K5238M7538p1791Q420k6999
$$ 44268 -72387 -150053 -241597 -224040 -125391 -79384 -146933 -121695 -74157 -145948 -137528 -164527
22263a64527M3509L8630L8530j1236j3344l9304J3291n761m7867J8396l0769k6805
$$ -164527 -121018 -82388 -43858 -55094 -68438 -107742 -94451 -100212 -148079 -129683 -160452 -187257
22251a87257K9416J03609q501j9965j3023j7646J01046J51661p5558j4231k1185
$$ -187257 -157841 -54232 -62733 -82698 -95721 -113367 -12321 139340 63782 49551 28366
22240B8366n3352L47l6537j9991O9163L0374m2752R092m2977M4573M788M0447
$$ 28366 -24986 -24639 -61176 -81167 -12004 18370 -24382 -15290 -58267 -13694 -8906 31541
22228C1541r1633r2554R2971Q8043j21j9410m05q1747m9002K1910L0943j1612
$$ 31541 -60092 -152646 -59675 28368 28247 8837 8432 -73315 -122317 -100407 -69464 -81076
22216h1076m2632L1988L2464q6457p1106J18275O4536Q6251M9086j2008j47431
$$ -81076 -123708 -91720 -59256 -145713 -216819 -98544 -34008 52243 101329 89321 -58110
22205e8110p6718J02257l3962l1120J3011j8517q70J7790J30153M6322o736j4906
$$ -58110 -134828 -32571 -66533 -97653 -84642 -103159 -104029 -86239 43914 90236 83500 68594
22193F8594k9851n940j8563n9470p6982k5745j27677M9226R2041O9078L8920l0611
$$ 68594 38743 32803 14240 -45230 -122212 -147957 -275634 -226408 -134367 -65289 -26369 -56980
22181e6980l6438l6426L0551k3076L6797P5607j8410m8793o9438Q2822J24930
$$ -56980 -93418 -129844 -99293 -122369 -85572 -9965 -28375 -77168 -146606 -63784 61146
22170F1146P5217k9878k0253Q0287j07094j35156m3717M3275R3879Q1965m380
$$ 61146 136363 106485 86232 166519 59425 -75731 -119448 -76173 17706 99671 95291
22159I5291P9582n3508k698o1919m4004n5423k9552R987j6370Q4836R4092n9324
$$ 95291 174873 121365 118667 56748 12744 -42679 -72231 -62244 -78614 6222 100314 40990
22147D0990q2902Q8334O1269n5467p1124j7969j1221L7288K5960L0999k3563l314
$$ 40990 -41912 46422 107691 52224 -18900 -36869 -48090 -10802 15158 46157 22594 19280
22135A9280r229m569J1001p3276l0518q9780Q1714J40813L7095m0563L9711r5106
$$ 19280 10051 5482 16483 -56793 -87311 -177091 -95377 45436 82531 41968 81679 -13427
22123a3427n4632M7826J60726m8246o6530m8183N0377j3842l1699k0285K576m0609
$$ -13427 -68059 -20233 140493 92247 25717 -22466 27911 14069 -17630 -37915 -35339 -75948
22111g5948m3287K1827J7884K0809l4652k5812P3383l9489p5054Q2990j7937L5898
$$ -75948 -119235 -97408 -79524 -58715 -93367 -119179 -45796 -85285 -160339 -77349 -95286 -59388
22099e9388l3520r1820o935j9277J7336m5149J7875J02329L3594L3375l2707m1268
$$ -59388 -92908 -184728 -191663 -210940 -193604 -238753 -220878 -118549 -84955 -51580 -84287 -125555
22087a25555J16831L8802l5357L7802j23592n1603O823L5685j3490J7044m392
$$ -125555 -8724 30078 -5279 32523 -91069 -142672 -135849 -100164 -113654 -96610 -101002
22076a01002R512Q2439O0566J3426j08871p5655Q6434K0231m948K9238o6097n8154
$$ -101002 -91490 -9051 51515 64941 -43930 -119585 -33151 -12920 -17868 11370 -54727 -112881
22064a12881O6114n618K0711j11836L0350J56353M3258r407o430J345m7255m7062
$$ -112881 -46767 -52385 -31674 -143510 -113160 43193 86451 77044 70614 71959 24704 -22358
22052b2358m4463l1205L4421J4614P6476r7473o7350J06333N7251j4702q7025
$$ -22358 -66821 -98026 -63605 -48991 27485 -69988 -137338 -31005 26246 11544 -75481
22041g5481J04443m262L6788Q1093J4065q1750j07127m2637P1222P9491j03732
$$ -75481 28962 24700 61488 142581 156646 74896 -32231 -74868 -3646 75845 -27887
22030b7887p2199j9004J01475j4230o0856n8838r28J8785J5940N4710J01239j5083
$$ -27887 -100086 -119090 -17615 -31845 -92701 -151539 -152467 -133682 -117742 -63032 38207 23124
22018B3124j23919l5645N3779l1469K1459K7344o0704l0267O5734J13533J7865
$$ 23124 -100795 -136440 -82661 -114130 -92671 -65327 -126031 -156298 -90564 22969 40834
22007D0834k5064q2174r2432k6112Q3706P6946O2963p1802l1886l5778m1009L8589
$$ 40834 15770 -66404 -158836 -184948 -101242 -24296 38667 -33135 -65021 -100799 -141808 -103219
21995a03219J00056l6556l1352k2735L5294J7070l790l0209Q0554J23286l4972
$$ -103219 -3163 -39719 -71071 -93806 -58512 -41442 -45232 -75441 5113 128399 93427
21984I3427L1831N0447o2886Q0633l5913j24828p5143j1542j220R4457M1539k4418
$$ 93427 125258 175705 112819 193452 157539 32711 -42432 -53974 -55194 39263 80802 56384
21972E6384j04593p8184J26917M5452p596l895m8973n2563p7950j0537P2827K860
$$ 56384 -48209 -126393 524 45976 38380 34485 -14488 -67051 -145001 -155538 -82711 -79851
21960g9851N5361l63M1417J7505l5233r04N449K4888Q2186M7006J02241o019N8954
$$ -79851 -24490 -24853 16564 34069 -1164 -2068 3381 28269 110455 157461 259702 253683 312637
21947C12637o1982j0399j2900n4939j2193o3871l4507J8325m2489q4957q8m5469
$$ 312637 250655 240256 227356 172417 160224 96353 61846 80171 37682 -47275 -47363 -92832
21935i2832l0365L235Q8630k4144N9004Q8655p9357j7251N8882P0943l2131q5984
$$ -92832 -123197 -119962 -31332 -55476 3528 92183 12826 -4425 54457 125400 93269 7285
21923G285L9544Q833J1518l5395k849K1127n0183q3556o0529L9154k9151o8389
$$ 7285 46829 55662 67180 31785 28936 50063 -120 -83676 -144205 -105051 -134202 -202591
21911b02591L9190K9074N5264k2186J11429P3784Q387q065j6454P2014M4253o2781
$$ -202591 -163401 -134327 -79063 -101249 10180 83964 92351 84286 67832 139846 184099 121318
21899A21318j26997J9130n405l1169O640l570J4794n1582p0234k1602P7217k4481
$$ 121318 -5679 13451 8046 -23123 -16483 -20053 -5259 -56841 -127075 -148677 -71460 -95941
21887i5941Q5648P922k2899P9274l555l2168P641L5151k085l0515N9581m5909
$$ -95941 -10293 -2371 -25270 54004 50449 18281 25922 61073 58988 28473 88054 42145
21875D2145K4609J21130m2462m4259n9559j1452L4175j4892m8703q1033m6867
$$ 42145 66754 187884 145422 101163 41604 30152 64327 49435 732 -80301 -127168
21864a27168J7316O8357O2536o7276m6418J06931J51555m4123q8534j45409j01682
$$ -127168 -109852 -41495 21041 -46235 -92653 14278 165833 121710 33176 -112233 -213915
21853b13915Q2415L3779p752Q827M1009M0462l9597L0630l2614N4707r213o9087
$$ -213915 -131500 -97721 -105473 -96646 -55637 -15175 -54772 -24142 -56756 -2049 -11262 -80349
21841h0349l3606L8847l1109n801n4118j5543l3021L6495N5340K9169K3911l9126
$$ -80349 -113955 -75108 -106217 -112018 -166136 -181679 -214700 -178205 -122865 -93696 -69785 -108911
21829a08911P614M2485r134l0826Q6697o923k3794M6512m7301k0159J5361K3446
$$ -108911 -101297 -58812 -67946 -98772 -12075 -18998 -42792 3720 -43581 -63740 -48379 -24933
21817b4933O6684n9295q8868o61J1720M7264J8534k0976N8283J03996r6089m1196
$$ -24933 41751 -17544 -106412 -107073 -95353 -48089 -29555 -50531 7752 111748 15659 -25537
21805b5537j04323o4339K883K6470O6622J23555O9923J2196j59698l1635O768
$$ -25537 -129860 -194199 -191316 -164846 -98224 25331 95254 107450 -52248 -83883 -77115
21794g7115J0593j7581L39K5133n6559o4287l3806Q1728L9256M1661n6797N6541
$$ -77115 -66522 -84103 -83764 -58631 -115190 -179477 -213283 -131555 -92299 -50638 -107435 -50894
21782e0894j0058l5026L2564J04894J03782l1322j37920K2850j9614n3183o5155
$$ -50894 -60952 -95978 -63414 41480 145262 113940 -23980 -1130 -20744 -73927 -139082
21771a39082l486J6966N0362o6567m8017r7452N5693J41765J48764L2739m6459
$$ -139082 -142568 -125602 -75240 -141807 -189824 -287276 -231583 -89818 58946 91685 45226
21760D5226N8577J6755n8491j28744q5215J06544P2602K2635m4959k8483M0296
$$ 45226 103803 120558 62067 -66677 -151892 -45348 27254 49889 4930 -23553 16743
21749A6743Q6945k2228l6770k3814R3838j4813q2188l3711j01871J4654K3206
$$ 16743 103688 81460 44690 20876 114714 99901 17713 -15998 -117869 -103215 -80009
21738h0009R5578N9679p5437p9066j4652J7677M7991Q8141L194o7457m693l1525
$$ -80009 15569 75248 -189 -79255 -93907 -76230 -28239 59902 63096 -4361 -9054 -40579
21726d0579K7180l5479K1053P5189j1347J1709K3040k1411J7118J02998P5931
$$ -40579 -13399 -48878 -27825 47364 36017 47726 70766 49355 66473 169471 245402
21715B45402M1940k6495j25502j21734q2392l4768J4274L5581l1367J828k0621
$$ 245402 287342 260847 135345 13611 -68781 -103549 -89275 -53694 -85061 -83233 -103854
21704a03854L6191k6542l0982Q6274p8587Q6998P0389p0738J0001k3445n6488
$$ -103854 -67663 -94205 -125187 -38913 -117500 -30502 39887 -30851 -20850 -44295 -100783
21693a00783l7278J7943k9065J067R425p2167J36370J45136j13605o7060J4993
$$ -100783 -138061 -120118 -149183 -148116 -138691 -210858 -74488 70648 -42957 -110017 -95024
21682i5024q1561K1198P1953Q5654l3353j0959j20116O4777Q6359N713M4752p2532
$$ -95024 -176585 -155387 -83434 2220 -31133 -42092 -162208 -97431 -11072 -5359 39393 -33139
21670c3139K8270R3583N027m1343N2925n4193Q3017M8831j25718q0000o3107j01669
$$ -33139 -4869 88714 93741 52398 105323 51130 134147 182978 57260 -22740 -85847 -187516
21658a87516p0580R991O2967Q0439k9611j9548P152Q1619N5833J00203K0677J7052
$$ -187516 -258096 -248105 -185138 -104699 -134310 -153858 -146706 -65087 -9254 90949 111626 128678
21646A28678m8069j49262j0818L7325m1513M8091M796j423j9627j1603n5035k7215
$$ 128678 80609 -68653 -79471 -42146 -83659 -35568 -30772 -32195 -51822 -63425 -118460 -145675
21634a45675L6100N1691M7679O506N887r733l858J9591q3680k0976r5846L7191
$$ -145675 -109575 -57884 -10205 -3699 2188 -7545 -11403 8188 -75492 -96468 -192314 -155123
21622a55123K5356n7025m140P8992J11270J02523l4372L64l3188j10730n5479
$$ -155123 -129767 -186792 -190932 -111940 -670 101853 67481 67845 34657 -76073 -131552
21611a31552o6474O6232P1788o5441n5653O1692J12966M3382j03280J01473Q1167
$$ -131552 -198026 -131794 -60006 -125447 -181100 -119408 -6442 36940 -66340 35133 116300
21600A16300Q5149p860j23393j4993K3934j0908j2004J7376j9230l4316J6917
$$ 116300 201449 193589 70196 55203 79137 68229 56225 73601 54371 20055 36972
21589C6972J9169m528P1206L5805P766l0602j23759m4675L2631N0484m1309o0377
$$ 36972 56141 51613 122819 158624 166390 135788 12029 -32646 -15 50469 9160 -51217
21577e1217M8677K1846o8531q3912J2324Q610q1363r4459L8849J46665Q1370N9551
$$ -51217 -2540 19306 -49225 -133137 -120813 -112203 -193566 -288025 -249176 -102511 -21141 38410
21565C8410J0586m3073n7204l3531N0608n9586L198O9389J45461k8751j42682
$$ 38410 48996 5923 -51281 -84812 -34204 -93790 -90592 -21203 124258 95507 -47175
21554d7175N2953J15766l595r3589P5208J31353n4686j44354o812P8033R6198
$$ -47175 5778 121544 117949 24360 99568 230921 176235 31881 25069 103102 199300
21543A99300r5276j03526O7649p9031j4600M8192p8188M3533K8816J2257p4134
$$ 199300 104024 498 68147 -10884 -25484 22708 -55480 -11947 16869 29126 -45008
21532d5008O2393j3030P6709j6326q9730l9659R0437Q7855L1502Q7390n3499j7766
$$ -45008 17385 4355 81064 64738 -24992 -64651 25786 113641 145143 232533 179034 161268
21520A61268o6945N4473k2134m6045n2418j492m2205j168M6203R485l7835k4485
$$ 161268 94323 148796 126662 80617 28199 26707 -15498 -16666 29537 39022 1187 -23298
21508b3298n5282M1099R2910J5615J2496p073n5927j5717p3550r0146K1332N2198
$$ -23298 -78580 -37481 55429 71044 83540 76467 20540 4823 -68727 -158873 -137541 -85343
21496h5343M2782o5663n4403j2848j4183N9946j4091m496J31924J44819R384j22847
$$ -85343 -42561 -108224 -162627 -175475 -189658 -129712 -143803 -148299 -16375 128444 137828 14981
21484A4981j48931M7519K6573N093j0526J7531p261j6412L9616M8492o435P7883
$$ 14981 -133950 -86431 -59858 -54765 -65291 -47760 -55021 -71433 -31817 16675 10240 88123
21472H8123n3141j00349p0487J8757J7580K4259L3184J7976o7864K2720K1976
$$ 88123 34982 -65367 -135854 -117097 -99517 -75258 -42074 -24098 -91962 -69242 -47266
21461d7266J2323K3979K2843q2778R621O4335l7401o5055p0833P263J18702Q9646
$$ -47266 -34943 -10964 11879 -70899 -61278 3057 -34344 -99399 -170232 -162969 -44267 45379
21449D5379q4812k3352L3079L6356q5454q7910O6236o030o0277n047j3005j8141
$$ 45379 -39433 -62785 -29706 6650 -78804 -166714 -100478 -106508 -166785 -171832 -184837 -202978
21437b02978N9659J1855m673n6218j0744j5198J27030R8404L3616j5939k1680
$$ -202978 -143319 -131464 -136137 -192355 -203099 -218297 -91267 7137 40753 24814 3134
21426C134p3005q3467n186m0624m153L7706L064P0773M7844J4066r81N9953j00360
$$ 3134 -69871 -153338 -158524 -199148 -203301 -165595 -162531 -91758 -43914 -29848 -30829 29124 -71236
21413g1236m7125L7744k656R1191R4595M6357l9769m4607m7898J7476o9105p242
$$ -71236 -118361 -80617 -83273 7918 102513 148870 109101 64494 16596 34072 -35033 -42275
21401d2275p9867M3052M9452J7705J9977j9402l8554p719q271k5443N8342R514
$$ -42275 -122142 -79090 -29638 -11933 8044 -11358 -49912 -57631 -65902 -91345 -33003 -23489
21389b3489l7018j2536o6359M5716J11987L8536j54723k4898M6438r840q0363
$$ -23489 -60507 -73043 -139402 -93686 18301 56837 -97886 -122784 -76346 -86186 -166549
21378a66549M2058Q2126k7712n2079L0787N7180K4170J2775o2868l6668J8117
$$ -166549 -124491 -42365 -70077 -122156 -91369 -34189 -10019 2756 -60112 -96780 -78663
21367g8663J418J8273J9440J10238M2841K1136K221O0738o4771k925L8755l4695
$$ -78663 -77245 -58972 -39532 70706 113547 134683 136904 197642 132871 129946 168701 134006
21355A34006p2782l758k0220M3898K3372L4534j17045R048K805n3832K64O4355
$$ 134006 61224 57466 37246 81144 104516 139050 22005 31053 33858 -19974 -19710 44645
21343D4645k792j6907J0931j06304n1077k045n2878m4067l2429m5619O1387P1186
$$ 44645 41853 24946 35877 -70427 -121504 -123549 -176427 -220494 -252923 -298542 -237155 -165969
21331a65969N2920N1053N879q1373p7625O0996J1158O698N9829P4426O7456J6198
$$ -165969 -113049 -61996 -56117 -137490 -215115 -154119 -142961 -136263 -76434 -2008 65448 81646
21319H1646L7637J4047L2284l9149j42711m7765M1396q299J2241M1770O7404m2149
$$ 81646 119283 133330 165614 126465 -16246 -64011 -22615 -30914 -18673 23097 90501 48352
21307D8352R6936o1338n6253j1482o1169J6648j7328n723O2791q320j062M7514
$$ 48352 145288 83950 27697 16215 -44954 -28306 -45634 -51357 11434 3114 2052 49566
21295D9566j6731q7396P0678J0194q9065n9670n1237L9509J07231N3763r6679
$$ 49566 32835 -54561 16117 26311 -62754 -122424 -173661 -134152 -26921 26842 -69837
21284f9837K054l6193L7056O8785R9791J2838j28100m2923j1853m6018q514m478
$$ -69837 -67783 -103976 -66920 1865 101656 114494 -13606 -56529 -68382 -114400 -122914 -127392
21272a27392P0854K7531m7066l999O7668M980p244L8751M8456j588j32681N868
$$ -127392 -56538 -29007 -76073 -80072 -12404 -7424 -14668 24083 72539 70951 -61730 -55862
21260e5862R2947K6280m0437J3713o7956m2798j4387n8915L042L2719L6081o2408
$$ -55862 37085 63365 22928 36641 -31315 -74113 -88500 -147415 -144373 -111654 -75573 -137981
21248a37981k2776J8348J31253K3595L0275k2733r5416o7694j8002Q8007L8597
$$ -137981 -160757 -142409 -11156 12439 42714 19981 -75435 -143129 -161131 -73124 -34527
21237c4527k7680m5177J5206q8972k7464O8010j6915m7329j7595R1207Q802j17688
$$ -34527 -62207 -107384 -92178 -181150 -208614 -140604 -157519 -204848 -222443 -131236 -122434 -240122
21225b40122j2557J29209N1945k3338j57530O0839J28065K2688N0320J681m8627
$$ -240122 -252679 -123470 -71525 -94863 -252393 -191554 -63489 -40801 9519 11200 -37427
21214c7427L2181K0165O5835j17931j43509k0840L9845K2367N5284k9322p7374
$$ -37427 -5246 14919 80754 -37177 -180686 -201526 -161681 -139314 -84030 -113352 -190726
21203a90726j53263q846J11413J65485o246k5002O2547j4651L166J565J3210L4514
$$ -190726 -343989 -352835 -241422 -75937 -82183 -107185 -44638 -59289 -56123 -54558 -41348 -6834
21191f834n0068q7445n8589m0155N4090O5884N3373M4826k4870j7949N5948o8811
$$ -6834 -56902 -144347 -202936 -243091 -189001 -123117 -69744 -24918 -49788 -67737 -11789 -80600
21179h0600j16814J5629J27671J19084L3286n3533j1657N0425J3458r4968p7203
$$ -80600 -197414 -181785 -54114 64970 98256 44723 33066 83491 96949 1981 -75222
21168g5222J5023Q016p7386k1266L6892m3955O9984M0808L137k6175J0529p9455
$$ -75222 -60199 -52183 -129569 -150835 -113943 -157898 -87914 -47106 -43969 -70144 -59615 -139070
21156a39070o8408J5972Q3286Q2028m448p0062J880Q5001r4598l0198j5541O4471
$$ -139070 -207478 -191506 -108220 -26192 -30640 -100702 -98822 -13821 -108419 -138617 -154158 -89687
21144h9687K0380L2070M0576R5643K2602o5561o652J254J9156n3537k3898O1666
$$ -89687 -69307 -37237 3339 98982 121584 56023 49371 50625 69781 16244 -7654 54012
21132E4012K1604P043J38591r4997j76215j25754k294L7798O88l3544Q0985O5737
$$ 54012 75616 82659 221250 126253 -49962 -175716 -178010 -140212 -139524 -173068 -92083 -26346
21120b6346q1794m8683M0628j9792J2186J11998Q3354p368r6214p7943P5229M6145
$$ -26346 -108140 -156823 -116195 -135987 -123801 -11803 71551 64183 -32031 -109974 -34745 11400
21108A1400p097j3193p4267j6208Q3401R29J6160r3926p4191R9925j1198K3562
$$ 11400 4303 -8890 -83157 -99365 -15964 -15035 1125 -92801 -166992 -67067 -78265 -54703
21096e4703j029j3282K6421o896K6378K9023k7462p9784p2396M2863Q9598k6350
$$ -54703 -55732 -69014 -42593 -49489 -23111 5912 -21550 -101334 -173730 -130867 -41269 -67619
21084f7619P4285J555p0873L7832L0410J8818L1242N177k5472k7552K533j9709
$$ -67619 6666 8221 -62652 -24820 5590 24408 55650 60827 35355 7803 10336 -9373
21072i373n5354m60k6677R183Q3998Q3631O6250Q2354j18167j06418J3619j339
$$ -9373 -64727 -65187 -91864 -82681 1317 84948 151198 233552 115385 8967 22586 21247
21060B1247q751J0919q4711r0027K257P9734M4430m0181K1251j04405L366J32100
$$ 21247 12496 23415 -61296 -151323 -149066 -69332 -24902 -65083 -43832 -148237 -144871 -12771
21048a2771K267m0480m3884O6549O8186M2542m5591M491N4858P0855K4546n7680
$$ -12771 -10504 -50984 -94868 -28319 39867 82409 36818 41309 96167 167022 191568 133888
21036A33888j7286L9973n5899m1292p4900o2049m2744Q1593M5021m9204n8362
$$ 133888 116602 156575 100676 59384 -15516 -77565 -120309 -38716 6305 -42899 -101261
21025a01261K3860L2594o7921J9088p0336o76J138M9106J1600o4400L1004q6886
$$ -101261 -77401 -44807 -112728 -93640 -163976 -164652 -163514 -114408 -102808 -167208 -136204 -223090
21013b23090k8996Q7547L2844J45856l8120q6796O6630j4846l2651n1735K543
$$ -223090 -252086 -164539 -131695 14161 -23959 -110755 -44125 -58971 -91622 -143357 -140814
21002a40814O8565L2019j9616K8515l0749L8433K457M1347J2330m4833K0218J21681
$$ -140814 -72249 -40230 -59846 -31331 -62080 -23647 -21190 20157 32487 -12346 7872 129553
20990A29553O4849j46843k5549l0363R7159j1011j51018r3147J04211J20429M114
$$ 129553 194402 47559 22010 -8353 88806 77795 -73223 -166370 -62159 58270 62384
20979F2384q9398o0595j03335p3528L5333J34594P1802Q9449L8536o0412n0169
$$ 62384 -27014 -87609 -190944 -264472 -229139 -94545 -22743 66706 105242 44830 -5339
20968e339l5439j44697N5831M0036j627M1947j4004n8596N0323M3092M2184N5331
$$ -5339 -40778 -185475 -129644 -89608 -91235 -49288 -63292 -121888 -71565 -28473 13711 69042
20956F9042j2755l8243n6736p549P0818k3560p8383O8023O8359k5458j01208L6748
$$ 69042 56287 18044 -38692 -46241 24577 1017 -77366 -9343 59016 33558 -67650 -30902
20944c0902m7770n2422J37037J15162m3086j26749j6001J3146K6955j8778l2005
$$ -30902 -78672 -131094 5943 121105 78019 -48730 -64731 -51585 -24630 -43408 -75413
20933g5413n7219K4845L950l598k4593J57867j0226k2997n781m5743J3971J27629
$$ -75413 -132632 -107787 -103837 -107435 -132028 25839 15613 -7384 -13165 -58908 -44937 82692
20921H2692N460q6712o0851N7300L9304p1640l5963M6066k1646m3193p5028j7334
$$ 82692 88152 1440 -59411 -2111 37193 -34447 -70410 -24344 -45990 -89183 -164211 -181545
20909a81545M1607Q0958J5766p2282P2363O034j57306p6915K7991L663Q0217P9255
$$ -181545 -139938 -58980 -43214 -115496 -43133 -37099 -194405 -271320 -243329 -239666 -159449 -80194
20897h0194O7521P0973Q709K4644j58023o1519l7541M8288O984n4432P9029K8489
$$ -80194 -12673 58300 67009 91653 -66370 -127889 -165430 -117142 -110158 -164590 -85561 -57072
20885e7072O7111R8022k4257r4473M8331m851n973J8476n8172n6010L5682N0475
$$ -57072 10039 108061 83804 -10669 37662 32811 26838 45314 -12858 -68868 -33186 17289
20873A7289N715J5166j06047J3301J2520k7770O1298o4743R344L6913J96228J23316
$$ 17289 23004 38170 -67877 -54576 -42056 -69826 -8528 -73271 -63927 -27014 169214 292530
20861B92530r8656j24919L7821p5813L083K3791o5838o8211n337O7803R9725L9198
$$ 292530 193874 68955 106776 30963 34046 57837 -8001 -76212 -81549 -13746 85979 125177
20849A25177r2373n3912L9183M8324k2506j28574O993O5764j553K7679j0112K7124
$$ 125177 32804 -21108 18075 66399 43893 -84681 -77688 -11924 -13477 14202 4090 31214
20837C1214q824n6348n6920j4514M4710n417K9673k6625O5655m8665q4258j00394
$$ 31214 22390 -33958 -90878 -105392 -60682 -66099 -36426 -63051 2604 -46061 -130319 -230713
20825b30713L7235K9957N9152J9714m5223J9229k3229k4307J26813N8805m0401
$$ -230713 -193478 -163521 -104369 -84655 -129878 -110649 -133878 -158185 -31372 27433 -12968
20814a2968Q3468o0984r8964k9929M9539j060j9007L0911L2437N5767R9534O8674
$$ -12968 70500 9516 -89448 -119377 -69838 -70898 -89905 -58994 -26557 29210 128744 197418
20802A97418R965Q528N2937o8406m4968r445l5714p503M19L0450p1826R038k5410
$$ 197418 207383 215911 268848 200442 155474 146029 110315 102812 103231 133681 61855 70893 45483
20789D5483j49300j0483N6752J90276l9607o8344j3512J2625L2579o8062q1961
$$ 45483 -103817 -114300 -57548 132728 93121 24777 11265 23890 56469 -11593 -93554
20778i3554J26540k1372q1603K0741L806L6400N2193j0389K7775j21593j29797
$$ -93554 32986 11614 -69989 -49248 -45442 -9042 43151 32762 60537 -61056 -190853
20767a90853j8441j1999O5506R4841Q3594p2571j49624j00435J5789J05546M1683
$$ -190853 -209294 -221293 -155787 -60946 22648 -49923 -199547 -299982 -284193 -178647 -136964
20756a36964N3973k6456J2065O4391m501L4781o3353l8551j1695L4123l5795L6511
$$ -136964 -82991 -109447 -97382 -32991 -37492 -2711 -66064 -104615 -116310 -82187 -117982 -81471
20744h1471M5154K7593J8659L272p3015p9490l9467M2308n1196M304N9275R0767
$$ -81471 -36317 -8724 9935 13207 -59808 -139298 -178765 -136457 -187653 -183349 -124074 -33307
20732c3307M1633q7810M9084k6679o0499m5262k7339k439J8334P7854J07812P7663
$$ -33307 8326 -79484 -30400 -57079 -117578 -162840 -190179 -192618 -174284 -96430 11382 89045
20720H9045K2362p0632j37490J0960O0009M5974j7375m8463L3355Q8786M9705
$$ 89045 111407 40775 -96715 -85755 -25746 20228 2853 -45610 -12255 76531 126236
20709A26236j52141k1289J1363n174j0806J4586q4863l2171J10414L844n6696
$$ 126236 -25905 -47194 -35831 -41005 -51811 -37225 -122088 -154259 -43845 -40001 -96697
20698i6697j7449q112q4364L6062N1200j1622n042N9890o7266j13224N7902R0705
$$ -96697 -114146 -122258 -206622 -170560 -119360 -130982 -136024 -76134 -143400 -256624 -198722 -108017
20686a08017P0503N6687J5584K1378j1855q4532J2638M4460L3898j00145K0545
$$ -108017 -37514 19173 34757 56135 44280 -40252 -27614 16846 50744 -49401 -28856
20675b8856K6891N2617p7423q7108k7021j7220K9299R4420K0912n1424k0475O2251
$$ -28856 -1965 50652 -26771 -113879 -140900 -158120 -128821 -34401 -13489 -64913 -85388 -23137
20663b3137L6434J485l1682k7609K7001j6919n7724k1319L6751K2418j1821k1053
$$ -23137 13297 14782 -16900 -44509 -17508 -34427 -92151 -113470 -76719 -54301 -66122 -87175
20651h7175O1635J09896R1443q1732j74458P9487L6722L6338L6410n5193j51077
$$ -87175 -25540 84356 175799 94067 -80391 -904 35818 72156 108566 53373 -97704
20640i7704r1484o6052J8205R0824O4936O9157m2613j1516J2893R12j34813J1646
$$ -97704 -189188 -255240 -237035 -146211 -81275 -12118 -54731 -66247 -53354 -52442 -187255 -175609
20628a75609P8312l7967M2380Q7297L5899m6723l51m1837q510J10616L6387m5005
$$ -175609 -97297 -135264 -92884 -5587 30312 -16411 -16762 -58599 -67109 43507 79894 34889
20616C4889p7042O9619J32427p6145n4193k0421o2268p5610J6278N2373K1250
$$ 34889 -42153 27466 159893 83748 29555 9134 -53134 -128744 -112466 -60093 -38843
20605c8843q3116j19458n3432O5946R2476P6291Q0863J9195q2680j8027O7492
$$ -38843 -121959 -241417 -294849 -228903 -136427 -60136 20727 39922 -42758 -60785 6707
20594F707J3996l7061Q1391K2415l0613j8851k6498j06866J1828k0005j336L6658
$$ 6707 20703 -16358 65033 87448 56835 37984 11486 -95380 -83552 -103557 -104893 -68235
20582f8235m7524K3923m5224q7497J13128N4742m8426j8908P6463P4652p7597
$$ -68235 -115759 -91836 -137060 -224557 -111429 -56687 -105113 -124021 -47558 27094 -50503
20571e0503k8924L3059j7532j7535K7944Q0946M3545M6449o0054j26472m1056
$$ -50503 -79427 -46368 -63900 -81435 -53491 27455 71000 117449 57395 -69077 -110133
20560a10133j6097J1378Q719J5697K2721r864j02023j1028N6492k2072q914J3435
$$ -110133 -126230 -114852 -106133 -90436 -67715 -77579 -179602 -190630 -134138 -156210 -165124 -151689
20548a51689N4135q9213n3637K5889J8157n1599N6928J10553M3077P0616N1297
$$ -151689 -97554 -186767 -240404 -214515 -196358 -247957 -191029 -80476 -37399 33217 84514
20537H4514n8233j09822j1484l6899j49854L0210Q6864K9173m4056K2756j184
$$ 84514 26281 -83541 -95025 -131924 -281778 -251568 -164704 -135531 -179587 -156831 -158015
20526a58015J6363L0368O3526J46488M8971r7549r8855p0200N5226K4446N8340
$$ -158015 -141652 -111284 -47758 98730 147701 50152 -48703 -118903 -63677 -39231 19109
20515A9109j1232l8129l9292K6234L3431l8344j59811k7234K5852J30946K1127
$$ 19109 7877 -30252 -69544 -43310 -9879 -48223 -208034 -235268 -209416 -78470 -57343
20504e7343L3665M8475l3327j03285Q1749K1565q6067j15275j2648J1147O6011
$$ -57343 -23678 24797 -8530 -111815 -30066 -8501 -94568 -209843 -222491 -211344 -145333
20493a45333P7925m3225L8149M2255o0886j1454j6326L5370l3542o3406o590J0884
$$ -145333 -67408 -110633 -72484 -30229 -91115 -102569 -118895 -83525 -117067 -180473 -187063 -176179
20481a76179J7552q984k9683K4632j2722J44673j5844K1936M423N0850n3541l7267
$$ -176179 -158627 -167611 -197294 -172662 -185384 -40711 -56555 -34619 -30196 20654 -32887 -70154
20469g0154k4791R638K6253K7479n2211k3942J30004J3719j03087q4786L2023
$$ -70154 -94945 -85307 -59054 -31575 -83786 -107728 22276 35995 -67092 -151878 -119855
20458a19855P9581K8600o003q6155j0248n3924o7770J1572R4933O7456L7707j3140
$$ -119855 -40274 -11674 -17677 -103832 -114080 -168004 -235774 -224202 -129269 -61813 -24106 -37246
20446c7246p4758p5107m355P2897O280N6377N0595n2400j7391K9065O3281J5289
$$ -37246 -112004 -187111 -191466 -118569 -112289 -55912 -5317 -57717 -75108 -46043 17238 32527
20434C2527r0153K1776P6559k334k0501l4877l137P754N4832N7742q7556o6879
$$ 32527 -57626 -35850 40709 38375 17874 -17003 -20140 -12386 42446 100188 12632 -54247
20422e4247K2042l496p6126R0615n828k5766l3486j5930L513N7459J6317q378
$$ -54247 -32205 -35701 -111827 -21212 -27040 -52806 -86292 -102222 -98709 -41250 -24933 -33311
20410c3311R6281O95n2720j2630O3614R504n7913n0826l2761j47575N3800J92004
$$ -33311 62970 63665 10945 -1685 61929 71433 13520 -37306 -70067 -217642 -163842 28162
20398B8162K0460Q202P3549N2962J056j9749n8855J2052O4521j1828j07581m1069
$$ 28162 48622 56824 130373 183335 184391 164642 105787 117839 182360 170532 62951 21882
20386B1882J00905L0706l6447n9038j10296l1491N4340M2070L0410J02267l5048
$$ 21882 122787 153493 117046 58008 -52288 -83779 -29439 12631 43041 145308 110260
20375A10260q1967N588l5348m3329l5773N7057P978m7141m1077O412k3957m0189
$$ 110260 28293 33881 -1467 -44796 -80569 -23512 -15534 -62675 -103752 -97340 -121297 -161486
20363a61486o7107L2149L7747O7749m2446n9656m3620L8799L0494j36618r1902
$$ -161486 -228593 -196444 -158697 -90948 -133394 -193050 -236670 -197871 -167377 -303995 -395897
20352c95897P441J03460J57911o0003j11846L8144J19200Q8744p0648K5142l5899
$$ -395897 -388456 -284996 -127085 -187088 -298934 -260790 -141590 -52846 -123494 -98352 -134251
20341a34251o1442O2205Q0937N8721J3965o9713o9275M0858Q1615j7380j13471
$$ -134251 -195693 -133488 -52551 6170 20135 -49578 -118853 -77995 3620 -13760 -127231
20330a27231j08052L7669L7528J21502k062m4765P3015J32843l7682o8295N4350
$$ -127231 -235283 -197614 -160086 -38584 -40646 -85411 -12396 120447 82765 14470 68820
20319F8820r3502p5078J39173J6550j8071K4910n4849n4106K4212P5155Q1368
$$ 68820 -24682 -99760 39413 55963 37892 62802 7953 -46153 -21941 53214 134582
20308A34582M9299q8732o2804r1447o3721K3997m8215q790o016J9137K2465o7614
$$ 134582 183881 95149 32345 -59102 -122823 -98826 -147041 -155831 -161847 -142710 -120245 -187859
20296a87859j6746J00312L0368N9627K849N8254j02854j53382J7850J05360J25568
$$ -187859 -204605 -104293 -73925 -14298 -11449 46805 -56049 -209431 -191581 -86221 39347
20285C9347O4590k2246n1752o7911l6030o2125O5845Q1679K3446k8962M754p641
$$ 39347 103937 81691 29939 -37972 -74002 -136127 -70282 11397 34843 5881 10635 2994
20273B994K2270M4639K9970m7060l9748r9682k0800R5373L3979m0116N9224M2495
$$ 2994 25264 69903 99873 52813 13065 -86617 -107417 -12044 21935 -18181 41043 83538
20261H3538k3340j9792j01974q958q3791l4232N0219K3477j7970J6382N9741l477
$$ 83538 60198 40406 -61568 -70526 -154317 -188549 -138330 -114853 -132823 -116441 -56700 -60177
20249f0177k2130l2785l7031J22482r195k852l4126l4259L8082P216Q5705m2374
$$ -60177 -82307 -115092 -152123 -29641 -38836 -41688 -75814 -110073 -71991 -64775 20930 -21444
20237b1444Q9251R0443m7602j32576K5141n7114m3333k7066L9238M2094o372n3986
$$ -21444 67807 158250 110648 -21928 3213 -53901 -97234 -124300 -85062 -42968 -49340 -103326
20225a03326J13741O957m2231k4776r6756J27544L8842Q205J3765q8733M3731
$$ -103326 10415 17372 -24859 -49635 -146391 -18847 19995 28200 41965 -46768 -3037
20214c037P0898m795l4496K5655R202k5782o0616O3553n1178K3229K1224l7614
$$ -3037 67861 63066 28570 54225 63427 37645 -22971 40582 -10596 12633 33857 -3757
20202c757O1138k0103o1545l0196r9777n9378J10508N3953j7635j19291O6790
$$ -3757 57381 37278 -24267 -54463 -154240 -213618 -103110 -49157 -66792 -186083 -119293
20191a19293J5759r3924O8183L5192J4453r222P6756Q6852N9354j05825j46668
$$ -119293 -103534 -197458 -129275 -94083 -79630 -88852 -12096 74756 134110 28285 -118383
20180a18383k6988L7174K0077O1615p872K012J9098m9750K2106K3811J7167r5185
$$ -118383 -145371 -108197 -88120 -26505 -34377 -32365 -13267 -63017 -40911 -17100 67 -95118
20168i5118J9157L534j44787N5975J1189N0692l5766j4821J38548L914l61j22091
$$ -95118 -75961 -72427 -217214 -161239 -150050 -99358 -135124 -149945 -11397 -7483 -7844 -129935
20156a29935l5154L4445N772J00810R6690m3588n6993Q424P5281r2056n4645n9400
$$ -129935 -165089 -130644 -124872 -24062 72628 29040 -27953 -19529 55752 -36304 -90949 -150349
20144a50349m1016M7970Q4510O5842O3050J2670k9953j6455K9754J847N7355K9607
$$ -150349 -191365 -143395 -58885 6957 70007 82677 52724 36269 66023 67870 125225 154832
20132A54832q9134r5015k1074q6411J4451M2476K591N3542J1591Q4894N9188q0408
$$ 154832 65698 -29317 -50391 -136802 -122351 -79875 -77284 -23742 -12151 72743 131931 51523
20120E1523n1507P2342j2879j23678L0173k3799q6433l1444j584q046k0526Q675
$$ 51523 16 72358 59479 -64199 -34026 -57825 -144258 -175702 -177286 -185332 -205858 -197183
20108a97183R636L6498O7321J7670J4208n1288l4791N2465J6891O9824P7270n8572
$$ -197183 -187547 -151049 -83728 -66058 -51850 -103138 -137929 -85464 -68573 1251 78521 19949
20096A9949l1894q3114j17287L5861J48454j8507J1962r935K7778n3597r8456
$$ 19949 -11945 -95059 -212346 -176485 -28031 -46538 -34576 -44511 -16733 -70330 -168786
20085a68786o4991M3827M3040k1000M3988k9642J10719P4588r5807n0900j12327
$$ -168786 -233777 -189950 -146910 -167910 -123922 -153564 -42845 31743 -64064 -114964 -227291
20074b27291J20422K35840N307j8723L4096N0997j01882j38254O6802J3564K2095
$$ -227291 -106869 128971 134278 115555 149651 200648 98766 -39488 27314 40878 62973
20063F2973q219K4176l2232j1901K3445j6561k7594o5812j30994o9877P9164Q1928
$$ 62973 54754 78930 46698 34797 58242 41681 14087 -51725 -182719 -252596 -173432 -91504
20051i1504q8790O2541Q9488q4588k6455L5475J03302K9863j46577r344J9055
$$ -91504 -180294 -117753 -28265 -112853 -139308 -103833 -531 29332 -117245 -126589 -107534
20040a07534J18878K2937k6312l3620k1709J7099m7017O8136M2931p415j1451
$$ -107534 11344 34281 7969 -25651 -47360 -30261 -77278 -9142 33789 26374 14923
20029A4923J8555J28072J8937q4767j30745J8680N4089O380j10003l2422M0063
$$ 14923 33478 161550 180487 95720 -35025 -16345 37744 44124 -65879 -98301 -58238
20018e8238J9315M1317m3262J6916N0627P1076j0244k5707M5466N678p5024j63052
$$ -58238 -38923 2394 -40868 -23952 26675 97751 87507 61800 107266 112944 37920 -125132
20006a25132n0843m8380M238O9641Q15j6342J9093j0582P8866J9838j6468l5650
$$ -125132 -175975 -224355 -220117 -150476 -149661 -166003 -146910 -157492 -78626 -58788 -75256 -110906
19994a10906j9623m0019p3563K0324N8188J3991J19864Q8307l4027j70573q7967
$$ -110906 -130529 -170548 -244111 -223787 -165599 -151608 -31744 56563 22536 -148037 -236004
19983b36004k3074O5023P887O0821Q4679M8505l9129j19644j00326K1853k8468
$$ -236004 -259078 -194055 -186168 -125347 -40668 7837 -31292 -150936 -251262 -229409 -257877
19972b57877N8419M5394M3762o5504K322N8819M5384L5518q60m4688J6254K3461
$$ -257877 -199458 -154064 -110302 -175806 -173484 -114665 -69281 -33763 -34623 -79311 -63057 -39596
19960c9596K8645O60Q3979L515K3222j09746j0019R7784O5035n1416r0874k2901
$$ -39596 -10951 -10291 73688 77203 100425 -9321 -19340 78444 143479 92063 1189 -21712
19948b1712k7287j2454J310K9340L5883K2461r2232n3371k4632k1674p8314m0825
$$ -21712 -48999 -61453 -60143 -30803 5080 27541 -64691 -118062 -142694 -164368 -242682 -283507
19936b83507N2293J47384O6191J6542m891J00305l6084p7080M1489j6547j14522
$$ -283507 -231214 -83830 -17639 -1097 -5988 94317 58233 -18847 22642 6095 -108427
19925a08427P1430K6970K5068m3020l1708l5441r29O0036M7594K4740q1942n3815
$$ -108427 -36997 -10027 15041 -27979 -59687 -95128 -96057 -36021 11573 36313 -45629 -99444
19913i9444R1158M9588q6946k8294N5245R9593j3090o6247n0573J12491L5554
$$ -99444 -8286 41302 -45644 -73938 -18693 80900 67810 1563 -49010 63481 99035
19902I9035j47511n03J13590J0564j27467j25489J16592L693m7333M8179K2226
$$ 99035 -48476 -48979 64611 75175 -52292 -177781 -61189 -57496 -104829 -56650 -34424
19891c4424O8263O8398k4266q8320j0687L1417J7170K3261r1687n49K0646O9952
$$ -34424 33839 102237 77971 -10349 -21036 10381 27551 50812 -40875 -41424 -20778 49174
19879D9174O5639p6590k7758j11866l7066O7820O2744p8185j53953L2751J38463
$$ 49174 114813 38223 10465 -101401 -138467 -70647 -7903 -86088 -240041 -207290 -68827
19868f8827l0606o9240m763J0398M3654m2659J07166P9333l7011J4502j1750n6234
$$ -68827 -99433 -168673 -173436 -163038 -119384 -162043 -54877 24456 -12555 1947 -9803 -66037
19856f6037L9220R4682J5194L2346k9896j15364K6277P129j27881M1632K5270
$$ -66037 -26817 67865 83059 115405 85509 -29855 -3578 3551 -124330 -82698 -57428
19845e7428J43370l7992j24632o3429l1973O7796J41910n4546j08744R8126K2310
$$ -57428 85942 47950 -76682 -140111 -172084 -104288 37622 -16924 -125668 -27542 -5232
19834e232r4308k9191L7313K3186K7419N6899O1002k3039Q4590K1066j00506q7927
$$ -5232 -99540 -128731 -91418 -68232 -40813 16086 77088 54049 138639 159705 59199 -28728
19822b8728q8872L2533L7555O3155M2720M2419m1645n2230j04007M9023O366r4118
$$ -28728 -117600 -85067 -47512 15643 58363 100782 59137 6907 -97100 -48077 -41711 -135829
19810a35829p0330p1580k6119J7568J46899P6093J5894N1607R8625N3425n6089
$$ -135829 -206159 -277739 -303858 -286290 -139391 -63298 -47404 4203 102828 156253 100164
19799A00164o7290n0487l9543P2619o5523R788K090L8206O1859j9214K4740K0007
$$ 100164 32874 -17613 -57156 15463 -50060 -40272 -38182 24 61883 42669 67409 87416
19787H7416o2063J3423J19242N0776j22458q6910k2134R5708j9024o9570j5200
$$ 87416 25353 38776 158018 208794 86336 -574 -22708 73000 53976 -15594 -30794
19776c0794l4041J09406J1883k157L7896m5308j32698j1646R6075L2622k8336
$$ -30794 -64835 44571 56454 54297 92193 46885 -85813 -97459 -1384 31238 2902
19765B902J9155J6829N197o8298K2745K1461M2986j8607j49632n593K170p4529
$$ 2902 22057 38886 44083 -24215 -1470 19991 62977 44370 -105262 -110855 -108685 -183214
19753a83214o7643O1825P4409K7184P5985r596O9996l9196j54336P9441J6802
$$ -183214 -250857 -189032 -114623 -87439 -11454 -21050 48946 9750 -144586 -65145 -48343
19742d8343N949q981q464L249R9972R2167l5999r4905M554r1951l9390L0398k3451
$$ -48343 -42394 -51375 -59839 -56590 43382 135549 99550 4645 9199 -82752 -122142 -91744 -115195
19729a15195j7639O8902p0350L5472R3735J0672L3597j2138Q8763j5451n8120
$$ -115195 -132834 -63932 -134282 -98810 -5075 5597 39194 27056 115819 100368 42248
19718D2248o5757N071j7473p6772m8996n0479J04264Q5999J2221L5510o2776m353
$$ 42248 -23509 -18438 -35911 -112683 -161679 -212158 -107894 -21895 -9674 25836 -36940 -41293
19706d1293n7298q3801r9019L3572P0891J54353O138q393l3085n0383k0409O6652
$$ -41293 -98591 -182392 -281411 -247839 -176948 -22595 -16457 -24850 -57935 -108318 -128727 -62075
19694f2075L262q7915J1849M0652L2942K0356L1747J1471n6523j40641J4567K8609
$$ -62075 -58813 -146728 -134879 -94227 -61285 -40929 -9182 2289 -54234 -194875 -180308 -151699
19682a51699Q1535L6739Q9233k1010q9689L7347P355q1553K557J58298M4622K6939
$$ -151699 -70164 -33425 55808 34798 -54891 -17544 -10189 -91742 -89185 69113 113735 140674
19670A40674L1720j31854j40384l611J09938J22999J03235l8685j44302q1959
$$ 140674 172394 40540 -99844 -103455 6483 129482 232717 194032 49730 -32229
19660c2229l712o6863r9900K6460O9509L9422R2996M2468m7391o9739N7443k1034
$$ -32229 -35941 -102804 -202704 -176244 -106735 -67313 25683 68151 20760 -48979 8464 -12570
19648a2570k6154j08272j39740j8369Q8766J38663N7027M3186m4946j9267k1861
$$ -12570 -38724 -146996 -286736 -305105 -216339 -77676 -20649 22537 -22409 -41676 -63537
19637f3537J4020J8079J14402P0489r5147j38076R8716O7505m737q1745m8341
$$ -63537 -49517 -31438 82964 153453 58306 -79770 18946 86451 81714 -31 -48372
19626d8372k4669o5344m3137M0992J39925l3664l976R0724R661k6677r6267M9248
$$ -48372 -73041 -138385 -181522 -140530 -605 -34269 -38245 52479 62140 35463 -60804 -11556
19614a1556M5347m7958l1653N5879O4075n8780m0565k241O0896P6213L8158j88994
$$ -11556 33791 -14167 -45820 10059 74134 15354 -25211 -27452 33444 109657 147815 -41179
19602d1179j30327R5043R6958K3327j14164n7643K5677k5320k2961L021P9061
$$ -41179 -171506 -76463 20495 43822 -70342 -127985 -102308 -127628 -150589 -147568 -68507
19591f8507Q4055j2906k7080k1519J270q1591l4801P9226J4386J3345O0805J2859
$$ -68507 15548 2642 -24438 -45957 -44687 -126278 -161079 -81853 -67467 -54122 6683 19542
19579A9542L2371k5702k7909L6245k0803q2890q279l1545p110j576R0338K0005
$$ 19542 51913 26211 -1698 34547 13744 -69146 -77425 -108970 -116080 -117656 -27318 -7313
19567g313j8430P5840q1410m082N5760l7518N4179l3394N6263N9106j53264j88859
$$ -7313 -25743 50097 -31313 -35395 20365 -17153 37026 3632 59895 119001 -34263 -223122
19555b23122O8312P4765l2264M3851R817o4143j42850r1173L6033J41629O1750
$$ -223122 -154810 -80045 -112309 -68458 -58641 -122784 -265634 -356807 -320774 -179145 -117395
19544a17395M6080J55891J00145j798j93292n3881O2387J9421P7297J2817p2696
$$ -117395 -71315 84576 184721 182923 -10369 -64250 -1863 17558 94855 107672 34976
19533C4976J1701J999j6400j10247k885K2472M4005M8764J0175L0018r5747r2401
$$ 34976 46677 48676 32276 -77971 -80856 -58384 -14379 34385 44560 74578 -21169 -113570
19521a13570Q093M3327M357J41502n76K7026p0492r8685j9458J01791K4142l4330
$$ -113570 -105477 -62150 -57793 83709 83133 110159 39667 -59018 -78476 23315 47457 13127
19509A3127Q99M8334l084m8434k3957n3911o1008m3700K1098O898Q9909N703K4518
$$ 13127 14026 62360 59276 10842 -13115 -67026 -128034 -171734 -150636 -143738 -53829 -48126 -23608
19496b3608R0141J4988l7095j5732p152O2104K2521q514n8430q9406Q5943m4851
$$ -23608 66533 81521 44426 28694 21542 83646 106167 97653 39223 -50183 35760 -9091
19484i091j83451L8627J26437P8854L0393P2734M0126m0142r9667J4927m9302
$$ -9091 -192542 -153915 -27478 51376 81769 154503 194629 154487 54820 69747 20445
19473B0445n3722L2145l0491l1496p379r7918o4070m8359R2605N1768M5571L7046
$$ 20445 -33277 -1132 -31623 -63119 -70498 -168416 -232486 -280845 -188240 -136472 -90901 -53855
19461e3855K2646J2351L9276o8763o117L2468n7529K0605m564O3882k732j00716
$$ -53855 -31209 -18858 20418 -48345 -54462 -21994 -79523 -58918 -63482 400 -2332 -103048
19449a03048N5716k480l2234o68m2559N4738K4966m589l0728l9495j077j2255
$$ -103048 -47332 -49812 -82046 -82714 -125273 -70535 -45569 -50158 -80886 -120381 -121458 -133713
19437a33713R133J1636O5037R3107O9530o6179m9734O4345R5284j06034n4613
$$ -133713 -124580 -112944 -47907 45200 114730 48551 -1183 63162 158446 52412 -2201
19426b201k326L1650l7287J6207K3615L297p9528r0526K2451N3181k8700P6783
$$ -2201 -4527 27123 -10164 6043 29658 32955 -46573 -137099 -114648 -61467 -90167 -13384
19414a3384L9358R6088J7548r5753j44443N1540J0862n422j8137O6159M7459N167
$$ -13384 25974 122062 139610 43857 -100586 -49046 -38184 -43606 -61743 4416 51875 57042
19402E7042j5841o3698l2757J790M2324O1810Q9366J8294o8705j0577j8476j9983
$$ 57042 41201 -22497 -55254 -53464 -11140 50670 140036 158330 89625 79048 60572 40589
19390D0589k1531J1375o3777l0224J7505L9482k5626J14890Q3816j12592o7262
$$ 40589 19058 30433 -33344 -63568 -46063 -6581 -32207 82683 166499 53907 -13355
19379a3355O6666O4170p6348n6082J7159J6255j2291r1595J59028Q5010l8715
$$ -13355 53311 117481 41133 -14949 2210 18465 6174 -85421 73607 158617 119902
19368A19902o8924m9888q5509Q2345L1150Q4894n628k6549P513o535l2964r6494
$$ 119902 50978 1090 -84419 -2074 29076 113970 108342 81793 89306 82771 49807 -46687
19356d6687m0463N1743O8518M4239k4862l4414o2760j52128J7521N8170N9644
$$ -46687 -87150 -35407 33111 77350 52488 18074 -44686 -196814 -179293 -121123 -61479
19345f1479P83M892K9945N0741Q111N9458O4315j3388j14411j16708J9395k7508
$$ -61479 -60696 -55804 -25859 24882 32993 92451 156766 143378 28967 -87741 -68346 -95854
19333i5854Q4781O3346n9565m873N2497J1898P93o0583K9490K5769p622r595m8067
$$ -95854 -11073 52273 -7292 -12165 40332 52230 53023 -7560 21930 47699 40077 30482 -17585
19320a7585j13965o3228q981j4164J8727J10097P8131m011P8412P2055p5754m3739
$$ -17585 -131550 -194778 -203759 -217923 -199196 -89099 -10968 -14979 63433 135488 59734 15995
19308A5995n0312N2613m8634p6577k8562Q447n4012o840M5046Q6612R7519n8638
$$ 15995 -34317 18296 -30338 -106915 -135477 -127030 -181042 -187882 -142836 -56224 41295 -17343
19296a7343r3607N7401O4927J283k4514P8367L7008o363n0478m3029L1685j0334
$$ -17343 -110950 -53549 11378 12661 -11853 66514 103522 97159 46681 3652 35337 25003
19284B5003j07773l9346Q5935N8551O844n8328j0605P4342P4845m9520j02514
$$ 25003 -82770 -122116 -36181 22370 29214 -29114 -39719 34623 109468 59948 -42566
19273d2566k5275O9507k7754j3005l0674m597K8832m1434j8762K5872J07036l0120
$$ -42566 -67841 1666 -26088 -39093 -69767 -74364 -45532 -86966 -105728 -79856 27180 -2940
19261b940m8377r1263J04279P8334L037J2289j4496L2603N2867N0116m7369K2548
$$ -2940 -51317 -142580 -38301 40033 43070 55359 40863 73466 126333 176449 129080 151628
19249A51628J8532k7575l4542q1284k1110p151o2094q2766k6298R8342P2925m5545
$$ 151628 170160 142585 108043 26759 5649 -1502 -63596 -146362 -172660 -74318 -1393 -46938
19237d6938M8523K8142k0251j5782m0021Q2626m719K3180j7642q0127p18J44233
$$ -46938 1585 29727 9476 -6306 -46327 36299 31580 54760 37118 -43009 -43727 100506
19225A00506L7443o2667r2164K3467M6265j7609p6794p0521M268L0302m2629k5937
$$ 100506 137949 75282 -16882 6585 52850 35241 -41553 -112074 -107806 -77504 -120133 -146070
19213a46070m3879J63043N8997p3137l4746N74J04981R9291l5300j14185r8400
$$ -146070 -189949 -26906 32091 -41046 -75792 -75218 29763 129054 93754 -20431 -118831
19202a18831J03055K5399J7324M1191K4254j8153o2519J7733m094J2233J5128
$$ -118831 -15776 9623 26947 68138 92392 74239 11720 29453 25359 37592 52720
19191E2720j00850r2156q9089n127J02594J20132J1363m0675j2982q0217m0468
$$ 52720 -48130 -140286 -229375 -234502 -131908 -11776 -413 -41088 -54070 -134287 -174755
19180a74755J0827O6918J35929q2259j43966L7459J05422J9340l09K2949l5156
$$ -174755 -163928 -97010 38919 -43340 -187306 -149847 -44425 -25085 -25394 -2445 -37601
19169c7601k985k1186j16596l3029J14594J4784M4998j80o4243O543R3611M0393
$$ -37601 -40586 -61772 -178368 -211397 -96803 -82019 -37021 -37201 -101444 -94901 -1290 39103
19157C9103N9724p4903o5100r669k9828P645P2168O7498M2497p977n745L1205
$$ 39103 98827 23924 -41176 -50845 -80673 -73028 -860 66638 109135 101158 95413 126618
19145A26618O751j0689N0539L0771j68096o9331P6070o037j20815j29363N9179
$$ 126618 133369 122680 173219 203990 35894 -33437 42633 36596 -84219 -213582 -154403
19134a54403O7922O275j6171Q1320n5286O3115n7863k2129O2679P3303j05140
$$ -154403 -86481 -80206 -96377 -15057 -70343 -7228 -65091 -87220 -24541 48762 -56378
19123e6378j0570N3042j6555l3973q400n0511o6711M4900r759k1701M7755k5212
$$ -56378 -66948 -13906 -30461 -64434 -72834 -123345 -190056 -145156 -154915 -176616 -128861 -154073
19111a54073p022N8579j11123Q4035N491J0212n7943P387Q0602j8595R5191P3112
$$ -154073 -161095 -102516 -213639 -129604 -124113 -113901 -171844 -164457 -83855 -102450 -7259 65853
19099F5853n7820m8119J0848L8638J8204j30602n4191n4223Q6050M4513N8172
$$ 65853 8033 -40086 -29238 9400 27604 -102998 -157189 -211412 -125362 -80849 -22677
19088b2677k8787m8507m2727M9807j47780K9600J66473K7929Q3247M8445N6676
$$ -22677 -51464 -99971 -142698 -92891 -240671 -211071 -44598 -16669 66578 115023 171699
19077A71699n582m6332k5805m1887o19m2110r4079K8756L3713l4619M3159M373
$$ 171699 166117 119785 93980 52093 51474 9364 -84715 -55959 -22246 -56865 -13706 -9333
19065i333q9707l1673j835n7869J8130N6431K9018M5388J0707p2925O893O6391
$$ -9333 -99040 -130713 -132548 -190417 -172287 -115856 -86838 -41450 -30743 -103668 -96775 -30384
19053c0384J9790j7629p5173O9220Q4372j1744l8760R5312J225n5828N3492O5293
$$ -30384 -10594 -28223 -103396 -34176 50196 38452 -308 95004 96229 40401 93893 159186
19041A59186N4363Q1254N2348m4282j25162j6146j2365j5848J99428k6062N1601
$$ 159186 213549 294803 347151 302869 177707 161561 149196 133348 332776 306714 358315
19030C58315K4895j63812l1937R6738M6543n6979o9789o1421P5632J1821r3952
$$ 358315 383210 219398 187461 284199 330742 273763 203974 142553 218185 230006 136054
19019A36054p7440O679j6608o6743o1348K7373k8969R821O4594J0987j9189r9452
$$ 136054 58614 65293 48685 -18058 -79406 -52033 -81002 -71181 -6587 4400 -14789 -114241
19007a14241j6639J31658l9350p9129o3649J3151k6192k4946R3462J68764R3427
$$ -114241 -130880 778 -38572 -117701 -181350 -168199 -194391 -219337 -125875 42889 136316
18996A36316r9196j00293N0871J02283n6555m3232N4744P1921o682j13215N673
$$ 136316 37120 -63173 -12302 89981 33426 -9806 44938 116859 110177 -3038 2635
18985B635R2532J05761P3018J5313q5094j29027k5426N8984N0412j2266K0136
$$ 2635 95167 200928 273946 289259 204165 75138 49712 108696 159108 146842 166978
18974A66978l5313o0245J307j28146P478j7942L921Q7571R1250r7906p9332K3510
$$ 166978 131665 71420 72727 -55419 -47941 -65883 -61962 25609 116859 18953 -60379 -36869
18962c6869M3053P2572J07368m2926j03704q2101R227m5181K4959J22470l1673
$$ -36869 6184 78756 186124 143198 39494 -42607 -33380 -78561 -53602 68868 37195
18951C7195j09061J6876O490M1587O6185n3114o1883M0880J30876J4874p9494
$$ 37195 -71866 -54990 -48500 -6913 59272 6158 -55725 -14845 116031 130905 51411
18940E1411J0084M291p0983q2523r262p9001k0670L2309n286K6193R6727Q2973
$$ 51411 61495 65786 -5197 -87720 -96982 -175983 -196653 -164344 -169630 -143437 -46710 36263
18928C6263l8171q0275l3846k0279N138N7218K8560q554L2285J1822o3045L5360
$$ 36263 -1908 -82183 -116029 -136308 -131170 -73952 -45392 -53946 -21661 -9839 -72884 -37524
18916c7524j4906J01036O6873l7051m134q5324k6414K9353n0628o1583L9792n8753
$$ -37524 -52430 48606 115479 78428 74294 -11030 -37444 -8091 -58719 -120302 -80510 -139263
18904a39263K595P9115R2137j443j3651M2446j6424j59074q8496l8293K1004K77
$$ -139263 -136668 -57553 34584 33141 19490 61936 45512 -113562 -202058 -240351 -219347 -219070
18892b19070J01336J26022N7580n3354n0267l18M7223O7754K2544j05761j38566
$$ -219070 -117734 8288 65868 12514 -37753 -38071 9152 76906 99450 -6311 -144877
18881a44877Q5111K1573j01751M247R1335Q7680L0725j9216r4444j6776N8888
$$ -144877 -59766 -38193 -139944 -135697 -44362 43318 74043 54827 -39617 -56393 2495
18870B495J34356K5162O5112o304N2815K5830r7211p5113m0015M7543Q5881l2240
$$ 2495 136851 162013 227125 220821 273636 299466 202255 127142 87127 134670 220551 188311
18858A88311J01637K4169j18960M3672m4309j03931j9748K7023J8389k4013l0854
$$ 188311 289948 314117 195157 238829 194520 90589 70841 97864 116253 92240 61386
18847F1386k4923k5803l6105O5692K7476n992J0396m9636j05560o0241J9146l1596
$$ 61386 36463 10660 -25445 40247 67723 61731 72127 22491 -83069 -143310 -124164 -155760
18835a55760J21844Q3933k1116J7817p6975j04045l5454O8499M4434l974l6186
$$ -155760 -33916 50017 28901 46718 -30257 -134302 -169756 -101257 -56823 -60797 -96983
18824i6983K2718j0714K6833j0718q4074p8522O1757J63311O4146O27K9218K7367
$$ -96983 -74265 -84979 -58146 -68864 -152938 -231460 -169703 -6392 57754 58381 87599 114966
18812A14966j10872J231P5173K7948n3469o3606k6919n220j678M1991k4070m0036
$$ 114966 4094 5325 80498 108446 54977 -8629 -35548 -40768 -42446 -455 -24525 -64561
18800f4561J14030Q7196k6421n4519N690M66K0858M7375O0396j19752J8947P7946
$$ -64561 49469 136665 110244 55725 61415 61881 82739 130114 190510 70758 89705 167651
18788A67651O7864j01384p7049P9491k8882r457L5994O99p9801L0102l092m3163
$$ 167651 235515 134131 57082 136573 107691 98234 134228 134927 55126 85228 82136 38973
18776C8973J08751P5029P5491J48305j2755M5535J8532j8619O1810R4471j1803
$$ 38973 147724 222753 298244 446549 433794 479329 497861 479242 541052 635523 623720
18765F23720j01654m4353j42304m2206k7158K3517m844l846o3441j8680j4742
$$ 623720 522066 477713 335409 293203 266045 289562 284718 280872 217431 198751 184009
18754A84009j35656l4381N1061m426N2802J2431m5384j22429p4620L6381J40448
$$ 184009 48353 13972 65033 60607 113409 125840 80456 -41973 -116593 -80212 60236
18743F0236M3042N6720J65009p0249n2960o9077o5105m5208R3181m6842o6141
$$ 60236 103278 159998 325007 254758 201798 132721 67616 22408 115589 68747 2606
18732B606P7033Q9569k6585Q822k306J00015n8230n5815k7326Q2973J3896J6662
$$ 2606 79639 169208 142623 151445 149139 249154 190924 135109 107783 190756 204652 221314
18720B21314o3843r425o4529K2906O4256Q1422p7842j09672M105P059L9894n763
$$ 221314 157471 148046 83517 106423 170679 252101 174259 64587 68692 75751 115645 109882
18708A09882m9385j7911k2786J168j5103j9614P692J867l0844q2011j2065N5493
$$ 109882 60497 42586 19800 20968 5865 -13749 -6057 -4190 -35034 -117045 -129110 -73617
18696g3617J40004l825m7316J9321n8347n2481M3132J41466J18495k8343l4961
$$ -73617 66387 62562 15246 34567 -23780 -76261 -33129 108337 226832 198489 163528
18685A63528q6504N4509K1999j1288j1511m4085L8467N9392l9100R5517Q0098
$$ 163528 77024 131533 153532 142244 130733 86648 125115 184507 145407 240924 321022
18674C21022K8842L1326J01142k5269N2972L9350l0398l351m985n2770j96946
$$ 321022 349864 381190 482332 457063 510035 549385 518987 515636 510651 457881 260935
18663B60935j35419k9917l9274q4356m5423n3619P1668Q4021r794L3570N8431
$$ 260935 125516 95599 56325 -28031 -73454 -127073 -55405 28616 18822 52392 110823
18652A10823J21625l8686j30441j02427O7859J45202k3570j7863l3929L8242J2259
$$ 110823 232448 193762 63321 -39106 28753 173955 150385 132522 98593 136835 149094
18641A49094l3792K8257l8264J5143N093j07677l2238L9721J7238j9113j1636
$$ 149094 115302 143559 105295 120438 125531 17854 -14384 25337 42575 23462 11826
18630A1826P773j01494K6305J44284M5281l4476n8741p345M2768m8368q5499K4382
$$ 11826 19599 -81895 -55590 88694 133975 99499 40758 33413 76181 27813 -57686 -33304
18618c3304J40904J04331N546n075o674n2910m108j03201q6075q5446p755O2635
$$ -33304 107600 211931 217477 212402 205728 152818 148710 45509 -40566 -126012 -133767 -71132
18606g1132J12840J15859r439M8770m5557j73544L0974J1140k1157n0645k4263
$$ -71132 41708 157567 148128 196898 151341 -22203 8771 19911 -1246 -51891 -76154
18595g6154J3562R4012k6772K259l9013m0776j5965M2886R6560J05823K2095j2461
$$ -76154 -62592 31420 4648 6907 -32106 -72882 -88847 -45961 50599 156422 178517 166056
18583A66056p4442p8500j28204n5172L7170K8945M4800m2311M6826O5015P16o5255
$$ 166056 91614 13114 -115090 -170262 -133092 -104147 -59347 -101658 -54832 10183 10899 -54356
18571e4356j7553N1505l1973q7415M1499J07705N9001p3333m8785N5174P0158
$$ -54356 -71909 -20404 -52377 -139792 -98293 9412 68413 -4920 -53705 1469 71627
18560G1627o0388j33273L5549J18769K2639p8321J4531P9271M9256R8818j985
$$ 71627 11239 -122034 -86485 32284 54923 -23398 -8867 70404 119660 218478 216493
18549B16493o1487r4271j3151J9187k4078j4905n643n2903q1898Q413O7565M5386
$$ 216493 155006 60735 47584 66771 42693 27788 22145 -30758 -112656 -104243 -36678 8708
18537H708N5398L9995n7581L0417J05126j2080o5624m1879J8231q9177M230Q4077
$$ 8708 64106 104101 46520 76937 182063 169983 104359 62480 80711 -8466 -4236 79841
18525G9841P2153M4560m8431l1495k4700J04830O0217L6177o4243r024n9520m0374
$$ 79841 151994 196554 148123 116628 91928 196758 256975 293152 228909 219885 160365 119991
18513A19991K0279o6585q7583m7686l2213J13690J07562m0046m2005N8174n2828
$$ 119991 140270 73685 -13898 -61584 -93797 19893 127455 87409 45404 103578 50750
18502E0750J929P8149m4647m3806O6372k4424o3784M4329m1165P502O6972M0040
$$ 50750 52679 130828 86181 42375 108747 84323 20539 64868 23703 31205 98177 138217
18490A38217l2352q2577M0312J00114M9251L9288l7680j96110l8183O5516k4359
$$ 138217 105865 23288 63600 163714 212965 252253 214573 18463 -19720 45796 21437
18479B1437N6894l4526l9311J75304L9559o6666m8868K8305n4203J637k6542P44
$$ 21437 78331 43805 4494 179798 219357 152691 103823 132128 77925 79562 53020 53764
18467E3764j01847J9566L0025r8047K2074j4031j384M6771J7320M8201Q915O3102
$$ 53764 -48083 -28517 1508 -96539 -74465 -88496 -89880 -43109 -25789 22412 31327 94429
18455I4429J43639l3739j17594r3521q5414m7874Q2392J57319Q0491q0644l4111
$$ 94429 238068 204329 86735 -6786 -92200 -140074 -57682 99637 180128 99484 65373
18444F5373k2590p1690O2676M1781P7926K589n413o8622J3148p290J8689j1462
$$ 65373 42783 -28907 33769 75550 153476 156065 150652 82030 95178 87888 106577 95115
18432I5115J237N0553K2368L7515q6244L4372P8625l5130j56256l1360J28456
$$ 95115 96352 146905 169273 206788 120544 154916 233541 198411 42155 10795 139251
18421A39251P6531J8666L2431M746L5719J9189o0959k5158O9962M0084J1231k8695
$$ 139251 215782 234448 266879 271625 307344 326533 265574 240416 310378 350462 361693 332998
18409C32998P628K5487m6639q4813J9966q7219j45156L0562Q2389P5301J28836
$$ 332998 340626 366113 319474 234661 254627 167408 22252 52814 135203 210504 339340
18398C39340K0883L5797M1068Q3709J5141O4294J63001k060J13522J44645m6970
$$ 339340 360223 396020 437088 520797 535938 600232 763233 761173 874695 1019340 972370
18387I72370p2905l461q4410l4190p1879j84609j86860q8928l7646L1008L1155
$$ 972370 899465 896004 811594 777404 705525 520916 334056 245128 207482 238490 269645
18376B69645P7742j024N7301J9360n3945N677k8396q2060N3485R1390o677o6770
$$ 269645 347387 346363 403664 423024 369079 374756 346360 264300 317785 409175 402498 335728
18364C35728n1327q8304j8706l3840M4499J6730m2033P1810o1030N3074J1893
$$ 335728 284401 196097 177391 143551 188050 204780 162747 234557 173527 226601 238494
18353B38494l5661k8376O0245M3687M7610L4408j4992k6169n5814l1689O3900
$$ 238494 202833 174457 234702 278389 325999 360407 345415 319246 263432 231743 295643
18342B95643p0164O908P7583P2642l5810j09046M9253J24759J47236K241l7480
$$ 295643 225479 232387 309970 382612 346802 237756 287009 411768 559004 561245 523765
18331E23765J98448J77999R7002J04060J13703J0315k4432L6175O8311l1913p076
$$ 523765 722213 900212 997214 1101274 1214977 1225292 1200860 1237035 1305346 1273433 1266357
18320A266357n680l6699j9074n7642j45150o0948j39101j15176l8002O7034J28960
$$ 1266357 1260677 1223978 1204904 1147262 1002112 941164 802063 686887 648885 715919 844879
18309H44879L2770q5148k3734J50174R9866K0788J9906n4670r829J45038J16599
$$ 844879 877649 792501 768767 918941 1018807 1039595 1059501 1004831 995002 1140040 1256639
18298A256639Q142K10897J76966K29976L54016J85576J92018L99573M62920L52748
$$ 1256639 1264781 1475678 1652644 1882620 2236636 2422212 2614230 3013803 3476723 3829471
18288C829471M66041N61071O39550O95242O90778O18285L96457N26063P07824
$$ 3829471 4295512 4856583 5496133 6191375 6882153 7500438 7896895 8422958 9130782
18279I130782O75306N27267M99105Q47799J099815J596308K642542M323764O891935
$$ 9130782 9806088 10333355 10832460 11680259 12780074 14376382 17018924 21342688 28234623
18270B8234623J0277691J3065884J2943199R151221N532144O430151J1028116
$$ 28234623 38512314 51578198 64521397 73672618 79204762 85634913 96663029
18263I6663029J4827467J0673677n392791k1881786k5466562j8520110j1718824
$$ 96663029 111490496 122164173 116771382 94889596 69423034 50902924 39184100
18256C9184100p667080n313639l912564k999482k279107j802861j304339r65372
$$ 39184100 31517020 26203381 22290817 19291335 17012228 15209367 13905028 12939656
18248A2939656p35783o54908o07696m48898l93164m21275k80656k69154l17824
$$ 12939656 12203873 11548965 10941269 10492371 10099207 9677932 9397276 9128122 8810298
18239H810298m25170l28205l63080l81700l68428k55889j38937j52755j37697
$$ 8810298 8385128 8056923 7693843 7312143 6943715 6687826 6548889 6396134 6258437
18230F258437j64487j83881k00348j46127q7351j43100j13235q3386j95280k03769
$$ 6258437 6093950 5910069 5709721 5563594 5476243 5333143 5219908 5136522 4941242 4737473
18220D737473k38479j85629M197P8801j08678k10764p5564r6010j97816j43792
$$ 4737473 4498994 4313365 4317562 4396363 4287685 4076921 4001357 3905347 3707531 3563739
18210C563739l0956o0340m0925L8973q0309j16676m0225Q2684l7947j70776l3551
$$ 3563739 3532783 3472443 3431518 3470491 3390182 3273506 3233281 3315965 3278018 3107242 3073691
18199C073691Q0512J6470P4221J18780L7337L8075J64865K45208K94077K97725
$$ 3073691 3154203 3170673 3244894 3363674 3401011 3439086 3603951 3849159 4143236 4440961
18189D440961M43866N53670O28132O88563P13389P49475O66913N91987N98666
$$ 4440961 4884827 5438497 6066629 6755192 7468581 8218056 8884969 9476956 10075622
18180A0075622P85990Q03660P18314P36458P94463J008476J691344K974146N008466
$$ 10075622 10861612 11665272 12383586 13120044 13914507 14922983 16614327 19588473 24596939
18171B4596939P747723J1300237J4224063J3829065J0179290O951850P582186
$$ 24596939 32344662 43644899 57868962 71698027 81877317 88829167 96411353
18164I6411353J1951227J5568215J0406020o011341k1210519k6532907k1123584
$$ 96411353 108362580 123930795 134336815 128325474 107114955 80582048 59458464
18157E9458464j3740166q936616o160740m452757l374831k646499k055375j562517
$$ 59458464 45718298 36781682 30620942 26168185 22793354 20146855 18091480 16528963
18149A6528963j207820r83305q66920p64983o93899n84806n16542m19826m27315
$$ 16528963 15321143 14337838 13470918 12705935 12012036 11427230 10910688 10490862 10063547
18140A0063547k74232k78437m15866n20977o22704m95898k55522k77537k75951
$$ 10063547 9789315 9510878 9095012 8574035 7951331 7455433 7199911 6922374 6646423
18131F646423k29254k97163j26900j87831k14439j18083n1665K6955J0124K9757
$$ 6646423 6417169 6120006 5993106 5805275 5590836 5472753 5421088 5448043 5458167 5487924
18121E487924J55657O4314K0792m7945m1746q1732j33574r0307J28735L4752j04769
$$ 5487924 5643581 5707895 5728687 5680742 5638996 5557264 5423690 5333383 5462118 5496870 5392101
18110E392101r3793j04839j56775k99199k30432k28222p7103j0881k67243k38434
$$ 5392101 5298308 5193469 5036694 4737495 4507063 4278841 4201738 4190857 3923614 3685180
18100C685180k38987k34060k91877j77274j86193p7049m0865K6822K8577K0549
$$ 3685180 3446193 3212133 2920256 2742982 2556789 2479740 2438875 2465697 2494274 2514823
18090B514823Q107q3048k1251n348r326R8138m9540M7994n126j0580o0642L8935
$$ 2514823 2522930 2439882 2418631 2413283 2403957 2502095 2452555 2500549 2495423 2484843 2424201 2463136
18078B463136J24429L2160J4928L9870K52731K91082J69472K28091J91625K25469
$$ 2463136 2587565 2619725 2634653 2674523 2927254 3218336 3387808 3615899 3807524 4032993
18068D032993L11199K21828J68548r1811l16970l39540k11985j15862j03529k09922
$$ 4032993 4344192 4566020 4734568 4642757 4325787 3986247 3774262 3658400 3554871 3344949
18058C344949j98018j53107q5001j9360n2369j05427r8331o6118m4259j72098
$$ 3344949 3146931 2993824 2908823 2889463 2837094 2731667 2633336 2567218 2522959 2350861
18048B350861o7145j13880k02711k14001j29601o4986K6582q1255l8718P115n1706
$$ 2350861 2283716 2169836 1967125 1753124 1623523 1558537 1585119 1503864 1465146 1472261 1420555
18037A420555K6080p5122J3741R6338l755j15016j2320J20758n807k2647m2290
$$ 1420555 1446635 1371513 1385254 1481592 1477837 1362821 1350501 1471259 1465452 1442805 1400515
18026A400515P4848l4138M9785J45641J72181J25318K0946J59156J76380K00149
$$ 1400515 1475363 1441225 1491010 1636651 1808832 1934150 1955096 2114252 2290632 2490781
18016B490781J59592J87982J95461K35626J18281J39872L34795L02756J51446
$$ 2490781 2650373 2838355 3033816 3269442 3387723 3527595 3862390 4165146 4316592
18007D316592J23365j8592p6651p9002j66010j65568k13655j60466k16592k97414
$$ 4316592 4439957 4421365 4344714 4265712 4099702 3934134 3720479 3560013 3343421 3046007
17997C046007l05972l74796k14562q8424L6501m3026N182J20397j0821m4508J0126
$$ 3046007 2740035 2365239 2150677 2062253 2098754 2055728 2060910 2181307 2170486 2125978 2136104
17986B136104Q1713K3130j07390j50853m488N4842p7158j15062q29Q2529J6041
$$ 2136104 2217817 2240947 2133557 1982704 1978216 2033058 1955900 1840838 1840009 1922538 1938579
17975A938579N6502O6485K8638o8736n3345L3363J23802K04144K5149r3003j1314
$$ 1938579 1995081 2061566 2090204 2021468 1968123 2001486 2125288 2329432 2354581 2261578 2250264
17964B250264P8367P1227L3476r297Q5949j8510j17387l9464j02447q1916m1283
$$ 2250264 2328631 2399858 2433334 2424037 2509986 2491476 2374089 2334625 2232178 2150262 2108979
17953B108979j2335J8427r0278j39508j26360j0861p0981j71262r5089q0265M5623
$$ 2108979 2096644 2115071 2024793 1885285 1758925 1748064 1677083 1505821 1410732 1330467 1376090
17942A376090P4667M1089M6635M6586P4489m2414J13259P2881p5784j36540j29035
$$ 1376090 1450757 1491846 1538481 1585067 1659556 1617142 1730401 1803282 1727498 1590958 1461923
17931A461923m2982o0930p5782j91531j60736j36004r6179R585M4825O2378O0745
$$ 1461923 1418941 1358011 1282229 1090698 929962 793958 697779 707364 752189 814567 875312
17920H75312k5466m7666P2313j4845m5684o3928l1307m8326M6695j3124K3224
$$ 875312 849846 802180 874493 859648 813964 750036 718729 670403 717098 703974 727198
17909G27198j28115l9411K3134N3764o0788J3264P1967Q6773l8227p3845N1963
$$ 727198 599083 559672 582806 636570 575782 589046 661013 747786 709559 635714 687677
17898F87677m3012o3727J5149J5894M9109O1765j8525r2829l8716l7710J0613
$$ 687677 644665 580938 596087 611981 661090 722855 704330 611501 572785 535075 545688
17887E45688J07650O6627j03222o8173L9161j4860r7622q5070L5427N1308o0149
$$ 545688 653338 719965 616743 548570 587731 572871 475249 390179 425606 476914 416765
17876D16765M0641L3759m7151m6542j071l9144r084M9963L6876J0254J6195m1669
$$ 416765 457406 491165 444014 397472 396401 357257 348173 398136 435012 445266 461461 419792
17864D19792l658n4919j2741J27645n7188k07705j29354o0960P0527J18713K8095
$$ 419792 416134 361215 348474 476119 418931 211226 81872 20912 91439 210152 238247
17853B38247p7559l793P5231o2864j05952m9219K9569J38507N2014L2183M8283
$$ 238247 160688 156895 232126 169262 63310 14091 43660 182167 234181 266364 314647
17842C14647J7074k4134n3239l3528J4669J3034J9952J53872R4839k2222j30078
$$ 314647 331721 307587 254348 220820 235489 248523 268475 422347 517186 494964 364886
17831C64886j17127M1151O513J0971j7531o6786m7327M2557J30350L2366l909
$$ 364886 247759 288910 295423 306394 288863 222077 174750 217307 347657 380023 376114
17820C76114k2675q9586L9443J13636N575j07373k0774J0822l237K1608J57975
$$ 376114 353439 263853 303296 416932 422507 315134 294360 305182 301945 323553 481528
17809D81528J58589j03503K561N255J02484L5601J5014k6845J9409L3139M2249
$$ 481528 640117 536614 539175 544430 646914 682515 697529 670684 690093 723232 765481
17798G65481o3847j97294l4987n648J0735o5678j20927J5215N1681P804J2324
$$ 765481 701634 504340 469353 463705 474440 408762 287835 303050 354731 362535 374859
17787C74859r1471j8519J35799O8481r8652P0100R3142P0057m5317l2900n5771
$$ 374859 283388 264869 400668 469149 370497 440597 533739 603796 558479 525579 469808
17776D69808n069n228l8918P370j828K4285r1886l9320P6542O0611k1529m3672
$$ 469808 464739 459511 420593 427963 426135 450420 358534 319214 395756 456367 434838 391166
17764C91166L8591l3902Q6045P6550l271n8887K5871J10615L0131J21277J69436
$$ 391166 429757 395855 481900 558450 555179 496292 522163 632778 662909 784186 953622
17753I53622J13258K53210K86000J61721J32296j7790r4406n128J8505n2704o4477
$$ 953622 1066880 1320090 1606090 1767811 1900107 1882317 1787911 1782783 1801288 1748584 1684107
17742A684107j11469j83158j43201j14787k7831J30580K5197j12209K230Q3524
$$ 1684107 1572638 1389480 1246279 1131492 1103661 1234241 1259438 1147229 1149459 1232983
17732A232983k8309R8063J31899J21785J18285J09111R4781j2339m4955K1991
$$ 1232983 1204674 1302737 1434636 1556421 1674706 1783817 1878598 1866259 1821304 1843295
17722A843295m6340j65922j39624j99015j73417j22608j38822l4894M5840O7258
$$ 1843295 1796955 1631033 1491409 1292394 1118977 996369 857547 822653 868493 935751
17712I35751J7459o8321o6159L6777P1706Q9419J1981K6067O400Q0099k4458n1958
$$ 935751 953210 884889 818730 855507 927213 1016632 1028613 1054680 1061080 1141179 1116721 1064763
17700A064763r7314L2562o0555j07131m4169q2503O53O6733l7184n1898j20258
$$ 1064763 967449 1000011 939456 832325 788156 705653 706306 773039 735855 683957 563699
17689E63699n8553K054J07397P0362J55609K51628K14820K30432K79390K51464
$$ 563699 505146 507200 614597 684959 840568 1092196 1307016 1537448 1816838 2068302
17679B068302L76394K85869J81628M2753R9689l845J1932j57848k57046j63160
$$ 2068302 2444696 2730565 2912193 2954946 3054635 3050790 3062722 2904874 2647828 2484668
17669B484668j42767k95296k59596j50405j905J25468K21015K73851K59400K33466
$$ 2484668 2341901 2046605 1787009 1636604 1634699 1760167 1981182 2255033 2514433 2747899
17659B747899L11159L31394L04119K50724K78531J99359J6517n0748p1313k32295
$$ 2747899 3059058 3390452 3694571 3945295 4223826 4423185 4439702 4388954 4317641 4085346
17649D085346l83245l55873m71732l34665k26352j48461r7223j02694j3321p2233
$$ 4085346 3702101 3346228 2874496 2539831 2313479 2165018 2067795 1965101 1951780 1879547
17639A879547j61486k6042K2601n4749j05009k2083n8608j51409j1450O3386n3104
$$ 1879547 1718061 1692019 1714620 1659871 1554862 1532779 1474171 1322762 1311312 1374698 1321594
17628A321594j74056r6311l4883J04255K3993N5494n8611l3023K6153o1078o3947
$$ 1321594 1147538 1051227 1016344 1120599 1144592 1200086 1141475 1108452 1134605 1073527 1009580
17617A009580l484J21396J12897m5384N2168J32613K20928M3921J4129l424r841
$$ 1009580 1006096 1127492 1240389 1195005 1247173 1379786 1600714 1644635 1658764 1655340 1645499
17606A645499k4409Q0601o1192j52141j52863j4771r7884r4228o3944M3666l6736
$$ 1645499 1621090 1701691 1640499 1488358 1335495 1320724 1222840 1128612 1064668 1108334 1071598
17595A071598j05952k0616R4527J04102J17073l9568k0191J38471O6355n7067
$$ 1071598 965646 945030 1039557 1143659 1260732 1221164 1200973 1339444 1405799 1348732
17585A348732r784Q8217J00209k9145L5238j2706M0638r0410k05547M479P6306
$$ 1348732 1338948 1427165 1527374 1498229 1533467 1520761 1561399 1470989 1265442 1269921 1346227
17574A346227m563j52802L6977J24450j45547r3950p8631M1033J8116M6085J1863
$$ 1346227 1341664 1188862 1225839 1350289 1204742 1110792 1032161 1073194 1091310 1137395 1149258
17563A149258K4948J38220J291j24233k0422N277J02291J62443m1527N5076K0549
$$ 1149258 1174206 1312426 1313717 1189484 1169062 1174339 1276630 1439073 1397546 1452622 1473171
17552A473171p7014N1851P2695N6087K54511K53713J95519K08634K47067K08668
$$ 1473171 1396157 1448008 1520703 1576790 1831301 2085014 2280533 2489167 2736234 2944902
17542B944902K79466K02809J60605K12178J14576m6206k89357l74524l22357j49697
$$ 2944902 3224368 3427177 3587782 3799960 3914536 3868330 3578973 3204449 2882092 2732395
17532B732395Q664J6994J24842P2083J24643J80313J25789K55182K19556L46649
$$ 2732395 2741059 2758053 2882895 2954978 3079621 3259934 3385723 3640905 3860461 4207110
17522D207110M13155M25948N57235O26698P96690R97623J162669J292577J752435
$$ 4207110 4620265 5046213 5603448 6230146 7026836 8024459 9187128 10479705 12232140
17513A2232140K192281K385941K093024J223506P05351J025980J700724K061251
$$ 12232140 14424421 16810362 18903386 20126892 20832243 21858223 23558947 25620198
17505B5620198J477877r52103k494627j619538j98725R36012J847000K815016
$$ 25620198 27098075 26145972 23651345 22031807 21833082 22769094 24616094 27431110
17497B7431110M042426N751815Q041677J1611267J7336995K5647446L5837125
$$ 27431110 31473536 37225351 45267028 56878295 74215290 99862736 135699861
17490A35699861M3964498M3178908L4701237L0942326L6051636M5216760M8157348
$$ 135699861 179664359 222843267 257544504 288486830 324538466 369755226 417912574
17483D17912574K6697332j9205906n0450507n5547140n4153268n1183512m5332721
$$ 417912574 444609906 425404000 374953493 319406353 265253085 214069573 168736852
17476A68736852l5329151k5006919j7613640j2830812r670620p445949n824657
$$ 168736852 133407701 108400782 90787142 77956330 68285710 60839761 55015104
17469E5015104m294057l080906k096691j346842j020102o99686n56199n28362
$$ 55015104 50721047 47640141 45543450 44196608 43176506 42476820 41920621 41392259
17461D1392259j57796L16570O9953p48751j875124k777048l029675k589404j869232
$$ 41392259 41234463 41551033 41620986 40872235 38997111 36220063 33190388 30600984 28731752
17452B8731752j599502j504384j408718j350164j263547j221272j170211j146225
$$ 28731752 27132250 25627866 24219148 22868984 21605437 20384165 19213954 18067729
17444A8067729j021201o50164n76660o33150n39273l96187m27633k79616l50227
$$ 18067729 17046528 16396364 15819704 15186554 14647281 14251094 13823461 13543845 13193618
17435A3193618l81999k65825l26476l19887m11567m03645m19334m05293m19844
$$ 13193618 12811619 12545794 12219318 11899431 11487864 11084219 10664885 10259592 9839748
17426I839748k28760l16503l68574l60583m45493k71480j91337k77102j53424
$$ 9839748 9610988 9294485 8925911 8565328 8119835 7848355 7657018 7379916 7226492
17417G226492p7608j88844k85031k41540k59225j90575j07992j48291m8962j66770
$$ 7226492 7148884 6960040 6675009 6433469 6174244 5983669 5875677 5727386 5678424 5511654
17407E511654j53189o5531r8468r9557j39378k6701J14453j08534j62153k0382
$$ 5511654 5358465 5292934 5194466 5094909 4955531 4928830 5043283 4934749 4772596 4752214
17397D752214m0551q0353k0496n8140k19735k09091j80196j32276p4249l2691
$$ 4752214 4711663 4631310 4610814 4552674 4332939 4123848 3943652 3811376 3737127 3704436
17387C704436o0685l2032n6240o5388q6433j61254r4321j608J734N514M2824K7612
$$ 3704436 3643751 3611719 3555479 3490091 3403658 3242404 3148083 3146475 3148209 3153723 3196547 3224159
17375C224159L7634o1786m5420j04056j30717m7243k5496k5695j81984j98155
$$ 3224159 3261793 3200007 3154587 3050531 2919814 2872571 2847075 2821380 2639396 2441241
17365B441241J7910L2846j12233l9160j26182o4741j38572p4125j31940k14379
$$ 2441241 2459151 2491997 2379764 2340604 2214422 2149681 2011109 1936984 1805044 1590665
17355A590665n6120N3313l119j9619K0557N9860K9165J23984K74328M11722L80113
$$ 1590665 1534545 1587858 1584739 1565120 1585677 1645537 1674702 1798686 2073014 2484736 2864849
17344B864849L01357J79556J07774K19999L93451M32566L06685l48541p11937
$$ 2864849 3166206 3345762 3453536 3673535 4066986 4499552 4806237 4457696 3745759
17335C745759o58529n22499k64999j73346o8148l9389p7509j45471j01562M4948
$$ 3745759 3087230 2564731 2299732 2126386 2058238 2018849 1941340 1795869 1694307 1739255
17325A739255J32399K08513K77015L24368K03852K4609J14529L29380M35901K02792
$$ 1739255 1871654 2080167 2357182 2681550 2885402 2910011 3024540 3353920 3789821 3992613
17315C992613l02518n71427o08440m01818k51558j97904k03503q6449r4322p8836
$$ 3992613 3690095 3118668 2510228 2108410 1856852 1658948 1455445 1368996 1274674 1195838
17305A195838k2812j7304L0411n8614r9442k4732q138R2102n6841j26019j8736
$$ 1195838 1173026 1155722 1186133 1127519 1028077 1003345 995207 1087309 1030468 904449 885713
17294H85713L4103j59035r332M8806l2128j05149j1286K7962N157m2108k1295
$$ 885713 919816 760781 751449 800255 768127 662978 651692 679654 684811 642703 621408
17283F21408q164K6493N88n6125l6518O0018J6214o1823K8668J22175J11094L977
$$ 621408 613244 639737 640325 584200 547682 607700 623914 562091 590759 712934 824028 828005
17271H28005M4735J09658P2748M0187j7693n5082o0557l1557K124q6043q0406
$$ 828005 872740 982398 1055146 1095333 1077640 1022558 962001 930444 932568 846525 766119
17260G66119r2407k9747N0890J7810p8420K5858M1836l9864M9949J05747Q5386
$$ 766119 673712 643965 694855 712665 634245 660103 701939 662075 712024 817771 903157
17249I03157n6158P8357n555p4038m0554P7130P1415l0038j3493N3812j2486o6192
$$ 903157 846999 925356 919801 845763 805209 882339 953754 923716 910223 964035 951549 885357
17237H85357N163R529m5794r7404n783O576j16932n1652m5114p2249j2337l452
$$ 885357 890520 900049 854255 756851 751068 757644 640712 589060 543946 471697 459360 455908
17225D55908L706M0256l3111k9438j8334M2794J7605Q3989Q6849M9559q4099J4147
$$ 455908 459614 499870 466759 437321 418987 461781 479386 563375 650224 699783 615684 629831
17213F29831l5060R1232L7310J9131J7634j59422L2343J35571j975K0132N5170
$$ 629831 594771 686003 723313 742444 760078 600656 632999 768570 766595 786727 841897
17202H41897J17264J61557J10404J49948J67603K44063L15100K90401L3685m08669
$$ 841897 959161 1120718 1231122 1381070 1548673 1792736 2107836 2398237 2431922 2023253
17192B023253n38424l91269k87754j12795p3701J7506Q7001l949L2869n0113L9400
$$ 2023253 1484829 1093560 805806 693011 619310 636816 723817 719868 752737 702624 742024
17181G42024J34740J88724K15655J71413O5653m6075J4951K45732K80355J98714
$$ 742024 876764 1065488 1281143 1452556 1518209 1472134 1487085 1732817 2013172 2211886
17171B211886j41150l65011m79346k30431j24238N1702r2336j96905p134J5664
$$ 2211886 2070736 1705725 1226379 995948 871710 923412 831076 634171 627037 642701
17161F42701k2194k0660k9238k0366p5699o0098j7138j524m6534P148P4069P6374
$$ 642701 620507 599847 570609 550243 474544 414446 397308 395784 349250 356398 430467 506841
17149E06841k1028k1768r4219j28652Q1177J26881K8295j5015l8550j1902M2499
$$ 506841 485813 464045 369826 241174 322351 449232 477527 462512 423962 412060 454559
17138D54559K415l5590q6826n3003J1851M6463M4092N3799j1075k9769k893J2880
$$ 454559 456974 421384 334558 281555 293406 339869 383961 437760 426685 396916 394023 406903
17126D06903J7125p3799k6543n4199L0425j7555k9958P9399L301L846J16898L2884
$$ 406903 424028 350229 323686 269487 299912 282357 252399 331798 335099 338945 455843 488727
17114D88727j24465k4961j10139m4449J29178O0019o3745p9523J09924J03008
$$ 488727 364262 339301 229162 184713 313891 373910 310165 230642 340566 443574
17104D43574O4j73038j39339J48440Q3173q531n6526m8504k7156N7960J24873
$$ 443574 443638 270600 131261 279701 362874 354343 297817 249313 222157 280117 404990
17093D04990p075r4426R094l5145m2633l9526n7076n6681J10868P071K2349N3061
$$ 404990 397915 303489 312583 277438 234805 195279 138203 81522 192390 199461 221810 274871
17081B74871j26035q1074J12573N9015l0533k7529J2915k5616M4014o2238o0632
$$ 274871 148836 67762 180335 239350 208817 181288 194203 168587 212601 150363 89731
17070H9731M2698k7122J11351N6682n4601k3984k7663L7870O5510l364J60506
$$ 89731 132429 105307 216658 273340 218739 194755 167092 204962 270472 267108 427614
17059D27614J42018L4637Q3027J02759K5356n5696l6603J138o8429j8570N430
$$ 427614 569632 604269 687296 790055 815411 759715 723112 724250 655821 637251 642681
17048F42681j32852q2416n2424M8986l6081k1330Q6385L6992O7819J9397P1144
$$ 642681 509829 427413 374989 423975 387894 366564 452949 489941 557760 577157 648301
17037F48301k4508j9864p4495n4072O5488M8573Q2562j7358l0770l1622L7833
$$ 648301 623793 603929 529434 475362 540850 589423 671985 654627 623857 592235 630068
17026F30068o4163j29184o0722M9569R3107O0627m1353o3561p7046j54561r1200
$$ 630068 565905 436721 375999 425568 518675 579302 537949 474388 397342 242781 151581
17015A51581J7066n9152k726N8417M2693N313J1478k3351k482M5478Q9028O253
$$ 151581 168647 109495 106769 165186 207879 213192 224670 201319 198837 244315 333343 339596
17003C39596n1118j08532M7460Q79k5296j24142m3294Q7253M2891R8171k8606
$$ 339596 288478 179946 227406 228285 202989 78847 35553 122806 165697 263868 235262
16992B35262j17799o1834n4901L8448O0115N1800K4476m0259q2308R899J3703
$$ 235262 117463 55629 728 39176 99291 151091 175567 135308 53000 62899 76602
16981G6602m099j0961j5896L6491K697K5172l5340J7096R898K6796m0640J975
$$ 76602 72503 61542 45646 82137 84834 110006 74666 91762 101660 128456 87816 89791
16969H9791j17272l6474M5381o8156O1478L1611L7676Q0012P2065P811J05252
$$ 89791 -27481 -63955 -18574 -86730 -25252 6359 44035 124047 196112 203923 309175
16958C09175l9783p0980j10456M8861R5390M5090m8938o8013L0382L2417m1182
$$ 309175 269392 198412 87956 136817 232207 277297 228359 160346 190728 223145 181963
16947A81963p4988j06350N1788J28257O3006M7433P6695k2515r4402j07402r0970
$$ 181963 106975 625 52413 180670 243676 291109 367804 345289 250887 143485 52515
16936E2515k7559L8681M8332m7975P8333O8514K6387L4508J47378P6067M9092
$$ 52515 24956 63637 111969 63994 142327 210841 237228 271736 419114 495181 544273
16925E44273L2999O3035J9828Q0193J69700J38484J43753L5656m1469j72775j70158
$$ 544273 577272 640307 660135 740328 910028 1048512 1192265 1227921 1186452 1013677 843519
16914H43519j21373j21224l571P5106o9668N761o2667N2919M8927p133L9976R1278
$$ 843519 722146 600922 597351 672457 602789 608550 545883 598802 647729 640596 680572 771850
16902G71850P8224M0181N1358L4570J95034J06822j08403r5135j6851o3204n3053
$$ 771850 850074 890255 941613 976183 1171217 1278039 1169636 1074501 1057650 994446 941393
16891I41393L9362o0795p675n1001r0150o7768q2108J6441J9052j9679P1451J49826
$$ 941393 980755 919960 912285 861284 771134 703366 621258 637699 656751 637072 708523 858349
16879H58349J17009j9279q6850M7117N9561r3710p8475j7849n228k317L4300J09006
$$ 858349 975358 956079 869229 916346 975907 882197 803722 785873 780645 778328 812628 921634
16867I21634K3471m7193k5961j23208o1494Q9065l9250j14279o6755n4213l6281
$$ 921634 945105 897912 871951 748743 687249 776314 737064 622785 556030 501817 465536
16856D65536L5131l2841L6656k2820o9026p2756L9294m6470l9420J3628m6222
$$ 465536 500667 467826 504482 481662 412636 339880 379174 332704 293284 306912 260690
16845B60690j30124N6507k82K6699J9037l3926k382R2577Q3689p1724k3258l5324
$$ 260690 130566 187073 186791 213490 232527 198601 196219 288796 372485 300761 277503 242179
16833B42179K7545j3517j2383R623j8750k7829J6243j0883m2251M8652N9903K912
$$ 242179 269724 256207 243824 253447 234697 206868 223111 212228 169977 218629 278532 281444
16821B81444q8071j08898n21k9021j1103n621L680n4481o5431N7408M8087P2210
$$ 281444 193373 84475 83954 54933 43830 38209 41889 -12592 -78023 -20615 27472 99682
16809I9682j7881j2261l378L8464j0345k8337j20332N4162L9093M2037J3242m1050
$$ 99682 81801 69540 66162 104626 94281 65944 -54388 -226 38867 80904 94146 53096
16797E3096n8160M8182l5948m6570J03597J20279k920j2286j1435K3896O7453
$$ 53096 -5064 43118 7170 -39400 64197 184476 181556 169270 157835 181731 249184
16786B49184k5578r4367K7373O4330R1654J61o1067j6153J80338J69569K1950
$$ 249184 223606 129239 156612 220942 312596 312757 251690 235537 415875 585444 607394
16775F07394R7012Q0657L56j5830q7008o2827L9405l3022m5965j878O2891q6255
$$ 607394 704406 785063 785419 769589 682581 619754 659159 626137 580172 578294 641185 554930
16763E54930o3408P4227k1087j19605n5725j07478q7749P6973O1326N417L9033
$$ 554930 491522 565749 544662 425057 369332 261854 174105 251078 312404 317821 356854
16752C56854j30376q2634k846N772K2460p3042j02170L2962M9637K4485N5059
$$ 356854 226478 143844 140998 146770 169230 96188 -5982 26980 76617 101102 156161
16741A56161N2315L2273m8210j57045j03146J17641K0345j9280J79262R045j20700
$$ 156161 208476 240749 192539 35494 -67652 49989 70334 51054 230316 239361 118661
16730A18661j18796l2974P9499J02446k5340j18695j10364O8166n273l4323l3795
$$ 118661 -135 -33109 46390 148836 123496 4801 -105563 -37397 -42670 -76993 -110788
16719a10788J53888Q2284q0328j4445N4762r2414j11865K995L2775N1394M7802
$$ -110788 43100 125384 45056 30611 85373 -7041 -118906 -115911 -83136 -31742 16060
16708A6060j5672J0862M7616P8466r528k5133J1906J12712L8301k3288m5530K370
$$ 16060 388 11250 58866 137332 127804 102671 114577 227289 265590 242302 196772 199142
16696A99142K1205j1635k452o9129p6931P5717l9940j35916K4046J02828J12520
$$ 199142 220347 208712 206260 137131 60200 135917 95977 -39939 -15893 86935 199455
16685A99455l1017j8042K9951o8247n8950J982N166L9334N9858o8438O3012M0928
$$ 199455 168438 150396 180347 112100 53150 55132 60298 99632 159490 91052 154064 194992
16673A94992N4210L7700m2057m1413o3330r5739n3173P2621J2661k2155k9449
$$ 194992 249202 286902 244845 203432 140102 44363 -8810 63811 76472 54317 24868
16662B4868O851j9540P6368j4568k6844Q0754J48752N6200j3174o1399J07875
$$ 24868 31719 12179 88547 73979 47135 127889 276641 332841 319667 258268 366143
16651C66143j4962j31775l3620R9181M2119L509l6585j22556m6060j5146L283
$$ 366143 351181 219406 185786 284967 327086 330595 294010 171454 125394 110248 113531
16640A13531J6457k823K2718o2148M4948L6629R9580O497q0336j7166q27L7049
$$ 113531 129988 127165 149883 87735 132683 169312 268892 275389 195053 177887 177060 214109
16628B14109J14628n3710j11817l6035J57048J02415j3015p2024j2749L2440P4404
$$ 214109 328737 275027 163210 127175 284223 386638 373623 301599 288850 321290 395694
16617C95694R9351J91659R3340k3109j0780N3850M5105m7489l6620K1330j01209
$$ 395694 495045 686704 780044 756935 746155 800005 845110 797621 761001 782331 681122
16606F81122o6752r6465J7477p4860p0824M4458Q0597p1833j25817L789K080k3824
$$ 681122 614370 517905 535382 460522 389698 434156 514753 442920 317103 320892 322972 299148
16594B99148L4780M9070n0478L2731r563L2329n9063p4197M3446m8837j3645N8836
$$ 299148 333928 382998 332520 365251 355688 388017 328954 254757 298203 249366 235721 294557
16582B94557J1804n6327r2081J03919J88800M4645N615n224J0263J8684k0223
$$ 294557 306361 250034 157953 261872 450672 495317 500932 495708 505971 524655 504432
16571E04432P1081j38817j69026j92442o7926O6809J1276K9226R9949R2429n6718
$$ 504432 575513 436696 267670 75228 7302 74111 85387 114613 214562 306991 250273
16560B50273N2389j3661n4643K6821r610l8684l2303l6672J7687P146j00993n7
$$ 250273 302662 289001 234358 261179 251569 212885 180582 143910 161597 168743 67750 67693
16548F7693N2633N2997q0758q9837J54623J07189K4228q7747p1387M0110j9408
$$ 67693 120326 173323 92565 2728 157351 264540 288768 201021 129634 169744 150336
16537A50336P0539m8147j850O3648O9938R994k682j1228r6530m6663M7615k6940
$$ 150336 220875 172728 170878 234526 304464 314458 311776 300548 204018 157355 204970 178030
16525A78030J17380J87791r099j29186m8582J28988J38007P7813L5223p9345P143
$$ 178030 295410 483201 474102 344916 296334 425322 563329 641142 676365 597020 604163
16514F04163L6646K7691R6018N7956N7469q1663L8011p3785j40724j39303q1330
$$ 604163 640809 668500 764518 822474 879943 798280 836291 762506 621782 482479 401149
16503D01149k0735Q8419k45n0078j02834k5391M8055j5870l356J8198L8325O9452
$$ 401149 380414 468833 468588 418510 315676 290285 338340 322470 319114 337312 375637 445089
16491D45089n6162k9853k5662o7704q1364l1764k6110L6472L7565J25453J01272
$$ 445089 388927 359074 333412 265708 184344 152580 126470 162942 200507 325960 427232
16480D27232j5278R9150L591m0777K503r0268k5658K1833J750p0737o00m3625
$$ 427232 411954 511104 514695 473918 476421 386153 360495 382328 384078 313341 312741 269116
16468B69116K8542Q3526P3168k497r2828j32057N0313K4149K0470J8866K5126
$$ 269116 297658 381184 454352 451855 359027 226970 277283 301432 321902 340768 365894
16457C65894O3117k5564q0690l0562n0925o5996K024K6009J8868J19867Q94j8644
$$ 365894 429011 403447 322757 292195 241270 175274 177298 203307 222175 342042 342936 324292
16445C24292l8488r1072O7151J21523J00334N9967l0264o1161N5857O7614J0310
$$ 324292 285804 194732 261883 383406 483740 543707 513443 452282 508139 575753 586063
16434E86063M6921k0890n9759n3555j18661M1759j26075O4662K5953K5231R8564
$$ 586063 632984 612094 552335 498780 380119 421878 295803 360465 386418 411649 510213
16423E10213P8929k1127k1204K8554Q18o9656m0134J53501j1444l5371K01642
$$ 510213 589142 568015 546811 575365 576183 506527 466393 619894 608450 573079 774721
16412G74721K70803L51041L52398K76404L07434M34948M15347M17844M44405K03402
$$ 774721 1045524 1396565 1748963 2025367 2332801 2767749 3183096 3600940 4045345 4248747
16402D248747O664k4589O2899j83839l05900k65844l80274k85725j33576k47228
$$ 4248747 4255411 4230822 4293721 4109882 3803982 3538138 3157864 2872139 2738563 2491335
16392B491335l52051k41416j23001m0730K2318N8891o80R9800O3691O1054N6649
$$ 2491335 2139284 1897868 1774867 1734137 1756455 1815346 1814666 1914466 1978157 2039211 2095860
16381B095860P2997R4068J66796J80649L04224K02936J92307K89299K98388L99249
$$ 2095860 2168857 2262925 2429721 2610370 2914594 3117530 3309837 3599136 3897524 4296773
16371D296773L26123J41179L45578M92673O55979R10996J216290J799376K402280
$$ 4296773 4622896 4764075 5109653 5602326 6258305 7169301 8385591 10184967 12587247
16362A2587247L257417M820753P140388R876573J2157585J2485541J1063554J0084652
$$ 12587247 15844664 20665417 27805805 37682378 49839963 62325504 73389058 83473710
16354H3473710R622143J0517902J1936978Q317669j602138r872838j6825889k1745206
$$ 83473710 93095853 103613755 115550733 123868402 122266264 112393426 95567537 73822331
16346G3822331j8582216j2657066q465000n811702m178471l128872k427696j961672
$$ 73822331 55240115 42583049 34118049 28306347 24127876 20999004 18571308 16609636
16338A6609636j494149j287033j028459p70816o02127o15819n60413m58360l86724
$$ 16609636 15115487 13828454 12799995 12029179 11427052 10811233 10250820 9792460 9405736
16329I405736l81782l40145n07285m13980k95268k61133k59637k50897l34709
$$ 9405736 9023954 8683809 8176524 7762544 7467276 7206143 6946506 6695609 6360900
16320F360900k96800k74393j58443j77374j42151r8872j6309o7762p5548O8792
$$ 6360900 6064100 5789707 5631264 5453890 5311739 5212867 5196558 5128796 5053248 5122040
16310E122040K47194J10311R1149J74108K34146L52669L94264J44399j56989o3305
$$ 5122040 5369234 5479545 5570694 5744802 5978948 6331617 6725881 6870280 6713291 6649986
16300F649986J12708j57033m16270m86449n02236m11233k09445j77035k07690
$$ 6649986 6762694 6605661 6189391 5702942 5200706 4789473 4580028 4402993 4195303
16291D195303k79481l93159k41602j12759Q9511N7003l3808j00570L8498M4706
$$ 4195303 3915822 3522663 3281061 3168302 3257813 3314816 3281008 3180438 3218936 3263642
16281C263642O0559P3401J48083K15965J28730J41159K12263P1154K15400K25055
$$ 3263642 3324201 3397602 3545685 3761650 3890380 4031539 4243802 4314956 4530356 4755411
16271D755411K61295K95812K42447L41931N83411Q64029J120604J454280J963351
$$ 4755411 5016706 5312518 5554965 5896896 6480307 7344336 8464940 9919220 11882571
16262A1882571K869728M243682O241820Q740801J0846699J1472831J0204547Q817073
$$ 11882571 14752299 18995981 25237801 33978602 44825301 56298132 66502679 75319752
16254G5319752Q309025R361583J0965005Q635221J15186r442918j6437864j9705532
$$ 75319752 83628777 92990360 103955365 112590586 112705772 103262854 86824990 67119458
16246F7119458j6721958j1474985p596214n341173l914600k832453k071959j694041
$$ 67119458 50397500 38922515 31326301 25985128 22070528 19238075 17166116 15472075
16238A5472075j518125j341825r79900o97512n98577n30694m62259m21010m20340
$$ 15472075 13953950 12612125 11632225 10934713 10336136 9805442 9343183 8922173 8501833
16229H501833l73105m09783l40840l78129l97377k60828l00466j94529k24271
$$ 8501833 8128728 7718945 7378105 6999976 6602599 6341771 6041305 5846776 5622505
16220E622505l66861k62978j90297n5332j64828k38554j35157j26752j99309j86739
$$ 5622505 5255644 4992666 4802369 4747037 4582209 4343655 4208498 4081746 3882437 3695698
16210C695698r0464r8477j50883k59896j37528o3022j45308k6068P7974k5671
$$ 3695698 3605234 3506757 3355874 3095978 2958450 2895428 2750120 2724052 2802026 2776355
16200B776355q3842j28766r3502m6291m1458o7564o3392q2465q8609j75364k2608
$$ 2776355 2692513 2563747 2470245 2423954 2382496 2314932 2251540 2169075 2080466 1905102 1882494
16189A882494Q8974m241Q117k4591r8593j8091p9816p6388q4873j33859n9073
$$ 1882494 1971468 1967227 1975344 1950753 1852160 1834069 1754253 1677865 1592992 1459133 1400060
16178A400060l7689j1139m7498L2811r4500l6170L5611O021J3812j21383j28053
$$ 1400060 1362371 1351232 1303734 1336545 1242045 1205875 1241486 1247507 1261319 1139936 1011883
16167A011883n3769N6706M0134m9960n7096q2583O1177M7103K9449j12052j35856
$$ 1011883 958114 1014820 1054954 1004994 947898 865315 926492 973595 1003044 890992 755136
16156G55136p5316K1063O8111P2341J18732L3849j07646j00642l1568p8518M1778
$$ 755136 679820 700883 768994 841335 960067 993916 886270 785628 754060 675542 717320
16145G17320k5456p1483l720J57628k5806k8353j408m141m4017j24041K3068L1436
$$ 717320 691864 620381 616661 774289 748483 720130 718722 714581 670564 546523 569591 601027
16133F01027P9896l7658q6750o9411j2308M5649N608n3983n1957l6666n2135Q2153
$$ 601027 680923 643265 556515 487104 474796 520445 526053 472070 420113 383447 331312 413465
16121D13465j1684N7772O0109k8343M8007p6415j32931q6501K4670l0920n2001
$$ 413465 401781 459553 519662 491319 539326 462911 329980 243479 268149 237229 185228
16110A85228m2859M2332M330J78258P1126j03362q6274J7751l7273j7195L962
$$ 185228 142369 184701 189031 367289 438415 335053 248779 266530 229257 212062 216024
16099B16024M9531M0443j07550n5682O2261J12770k1680j73055N7436k3366r6473
$$ 216024 265555 305998 198448 142766 205027 317797 296117 123062 180498 157132 60659
16088F0659O132l9132J6755J34832M5360J9382L1610j3569j13755j4536L1366
$$ 60659 66791 27659 44414 179246 224606 243988 275598 262029 148274 133738 165104
16077A65104J9529j9976O278J10399j5139m3909r2902O905R2423k706o2250Q3782
$$ 165104 184633 164657 170935 281334 266195 222286 129384 136289 228712 226006 163756 247538
16065B47538J40395j63737m296M1101R7369L9107p8267r2453j62900j02478J7897
$$ 247538 387933 224196 219900 261001 358370 397477 319210 226757 63857 -38621 -20724
16054b0724Q5643N2052k0617K9909J5692K8616M3419p25o7730o3576N9560L0485
$$ -20724 64919 116971 96354 126263 141955 170571 213990 213265 145535 81959 141519 172004
16042A72004j15247M4264L7744J1053K2028o5515m344L9712J06040j09641j67621
$$ 172004 56757 101021 138765 149818 171846 106331 101987 141699 247739 138098 -29523
16031b9523R1263N112k6388L384L6856L1957j12398N8677K9816o8615m2114K5061
$$ -29523 61740 66852 40464 43848 80704 112661 263 58940 88756 20141 -21973 3088
16019C088J00657k2332p0261j2283J1929Q5680K1888j1562k0404M3387M3214j40166
$$ 3088 103745 81413 11152 -1131 10798 96478 118366 106804 86400 129787 173001 32835
16007C2835l4531K0015M7709m6052M4479o957O5403n936o2442l629k0600P6461
$$ 32835 -1696 18319 66028 19976 64455 57498 122901 116965 54523 50894 30294 106755
15995A06755N9211n5546l6056o3957r7158l9631k9096N8183J37887J52174K3351
$$ 106755 165966 110420 74364 10407 -86751 -126382 -155478 -97295 40592 192766 216117
15984B16117n6338r8255j33474o0047N9700R7671p921q0602p944L2213L8215J3268
$$ 216117 159779 61524 -71950 -131997 -72297 25374 17453 -63149 -71093 -38880 -665 12603
15972A2603L9695K0958J65845K7823R565m4155j11130l0816q1921j48740M2374
$$ 12603 52298 73256 239101 266924 276489 232334 121204 90388 8467 -140273 -97899
15961i7899m670o3343l0292O1555O1866L5741l5460p6726J00332R6305k9347j2166
$$ -97899 -102569 -165912 -196204 -134649 -72783 -37042 -72502 -149228 -48896 47409 18062 5896
15949E896j28265k1373j6755P1160K6370J0405J4107p9727j1656J13910N4485
$$ 5896 -122369 -143742 -160497 -89337 -62967 -52562 -38455 -118182 -129838 -15928 38557
15938C8557K964m3726o2187o7222J05933J01495M0762P500r0779l424k8401l6838
$$ 38557 41521 -2205 -64392 -131614 -25681 75814 116576 124076 33297 29873 1472 -35366
15926c5366l3929l0817P7484N0082L5052O5136Q469M3293L4159m0789j9663J1404
$$ -35366 -69295 -100112 -22628 27454 62506 127642 136111 179404 213563 172774 153111 164515
15914A64515m8230r9026j76025l3890J21906J13887r111j2618J5115R1339L6834
$$ 164515 116285 17259 -158766 -192656 -70750 43137 34026 21408 36523 127862 164696
15903A64696N1305p129r2184k527Q5037O6051l4011j06570j41490N6747Q0865
$$ 164696 216001 208872 116688 114161 199198 265249 231238 124668 -16822 39925 120790
15892A20790r8018o8878p749m5673K2866P9807J41952q9487j24871j1765K6349
$$ 120790 22772 -46106 -53855 -99528 -76662 3145 145097 55610 -69261 -81026 -54677
15881e4677M2746K7579N1376k9981k234R4639k8397k5687J34761J13351L4440
$$ -54677 -11931 15648 67024 37043 34809 129448 101051 75364 210125 323476 357916
15870C57916o8830q8120j09800m5912j1993J1019m6976o5123Q5368L1728K9126
$$ 357916 289086 200966 91166 45254 33261 44280 -2696 -67819 17549 49277 78403
15859G8403o5370j4212L2723m7264K6700L840l3588j2039L9385m1063k1678j04146
$$ 78403 13033 -1179 31544 -15720 10980 14820 -18768 -30807 8578 -32485 -54163 -158309
15847a58309L7850Q9206M3764J1344J14972R7031K6485o8970r170R7386Q9469
$$ -158309 -120459 -31253 12511 23855 138827 235858 262343 193373 184203 281589 371058
15836C71058k7568J41862K5291k0594J03799Q4792P7545R644q0811k13179k46086
$$ 371058 343490 485352 510643 490049 593848 678640 756185 765829 685018 471839 225753
15825B25753j67656o6300L9426M8568L9544j31922m0380N0060J20833N103m339
$$ 225753 58097 -8203 31223 79791 119335 -12587 -52967 -2907 117926 123029 118690
15814A18690r5298l2131j6911J2657r610j252Q4151J32882o4020j33434L009k195
$$ 118690 23392 -8739 -25650 -12993 -22603 -23855 60296 193178 129158 -4276 -1267 -3462
15802c462K4198L520k1076O763J8567O001L7223p7823q7736n7169R3052p011J318
$$ -3462 20736 24256 3180 9943 28510 34511 71734 -6089 -93825 -150994 -57942 -64953 -63635
15789f3635k8995K4636J48538K6839o3177m855L4915j5772k4665l059j2663n6998
$$ -63635 -92630 -67994 80544 107383 44206 39351 74266 58494 33829 30770 18107 -38891
15777c8891o9023J4078L25K1221P0118Q572l0058Q4519M7706K922k6669k2659
$$ -38891 -107914 -93836 -93511 -72290 -2172 6400 -23658 60861 108567 111489 84820 62161
15765F2161j48842n0427r179K0152Q5542M2532o2255J1386Q1234o8956J168K2580
$$ 62161 -86681 -137108 -146287 -126135 -40593 1939 -60316 -48930 32304 -36652 -35484 -12904
15753a2904Q2482K9693Q236l5303N634n4421o9779L3612J20659J36041o4224j579
$$ -12904 69578 99271 107507 72204 77838 23417 -46362 -12750 107909 243950 179726 178147
15741A78147p1340K4648J00941k4929J15922q244o2057Q7045L8723k9800Q8534
$$ 178147 106807 131455 232396 207467 323389 315145 253088 340133 378856 349056 437590
15730D37590J15460k1578p9554j25192k5387K7187o7188m3667o5287j3317K3984
$$ 437590 553050 531472 451918 326726 301339 328526 261338 217671 152384 139067 163051
15719A63051p2281J3443O4864l0845q3332n8259P4433j8946p0292J8800m0148
$$ 163051 90770 104213 169077 138232 54900 -3359 71074 52128 -18164 636 -39512
15708c9512N2438P2110M006j05133J2596R9372J374o5277j05273m0768P3301J0596
$$ -39512 12926 85036 89042 -16091 -3495 95877 97251 31974 -73299 -114067 -40766 -30170
15696c0170o5704k7909L3441N8306l3318L3498j8466j737l5787p2498m1605P9667
$$ -30170 -95874 -123783 -90342 -32036 -65354 -31856 -50322 -52059 -87846 -160344 -201949 -122282
15684a22282k1751L5991J00835j3279j064k9970n8239p5401J30164j6234m4940
$$ -122282 -144033 -108042 -7207 -20486 -21550 -51520 -109759 -185160 -54996 -71230 -116170
15673a16170N9873J33863Q164j5286p0884j01493J8143J3681m1296m0096j0281
$$ -116170 -56297 77566 85730 70444 -440 -101933 -83790 -70109 -111405 -151501 -161782
15662a61782k3540o8567Q6307J23712P3284n5778r2063j0899k5995O2173L8845
$$ -161782 -185322 -253889 -167582 -43870 29414 -26364 -118427 -129326 -155321 -93148 -54303
15651e4303O61Q2497P2177l6072J9951O6829j945J7095k9559q0688k22095m2375
$$ -54303 -53642 28855 101032 64960 84911 151740 149795 166890 137331 56643 -165452 -207827
15639b07827P1772j2660J06951M5876k1207M9080J6251j15351o8841O2161l57
$$ -207827 -136055 -148715 -41764 4112 -17095 31985 48236 -67115 -135956 -73795 -74152
15628g4152l7966P1616N4464l5661N275k8014N8727M2024r1763j03694l5615R599
$$ -74152 -112118 -40502 13962 -21699 -16424 -44438 14289 56313 -35450 -139144 -174759 -165160
15616a65160O850N395j20734L9624P4265L3853P4461J51569j9039n4674n3213
$$ -165160 -158310 -152915 -273649 -234025 -159760 -125907 -51446 100123 81084 26410 -26803
15605b6803o5270o863R124L3991Q7397n1953o2601M6622l0105k6337K911q971
$$ -26803 -92073 -98936 -89812 -55821 31576 -20377 -82978 -36356 -66461 -92798 -89887 -98858
15593i8858J8606p9423P6056L2141n1823M3284K2614l4804J7274L6033P4931J16278
$$ -98858 -80252 -159675 -83619 -51478 -103301 -60017 -37403 -72207 -54933 -18900 56031 172309
15581A72309o531n6821j50879p8829j09180K6639J05436N0028J08077K0699n3851
$$ 172309 165778 108957 -41922 -120751 -229931 -203292 -97856 -47828 60249 80948 27097
15570B7097l391k0971K2992J6941m1783l0044N7565J1519j60519R994J0650J36756
$$ 27097 23706 2735 25727 42668 885 -29159 28406 39925 -120594 -110600 -99950 36806
15558C6806m349l0644K2616j48351l9564k6169k333J35972N2004M5623j2935L871
$$ 36806 32457 1813 24429 -123922 -163486 -189655 -191988 -56016 -4012 41611 28676 32547
15546C2547k7342k0425k100k0110K9625O8871j06165j66136m3485L0225J18501
$$ 32547 5205 -15220 -17320 -37430 -7805 61066 -45099 -211235 -254720 -224495 -105994
15535a05994J25838m4256p4403L999P6592L5965n68M8824m0447o540n1970O0539
$$ -105994 19844 -24412 -98815 -94816 -18224 17741 17173 65997 25550 19010 -32960 27579
15523B7579O3922o5119q9221K2010j6801j029K7232J75681m9061r1964M5081j500
$$ 27579 91501 26382 -62839 -40829 -57630 -58659 -31427 144254 95193 3229 48310 46810
15511D6810M3550o7453j36977j262R2469J17941K383q2140j7069P7910O0988M1727
$$ 46810 90360 22907 -114070 -115332 -22863 95078 97461 15321 -1748 76162 137150 178877
15499A78877o1592n2357J8307q0830k042p530n6202m9377Q2205j7131j3373Q0222
$$ 178877 117285 64928 83235 2405 363 -7167 -63369 -112746 -30541 -47672 -61045 19177
15487A9177O2442o3282j4571o03K8794j795m3592k1027n674k6623m9800j5741
$$ 19177 81619 18337 3766 3163 31957 30162 -13430 -34457 -40131 -66754 -116554 -132295
15475a32295J8914P2618J51162L5617k2827J0494m3433K1273r3229J8528L9354
$$ -132295 -113381 -40763 110399 146016 123189 133683 90250 111523 18294 36822 76176
15464G6176n5293o501m4159k5828k0415j8423L013L8747j9567r5889K7125J18989
$$ 76176 20883 14382 -29777 -55605 -76020 -94443 -91430 -52683 -72250 -168139 -141014 -22025
15452b2025J3046l8822k1203l1266l4536P1936Q2173P5089j7851p6959j9656k8879
$$ -22025 -8979 -47801 -69004 -100270 -134806 -62870 19303 94392 76541 -418 -20074 -48953
15440d8953k4964j658K2489p9983p3915k846J2958L6051j2971j7869m4501Q2156
$$ -48953 -73917 -75575 -53086 -133069 -206984 -209830 -196872 -160821 -173792 -191661 -236162 -154006
15428a54006P7047j1282j665m1053P9965L4273q1390N8230R5232j6934n7002P7309
$$ -154006 -76959 -88241 -89906 -130959 -50994 -16721 -98111 -39881 55351 38417 -18585 58724
15416E8724M3018j10286r0288N3747M1772k5867M0991P3260L1454l3075r230N57
$$ 58724 101742 -8544 -98832 -45085 -3313 -29180 11811 85071 116525 83450 74220 74777
15404G4777o3479l0389j3450Q3790K658r1781k4587J7641M7513L6055L3257n5323
$$ 74777 11298 -19091 -32541 51249 53907 -37874 -62461 -44820 2693 38748 72005 16682
15392A6682l6941K061J00454o2714k9147o0253j8069O0423N0215q2492j0577p2252
$$ 16682 -20259 -18198 82256 19542 -9605 -69858 -87927 -27504 22711 -59781 -70358 -142610
15380a42610K4512N8551n4206j5053M304O6733O163J05387k3996j36208N4507
$$ -142610 -118098 -59547 -113753 -128806 -124502 -57769 -51606 53781 29785 -106423 -51916
15369e1916J29939N6880j44778r1844L9982Q8063j01164J8784J09235L0550o3126
$$ -51916 78023 134903 -9875 -101719 -61737 26326 -74838 -56054 53181 83731 20605
15358B0605n596L9283M1977o220q0740J4483k4889n5368J05496J4347j27243k8328
$$ 20605 15009 54292 96269 90049 9309 23792 -1097 -56465 49031 63378 -63865 -92193
15346i2193P2983q2102o3182J6711P6500L6533l753k4980p2391L0912J62425L3937
$$ -92193 -19210 -101312 -164494 -147783 -71283 -34750 -38503 -63483 -135874 -104962 57463 91400
15334I1400k04568o6022J28369J4649K0229J06857K6370p7066j25225M4472j4002
$$ 91400 -113168 -179190 -50821 -36172 -15943 90914 117284 40218 -85007 -40535 -54537
15323e4537j44212J23792J01601l3186J0610M5814N7139J2513q9375k3173n1220
$$ -54537 -198749 -74957 26644 -6542 4068 49882 107021 119534 30159 6986 -44234
15312d4234N2334n1579p5735J8313J22385N0743M3379p0781O7884J2171j18114
$$ -44234 8100 -43479 -119214 -100901 21484 72227 115606 44825 112709 124880 6766
15301F766o6340R1589K1987j031K8869J4975p3465o3817n281L5323K1569J04611
$$ 6766 -59574 32015 54002 52971 81840 96815 23350 -40467 -45748 -10425 11144 115755
15289A15755N2621q5076k6146o8420j6537o522O1425L4987p6460L3842N1076n3076
$$ 115755 168376 83300 57154 -11266 -27803 -34325 27100 62087 -14373 19469 70545 17469
15277A7469P3614o7345m0091N3496L7833j6817j15951k4656L8368K7613J9807
$$ 17469 91083 23738 -16353 37143 74976 58159 -57792 -82448 -44080 -16467 3340
15266C340O5529l5377p2278L4593k3407J1395q90l3638m2156J4533O5257m4174
$$ 3340 68869 33492 -38786 -4193 -27600 -16205 -17095 -50733 -92889 -78356 -13099 -57273
15254e7273n6158M1947Q7316Q8476r8786o6787n1603Q5675l8015L5059q419o1856
$$ -57273 -113431 -71484 15832 104308 5522 -61265 -112868 -27193 -65208 -30149 -38568 -100424
15242a00424q0634N0215O1597k6452j9334Q7088N4015j5319k2057M1011Q1058
$$ -100424 -181058 -130843 -69246 -95698 -115032 -27944 26071 10752 -11305 29706 110764
15231A10764k0710l7826N061p6990n0481L2310N2148k0015p9449n0769J03384
$$ 110764 90054 52228 57289 -19701 -70182 -37872 14276 -5739 -85188 -135957 -32573
15220c2573J42613p2361j01701o9327p079q4112M7387r6084n2893Q2012P0617
$$ -32573 110040 37679 -64022 -133349 -140428 -224540 -177153 -273237 -326130 -244118 -173501
15209a73501Q9481P1638L0553O448J0675N4363m3044m9104p3175J3007L4005j6907
$$ -173501 -84020 -12382 18171 24619 35294 89657 46613 -2491 -75666 -62659 -28654 -45561
15197d5561J05896p7074n2900J39599P9058r0761K6258k5699o568k4044r1580
$$ -45561 60335 -16739 -69639 69960 149018 58257 84515 58816 52248 28204 -63376
15186f3376j19031N8593n7446k6696n9491n6180J14266J30151N1661N9267n2595
$$ -63376 -182407 -123814 -181260 -207956 -267447 -323627 -209361 -79210 -27549 31718 -20877
15175b0877K3790o379n6746L7631L0559k1440n8554k5575J35172P3396j06575
$$ -20877 2913 -3466 -60212 -22581 7978 -13462 -72016 -97591 37581 110977 4402
15164D402N7103O8996M3776j09202j36752o4616L268N0814J9432m4850N9301J02092
$$ 4402 61505 130501 174277 65075 -71677 -136293 -133025 -82211 -62779 -107629 -48328 53764
15152E3764k6157m1849M3802R2823K2397o4707m3493R704L7633j11086m7216N3856
$$ 53764 27607 -14242 29560 122383 144780 80073 36580 46284 83917 -27169 -74385 -20529
15140b0529m1457k9928j3470l0279Q4538N3996p4205J6557K5774K0071J6019j6674
$$ -20529 -61986 -91914 -105384 -135663 -51125 2871 -71334 -54777 -29003 -8932 7087 -9587
15128i587m2766L8475M0773n7261P1214J8301K479l187o331j0408k9331l6441
$$ -9587 -52353 -13878 26895 -30366 40848 59149 61628 58441 52110 41702 12371 -24070
15116b4070m2991k556O1530N4237L3815k6847N212j34018j8251P7838K2070M3262
$$ -24070 -67061 -69617 -8087 46150 79965 53118 58330 -75688 -93939 -16101 5969 49231
15104D9231l6329N2910J09853j7127j01174k2360q9394p3043N4149J10484J5566
$$ 49231 12902 65812 175665 158538 57364 35004 -54390 -127433 -73284 37200 52766
15093E2766j02219r6982J6073K3247l7682N7600J04553P690j4270l9270J23878
$$ 52766 -49453 -146435 -130362 -107115 -144797 -87197 17356 25046 10776 -28494 95384
15082I5384M0740j38451l8792p3995J4319R1440K0539n5903j7409K09n1888m6462
$$ 95384 136124 -2327 -41119 -115114 -100795 -9355 11184 -44719 -62128 -61919 -113807 -160269
15070a60269J33827K5202n6239m9091K8428K2431P9449P3136N6025k889j01548
$$ -160269 -26442 -1240 -57479 -106570 -78142 -55711 23738 96874 152899 150010 48462
15059D8462m1298K6315N001k7423K3176o3115r836O0587N8758N3409O1069K618
$$ 48462 7164 33479 38480 11057 34233 -28882 -38718 21869 80627 134036 195105 197723
15047A97723q746j5573l3974L4975m9847j6723M4111M4696j3083j06584j34460
$$ 197723 188977 173404 139430 174405 124558 107835 151946 196642 183559 76975 -57485
15036e7485m4366r204R198N8184O2370L9472R2461J7182p9730j6876K1871Q9855
$$ -57485 -101851 -111055 -101857 -43673 18697 58169 150630 167812 88082 71206 93077 182932
15024A82932k4283j33533j19198p1482P3412K6401j5910k1473j1909p1433j35113
$$ 182932 158649 25116 -94082 -165564 -92152 -65751 -81661 -103134 -115043 -186476 -321589
15013c21589N2563J08430O9635Q238o7838L4897k0648M552J12846M1503R0305
$$ -321589 -269026 -160596 -90961 -82723 -150561 -115664 -136312 -131760 -18914 22589 112894
15002A12894l416j1514k648N210l2691l2725n0300l3027n6419p681Q8109P7078
$$ 112894 109478 97964 95316 100526 67835 35110 -15190 -48217 -104636 -112317 -24208 52870
14990E2870M273n4524k2039L521M1496j468q2858k2801m426n888R487m8370M3908
$$ 52870 57143 2619 -19420 -15899 25597 24129 -58729 -81530 -85956 -91844 -82357 -130727 -86819
14977h6819M4005j7561K3098j00520m0040M7779j4097O701J24558K0974P2917
$$ -86819 -42814 -60375 -37277 -137797 -177837 -130058 -144155 -137454 -12896 8078 80995
14966H0995m2202K419k4521L0174O7211j078m2826j00973r1381r984J0851M0524
$$ 80995 38793 41212 16691 46865 114076 112998 70172 -30801 -122182 -132166 -121315 -80791
14954h0791N9477K5902j5075O5620q340m5072k5357M2727j3890j05062o6922M0848
$$ -80791 -21314 4588 -10487 55133 46793 1721 -23636 19091 5201 -99861 -166783 -125935
14942a25935j6755N8339k1599L6953Q5223P9857K4201Q1282j6089j92424l7386
$$ -125935 -142690 -84351 -105950 -68997 16226 96083 120284 201566 185477 -6947 -44333
14931d4333m2399J8042P2166p3955q4747R6371m0589j3304k2160M8292P1181O2261
$$ -44333 -86732 -68690 3476 -70479 -155226 -58855 -99444 -112748 -134908 -86616 -15435 46826
14919D6826N4243j1162n1362K8131k7973P4616l8355q9378n8852o8747Q1936J30750
$$ 46826 101069 89907 38545 66676 38703 113319 74964 -14414 -73266 -142013 -60077 70673
14907G0673j8678r620P1303L8224k3008q1506l3716n8951L2349k7564p0726l7316
$$ 70673 51995 42375 113678 151902 128894 47388 13672 -45279 -12930 -40494 -111220 -148536
14895a48536J26120P719l2435J7419q3287k0376l187J11705K2033l734n1386k673
$$ -148536 -22416 -14697 -47132 -29713 -113000 -133376 -136563 -24858 -2825 -6559 -57945 -60618
14883f0618L9248j7616K9820o8562k8208R3095k4347K1665N5969m7419P276k0871
$$ -60618 -21370 -38986 -9166 -77728 -105936 -12841 -37188 -15523 40446 -6973 303 -20568
14871b0568k9626n6932l4218O845R3039N3278N0631p3723k201M059p7334j7960
$$ -20568 -50194 -107126 -141344 -134499 -41460 11818 62449 -11274 -13475 -9416 -86750 -104710
14859a04710j6114J08092J04821P6266N0665P950j60556n4906k1986m8303k6880
$$ -104710 -120824 -12732 92089 168355 219020 226970 66414 11508 -10478 -58781 -85661
14848h5661L7084j11925j19548R2695J26445J9701K6908O5334R6933j6141q2722
$$ -85661 -48577 -160502 -280050 -187355 -60910 -41209 -14301 51033 147966 131825 49103
14837D9103L1898o9404l7803k8216p0223J6000n6926m7262O5897L0237o4360K8702
$$ 49103 81001 11597 -26206 -54422 -124645 -108645 -165571 -212833 -146936 -116699 -181059 -152357
14825a52357O8209m390P03L359k9015J8159K0077L0681n9655O0042N9836J1172
$$ -152357 -84148 -88538 -87835 -84476 -113491 -95332 -75255 -44574 -104229 -44187 15649 26821
14813B6821Q3561M8602N1587j34623q5630j44835Q9714M0960o1686n835O0250
$$ 26821 110382 158984 210571 75948 -9682 -154517 -64803 -23843 -85529 -91364 -31114
14802c1114n1689j05431J115N7095K0067O5588J68268J25400n7973j01120q8241
$$ -31114 -82803 -188234 -187119 -130024 -109957 -44369 123899 249299 191326 90206 1965
14791A965p8819m1042J52251L5698l5805L3971Q7574j02161p8858k5427K505K4606
$$ 1965 -76854 -117896 34355 70053 34248 68219 155793 53632 -25226 -50653 -48148 -23542
14779b3542O8617N2566n3892l5095M6023N816J6023J8225M9780m2633r2938k436
$$ -23542 45075 97641 43749 8654 54677 60493 76516 94741 144521 101888 8950 6514
14767F514L0456M9371p196n6847j5901r2048J3107O4358L3395j6268K863N1141
$$ 6514 36970 86341 79145 22298 6397 -85651 -72544 -8186 25209 8941 11804 62945
14755F2945j5677N7574l3522j06947m7198Q3116O6399m3291q23r8332Q139j1077
$$ 62945 47268 104842 71320 -35627 -82825 291 66690 23399 22576 -75756 -67617 -78694
14743g8694m2308P83J66930J07953O7899j15389q4383j46717L9527J09065O1711
$$ -78694 -121002 -120219 46711 154664 222563 107174 22791 -123926 -84399 24666 86377
14732H6377l6085M8941O9487o3826q8661q227j4881M7347M2424q8935K7517P7359
$$ 86377 50292 99233 168720 104894 16233 8006 -6875 40472 82896 -6039 21478 98837
14720I8837m5058J294r6261l8978O5169K04776L296n4364r027m9140p1263L8585
$$ 98837 53779 55073 -41188 -80166 -14997 189779 193075 138711 129684 80544 9281 47866
14708D7866J11346p2371m4103Q4617N635J1976k5289n8470n5443q4094L8047J25563
$$ 47866 159212 86841 42738 127355 132990 144966 119677 61207 5764 -78330 -40283 85280
14696H5280o1936N0094J02020J2711M158l878Q1897r9739p3930p9194p2299n4878
$$ 85280 23344 73438 175458 188169 192327 188449 270346 170607 96677 17483 -54816 -109694
14684a09694N3066N8944K5333R2273k0142m500P9333l1399l8611L1713n3579J5612
$$ -109694 -56628 2316 27649 119922 99780 95280 174613 143214 104603 136316 82737 98349
14672I8349J7999n764q6090n2937p2793o2087j8483O4420N4033m1698R969L4186
$$ 98349 116348 110584 24494 -28443 -101236 -163323 -181806 -117386 -63353 -105051 -95082 -60896
14660f0896K420k3355l4032J8884j3622K8764N083k4986P4254J23141L4474q6423
$$ -60896 -58476 -81831 -115863 -96979 -110601 -81837 -76754 -101740 -27486 95655 130129 43706
14648D3706j55288O5375O5517L7115O0161j4859q6754L3411m7376j4594L449L1071
$$ 43706 -111582 -46207 19310 56425 116586 101727 14973 48384 1008 -13586 -10137 20934
14636B0934P9612L7725n7289m6224q0021J37559J8685k9138l6440O3162J2159
$$ 20934 100546 138271 80982 34758 -45263 92296 110981 81843 45403 108565 120724
14625A20724p4198j12906o805L5596K6459p322Q2372J27629p953j40283q6457
$$ 120724 46526 -66380 -73185 -37589 -11130 -18452 63920 191549 183596 43313 -43144
14614d3144j2518j9796m4188O6494j1229M115L7126M7581N791m5443l132K3585
$$ -43144 -55662 -75458 -119646 -53152 -64381 -60266 -23140 24441 30232 -15211 -18343 5242
14602E242Q374M1201o332q2998M6631J02518k5044M6732O8396R690p0290l8567
$$ 5242 13616 54817 48485 -34513 12118 114636 89592 136324 204720 214410 144120 105553
14590A05553l7990Q5689M4727n6807p5690j00998o5476L2038j7874N9706K8898
$$ 105553 67563 153252 197979 141172 65482 -35516 -100992 -68954 -86828 -27122 1776
14579A776l7450j2704K9012K9000J0473j00506j6636N9488P1951L866o0156J5927
$$ 1776 -35674 -48378 -19366 9634 20107 -80399 -97035 -37547 34404 38270 -21886 -5959
14567e959Q8434M1521N5847m4409j02748o3471P5340N3518l7408J7902Q1842r4081
$$ -5959 82475 123996 179843 135434 32686 -30785 44555 98073 60665 78567 160409 66328
14555F6328p2120K3078N37O5713n1321O2756N7630p5521r1691K5124P590j18493
$$ 66328 -5792 17286 17823 83536 32215 94971 152601 77080 -14611 10513 18103 -100390
14543a00390j2902L7974J44783k3751m2391M7243m4282j1482Q3387L6614p2820
$$ -100390 -113292 -75318 69465 45714 3323 50566 6284 -5198 78189 114803 41983
14532D1983M9731J27363j22030k21603o6331Q0823n039n1586J7290N4493l5835
$$ 41983 91714 219077 97047 -124556 -190887 -110064 -115103 -166689 -149399 -94906 -130741
14521a30741n2015O8870R1603J9704P792J0984l9365m5303M3701L8605J5409o7222
$$ -130741 -182756 -113886 -22283 -2579 5213 16197 -23168 -68471 -24770 13835 29244 -37978
14509c7978J14759O5651n060l1630j23085N744L3177K7916P125L3260k7909O6473
$$ -37978 76781 142432 137372 105742 -17343 -11599 21578 49494 56619 89879 61970 128443
14497A28443J4608l3749n3831p3178m8530j2138K5433j2545j8207p8011L5765
$$ 128443 143051 109302 55471 -17707 -66237 -78375 -52942 -65487 -83694 -161705 -125940
14486a25940K0432O8768j2608p2497J11787P0178M6072j03685j04214M8515L1976
$$ -125940 -105508 -36740 -49348 -121845 -10058 60120 106192 2507 -101707 -53192 -21216
14475b1216O4433J9566o0389p5950K6963O0253K3956j0957j13818o2717j7278
$$ -21216 43217 62783 2394 -73556 -46593 13660 37616 26659 -87159 -149876 -167154
14464a67154N3685J01208R3496m4438j22681K2073J1952M5776Q580M8042m8577
$$ -167154 -113469 -12261 81235 36797 -85884 -63811 -51859 -6083 2497 50539 1962
14453A962o4017j8827l1252K2521M5620R3257N4235q8040l4146Q4240j9269j9804
$$ 1962 -62055 -80882 -112134 -89613 -43993 49264 103499 15459 -18687 65553 46284 26480
14441B6480o5361K517M4962L0971O3331L9609L7926m0398m4610o4715j48275M652
$$ 26480 -38881 -36364 8598 39569 102900 142509 180435 140037 95427 30712 -117563 -112911
14429a12911R6987J67925K397j45349o907n9740P7727R4825J6945M8995n613m7206
$$ -112911 -15924 152001 154398 9049 2142 -57598 20129 114954 131899 180894 175281 128075
14417A28075k0496o5805n4329L4555N4835j9044r1853m4241Q0131L1369r9482
$$ 128075 107579 41774 -12555 22000 76835 57791 -34062 -78303 1828 33197 -66285
14406f6285k7820M5401J8147N8386J14528o1892m0740R2787o4443o9296N1820
$$ -66285 -94105 -48704 -30557 27829 142357 80465 39725 132512 68069 -1227 50593
14395E0593K8150n2219R563m5613L766R401J89M4081J01831K6946r1545N552j4350
$$ 50593 78743 26524 36087 -9526 -5760 3641 3830 47911 149742 176688 85143 90695 76345
14382G6345j0770o047m6492j4000j4733q2675J047R500q8439j9770O9365J02023
$$ 76345 65575 59528 13036 -964 -15697 -98372 -97325 -87825 -176264 -196034 -126669 -24646
14370b4646q4879q8992m5519Q0311R1042m7502p8621M2677N6472l6472m3401K9358
$$ -24646 -109525 -198517 -244036 -163725 -72683 -120185 -198806 -156129 -99657 -136129 -179530 -150172
14358a50172L224q0172J3864k8189R5225J72080J7922P2283n1821p2623j3966
$$ -150172 -146948 -227120 -213256 -241445 -146220 25860 43782 116065 64244 -8379 -22345
14347b2345J968N1441r9138o2809K5774r6148p8679J7932J2491K00057L4501K4325
$$ -22345 -20377 31064 -68074 -130883 -105109 -201257 -279936 -262004 -249513 -49456 -14955 9370
14335I370n2709j34518O9789N8089j7640J4576P6634m360K463o4844n166R7208
$$ 9370 -43339 -177857 -108068 -49979 -67619 -53043 23591 19231 21694 -43150 -48316 48892
14323D8892L8129N0349J0493o1134j16917L6084j6111N9827O342l6694K059O3015
$$ 48892 87021 137370 147863 86729 -30188 5896 -10215 49612 55954 19260 21319 84334
14311H4334R0411O78j976p9245p6326n0895p8834o144J38240K7863o9629o4487
$$ 84334 174745 175423 173447 94202 17876 -33019 -111853 -117997 20243 48106 -21523 -86010
14299h6010j00891J33993J93251j4040r0259n8819j00659L4470Q4641R2847k3923
$$ -86010 -186901 -52908 140343 126303 36044 -22775 -123434 -88964 -4323 88524 64601
14288F4601j66248n208O111L594J0272n115L1153L7705J5455j06731O9601K4689
$$ 64601 -101647 -106855 -100744 -97150 -86878 -91993 -60840 -23135 -7680 -114411 -44810 -20121
14276b0121K7464q2051O249R8779P7000k6668O712q0391p3951K495O6624o7871
$$ -20121 7343 -74708 -68459 30320 107320 80652 87364 6973 -66978 -64483 2141 -65730
14264f5730o7244Q704L3281l0117O3896L6873l2171O1983k4322k3673l1307O781
$$ -65730 -132974 -124270 -90989 -121106 -57210 -20337 -52508 9475 -14847 -38520 -69827 -63046
14252f3046M9253R4502J34912J4136q5799m4313l0354o6575j37182N0863l8008
$$ -63046 -13793 80709 215621 229757 143958 99645 69291 2716 -134466 -83603 -121611
14241a21611J0451l096J10824O8981L0663L1626j04010q542R2875M6593j11568
$$ -121611 -111160 -114256 -3432 65549 96212 127838 23828 15286 108161 154754 43186
14230D3186o3965L0145J4669m8176L3004n0714P8084P6421n4555m027R4494p9761
$$ 43186 -20779 9366 24035 -24141 8863 -41851 36233 112654 58099 54072 148566 68805
14218F8805k3491j1052j6410r1091L2222L7359q7980K8137J28166N4551N6393
$$ 68805 45314 34262 17852 -73239 -41017 -3658 -91638 -63501 64665 119216 175609
14207A75609J8986j6512m5228p0973n1922J5951o3484L2766m9517o9992m3209
$$ 175609 194595 178083 132855 61882 9960 25911 -37573 -4807 -54324 -124316 -167525
14196a67525p029J02705P4157l8824K065n2266m5632L9719l6381l4056M7399J23073
$$ -167525 -174554 -71849 2308 -36516 -34451 -86717 -132349 -92630 -129011 -163067 -115668 7405
14184G405p3736j6609Q93k4139L6137K1490J3183M4938j836o4100J03189M0513
$$ 7405 -66331 -82940 -82047 -106186 -70049 -48559 -35376 9562 7726 -56374 46815 87328
14172H7328j01640J4553N3414M6574j7798m2755n4548j5198l5785P150Q8108k8740
$$ 87328 -14312 241 53655 100229 82431 39676 -14872 -30070 -65855 -58705 29403 663
14160F63j9153q2136m2635j9659k0062k6946l8003N7922N5828R2169J00411K3399
$$ 663 -18490 -100626 -143261 -162920 -182982 -209928 -247931 -190009 -134181 -42012 58399 81798
14148H1798o7997o9638K6518o8960o6263R9544Q9520j7000K0983O4428r1630j33270
$$ 81798 13801 -55837 -29319 -98279 -164542 -64998 24522 7522 28505 92933 1303 -131967
14136a31967l0932O7410R1769k1648p2161M0962N5748M7504J9992O3199N316l0487
$$ -131967 -162899 -95489 -3720 -25368 -97529 -56567 -819 46685 66677 129876 135192 104705
14124A04705j32401p025l5828N1381l1455R846L7960K9148K4279J0193m2081n4674
$$ 104705 -27696 -34721 -70549 -19168 -50623 -40777 -2817 26331 50610 60803 18722 -35952
14112c5952o0412J863J7037J05308J45268K1314j45218j14296P7503O9878l4724
$$ -35952 -96364 -94501 -77464 27844 173112 194426 49208 -65088 12415 82293 47569
14101D7569m1762l2199M3782K0959o6735L383l1716k3848J2052l3998J27575J23512
$$ 47569 5807 -26392 17390 38349 -28386 -25003 -56719 -80567 -68515 -102513 25062 148574
14089A48574o875J4497l2251l1259k1721l4346j39352L2208J38939L0752j1473
$$ 148574 141699 156196 123945 92686 70965 36619 -102733 -70525 68414 99166 87693
14078H7693K1816l6250r503P0189k3344j53929o8785O7843k0388J11327Q4894
$$ 87693 109509 73259 63756 133945 110601 -43328 -112113 -44270 -64658 46669 131563
14067A31563n1562m8919R4695J13455n5867o0903k0998j15519n3157J0480L0627
$$ 131563 80001 31082 125777 239232 183365 122462 101464 -14055 -67212 -56732 -26105
14056b6105m2466j596O9870R7036j1333j7519m9350K791O3138o303n8736j36336
$$ -26105 -68571 -70167 -297 96739 85406 67887 18537 21328 84466 78163 19427 -116909
14044a16909N8723K9455L6404r4713j6733l147j26j2392j10782J6153J5427K4761
$$ -116909 -58186 -28731 7673 -87040 -103773 -106920 -107046 -119438 -230220 -214067 -198640 -173879
14032a73879P5677J11025O7695l2267j6365o5977q287O7427n0785l6322l4408
$$ -173879 -98202 12823 80518 48251 31886 -34091 -42378 25049 -25736 -62058 -96466
14021i6466K3974Q0993N9973L980L252j05426o2426j187q125O8368J17828o7381
$$ -96466 -72492 8501 68474 72454 75706 -29720 -92146 -93333 -101458 -33090 84738 17357
14009A7357k444o251j0913K1905L7573O2564J2783m2986k4647o4908N5452R1161
$$ 17357 14913 8662 -2251 19654 57227 119791 132574 89588 64941 33 55485 146646
13997A46646K025o1764J0835n707n0243l6860M235o6751r32K4186j04036o1540
$$ 146646 148671 86907 97742 92035 41792 4932 9167 -57584 -58516 -34330 -138366 -199906
13985a99906R7286K6340n2433L5496J17161J5728n0167m9463n3301R062J7410
$$ -199906 -102620 -76280 -128713 -93217 23944 39672 -10495 -59958 -113259 -104197 -86787
13974h6787Q9347J9462o1250O9417O97r1495O2800N5290M8453Q4881Q2318m3045
$$ -86787 2560 22022 -39228 30189 30886 -60609 2191 57481 105934 190815 273133 230088
13962B30088r3896n2167p0045J1968N0076L2735r365j49934j29712J05950J20550
$$ 230088 136192 84025 13980 25948 76024 108759 99394 -50540 -180252 -74302 46248
13951D6248R3211n3329p8058K155O9971M7987j09124o0188M7762o0742n1343j9221
$$ 46248 139459 86130 8072 10227 80198 128185 19061 -41127 6635 -54107 -105450 -124671
13939a24671m1271J4060N8168Q9800O4300o1849m7866J34660P8546r0171j17035
$$ -124671 -165942 -151882 -93714 -3914 60386 -1463 -49329 85331 163877 73706 -43329
13928d3329k9450K5379K3583K4294P0551N4510k0357j7121K3080K7306r7360O7225
$$ -43329 -72779 -47400 -23817 477 71028 125538 105181 88060 111140 138446 41086 108311
13916A08311m49j618N289j203J1391k9410j3602m674r4269q0045j4551M97N8538
$$ 108311 107862 106244 111533 110330 121721 92311 78709 74035 -20234 -100279 -114830 -114333 -55795
13903e5795J00984m7422j1778k4491l4654p407N0270M6274J6724p8481k611J50479
$$ -55795 45189 -2233 -14011 -38502 -73156 -80563 -30293 15981 32705 -45776 -48387 102092
13891A02092R927J811P0037O4059o63r7241j98234j8273P767N9060K4619k4102
$$ 102092 112019 113830 183867 247926 247263 150022 -48212 -66485 -58718 342 24961 859
13879H59q2695j7565N8670m9286l0997O6241L1655q6095O0996P1122O090m6371
$$ 859 -81836 -99401 -40731 -90017 -121014 -54773 -23118 -109213 -48217 22905 28995 -17376
13867a7376N5681m7591p7153o0458K606O259P1503K7063r390q2934j2086Q6579
$$ -17376 38305 -9286 -86439 -146897 -144291 -138032 -66529 -39466 -48856 -131790 -143876 -57297
13855e7297K3963m958K8159m98k1214o0745Q1635n6211O3921M4211O0456J0578
$$ -57297 -33334 -38292 -10133 -10631 -31845 -92590 -10955 -67166 -3245 40966 101422 112000
13843A12000N6807j0763k6114o6642n2945j5678L2486n5738o8242M8175N5638
$$ 112000 168807 158044 131930 65288 12343 -3335 29151 -26587 -94829 -46654 8984
13832H984N7366n359m1407Q5455P521l7644j3289j40555J03538K2925j0493J5598
$$ 8984 66350 60991 19584 105039 112560 74916 61627 -78928 24610 47535 37042 52640
13820E2640n2979l424k5899j7935K4812M1579P2967K2068J5702J7347q469P415
$$ 52640 -339 -3763 -29662 -47597 -22785 18794 91761 113829 129531 146878 138409 145824
13808A45824j02990M0850Q754j19619m5035l4806J0610J25993L9610n0655N421
$$ 145824 42834 83684 92438 -27181 -72216 -107022 -96412 29581 69191 18536 23957
13797B3957n3330j02136m6083l0842K0030Q2808R027K2307J09141Q861n973l8377
$$ 23957 -29373 -131509 -177592 -208434 -188404 -105596 -96569 -74262 34879 43740 37767 -610
13785f10M749k5209j1871P2005N4843N2284l2244q1237M2613O369q3121J3968
$$ -610 4139 -21070 -32941 39064 93907 146191 113947 32710 75323 81692 -1429 12539
13773A2539O6744K3401p9420j5621K9907k2084K0776m6746r7541k1711k663O4487
$$ 12539 79283 102684 23264 7643 37550 15466 36242 -10504 -108045 -129756 -132419 -67932
13761f7932n9420m4764O114M0415J00059j4737q2092p46O8010K3627k4729O0380
$$ -67932 -127352 -172116 -166002 -125587 -25528 -40265 -122357 -123103 -55093 -31466 -56195 4185
13749D185K5520l5717j06571M054j8633j2725O729Q5593J3961R2267n9454q4090
$$ 4185 29705 -6012 -112583 -108529 -127162 -139887 -133158 -47565 -33604 58663 -791 -84881
13737h4881M4885l6410j7548l4919J5240L3997L5308N0637O1606j668p9851M5791
$$ -84881 -39996 -76406 -93954 -128873 -113633 -79636 -44328 6309 67915 66247 -13604 32187
13725C2187P027p0558O419P121N8641K2479M1207n6505q008k3669O5392m0548
$$ 32187 39214 -31344 -24925 -17804 40837 63316 104523 48018 40010 16341 81733 41185
13713D1185o3181j6560n7919m368l2503m6222R5821N1293l7096K6662N7390O5617
$$ 41185 -21996 -38556 -96475 -100843 -133346 -179568 -83747 -32454 -69550 -42888 14502 80119
13701H0119J8203m6394K7270O0888K6846l5357k04973o0730J3016Q5660o7007
$$ 80119 98322 51928 79198 140086 166932 131575 -73398 -134128 -121112 -35452 -102459
13690a02459N7858M3517Q9867n8377j37460p4923R0394O2507K366M945m3431k7322
$$ -102459 -44601 -1084 88783 30406 -107054 -181977 -91583 -29076 -26710 -21765 -65196 -92518
13678i2518l2542o3306M5504L3675N7441o5906k4784O2751L7485J8603M0176J44419
$$ -92518 -125060 -188366 -142862 -109187 -51746 -117652 -142436 -79685 -42200 -23597 16579 160998
13666A60998J6533q3333O6171m5098j1571J0156o7855m3286p4816Q992N642L9467
$$ 160998 177531 94198 160369 115271 103700 113856 46001 2715 -72101 -63109 -57467 -18000
13654a8000K1455p5617l7455o736N2030R0243J9223n033j4006N2591q729q5770
$$ -18000 3455 -72162 -109617 -116353 -64323 25920 45143 40110 26104 78695 69966 -15804
13642a5804R885K0525j11904N583L0670M1380o586Q3931r1900o2552k0838m2834
$$ -15804 -5919 14606 -97298 -91715 -61045 -19665 -26251 57680 -34220 -96772 -117610 -160444
13630a60444P8078p909r9667L4939J51304r3548j00991N9988M4292K7427M7519
$$ -160444 -82366 -90275 -189942 -155003 -3699 -97247 -198238 -138250 -93958 -66531 -19012
13619a9012P7231o6597r5320M9325J09531Q232K0765N2646j31990q5933J4924
$$ -19012 58219 -8378 -103698 -54373 55158 63390 84155 136801 4811 -81122 -66198
13608f6198o4530o4352J1747J34197J444L061q778k8648m009j6576j8562L665
$$ -66198 -130728 -195080 -183333 -49136 -47692 -44631 -53409 -82057 -86066 -102642 -121204 -117539
13596a17539m9198Q2792k8891J6462L4059k3084L2201J43066M1236j4216J8453
$$ -117539 -166737 -83945 -112836 -96374 -62315 -85399 -53198 89868 131104 116888 135341
13585A35341q7293r3053j37422J22771J09304j2751N4625L8563q6053j3526M6832
$$ 135341 48048 -45005 -182427 -59656 49648 36897 91522 130085 44032 30506 77338
13574G7338O6379j52154j2486L6464J1776L1049J4666l6697r7882m331L2501N1621
$$ 77338 143717 -8437 -20923 15541 27317 58366 73032 36335 -61547 -65878 -33377 18244
13562A8244l4174o6824j8495j482Q3993J7025r7678j426m69J9033m1678m283P8890
$$ 18244 -15930 -82754 -101249 -102731 -18738 -1713 -99391 -100817 -101286 -82253 -123931 -128214 -49324
13549d9324J07387R9386Q447j15812o1861J46924N2062o2537l6354k8047m4009
$$ -49324 58063 157449 165896 50084 -11777 135147 187209 124672 88318 60271 16262
13538A6262j5759K7578L6153O0699O7502n6246p7348q873q1293N0854n63m7358
$$ 16262 503 28081 64234 124933 192435 136189 58841 49968 -31325 19529 18966 -28392
13526b8392P0540M300m1733q5000r0975l910j0466k9637J4831N2712J71489Q3845
$$ -28392 42148 46448 4715 -80285 -171260 -175170 -185636 -215273 -200442 -147730 23759 107604
13514A07604P1978n2351j10766P6434k8922o7842l0271k7869N8871M3377J6380
$$ 107604 179582 127231 16465 92899 63977 -3865 -34136 -62005 -3134 40243 56623
13503E6623o498K9124o5979j7347J15141k648n2997l9679M440q8120k2514J21475
$$ 56623 50125 79249 13270 -4077 111064 108416 55419 15740 20180 -67940 -90454 31021
13491C1021L7943j04679l863j2756p7406l05J23324j4318M6208Q1140k1316M3167
$$ 31021 68964 -35715 -39578 -52334 -129740 -130045 -6721 -21039 25169 106309 84993 128160
13479A28160n5921j07388M5839J06390J3033l9577m1739m7194m0607j5461j00123
$$ 128160 72239 -35149 10690 117080 130113 90536 48797 1603 -39004 -54465 -154588
13468a54588M1703N2785j4652Q2756Q4558J17383K5400j30513m3806o9708q6621
$$ -154588 -112885 -60100 -74752 8004 92562 209945 235345 104832 61026 -8682 -95303
13457i5303J58801M0288j16930n1914R0371K5927J7282J3233p206r1069M2898
$$ -95303 63498 103786 -13144 -65058 25313 51240 68522 81755 74549 -16520 26378
13446B6378O7552M9728k3010k6905R4531O7896o6243o7871r2730l5494k332j2424
$$ 26378 93930 143658 120648 93743 188274 256170 189927 122056 29326 -6168 -8500 -20924
13434b0924Q8060P6908n2647k2685K4331N2155n5203j43962o5177K7560J4819
$$ -20924 67136 144044 91397 68712 93043 145198 89995 -53967 -119144 -91584 -76765
13423g6765J11958N4442M8837o0347m0277K0124p4133p7003N7062R2393K0528
$$ -76765 35193 89635 138472 78125 37848 57972 -16161 -93164 -36102 56291 76819
13412G6819N2774L5489N2465K4246l1506q2662l12k0020J15277J01491j1056m7115
$$ 76819 129593 165082 217547 241793 210287 127625 127313 107293 222570 324061 313005 265890
13400B65890n5088j01738l8567K4928N387j52137l6509P2347J26428L7317j30579
$$ 265890 210802 109064 70497 95425 100812 -51325 -87834 -15487 110941 148258 17679
13389A7679q1145p719J10450O0777O608Q151Q5381o6852Q50j02661p7628K7536
$$ 17679 -63466 -71185 39265 100042 106650 114801 200182 133330 134180 31519 -46109 -18573
13377a8573j5932O7483Q7733M9308p8593j6725o3504m2067l5789n918N5635n9511
$$ -18573 -34505 32978 120711 170019 91426 74701 11197 -30870 -66659 -72577 -16942 -76453
13365g6453L6719R8157k1133r021L879N3503m6580O4399L0597r6597J02288P5941
$$ -76453 -39734 58423 37290 28269 32148 85651 39071 103470 134067 37470 139758 215699
13353B15699L3977p8220j13999N921r618J628N6595O773j25617l0157K9859n6503
$$ 215699 249676 171456 57457 63378 53760 55388 111983 118756 -6861 -37018 -7159 -63662
13341f3662l8624K5234m5476o6115l6756O8421J31795Q6748l6891p7194j21443
$$ -63662 -102286 -77052 -122528 -188643 -225399 -156978 -25183 61565 24674 -52520 -173963
13330a73963m2999K6862m2888J13340J723l2655J8089Q776J26234k4193j2711
$$ -173963 -216962 -190100 -232988 -119648 -117925 -150580 -132491 -123715 2519 -21674 -34385
13319c4385o9317P2397R0153l1295j3797k7107j015j3734m7526n7880P4283M3603
$$ -34385 -103702 -31305 58848 27553 13756 -13351 -14366 -28100 -75626 -133506 -59223 -15620
13307a5620j3987n2599o9772P9903M5409p1668q6425R5321J5483p6121J33072
$$ -15620 -29607 -82206 -151978 -72075 -26666 -98334 -184759 -89438 -73955 -150076 -17004
13296a7004O672p0364m6390m175N3943M5198J9927Q097q5973j6891L0722M6251
$$ -17004 -10332 -80696 -127086 -131261 -77318 -32120 -12193 -4096 -90069 -106960 -76238 -29987
13284b9987j0770p1550k971l2959J5144K3913K7905N7253L6178M393o3733l3326
$$ -29987 -40757 -112307 -115278 -148237 -133093 -109180 -81275 -24022 12156 16549 -47184 -80510
13272h0510q9629n1468M3421N2966J47275j127j474P7399M3769M441q0838P8229
$$ -80510 -170139 -221607 -178186 -125220 22055 20928 19454 96853 140622 145063 64225 142454
13260A42454M972j14760m6125r982L9895k884N634m6101k3843J09777M1382J3660
$$ 142454 147426 32666 -13459 -23441 16454 13570 19204 -26897 -50740 59037 100419 114079
13248A14079l6108j9837M8727m4739r4469r1577j40960P9346J46805L7365j05812
$$ 114079 77971 58134 106861 62122 -32347 -123924 -264884 -185538 -38733 -1368 -107180
13237a07180R311J893N9659q5438k5135J8045O8985J15085q542L9906K1240p7775
$$ -107180 -97869 -95976 -36317 -121755 -146890 -128845 -59860 55225 46683 86589 107829 30054
13225C0054m098K2866N596j6166J5220j1729k1074M5825J767J27559M6028o2900
$$ 30054 25956 48822 54418 38252 53472 41743 20669 66494 68261 195820 241848 178948
13213A78948q2125l0744J0702L1850l601R3170M3950j12923j1986q0636j32831
$$ 178948 96823 66079 76781 108631 105030 198200 242150 129227 117241 36605 -96226
13202i6226j62614j4508O0514R1769N4371k2702N8726o86N550n9650Q13m4430
$$ -96226 -258840 -273348 -212834 -121065 -66694 -89396 -30670 -31356 -25806 -85456 -84643 -129073
13190a29073j6519K1901M6091J14076K3819r676J7690P2638J22758q1377o1372
$$ -129073 -145592 -123691 -77600 36476 60295 50619 68309 140947 263705 182328 120956
13179A20956k0872n322m9411j2752n602L6136K8431L9403m1552j18988j57898
$$ 120956 100084 94762 45351 32599 26997 63133 91564 130967 89415 -29573 -187471
13168a87471J2330L3399k4634L4108R0574k755M4741R092l0865L2426J18510o2895
$$ -187471 -175141 -141742 -166376 -132268 -41694 -44449 292 9384 -21481 10945 129455 66560
13156F6560l5276k3385n9658J5275N2465k5409P7363P5282j9455o2721l0099j28059
$$ 66560 31284 7899 -51759 -36484 15981 -9428 67935 143217 123762 61041 30942 -97117
13144i7117k4364K8445Q6429o3094j3984l1648o7332j629J3512r781o273J20565
$$ -97117 -121481 -93036 -6607 -69701 -83685 -115333 -182665 -184294 -170782 -180563 -186836 -66271
13132f6271M4768l7348m8366N1516P3107K7768L6483m1533m2410J0072k7084L2352
$$ -66271 -21503 -58851 -107217 -55701 17406 45174 81657 40124 -2286 7786 -19298 13054
13120A3054K5200l9471j06434k2497j424K2958K2600m467L5031n5696M9051N4879
$$ 13054 38254 -1217 -107651 -130148 -131572 -108614 -86014 -90481 -55450 -111146 -62095 -7216
13108g216P843N5949n1840m6099q4046J6360R744k0163Q6522O7055O5459k6602
$$ -7216 627 56576 4736 -41363 -125409 -109049 -99305 -119468 -32946 34109 99568 72966
13096G2966j0132j08623M1262J6146o3073r0644J36073N6594K1359P1744p464
$$ 72966 62834 -45789 -4527 11619 -51454 -142098 -6025 50569 71928 143672 136208
13085A36208j51035j7729n2606R3392O7068k0024o559j4629l7866J3954K2695
$$ 136208 -14827 -32556 -85162 8230 75298 55274 48715 34086 -3780 10174 32869
13074C2869L142R0909K189j9117j01978m1249P4506p5938K1830P0809p3015K8018
$$ 32869 36011 126920 129109 109992 8014 -33235 41271 -34667 -12837 57972 -15043 12975
13062A2975j6273j0051P0921K1897J6889L7189r031l8285q6203k3188j738j4454
$$ 12975 -3298 -13349 57572 79469 96358 133547 124516 86231 28 -23160 -24898 -39352
13050c9352j8840l0342j5199R902J9404M1134O6965L4146n5593K3438J02577n8116
$$ -39352 -58192 -88534 -103733 -93831 -74427 -33293 33672 67818 12225 35663 138240 80124
13038H0124p0536J18649R6485r6878k7283M1929o9841k6754K1889n7049K5705
$$ 80124 9588 128237 224722 127844 100561 142490 72649 45895 67784 10735 36440
13027C6440L9988q8085P607K5077O6526L177j6719n6610k2603K6301J0161Q7949
$$ 36440 76428 -11657 -4050 21027 87553 90730 74011 17401 -5202 21099 31260 119209
13015A19209p9046o2642P4411R864J8141j0047M2842K0246l1990P1229j3754l8839
$$ 119209 40163 -22479 51932 61796 79937 69890 112732 132978 100988 172217 158463 119624
13003A19624o2658j23518k535O2246L5739P7617l8997j9889m101M4283J518q8057
$$ 119624 56966 -66552 -69087 -6841 28898 106515 67518 47629 43528 87811 89329 1272
12991A272r2585J04922L5490o6251K3233N1132l7088l8237k3015l4951L4045P8140
$$ 1272 -91313 13609 49099 -17152 6081 57213 20125 -18112 -41127 -76078 -42033 36107
12979C6107L3669r6567n3579k0477N8160J58423P644o5049L1769n5710n3348J7591
$$ 36107 69776 -26791 -80370 -100847 -42687 115736 123380 58331 90100 34390 -18958 -1367
12967a367R61J8159J15134m9461j27333o5998J46141M8437k6311J9231k5829p8276
$$ -1367 -406 17753 132887 83426 -43907 -109905 36236 84673 58362 77593 51764 -26512
12955b6512n0040q107p8038L0474J08401J23558j330q3324k8133J3368j44833
$$ -26512 -76552 -84659 -162697 -132223 -23822 99736 98406 15082 -13051 317 -144516
12944a44516p6983k4320J19649J09724q1920N3578J8979K9163k190j01690p555
$$ -144516 -221499 -245819 -126170 -16446 -98366 -44788 -25809 3354 1164 -100526 -108081
12933a08081N2304L9163J06357Q1516N4733n5722j34425k1662R0016o8455m0652
$$ -108081 -55777 -16614 89743 171259 225992 170270 35845 14183 104199 35744 -4908
12922d908O7054Q8446o7122n1779p2442Q2402P6513j5576o9714j2687O612o4997
$$ -4908 62146 150592 83470 31691 -40751 41651 118164 102588 32874 20187 26799 -38198
12910c8198j5056K9052R6621J1498K0389j04454o3258l2257n200j9795L5412J35470
$$ -38198 -53254 -24202 72419 83917 104306 -148 -63406 -95663 -100863 -120658 -85246 50224
12898E0224R1013N377k1102r3952m6355q0437L1861J19053J0449M6336n9746j9438
$$ 50224 141237 146614 125512 31560 -14795 -95232 -63371 55682 66131 112467 52721 33283
12886C3283J39084Q7027R6039L3974j28024l4542k612k0155K1271l8910J3701
$$ 33283 172367 259394 355433 389407 261383 226841 224229 204074 225345 186435 200136
12875B00136l8368k4608n0611j43495J16974R2823n7257K2135M7796j1165n0174
$$ 200136 161768 137160 86549 -56946 60028 152851 95594 117729 165525 154360 104186
12864A04186n1366J1591M0721m0157j4190N4907P9052j8469l1609K8187L9645
$$ 104186 52820 64411 105132 64975 50785 105692 184744 166275 134666 162853 202498
12853B02498l305l0737K7849j02194M350k4931n3837m7859O1502J07374p3770
$$ 202498 199193 168456 196305 94111 98461 73530 19693 -28166 33336 140710 66940
12842F6940k7043M7755Q5539L4820n6675q4253M0425m292N785O6631l195j01196
$$ 66940 39897 87652 173191 208011 151336 67083 107508 103216 109001 175632 172437 71241
12830G1241k6387R5329N2205n2763P371Q7770j11810j47045l3981O6102l9581
$$ 71241 44854 140183 192388 139625 146996 234766 122956 -24089 -58070 8032 -31549
12819c1549N2795m4828J07595p1974n4204P1519J2281M6738K6142r7634q6795
$$ -31549 21246 -23582 84013 12039 -42165 29354 41635 88373 114515 16881 -69914
12808f9914p581M8000M1791Q5883l4428O071M2166M9007R1582J1714L4091m5899
$$ -69914 -77495 -29495 12296 98179 63751 69822 111988 160995 252577 264291 298382 252483
12796B52483r5706p2290q9084k3555Q5153J6623M3980j05303q4553J85495M97
$$ 252483 156777 84487 -4597 -28152 57001 73624 117604 12301 -72252 113243 113740
12785A13740m6575o6354J8179j3163r4736P1579O7692O7835j0030L5850J84M8185
$$ 113740 67165 811 18990 5827 -88909 -17330 50362 118197 108167 144017 144201 192386
12773A92386j7425n4720k0858o701k0677M5636j0551L928j640m5059M4599R0606
$$ 192386 174961 120241 99383 92682 72005 117641 107090 111018 109378 64319 108918 199524
12761A99524J2578L4921m0970n6720k7422n1003o4303r9388o9313O4721R6775
$$ 199524 212102 247023 206053 149333 121911 70908 6605 -92783 -162096 -97375 -600
12750f00R2267J1165n954n6932k816m4257o9029R4215Q3416K8737q3681r0969
$$ -600 91667 102832 96878 39946 37130 -7127 -76156 18059 101475 130212 46531 -44438
12738d4438J317m948P377J31475J37622m742m0520r9647n8960p0261r5750l3646
$$ -44438 -43121 -48069 -40692 90783 228405 223663 183143 83496 24536 -45725 -141475 -175121
12726a75121l999O3641J58970P403m2971k4521O9717K1998o763N082r870R533
$$ -175121 -179120 -115479 43491 50894 7923 -16598 53119 75117 68354 73436 63566 73099
12714G3099J13079J37368J4733j53395j4384L6249j09759k3039Q3192k102j04303
$$ 73099 186178 323546 338279 184884 170500 206749 96990 73951 157143 155041 50738
12703E0738l5534j2435m2110R5090J27289L3691l3313M1883n8987j24118J3936
$$ 50738 15204 2769 -39341 55749 183038 216729 183416 225299 166312 42194 56130
12692E6130L2136R168K6892J422p542J03731j6701j20856j8251N3571l3012P525
$$ 56130 88266 97434 124326 125748 118206 221937 205236 84380 66129 119700 86688 94213
12680I4213o5351L5467M5886O4265m5496m5475M3263M129M5034o9681n4016J7346
$$ 94213 28862 64329 110215 174480 128984 83509 126772 130901 175935 106254 52238 69584
12668F9584J06631N8917M2773L4726l7519j80850k0545m2088j446k191Q638J8998
$$ 69584 176215 235132 277905 312631 275112 94262 73717 31629 30183 27992 36630 55628
12656E5628m2580k0194o7853J5602n5317P8123R7239l96K8428M6149n5547p6903
$$ 55628 13048 -7146 -74999 -59397 -114714 -36591 60648 60252 88680 134829 79282 2379
12644B379M3929J5825k1573j2240N420P6363N7734l7175L0130k7248q0251o0890
$$ 2379 46308 62133 40560 28320 33740 110103 167837 130662 160792 133544 53293 -7597
12632g597R327r3228J20325J95768m9920n3008Q2392m9570n7652K5325j0697O4891
$$ -7597 1730 -91498 28827 224595 174675 121667 204059 154489 96837 122162 111465 176356
12620A76356K2705k7221J6809n6248j01527J1983k3272M1246l328n8998R971J24443
$$ 176356 199061 171840 188649 132401 30874 42857 19585 60831 57503 -1495 8476 132919
12608A32919J48923o1429m2035Q5976q5489l1841j125R41j1974M3603P4q2959
$$ 132919 281842 220413 178378 264354 178865 147024 145899 146840 134866 178469 178543 95584
12596I5584l22N4123L6501L0462l9225Q82L6359n8281j62554K5748Q7698J22367
$$ 95584 95262 149385 185886 216348 177123 178005 214364 156083 -6471 19277 106975 229342
12584B29342l2716q0299N314Q887J2061j24217k0946K4686l7821o290J8257J14289
$$ 229342 196626 116327 121641 130528 142589 18372 -2574 22112 -15709 -21999 -3742 110547
12572A10547R5689L341q2567n4025Q6756P8901O2594J462m5519k7959K1834p7151
$$ 110547 206236 209577 127010 72985 159741 238642 301236 302698 257179 229220 251054 173903
12560A73903n2298N3316j4038k3389J6693j1202K3094L3358J2412l1430l8399
$$ 173903 121605 174921 160883 137494 154187 142985 166079 199437 211849 180419 142020
12549A42020N6613J7384m3690n479L0072J02854o377p8792p6920k0718j1186J04257
$$ 142020 198633 216017 172327 166848 196920 299774 293397 214605 137685 116967 105781 210038
12537B10038O6908q1794r3089L280q2706q5295l4941p505R9015J11415O5127k164
$$ 210038 276946 195152 102063 105343 22637 -62658 -97599 -105104 -6089 105326 170453 168289
12525A68289j53674k9483Q9634J18068o322q0979p6686N5084P7871M5750J3137
$$ 168289 14615 -14868 74766 192834 186512 105533 28847 83931 161802 207552 220689
12514B20689P0671n5120m7973j10426L4227P4465q4604m9926L3334L8120n3311
$$ 220689 291360 236240 188267 77841 112068 186533 101929 52003 85337 123457 70146
12503G0146k8690L0222Q5158P3161l440j41520Q949r768K1484m49r415l5468L9381
$$ 70146 41456 71678 156836 229997 226557 85037 93986 84218 105702 105253 95838 60370 99751
12490I9751M656O356j6874l7209R384J40651J2396p2810k0883R9092O5584p7795
$$ 99751 104407 110763 93889 56680 66064 206715 219111 146301 125418 224510 290094 212299
12478B12299k9313l9483q3712j5407J08034p4617j5403k8335P1684K1225l8857
$$ 212299 182986 143503 59791 44384 152418 77801 62398 34063 105747 126972 88115
12467H8115o975O8077j6807J2684j01543RJ17646J5366o2066p8326O3386n2207
$$ 88115 81140 149217 132410 145094 43551 43560 161206 176572 114506 36180 99566 47359
12455D7359p6554Q982O669M5019J87675J33228M1399L404k6396j54919l870J04724
$$ 47359 -29195 -20213 -13544 31475 219150 352378 393777 397181 370785 215866 211996 316720
12443C16720j6073q0660m988L4309k6102r032N221k7189r248K5242k801j6565
$$ 316720 300647 219987 214999 249308 223206 214174 219395 192206 182958 208200 205399 188834
12431A88834O17K6109L3854J00030L3388j07428q9231j7757m1477j09498R7275
$$ 188834 189451 215560 249414 349444 382832 275404 186173 168416 126939 17441 114716
12420A14716J17643L2883o6993k6112o3700M2617P569q740O307j17867r152J14733
$$ 114716 232359 265242 198249 172137 108437 151054 158623 149883 156190 38323 29171 143904
12408A43904Q1766M5977K1952N109l8211k7819P571j1648r8926L1143J00478o3350
$$ 143904 225670 271647 293599 298708 260497 232678 240249 228601 129675 160818 261296 197946
12396A97946n7457M388j4370p48l2217J907J8920Q8818j1823k0610O662M7516
$$ 197946 140489 144877 130507 129759 97542 99449 118369 207187 195364 174754 181416 228932
12384B28932N5654K9670o0286j45601q6258Q5093O8039N1475R845M4305n9110
$$ 228932 284586 314256 253970 108369 22111 107204 175243 226718 236563 280868 221758
12373B21758o3843K1750n4438L6247K1020p5243o2112K2479m8687M3810P3504
$$ 221758 157915 179665 125227 161474 182494 107251 45139 67618 18931 62741 136245
12362A36245Q9566K7554J6381l6113N2977L0737j2601j23335P078l2387p3373
$$ 136245 225811 253365 269746 233633 286610 317347 304746 181411 188489 156102 82729
12351H2729J3919J0047L5524K6246J2842l0702O522M7136k4933R0572j548j10850
$$ 82729 96648 106695 142219 168465 181307 150605 157127 204263 179330 269902 268354 157504
12339A57504K8103L4017l4134M3168M0434M5501P3392R6602K1097m6740j42834
$$ 157504 185607 219624 185490 228658 269092 314593 387985 484587 505684 458944 316110
12328C16110m0468j6452r1779M380j7215L1692N4312l878J1991n9819M9716M0737
$$ 316110 275642 259190 167411 171791 154576 186268 240580 236702 248693 188874 238590 279327
12316B79327L4112m8594l2957Q1306Q859j02597k2063Q4981Q8452n0918n3717
$$ 279327 313439 264845 231888 313194 322053 219456 197393 282374 370826 319908 266191
12305B66191L1798o363j5300j0199j9382K7455J02403j38127r4118K0322q6102
$$ 266191 297989 291626 276326 266127 246745 274200 376603 238476 144358 164680 78578
12294G8578L7412J23364J04480j1735j07734M5375L7390J0763j4048k8777o5512
$$ 78578 115990 239354 343834 332099 224365 269740 307130 317893 303845 275068 209556
12283B09556o0894J1927M2949J36987O2075M0802j29168M9571l6390l7595P3808
$$ 209556 148662 160589 203538 340525 402600 443402 314234 363805 327415 289820 363628
12272C63628P5717M0459j05221J2310J9177m8090J02441J664o1962n7456o751
$$ 363628 439345 479804 374583 386893 406070 357980 460421 462085 400123 342667 335916
12261C35916O3396O4049l6127m2269J3302M0846J58917L5950r2002M7988Q6453
$$ 335916 399312 463361 427234 384965 398267 439113 598030 633980 541978 589966 676419
12250F76419j17226j5535O3766l1356k9602p1108j045o7499m0254P1123q39j5152
$$ 676419 559193 543658 607424 576068 546466 475358 474313 406814 366560 437683 436844 421692
12238D21692m0646j4719q8594l847j2568P1135Q8931o5960n4318m6878M390M4748
$$ 421692 381046 366327 277733 273886 261318 332453 421384 355424 301106 254228 258618 303366
12226C03366J20109Q3496l8370O818P5788J769j0939M3035k5086l158J9367Q7924
$$ 303366 423475 506971 468601 475419 551207 552976 542037 585072 559986 556828 576195 664119
12214F64119p7980j0567M8753j2466p8580o7898R7496P2788k0378M565P2784m0527
$$ 664119 586139 575572 624325 611859 533279 465381 562877 635665 615287 619852 692636 652109
12202F52109j1099m5708J5621J0352o6495L3097N9380j1843J2681J16449k9133
$$ 652109 641010 595302 610923 621275 554780 587877 647257 635414 648095 764544 735411
12191G35411o6577j8879L0734q981L4393N7161J23259J23981q7450p5256j00272
$$ 735411 668834 649955 680689 671708 706101 763262 886521 1010502 923052 847796 747524
12180G47524k7645j7992l2842o6918K610R1248N6666m9713l577j2396j12584j2006
$$ 747524 719879 701887 669045 602127 604737 695985 752651 702938 699361 686965 574381 562375
12168E62375J11399Q3844l5290l7836K6004M713l4418N5491M5061q411L1466m593
$$ 562375 673774 757618 722328 684492 710496 715209 680791 736282 781343 772932 804398 799805
12156G99805m960N1089J5733r1232J7219Q7990M661M0379n7030r1975l1504O7607
$$ 799805 794845 845934 861667 770435 787654 875644 880305 920684 863654 771679 740175 807782
12144H07782m0787J4033J58675k2626o2857n1155L7291O7241Q0343J7080n5247
$$ 807782 766995 781028 939703 917077 854220 803065 840356 907597 987940 1005020 949773
12133I49773l7578k19K4303p914J386K3258L4235P9366j8585m2386r9650N0574
$$ 949773 912195 911976 936279 928365 929751 953009 987244 1066610 1048025 1005639 905989 956563
12121I56563P6007K2390j478J36914M2680l9041k2070j9764k9237J19182M7571
$$ 956563 1032570 1054960 1053482 1190396 1233076 1194035 1171965 1152201 1122964 1242146 1289717
12110A289717l8881m6399P227N3560K0609n2130j0554r739K6065P6932Q886P4598
$$ 1289717 1250836 1204437 1211664 1265224 1285833 1233703 1223149 1213410 1239475 1316407 1325293 1399891
12098A399891Q6576O8213Q892l6712m6818Q339K5427M1733Q2073q8628r7488K9590
$$ 1399891 1486467 1554680 1563572 1526860 1480042 1488381 1513808 1555541 1637614 1548986 1451498 1481088
12086A481088R78n9635R2876O4873M2057P1675j6391L7416M5142j0432K1765N7570
$$ 1481088 1482066 1422431 1515307 1580180 1622237 1693912 1677521 1714937 1760079 1749647 1771412 1828982
12074A828982m2305J2504L0059J8052K400R8672L8431K0377J5210O5602O8562
$$ 1828982 1786677 1799181 1829240 1847292 1849692 1948364 1986795 2007172 2022382 2087984 2156546
12063B156546j3810M573K4873J3528l2631N8467Q7826M3114Q1058N2126K1685
$$ 2156546 2142736 2147309 2172182 2185710 2153079 2211546 2299372 2342486 2423544 2475670 2497355
12052B497355L7578R5697j0914o6837j5716N7296J9677q6849O6256J03996M1410
$$ 2497355 2534933 2630630 2619716 2552879 2537163 2594459 2614136 2527287 2593543 2697539 2738949
$$ [...]
##END NTUPLES=NMR SPECTRUM
##END=
