##TITLE=Analysis number 322179
Compound Code ss 00053
Project Code adrs
Chemist Name endeavour
##JCAMPDX= 6.0         $$ Bruker NMR JCAMP-DX V2.0
##DATA TYPE= NMR SPECTRUM
##DATA CLASS= NTUPLES
##ORIGIN= Bruker BioSpin GmbH
##OWNER= nmr
$$ XWIN-NMR		Version 3.5
$$ Fri Sep 15 12:01:43 2006 GMT Daylight Time (UT+1h)  MAYBRIDGE\nmr@NMR_250MHZ
##.OBSERVE FREQUENCY= 250.131544655141
##.OBSERVE NUCLEUS= ^1H
##.ACQUISITION MODE= SIMULTANEOUS (DQD)
##.ACQUISITION SCHEME= undefined
##.AVERAGES= 16
##.DIGITISER RES= 18
##SPECTROMETER/DATA SYSTEM= dpx250
##.PULSE SEQUENCE= zg30
##.SOLVENT NAME= CDCl3
##.SHIFT REFERENCE= (INTERNAL, CDCl3, 0, 16.522)
##AUDIT TRAIL= $$ (NUMBER, WHEN, WHO, WHERE, WHAT)
$$ ##TITLE= Audit trail, XWIN-NMR		Version 3.5
$$ ##JCAMPDX= 5.01
$$ ##ORIGIN= Bruker BioSpin GmbH
$$ ##OWNER= nmr
$$ C:\u/data/dgb/nmr/ADRS/810/pdata/1/auditp.txt
$$ ##AUDIT TRAIL=  $$ (NUMBER, WHEN, WHO, WHERE, WHAT)
(   1,<2006-09-15 12:01:14.46 +100>,<MAYBRIDGE\nmr>,<NMR_250MHZ>,
      <created by zg, POWCHK disabled, PULCHK disabled
       configuration hash MD5:
       E2 DF 36 D8 04 B2 41 60 5A D7 A3 38 5A 4B D0 FE
       data hash MD5: 64K
       E5 15 BF 06 38 B6 09 3D 62 1B 6A D0 15 3E C0 9C>)
(   2,<2006-09-15 12:01:30.78 +100>,<MAYBRIDGE\nmr>,<NMR_250MHZ>,
      <Start of raw data processing
       ef LB = 0.3 FT_mod = 6 PKNL = 1 SI = 32K 
       data hash MD5: 32K
       00 B9 3E 85 F9 F6 CF 7E 52 FC 22 43 E6 4D 1F 44>)
(   3,<2006-09-15 12:01:32.64 +100>,<MAYBRIDGE\nmr>,<NMR_250MHZ>,
      <apk 
       data hash MD5: 32K
       81 21 C1 FC 91 39 43 1C 20 B5 49 74 17 CB F3 2B>)
(   4,<2006-09-15 12:01:33.39 +100>,<MAYBRIDGE\nmr>,<NMR_250MHZ>,
      <abs ABSG = 5 
       data hash MD5: 32K
       B0 DC FA 9B 8E 3D 8A 72 76 CE BB F3 E0 CE 33 C8>)
$$ ##END=
$$ 
$$ hash MD5
$$ 86 2F 9E 39 3E F5 89 F0 2A 5C BF CA 23 54 1A 97
##$RELAX= 
##$RELAX= 
##$RELAX= 
##$RELAX= 
##$RELAX= 
##$RELAX= 
##$RELAX= 
$$ Bruker specific parameters
$$ --------------------------
##$DU= <C:\u>
##$EXPNO= 810
##$NAME= <ADRS>
##$PROCNO= 1
##$TYPE= <nmr>
##$USER= <dgb>
##$AMP= (0..31)
100 100 100 100 100 100 100 100 100 100 100 100 100 100 100 100 100 100 
100 100 100 100 100 100 100 100 100 100 100 100 100 100 
##$AQSEQ= 0
##$AQ_mod= 3
##$AUNM= <au_zg>
##$AUTOPOS= <49 >
##$BF1= 250.13
##$BF2= 250.13
##$BF3= 250.13
##$BF4= 250.13
##$BF5= 500.13
##$BF6= 500.13
##$BF7= 500.13
##$BF8= 500.13
##$BYTORDA= 1
##$CFDGTYP= 0
##$CFRGTYP= 5
##$CHEMSTR= <none>
##$CNST= (0..31)
1 1 145 1 1 1 1 1 1 1 1 1 1 1 1 1 1 1 1 1 1 1 1 1 1 1 1 1 1 1 1 1 
##$CPDPRG= <>
##$CPDPRG1= <>
##$CPDPRG2= <>
##$CPDPRG3= <>
##$CPDPRG4= <mlev>
##$CPDPRG5= <mlev>
##$CPDPRG6= <mlev>
##$CPDPRG7= <mlev>
##$CPDPRG8= <mlev>
##$CPDPRGB= <>
##$CPDPRGT= <>
##$D= (0..31)
0 1 0 0 0 0 0 0 0 0.06 0 0 0 0 0 0 0.0002 0 0 0 0 0 0 0 0 0 0 0 0 0 0 
0 
##$DATE= 1158318073
##$DBL= (0..7)
120 120 120 120 120 120 120 120 
##$DBP= (0..7)
150 150 150 150 150 150 150 150 
##$DBP07= 0
##$DBPNAM0= <>
##$DBPNAM1= <>
##$DBPNAM2= <>
$$ [...]
##$SUBNAM7= <"">
##$SUBNAM8= <"">
##$SUBNAM9= <"">
##$SW= 20.6930455092707
##$SWIBOX= (0..15)
0 0 3 0 0 0 0 0 0 0 0 0 0 0 0 0 
##$SW_h= 5175.983436853
##$TD= 65536
##$TD0= 1
##$TE= 295.16
##$TE2= 300
##$TE3= 300
##$TEG= 300
##$TL= (0..7)
0 120 120 120 120 120 120 120 
##$TP= (0..7)
150 150 150 150 150 150 150 150 
##$TP07= 0
##$TPNAME0= <>
##$TPNAME1= <>
##$TPNAME2= <>
##$TPNAME3= <>
##$TPNAME4= <>
##$TPNAME5= <>
##$TPNAME6= <>
##$TPNAME7= <>
##$TPOAL= (0..7)
0.5 0.5 0.5 0.5 0.5 0.5 0.5 0.5 
##$TPOFFS= (0..7)
0 0 0 0 0 0 0 0 
##$TUNHIN= 0
##$TUNHOUT= 0
##$TUNXOUT= 0
##$USERA1= <user>
##$USERA2= <user>
##$USERA3= <user>
##$USERA4= <user>
##$USERA5= <user>
##$V9= 5
##$VALIST= <valist>
##$VCLIST= <CCCCCCCCCCCCCCC>
##$VD= 0
##$VDLIST= <DDDDDDDDDDDDDDD>
##$VPLIST= <PPPPPPPPPPPPPPP>
##$VTLIST= <TTTTTTTTTTTTTTT>
##$WBST= 1024
##$WBSW= 4
##$XGAIN= (0..3)
0 0 0 0 
##$XL= 0
##$YL= 0
##$YMAX_a= 298466
##$YMIN_a= -446772
##$ZGOPTNS= <>
##$ZL1= 120
##$ZL2= 120
##$ZL3= 120
##$ZL4= 120
##$ABSF1= 16.522
##$ABSF2= -4.171173
##$ABSG= 5
##$ABSL= 3
##$ALPHA= 0
##$AQORDER= 0
##$ASSFAC= 0
##$ASSFACI= 0
##$ASSFACX= 0
##$ASSWID= 0
##$AUNMP= <proc_1d>
##$AZFE= 0.1
##$AZFW= 0.1
##$BCFW= 0
##$BC_mod= 0
##$BYTORDP= 0
##$COROFFS= 0
##$CY= 12.5
##$DATMOD= 1
##$DC= 0
##$DFILT= <>
##$DTYPP= 0
##$F1P= 14.0000005364418
##$F2P= -0.99999901652339
##$FCOR= 0.5
##$FTSIZE= 32768
##$FT_mod= 6
##$GAMMA= 0
##$GB= 0
##$INTBC= 1
##$INTSCL= 1
##$ISEN= 128
##$LB= 0.3
##$LEV0= 0
##$LPBIN= 0
##$MAXI= 10000
##$MC2= 0
##$MEAN= 0
##$ME_mod= 0
##$MI= 0
##$NCOEF= 0
##$NC_proc= -4
##$NLEV= 6
##$NOISF1= 0
##$NOISF2= 0
##$NSP= 0
##$NTH_PI= 0
##$NZP= 0
##$OFFSET= 16.522
##$PC= 1
##$PHC0= 152.6651
##$PHC1= 5.524792
##$PH_mod= 1
##$PKNL= yes
##$PPARMOD= 0
##$PSCAL= 4
##$PSIGN= 0
##$REVERSE= no
##$SF= 250.13
##$SI= 32768
##$SIGF1= 0
##$SIGF2= 0
##$SINO= 400
##$SIOLD= 32768
##$SREGLST= <1H.CDCl3>
##$SSB= 0
##$STSI= 32768
##$STSR= 0
##$SW_p= 5175.98343685301
##$SYMM= 0
##$S_DEV= 0
##$TDeff= 65536
##$TDoff= 0
##$TI= <Analysis number 999999
Compound Code 99
Book Reference 9
Project Code 9>
##$TILT= no
##$TM1= 0
##$TM2= 0
##$TOPLEV= 0
##$USERP1= <user>
##$USERP2= <user>
##$USERP3= <user>
##$USERP4= <user>
##$USERP5= <user>
##$WDW= 1
##$XDIM= 32768
##$YMAX_p= 528419644
##$YMIN_p= -328096
$$ End of Bruker specific parameters
$$ ---------------------------------
##NTUPLES= NMR SPECTRUM
##VAR_NAME=  FREQUENCY,     SPECTRUM/REAL,   SPECTRUM/IMAG
##SYMBOL=    X,             R,               I
##VAR_TYPE=  INDEPENDENT,   DEPENDENT,       DEPENDENT
##VAR_FORM=  AFFN,          ASDF,            ASDF
##VAR_DIM=   32768,         32768,           32768
##UNITS=     HZ,            ARBITRARY UNITS, ARBITRARY UNITS
##FACTOR=    0.157963299565203, 1,           1
##FIRST=     4132.6476996994, 0,             0
##LAST=      -1043.33573715361, 0,           0
##MIN=       -1043.33573715361, -328096,     0
##MAX=       4132.6476996994, 528419644,     0
$$ Real data points
##PAGE= N=1
##DATA TABLE= (X++(R..R)), XYDATA
$$ [...]
16706a4835Q2340P8816l5567o2126j9442l1956k0603l9737K0853L9421L5068m716
16694B7516P1013m0989j04386R703M094J407l001N750K0690l2753l9542k3309
16682a03807N0771J5825N3746j9110K8014K8201L6462M9496K8771n7965k8333
16671H2071l2256o7906m8479L4060L5843n8497J4988j0679K5171K41j2096L0469
16659g070m7802p14J48771J2988p0211L7185N8749K6861k8165r9270j10609P1246
16647h041O9888j5044J500J2971j1784o8911j2201r947L5783K1866M5178L8515
16635I9773p4311q4746k6863o1844m1199P7213K3216j4694M9786M1236O6704j490
16623E2781j6891K8722j6838n2783r7287L7015k773L4883O4873k4387o7367j00528
$$ y = [-14835, 67505, 146321, 110754, 48628, 29186, -2770, -23373, -63110, -42257, -2836, 32232, 27516, 98529, 57540, -46846, -37143, -33049, -31642, -34643, -28893, -8203, -40956, -80498, -103807, -53036, -37211, 16535, -2575, 25439, 53640, 90102, 139598, 168369, 110404, 82071, 49815, -18091, -66570, -32510, 3333, -55164, -40176, -50855, -25684, -25443, -37539, -7070, -54872, -55586, 93185, 106173, 35962, 73147, 131896, 158757, 130592, 31322, -79287, -8041, 61847, 46803, 48303, 61274, 49490, -19421, -31622, -41569, -5786, 16080, 61258, 99773, 25462, -59284, -86147, -147991, -189190, -111977, -88761, -103455, -53669, -12433, 54271, 52781, 35890, 64612, 47774, -5009, -102296, -65281, -68054, -33171, 31702, 7315, -60052, -160580]
16611a60580K0592J4765k7070J2776j6016O5955M4279J23756j1392k4622p3144
16600c0701q38K043M5937L3741k1790l1758J7236n4788p6518Q1828Q915N390J8804
16587b499J2108L6929j0142J7898o993j3865m1916n2269Q8241l9949l4977O4620
16575A7186m3595M607L2203O0941r0344r3056r377O1767P7082n3257J5097k3273
16563d4019k3096m06P850J3583l8649N4902N0630n3705j8411J8633L7202M9988
16551E4502O2967K642k2329p6328n0756j1200m3735P7056K2159o9663M8241J5883
16539I439k4291n3937L3638r0976k0528M9880j0197j5392m065J6243M2478N4067
16527a3641J10486Q681j16066j01743o463N2926L2840K7137P2051J00853J9626
$$ y = [-160580, -139988, -125223, -152293, -139517, -155533, -89578, -45299, 78457, 67065, 42443, -30701, -31539, -29496, 16441, 50182, 28392, -3366, 13870, -40918, -117436, -35608, -26693, -21303, -2499, 9609, 46538, 36396, 54294, 47301, 33436, -8480, -60749, 27492, -12457, -47434, 17186, -26409, -21802, 10401, 71342, -19002, -112058, -121435, -59668, 17414, -35843, -20746, -44019, -67115, -67521, -59671, -46088, -84737, -29835, 20795, -32910, -51321, -32688, 4514, 54502, 117469, 120111, 97782, 21454, -29302, -40502, -84237, -7181, 14978, -54685, -6444, 9439, -14852, -68789, -35151, -126127, -146655, -96775, -106972, -122364, -126429, -110186, -67708, -13641, 96845, 105526, -10540, -112283, -118746, -65820, -32980, -5843, 66208, 167061, 186687]
16516A86687j24595j03458K8325K7297j2337o6340M0188O3304k5518L8108N3514
16505A05175q4714m199n812n8167p4275K982P0777J1008L539P6074k6117r883
16493F388j9172L3247J36957K847j0748l4103M9369M1774k2129q1189l5827L0063
16481I7477R4750l6527l9443j9977k9022n9327j14096R4132R6044M9041Q3637
16470B16689q037j47139p3139p8148M4575l910p666p940r904l6139J8071N2638
16458d0049J8882k7406p5523J3317Q7403Q287j623K3356m8346l7048Q7605L244
16446A2099k1220j7644p4240l4741Q803P4748N0787k9887o3054o2857J5057k7540
16434a69689J6619K0062P2290M181n5263Q420M3497L5637n5101l3864n6225P763
$$ y = [186687, 62092, -41366, -13041, 14256, 1919, -64421, -24233, 39071, 13553, 51661, 105175, 20461, 16262, 10450, -47717, -121992, -119010, -48233, -37225, -33686, 42388, 16271, 6388, -12784, 20463, 157420, 160267, 149519, 115416, 164785, 206559, 184430, 103241, 67414, 97477, 192227, 155700, 116257, 96280, 67258, 7931, -106165, -12033, 84011, 133052, 216689, 208652, 61513, -11626, -89774, -45199, -49109, -56775, -64715, -74619, -110758, -92687, -40049, -21167, -48573, -124096, -110779, -23376, -15089, -16712, 6644, -41702, -78750, 8855, 12099, -9121, -26765, -101005, -135746, -126943, -52195, -1408, -31295, -94349, -157206, -142149, -169689, -153070, -133008, -60718, -56537, -111800, -103380, -59883, -24246, -79347, -113211, -169436, -161673]
16422a61673m2288M8751l6798l7256O5143k9282N4469O8113m954J3489r2N8632
16410c746J47780k6758p1672l5825Q920l0982k3537P4135K687L371N240J3958
16398F3571o1047n7896Q5823O3490M4710M1012o3476p850J1993J1786j9174n9449
16386E3493K1860P290k8831Q7214n0063k4248m361q3026n7246j9409p4379R47
16374a70759j1219M4435J14583N4467k4510L6114N0630J4179l3385j3722N8173
16363A18986J0396K4279m3030j1302q867r839m3749l5880J1154l9306m026N3968
16351B2784j506q5274m098N270m237m5192K0989J6219K0566l3337K4673K7164
16339c5979r803J1467q9913J9110O9297J0914N4258k1763q0865L7158K046P3757
$$ y = [-161673, -203961, -155210, -192008, -229264, -164121, -193403, -138934, -70821, -75775, -62286, -62378, -3746, 144034, 117276, 45604, 9779, 18699, -12283, -35820, 38315, 41002, 44373, 49613, 63571, 2524, -55372, 30451, 93941, 138651, 179663, 116187, 108337, 120330, 132116, 112942, 53493, 75353, 82643, 53812, 141026, 90963, 66715, 62354, -20672, -77918, -97327, -171706, -170759, -181978, -137543, -22960, 31507, 6997, 43111, 93741, 107920, 74535, 60813, 118986, 129382, 153661, 110631, 99329, 90462, 80623, 36874, 994, 12148, -27158, -31184, 22784, 21278, -63996, -68094, -62824, -67061, -112253, -91264, -75045, -54479, -87816, -63143, -35979, -45782, -34315, -124228, -105118, -35821, -24907, 29351, 7588, -73277, -36119, -34073, 39684]
16327C9684O6037l0541p1501q4312k4982K2080q909j6696P0499L0087M9430K9417
16315G0293P6595o219L4121l364m8550k938Q574k5845r372J5177j1923l2924n0785
16302A2840n5712M1034Q3953k5449j3686l8263q940Q285k4304k4773m341J2975
16290c6381K3387k5947m4792J8267J4483O6105N2704M5602Q397p7432q3484r978
16278d9069m3590O4081J6785j5625N275M5501k7437p127M4273o4510q4101p523
16266a23067m2916M7230J03958K5192Q8499k7948o1445k8472j9869j2360M8352
16255b846L6645q348K3360M7516j0252l7107l8843k2393k516l4860q2041O3672
16243f8013O5172o7891l6674P9440j10093j0664P5169O2370k5051j5364L0981
$$ y = [39684, 105721, 75180, 3679, -80633, -105615, -83535, -92444, -109140, -38641, -8554, 40876, 70293, 146888, 140669, 174790, 171426, 122876, 119938, 128512, 102667, 93295, 108472, 96549, 63625, 12840, -42872, -1838, 82115, 56666, 42980, 4717, -4223, 4062, -20242, -45015, -49356, -36381, -12994, -38941, -83733, -65466, -50983, 15122, 67826, 113428, 121825, 44393, -39091, -49069, -92659, -28578, -11793, -27418, -22143, 23358, -4079, -11206, 33067, -31443, -115544, -123067, -165983, -118753, -14795, 10397, 98896, 70948, 9503, -18969, -38838, -51198, -2846, 33799, 25451, 48811, 96327, 86075, 48968, 10125, -12268, -14784, -49644, -131685, -68013, -2841, -70732, -107406, -27966, -138059, -148723, -73554, -11184, -36235, -51599, -20618]
16232b0618K6249m5448k7700R097o1289J224k9172m7897J3430Q4269O5615r767
16220d2007R3p790J917k5467n338M9116M3144Q95l2115k6669o2556p3873k4228
16207b04878K5337J48088Q1184m2655J4045J00842Q9853j55932m4409j3706j10081
16196a12312J5465L6960N7518M7574K1625Q20m9432p2520l5784J4430m7779K8477
16184i4958R4382M5501j0059m5227j04344L5402P0771k9186O256p61K2660J5578
16172F015P9302Q6442K0887l5648j01234j26484r363N4953L0098n6724L3516R1507
16160G3267l2060l2588P121j8071l7186o6987J9928N8442K6424M5126o9563j04086
16148a30233M7047J18579O214l4618j1169m3370m62K305n941P7510L399o8141
$$ y = [-20618, 5631, -39817, -67517, -58420, -119709, -118485, -147657, -195554, -182124, -97855, -32240, -42007, -41914, -49704, -47787, -73254, -78592, -29476, 13668, 14563, -17552, -44221, -106777, -180650, -204878, -179541, -31453, 49731, 7076, 21121, 121963, 211816, 55884, 11475, -2231, -112312, -96847, -59887, -2369, 45205, 66830, 67650, 18218, -54302, -90086, -75656, -123435, -94958, -576, 44925, 34866, -10361, -114705, -79303, -8532, -37718, -31462, -32223, -9563, 6015, 85317, 171759, 192646, 156998, 55764, -70720, -80083, -25130, 4968, -51756, -18240, 73267, 41207, 8619, 15740, -2331, -39517, -106504, -86576, -28134, -1710, 43416, -26147, -130233, -83186, 35393, 41607, 6989, -4180, -47550, -48012, -45707, -51648, 25862, 29261, -38880]
16136c8880p9725M1025J07733j166k9608L9605N0942L2516q2939l6313m4873L4976
16124f707O8351K0074l3968j13509k8153Q4466J15014R2789j7875p5592k0976
16113H3914K1243j7708N0210l6852m5633J3837j9083K006L2622j533o2463m5631
16101b5071o6687K2509j8886J7374n4525J5497J00019N4746n8203j0732O8203
16090D4244L5691P5709q4875j07863l2436N2003Q7344o5394N4894N7741k2206
16079I4852Q159n5048n6666R091L0332M6207J0215n2843L6173R9946l6152l7742
16067I6524P7133J2039p6528k1453o2046p8114o7507K0520j02017o0696P9366
16056a82779R5163R0965o8656N9114P8130J668j4383p610l4304l2408J7514l851
$$ y = [-38880, -118605, -77580, 30153, 28987, -621, 38984, 89926, 122442, 39503, 3190, -41683, -6707, 61644, 81718, 47750, -65759, -93912, -9446, 105568, 198357, 180482, 104890, 83914, 105157, 87449, 137659, 100807, 55174, 69011, 49928, 51934, 84556, 83023, 20560, -25071, -91758, -69249, -88135, -70761, -125286, -109789, -9770, 44976, -13227, -23959, 44244, 79935, 155644, 70769, -37094, -69530, -17527, 69817, 4423, 59317, 117058, 94852, 103011, 47963, -8703, 388, 30720, 76927, 87142, 34299, 70472, 170418, 134266, 96524, 173657, 185696, 109168, 87715, 25669, -52445, -119952, -99432, -201449, -262145, -182779, -87616, 3349, -65307, -6193, 71937, 73605, 59222, 51612, 17308, -15100, 2414, -1437]
16044a437p2307j210J5361J2048L8002j5481J7583N025N3017N5555j1861N4164
16032A48459J0950j29231J3877L1261J1305k0479j4560j3320l2483o5065k6435
16021h5721Q7553O7404N8602r3401m3631O7796q619p7998Q013K4596L9713l722
16009D0585K8062j2746j938O838L1994N5752n8455k6713k0586K1704m7200L6823
15997E4120L6677m0678j2186L5652l5318j15985L398m412P0291J01737k4418r486
15985E9392j4056k5372P745J8017l8443n5886k4360J1476l1375q3411M2784o224
15973a39713L9281R6609k0930L1284j2720k9741K2693M4023l6625M5866J2292
15962E2319r8308k0880Q7417O1115o0488p5485L0121O0663n2883N216J7118Q90
$$ y = [-1437, -73744, -74954, -59593, -47545, -9543, -25024, -7441, -2416, 50601, 106156, 94295, 148459, 159409, 30178, 44055, 75316, 86621, 66142, 51582, 38262, 5779, -59286, -85721, 1832, 69236, 127838, 34437, -9194, 58602, 49983, -28015, -20002, 4594, 44307, 40585, 68647, 55901, 53963, 60801, 92795, 148547, 90092, 63379, 42793, 64497, 17297, 54120, 90797, 50119, 37933, 73585, 38267, -77718, -74320, -78732, -8441, 93296, 68878, 59392, 45336, 19964, 27709, 45726, 7283, -48603, -72963, -61487, -92862, -176273, -133489, -139713, -100432, -3823, -24753, 6531, -6189, -35930, -13237, 30786, -5839, 40027, 52319, -45989, -66869, 20548, 81663, 21175, -54310, -24189, 36474, -16409, -11193, 5925, 6815]
15950F815J1465N512l3373n8549p7321J13770K583n0786L5436K6484p3935l9802
15938a31701P2725M6907l5072l193k0725N0049N9486o7565N416l324j7140J8424
15926b5713j44809l5149M7891O521O3621N7736J0735M3255L156J873K9980k2980
15914C6117n3825K924q088m2821N0274j3704J58m3883m830Q86l4865m1170P6443
15901g6384R2619n8141j11466k0125R9137P1406Q1093N0511j9410p3155J2038
15890D8123p7504K5423p35K2040l8670l4089K6093K4746k0796p8873K0569J03328
15878A9655J28347K7489j02656j08297p7690L0400L6018O8802J1607p4391J1434
15867b9282J0360o4034j4387K7443O1888J0176l2063K5102N8697k5303k6483M6193
$$ y = [6815, 18280, 23792, -9581, -68130, -145451, -31681, -29098, -79884, -44448, -17964, -91899, -131701, -58976, -12069, -47141, -50334, -71059, -21010, 38476, -29089, -23673, -26997, -44137, -25713, -170522, -205671, -157780, -151259, -87638, -29902, -19167, 24088, 27244, 29117, 59097, 36117, -17708, -14784, -22872, -65693, -15419, -29123, -28965, -72848, -77678, -76792, -111657, -152827, -76384, 16235, -41906, -153372, -173497, -74360, -2954, 78139, 128650, 109240, 36085, 48123, -29381, -3958, -4693, 17347, -21323, -55412, -29319, -4573, -25369, -104242, -83673, 19655, 148002, 175491, 72835, -35462, -113152, -82752, -46734, 22068, 33675, -40716, -29282, -18922, -82956, -97343, -69900, -8012, 2164, -29899, -4797, 53900, 28597, 2114, 48307]
15855D8307Q2031m0629k9799J5593j0490k1039j08369k9678O4163O6758K7717
15844F4565q9231n222M361N6035R1760m7178o4659p7431j0611k9068R4782n3464
15832f5361l3165l7419m0325K8313P1960R8168J7656l5598m4419r6286L7751J28321
15820B9596P2219n3759J3793N38l0566o8129J767j3949K8387l5512o6008O5492
15808e6131O1553N0761K9778q85L487m0174k5042j2572R1463K903o0248K8817
15796G3710j3829K5172J6725j4178J1495M4285p3990n8174M273N6003M4226R677
15784A25395k082k7569r3089p0354N3071O141M3323N5087J171j07471j3568L7250
15772G305M9538m0279k1362O0982J7514o7820k4457p9308K4008J7611l1293n0280
$$ y = [48307, 130338, 89709, 59910, 75503, 65013, 43974, -64395, -94073, -29910, 36848, 64565, -24666, -29888, -25527, 30508, 122268, 75090, 10431, -67000, -77611, -106679, -11897, -65361, -98526, -135945, -176270, -147957, -75997, 22171, 39827, 4229, -40190, -136476, -98725, 29596, 101815, 48056, 61849, 62387, 31821, -36308, -34541, -48490, -20103, -55615, -121623, -56131, 5422, 56183, 85961, 85076, 88563, 48389, 23347, 10775, 102238, 105141, 44893, 73710, 59881, 85053, 101778, 87600, 99095, 143380, 69390, 11216, 15489, 71492, 115718, 125395, 123313, 95744, 2655, -67699, -14628, -8487, 34836, 89923, 91094, -16377, -29945, 7305, 56843, 16564, -4798, 56184, 73698, 5878, -18579, -97887, -73879, -56268, -87561, -137841]
15760a37841k8423K8479J32881J4170m4784K7381L0515O137J0127l8262k9043
15749b8663J619o9464j25639m6413P3791K6813j9985R9903K1626Q978L3361K6205
15737B132L4369J4096j22473m5848M6477N9409L6406j3721m997M4588J5554o1677
15725D315j4850L2829n5648o8073k1235P0636N8878P3855N9029k3189p0516k44
15713D5787l6693N7480J8193k52l2326n7835M7516l0544l990k7130M1144J8236
15701C9586K2337o6416r27J7258J1143p3949J2249R3202n3521j15311n5446l0377
15689b00172N4998N8350R8619N5542l4243M2914l9715o4366K4369m2921J0446
15678c6179M2953k4246J1153q3531k2923Q2953M0190J2855n156K1425M9653n1225
$$ y = [-137841, -166264, -137785, -4904, 9266, -35518, -8137, 22378, 28515, 38642, 380, -28663, -27044, -96508, -222147, -268560, -194769, -167956, -187941, -88038, -66412, -57434, -24073, 2132, 36501, 50597, -71876, -117724, -71247, -11838, 24568, 10847, 5850, 50438, 65992, 4315, -10535, 22294, -33354, -101427, -122662, -52026, 6852, 80707, 139736, 116547, 46031, 45787, 9094, 66574, 84767, 84515, 52189, -5646, 41870, 11326, 7336, -19794, 21350, 39586, 61923, -4493, -5420, 11838, 22981, -50968, -38719, 54483, 962, -114349, -169795, -200172, -145174, -86824, 11795, 67337, 33094, 76008, 36293, -28073, -3704, -46625, -36179, 6774, -17472, -6319, -89850, -112773, -29820, 10370, 23225, 18069, 39494, 89147, 37922]
15666C7922j6115j2337o1568l0840l3070J5379L9342M0296K864j6393m3167p129
15654h4816N4036J15374p6162r823L5917o7809L8314L9094k8968o6346O2786J6973
15642B8570j33208j04020q701P4022R4176L5707k1297q7149l9728N1769O8768
15631d1091P8165Q350o0110j0383P5195q0127p3767L1105Q6045K7584K7671n7530
15619A1107o1011L5134j6601J06936J3985n5312o1050Q186l9892Q7865N497k9330
15607E514O4736j5377n0756p8794q6798j538J17860J07829r708M5325k2316k5313
15595E0664o0807q2696r2853q4380M6817J83094J2084l3972N5021L6530q6783
15584e7281r2451m2602P5830j595n7967N2653J0797K1534N1290M2131l3510J1221
$$ y = [37922, 21807, 9470, -52098, -82938, -116008, -100629, -61287, -20991, -18127, -34520, -77687, -84816, -30780, 84594, 8432, -1391, 34526, -33283, 5031, 44125, 15157, -51189, 11597, 28570, -104638, -208658, -217359, -143337, -49161, -13454, -34751, -121900, -161628, -109859, -41091, 37074, 45424, -14686, -25069, 50126, -30001, -103768, -72663, 13382, 40966, 68637, 11107, -49904, -14770, -31371, 75565, 89550, 34238, -26812, -18626, -58518, 29347, 34844, 5514, 70250, 54873, 4117, -74677, -161475, -163013, -45153, 62676, 52968, 98293, 75977, 50664, -10143, -92839, -185692, -270072, -223255, -40161, -28077, -62049, -7028, 29502, -57281, -149732, -192334, -116504, -118099, -176066, -123413, -112616, -91082, -39792, 2339, -31171, -19950]
15572a9950k0172j12436o3531N2333J17284l102j4539j9138M9381Q9295N315Q3570
15560A44310m267j27623j30282k0550K8125J12577J5145l3759j12944n0772R4195
15549h5845P3249q896k6968m9323J0928n3026K3061j1394m3323M4631O2769L6443
15537b7694Q7204R7967l1343l6453o1496j5351p3636L9639P6983r909p8797r9296
15525a32182J59490P5494p9812m7238j07654l9386M3259M4841R5460P3948q0384
15514E836M6543r4384l7730k9237n5671O3109N7442Q8469N714o348k4700l2657
15502a3614L9178m674L5768j1484n8486m9899J6351L3399Q2809j9238j0374J89
15490C9925J8973n9763k29k0785Q488P7664P3696o3283p3193k0498m5298r034
$$ y = [-19950, -40122, -152558, -216089, -163756, -46472, -49574, -64113, -83251, -33870, 55425, 60740, 144310, 140043, 12420, -117862, -138412, -110287, 2290, 17435, -16324, -129268, -180040, -85845, -12596, -21492, -48460, -97783, -86855, -139881, -116820, -128214, -171537, -126906, -64137, -27694, 59510, 157477, 126134, 89681, 28185, 12834, -60802, -21163, 55820, 45911, -32886, -132182, 27308, 102802, 22990, -24248, -131902, -171288, -128029, -83188, 12272, 86220, 5836, 52379, -42005, -79735, -108972, -164643, -101534, -44092, 44377, 50091, 43743, 19043, -13614, 25564, 20890, 56658, 45174, -13312, -63211, -46860, -13461, 69348, 50110, 39736, 39925, 58898, -865, -1094, -21879, -13391, 64273, 137969, 74686, 1493, -19005, -64303, -73337]
15478g3337l811O4120k0166j17079j010L7510q188m4711J2696R4337K3704O731
15466b9204l790M1602R6938N353k6515P6127L3029j3621m6594n363L6535p2177
15454I2320k7615q197L9855p2092j3829K0663m0621j0095J02285r701o3747r1911
15442h2685Q336O1248L634l1372o4322l5387j2714M8550R7508l058L1951Q0831
15430A02520p5267J7836J02906q00o0023j30190j8673Q971J6765L4524j9762R555
15418a1638q830R1902J02747M0548r2475j12617o0683k0247n6644N3094J05349
15407C0506j1599l8691m5542n6027L5657J56322Q466l7591k0240P8848J9926r4076
15395B5959k138M222j31007l4560J6394N2980P6637l3545n5032L9656O0579L8310
$$ y = [-73337, -77148, -13028, -33194, -150273, -151283, -113773, -121961, -166672, -153976, -59639, -35935, -29204, -32994, 8608, 105546, 110899, 84384, 160511, 193540, 179919, 133325, 127962, 164497, 92320, 64705, 56508, 96363, 24271, 10442, 31105, -9516, -19611, 82674, 72973, 9226, -82685, -74349, -13101, -9467, -40839, -105161, -140548, -153262, -104712, -7204, -10262, 21689, 102520, 27253, 45089, 147995, 147195, 87172, -43018, -61691, -52720, -35955, -1431, -21193, -11638, -20468, 71434, 174181, 214729, 122254, 9637, -51046, -71293, -127937, -74843, 30506, 18907, -19784, -65326, -121353, -85696, 70626, 79092, 41501, 21261, 100109, 120035, 25959, 23821, 28043, -102964, -137524, -121130, -68150, 8487, -25058, -80090, -40434, 20145, 58455]
15383E8455k4008K1687j01089q9129L4328M6277O6287J7397m2615P5626M3229
15372A06445j3108j882p8031l1034K8250L129q9596j3848J24353L5310m4287J929
15360B7630k0855P0199k0496l3982R749N1436q9276l14p677J0163P5341M0980
15348A12898L0674J8711o1372j24192l4953L2102P563R2672P022j29271m2466
15337i0612R207Q641O4805R3727j7573J5693K3031O97k7094k9266o1943J0981
15325B94O0188k4630l5385K0191j6502l3440m9825p2135L3293j2156P0702L2903
15313b6502q0l9798Q714N0384K3328L2374j7401J0096m8125J4566N2336P1395
15301A31287l5979p9970m111Q529O1134k617o7008l423O9412N2561j9850k1034
$$ y = [58455, 34447, 56134, -44955, -134084, -99756, -53479, 12808, 30205, -12410, 63216, 106445, 93337, 91455, 13424, -17610, 10640, 13769, -75827, -89675, 34678, 69988, 25701, 27630, 6775, 76974, 56478, 22496, 32245, 83681, -5595, -5909, -13586, -3423, 71918, 112898, 143572, 162283, 100911, -23281, -58234, -26132, -18569, 74103, 81125, -48146, -90612, -81405, -72764, -7959, 85768, 68195, 83888, 106919, 107616, 80522, 51256, -10687, 294, 60482, 35852, 467, 20658, 4156, -29284, -79109, -151244, -117951, -130107, -59405, -26502, -26582, -66380, -57666, -7282, 16046, 48420, 31019, 41115, -7010, 7556, 59892, 131287, 95308, 15338, 11227, 19756, 80890, 78273, 11265, 7842, 77254, 129815, 109965, 88931]
15289H8931m5349J5524P01j6264l5017P471j40003k362Q1152K2827m3972J6335
15277e0026J0762Q3609J04959n0631j65128j982N6636K7699m8001j73045m4688
15266b49836R4888R8444L4429j2626J6232M797n9373M1027M6911N4212p461j7235
15254D4409m205k1570J8486l9089r3826L3659J65K4079j8373J9767M5701n6005
15242d6802k7031m1259L2542J04596P418k9381n1448n3789P9903O9217k479l455
15230C8032J4200l5802k0788q834J5322o4469n9407R3678J1335K9248O7726P1671
15218A51912l8340j12171j9153M3127k6187K1885M2359j4083k9190j6409Q15O4558
15206F9123L9414j0210k5754K9993o9912p7755M7794K3603l9308N3837J02103
$$ y = [88931, 43582, 59106, 59807, 43543, 8526, 15997, -124006, -126368, -45216, -22389, -66361, -50026, -39264, 44345, 149304, 98673, -66455, -68437, -11801, 15898, -32103, -205148, -249836, -154948, -56504, -22075, -34701, -18469, -13672, -73045, -32018, 14893, 69105, 61644, 44409, 40204, 18634, 37120, -1969, -95795, -62136, -61971, -37892, -56265, -36498, 9203, -46802, -73833, -115092, -82550, 22046, 29464, 83, -51365, -105154, -25251, 43966, 41487, 38032, 52232, 16430, -4358, -13192, 2130, -62339, -121746, -28068, -16733, 12515, 80241, 151912, 113572, 1401, -17752, 25375, -812, 21073, 63432, 49349, 20159, 3750, 4565, 69123, 108537, 98327, 72573, 102566, 32654, -45101, 2693, 26296, -13012, 40825, 142928]
15195A42928k0293L9630P313m8278k0552J8677q4037o7925J7045K3902j5441O5064
15183E8033J0333p0677p4041N8505L0680n0741l5574m8659M9179l9212o2362L852
15171a70684L1180Q0761N5294Q1691n2321j0051q972o192J6655O269M0334r6976
15159c3012q1391j5852N6659K8721K2640K1871o4345r3216R1277O9501j880R5943
15147I6916J04520j21582p9742l3282j7587K6585R6941N8913j6272N7191k8390
15136A44211m5112K4039n583p7787J4401j4994j02917K5628N7205n3370n966Q664
15124c1581K9477j797k1963k8415j07465K4245J13538P0995J2848k3331j06404
15113f9853o0173N3690O8780l8344m5339m5930L1574r788L6875M4192n2307l9846
$$ y = [142928, 122635, 162265, 169578, 121300, 100748, 119425, 35388, -32537, -15492, 8410, -7031, 58033, 68366, -2311, -76352, -17847, 12833, -37908, -73482, -122141, -72962, -112174, -174536, -170684, -139504, -58743, -3449, 78242, 25921, 15870, 6898, 706, 17361, 23630, 63964, -33012, -114403, -130255, -73596, -44875, -22235, -364, -64709, -157925, -66648, 2853, 973, 96916, 201436, 79854, 112, -33170, -50757, -24172, 72769, 131682, 115410, 172601, 144211, 99099, 123138, 117555, 39768, 54169, 39175, -63742, -38114, 19091, -34279, -40245, -31581, -2104, -3901, -25864, -54279, -161744, -137499, -23961, 47034, 59882, 36551, -69853, -130026, -76336, -7556, -45900, -91239, -137169, -105595, -115383, -78508, -34316, -86623, -126469]
15101a26469j7405Q926O0874J04446k3603l3401K9923L0547M8665r4818M642K2593
15089A4920l8563k3437J7028l7015J05600L8954N0337M3870J6173l2795j5640
15078A39432n9805n8423K6050M7251m962L4180l1241k8914l9420K0288j4735J9123
15066D8824l0882q5603k0865Q6738J0686k4542j3586j9785l7267L279K4850M8613
15054i540L5937M5986K2842P333l3658p1099K5051M3569O383l5041q0817k6983
15042g0037k49K7538J11361P2941J4813q2217r1695p0751J3611M3202M0556n2178
15030d3105J9707R0804M2383n0362l2436k6546P2804j1577m3558K0932M4967j1324
15018G2689n0973k883L1939O232k2593p097k9916K57J76217K65387J73042L7081
$$ y = [-126469, -143874, -134948, -74074, 30372, 6769, -26632, 3291, 33838, 82503, -12315, -7673, 14920, -23643, -47080, -30052, -67067, 38533, 77487, 127824, 171694, 187867, 155072, 139432, 79627, 21204, 47254, 94505, 89543, 123723, 92482, 63568, 24148, 44436, 29701, 48824, 17942, -67661, -88526, -1788, 8898, -15644, -29230, -49015, -86282, -83003, -58153, -9540, 26397, 72383, 95225, 102558, 68900, -2199, 22852, 66421, 72804, 37763, -43054, -70037, -70286, -42748, 68613, 141554, 156367, 74150, -17545, -88296, -74685, -31483, 9073, -43105, -23398, 67406, 109789, 59427, 26991, 445, 73249, 61672, 18114, 39046, 84013, 72689, 21716, 18833, 50772, 57004, 34411, 27314, -2602, -2345, 173872, 439259, 612301, 649382]
15006F49382K372J4659n9459j00588k32575j74160j6494l9141l7536J2915O888
14995B6263O6532j3577J6666m6456p6344o414J1912N9239L4398n0814l8919j9030
14983c6544O1634K8229j28865r3272l3177O9554J07130L6289L2107Q277l6943
14972A4419p6116l4748l2224K8606N2720l6733j0665M755N9739P437l743N847
14960b0706L767N3801P4969Q572l1937K884n539J8860n0923r2965o4870L6989
14948f7098M6286l3963m6043k3301L3348Q1861j4378n6568L5193N4688K7598K2533
14936F0156m0176l0076k0900m1283M2782P3666O0963o3689n6093q354N9849L767
14924D0612k6852o1933L0541L4597R2933m714l5718K2199j4532n1067j1019O577
$$ y = [649382, 651754, 666413, 606954, 506366, 273791, 99631, 83137, 43996, 6460, 19375, 26263, 92795, 79218, 95884, 49428, -26916, -33330, -21418, 37821, 72219, 21405, -17514, -36544, 25090, 53319, -75546, -168818, -201995, -132441, -25311, 10978, 43085, 51362, 14419, -61697, -96445, -128669, -100063, -47343, -84076, -94741, -89986, -30247, -22810, -26553, -20706, -16939, 36862, 111831, 120403, 88466, 91350, 85811, 104671, 53748, -39217, -104087, -67098, -20812, -54775, -100818, -124119, -90771, -8910, -23288, -79856, -44663, 10025, 37623, 60156, 19980, -10096, -30996, -72279, -29497, 44169, 105132, 41443, -14650, -23004, 36845, 40612, 13760, -48173, -17632, 16965, 109898, 105184, 69466, 91665, 77133, 26066, 15047, 21624]
14912B1624L7191m5733m0630M9608J0450k8238j2497l6295m8198K2365J12850
14901D2497N4085r5536q8074L1483O9834Q2998j2790m130K0045L7945j2307k8260
14889I7790k0620m9071J9220M4194J2922q4835k9280L5632k9290J3518O0638j5913
14877E4905L5396M1222J0747l5315p7473o3956J7879m2132j6661k3998K1910j4981
14865i2457k624K3685J11293L5306R7860Q3816m1051n1673j23959r8836J6244
14854d2396M0090N7918L8504l6425j05718j664l2862N461K4296m846n7920l5930
14842a51492K233N0630R0684M4964p726M9559Q674p5098R791J8396M1623l4670
14830D7568j14542K0213J03867l2892j07274j25317N3805j1271K9657J05272N9814
$$ y = [21624, 58815, 13082, -27548, 22060, 32510, 4272, -8225, -44520, -92718, -70353, 42497, 96582, 1046, -87028, -55545, 14289, 97287, 84497, 80367, 100412, 138357, 126050, 97790, 77170, 28099, 47319, 91513, 104435, 19600, -9680, 25952, -3338, 10180, 70818, 54905, 90301, 131523, 142270, 106955, 29482, -34474, -16595, -58727, -75388, -99386, -77476, -92457, -95081, -71396, 39897, 75203, 173063, 256879, 215828, 164155, 40196, -58640, -42396, -2306, 55612, 94116, 57691, -48027, -49691, -82553, -77092, -52796, -57642, -115562, -151492, -149259, -98629, -7945, 37019, 29293, 78852, 87526, 12428, 22219, 40615, 82238, 47568, -66974, -46761, 57106, 24214, -83060, -208377, -154572, -165843, -136186, -30914, 28900]
14819B8900q5128l2305O5449P1826p8888k5178r1211k3259K7793R946k0052k0879
14807a72986k7311L062Q9080j6878p987J34944J27520M9270J1443o6156k6890
14796I7111M2147n5706o8974n3827L0113P0109p500N2766j7119p041O417k2285
14784F6211O4982l1884m5706Q9810L8467j15170j51160n1336l7023R8891J1026
14773f2892m2363k2515Q9288R4630o514j4502r6496L522Q8424M3947q2896j3191
14761b1558Q4152m5829n9858J1219O8811K6915J3736K3894m3179P223p411n7495
14749F20p3152m315l5901k9701j5948J02758J14249L2766n9543K7974o330m2934
14737A0543M372n5365o4587m6312L8955P7371M8425m0800o6755N6706L5802o2670
$$ y = [28900, -56228, -88533, -23084, 48742, -30146, -55324, -146535, -169794, -142001, -132055, -152107, -172986, -200297, -197235, -108155, -125033, -133020, 1924, 129444, 178714, 190157, 124001, 97111, 139258, 83552, 14578, -39249, -9136, 60973, 53473, 106239, 89120, 82079, 88496, 66211, 131193, 99309, 53603, 143413, 181880, 66710, -84450, -135786, -172809, -73918, -62892, -105255, -127770, -38482, 56148, 49634, 35132, -61364, -57842, 30582, 74529, -8367, -21558, 62594, 16765, -43093, -31874, 36937, 63852, 77588, 101482, 58303, 65526, 58115, 620, -72532, -76847, -112748, -142449, -158397, -55639, 58610, 91376, 31833, 59807, 53477, 10543, 14915, -40450, -105037, -151349, -112394, -35023, 13402, -27398, -94153, -37447, -1645, -64315]
14725f4315k9121o0501N8488L6458N7204J3941J5144o9192k5375j0493K5402M1795
14713a0565N4083l7168j4772l8726l1817K1332l0285L1733L2972q7246M1043P9465
14701A0049p5250J6974J0937N890m548o5760l2200P2612l870J8932O1080j9748
14689d902m2538k5133o3469J0828j9004K8859K9678J04614j2483p9277K4746N0140
14677B059l8413j16111p6657R2611O7836L2731R4159R948k7050J9910l0434K7523
14665E8112L5411m3802l9017K765L6649r2679m5163K955M7126K3949r1898p5065
14653a80657K1495Q9461J1794m7545m4618k335J41185J15012k7131L5209J1030
14642A22900n4079p2164K1111N570m7583L1259O562L5319q0729j6783j3926l1793
$$ y = [-64315, -93436, -153937, -95449, -58991, -1787, 12154, 27298, -41894, -67269, -77762, -52360, -10565, 43518, 6350, -8422, -47148, -78965, -57633, -87918, -56185, -23213, -110459, -69416, 10049, -65201, -48227, -37290, -31400, -35948, -101708, -133908, -61296, -65166, -46234, 14846, -4902, -47440, -72573, -136042, -125214, -144218, -115359, -85681, 18933, 6450, -72827, -48081, 2059, -36354, -152465, -229122, -136511, -68675, -35944, 58215, 68163, 41113, 61023, 30589, 58112, 93523, 49721, 10704, 13469, 50118, -42561, -87724, -84769, -37643, -13694, -105592, -180657, -159162, -69701, -57907, -105452, -150070, -152405, -11220, 103792, 76661, 111870, 122900, 68821, -3343, 17768, 23338, -24245, 7014, 13576, 48895, -31834, -48617, -62543, -94336]
14630i4336l906L2886J6547l683j02790J0380N8590K0796l4047o0404k0295P6140
14618a04122N7903N5019J20040K1436j13465j27928m8078J02425O7864O5753L0453
14607A27300m4211K5112O7686k3515l3835J4212o8113l5874O2470j2292o3475
14596A5465K0251Q2335n243k3436q9592k0719N1786O8335r0400j20228k76J08171
14584c551p066n7347P004L4695L310l5484N1113L2804j4810o1557k8369M1427
14572c7831N320M2114l1276o0742j8290j7724Q5543J0388J9451N1623q7821p1196
14560a10441n2809L1976R6353N409J3214M0790M0934P4275q963l7263n4618j583
14548C7274Q9586K3542j24192q7595o658J8738N4573L486j4287M5164k7523q0550
$$ y = [-94336, -98242, -65356, -48809, -52492, -155282, -144902, -86312, -65516, -99563, -159967, -180262, -104122, -46219, 8800, 128840, 150276, 36811, -91117, -139195, -36770, 31094, 96847, 127300, 83089, 108201, 175887, 152372, 118537, 132749, 64636, 28762, 91232, 78940, 15465, 35716, 118051, 112808, 89372, -220, -20939, 30847, 99182, 8782, -111446, -111722, -3551, -10617, -67964, -60960, -26265, -22955, -58439, -7326, 25478, 10668, -50889, -79258, -37831, -32511, 9603, -21673, -82415, -100705, -118429, -32886, -22498, -3047, 48576, -39245, -110441, -163250, -131274, -34921, -29512, -16298, 24492, 65426, 139701, 130738, 93475, 38857, 37274, 126860, 150402, 26210, -61385, -68043, -49305, 5268, 8754, -5533, 39631, 12108, -68442]
14536f8442p2831P6341L5197Q2085M1859M3508L262j6862r5155q7770K3464j0546
14524d5890L934O3841M6613L5080n7593L4405K3394L7834n8252r2559n4133l9774
14512a03100J9629K2468L0400R2523o2389m9000k3335M4551m8571p4744K589j8006
14500a66985M5558P9900M9150J6756J1280j9143n4233O10l4540K8726J3833N1615
14488B2527L9012o1838K66L4885m7799M1342n1029k1040R613K0950r1241k0069
14476a24421P7637p465m8605J1190j6774L4388K6025l398J3476j5170J8077l9612
14464g4652K2878K3576k4539R047j8256p6698O2136Q5176j2174k6923J8445l5933
14452d7917l1656o440k420o0121Q3529K9353J7506K3906o0116M3113J9637J0997
$$ y = [-68442, -141273, -64932, -29735, 52350, 94209, 137717, 140979, 124117, 28962, -58808, -35344, -45890, -41956, 21885, 68498, 103578, 45985, 80390, 103784, 141618, 83366, -9193, -63326, -103100, -83471, -61003, -30603, 61920, -469, -49469, -72804, -28253, -76824, -151568, -148979, -166985, -121427, -41527, 7623, 24379, 35659, 16516, -37717, -37107, -71647, -42921, -29088, 22527, 61539, -299, -33, 34852, -12947, 28395, -22634, -43674, -34061, -13111, -104352, -124421, -46784, -54249, -102854, -91664, -108438, -74050, -48025, -51423, -37947, -53117, -35040, -74652, -51774, -28198, -52737, -43690, -61946, -138644, -76508, 8668, -3506, -30429, -11984, -47917, -79573, -86013, -88433, -148554, -65025, -35672, -18166, 5740, -54376, -11263, 8374, 19371]
14440A9371M7335o543M0969n493k9210k2846j0802N6569N6260J2335j351r8919
14428E7675j24489k382j9432O774J58424j564J7444n1195j06944N3541K3518l1459
14416b0089J5630k2017j7455L699p814n1080j8239r116J7554M3344o4513k3170
14404a53266N4348M4856N0297k5089m1135P0836m7065j8117k3636J9516M6701
14393b1754N8585N7075L6679L6319L0593j31342j9310N3647j11694o9440k3345
14382a03987L126j5398j1403P5185M3462R092J2952L625j1082j4276K347J7771
14370A1414O2206k2900k3119K1302K414L395O599k986j5334J0867k0816p5599
14358d2557o5892M1321K0000J865J4024j1535r1374m4911J01270J4892k185K5747
$$ y = [19371, 66706, 60163, 101132, 95639, 66429, 43583, 32781, 89350, 145610, 157945, 156594, 57675, -66814, -69196, -88628, -81854, 76570, 75006, 92450, 41255, -65689, -12148, 11370, -20089, -4459, -26476, -43931, -40232, -48046, -99126, -117365, -126481, -108927, -65583, -130096, -153266, -98918, -54062, -3765, -28854, -69989, 847, -46218, -64335, -87971, -68455, -21754, 36831, 93906, 130585, 166904, 197497, 66155, 46845, 100492, -11202, -80642, -103987, -100861, -116259, -127662, -52477, -9015, 77, 13029, 16654, 5572, -8704, -6357, 11414, 73620, 50720, 27601, 48903, 51317, 54712, 61311, 58325, 42991, 53858, 33042, -42557, -108449, -67128, -47128, -45263, -31239, -42774, -134148, -179059, -77789, -62897, -65082, -39335]
14346c9335P7937J2721n7665J3954j6826l364O0891K0474j23837K0325O0418O5773
14334I1466m2267l354J9018M112o0913O167n700m1530j6216j9479l3474M1149
14322f1021P9444j8624l9261o9018n2121N4761K0621j32763j7496P1839N7831
14311a05808L9593R914N8165K6467q3573K9850N2862J3075R6992K4007q7608k4961
14299D8975L3360M4255l5451l9550r1104R631J5474L0114M917r210K7896M6550
14287H5857o956l3521r6667L9957L3922M9389n2894r2000J3773M6253L7161J4665
14275C8939l1809m5508k6475l1689o1804O4943P2378Q5006l4625j16602l4516
14264a21762N6762J3016j6493O3313n0871p7683K2628R2326O7306m5809n8109
$$ y = [-39335, 38602, 51323, -6342, 7612, -9214, -12578, 48313, 68787, -55050, -34725, 25693, 91466, 49199, 45845, 64863, 68975, 8062, 14229, 8529, -33001, -49217, -68696, -102170, -61021, 18423, -201, -39462, -108480, -160601, -105840, -85219, -217982, -235478, -163639, -105808, -66215, -56301, 1864, 28331, -55242, -25392, 27470, 40545, 137537, 161544, 73936, 48975, 82335, 126590, 91139, 51589, -39515, -29884, -14410, 15704, 20621, 11411, 39307, 85857, 78901, 45380, -51287, -11330, 22592, 71981, 19087, -72913, -59140, -12887, 24274, 38939, 7130, -38378, -64853, -96542, -158346, -93403, -21025, 63981, 29356, -87246, -121762, -65000, -51984, -68477, -5164, -56035, -133718, -111090, -18764, 48542, 2733, -55376]
14253e5376o8548L8498N8987J20953k1791o9284K2287m28J3763m5980L9114n796
14241B6399n6005L8348L6574j12773k9866J13858N7748P6423k9055n4114K2095
14230H9632O8725j4892j10819j16472L1696L5592o3173J14625K6660Q208j3445
14219E6337o0743O6810q3960p8393Q9417J58099N9594q5221j05849J1139n0377
14208b3147n3465j2573k7014P5379P345K8370N3102o9614k1506R7250J763n9374
14196c484o1839l4384L9283K8049j8341N9373J48072o3400p4251K0197N9650j638
14184I7287l7665J4165l862J6055M3590K6796J44r0734q197n1957m8475N94M7479
14171E220k231n5019o4312j9660J0519r471L6274K3902N815j188j3176O2035L0736
$$ y = [-55376, -123924, -85426, -26439, 94514, 72723, 3439, 25726, 25298, 39061, -6919, 32195, 26399, -29606, 8742, 45316, -67457, -97323, 16535, 74283, 150706, 121651, 67537, 89632, 158357, 143465, 32646, -83826, -52130, -16538, -79711, 34914, 61574, 69782, 56337, -4406, 62404, -21556, -99949, -10532, 147567, 207161, 121940, 16091, 27230, -23147, -76612, -89185, -116199, -40820, -33475, -5105, 47997, -21617, -43123, 54127, 55890, -3484, -65323, -99707, -60424, -32375, -50716, 8657, 156729, 93329, 19078, 39275, 98925, 97287, 59622, 73787, 69925, 85980, 129570, 156366, 156510, 65776, 57579, 5622, -42853, -42259, 5220, 2989, -52030, -116342, -136002, -125483, -134954, -98680, -74778, -68963, -70151, -83327, -21292, 9444]
14158I444J8625L8984n4292m7460k7903n845O1072Q3066j6102n7180m4185o3784
14146a05560L4494l0876M622N2469l778M8902K9577J06642p700l4278n4882n1658
14134a2026m7008j3945L6130n4316K3929N5338r901j2136M5037M3253k035j0618
14122D1702n9933m6167p8736N0257J32534R1849l9699j24689j24925R9800J70442
14111A12435J9645o4886j842l0856r1809L0182j2942q966j495k9809j690J4285
14099f7748j8144N9627J29637Q781m2733j1537O864m6169j6176n125N800J06700
14087A09777O0242j14683j06015J8118q059l5322O5962O921n3004p5278K7299
14076a04042L1308M411n017m163P1270K9086J8832k3251k2145m7536l1156N8928
$$ y = [9444, 28069, 67053, 12761, -34699, -62602, -68447, -7375, 75691, 59589, 2409, -41776, -105560, -71066, -101942, -97320, -44851, -48629, 273, 29850, 136492, 128792, 94514, 39632, -12026, -59034, -72979, -36849, -91165, -67236, -11898, -21799, -33935, 11102, 54355, 52320, 41702, -18231, -64398, -143134, -92877, 39657, 131506, 91807, -32882, -157807, -58007, 112435, 132080, 67194, 65352, 34496, -57313, -27131, -40073, -49039, -50534, -80343, -82033, -67748, -85892, -26265, 103372, 112153, 69420, 57883, 64747, 18578, 2402, -2723, 3077, 109777, 170019, 55336, -50679, -32561, -40620, -75942, -9980, -3059, -56063, -131341, -104042, -72734, -68323, -73340, -77503, -6233, 22853, 41685, 18434, -3711, -51247, -82403, -23475]
14064b3475L2090P705k1880m4354M6098k8755r5246m4527n095j9026P1920M2093
14052h2452n3056j0186O0003J3006L1395j8439m4500n033J0833K9930k917n2428
14040a23844K608P8242L7444R8646M2593l8811Q42p8284j9188n786R804K0490
14028B4756J9675m3443m519p2559k3731N4601R8015m3289p8929j1261O7344o6275
14016g9615n672M9455L0327K5339J0766n158J4888m265j03511l4760L4474L4178
14004c3554m961l3977j10684M7866j384M5381P1677R067k1088r929r537k207k727
13991e6057l663l1476J2665L8639N1595j4539k9429l027L3282q757k3112m5453
13979g9332J0364M2919K5081J7699q4990k6900N2424L3947q692n9805l6567j12134
$$ y = [-23475, 8615, 16320, -5560, -49914, -3816, -32571, -127817, -172344, -177439, -196465, -124545, -82452, -135508, -145694, -85691, -72685, -41290, -59729, -104229, -109262, -98429, -68499, -71416, -123844, -121236, -42994, -5550, 93096, 135689, 96878, 97720, 19436, 248, -5538, 4266, 24756, 44431, 988, -3531, -76090, -99821, -45220, 52795, 9506, -69423, -80684, -13340, -79615, -85287, -35832, -5505, 19834, 30600, 25442, 40330, 36065, -67446, -102206, -67732, -33554, -38515, -72492, -183176, -135310, -136694, -91313, -19636, -10569, -31657, -41586, -51123, -53330, -56057, -59720, -91196, -78531, -39892, 11703, -2836, -32265, -35292, -2010, -10767, -33879, -79332, -68968, -26049, -968, 16731, -68259, -95159, -42735, -8788, -17480, -77285, -113852, -225986]
13967b25986M116K2344L7923K0462N2574Q784M6405K0273j2310K0545o302q578
13955a9750p4105k4076M401P4434N1796J1339m4443k2144O1921m9412n684j1683
13943d7406L5224k1134j5231J8305J3786l9023p0925J9898J00434O5519Q933J652
13931G0032m9516L3269J7230N8137J220j06906r8975L0067O6791O3126l93L1255
13919A15337K4166j8547j9993o3937J1690k2116o0310l7876q8817J7521K5195
13908a17687q015J3523m5813j5693L6754P8574M7834K0932n9072m3349N980L9916
13896d6116L6711j4915M2130k0746l3632l7253l5824O6392N5295m5846K725N8869
13884B7790L6567n2498N1648k3913Q174L0109j21195j3945O0233n3030J677J8428
$$ y = [-225986, -221870, -199526, -161603, -141141, -88567, -79783, -33378, -13105, -25415, -4870, -11172, -19750, -93855, -117931, -113530, -39096, 12700, 24039, -20404, -42548, 19373, -30039, -35723, -47406, -12182, -33316, -48547, -30242, -16456, -55479, -126404, -106506, -6072, 59447, 68380, 70032, 20516, 53785, 71015, 129152, 130372, 23466, -75509, -45442, 21349, 84475, 84082, 115337, 139503, 120956, 100963, 37026, 48716, 26600, -33710, -71586, -160403, -142882, -117687, -125702, -112179, -157992, -173685, -136931, -58357, -10523, 10409, -48663, -92012, -86032, -46116, -9405, -24320, 17810, -2936, -36568, -73821, -109645, -43253, 12042, -33804, -31079, 27790, 64357, 11859, 63507, 39594, 47768, 77877, -43318, -57263, 2970, -50060, -48383, -29955]
13872b9955r3J1171o0465m5860j7531l4068R8258N2845n6273M4121K002n3813
13860h9661n7271j8716O4863K9828l13K4638J11251J4988O7749K9850k8799j12962
13848C5445r9986P6380J8132r1039o3843N4849N4940n1154O2012L7595j4581j48317
13836a29567q57K3483J05944L8836j759L614k6771j4007j7213l0655K0073L5399
13824F520n8532J09827O0730o6367k0578L295L6187N2958o7193o757m1356p2909
13812f4175n8788j5121K8966R4038Q7409m7675p4892R1229M8408J5728p6518l2726
13800d117J3607k6502L912l688n3818N0590J5573N9206j681n8405l8459J1402
13788c2380j2950J3569j8187J0340j5285k163k897K1030m0566k1670J49770L1876
$$ y = [-29955, -30048, -18877, -79342, -125202, -142733, -176801, -78543, -25698, -81971, -37850, -35848, -89661, -146932, -165648, -100785, -70957, -71270, -46632, 64619, 79607, 147356, 177206, 148407, 35445, -64541, 11839, 29971, -61068, -124911, -70062, -15122, -66276, -4264, 33331, 18750, -129567, -130424, -106941, -997, 37839, 36080, 39694, 12923, -1084, -18297, -48952, -28879, 6520, -52012, 57815, 118545, 52178, 31600, 34895, 71082, 124040, 56847, 50090, 8734, -64175, -122963, -138084, -109118, -15080, 72329, 24654, -50238, 40991, 89399, 105127, 28609, -4117, 9490, -17012, -13100, -16788, -70606, -20016, -4443, 54763, 53082, -5323, -43782, -32380, -45330, -31761, -49948, -39608, -54893, -57056, -59953, -38923, -79489, -101159, 48611, 80487]
13776H0487p2164l6092N8146N3535L3971J1749k2575j5403K816J6765o5100J091
13764D7226j28660l8435N4557N9079N3454K9208r4026k4667N0866J2086k4111
13753c423J9149l1517m6160L3299K6272j982K5971o4479j823M1029k4700R298
13741a9066m2879M6602J5919R484R655L4516p0672l0762K3760k9754m677k6132
13729h4006p1428J27154N795Q950L5928P1821j1636K3424n6842r2455O755M4365
13717G825M0861K6217j1325N050n6702j9058P8715j4388m5932O4768O3851k2506
13705A17376j23412r4245P213J10367j701l1844n9299Q4336N1975j3339J6509
13694F3936j5993K0562M4371K04P9358K1257q4522K4616J7444m8817j02053p8260
$$ y = [80487, 8323, -27769, 30377, 83912, 117883, 129632, 107057, 91654, 94470, 111235, 46135, 47226, -81434, -119869, -65312, -6233, 47221, 76429, -17597, -42264, 8602, 20688, -3423, 15726, -15791, -61951, -28652, -2380, -4362, 21609, -42870, -44693, -3664, -28364, -19066, -61945, -15343, 576, 10060, 19715, 54231, -16441, -47203, -23443, -53197, -57874, -84006, -155434, -28280, -22485, -13535, 22393, 94214, 82578, 106002, 49160, -43295, -36540, 7825, 48686, 74903, 63578, 68628, 11926, -7132, 71583, 57195, 11263, 76031, 139882, 117376, -6036, -100281, -93068, 17299, 15598, -16246, -75545, 8791, 60766, 47427, 63936, 47943, 68505, 112876, 113080, 192438, 213695, 129173, 153789, 171233, 122416, 20363, -57897]
13682e7897k4136P4230M8465p3021M9136l4322j10810l0469P4979J29531o5125
13671a9439j5185l617n5845J8103Q952P613P8049n942l0634j2546J33392L1071
13659A33972j17514q4333p4600m208k3612N4161O3361k8214L5868p7997m2206
13648a65322J8738J01454Q5816m971r180M0245O2123j0172j33889n7604J2063
13637f0699L7881j7063K249L077J5838k2498M0176p4158J3959j4078r7549M0259
13625a32606J15068K924k362N1762J03836n9893j9862j3655l8106p421j856j7261
13613a9432L482K5727q6933k0817Q4800j438Q611L7308q0918p6890N4116K0603
13601e1781L2260K8622l2987j06759l5218O5250K4009K4394P668l6005l8699m0285
$$ y = [-57897, -82033, -7803, 40662, -32359, 16777, -17545, -128355, -158824, -83845, 45686, -19439, -34624, -38241, -94086, -75983, -67031, -59418, 18631, 12689, -17945, -30491, 102901, 133972, 16458, -67875, -142475, -146683, -170295, -116134, -52773, -80987, -45119, -123116, -165322, -146584, -45130, 40686, 35715, 26535, 66780, 128903, 118731, -15158, -72762, -60699, -22818, -39881, -37632, -34555, -18717, -41215, -1039, -75197, -61238, -75316, -172865, -132606, -17538, -14614, -16976, 34786, 138622, 78729, 58867, 45212, 7106, -315, -2171, -19432, -15950, 9777, -77156, -97973, -13173, -14611, -6000, 31308, -49610, -126500, -72384, -51781, -19521, 9101, -23886, -130645, -165863, -100613, -76604, -52210, -44542, -80547, -119246, -159531]
13589a59531N8981k319l260J9584K5888L3427J3281p6072n5608l5603O8155O6421
13577d6656M486p5622r5534p0346j5234N8308J12676O8162M5680n9501l1486L661
13565a01406L4321L2810l8188m4300o4522l7178Q1958K2483m6160L3445R8730
13554b8007L0415J3872k3904L6731m4536m647J1406L0067k6586J5099o8708N8923
13542A25P4704j5251K3682l7503l7654L725m3530q0645o1899j5247M3032Q158
13530a38303j1692L6742j0733N63L9581o1418j5183P1209N9562L5765N1609m0483
13518A7219J4628M5023J2807l9819j6156L8333L1973l4386j7964M4282q3705p0559
13506e8324M1926K198r9638j3853K5285M2900Q4857O884o3082p0483K2306P0869
$$ y = [-159531, -100550, -102869, -106129, -86545, -60657, -27230, -13949, -90021, -145629, -181232, -113077, -46656, -42170, -117792, -213326, -283672, -298906, -240598, -127922, -59760, -14080, -73581, -105067, -101406, -67085, -34275, -72463, -116763, -181285, -218463, -136505, -114022, -160182, -126737, -28007, 2408, 16280, -7624, 29107, -15429, -20076, -8670, 21397, -5189, 9910, -58798, 125, 74829, 59578, 83260, 45757, 8103, 11828, -31702, -112347, -174246, -189493, -146461, -138303, -149995, -113253, -123986, -123423, -83842, -145260, -160443, -89234, -29672, 6093, 57702, 17219, 31847, 76870, 89677, 49858, 33702, 72035, 104008, 69622, 51658, 95940, 12235, -58324, -16398, -14200, -113838, -127691, -102406, -59506, 25351, 32235, -30847, -101330, -79024, -8155]
13494h155P7342M3659j6699k8444o4988n6688n7303L3131J06828O3728j5314J7480
13482I4577r9418o0879R1480k5961l7429l6142n487L3409L7876n1020m9018L9060
13470f8952Q4075O0276k6097J6696M0783k1503o3557k6557j1526M041j1936l9363
13458f3620n5112M6722J01946p0300q8788o1973L09P3883l0596K8613N1504L695
13446f3717L807k0191J4401N3489J05267N1109k6483k3186P0709m8634n1485O449
13434G1535n5191o1403J6404K3654j14490j5098Q685O2191M5311n3972p4548L7384
13422a09538M0126J14862Q0405k2094o7864o2038j2125j7604J09347o3290j7005
13411b6818R7055l7389p1156j8163O8170K4147n526N5559j2385l627l6504L4685
$$ y = [-8155, 69187, 112846, 96147, 67703, 2715, -53973, -111276, -78145, 28683, 92411, 77097, 94577, -4841, -65720, 25760, -201, -37630, -73772, -79259, -45850, -7974, -58994, -108012, -68952, 15123, 75399, 49302, 65998, 106781, 85278, 21721, -4836, -16362, -12321, -24257, -63620, -118732, -72010, 29936, -40364, -129152, -191125, -190816, -116933, -147529, -118916, -67412, -63717, -59910, -80101, -65700, -12211, 93056, 144165, 117682, 94496, 165205, 116571, 65086, 71535, 16344, -45059, -28655, -5001, -119491, -134589, -125904, -63713, -18402, -72374, -146922, -109538, -69412, 45450, 125855, 103761, 35897, -26141, -38266, -55870, 53477, -9813, -26818, 70237, 32848, -38308, -56471, 11699, 35846, 30320, 85879, 73494, 69867, 33363, 68048]
13399F8048l1772k0338n2984j6254q72Q1392O2209j4687j02983k0752K4443K6443
13387A893j04238K5843N9867l1420m8235o7850O1305K398l8531O2217m6900O9682
13375e3969K8338j5982n667J8713L4297j2829M1402r9545j1004J20225j4751q4142
13363e4914l8389M435m0316M71k4961Q59J30582J5205O269J4027k1779P8246p3791
13350d056j34450L4201N1923O3396K9330j574m9041J5491J32775m2443j16934
13339b1382J5898J40652K7484k6063q4406o2103j4041k6646N0683P8072J5159
13328I3307n9891J1073l3097m4072k452L8632N274K3573O1704m124N0970O0468
13316B01365p323j0261p2308l2470M5711L565n7500n8325K4111r0061J517j5840
$$ y = [68048, 36276, 15938, -37046, -53300, -54172, 27220, 89429, 74742, -28241, -48993, -24550, 1893, -102345, -76502, -16635, -48055, -96290, -164140, -102835, -100437, -138968, -76751, -123651, -53969, -25631, -41613, -47280, -28567, 5730, -7099, 34303, -65242, -76246, 43979, 29228, -54914, -93303, -88868, -129184, -128713, -153674, -152815, -22233, -7028, -759, 13268, -8511, 69735, -4056, -138506, -104305, -52382, 11014, 40344, 38770, -10271, 5220, 137995, 95552, -21382, -5484, 135168, 162652, 136589, 52183, -9920, -23961, -50607, 76, 78148, 93307, 33416, 44489, 11392, -32680, -35132, 3500, 8774, 32347, 94051, 89927, 140897, 201365, 194042, 183781, 111473, 79003, 124714, 128279, 70779, 12454, 36565, -53496, -51979, -67819]
13304f7819m9074K2474l6556l7856j4500o6002L4450Q6720J0772L2892J02608
13293A8109K6773r918K4289N254J826Q664l6225q765k4941m8052J1865L8395o4420
13280e7146K5906n2725m7070L563N140J7065R406j4248J3263P2297O6595l534
13268C8512j3799k3951L5682O9157M57l3327n5676p6166J3031J21640l2643O2741
13256A05658l1677j05494j23582j364n571L1350M4467M2180O175m1193n0234N0549
13244g8736K2312K5205K4357k2172r255J6523j9458q089Q7686n7690N4247j2630
13232B2300L4689J0635k8450l2489o6907l5549K066L9550J03699J7383n9021o7511
13220e9605o2344J2451M3588L5497j420Q7001N5169J0276j9731q0547q0684m9012
$$ y = [-67819, -116893, -94419, -130975, -168831, -183331, -249333, -214883, -128163, -117391, -84499, 18109, 44882, 34964, 59253, 64507, 66333, 74997, 38772, 30007, 5066, -42986, -31121, 7274, -57146, -31240, -83965, -131035, -127472, -122332, -105267, -95861, -110109, -96846, -24549, 42046, 38512, 24713, 762, 36444, 105601, 106058, 72731, 17055, -59111, -46080, 75560, 42917, 105658, 73981, -31513, -155095, -156459, -162030, -130680, -86213, -44033, -37858, -79051, -129285, -78736, -56424, -31219, -6862, -29034, -38289, -21766, -41224, -49313, 38373, -19317, 34930, 22300, 56989, 67624, 39174, 6685, -60222, -95771, -93705, -54155, 49544, 66927, 7906, -59605, -121949, -109498, -65910, -30413, -31833, 55168, 110337, 120613, 100882, 20335, -60349, -109361]
13208a09361k5690M101J1156r693Q7596M1804k8420j03695R0155R7077M0182k5374
13196F9838n4905m8583o449L7854K3931o5931j22191o4393k6254K3522J19999
13185a13562n2995L39N9460M7727l8943J7490k1101n093J4297J04387N2916L2926
13173I7848N2770o7807l6090j4770n4272j7408J3087N3735Q649N0005J6188p3857
13161B8078p1457j940M6382r352L1183k8188q044k8875P1170j9887L6434j704
13149D3800l4483j8277n1022L4168k6252m4264o4739J4416J07546L4274l1493
13138c6326j5384K4289K0394L0289M5268k5286l721n3627q9177q41R2062m358
13126a6418j0656M5415J7226O404K953l0626N7565m0692l1885K1105l540l7824
$$ y = [-109361, -135051, -130950, -119794, -129487, -41891, -87, -28507, -132202, -42047, 55030, 95212, 69838, 14933, -33650, -40099, -2245, 21686, -44245, -166436, -230829, -257083, -233561, -113562, -166557, -166218, -106758, -59031, -97974, -80484, -101585, -106678, -92381, 12006, 64922, 97848, 150618, 82811, 46721, 31951, -22321, -39729, -26642, 27093, 35742, 85747, 101935, 28078, -43379, -45319, 1063, -8289, 22894, -5294, -13338, -42213, 28957, 9070, 45504, 43800, 9317, -8960, -59982, -25814, -52066, -96330, -161069, -146653, -39107, -4833, -36326, -51710, -27421, -7027, 23262, 68530, 43244, 39523, -14104, -103281, -104122, -12060, -16418, -27074, 18341, 35567, 41971, 44924, 14298, 71863, 31171, -714, 20391, 16851, -20973]
13114b0973j24372o971Q0935L6737m4654L2472N2813m994o3284o1069N6140P9389
13102A2169M8636L2037m1881m2443m193k1753n2994k6453j6580L6744J0054M9111
13090a7546k269q8818R1597N3169k755J1139L4631r428j4565l6201p5881j6283
13078g3210o2588n2411k875L494O7973Q0244j9194k983M3339P3796J8909k0981
13066E3513l5451J5424k9932M4001K9321O486k9263k244P969l2917o6359J8068
13054b1384Q673K1170Q358l9560O7540R1762P2641L1518o4382m1310n8392n2965
13042B3669O5348M4863K4864m9543q0575k2279O3909p9626o7771M6058l3522N553
13030e9052L0385O879N770J5761Q613n511K9269r953L2194P1126J5348l3574n0097
$$ y = [-20973, -145345, -152316, -71381, -34644, -79298, -46826, 5987, 993, -62291, -123360, -67220, 12169, 60805, 92842, 50961, 8518, 4325, -17428, -70422, -96875, -113455, -76711, -66657, -17546, -19815, -108633, -17036, 36133, 33378, 44517, 79148, 69720, 55155, 18954, -56927, -73210, -135798, -188209, -191084, -187590, -119617, -39373, -58567, -61550, -18211, 55585, 74494, 53513, 18062, 33486, 3554, 47555, 76876, 83362, 54099, 51855, 59824, 26907, -39452, -21384, -12711, 8459, 16817, -22743, 44797, 136559, 209200, 240718, 176336, 135026, 76634, 23669, 89017, 133880, 158744, 109201, 28626, 6347, 70256, -9370, -77141, -31083, -64605, -59052, -28667, -21788, -16018, -257, 8356, 2845, 32114, 22161, 54355, 125481, 140829, 107255, 57158]
13017E7158M4238O2791J8966o7318m6994l0531L6045J305o3598N6721Q0665l0014
13005A19434n246K9075l8762p0699k1087K3469k0301J5878L5860J1153n67j6186
12993F2021j2129L252k722l3498j2919J1285O9641Q876k7752p0769M0759r6144
12981f0099m1314K5913J26723J06066l3790r5720p4143m3458m582o8834P6343
12970h6895J21507K902o9453m6498O1019R1781m2425o1966j0061R0996N3030k4809
12958G9128j532p6164p1808N9145M9533j6848j3707K1030p6748j1501M4695N920
12946h857O3173r474l9217p9999K0195P6365O722p316k3882j1531q8253M9962
12934e2112N4959K553k6425o3581j8767K4476L7382M3874L9623L6405m1495j19309
$$ y = [57158, 101396, 164187, 183153, 115835, 68841, 38310, 74355, 75660, 12062, 68783, 149448, 119434, 114188, 143263, 104501, 33802, 12715, 36184, 15883, 31761, 67621, 78774, 78207, 62021, 49892, 53144, 50422, 16924, 4005, 15290, 84931, 93807, 66055, -4714, 36045, -60099, -101413, -75500, 51223, 157289, 123499, 27779, -46364, -89822, -94404, -163238, -86895, 34612, 37514, -31939, -78437, -17418, 74363, 31938, -30028, -40089, 50907, 103937, 79128, 77596, 1432, -70376, -11231, 38302, 21454, 7747, 28777, -47971, -59472, -14777, -8857, 54316, 44842, 5625, -74374, -54179, 22186, 28908, 21592, -2290, -13821, -102074, -52112, 2847, 5400, -21025, -84606, -103373, -78897, -41515, 2359, 41982, 78387, 36892, -82417]
12922h2417L3344L1399K9618l3187l5901K6035P4807q6229j13967o1933j3788
12911b32219P1756o176J5497K7301N4669R5889n5986p1311L6274k2230M7293Q8718
12899D9475l8989j9838M5101j3204l1032M114Q819l4900m9880k7882j8775J3186
12887a13805J3696K5324R437L4160P5158j3871o0603J3702K3714J9415j8536m967
12875B824m3512j5082O7971L1071n3079p6741m053K7690O9998o0407m785M0716
12863a7389L7363R9048K2198n7031N852l2897j855K7399j4859l2943j3057L3689
12851E5518n8644q5666J5913Q3575k9056j14653p386m6670M035J15885O1741j187
12839f595l7621l5808O6796j296j1092l1172R70R0878L0661K1419j26623j05471
$$ y = [-82417, -49073, -17674, 11944, -21243, -57144, -31109, 43698, -42531, -156498, -218431, -232219, -160463, -166639, -151142, -123841, -69172, 26717, -29269, -100580, -64306, -86536, -39243, 49475, 10486, -9352, 35749, 22545, -8487, -4373, 4446, -30454, -80334, -108216, -126991, -113805, -100109, -74785, -65348, -31188, 43970, 30099, -30504, -16802, 6912, 26327, 7791, 2824, -40688, -55770, 12201, 43272, -9807, -86548, -90601, -62911, 7087, -53320, -58105, -17389, 19974, 119022, 141220, 84189, 90041, 57144, 55289, 82688, 67829, 34886, 21829, 55518, -3126, -88792, -72879, 10696, -18360, -133013, -140399, -187069, -183034, -67149, -5408, -6595, -44216, -80024, -13228, -14524, -25616, -56788, -55818, 35060, 65721, 87140, -39483, -144954]
12827a44954R9195J15067j9374L5738o6031j20007J6291J1830L1812L8375K8296
12816B6238n3190p8565K3950N1240N1593k0195M0991Q5301L1689m7192r1704q7263
12804f7107J179L7197N5151J1200n8617J0147P3929l1859l7151q0056l32j2821
12792i9140K9462N3421J6786k6783L3328O5709m3921j07122O5661M2702l9893
12781i790m3944P1145P461R8978O831m1643L3620L9349j05987j72475K5077O6744
12769b4634P0555M2538K8283q8509r2008P9850J4164L8975N626l9463l6155j093
12757a871N3141N8418j3496m5110j733k0225m9687l0844k4350J5991R3298l2860
12745F72m9415n0251Q078k887k5897O7265K8373k2194p4460J905l7066L179l8601
$$ y = [-144954, -45759, 69308, 49934, 85672, 19641, -100366, -84075, -72245, -40433, -2058, 26238, -26952, -105517, -81567, -30327, 21266, 1071, 42062, 127363, 159052, 111860, 20156, -67107, -65928, -28731, 26420, 37620, -20997, -10850, 63079, 31220, -5931, -85987, -86319, -99140, -69678, -16257, 529, -26254, 7074, 72783, 28862, -78260, -12599, 30103, -9790, -53734, 17411, 24872, 123850, 130681, 89038, 122658, 162007, 56020, -116455, -91378, -24634, 45921, 88459, 116742, 28233, -63775, 16075, 30239, 69214, 74840, 35377, -778, -1871, 51270, 109688, 96192, 51082, 49349, 29124, -20563, -51407, -75757, -59766, 33532, 672, -48743, -98994, -90916, -93803, -119700, -52435, -24062, -46256, -120716, -118811, -155877, -152698, -191299]
12732a91299K625Q1283K7410L1828O930M9397J4640R362J5522L0864o5790K1596
12720C4368j2264q871k1416p5447q4745l8177J30395J03404l5931Q484N7M6883
12708D6740Q8941p536j6754o7505k8760o2119n4194k8423M4817N5760n5220q0514
12696a64767l7446N5850K6843P3204N664m9128k5186q374j5641M5253o7425M3703
12684a17450K9850l700Q482j868j1870J23424L9606n3245n5959K8646J3967m142
12672d259O4936J2873p9734L2219K8603o629j84J3135O2194r91J8585j0701r2683
12659C7364j04393p672L2738K8665K5003l3125p9251K3139j6871J2198N7934P270
12647a7001p0946M3329K4324R4359j308o7094p1266j9147N4009J11079J11372
$$ y = [-191299, -188674, -107391, -79981, -48153, -41223, 8174, 22814, 32176, 47698, 78562, 12772, 34368, 22104, 13233, -8183, -83630, -168375, -206552, -76157, 27247, -8684, -200, -143, 46740, 135681, 128145, 111391, 43886, 15126, -46993, -101187, -129610, -84793, -29033, -84253, -164767, -202213, -146363, -119520, -46316, -40652, -89780, -114966, -123340, -138981, -93728, -161153, -117450, -87600, -91300, -82818, -84686, -96556, 26868, 66474, 13229, -42730, -14084, -117, -4259, 60677, 73550, -6184, 26035, 54638, 48009, 47825, 60960, 123154, 122163, 140748, 130047, 37364, -67029, -74701, -41963, -13298, 11705, -21420, -100671, -77532, -94403, -82205, -24271, -17001, -87947, -44618, -20294, 74065, 72757, 5663, -65603, -84750, -30741, 80338, 191710]
12636A91710l8972j24727P3787J22584k5122j16846L5597q2622j21606n340N2508
12625c9049r1966o0390M8054q373n180k9031K2640L9147O0401J5256j0470k6497
12613h5458j0463L9992P008m0598R5705K6662J2255l432n2932o7063O567j9511
12601i1268k0856l0484J08994Q6622N1720P4166j07425p7589K0133K4398L6413
12590G4824r770j751K6805Q157k5373k7764R753J1411m2430K7803l3087j8671
12578i3P2933p7173p6431O6123J18112n3886l6957N6046r880K9498J299P6378
12566A65969K7123q2754o2068j35444L5031j1835J1182j0950Q0223L0359m0341
12555F495N8534K8235k4863p0212n4065L1123O9898j7242p2725n7735N7000L0049
$$ y = [191710, 152738, 28011, 101798, 224382, 199260, 82414, 118011, 35389, -86217, -91557, -39049, -131015, -191405, -143351, -151724, -156904, -185935, -163295, -124148, -63747, -48491, -58961, -85458, -95921, -55929, -48921, -89519, 6186, 32848, 45103, 41671, -11261, -78324, -71757, -91268, -112124, -142608, -33614, 53008, 104728, 178894, 71469, -6120, 14013, 38411, 74824, 65054, 63303, 90108, 98265, 72892, 45128, 54881, 66292, 23862, 51665, 18578, -93, 72840, -4333, -80764, -14641, 103471, 49585, 12628, 68674, 58794, 88292, 89591, 165969, 193092, 110338, 48270, -87174, -52143, -63978, -52796, -63746, 16477, 46836, 6495, 65029, 93264, 68401, -1811, -55876, -24753, 45145, 27903, -44822, -102557, -45557, -15508]
12543a5508K687l895L1133n1651n9614O2688k2926L2930N5540n8884k6814N3947
12531c67J4281q1556M0914L4924k9415P1700J17500L2782p9366Q206J5064j6573
12519A28094q013k4581m653Q1599j0365q3249p9946p7991j0762q283K5921K4384
12507d7845K233K8310k0341O5027o1936N2132L9505k7258n701o3864K040l7759
12495g5457K4838M6403L1201P599M2590k1056o3712L1513j6651j2318N603n1658
12483e1105o1799l6353K1490l4835K5186l2530m6859J425J02693J539m265J8684
12471i6729m6682J8535O1955K9705M0361K2211n7842j26654k2820K4404j9453
12460a73009l1110k4081L6199N7989J6205K5432M0905O4670L6941k7775k0556
$$ y = [-15508, -12821, -16716, 14417, -37234, -96848, -34160, -57086, -24156, 31384, -27500, -54314, -367, 13914, -67642, -26728, 8196, -21219, 50481, 167981, 200763, 121397, 129603, 144667, 128094, 120081, 95500, 90847, 172446, 162081, 78832, -1114, -79105, -89867, -98150, -72229, -47845, -45612, -17302, -37643, 27384, -34552, 17580, 57085, 29827, 24126, -39738, -37698, -75457, -50619, -4216, 26985, 34584, 77174, 56118, -7594, 23919, 7268, -5050, 553, -51105, -112904, -149257, -127767, -162602, -137416, -169946, -216805, -215380, -112687, -111148, -115413, -96729, -143411, -124876, -62921, -33216, 7145, 29356, -28486, -155140, -177960, -153556, -173009, -204119, -228200, -192001, -134012, -117807, -92375, -51470, 13200, 50141, 22366, 1810]
12449A810k2213m618L1995j5783N1563j03185n0641K9656R8056l182j8670M5498
12437D0286K6457k1313j11437j15182j3640J6282Q6589J2655l2767J559N5910
12426e4601L2381n2475r7947k6207M8333K5972K3567M0054N785q5578k6170Q490
12414a58396J0827o449J8577Q1675M7657K4172K5230N816k3661l2950N8148m4259
12402F387o5246n2851K1861K5848j7271J11799M8152n1095l0942m219K6754P1855
12390I1032P801j9904Q06M9749o0680l0479L3270P615n9620L2989k1800K2490
12378E3269Q769k3197p055K5717j25733K676L249K7526N9417J4810J11252n1802
12366I8898j33735k4355P9458q6821j4164O0044J9633K7581J3399K984K3397m6643
$$ y = [1810, -20403, -25021, 6974, -8809, 42754, -60431, -111072, -81416, 16640, 13458, -5212, 40286, 66743, 45430, -66007, -181189, -194829, -178547, -91958, -79303, -112070, -110511, -54601, -22220, -74695, -172642, -198849, -150516, -124544, -100977, -60923, -55138, -140716, -166886, -158396, -147569, -154018, -135441, -53766, -6109, 18063, 43293, 49109, 25448, -7502, 50646, 6387, -58859, -111710, -89849, -64001, -81272, 30527, 78679, 27584, -3358, -7577, 19177, 91032, 98833, 78929, 79735, 129484, 68804, 38325, 71595, 79210, 19590, 52579, 30779, 53269, 62038, 38841, 31786, 57503, -68230, -65554, -62305, -34779, 24638, 39448, 150700, 98898, -34837, -59192, 20266, -66555, -80719, -20675, -1042, 26539, 39938, 42922, 66319, 19676]
12354A9676k3272J3241N2304j4699m8522j5515q8532q6091N8601Q4379K0569M8696
12342B0835n2765J7412J46936M0230j04457j46204o59J01606q9J1609N469k2812
12330A7111N852K271p3729p7433O420l3676n3506M975O9843M4205j5447K2460
12318h0654J60972M4721j5204o220J0486j1576K7379j1348q2976j01403M3918
12307b1905Q3704M9769l7699k2471L3049m9306n2386o2093m4034o6859O8936P4057
12295d7238j5730J5080P0960p7987K9429J38187M1009m7255p8011m7759K7102
12284G787P1426J23516k9077j6553j3029q7949m100p496J4636P7065J2678m5513
12272A03391K1507r0376l3918k2470L793J027M8232j3447k4224L7714l6316N446
$$ y = [19676, -3596, 9645, 61949, 47250, -1272, -16787, -105319, -191410, -132809, -48430, -27861, 20835, -31930, -14518, 132418, 172648, 68191, -78013, -78672, 22934, 22845, 34454, 39923, 17111, 22963, 25234, -48495, -125928, -119508, -153184, -206690, -201715, -131872, -87667, -103114, -80654, 80318, 125039, 109835, 103615, 114101, 102525, 129904, 118556, 35580, -65823, -21905, 61799, 111568, 73869, 51398, 84447, 35141, -17245, -79338, -123372, -190231, -121295, -47238, -62968, -47888, 23072, -54915, -25486, 112701, 153710, 106455, 28444, -19315, 7787, 79213, 202729, 173652, 157099, 144070, 56121, 52021, 44525, 59161, 136226, 148904, 103391, 124898, 34522, 604, -21866, -18073, -17046, 31186, 17739, -6485, 31229, -5087, 359]
12260C59O3121l1304L3109l3875k9503p1850R2157J23142q7075m3583L912L1101
12248D9711K765m759l4656n1280l1924M6758Q1396L0705q0498m7398Q5311J8397
12236F4528J3114K208q3216r5333J0448J12415R8341K6148m9021P8108j9185o5393
12224I3162p3743L6971K9868J6142j8808r4978j917O9446J5995n1408l2424n5349
12212f7043O205J33753N3162j13890p3632K6336M3573l2037p4349O3359K9983
12201d580o9806J1403N0050l2649j7911N5120j21708k4229J0859J21784R0118
12190F8451l4198O0814J2089N505q0479o6656O3706M7748O1761l3659n1735J1357
12178F4704j0810J9045K1632l261j16537j8478J15861L282J18236k4029j54406
$$ y = [359, 63480, 32176, 65285, 31410, 1907, -69943, 22214, 145356, 58281, 14698, 18610, 49711, 52476, 47717, 13061, -38219, -70143, -23385, 58011, 88716, 8218, -39180, 46131, 64528, 77642, 79850, -3366, -98699, -88251, 24164, 122505, 148653, 99632, 177740, 158555, 93162, 19419, 56390, 86258, 102400, 83592, -11386, -13303, 56143, 72138, 20730, -11694, -67043, -60838, 72915, 126077, 12187, -61445, -35109, 8464, -23573, -97922, -34563, -4580, -74386, -62983, -12933, -45582, -63493, -8373, -130081, -154310, -143451, -21667, 68451, 34253, 95067, 107156, 112661, 32182, -34474, 29232, 76980, 138741, 105082, 53347, 64704, 53894, 72939, 94571, 91310, -25227, -43705, 72156, 75438, 193674, 169645, 15239]
12167A5239r3367R7509M8060p5838L3406J1555o9105m6552k3216m5742j1572N1129
12155a08494j2945k3333j09239p4085M8420R7215R2136N1487L0232P4460N4847
12144A20701r1367o0792K5958l122r7507m944L0340m992l5909O1400P3002M3674
12132E6442j2327J0696K2622q074K4130m6678q2146k9768K9338l8072K3251J2903
12120c7683m0831j5659J556l8471p680J13845P7756j8167j2678J1200N8575P8348
12108A70111J9984m844j01388K1331J48173j03778o8385j292R253k0143r9917
12097c0895j28829n1615q159M843P0556K3615J3129o2615N135K6224M1730K2834
12085g4047K7730M2578R0673K4877m2171m4288k2629j254k7057l5368M840Q1744
$$ y = [15239, -78128, 19381, 67441, -8397, 25009, 36564, -32541, -79093, -102309, -148051, -159623, -108494, -121439, -144772, -254011, -328096, -279676, -182461, -90325, -38838, -8606, 65854, 120701, 29334, -31458, -5500, -8622, -106129, -111073, -80733, -85725, -121634, -60234, 12768, 56442, 44115, 54811, 77433, 69359, 93489, 46811, -35335, -65103, -35765, -73837, -50586, -37683, -78514, -94173, -92617, -131088, -138768, -24923, 52833, 34666, 21988, 33188, 91763, 170111, 190095, 185251, 83863, 105194, 253367, 149589, 81204, 79912, 89165, 69022, -30895, -159724, -211339, -219498, -214655, -144099, -120484, -107355, -169970, -164835, -138611, -96881, -74047, -46317, -3739, 86934, 111811, 69640, 25352, 2723, 1469, -25588, -60956, -56116, 25628]
12073B5628l7034k0114k4325j2999M7995J1659m500l4048P7645L2842m2093p8765
12061e8109j4033L7737J09176N6320k0669l546n3555p2322j0954L5319O0987P4251
12049A40602j1507j17213o9556k1380O5994M8774k9637q3165m8503Q532M4371
12038g2688k3330N2488k7900N5066L5381K2091k6318p6588l1585j02604J6628
12027a79359M0063N8802J00724K0985K0301Q0188P1026p3777q1746P804m9176
12016A5835j6228l3508N3088j0004p2575o5178L963p3287P1330O2738K6254l5619
12004g3191l8386q090N3822R9425K9312J6712P5516j7298j7264o6141M4821k6923
11992G2315p4512j3487O7289L3850o241Q594l2458j00815k6064L9880n3704J0399
$$ y = [25628, -11406, -31520, -55845, -68844, -20849, -9190, -13690, -47738, 29907, 62749, 20656, -58109, -72142, -34405, 74771, 131091, 110422, 106876, 53321, -19001, -29955, 5364, 66351, 140602, 129095, 11882, -57674, -79054, -13060, 35714, 6077, -77088, -125591, -117059, -72688, -96018, -43530, -71430, -16364, 19017, 41108, 14790, -61798, -93383, -195987, -179359, -139296, -80494, 20230, 41215, 61516, 141704, 212730, 138953, 57207, 65011, 15835, -393, -33901, 19187, 9183, -63392, -128570, -124607, -197894, -126564, -63826, -37572, -73191, -111577, -119667, -65845, 33580, 62892, 79604, 155120, 137822, 120558, 54417, 99238, 72315, -2197, -15684, 51605, 85455, 79214, 87808, 55350, -45465, -71529, -31649, -85353, -74954]
11980g4954J24413M5722p4866n7036q3782o4223K1043J6721J12364J22560O6292
11969A54254P587k3679J3155K2698p6026j26104n087j4620q3095L5963Q5725O214
11957c015n0378l3256N0917k098o7404r5948P0578N5469L2740l0679K7430J4796
11945c0848r9583l464J6970k6409k1911M6804L1705j2858L184m11m4804L96O9106
11932g2123J16615O2054k412k6353o0693J2359l4056j08954l028j3975J7991N7314
11920e5261Q019K0902l8629Q174k9309l7450n327P1612M8159M9917R765J6428
11908F7000k6053l3072J10875M1568n6186p6568l3301J9065n7814n8180p4947
11897a77613R3900k0356j5165P8542J7082k7417m1274L0426L9646j064l6335j9850
$$ y = [-74954, 49459, 95181, 20315, -36721, -120503, -184726, -163683, -146962, -34598, 87962, 154254, 161841, 138162, 151317, 174015, 97989, -28115, -33202, -47822, -130917, -94954, -9229, -3015, -53393, -86649, -35732, -37830, -105234, -201182, -130604, -75135, -42395, -73074, -45644, -30848, -130431, -133895, -116925, -143334, -165245, -118441, -86736, -99594, -96410, -96821, -141625, -141229, -72123, 44492, 106546, 104134, 77781, 17088, 29447, -4609, -113563, -116591, -130566, -112575, -55261, -47242, -26340, -64969, -56795, -86104, -123554, -128881, -57269, -9110, 40807, 50572, 67000, 40947, 7875, 118750, 160318, 104132, 27564, -5737, 13328, -44486, -102666, -177613, -83713, -104069, -119234, -40692, -23610, -51027, -92301, -61875, -22229, -23293, -59628, -79478]
11885g9478j026J0226O467L7946N2007J02650L3876j6322r8301l7514Q9553Q2616
11873A82700N1278m0305k9180m909K8980o7958q6669K328k8885n6838j8027n800
11861g3285n320l8022N2677Q9845m9886k6018k675k6669M4502j7374J5971L5577
11849f77O3658J2608n4015n6037k9207k4987l9541k4522N8273R510N6675P4265
11837D6003Q274o1822k9673l6142O757J7356J31005K3232J8085j0783m9863j16328
11825e3899K0143j7619L9929l5395L047M8895O9132M1522r62p2843j77098K8210
11813a06938N4884N3466K3391P7590r9044r5669l7785o231k002m8125Q657j884
11801a79690J9428O9793J29796L970l5427K3M6011p7509o7821r7527J41445N3032
$$ y = [-79478, -80504, -70278, -63811, -25865, 26142, 128792, 162668, 146346, 48045, 10531, 100084, 182700, 233978, 193673, 164493, 159584, 188564, 120606, 33937, 36265, 7380, -49458, -67485, -73285, -78605, -116627, -63950, 25895, -23991, -50009, -52684, -79353, -34851, -52225, -36254, -677, 62981, 75589, 21574, -34463, -63670, -88657, -128198, -152720, -94447, -84937, -28262, 46003, 54277, -7545, -37218, -73360, -66603, -49247, 81758, 104990, 123075, 112292, 62429, -53899, -33756, -51375, -11446, -46841, -43794, 5101, 74233, 115755, 114793, 41950, -135148, -106938, -52054, 1412, 24803, 102393, 3349, -92320, -130105, -136336, -138338, -186463, -177806, -179690, -160262, -90469, 39327, 43297, 7870, 7893, 53904, -23605, -91426, -188953, -47508, 5524]
11789E524o1818r11o7110J3512J7164L4191R2601K1293j2858p260q758p345L5992
11776E4217J0345L971k2819N2173m670K2184l6204R671l5535q8362j1337K0968
11764b5398m3890l0291k3991j6007N8144J11874j9982O225J8828L157o7632l7166
11752f6129k3483Q3613O7888k3482J8705j5674L1518M1285k3066m1139M0009m955
11740H5090m7763j8089j3140K8312N881L3538k4526k0822M3690O9707l5783n391
11728A00704J5958j09373k1742M5267m7207Q6881j3215j6076Q4588r0096m0995
11717e306k826j391O4860M7025n6870p712K4372n0621o6476L1122k9448o2090
11705a15361L9345J04990l9702j06468R9939L1837J990K6985k6865l4313p2780
$$ y = [5524, -56294, -57205, -124315, -110803, -93639, -59448, 33153, 54446, 41588, 34328, 25570, 18225, 54217, 64562, 68533, 45714, 97887, 93217, 115401, 79197, 88868, 53333, -35029, -46366, -25398, -69288, -99579, -123570, -139577, -81433, 30441, 10459, 16684, 35512, 38669, -28963, -66129, -89612, -5999, 61889, 38407, 57112, 41438, 72956, 114241, 91175, 50036, 90045, 85090, 37327, 19238, 6098, 34410, 40291, 73829, 49303, 28481, 72171, 141878, 106095, 100704, 116662, 7289, -14453, 30814, -16393, 70488, 57273, 41197, 125785, 35689, -5306, -8132, -9523, 55337, 102362, 45492, 37780, 62152, 11531, -54945, -23823, -53271, -115361, -76016, 28974, -10728, -117196, -17257, 14580, 16570, 43555, 16690, -17623, -90403]
11694i0403K9823O8631o0363O8595m9072m5461J24999J7309N992L2892k3813J1454
11682I0583m8647k5850R9127O8374M6427K3825k7962j13989r2836R086P9112O780
11670A14030L2264m3911j357P35J0041p2736k1034M0308J0224K6801J1439l7493
11658F9311O2558K283n8555N753p6982k0631l8363n7506j9511L9848J37542J26220
11646A71967L7023j06333k9070K8642p1070j539q997K0604k6500j22Q5755L8871
11634A39231k3187j3990l0708M6006L1283L542j4848N71L3711N2141O1894j6328
11622B69318o2092m0821j16044j26160J04104J28025o7900n9561L2539L1114M6159
11611A38681m6989r8780M7508l851O7542J1011q2389m2093K8580M0l6856N0666
$$ y = [-90403, -60580, 8051, -52312, 16283, -32789, -78250, 46749, 64058, 70050, 102942, 79129, 90583, 41936, 16086, 115213, 183587, 230014, 253839, 225877, 111888, 19052, 28138, 107250, 114030, 146294, 102383, 101026, 101761, 111802, 39066, 18032, 58340, 68564, 95365, 106804, 69311, 131869, 134152, 75597, 81350, 4368, -16263, -54626, -112132, -131643, -91795, 45747, 171967, 208990, 102657, 73587, 102229, 31159, 29620, 20623, 41227, 14727, 14605, 100360, 139231, 116044, 102054, 71346, 117352, 148635, 152177, 137329, 137900, 171611, 223752, 285646, 269318, 207226, 166405, 50361, -75799, 28305, 156330, 88430, 28869, 61408, 92522, 138681, 91692, -7088, 40420, 36569, 104111, 115122, 32733, -9360, 19220, 19260, -17596, 33070]
11599C3070M5202J3026N2494O2459k8980p5203J8541M6470K6213j3279q2750q9155
11587H108P1023k4105m2488q778P1131J3762j9568p788l7657k4913M9895N4856
11575A03478k4704j8373k124J01908K1807p4394L2321K6760N1698L4127K2389
11564B74893p7288n5746k9182k8136l7055j1086m884M1048l2424L1933P9420K0728
11552A72221n5649N7185n5857q7749l3899r1146o852Q1982M8456O0128N4400k5192
11540A18028j5337l2549k9451p1107J07001Q7577k927O460j9257q4089K7865J0457
11528A02671l2915l6149k1862r424m4218J3525O6485J1506n1936j54314O5892
11517i0739J00663K0836Q0252M1352n7782l4201Q485R4160L370o3700L7787M2925
$$ y = [33070, 78272, 91298, 143792, 206251, 177271, 102068, 120609, 167079, 193292, 180013, 97263, 8108, 79131, 55026, 12538, 3760, 74891, 88653, 69085, 61297, 23640, -1273, 48622, 103478, 78774, 60401, 58277, 160185, 181992, 107598, 139919, 166679, 218377, 252504, 274893, 197605, 141859, 112677, 84541, 47486, 36400, 31516, 72564, 40140, 72073, 151493, 172221, 116572, 173757, 117900, 30151, -3748, -94894, -101746, -19764, 28692, 88820, 143220, 118028, 102691, 70142, 40691, -30416, 76585, 164162, 161235, 167695, 148438, 64349, 92214, 102671, 69756, 33607, 11745, 2321, -41897, -28372, 38113, 49619, -2317, -156631, -90739, 9924, 30760, 111012, 152364, 94582, 60381, 68866, 163026, 166396, 102696, 140483, 183408]
11505A83408Q654N5611J419L6718M0936r7583P992J07627R5560j5326L002J71848
11493E99866J32918J03867R8099K64182M39956L37670K01359K13075K36986K48387
11483B876365R4488l9483k49883k97377j54983k29918k57066k95882k26342k65970
11473I53949j04036j10265j07595o5212p8136N1233M079J2506j193q8352K8490
11462D95468Q968n5036j8999M2211J8948K3635m9251K6679L161k5787L1329n1711
11450D49615m9360m2368K7659M256j21417r1370p0208J0145M1235R037j7512k9330
11438A20382J3109M6936p7492q8391K6207O5870J623J3186N1p6615J8219J27931
11426A91016M1359J4220q358l0204m1568o2546m6867k8252j4260P9780P9262p2164
$$ y = [183408, 192062, 247673, 249092, 285810, 326746, 229163, 237155, 344782, 440342, 425016, 428018, 599866, 732784, 836651, 934750, 1198932, 1638888, 1976558, 2177917, 2390992, 2627978, 2876365, 2970853, 2931370, 2681487, 2384110, 2229127, 1999209, 1742143, 1446261, 1219919, 953949, 849913, 739648, 632053, 566841, 488705, 539938, 544017, 556523, 555330, 466978, 495468, 504436, 449400, 430401, 472612, 491560, 515195, 465944, 492623, 495784, 469997, 501326, 449615, 400255, 357887, 385546, 389802, 268385, 177015, 106807, 116952, 158187, 167224, 149712, 120382, 133491, 180427, 102935, 14544, 40751, 106621, 108244, 121430, 121481, 44866, 63085, 191016, 232375, 246595, 238237, 208033, 166465, 103919, 57052, 28800, 14540, 94320, 173582, 101418]
11414A01418L9168M2079l4931j12207L1291R1027m1942m0711N1191L2089J3782
11403A72254k1264j4647j4600N5028k6249l7924R8114k4487l4614K4245N1541
11392B27397R0419k6730p6672q7676K3214M8605l8963j1043M0298j22N0935N7923
11380B97585j4368j6876k416o7829J6342J21155p2813n3579J2771k1449l2893
11369A65630L2459K8054m1165k964M9399l421q0047k6279j21108J5353K5643N9237
11357A00791L8110k2762L0497L0435L1215j6294r541q4152k5940O4760m4097n3743
11345C9279R768Q4356K4489K2760L7538m0322l6682k6357N0283R8558L8966R179
11333C11815O1866j0266R7836j7427j7550o2410k2101m5001o9471l3834r0071
$$ y = [101418, 140586, 182665, 147734, 35527, 66818, 157845, 115903, 75192, 126383, 158472, 172254, 150990, 136343, 121743, 176771, 150522, 112598, 210712, 186225, 151611, 175856, 227397, 317816, 291086, 214414, 126738, 149952, 198557, 159594, 148551, 188849, 188727, 239662, 297585, 283217, 266341, 263925, 196096, 212438, 333593, 260780, 207201, 219972, 198523, 165630, 198089, 226143, 184978, 182014, 231413, 227992, 147945, 121666, 558, 15911, 41554, 100791, 138901, 116139, 146636, 177071, 208286, 191992, 182451, 98299, 72359, 137119, 93022, 39279, 49047, 133403, 157892, 180652, 218190, 177868, 141186, 114829, 165112, 263670, 302636, 311815, 373681, 363415, 461251, 443824, 426274, 363864, 341763, 296762, 227291, 193457, 103386]
11322A03386o2109L1063Q4051N1772p009p6784j0146o5911j9184L4766Q214K0367
11310I2476o0019M2496n0704m0272j3903P7777J10179J1590j01001p7587N2046
11299D3078P2687R1468j5609m3637p03J3505N767O0499K1509l6217m0784O1820
11287B33383r2911J304m0032l4932o556p4996p6293m990P1854J2372m898R57m781
11274b0519R6283R0331N3300O3699J88995Q5568L6725O1939l8877m7337N4324
11263F24431M6319L0676m7851r3078q7594R985j3107j4669m8286R665k411M3513
11251D57593m1473m3128J3515O1028r926l472K8867n6201m0411L5671R5479L5434
11239E32976m5051j18969j9828M5466k682o4952l4702P4216K1006K3644L8753
$$ y = [103386, 41277, 72340, 156391, 208163, 201154, 124370, 114224, 48313, 29129, 63895, 72109, 92476, 32457, 74953, 24249, -16023, -29926, 47851, 158030, 169620, 68619, -8968, 43078, 115765, 207233, 191624, 147987, 147284, 160789, 166556, 227055, 248564, 212347, 171563, 233383, 140472, 141776, 101744, 66812, 60256, -14740, -91033, -96023, -24169, -11797, -16695, -15738, -20519, 75764, 166095, 219395, 283094, 472089, 557657, 594382, 656321, 617444, 570107, 624431, 670750, 701426, 653575, 560497, 472903, 482888, 469781, 455112, 406826, 416491, 414080, 457593, 416120, 372992, 386507, 447535, 437609, 434137, 463004, 406803, 366392, 402063, 497542, 532976, 487925, 368956, 349128, 394594, 391912, 326960, 292258, 366474, 387480, 411124, 449877]
11228D49877P6176M4349K5231N3399l8600n1451m828n0988n8196R177J9296M5182
11216E18624J41484J98155J70591J35920J22491J60710R4240J06168J51034J89563
11206A988980N7842m8328J4788p2313j19104r2621j34589j40786o3311j24605
11196A265953j19222m3573k474L3033L1682J31146k527j32276k5453n3004L1648
11185A114933R3L1854j4197l1104k4871O5876J9736J3666N7004j2385p4777J2179
11173A158007N0170P8528O2965q612M2924N341j5014M3938J16051Q0727L1929
11162A646954O4411n095r2224m6988N3809M9824j2893K930j619J6631O1737M6135
11150A783612M4847o202L1886n9620j50325m4334J07169J67336M6079k5629N9738
$$ y = [449877, 526053, 570402, 595633, 649032, 610432, 558981, 554153, 503165, 444969, 454146, 473442, 518624, 660108, 858263, 1028854, 1164774, 1287265, 1447975, 1542215, 1648383, 1799417, 1988980, 2046822, 1998494, 2013282, 1940969, 1821865, 1729244, 1594655, 1453869, 1390558, 1265953, 1146731, 1103158, 1100684, 1133717, 1165399, 1296545, 1294018, 1161742, 1136289, 1083285, 1114933, 1115026, 1146880, 1132683, 1101579, 1076708, 1142584, 1162320, 1175986, 1232990, 1220605, 1145828, 1158007, 1208177, 1286705, 1349670, 1341058, 1383982, 1389323, 1374309, 1418247, 1534298, 1615025, 1646954, 1711365, 1706270, 1614046, 1567058, 1620867, 1670691, 1657798, 1660728, 1659109, 1675740, 1737477, 1783612, 1828459, 1822257, 1854143, 1794523, 1644198, 1599864, 1707033, 1874369, 1920448, 1894819, 1954557]
11139A954557P6489M6590P865n0394L5520K6487J11113Q5302M4461J14931J68967
11128B621888J06060O8779J16972J44245J54774J53997J43102J64394J55669J59471
11118C989351J51056K44095L18917K77716K50061L82494M28148N28377P59069
11109G329284Q62746R61402J142885J354993J474628J647806J823686J940327
11101A8537757K214308K332642K454276K829550L495780M302021N739573P610554
11093D9516461J0655350J6109248K4661185L6640678M9171223N5846817N5845372
11086B98446334N2274442M8903750N0217072M5496229K7221134N860683j6657602
11079E11762042k9828558k8356539l1110597m3112495n3744387o2339842n9112690
$$ y = [1954557, 2031046, 2077636, 2085501, 2035107, 2070627, 2097114, 2208227, 2293529, 2337990, 2452921, 2621888, 2727948, 2796727, 2913699, 3057944, 3212718, 3366715, 3509817, 3674211, 3829880, 3989351, 4140407, 4384502, 4703419, 4981135, 5231196, 5613690, 6041838, 6570215, 7329284, 8192030, 9153432, 10296317, 11651310, 13125938, 14773744, 16597430, 18537757, 20752065, 23084707, 25538983, 28368533, 31864313, 36166334, 41905907, 49516461, 60171811, 76281059, 100942244, 137582922, 186754145, 242600962, 298446334, 350720776, 399624526, 449841598, 495337827, 522558961, 528419644, 511762042, 481933484, 453576945, 422466348, 379353853, 325609466, 263269624, 204156934]
11072B04156934m4312665l0237577k0786442j4785521j0861168q200002o327659
11065F8645900n246611m415696l888026l568086l111640k804280k507859k262197
11057D0841505k018919j906525j757208j569194j385119j017346q84657q40487
11049B9462050p46394p52625n85794m33788l52726l68621l72242m18811m29506
11040B5001543l17109n45287n65789o12862n92356o29468o69476p70655r72933
11031A9325608r05379q08017p36641o65654n86962n08561m65879k54306j69940
11022A4224269k08645k26706j15431r4155j25076k08005j92835k27941m18395
11013A2407080m76219n47624n21434n21770n66074n13472m97643n54358l71294
$$ y = [204156934, 159844269, 129606692, 108820250, 94034729, 83173561, 74973559, 68645900, 63399289, 58983593, 55095567, 51527481, 48415841, 45611561, 43103702, 40841505, 38822586, 36916061, 35158853, 33589659, 32204540, 31187194, 30302537, 29462050, 28715656, 27963031, 27377237, 26943449, 26590723, 26222102, 25849860, 25431049, 25001543, 24684434, 24139147, 23573358, 22960496, 22368140, 21738672, 21069196, 20298541, 19325608, 18420229, 17612212, 16875571, 16209917, 15622955, 15114394, 14648515, 14394209, 14224269, 14015624, 13788918, 13673487, 13579332, 13454256, 13246251, 13053416, 12825475, 12407080, 11930861, 11383237, 10861803, 10340033, 9773959, 9260487, 8762844, 8208486, 7837192]
11004G837192k67899l43312l16865k76056k15262j35589j91786k00167k17712
10995E672544r8645j42372j86416j64591j52286m2637p6269j42618j00632j87048
10985D379030q3472o9919k15645j21854k8570K4091j51237k48683j50209r4338
10975C239194n7935l9381r6492n2541j6567k1100j26180o9884j04172j50660j47019
10964B357263j58294j49179k08811j15218j23988j37188j00496j61870j73130
10955A029089p6637L2090m4579m8941L8068N4955J00982J11492N0404j2301J4952
10944A249574j2183k1199j5913j15372J9734O5011l2049j73666k4376J8300J9183
10933I77044p3448q8360J1626O3329J1560n4320q5591L7438J35772O950m5749
$$ y = [7837192, 7569293, 7225981, 6909116, 6633060, 6417798, 6282209, 6090423, 5890256, 5672544, 5573899, 5431527, 5245111, 5080520, 4928234, 4885597, 4809328, 4666710, 4566078, 4379030, 4295558, 4225639, 4009994, 3888140, 3859570, 3883661, 3732424, 3483741, 3333532, 3239194, 3181259, 3141878, 3045386, 2992845, 2976278, 2955178, 2828998, 2759114, 2654942, 2504282, 2357263, 2198969, 2049790, 1840979, 1725761, 1601773, 1464585, 1364089, 1202219, 1029089, 952452, 984542, 939963, 891022, 929090, 984045, 1085027, 1196519, 1246923, 1234622, 1249574, 1237391, 1216192, 1200279, 1084907, 1104641, 1169652, 1137603, 963937, 939561, 957861, 977044, 903596, 815236, 826862, 890191, 901751, 847431, 761840, 799278, 935050, 942000, 896251]
10922H96251l0372j57739m1478K6488m3731K3098j1227l3120L3873K7385K3665
10911G13093M2657j51832j21429k2437k576j793j0140p6021m7811M7351N3166
10900D22228Q3474L0147j2727q688m2349Q3162L5352l5770J30188M8503m9261
10889F84259q788j7976J08349J09703P2161j6403O397l4248m2442n0388p3494
10878G37130l0122N8477j7976p21q5946K1513j15460q2083l7539J383k0417J3759
10866D41998R9880j8437l4912m1242N4866p68j6386N1748L0879J5587J4969J4576
10854F12758p7534n8940J6035J4475j7723j5523J16387N0373l7936l0162J22474
10843F94684K6239L5553n974j32874k9351j6661j2754o3095m0547j6736J0313
$$ y = [896251, 865879, 708140, 666662, 693150, 649419, 672517, 661290, 628170, 662043, 689428, 713093, 755750, 603918, 482489, 460052, 457476, 455683, 445543, 369522, 321711, 369062, 422228, 505702, 535849, 523122, 514434, 472085, 555247, 590599, 554829, 685017, 733520, 684259, 675471, 657495, 765844, 875547, 947708, 931305, 937702, 903454, 861012, 810624, 737130, 707008, 765485, 747509, 746788, 660842, 682355, 566895, 484812, 447273, 448656, 428239, 441998, 541878, 523441, 488529, 447287, 502153, 501385, 484999, 536747, 567626, 583213, 598182, 612758, 535224, 476284, 492319, 506794, 489071, 473548, 589935, 640308, 602372, 572210, 694684, 720923, 756476, 750502, 617628, 588277, 571616, 558862, 495767, 455220, 438484, 448797]
10832D48797J1573K9727n4252j00894l0753Q8893J19683n0170p4948P5697l6129
10821D27224q2593l6314k907J9169p423p7582k4390K3896n6259L6027K8554j6575
10809B30827L597J2592m4677O744N2216j6472l0454J6371L4403m2536p9107K1524
10797A65028J8792k3882R513l3803Q198j8828r8699J2954J5135J16147Q2164n4163
10785A98556N154m1600q6877N584o4842J4599N2596K8646p465L5890l3703K5485
10773A32023m6346o2205O6514M8301J7319O717P5766r8343j11997o8653L7033
10762c871R6158j652N0197j4667O58M6470m3133J849j0256N0898j9472M7616Q864
10749B09659Q552n2874m9031Q686l3074n8325q306O9286R0006m5312L1617l4222
$$ y = [448797, 460370, 490097, 435845, 334951, 304198, 393091, 512774, 462604, 387656, 463353, 427224, 344631, 308317, 305410, 324579, 317156, 239574, 215184, 239080, 182821, 218848, 247402, 230827, 234424, 247016, 202339, 209083, 261299, 244827, 214373, 230744, 265147, 222611, 143504, 165028, 183820, 159938, 169451, 135648, 143846, 125018, 26319, 39273, 54408, 170555, 252719, 198556, 203710, 162110, 75233, 80817, 15975, 30574, 83170, 111816, 104351, 140241, 106538, 132023, 85677, 23472, 89986, 138287, 155606, 162323, 238089, 139746, 27749, -40904, -3871, 92287, 90635, 140832, 126165, 126823, 173293, 130160, 132009, 121753, 172651, 153179, 200795, 209659, 218211, 165337, 116306, 124992, 91918, 33593, 25287, 94573, 184579, 139267, 170884, 136662]
10737A36662M367k428o745P5296M4873n1705p9929j0366J04674K4119o727j5309
10725B16782l4864k9389j3358k6309o018o888p9384k8641J19097K9724j9801p61
10713A20190l4409l5350O3097m038l8684M0930K72j1177k6699n400m2607j0983
10701A5142O0968L4775M5634l987p2065m4359M9026m8207j989L9068m601K7495
10689I6900O4023K6704Q9805O6802L3912J91828K04561K34286K71738K81834K61867
10678A824260L20554K98257K39955J37783M4390k7900j90895j38262k06302j48361
10668B153479k32914l20759k99802k92202k54364k36939q7757O7891N3201m4226
10658E05608o8713N1337j8497j03807n284N5914P5907j22737j06732K635R997
$$ y = [136662, 141029, 138601, 131856, 207152, 252025, 200320, 120391, 110025, 214699, 238818, 232091, 216782, 181918, 152529, 139171, 112862, 106844, 99956, 20572, -8069, 111028, 140752, 120951, 120190, 85781, 50431, 113528, 109490, 70806, 111736, 112008, 100831, 74132, 68732, 26125, 15142, 76110, 110885, 156519, 152532, 80467, 36108, 85134, 36927, 34938, 74006, 69405, 96900, 160923, 187627, 277432, 344234, 378146, 569974, 774535, 1008821, 1280559, 1562393, 1824260, 2144814, 2443071, 2683026, 2820809, 2865199, 2837299, 2646404, 2508142, 2301840, 2153479, 1920565, 1599806, 1300004, 1007802, 753438, 516499, 428742, 496633, 549834, 505608, 436895, 488232, 469735, 365928, 360644, 416558, 492465, 369728, 262996, 265631, 275628]
10647B75628m2277k6954j0122k1483j0251M2927M7803P8499J09313r1575k12107
10636A39401m7790K8336L9922L3386J8991j01429j2440q9581L3338R5435N4081
10625A91650j1816O4030J3050l7893J1784O2038l4910J839j0085o9414o6443K5208
10613A39038J4133k2116m9375Q8576Q3436R663q3644K5061J0360n2629M401p6007
10601I0897n5594Q2351M6360K6380j09432j06575o5167M9008M8536M9839K1022
10590G7625k8159q5402J22462Q5843p2874l6909L5663K2207m0632K6906m9246
10579E7484j80388L6036M0244m4814Q9560J35395j6692j3604k0692j8709LK336
10567F6159m2070m0811n1303j14185J04423R9008l5015K6942J153L2082p0102
$$ y = [275628, 233351, 206397, 196275, 174792, 164541, 207468, 255271, 333770, 443083, 351508, 139401, 91611, 119947, 159869, 193255, 212246, 110817, 98377, 8796, 42134, 137569, 191650, 179834, 243864, 256914, 219021, 230805, 292843, 257933, 259772, 249687, 180273, 113830, 139038, 153171, 131055, 81680, 170256, 253692, 263355, 179711, 204772, 215132, 162503, 166904, 90897, 35303, 117654, 164014, 190394, 80962, -25613, -90780, -41772, 6764, 56603, 77625, 49466, -35936, 86526, 172369, 99495, 62586, 98249, 120456, 79824, 106730, 57484, -122904, -86868, -46624, -91438, -1878, 133517, 116825, 103221, 82529, 63820, 63823, 66159, 24089, -16722, -68025, -182210, -77787, 21221, -13794, 13148, 14301, 46383, -23719]
10556b3719j04563N6843P6646o5473M2508M1481L2059J7113M5464m3526q131q4962
10544a8260M2595Q057k9745p4450M985Q1175J0761p588L4005P9695K0031m8929
10532A02332J45818k2371j67396l7669K2361j12026k4554R8336R8001J6177N396
10521A24405m2704l5604n274k7375m2307K7950N02O869P1389k4305n6450M7888
10509D4984N919n1278o0607p5084L9064Q8171j0252M518k2287J7671R9429k1669
10497E8579L5160L2456J2436n4472K191n6646p1638K1967Q5929R5l8701k0719
10485F637n7728m1565J17236r492q8173N1753Q9156L1472j14859k1699k576M4539
10473D701M8116m118k1949L5187j1518o9427J0202L3002J6406m1749m476L1219
$$ y = [-23719, -128282, -71439, 5207, -60266, -17758, 23723, 55782, 72895, 118359, 74833, 66702, -18260, 24335, 32392, 2647, -71803, -66818, 14357, 25118, 17530, 51535, 131230, 151261, 102332, 248150, 225779, 58383, 20714, 43075, -68951, -93505, 4831, 102832, 119009, 124405, 81701, 46097, 40823, 13448, -28859, -909, -407, 6462, 77851, 53546, -2904, 44984, 50903, -375, -60982, -136066, -97002, -8831, -19083, -14565, -36852, -19181, 80248, 58579, 93739, 126195, 138631, 84159, 86350, 29704, -41934, -19967, 65962, 66057, 27356, 6637, -51091, -92656, 24580, 15088, -73085, -21332, 67824, 99296, -15563, -37262, -39838, 4701, 52817, 48699, 26750, 61937, 50419, -19008, -8806, 24196, 40602, -1147, -5623, 25596]
10461B5596l3641k5210L3025R7813j5945l202O362k3572o6263j9866R962O9715
10449E4774M3880K25m2573L8868L3197j7956p3089j0871M6174M2103K7424q5293
10437E6863q0963k1217J18811L3080R50o3049Q450R3059m9717n5437J9007k7063
10425C2774r2101r128l2273L9106J25716R8592n6771m6090L4832k9775j0481j14973
10413f0572K0280R23o4901r654M0800P588O7241j0428p2928K0435M4954M7135
10401C0873K758K5069j8295r718r8581O0731J08800j4076m3968n9534M4695m743
10389B4011k7125m9254k6114M1430O4049m0067r752M7617R5756j3678n0898j518
10377E4457n3309m6441M0540J37878N5876j4446m4070k8479j25787j6298l5600
$$ y = [25596, -8045, -33255, -230, 97583, 81638, 78436, 84798, 61226, -5037, -24903, -14941, 54774, 98654, 98879, 56306, 95174, 128371, 110415, 37326, 26455, 72629, 114732, 142156, 56863, -24100, -45317, 73494, 106574, 107524, 44475, 52925, 145984, 96267, 40830, 59837, 32774, -59327, -68455, -100728, -61622, 64094, 162686, 105915, 59825, 94657, 64882, 54401, -60572, -40292, -39369, -104270, -113924, -73124, -65536, 1705, -8723, -81651, -61216, -16262, 30873, 33631, 58700, 40405, 30687, -67894, -7163, 101637, 87561, 43593, -15941, 28754, 24011, -3114, -52368, -78482, -37052, 26997, -13070, -22822, 24795, 120551, 106873, 55975, 54457, 1148, -45293, -4753, 133125, 189001, 174555, 130485, 102006, -23781, -40079, -75679]
10366g5679N150J30852P0934j8591l1537n1477j6251Q9614P6914Q2249n6674J0755
10354B16259o3364q6656j3908m0789m973l3951P3935R2476M0233Q6001p1089J3401
10342B07575N1643k6257j13313J1356k0712o5805M1662K9017N1394j16828j32859
10331h3127J8462J04250n0982m0653J2371M3770J5200k3715Q5625K5038L3325
10320A39564J256r7977j07022n2408Q2132R9097n6277r2810j2356K0382k4329
10309a00748O5449O5181M2597L0915L0434j3198l5177L1496j5242q6873k9858
10298a5024K1532o8736P7779L2352J6658L3778L1638R402p4790q2329p8408J8697
10286g7451J03230N4677q0884l9456K6579M7852O3548N517o715n113r0629l3429
$$ y = [-75679, -70529, 60323, 131257, 112666, 81129, 29652, 13401, 103015, 179929, 262178, 205504, 216259, 152895, 66239, 52331, 11542, 6569, -27382, 46553, 139029, 179262, 265263, 194174, 207575, 259218, 232961, 119648, 131004, 110292, 44487, 86149, 115166, 166560, 49732, -83127, -64665, 39585, -11397, -52050, -39679, 4091, 19291, -4424, 81201, 106239, 139564, 140820, 42843, -64179, -116587, -34455, 64642, 8365, -84445, -96801, -76419, -100748, -35299, 29882, 72479, 103394, 133828, 120630, 85453, 116949, 101707, 14834, -15024, 6508, -62228, 15551, 47903, 64561, 98339, 129977, 139379, 64589, -17740, -96148, -77451, 25779, 80456, -428, -39884, -13305, 34547, 98095, 103612, 96897, 91784, 1155, -32274]
10274c2274J6362m1924o5855N0011O4206k4376j6493J17092Q2989m2190l7188
10263G0360q8511L7463J5133O5789l132n9190q7699N4856K9765K7526j344m2153
10251A8863l2780m4214m3003l002l8250P8128K0961N7592O5102Q625m8041o1866
10239b1885q1904m9924M7092J23161L0045m7715L4344k5550N1595Q5996j2337
10228A32918j11597l0928J16203Q58M1497l855n2738M1946M6668M5199m5526n441
10216A75204q1918o0440J372j7760p9285j2830m5501l9401O1977L0442m4034o9897
10204a82071N4258Q440L3560R949J0288N7458J43852l5562K0353l1220p9030r6816
10192h6541o8719O2313R3490j759l1807P863O301m6307o1118L5231J72058K7528
$$ y = [-32274, -15912, -57836, -123691, -73680, -9474, -33850, -50343, 66749, 149738, 107548, 70360, -18151, 19312, 34445, 100234, 97102, 37912, -49787, 5069, 34834, 62360, 61016, 18863, -13917, -58131, -101134, -104136, -142386, -64258, -43297, 14295, 79397, 88022, 39981, -21885, -103789, -153713, -106621, 16540, 46585, -1130, 33214, 7664, 59259, 145255, 132918, 21321, -9607, 106596, 107454, 148951, 145096, 92358, 134304, 180972, 226171, 180645, 175204, 93286, 32846, 34218, 16458, -62827, -75657, -121158, -160559, -98582, -68140, -112174, -182071, -127813, -119373, -85813, -75864, -65576, -8118, 135734, 100172, 120525, 89305, 10275, -86541, -155260, -92947, 543, -1216, -33023, -25160, -18859, -65166, -126284, -91053, 81005, 108533]
10180A08533l7517Q381m649J4411k4267q5294N4158O1456K5919j9592k1527q7867
10168g855n3237L4620J64742L7942l0025r206K9033l0740k2222l567O2875l7795
10156A34565j30257k7613K744K5720L2436k0425O30K9516J9173m5245o3097l8606
10144h0459P56k1577m1749J02944j8276L4690q0355q9198j3480J8610K5560O3243
10132i9291q69L7961K5978j4307p577O3911N9522j0108q8917j1733k9861o587
10120h1878K8182k8561O8984J22670N720n9001p5546p596K3564m0558k277m6292
10108i2589o960M2926N1832j0853j9949L0804Q9192J5903k3889L4715j6034j9022
10096G6076k5515l1479p3149j1108J01678L8778q0457j7681J1211o1666K1255
$$ y = [108533, 71016, 79397, 74748, 89159, 64892, -20402, 33756, 95212, 121131, 101539, 80012, -7855, -61092, -26472, 138270, 176212, 146187, 136981, 166014, 135274, 113052, 109485, 172360, 134565, 4308, -23305, -20561, 5159, 37595, 17170, 17800, 47316, 66489, 21244, -41853, -80459, -79703, -101280, -143029, -40085, -58361, -23671, -104026, -193224, -206704, -188094, -162534, -99291, -100160, -62199, -36221, -50528, -58105, 5806, 65328, 55220, -33697, -45430, -75291, -81878, -53696, -82257, -13273, 109397, 115117, 56116, -19430, -27026, -3462, -44020, -46297, -92589, -99549, -56623, -4791, -15644, -35593, -4789, 84403, 100306, 76417, 111132, 95098, 76076, 50561, 19082, -54067, -65175, 36503, 75281, -5176, -22857, -11646, -73312, -52057]
10085e2057P8398M0872K4758m5740m0567l4373N6910J16344M9872J8869j8676
10074A94610l4212l3909l2442R413M6024p8239m4899N9909J40978J16973P3793
10063D17999P4499J54036N16132Q68371R83692N02115K10330J69801J94283L78275
10053D469533l78416j229815r70077n12482k87031j62584j63614j09545j09735
10044E46234j49924n3598r0365L7759k3731j39807m7522P8471J13014m2966J3019
10033B40584L8771m7424o3770l1917j2452J354m1364J05596O7488L1313k4952
10022B63227j18389l661K9761k1633n8202o3203j4880K3637M4463P3865P1166
10011B26151K608o5169l7450m1254K8959o3906r669R1963P9502j06740m7446O8062
$$ y = [-52057, 26341, 67213, 91971, 46231, 5664, -28709, 28201, 144545, 194417, 213286, 194610, 160398, 126489, 94047, 103460, 149484, 71245, 26346, 86255, 227233, 344206, 417999, 492498, 646534, 1162666, 2031037, 3014729, 3516844, 3727174, 3896975, 4091258, 4469533, 4091117, 2861302, 1891225, 1378743, 1091712, 929128, 765514, 655969, 546234, 396310, 342712, 252347, 290106, 266375, 126568, 79046, 157517, 270531, 227565, 240584, 279355, 231931, 168161, 136244, 123792, 125146, 83782, 189378, 256866, 288179, 263227, 144838, 141177, 170938, 149305, 91103, 27900, 13020, 36657, 81120, 154985, 226151, 228759, 163590, 126140, 84886, 113845, 49939, 40270, 132233, 211735, 104995, 57549, 125611]
9999A25611m2328o6829R094k3281m4630M1152j0185k5270j4327l1366K5502J9182
9987c7675m720l5668K6779P3774R9562o6283o2300L7150k0565k1061J7946Q4886
9975I1825O8710q320m2622p3855o42M5401l7043M1071L6999r375p2077m5279k4991
9962c0198K7683k5074M7585Q1083m4493p5923K1320O5689j6605p2875j9606Q8256
9950D6842O0185m5566o0582l510R5576k0656L14M2016J6650L2202K4786k6693
9938A61564k7513n8247j1436j6080l6891l9125k9408M5601K3005m7419M7169K1530
9926C2750L5242L1347m3515j8222q258j01367l1850N9862K5624R3871Q4160J653
9914A61297n1616o5298M5261o560q8732k6004K9091l3743N9147m9116m2723l3602
$$ y = [125611, 83283, 16454, 25548, 2267, -42363, -1211, -11396, -36666, -50993, -82359, -56857, -37675, -42395, -78063, -51284, 22490, 122052, 55769, -6531, 30619, 10054, -11007, 6939, 91825, 160535, 152215, 109593, 35738, 35096, 80497, 43454, 84525, 121524, 112149, 40072, -5207, -30198, -2515, -27589, 19996, 101079, 56586, -19337, 1983, 67672, 51067, -21808, -41414, 46842, 107027, 61461, 879, -2631, 92945, 72289, 72603, 114619, 131269, 163471, 188257, 161564, 134051, 75804, 64368, 48288, 11397, -27728, -57136, -11535, 11470, -35949, 11220, 32750, 67992, 99339, 55824, 37602, 29344, -72023, -103873, -44011, -18387, 75484, 159644, 161297, 109681, 44383, 89644, 83084, -5648, -31652, -2561, -36304, 22843, -26273, -68996, -102598]
9902a02598K120K9912j6100l6852J7436M9321N5808K6977m78m3732J6133j983
9890d036N096M9621q627k2936j6113M6377m4724M807Q9737K3684n9935k9220l1032
9877B699K8073J4998m5359o7225k205k1278j172L99N5177k303k6580P6890J1214
9864B3328M455M2106j4015o2467N6631J6689j0033n3657Q5249j3465o6117N2088
9852F0792k010o0439j0756K8428M164j4801l6976J4000J00513J60p8703l0100
9840b5728M3857l3903k2449R848K0547K3949o8039J3746M7884k5481K6336R6994
9828A07561l7873p9503M966O1782P8829K9185l7972m4448j6767J8335l9790L1627
9816G5932q224l0989M3662N3955K1030l2962j04414m4712M8286O6486m6097j5324
$$ y = [-102598, -100478, -70566, -86666, -123518, -106082, -56761, -953, 26024, 25546, -18186, -2053, -4036, 1060, 50681, 42054, 19118, 3005, 49382, 4658, 9465, 99202, 122886, 62951, 33731, 2699, 30772, 45770, 411, -66814, -69019, -90297, -91469, -91070, -35893, -38196, -64776, 12114, 23328, 27783, 69889, 55874, -6593, 50038, 66727, 56694, 3037, 88286, 74821, 8704, 60792, 58782, -1657, -12413, 16015, 20179, 5378, -31598, -17598, 82915, 83075, 4372, -25728, 18129, -15774, -38223, -28375, -7828, 16121, -51918, -38172, 9712, -15769, 10567, 107561, 69688, -9815, -4849, 56933, 135762, 164947, 126975, 82527, 65760, 84095, 44305, 75932, 67708, 36719, 80381, 134336, 155366, 122404, 17990, -26722, 21564, 88050, 41953, 26629]
9804B6629q0682o6920M4473J21506M2736L6936N915j14492J6517q1735m6996P5797
9792b0316J4154J5597O3976L4375m0895o2560n1766L5101J8222o0770O4026q45
9780H299l8722n3575K7850R4230L4886j5005K287k5289L1366k1192J02766N6269
9768B04170k3187j9512l0592L403L3010k5793j30287m3031Q0901l5095m5262n7396
9756h8671k8615M5211Q7511o37j9156n4899O971o687N1459L0707J0695M3625p481
9743G0033L1601l5659r2530M9113O3353o643p0867O1254K0802j6274m8866O8658
9731I3975L5562l228j0324m7549j6548K1499j3214k7883M184p02R270K2029j09348
9718d2277m4116n7739J4881N5086J6157k9736N2570J10504K8278k7216q2226j6310
$$ y = [26629, -54053, -120973, -76500, 45006, 87742, 124678, 130593, 16101, 32618, -49117, -96113, -20316, -6162, 9435, 73411, 107786, 66891, 4331, -47435, -12334, 5888, -54882, 9144, 8299, -30423, -83998, -56148, 38082, 72968, 57963, 60250, 34961, 66327, 45135, 147901, 204170, 180983, 161471, 130879, 134282, 167292, 141499, 11212, -31819, 49082, 13987, -31275, -88671, -117286, -72075, 15436, 14799, -4357, -59256, -52285, -58972, -7513, 23194, 33889, 77514, 70033, 101634, 65975, -26555, 22558, 85911, 79268, 8401, 69655, 90457, 74183, 25317, 93975, 129537, 126309, 115985, 68436, 51888, 73387, 60173, 32290, 36474, 35772, 45042, 67071, -42277, -86393, -144132, -129251, -74165, -58008, -87744, -35174, 75330, 103608, 76392, -5834, -22144]
9706b2144l0633p7342k426J8388q5163L7992J13503r816m0235J942j5747j9295
9694a30976j4740K8296L1448k0646J05884J7767L36l8067j14991k5675R7079K7519
9682c6766m8533l12J51838M7647J6642L2212n5623J4241k5457L4543o572n8275
9670F5585q227M4333l9952j06606J4952L6603n2942L4457K3511j0441N2182J7222
9658G0677K4849j7996n3601m1879p6096O3202K7286o8390J6277R7025L3570l2581
9646D2343m9105l7104k8244l0566m046R6157P1336o3617O99J8187m995M2926O4277
9633A18248k2195j16925m3563K9523K0505n6220R3224J71197N559o9631J1796
9622A41518K0405q678J0831m5452o1834K6260J5109M1455q9497j01049P929J48240
$$ y = [-22144, -52777, -130119, -132545, -114157, -199320, -161328, -47825, -57641, -97876, -95934, -111681, -130976, -145716, -117420, -85972, -106618, -734, 17033, 17369, -20698, -135689, -161364, -64285, -36766, -85299, -85611, 66227, 113874, 130516, 162728, 107105, 121346, 95889, 130432, 123860, 65585, 57358, 101691, 61739, -44867, -29915, 6688, -46254, -11797, 11714, 1273, 53455, 70677, 95526, 77530, 23929, -17950, -94046, -30844, -3558, -71948, -55671, 41354, 74924, 42343, -6762, -43866, -72110, -102676, -106722, -10565, 60771, -2846, -2147, 16040, 11045, 53971, 118248, 96053, -20872, -64435, -34912, -14407, -70627, 22597, 193794, 199353, 129722, 141518, 161923, 153245, 164076, 118624, 56790, 83050, 98159, 139614, 50117, -50932, -43003, 105237]
9610A05237P8046j65092q0037M1903j9199l8951R0646P063J4810n733L7501l0690
9598C5504L1673m5228q9431k2491q0452n0999M0461K7988j2198j4697O4556O0307
9586e5007K1775O4927R0071n66J044l5596m7453N0839j3648r9908o0939J16523
9574C2062Q025m9645L9240N5035Q421j6967k5434R609L9717q5289p9316J2338
9562e2204N5851M3575J1473p0594o6518j6025L0879P5794n086Q8540J182J2684
9550A09551q5803m3441J6806k1258P8345j7595m1949J05K6561l225j2576m8378
9538d2857P0198O1039p5472j4315M8354q1524n1590L6880J01564L2023o1723J5023
9526C7600n7250K5707j8741o0439N1846O7580J2624j23341k7108K9353L3091N7170
$$ y = [105237, 183283, 18191, -61846, -19943, -39142, -78093, 12553, 19616, 34426, 28693, 66194, 35504, 67177, 21949, -67482, -89973, -170425, -221424, -180963, -152975, -165173, -179870, -115314, -55007, -33232, 31695, 121766, 121200, 122244, 86648, 39195, 90034, 76386, -23522, -84461, 32062, 40087, -9558, 29682, 84717, 93138, 76171, 50737, 60346, 100063, 14774, -64542, -52204, 3647, 47222, 58695, -11899, -78417, -94442, -63563, 12231, 7145, 95685, 96867, 109551, 23748, -19693, -2887, -24145, 54200, 36605, -5344, -5239, 21322, 18097, 5521, -42857, 27341, 88380, 12908, -1407, 46947, -34577, -86167, -49287, 52277, 84300, 22577, 37600, -19650, 6057, -12684, -73123, -21277, 46303, 58927, -64414, -91522, -62169, -29078, 28092]
9514B8092k105n9484j1063K6067L8125M0384N4511L5084o2183L505o6088p1308
9502d6463L5995M2955J972k372l7282n7890k1703K1818l3236J7853J10688J12481
9490A44816o5837q8952L2398l9822j9036J120R8538k3160m0437m6488j4996m7654
9478a09510J8895R5838Q8984j7945n9146P2810P05n167n0750R528N0480j7149
9466G7573o5187J5874m1087j8116K0294n1899j560q028J3411j7660N3494M8885
9454B5994q722Q0552J7638p9134j7175p319J1154O0560j2527p5682J1941l6861
9442b9581l2053J00240L9154m4885o3015k2123P1761P4972J4971J3805L8401J0378
9430A72025l14m5839j3312n1057K8219L3p6688m5414o5354M15R429J54581P1011
$$ y = [28092, 25987, -33497, -44560, -18493, 19632, 60016, 114527, 149611, 87428, 90933, 24845, -46463, -10468, 32487, 34459, 32087, -5195, -63085, -84788, -62970, -96206, -78353, 32335, 144816, 78979, -9973, 22425, -17397, -36433, -35313, 63225, 40065, -372, -46860, -61856, -109510, -90615, 5223, 94207, 76262, 17116, 89926, 90631, 85464, 34714, 44242, 94722, 77573, 12386, 28260, -12827, -30943, -10649, -62548, -64108, -72136, -58725, -76385, -22891, 25994, 17272, 97824, 115462, 36328, 19153, 11834, 22988, 83548, 71021, -4661, 7280, -29581, -61634, 38606, 77760, 32875, -30140, -52263, 19498, 94470, 109441, 123246, 161647, 172025, 171711, 125872, 112560, 61503, 89722, 89755, 13067, -32347, -97701, -97286, -87857, 66724, 137735]
9417A37735m0782N69m8275J49295N0692P979o2366o5580q3041q3517O2098n5988
9405c1181R175J5789m2919k4265M652N6347Q244P681O8215R912m4321L2936J6161
9392H6426n1153n8441k2846N1171K2101m2818K5635m7970k6394K9140n3453K9574
9380e9028O5404J03584J05053n8267J3924j3641l8500k7404O5435k5910J1499
9369A42149Q5034K2888j73306m1650k9635N7990N8282N7714m858K1241m9868n4906
9357I1075K8180N1146P5047K7186L23k7135r2171j02260K0868j6982K9235L1850
9345A16362K4355K5616K831P0471m9690J1301n6956k8977L6886J2499O0610M9721
9333B75029l17l1231k1512K3231m1290m1133j6880j1831l4593N3531J5824J288
$$ y = [137735, 96953, 97522, 49247, 198542, 249234, 257213, 194847, 129267, 46226, -37291, 24807, -31181, -22006, -6217, -49136, -73401, -68749, -12402, -4158, 3523, 71738, 81650, 37329, 70265, 86426, 35273, -23168, -46014, 5157, 27258, -15560, 10075, -37895, -64289, -35149, -88602, -59028, 6376, 109960, 215013, 156746, 170670, 157029, 118529, 91125, 156560, 130650, 142149, 227183, 250071, 76765, 35115, 5480, 63470, 121752, 179466, 174608, 195849, 145981, 91075, 119255, 170401, 245448, 272634, 272957, 245822, 153651, 51391, 72259, 55277, 84512, 116362, 140717, 166333, 169164, 239635, 189945, 201246, 144290, 115313, 152199, 164698, 225308, 275029, 274712, 243481, 221969, 245200, 203910, 162777, 145897, 134066, 99473, 153004, 168828, 170116]
9321A70116K3367Q293o8382p1008O4347Q9202N1929m2682k2063l5479Q7537P0908
9309C26085k5901j31617l0129P2911M561J6103M0733J06456M5774M353q8743j59272
9297A81314L9439N9675M370L5231Q5599M2067p260q2869q9774l1842M6030K0364
9285C02344j43K2419P0364O1482n5665n2488q7574k8415N32O6450J19472k392
9273D16386j8802R8828N3593j03050m193M4705j4931n8466J00083N8021N75M5969
9261F18718n8575M9887P3081l9150j9946o20k5798L0240O3414o9447L0163J63575
9249H15542L4247j04157k2073J07418P4129k5695L4741Q3315l7933p571K5585
9238I77548P7362M9017J6544M2689P1983J4336J5496L5502L2931q720P4925J20394
$$ y = [170116, 193483, 201776, 133394, 62386, 126733, 215935, 267864, 225182, 203119, 167640, 255177, 326085, 300184, 168567, 138438, 211349, 215910, 232013, 272746, 379202, 424976, 429329, 340586, 181314, 220753, 280428, 284798, 320029, 405628, 447695, 440435, 357566, 267792, 235950, 281980, 302344, 302201, 324620, 394984, 456466, 400801, 348313, 260739, 232324, 232856, 299306, 418778, 416386, 397584, 496412, 550005, 446955, 442762, 487467, 472536, 414070, 514153, 572174, 572749, 618718, 560143, 610030, 683111, 643961, 624015, 623395, 597597, 627837, 691251, 621804, 651967, 815542, 849789, 745632, 723559, 830977, 905106, 879411, 914152, 997467, 959534, 951963, 977548, 1054910, 1103927, 1120471, 1163160, 1235143, 1249479, 1264975, 1300477, 1333408, 1324688, 1399613, 1520007]
9226A520007l5044k3103l5299J9901Q1219P2554L1257l299R2959J69968P3425
9215A964545O8988M7166P0830Q6922J01628J02800J14188Q1593Q0597J01191J85527
9204C005975P9781L9752J80259J42896O0270J35078J61740J70613J47140J61721
9194D285225N6764K02255J94962K36587K70960R5711J63782J96108J23805J31567
9184E957726L9365J06640N8469N3637M3332L5181K7817J6426q6370m1441p504
9173F203278p3771j38781l301m9533j02878p1981j75215j32261j20629j18793
9163E216135k07538j89541j54013k12116j69420r15n6803j29227j27358j53588
9153C815616n8728q9533j05203j26582j41460j28612j04860q8166j33773n776
$$ y = [1520007, 1484963, 1461860, 1426561, 1446462, 1527681, 1600235, 1631492, 1628193, 1721152, 1891120, 1964545, 2033533, 2080699, 2151529, 2238451, 2340079, 2442879, 2557067, 2638660, 2719257, 2820448, 3005975, 3085756, 3125508, 3305767, 3448663, 3508933, 3644011, 3805751, 3976364, 4123504, 4285225, 4341989, 4544244, 4739206, 4975793, 5246753, 5342464, 5506246, 5702354, 5826159, 5957726, 5997091, 6103731, 6162200, 6215837, 6259169, 6294350, 6322167, 6338593, 6252223, 6210782, 6203278, 6129507, 5990726, 5987425, 5937892, 5835014, 5763033, 5587818, 5455557, 5334928, 5216135, 5008597, 4819056, 4665043, 4452927, 4283507, 4282592, 4225789, 4096562, 3969204, 3815616, 3756888, 3667355, 3562152, 3435570, 3294110, 3165498, 3060638, 2972472, 2838699, 2832923]
9143B832923o7092j40337j01203n2503o7121o286N3998o574o2911o9277j78688
9132B134929j89606m2893l393K0228K3404n2792j27544o3132J824n0255o6797
9121A583973o6193j13498J144q731m1920l3916K5885q1020J722k9234m9655j527
9109A187030j0866o7089P3075J7082p0618j3653J8352k8167O0606q3883j40162
9098I41707l8578J2629j7678j08332n7621L031k7830N4058N0687q0473p7541K313
9086F56372O6874p4578p4590k157k5600l58o2936R623K8771l7041j455m2592J4577
9073D54910N5338n5502l1733N8640j9115L726l0869l5001k5124L0811P5414j7923
9061D63572l6921M515k8447q914k3813L9978J551j3962j5246L5320m9042j09534
$$ y = [2832923, 2765831, 2625494, 2524291, 2471788, 2404667, 2398381, 2452379, 2445805, 2382894, 2313617, 2134929, 1945323, 1902430, 1899037, 1919265, 1942669, 1889877, 1762333, 1699201, 1701025, 1650770, 1583973, 1517780, 1404282, 1405426, 1396695, 1354775, 1320859, 1346744, 1265724, 1267446, 1238212, 1188557, 1187030, 1176164, 1109075, 1182150, 1199232, 1128614, 1114961, 1133313, 1105146, 1165752, 1081869, 941707, 903129, 915758, 898080, 789748, 732127, 735158, 707328, 761386, 812073, 731600, 654059, 656372, 723246, 648668, 574078, 571921, 546321, 545963, 483027, 492650, 521421, 484380, 482925, 440333, 454910, 510248, 454746, 423013, 481653, 462538, 466264, 435395, 400394, 375270, 406081, 481495, 463572, 426651, 431166, 402719, 393805, 369992, 409970, 411521, 397559, 382313, 417633, 368591, 259057]
9049B59057l1645L3412P2887o7747j03317M3375M6658K2588j3050j8208J8777
9038B62787m2265N3183p034j35232o6250L0807Q6780O0010M6169j708N040Q7823
9026C80110l0960r7576n4807N1317P8071q3103p8519p7221K6626P552Q065j1883
9014A17672J31322P7471m5041r8984j2153J04127j5116p8113L3321K3370P620
9003B45496J5590p170m8509L127o1727l8461j359L1619M4965O863q5207L5910
8991A41137q732l1284M0415J02390p5215n3829R5295j9445l6600N0785M8073p3316
8979A79674j4890p204j01388j11354M6082O2781N4919k1387n5766l8881K8525
8968B1111R9005j3599K2713j8374j3916O1304K2257k0327K7609J9566l6731p9767
$$ y = [259057, 227412, 260824, 333711, 265964, 162647, 206022, 252680, 275268, 262218, 244010, 262787, 220522, 273705, 266671, 131439, 65189, 95996, 182776, 242786, 288955, 287247, 292287, 380110, 349150, 251574, 196767, 248084, 326155, 243052, 164533, 87312, 113938, 121490, 129555, 117672, 248994, 326465, 281424, 182440, 170287, 274414, 259298, 181185, 214506, 237876, 245496, 261086, 253916, 205407, 208534, 146807, 108346, 106987, 138606, 183571, 190434, 105227, 141137, 132405, 101121, 141536, 243926, 168711, 114882, 210177, 190732, 154132, 204917, 252990, 179674, 164784, 157580, 56192, -55162, -9080, 53701, 108620, 87233, 31467, -7414, 21111, 120116, 106517, 129230, 110856, 96940, 158244, 180501, 160174, 187783, 207349, 170618, 90851]
8956I0851q3788q2378m2160J28790P7626L1103l844p7841m8204K4129K9519r340
8944C4463j9497R302l5323m0625Q1684J1047L2741J00672m3607p1755l719J3232
8932F8615N7470N2915P4158j0674o7580m0364m5610K2336L291l9830K7013J5793
8920A17533O9929n7027j6642L1975l7493q4051l4413Q050J08279J1163k590M545
8908A19258L548k162k9142m0757o046L8790k852K2600O9754p1460r8863k8356
8896b5688O6766R4598Q1271L8092m0586n3993N6964N3519K8169Q877m6263l301
8884B58425R4938L2453o0123P3741J55596L3911Q6724J51316L16243M38776L54759
8873A936759K34488J83284J35223J11763n5047k83384m83245m41838l06310l01161
$$ y = [90851, 7063, -75315, -117475, 11315, 88941, 120044, 116200, 38359, -9845, 14284, 43803, 34463, 14966, 24268, -11055, -51680, 30004, 41051, 73792, 174464, 130857, 59102, 55383, 68615, 126085, 179000, 253158, 242484, 174904, 134540, 88930, 111266, 114557, 74727, 101740, 117533, 187462, 130435, 113793, 145768, 108275, 24224, -10189, -2139, 106140, 117303, 114713, 119258, 122806, 120644, 91502, 50745, 44699, 83489, 80637, 103237, 172991, 101531, 2668, -25688, 41078, 135676, 216947, 255039, 214453, 160460, 217424, 270943, 299112, 307989, 261726, 258425, 353363, 385816, 325693, 399434, 555030, 588941, 675665, 826981, 1143224, 1582000, 1936759, 2171247, 2354531, 2489754, 2601517, 2546470, 2263086, 1779841, 1338003, 1031693, 730532]
8863G30532j56715l3522k1473M577l2818R447K5797m9496r5218K8574M3571L2049
8851D85305j12807j00161o0153M207K6712R766l7051J1807K0127q281n0760j6346
8839A72365k4365j02679o0137J1328R4738J4374k4716J0324n0180m1925J6717
8828A5844l3047m2512K2480K0191P884j7001Q2313J48861K2833j07122l9179M7984
8816A29529M1125K9226j3500o4425p8199r6729J5080M7479K5814J7842O8169l682
8804A17729L333l9509l9774O6530K4152p9788j0170q0246K9816K0398O7086K1902
8792A01459J748k0142m5005k0628m1737l5156J0107K8912q065O716o0653j0828
8780i3272L6153O2004P6515M0737o6964j6772o5501k8098j5865l142L571P5328
$$ y = [730532, 573817, 540295, 518822, 523399, 490581, 500028, 525825, 476329, 381111, 409685, 453256, 485305, 372498, 272337, 212184, 216391, 243103, 252869, 215818, 227625, 247752, 239471, 188711, 172365, 148000, 45321, -14816, -3488, 91250, 105624, 80908, 91232, 41052, -873, 15844, -17203, -59715, -37235, -17044, -9160, -26161, 56152, 205013, 227846, 120724, 81545, 129529, 170654, 199880, 186380, 121955, 43756, -52973, -37893, 9586, 35400, 53242, 121411, 117729, 121062, 81553, 41779, 108309, 132461, 52673, 42503, -37743, -7927, 12471, 79557, 101459, 103207, 83065, 38060, 17432, -24305, -59461, -49354, -20442, -28507, -21791, -82444, -93272, -57119, 4885, 81400, 122137, 55173, 38401, -27100, -55198, -71063, -74205, -70634, 4694]
8768D694Q8373N9043p4505m7049q621k6418J576O2938R4396K0690j23308q1686
8756b9877J0660O709Q7741K4775k3771N612l4116k2890l2362m2439k9161j4192
8744i3311N28P4505J01915m5078r0819o2618L7109J24733O8183Q7784l6583j45022
8732B1326L388L9559q537K6848l3869p1404l9951P1315l682n9115k2455j4917
8720i1494K4594M4099O130q315N7309L3687J0174l2316O278j1352L6078L831j4834
8707F3869m5529p244m4542j8104j4609K0959L1067J0941p8285N470K6546m8841
8695i8302n1206N3863K5089n7733M9215P7681N9199L0159K6711k8762p7902p8293
8683g0281L3367l0226L9479L4929L2274o701l4677J63n4807q5692j9541R4586
$$ y = [4694, 93067, 152110, 77605, 30556, 21935, -4483, -2907, 60031, 154427, 175117, 51809, -29877, -19217, -12508, 75233, 100008, 76237, 81849, 47733, 24843, -7519, -49958, -79119, -93311, -92783, -18278, 83637, 38559, -52260, -114878, -77769, 46964, 115147, 202931, 166348, 21326, 24714, 64273, 55736, 82584, 48715, -22689, -62640, 8675, 4993, -54122, -76577, -91494, -66900, -22801, -16671, -24986, 32323, 66010, 76184, 43868, 50146, 38794, 74872, 78703, 63869, 18340, 11096, -33446, -51550, -66159, -45200, -14133, -3192, -81477, -76007, -49461, -98302, -149508, -95645, -70556, -128289, -79074, -1393, 57806, 87965, 114676, 85914, 8012, -70281, -36914, -67140, -27661, 7268, 39542, 32841, -1836, -1673, -56480, -142172, -161713, -67127]
8671f7127L6765q4142O0663J23225k1238m4002k732L2076O0749o02L7335j262
8659A29708J3487l8996m9964J8782m8534j0130J12170J6231o6469n6060n0728
8648c0503P506R5776j4105k2747M3719J03086j099p0743o6470o8300l3915J4616
8636d3179L3968R2940L1143O0944L7885k0255j00156j18257n2814N4588j6500
8625c9693k7226J4205p509L4802N9741l0514k9489k5689L1149P5654N0334j3938
8613I1827l3764j372K8271o1599K3658O2100r011J4346K5175O4187q2154p2284
8601D9380m2750l6667L0334J13535l6055n7278M717J15504m99k3852l1496k1167
8589F3706j6074p703m4207M68J01240Q421j20321n0248O1886k2224k1120L4654
$$ y = [-67127, -30362, -114504, -53841, 69384, 48146, 4144, 1412, 33488, 94237, 93635, 130970, 129708, 143195, 104199, 54235, 73017, 24483, 14353, 126523, 142754, 76285, 20225, -30503, -22997, 72779, 58674, 35927, 79646, 182732, 181633, 110890, 44420, -23880, -57795, -43179, -9211, 83729, 114872, 175816, 213701, 193446, 93290, -24967, -77781, -23193, -39693, -66919, -52714, -60223, -25421, 34320, 3806, -25683, -51372, -20223, 55431, 105765, 91827, 58063, 56691, 84962, 23363, 47021, 109121, 100110, 114456, 139631, 203818, 121664, 49380, 6630, -30037, 297, 113832, 77777, 20499, 25216, 140720, 140221, 116369, 84873, 63706, 47632, 39929, -4278, -3810, 97430, 105851, -14470, -64718, -2832, -25056, -46176, -11522]
8577a1522j2951N1027P5870J446k3673P6499m369m6221L1342L1007q9055l3103
8565D6297Q1684n895M9578O0742L0234q5422p0609l2704l7570r098J2503K0j948
8552C7812j1910k8497j8233L1441P0686R305k7854K170K8041R1887L5659l783
8540B16724j16103k5645k5722j2970J7846L9388q2814L0391N7194l9650r3342
8529c4703j02276L2433Q4864K7015K8383k128O3041n890m8416K529P074o0082
8517h156n0777M9162J7950j6080O811L07P0755o9983m2463M6620J5259j9964K3904
8504B3345O3724M6947q1802l7395k5919m2485J5396k0338J5009l9367N3234L2513
8492B862m554J2475l3830L2701M0376N6056J0675p797m5799K8593k081l1058n7069
$$ y = [-11522, -24473, 26554, 102424, 103870, 80197, 156696, 152327, 106106, 137448, 168455, 79400, 46297, 127981, 122086, 171664, 232406, 262640, 177218, 106609, 73905, 36335, 27237, 39740, 39760, 37812, 25902, -2595, -20828, 10613, 81299, 90604, 62750, 64920, 92961, 184848, 220507, 216724, 100621, 74976, 49254, 36284, 54130, 93518, 10704, 41095, 98289, 58639, -34703, -136979, -104546, -19682, 7333, 35716, 33588, 96629, 90739, 42323, 44852, 51926, -8156, -58933, -9771, 8179, -7901, -1090, -783, 69972, -11, -42474, 4146, 19405, -559, 23345, 87069, 134016, 52214, 14819, -11100, -53585, -38189, -58527, -43518, -82885, -29651, 2862, -1692, 10783, -23047, 9654, 50030, 106086, 116761, 108964, 63165, 91758, 89677, 58619, 1550]
8479A550o0997O680L0424j2761L6203j5294j29433N5294J56340P8459k5426K5348
8467A46387R042n004o5428j37697r8145M6377Q6556J2115K6546M1038P5294M4755
8455A81836j12477n7038N6101J744n6390L5061J01249L2169m2535k4301J996J5847
8443A33262l4350L7240n1591k2101o794K996k8077q3037n4463M7286M8797j3339
8431b4171k8233K746R3329M7479l5014k1901m7134p1902M2005J2998J671K5241
8419b886P4371P3793N0734o9226l7582p0224j04511K9801l918Q275j3283J7608
8407d7048n1792N3433N9740K530K3794j8948n0783O9608N4751O1361n5882K2053
8395A22817J7329j01988n6769n0023M2342M5123N2965q4987j2683n8113k1559
$$ y = [1550, -59447, -52767, -22343, -35104, 1099, -14195, -143628, -88334, 68006, 146465, 121039, 146387, 155429, 150425, 84997, -52700, -150845, -104468, -17912, -5797, 20749, 61787, 137081, 181836, 69359, 12321, 68422, 70166, 13776, 48837, 150086, 182255, 139720, 115419, 117415, 133262, 98912, 136152, 84561, 62460, 55666, 58662, 30585, -52452, -106915, -59629, -10832, -24171, -52404, -49658, 43671, 91150, 56136, 34235, -12899, -84801, -42796, -29798, -28127, -2886, 71485, 145278, 196012, 126786, 89204, 18980, -85531, -55730, -59648, -51373, -64656, -47048, -98840, -45407, 14333, 16863, 40657, 21709, -29074, 40534, 95285, 156646, 100764, 122817, 140146, 38158, -18611, -68634, -26292, 18831, 71796, -13191, -25874, -83987, -105546]
8384a05546P1279K796R738J4065p4772j43284p673L7863J18023J15586l3507J4176
8372A8744L1397j2738o0847j37305J551J21803K7693k3341J3649L3932M4137p2643
8360a3968o3267n213O6683M6882l7965j8288n0778l294N0475K1853j780m1222
8348d9882K3974m5186l6629M5912J14214O0784m0114j5030J7259q9416j35130
8337a49244Q823M3749l6354L5201J14303J01715q4781k3834p8355k7503j06593
8326b02873p8409k4172N4707P7061R1004N3847k4760m507k8793n7757L4748O375
8314a03529m4194j578L7602M3904o237R105k4442L4825J24993k9513K9390n7087
8302A3239K6137L6054M1114o5776J6272M7087o1325M7028L2640j10637r6808J1040
$$ y = [-105546, -34267, -31471, -21733, -7668, -82440, -225724, -233397, -195534, -77511, 38075, 4568, 18744, 50141, 37403, -23444, -160749, -159198, -37395, -9702, -33043, -19394, 14538, 58675, -13968, -77235, -82448, -15765, 31117, -6848, -25136, -75914, -79208, -28733, -6880, -8660, -49882, -25908, -71094, -107723, -61811, 52403, 113187, 73073, 58043, 75302, -14114, -149244, -140421, -96672, -133026, -97825, 16478, 118193, 33412, 9578, -68777, -96280, -202873, -281282, -305454, -250747, -173686, -82682, -28835, -53595, -58102, -86895, -144652, -109904, -103529, -147723, -149301, -111699, -67795, -74032, -64927, -89369, -54544, 70449, 40936, 70326, 13239, 39376, 75430, 116544, 50768, 67040, 114127, 52802, 99830, 132470, 21833, -74975, -63935]
8290f3935N0386j2160j25506K1218P7488M6051M8855Q188n2627L4077K1112r4063
8278d0916p2194J7553l036n3234j5221N7161J09268j9925l3802K9198N7481K241
8266C4574j42241l2687M0194R8995Q6434r6669o1148L7033l4771N7703J55599
8255A43016O39o0924j21042k992N4033m9381N6891l2939m7156k7981M2943L3913
8243a0980L2819q7991m1129j8213p8124O5180P1858l7014K4677m1302j5408R3264
8231d2363l4450m0531n1046l8562N7997J09382Q5010J2769k7363j8553N3177K7504
8219I2971J7849N4908m4820r6569p3596q0443j3455M3600m3446P0874K0028K149
8207d9950M5472R3799j1810j21823j05121M7236L5583N0695O2248K2767N6338
$$ y = [-63935, -13549, -25709, -151215, -129997, -52509, -6458, 42397, 50585, -2042, 32035, 53147, -40916, -113110, -95557, -98593, -151827, -167048, -109887, -619, -20544, -54346, -25148, 32333, 34574, -107667, -140354, -100160, -1165, 85269, -11400, -72548, -35515, -70286, -12583, 143016, 143655, 82731, -38311, -41303, 12730, -36651, 20240, -12699, -59855, -87836, -44893, -10980, 21839, -66152, -107281, -125494, -203618, -138438, -66580, -103594, -78917, -120219, -135627, -42363, -76813, -117344, -168390, -206952, -148955, -39573, 45437, 58206, 30843, 12290, 65467, 92971, 110820, 165728, 120908, 24339, -49257, -129700, -143155, -99555, -143001, -72127, -52099, -49950, -4478, 89321, 77511, -44312, -149433, -102197, -66614, -15919, 46329, 69096, 125434]
8196A25434n4185l2350R854j0429Q5670M4118n7374j3367n3254n9500O189O3939
8184E4745m3651l6555K0002l0477R0553M9301j686k11K555M2170k9972m5669m292
8171F6813k2754k3917m2118N8222K9355j1668L0779k5381Q7154n8720q7719N218
8159E264M8737o668p3225q5990P1372K7043p028L7776L2497j13161M1297M7303
8147B5217P2973k392o5663k7438O654o1422O6846L8819M0161J6062M3042P25n7798
8134I5786N910p4513k6023J00210n4430o8203j3189N2811n0994l7698m3598k38
8122a14169M6188l3433j150J8040N8650R5320r7785k2780P9135l3728n0350m2987
8110i9049L232M6739K0245L3537l5319q0384J1570P915O0325J6367m4581L65K8368
$$ y = [125434, 71249, 38899, 48753, 38324, 123994, 168112, 110738, 97371, 44117, -15383, -9194, 54745, 11094, -25461, -5459, -35936, 54617, 103918, 102232, 102021, 104576, 146746, 116774, 71105, 66813, 44059, 20142, -21976, 36246, 65601, 53933, 84712, 59331, 146485, 87765, 46, 5264, 54001, 47333, -25892, -111882, -40510, -13467, -20495, 17281, 49778, -63383, -22086, 25217, 98190, 95798, 30135, 2697, 9351, -52071, 14775, 53594, 93755, 109817, 152859, 153584, 95786, 101696, 27183, 1160, 101370, 46940, -21263, -34452, 18359, -32635, -70333, -113931, -114169, -67981, -101414, -102564, -84524, -25874, 69446, -28339, -51119, 28016, -5712, -56062, -99049, -95817, -49078, -28833, 4704, -30615, -110999, -99429, -91514, -31189, -14822, -59403, -59038, -30670]
8097c0670N4215j7598k9711q7649j5829n737Q2614L1572m5740n2205k3081K6087
8085a13732O2l2825j2959J6125M0188K490J1250Q546j8558l4883P6104K7810J6935
8072a3447l457q2458r200l3712o7743n6903L6935R5729Q0715k4289L9276M7236
8060H682M8857N274R5066J6542L2230o1836p3457R869j4256n8125j7141Q9065
8048H0770J14750l2079j23944j1014K1334L2406M247r8741j37690J03046K00079
8037A53164L6149j23586m3855j5800j4955m7854P765M050N4444p1678m0548N0377
8025e2327Q4955k0070K387m1631J854K7234K0791J8993M3600k5693j5384J7881
8013F2590M9801j4293J0322M0618L2243n3688j15662m9268J38670L7612p1381
$$ y = [-30670, 23545, 5947, -23764, -111413, -127242, -132979, -50365, -18793, -64533, -116738, -139819, -113732, -113670, -146495, -159454, -143329, -103141, -100651, -89401, -80855, -99413, -134296, -58192, -30382, -13447, -16904, -99362, -108562, -142274, -210017, -266920, -229985, -134256, -53541, -77830, -38554, 8682, 57539, 62813, 157879, 174421, 206651, 144815, 71358, 81227, 66971, 8846, -8295, 80770, 195520, 163441, 39497, 28483, 49817, 82223, 86470, -12271, -149961, -46915, 153164, 189313, 65727, 21872, 6072, -8883, -56737, -48972, -44922, 9522, -62156, -102704, -52327, 32628, 12558, 14945, -26686, -24832, 2402, 23193, 42186, 85786, 60093, 44709, 62590, 112391, 98098, 108420, 149038, 181281, 127593, 11931, -37337, 101333, 138945, 67564]
8002F7564q7909m9539N3633Q1757R1253j31J1833O5266k8485n2504j3796o5034
7990G3908m9965L5416K8666n0458k5319k3855J8285k5191j6095K2140K3827k3295
7978a1936L8160Q528j4526K3308j2538j6477l3414J861R0465R6023n8344r0764
7966B0346k9268M4830Q857o3156n022m7889l448M9792k2199L7138L9481L7939
7954F7401M299M5490L2199n3749l3647k3543r9617m013l8068j5656N3581J66189
7942A00866K7666l4837k7930j2277K0244o4064P8334l8574l050M8563p5731k9229
7930a0019L9752j3903J0521m2022K9315N0841k3469m1150R5669Q3068j4348p4385
7918H9870L6649M5552K444k6060p5326J4554o9924j49471p705J64693J30434M95
$$ y = [67564, -20345, -69884, -16251, 65506, 156759, 156628, 168461, 233727, 205242, 152738, 138942, 73908, 23943, 59359, 88025, 37567, 12248, -11607, 6678, -18513, -34608, -12468, 11359, -11936, 26224, 34752, 20226, 43534, 30996, 14519, -18895, -17034, 73431, 169454, 111110, 20346, -8922, 35908, 44765, -18391, -23413, -71302, -74750, -24958, -47157, -10019, 29462, 67401, 71700, 117190, 149389, 95640, 61993, 38450, -61167, -65180, -103248, -118904, -65323, 100866, 128532, 93695, 65765, 53488, 73732, 9668, 88002, 49428, 46378, 94941, 19210, -10019, 29733, 15830, 26351, -15671, 13644, 64485, 41016, -134, 95535, 178603, 164255, 89870, 126519, 172071, 174515, 148455, 73129, 87683, 17759, -131712, -139417, 25276, 155710, 156205]
7906A56205q6910o1022l5343j1661J4994J02359P4404l439J7401L3284j0734j7043
7894A72495K1027M6315m309n3324n4506o273j4802n5729j1740L0700j5160J6708
7882G1402j2776m9173L243j2558J1216Q1255k3823p7030K8657p186k0508J1891
7870D610l0950J7774P8960O948p5256j1895K9791l4687o9402j153M3600K528K6815
7857a2317n2586j04790k2670Q8273J1456l176R8426M5780J6815J4610L6266j07875
7845H212J3081Q8343j8801n8737J2685R604M762l1680m0968r392M8211K4248l2366
7832A7202M664k0151q0573m6911k0272K0806J10668L4792l0018k9090L7062m8614
7820e0435k5692n5848n2632O0463R9230P2337m0731j30957o1370K37J62982L4684
$$ y = [156205, 69295, 8273, -27070, -38731, -23737, 78622, 153026, 149587, 166988, 200272, 189538, 172495, 193522, 239837, 235528, 182204, 127698, 121425, 106623, 50894, 39154, 69854, 54694, 71402, 58626, 9453, 12696, 138, 11354, 92609, 68786, -8244, 20413, 13227, -7281, 4610, -26340, -8566, 70394, 77342, 2086, -9809, 19982, -14705, -84107, -85260, -41660, -39132, -12317, -64903, -169693, -192363, -104090, -92634, -95810, 2616, 48396, 65211, 79821, 116087, 8212, 21293, 109636, 90835, 32098, 44783, 54387, 59149, 27469, -13499, -22891, 25320, 49568, 17202, 21866, 1715, -78858, -125769, -146041, -125235, -14567, 20225, -9793, -38883, -1821, -50435, -76127, -131975, -184607, -124144, -24914, 47423, 6692, -124265, -185635, -185398, -22416, 12268]
7808A2268Q0414r8801p7650n3589O1674M7377M0059N6389J391K4049P6158o645
7796A63094j11864m1160k9212M8978L4088l6695j3675l2292l464j16081J839N0542
7784h5902j4883L451R300O809M8430m9649j4922O3385P9270N2695J7994m1929
7772G4049l0852M403N2441q6499o9813R357L5813P1700P0462p9863J6432Q357
7760G5987n7413K1110k7109q3203Q8646m395r0006J6653Q5180K1055n9137M7585
7748C4953J14425j4443K2403l1534o0202n9677M6176J1636K9215k7937p8403j1959
7736b5347R2259l4606J4896l9055p4799m5975J01403K1767L3693m0761j04596
7725a01121n5984j1392O114j3556O9895M2790m3338m4034k09J05510J55662M2108
$$ y = [12268, 92682, -6119, -83769, -137358, -75684, -28307, 11752, 68141, 69532, 93581, 169739, 163094, 51230, 10070, -19142, 29836, 63924, 27229, 13554, -18738, -22202, -138283, -136444, -85902, -100785, -97334, -88034, -81225, -32795, -82444, -97366, -33981, 45289, 97984, 115978, 74049, 43197, 47600, 100041, 13542, -56271, -46914, -11101, 60599, 131061, 51198, 67630, 75987, 18574, 39684, 12575, -70628, 18018, 13623, -76383, -59730, 25450, 46505, -12632, 34953, 149378, 134935, 157338, 125804, 65602, 5925, 52101, 63737, 92952, 65015, -13388, -25347, 66912, 32306, 47202, 8147, -66652, -112627, -11224, 10543, 44236, 3475, -101121, -157105, -168497, -162383, -175939, -106044, -63254, -106592, -150626, -150835, -45325, 110337, 152445]
7713A52445j37267o085n0406r5109K6130O8459q842j3808m1241L0257j573o1927
7701a38967l6042N7432L1295K7309k7548J2430J10830M3343l4136j2728N2761
7690H5979r83p8189j6871j2970m054p5903L9206Q1773M9222l1006j10665o1181
7678a35642N5477N7046N936N416n634m5065L3207p5034M8185J47441K2540K3788
7666A37661J9054m4556k4319m4695l5370l7904R7160J6258J65p7138J6132o2106
7654c9658n2136J00209L0563n1618k407N9984J3974m0722j02908Q947M4011n9075
7642i0836M9316o382M274O6921L1768l4501n2508J8938N879K437N0966O266r207
7629D3331m5927P343J1662n332K4810m807n5722R947J8899j0487l5717q3312Q4193
$$ y = [152445, 15178, 9093, -41313, -136422, -110292, -41833, -50675, -64483, -105724, -75467, -77040, -138967, -175009, -117577, -86282, -58973, -86521, -74091, 36739, 80082, 45946, 33218, 85979, 84996, 6807, -10064, -23034, -27088, -102991, -63785, 17988, 67210, 36204, -74461, -135642, -80165, -23119, -17183, -11767, -17401, -62466, -29259, -104293, -56108, 91333, 113873, 137661, 156715, 112159, 87840, 43145, 7775, -30129, 67031, 83289, 83454, 6316, 22448, -39658, -91794, 8415, 38978, -12640, -15047, 44937, 58911, 18189, -84719, -75772, -31761, -90836, -41520, -47902, -43628, 23293, 55061, 20560, -31948, -13010, -7131, -4694, 46272, 52538, 43331, -2596, 4747, 16409, 11077, 35887, 31080, -24642, -14695, 4204, -6283, -42000, -125312, -41119]
7616d1119O7724L4381j31239L954q465n3480J4689L5461N1383K4381m1080k7984
7604g1394k292O1268o6729J9290P8585J3477l1607O085P8761L372q0119o6721
7592e8024J04223L0658l5513o392j3730M136k2459l6795L5467j8369M2816q1928
7580e5910j602L3151J5745j571O160k3792k607L8834k5048q5764o1994P2497M1532
7567e0369r966R1085L9632k254q9168l2386k491R0279R776j17659M7010O4814
7555C8303L0406M5780N1966J5687j14000j9503L544J3800L3840N1822l2921n4502
7543F4222L9530l104K0258n9382r1721l8191N2913J0596L4252j18953o7529k3092
7531a80201o1049k4279J17957J09644K387n2777L6382P1030J6400j3798K2554
$$ y = [-41119, 26605, 60986, -70253, -66299, -74764, -128244, -113555, -78094, -26711, -2330, -43410, -71394, -73686, -12418, -79147, -59857, 18728, 32205, 598, 6683, 85444, 88816, 8697, -58024, 46199, 76857, 41344, 34952, 21222, 25358, 2899, -33896, 1571, -16798, 26018, -55910, -57512, -24361, -8616, -10187, -4027, -27819, -30426, 8408, -16640, -102404, -164398, -91901, -50369, -60335, 30750, 70382, 68128, -21040, -53426, -55917, 34362, 44138, -73521, -26511, 38303, 68709, 114489, 166455, 182142, 68142, 48639, 52183, 65983, 99823, 151645, 118724, 64222, 103752, 100648, 120906, 61524, -30197, -68388, -15475, -4879, 29373, -89580, -157109, -180201, -241250, -265529, -147572, -37928, -35541, -88318, -51936, 19094, 35494, 21696, 44250]
7520D4250R569P834l43n9730j05864Q201j902M956K5670j4639L4718P4078R0648
7507A17446P420L2152q4536r5423l9659m268q846J04039l3496n1262k9665l9512
7495a25610k1761J04869M9831J1994p310k7029R958Q3060P109p0933l4933m474
7483b5229J5454l5677j2381L5833r463l9149J9060J2857O0627Q206K78j8194K1313
7470C3535m1848n7525l091J405o1912L5636J04312M4910k1970L4693k7796j259
7458C9090j623j0796j6214p4179L0122K1099m2200k9881K5740J322m0058J5531
7446h2047J624K1181l7926Q538q471n7964M6153l5755r466N8282P3192j057j3410
7433c7126l8321m7464L4038J29372J250m4835q889j8069L0976P1710K8687l4879
$$ y = [44250, 53819, 61653, 61310, 1580, -104284, -96083, -97985, -93029, -67359, -81998, -47280, 26798, 117446, 124866, 157018, 72482, -22941, -62600, -66868, -75714, 28325, -5171, -56433, -86098, -125610, -147371, -42502, 7329, 19323, 12013, -15016, -5058, 78002, 85111, 14178, -20755, -25229, -9775, -45452, -57833, -22000, -31463, -70612, -51552, -38695, 21932, 30138, 30416, 12222, 33535, -8313, -65838, -68929, -67524, -129436, -93800, 10512, 55422, 33452, 68145, 40349, 39090, 37467, 26671, 10457, -63722, -33600, -12501, -54701, -84582, -58842, -57520, -97578, -82047, -80423, -59242, -97168, -88630, -97101, -155065, -108912, -144667, -154133, -95851, -22659, -23716, -37126, -75447, -122911, -88873, 40499, 41749, -3086, -11975, -30044, 932, 72642, 101329, 66450]
7421F6450k686L1052o8501j3619j8664L0977K7854R0189j4151l5594n4593m8483
7409i769j1816k1089O450L2703k0340m6923P7561Q5867Q596K5986k5715j0946
7397I0565m5128k8067J4370P3088L7097j11074k0247M3257K47n5092j6499N7114
7385C9631J4790j56106q4392K2120P4162R920L3822J6753O632K3763O7963K6565
7373I5623M607o9711m2856L7838P104j39553j02021O7096M3870J2069J3440N5118
7361a7376M3738n6196j4706L0866O1246p584j4764M951r6027n3348l7651q6182
7349b43033o3277Q5351J02541j9833O1721n8846j0116M3523J3078k6895j9272
7338a35058q049L8484n45J03161Q6301p0067l3557L2614j02291j4946N6184J6298
$$ y = [66450, 63764, 94816, 26315, 12696, -5968, 25009, 52863, 143052, 128901, 93307, 38714, -9769, -21585, -42674, -36224, -3521, -23861, -70784, 6777, 92644, 101240, 127226, 101511, 90565, 45437, 17370, 31740, 104828, 141925, 30851, 10604, 53861, 54108, -984, -17483, 39631, 54421, -101685, -186077, -163957, -89795, -79875, -46053, -29300, -22668, 1095, 69058, 95623, 100230, 30519, -12337, 25501, 32605, -106948, -208969, -141873, -98003, -85934, -72494, -17376, 26362, -29834, -44540, -13674, 47572, 39988, 25224, 30175, -65852, -119200, -156851, -243033, -306310, -220959, -118418, -138251, -76530, -135376, -145492, -101969, -88891, -115786, -135058, -143107, -104623, -105168, -2007, 84294, 14227, -19330, 13284, -89007, -103953, -47769, -31471]
7326c1471l4955p8447j9031K3772J4054L5103P8858L0654L6199M1659m7264m2577
7314F554m858l7388p719m6756K3045l9543P0411L5334p3898N911M1001K8426j10184
7301a09664J460L2254n3216j2171L4082p1658N3162N0422n5191n4160P3180P1661
7289c9839P4650m8680r3369Q7973L8191J175j5949Q4004l2755n2709K1323n036
7277A8979J4675l7170L021m1084r333l3099k2811j0925l7095j00011Q3567J23945
7265d7341J766J4890J9344K7021k9778l1714n3251o4144K0795M0249l3966L4449
7253a01680K3921k4458n1429n1419N4826Q4729O8869n4820m3729m4014k586Q834
7241a32956K4291L3379P2092M4428M0890N6710l8528j32833K0218J4163o570n6617
$$ y = [-31471, -66426, -144873, -163904, -140132, -126078, -90975, -12117, 18537, 54736, 96395, 49131, 6554, 1696, -35692, -43411, -90167, -67122, -106665, -36254, -920, -74818, -68907, -27906, 520, -109664, -108204, -75950, -129166, -141337, -107255, -178913, -125751, -75329, -130520, -184680, -111500, -39839, 34811, -13869, -107238, -19265, 18926, 20101, 4152, 88156, 55401, 2692, 24015, 18979, 33654, -3516, -495, -41579, -50912, -84011, -106822, -117747, -154842, -254853, -171286, -47341, -45575, -30685, -11341, 15680, -14098, -45812, -99063, -163207, -142412, -102163, -136129, -101680, -77759, -102217, -153646, -205065, -150239, -65510, 3359, -51461, -95190, -139204, -141790, -132956, -108665, -75286, -3194, 41234, 82124, 138834, 100306, -32527, -12309, 1854, -4716, -61333]
7229f1333J0448k4248R388J35860O462p7682p6239m2857n3892O0363P4002m7230
7217h6958l0225J8850l0382j7178O513J2605L4510Q2781Q7805j15564q3990Q1191
7205d0042l614k8868m9595n0115J9766K1574O6343L2556k24J2644l9625N062L2758
7192b1380K004l9443k2724m7533j4373J3116J9799M4677J01732p2963j22907l1218
7180a91213N2285j453q188L0711K8232J21743R2055l2595j03151K6820J12261
7169A27507L1192j08433m0957k7156r7705J3712O878m9847P3516J1688M8004k9568
7157d1169r2357P9432O7757L10N6892N8752p589p7493m9198m8989k270M7408M4973
7144C6459P6634J3462l1286r80l6591p1812p1336m087J3699P489l1548k4481J02404
$$ y = [-61333, -50885, -75133, -65745, 70115, 76577, -1105, -77344, -120201, -174093, -113730, -39728, -86958, -117183, -98333, -128715, -145893, -139380, -126775, -92265, -9484, 78321, -37243, -121233, -40042, -43656, -72524, -122119, -172234, -152468, -130894, -64551, -31995, -32219, -19575, -59200, -54138, -21380, -19376, -58819, -81543, -129076, -143449, -130333, -110534, -65857, 35875, -37088, -159995, -191213, -138928, -140381, -148569, -117858, -89626, 32117, 124172, 91577, -11574, 15246, 127507, 158699, 50266, 9309, -17847, -115552, -101840, -94962, -144809, -71293, -59605, -11601, -41169, -133526, -54094, 13663, 13973, 70865, 129617, 122028, 44535, -4663, -53652, -55922, -8514, 36459, 113093, 126555, 95269, 94289, 57698, -14114, -85450, -89537, -75838, -68349, -99897, -124378, -21974]
7131b1974L4659k362r4944M4879l0540l6642m0366k5947O8992N0701m5483L2424
7119f6603J48162J2644j628o4674N843J6235j555j4882o6336J368Q4800N3163
7107A06537n2010n4602L1472R6985L7090p6570j48596r4143j8206O1199M7873
7096f2971Q2051n533j8127J603j0924J3429R8532K6193p4190r4797m1209n793
7084i1736N644N4434k3492J2388L482l0117J3510j7597k6649Q3707k815o3797
7072h3038m2856M7611M4422O0183J9301N9586L8804p241m3196j8796n04M1766
7060A16042m0404p4K2925k3318L2081p6462j05427L6084K0744j9057o9740l4395
7048a41001M5035Q5100p9081r233N4432L924M8998j8865M194R856N1469n9684
$$ y = [-21974, 12685, 10323, -84621, -39742, -70282, -106924, -147290, -173237, -104245, -53544, -99027, -66603, 81559, 94203, 92575, 27901, 33744, 49979, 48424, 33542, -32794, -31426, 53374, 106537, 54527, -75, 31397, 128382, 165472, 88902, -59694, -153837, -172043, -110844, -62971, 19080, 13547, -4580, -2977, -13901, -472, 98060, 124253, 50063, -44734, -85943, -91736, -86092, -31658, -55150, -42762, -39280, -69397, -55887, -73484, -100133, -16426, -19241, -83038, -125894, -78283, -33861, 26322, 45623, 105209, 144013, 136772, 93576, 74780, 74276, 116042, 75638, 75564, 98489, 75171, 107252, 30790, -74637, -38553, -17809, -36866, -106606, -141001, -95966, -10866, -89947, -99180, -44748, -40824, 8174, -10691, -6497, 3359, 54828, -4856]
7036d856m2047N1338q615k1515k998P2547L5320k3045m046j34164j5183J17147
7024A9883R878l6241j6961K3199J16279k424m1540q3381k8030N344l768P320l7336
7011f7778M4735R451l5715L1187m4324p2790M0659R3634O0815L6440l0588l982
6999F1744m9491k8146M0244j8427n1748k4810J00126K6294O5329P660j15868r3106
6987h0199L7653P0381K4726r34o5653n7254P7781J25332l2936r5379m0239P6202
6975C9481k0393p479l1259o712J29554j7001p2717n0437K4701L7820q9327j2997
6963g6766N383L965j0830r9059L5312O0406O6094l2493p819k5384q4534l8127
6951b03852L0823N7117R6772N8370L763p5811n1491O3911K7580K5587p799k2484
$$ y = [-4856, -46903, 4435, -4180, -25695, -28693, 43854, 79174, 56129, 52083, -82081, -97264, 19883, 29761, -6480, -23441, -242, 116037, 113613, 72073, -11308, -39338, -33994, -37762, -30442, -67778, -23043, -13592, -49307, -18120, -62444, -135234, -94575, -941, 59874, 96314, 65726, 61744, 12253, -15893, 24351, 5924, -45824, -70634, 29492, 55786, 121115, 128775, 12907, -80199, -42546, 27835, 52561, 51627, -14026, -71280, 6501, 131833, 98897, 3518, -36721, 39481, 19088, 11609, -19650, -26362, 103192, 86191, 13474, -36963, -12262, 25558, -63769, -76766, -71383, -67418, -78248, -177307, -141995, -81589, -15495, -47988, -55807, -81191, -165725, -203852, -173029, -115912, -19140, 39230, 42993, -32818, -84309, -20398, 7182, 32769, 24970, 2486]
6939B486O2487p1380k387N4736l6004p4420j5873L200k6506l5184m7251N4266
6927a31830Q7079P4136j0568p3477j12216N1091J77001K8403j26326q2410j8220
6916a37337m1268r501L6917K9195Q7927K8092N2049n8595k3708k9806q9362J6659
6904a38738k8050J7709L0414Q5198N2364P5748k740m5701r8558o8443k1304L8012
6892a04089J1238j071R7422N20r5413o2422J6410M8925P3184j2460j16159l0212
6880a74127N1747N8958N3510M065q8229j06525O6857P6409L5568j8323P3212J12452
6868A45574m6373l7020j7922M056r707O4480n037k8281n0954m6063J1374L8932
6856B3059p221P013K3625O9336l2561p0686o3028l7428l2768P3524o5944L1884
$$ y = [2486, 64973, -6407, -8794, 45942, 9938, -64482, -80355, -77155, -103661, -138845, -186096, -131830, -44751, 29385, 18817, -54660, -166876, -115785, 61216, 89619, -36707, -119117, -137337, -178605, -188106, -151189, -121994, -34067, -5975, 46074, -12521, -36229, -66035, -155397, -138738, -166788, -149079, -118665, -33467, 18897, 94645, 91905, 46204, -52354, -120797, -142101, -104089, -92851, -93922, 3500, 4020, -91393, -153815, -137405, -88480, -15296, -27756, -143915, -174127, -122380, -63422, -9912, -5847, -94076, -200601, -133744, -57335, -21767, -40090, 33122, 145574, 99201, 62181, 44259, 48315, 38608, 103088, 98051, 69770, 18816, -27247, -15873, 23059, 15838, 22851, 46476, 115812, 83251, 12565, -50463, -87891, -120659, -47135, -113079, -81195]
6844h1195J30597J6800j2494l5898q386K7223J5963k8727m2278L3828k4574r6852
6832a05993r5157L3906M4765n1335K902N8443p438n017N0322M7059K3924m847
6820h466Q0782J17796n5470r7364M5505Q5232M1014n0441o4471j40513M3074L9128
6808C5806n1802j6083N9062M4008M4267J7451j41402R428K0121N368q4703o8419
6796a26898j217N2818P8671J26996K0648k6154q9987o0745L3148k7996k7501J2985
6784c5232P1755N4828r6912q6480n8178k6075L7678J02602n8122k4466m7325M7955
6772a17972J29836P1239K6206o7421n5197l2419L1262R9848O2941m3564m1363
6761F3396j17644J2006k3673q0340l6188R416Q8988P7938R2070m4620m3975J5656
$$ y = [-81195, 49402, 66202, 53708, 17810, 9424, 36647, 52610, 23883, -18395, 15433, -9141, -105993, -201150, -167244, -122479, -173814, -170912, -112469, -119907, -124924, -74602, -27543, -3619, -8466, 72316, 190112, 134642, 37278, 82783, 168015, 209029, 158588, 94117, -46396, -3322, 35806, -15996, -32079, 26983, 70991, 115258, 132709, -8693, 735, 20856, 26224, -58479, -126898, -128115, -75297, 3374, 130370, 151018, 124864, 34877, -25868, 7280, -20716, -48217, -35232, 36523, 91351, -5561, -92041, -150219, -176294, -138616, -36014, -94136, -118602, -165927, -117972, 11864, 83103, 109309, 41888, -13309, -45728, -14466, 85382, 148323, 104759, 63396, -54248, -42242, -65915, -146255, -182443, -173027, -84039, -6101, 85969, 41349, -2626, 13030]
6749A3030n5601n3749O168l7048J8449M5068O0996m7438L5168M2349L3361L6347
6737I7100o5588k6097m3042q6476K0067P1098n0947K1201P4823o4345n4966k0430
6725a27602L9900J16029M8751m6019l6066m893M3096K3957j0508j29100p1234
6714a53689R3122M0061j380l8140L4593Q2435l0011m6174l0974l3341J26578P6424
6702A19504m8739p4799K1883o1414q7099k7786k50n163K9413J10862L0729k0931
6690a3790M5596P0976l7825j5823M622n6256j65882M7225O0081L950P6874o8700
6678d8952o5073l4647M8578m4591N2222J12348k8228K0415K1012k9724K8670m3563
6666a1533q2843o6060o822R3683P7087q8525J6920n0111l3445J7097J12501L4407
$$ y = [13030, -42571, -96320, -90152, -127200, -108751, -63683, -2687, -50125, -14957, 27392, 60753, 97100, 31512, 5415, -37627, -124103, -104036, -32938, -83885, -62684, 12139, -52206, -107172, -127602, -87702, 28327, 77078, 31059, -5007, -9900, 33196, 57153, 46645, -82455, -153689, -60567, -20506, -21886, -60026, -25433, 57002, 26991, -19183, -50157, -83498, 43080, 119504, 70765, -4034, 17849, -43565, -130664, -158450, -158700, -163863, -134450, -23588, 7141, -13790, 31806, 102782, 64957, 49134, 53756, -2500, -168382, -121157, -61076, -57126, 19748, -48952, -114025, -148672, -100094, -144685, -92463, 19885, -8343, 12072, 33084, 3360, 32030, -11533, -94376, -160436, -167258, -73575, 3512, -85013, -68093, -118204, -151649, -134552, -22051, 12356]
6654A2356p3413r357o64K8269J8614m4695o1707M479m2385O0015R4107K7521m0691
6641b7551j6661j7513o6986o7014j2290O1073O0393k232L2695m006k4998K9988
6629e5102O9189m8417O1128L3529j752l5683r53R527j9857J0296L5345j6378K2569
6616F3441K2457K8743K6639o2061m3741O809p6851l2723J2265j0970Q868L4701
6604b2423K4561l1021Q8177P8804j21397r5473O9888Q1035j6277k4932L630r496
6592B5076l4189n1086l8926O8832k9701j6683P2928L9216K7449k3357o9559l4967
6580f4967P7098K4463j6238O0852q283q4576o9036l8447O3341J07355L6645n4903
6568C3304K1240K4706m2705j183o1193q0175m8683P8687K6390j5921o409l7245
$$ y = [12356, -61057, -70414, -71078, -42809, -24195, -68890, -130597, -126118, -168503, -108488, -14381, 13140, -27551, -44212, -61725, -128711, -195725, -208015, -146942, -86549, -88781, -56086, -60092, -85090, -55102, 14087, -34330, 26798, 60327, 58575, 22892, 21939, 31466, 11609, 21905, 57250, 40872, 63441, 85898, 114641, 141280, 79219, 35478, 42287, -34564, -67287, -55022, -65992, -57124, -22423, 2138, -28883, 59294, 138098, 16701, -78772, -8884, 72151, 55874, 30942, 34572, 25076, -9113, -60199, -99125, -30293, -59994, -76677, -3749, 35467, 62916, 39559, -30000, -64967, 12131, 36594, 20356, 81208, 72925, -11651, -80687, -119134, -55793, 51562, 88207, 33304, 54544, 79250, 36545, 35362, -25831, -106006, -154689, -76002, -49612, -65533, -71942, -109187]
6556a09187k5399R811J6599J7510J06058M2843o6972M4000Q7607o8792m2018L6941
6544D9001l66l3332R638L201K7499k7615m6404P3081K5677o8544j9578Q952j2728
6531a1518R261K7973O4806M9686j29094q3209J1560Q0204J4233p75n1154K7314
6519I287k5994N0184m6859n7796p4969O7576P6893P5418k5534r6547J7794P0160
6507C9613J8697j1876n1267l6400n1024P8484K6001q6033J0939N1837k4157n1999
6495h7185N0385N7906o938j51539l8235L4761L7008L6828O9359L8043R100m1616
6483G877p320K061J9369l8943l7258l8352N6629l663n0939M8153L3337K0002K6887
6470C7840O5097k7415n5767j8678K1987K5787L7948L5114n2380r8704p702N0106
$$ y = [-109187, -134586, -124775, -108176, -90666, 15392, 58235, -8737, 35263, 122870, 54078, 12060, 49001, 48635, 15303, 24941, 28142, 55641, 28026, -18378, 54703, 80380, 11836, -7742, 1210, -11518, -2257, 25716, 90522, 140208, 11114, -72095, -60535, 19669, 33902, 33127, -18027, 9287, -16707, 33477, -13382, -71178, -146147, -78571, -1678, 73740, 48206, -48341, -30547, 39613, 58310, 46434, -4833, -41233, -92257, -13773, 12228, -73805, -62866, -11029, -35186, -87185, -36800, 21106, 14168, -137371, -175606, -140845, -103837, -67009, 2350, 40393, 49493, 7877, 557, 2618, 21987, -16956, -54214, -92566, -35937, -39600, -90539, -42386, -9049, 10953, 37840, 102937, 75522, 19755, 1077, 23064, 48851, 86799, 121913, 69533, -29171, -36873, 13233]
6458A3233N9236q461n8732j11940r4455O626p925M859N3370N7758M4435j0755
6446e2751K9865L8466o6044l0076K4956K0498o9847j8100K7694k0807l1586O2961
6434h4771J05724L0197j0763j4510J28397j5794j11844l3307M7764N688J0813
6423E7594J07407p5138n9414m2873r1445L8839M6519M3312K7436l7718k9335k9186
6411d4002K8481M4233J7185j2514k9268N7156l1350m0898l1674r356N3083l9828
6399c8752K1073N4135m6629n5355j7745m2680O7257P1984L9817k8738o1565J3672
6387b3526K1696N486m7716N4530J4924k3952k7812n08R979j45j417L7188k369
6374A6358N7557m913q3695j6876k72K5488J4517L3224L7552K0905J3505j15682
$$ y = [13233, 72469, 64008, 5276, -106664, -201119, -194493, -202418, -197559, -144189, -86431, -41996, -52751, -22886, 15580, -50464, -80540, -55584, -35086, -104933, -123033, -95339, -116146, -147732, -84771, 20953, 51150, 40387, 25877, 154274, 138480, 26636, -6671, 41093, 46781, 57594, 165001, 89863, 30449, -12424, -103869, -65030, -18511, 24801, 52237, 14519, -14816, -44002, -15521, 28712, 45897, 33383, 4115, 61271, 29921, -10977, -42651, -52007, 1076, -38752, -17679, 36456, -10173, -65528, -83273, -125953, -58696, 13288, 53105, 24367, -37198, -23526, -1830, 3656, -44060, 10470, 25394, 1442, -26370, -26878, -16899, -17044, -18461, 18727, 16358, 73915, 69002, -14693, -31569, -31841, -6353, 8164, 41388, 78940, 99845, 113350, -2332]
6362b332m4657j581l0232L6274N910K0037N7341K7033K5985n1635k3003M4290
6350F3430L9718m544j7859O34n887r043j56633k9113o0017K8610L5588l718j1778
6337a30612n0555Q0144J34429R2420k0459o8095J7694N9265l6860q9857j19953
6326a32439q7034O3055j6828p7542O6357J01816P927O4249L2714n2690r0662j9842
6314a40919J52185K5290m2658k6513j2268P329m5369M650k3476K4181k0003M3057
6302e4514K7812M0048k7234n2098k1992J399M7783J4209j01214n0695K8364J07507
6290d0625M4660n6414q0242K7142Q1114n575N026K1547K1219l5745m4471p2891
6278a35255L5907j0400K0186M4462K9023p6239O0797J07948P4267k9817p5147
$$ y = [-2332, -46989, -48570, -78802, -42528, -36618, -16581, 40760, 67793, 93778, 42143, 19140, 63430, 103148, 98604, 80745, 81379, 75492, 66449, -90184, -119297, -179314, -150704, -115116, -118834, -130612, -181167, -101023, 33406, 125826, 105367, 37272, 54966, 114231, 77371, -12486, -132439, -219473, -156418, -173246, -250788, -184431, -82615, -74688, -10439, 22275, -30415, -121077, -140919, 11266, 36556, -6102, -32615, -44883, -37554, -82923, -78273, -101749, -77568, -97571, -54514, -26702, 13346, -13888, -65986, -87978, -86579, -38796, -24587, -125801, -176496, -148132, -40625, 4035, -52379, -132621, -105479, -24365, -29940, -24914, -3367, 17852, -17893, -62364, -135255, -99348, -109748, -89562, -45100, -16077, -92316, -31519, 76429, 150696, 120879, 45732]
6267D5732m885n3925o030j36807N685K5690L1496N5605n2379p135O4104K1816
6255a1033J5347O700m9450k3208k9720M3050J42203m5362p3210K1795P1869O0248
6243A29229m0631j25016K5698k791J1046J7327k8153o835N9331L0367p4313M6609
6231D1868k9172L8252j7166l6046O8499n1813r9468k5732l2571P212P0280R1847
6219B5990p8543p8597M4710P1618m9022j2613J11458L1777r9770n934N8746p1221
6207e1401M9985p0951l5722l6697o2098P5710R1801M2279k1057k7036O2675L0749
6195D8237n4216n2093N6630J02564L2596q4469k4937o0913m2045Q7712Q0330O5427
6183A54823p0781l6041m1606K126J4306Q261M786j7405L8310O0887m5900j07966
$$ y = [45732, 40847, -13078, -19108, -155915, -150230, -124540, -93044, -37439, -89818, -96953, -32849, -11033, 4314, 11014, -38436, -61644, -91364, -48314, 93889, 48527, -24683, -2888, 68981, 129229, 88598, -36418, -10720, -13511, -2465, 14862, -13291, -20126, 39205, 69572, -4741, 41868, 12696, 50948, 33782, -2264, 66235, 14422, -85046, -110778, -143349, -136137, -65857, 25990, -52553, -131150, -86440, -14822, -63844, -76457, 35001, 66778, -32992, -38926, 19820, -51401, -1416, -72367, -108089, -144786, -206884, -131174, -39373, 2906, -18151, -45187, 17488, 48237, -5979, -58072, -1442, 101122, 133718, 49249, 24312, -36601, -78646, 9066, 89396, 154823, 84042, 48001, 6395, 8521, 22827, 31088, 35874, 18469, 56779, 117666, 71766, -36200]
6171c6200o4536n2879K2681Q0208L5249K960M9654l4068l3703K0943J529j3421
6159b1583l6629P8302j97r604q8814p4419l8923M0147O9149J2362J5138n9747
6147a14818q917n3203l6294J4417O8088L7699j4390l3968N5911J00714N7851K3322
6135I6412n9255m7741K2471N2408l7444N4937l3906m7284p7405l0900L9174M2895
6123b5638m9655P224N6725l630j3048K5784n3192j0018J21123n992q6475k2448
6111e9240M7399J14323j9573l3925Q8075K5198j00397q2721m4793O5125m53q4332
6099h5314K094L9198O6083K6421m4008J4680L1724N2862J4544p3804o6395n5492
6087g7407k1436L4860J8311r414j3876j1699M968K296L5579r425m3353J17729
$$ y = [-36200, -100736, -153615, -130934, -50726, -15477, -12517, 37137, 3069, -30634, -9691, -8162, -21583, -58212, 20090, 19893, 10289, -78525, -152944, -191867, -151720, -82571, -70209, -55071, -114818, -123735, -176938, -213232, -198815, -130727, -93028, -107418, -141386, -85475, 15239, 73090, 96412, 37157, -10584, 11887, 64295, 26851, 81788, 47882, 598, -76807, -107707, -68533, -25638, -75293, -68069, -11344, -14974, -28022, -2238, -55430, -65448, 55675, 49683, -36792, -59240, -11841, 102482, 82909, 48984, 137059, 162257, 61860, -20861, -65654, -529, -982, -85314, -83220, -44022, 22061, 48482, 4474, 19154, 50878, 103740, 118284, 44480, -21915, -77407, -98843, -63983, -45672, -55086, -68962, -80661, -75693, -73397, -37818, -47243, -90596, 27133]
6075B7133j4142k5718k8881J3489j0559M548R640l4302N8936L5097o5116p2075
6063a01950j06831k4389Q8611M6037J0907M4215R6404p627j2257j4997l790k2495
6051h162O4178j7483K2772Q783L4481q1653l1468o2359j4533K8591N9275L3761
6039C6183K1122m7999l6374k4029k7127n060j8126K1821n512p0600P1413J15533
6027C1245L6452K4212n9515n2855R465n603N6751L8684K5878o138K1200p0264
6015D9512J4221J05464k1482o2761j13016j6669M5585o2248n6846k6285Q981j01728
6003b37272l7882N7927P2151K9801J9440k813J21653P6526o6531L533L668j960
5991C8241q9341L064L3889l0462K5239k9167m779J36401Q1603o3161L2589m2275
$$ y = [27133, 12991, -12727, -41608, -28119, -38678, -34130, -24490, -58792, 144, 35241, -29875, -101950, -208781, -233170, -144559, -98522, -87615, -43400, 53004, 45377, 33120, 18123, 14333, -8162, 56016, 38533, 61305, 70088, 104569, 22916, -8552, -70911, -85444, -56853, 2422, 36183, 57305, 9306, -27068, -51097, -78224, -83284, -101410, -79589, -85101, -155701, -84288, 31245, 67697, 91909, 32394, -20461, -10996, -16599, 40152, 78836, 104714, 98576, 119776, 49512, 63733, 169197, 147715, 84954, -28062, -44731, 854, -61394, -118240, -144525, -135544, -237272, -275154, -217227, -145076, -115275, -95835, -98648, 23005, 99531, 33000, 36533, 40201, 38241, -51100, -48036, -14147, -44609, -19370, -48537, -53316, 83085, 164688, 101527, 134116, 91841]
5979I1841Q391R863O6951L800J663k2038n8219o0418r8001J2736L679k485L8595
5966c642J3328J05561k064q7580q0614K3107N4688N8392l3570q9267k3970Q2080
5954A6449J9495j7352m6445N747K4649j3452K8647O645J3407l2031o5277p5316
5942a34834R680J04140J55869j12967j03212k3837j0700j5897Q434J8375N2081
5931e2868K8959L388L5303J4130P681m3882o3114K6527M8860p530m5730l4491
5919h2767k1666J346O1932K4803j4810R532L9725K4936j21624q2582N07J31160
5907b9508J5972r477q4916j28539O2876K0063M6530Q9577l0614r1195p3265k2253
5895b34749n9287P6260M6758Q5917J20659l4147m4575N0582M4439K3222n9l2775
$$ y = [91841, 100232, 110095, 177046, 180846, 182509, 160471, 102252, 41834, -56167, -43431, -39752, -42237, -3642, 9686, 115247, 113183, 25603, -55011, -31904, 22784, 81176, 47606, -41661, -65631, 16449, 35944, 18592, -27853, -22106, 2543, -10909, 17738, 24383, 37790, 5759, -59518, -134834, -125154, -21014, 134855, 21888, -81324, -105161, -115861, -131758, -123324, -104949, -52868, -23909, -20521, 14782, 28912, 36593, -7289, -70403, -43876, 4984, -2546, -48276, -82767, -104433, -103087, -41155, -16352, -31162, -21630, 18095, 43031, -78593, -161175, -160668, -29508, -13536, -23013, -107929, -236468, -173592, -153529, -106999, -17422, -48036, -139231, -212496, -234749, -294036, -217776, -171018, -85101, 35558, 1411, -43164, 7418, 51857, 75079, 75020, 42245]
5883D2245j1212J2590J0441j781r2354n9434M4238N5055M3903J4998p3684K3729
5871H734q7201Q8056P551n7851k9423k5118M3213P8007K7828m9466M4498Q51p5952
5858b6273l8961l0444R0634M2138l2274J8641r356P897k1721m633n8508p5281
5846a38141N5458R7634K6014m4235m3535l3090R2047J11501R05n7018n0162k0463
5834c085j9670M213n1907J9981Q6052j2346k1260j2365J0324k6136L5482L1377
5822D0660k1093K956k0021M7964L930M3313K1750q1051L081K5427o2822N4122
5810E8216j6782J2946q252k7798p3611j3626J5617J6517J7896o767O587m004r0458
5797a13519k8658L1589n60l0080J5703J6881j8787L3104L9373J8299o863L112
$$ y = [42245, 31033, 43623, 54064, 52283, -40071, -99505, -55267, -212, 43691, 58689, -14995, 8734, -78467, 9589, 17140, -40711, -70134, -95252, -52039, 25968, 53796, 4330, 48828, 49679, -26273, -65234, -95678, -5044, 37094, 4820, 23461, 14105, 22002, 281, -4352, -62860, -138141, -82683, 14951, 40965, -3270, -46805, -79895, 12152, 123653, 124558, 67540, 17378, -3085, -22755, -18542, -70449, -50468, 35584, 23238, 1978, -10387, -63, -26199, 9283, 40660, 19567, 22523, 2502, 50466, 54396, 97709, 119459, 38408, 41489, 66916, 4094, 58216, 41434, 54380, 46128, 18330, -55281, -68907, -53290, -36773, -18877, -25644, -19057, -23061, -113519, -142177, -110588, -111148, -141228, -125525, -108644, -127431, -94327, -54954, -36655, -43518, -40406]
5785d0406K2981J1592N4833P565N652M6522j4793J4854q645m7988k9501K6926
5773D9592K8682l6191j28968n988k5342M540M2289N2320L8527m2375m4734m9750
5761a17398m2108L4183J75038N5359l4769n9075j09736j09037R2087L2476K2607
5750f0373j09059j9212M5277J9773K5649J2087J08629N5522J3049k9375J5618
5739G7585K3479K6449j4738N126n8884J32M6971p7710m4461q414l9665l9398k615
5726a06143k0564O5012O9259l2570j23821o5060R2013J15936O6929P5742j7464
5715A19269o7936m5049N8502J10134j0502j18889j38146o9592K8171N7434L0498
5704d6106K7750q9147l8148j5735P4336p6789K7996L5431J4047j8322K6173P8108
$$ y = [-40406, -17425, -5833, 49000, 56565, 62217, 108739, 93946, 108800, 100155, 52167, 22666, 49592, 78274, 42083, -86885, -92873, -118215, -113675, -71386, -19066, 19461, -22914, -67648, -117398, -159506, -125323, 49715, 105074, 70305, 11230, -98506, -207543, -115456, -82980, -60373, -169432, -188644, -143367, -123594, -97945, -85858, 22771, 78293, 91342, 61967, 77585, 101064, 127513, 112775, 117901, 59017, 59149, 106120, 28410, -16051, -24465, -64130, -103528, -106143, -126707, -61695, 7564, -25006, -148827, -213887, -121874, -5938, 60991, 136733, 119269, 51333, 6284, 64786, 174920, 164418, 45529, -92617, -162209, -134038, -76604, -46106, -18356, -107503, -145651, -161386, -87050, -163839, -135843, -100412, -86365, -104687, -78514, -406]
5692d06o138J6662R2846M5330o3519m200j8907q130l6238j9688J9005q906k3748
5679a6037N5626J17357L6828o4915o0839J2829l8323k3946l0070m0804K6684q3463
5667a09073l6613l7835L5284K1081Q0233O0043M3535P2618q6396l3561l5834k9235
5655e5753L1203m2593L6194J27443J5429j84067k9369j0749K2152N4207L0707
5644e196o6686l0477j3709K7245N7198k0897j4326P2210k6841n1226m363J1402
5632f5666l5674m1387J43440l5983j15291K8966P1942J2021J4497j2527L7332
5621A670k8207m4480J5417o6013K7117L9419K6174r4222n0694M3277O9575N5917
5609e050R8971M2273l1171m1282k9512J1817j10374r1501k2277O7248L0623k1775
$$ y = [-406, -6544, 10118, 102964, 148294, 84775, 80575, 61668, 53538, 17300, -2388, 16617, 7711, -16037, 39589, 156946, 193774, 128859, 68020, 80849, 42526, 18580, -11490, -52294, -25610, -109073, -145686, -183521, -148237, -127156, -46923, 13120, 56655, 129273, 42877, 9316, -26518, -55753, -24550, -67143, -30949, 96494, 111923, -72144, -101513, -112262, -90110, -35903, -5196, -71882, -102359, -116068, -88823, -31625, -52522, -66848, 5362, -21479, -72705, -77068, -65666, -101340, -142727, 713, -35270, -150561, -121595, -49653, -37632, -23135, -35662, 1670, -26537, -71017, -55600, -121613, -94496, -55077, -28903, -123125, -173819, -130542, -60967, -5050, 93921, 136194, 105023, 63741, 34229, 46046, -64328, -155829, -178106, -110858, -80235, -102010]
5597a02010j1509J21061P1127K7609l2563n1754j0055m0537J9551J1650m4053
5586d1483J3942O1790l6057n1115l6803J293L1778R691R7955j3321j24620m4955
5574a31905l9574j3579L9870K5519j2094m1116O0654L5603j9221j7640r4261j622
5562b09366L1920O6039L4640m2401k6951L3510J5271n10K1421J5466P0555L5999
5550D5593o4019k7253R5366q895m7523k7838K1445J8974R804J0534M5787P1516
5538A43491o7123L7574q1312j24673n5544n9102Q2021Q3266K1576K4669K0409
5527B5252J6135n0346J6206N9968l5105k4462j9912n9917m2553l5649O194N4547
5515h9642l5117n733K0180J14854Q8920M1696o7598l3986j0771K5770M3212n2790
$$ y = [-102010, -113519, 7542, 78669, 106278, 73715, 21961, 11906, -28631, -9080, 2570, -41483, -27541, 34249, -1808, -52923, -89726, -88433, -56655, -46964, 50991, 37670, -86950, -131905, -171479, -185058, -145188, -119669, -131763, -172879, -112225, -76622, -95843, -113483, -207744, -209366, -177446, -111407, -76767, -119168, -146119, -112609, -97338, -97848, -76427, -60961, 9594, 45593, -18426, -45679, 49687, 40792, -6731, -34569, -13124, 5850, 15654, 26188, 71975, 143491, 76368, 113942, 32630, -92043, -147587, -206689, -124668, -41402, -19826, 4843, 25252, 41387, -8959, 7247, 67215, 32110, 7648, -12264, -72181, -114734, -150383, -144189, -89642, -124759, -130492, -110312, 4542, 93462, 135158, 67560, 33574, 22803, 48573, 91785, 38995]
5503C8995m3299O5038J14815m5536p7079j1846j6896J4964M7546o0532m0489N1882
5491C7563m5659p4201p822N4607J22915l431O2512P5224L763k5012k1675n4708
5479A24076n2625o3682j941P5779o0887K9558K7337J3234q2715j26313K5725K8754
5467f3700P6806J8357j39j9644o2233O1211j4348j1829l6527L5146Q9704K4205
5455I7009J3058o6200l8737L7410O970r8347k8600J5836l6701l2032R0018O5302
5443B4986N0418J5409J8867j4022n005m6839o268n800J4779j951K3446o8141q575
5430h696q183n309O6455k2166n8209J6303J784q6330J0890J9619M936K5137N0691
$$ y = [38995, -4304, 60734, 175549, 130013, 52934, 41088, 24192, 39156, 86702, 26170, -14319, 37563, -8096, -82297, -90119, -35512, 87403, 83972, 146484, 221708, 225471, 200459, 178784, 124076, 71451, 7769, 5828, 81607, 20720, 50278, 77615, 90849, 8134, -118179, -92454, -63700, 13106, 31463, 31324, 11680, -50553, 10658, -3690, -15519, -52046, -16900, 72804, 97009, 110067, 43867, 5130, 42540, 49510, -48837, -77437, -61601, -98302, -130334, -40316, 24986, 75404, 90813, 109680, 95658, 90653, 43814, 37546, 31746, 46525, 44574, 68020, -121, -8696, -16879, -22188, 44267, 22101, -36108, -19805, -18021, -104351, -93461, -73842, -68906, -43769, 6922]
$$ [...]
##END NTUPLES=NMR SPECTRUM
##END=
