##TITLE=Analysis number 322117
Compound Code tl 00682
Project Code adrs
Chemist Name ians
##JCAMPDX= 6.0         $$ Bruker NMR JCAMP-DX V2.0
##DATA TYPE= NMR SPECTRUM
##DATA CLASS= NTUPLES
##ORIGIN= Bruker BioSpin GmbH
##OWNER= nmr
$$ XWIN-NMR		Version 3.5
$$ Wed Sep 13 11:06:06 2006 GMT Daylight Time (UT+1h)  MAYBRIDGE\nmr@NMR_250MHZ
##.OBSERVE FREQUENCY= 250.131544655141
##.OBSERVE NUCLEUS= ^1H
##.ACQUISITION MODE= SIMULTANEOUS (DQD)
##.ACQUISITION SCHEME= undefined
##.AVERAGES= 16
##.DIGITISER RES= 18
##SPECTROMETER/DATA SYSTEM= dpx250
##.PULSE SEQUENCE= zg30
##.SOLVENT NAME= DMSO
##.SHIFT REFERENCE= (INTERNAL, DMSO, 0, 16.5702)
##AUDIT TRAIL= $$ (NUMBER, WHEN, WHO, WHERE, WHAT)
$$ ##TITLE= Audit trail, XWIN-NMR		Version 3.5
$$ ##JCAMPDX= 5.01
$$ ##ORIGIN= Bruker BioSpin GmbH
$$ ##OWNER= nmr
$$ C:\u/data/dgb/nmr/ADRS/680/pdata/1/auditp.txt
$$ ##AUDIT TRAIL=  $$ (NUMBER, WHEN, WHO, WHERE, WHAT)
(   1,<2006-09-13 11:05:42.20 +100>,<MAYBRIDGE\nmr>,<NMR_250MHZ>,
      <created by zg, POWCHK disabled, PULCHK disabled
       configuration hash MD5:
       E2 DF 36 D8 04 B2 41 60 5A D7 A3 38 5A 4B D0 FE
       data hash MD5: 64K
       FE BA 5F B4 CD 57 86 AE AB 3D C1 34 FD C8 48 AE>)
(   2,<2006-09-13 11:05:55.90 +100>,<MAYBRIDGE\nmr>,<NMR_250MHZ>,
      <Start of raw data processing
       ef LB = 0.3 FT_mod = 6 PKNL = 1 SI = 32K 
       data hash MD5: 32K
       66 C4 59 38 6C B3 3F A1 80 32 96 8E BF 9D 94 03>)
(   3,<2006-09-13 11:05:57.87 +100>,<MAYBRIDGE\nmr>,<NMR_250MHZ>,
      <apk 
       data hash MD5: 32K
       53 EB F4 4D F0 82 28 4A E7 C8 68 DC 4F BD E0 B1>)
(   4,<2006-09-13 11:05:58.78 +100>,<MAYBRIDGE\nmr>,<NMR_250MHZ>,
      <abs ABSG = 5 
       data hash MD5: 32K
       96 47 0A C9 00 07 CD 28 F8 42 E4 3F 6D 0B 44 A0>)
$$ ##END=
$$ 
$$ hash MD5
$$ A8 BE 51 70 52 34 19 F2 DC 66 83 23 A8 32 1C 3F
##$RELAX= 
##$RELAX= 
##$RELAX= 
##$RELAX= 
##$RELAX= 
##$RELAX= 
##$RELAX= 
$$ Bruker specific parameters
$$ --------------------------
##$DU= <C:\u>
##$EXPNO= 680
##$NAME= <ADRS>
##$PROCNO= 1
##$TYPE= <nmr>
##$USER= <dgb>
##$AMP= (0..31)
100 100 100 100 100 100 100 100 100 100 100 100 100 100 100 100 100 100 
100 100 100 100 100 100 100 100 100 100 100 100 100 100 
##$AQSEQ= 0
##$AQ_mod= 3
##$AUNM= <au_zg>
##$AUTOPOS= <18 >
##$BF1= 250.13
##$BF2= 250.13
##$BF3= 250.13
##$BF4= 250.13
##$BF5= 500.13
##$BF6= 500.13
##$BF7= 500.13
##$BF8= 500.13
##$BYTORDA= 1
##$CFDGTYP= 0
##$CFRGTYP= 5
##$CHEMSTR= <none>
##$CNST= (0..31)
1 1 145 1 1 1 1 1 1 1 1 1 1 1 1 1 1 1 1 1 1 1 1 1 1 1 1 1 1 1 1 1 
##$CPDPRG= <>
##$CPDPRG1= <>
##$CPDPRG2= <>
##$CPDPRG3= <>
##$CPDPRG4= <mlev>
##$CPDPRG5= <mlev>
##$CPDPRG6= <mlev>
##$CPDPRG7= <mlev>
##$CPDPRG8= <mlev>
##$CPDPRGB= <>
##$CPDPRGT= <>
##$D= (0..31)
0 1 0 0 0 0 0 0 0 0.06 0 0 0 0 0 0 0.0002 0 0 0 0 0 0 0 0 0 0 0 0 0 0 
0 
##$DATE= 1158141941
##$DBL= (0..7)
120 120 120 120 120 120 120 120 
##$DBP= (0..7)
150 150 150 150 150 150 150 150 
##$DBP07= 0
##$DBPNAM0= <>
##$DBPNAM1= <>
##$DBPNAM2= <>
##$DBPNAM3= <>
$$ [...]
##$SUBNAM7= <"">
##$SUBNAM8= <"">
##$SUBNAM9= <"">
##$SW= 20.6930455092707
##$SWIBOX= (0..15)
0 0 3 0 0 0 0 0 0 0 0 0 0 0 0 0 
##$SW_h= 5175.983436853
##$TD= 65536
##$TD0= 1
##$TE= 296.16
##$TE2= 300
##$TE3= 300
##$TEG= 300
##$TL= (0..7)
0 120 120 120 120 120 120 120 
##$TP= (0..7)
150 150 150 150 150 150 150 150 
##$TP07= 0
##$TPNAME0= <>
##$TPNAME1= <>
##$TPNAME2= <>
##$TPNAME3= <>
##$TPNAME4= <>
##$TPNAME5= <>
##$TPNAME6= <>
##$TPNAME7= <>
##$TPOAL= (0..7)
0.5 0.5 0.5 0.5 0.5 0.5 0.5 0.5 
##$TPOFFS= (0..7)
0 0 0 0 0 0 0 0 
##$TUNHIN= 0
##$TUNHOUT= 0
##$TUNXOUT= 0
##$USERA1= <user>
##$USERA2= <user>
##$USERA3= <user>
##$USERA4= <user>
##$USERA5= <user>
##$V9= 5
##$VALIST= <valist>
##$VCLIST= <CCCCCCCCCCCCCCC>
##$VD= 0
##$VDLIST= <DDDDDDDDDDDDDDD>
##$VPLIST= <PPPPPPPPPPPPPPP>
##$VTLIST= <TTTTTTTTTTTTTTT>
##$WBST= 1024
##$WBSW= 4
##$XGAIN= (0..3)
0 0 0 0 
##$XL= 0
##$YL= 0
##$YMAX_a= 221429
##$YMIN_a= -292648
##$ZGOPTNS= <>
##$ZL1= 120
##$ZL2= 120
##$ZL3= 120
##$ZL4= 120
##$ABSF1= 16.57022
##$ABSF2= -4.122953
##$ABSG= 5
##$ABSL= 3
##$ALPHA= 0
##$AQORDER= 0
##$ASSFAC= 0
##$ASSFACI= 0
##$ASSFACX= 0
##$ASSWID= 0
##$AUNMP= <proc_1d>
##$AZFE= 0.1
##$AZFW= 0.1
##$BCFW= 0
##$BC_mod= 0
##$BYTORDP= 0
##$COROFFS= 0
##$CY= 12.5
##$DATMOD= 1
##$DC= 0
##$DFILT= <>
##$DTYPP= 0
##$F1P= 14.0000005364418
##$F2P= -0.99999901652339
##$FCOR= 0.5
##$FTSIZE= 32768
##$FT_mod= 6
##$GAMMA= 0
##$GB= 0
##$INTBC= 1
##$INTSCL= 1
##$ISEN= 128
##$LB= 0.3
##$LEV0= 0
##$LPBIN= 0
##$MAXI= 10000
##$MC2= 0
##$MEAN= 0
##$ME_mod= 0
##$MI= 0
##$NCOEF= 0
##$NC_proc= -4
##$NLEV= 6
##$NOISF1= 0
##$NOISF2= 0
##$NSP= 0
##$NTH_PI= 0
##$NZP= 0
##$OFFSET= 16.57022
##$PC= 1
##$PHC0= 141.8338
##$PHC1= -1.244808
##$PH_mod= 1
##$PKNL= yes
##$PPARMOD= 0
##$PSCAL= 4
##$PSIGN= 0
##$REVERSE= no
##$SF= 250.129987936887
##$SI= 32768
##$SIGF1= 0
##$SIGF2= 0
##$SINO= 400
##$SIOLD= 32768
##$SREGLST= <1H.DMSO>
##$SSB= 0
##$STSI= 32768
##$STSR= 0
##$SW_p= 5175.98343685301
##$SYMM= 0
##$S_DEV= 0
##$TDeff= 65536
##$TDoff= 0
##$TI= <Analysis number 999999
Compound Code 99
Book Reference 9
Project Code 9>
##$TILT= no
##$TM1= 0
##$TM2= 0
##$TOPLEV= 0
##$USERP1= <user>
##$USERP2= <user>
##$USERP3= <user>
##$USERP4= <user>
##$USERP5= <user>
##$WDW= 1
##$XDIM= 32768
##$YMAX_p= 289170950
##$YMIN_p= -372371
$$ End of Bruker specific parameters
$$ ---------------------------------
##NTUPLES= NMR SPECTRUM
##VAR_NAME=  FREQUENCY,     SPECTRUM/REAL,   SPECTRUM/IMAG
##SYMBOL=    X,             R,               I
##VAR_TYPE=  INDEPENDENT,   DEPENDENT,       DEPENDENT
##VAR_FORM=  AFFN,          ASDF,            ASDF
##VAR_DIM=   32768,         32768,           32768
##UNITS=     HZ,            ARBITRARY UNITS, ARBITRARY UNITS
##FACTOR=    0.157963299565203, 1,           1
##FIRST=     4144.7091656511, 0,             0
##LAST=      -1031.27427120191, 0,           0
##MIN=       -1031.27427120191, -372371,     0
##MAX=       4144.7091656511, 289170950,     0
$$ Real data points
##PAGE= N=1
##DATA TABLE= (X++(R..R)), XYDATA
$$ [...]
15492d969J5115Q0443O1680n606p7073O9641j2514n2883l4734M689l702N6506
15480I6593L3068K6815O5276K9724J9876o7845r2430j5884K2650j9275n298P6925
15468A70195L5603j9803r9492l8752L6910m1349N55l1048N8143N0435j8672l1713
15456G1012k7301N547q578k7259J8708L1780L134Q0553j9106j24385p072n0766
15444e3733k3105M0089K193K8140K1174k3555k9013L0675N0067L2024J688J06141
15432A82785m4945l1959m5101l9110M6432Q8498M7934m3543q2127L2069q421o336
15420I6176j084m4617l5945K6785p858m3425J0299l7004J6702j5859L7983j810
15408C43O908L4722K1440k1387j1312j9426k5333m0239J17650N9606k7500J5819
$$ y = [-4969, 10146, 90589, 152269, 146663, 69590, 139231, 126717, 73834, 39100, 43789, 40087, 96593, 129661, 156476, 221752, 251476, 271352, 203507, 111077, 95193, 117843, 98568, 93270, 170195, 205798, 185995, 86503, 47751, 84661, 43312, 43867, 12819, 70962, 121397, 102725, 71012, 43711, 49258, 40680, 13421, 32129, 63909, 67043, 147596, 128490, 4105, -2967, -53733, -76838, -36749, -34556, -6416, 14758, -8797, -37810, -7135, 42932, 74956, 76644, 182785, 137840, 105881, 60780, 21670, 68102, 156600, 204534, 160991, 78864, 110933, 102512, 96176, 95092, 50475, 14530, 41315, 33457, -9968, 331, -36673, -19971, -35830, 2153, 343, 7251, 41973, 63413, 42026, 30714, 11288, -14045, -54284, 63366, 122972, 95472, 111291]
15396A11291l5512l2286L9032K6386n9951n3553L3205P7729Q1590l3181r6897
15385E7853q540n3256M3224j774L3898L1667M9405m3880q111j3511q5487n8965
15373e7477J8725N8252j81N3741L334j7876n1770j6140O7356Q8493k171o606Q1319
15360B18999p794q5891k2436m9649M8675k8811M8661l9788p3673J3349m2588k1192
15348d2138K7494J07777M2783o6075m4665M2789K2026l6545j4513o853P327J7221
15336E6628l483k1472l3129L6271L4850k0920n9855O2511M2797K6296J7766l1284
15324A06976j4277K7424l5629K3977P6305M3310n9223j20605q4681p0920r483
15313a16826Q0028O7791O4236j0603N207o9980n0917J2669M8183K6812J00388
$$ y = [111291, 75779, 43493, 82525, 108911, 48960, -4593, 28612, 106341, 187931, 154750, 57853, 49313, -3943, 39281, 37507, 71405, 103072, 152477, 108597, 100486, 86975, 1488, -57477, -38752, 19500, 19319, 73060, 76394, 58518, 6748, -9392, 57964, 146457, 144286, 137680, 218999, 211205, 125314, 102878, 53229, 101904, 73093, 121754, 81966, 8293, 21642, -20946, -42138, -14644, 93133, 135916, 69841, 25176, 67965, 89991, 53446, 38933, 32080, 39407, 56628, 53145, 31673, -1456, 34815, 69665, 48745, -11110, 51401, 94198, 120494, 138260, 106976, 92699, 120123, 84494, 108471, 184776, 228086, 168863, 48258, -36423, -107343, -116826, -36798, 30993, 95229, 84626, 89833, 19853, -31064, -18395, 29788, 56600, 156988]
15302A56988l9402N626J0919J8644K029j14099r7220M9329N2508r858K8913j0272
15290E4105o6721L9462R407o0687Q0044J30418j5043R198k4095L3460J8154q1653
15278A26049j03559j05278L7461O5972N8223M9524q9128p4626K9501L2320p3805
15267d7346k0382m4160O8525L5114J849Q533P2157R4141P3173k7792J8571M8972
15255B81355l4742q1789q3352k4435Q8241P0947l9951q1182m9815P491K4505K6274
15243A03547m3789m0369Q8827N3746J6845j06915p7284j9964K6621M2296M4100
15232H7661N8361J0204L2354m4319K9047n0830k0297M892l8954l812Q9430M5365
15220A99102K8789n4329m0148R3148l9650j08983n1731J0791j1466Q0749N936
$$ y = [156988, 117586, 123212, 134131, 152775, 154804, 40705, -56515, -7186, 45322, 35464, 64377, 54105, -12616, 26846, 36253, -24434, 55610, 186028, 170985, 180183, 156088, 189548, 207702, 126049, 22490, -82788, -45327, 20645, 78868, 128392, 39264, -35362, -5861, 26459, -47346, -67728, -111888, -43363, -8249, -6400, 2133, 74290, 168431, 241604, 213812, 232383, 281355, 246613, 164824, 81472, 57037, 145278, 216225, 176274, 95092, 45277, 52768, 77273, 103547, 59758, 19389, 108216, 161962, 178807, 71892, -5392, -25356, 1265, 43561, 87661, 146022, 156226, 188580, 144261, 173308, 122478, 102181, 107073, 68119, 64307, 153737, 199102, 227891, 173562, 133414, 226562, 186912, 77929, 26198, 36989, 25523, 106272, 112208]
15209A12208k0626o0950j9437J03262J9986L815P3770j7472j3200k212o1738l2749
15197H4657J19838J05789l6891j14522m8484M8970k3343J1316J6889k5487n4826
15186H3906l7928m5358J3885M4802O2810M4484l3616o1827L3423O2310L957N2121
15174B22969K8754m438m1088p8164p0464O1968Q9245O6j1446n9766j5878m4662
15162G7096K3258N7713n948o8342j19380N9220R5082j3286K501K9022l905q2360
15150E0671j22983j1768R3193Q066q905L8886K2598p561J1598l6023P8475P4392
15138A90639M0391n5012j03658j01711J3822J40518R0975m352q2914l0352k4867
15127G3479j0409M9996J5786K2424l5872m958J47359l2506q3417L0582j1820l5718
$$ y = [112208, 91582, 30632, 11195, 114457, 134443, 138258, 212028, 194556, 181356, 179144, 117406, 84657, 204495, 310284, 273393, 158871, 110387, 159357, 136014, 147330, 164219, 138732, 83906, 45978, 620, 14505, 59307, 122117, 166601, 132985, 71158, 104581, 166891, 170848, 222969, 251723, 247285, 206197, 128033, 57569, 119537, 208782, 208848, 197402, 137636, 121758, 77096, 100354, 158067, 152119, 83777, -35603, 23617, 118699, 105413, 107914, 136936, 133031, 50671, -72312, -84080, 9113, 17179, 8274, 47160, 69758, 62197, 73795, 37772, 116247, 190639, 231030, 176018, 72360, -29351, -15529, 124989, 215964, 211612, 128698, 98346, 73479, 63070, 113066, 128852, 151276, 115404, 110446, 257805, 225299, 141882, 172464, 160644, 124926]
15115A24926j8440L0284j8310o6485J6445k8178N3365P1487k0592J1786l6335
15104A19953P8205J3424l7280k1983M0755j5957p1314k956L7931M0258j1388N135
15092A74783J8919J7903L8558M0375j7665n4048K6704l5160n9546j7512n4648
15081G8663L2594P8725k4197o2447m2796J0539R9169m7764O930L036j21578J3979
15069B4853P4639k3355j3440r200j2627J60837K9859j00314q7970M5558O9246
15058A58086l4673k6093P5991K7642m2811k5037K1912O8592L5218l8546j04251
15047A16030l4441j6374q2350K3799J7488Q6378o2592p2430m4331P8518L2296
15036D1991N9011M2562M5797K2075o7862J9280m4420J1751M6599K7512J2259m0912
$$ y = [124926, 106486, 136770, 118460, 51975, 68420, 40242, 93607, 165094, 144502, 156288, 119953, 198158, 211582, 174302, 152319, 193074, 177117, 105803, 102847, 140778, 181036, 169648, 174783, 193702, 211605, 250163, 290538, 272873, 218825, 245529, 210369, 150823, 133311, 78663, 111257, 189982, 165785, 103338, 60542, 71081, 170250, 122486, 129416, 132452, 10874, 24853, 99492, 76137, 62697, 53497, 40870, 201707, 231566, 131252, 43282, 88840, 158086, 123413, 97320, 173311, 200953, 158142, 133105, 155017, 223609, 258827, 220281, 116030, 81589, 65215, -17135, 6664, 24152, 110530, 47938, -24492, -68823, 9695, 41991, 101002, 143564, 189361, 211436, 143574, 162854, 118434, 130185, 176784, 204296, 216555, 175643]
15024A75643p739l5469n4606J3171J7003k4091j375M4788p144P649O829J10240
15012B44899k0792j37377k0905J01508J15087l5251q4968j7756J6586k9972J4060
15001A45119L9385p6734m1870j6116k0861L1647L5202K1916m2031q3150j1829
14990a9322R7614R0199M7337Q841l2834l0931k6402l0247n918M909o819o8323
14978B8104n0208j9830R3925P0646J2670l8615n9490L9211L6082K9825j9178o1333
14966F1809o650K0931j4624K1218q5420K6898P372K611J03194J4532m5467j229
14954A05175M2823J1741P397N299Q0098R484L933J0688J5745n3010l9378J550
14942B01545k8984L2261l301o6361k6237j5707N7351j7197O167K6723L6091j8588
$$ y = [175643, 167904, 132435, 77829, 91000, 108003, 83912, 82537, 127325, 120181, 127830, 134659, 244899, 224107, 86730, 65825, 167333, 282420, 247169, 162201, 144445, 161031, 131059, 145119, 184504, 107770, 65900, 49784, 28923, 60570, 95772, 117688, 75657, -7493, -19322, 78292, 168491, 215828, 224669, 191835, 160904, 134502, 104255, 98337, 103246, 96427, 28104, -22104, -41934, 51991, 122637, 135307, 96692, 37202, 76413, 112495, 142320, 123142, 61809, 55159, 76090, 61466, 82684, -2736, 24162, 31534, 34145, 137339, 151871, 106404, 105175, 147998, 159739, 167136, 172435, 252533, 262017, 265950, 276638, 292383, 239373, 199995, 201545, 172561, 204822, 201521, 135160, 108923, 93216, 150567, 133370, 139537, 166260, 202351, 183763]
14930A83763k872Q1202K8363l8880k3939j8844j5953n8080o5311j3157n6875j6187
14918a6770M9035Q6519J266j0536k1880J4425k0219n1443p660L3824K2040M6480
14906A25081K7610j6350m9470k7959M1755k8345p6541J3738P6311N902j7261N8872
14894A33343K4258r728P9761j8851p964n5630k0804m070L951l8649o0275J2967
14882C8309k0085l9793L3079K5565M0471p4133O9737N8801n8917k1335O3927n8159
14870E7467P956J7949M6117m1637K9206J8853l7152j1884L5706M4852l2974n3868
14858H0591K9340N1289M4442N1873p0260o2531R6166P8256n5403p0752j1356J4845
14846A76500K10l0249O302L4180Q577R453J7390K002o5134K1496J4446j6299j8921
$$ y = [183763, 180891, 262093, 290456, 251576, 227637, 208793, 192840, 134760, 69449, 56292, -583, -16770, 32265, 118784, 120050, 109514, 87634, 102059, 81840, 30397, 22737, 56561, 78601, 125081, 152691, 136341, 86871, 58912, 100667, 72322, -4219, 9519, 85830, 91732, 74471, 133343, 157601, 147873, 227634, 208783, 200819, 145189, 124385, 120315, 124266, 85617, 25342, 38309, 18224, -21569, 11510, 37075, 77546, 3413, 73150, 131951, 73034, 51699, 115626, 57467, 65423, 83372, 129489, 87852, 117058, 135911, 98759, 86875, 122581, 167433, 134459, 80591, 109931, 161220, 205662, 257535, 187275, 124744, 220910, 299166, 243763, 173011, 161655, 176500, 176710, 146461, 152763, 186943, 195520, 204973, 222363, 224365, 159231, 180727, 195173, 178874, 159953]
14833A59953O599L4571j8748r576l3184k5232L4754j2705j4212n779j7174p9514
14821A9753l0895J2299m994n2443M6800l3182J0360P0157Q5358j1705N4691R4105
14809B60304m681j2870k2066M2694l1840n5995j1759J4407L5259m6976n1658N1915
14797A66734j5301j3241l3736j831Q4287K376M5119q9928n2129L6265n330J05310
14785B28595L0688K5622N476m6695q861o029q2663m1309R563m314m3276l8976
14773B7821O9526J3383m75n0426k5997j7114L5889p788k939J1876K36R8092N9088
14760B11172j0261o157k9830J8725L8658K7547N60n4873l1983p4104o9699r646
14748A0109K4087N1389n349j0976L0508K4163m5622N0026M6059Q2434J1286L4373
$$ y = [159953, 166552, 201123, 182375, 172799, 139615, 114383, 149137, 136432, 122220, 116441, 99267, 19753, -11142, 1157, -3837, -56280, -9480, -42662, -32302, 37855, 123213, 111508, 166199, 260304, 255623, 242753, 220687, 263381, 231541, 175546, 163787, 178194, 213453, 166477, 114819, 166734, 151433, 138192, 104456, 102625, 186912, 189288, 234407, 144479, 92350, 128615, 123285, 228595, 259283, 284905, 290381, 243686, 234825, 228796, 146133, 104824, 114387, 110073, 66797, 27821, 97347, 110730, 110255, 59829, 33832, 16718, 52607, 44819, 41880, 53756, 53992, 152084, 211172, 200911, 194754, 164924, 183649, 222307, 249854, 250414, 195541, 163558, 89454, 19755, 10109, 34196, 85585, 80236, 69260, 99768, 123931, 78309, 128335, 174394, 256828, 268114, 302487]
14736C02487k7503P989n5186q5436P667P3076n4558k9109k1329P5475N8595L9032
14724B91200o467l1282m5866m1266N1627K186O758L659m582k5278K7023Q487K2807
14711B59006J4712O081M6664P3128k9764j4403m3127m637o3662q2564o6399K9288
14699A24323P4155o1684K5720n4084J6536O1950J5574n0450J3131o640k3369J9752
14687A54914L5858j515j8576J2358L4039l7470n0878P236M8801r19o882m0126
14675A36840j9727n7391L5357O4272O996p0871l0249P7186J21742o8832r4499
14664A00824k1393j91K0076R4846Q245J6851M0463N6681j23234n1372M0255L3460
14652B15511m1791q0219p6272P0858L6718K1573J5016m7779l0286J338L0414O7588
$$ y = [302487, 274984, 282973, 227787, 142351, 150018, 223094, 168536, 139427, 118098, 193573, 252168, 291200, 284733, 253451, 207585, 166319, 217946, 220132, 226890, 230549, 225967, 200689, 227712, 236199, 259006, 273718, 279799, 326463, 399591, 369827, 355424, 312297, 307660, 243998, 161434, 95035, 124323, 198478, 136794, 162514, 108430, 124966, 186916, 202490, 152040, 165171, 158531, 135162, 154914, 190772, 189257, 170681, 183039, 217078, 179608, 128730, 135966, 184767, 183848, 176966, 136840, 117113, 59722, 95079, 159351, 166347, 95476, 65227, 142413, 264155, 195323, 100824, 79431, 79240, 99316, 194162, 202407, 219258, 259721, 316402, 193168, 141796, 182051, 215511, 173720, 93501, 17229, 88087, 124805, 146378, 161394, 113615, 83329, 84667, 115081, 182669]
14640A82669R7039P4728q109m8885q3376P2097o0701m8455M0834K2746l2398L7817
14628B46006O915M1390p1582j13194p2378p563Q5358Q0871L1791j03203r7042
14617B7369J0214J03688j4898J9950N7500J32143P3080r1447k6329m1251n0679
14606A99340m4725p8702Q1201L4047P152p1532l3035j4298K4239K8753q8108N4835
14594I9167o964L0833N2637J4299K4013p02n7236L5225J5280m1568j6284p280
14582A41420L0993O0674m9579K2045N3262k3595m0033k3823j379l731P5263L2049
14570B73566o2752o2870R952O2162q3583K5234M4638l5321N9688k1997n9358k6596
14558A22763L3491j704j0124M7862O0478l4744k7614m9543K3980L606m440l6288
$$ y = [182669, 279708, 354436, 346327, 297442, 214066, 286163, 225462, 177007, 217841, 240587, 208189, 246006, 252921, 294311, 222729, 109535, 37157, 29594, 114952, 195823, 227614, 124411, 27369, 37583, 141271, 126373, 146323, 203823, 335966, 409046, 317599, 291270, 250019, 199340, 154615, 75913, 157114, 191161, 198313, 126781, 93746, 79448, 103687, 132440, 44332, 99167, 92203, 123036, 175673, 189972, 213985, 213283, 156047, 191272, 206552, 164984, 148700, 141420, 172413, 233087, 183508, 205553, 258815, 235220, 195187, 171364, 169985, 166254, 241517, 273566, 210814, 147944, 157896, 220058, 136475, 161709, 206347, 171026, 230714, 208717, 149359, 122763, 156254, 154550, 144426, 192288, 252766, 218022, 190408, 140865, 164845, 168451, 164011, 127723]
14546A27723l9035R8418M9070O8928o8493j08532R780O896K6861L7456k6989l7251
14534A44832P6361N239p890N9667l7007k9409m3291k7666K5326l0003n9450M7596
14522A24305O8679K5719N62j0081K6677N415j00496K6643P0991M864m5362m0351
14510A57565L7316M7548J9728J0901k30m3409l1816O2958L3612k8138J7322o0835
14498B22522L2213J4143m4948n3732q1281R9679R6604l7885K8687L25M0748O9213
14486C86288p8561j43609K5325k4054M3548K8468j40578m7856R3475P0345N146
14475B17937L4942M7190j3082N700l7060l1964p333k4249m4662N2638R719K1380
14463B31156O918J8517N3010K3287r4553l7619m292n454l8129N9753J08573n8093
$$ y = [127723, 88688, 187106, 236176, 305104, 236611, 128079, 137859, 144755, 171616, 209072, 182083, 144832, 221193, 226432, 218542, 278209, 241202, 211793, 168502, 140836, 166162, 136159, 76709, 124305, 192984, 218703, 219265, 209184, 235861, 241276, 140780, 167423, 238414, 243278, 197916, 157565, 194881, 242429, 262157, 273058, 272828, 229419, 197603, 260561, 294173, 266035, 283357, 222522, 254735, 268878, 223930, 170198, 88917, 188596, 285200, 247315, 276002, 276327, 317075, 386288, 307727, 164118, 189443, 165389, 208937, 237405, 96827, 48971, 142446, 212791, 217937, 252879, 300069, 286987, 292687, 255627, 223663, 216330, 192081, 147419, 200057, 209776, 231156, 238074, 256591, 309601, 332888, 238335, 200716, 196424, 190970, 152841, 212594, 321167, 263074]
14451B63074m8835m0074p69P6835K3497k0204j3094J147k8775m1997N0877L6906
14439B58588M365k8974l877K7159k1521N2574k9343o6227k6970J2145K4357j3535
14427A88741J14616J05462m8878r75j7755n0843L0024J7868L6200M5311k8011
14416C91760q2054l5727k6898K883M71L013P628N0052p7167r4938k0527M4229
14404A62725k0163K7483N7494N8059j6282k9921r130K5663J4703J5759n9969q8672
14392A37749L9540N8806n403M2224K4641l089o986o3173J6048M93j3309L310O4403
14379B95254R0359k0108k4195l2817j6437m1324O8337k1212j8842M9138m008j9952
14367C04193n3633r8601L0544q0598j4112J7284N7281J8743J06819R1735o7753
$$ y = [263074, 214239, 174165, 173396, 250231, 273728, 253524, 240430, 241577, 212802, 170805, 221682, 258588, 262953, 233979, 230102, 257261, 235740, 288314, 258971, 192744, 165774, 177919, 202276, 188741, 303357, 408819, 359941, 358966, 341211, 290368, 320392, 338260, 374460, 419771, 391760, 309706, 273979, 247081, 249964, 250435, 253448, 261076, 311128, 233961, 139023, 118496, 162725, 142562, 170045, 227539, 285598, 269316, 239395, 230265, 255928, 270631, 286390, 226421, 137749, 177289, 236095, 230692, 272916, 297557, 294468, 287482, 224309, 240357, 240850, 227541, 230851, 295254, 385613, 365505, 341310, 308493, 292056, 250732, 319069, 297857, 279015, 328153, 324145, 304193, 250560, 151959, 182503, 101905, 87793, 105077, 162358, 181101, 287920, 379655, 311902]
14356C11902o5326l3550j25528o4912N5505L005P9872L8871r2382J7178J46344
14345B70979P4034N8076k3288j556J4693n5999p2337r3276J0198k6485K6524k552
14333A79011P40P630L7341Q2844o4443J73L2088o952J9008k1340n2633N0856N2180
14320C16503p531J0091l933n986m127M2822O9188P545l1829n6746o6451n7043
14308B12503k4120J1833Q2186M7474l1853K5955j268o8023K4168L3515n6878K0564
14296B76056J22471n2160j02449k1970k5784j00162L2513J17709Q7812K6861k2665
14285C38232j5184m5769L5344J7944K7779o7513q0206m4069M8414O0073l0652
14274B44393o2699o92J3585N5779M2491r8684K5556N3025J7016k1741J5882p1897
$$ y = [311902, 246576, 213026, 87498, 22586, 78091, 81096, 160968, 199839, 107457, 124635, 270979, 345013, 403089, 379801, 378245, 392938, 336939, 264602, 171326, 181524, 155039, 181563, 179011, 179751, 187381, 224722, 307566, 243123, 243296, 275384, 268432, 287440, 266100, 213467, 264323, 316503, 308972, 319063, 315130, 309144, 305017, 347839, 417027, 424572, 392743, 335997, 269546, 212503, 188383, 200216, 282402, 329876, 298023, 323978, 322710, 254687, 278855, 312370, 255492, 276056, 398527, 346367, 243918, 221948, 196164, 96002, 128515, 246224, 334036, 360897, 338232, 323048, 277279, 312623, 330567, 358346, 290833, 210627, 166558, 214972, 275045, 244393, 181694, 181002, 194587, 250366, 292857, 194173, 219729, 272754, 289770, 268029, 283911, 212014]
14262B12014n2647K0345J6061M4768o0037M4850N5604q2139l5923M6367L4688
14251B43951l9796N252m2434q5505m0452P2919J04127O8207K0762J20015n077
14240D21969j23831p6949l2857N4126k5450l8219J0015J1166Q531l8934q536J06995
14228B68026k9652o019j0448J1950L9651K6794n8148J3671O7749M8095Q8934j36590
14216C24013j99759n3410O3089Q2166L8796k6706J320N8622m9675j35076R098
14205A12478L5126M0575O0488J21035K7535q2555o4669l0232P3369N905k5411
14194B73644K452O3105m3633k5355n9478K3550Q2243J24782O1942o6430r2530
14183C44292k2631J21695O5095n4046j10101n4338p0849N2047L3728P743n4891
$$ y = [212014, 159367, 179712, 195773, 240541, 180504, 225354, 280958, 198819, 162896, 209263, 243951, 204155, 209407, 166973, 81468, 41016, 113935, 218062, 286269, 307031, 427046, 421969, 298138, 221189, 188332, 242458, 217008, 178789, 188804, 199970, 208501, 169567, 161031, 268026, 238374, 232355, 221907, 233857, 273508, 300302, 242154, 255825, 323574, 371669, 460603, 324013, 124254, 70844, 133933, 216099, 254895, 228189, 229509, 288131, 238456, 103380, 112478, 147604, 188179, 248667, 369702, 397237, 314682, 250013, 219781, 293150, 299055, 273644, 276096, 339201, 295568, 270213, 210735, 234285, 316528, 441310, 503252, 436822, 344292, 321661, 443356, 508451, 454405, 344304, 289966, 219117, 271164, 304892, 312635, 257744]
14172B57744K3710N8835K6903o1490j27141Q165R065R2301M7090m5914k5210j0348
14160B53710j1247R0444L9715q5673q4973N6459n9178p0159K7882j5565J233L087
14148A45735L6887j70J6350M3784J29217N7396l7416k9599n2727l6225Q4959p760
14136C50431M6805l4088m3991k7084J6440r522L2826J7213O203k9950J5212N285
14124C45780l6613J5349l4695O078k7305k4253M4438K2689J1699j9257n5627O4238
14112C12521N6090p9069l121l2086O4211O2296J0913r8380q46P7606l5691o695
14100C27749P227n367M0561p1561j26538k7006J4362K8403N4030m954M7115N4535
14088C38556Q302Q2331o3773Q537J4575q150K3603l6030j08971m5182O7379K6091
$$ y = [257744, 281454, 340289, 367192, 305702, 178561, 186726, 195791, 288092, 335182, 289268, 264058, 253710, 242463, 332907, 372622, 286949, 201976, 258435, 199257, 129098, 156980, 141415, 142648, 145735, 182622, 182452, 198802, 242586, 371803, 429199, 391783, 362184, 309457, 273232, 358191, 350431, 397236, 363148, 319157, 292073, 308513, 298991, 331817, 349030, 355233, 325283, 340495, 345780, 309167, 324516, 289821, 295899, 268594, 244341, 288779, 311468, 323167, 303910, 248283, 312521, 368611, 289542, 286421, 254335, 318546, 380842, 391755, 293375, 292529, 370135, 334444, 327749, 334976, 329609, 370170, 298609, 172071, 145065, 159427, 187830, 241860, 236906, 284021, 338556, 346858, 429189, 365416, 373953, 388528, 380378, 403981, 367951, 258980, 213798, 281177, 307268]
14076C07268p533K6474K2355J2244r444K1763N8094K5330o9197o2668n601J8171
14064C37256n5749Q1983m5418j11778j2426j1086O4082R8901R7334n5036m0830
14053C47233m9433M0249j088p2494k4934o9391o1363R2824R5582l2986m7643J17232
14041C33788J04565l3539P455n0732M5829o5780n3772q584k3147l4899r9353K4483
14029A46314R2420O9260J0563K9247l4993j13702k4782j0019O0165J79151K232
14018D05856o8902q8429K1937l0271l5988N2387M7964P729O68j6482n0846N6162
14006C01785Q5476j5785l0809n5441l041j6321k8736k9090N7972P131j3511l5341
13994B24289m03L9894n128q883M0347j5524j3921o5014j2634M6594M7809l3340
$$ y = [307268, 299735, 326209, 348564, 360808, 351364, 373127, 431221, 456551, 387354, 324686, 319085, 337256, 281507, 363490, 318072, 206294, 193868, 182782, 246864, 345765, 443099, 388063, 347233, 297800, 338049, 336961, 264467, 239533, 170142, 108779, 201603, 297185, 264199, 216556, 333788, 438353, 404814, 412269, 361537, 407366, 341586, 287814, 279230, 256083, 221184, 121831, 146314, 238734, 307994, 318557, 347804, 312811, 199109, 174327, 164308, 224473, 403624, 405856, 336954, 248525, 270462, 240191, 204203, 256590, 304554, 312283, 312951, 296469, 245623, 301785, 387261, 371476, 340667, 285226, 282185, 265864, 237128, 208038, 266010, 273141, 259630, 224289, 223886, 263780, 258652, 249769, 290116, 274592, 260671, 195657, 183023, 229617, 277426, 244086]
13982B44086m5265j3948N1197Q942l5606O6853O9632o1313J5851K1472q894N4737
13970C67744R547l5092o5537K8194K7061q1788P1945N0397M6243m9412l096r4188
13958B72018M1944N4383o0834j0929N4787O0322k3489j6937p287l982o3117L7644
13946C34523J7202k3860J22J1648K647M3422O5773j9391l3228j3720p4930O222
13934C16430J9151M4314M839O1076j8524k0443M1851J1866Q05n7830J02J0442
13922D14079J06157j1313m9665p2765m9821P756L1443O859l5600m6233p4657J21447
13910C47687R4935l6653L0725K3956o3225k1214N0202k1156k8564j2323J1966
13899C76336N3470L6132m3950k2239J1870K7939J18230O8268N1983n4244r1755
$$ y = [244086, 198821, 184873, 236070, 245012, 209406, 276259, 345891, 284578, 300429, 321901, 313007, 367744, 377291, 342199, 276662, 304856, 331917, 250129, 322074, 372471, 418714, 369302, 366206, 272018, 313962, 368345, 307511, 296582, 351369, 411691, 388202, 371265, 363978, 359996, 296879, 334523, 351725, 327865, 327987, 339635, 342282, 385704, 451477, 432086, 398858, 385138, 310208, 316430, 335581, 379895, 384734, 445810, 427286, 406843, 448694, 460560, 461365, 403535, 403637, 414079, 520236, 508923, 459258, 386493, 336672, 344428, 375871, 382730, 347130, 300897, 226240, 347687, 442622, 405969, 436694, 460650, 397425, 376211, 426413, 405257, 376693, 364370, 376336, 429806, 465938, 421988, 399749, 411619, 439558, 557788, 626056, 678039, 623795, 532040]
13888E32040n6829K8880l7457l4737l6679l9168j630Q959K7491K3100k3342J0545
13876D01173p52p1L5711L8561J2823n0820n2305J2764j4146m7371N019J7525M7704
13863D05815p7579o392O8529j0280q6952q458N2307O754K8369l3891J0575j5492
13851C33305m3685L613R8970j4297L429k1255K1697j6705P71l2599m56L2005k5632
13838C39161j5648Q901j3422q2576J6297N051J3886Q5338L7158L5016L3878m7040
13826D16000J6661j2988k1048K6790j891k1927K1828L7587j8020K509K0986j8800
13814D47687p9315K5645J2887n2019p0160P8989M0547k4025o6014l9823P2990
13803C47389K3752L239k0584M354N8809J6874m4213n5861L799P7539M224l2253
$$ y = [532040, 475211, 504091, 466634, 431897, 395218, 356050, 354420, 363379, 390870, 413970, 390628, 401173, 400421, 400350, 436061, 474622, 487445, 436625, 384320, 397084, 382938, 335567, 340586, 358111, 405815, 328236, 321844, 390373, 380093, 293141, 284683, 336990, 343744, 372113, 338222, 348797, 333305, 289620, 293233, 392203, 377906, 381335, 360080, 381777, 365072, 365843, 333244, 332788, 364793, 339161, 323513, 332414, 318992, 236416, 252713, 257764, 271650, 356988, 394146, 429162, 463040, 416000, 432661, 419673, 398625, 425415, 423524, 401597, 423425, 461012, 442992, 445501, 466487, 447687, 368372, 394017, 406904, 354885, 284725, 363714, 404261, 380236, 314222, 274399, 347389, 371141, 374380, 353796, 358150, 416959, 433833, 389620, 333759, 337558, 415097, 419321, 387068]
13791C87068M9717K3552l9198r569j2190k6985Q946o150N5391R4622N1501p3170
13779E03535j33288P5171K7612k7769L6510k466J1153N0693n0015j30024m511
13768C56601N9047j5579M5564L3167o753j890p2211o4232l7521K7237Q1201M6329
13756D50960n540K7665j4612O061L9112K8286j2956N5211p8037J2691L4484j09512
13744D33813k5635R27r7501j5203O9019J38285Q1425o0384n2426n493J9297l1149
13732D54975j8736K5946n8854j4473k0312P7946O3230M545n1861r509o1197r608
13720C82092L1312P669M5110O3251r47n5438p1427J5919l8124K2346L5992L0307
13708D68062j2042K0262k7165m5840K4630O5247N6982n4590k3955J3613l9044
$$ y = [387068, 436785, 460337, 421139, 411570, 399380, 372395, 381341, 375191, 430582, 525204, 576705, 503535, 370247, 445418, 473030, 445261, 481771, 479305, 490458, 541151, 491136, 361112, 356601, 415648, 400069, 445633, 478800, 472047, 470157, 397946, 333714, 296193, 323430, 404631, 450960, 445420, 473085, 458473, 464534, 503646, 531932, 518976, 574187, 496150, 508841, 543325, 433813, 408178, 409105, 311604, 296401, 365420, 503705, 585130, 524746, 472320, 466827, 486124, 454975, 436239, 462185, 403331, 388858, 368546, 446492, 509722, 514267, 462406, 452897, 391700, 382092, 413404, 421073, 466183, 529434, 528487, 473049, 401622, 417541, 379417, 401763, 437755, 468062, 456020, 476282, 449117, 403277, 427907, 493154, 550136, 495546, 471591, 485204, 446160]
13697D46160n1124j5186R3780L9791q367M4832L9341q9785p1501k7959M6385N8045
13685E04412J8575j8868j0771l5081l2645K7526K0584p3757N253J8239L2420k4906
13673D30981K0822N7583R2785j5301m4802j7111l2897o3338j2206R7378m85M0401
13661E53810n6277M3653K1326l8083o4330p2570Q0571l546o4566L7552J9520M677
13649D61737l5695J7252j5828n1404O5833K4723M1325N1139j02087m0991L5963
13638D51967Q7474N7965o4681J5484k0922j8745M9245M7756O7449j6243m619M1877
13626F94007p2965q9018o823r889K6112L6131N947k7628l7324K1124P4492n0479
13614E63687n4693J1031k6363l4578l4223O2530J08064m343q9543n9592Q195O5328
$$ y = [446160, 395036, 379850, 473630, 513421, 505054, 549886, 589227, 499442, 427941, 399982, 446367, 504412, 522987, 504119, 493348, 458267, 425622, 453148, 473732, 399975, 405228, 423467, 455887, 430981, 451803, 509386, 602171, 586870, 542068, 524957, 492060, 428722, 416516, 513894, 513409, 553810, 497533, 541186, 562512, 524429, 460099, 387529, 468100, 464554, 399988, 437540, 457060, 461737, 426042, 443294, 427466, 376062, 441895, 466618, 507943, 559082, 456995, 416004, 451967, 539441, 597406, 532725, 548209, 527287, 508542, 557787, 605543, 672992, 656749, 652130, 694007, 621042, 532024, 525201, 515312, 541424, 577555, 583502, 555874, 518550, 539674, 614166, 563687, 508994, 520025, 493662, 459084, 424861, 487391, 595455, 591112, 501569, 441977, 450172, 515500]
13602E15500P742o6312N2395Q3419P0018K5692L7208r080r8642n810M7124L2317
13590F91571n5484j01976k7323K8427q170k2580l130k1059K0072P4918p7164L4003
13578E32105j4454j10020J04264N3014j01554l8650N7031K7328j7993l6329j5404
13567D39338L5020o2326J232J7049J35140O1389o7838j985J6839J6251R568o046
13555E93631K6254J229j5988O1620N0425J46551o080o339q2280j28462n4615j8696
13543E67250L8935L3939p5006j03768M7204O1435R4506K1544j4427K1367N6725
13532G49704N0541n9830j46648j3879k3211K4022N0420K7329m3948m6L5248l678
13520F46024K735j09275r0017N470Q8238j8938k4223m654K3105K2584J8834M6650
$$ y = [515500, 523242, 456930, 509325, 592744, 662762, 688454, 725662, 716582, 617940, 612130, 659254, 691571, 636087, 534111, 506788, 535215, 527045, 504465, 501335, 480276, 500348, 575266, 498102, 532105, 517651, 407631, 511895, 564909, 463355, 424705, 481736, 509064, 491071, 454742, 439338, 474358, 412032, 413264, 430313, 565453, 626842, 559004, 557019, 573858, 590109, 599677, 593631, 619885, 621114, 605126, 666746, 717171, 863722, 857642, 851303, 769023, 640561, 585946, 567250, 606185, 640124, 565118, 461350, 508554, 569989, 664495, 686039, 671612, 692979, 749704, 800245, 740415, 593767, 579888, 556677, 580699, 631119, 658448, 614500, 614454, 649702, 646024, 648759, 539484, 449467, 454937, 543175, 524237, 500014, 495360, 518465, 541049, 559883, 606533]
13508F06533M467m0610L0028J32662L153k1617j12382m2335P887K5212J16229
13497G09227j748k9201k5045m4978k5648J4906J1664K801J039P4907M978l8659
13485F54243j42048k5988j9228R6739O2281p3808n9230M1677J5642k6962J9769
13474E43087r940o1321n0274K8823p379N8240O8751j2444N2683n4797K5275P4348
13462F55052N7353l1466k8357j4782M997O8427J06926j11411l5727K752m630R4069
13450G63203k1936r208l0854l7401j7019M3586J2369k9111q7109p9572M5519O6014
13438F18481l9709P817M3611j6576j0268k8522M1291N095p7642K7063N9380O9620
13426F99641k6087o28k2862N339k6731O0048M9623k147j6762L6492q1577M0666
$$ y = [606533, 611000, 570390, 600418, 733080, 736233, 714616, 602234, 559899, 567786, 592998, 709227, 707479, 678278, 653233, 608255, 582607, 597513, 609177, 611978, 613017, 687924, 692902, 654243, 512195, 486207, 466979, 563718, 625999, 552191, 492961, 534638, 550280, 523318, 543087, 533147, 471826, 421552, 450375, 442996, 501236, 569987, 557543, 610226, 555429, 580704, 655052, 712405, 680939, 652582, 637800, 642797, 711224, 818150, 706739, 671012, 673764, 669134, 763203, 741267, 732059, 701205, 663804, 646785, 690371, 702740, 673629, 586520, 506948, 552467, 618481, 578772, 586589, 630200, 613624, 603356, 574834, 616125, 621220, 543578, 570641, 630021, 699641, 673554, 672926, 650064, 655403, 628672, 688720, 738343, 736196, 719434, 755926, 674349, 715015]
13414G15015P6792K9413r0046r3493K2476M796K7645k7598k2766L8781j3420n141
13402F62454j9217j2344P38j0609n433Q1074M8491k379L0930j7541j08998n4552
13390E92614J5167l8084j9806P3644L1945k747K1586j7462q6393j3663Q5046L2959
13378F74806N61L9279J9071k7391j0415l1233k0967k8846j5443J7433L4635n949
13366F45541R0414K7149L3660j8282N266n9142o459K4788L0607k0259k0406m1213
13354F91664Q214J1919n4638p3255M9500N7830O9075Q3650j5998j20086M648L2046
13342G44569M4963Q783j45275o779J57759P7247n5022n9995o6697m4430l893j0637
13330F40593P1105J18778N55M0347N4557k4861j35805P019J3711o3436k5406M5449
$$ y = [715015, 791807, 821220, 731174, 637681, 660157, 664953, 692598, 665000, 642234, 681015, 667595, 662454, 643237, 630893, 631631, 621022, 615589, 696663, 745154, 742775, 773705, 756164, 647166, 592614, 607781, 569697, 549891, 623535, 655480, 652733, 674319, 656857, 570464, 556801, 641847, 674806, 675367, 714646, 733717, 706326, 695911, 664678, 643711, 614865, 599422, 616855, 651490, 645541, 735955, 763104, 796764, 778482, 783748, 724606, 718147, 742935, 773542, 753283, 732877, 691664, 699878, 711797, 657159, 583904, 633404, 691234, 760309, 843959, 827961, 707875, 712523, 744569, 789532, 798315, 653040, 646261, 804020, 881267, 826245, 766250, 699553, 655123, 651230, 640593, 711698, 830476, 831031, 871378, 925935, 901074, 765269, 772288, 785999, 722563, 697157, 742606]
13318G42606n7332j5307L1392J4440P335O7823N475o3228K5191P5051J7230j07162
13306G43514p5172K1527J18919P1765k2660o5988P238p279P1821N3979m6421q706
13294H62537M6042K7783n2740o1406Q754M8599j5521o9975j04872M5442R1535
13283H26178L5360m2431j31133r6515Q328n580M9941M3329p1288P4975L1393l4208
13271F88349p6459M2228P6429L8326L5538K7460J6780k9134n3169l4916N7391
13260G88823j05344p6103l3251M6126N9273K6754j3584L8086R2299P2595p8904
13249H16770O3720j1195m7773q231p914L0839O4161N2999n1794j62548O9062Q8157
13237H96253K5723j46690o4620J23129R2153o0215n6766J05284R2507q8671j33471
$$ y = [742606, 685274, 669967, 701359, 715799, 723134, 790957, 796432, 733204, 758395, 833446, 850676, 743514, 668342, 689869, 808788, 880553, 857893, 791905, 799143, 791864, 863685, 917664, 871243, 862537, 908579, 936362, 883622, 822216, 830970, 879569, 864048, 794073, 689201, 734643, 826178, 861538, 819107, 687974, 591459, 599787, 594207, 644148, 687477, 616189, 691164, 722557, 688349, 611890, 654118, 730547, 768873, 804411, 831871, 848651, 819517, 766348, 731432, 788823, 683479, 607376, 574125, 620251, 679524, 706278, 692694, 730780, 823079, 895674, 816770, 880490, 869295, 821522, 813291, 805377, 836216, 900377, 953376, 901582, 739034, 808096, 896253, 921976, 775286, 710666, 833795, 925948, 865733, 808967, 914251, 1006758, 918087, 784616]
13226G84616j7170p9522O9034K8774L4104l2096M3460P6918j63N358K0226k1417
13214I12122N5658L14n5329j4323m3050k4177O9143L9062L3969M0668N757q6843
13202I32971p2124l103O7411J071n2213p264j9195q727o331M6284m2408j3225
13190H23147Q059k8013J7308k946p297k803k0557j6324m9581m888K6560J11199
13178H53864P5951n6171l2440j859p652R4511L1638P98k7832n5051m6371Q440
13166H37826l0936m90M6251L8467n0007j20458j06211J02513J05043N0742M9540
13155I22280J4585j11981L2176K1493k5991m2608j4192P0315M6159q6828p359
13144H18049l2607n864P4900J05552N3633o2545n6204o4275n1386R8213N1328
$$ y = [784616, 767446, 687924, 756958, 785732, 819836, 787740, 831200, 908118, 907955, 913313, 933539, 912122, 967780, 968094, 912765, 898442, 855392, 831215, 900358, 939420, 973389, 1014057, 1019814, 932971, 860847, 857744, 925155, 926226, 874013, 866749, 847554, 838827, 832496, 878780, 836372, 823147, 831206, 803193, 820501, 817555, 810258, 807455, 786898, 770574, 720993, 716105, 742665, 853864, 929815, 873644, 841204, 839345, 831693, 926204, 957842, 958640, 930808, 875757, 829386, 837826, 806890, 806400, 852651, 891118, 841111, 720653, 614442, 716955, 821998, 872740, 922280, 936865, 824884, 857060, 878553, 852562, 809954, 795762, 866077, 912236, 825408, 818049, 785442, 779578, 854478, 960030, 1013663, 951118, 894914, 830639, 779253, 877466, 928794]
13133I28794o4994l6573K5632N2344M8706M1007o5867p8658j2812j6436M1296
13122H62439K8919J5506j0554j7856j568O9380o32K1099K3225l885L5360l1536
13110I89897l1615P309p8128K5265K7596k3333K2886O5342J4960J662K650p9631
13098I44860k8503K8130j0874n0173o755L892O609Q637M0543m122P8255m4122
13086I66377J6091K5595M0511L2472O0785m4665n1541p1397l079p62K847J00662
13074A073896K635N7371N2467M358l5433j7418J251r9283J992K652j7199K2680
13062A049969m1065j731K0638L3797l0213K2922O059k8100m4467k0164O4469N934
13050A038048p2533j5262O3264L2972k6133n4605j8858j9999L7960J3155M5854
$$ y = [928794, 863800, 827227, 852859, 905203, 953909, 994916, 929049, 850391, 837579, 821143, 862439, 891358, 906864, 896310, 878454, 876886, 946266, 945634, 966733, 989958, 986073, 1021433, 989897, 958282, 965591, 887463, 912728, 940324, 916991, 939877, 1005219, 1020179, 1021841, 1024491, 944860, 916357, 944487, 933613, 883440, 876685, 880577, 887186, 895823, 936366, 932244, 1010499, 966377, 982468, 1008063, 1048574, 1081046, 1141831, 1097166, 1045625, 974228, 971149, 970387, 973234, 1073896, 1076531, 1133902, 1186369, 1190727, 1155294, 1137876, 1139127, 1039844, 1041836, 1044488, 1027289, 1049969, 1008904, 1007173, 1027811, 1061608, 1031395, 1054317, 1060376, 1032276, 987809, 967645, 1032114, 1038048, 965515, 950253, 1013517, 1046489, 1020356, 965751, 946893, 926894, 964854, 978009, 1023863]
13039A023863l7189m5887L1567Q4377J11231Q0998k7986k9394N2625r014O859
13028A242050Q2037P4312N6851k2532j09043o6964k7569l9456p9389k3133M7228
13017A134392O1885k5054J00843k7571Q74M7910n8187j26983o2437O1031j1757
13006A094946n2043L9563R1582J5590j6290j0430n7199O2298K1865r8802M0876
12995A131956K9151n6894m0435Q0838K8192J3073J9071p9557K4273J53728O0282
12984A363678N0245N5214J3518K9235l5261p7054r1619o9570j5841j7851k5814
12973A178880J478l2753L4246q4561m873J11055K6501N4039j6317o0569m084K072
12961A205114j9309p7409o440o016j4535J5272N8152j3457L7605L1631o8840j3823
$$ y = [1023863, 986674, 940787, 972354, 1056731, 1167962, 1248960, 1220974, 1191580, 1244205, 1235191, 1242050, 1324087, 1398399, 1455250, 1432718, 1323675, 1256711, 1229142, 1189686, 1110297, 1087164, 1134392, 1196277, 1171223, 1272066, 1244495, 1245369, 1293279, 1235092, 1108109, 1045672, 1106703, 1094946, 1042903, 1082466, 1174048, 1189638, 1173348, 1162918, 1105719, 1168017, 1189882, 1091080, 1131956, 1161107, 1104213, 1063778, 1144616, 1172808, 1185881, 1204952, 1125395, 1149668, 1303396, 1363678, 1413923, 1469137, 1482655, 1511890, 1476629, 1399575, 1307956, 1238386, 1222545, 1204694, 1178880, 1180358, 1147605, 1181851, 1097290, 1092417, 1203472, 1229973, 1284012, 1267695, 1207126, 1203042, 1205114, 1185805, 1108396, 1101956, 1095940, 1081405, 1096677, 1154829, 1141372, 1178977, 1210608, 1141768, 1127945]
12949A127945l0274K1352J7448L820k5539K5026M3094Q7070n5200p5660n2959
12938A086123J2583O9931Q2940l9338o8300j4973P162J1505J8899N3057K6129
12927A245718r473r531o459q3250o2294L6582J9399N3404K4895J9943m9503j5261
12915A164170r009K3334M8369O8992j5030p0091M0323O278L058K7499j0191L6044
12903A313746n587k0354q596k0741o4602L5399L3614n6003n935O1544j3905k2255
12891A226325M4428K5380l443K7972J8871p5041m4917J3005Q1022n357m4187J9044
12879A283102j3416M1469o749j6922L7617m1014r117L1969P5106O0158J0634n080
12867A447757N140j7118k0811r832o532N045L2958k4139Q070K1534Q913K4367
$$ y = [1127945, 1097671, 1119023, 1136471, 1140291, 1114752, 1139778, 1182872, 1269942, 1214742, 1139082, 1086123, 1098706, 1168637, 1251577, 1212239, 1143939, 1128966, 1136128, 1147633, 1166532, 1219589, 1245718, 1236245, 1226714, 1220255, 1137005, 1074711, 1111293, 1130692, 1184096, 1208991, 1228934, 1179431, 1164170, 1155161, 1178495, 1226864, 1295856, 1280826, 1210735, 1251058, 1257336, 1260394, 1287893, 1277702, 1313746, 1308159, 1287805, 1279209, 1258468, 1193866, 1229265, 1262879, 1206876, 1200941, 1262485, 1248580, 1226325, 1270753, 1296133, 1292690, 1320662, 1339533, 1264492, 1219575, 1232580, 1313602, 1308245, 1264058, 1283102, 1269686, 1311155, 1304406, 1287484, 1325101, 1284087, 1274970, 1306939, 1382045, 1442203, 1452837, 1447757, 1452897, 1435779, 1414968, 1405136, 1398604, 1403649, 1436607, 1412468, 1420538, 1442072, 1450985, 1475352]
12855A475352l4430n8606l0816p230J4239m8221n4802K3765k9022K2824L1640
12844A304693j0782K8006L6577P4510k1979o4850J2976n9586j8849N0988M6178
12833A377882R861K9101L2446N5603m5564r1212m1489K491K5519N9559K9029O7606
12821A510832p447L8142K268o8427j01631N495P5301j131j336K3434M8023k4559
12809A498964p7413p7989L6790r58l0201P131J3011Q6589m7440o5139R990j541
12797A351794O4058J7153l3432J1723k6641l8214J7891j1456K5019K9324O609
12786A413828q771k4840L1201J00932L9398N7765l0684k1712m0637j0596L9724
12775A545608M5763m0331m4042M609p4372m1720L4800N6086M6227n7555K9725
$$ y = [1475352, 1440922, 1382316, 1351500, 1344270, 1358509, 1310288, 1255486, 1279251, 1250229, 1273053, 1304693, 1293911, 1321917, 1358494, 1433004, 1411025, 1346175, 1359151, 1299565, 1280716, 1331704, 1377882, 1387743, 1416844, 1449290, 1504893, 1459329, 1368117, 1326628, 1329119, 1354638, 1414197, 1443226, 1510832, 1503385, 1541527, 1543795, 1475368, 1373737, 1379232, 1454533, 1453402, 1452066, 1475500, 1523523, 1498964, 1421551, 1343562, 1380352, 1379394, 1349193, 1356324, 1369335, 1455924, 1408484, 1343345, 1353335, 1351794, 1415852, 1433005, 1399573, 1411296, 1384655, 1346441, 1364332, 1352876, 1377895, 1407219, 1413828, 1405057, 1380217, 1411418, 1512350, 1551748, 1609513, 1578829, 1557117, 1516480, 1505884, 1545608, 1591371, 1551040, 1506998, 1511607, 1437235, 1395515, 1430315, 1486401, 1532628, 1475073, 1504798]
12764A504798J9673j5915J3723P6237Q2297n3613m9737p4732L3278K1145p7043
12753A480111k9J30456J0878K8238n6898k1205o0981r2353J4185P3213M7562N0001
12741A603178l1090q3271m5560L749P6324k3848Q2029L2557L320p7327k7031L1488
12729A544518K6905l9891m9329N9889K9148q0814R9904j5540K7788J02592k6690
12718A678480m2248j2541M6817Q1798L3009M3998m9525l3270q3544l9093N2227
12707A676108Q0156M7015o6850q6507n0237k6817Q9047M7987O3332J9623p9900
12696A712957j1068K1297k2131j11116N9178J07227L6629J9154Q3883n3191j17968
12685A724851N0856J15651K6140J9491j02311l3958j6053J8293M3585J7546o2811
$$ y = [1504798, 1524471, 1508556, 1522279, 1598516, 1680813, 1627200, 1577463, 1502731, 1536009, 1557154, 1480111, 1480082, 1610538, 1621416, 1649654, 1592756, 1571551, 1510570, 1418217, 1432402, 1505615, 1553177, 1603178, 1572088, 1488817, 1443257, 1447006, 1523330, 1499482, 1581511, 1614068, 1617388, 1540061, 1513030, 1544518, 1571423, 1531532, 1482203, 1542092, 1571240, 1490426, 1590330, 1574790, 1602578, 1705170, 1678480, 1636232, 1623691, 1670508, 1752306, 1785315, 1829313, 1779788, 1746518, 1662974, 1623881, 1676108, 1756264, 1803279, 1736429, 1649922, 1599685, 1572868, 1661915, 1709902, 1773234, 1792857, 1712957, 1701889, 1723186, 1701055, 1589939, 1649117, 1756344, 1792973, 1812127, 1896010, 1842819, 1724851, 1775707, 1891358, 1917498, 1936989, 1834678, 1800720, 1784667, 1802960, 1846545, 1864091, 1801280]
12674A801280l4992L7055k1396n889J01386K8813q5971q1637j6005L1811J02750
12663A857205p2702J0738N8085l2537N2512m2291n8165M7175Q8510m8974j0153
12652A849403L647k04557k446J06214L2238R9275M597m5466l969n2769M0269P6286
12640A902722J9570l2803M2434O4470n1224l7798j8397m6080K0396L1843K8133
12629A923266j0648l6979O7138K028J5026K9767J4173L212J7060j1672J3000l9255
12617A986116n8340N5872l0555o4471J2426O4551q4247m0110Q4410N1658n9658
12606A917652p4895m3815n684N1915J3755L7030M6063M6483Q2233P6951m5498
12595B102190o5656l9426o96P2644k2575m1380L183K3865j1705j6511K3039m1960
$$ y = [1801280, 1766288, 1803343, 1781947, 1776058, 1877444, 1906257, 1820286, 1738649, 1722644, 1754455, 1857205, 1784503, 1795241, 1853326, 1820789, 1873301, 1831010, 1772845, 1820020, 1908530, 1859556, 1849403, 1853050, 1648493, 1646047, 1752261, 1784499, 1883774, 1888371, 1842905, 1838936, 1786167, 1826436, 1902722, 1922292, 1889489, 1931923, 1996393, 1945169, 1907371, 1888974, 1842894, 1863290, 1895133, 1923266, 1912618, 1875639, 1942777, 1944805, 1959831, 1989598, 2003771, 2006983, 2024043, 2012371, 2025371, 1986116, 1927776, 1983648, 1953093, 1888622, 1901048, 1965599, 1881352, 1841242, 1925652, 1977310, 1917652, 1842757, 1798942, 1793258, 1845173, 1858928, 1895958, 1942021, 1988504, 2070737, 2147688, 2102190, 2036534, 1997108, 1996412, 2069056, 2046481, 2005101, 2008284, 2032149, 2020444, 2003933, 2026972, 1985012]
12583A985012J6022M0395M2036n006k6500O3319J82579r971p1586m2973L4774
12572B208101j7585j860M5410k7707o9070o7084j6367k5737k5336Q2484K2656
12561B107905N2564J6414p9360m9108Q415K0096j1527K6365M3981J2891k7206
12550B121430O3409Q5781m0960k2542R278l4450j00164r6214l6136K7486M5880
12539B022798L2216O6361K5790p422M4660o4723J0368K5327k1058L3962j9611
12528B148668j8593j1783J19356p011o3358K3677M1474M3499n7543n3985p5657
12517B088744k1052P8286N9357J9670p4994m9334k7056J21443K7731p4969K7393
12506B175219P2891J6132M2158K8203p2611q0572k2617K1813N1026M7813L4562
$$ y = [1985012, 2001034, 2041429, 2083465, 2078459, 2051959, 2115278, 2297857, 2287886, 2216300, 2173327, 2208101, 2190516, 2188656, 2234066, 2206359, 2137289, 2070205, 2053838, 2028101, 2002765, 2085249, 2107905, 2160469, 2176883, 2097523, 2048415, 2056830, 2076926, 2065399, 2091764, 2135745, 2148636, 2121430, 2184839, 2270620, 2229660, 2207118, 2216396, 2181946, 2081782, 1985568, 1949432, 1976918, 2022798, 2055014, 2121375, 2147165, 2139743, 2184403, 2119680, 2130048, 2155375, 2134317, 2168279, 2148668, 2130075, 2118292, 2237648, 2230637, 2167279, 2190956, 2232430, 2275929, 2218386, 2164401, 2088744, 2067692, 2145978, 2205335, 2225005, 2150011, 2100677, 2073621, 2195064, 2222795, 2147826, 2175219, 2248110, 2264242, 2306400, 2334603, 2261992, 2181420, 2158803, 2180616, 2231642, 2279455, 2314017]
12495B314017p1127p5372n2029O6220M7374J9037k7207L2175M7317j9304l0104
12484B250997j0585j8022K1601Q826j5650M6587K1569j7974j0175k0064M3145
12473B300255R4249n969N2112O5035N6571L9261O1252n4385j35582l1843j27154
12462B313802O5770P5843n986o0766O1228m5624L5968r3186j10146Q417P3848
12451B319168J1229J09911N5393r327m1045r1115N5897L7173m6501j023J6327
12440B416087O4531J9316P729l8472J469l441m4875k4731L6979P3609L3018R478
12428B550697m2193K0481N7892j8800m1540k5066N1508N7270n6741j04995K9762
12417B478275J00896j1522k6827l367L6303K086M081o674J4655m8311L4882k6986
$$ y = [2314017, 2242890, 2167518, 2115489, 2181709, 2229083, 2248120, 2220913, 2253088, 2300405, 2281101, 2250997, 2240412, 2222390, 2243991, 2252817, 2237167, 2283754, 2305323, 2287349, 2277174, 2257110, 2300255, 2394504, 2388535, 2440647, 2505682, 2562253, 2601514, 2662766, 2608381, 2472799, 2440956, 2313802, 2379572, 2455415, 2449429, 2388663, 2449891, 2404267, 2440235, 2347049, 2236903, 2245320, 2319168, 2330397, 2440308, 2495701, 2486374, 2445329, 2354214, 2410111, 2447284, 2400783, 2399760, 2416087, 2480618, 2499934, 2507663, 2469191, 2470660, 2467219, 2422344, 2397613, 2434592, 2508201, 2541219, 2550697, 2508504, 2528985, 2586877, 2568077, 2526537, 2501471, 2552979, 2610249, 2553508, 2448513, 2478275, 2579171, 2567649, 2540822, 2537455, 2573758, 2575844, 2579925, 2573251, 2587906, 2539595, 2574477, 2547491]
12405B547491n177M7664O5963p1404L1678O0275n1965k3777k4040n3599J0868
12394B533977R3891N303m7911L8771M7838O9839M2512N4824R3733o1144j40352
12383B731281n7050K7286l9784j8754N9139O1856Q877k6012m2846j1619j2540
12372B679834K1618l5258L4320R6238L5104K5458N07n7270p0192P572M6397K9854
12360B814182n282O292R79L6166l5192l8975L7929j4241k5273K5269J2724N0176
12348B864754K0516N0705J7411r2365o289J5340L2960K2664j3992o0938o3979
12337B786787r3535K65N6450J5075M8493J8190o1359n007r769J5124K3775q5263
12325B709226Q9827M7480j4687Q6141K9690p4073O3849m4908M0560J39334l2485
$$ y = [2547491, 2542314, 2589978, 2655941, 2584537, 2616215, 2676490, 2624525, 2600748, 2576708, 2523109, 2533977, 2627868, 2633171, 2585260, 2624031, 2671869, 2741708, 2784220, 2839044, 2932777, 2871633, 2731281, 2674231, 2701517, 2661733, 2642979, 2702118, 2763974, 2772851, 2746839, 2703993, 2692374, 2679834, 2701452, 2666194, 2700514, 2796752, 2831856, 2857314, 2857821, 2800551, 2730359, 2737931, 2784328, 2814182, 2808900, 2815192, 2816171, 2852337, 2817145, 2778170, 2816099, 2801858, 2776585, 2801854, 2814578, 2864754, 2885270, 2935975, 2953386, 2861021, 2854732, 2870072, 2903032, 2925696, 2911704, 2850766, 2786787, 2693252, 2693517, 2749967, 2765042, 2813535, 2831725, 2770366, 2765359, 2755590, 2770714, 2794489, 2709226, 2799053, 2846533, 2831846, 2917987, 2947677, 2873604, 2937453, 2892545, 2933105, 3072439, 3039954]
12314C039954l1450Q5965j5807n6162k3583J1641J814k8592j5179m374J03573
12303C067800j0750j11313j8387Q3195L2876O7351o3031k254p1047O5343N5501
12292C095284q856P3198R847l7266J969r0383q8282M2137Q5024J2418k3929q1739
12280B989422m6593J28818K0762j6970L6893K2967l568j406j2302l3492m213j5966
12268C064352P1665J7611o1683m6572M1885j3313Q2290J18942P104q8213j2615
12257C181453P4594k2069o5419r068P5636J9958m2766j29498l5840J31143O6581
12246C244705l8374L9565l9595r9466o9244L8790m353n4078j1150O4145Q0744
12235C151689L760P503K3642J1740K979J2580J7418l528l0197R2982R8388r888
$$ y = [3039954, 3008504, 3094469, 3078662, 3022500, 2998917, 3010558, 3012372, 2983780, 2968601, 2964227, 3067800, 3057050, 2945737, 2927350, 3010545, 3043421, 3110772, 3047741, 3045487, 2974440, 3039783, 3095284, 3086428, 3159626, 3169473, 3132207, 3134176, 3043793, 2955511, 2997648, 3082672, 3095090, 3071161, 2989422, 2942829, 3071647, 3092409, 3075439, 3112332, 3135299, 3131731, 3130325, 3118023, 3084531, 3080318, 3064352, 3136017, 3153628, 3091945, 3045373, 3087258, 3073945, 3156235, 3275177, 3282281, 3194068, 3181453, 3256047, 3233978, 3168559, 3159491, 3235127, 3255085, 3212319, 3082821, 3046981, 3178124, 3244705, 3206331, 3245896, 3206301, 3106835, 3037591, 3076381, 3072028, 3017950, 3006800, 3070945, 3151689, 3155449, 3162952, 3186594, 3198334, 3201313, 3213893, 3231311, 3227783, 3197586, 3290568, 3388956, 3379068]
12223C379068p3408n332m7479n0483N3922O6550M5275j6195m9211R904k16J3721
12211C326116K0121n6470Q952N4231j5981p289M1621N7428k6422O4281K6559k1441
12199C471706L7681J30590n7280r0087k8915M2662o8364R858M0916J7657r4209
12188C412215K7586k3693M13J1203J6309o4969o6964J30417m504m882R2421j2772
12176C512780m5357J5948p465Q791O4557J0451l8588l2560r6336m7149n3237J0857
12164C302692K1657M8922K2667P807N0567k4L5469l5003L39N3080K3223l7614
12152C493782L269J9701l5379J1633p926R3049J09676O9541J5000n7053N4963
12141C770256R0649K9179k4600j39165j14413r4524M9560P9623l3166j2631o1069
$$ y = [3379068, 3305660, 3300328, 3252849, 3202366, 3256288, 3322838, 3368113, 3351918, 3302707, 3312611, 3312395, 3326116, 3346237, 3289767, 3298719, 3352950, 3336969, 3329680, 3371301, 3428729, 3402307, 3466588, 3493147, 3471706, 3509387, 3639977, 3582697, 3492610, 3463695, 3506357, 3437993, 3447851, 3488767, 3506424, 3412215, 3439801, 3416108, 3416521, 3427724, 3444033, 3379064, 3312100, 3442517, 3438013, 3433131, 3525552, 3512780, 3467423, 3483371, 3475906, 3484697, 3549254, 3559705, 3521117, 3488557, 3392221, 3345072, 3291835, 3302692, 3324349, 3373271, 3395938, 3403745, 3454312, 3454288, 3489757, 3454754, 3455093, 3508173, 3531396, 3493782, 3497051, 3516752, 3481373, 3493006, 3485080, 3578129, 3687805, 3757346, 3772346, 3715293, 3770256, 3860905, 3890084, 3865484, 3726319, 3611906, 3517382, 3566942, 3646565, 3613399, 3600768, 3539699]
12130C539699j11425n9598L8147L0680M4908O1964n912N225K3621K0363N2402
12119C640074K1508j9832l1552j6491q017j08459L102J27614O0276J6401n8576
12108C626048j1382J6460Q2737J53888J59354Q5657K16046J18807n6508M4379
12098D435486J18164K02142K65805M4901k34559l31576k22721j65481j23622j82745
12088C805794o8001M2364K2290n1859k6731O6194l2750j41376j3779M9813J04173
12077C756132n387J1156N6519l8411q5648L0671Q4088m4774p1152o864L3423q0897
12065C638856L6897J00875M8417M0247Q0276Q0440J86590R9214J03223P1893O8802
12054D555730J04433K25700K35901J46868q3545l57320l07256k52323j19623j08567
$$ y = [3539699, 3428274, 3368676, 3406823, 3437503, 3482411, 3544375, 3538463, 3543688, 3567309, 3587672, 3640074, 3661582, 3641750, 3610198, 3593707, 3585690, 3477231, 3480333, 3607947, 3668223, 3684624, 3626048, 3614666, 3631126, 3713863, 3867751, 4027105, 4112762, 4328808, 4447615, 4391107, 4435486, 4553650, 4755792, 5021597, 5066498, 4831939, 4500363, 4277642, 4112161, 3988539, 3805794, 3737793, 3780157, 3802447, 3750588, 3723857, 3790051, 3757301, 3615925, 3602146, 3651959, 3756132, 3750745, 3761901, 3818420, 3780009, 3694361, 3725032, 3809120, 3764346, 3693194, 3686330, 3719753, 3638856, 3675753, 3776628, 3825045, 3865292, 3945568, 4026008, 4212598, 4311812, 4415035, 4486928, 4555730, 4660163, 4885863, 5121764, 5268632, 5185087, 4827767, 4520511, 4268188, 4148565, 4039998]
12044D039998o7126j20876j14214l1348q448N3869J00032m2392o4709j51197k4292
12033C569297n072P0706J00094N562J4110n0417k6878K9688J4398R1172l2902
12022C779758m0627l8383k8928J5271p4368M3595J0997M098R2697P8020Q8199
12011C930329L7826m9726O2009J19093Q8250r907j63526q9105k1082q7880m1732
12000C774549j2390q1758j9385j6555K91L2479L9093o9998m9695M2655J2276o3254
11988C588308o8187L6584Q5745p858M4395L8022K568j33067l0923n5155m588j2963
11976C482881m7846Q2184M5709j5551j01423j6786O291M8217n1376l0973Q6608
11965C487935P4208J04756L8052q9071p3152l9530j44p5292P2629J50886o5115
$$ y = [4039998, 3972872, 3851996, 3737782, 3706434, 3697986, 3751855, 3851887, 3809495, 3744786, 3593589, 3569297, 3564225, 3634931, 3735025, 3740587, 3754697, 3704280, 3677402, 3707090, 3721488, 3812660, 3779758, 3739131, 3700748, 3671820, 3687091, 3612723, 3656318, 3667315, 3671413, 3764110, 3842130, 3930329, 3968155, 3918429, 3980438, 4099531, 4187781, 4177874, 4014348, 3925243, 3904161, 3816281, 3774549, 3762159, 3680401, 3661016, 3644461, 3644752, 3677231, 3716324, 3646326, 3596631, 3639286, 3651562, 3588308, 3520121, 3556705, 3642450, 3634592, 3678987, 3717009, 3719577, 3586510, 3555587, 3500432, 3495844, 3482881, 3435035, 3517219, 3562928, 3547377, 3445954, 3429168, 3435459, 3483676, 3432300, 3401327, 3487935, 3562143, 3666899, 3704951, 3615880, 3542728, 3503198, 3503054, 3427762, 3500391, 3651277, 3586162]
11954C586162p8640m5843m9726Q0656M6692k6276k4750P1551O9782o0595q0799
11943C488214k6636L0146M4748n3197o5848M7268K0883j530K6781J9018j9555
11932C510292R249l71o2862k5383K5828L0770K3769K5703l5220j9942l95k694
11920C478744Q442n061k2103q757J8327l3197l318K1124J1201J517l2543k1721
11908C412655k2021K0584N2256O1391q6724n0744J4544L9224l2485j46924r4613
11897C167143r857M6303M3450J6796N7651M6415J1551n14k6222M1279P8134l3618
11885C438511r2616l5848j7448P8330L5960l8246J5678k0591l2175n7465l9524
11874C234566M4796K0239m7616J6468N4167J1357m1314Q2791j5915o8337N6747
$$ y = [3586162, 3507522, 3461679, 3411953, 3492609, 3539301, 3513025, 3488275, 3559826, 3629608, 3569013, 3488214, 3461578, 3491724, 3536472, 3483275, 3417427, 3464695, 3485578, 3484048, 3510829, 3529847, 3510292, 3519541, 3519170, 3456308, 3430925, 3456753, 3487523, 3511292, 3536995, 3501775, 3481833, 3481438, 3478744, 3487186, 3482125, 3460022, 3451265, 3469592, 3436395, 3433077, 3454201, 3465402, 3466919, 3434376, 3412655, 3390634, 3411218, 3463474, 3524865, 3438141, 3387397, 3401941, 3441165, 3408680, 3261756, 3167143, 3157286, 3203589, 3247039, 3263835, 3321486, 3367901, 3379452, 3378938, 3352716, 3393995, 3472129, 3438511, 3345895, 3310047, 3292599, 3370929, 3406889, 3368643, 3384321, 3363730, 3331555, 3274090, 3234566, 3279362, 3299601, 3251985, 3268453, 3322620, 3333977, 3292663, 3375454, 3359539, 3291202, 3347949]
11863C347949k59l9016J9322L2107k1023k5705m2319L893L7655K0157j4578r454
11851C308729n4395j20390L092Q7138K8802Q818l4930J3739j9569o0568j4331
11840C146135P4921J07332k8418O2235K2862l085n4006j1296l6669r4732q9603
11829C095676j3493J2379R522J3364R1789L3304M4700j9217o010k0799q462k3668
11817C209085k7407k3366O736n6134k9426l3310l0065n67N7761R8735k3845j23298
11805C024899M2833O9834p2163n3063K859o6261Q8948R2573O273q8798r6486m5098
11793B906350J14862N3030m8332l8791j1888k5316K2139P5463J4523J1595R7991
11782C171626o3192j12295m0836M1253M0125L1689r494m9911Q6813J1074n8312
$$ y = [3347949, 3347690, 3308674, 3327996, 3360103, 3339080, 3313375, 3271056, 3274949, 3312604, 3332761, 3318183, 3308729, 3254334, 3133944, 3137036, 3224174, 3252976, 3261794, 3226864, 3240603, 3221034, 3160466, 3146135, 3221056, 3328388, 3299970, 3362205, 3385067, 3381982, 3327976, 3316680, 3280011, 3185279, 3095676, 3082183, 3094562, 3104084, 3117448, 3209237, 3242541, 3287241, 3268024, 3262014, 3241215, 3232753, 3209085, 3181678, 3158312, 3165048, 3108914, 3079488, 3046178, 3016113, 3015546, 3073307, 3172042, 3148197, 3024899, 3067732, 3137566, 3065403, 3012340, 3015199, 2948938, 3037886, 3130459, 3136732, 3047934, 2951448, 2906350, 3021212, 3074242, 3025910, 2987119, 2975231, 2949915, 2972054, 3047517, 3062040, 3073635, 3171626, 3108434, 2996139, 2955303, 2996556, 3036681, 3068370, 3058876, 3008965, 3095778, 3106852, 3048540]
11771C048540J7174L5286j13827m6616j911k3508k7984Q0065l6552j2359J9898
11760B938206O1939r6920p3119n5374K0389J06888L4499m3255j6737P4369J8967
11749B969852J6911j4321j46569k6742J1924o5989K0285K2883J9007K6012L7458
11738B870711k222j8993m9749j6950K7024M5396n2166l1413P6693J0678O8157
11727B927166j07405k4141M1608j7424L9141k4102k5114J8417l8514N598m0220
11716B755010L2987N548r7386j90J17354j3148l88j1585n5415r129Q732N4190
11704B786580k5813j15057l5267r1578l6027N5320J05611O7754k3032L3400N527
11693B727418n609K7144j2544m6223j4553j6205M1605r2891o5512J2303P2226
$$ y = [3048540, 3065714, 3101000, 2987173, 2940557, 2938646, 2915138, 2887154, 2967219, 2930667, 2918308, 2938206, 3000145, 2903225, 2830106, 2774732, 2795121, 2902009, 2936508, 2893253, 2876516, 2950885, 2969852, 2986763, 2972442, 2825873, 2799131, 2811055, 2745066, 2765351, 2788234, 2807241, 2833253, 2870711, 2868489, 2849496, 2799747, 2782797, 2809821, 2855217, 2803051, 2771638, 2848331, 2859009, 2927166, 2819761, 2795620, 2837228, 2819804, 2858945, 2834843, 2809729, 2828146, 2789632, 2795230, 2755010, 2787997, 2793545, 2696159, 2695969, 2813323, 2800175, 2799787, 2788202, 2732787, 2723658, 2732390, 2786580, 2760767, 2645710, 2610443, 2518865, 2482838, 2538158, 2643769, 2711523, 2688491, 2721891, 2727418, 2721809, 2748953, 2736409, 2690186, 2675633, 2659428, 2701033, 2608142, 2542630, 2554933, 2627159]
11682B627159O3057j01774n821M6234l2590J3341p5034q6143o921R5728J4273
11671B551509l1891K094k8634m528N5416L7372j11198K9954P6166N2962p6503
11660B552719n4407p6038j993L4193N9632M7837j5436J8072L5100N2699J2620
11649B664998q4537j18398q561o524L8561L7973M91j9805m2905l4689k8492J717
11637B399829j8164M9349J3301n580r2496n9622l284j6224l160J2064J15445l1842
11625B359616r851J27449l478J020k1570r1360j0772J565R338J00330r494m6245
11613B406548m6004l5045k126J5503M6746l9584j2889n2731M8241J3312L452m1994
11601B303429n6112k8100M1752O6962j603n494Q5972K1431k25q3187r8602R5091
$$ y = [2627159, 2690216, 2588442, 2582621, 2628855, 2596265, 2609606, 2534572, 2448429, 2441508, 2537236, 2551509, 2519618, 2521712, 2493078, 2488550, 2543966, 2581338, 2470140, 2500094, 2576260, 2629222, 2552719, 2498312, 2422274, 2420281, 2454474, 2514106, 2561943, 2546507, 2564579, 2599679, 2652378, 2664998, 2580461, 2462063, 2453502, 2446978, 2485539, 2523512, 2524003, 2504198, 2461293, 2426604, 2398112, 2399829, 2381665, 2431014, 2444315, 2438735, 2346239, 2286617, 2283333, 2267109, 2263949, 2276013, 2391458, 2359616, 2349765, 2477214, 2473736, 2474756, 2453186, 2361826, 2351054, 2352619, 2361957, 2462287, 2452793, 2406548, 2360544, 2325499, 2323373, 2338876, 2385622, 2346038, 2333149, 2280418, 2328659, 2341971, 2345423, 2303429, 2247317, 2219217, 2260969, 2327931, 2326328, 2320834, 2406806, 2428237, 2428012, 2344825, 2246223, 2341314]
11589B341314K2238k6647J075K1461j0865J830L30q2797m4925m8494q2213J2831
11577B105138k0313l3084k8940K6952l263M4769N0191J2621O503k6396K2554K5185
11565B181917p9351k9054J6978M8736l0698L8301L0J1430L2649l8315r851Q480
11553B151252j5997o9204k4842P686J7417j270j8470R9627K8772j11227l9482
11542B024262R5204n8488p9711k1694O126O5345q5565J4570P4979o5163j9430
11531A950435M2541L0632M1202n6111k7721L1915o0310j5930J27916K2306j00576
11520A986299K3159O6693P1113j0554n7879l4971L2592m1789j3352N2246l1086
11509B042471n3752m3138O2825m7308K7854q9952o631m42J19492j1911m7368j1826
$$ y = [2341314, 2363552, 2336905, 2337980, 2359441, 2348576, 2350406, 2350736, 2267939, 2223014, 2174520, 2092307, 2105138, 2084825, 2051741, 2022801, 2049753, 2046490, 2091259, 2141450, 2154071, 2160574, 2134178, 2156732, 2181917, 2102566, 2073512, 2090490, 2139226, 2108528, 2146829, 2146859, 2158289, 2190938, 2152623, 2142772, 2151252, 2135255, 2066051, 2041209, 2048895, 2066312, 2065042, 2046572, 2146199, 2174971, 2063744, 2024262, 2119466, 2060978, 1981267, 1959573, 1965699, 2031044, 1945479, 1960049, 2035028, 1969865, 1950435, 1992976, 2023608, 2064810, 2008699, 1980978, 2012893, 1952583, 1936653, 2064569, 2086875, 1986299, 2009458, 2076151, 2147264, 2136710, 2078831, 2043860, 2076452, 2034663, 2021311, 2073557, 2042471, 1988719, 1945581, 2008406, 1961098, 1988952, 1899000, 1892369, 1891927, 2011419, 1999508, 1952140, 1940314]
11497A940314K7787R988m39n7292K3331j9469o3644m9264J8345R8877N3555p5682
11485A906407k4667l8787k2150o7158M3573L8770j4382L0825k7554k789l9914
11474A782174L6038J5803j7352K3958J6582N1425m7494j06590L6925L0613N2469
11463A874551N1432J4892k8962m7594p9396j2894M2170l0444m8453M365p302Q5684
11451A818049J03391J0580K536l1876n2732o9575Q2563O0252j01363K029K8179
11440A852033O169k4658n1777q0356r2037O2722j1561M4735q1329o4791L1241
11429A590391R3807N4258j116k4239j25522K4195J2668M8211J7340j15044m9020
11418A525929m729K2721N2847N1670r3401p4364k4367N8860O6011K2276r5041
$$ y = [1940314, 1968101, 1978089, 1977650, 1920358, 1943689, 1924220, 1860576, 1811312, 1829657, 1928534, 1982089, 1906407, 1881740, 1842953, 1820803, 1753645, 1797218, 1835988, 1821606, 1852431, 1824877, 1822088, 1782174, 1818212, 1834015, 1816663, 1840621, 1857203, 1908628, 1861134, 1754544, 1791469, 1822082, 1874551, 1925983, 1940875, 1911913, 1864319, 1784923, 1772029, 1814199, 1783755, 1735302, 1739667, 1732365, 1818049, 1921440, 1932020, 1934556, 1902680, 1849948, 1780373, 1862936, 1923188, 1821825, 1823854, 1852033, 1858202, 1833544, 1781767, 1701411, 1609374, 1672096, 1660535, 1705270, 1623941, 1559150, 1590391, 1684198, 1738456, 1737340, 1713101, 1587579, 1611774, 1624442, 1672653, 1689993, 1574949, 1525929, 1521200, 1543921, 1596768, 1648438, 1555037, 1480673, 1456306, 1515166, 1581177, 1603453, 1508412]
11407A508412n099N1420J0240q9759j1706P5425R8823P6001K7967q8542o4962
11396A588220N7698N5977j45976j13215l5435P4456J4241K8276m0358m2467K9911
11385A471328J24275P9422m0429M2m8428k7604K3925N3156q4246m9174l6430m3292
11373A422545l9207M6662M8794L7667L3177M6263q3655j25021M9089M5111K049
11362A483474J8473N477m005l0771K7008P4122l780k1690L5183K7051R4489k1029
11350A684002j99757j02077j7053N0294Q604l2673K8403L1599j4403O529J8596
11339A462064n7193m5124N0407R1778l9377l6573o671L0338k1415Q3379k26l792
11327A507595L3587N6486j9102m8759n6782o0297j2710n2229r570M9756k2947
$$ y = [1508412, 1503313, 1554733, 1564973, 1475214, 1463508, 1538933, 1637756, 1713757, 1741724, 1653182, 1588220, 1645918, 1701895, 1555919, 1442704, 1407269, 1481725, 1495966, 1524242, 1483884, 1441417, 1471328, 1595603, 1675025, 1634596, 1634638, 1586210, 1558606, 1582531, 1635687, 1551441, 1502267, 1465837, 1422545, 1383338, 1430000, 1478794, 1516461, 1549638, 1595901, 1512246, 1387225, 1436314, 1481425, 1483474, 1501947, 1507424, 1503419, 1472648, 1499656, 1573778, 1569998, 1548308, 1583491, 1610542, 1705031, 1684002, 1484245, 1382168, 1365115, 1415409, 1424013, 1391340, 1419743, 1451342, 1436939, 1443468, 1462064, 1404871, 1359747, 1410154, 1501932, 1462555, 1425982, 1419311, 1449649, 1428234, 1511613, 1511387, 1507595, 1541182, 1597668, 1578566, 1529807, 1473025, 1412728, 1400018, 1347789, 1338219, 1387975, 1365028]
11316A365028R4591N4306j6798k8090k81K8206p7916n1055L2949N0748J1740l5951
11304A427477k8337L5552O9636q6081n953J8063N8294N7117p5346m9384K4603
11293A445641j512j0662J9l3588P2712j6052M2223j18424j681K7437k4145l0376
11281A351592l9573n3521m2216O1130O0513O6066n9041J9689k6423p4484k5911
11270A237821K3909J45986R1356L772n3179j28863j4236R7172o0004l5676l5901
11259A272157k5983M2103j6725m3142m203O5657L6762K6307M7389l6298q2314
11248A281710P1235l0084j6858J9352m271J346m433k9149q0980q680O0674O4711
11236A324573q372p6319K43m2920j6119n4508j5601R1441L9168J1225k2788J3525
$$ y = [1365028, 1459619, 1513925, 1497127, 1469037, 1468756, 1496962, 1419046, 1367991, 1400940, 1451688, 1463428, 1427477, 1399140, 1434692, 1504328, 1418247, 1412294, 1430357, 1488651, 1545768, 1470422, 1421038, 1445641, 1444129, 1433467, 1433486, 1399898, 1472610, 1456558, 1498781, 1380357, 1378676, 1406113, 1381968, 1351592, 1312019, 1258498, 1216282, 1277412, 1337925, 1403991, 1344950, 1364639, 1338216, 1263732, 1237821, 1261730, 1407716, 1499072, 1502844, 1449665, 1320802, 1306566, 1403738, 1343734, 1308058, 1272157, 1246174, 1288277, 1271552, 1228410, 1224207, 1289864, 1326626, 1352933, 1400322, 1364024, 1281710, 1352945, 1322861, 1306003, 1325355, 1321084, 1322430, 1317997, 1288848, 1207868, 1199188, 1259862, 1324573, 1316201, 1239882, 1240125, 1197205, 1181086, 1126578, 1110977, 1202418, 1241586, 1252811, 1230023, 1243548]
11224A243548o126L1425L7800l477m4024p316m6374L1030n9804m3762K6412Q12
11212A160144O4117P8103n8105n1013M5191J6995L0207o9727m1950K3374j772
11201A195564Q588m3700o1403k3350N6148m871R327P2920M7524q0575m4969K7142
11189A158345K0866j1729k6714P5290R2896k9473k6859n1361r2762l8046J3688
11178A084141Q8172N4717K3130j9137J4109k1145j14913l8735K8639L9300k5401
11167A112877k8078k7701n5710l3296L2217l622L1837P2741j4227k7250P717J2517
11155A080022j8505Q352k083o6497k0022N3988l4233L4159K4185j8567m8336J6109
11143A008572k0883r958Q311q239q5502J4519J16255M9885j6393J13281M9588
$$ y = [1243548, 1237422, 1268847, 1306647, 1303170, 1259146, 1251830, 1205456, 1236486, 1176682, 1132920, 1159332, 1160144, 1224261, 1302364, 1244259, 1193246, 1238437, 1255432, 1285639, 1215912, 1173962, 1197336, 1195564, 1204152, 1160452, 1099049, 1075699, 1131847, 1126976, 1136303, 1209223, 1256747, 1176172, 1131203, 1158345, 1179211, 1167482, 1140768, 1216058, 1308954, 1279481, 1252622, 1201261, 1108499, 1070453, 1084141, 1172313, 1227030, 1250160, 1231023, 1245132, 1223987, 1109074, 1070339, 1098978, 1138278, 1112877, 1084799, 1057098, 1001388, 968092, 1000309, 996687, 1028524, 1101265, 1087038, 1059788, 1067505, 1080022, 1061517, 1069869, 1067786, 1001289, 981267, 1035255, 1001022, 1035181, 1059366, 1040799, 992463, 1008572, 987689, 977731, 986042, 977803, 892301, 906820, 1023075, 1072960, 1056567, 1169848, 1219436]
11132A219436K439n8406n430L9330o1465J527n183O871n3139l2343R999N9258
11120A122894M6304j0461o2166J6246N5704J7447m9518p7797k8971R0114M9361
11109A169157r2046n2435k8159L2034Q7666l5112J4933K7863l9246o2542m3230
11098I78883n4249L1934N3387J6020J3138Q466Q8976J310O7422K7225j7418l8458
11086A176636j28757r5650N0438O7688m1444K346J5585j2640K992Q3963l7209
11075A083948k2610q511L2031n8J098L9817l9208J841K2840J7556o0980m1783
11063A025981J87J5083r281n1872N1335L6503J9178p2911j1843j6806K6127R1380
11051A103061Q5515K9277k0536m882J50195L1138p9650j1834m712m0482j2927
$$ y = [1219436, 1221875, 1163469, 1158039, 1197369, 1135904, 1137431, 1132248, 1139119, 1085980, 1053637, 1063636, 1122894, 1169198, 1158737, 1096571, 1112817, 1168521, 1185968, 1136450, 1058653, 1029682, 1119796, 1169157, 1077111, 1024676, 996517, 1028551, 1116217, 1081105, 1096038, 1123901, 1084655, 1022113, 978883, 924634, 956568, 1009955, 1025975, 1039113, 1047579, 1136555, 1137865, 1205287, 1232512, 1215094, 1176636, 1047879, 952229, 1002667, 1070355, 1028911, 1031257, 1046842, 1034202, 1037194, 1121157, 1083948, 1061338, 1052827, 1084858, 1084800, 1085898, 1125715, 1086507, 1088348, 1111188, 1128744, 1067764, 1025981, 1026168, 1041251, 1031970, 980098, 1031433, 1067936, 1087114, 1014203, 1002360, 985554, 1011681, 1103061, 1188576, 1217853, 1197317, 1192435, 1342630, 1373768, 1294118, 1282284, 1277572, 1237090, 1224163]
11040A224163P8370m7297l4254Q4828Q6634J5534l636L2852M0626N164J564N398
11028A489946J7761J7101J5103K7669L8628O3217L3798l9737q4008o7886j09764
11017A401828k6283O2816l7354j1039M9673K3727P596k3146l5126o3011o0709
11006A288972o9249J8081j1580j2842k3342o51L1587k384l837n4766k40l593o0705
10993A095451j7886o8170l7840O5737L7331J5495N7159K6223q8600n2046K1437
10982A054291j4720l2653L6351K7092k1087r7480n6669L1679N65Q661K825O3670
10970A002525J3913m0257J4525K93p2704n3392M7780L6013J4139N092Q0332K3213
10958A071472k8607j9407L3413K4183n4486p0868k3034m5782r189o1515k3962
$$ y = [1224163, 1302533, 1255236, 1220982, 1305810, 1392444, 1407978, 1404342, 1437194, 1477820, 1482984, 1484548, 1489946, 1507707, 1524808, 1539911, 1567580, 1606208, 1669425, 1703223, 1663486, 1579478, 1511592, 1401828, 1375545, 1438361, 1401007, 1389968, 1439641, 1463368, 1470964, 1447818, 1412692, 1349681, 1288972, 1219723, 1237804, 1226224, 1213382, 1190040, 1189389, 1220976, 1218592, 1214755, 1159989, 1159749, 1156156, 1095451, 1077565, 1009395, 971555, 1037292, 1074623, 1090118, 1147277, 1173500, 1084900, 1032854, 1054291, 1039571, 1006918, 1043269, 1070361, 1049274, 951794, 895125, 926804, 927369, 936030, 938855, 1002525, 1016438, 976181, 990706, 990999, 918295, 864903, 912683, 948696, 962835, 967927, 1048259, 1071472, 1042865, 1023458, 1056871, 1081054, 1026568, 955700, 932666, 886884, 877695, 816180, 792218]
10947G92218K664r520P4636m3598l5269J05664K6638l2550p7390o646l4894K0859
10935G82812O9881L982L0367O6551q627j2509o3086L3188j6684K7580m1397j16285
10923G55773p286Q6460k500J745l2186n7964k919Q6329J4016m5677n4870P3977
10911H14898j444l883k229J1106R7262L2753L3717M6622n694p9634o572J4713
10899I51615n4439q1771Q2413M7856J8l4243n976j3697k2007O6129K023p9310
10887H58611Q1666j1126o5219j4768m06l4613j36330K358J08096J02725M6226
10876I37220J0654L2568n6069N8873j1840m7429l4057L4427O3284O70r5280k4885
10864H68136j0022q7704N4318M8567P2596M1120n3263j2888m840K5114j0142M3614
$$ y = [792218, 794882, 785362, 859998, 816400, 781131, 886795, 913433, 880883, 803493, 796847, 761953, 782812, 852693, 856675, 887042, 953593, 944966, 932457, 869371, 902559, 885875, 913455, 872058, 755773, 748487, 834947, 832447, 834192, 802006, 744042, 741123, 827452, 841468, 795791, 740921, 814898, 813454, 809571, 807342, 818448, 915710, 948463, 982180, 1028802, 1023108, 943474, 936902, 951615, 897176, 815405, 897818, 945674, 945692, 911449, 905473, 891776, 869769, 935898, 937921, 858611, 940277, 929151, 863932, 849164, 848758, 814145, 677815, 680173, 788269, 890994, 937220, 947874, 980442, 924373, 983246, 971406, 923977, 889920, 924347, 987631, 988301, 893021, 868136, 858114, 770410, 824728, 873295, 945891, 987011, 933748, 920860, 916020, 941134, 930992, 974606]
10852I74606N1429j0003r654K6527k2611k136M3747l6653P67k8190K1072j7884
10840I91017J1978J3863J7340N499n264l6799m4523n3450q051O370k5812N2378
10828I24546N7911k0758p480N0359l5846m305L9455k5450l1172j6680J9987l5707
10816I14860j09823O4270Q739J4644J05687O4432l4345p2766L275L3828m5268
10805I47533o1975k0026K3815M1002N3494j573n1938K5507J8268k0840j3162N3174
10793I93279K1747L9510k872m9021l0077K8210o0554p9999o3787J01048N6406
10782I53890K0942N0740Q2199l6272j03177J1570M212P1399J09994k3872k0124
10771A121501k7773j31582j27414O4674K7555Q2096J08025J73459K6522Q723o0087
$$ y = [974606, 1026035, 1016032, 1006378, 1032905, 1010294, 1008158, 1051905, 1015252, 1016019, 987829, 1008901, 991017, 1002995, 1016858, 1034198, 1039697, 1034433, 997634, 953111, 899661, 891610, 897980, 872168, 924546, 982457, 961699, 954219, 1004578, 968732, 964427, 1003882, 978432, 947260, 930580, 950567, 914860, 805037, 869307, 878046, 892690, 998377, 1062809, 1028464, 955698, 958973, 992801, 947533, 885558, 865532, 889347, 930349, 983843, 982270, 930332, 955839, 974107, 953267, 940105, 993279, 1015026, 1054536, 1051664, 1002643, 972566, 1000776, 940222, 860223, 796436, 897484, 953890, 974832, 1025572, 1107771, 1071499, 968322, 979892, 984104, 1055503, 1165497, 1141625, 1121501, 1093728, 962146, 834732, 899406, 926961, 1009057, 1117082, 1290541, 1317063, 1325786, 1265699]
10760A265699r4637J4497k2855p2982Q4639N2118n8990k3242R066N1211l991l0941
10748A169592L5326j7810P6414o05P5065M3625n9649L390P713L5527J07491l0880
10736A445199p8965r269l9272j06694o3866O3712J0406K3242O4767m648n1042
10725A253570R1437k5290r7965j8495r670N0025J6989k9087Q0561Q9423M8933
10714A450431J7779K6268N1141L0142k6362j17046q2557K0707O7874r347O706
10703A435736M7381L3112L7052J0114J4729N7144Q6754j05749j25314M5608O1191
10692A597758K4735p7006n3126J09123J7492J8855l5604k3571O311P0117J6952
10681A672036N4048Q0255j10965q1397O8622R0261K0415J7790o5858m4537K0095
$$ y = [1265699, 1171062, 1185559, 1162704, 1089722, 1174361, 1226479, 1167489, 1144247, 1153313, 1204524, 1200533, 1169592, 1204918, 1187108, 1263522, 1262917, 1337982, 1381607, 1321958, 1325348, 1333061, 1368588, 1476079, 1445199, 1366234, 1356965, 1317693, 1210999, 1147133, 1210845, 1221251, 1244493, 1309260, 1304612, 1253570, 1345007, 1319717, 1221752, 1203257, 1193587, 1243612, 1260601, 1231514, 1312075, 1401498, 1450431, 1468210, 1494478, 1545619, 1575761, 1549399, 1432353, 1349796, 1370503, 1438377, 1429030, 1435736, 1483117, 1516229, 1553281, 1563395, 1578124, 1635268, 1722022, 1616273, 1490959, 1536567, 1597758, 1622493, 1545487, 1492361, 1601484, 1618976, 1637831, 1602227, 1578656, 1584967, 1655084, 1672036, 1726084, 1806339, 1695374, 1613977, 1682599, 1772860, 1793275, 1811065, 1745207, 1700670, 1720765]
10670A720765M6677O3296M4574L1774l0024Q367M9383P0386L9677P0268m7618
10659B067525K3063O455J1927R8681J04334K7265k0369K0946J24595P8537J53215
10648B696174M3321M66J04258J22018L143J5311J66757R6409J93580K08634L03298
10637C953369K23802K32250K95870K19560L46030L12213M32676N13161N63809
10628G092740P53894J051951J424450J821670K287006K889319L270606L239273
10620B3830909L013812K912028L342307L726570L833023L306598K131925J539022
10612D7636194J816761L059079M067011M208928L990926M053625M859703N913206
10604G9605433O184473M380076P92726j821872j447352P75511K866511L569538
$$ y = [1720765, 1767442, 1830738, 1875312, 1907086, 1877062, 1885429, 1934812, 2005198, 2044875, 2115143, 2067525, 2090588, 2097043, 2108970, 2207651, 2311985, 2339250, 2318881, 2339827, 2464422, 2542959, 2696174, 2739495, 2739961, 2844219, 2966237, 2969380, 2984691, 3151448, 3247857, 3441437, 3650071, 3953369, 4177171, 4409421, 4705291, 4924851, 5270881, 5583094, 6015770, 6528931, 7092740, 7846634, 8898585, 10323035, 12144705, 14431711, 17321030, 20591636, 23830909, 26844721, 29756749, 33099056, 36825626, 40658649, 43965247, 46097172, 47636194, 49452955, 52512034, 56579045, 60787973, 64778899, 68832524, 73692227, 79605433, 85789906, 90169982, 90962708, 89140836, 87693484, 88468995, 91335506, 94905044]
10596I4905044L247715L342533M488830N749887N344309J648965m439713q550166
10588A05737404q306286n575337l018483j679124j117559m02343O57901J545724
10580H7841897J085114j587961n670000q159228p728027n805295l989246k843726
10572E3143528k111136j634296j076588q22431j222672k555063l946394m771914
10564C5003034m750086l945139l050631k371734j864727j476466j156424j013287
10556A5374540q17584o41258n42150m46321m51197m74408k98545k29047k75376
10547A1198654l33623j63253j59189k90064m00171n24361m70701m35915l30706
10538H090671l65131k21103k38380l76736l33970j38245j61918j34997k5144j25483
$$ y = [94905044, 98152759, 101495292, 105984122, 111734009, 117078318, 118727283, 114287570, 105737404, 97431118, 91855781, 88837298, 87158174, 86040615, 85638272, 86296173, 87841897, 88927011, 87339050, 81669050, 73509822, 65781795, 59976500, 55987254, 53143528, 51032392, 49398096, 48321508, 47499077, 46276405, 43721342, 39774948, 35003034, 30252948, 26307809, 23257178, 20885444, 19020717, 17544251, 16387827, 15374540, 14556956, 13915698, 13373548, 12927227, 12476030, 12001622, 11703077, 11474030, 11198654, 10865031, 10701778, 10542589, 10252525, 9852354, 9327993, 8857292, 8421377, 8090671, 7725540, 7504437, 7266057, 6889321, 6555351, 6417106, 6255188, 6120191, 6095047, 5969564]
10528E969564k12998j55565j82612j90470q9195j28149j47183j31705p7180j30741
10518D523766k53203j06926o3364p2035m3320j39100j39854l2642J4515p7287
10508C610550j16334l7721j48600j22799j03486o4258m0223m1141j01751o5911
10498B768326n4877j05413p4098M46j21345o6920L771j3808j6552N279p92l7145
10486B286872p5643q3170k8495o5444r2987k3674q545m219k6804m7731p2036k4940
10474A733184M2823K3383j07305p5772l5874p4562j4456J2769N163j9029r0431
10463A399893n5619n9554N677p29k9509j2564m7010P2873k4216l3545P550K3583
10451A246830K9400J6011o0923p0173K2349j8554j5248N177j03307J2505P116
$$ y = [5969564, 5756566, 5601001, 5418389, 5227919, 5138724, 5010575, 4863392, 4731687, 4654507, 4523766, 4270563, 4163637, 4100273, 4028238, 3984918, 3845818, 3705964, 3673322, 3687837, 3610550, 3494216, 3456495, 3307895, 3185096, 3081610, 3017352, 2977129, 2935988, 2834237, 2768326, 2713449, 2608036, 2533938, 2534384, 2413039, 2346119, 2349890, 2336082, 2319530, 2324809, 2324017, 2286872, 2211229, 2128059, 2099564, 2034120, 1941133, 1917459, 1908914, 1904695, 1877891, 1830160, 1758124, 1733184, 1776007, 1799390, 1692085, 1616313, 1580439, 1505877, 1491421, 1504190, 1509353, 1490324, 1399893, 1344274, 1284720, 1290397, 1289668, 1260159, 1247595, 1200585, 1273458, 1249242, 1215697, 1223247, 1246830, 1276230, 1292241, 1231318, 1161145, 1183494, 1164940, 1149692, 1154869, 1051562, 1064067, 1071183]
10440A071183K4018p274o6357Q480J8715k4315K816r685q6626k3551P4215p6120
10428I05499j5240N1290R3435n2279n0503N7420L3708o7738k2778K8799O958j2738
10416I55833L4047j44398j64898k8434P8589P884o9299o3350J5893J37113L8961
10405G97941o1916K9469l9505k6341j111k1571J770l32o5616O453L6732k4053
10393F31920m9251k1749l3552M1598N5309O6826M226k6213o711N1666j2733j07365
10381E93971l9418p3657k848m856n1659K6001K9198j4978k2649K6914N9809Q338
10369E34166k7254n949Q7073l8104k7275k6502L1029N8945O5582N693J7460O1180
10357G36044l2078n4088m7628J1071L530M7250l4047o388M3429l0834r8878l4493
$$ y = [1071183, 1095201, 1087927, 1021570, 1030050, 1048765, 1024450, 1027266, 1017581, 930955, 907404, 981619, 905499, 890259, 941549, 1034984, 982705, 932202, 989622, 1023330, 955592, 932814, 961613, 968571, 955833, 989880, 845482, 680584, 652150, 730739, 738623, 669324, 605974, 621867, 758980, 797941, 736025, 765494, 725989, 699648, 698537, 676966, 678736, 678404, 612788, 619241, 655973, 631920, 582669, 560920, 527368, 568966, 624275, 691101, 695327, 669114, 662403, 714069, 701336, 593971, 554553, 480896, 478048, 473192, 421533, 447534, 476732, 461754, 439105, 466019, 525828, 534166, 506912, 500963, 588036, 549932, 522657, 496155, 527184, 586129, 651711, 657404, 674864, 736044, 703966, 649878, 602250, 613321, 616851, 664101, 630054, 623666, 667095, 636261, 537383, 502890]
10345E02890l4157J23503K6877M7731J02554r123o4023j8864J0046Q7670q1810
10334F93294p9343m8437j8009M1120Q2242j4937m826M117M5340K0181o0163l8556
10322F22023M6309O4829M9320k2298J198k2432Q200J47403j3208q62o9891l8619
10310G71972p3440K2012q751N9156m5118n5034j7239K8366O3608P0155L9629O2228
10298I17544p279n7620n7320k8060N5083O7789k4068m5163m3802L3412j5586K2185
10286H17115N466J169L8886K2379m566J7421l2986n778L8280N9895N8204J7282
10274A032767R7501M5770n398q4968o4959P1179N9768L9420m4323j5418n6251
10263A075088O282P3445k274q2007m9122p874L2765R8280o2230j0130M6415k4491
$$ y = [502890, 468733, 592236, 619113, 666844, 769398, 760275, 696252, 677388, 687434, 775104, 693294, 613951, 565514, 547505, 588625, 670867, 655930, 651104, 655221, 700561, 720742, 660579, 622023, 668332, 733161, 782481, 760183, 761381, 738949, 747149, 894552, 881344, 880482, 810591, 771972, 698532, 720544, 711793, 770949, 725831, 670797, 653558, 681924, 745532, 815687, 855316, 917544, 910265, 852645, 795325, 767265, 822348, 890137, 866069, 820906, 777104, 810516, 794930, 817115, 822581, 823750, 862636, 885015, 880449, 897870, 864884, 859106, 897386, 957281, 1015485, 1032767, 1130268, 1176038, 1170640, 1085672, 1020713, 1091892, 1151660, 1191080, 1146757, 1131339, 1075088, 1081370, 1154815, 1152541, 1070534, 1021412, 1013538, 1046303, 1144583, 1082353, 1072223, 1118638, 1094147]
10251A094147M1303N4836O9118o5814m7873L9567L7421o015l2244J3701K1254
10240A219401o8369N7855m1863p7827L0155p957N4521J86266Q4530O3873p096
10229A493489j7607N2307j8856M3895k3857p5484L3172P3555J21526k0636n6859
10218A604645J8602o2531L453J15131O6264M6091J18516N3534k8393l3996Q398
10207A909714Q4053P9776K345P8253J08683N4137K1609J2796K7360O3618O0944
10196B503288J32285J07341J44815J03900L1379O7587Q9601J17272J59659J83300
10186C640427R1611J71186J65575N4877J1257J96231K49388J82322K13777J48697
10176E125348K57903K70484L75974L31416L07253L92742M79955O45917M86789
$$ y = [1094147, 1135450, 1190286, 1259404, 1193590, 1145717, 1185284, 1222705, 1216690, 1184446, 1198147, 1219401, 1151032, 1208887, 1167024, 1089197, 1119352, 1111395, 1165916, 1352182, 1436712, 1500585, 1493489, 1475882, 1528189, 1509333, 1553228, 1529371, 1453887, 1487059, 1560614, 1682140, 1661504, 1604645, 1623247, 1560716, 1564169, 1679300, 1745564, 1791655, 1910171, 1963705, 1935312, 1901316, 1909714, 1993767, 2073543, 2075888, 2154141, 2262824, 2316961, 2338570, 2351366, 2378726, 2442344, 2503288, 2635573, 2742914, 2887729, 2991629, 3023008, 3090595, 3180196, 3297468, 3457127, 3640427, 3732038, 3903224, 4068799, 4123676, 4134933, 4331164, 4580552, 4762874, 4976651, 5125348, 5383251, 5653735, 6029709, 6361125, 6668378, 7061120, 7541075, 8186992, 8673781]
10167H673781O25426Q11956Q49549R01398R70827J087172J242758J472408J762557
10158A8397832K052441K224974K614426L409950M453491N773743P695677J0445374
10150E7067908J4319433J9611964K5897312L0491760K8908479K0413075J2985253
10143B09695184J4273662K1323493K5870019J8008592j0566081m6680132n2059487
10136A79865250m0431898k8790420k0345894j4777971j1076479q376507o493205
10129D9572876n183363m206344l302730k687659k151226j926425j693585j442056
10121B6979488j236069j127246j065017j090180j221754j201879j162883r63217
10113A7911243q59214q23554o73919p15436p42878n68013n30242n78408n19969
$$ y = [8673781, 9299207, 10111163, 10960712, 11862110, 12832937, 13920109, 15162867, 16635275, 18397832, 20450273, 22675247, 25289673, 28699623, 33153114, 38926857, 46622534, 57067908, 71387341, 90999305, 116896617, 147388377, 176296856, 196709931, 209695184, 223968846, 245292339, 271162358, 289170950, 278604869, 231924737, 179865250, 139433352, 110642932, 90297038, 75519067, 64442588, 56066081, 49572876, 44389513, 40183169, 36880439, 34192780, 32041554, 30115129, 28421544, 26979488, 25743419, 24616173, 23551156, 22460976, 21239222, 20037343, 18874460, 17911243, 17052029, 16228475, 15554556, 14839120, 14096242, 13528229, 12997987, 12419579, 11899610]
10104A1899610m16082m28896n17567m57173l53559l54880l15294k88065l06211
10095H461883k56801k47847k50739k51826n8527q9660k41465k54283k04309j38087
10085F468339k31304k08450j63494j49778j72315k17739j77306o1083j10636j47721
10075D828513k20328j06973j36983j11016j05838r3664j32936j24174n5769q1877
10065C658955k03804r0630m089m9239p8431r7843j07210j3351j11582m3431j09583
10054B749762q6661m3846p0571j00066n1139k5587q5409j0870m2880n9357L4706
10043B208082o4548j70858j68927q7732o4572n7275n6739l7481k1113p8586p9
10032A400172n6782o679L6145Q38l4396k5899k7021j05873m8612J3562O3459l8951
$$ y = [11899610, 11483528, 11054632, 10537065, 10079892, 9726333, 9371453, 9056159, 8768094, 8461883, 8205082, 7957235, 7706496, 7454670, 7396143, 7306483, 7065018, 6810735, 6606426, 6468339, 6237035, 6028585, 5865091, 5715313, 5542998, 5325259, 5147953, 5086870, 4976234, 4828513, 4608185, 4501212, 4364229, 4253213, 4147375, 4053711, 3920775, 3796601, 3740832, 3658955, 3455151, 3364521, 3360432, 3311193, 3232762, 3134919, 3027709, 3014358, 2902776, 2859345, 2749762, 2663101, 2619255, 2548684, 2448618, 2397479, 2371892, 2286483, 2275613, 2232733, 2173376, 2208082, 2143534, 1972676, 1803749, 1716017, 1651445, 1594170, 1537431, 1499950, 1478837, 1400251, 1400172, 1343390, 1336711, 1372856, 1373694, 1339298, 1313399, 1286378, 1180505, 1131893, 1145455, 1208914, 1169963]
10020A169963r3899j827O9693L853k3114l4026m333k3979P018j288J4864n3446
10008A029479o4067n0537k4026J9105k662j35360j67810L8624L4328N5761R457
9997G42292O3329P031q0534q2925Q913J20201K4936Q821m8969j09644n6360J5246
9985F12337p330j21881N1194Q837p0351o4142j3263l3720o0575p540J09833k7571
9973C75828l6468n4452m9855K3786k9930P89M2121k7758l2089K1391K0025N6021
9961C09409k4438M439m0469n1183K2814j7898Q930R0295P0674k7843m354p7908
9949B62468n1143n2847l7292m3687P494O59q0894l5687P7080J9391j6700p508
9937D1334L6054N5379R057p7175j4167Q0732M0285m6968p1678n0692l7034M3703
$$ y = [1169963, 1076064, 1074237, 1143930, 1147783, 1124669, 1090643, 1086310, 1062331, 1069349, 1068061, 1082925, 1029479, 965412, 914875, 890849, 909954, 907292, 771932, 604122, 642746, 677074, 732835, 742292, 805621, 812652, 732118, 649193, 658106, 778307, 803243, 812064, 763095, 653451, 597091, 612337, 605007, 483126, 534320, 543157, 472806, 408664, 395401, 361681, 301106, 293566, 403399, 375828, 339360, 284908, 235053, 258839, 228909, 229698, 271819, 244061, 211972, 233363, 253388, 309409, 284971, 289410, 248941, 197758, 220572, 202674, 211604, 301899, 372573, 344730, 340376, 262468, 211325, 158478, 121186, 77499, 84993, 85652, 4758, -30929, 46151, 65542, 48842, 41334, 77388, 132767, 141824, 64649, 50482, 131214, 171499, 124531, 52853, 2161, -34873, 8830]
9925H830j632J635j7293K4610n706m4611k4486k7112M2183L0595M1589n582O6197
9912H9217J5808p8447r357O121m2556L9398P5256j3295n3094K8755R2800K889
9900A53495m0669k3959p3722k7313l1433M0564Q0129L380k6094K248j00398q3000
9888a26772L9347P4941j0596m9819J3920O7520k3861l3408n6026Q4320J18804
9877I8370L442l0482P159M3780L5769p425Q7915O854l5445m3011j620J3245O389
9864A84940n1345o5972j8007J20694r431N655n2377j6532j8133n1929L495l8357
9852g299J830L0961m2755k2834n0423m6662o733Q3856J3684j6291l6755K892Q415
9839h8114N3329o1654l9870P6973R8422N9462L0401q3417j18275N7284k8531j0023
$$ y = [8830, 7198, 8833, -8460, 16150, 10444, -34167, -58653, -85765, -43582, -12987, 28602, 23020, 89217, 105025, 26578, 17221, 23342, -19214, 20184, 95440, 82145, 29051, 57806, 150606, 153495, 112826, 88867, 15145, -12168, -43601, -3037, 77092, 80472, 54378, 56626, -43772, -126772, -87425, -12484, -23080, -72899, -58979, 8541, -15320, -48728, -104754, -20434, 98370, 101812, 71330, 78489, 122269, 158038, 150613, 238528, 245382, 209937, 166926, 165306, 178551, 184940, 133595, 67623, 49616, 170310, 160879, 166534, 114157, 97625, 79492, 27563, 31058, -7299, -5469, 25492, -17263, -40097, -90520, -137182, -143915, -60059, -46375, -62666, -99421, -96529, -88114, -34785, -96439, -136309, -59336, 39086, 98548, 128949, 45532, -72743, -15459, -43990, -54013]
9827e4013r826M1061J3966j9679J4334l3361J3771j0542O3181M97r2047l720L9212
9814c7166n7639r1508j8393P3019l8453j03834k9383P316M7680P5116P9283N9500
9802c4462m0468K7555j1622J0132P5037P9196q8276j16717n9952L6695N7162L7534
9790b8186M7440M9834j6465k1157O3867R0251J64681J27175J37693J17087J31039
9779H63259J52479R3894J62279J83938k4143l31677m42521k49402j42120l8639
9769B27347r9318m9223l6452j8694k806K3557q8965j5376M6729P769j1526j7111
9757c4069R4416N0533q0874l8685p9784N0589M3025J0190K0037k5232R0628J45234
9745B46008J07687p6272n8570K8987R1525Q0481N7005J24087J13324J00110J22856
$$ y = [-54013, -63839, -22778, -8812, -28491, -14157, -47518, -33747, -44289, 18892, 19389, -72658, -76378, -37166, -94805, -186313, -204706, -131687, -170140, -273974, -303357, -296041, -248361, -173245, -93962, -34462, -74930, -47375, -58997, -48865, 26172, 105368, 17092, -99625, -159577, -122882, -65720, -28186, 19254, 69088, 52623, 31466, 95333, 185584, 350265, 477440, 615133, 732220, 863259, 1015738, 1109632, 1271911, 1455849, 1431706, 1100029, 657508, 408106, 265986, 227347, 128029, 78806, 42354, 23660, 20854, 44411, -44554, -59930, -13201, -5432, -16958, -34069, 60347, 110880, 30006, -8679, -88463, -37874, 5151, 15341, 35378, 10146, 100774, 246008, 353695, 277423, 218853, 247840, 339365, 419846, 476851, 600938, 714262, 814372, 937228]
9734I37228R2376J41028Q0287N9102P5670o4548k43292k13288j94241o2519p4169
9723E33634m9616o9503o8192k2186o4263k2846o7958l9390P261N1486J8930n2149
9711A55208k0872l7906n7373l2197l3420j2763J22031J0513l3079j056m3276l0780
9699a4970K5817N5856P843j7732N6676M5267k9265j02731r3263L262n8475p4880
9687a96595J3274J39953Q0632k2997k652p305l4124N8947K3731j4688j1673M7975
9675G4478J632K0092n974p5659J3876R312k1558j10305M2883O8269l185p84m9864
9662c6787Q1597Q4339l5998o9038K375J54042J93346M3537n4173M6919J51305
9651E61464J40790J52359l1719k22728k28412j03335o6716p1446o2405O583j3325
$$ y = [937228, 1029604, 1170632, 1250919, 1310021, 1385691, 1321143, 1077851, 864563, 670322, 607803, 533634, 484018, 414515, 346323, 324137, 259874, 237028, 169070, 129680, 136941, 188427, 207357, 155208, 134336, 96430, 39057, 6860, -26560, -39323, 82708, 93221, 60142, 59086, 15810, -14970, 10847, 66703, 74546, 56814, 113490, 158757, 129492, 26761, -66502, -63240, -121715, -196595, -183321, -43368, 37264, 14267, 11615, 4310, -29814, 29133, 52864, 38176, 26503, 74478, 76110, 96202, 90228, 14569, 28445, 37757, 16199, -94106, -51223, 17046, 13861, 13077, -36787, 44810, 129149, 93151, 24113, 26488, 180530, 373876, 417413, 363240, 410159, 561464, 702254, 854613, 822894, 600166, 371754, 268419, 201703, 130257, 67852, 74435, 61110]
9640F1110r3261q6674n7386J21394L5720m6425K738k1827J9454R3186N5291J2765
9628I6085r3645o8200L0229O303q8146p2992J61884J6640J00097M1318r2007p1024
9616c3458m2260L7706M8292O261m9708k6297j075K2815p420J9542J329L4514J7640
9603B7881l4147j8423n782J09327n2487M165j4065p3210p3766J0149m476L814
9591a21020J6562l61o692j63p395o5386K945M7216o687O9298Q1179P443K925k1329
9577a465m0646p696n59R977n6218n5839M0216Q2769J6255n8296Q2769K1318J1921
9564D4506L2681k1376l7035o7760l558J9962j0353P4636R27j54312o0312M0175
9552a41819M2834O2424L319l8903j9711k9637J2057o2063j6171m771J814Q6188
$$ y = [61110, -32151, -118825, -176211, -54817, -19097, -65522, -62784, -84611, -65157, 28029, 83320, 96085, 2440, -65760, -35531, -29228, -117374, -190366, -28482, -11842, 88255, 129573, 37566, -33458, -75718, -38012, 10280, 16541, -33167, -59464, -60539, -37724, -45144, -25602, -24273, 10241, 27881, -6266, -24689, -30471, 78856, 26369, 30534, 16469, -56741, -130507, -120358, -124834, -121020, -104458, -104819, -111511, -111674, -119069, -184455, -181510, -134294, -140981, -71683, 9496, 16939, 19864, -1465, -42111, -49807, -50366, -40389, -96607, -152446, -112230, -29461, -13206, -71502, 11267, 32585, 44506, 77187, 55811, 18776, -48984, -52542, -32580, -42933, 31703, 32630, -121682, -181994, -141819, -98985, -36561, -33242, -72145, -91856, -121493, -109436, -171499, -187670, -192441, -190627, -104439]
9540a04439m6764p1463K2650J2350j796j3429P0606r608L8415r6915m086J05270
9528i9209J6756K6819o055j5379m8848l4196q091N8938J28233O6716m8267o2989
9516b5572n4929N434n8080P134k2769l6109J7677K6858M2875J15867M2427l0078
9504C0735k5259j1594Q726k0821j29257J8985r50K1354l0341o9779M0784n3082
9492b20499j6503Q8365k0133K6299Q0181j1366k3058l5519j3717j6661M7052N1468
9480f4091p530l8029M7974K8058J50k964p8643O271l7702J0480L3863O2064k3467
9467f3566n9032j15334N2608J12320J2818l704M4997K2786j5086R512l9038q8710
9455a29429P662J61684q077j14610j24044M4435N7976M2932o051M5293K9494n6649
$$ y = [-104439, -151203, -222666, -200016, -187666, -189462, -202891, -132285, -141893, -103478, -200393, -204479, -99209, -82453, -55634, -61689, -77068, -125916, -160112, -168203, -109265, 18968, 85684, 37417, -25572, -80501, -75067, -133147, -126013, -148782, -184891, -167214, -140356, -97481, 18386, 60813, 30735, 5476, -6118, 2608, -18213, -147470, -128485, -129435, -108081, -138422, -208201, -167417, -220499, -237002, -148637, -168770, -142471, -62290, -73656, -96714, -132233, -145950, -162611, -115559, -64091, -71621, -109650, -61676, -33618, -33468, -36432, -115075, -108804, -146506, -136026, -102163, -40099, -63566, -122598, -237932, -185324, -73004, -60186, -63890, -18893, 3893, -11193, -1681, -40719, -129429, -121767, 39917, 31840, -82770, -206814, -162379, -104403, -61471, -67522, -22229, 7265, -49384]
9443d9384k6696r3277k8830J05982M3003P2331N0298j21087k5620K2160l8768
9432h9888q5265J1099J16413n4272p0491J7731Q4093K2441K5172N4580j6527J7230
9420C2316L1866k7745j18563m7344k7816l842M994P5595k0696P3399k7776o7361
9408a22973k5587q8124k3017J34626M6435k8762P4455L2791k945k4271J151k5926
9396e2147l6731r1772J2304O9825N8087m461n2304o003p891L0292N6278J474l4199
9383e7248l5174p2927L2342j2307k7959Q6530K4556J2106Q5134N6959J3368j1772
9371I3608m7511l8332J9515k4120n0187L1117o5171m1081J8335j07016K0540P6495
9359a13808P9677l80l2985L8615K4783O865Q2649l5417q1826L2735q6959J344
$$ y = [-49384, -76080, -169357, -198187, -92205, -49202, 23129, 73427, -47660, -73280, -51120, -89888, -175153, -164054, -47641, -101913, -172404, -154673, -70580, -48139, -22967, 31613, 15086, 32316, 64182, 36437, -82126, -129470, -157286, -161128, -156134, -80539, -101235, -27836, -55612, -122973, -148560, -236684, -259701, -125075, -78640, -107402, -32947, -156, -3101, -27372, -26221, -52147, -88878, -180650, -168346, -98521, -40434, -44895, -97199, -103202, -111093, -80801, -24523, -23049, -57248, -92422, -165349, -133007, -145314, -173273, -86743, -62187, -50081, 35053, 92012, 105380, 93608, 46097, 7765, 27280, 3160, -47027, -15910, -81081, -122162, -103827, -210843, -190303, -113808, -34131, -34511, -67496, -28881, -4098, 2767, 85416, 49999, -31827, 908, -86051, -84707]
9347h4707O0213q591q684l4906M6398N0079l7764n0313m9123K37J3654l3847K6197
9334a11157M8753M5770K6743l1153j167R779q842n3353N0885P4074J194p7950
9322b6424r0385n6789Q936N9088j8811r1055J09094J7104k4767j34496m154R4272
9310a58387R3043P8476J8695j4389o177j9870k0172M1336l7437K4752M5651j4489
9298C1032l5619j4500o7162M7677J1648l3348K9204K0720q2533m0032n6695l0252
9286b19860K5029J2091R6307M8957Q636k7380m4767L71j4567K8859M3282q909
9274e1951k7276m4898l5612o3231j2696Q4206j5726P8986J64798J3045J8959n3422
9262E5182m6118q3388j7460k0455N209l8558N2457J03919l0122n8947m141J5428
$$ y = [-84707, -24494, -33085, -41769, -76675, -30277, 19802, -17962, -68275, -117398, -117161, -103507, -137354, -111157, -62404, -16634, 10109, -21044, -22211, -12432, -21274, -74627, -23742, 50332, 51526, -26424, -116809, -173598, -164662, -105574, -124385, -215440, -106346, -89242, -114009, -248505, -252659, -158387, -65344, 13132, 31827, 17438, 11261, -8609, -28781, 12555, -24882, -130, 45521, 31032, -4587, -19087, -86249, -38572, -26924, -60272, -31068, -10348, -92881, -132913, -189608, -219860, -194831, -182740, -86433, -37476, -28840, -56220, -100987, -100616, -115183, -86324, -43042, -51951, -79227, -124125, -159737, -222968, -235664, -151458, -167184, -88198, 76600, 89645, 108604, 55182, 9064, -74324, -91784, -112239, -107030, -145588, -93131, 10788, -19334, -78281, -82422, -66994]
9250f6994Q938j9117l2582Q4424K0474p7141m4113K9282k3543p646P5377J32166
9238G9525J00776l1443r7245q5495l0097m5676O401M2512O2765m6213n1052j28748
9226b23990P7042M9105M8849l0481k8851O0184O5686q031j6343M275l1124R18
9214c2761L5924p929j19826J4370j1170O8401P9371j3359n5912r698N9582O9028
9202G6021k5673j10864o5227L5098N5342M7031n291n9613M0715K5863l3931j9467
9190c9996O6719J9061j3132L8542N903m2697Q599J5646n3534o1178M4070l5211
9178d7208j2206j8128K6961K6204m4284n8282L1844p6762j5368N2881K436P8631
9166e3281M2204q3695L8971m273M5849n7014k0759l5325J8729K2228Q1070R2495
$$ y = [-66994, -58056, -77173, -109755, -25331, -4857, -81998, -126111, -96829, -120372, -128018, -52641, 79525, 180301, 148858, 51613, -33882, -63979, -109655, -103254, -60742, 2023, -44190, -95242, -223990, -146948, -97843, -48994, -79475, -108326, -48142, 17544, 9513, -6830, -2555, -33679, -32761, 3163, -4766, -124592, -110222, -121392, -52991, 26380, 13021, -42891, -52589, 6993, 76021, 50348, -60516, -125743, -90645, -35303, 11728, 6437, -53176, -12461, 13402, -20529, -39996, 26723, 45784, 32652, 71194, 77097, 34400, 42999, 58645, 5111, -56067, -11997, -47208, -59414, -77542, -50581, -24377, -68661, -126943, -95099, -171861, -187229, -134348, -131912, -53281, -11077, -94772, -55801, -60074, -14225, -71239, -91998, -127323, -108594, -86366, -5296, 87199]
9154H7199k7949R504j9320l0639k8864k1918M5599K0037k293M804K2589m0504
9142A8245k4959m4356n6086M9334N7128n190m4749o1628M397J7084M079j7418
9130a04119R1921o3036L2855j1247J00732N5914k6401J1673j0636m4614k2410
9119A0632l9457M251M8719j209j34316l6739R8511L729j2806l4504O9589M2857
9107A9257K5149k3428O654o242M5238n7292j5349J8609j3875n4343q081m2383
9095a06086l2506k721o002N819J21013J43219j9581j54881j31875k7740k8045
9084b39386K5357R0373P0814p9257K1182L2994l8618J1757P107K0579K0346L9652
9072a7100j15669K5905Q9542P2460M8744l1008l8362M902j06053k3589j504N0166
$$ y = [87199, 59250, 68754, 49434, 18795, -10069, -31987, 13612, 33649, 31356, 36160, 58749, 18245, -6714, -51070, -107156, -57822, -694, -5884, -50633, -112261, -107864, -90780, -86701, -104119, -12198, -75234, -42379, -53626, 47106, 103020, 76619, 88292, 77656, 33042, 10632, -28825, -24574, 24145, 22936, -111380, -148119, -49608, -45879, -58685, -93189, -23600, 19257, 44406, 20978, 27632, 21390, 66628, 9336, -6013, 12596, -1279, -55622, -63703, -106086, -138592, -141313, -147315, -141496, -20483, 122736, 103155, -51726, -183601, -211341, -239386, -214029, -123656, -52842, -132099, -110917, -77923, -116541, -104784, -97677, -77098, -56752, -17100, -132769, -106864, -17322, 55138, 103882, 72874, 34512, 39414, -66639, -90228, -91732, -41566]
9060d1566J5122K8623l2241l6805K6521O8946j9494p8434k4926j718L4355L0278
9048c1339L7128J5880P295p1113j07328J6692L4170M8174l8020l4047J9385j8171
9036a21294K922R2804l2169j12971K9981N070m2855n9665P1886J38525K8571l5178
9024c4373m4500o1737j7768M0409P956L4465J4420k4802l3302M8932J4693j7376
9012g2983m26p1785L9938l193M4318K144o7772Q0086k5000j260n6636l2394R4014
8999g0949L0628N474J1214m0584K9865j28902k1154J16066P2877N0632l8948o6178
8987d9959p3534j08281k6975J48324P9038O447J1489p3204o8835J14187Q8740
8976D7437r875k2083n5513j2511k1211J330j5748j0262p6070L4221J27888J6383
$$ y = [-41566, -26444, 2179, -30062, -66867, -40346, 28600, 9106, -69328, -94254, -95972, -61617, -31339, 5789, 21669, 28964, -42149, -149477, -132785, -98615, -50441, -88461, -122508, -103123, -121294, -118372, -25568, -57737, -170708, -140727, -135657, -178512, -238177, -166291, -27766, 805, -34373, -78873, -140610, -158378, -117969, -110013, -75548, -61128, -85930, -119232, -70300, -55607, -72983, -73409, -145194, -105256, -108449, -64131, -61987, -129759, -49673, -74673, -75933, -132569, -164963, -70949, -40321, -34847, -23633, -64217, -34352, -163254, -184408, -68342, 4535, 55167, 16219, -49959, -123493, -231774, -258749, -110425, -31387, -24940, -13451, -86655, -155490, -41303, 47437, 37562, 15479, -40034, -52545, -73756, -72426, -88174, -98436, -174506, -140285, -12397, 3986]
8964C986m1015l6502P671J15118m3606r8369l8517l8778K0165P034Q0812R2571
8952C0570L0127L722l0144o922k4014N337p8969k5465k1901J9890k624j4727J8776
8939i6344J2278N7269K7673L8212o4500O9736J1437o6208r094R97m8346o9489
8927a36379M5870J9795j5515k3982p1500Q4791N3502p7676M5477O6546k4697j40466
8915a74234j07218L8306M5980k319O1669O2080P0148K7406K1797M4036l7278j00137
8903d9764j5432P2148J29761k7183r5726q5785K4475l0834n9354j3749l1083N9834
8891a22692J2669O9989P6366l8600j04581q8532N8343J60432K4107j1751o1054
8880b5304n9604n7122K6769l221l4991j0580r132L8251N3725K6605k453J8890
$$ y = [3986, -37029, -73531, -65860, 49258, 5652, -92717, -131234, -170012, -149847, -142813, -62001, 30570, 60697, 64419, 34275, 27353, 3339, 8676, -70293, -95758, -117659, -97769, -100393, -115120, -96344, -84066, -26797, 876, 39088, -25412, 44324, 55761, -10447, -19541, -18544, -66890, -136379, -90509, -70714, -86229, -110211, -181711, -96920, -43418, -121094, -75617, -9071, -33768, -174234, -281452, -243146, -197166, -199485, -137816, -75736, -5588, 21818, 43615, 87651, 50373, -49764, -65196, 6952, 136713, 109530, 13804, -71981, -47506, -78340, -137694, -151443, -182526, -122692, -110023, -40034, 36332, -2268, -106849, -195381, -137038, 23394, 47501, 35750, -25304, -84908, -142030, -115261, -118482, -153473, -164053, -173185, -134934, -81209, -54604, -57057, -38167]
8868c8167n3692l8794N3875J32141P0602o9445o0578k7794j7543M1211m6614j24939
8856a79737r0363N1015P1998J17600j1063K4009k5721K594L0057K6450o9226K9470
8844b2917M4993M8424L8189m1547O7891n7860j25719j6529J17004j1758j6868
8833B3303K9479l4491l5574k6042o332N1913L6022N178o5183p4689k7450j9809
8821a43675r253m0209j3305O6947l4897j0160J9428O9469K6287k7506l8210k9245
8809a64329j2530Q6676K460Q314L7273J2407L3415L7447J853L8494m2045M0272
8797G9707N6538m2345o4720P810j415j4871N8378j5297n0196K0837o6957k0r1676
8784a24227m4573N5176o0029n1378l154k3062J678K9298Q8538Q0310l7377m1962
$$ y = [-38167, -91859, -130653, -76778, 55363, 125965, 56520, -4058, -31852, -49395, -8184, -54798, -179737, -270100, -219085, -147087, -29487, -40550, -16541, -42262, -39668, -9611, 16839, -52387, -22917, 22076, 70500, 108689, 67142, 135033, 77173, -48546, -65075, 51929, 40171, 23303, 52782, 18291, -17283, -43325, -49657, 2256, 38278, 43456, -21727, -96416, -123866, -143675, -152928, -193137, -206442, -139495, -174392, -184552, -165124, -95655, -69368, -96874, -135084, -164329, -176859, -90183, -87723, -79409, -42136, -29729, 3686, 41133, 42986, 81480, 39435, 79707, 136245, 93900, 29180, 36990, 35575, 20704, 79082, 63785, 13589, 34426, -32531, -32551, -124227, -168800, -113624, -173653, -225031, -228185, -251247, -249569, -220271, -131733, -51423, -88800, -130762]
8772a30762n9673K5822L2499N3699P8860O0521k1840j06755m3357j9649M6907
8761h3728n3485n154N3909O0466N8831m0416m29K7251l9620K9955L0287j7258
8749B0609l4320O5400J8978q9715m846K0521m1584o1486O192Q9656J7999k7659
8737b0255m9226L7040J09213J4293m5186q7999M2547M7928j730j0308o535l5260
8725e478k7200l0462M8207M5465o6385k9340o472M7863K8748O889r1J3922l7542
8712a1876r485L9562M7368N5822L3356l961o7219j16588o2312L6552O1022N1681
8700E3922l0306K0069k6337j3978j302r058k9755n2633k6771K6874R1407K2621
8688B4753o8697j5719J1535K2235M3152k2930l07p733L1033K9970l4245n0556
$$ y = [-130762, -190435, -164613, -132114, -78415, 445, 60966, 39126, -67629, -110986, -130635, -83728, -137213, -142367, -88458, -27992, 30839, -9577, -10006, 17245, -22375, 7580, 37867, 20609, -13711, 51689, 70667, -19048, -23894, -3373, -44957, -106443, -100251, -10595, 7404, -20255, -69481, -32441, 76772, 91065, 45879, -42120, 427, 48355, 46625, 36317, 29782, -5478, -32678, -63140, -14933, 30532, -35853, -65193, -71665, -23802, 4946, 11835, 11744, 25666, -11876, -21361, 18201, 65569, 121391, 154747, 150786, 83567, -33021, -95333, -58781, 2241, 53922, 23616, 43685, 17348, 3370, 2068, -6990, -36745, -89378, -116149, -89275, 2132, 24753, -43944, -59663, -48128, -25893, 17259, -5671, -5978, -13711, 17322, 47292, 13047, -37509]
8676c7509k3895N0814k5337l2707q411N6645L1281J9130n2213N6665J43072N1551
8664B29086j7490n5901j6338o2479k7906Q9785L1609j30451j3802O6794q6515
8653F392n8518J3260k2141R7431J15244J3672r7228k3894p849l1596L6379r5152
8641e4000l7101O8412m3427j31366O0742R7378j8912q6206l1972q052J35503J00972
8629E1971J8281J3104o7650L0970O2444k9848k5693L4028P4242O1292l8931k3932
8617A60278j0239j39718j2771Q217J23364K0012p0036m5670R137L1668n7835J2010
8605B8417J06058L273m7453N0803k731j7699o4086j1870j3451j7663n3800n504
8593d5706m5106k0031R8920P5321m1323j7005J1675N5239P873M0407L7938l0411
$$ y = [-37509, -61404, -10590, -35927, -68634, -77045, -20400, 10881, 30011, -22202, 34463, 177535, 229086, 211596, 155695, 139357, 76878, 48972, 138757, 170366, 39915, 26113, 92907, 6392, -52126, -38866, -61007, 36424, 151668, 165340, 68112, 44218, 36369, 4773, 41152, -54000, -91101, -22689, -66116, -197482, -136740, -39362, -58274, -144480, -176452, -184504, -49001, 51971, 70252, 83356, 15706, 46676, 109120, 79272, 53579, 87607, 161849, 223141, 184210, 160278, 150039, 10321, -2450, 5767, 129131, 149143, 79107, 33437, 42574, 74242, 16407, 28417, 134475, 137748, 90295, 141098, 138367, 120668, 56582, 44712, 31261, 13598, -40202, -45706, -90812, -110843, -11923, 63398, 22075, 5070, 16745, 71984, 79857, 120264, 158202, 127791]
8581A27791M667Q2012K9348q917O4077P9476j5865L3965P958j5575K9310l4755
8569C83492r3163K269N5267j9246o3245l6705k2588J3453q8487j9963N9926j3191
8557A57819o6600j6512J7852k277q3792K0519O2837P7943L0085k1955r31n3434
8545A21554O5399Q1643L3736K1503l027J7374K0303k6693j7049O0939R7364N4894
8533E27940p3774k6982P6895J3267M395r7382q6838K4361j3872j41954r6927o7462
8521D1667n1641r109M9697m3412K1044N813L1401M8478K9100J7458m7309n5024
8509C8163k0465l4424O6358k649n0328q8959K7679J29798P8242j0463k5040p8102
8497B9810Q3179Q3386K8885K8510K9562J04231J12295O0917k8616M340P4910J01458
$$ y = [127791, 132458, 214470, 243818, 234901, 298978, 378454, 362589, 396554, 404512, 388937, 418247, 383492, 290329, 292598, 347865, 328619, 265374, 228669, 206081, 219534, 131047, 111084, 171010, 157819, 91219, 74707, 92559, 90282, 6490, 27009, 89846, 167789, 197874, 175919, 174988, 121554, 186953, 268596, 302332, 323835, 320808, 338182, 358485, 331792, 314743, 375682, 473046, 527940, 454166, 427184, 504079, 517346, 521741, 424359, 337521, 361882, 348010, 206056, 109129, 41667, -9974, -19083, 30614, -12798, 8246, 14059, 45460, 93938, 123038, 140496, 93187, 38163, 17698, -16726, 49632, 46983, -3345, -92304, -64625, 65173, 143415, 132952, 107912, 29810, 112989, 196375, 225260, 253770, 283332, 387563, 499858, 560775, 532159, 536499, 611409, 712867]
8485G12867O3749m835j51213j80398n6937k5365j02308j51950k8806J9609k1573
8474G2840k7192Q635j5853L6154N3946O681o1358j3869J1249J8937m5943j9600
8462B4627L360K1414M4791M6583K0033O3374N7669o6177n7218l9345P4444N7936
8450B51491k1037K3375K1608q306J17L3917O5231M7826J3091j5938L2254J3926
8438D57555q1718j20862o756N2376l416n311j66239q4338O8284L8514j28550r8823
8426g9284n445R9773J492J0025J13637o9984p5951l2110J3483l3244q7731J8123
8414a27216P0538N6866m3495M4968J14785J0995j3766J4827k760P264O4885j9292
8402A78599j21606n0467j3353M0158R0351k3235j36024k7918L9881P0865j9680
$$ y = [712867, 776616, 771781, 620568, 440170, 383233, 357868, 255560, 103610, 74804, 94413, 72840, 45648, 54283, 38430, 74584, 128530, 135211, 73853, 59984, 71233, 90170, 44227, 24627, 27987, 49401, 94192, 140775, 160808, 224182, 281851, 215674, 158456, 119111, 193555, 251491, 230454, 253829, 275437, 267131, 267248, 301165, 366396, 414222, 427313, 411375, 443629, 457555, 375837, 254975, 248219, 300595, 297179, 291868, 125629, 41291, 109575, 148089, 19539, -79284, -84729, 15044, 16536, 26561, 140198, 70214, -5737, -37847, -24364, -57608, -145339, -127216, -56678, 188, -43307, 1661, 116446, 127441, 113675, 128502, 125742, 133006, 197891, 178599, 56993, 6526, -6827, 33331, 123682, 100447, -35577, -63495, -23614, 47251, 27571]
8391B7571K1481K2493m44j1254k4565j7429M9267l150n9010l2659K478L0538j319
8378C998J6963O5845L4274k7306p681M2959l9558n9355o2112m2991m8268Q6275
8366c6957K9290N8935P9563M832k365m5012p6927o8890k5566j3679L0994R0608
8354B4826J8917Q504K9347J27285J52764J88860K23027Q2923Q289j578J03906
8343I67070K17141K54122K06530j2154m05881m22850k23877j45599j81747q9617
8333A63138L521j54p051J6173M9442o282p1977K2928P4085P6144o3011k09935
8321D7021R100Q42o2620K3118M3884J8944R8209P4752m4043j35783m9843L5779
8309E9360J11987J77308J15990J12878J87220M88462M93147J99061O077k2752
$$ y = [27571, 49052, 71545, 71101, 59847, 35282, 17853, 67120, 63970, 4960, -27699, -25221, 5317, 3998, 20961, 86806, 121080, 93774, 86093, 129052, 89494, 30139, -31973, -74964, -123232, -36957, -7667, 51268, 130831, 135663, 133298, 88286, 11359, -57531, -83097, -96776, -65782, 24826, 43743, 52247, 81594, 208879, 361643, 550503, 773530, 856453, 864742, 863164, 967070, 1184211, 1438333, 1644863, 1632709, 1226828, 803978, 580101, 434502, 252755, 163138, 166659, 166505, 159454, 175627, 225069, 218787, 146810, 169738, 243823, 319967, 256956, 47021, 56121, 56963, -5657, 17461, 61345, 80289, 178498, 253250, 209207, 73424, 23581, 59360, 171347, 348655, 464645, 577523, 764743, 1253205, 1746352, 1945413, 1951490, 1928738]
8299A928738K66241M64756M25102O9881p35111q54343m56685j98297j57373j87281
8289E65628j00813r9620j9041K4565m9237n889m1083n8742p4874n5694L1981M3436
8277A60617K5028J9746j5865M0221O6589j5810q0859l8269n565m6770l9662j9451
8265D9950j2107J47411K3141N9610P1555J29998K41819J55634J50031J9860j6230
8254A020672J53294J68925J18745j74133m05525k82773k48659n2828p9831o4375
8244A53512p3300M330P6201N3367N3130j02340j0711O5960O2297o5703j01482
8233A15261j1537j0493M9607m1805K13J6753k0690o4729K7193m5932j3285M2260
8221D2816j5740K0204J8010l5494N2887L7048k0179k8577K4026n1650o480J797
$$ y = [1928738, 2194979, 2659735, 3084837, 3154718, 2419607, 1565264, 1108579, 910282, 752909, 565628, 464815, 365195, 346154, 370719, 321482, 315593, 274510, 215768, 140894, 85200, 117181, 160617, 185645, 205391, 189526, 229747, 296336, 280526, 199667, 161398, 155833, 109063, 69401, 49950, 37843, 185254, 208395, 268005, 339560, 469558, 711377, 867011, 1017042, 1036902, 1020672, 1173966, 1342891, 1461636, 1287503, 881978, 599205, 350546, 297718, 217887, 153512, 80212, 84542, 160743, 214110, 267240, 164900, 154189, 220149, 282446, 216743, 115261, 103724, 93231, 142838, 101033, 101246, 117999, 97309, 32580, 59773, 13841, 556, 42816, 27076, 47280, 65290, 29796, 82683, 119731, 99552, 70975, 95001, 43351, 36871, 38668]
8209C8668j715j8260J4859j1689m6793K4422o6255n4168L6806K861P7294J5680
8197A1710J7797P9509j2001p3329N2914K8999m3722n6681L755K1891l7137r0701
8185i6996l276k9929K3872m3646k9720K5119M5940m017R9027N4230J6890P732
8173F5226n1463k9492j9227m5679k898J2172L9040o0435j03197N6602L0931l1026
8161a39446k991O9014p4441r9041L3377K2263N6157R8126O9928K9916r736k8669
8149B4457o0562q1620m5765o1445J14259J42387N3869o3677n296k5003J662p0835
8137g7569l0419j1542o7065M0794Q7266L1951P3923Q3219j3761n3926r364k1150
8125C2357p7783p0691j1511J6996K2190K1612M1402N3424N298j1028M396o6333
$$ y = [38668, 36953, 18693, 33552, 21863, -24930, -508, -66763, -120931, -84125, -81264, -3970, 11710, 29507, 109016, 97015, 23686, 76600, 105599, 61877, 5196, 8951, 30842, -6295, -96996, -100272, -130201, -106329, -149975, -179695, -154576, -108636, -112653, -13626, 40604, 57494, 65226, 13763, -15729, -34956, -80635, -83533, -71361, -32321, -92756, -195953, -139351, -108420, -139446, -142437, -73423, -147864, -246905, -213528, -191265, -135108, -36982, 32946, 62862, 53126, 24457, -36105, -117725, -163490, -224935, -110676, 31711, 85580, 21903, 16607, -8396, -6734, -77569, -107988, -119530, -186595, -145801, -58535, -26584, 47339, 130558, 116797, 62871, 53507, 32357, -45426, -116117, -127628, -110632, -88442, -66830, -25428, 27996, 33294, 22266, 26662, -39671]
8113c9671K3822M5152M7663j29962n6917n7203J92K8621N4915R7891k5313q2928
8101i3738P427Q3918O265O0522j05546J2175K3436M3130j1799m0487j7555n3829
8089h6081J96K6370P8235K0589J3608n7811m3701k2514J0986L0464O0854k5640
8077E555M0238o0585j15757L5918J07069K6950M439m6230R359r3769K4471K5321
8065c7021R1547L5891j03643q1189j4182J7072N7000J3423K3195j065K4801L6353
8053F2182J571n2663n6325N0146k1109P120J9769j3691K3135N0224N4031p6758
8041D7632p4986l0848k6416K7673J1273N6997k662p8861M9396Q9316L7570P861
8029A13945l1888n9913J9094p386k0596o2011J8302k0041r0695N4411M3988J335
$$ y = [-39671, -15849, 29303, 76966, -52996, -109913, -167116, -166924, -138303, -83388, 14503, -10810, -93738, -86311, -2393, 3872, 64394, -41152, -28977, -5541, 37589, 25790, -14697, -32252, -86081, -85885, -59515, 18720, 39309, 52917, -4894, -48595, -71109, -60123, -29659, 31195, 5555, 45793, -14792, -130549, -94631, 12438, 39388, 43827, -2403, 6956, -86813, -62342, -37021, 54526, 90417, -13226, -94415, -108597, -91525, -34525, -21102, 2093, 1028, 25829, 62182, 63753, 11090, -45235, 4911, -16198, -9078, 10691, -3000, 20135, 70359, 124390, 47632, -27354, -58202, -84618, -56945, -45672, 11325, 8663, -70198, -20802, 68514, 106084, 113945, 82057, 22144, 41238, 33852, 13256, -48755, -30453, -50494, -141189, -86778, -42790, -41455]
8017d1455O3751M2812o730m2151K5527R636j998k4289q9975K4268l1146K3993
8005d7757P481K2260J6325K5732J9929M2188p7008k0287L6798j6225k9036l766
7993b3366L1886N4483k0489o0523p2473K7801Q9847K5242p7243n49J6500j0454
7981a9338k7183m04J960q0627J5657M2699L2855k851J09672R872q1512m5258m3665
7968h8123M6352J7006k9673K0995L901o9375n3703N2622J14748p7212m7235n7767
7956a67464J7747R5387R0866L9794o3205j02323r221M951o898J04987K7496J1599
7944D3716J4800L217n025O331K0649M402n2589n4893o2011O955P7613j5403r65
7931a3203O2814K4890m1511M7145j036J2186j5037q0960n0351J20444M1136p8073
$$ y = [-41455, 22296, 65108, 58378, 16227, 41754, 51390, 49392, 25103, -64872, -40604, -71750, -47757, -40276, -18016, -1691, 24041, 43970, 86158, 9150, -11137, 25661, 9436, -19600, -23366, 8520, 63003, 42514, -18009, -90482, -62681, 27166, 52408, -24835, -25384, -8884, -19338, -46521, -46925, -44965, -125592, -109935, -67236, -34381, -37232, 72440, 82312, 800, -44458, -88123, -41771, -24765, -54438, -33443, -29542, -98917, -152620, -99998, 14750, -62462, -109697, -167464, -149717, -54330, 36536, 76330, 13125, -89198, -98419, -93468, -100366, 4621, 32117, 43716, 58516, 61733, 56708, 63039, 83688, 88090, 35501, -19392, -81403, -74448, 3165, -12238, -13203, 49611, 74501, 32990, 80135, 79099, 91285, 76248, -4712, -55063, 65381, 106517, 28444]
7919B8444q433L0883Q281p4794q3193R1422M0906l0707N8899K9963n4879K5162
7907F1954q585O413l1041l303op2622L1693j3434M1690N2321m2994N6369P107
7894H5562o5576k9248N0691r9140j10482K3316P2532R866J09934P7776m5244r842
7882G0145m604l0966k1858m1649P1530q376p3891J6361Q622R6511L1351j1622
7870A01554l6889M2303o4667r6888p6347J5973J3947k4232O1492J7995L7303N8393
7858D9937L1951J5534k0259q4036q7823R2747L7663N970K3757n1726q8517N959
7846f8843P9100N5261p920j6710o410j5477m4584M1507M1928J6261p5316j6230
7834a7433j935K2271o3644l8969O3129q6749n2799J7105K2104L5498L2449Q691
$$ y = [28444, 20011, 50894, 59175, -15619, -98812, -7390, 33516, 2809, 61708, 91671, 36792, 61954, 53369, 59782, 28741, 25438, 25432, -47190, -15497, -28931, 12759, 65080, 22086, 78455, 85562, 19986, -9262, 41429, -57711, -168193, -144877, -72345, -62479, 47455, 125231, 79987, 70145, 65541, 34575, 12717, -28932, 42598, 34222, -39669, -23308, -14686, 81825, 113176, 101554, 64665, 106968, 42301, -54587, -130934, -114961, -101014, -125246, -63754, -45759, -8456, 49937, 81888, 97422, 77163, -6873, -94696, -1949, 35714, 41684, 65441, 13715, -74802, -68843, 10257, 65518, 57598, 40888, 34478, 19001, -25583, 15924, 57852, 74113, -1203, -17433, -19368, 2903, -60741, -99710, -36581, -123330, -176129, -159024, -136920, -101422, -68973, -60282]
7822f0282M0541J8023r2633J3977P3711M8176l4862n7728K4161O887K8714q83
7810G802P0010N102l7110k6379j1893K3635L7289r4646q1763l0912O1267N0376
7798b7222M1913O5045j8659r4695m8930l8613P2086N5395j6653m1112n4798J4616
7786i1627r902p1672m0078L4769L4066P5262M7171J6387j0750l4321M9948N1166
7774E0419j9617j5039p0455j5340M6061j4224n280J16096K6256l5173N339j1246
7762E7797m8389o0939k5391J974l7101l481L4076L6985J1169O1224M2384Q0659
7750A50967k9827q8009J2438J8776m5345M0702Q1552k7343j25200o8168J953Q561
7738f8943k6286j29R332Q5583K7867M98k2591J159M7641m6617r6038m4672P519
$$ y = [-60282, -19741, -1718, -94351, -80374, -6663, 41513, 6651, -51077, -26916, -20029, 8685, 7802, 77812, 82914, 45804, 19425, 7532, 31167, 68456, -26190, -107953, -138865, -77598, -27222, 14691, 79736, 61077, -33618, -82548, -121161, -49075, 6320, -10333, -51445, -106243, -91627, -101529, -173201, -213279, -178510, -144444, -69182, -22011, -5624, -16374, -50695, -747, 50419, 30802, 15763, -54692, -70032, -23971, -38195, -43475, 72621, 98877, 63704, 69043, 57797, 9408, -51531, -76922, -74948, -112049, -115530, -81454, -44469, -33300, 27924, 70308, 150967, 121140, 33131, 45569, 64345, 19000, 59702, 141254, 113911, -11289, -79457, -77504, -68943, -95229, -95358, -86026, -443, 27424, 27922, 5331, 6490, 54131, 7514, -88524, -133196, -125677]
7725a25677n2984P4898j3513j872M0955L845o217L9310J7919n961J205k0683K2861
7712b5914K2726J2649l6624p744j1153k7105Q509p4012k6917M6747k032l4376
7700a55246K8952L9136M434Q7182J34388j4021q2642q0655l4526P3234k295j18372
7688a20431n3519k6727P9590K1535M7659J9203J250Q244K0280J6815j3742J2291
7676A2448p9765K7978P095o9198l474O2150j612k0832o8450L0903m5177n6748
7664b04682K3267L2429P7700N1025l408k8079r410j5416J514l8568J3997J5613
7652h4018L8235k3933p8807M4419M1227N238N346O4631K9018J8219n16j4982Q4381
7639A28458J3806j02708q6428j6472l1302m1441j6548J7447M9827J27850O6515
$$ y = [-125677, -178661, -103763, -117276, -119148, -78193, -74348, -80565, -41255, -23336, -29297, -28092, -48775, -25914, -3188, 9461, -27163, -34907, -46060, -73165, -64656, -138668, -165585, -118838, -120870, -155246, -126294, -87158, -82724, 4458, 138846, 124825, 42183, -38472, -72998, 236, -2059, -120431, -173950, -200677, -121087, -99552, -51893, -32690, -31440, -23196, -2916, 13899, 157, 12448, -67317, -39339, -32244, -101442, -104916, -42766, -44378, -65210, -133660, -102757, -147934, -204682, -181415, -148986, -71286, -20261, -23669, -51748, -61158, -76574, -75060, -113628, -99631, -84018, -45783, -69716, -148523, -104104, -62877, -57639, -52293, 12338, 41356, 59575, 59059, 44077, 128458, 142264, 39556, -46872, -63344, -94646, -136087, -152635, -135188, -85361, 42489, 109004]
7628A09004L3682n1745k0938N7553l8388q1566m4884O3168O2946J3266m5170k3439
7616C3489K0364o8193p9238J5453K3626j3732m0660l1903N8267M6529N9303Q946
7604C2251M2053P5441L5031j2233m0584k2981p6714M610j2558L1546P3655j05572
7592B3945r2240j0568M6897N8676N2731l1547m0075k8131j6053j44682K7378J18152
7580c5517Q0545m9759j899k4255r2672J6905j8013K3544M2939N1228j0198o7130
7568h4282K7382J4861L4669l8039k9570q698L3310O613k4643J3657P0882K6446
7556D2588n0823j0704j9334j0252j0552l0087o0714J6797r784l2592j7443K3708
7544a69192L7377N0450J1687L2958p7563p1064K0487Q6296O1811O5307l7099j25130
$$ y = [109004, 142686, 90941, 70003, 127556, 89168, 7602, -37282, 25886, 88832, 102098, 56928, 33489, 53853, -14340, -93578, -78125, -54499, -68231, -108891, -140794, -82527, -35998, 23305, 32251, 74304, 149745, 184776, 172543, 131959, 108978, 32264, 36874, 24316, 55862, 129517, 23945, -68295, -78863, -31966, 26710, 79441, 47894, 7819, -20312, -36365, -181047, -153669, -35517, 45028, -4731, -6630, -30885, -123557, -106652, -124665, -101121, -58182, -6954, -17152, -84282, -56900, -42039, -7370, -45409, -74979, -83677, -50367, -43754, -68397, -54740, 16142, 42588, -8235, -18939, -38273, -48525, -59077, -89164, -149878, -133081, -142865, -175457, -192900, -169192, -131815, -81365, -69678, -36720, -114283, -185347, -164860, -78564, -16753, 48554, 11455, -113675]
7532a13675k37L0891Q2692m845l268L0731j6821k3503k1938o2570J3840M5855
7520d2848K0809l4600n2753l525M6808J370o0394o449O2047P049L2707k6088L0333
7507b5534k0163n3523m5770J6683K4640L6542N3188K2899l3512K4088J10268O5487
7495A75293j1571j13264r2987J6439J20719l2633o2170m7156J0036k4835O2512
7484C83J2988l8417k1857k5020K8144N3557n100M0179Q3423M9547r1199j7618
7472F9010k5182l8477m4366k526j5006l5757J00134k481r341J0558l4191M2222
7460A4597L1503J5723K4913k5728k7932m4067k2455J753K9786N634O186J5988
7448B5901k5811q3383q827N630l2282K1658o5390j0601J31152n2410n8318q537
$$ y = [-113675, -113912, -83021, -329, -5174, -8442, 22289, 5468, -18035, -39973, -102543, -88703, -42848, -22039, -56639, -109392, -112917, -66109, -64739, -125133, -131582, -69535, -62486, -29779, -55867, -25534, -45697, -99220, -144990, -128307, -103667, -67125, -13937, 8962, -24550, -462, 109806, 175293, 163722, 50458, -42529, -26090, 94629, 61996, -174, -47330, -37294, -62129, 383, 13371, -25046, -46903, -71923, -43779, 9778, 4678, 44857, 128280, 177827, 86628, 69010, 43828, 5351, -39015, -41541, -56547, -92304, 7830, 5349, -3992, 6566, -27625, 14597, 46100, 61823, 86736, 61008, 33076, -10991, -33446, -31693, -1907, 3727, 9913, 25901, 90, -83293, -92120, -86490, -118772, -97114, -162504, -173105, -41953, -94363, -152681, -161218]
7436a61218M6964P4570L4842J1325Q627m7414j09210n4513q0317k5031Q9703M6033
7424a65639L7401J0783M4457M2748k9304o5092k0772P9516N3188n645l0076m8343
7412i6778Q522K3489M232o6516j10562K1415L1156Q5572N0418r5402j5335k3076
7400a82865N1258J6331K8636p180N0467n4408k0782O4247o045j3738k1049k4658
7388a19786l6260p9697K1409M2513K430R8954K4728o1023l2060J9088R2609L4369
7376G274l3517n4215J1010O8705L9708n516K0786J6767L6158N8642j45331j15956
7364i5485k4786r592o6421K2755J61634m3352j3687L6433L0943K4802o2149j3195
7352e2100n0748m3316M6522O7968j3439j7968j3886J6483M9792n0997q0347L4934
$$ y = [-161218, -114254, -39684, -4842, 6483, 15110, -32304, -141514, -196027, -276344, -301375, -211672, -165639, -128238, -117455, -72998, -30250, -59554, -124646, -145418, -65902, -12714, -18359, -48435, -96778, -88256, -64767, -60535, -127051, -237613, -216198, -185042, -99470, -49052, -144454, -159789, -182865, -131607, -115276, -86640, -93820, -43353, -97761, -118543, -54296, -60341, -74079, -95128, -119786, -156046, -235743, -214334, -171821, -169391, -70437, -45709, -106732, -138792, -119704, -27095, 7274, -26243, -80458, -69448, -743, 38965, 33449, 54235, 71002, 107160, 165802, 20471, -95485, -120271, -129863, -196284, -173529, -11895, -55247, -68934, -32501, -1558, 23244, -38905, -52100, -102848, -146164, -99642, -31674, -45113, -63081, -76967, -60484, -10692, -61689, -142036, -107102]
7340a07102M7207K0296R351M7004k7274k0861m753l1387L6305j4618N16o2096
7328a07412L2421M5700j2607p915m768M4343K1826r6646o505O6966k8490L3688
7316a9399p8334j2796J9281M7122K9395N2659r9994k0765M064K1126J108K6277
7304c0256l4883R002R1847K1831m5284j673l2417k3378n3366l2120L9043L2817
7292e8837o785M4842K4643l3150q550n3511M9232N9K1843K5322o960k53J05975
7279A03870j8841L4796m5063j12891q4385N7271j8091m9186R8708P1992k1990
7268A6190j8520j5377j23428n9112P1506R7331J4266m3075o1176M741J1284l2294
7256a37664n9616J3051N4505L4592J2406M1871L7526L5180L2085o1763p2476j367
$$ y = [-107102, -59895, -39599, -30248, 16756, -10518, -31379, -36132, -67519, -31214, -45832, -45316, -107412, -74991, -29291, -41898, -49813, -54581, -10238, 11588, -85058, -91563, -24597, -53087, -19399, -97733, -110529, -91248, -44126, -14731, 37928, -62066, -82831, -78767, -57641, -56533, -30256, -65139, -56137, 35710, 57541, 12257, 10584, -21833, -45211, -98577, -130697, -91654, -58837, -65622, -20780, 3863, -29287, -37837, -91348, -42116, -42057, -20214, 5108, -1852, -2105, 103870, 85029, 119825, 74762, -38129, -122514, -65243, -83334, -132520, -33812, 38180, 16190, -2330, -17707, -141135, -200247, -128741, -31410, -17144, -60219, -121395, -116654, -105370, -137664, -197280, -184229, -129724, -95132, -82726, -40855, -3329, 31851, 63936, 2173, -70303, -71670]
7244g1670L894M0164j651o6352q762M7878J4602J18137J19856j2410j50678K4403
7232E7411j8624n6452j4745J098n4896m4595M5432J7418r040l4135J227O1988
7220d7913L6940m4049L1316O266J2598J9786L4517L397r0252p4335m7188o7863
7208b26780O5991j2407K9858M6559N6122Q3822p254l4513l1259M2741m2780l1199
7196f1099J03283J5379K30n2594j2584Q2465o5949j5938O9692j5041N998K6964
7184H0806M8895j613j691j11953j07215k2189Q5379J13135P7186P965j14879q7476
7172c3650N6411K7793o270k8416j21752n2614L3620R1862N1214r5285r9691O8852
7160a07926O1127M8296J23503N6132m4900p0484n5849q419n937r0814L0631L0459
$$ y = [-71670, -67776, -27612, -29263, -95615, -104377, -56499, -41897, 76240, 196096, 183686, 33008, 57411, 38787, -17665, -32410, -31312, -86208, -130803, -85371, -67953, -76993, -111128, -109901, -47913, -10973, -55022, -23706, -17440, -4842, 14944, 49461, 52858, -37394, -111729, -158917, -226780, -160789, -173196, -143338, -96779, -40657, 43165, 35911, 1398, -29861, 12880, -29900, -61099, 42184, 57563, 57793, 5199, -7385, 75080, 9131, -6807, 62885, 47844, 53842, 80806, 129701, 128088, 126397, 14444, -92771, -114960, -29581, 83554, 160740, 168705, 53826, -33650, 22761, 50554, 44284, 15868, -105884, -158498, -124878, -33016, 18198, -77087, -176778, -107926, -46799, 1497, 125000, 181132, 136232, 65748, 9899, 1480, -4457, -95271, -64640, -34181]
7148c4181N2811N0639j0122m2418n8006L0956j5202m4684o695n7929O3711m543
7136g5663j01740R382k7123Q3669N0944J3233k5361l5682p568K2548Q009L0015
7124e5337J0358K0511n8833O2008l8556l9666P140M7996O0850J4162o9779k287
7112d1433J7254L4323L3032j7309m7030m0574L7497J9361j3544l9485r552j0418
7100g7878k2331o7212k205P6974k4496M4126r086j05060j7932J61428J18430l9316
7088C5442k0123K6182n0775o0292l466o4461k0690N3051K3463M4280k3631j5101
7076g6121L2828P7420l6035p5418m0165P9675P3315J3954l2363l0244N159K4739
7064A6744o605n5862n5118J45549Q4856l7273m2516m8358J7565K7650n1471n3429
$$ y = [-34181, 18630, 69269, 59147, 16729, -41277, -10321, -25523, -70207, -76902, -134831, -71120, -75663, -177403, -168021, -195144, -111475, -60531, -47298, -72659, -108341, -115909, -93361, -85352, -55337, -44979, -24468, -83301, -21293, -59849, -99515, -92375, -44379, 16471, 30633, -39146, -41433, -24179, 10144, 43176, 25867, -21163, -61737, -24240, -4879, -18423, -57908, -67460, -77878, -100209, -167421, -169626, -92652, -117148, -73022, -82108, -187168, -205100, -43672, 74758, 35442, 15319, 41501, -9274, -69566, -73032, -137493, -158183, -105132, -81669, -37389, -61020, -76121, -43293, 34127, -1908, -77326, -117491, -37816, 35499, 49453, 17090, -13154, -7995, 16744, 10139, -45723, -100841, 44708, 129564, 92291, 49775, 1417, 18982, 46632, -4839, -58268]
7052e8268j8732O0396K3518Q4870P3305m5163r7564n4224m9412J5048P0337o7625
7040f3514M054P8757l7243l4571j2925L9725N3596k6235j6411m9196r0025n7780
7028b11768N0988Q9918k077K0152R8772N9777J9852m7420p1848L6666K0381m5425
7016A7968o4342j1679K5463P9822J7174l8436R528l6193l8045J7837k8713m8552
7004i8168O7414Q5189l7911l4380J2264m0386j6793L1573O4205K284K0801K1413
6992G7505j23686k7840j950L429L0405J03558P2311m5834j5246j104K8365K764
6980A02677j09289L9149O1364j2798l2758m1927L2916L5431j1037q4091n1031
6969g1394N511J2519p2710P1106K7488J481j1173N606n3176M3410K1858L835O0638
$$ y = [-58268, -77000, -16604, 6914, 91784, 165089, 119926, 22362, -31862, -81274, -66226, 4111, -63514, -59460, 19297, -17946, -52517, -65442, -25717, 27879, 1644, -14767, -63963, -153988, -211768, -160780, -70862, -72939, -52787, 45985, 105762, 125614, 78194, 6346, 43012, 63393, 17968, -46374, -58053, -32590, 47232, 64406, 25970, 35498, -695, -38740, -20903, -49616, -98168, -30754, 54435, 16524, -17856, -5592, -45978, -62771, -31198, 33007, 35291, 56092, 77505, -46181, -74021, -75971, -72542, -42137, 61421, 133732, 87898, 72652, 71548, 99913, 102677, -6612, 32537, 93901, 81103, 48345, 6418, 39334, 74765, 63728, -20363, -71394, -65883, -53364, -126074, -54968, -27480, -25999, -37172, -31566, -84742, -41332, -19474, -15639, 44999]
6956D4999M2245r3224k3380n576N6326K6641l6323q9132J26312M1450r3753m4134
6944d7549K8972K9891l7086O861L5259L060J090K1496J2784p1816k7735m7953
6932i2726K4151L3804N2074M9421o984p2373j08823Q655P2693L4521j952m287
6920a1826l9397q8308J3101k7768J9599L0440m0500M5331l3328k6342K3079N8031
6908g7888M9359k6188l6601R8279N1325p1159o11M2893R6254O1391j27793q4594
6896b5333q9365J1970M8219Q981m336K8102m5988L1640K8000J458J5401j9654
6884a0905p2263l9030n653L5141K4453m461l4620o035Q8913K6534q3141m7475
6872a28542q871N6492k475K739n718k4028M8821k8759J3383K4486N8939P5419
$$ y = [44999, 87244, -5980, -29360, -34936, 21390, 48031, 11708, -77424, 48888, 90338, -3415, -47549, -18577, 11314, -25772, -18911, 16348, 19408, 20498, 41994, 54778, -17038, -44773, -92726, -68575, -34771, 17303, 66724, 59740, -12633, -121456, -112801, -40108, -5587, -7539, -11826, -51223, -139531, -126430, -154198, -134599, -104159, -144659, -99328, -132656, -158998, -135919, -77888, -28529, -54717, -91318, 6961, 58286, -12873, -13484, 29409, 125663, 187054, 59261, -25333, -114698, -102728, -54509, -45528, -49864, -21762, -67750, -36110, -8110, -6652, 8749, -10905, -83168, -122198, -127851, -92710, -68257, -72718, -107338, -113373, -24460, 2074, -81067, -128542, -137413, -80921, -83396, -80657, -86375, -110403, -61582, -90341, -76958, -52472, 6467, 81886]
6860H1886K7143j42120r9254J26171Q1108k3211m0382J4864m1101l1635L9615
6849f916J996j1583K2206m7155k2234M314m6368O0938m6137J9161O5364P1245
6837F4831M623o0147l0503L5959m8485o1566L5087O7489K8378L1913l821n7944
6825E814N0378l1076o9438l3687j1833N5328P6870j7452K93j08352J5511L2255
6813c5389M7725l1593p088M5995L3024j5121K9538O8313m209n6416m4921J4685
6801D4543p8768l8164K8930O9256O7827l8991j123R6034m170j84130j30632N4858
6789a14530N4718L3671O0431L0028j6269r956J6984k6148j25221j0529P2427L4221
6777a73l1382L7350Q0606l0356m0554j2220l0468j4158J8861l3618l2005J9970
$$ y = [81886, 109029, -33091, -132345, -6174, 74934, 51723, 11341, 26205, -14896, -46531, -6916, -4920, -16503, 5703, -41452, -63686, -59372, -105740, -44802, -90939, -71778, -6414, 64831, 69454, 9307, -21196, 14763, -33722, -95288, -60201, 7288, 35666, 67579, 63758, 5814, 56192, 25116, -44322, -78009, -89842, -34514, 42356, 24904, 25197, -83155, -67644, -35389, 12336, -19257, -26345, 19650, 52674, 37553, 67091, 135404, 131195, 74779, 29858, 44543, -34225, -72389, -43459, 25797, 93624, 54633, 53510, 149544, 145374, -38756, -169388, -114530, -59812, -26141, 34290, 64318, 48049, 38093, 55077, 28929, -96292, -106821, -34394, -173, -31555, 5795, 86401, 56045, 15491, 3271, -27197, -41355, -22494, -56112, -88117, -68147]
6765f8147K6147J3166m037N2897n5887r2229o5818J750K4491Q8352M1472p718
6753d5561R853M9125o8022P454Q0647M5866L6055P2783n9811j45329Q587j4299
6741b2652j3975j0195K6172r637O5543K7064l5357J8381L1656M7824L9750k6144
6729A38430n5065n5393k7430q9349m4919K0077P2455O4773J6797Q6122j4717q3049
6717B8732j1800l3914q1331l007R3563P4648L04j7658o1598p118Q8053J07897
6705A76771j8786p5562J0305j3266K2208K9600o6868m6211L5555m8117N4002L1168
6693I0799q386J4557k7457k1662j4660J0852m5470N5841M1275k7336l8976M867
6681C4244O132j6018k9713O7610j956k8150K1795k8209K1890N561L4265J3075
$$ y = [-68147, -42000, -28834, -32871, 20026, -35861, -128090, -193908, -192158, -167667, -79315, -37843, -45561, -35708, 13417, -54605, -47151, 33496, 79362, 115417, 188200, 128389, -16940, -8353, -22652, -36627, -46822, -20650, -30287, 35256, 62320, 26963, 45344, 77000, 124824, 164574, 138430, 83365, 27972, 542, -88807, -133726, -113649, -41194, 23579, 40376, 126498, 111781, 28732, 16932, -16982, -98313, -101320, -7757, 66891, 67195, 49537, -12061, -19179, 68874, 176771, 157985, 82423, 92728, 79462, 101670, 131270, 64402, 18191, 53746, 5629, 59631, 90799, 82413, 96970, 69513, 47851, 33191, 44043, -1427, 54414, 95689, 68353, 29377, 34244, 40376, 24358, -5355, 62255, 60299, 32149, 53944, 25735, 47625, 53186, 87451, 100526]
6669A00526O6101N6681k4261j03555l2738o6161k7625J4415M4552N9521k410q661
6657G6385n1007q6946P8486j997l5906R920N512L356J2076p36n2401M0014J00750
6644I7506K3031m103q3641j0209k1226Q8750O2647j12427K7926M6944J342r939
6632A06601N0819m5573J7746J7127N3229R0375K1954k3900l7669m9431m8709l9911
6620A12658n3158J4122J9549K6298j8192k2772K346K3301K7410J0434Q555M6339
6608A96890q1721k6172R585p9871l5429P2560K0056j1725J00518P7100J0989l4491
6596B18289l6193J6830K344n8255j6982R8539L1900j3506m5676k4186K4696j6331
6584A81469K8772j0249j2752P7636J6748r299L2465K1132k1018J5630J01124l1435
$$ y = [100526, 166627, 223308, 199047, 95492, 62754, -3407, -31032, -16617, 27935, 87456, 85046, 76385, 25378, -61568, 16918, 14921, -20985, -11065, -5553, -2197, 9879, 9143, -43258, -3244, 97506, 120537, 116434, 32793, 22584, 1358, 90108, 152755, 40328, 68254, 115198, 116540, 106601, 157420, 111847, 129593, 146720, 199949, 290324, 312278, 288378, 250709, 201278, 152569, 112658, 59500, 73622, 93171, 119469, 101277, 78505, 80851, 104152, 131562, 141996, 150551, 196890, 115169, 88997, 98582, 18711, -16718, 55842, 75898, 64173, 164691, 241791, 252780, 218289, 182096, 198926, 201270, 143015, 126033, 224572, 256472, 242966, 197290, 173104, 197800, 181469, 210241, 199992, 187240, 264876, 281624, 272325, 304790, 325922, 304904, 320534, 421658, 390223]
6572C90223K0405N4156K3428r604K3282L1668N790M6704N0149n5297j34009Q603
6560D55498L5773J37598P0176j2319K1458N3057K9915O0313J9794J7231l0229
6549H58265L2436M3067Q2962M7373M7314J20129J07547N1166Q0718R696m6982
6538A433691J33264J49281J48451J26787J20323O4701K2155P1129R7956O3227
6528B430965k2581n0171j72923j92377k07180j03952n8159o5418j01340j29136
6518A327728n1778q47n789j2155m1272l5936o8030p0819p167j7535r1223p9707
6506H45470m1273k7901O315K331m8642n3346k483K6832o8725j5971p2218o2010
6494D88379q670K3755J0578j7667k3726M907J1199m960j8864n7323l1457Q0167
$$ y = [390223, 410628, 464784, 488212, 478608, 501890, 533558, 539348, 586052, 636201, 580904, 446895, 455498, 491271, 628869, 699045, 686726, 708184, 761241, 791156, 851469, 871263, 888494, 858265, 890701, 933768, 1016730, 1064103, 1111417, 1231546, 1339093, 1390259, 1470977, 1480673, 1433691, 1566955, 1716236, 1864687, 1991474, 2111797, 2176498, 2198653, 2269782, 2367738, 2430965, 2408384, 2358213, 2185290, 1992913, 1785733, 1681781, 1623622, 1558204, 1456864, 1327728, 1275950, 1275103, 1269314, 1257159, 1215887, 1179951, 1111921, 1041102, 1033935, 1016400, 925177, 845470, 804197, 776296, 782611, 784942, 736300, 682954, 680471, 707303, 638578, 622607, 550389, 488379, 479709, 503464, 514042, 496375, 472649, 477556, 488755, 483795, 464931, 407608, 376151, 456318]
6482D56318p514m3684l7253m5544K815L0755j6056j4584k6936j3396o285j5284
6470B63352n948m7530j0273q008R541p462J2544m6495K5213Q230p1264o6540o2171
6457f811K588O9749K1360K0292J3317L7777J2608j8355j9822j8225J8392p4343
6445E8527L1602K9018l231P9331k0009q7754J9224M3624K8387p823r7655L512
6433G6753q834m5021K8290k9874N6105M2269J6527q6937J3363L8533O727k842
6421A05059l2642J6135l7843K9550J8535n4059k6613L1021j2294k2097N0262l4346
6409C0668L1716N535L7027n143J2109O6710P0473l0921j02249r3875r520M6563
6397E9093k769J749M6600l953P2359N3188q9460q5452L2742J4573K4279k5026
$$ y = [456318, 448804, 405120, 367867, 322323, 325138, 355893, 339837, 325253, 298317, 284921, 278636, 263352, 257404, 209874, 199601, 191593, 201134, 193672, 206216, 159721, 184934, 193164, 121900, 55360, -6811, -4223, 65526, 86886, 107178, 120495, 158272, 170880, 152525, 132703, 114478, 132870, 58527, 90129, 119147, 115916, 195247, 175238, 87484, 106708, 150332, 178719, 170896, 73241, 76753, 67919, 22898, 51188, 21314, 77419, 119688, 136215, 49278, 62641, 101174, 107901, 105059, 72417, 88552, 50709, 80259, 98794, 44735, 18122, 49143, 36849, 14752, 65014, 30668, 62384, 67919, 104946, 99803, 111912, 178622, 249095, 218174, 115925, 22050, 12530, 59093, 56324, 58073, 104673, 100720, 173079, 226267, 136807, 51355, 84097, 98670, 122949, 97923]
6385I7923p2712K1810m4045j9779L9995J4801q572M5066j9149m9206m7028o5929
6373a06825r1698J04603J14748J07182j7160j09144j3284R2375L4462j8272j11
6362I6876r7590Q265k0679M6260j4231o0244M7448M1787N5395R3057j07892o6539
6350B1913k5065K4821N0056p5102l6418P4688M9336m0806j10488K8933R5797n622
6338E2043p5736R0473Q8425k6373j19125r8773o5382j3477J34750J31152L8980
6327A36957r05k3675q9765j16981p0681M9870O6169r396r573o1830L265K9068
6315i7477O5984L4806j8831k0757M946o7552P1359N0164m2719j9002m9510j809
6303i0398L5614O2530o5348L42O8733O2432Q0786J1736j71389n4722O8034P7460
$$ y = [97923, 25211, 47021, 2976, -16803, 23192, 37993, 29421, 74487, 55338, 6132, -40896, -106825, -198523, -93920, 20828, 128010, 110850, 1706, -11578, 80797, 115259, 96987, 96876, -714, 7551, -13128, 33132, 18901, -41343, 6105, 47892, 103287, 196344, 88452, 21913, -3152, 21669, 71725, -3377, -39795, 34893, 84229, 43423, -67065, -38132, 57665, 52043, -23693, 66780, 155205, 128832, 9707, -89066, -154448, -167925, -33175, 97977, 136957, 136052, 112377, 22612, -94369, -165050, -115180, -49011, -58407, -67980, -129810, -126545, -97477, -31493, 3313, -15518, -36275, -31329, -98881, -27522, 22642, -20077, -39079, -88589, -90398, -54784, 7746, -57602, -57260, 11473, 73905, 154691, 166427, -4962, -59684, 8350, 85810]
6291H5810p5798l9082M0501K8592j1432J4635k442l2102j0513p4278j8298j3015
6279a07422N409M5465Q1804j5200K9865R3990k552o9m5678m1523p3415o831r9112
6266a35269O708R6324p210j530P3583P854j27727L5154O6810m1801j4231j8145
6254e9480p2292j594Q1360N7967J7250J112J8699l5350l5405o8368L528P0674
6242b1899L5263n753O3905j1370j02688o1870J0215l837K7627J7278N1641N2323
6230E0835l8335l7999P1798J21156n4829r8647O355O8993m1725p675N5838o8548
6218B7217m3764N9438Q6830m8959j05359k6689j4778L2251l1290Q575J8327K7614
6206a0587L3971J6079L7044m5769r7147q1882p525L6420K3772L5363N5307N6125
$$ y = [85810, 10012, -29070, 11431, 40023, 28591, 43226, 40784, 8682, -1831, -76109, -94407, -107422, -102013, -56548, 25256, 10056, 39921, 133911, 131359, 131290, 85612, 44089, -29326, -36157, -135269, -128561, -32237, -39447, -40977, 32606, 40460, -87267, -52113, 14697, -27104, -41335, -59480, -131772, -133366, -52006, 5961, 23211, 24323, 43022, 7672, -27733, -96101, -92573, -21899, 13364, 7611, 71516, 60146, -42542, -104412, -94197, -98034, -70407, -53129, -1488, 50835, 12500, -25499, 46299, 167455, 112626, 13979, 20334, 89327, 47602, 39927, 95765, 27217, -16547, 42891, 129721, 80762, -24597, -51286, -66064, -33813, -65103, -56528, -38201, -10587, 23384, 39463, 76507, 30738, -66409, -148291, -155816, -119396, -95624, -60261, -4954, 51171]
6194E1171Q742m5057o1057O2995P4510k4139m7979p8804o2301j6432J5489L5191
6182h7671n9022p2510J7353Q6248P9843N093l1919P0962O0784m8602k3415j4165
6170a7021n4604L9472M5217k9894o3112p3939J9224J4537K4611P5218Q2643l5433
6158B6919O920J0917l4097N957K8802r1874m8836j8856j1660Q0006Q0704l3958
6146I44q174j4100k92K0649N215N7294J03662k5132M7402o1323j47619L3769K4235
6133C6530n0493M9997N5116j9018k9666J1873O2818m5982n5545m4202J7360P4921
6121F3709J6931k0982J2954l314o0057M9147R5051n7468p3098j9092N9250j9221
6109D3810q0391L4445P8286L5708K802O291M2974J1281m8361q4384j10820O9412
$$ y = [51171, 59913, 14856, -46201, 16794, 91304, 67165, 19186, -59618, -121919, -138351, -122862, -87671, -146693, -219203, -201850, -115602, -35759, -30666, -62585, 8377, 69161, 20559, -2856, -17021, -71625, -32153, 13064, -16830, -79942, -153881, -134657, -120120, -95509, -20291, 62352, 26919, 33839, 44756, 10659, 16616, 45418, -46456, -95292, -114148, -125808, -45802, 34902, 944, -7230, -21330, -21622, -973, 4242, 61536, 165198, 140066, 187468, 126145, -21474, 12295, 36530, -13963, 36034, 91150, 72132, 42466, 54339, 117157, 71175, 15630, -28572, -11212, 63709, 80640, 59658, 72612, 69298, 9241, 58388, 153439, 95971, 22873, 3781, 63031, 43810, -36581, -2136, 76150, 111858, 114660, 120951, 163925, 175206, 126845, 42461, -68359, 1053]
6097A053K8120o2425P9687K9482o3276k1820k9011k1730k9567O2051R7030Q783
6085G8377m1900J4619J2333j9450O8735K0714p897q572l745r7581m1322P6157
6073E0468J7752R1525K4412r9433r2194m9656m1672N6669L5978k2432k498m4182
6061g5263k6090O573k2735o172J03300O0518j3346j4408l8018o9425N0504N1772
6049G210P8798k9873k0865n4236L4395k5870K1234k7344O112m774q1363J6985
6037g9591l8099P0997N5340N4256J7132n5997n6071O6181R286R489L5711l5037
6025E3597l6742m0695k5893k5359p5823j8498J02694P7010l8501l0737l7240n3519
6013a49706k1300M6137Q7729Q9723k8707j17012K9914N6392q1075p7596J21034
$$ y = [1053, 29173, -33252, 46435, 75917, 12641, -9179, -38190, -59920, -89487, -27436, 69594, 78377, 36477, 51096, 63429, 43979, 112714, 133428, 125531, 116959, 113214, 15633, -25689, 50468, 68220, 159745, 184157, 84724, -7470, -57126, -98798, -42129, -6151, -28583, -31081, -75263, -101353, -94780, -117515, -123687, -20387, 40131, 26785, 12377, -25641, -95066, -44562, 7210, 86008, 56135, 35270, -18966, 15429, -10441, 10793, -16551, -10439, -15213, -96576, -79591, -117690, -46693, 8647, 62903, 80035, 24038, -32033, 34148, 43434, 52923, 88634, 53597, 16855, -23840, -49733, -75092, -150915, -169413, -66719, 10291, -28210, -58947, -96187, -149706, -171006, -124869, -37140, 52583, 23876, -93136, -63222, -6830, -87905, -165501, -44467]
6002d4467n2166P3795K8718p177Q1022l9879j03902o9380m7324L9628J22693K9644
5990A1205L5684K3603r691N9590J2209n7813J3520Q6624j6990j23743L2939J6334
5978H3471p4978j04456k5136N0249M3897l77J4255K4573Q2581j00989r5179K995
5966i9094N7962L8735j1543o2663K6454J01621j0699m7748J8230N3873K3009m706
5954H3431n351k0119k6114n8407o2293K7798L1411M2100n84k1015M9956o167q7963
5941e3317j22219Q9192Q6618N2231k9620n9859l9540k3526L0457N4363k3082p8995
5929a17297R0494k0167j5045m852P8103J1227k1491M2240K0834r6301p9493L4075
5917g7673q297p0911l3662N2070O5149M9220L3011L8918k3192n3183m2330L1787
$$ y = [-44467, -96633, -22838, 5880, -1297, 79725, 39846, -64056, -133436, -180760, -141132, -18439, 11205, 46889, 70492, 60801, 120391, 132600, 74787, 88307, 174931, 157941, 34198, 67137, 83471, 8493, -95963, -121099, -70850, -26953, -27330, -13075, 11498, 94079, -6910, -102089, -99094, -41132, -2397, -13940, -76603, -50149, 51472, 40773, -6975, 11255, 65128, 88137, 83431, 78080, 57961, 31847, -26560, -88853, -61055, -29644, 12456, 11872, -9143, 40813, 34646, -53317, -175536, -86344, 274, 52505, 22885, -36974, -76514, -100040, -69583, -15220, -38302, -117297, -26803, -46970, -62015, -66867, 11236, 22463, 972, 43212, 64046, -32255, -111748, -77673, -85970, -156881, -190543, -138473, -73324, -24104, 8907, 47825, 24633, -28550, -70880, -39093]
5905c9093M0698K8543L573o513L9463J0704q22j3087j2677K1991l7829m229k4017
5892F705L591K278j5178O593O4287P1519k664m0079o5913l4594m1975k6364N1101
5879b0693N2389J3684N8631p933r7385j7930M6499k5315J5461K73L0177j9199
5867B8659k9237k5924l1735K1121J3022L2461J7529J02178n6044p2083L9154k8299
5855A0802o9977n8215R2862J433Q492J7767N0012M0047o3437o6325j6535P7756
5843B4682R218l0430n8650M3367J2864p5633m2949R9643k9392K5565R3662J5357
5831H7304O190r5286l2421N0650K089j6160N3J6249n0492j3823o249m3048p0826
5818a65770L0379J32642M0988j2591p7986j873R7203r0719m1206l595K8980K3723
$$ y = [-39093, 1605, 30148, 33721, 27208, 66671, 77375, 76553, 63466, 50789, 72780, 34951, 30722, 6705, 10296, 12574, -2604, 3989, 68276, 139795, 137131, 97052, 31139, -3455, -45430, -71794, -20693, 31696, 45380, 104011, 96078, -1307, -19237, 27262, 1947, 17408, 17681, 47858, 28659, -578, -26502, -58237, -37116, -24094, 8367, 25896, 128074, 72030, -53, 39101, 10802, -59175, -117390, -24528, -23095, -14603, 3164, 53176, 93223, 29786, -36539, -53074, 24682, 33900, 3470, -55180, -11813, 1051, -74582, -117531, -17888, -47280, -21715, 71947, 87304, 93494, -1792, -34213, 16437, 18526, 2366, 2419, 18668, -31824, -45647, -51896, -94944, -165770, -135391, -2749, 38239, 25648, -52338, -54211, 42992, -47727, -88933, -92528, -63548, -39825]
5806c9825O1679R397p2822j17873j1221j0073L1915N9542Q8555k8365k1976J0062
5794d1005m0257j8953O2098k6094q8679l208J1937J07235J8765k2943m5536O1996
5782b4644P1585k4302k4228m4399k3730L1221l5822n7008J6368K6102P5374N2244
5770C8761M7607m7610K3357m1127n8150m9913o9625J17574l929n4252M669P3851
5758a8787j6447n3715j9469J20046J5599o1057L5839P9536K804j18311L4494M957
5746E489R0274j673r335o9741k9326l5545m3771M0751K8514p6031l1746O6883
5734f5257N079Q694Q6932M0965j9559n9455p6046N8733K2169N4995q846M1788
5722I0192m1242k1026P8968J5708L325j2302p6931j01724K8233O6351q446p5003
$$ y = [-39825, 21854, 31251, -41571, -159444, -170665, -180738, -148823, -89281, -726, -29091, -51067, -41005, -81262, -100215, -38117, -64211, -152890, -156098, -144161, -36926, -18161, -41104, -86640, -24644, 46941, 22639, -1589, -45988, -69718, -38497, -74319, -131327, -114959, -88857, -13483, 38761, 86368, 38758, 62115, 20988, -37162, -87075, -156700, -39126, -43055, -97307, -92638, -18787, -35234, -88949, -108418, 11628, 27227, -33830, 2009, 81545, 84349, -33962, 532, 5489, 95763, 94090, 84755, 15014, -14312, -49857, -93628, -52877, -24363, -100394, -132140, -65257, -60178, -51484, 35448, 76413, 56854, -2601, -78647, -19914, 2255, 57250, 48404, 90192, 48950, 27924, 106892, 122600, 125925, 113623, 36692, -65032, -36799, 29552, 21106, -53897]
5710e3897n1013l2978P0453j0229K7548K1764j3333j8780l7026K1791J5822Q5315
5698B5437P9391Q843J5256r0143p6865L4090J9466r1962m7032Q394n7980j2951
5686a86056J02333L0439J371K5171l8516L578J7127J6100M4749p8254m1182j4308
5674a17448O6816K2136n0835O5682P295m5714q482j732j1817j8546k4869n816
5662a23330j6398N7302M2004m9619j9751O5782m636O0207O6733k1363j25675k9440
5650i8184k826J3044L831j0443Q6109n036j0541k1890n7389m4960Q2697R3713
5638B8125P3029K0973q5567j6249K7459J3784m9895q9662j0060n6887J6791J18378
5626i781N8187N3326l4476m0497m1537k3407L1639L5243k4825K3174p210k3097
$$ y = [-53897, -104910, -137888, -67435, -77664, -50116, -28352, -41685, -60465, -97491, -75700, -59878, 25437, 104828, 113671, 128927, 38784, -38081, -3991, 15475, -76487, -123519, -115125, -173105, -186056, -83723, -53284, -51913, -26742, -65258, -61680, -44553, -28453, 16296, -61958, -103140, -117448, -50632, -28496, -79331, -13649, -6354, -52068, -60550, -62282, -74099, -92645, -117514, -123330, -139728, -82426, -40422, -90041, -109792, -44010, -48646, 11561, 78294, 56931, -68744, -98184, -101010, -87966, -84135, -94578, -8469, -13505, -24046, -45936, -103325, -148285, -65588, 28125, 101154, 122127, 36560, 20311, 47770, 61554, 11659, -78003, -88063, -144950, -128159, -9781, 48406, 101732, 67256, 26759, -14778, -38185, -6546, 28697, 3872, 27046, 19836, -3261]
5614c261l2894R463k8814O8003M5415K0138l3677k706N0141Q575m7208q5206k2670
5601e4701J5193O3920R5322p6277q8161R678j2163p8279M7163K2506r738j1337
5589g6874J02538O2733J9485l1300o1747m9648P1950L0229m5010m9073n7167J2703
5577g1181J2244M618L1487M7106R6349m2967n6117n8807l0812R186J18746k7035
5565C2817n7916l2713J5716J04992J0470K8785L6251l2945l635j3877p2074n6914
5553d1043q576n6570l3294N3180O2278j0769K3606M4153m0086K2162L0532K7734
5541G3307n4821k6877m7738m182M0651P256k0495K532p913p002M702Q6715l966
5528D2169o8932J6794q0310M794R9353p3603m4477R405r170j2451P2671Q4930
$$ y = [-3261, -36155, -26692, -55506, 12497, 57912, 78050, 44373, 41667, 91808, 100383, 53175, -32031, -54701, -39508, 24412, 119734, 43457, -44704, -35026, -47189, -125468, -78305, -55799, -65537, -76874, 25664, 88397, 107882, 76582, 14835, -34813, 37137, 67366, 22356, -26717, -83884, -71181, -58937, -54319, -22832, 24274, 120623, 77656, 21539, -37268, -68080, -58894, 59852, 32817, -25099, -57812, -42096, 62896, 73366, 102151, 138402, 105457, 101822, 87945, 15871, -41043, -49619, -106189, -139483, -86303, -24025, -34794, -11188, 32965, -7121, 15041, 45573, 73307, 18486, -8391, -56129, -60311, -19660, -12404, -32899, -30367, -38280, -45282, -40580, 46135, 42169, -26763, -9969, -90279, -85485, 13868, -59735, -104212, -94807, -103977, -116428, -43757, 41173]
5516D1173l5340r0084n5964J4326N2816K8583m1463L4374K7758n2957m5732k1102
5504a43612K9521R3848l4180l9437p497N6238L2535L2407J3705O1759j5980o4641
5492A4666o0222l0488p9650j8284R6193J12621K4462j4537r3476l570J54481m4961
5480E7235j08187r793Q6365l3324k9676L1183M9491K6894l4583P448r5574l5051
5468h7572R9498P3647l3712n5320l5440p600l2539m6139K1599J15753Q1723K8415
5456A22313k9919L3161n0446n6067M2842r845Q468O1736m0081q686O1420j2922
5444A21974p1739n5647L8095j1095j1771O9086j7508m0068K0100q3478n5094P0377
5432b6768J990n5375j1213J8287N6934L0195K4061O1047L5104p9742m4846J7622
$$ y = [41173, 5833, -84251, -140215, -125889, -73073, -44490, -85953, -51579, -23821, -76778, -122510, -143612, -114091, -20243, -54423, -93860, -101357, -45119, -12584, 19823, 33528, 95287, 79307, 14666, -45556, -76044, -155694, -173978, -77785, 34836, 59298, 44761, -48715, -52285, 102196, 57235, -50952, -60745, 25620, -7704, -37380, -6197, 43294, 70188, 35605, 43053, -52521, -87572, 11926, 85573, 51861, -3459, -38899, -46499, -79038, -125177, -103578, 12175, 93898, 122313, 92394, 125555, 75109, 19042, 61884, 52039, 60507, 122243, 82162, 73476, 134896, 121974, 50235, -5412, 32683, 21588, 9817, 78903, 61395, 21327, 41427, -42051, -97145, -26768, -24778, -80153, -91366, -73079, -16145, 14050, 38111, 99158, 134262, 54520, 9674, 27296]
5420B7296l1205P902l3183j41929K37O5130J9001m2355j8518n3501N8023Q6855
5408e6247Q8776R27L9053N1794q0315J9165p7280m4512Q0033M7256j15369P240
5396c9479K1996p3698K5906P8611J5922j967m4788J7076N558j3476k1410p5373
5384a05122J5573L1642O4124j0396n7162k008K6525p8300J0519M1961L7993P6730
5372E2079k9932q36o8402m4034M8070J4687L4809L6086K6070L3029L2282j4428
5360A19480k6742m602j8428j1021m2611p8099R8448N1462J1516m6003o5312k7568
5348c9480K4431O4160j9264k4147l4451M1262K3210p7494P4226N4829Q095L9454
5336A34831Q946p6666n4254q7915Q520P6837m5297L8710N9034K1943l433m5460
$$ y = [27296, -3909, 3993, -29190, -171119, -170882, -105752, -86751, -129106, -147624, -201125, -143102, -56247, 32529, 33456, 72509, 124303, 43988, 63153, -14127, -58639, 21394, 68650, -46719, -39479, -17483, -91181, -65275, 13336, 29258, 27291, -17497, -421, 5137, -8339, -29749, -105122, -89549, -57907, 6217, -4179, -61341, -63349, -36824, -115124, -104605, -62644, -24651, 52079, 22147, 21311, -47091, -91125, -43055, -28368, 6441, 42527, 68597, 101626, 133908, 119480, 92738, 88136, 69708, 58687, 16076, -62023, 36425, 87887, 99403, 53400, -11912, -39480, -15049, 49111, 29847, 5700, -28751, 12511, 35721, -41773, 32453, 87282, 95377, 134831, 143777, 67111, 12857, -75058, -66538, 10299, -34998, 3712, 62746, 84689, 81256, 35796]
5324C5796M894M0741k1461m395q3102m209q9083P5929R4918k4265N334k4563R501
5311A6035j5466r7173l0886O6945m3124J1219P5699n1235j7341R5086J6856k9559
5299b944n8536k8680l3391P2260L7544o0324n2442L2719O0090K2447n1500l9691
5287a02448L166j2443p6173J15549Q3634M5254k7708p1186k5232J0044P3196n196
5275A0457M6929j9664j05573J2189J04069J1151n0596l5404O2899l4254N4227
5264E6430M791r47j04017m9990N3027m257n670p4714J4725N1380j1991K700k984
5251g1517K9423M8316O9828r798r7016l4659L0229j3o300n3357K2207r50O972
5238f6635M1428m7448p4825l7353L7465k7977R3077P9048M0029J2681p704P782
$$ y = [35796, 40690, 81431, 59970, 55575, -27527, -31736, -120819, -44890, 50028, 25763, 31097, 6534, 16035, 569, -96604, -127490, -60545, -103669, -92450, -16751, -67986, -85327, 9759, 26615, -2944, -61480, -90160, -123551, -51291, -13747, -74071, -126513, -93794, -33704, -11257, -62757, -102448, -99282, -111725, -187898, -72349, 11285, 56539, 28831, -42355, -67587, -57543, 15653, 10457, 57386, 37722, -67851, -55662, 48407, 59558, 8962, -26442, 36457, 2203, 56430, 61221, 60274, -43743, -93733, -40706, -44963, -50633, -125347, -110622, -59242, -71233, -68533, -71517, -42094, 6222, 76050, 66252, -30764, -65423, -35194, -35207, -41507, -94864, -72657, -73607, -66635, -25207, -72655, -147480, -184833, -147368, -175345, -82268, -3220, 36809, 49490, 41786, 49568]
5226D9568K5816J2646k1912k7236O1184j21824o9586L8723Q4905J05069J7429
5215A54782j04593r8932P5420N2211O6124j0188j09945l5077K5481m9673M248
5204c0142o5575K9908L4250N1574J3009j18754j20865k2108N5660P9101K7300
5193f6642k699n8206P025L0264P086N9927K3828O3313N7382q805j5296k6654j0376
5180F0147m909p2422O016M1186Q374q2996J7597N4352j060j20636n1237M012j4585
5167a56161l9863Q5376J51449P5286m3354l8439M3265m7906p0261l56K1978K7462
5155H476n1679L630R5675K6419j2778k9407k3676Q438n0035K847O2425l4043k8235
5142b1943k0236l7197r101O428L6110j8956L5420p8792o6227O703N6770M9695
$$ y = [49568, 75384, 88030, 66118, 38882, 100066, -21758, -91344, -52621, 32284, 137353, 154782, 50189, -48743, 26677, 78888, 145012, 134824, 24879, -10198, 15283, -34390, -30142, -95717, -65809, -31559, 20015, 33024, -85730, -206595, -228703, -173043, -93942, -66642, -69341, -127547, -120522, -90258, -83172, -23245, 583, 63896, 121278, 112473, 97177, 70523, 60147, 55238, -17184, -11168, 30018, 38392, -44604, -27007, 27345, 26285, -94351, -145588, -141576, -156161, -196024, -110648, 40801, 116087, 72733, 34294, 77559, 29653, -40608, -40964, -18986, 8476, -43203, -39573, 56102, 82521, 69743, 40336, 16660, 25098, -24937, -22090, 40335, 6292, -21943, -42179, -79376, -88477, -82049, -45939, -64895, -29475, -108267, -174494, -167791, -111021, -61326]
5130f1326O923o729L7598J8731P7276J7438J2687k3289n3839M8709N346k9486
5118E0039q0290m2347N6812J6562j424L3026p9344n7581J09482L3098l2778K5550
5106C0805K5562P1966J3657q3887o2989n6167m238Q1180O8356n352K135Q9295
5094A70323j3915o2357J0090q6554n3569O5385N9978j5723k6537m3150k4043J06142
5082H6070J9555p4670k4182j0134p417l3142N9737M3043O1486r986o5346q762
5070C6252M4685J002j31174m7426Q8013k6484J6359m5675L4969N0541O4321j0663
5058G4720p9188j15340K5045J16098L5726o1830R691M7297J6744J2243m400J6615
5046I3421j8273l38n6637K3507M3490o9644k3610l7092m8360L0227M1972Q8560
$$ y = [-61326, -54403, -61132, -23534, -4803, 72473, 89911, 102598, 79309, 25470, 74179, 79525, 50039, -30251, -72598, -15786, 776, -648, 32378, -46966, -104547, 4935, 38033, 5255, 30805, 56367, 128333, 141990, 58103, -4886, -61053, -65291, 15889, 84245, 78893, 81028, 170323, 156408, 94051, 104141, 17587, -35982, 29403, 89381, 73658, 47121, 3971, -20072, 86070, 105625, 30955, 6773, -3361, -10778, -43920, 15817, 58860, 120346, 110360, 45014, 36252, 80937, 81939, -49235, -96661, -8648, -35132, -18773, -64448, -29479, 21062, 85383, 74720, -4468, -119808, -94763, 21335, 57061, -4769, 4922, 52219, 68963, 81206, 76806, 93421, 75148, 74810, 18173, 41680, 85170, 15526, -8084, -45176, -93536, -63309, -21337, 67223]
5034F7223K969j27031l7947J6148J8578m6897M97K9921j9630l832L370n7462K6258
5021a27835R7739N6279L3077n426k4202o821M5109J2908n4873O210p2511k5870
5009f6216N0678K2153n9109r9102j177N0756O221J6139J4055J5753n3587L7098
4997f6338K9696q249l1631M9668K4441K1308L1976K3578q5122m7814M3215N113
4985a0159p352L7668o8430k7901M5716Q4937m8776J9562J8719n5872M7104j5525
4973A9691J1463K4050N8029P1139j0097n0152j3654J8538k3815j00511p2422J8203
4961d9538O6126k4752M5617J6292k1812k8834o0368o6362O2609N9215l6341j0511
4949d8659J8477M1240n7603M0866Q6945M5357p0697m3533L8994o3401M26n2571
$$ y = [67223, 70192, -56839, -94786, -78638, -60060, -106957, -106460, -76539, -96169, -100001, -96631, -154093, -127835, -30096, 26183, 59260, 53834, 29632, 22811, 67920, 80828, 25955, 32165, -40346, -66216, -15538, 6615, -52494, -151596, -152773, -102017, -95796, -79657, -65602, -49849, -103436, -66338, -36642, -44891, -76522, -26854, -2413, 18895, 50871, 74449, -10673, -58487, -15272, -10159, -17511, 20157, -48273, -76174, -30458, 54479, 5703, 25265, 43984, -11888, 35216, 19691, 31154, 55204, 113233, 184372, 174275, 124123, 110469, 129007, 105192, 4681, -67741, -49538, 16588, -8164, 37453, 53745, 31933, 3099, -57269, -123631, -61022, -1807, -38148, -48659, -30182, 11058, -46545, -5679, 81266, 126623, 55926, 12393, 51387, -12014, -11588, -64159]
4937f4159O8576l3152n8376q3987k1950K361J38869j1908K3664J7015M461l054
4925b1640j9314J0418K2492N0708L7336k7952j33719l6877K8407P923M398L9503
4913c8317k524L4308M9221K3514m7624k7286k9758L0811l3924n206J15772J475
4901G0462k0364n7260M6862P6140L1499j06590p6438j4481K8604K4613M0596q3565
4889c9922k9847J7845J09139J4606J9229j4676J4080L4329N7409l8204l4009m4654
4877F5325l3406Q1103O098k7643K2328o6967k9237N069N5219m1366q5093j8821
4865f7391Q9161L0406k8636k0031L822m9876L9613M7960o1362k1138J0577J1981
4853a4914j2728k1102K6589q5188O0804R5349Q0531j5047q4448k3301p8777r1783
$$ y = [-64159, 4417, -28735, -87111, -171098, -193048, -190687, -51818, -63726, -40062, -23047, -18586, -21640, -40954, -30536, -8044, 42664, 80000, 52048, -81671, -118548, -90141, -82218, -77820, -38317, -40841, -6533, 42688, 66202, 18578, -8708, -38466, -7655, -41579, -46785, 68987, 70462, 50098, -7162, 39700, 115840, 147339, 40749, -35689, -50170, -21566, 3047, 43643, -39922, -69769, -51924, 57215, 71821, 91050, 76374, 90454, 124783, 182192, 143988, 109979, 65325, 31919, 113022, 119120, 91477, 113805, 46838, 17601, 22670, 77889, 36523, -48570, -67391, 21770, 52176, 23540, 3509, 7331, -42545, -2932, 45028, -16334, -37472, -26895, -14914, -27642, -48744, -22155, -107343, -46539, 48810, 129341, 114294, 29846, 6545, -72232, -164015]
4841a64015k9636R9662M5113L795K7283j2568J8410j1215j6733O1596J01703k7687
4829I5708K1980l6296k2171N2719J3502N222l7948j4047M9203O5741j3272r9511
4817H0830j7393R61J274N7396J7391m7700n1204j19348M3458R969L3414N2037
4805F1085n2643n3256J6060N9839L343m7593N3975M2847O4483k1371j44369k1786
4793c9386P5000K8149l7257R692j688o6821m1287k7529K6745L9166l4849o564
4781g6629J27325P9572m7752M4434n1612j07484l6116k5869m1619L3758J02046
4770E4J0569K6424M2769M687j1687o3752l6227l0826N080m925k2784O8560J0709
4757a349r780m2461n4565O7374R0161Q6161K3634j38418j6765Q6872m1704q5958
$$ y = [-164015, -193651, -93989, -48876, -45081, -17798, -30366, -11956, -23171, -39904, 21692, 123395, 95708, 117688, 81392, 59221, 111940, 125442, 130664, 92716, 78669, 127872, 193613, 180341, 80830, 63437, 64398, 65672, 123068, 140459, 92759, 41555, -77793, -34335, -24366, 9048, 61085, 8442, -44814, -28754, 31085, 34428, -13165, 40810, 83657, 148140, 126769, -17600, -39386, 35614, 63763, 26506, 36198, 34510, -32311, -73598, -101127, -74382, -35216, -70065, -76629, 50696, 130268, 82516, 126950, 75338, -32146, -68262, -94131, -135750, -101992, 54, 10623, 37047, 79816, 84503, 72816, 9064, -27163, -57989, -52909, -57834, -80618, -12058, -1349, -11129, -53590, -108155, -40781, 49380, 135541, 159175, 20757, 3992, 90864, 49160, -36798]
4745c6798P2253R0558p002K1072m4406p509j31776r4232O861N4376O2078L8756
4733B4231R774j3308j3179M0950l240l631m2471J4828J7709N3499j1587k3121
4721E0454l9698k1860r0486j5388J18338l0474k3996n2196L2014O1847N1130j4171
4709B5514L5920o4165l249L5639J0539M8283R448m7481m4948j1765K6011J8204
4697C7950j7865M5546K233P4440J2367p778k5688j29284k5981K9490m6879o3833
4685a15282J22353Q2299j08189l9836K0096N1436o8087j552L9722J6979k2711
4674b2772j6641k2327r0444O3102P224L573L3055J33259m9469r0604q486N9501
4662a029l8987o3321o3137J383j3065L6874K2227P5595J1956P8259O0919n3094
$$ y = [-36798, 35455, 126013, 119011, 140083, 95677, 88168, -43608, -137840, -130979, -76603, -14525, 24231, 34005, 20697, 7518, 48468, 45228, 41597, -874, 13954, 31663, 85162, 73575, 50454, 10756, -11104, -101590, -116978, 1360, -29114, -53110, -105306, -73292, -11445, 39685, 25514, 61434, -2731, -5980, 29659, 40198, 88481, 97929, 50448, 5500, -6265, 19746, 37950, 20085, 65631, 67864, 142304, 154671, 146893, 121205, -8079, -34060, -4570, -51449, -115282, 7071, 89370, -18819, -58655, -38559, 12877, -55210, -56762, -17040, -61, -22772, -39413, -61740, -152184, -89082, -81858, -78285, -45230, 88029, 38560, -52044, -60530, -1029, -40016, -103337, -166474, -165091, -178156, -141282, -119055, -43460, -31504, 46755, 107674, 54580]
4650E4580r470L603j6836j2614m7358J4386Q757P7553p268L5378p281O9776l7063
4637A26143M4091o3488j11216p7930J26882N1053r7869m3453O3228K9384K046
4626D8871r3665j2214P1977M2858j06940j26328n739M5869J05162J7280J17349
4615A04480j3246o1744p1669l5986q557k302P3953R1012K2147k0925p673n1757
4603A7733l9630K8135R051j4743k9739Q9123R757m3863n6845n5336m7852J2183
4591a22026N9454j9506q26N0407K1118M3785N5212p20k1440m4452k4687P2501
4579F8820j0254l1126k2255L3978l3130m5633o4176Q1508L2909q7621N0046N7421
4567C0487m8956k8915L3005J02063J2862r558K1243K707m4189n7214J6647j3477
$$ y = [54580, 45110, 48713, 31877, 19263, -28095, -13709, -4952, 72601, 65333, 100711, 93430, 163206, 126143, 170234, 106746, -4470, -82400, 44482, 95535, -2334, -45787, 17441, 46825, 48871, -44794, -57008, 14969, 57827, -49113, -175441, -181180, -135311, -30149, -12869, 104480, 91234, 29490, -42179, -78165, -86722, -89024, -15071, 75941, 98088, 77163, 69490, 17733, -21897, 6238, 15289, 546, -29193, 59930, 69687, 25824, -31021, -86357, -134209, -122026, -62572, -82078, -82904, -32497, -11379, 32406, 87618, 86898, 65458, 21006, -3681, 68820, 58566, 27440, 5185, 39163, 6033, -39600, -103776, -22268, 10641, -76980, -26934, 30487, -18469, -47384, -14379, 87684, 100546, 90988, 112231, 114938, 70749, 13535, 30182, 16705]
$$ [...]
##END NTUPLES=NMR SPECTRUM
##END=
