##TITLE=Analysis number 322523
Compound Code tl 00910
Project Code adrs
Chemist Name flurochem
##JCAMPDX= 6.0         $$ Bruker NMR JCAMP-DX V2.0
##DATA TYPE= NMR SPECTRUM
##DATA CLASS= NTUPLES
##ORIGIN= Bruker BioSpin GmbH
##OWNER= nmr
$$ XWIN-NMR		Version 3.5
$$ Fri Sep 29 09:04:24 2006 GMT Daylight Time (UT+1h)  MAYBRIDGE\nmr@NMR_250MHZ
##.OBSERVE FREQUENCY= 250.131544655141
##.OBSERVE NUCLEUS= ^1H
##.ACQUISITION MODE= SIMULTANEOUS (DQD)
##.ACQUISITION SCHEME= undefined
##.AVERAGES= 16
##.DIGITISER RES= 18
##SPECTROMETER/DATA SYSTEM= dpx250
##.PULSE SEQUENCE= zg30
##.SOLVENT NAME= DMSO
##.SHIFT REFERENCE= (INTERNAL, DMSO, 0, 16.522)
##AUDIT TRAIL= $$ (NUMBER, WHEN, WHO, WHERE, WHAT)
$$ ##TITLE= Audit trail, XWIN-NMR		Version 3.5
$$ ##JCAMPDX= 5.01
$$ ##ORIGIN= Bruker BioSpin GmbH
$$ ##OWNER= nmr
$$ C:\u/data/dgb/nmr/ADRS/1680/pdata/1/auditp.txt
$$ ##AUDIT TRAIL=  $$ (NUMBER, WHEN, WHO, WHERE, WHAT)
(   1,<2006-09-29 09:02:41.37 +100>,<MAYBRIDGE\nmr>,<NMR_250MHZ>,
      <created by zg, POWCHK disabled, PULCHK disabled
       configuration hash MD5:
       E2 DF 36 D8 04 B2 41 60 5A D7 A3 38 5A 4B D0 FE
       data hash MD5: 64K
       63 34 15 D8 05 61 D6 F6 ED E9 76 4F AA 0E 63 3F>)
(   2,<2006-09-29 09:02:59.99 +100>,<MAYBRIDGE\nmr>,<NMR_250MHZ>,
      <Start of raw data processing
       ef LB = 0.3 FT_mod = 6 PKNL = 1 SI = 32K 
       data hash MD5: 32K
       14 81 87 53 FC 44 B4 50 0D D6 96 97 36 EB 8D C5>)
(   3,<2006-09-29 09:03:02.51 +100>,<MAYBRIDGE\nmr>,<NMR_250MHZ>,
      <apk 
       data hash MD5: 32K
       42 A4 AE 88 97 7D B9 6A 6E 06 26 C3 C2 4B 88 67>)
(   4,<2006-09-29 09:03:06.88 +100>,<MAYBRIDGE\nmr>,<NMR_250MHZ>,
      <abs ABSG = 5 
       data hash MD5: 32K
       97 2D 3E A6 2D B5 FE 82 72 E5 50 2E 2A 97 58 FC>)
$$ ##END=
$$ 
$$ hash MD5
$$ CC F8 E9 58 3A FD E8 99 69 35 D0 01 81 EC E0 1A
##$RELAX= 
##$RELAX= 
##$RELAX= 
##$RELAX= 
##$RELAX= 
##$RELAX= 
##$RELAX= 
$$ Bruker specific parameters
$$ --------------------------
##$DU= <C:\u>
##$EXPNO= 1680
##$NAME= <ADRS>
##$PROCNO= 1
##$TYPE= <nmr>
##$USER= <dgb>
##$AMP= (0..31)
100 100 100 100 100 100 100 100 100 100 100 100 100 100 100 100 100 100 
100 100 100 100 100 100 100 100 100 100 100 100 100 100 
##$AQSEQ= 0
##$AQ_mod= 3
##$AUNM= <au_zg>
##$AUTOPOS= <2 >
##$BF1= 250.13
##$BF2= 250.13
##$BF3= 250.13
##$BF4= 250.13
##$BF5= 500.13
##$BF6= 500.13
##$BF7= 500.13
##$BF8= 500.13
##$BYTORDA= 1
##$CFDGTYP= 0
##$CFRGTYP= 5
##$CHEMSTR= <none>
##$CNST= (0..31)
1 1 145 1 1 1 1 1 1 1 1 1 1 1 1 1 1 1 1 1 1 1 1 1 1 1 1 1 1 1 1 1 
##$CPDPRG= <>
##$CPDPRG1= <>
##$CPDPRG2= <>
##$CPDPRG3= <>
##$CPDPRG4= <mlev>
##$CPDPRG5= <mlev>
##$CPDPRG6= <mlev>
##$CPDPRG7= <mlev>
##$CPDPRG8= <mlev>
##$CPDPRGB= <>
##$CPDPRGT= <>
##$D= (0..31)
0 1 0 0 0 0 0 0 0 0.06 0 0 0 0 0 0 0.0002 0 0 0 0 0 0 0 0 0 0 0 0 0 0 
0 
##$DATE= 1159516959
##$DBL= (0..7)
120 120 120 120 120 120 120 120 
##$DBP= (0..7)
150 150 150 150 150 150 150 150 
##$DBP07= 0
##$DBPNAM0= <>
##$DBPNAM1= <>
##$DBPNAM2= <>
$$ [...]
##$SUBNAM7= <"">
##$SUBNAM8= <"">
##$SUBNAM9= <"">
##$SW= 20.6930455092707
##$SWIBOX= (0..15)
0 0 3 0 0 0 0 0 0 0 0 0 0 0 0 0 
##$SW_h= 5175.983436853
##$TD= 65536
##$TD0= 1
##$TE= 295.16
##$TE2= 300
##$TE3= 300
##$TEG= 300
##$TL= (0..7)
0 120 120 120 120 120 120 120 
##$TP= (0..7)
150 150 150 150 150 150 150 150 
##$TP07= 0
##$TPNAME0= <>
##$TPNAME1= <>
##$TPNAME2= <>
##$TPNAME3= <>
##$TPNAME4= <>
##$TPNAME5= <>
##$TPNAME6= <>
##$TPNAME7= <>
##$TPOAL= (0..7)
0.5 0.5 0.5 0.5 0.5 0.5 0.5 0.5 
##$TPOFFS= (0..7)
0 0 0 0 0 0 0 0 
##$TUNHIN= 0
##$TUNHOUT= 0
##$TUNXOUT= 0
##$USERA1= <user>
##$USERA2= <user>
##$USERA3= <user>
##$USERA4= <user>
##$USERA5= <user>
##$V9= 5
##$VALIST= <valist>
##$VCLIST= <CCCCCCCCCCCCCCC>
##$VD= 0
##$VDLIST= <DDDDDDDDDDDDDDD>
##$VPLIST= <PPPPPPPPPPPPPPP>
##$VTLIST= <TTTTTTTTTTTTTTT>
##$WBST= 1024
##$WBSW= 4
##$XGAIN= (0..3)
0 0 0 0 
##$XL= 0
##$YL= 0
##$YMAX_a= 330818
##$YMIN_a= -351270
##$ZGOPTNS= <>
##$ZL1= 120
##$ZL2= 120
##$ZL3= 120
##$ZL4= 120
##$ABSF1= 16.522
##$ABSF2= -4.171173
##$ABSG= 5
##$ABSL= 3
##$ALPHA= 0
##$AQORDER= 0
##$ASSFAC= 0
##$ASSFACI= 0
##$ASSFACX= 0
##$ASSWID= 0
##$AUNMP= <proc_1d>
##$AZFE= 0.1
##$AZFW= 0.1
##$BCFW= 0
##$BC_mod= 0
##$BYTORDP= 0
##$COROFFS= 0
##$CY= 12.5
##$DATMOD= 1
##$DC= 0
##$DFILT= <>
##$DTYPP= 0
##$F1P= 14.0000005364418
##$F2P= -0.99999901652339
##$FCOR= 0.5
##$FTSIZE= 32768
##$FT_mod= 6
##$GAMMA= 0
##$GB= 0
##$INTBC= 1
##$INTSCL= 1
##$ISEN= 128
##$LB= 0.3
##$LEV0= 0
##$LPBIN= 0
##$MAXI= 10000
##$MC2= 0
##$MEAN= 0
##$ME_mod= 0
##$MI= 0
##$NCOEF= 0
##$NC_proc= -4
##$NLEV= 6
##$NOISF1= 0
##$NOISF2= 0
##$NSP= 0
##$NTH_PI= 0
##$NZP= 0
##$OFFSET= 16.522
##$PC= 1
##$PHC0= 143.9379
##$PHC1= 10.42042
##$PH_mod= 1
##$PKNL= yes
##$PPARMOD= 0
##$PSCAL= 4
##$PSIGN= 0
##$REVERSE= no
##$SF= 250.13
##$SI= 32768
##$SIGF1= 0
##$SIGF2= 0
##$SINO= 400
##$SIOLD= 32768
##$SREGLST= <1H.DMSO>
##$SSB= 0
##$STSI= 32768
##$STSR= 0
##$SW_p= 5175.98343685301
##$SYMM= 0
##$S_DEV= 0
##$TDeff= 65536
##$TDoff= 0
##$TI= <Analysis number 999999
Compound Code 99
Book Reference 9
Project Code 9>
##$TILT= no
##$TM1= 0
##$TM2= 0
##$TOPLEV= 0
##$USERP1= <user>
##$USERP2= <user>
##$USERP3= <user>
##$USERP4= <user>
##$USERP5= <user>
##$WDW= 1
##$XDIM= 32768
##$YMAX_p= 471776531
##$YMIN_p= -386879
$$ End of Bruker specific parameters
$$ ---------------------------------
##NTUPLES= NMR SPECTRUM
##VAR_NAME=  FREQUENCY,     SPECTRUM/REAL,   SPECTRUM/IMAG
##SYMBOL=    X,             R,               I
##VAR_TYPE=  INDEPENDENT,   DEPENDENT,       DEPENDENT
##VAR_FORM=  AFFN,          ASDF,            ASDF
##VAR_DIM=   32768,         32768,           32768
##UNITS=     HZ,            ARBITRARY UNITS, ARBITRARY UNITS
##FACTOR=    0.157963299565203, 1,           1
##FIRST=     4132.6476996994, 0,             0
##LAST=      -1043.33573715361, 0,           0
##MIN=       -1043.33573715361, -386879,     0
##MAX=       4132.6476996994, 471776531,     0
$$ Real data points
##PAGE= N=1
##DATA TABLE= (X++(R..R)), XYDATA
$$ [...]
20148 -47637 596 -36415 28455 -1896 -72361 -64893 -68388 -202809 -194403 -44890 -7506 71827
20136 71827 -36242 -87775 -38742 -103851 -130130 -139566 -148214 -137713 -158322 -154059 -111717 -69628
20124 -69628 -168898 -157701 -168756 -105614 -70336 -62199 -52073 -32387 92577 154178 59951 -6914
20112 -6914 -39499 -146194 -186890 -136674 -111246 -43239 -128646 -176913 -133806 -194068 -217495 -128004
20100 -128004 -44871 -50392 -52683 -110245 -68304 -61065 -88180 -102264 -37255 87802 89884 53468
20088 53468 -77605 -125667 -85316 -14594 104951 172854 127099 73693 94263 84827 95549
20077 95549 25410 -37200 37664 127722 113024 149264 141547 118428 16757 -42657 -26505 -52213
20065 -52213 -112624 -39827 1237 -62717 -29652 33273 21141 96512 -7694 -24657 90352
20054 90352 66992 86512 41602 9184 -86126 -56744 -40114 12751 186684 146703 -17304
20043 -17304 -27019 59898 28778 15946 37158 70099 20481 -28556 30169 -31471 -59450 -57377
20031 -57377 -86901 -16653 14479 -108418 -96223 25055 73579 44925 -22237 28472 -87735
20020 -87735 -152506 -78428 -80695 -86602 -58369 -80390 38952 176442 38343 -63696 -136148
20009 -136148 -165320 -115622 -61502 13811 11270 -22468 7870 76056 170843 153862 72730 -31885
19997 -31885 14717 39893 20215 -23375 -27702 -31147 -20373 -10182 27459 29018 25170 -33513
19985 -33513 -85529 -23672 -42224 -225136 -234516 -189103 -136196 -62930 -83887 -11759 20772 23147
19973 23147 14517 -5949 9967 -24801 -62337 27653 11989 -8346 -37269 -90979 -32024 20372
19961 20372 65815 52131 -33713 -81578 -45970 32259 101053 107866 101622 123619 201602 123160
19949 123160 -11084 19062 58981 80614 118869 38747 8296 37010 -60317 -144846 -137817
19938 -137817 -105721 -81960 -87914 -170305 -104636 -27281 -20070 -6194 -48296 13735 62114 46844
19926 46844 62922 112688 86966 172553 255821 149048 -14283 -26361 25360 -26239 -44688
19915 -44688 -15064 -3836 -24062 -66910 -85722 -94825 -144209 -107471 -7512 -50576 -98699 -127118
19903 -127118 -112264 -33000 44933 7123 -57199 8906 17781 21342 38062 68526 -7623 8206
19891 8206 7833 18482 -51546 -76216 -21812 56788 100112 35684 24 -3306 77136 46285
19879 46285 -14238 -58705 2443 -62911 -73209 -99808 -70674 -25837 -64460 -164315 -187597 -154549
19867 -154549 -125504 -98983 -62945 -144239 -95680 -1320 -35284 -110143 -210896 -205511 -116869
19856 -116869 -157767 -87620 10690 36669 48452 107166 54319 -107472 -171310 -24259 -16221
19845 -16221 -25644 64788 116638 -4177 -67601 -23980 22436 59824 -21055 -59609 -93581 -175925
19833 -175925 -219290 -216022 -188472 -166690 -184321 -189419 -146525 -150804 -211532 -165242 -188354 -59025
19821 -59025 -81594 -51603 -26594 -49116 -40247 19228 33057 32001 4205 -49701 -129 10290
19809 10290 -134429 -151658 -13748 16563 -17678 -3057 -30852 1102 90830 98630 47167
19798 47167 8675 -39536 -41759 42081 44238 -51680 -105452 -19519 35892 107853 95225 88907
19786 88907 95549 74993 173648 186846 167085 130953 -5994 -95642 -86993 -146639 -168045 -47978
19774 -47978 55040 47883 3766 -17040 -72728 -83813 -56577 -53485 -20342 -14174 -69888 -113755
19762 -113755 -183532 -132571 -72997 -115962 -118584 -37008 109354 143400 180304 130531 8718
19751 8718 -65015 32892 110853 61020 44860 14000 49477 23975 -17635 -105415 -246699 -281601
19739 -281601 -222031 -58046 -39007 -22515 29791 -44403 -147730 -214294 -128855 -67887 -59849
19728 -59849 -65904 -67929 83756 128502 39959 -49153 -114318 -57720 68377 92619 97259 74499
19716 74499 87111 67185 -62313 -74777 -78611 -92417 -64783 -22663 50611 -62842 -101895
19705 -101895 -105373 -90269 -122707 -69116 -25519 -138939 -150238 -62905 -15385 33739 44591
19694 44591 66452 12904 9366 12122 -1834 32958 -40753 -99133 -83205 -44920 -49373 -13445
19682 -13445 28915 37373 94841 168293 150414 128124 111244 64634 27235 -56012 -154906 -40148
19670 -40148 1538 -54358 -147976 -100304 6963 -1577 -70692 -109886 -109490 -62076 -76279 -17494
19658 -17494 2088 -19857 18490 30286 5530 5789 12485 90179 131303 125505 132679 192368 152049
19645 152049 121563 104229 91184 36994 116191 115587 1053 -70062 -103301 -112275 -104694 -60780
19633 -60780 -41916 -18634 308 -17638 15474 130310 144654 25892 -33723 -20245 104554
19622 104554 217199 210983 173744 151415 85545 76155 95856 80322 -59977 -57615 79806
19611 79806 65764 -33354 -76683 -42475 -5008 -43149 -82922 -48378 -43132 -90678 -123309 -78548
19599 -78548 -97985 -62163 34346 -15911 -105149 -29938 111855 93600 13334 42589 109840
19588 109840 175643 172392 121058 113068 78784 25512 -2774 36497 130448 245413 242576 219094
19576 219094 224113 342130 423183 367509 305122 237713 207498 156963 193334 144591 207001
19565 207001 287191 263471 255917 226352 217203 130516 124698 142329 184826 184038 177193 137216 68652
19552 68652 -8261 9748 80752 111462 81482 31937 -36901 4673 81120 16198 -139698
19541 -139698 -67730 23419 -29395 -8699 -3732 92136 59055 106266 105605 78069 49947 -1702
19529 -1702 -1383 40658 95960 176506 289280 427679 475545 457858 448252 401017 439109 592692
19517 592692 547961 305460 211555 176805 188185 181917 50789 33853 9743 26131 8939
19506 8939 29262 -13715 -15261 93897 117265 158469 167321 126772 119094 61509 60230 102185
19494 102185 67142 51839 65536 90591 -46707 -27004 26846 128184 241153 174140 130178
19483 130178 139487 93649 14685 71154 86318 86314 59830 72298 41730 -57766 -85252 48285
19471 48285 115645 182804 160283 106038 49545 94498 200434 179510 133338 210193 164578
19460 164578 169259 184387 143461 126007 27390 -45493 -26744 24247 53252 -14583 -31382 -22383
19448 -22383 -19525 -43633 -64281 -62820 -54750 37924 7885 -31078 -51931 -122893 -99847 -73843
19436 -73843 11227 98740 113605 161719 193226 134850 18487 -8122 33563 64149 111827
19425 111827 126206 421 10908 11776 -100783 -47755 43099 11180 -6437 -107421 -114338
19414 -114338 -116113 -63436 -40986 31962 132561 121311 88863 -6743 -107847 -117514 -182890
19403 -182890 -115843 -24898 29554 144306 246168 206749 109299 -64729 -70658 -81865 -101292
19392 -101292 -120849 -152407 -83950 -57719 -2456 23431 -49803 -53710 -90237 -114343 -134490 -54929
19380 -54929 -31736 -51114 -59845 -104101 -73669 6056 58710 -23090 -128941 -185874 -253037 -323878
19368 -323878 -247802 -65301 4967 -39914 8633 80528 -6696 -41671 -85121 -90733 -103519
19357 -103519 -48128 -49977 -35266 -45879 -116020 10917 30901 -13582 -59735 -30302 44739
19346 44739 27294 6920 82678 77912 119023 164725 204630 128180 131629 161147 138091 104046
19334 104046 19470 11755 115833 74387 -22465 -63294 -16696 -28370 -64561 -1861 -24512
19323 -24512 -57355 -67205 -113479 -54343 -107368 -64160 -13257 72698 107668 -56417 -137517 -43171
19311 -43171 -9 -106789 -66947 127484 208874 86336 7448 6685 44171 21981 6026
19300 6026 -42872 -47205 -79172 -56249 27287 -21630 -180498 -140805 51824 45933 38463 60059
19288 60059 56571 28923 -4392 113 -63710 -88987 -69379 -23742 25949 -123531 -30563 104378
19276 104378 110710 107755 129070 131184 88631 74832 22351 69795 134252 195553 176403 108468
19264 108468 108609 61384 75506 91264 153351 172788 240566 293127 257816 177155 203287 212422
19252 212422 184209 172237 251529 227417 91679 69051 118455 150049 200494 229643 256992
19241 256992 159658 117884 128665 234998 196715 175074 19030 -50410 -35703 116689 227981
19230 227981 233773 257078 206969 155777 95728 87125 55843 27417 124432 124219 133203 192640
19218 192640 237340 222054 138229 181960 232820 247003 169339 72926 -46489 -17337 98971
19207 98971 126262 124155 116008 96510 105289 125932 74198 159363 266331 244927 137678 102608
19195 102608 117262 171096 180445 200324 253419 261315 174916 130880 131967 148495 114989 106616
19183 106616 130795 104397 88516 236410 286447 247635 270598 215625 148826 257467 222113
19172 222113 196382 125403 84099 16639 50379 135562 158159 182322 158106 98908 -43630
19161 -43630 -129810 -29151 64343 138496 133990 123050 156159 243943 293143 166029 69140
19150 69140 54914 99996 148559 163067 69121 53153 56421 168050 263912 293238 273726 193517
19138 193517 113979 188209 354399 369478 276013 258920 252709 249290 254746 280437 347355 341637
19126 341637 282128 303416 303029 255868 259697 318355 369316 328242 391286 412651 321945 318009
19114 318009 345163 361744 355747 413937 392497 447262 526158 461151 314509 346597 307402
19103 307402 312272 451029 504321 555794 566284 611204 722775 919834 1100840 1075477 985392
19092 985392 954727 890411 807355 619276 645565 818590 950411 890528 825734 1012902 1205911
19081 1205911 1318891 1401971 1498909 1675244 1863556 1949131 2076384 2281431 2510071 2776035
19071 2776035 3053495 3551634 4282510 5082140 6089074 7517318 9838591 13324466 18290429
19062 18290429 25223467 33994807 44361652 56004837 67461141 77093722 82776686 83747925
19054 83747925 79443255 69094531 57500886 45491638 34595486 26543893 21003698
19047 21003698 17377863 15065876 13518713 12410168 11500288 10751711 10210830 9697375 9157714
19038 9157714 8670038 8411010 8059345 7792585 7523089 7253539 7019053 6892122 6767679
19029 6767679 6549142 6431033 6390382 6302888 6247398 6304736 6335557 6424727 6587496 6796976
19019 6796976 7036300 7406107 7845810 8403344 9103570 10086710 11752724 14459687 18491131
19010 18491131 24268651 32166599 42149463 54146370 67672985 80744173 91438327
19003 91438327 97754179 98609854 92965952 80685906 67382834 53139784 40598039 31588071
18995 31588071 25337366 21210650 18517299 16569440 15114000 14069714 13157974 12309874
18987 12309874 11630713 11057265 10600553 10271668 9765219 9341528 8979714 8592197 8387698
18978 8387698 8108625 7729742 7367854 7011895 6729064 6447218 6271392 6120499 6051767 6069139
18968 6069139 5987063 5786795 5675457 5565445 5410956 5231694 5061064 4905880 4704656 4503346
18958 4503346 4412890 4264624 4162050 4099191 3943299 3828378 3692375 3588857 3461829 3321704
18948 3321704 3181846 3131862 3129512 3123996 3074258 3030912 2931154 2824688 2794239 2793764 2774307 2689750
18936 2689750 2703326 2741742 2658990 2571883 2533113 2367292 2324459 2323632 2262614 2091814 2056017
18925 2056017 2051987 2048187 2026852 2001076 2021026 2115858 2195444 2066948 1896315 1945690 1991503
18914 1991503 1909386 1862367 1859781 1767179 1677279 1697963 1643883 1702420 1691725 1636669 1521537
18903 1521537 1503684 1487929 1571125 1592651 1546395 1543394 1465445 1355891 1276955 1363288 1386571
18892 1386571 1341474 1287963 1065441 979799 1007354 1059550 1049728 1051295 947558 874077 841782
18881 841782 818429 786016 816515 830565 822161 781166 748611 742668 696127 674771 635799 600644
18869 600644 650339 656932 661287 637668 544806 504794 442875 376914 422830 419521 478812 497461
18857 497461 523776 568867 528708 501742 527578 476060 412809 405516 425855 374069 376993 516687
18845 516687 607153 645525 583928 559144 604431 608986 593613 630981 716058 562682 494835
18834 494835 466857 551042 619793 554301 669043 764444 720204 649264 573821 538243 486452
18823 486452 516669 499926 436721 302182 152176 181007 231750 280574 269710 139447 51277
18812 51277 -36664 55664 134113 169242 143090 179074 264156 245237 239367 241344 247046 208784
18800 208784 153236 168119 216407 249605 330670 425852 453042 338299 166014 169252 255857
18789 255857 291572 272029 236623 256997 341629 263019 215354 308457 268950 167038 146685
18778 146685 202145 313236 415034 455172 451398 428677 280184 128241 178430 235375 299561
18767 299561 228615 218055 179517 155868 113874 160274 164714 133925 66826 64474 184777 204178
18755 204178 218968 170353 145566 165238 148383 17848 -35380 -18764 43026 35663 -29804
18744 -29804 15323 54321 26169 73721 135067 241643 195513 183889 167614 188628 127500
18733 127500 42347 14881 -31562 -14686 77050 132579 128820 142795 64146 -44720 -54112 21490
18721 21490 18948 -15609 -41311 50272 170131 194713 194662 189420 157985 152210 107186 134915 85018
18708 85018 22907 -3809 -5125 -15621 -38744 -90694 -18027 101334 73891 114629 181741 218290
18696 218290 166950 135944 143848 122805 55010 -3856 25055 -4293 -79790 12359 116621
18685 116621 197048 193725 122856 36354 81731 77833 48554 3970 29992 62788 68907 45516
18673 45516 47737 89996 119892 142208 155428 149477 145172 132020 131474 113970 -43242 1581
18661 1581 24283 2659 45169 120911 210936 233226 240661 243654 314154 307274 249965 190959
18649 190959 144301 74448 -4222 47073 22464 107654 166203 175513 205052 186674 304713
18638 304713 325669 195493 133074 123881 56239 23454 31799 -19156 37380 48696 -2509 12667
18626 12667 64921 24983 -110011 -105655 -94285 -3209 22768 58724 76767 48202 161172
18615 161172 218213 124311 179541 184650 64876 627 -37716 -5475 35588 191265 185193
18604 185193 204269 106425 17214 -3807 681 27544 120001 201407 218152 158064 244384 185264
18592 185264 80220 28672 10163 2789 -20303 22678 71354 105278 139856 185336 205877
18581 205877 97973 11577 33020 41745 42270 154326 105787 65779 160095 215902 75184
18570 75184 16155 124517 143168 150051 200152 151605 63181 21467 3532 30442 47023 102317
18558 102317 84317 -7508 45984 115645 182259 154793 153225 78924 21272 84012 30893 12134
18546 12134 104429 236155 299649 279890 263641 187861 148395 229245 357779 468043 491792
18535 491792 492292 446981 347338 421376 354223 218567 307183 272341 292137 355239 328616 312937
18523 312937 239024 142433 97839 151338 266114 327962 269015 269869 183204 260246 322541 405213
18511 405213 480893 348461 152569 183469 257574 359492 354431 314661 174515 87707 180519
18500 180519 319054 381535 435003 449282 469614 517340 472931 356477 282907 260714 287885
18489 287885 359130 369766 427497 503000 556163 658635 718451 670121 675693 692631 704073
18478 704073 762535 663092 442023 419959 372257 364463 278051 345064 432513 510268 559555
18467 559555 467352 376758 397922 394826 371175 404423 445840 455315 395640 415210 459665 415624
18455 415624 477261 471780 398374 426810 450186 542226 529374 452164 305478 333463 373793
18444 373793 349040 269991 325115 413327 472282 475822 553667 626062 667846 757654 707163 686091
18432 686091 670604 626990 682905 661578 663829 728671 904770 1007303 948921 933489 1039767
18421 1039767 1122727 1125464 1293832 1613633 1859321 2020270 2113458 2274652 2382481 2568055
18411 2568055 2875477 3100222 3476247 3953067 4334132 4889533 5701689 6878915 8430189
18402 8430189 10399240 12964576 16473125 21096288 26389809 31843056 37771425 44636658
18394 44636658 51432162 56773356 60121699 63327386 65411371 64733007 63856409 63483595
18386 63483595 63879967 63150087 63020570 65045402 68328264 73199479 79238022 84150297
18378 84150297 85470372 85448195 85907630 83398055 78457006 71673033 65196823 57416435
18370 57416435 48278186 40758254 34951002 30239941 26355543 23175646 20699989 18959371
18362 18959371 17706896 16589796 15632153 14874528 14239996 13598339 12897396 12353996 11804434
18353 11804434 11342735 10947151 10456431 10040327 9641333 9207800 8848239 8633146 8392197
18344 8392197 8180829 8012044 7799060 7602872 7425890 7298784 7126663 7053301 7012139 7000625
18334 7000625 6912340 6801445 6793636 6878345 6851135 6815555 6921260 7009331 7193438 7530225 8009214
18323 8009214 8717178 9582447 10891273 12794933 15371920 18764281 23377122 28923506
18315 28923506 34252163 39036421 44603648 50732185 53855570 51890541 49964579 49963921 48232010
18306 48232010 42799186 37908288 35450964 34514912 34628678 35610033 37007138 39205073
18298 39205073 42351210 44347514 43042648 40540605 39410443 37778009 33195785 27816314
18290 27816314 23869350 20773618 18069576 15869701 14224011 13008605 12094584 11465547
18282 11465547 10862221 10334229 9924727 9702037 9437123 9241208 9164912 9038655 9019991 8918830
18272 8918830 9003013 9259322 9628511 10290103 11267082 12808432 14892999 17617452 21470229
18263 21470229 26127140 30449661 34310113 38986413 43853574 46081486 44282652 42717650
18255 42717650 42671569 41025767 36567583 32765964 31149505 30818020 31466370 32717828 34141878
18246 34141878 36318396 39501624 41425938 39910236 37436640 36437471 34775407 30251509
18238 30251509 25301434 21769618 18945896 16224421 14171843 12659233 11508111 10690545
18230 10690545 10132635 9584224 9097041 8624866 8127829 7654076 7393743 7175549 6961273
18221 6961273 6780966 6588500 6387928 6098956 5896438 5774716 5597048 5446497 5236697
18212 5236697 5059615 4917319 4880147 4811440 4648487 4460408 4308342 4259785 4200660 4171820
18202 4171820 4116254 3954278 3766058 3556396 3418173 3400690 3396315 3339236 3296950 3223848 3095217
18191 3095217 3116526 3070837 2949381 2829793 2644588 2544216 2502775 2431501 2364234 2323048
18181 2323048 2357286 2340208 2323249 2376006 2206594 2216923 2159309 2037985 1998813 1924472 1838727
18170 1838727 1761211 1653934 1640731 1688213 1647019 1684851 1630696 1634443 1622708 1556470 1489440
18159 1489440 1409822 1401281 1460612 1431274 1460024 1429267 1441439 1543606 1485282 1335053 1191781
18148 1191781 1076336 1091078 1073751 1057739 1051041 1078155 1110074 1098806 942078 904370 965445
18137 965445 915255 797834 750460 808795 830232 829195 848093 815231 825519 838737 827528
18126 827528 804055 733416 760070 762726 792938 834478 752658 673505 647770 694831 734442 725632
18114 725632 592725 577920 680763 687796 670319 649831 621576 514844 500278 483463 351025
18103 351025 404012 480719 458331 455776 469754 500576 508843 492608 489603 488450 493313 448271
18091 448271 356902 322208 304693 269071 177455 179271 241829 234773 208115 203610 274763 196811
18079 196811 126643 76204 201437 319559 230073 140838 280058 392325 450199 400828 285780
18068 285780 269639 328277 394968 388518 407844 408211 344199 271927 263691 267457 294264 318577
18056 318577 333240 198654 70506 175940 291077 276035 246903 185152 117917 145616 188180
18045 188180 195963 176585 238196 212847 185134 141193 183057 299923 295626 124211 -7058
18034 -7058 2683 29575 46984 63018 132929 220633 205942 221564 105348 72963 20017 64900
18022 64900 93959 47208 -5516 136051 52856 4326 -6753 124932 76902 -74262 -78753
18011 -78753 -91610 6847 131571 214258 142859 74082 37988 -34126 -22019 20884 51817
18000 51817 -11549 -57810 -85131 -20815 75009 97942 -7299 -26476 -79592 -166465 -53694
17989 -53694 23970 71658 87952 109596 77798 -16240 -84147 -37210 39931 82280 84889 114516
17977 114516 107936 137230 138099 94619 200874 205334 232865 257954 240779 135857 164565 125636
17965 125636 50653 12275 9059 32452 35769 19600 30305 -92456 -38017 57163 63696 -17391
17953 -17391 -101900 -16729 92847 -15480 -53682 -29129 11923 51295 71346 40336 35001
17942 35001 -51656 -14287 30527 85977 73782 7117 9650 30852 -18082 52679 82853 135274
17930 135274 111120 4818 -52681 -21041 103394 171728 96838 80986 90779 52366 66310
17919 66310 79024 -8355 92017 139688 35795 -38322 -68149 -3639 -16196 80863 195703
17908 195703 164013 151103 167201 187885 131664 76066 76985 181803 36677 94862 128579
17897 128579 117067 149166 67693 4178 -37661 -15724 47930 33913 30801 75020 153914 173690
17885 173690 80376 -9808 -71317 28313 134557 68377 49593 44664 -41451 -92973 -77809
17874 -77809 10809 141298 282244 309237 329387 230634 218967 348117 393184 270311 280952
17863 280952 390846 382452 274185 294710 272686 303710 416791 490393 459908 395203 416033
17852 416033 413426 383963 326701 323326 387556 449447 389560 306039 321420 261477 192576 188856
17840 188856 164526 145843 212922 220775 233316 193816 119640 141189 137645 86722 69842 106050
17828 106050 95695 9207 44325 154291 209560 229616 234641 240170 207007 183651 202095 210771
17816 210771 203735 263109 243866 72828 1614 -65802 -76882 -43292 -65774 -89754 -27706
17805 -27706 47645 74982 -1983 61088 72424 47178 -27772 -120293 -151878 -161376 -222959 -218066
17793 -218066 -204251 -155543 -42860 16462 -37 66987 83296 63927 11822 17350 36767
17782 36767 -11748 -46424 -66283 -12516 140445 162803 110106 178814 298990 253429 190757
17771 190757 215681 295783 328132 248791 311890 330572 321757 343824 252802 291188 298921 235245
17759 235245 230476 151996 173086 153041 136471 116150 147347 136697 62178 46458 22915 20521
17747 20521 -39961 -51727 10237 -8679 13092 -21884 -20753 -45574 29940 62236 -86738 -115447
17735 -115447 -124815 -37432 166128 317572 326256 282285 186354 76596 39996 28129 84054
17724 84054 120639 136256 193792 171925 263023 356279 295485 266274 269127 263725 235727 253029
17712 253029 223691 149901 22629 77484 158070 205144 255537 342946 408647 383214 344234
17701 344234 378389 276972 159448 132581 45840 -6750 -1457 -48285 15469 40198 177495
17690 177495 289986 261485 185976 68483 -58420 -105400 -151168 -96694 -59994 -39817 12001
17679 12001 85371 132828 130875 29843 -108254 -163897 -72230 39778 90183 49098 11928
17668 11928 20615 114687 112834 126303 55485 -77443 -79394 -5674 47350 56299 82837 88789
17656 88789 15431 2279 60566 18016 136522 101301 -27733 21880 9580 -69187 -70297
17645 -70297 -62846 -117858 -128391 -168096 -90444 -53397 -32533 -54907 -14409 61790 24361 35836
17633 35836 58951 102920 117980 50879 25953 3162 -5138 74596 27169 -73725 58062
17622 58062 84920 -61753 -4415 -136854 -146763 -71343 -56398 -188984 -247987 -140636 -42035
17611 -42035 48872 16526 -65227 -92650 -182341 -177787 -118821 -49462 49317 1994 -46465 -55371
17599 -55371 -19418 -30425 -96706 -142958 -117346 60629 94301 112594 80700 46959 35920
17588 35920 24576 -56694 -84485 -167426 -208742 -211132 -261004 -138700 -15080 2988 49501
17577 49501 11112 31766 87018 96831 67304 32191 18809 -95046 -103176 -24044 -4908 -40842
17565 -40842 -79010 -94088 -74668 -132969 -113633 -12399 -16449 -40144 -53558 -69527 22940 19468
17553 19468 -22032 -27532 -15871 -44020 -16964 8174 -11070 -82476 -144129 -115763 -106889 -172199
17541 -172199 -67313 -49864 -47841 -53070 -21696 10984 -19866 -47006 -32569 -48416 36713 17824
17529 17824 1770 72171 40806 -22969 -79555 -93389 -106576 -143268 -203105 -225366 -182981 -83815
17517 -83815 -11300 -114919 -158496 -191105 -222575 -113823 -60652 3145 90159 158484 71444
17506 71444 -76712 -93896 -50984 57600 136499 106254 34747 82075 117969 83599 18114
17495 18114 104479 161966 189836 103599 1615 -66768 -137558 -124518 -67841 -63603 -50880 -26043
17483 -26043 -23859 -28799 75747 91069 17824 -73449 -19977 -17136 -89204 -194400 -204163 -133957
17471 -133957 -112380 11881 -44647 -141013 -171913 -62903 50618 35852 -54108 -105365 -105977
17460 -105977 49103 39017 -12773 51059 121451 40777 -31337 -107184 -118015 -130839 -92883
17449 -92883 29336 2211 52230 24130 -16196 -11194 149180 116822 65141 74481 84639 131301
17437 131301 59973 -24873 -69197 -4212 -20332 -82280 -1889 -2212 -11430 103455 45241 44588
17425 44588 84579 -18885 6216 -8325 -106705 -59687 38373 78861 6162 6112 -34913 -44473
17413 -44473 41335 68225 85098 58005 -24480 -63533 -60340 97570 165852 74327 -36480
17402 -36480 -68899 -58862 -38336 -28653 -76515 -38084 -75795 -120746 -116615 -87351 55992 41392
17390 41392 -62065 -78439 7591 6754 -40236 -90172 -9875 -49081 -13745 -44302 -86172 -67123
17378 -67123 -253 54726 80906 78418 8649 -28799 -94116 -39370 -1820 -72477 -114751 -59464
17366 -59464 -1409 51810 91820 31435 -13061 -36394 -57548 -21917 -175052 -172724 -102174 -67031
17354 -67031 -146961 -95385 -72011 -105049 30692 125785 124553 108660 182342 186220 98450 116480
17342 116480 127224 67972 -49262 -104603 14845 33695 -75164 -79309 11357 2094 -10373
17331 -10373 15165 28531 36041 -34565 -89792 -157183 -193462 -141313 -22708 -28 -64878 -62429
17319 -62429 -93100 -96493 -130979 -78364 23362 -8730 -95528 -156746 -170552 -206952 -102494
17308 -102494 -44045 -30750 -43735 -87947 -44264 -48364 -52705 -72325 -66730 -129523 -151665 -134899
17296 -134899 -109701 -81393 -57962 -39703 -104166 -90607 -33957 -78946 19545 9645 -204267
17285 -204267 -216558 -196840 -219774 -233772 -217371 -232624 -178742 -198655 -99234 34236 -10683
17274 -10683 -53399 -12434 101689 167851 174402 133262 110541 115956 30060 -68104 -19647 13733
17262 13733 51937 97881 93781 71280 89971 63800 58933 -17543 -84471 -32417 50955 65957
17250 65957 18150 -27784 -111580 -137441 -126746 -40303 -75392 -77155 -115382 -68627 23877 35012
17238 35012 14343 -24138 -33139 -18470 -1563 10179 -57811 -62171 -78552 -100505 -120737 -90607
17226 -90607 24128 44889 -97663 -89299 -37935 -20486 -31420 -117855 -158363 -65844 34448
17215 34448 -15169 -1952 -24896 16032 -55949 -170980 -267996 -279532 -250725 -223813 -64517
17204 -64517 -29227 -2645 17655 -39973 -24689 -17020 -77196 -114443 -88945 -55656 -69283 -108244
17192 -108244 -46248 -35834 1598 5300 -51840 -110236 -77904 -45990 -60012 -15532 64891 91414
17180 91414 65077 52453 -41487 -127130 -102457 -91905 -202959 -205876 -33937 7359 32793
17169 32793 77035 61887 19381 37674 114382 63977 108446 155341 159895 200458 122727 -2114
17157 -2114 -59977 -52913 5642 74255 54108 -56396 -53524 30386 45657 -31994 -103374 -49756
17145 -49756 58545 49509 -36227 -113217 12795 165801 223898 230906 138733 33952 4293
17134 4293 102369 159806 58749 53181 62951 66181 70650 168 -63520 -127119 -97853 -41919
17122 -41919 -88329 -100929 -188502 -160935 2639 -819 -38409 -89698 49710 132731 85411
17111 85411 34203 -13480 3023 29621 1975 -78648 -57361 645 23690 16099 -23813 -102048
17099 -102048 -203548 -232429 -154051 -129743 -146116 -111929 -147094 -49974 -46651 -22552 66773
17088 66773 73035 32985 -28235 11634 101004 89475 47275 -75724 -27072 -52796 -113095 -22444
17076 -22444 -64982 -138830 -179978 -177038 -156204 -140370 -86332 -6592 83372 196581 193568 100526
17064 100526 57482 22781 107627 39876 62741 133328 75738 1405 17175 21463 -43808 -76734
17052 -76734 -126979 -38060 49108 8854 -10582 -120 104807 52656 -74696 19815 80052
17041 80052 128548 45792 -39612 -93726 -127309 -109960 -3499 -1749 -35438 -57318 -77781 -55737
17029 -55737 53594 47745 44492 77761 113768 28126 74303 111216 96699 38304 -62912 -115920
17017 -115920 -142768 -139041 -174332 -188501 -191004 -231099 -173844 -95450 6452 -11030 -130958
17006 -130958 -227444 -141166 -57015 -30604 -28458 -42368 -4813 -49621 12934 -57497 -168747
16995 -168747 -162257 -106622 -57938 -26415 -29263 -149133 -163054 -88853 -94746 -98436 -67746 -34239
16983 -34239 -69692 -70175 -26053 -3732 -38821 -38020 -120590 -115371 -106966 -174123 -195573 -132149 -114194
16970 -114194 -37655 82652 106581 144946 122509 96017 95222 69497 100628 65845 -35231
16959 -35231 -16154 17053 89882 77086 -7909 48507 9198 4489 -75745 -52169 28868 3811
16947 3811 -49135 -53767 16618 376 4346 -35579 -84537 -59955 -16669 -95001 -58290 23482
16935 23482 -90344 -180864 -98382 -45683 -3117 12127 32771 -36477 -83939 -67487 -38622
16924 -38622 -89039 -54885 13134 46116 9618 18962 -32179 23222 -13425 -72244 -153690 -103416
16912 -103416 44639 63279 -43979 -83976 -120323 -32809 -81738 -112907 24142 74930 33543
16901 33543 38464 -74932 -124998 -14647 71266 113694 88108 89153 73937 94967 156379 119100
16889 119100 30508 33130 20675 -11857 -56327 -24661 -3137 39308 -8392 -6569 95155 57745
16877 57745 38614 53210 -4595 8888 -26162 -36090 -86040 -106337 -163583 -178130 -196302 -167149
16865 -167149 -106303 -110773 2229 10942 -98508 -152908 -74466 36628 -6349 -17289 29007
16854 29007 125718 79765 -68879 -100817 -17828 -11994 -69398 -121126 -146875 -207626 -215845 -170651
16842 -170651 1298 104306 116080 15737 -122122 -142645 -118521 -78723 -25044 -15665 -105005
16831 -105005 -164565 -171681 -43845 -11441 -157685 -125757 -9565 36611 -58603 -112090 -98546
16820 -98546 35632 73243 51985 73127 74099 108092 50630 25396 23075 69128 130696 90738
16808 90738 67450 32599 64453 26169 4481 -103643 -100949 -109831 -96395 18829 43894 40624
16796 40624 -65093 -143965 -40935 -39390 -89923 -73204 -50560 -60913 4665 23629 29328 -73007
16784 -73007 -60477 11081 15252 -65010 -90525 -80204 -115115 -125451 -183104 -139208 42801 99232
16772 99232 -17380 -143509 -58614 -6493 19373 98964 104696 104542 139666 148130 104959 137599
16760 137599 117011 21494 1213 27408 111920 109004 18078 15874 44128 155969 204431 135736
16748 135736 63490 -33834 -81897 -73820 -64448 -113716 -81228 -68099 -50217 -41599 -40294 -24141
16736 -24141 4109 -130549 -160098 -127661 -53065 51615 39864 -59255 -43643 -35205 -8965
16725 -8965 -19489 -61905 -929 -71726 -126925 -69897 -16096 -19300 11680 -17700 -39888 -143621
16713 -143621 -153653 -102570 31500 14813 -10086 20769 -71517 -173027 -88075 -33229 66955
16702 66955 27443 -42640 -116657 -73105 -58764 -113862 -120980 -53252 -27628 -42253 54506 66895
16690 66895 -35191 -86919 -98986 -72820 -85901 -131004 -155563 -66796 -37532 -80659 -22684
16679 -22684 -3414 14236 27614 86117 45653 -15241 84703 67970 69632 68612 -29609 -43599
16667 -43599 65939 59162 91048 95784 6238 34899 31774 111556 175717 96005 31967 31405
16655 31405 43634 13837 -64116 -22579 -16246 -32838 -44655 -141062 -194475 -65518 7265 -18651
16643 -18651 -51621 29288 90011 22180 -73526 -116967 -136256 -145395 -124879 -161474 -211185 -205066
16631 -205066 -66203 9837 -4279 -74033 -143806 -8832 40115 -32124 -34282 -18001 -12669
16620 -12669 -34579 -104416 -71520 13520 -32642 -79136 -126441 -16140 55687 688 -82093
16609 -82093 -87475 -74806 -51836 3115 -22425 -30264 107179 140792 91996 31423 31009 -35766
16597 -35766 -95321 -30559 9886 118672 76041 33278 121074 68814 85721 62043 95839
16586 95839 61344 -26558 -42652 -22603 84426 43877 19020 23670 -56061 -76009 4553 115814
16574 115814 142813 101030 62844 -10543 -153723 -137615 -3953 1378 -27338 -3962 60525
16563 60525 13045 15399 38468 32834 49825 97133 91190 79618 8313 38789 78839 39206
16551 39206 -34773 -1343 99638 191153 117631 66962 28404 12880 21685 32660 -68537
16540 -68537 -120460 -199260 -213825 -122148 -57550 -18783 -5920 -73300 -122736 -118254 -198475 -280082
16528 -280082 -273129 -202397 -151690 -15648 28138 38423 36583 91379 25231 15038 -35290 -27668
16516 -27668 -62528 -135397 -121381 -142120 -129613 -165809 -156055 -63358 -51062 -149382 -237212 -239921
16504 -239921 -119418 -126292 -123313 -18341 -24309 -55634 -6276 -1054 -57411 39885 170879 165558
16492 165558 119792 76461 21997 69762 16098 -104355 -53452 -36095 -41499 -12455 -41046
16481 -41046 -86141 -106283 -128517 -60097 -37648 -35166 103749 129748 223265 273415 265814 289825
16469 289825 208592 40062 -81675 -37253 -37848 25368 -16644 -96606 -166996 -99253 -30620
16458 -30620 -10500 -14314 -28339 36230 58184 -24760 -66065 26566 90916 46276 81144 -37057
16446 -37057 -76689 -19631 -76378 -139418 -157926 -120747 -76212 -80479 -48095 -40726 31328 31346 -127974
16433 -127974 -179709 -160800 -147880 -88882 26194 3207 -87212 -134044 -211851 -236130 -293502
16422 -293502 -296892 -208803 -137621 -48394 7279 -116371 -272904 -285520 -179361 -110442 41688
16411 41688 600 -3075 -12657 -81659 -90191 -48613 -3551 -7347 57171 127174 99511 100075 -29825
16398 -29825 -104516 91313 155208 55776 -106351 -56648 -95541 -115206 -99380 63739 44112
16387 44112 -82763 22633 45874 -13954 7958 28146 -3496 49086 -2454 999 -34435
16376 -34435 -55744 -92401 -124277 -113145 44191 138239 76992 15027 -89051 -128701 -101199
16365 -101199 -64680 -119913 -130733 -103478 -56143 52543 164746 132238 188794 190768 140633
16354 140633 -16378 -105404 -75931 -108792 -82046 -27342 -39602 -10938 75833 105652 -27528
16343 -27528 -38881 -11749 45192 251324 280568 231421 159412 149698 149914 115104 127039 119637
16331 119637 46735 98175 180366 132981 68042 71491 16613 -10562 11198 84665 72594 24462
16319 24462 20375 -4344 -18820 -54349 -67184 -107637 -63768 65406 116039 150439 147904 92785
16307 92785 -9468 -77577 -160411 -66326 -75434 -99566 18300 30482 9097 61864 17875
16296 17875 -49355 -36003 -130272 -136519 -77529 -56423 -88354 -35624 8692 16286 -43377 -99717
16284 -99717 -45611 -42273 -75706 -130970 -97980 -59591 25535 75297 128005 150517 110649 122820
16272 122820 169644 146383 146156 135229 70347 111674 35863 -1569 63354 93962 7252 -50124
16260 -50124 -160043 -260842 -89606 31545 8556 10199 8770 -36469 -39622 -38247 -18606 -32715
16248 -32715 -25333 -25868 521 -41739 4397 102751 123729 49874 -2537 57009 73163 88244
16236 88244 53799 -6305 -63613 -47408 -32434 51031 58523 -5469 -17788 -112551 -114894 -26714
16224 -26714 32080 -43903 -115303 -51289 22442 -47111 -142353 -181617 -164686 -167755 -135556 -216202
16212 -216202 -188639 -136360 -56079 19143 -11624 -17310 2774 26065 107676 105761 49837 34319
16200 34319 27434 -64458 -70647 -25570 97039 137527 77779 61917 52158 16317 -80019 14424
16188 14424 79812 24809 -31299 -125916 -127960 -7448 44462 -20366 26406 7554 76806 100498
16176 100498 35907 46548 17685 -2909 -101295 25578 25182 73003 84718 9889 -122706
16165 -122706 -96852 -51597 -38304 18472 15998 -23555 -1358 187 -34490 -13746 -74659 -162098
16153 -162098 -156680 -87774 -41624 12021 -93597 -91615 -22125 -1197 73599 154967 108334 -15855
16141 -15855 -75205 46225 44396 12972 74893 164575 121774 53260 37355 -36433 -131471 -177098
16129 -177098 -170368 -147398 -86412 -160728 -197397 -86508 -56212 -35512 14645 61196 -47925
16118 -47925 -71051 -20293 -22924 -13030 115621 160432 125353 93727 35681 61521 -450 102288
16106 102288 50851 102798 54378 31219 47949 71864 48742 38395 11227 -51852 -112346
16095 -112346 -170099 -175608 -94862 -55545 -13099 -21773 54101 139103 140422 52331 73057 84040
16083 84040 94232 169505 132250 122556 19551 -97508 -131186 2954 62198 13719 58532
16072 58532 64927 39914 93089 186848 216652 141139 129344 150105 116179 186042 184364 113495
16060 113495 76364 100683 57344 -30650 34860 66593 39935 103238 87425 17805 -47808
16049 -47808 -67804 4488 36967 59360 1514 -11842 -35762 -99 41283 -4770 7858 9440
16037 9440 8594 70668 45527 27129 81862 139108 89429 76696 93596 88336 98331 -31795
16025 -31795 -222640 -190947 -182954 -79688 45910 2748 -47168 -22944 33033 25383 124753
16014 124753 186986 150335 106288 57369 84060 21991 -23975 -7000 -3996 -13792 -35536 -6416
16002 -6416 -178070 -125218 -134121 -128140 -121574 -52897 -24682 -28483 -67600 -56300 -72481 -137709
15990 -137709 -190020 -211177 -141287 -62255 -14368 -22709 -65918 -124461 -108887 -26107 98352
15979 98352 64604 -57882 -139756 -69086 47738 53540 -46736 438 17511 57938 42461
15968 42461 73397 -37274 -31017 -20373 28922 105851 43891 -2727 -84897 -125110 -13510
15957 -13510 135587 69259 -19616 -75142 -31784 45671 46794 29629 30909 33951 74928 87265
15945 87265 104779 93411 87195 61711 -47168 -45733 -95519 -50551 -56271 -106230 -135400 -147808
15933 -147808 -90110 -146367 -133570 -74685 -79228 -166998 -56631 20639 44053 3502 11025 46786
15921 46786 74448 114004 118443 100690 41632 -28187 4916 70406 72736 79764 45719 88794
15909 88794 143230 31328 44796 23366 -26213 -31298 -98621 -134680 -137179 -121883 -92765 -74609
15897 -74609 30832 -31911 -21095 1320 20782 -30040 -44724 23732 -2052 -121028 -118651
15886 -118651 -2502 73887 44123 70739 122736 163626 167556 137614 90728 63849 48565
15875 48565 73937 109775 148636 102621 33367 50562 -38797 -118562 -84029 -24528 -2979 11747
15863 11747 62045 65490 56013 92109 6864 -14923 8398 4274 -57823 -38764 -7456 41213
15851 41213 87247 12846 -678 24283 -56389 -70097 -13023 27491 -30562 -69250 -46399 -26752
15839 -26752 31257 67740 30108 -65501 -70442 -93055 -89646 -137713 -188211 -90774 -99741 -95346
15827 -95346 -68616 -136848 -158666 -164596 -110859 -10316 -18464 77599 104515 136465 96833 48660
15815 48660 66381 925 -83734 -134988 -69405 -36567 -27645 54566 64040 -90487 -209314 -228874
15803 -228874 -84918 19658 24860 -65527 -85957 -67485 -47054 -44627 -54362 -27190 -9914 -18917
15791 -18917 -24122 -31214 26335 -11738 -23636 23074 70673 112156 81252 17560 -26634 -39897
15779 -39897 42874 168498 132469 133007 114845 47367 113480 157139 63631 -14406 7227 -12212
15767 -12212 -55615 26879 169984 161864 117611 142003 120604 151107 162535 109109 34053 -77356
15755 -77356 -36044 63432 128208 145112 57504 59029 39232 34734 17928 -12286 -117914 -170791
15743 -170791 -128828 -204578 -199273 -88390 -1758 12289 26008 -87107 -114612 -136197 -56847
15732 -56847 152243 240718 193192 87014 62260 57074 45124 18690 -93698 -124033 -130043
15721 -130043 -158778 -208112 -100788 47760 128521 96386 91258 -3063 -87487 -48906 -43413
15710 -43413 -110652 -59894 8662 -28571 256 61432 31319 58041 122236 80394 69233 5369
15698 5369 -31147 -14615 -41831 -88836 -25418 60280 -36749 -146859 -142492 -55743 -6362 30444
15686 30444 21112 40008 95690 56986 -72066 -150327 -117215 -29529 -19379 -58067 -132699 -241430
15674 -241430 -255292 -209151 -101818 52854 -71696 -207630 -346191 -312465 -132242 -172866
15664 -172866 -82836 10588 46934 114862 130778 19116 -71592 -75284 -41880 -68997 -126588
15653 -126588 -123117 85033 176694 172285 92804 7889 66951 78639 129330 132177 140711 87923
15641 87923 52858 -11501 39599 169767 182338 40283 -41171 -103727 -79789 -122829 -182814
15630 -182814 -183129 -163701 -72201 -6110 19151 -11012 2466 3949 -57635 -171630 -46334 -52540
15618 -52540 -16531 52487 98515 15856 -6466 11646 28787 78337 12361 -58858 -144918 -240233
15606 -240233 -224441 -208589 -195360 -75998 -47546 -39763 -95803 -102142 -55444 -31781 52413 -13325
15594 -13325 -147273 -100148 -85181 -135599 -117718 16515 -73340 -116090 -15471 40696 39039
15583 39039 -73469 -11801 -30924 -93089 -70802 -66817 -168887 -128098 -11398 -35816 -89864
15572 -89864 -58253 -65356 5918 -56302 -86974 -74771 -90536 -62777 -21018 6917 45562 28449
15560 28449 27357 76816 175219 192999 93859 73885 40485 42836 42731 47468 87093 -81405
15548 -81405 -100649 -29073 -16569 -52198 -66287 -26165 85605 191740 157930 1000 30032
15537 30032 105264 47573 -6813 -59257 -60236 -63214 -12731 76640 48228 40068 79720 224700
15525 224700 208214 126435 75350 3317 -60123 -84209 -6148 51384 58104 43601 59969 121077
15513 121077 104467 102523 61046 50965 61884 90944 81548 28885 18944 79103 81805 163384
15501 163384 128766 27219 -149564 -250655 -154440 -40685 -4002 31949 -2565 48622 32518
15490 32518 12235 -52784 44218 132201 122839 -35070 -70986 1791 -55010 -98674 -58883 -41718
15478 -41718 16258 65686 -9153 -41882 -58563 -84943 -84172 -81101 -68798 -19628 -31452 13509
15466 13509 27740 19741 78086 33345 -92509 17826 86065 30405 16592 63993 125823
15455 125823 81171 58280 39444 47091 165538 115528 136361 234550 227598 186743 184043 199542
15443 199542 145568 -17304 -182616 -191941 -109141 -54957 9521 -70993 -186396 -224370 -192270
15432 -192270 -143975 -158895 -199590 -85378 -28531 -68339 -137640 -118522 -75577 41106 99006
15421 99006 90786 164889 120125 101542 27564 27860 8186 34033 -95835 -205762 -170326 -24806
15409 -24806 15673 64908 -28848 -102262 -127096 -209617 -214621 -63143 -10152 -11097 -33213 -74890
15397 -74890 -25832 36942 -14226 -66842 -30926 -96274 -161069 -179014 -176639 -70194 -89533 -154733
15385 -154733 -158413 -84316 -78861 6302 49118 30417 71053 81874 139831 100188 34393 -42063
15373 -42063 -22218 -13519 -63163 -19628 70972 52011 16055 -36880 -104342 -145894 -70383 4761
15361 4761 42968 -93578 -147690 -86835 49543 44693 112947 66336 -31602 5581 11505 -59129
15349 -59129 -196073 -129300 -51592 -9250 28659 117639 131451 67962 -3788 -71041 -194801
15338 -194801 -194673 -180170 -165449 -138572 -124432 -192397 -140385 -196743 -199371 -99287 -99746 -93467
15326 -93467 -105303 -81714 -1219 1223 -55687 -43390 -79675 -60820 -75740 -81694 -11635 33313
15314 33313 -30218 -70817 -80885 -40702 -51470 35260 131666 80479 -49754 -167504 -117754
15303 -117754 -161989 -210554 -105080 -155924 -159721 -78697 -96857 -101231 -103101 -92376 -96567 21921
15291 21921 110741 -11671 -71849 -116898 -53604 -63469 -84256 -94294 -15844 4690 -81941 -12131
15279 -12131 2377 -44792 -141638 -150116 -124296 -15146 17466 -135525 -194638 -131496 -50869
15268 -50869 56216 79373 86868 54053 20479 -36284 119343 146511 116437 104071 84126
15257 84126 -43895 -43250 -51297 -44067 -41359 -54487 -98192 -45929 -28760 -40740 -53342 -29527
15245 -29527 -134479 -179056 -33572 39775 -87404 -51409 -23733 -25508 10673 -32444 -97564
15234 -97564 -93071 -76034 -2997 7407 34205 57112 75908 93823 43361 -6142 -119270 -123797
15222 -123797 -74568 -39497 -95262 -137725 -99947 -62844 -27408 24575 52261 -32799 -75488
15211 -75488 -89237 -34850 -4038 74931 165462 268254 246410 85297 31869 84433 88917
15200 88917 19782 -61404 -47884 44647 143202 141430 -1775 -166454 -124808 -94810 -39106
15189 -39106 21905 35910 54533 49891 186086 225516 110153 23297 -3708 -6791 -4740 -79700
15177 -79700 -171443 -179613 -120367 -25278 237 15512 166567 135731 24384 -9115 26950
15166 26950 60162 -53853 -96065 -26660 -43750 -82930 -49222 -27636 -54117 28631 76493
15155 76493 -476 59979 44621 20732 -55061 -91988 -129089 -130451 -55250 -38211 -106852 -107819
15143 -107819 -191651 -195898 -162665 -104033 -53692 -31702 -1450 15880 2592 30816 -17400 -77180
15131 -77180 -29653 -31560 29192 55618 -15183 -87150 -56593 -39694 -5860 36839 166028 249845
15119 249845 209327 119351 87482 64064 -63504 -106230 -39743 -59099 -92230 53946 57854
15108 57854 129071 186162 133550 166857 224507 239483 170046 133628 66477 13756 8611 6441
15096 6441 -82062 -112535 15503 1596 -71290 -80315 -145726 -322655 -357955 -342979 -194494
15085 -194494 -152702 -169206 -71393 51202 28404 84893 23580 -18662 -43161 19047 44456
15074 44456 -61136 -137063 -41886 57942 -36262 -128195 -80937 3896 -7737 -65519 -62471 -115948
15062 -115948 -128856 -101180 -125616 -73537 -32986 44260 -8564 -41555 -55033 -102781 -54901
15051 -54901 -62654 -97781 -37087 -38495 -42039 -82703 -115258 -61808 90222 112179 94123 74844
15039 74844 3208 -86366 -17071 -8124 -36772 6947 14266 -60751 -85674 -128720 -114387 -58111
15027 -58111 -51587 -114687 -95526 979 -7027 -70975 -111593 -144645 -271326 -150213 -61636 -91083
15015 -91083 -46766 -82444 -51131 21779 88067 12856 -64929 -154272 -175769 -194924 -122485 -79158
15003 -79158 -47597 -15700 54261 8499 -25080 -238 31077 81213 27029 38459 9059 -22508
14991 -22508 -144367 -225292 -213716 -172895 -17553 90273 89873 79352 109975 209119 121115
14980 121115 -27505 -146104 -160613 -123739 -153107 -110543 -79535 -103020 -153705 -136310 -103853
14969 -103853 -15161 -19483 -123089 -154236 -115144 -46141 -15136 80137 141377 102936 98623 147548
14957 147548 80514 49320 111255 130032 65773 57717 60125 122933 133787 78862 -27968 -45170
14945 -45170 -36203 -52354 -70375 43064 109175 104152 -6513 189 -2283 102712 117847 24699
14933 24699 -70095 -130249 -138036 -40591 30413 32862 -23142 -96755 -142985 -194887 -283820 -182955
14921 -182955 -32468 75667 41839 3423 -41827 -173730 -56072 88801 99850 83819
14911 83819 -21905 -66437 -39136 68966 145030 67120 -86048 -132912 -87710 -71525 50173
14900 50173 117867 69482 60922 116310 125639 76727 27469 -2922 -11174 39208 118568 76146
14888 76146 97016 133238 161275 96215 -34152 -104778 12299 52618 -29122 -40057 50003
14877 50003 -16342 -12542 95254 87683 20712 -9803 28516 15002 97775 92090 34752 43273
14865 43273 -35329 -114559 -83225 35434 63373 81006 74322 99267 147823 170582 103332 -44518
14853 -44518 -64944 -147941 -54544 -30534 -39654 -37602 -77958 -129531 -119142 -80404 -33589 43843
14841 43843 100405 60074 102005 133443 185159 162185 115832 26068 -5908 -212 -11486 35399
14829 35399 -21918 -63482 -123593 -127206 -71812 -82015 -68046 -47220 -118675 -30816 -5562 -35283
14817 -35283 -57432 -68756 -72708 -82093 -52067 -27638 54730 109153 81031 -51097 -38670 88331
14805 88331 33383 -2530 -59570 -96362 23072 71357 14528 -41256 -24214 -91084 -77400
14794 -77400 -42657 -61636 -120909 -207894 -257111 -187865 -81892 14613 19755 -17937 -40 5200
14782 5200 -35887 -20334 -70734 -71433 -42053 -114224 -154869 -98639 -34008 -18485 -16104 10060
14770 10060 -27489 -121519 -198665 -208487 -247499 -166849 -87181 -55892 -95815 -65467 -63687 -50226
14758 -50226 -85617 -72293 -42415 21126 32265 -10026 -86981 -119149 -137328 -223510 -164538 -105664
14746 -105664 -115037 -113798 25011 37973 -69545 -118579 -170640 -135133 -69891 -30718 -34056 -81471
14734 -81471 -109430 -86570 -112137 -11850 51699 -48019 -89690 -31391 -108689 -150886 -11960
14723 -11960 -28567 -109971 -99528 -167981 -103804 -21717 29066 -9559 67748 69308 -53315 -38188
14711 -38188 38700 45295 -73029 -140327 -219736 -180539 -28626 46090 64632 51851 61756 20652
14699 20652 -26472 -14971 42707 67803 70554 21913 84896 133088 198817 168710 49695 -10862
14687 -10862 -16339 -37902 5971 -17267 64265 46465 -131063 -176742 -234646 -216576 -179472 -160662
14675 -160662 -85022 -85063 -165932 -78309 -20159 -41109 -16507 50273 9015 -53216 -89783 -109103
14663 -109103 23327 103453 40596 12775 11851 60281 89962 30483 -74103 -60058 -74449
14652 -74449 -107813 -114206 -85856 -34136 43924 38433 -80910 -129429 -19118 70032 93285 83312
14640 83312 91759 35092 93752 98648 83364 128284 193720 117131 20933 4811 102328 126464
14628 126464 28452 -37940 -35191 90417 133329 88810 163242 191198 56934 -86180 -86169 -69455
14616 -69455 -54613 27971 25409 -55320 -41804 1022 -27634 -102219 -198518 -183048 -117585 -93039
14604 -93039 40514 34498 -94498 -89217 -98699 -55398 -34638 -21900 -40090 -136711 -89234 -17503
14592 -17503 978 -112191 -171380 -50600 -10867 -86420 -50286 10084 67022 -47414 -121396
14581 -121396 -71802 -105282 -114066 -158005 -121658 18100 105101 193124 130357 47063 17783
14570 17783 41945 89952 89533 69055 82243 60040 96621 62812 -32118 -72263 -47922 -21021
14558 -21021 -28304 -44066 48672 -16750 -27070 -53271 -39143 -41810 -94327 -56641 46881 124146
14546 124146 106923 62461 32008 72509 141086 71950 -9794 -38449 -25830 23036 61699
14535 61699 118039 125022 56158 -86044 -85758 -83169 -39320 125786 104097 68521 -50785 -35871
14523 -35871 53517 99533 142954 59682 -11704 -39699 -16862 -16115 -14986 -61635 -103784 -110001
14511 -110001 -33709 -39518 -60621 -101965 -43789 -4616 -32207 -88686 -70355 -79574 -122881 -200601
14499 -200601 -44887 111528 38772 -61643 -166178 -170132 -187046 -145801 -19276 -29623 -14507
14488 -14507 7378 -57695 -23226 2018 -36247 -5656 9865 -50969 -23829 27257 14519 27254
14476 27254 61506 97064 -42322 -74508 -34952 40814 115191 180298 161601 57070 31504
14465 31504 -63682 -110355 -83110 -108913 -44646 14833 3429 -60276 -45976 -21595 -32703 -64815
14453 -64815 18364 78293 4727 -74887 -118954 -87717 30168 125915 126383 66568 -16650 -45973
14441 -45973 -10293 -24778 13314 50789 70585 34142 -126 -57387 -200424 -224196 -230262 -225518
14429 -225518 -96440 -60152 -36180 -8314 -27741 -78249 -47773 -38177 114063 119887 115031 55260
14417 55260 4983 936 21439 35549 31412 24971 30643 -53133 -40869 -36344 -141601 -150213 -180918
14404 -180918 -157866 -84916 -135275 -99273 -83682 -12327 -66725 -22932 40035 45767 15943 -2977
14392 -2977 87089 99847 103655 6291 -32312 -20754 -12643 -92736 -107049 -158894 -130663 -91529
14380 -91529 -95763 -118283 -99485 -7333 -25782 -32990 -1293 24015 32524 30296 -17515 -72057
14368 -72057 14901 60302 79078 96103 73735 -66434 -137599 -107098 -83078 6911 -1595 -8293
14356 -8293 41017 29136 -10882 -333 7673 -125265 -198569 -46590 130920 132965 79670 55431
14344 55431 55077 128450 133847 70422 -85688 -177250 -83972 -73572 -55292 50695 49549 -37473
14332 -37473 -102227 -203453 -235838 -118692 13431 -16728 -70498 -129559 -19570 37161 -44642
14321 -44642 -96418 -116075 -87142 -34831 6709 38875 -28390 -16088 51262 60630 60733 125739
14309 125739 174950 150658 163238 166532 59426 -105076 9151 86230 92464 76911 -30748
14298 -30748 -53649 134689 264117 261356 207120 88697 -40107 -45957 15483 -1527 -78791
14287 -78791 -62550 39181 107182 158964 159519 127142 114840 119935 66063 113577 130861 72200
14275 72200 24316 -44405 -13791 4877 51663 154360 172026 197344 188366 62080 99043
14264 99043 77097 62030 8134 -13912 -9263 -7456 -71038 -66629 9652 -19898 93957 142507
14252 142507 54406 2695 -85631 -138189 2009 113140 160700 152409 130470 111446 103663
14241 103663 70451 23983 43102 6169 -7524 -14232 -45597 -83696 -92931 -110517 -3128 11994
14229 11994 -22996 7347 105822 108493 107842 33493 152298 157987 -33871 -24521 -19620 -67760
14217 -67760 -58043 18342 49079 31448 11466 -77871 -199878 -106139 -44798 -27779 78729
14206 78729 48338 5629 77989 95742 26928 18070 -26629 -133100 -246620 -212103 -141296
14195 -141296 -115898 -30150 51386 -53956 -121418 -118042 -33494 3203 1393 129445 117629
14184 117629 -2233 -19974 5971 -6135 53475 97587 -4850 50554 105622 74632 -41221
14173 -41221 36847 -12472 -19034 98598 203938 111991 -48565 -66628 6190 110545 8490
14162 8490 -131253 -120582 -29053 57009 20181 -120669 -152628 -136302 -153710 -83000 43525
14151 43525 119331 129078 106805 47067 1118 42909 145126 98893 64069 67744 -9608 -14469
14139 -14469 14864 23884 -65025 -65612 7484 53927 -46438 -98031 -40799 37013 42451 -11894
14127 -11894 -56928 -88490 -130877 -186779 -126012 -53497 -53994 -12473 66056 92742 -33538 -100274
14115 -100274 -126717 -18877 -16895 8231 -19862 -147520 -127627 -151919 -107084 -140013 -208247
14104 -208247 -180524 -84266 -32183 2190 -50345 -33842 -28640 -102860 -87086 -31211 -34494 3750
14092 3750 -25100 37065 112211 134062 137923 52942 61456 121965 130259 89290 71596 44902
14080 44902 47497 47054 -27189 -13895 -23019 24950 70949 114794 86041 121008 96424 71879
14068 71879 78803 57315 -37090 -29580 -45151 -8776 -29414 -109626 -171827 -148794 -102887 -50127
14056 -50127 -9550 -29713 -52832 7890 52607 118597 78288 -46180 -114324 -98963 -27326
14045 -27326 -83182 -85865 -91590 -74816 -11344 -71087 -66280 -100765 -45698 1942 -79819 -78350
14033 -78350 -95537 -211330 -180505 -71609 -76446 -23643 10443 -20800 -15370 -32532 -44913 -6666
14021 -6666 -35659 -6723 6778 47085 10794 -6203 -29693 -50295 -136153 -53167 -6028 -5937
14009 -5937 -70436 -104386 -218325 -229551 -118740 -53309 -110124 -112149 -50020 -12382 -40847 23369
13997 23369 42750 21225 -71294 -51816 53393 -60633 -178864 -207157 -205478 -41713 -17545
13986 -17545 -72434 9979 105523 108714 157664 93882 -65095 -83525 -167410 -172220 -189073 -156281
13974 -156281 -109136 -84220 -48306 -100866 -149060 -148676 -163073 -114011 -21168 17949 58107 -50566
13962 -50566 -146444 -74342 12627 -46210 -80435 -63817 -72406 -41915 -68406 -135935 -159916 -147567
13950 -147567 -83966 -27275 -64180 -193889 -248773 -163334 -58946 58810 22112 -67345 -224026
13939 -224026 -306803 -337831 -258386 -239702 -156938 -78161 50949 1603 9395 -51002 -83715
13928 -83715 -33196 23571 -48554 -98511 9976 56211 104822 16849 -85276 -32812 3516
13917 3516 265 1235 -11544 -58645 23722 34334 74818 21438 -39339 -145661 -158978 -77468
13905 -77468 -9323 39917 23303 -37130 -50570 15136 78462 102377 80364 88430 134392 102865
13893 102865 136129 117911 73330 38122 -18800 -32445 1943 92696 65082 26700 25115 101357
13881 101357 96350 21663 -13903 2235 -59307 -112643 -123096 -84952 -117858 -162566 -110759 -104757
13869 -104757 -68504 8884 149606 135314 -10438 59021 78120 -21726 -46577 -9734 62395
13858 62395 5457 -91365 -76297 -8423 -39682 -95658 -140095 -172126 -123143 -175446 -153389 -11092
13846 -11092 -23610 -19621 41466 57609 112229 68189 4644 -14392 -1200 -18199 -24514 -14087
13834 -14087 -103181 -143514 -123814 -93546 -56508 -67156 -8203 9640 -52369 -132844 -34807 56033
13822 56033 54751 82726 3313 -74310 -124365 -150564 -151836 -111087 -63952 -67782 40040 76711
13810 76711 -29948 -149280 -141391 -25190 30365 -2250 26697 -70481 -131499 -116281 -72197
13799 -72197 -141099 -115151 -45471 -70020 -157429 -284536 -239558 -252354 -162365 -69485 -58191
13788 -58191 -19565 -76455 -40126 -68725 -111034 -104542 -12601 52656 116542 96965 75024 166426
13776 166426 93598 -17426 -74700 -48067 -26004 -60178 -153082 -172562 -22687 76178 71917
13765 71917 64172 18127 -78242 -69765 -29538 -39091 -105636 -75169 -141508 -70117 28647 -73196
13753 -73196 -120712 -109490 -160492 -174513 -128585 -80929 -137191 -94746 -97702 -114417 -80152 32274
13741 32274 74402 41652 -21160 -73412 -145242 -45686 93490 139743 131362 27304 93107
13730 93107 133073 -12320 -64170 -184883 -211119 -245805 -228939 -139874 -85205 47687 33801
13719 33801 -148586 -236418 -151822 -116594 -83211 -156049 -124187 -32663 -97670 -110700 -133370
13708 -133370 -200303 -150644 -61127 20738 17278 -27658 -5557 21975 47691 -56559 -138146
13697 -138146 -81855 -1168 99976 120817 48475 64886 45766 -121254 -178464 -72763 -45308
13686 -45308 -21066 -6090 -49020 -53898 -76015 -56285 -126579 -135199 -81914 -47868 -36010 -104251
13674 -104251 -188244 -216894 -60254 5060 -67394 -140511 -50871 -42930 -76885 -73081 17599 130102
13662 130102 222051 124977 -53340 -93973 -70157 -54403 -31104 -47292 -1952 -21308 8623
13651 8623 25825 -113 -27948 15209 -54399 -122150 -194543 -202572 -127721 -119503 -167487 -137836
13639 -137836 -33207 38153 104027 68177 -64424 -150694 -162766 -72412 -27023 -20839 -47405
13628 -47405 -64486 -6188 16992 53642 92330 -13804 -76877 -83821 -111496 -92536 -118341 -126317
13616 -126317 -149360 -186372 -167845 -141393 -155230 -97352 -122347 -189056 -208473 -105622 -79614
13605 -79614 -75249 -119432 -116872 -58788 -70125 -49639 -91233 -79557 -51825 -69988 -54084 -50292
13593 -50292 -86203 -120222 -122791 -157728 -122177 -26567 -24156 -88459 -90944 -43160 -117547 -100828
13581 -100828 -78692 -95894 -164146 -184712 -297323 -206595 3682 92433 123955 146814 111000
13570 111000 30006 73792 44120 -8729 12551 48048 58784 31053 25505 9659 36842 34493
13558 34493 -74011 -81074 -9053 57574 11767 -9776 5480 -40055 8468 22887 50109 11413
13546 11413 -10967 -108562 -213029 -169531 -6151 40680 7814 76604 69568 37706 787
13535 787 78938 45491 -6670 -48309 -41526 41703 118336 123098 69704 51959 86912 55849
13523 55849 -50390 -6558 19642 -59997 -26952 -70053 -150443 -58850 -108349 -192097 -238656
13512 -238656 -133577 -1439 99628 111136 113805 38288 -63970 -152198 -144951 -125137 -160775
13501 -160775 -159733 -87630 -25435 -57304 -107128 -14695 66851 140138 38156 2355 -25566
13490 -25566 -53909 34846 23992 -38920 -139952 -132608 -54858 -96142 -93795 55791 91828 61249
13478 61249 -19594 -99867 -164211 -149147 -72354 -99532 -66727 -89272 -137844 -161131 -150181 -108090
13466 -108090 -156582 -157849 -142306 -167075 -152717 -161239 -39124 67102 62345 29584 -10348 -16132
13454 -16132 -27236 55678 23666 16449 -46024 -95540 -87690 -1089 94628 136613 11391 -122912
13442 -122912 -143831 -162714 -115554 -81630 -43671 90494 105487 117453 48558 59708 7765
13431 7765 15824 37117 25912 -26245 -459 24244 -23334 29224 67596 63526 61849 14780
13419 14780 48574 77113 149693 56771 16031 -42609 -6382 58422 37755 -16732 4489 82891
13407 82891 79997 -50253 -168430 -141223 -75095 37275 109243 97882 163164 148553 94420
13396 94420 200027 170293 90054 66045 -14026 -84136 -132098 -57594 30058 39376 13812 97963
13384 97963 39820 -28021 -14853 30474 -12509 -39508 -58652 -89887 -178869 -137272 -31428
13373 -31428 62741 52933 -68813 -103844 -174211 -137520 -42180 75521 128448 153528 181831
13362 181831 117711 122372 45935 -16490 -82912 -52336 1800 31652 30830 101517 44342 -42180
13350 -42180 -64266 -66817 -80310 -117780 -152712 -230277 -235891 -194218 -253595 -250254 -111904 30160
13338 30160 -38497 -70946 -119736 -138071 -270 -14203 5178 -5068 -89790 -159250 -89756
13327 -89756 -40210 -52442 -9987 67072 -17105 -26100 -70386 -5979 17499 -50317 -21665 -68637
13315 -68637 -210965 -181696 -105587 -2961 98143 169592 163137 127819 199474 199113 48674
13304 48674 81581 157920 142042 151484 87731 71924 22447 -33396 -83796 -135611 -134261 -107998
13292 -107998 5470 105690 138062 34196 -23545 58804 114650 -4693 -38766 4549 44060
13281 44060 -1812 57032 -51723 -140630 -224093 -192795 -113112 -67337 39946 110920 26852
13270 26852 -103364 -58972 21879 33648 -75882 -134070 -55419 -7405 5012 53735 28055
13259 28055 1527 64690 130567 132739 58229 -25014 -25163 -113816 -199783 -190845 -145224 -228300
13247 -228300 -270231 -238999 -135981 -36435 45597 54360 27821 32404 81357 25751 -112746
13236 -112746 -36988 58268 38853 -57603 -39503 13464 37743 -43516 -40489 -89013 -69451 12212
13224 12212 -34170 -103343 -106165 -76500 -14663 41988 65965 65839 47104 18794 26613 131134
13212 131134 183810 75646 -31090 -28006 111905 227466 168001 118389 128089 141232 125103
13201 125103 63191 -56588 -79367 -100840 -169409 -254676 -285092 -242484 -200816 -32075 28764
13190 28764 3983 -13925 -17243 -33247 -21515 2255 309 -11118 -47928 -66483 -88766 -49093
13178 -49093 -39224 -25104 81304 126377 7782 -96464 -115093 -36235 75650 123456 122696
13167 122696 102992 13288 -25042 49255 34131 -46449 11568 125999 78082 -90544 -126356
13156 -126356 -31209 -20564 -205211 -241993 -93698 -9148 56558 24868 48509 44817 -23546
13145 -23546 -33942 19949 6475 -82818 -128002 -62136 10094 25818 35936 107638 103000 -17647
13133 -17647 -139744 -32554 67492 34640 -62989 -75569 -50711 -104782 -169474 -192606 -178078
13122 -178078 -61748 -2035 43851 93698 30480 48167 5318 15862 24922 -23913 -12039
13111 -12039 -3012 22991 58770 80813 10614 -56572 -82542 -189006 -186820 -191123 -169214 -172456
13099 -172456 -188183 -236354 -166140 -143267 -283037 -241955 -68237 60241 63371 -9689 -53171
13088 -53171 -24259 -81669 -98099 -10978 75311 129046 201904 228955 118690 74511 70617 161650
13076 161650 162799 87343 37378 -42059 -21721 -22293 -16471 -48290 -36793 -17378 17520 118154
13064 118154 70292 15750 4778 -502 -36612 46486 30116 -43464 -31746 -13455 -51224 -47359
13052 -47359 13311 82235 50279 26729 -32278 -56900 -92154 -72807 -29108 45800 78975 9782
13040 9782 30264 32622 61845 82189 -7090 -66208 -65429 -38214 -5774 35886 60098 -24828
13028 -24828 -22491 7676 -11742 -3643 -20214 -24708 -20064 20612 74951 188022 151092 131287
13016 131287 25260 -36936 47234 76048 21929 63637 180702 147614 86767 -16928 -100666
13005 -100666 -91596 -30580 4481 -21799 -87664 -51696 -25147 72585 83610 135769 165665 201405
12993 201405 255909 191829 243628 264402 305995 301030 213588 190093 224548 101957 34658
12982 34658 -3866 -46171 -1342 46801 45250 68398 43380 -20187 25751 18189 -47931 -78835
12970 -78835 -179463 -167265 -60008 24025 -42944 26018 73525 73823 -27747 -92781 -78114
12959 -78114 -70838 -90214 -54931 108491 78470 -30804 -98671 -6657 -56096 -134341 -88718
12948 -88718 -25752 65420 125836 194393 149855 116923 92050 23120 10322 -64145 -35691 -14200
12936 -14200 19731 32007 5961 117917 140717 80773 87712 69511 -21024 -10533 91254
12925 91254 151085 225266 142990 79375 2208 -102936 -65341 -87586 -186077 -172288 -139651
12914 -139651 -118370 52638 65834 118136 123879 106300 88451 95655 105513 89313 51999 30867
12902 30867 -14590 -61292 -80764 -10051 -74247 -41760 -21503 -59933 5262 32086 95877 181311
12890 181311 221497 186722 204033 261313 199352 135421 111625 71439 -11845 14869 16620 -104387
12878 -104387 -162381 -90436 -65736 3680 133369 152211 155092 187369 174281 93747 30418
12867 30418 -91405 -209005 -126097 -95208 -252 25139 -32964 -21389 159435 176906 106575
12856 106575 105400 129964 116573 38356 -36513 -47482 31594 109966 152313 187746 81075
12845 81075 20764 -17848 -45924 -61053 -90691 30648 -31205 -133935 -219274 -307774 -246252
12834 -246252 -188995 -214141 -240169 -238093 -114858 -74651 -92486 -63845 -83775 -23248 115603
12823 115603 76404 -40139 -102517 -29899 -50417 -107704 -176095 -154807 -75094 56052 160521
12812 160521 115507 68257 96740 -32878 -65753 -9254 -33056 -47575 -84692 17085 49686
12801 49686 79200 57411 -43126 -100490 -140917 -145503 -49390 44414 154956 203495 143561
12790 143561 64567 80874 142533 178619 214996 114446 -55976 -95102 -105700 -26686 43586
12779 43586 33700 29481 344 42928 72830 36683 -93457 -128937 -90328 9911 -23883 -134587
12767 -134587 -70260 28325 44527 -32008 -44916 -121696 -158462 -50744 38255 41655 32095 34287
12755 34287 -4927 -86240 37921 118424 115008 80198 76986 36461 -65897 -65770 29039 28349
12743 28349 -20223 -31 31258 55258 127474 159194 145916 97352 3579 25115 25963 46974
12731 46974 59516 -6911 4791 18950 24531 15847 -55173 -89620 -150371 -222367 -217287 -98936
12719 -98936 -53588 -61328 78236 232507 305706 142433 9299 24686 119396 99273 65251
12708 65251 93257 106816 124718 128271 -19865 -139134 -216207 -187916 -192836 -156177 -193957 -149480
12696 -149480 -101207 9295 49246 83416 88559 69207 37016 102267 125206 63867 -1366
12685 -1366 1537 -51239 -40512 11180 68873 2972 -85984 -44517 11698 -2741 4427 -18981
12673 -18981 85943 163335 81007 108094 50409 57014 24865 -28760 24176 -24183 -85905 26857
12661 26857 34356 39777 31153 9603 -84470 -85400 -81584 -65688 -132780 -122721 -106346 -82539 -94341
12648 -94341 -38596 -68750 -127903 -79130 44770 108915 61319 23678 75027 73750 122766 82459
12636 82459 14958 55689 81471 119009 68806 49416 39419 9868 7421 58558 21785 58829
12624 58829 156612 159826 136812 132126 179394 80156 9667 42181 -46576 27576 100608 139231
12612 139231 139298 92092 22178 3499 257 -104994 -149316 -101112 -26741 21983 8094 1672
12600 1672 17038 46688 27954 -126006 -171812 -105083 -20294 9744 88692 45531 20550 -38835
12588 -38835 -14631 6613 -48483 -27617 105966 95916 132304 176663 122573 47666 162968
12577 162968 226656 220252 209211 198473 80969 44616 13510 -20786 -28068 -2197 54938 46934
12565 46934 80362 150511 99678 5595 42610 -34529 -34571 108975 85266 -53833 -117437 -113114
12553 -113114 -67950 -32122 -56079 -61870 26459 68346 32420 36872 116720 63450 63094 96694
12541 96694 83264 47123 33045 65959 98782 130427 134814 132749 111924 39879 -38651 7648
12529 7648 3060 -4177 67186 114532 115419 70937 79750 22639 -2234 30518 45725 37978 15368
12516 15368 -15205 -81848 -37187 -60725 3329 118465 72928 35941 -47279 -21104 93455
12505 93455 78622 132037 102411 81413 58821 65331 89702 175951 232559 161620 129061 221948
12493 221948 153151 -61014 -120099 -100734 -22069 102490 92030 14228 55988 24835 21940
12482 21940 31046 180099 281212 266449 187326 196729 204973 142335 16389 21571 64263 -37323
12470 -37323 -1970 67644 61004 265 -90088 -58490 -1100 -19294 30295 21187 -42384 -7031
12458 -7031 86070 75935 -157 83786 93000 74473 187736 54178 -144752 -94253 32786
12447 32786 118533 99275 126907 92149 63353 -53134 -9688 40949 37603 18216 -90285
12436 -90285 -142459 -134862 -49710 -12361 -89486 -13050 8786 54308 26784 43797 54714 64444
12424 64444 101746 195362 155898 144137 64532 -816 77185 143868 194279 178920 111860 16571
12412 16571 17734 42931 50039 84793 133567 102986 64169 53963 15143 -29490 11580 137470
12400 137470 166858 120975 112993 107174 73386 42141 72392 161181 146088 81184 -31188 1373
12388 1373 26308 25938 75077 102028 165940 209249 148550 139254 100582 119625 131655 98639
12376 98639 72042 93466 188084 154794 73107 93319 29357 75057 138165 204908 146182 134201
12364 134201 80614 16671 50087 134939 135246 96363 142336 94363 143008 180836 217300 191895
12352 191895 103505 177890 194672 72585 58111 -385 89076 100290 184902 287483 252790
12341 252790 194401 271831 281076 207791 157648 267210 274672 217827 198533 201626 176832 79165
12329 79165 65035 61900 87605 137816 145323 72577 60748 142100 152393 185654 155685 147395
12317 147395 169831 175643 169293 175006 157582 229462 260308 211392 255081 280379 167367 196404
12305 196404 189159 173569 205845 188655 188921 232062 185552 72497 74088 161084 217992 231344
12293 231344 179368 165782 136316 151319 191158 194157 239615 263583 278984 317045 249132 311658
12281 311658 386393 418909 272623 258711 284072 272902 368984 482121 485397 425523 359457
12270 359457 307169 197259 272367 309619 282858 319790 286074 188780 195199 230758 170606
12259 170606 175749 309745 255132 198056 205194 228593 208866 197985 289823 482163 439067
12248 439067 291386 226506 161826 96307 87522 150888 321719 348498 294917 316180 232455
12237 232455 151292 213474 180297 245556 323218 268743 241291 219897 212635 232065 329184 315317
12225 315317 254673 270748 349441 377077 316675 268329 259606 184887 209439 192198 217613 374555
12213 374555 446502 415048 406916 407102 448088 414136 473960 427854 388951 410417 533573 554565
12201 554565 510839 406557 354483 512148 593320 591674 619692 596547 631208 633767 562465
12190 562465 581600 570347 439791 462297 462213 471343 535460 583130 645028 610405 641646 696212
12178 696212 640667 535125 454900 607385 595513 510366 577862 805068 735814 593921 584824
12167 584824 560163 572972 592845 575896 530389 535712 629570 681725 683553 668634 658209 595000
12155 595000 747403 781046 766253 806521 681478 634931 630041 481026 508607 730706 845983
12144 845983 821965 745712 704687 667435 688777 737934 718544 776833 783301 763897 782262 748149
12132 748149 800398 863518 879888 794656 756036 760016 790488 860053 919877 885648 787064 791565
12120 791565 855068 878589 979461 956459 943242 890948 879892 863595 810419 851861 953917
12109 953917 1029462 983216 984929 1006753 1085408 1155216 1081155 995841 947563 946504 1017918 1070141
12097 1070141 1117576 1184236 1288281 1368212 1344963 1352958 1227661 1075397 1097755 1122832 1093881
12086 1093881 1188031 1191813 1259930 1294663 1247709 1277491 1288849 1351200 1452107 1491405 1480473
12075 1480473 1447782 1441584 1413208 1451104 1591491 1673327 1675740 1608733 1719864 1817652 1818016 1770200
12063 1770200 1698098 1716347 1736484 1792387 1894260 1948086 2039895 2000239 1920009 1935378 1986720
12052 1986720 2042361 2016866 2080661 2102549 2190930 2185917 2229101 2232691 2289655 2333016 2346074 2438330
12040 2438330 2395738 2457411 2554704 2599911 2688138 2679447 2672807 2757983 2871248 2893732 3037012
12029 3037012 3087121 3003959 2997369 2988140 3039426 3201246 3345546 3372336 3334686 3389348 3491053
12018 3491053 3690111 3782454 3817238 3866825 4008053 4073439 4164948 4171626 4310045 4408257 4563918
12007 4563918 4616080 4647941 4828453 4968994 5034140 5132089 5236814 5403812 5589527 5739641
11997 5739641 5892095 5996342 6152898 6363323 6454326 6501094 6527514 6642348 6897441 7224926
11987 7224926 7519100 7719142 7924379 8175312 8374457 8505336 8663433 9028212 9393124
11978 9393124 9564765 9839754 10157178 10517399 10904358 11170292 11534728 11986531 12389866
11969 12389866 12797765 13141422 13582110 14073584 14594039 15118419 15628866 16151522 16766778
11960 16766778 17420948 17893529 18444485 19264984 20114866 20780795 21506739 22401089 23233184
11951 23233184 24098763 24998850 25962491 26958943 27932370 28931281 30017444 31069813 32136036
11942 32136036 33331226 34544184 35755829 36949626 38063790 39288573 40532960 41653339
11934 41653339 42649542 43594522 44597559 45537733 46303348 47063446 47705530 48204230 48633775
11925 48633775 49018547 49310233 49515881 49520131 49253481 48856534 48503118 48003807 47468788 46919957
11915 46919957 46218279 45479374 44615269 43683516 42803467 41956286 41017714 39957213 38916162
11906 38916162 37972522 37054259 36211526 35397830 34445042 33468723 32587650 31707495 30970428
11897 30970428 30178538 29272245 28379510 27604411 26860336 26182913 25506043 24832363 24206539
11888 24206539 23513430 22931115 22369183 21765546 21245930 20685708 20134811 19710296 19228878
11879 19228878 18716267 18325202 17831296 17438751 17092405 16693007 16289199 15869780 15369448
11870 15369448 15004583 14769209 14516720 14256947 14001722 13782585 13453795 13064858 12797218
11861 12797218 12489307 12213027 11983897 11689055 11418495 11207440 11004499 10777324 10624870
11852 10624870 10437149 10149223 9849256 9678070 9539686 9331089 9131258 8939948 8808188
11843 8808188 8700163 8503624 8405115 8264148 8013919 7920671 7830994 7694144 7494766 7350801
11833 7350801 7222962 7097423 6936127 6810409 6703638 6576893 6519329 6319684 6138905 6052693
11823 6052693 6042684 5911065 5837694 5869543 5772681 5680038 5565940 5352520 5170618 5021325
11813 5021325 5041526 4988468 4954306 4881312 4702620 4529118 4510246 4453078 4510258 4461902 4371437
11802 4371437 4319505 4197241 4189390 4131707 4062829 3983819 3886859 3789052 3710090 3715944 3742374
11791 3742374 3594981 3441780 3396819 3426598 3437334 3377707 3365298 3323104 3205178 3131963 3103344
11780 3103344 3067046 2990871 2961387 2962397 2902468 2850106 2843077 2877606 2814401 2746323 2682011 2516935
11768 2516935 2382010 2372711 2590413 2651479 2570053 2481436 2416862 2333982 2277435 2304028 2245063
11757 2245063 2207335 2191853 2182256 2163521 2111640 2071009 2067555 2074069 1983628 1874905 1793580 1958492
11745 1958492 2005584 1909696 1830773 1765759 1669093 1808804 1814233 1732471 1775614 1744541 1737053
11734 1737053 1625621 1675457 1728654 1568708 1535767 1628690 1683247 1608894 1535411 1491818 1534096
11723 1534096 1451174 1464216 1439437 1425274 1437145 1454923 1340336 1269911 1227183 1182719 1145786
11712 1145786 1297731 1290387 1212063 1203732 1221823 1178768 1129124 1027751 1007094 1000889 1039921
11701 1039921 1019222 1160121 1095722 1012409 959702 942168 929726 949014 919558 901704 991168
11690 991168 1027328 1057338 963762 1050371 1057890 953387 930530 857220 835576 769901 751901
11679 751901 873273 933136 944175 928904 866204 796151 845608 823061 762651 720647 753165
11668 753165 771714 733396 728359 789217 839362 773015 716467 688867 656408 714717 757419 762143
11656 762143 740545 746560 733384 599832 712638 764605 764543 743790 714065 652646 602997 645529
11644 645529 636061 722554 706450 583574 517666 483425 486270 544805 574215 572970 603482 614833
11632 614833 555248 560625 542813 488648 486630 501791 513128 546326 667193 687310 665954 639454
11620 639454 539378 547511 553968 486144 513973 507719 514841 475001 447658 369016 372261 419467
11608 419467 347739 412241 446255 374022 264498 241691 410166 471006 568714 565989 404714
11597 404714 324328 311473 303967 405017 489159 455977 493347 513520 529027 443651 395503
11586 395503 395111 477791 514208 457729 352183 266654 288549 300855 302090 284692 271842 299724
11574 299724 305508 262753 332461 326227 281419 234848 315522 335523 319477 359346 449903 445490
11562 445490 414045 340257 313795 329644 302907 284047 247088 247379 210620 210748 355798 360861
11550 360861 286833 262296 301722 317149 315366 373927 357518 314385 264235 191660 292394
11539 292394 323843 263621 310906 373159 370322 349100 294374 228659 221368 329498 313472 272326
11527 272326 250981 179071 64777 132082 154593 160590 138065 209417 279263 260662 189847
11516 189847 227339 197224 128741 190201 209406 305563 361786 272030 224632 243989 263878
11505 263878 254155 244002 212240 163615 193286 288057 324456 311963 151883 114159 70324
11494 70324 151956 250161 262813 257095 120134 124845 122193 117872 169316 272493 276610 245983
11482 245983 234269 205362 97309 72303 64482 110063 167383 232857 228639 263327 306769 195523
11470 195523 134736 127350 117707 118409 81492 96856 73079 95432 198745 216412 227486 237194
11458 237194 183730 144854 96883 189484 149001 206648 206832 258183 318164 286925 213266 219260
11446 219260 220104 205934 140021 183420 166026 75962 100103 132770 163130 96451 104889 104835 145396
11433 145396 144792 141925 146919 163871 158793 87443 118171 214842 182527 155058 51453 21366
11421 21366 -9434 13844 -23846 -116181 -111884 82373 256992 311277 310374 308385 346636 198748
11409 198748 98367 141152 127808 39326 12699 95199 137035 138572 164274 126685 46422
11398 46422 81057 50472 25876 150796 203295 237429 192313 171877 211431 139019 82783
11387 82783 233057 275462 308780 232581 118350 52008 39099 32077 -6885 78013 118137
11376 118137 136346 153695 13983 44532 172387 223562 242201 231612 173865 151541 196849
11365 196849 154626 68093 6598 -69355 -54280 6396 -68552 19047 -18030 -85057 17592
11354 17592 86222 100135 171291 239132 247304 65121 90282 80754 63644 150647 164265 132340
11342 132340 57316 14368 -20733 -76329 6145 205631 259596 194812 67227 37623 -32616
11331 -32616 12461 14139 -8292 78100 92936 100033 166086 246846 256525 91464 64382 150740
11319 150740 109725 10648 -11337 46406 23216 68868 59018 109838 178862 206379 141136 211772
11307 211772 194088 152567 207559 289672 302031 285068 243991 205801 219101 204180 135761
11296 135761 8656 15395 31597 57930 44868 9675 22117 68598 141206 91460 -4076
11285 -4076 8813 22594 125716 134997 134360 89900 88921 55989 99070 168120 120266 27722 39142
11272 39142 94199 73813 10168 -83650 -45529 -6648 35184 13202 112052 178012 115180 78353
11260 78353 48746 -31563 -67072 -41608 -38115 55197 97878 16483 29823 20676 56853 144001
11248 144001 119633 120466 131005 92264 15793 23142 -9350 3497 89808 156514 85620 100343
11236 100343 168956 179613 141786 75636 9202 -39052 -61199 -135882 -91704 -44168 35469
11225 35469 77341 -8021 -58553 -72581 -16070 -8861 -78206 -111518 -56670 85586 95335 127991
11213 127991 195511 117728 -44946 16095 31887 23082 96327 75213 38281 -34383 -10824
11202 -10824 8245 -34140 -18757 8952 -48381 -116992 -80973 46884 15900 -71987 -25070
11191 -25070 -75220 12137 18228 -151649 -71522 -9560 -113839 -232049 -176730 -83943 -7360
11180 -7360 40904 -19600 14545 -51454 -117032 -208014 -194770 -117560 1901 102340 77049
11169 77049 57937 7859 -49811 -97350 -50829 15333 30591 -68869 -20003 89668 60647
11158 60647 79532 36007 17073 -2818 30208 60916 87349 37561 -107299 -202600 -98699
11147 -98699 -78400 34545 1837 -6608 -4824 -31200 8205 -60673 10797 145859 156467 123039
11135 123039 6093 22973 25847 33447 13665 24215 -43234 -63665 -68777 -2931 11071 46277
11123 46277 -63781 -164373 -183114 -151365 -39833 8407 -59890 -135255 -91488 42335 59938
11112 59938 20371 30904 69392 65568 43964 14346 11954 15512 26826 -52484 864 -42723
11100 -42723 -74739 -2091 30787 -87308 -100390 -119112 -126654 -187340 -138209 -21339 38776
11089 38776 49431 69620 70545 67041 7859 -12836 39446 100812 108984 -11405 -27195 -48739
11077 -48739 -107314 -58151 -43210 -67489 -5416 111492 120121 63071 132785 158123 -27219
11066 -27219 -165411 -83012 -41580 -104283 -110008 -137425 -113899 -43448 -35160 -40638 237 39477
11054 39477 10997 1097 13348 68356 146624 153469 161228 160158 147003 210667 275859 236677
11042 236677 319254 563452 693602 479585 462223 653161 636983 636964 711653 852408 940305
11031 940305 1181932 1573585 1913359 2229022 2498631 2731391 2879506 2901133 2829952 2609001
11021 2609001 2344389 2237566 2073661 1819419 1518460 1197172 1034134 896928 755533
11012 755533 699240 813941 813871 684915 639764 513391 457701 496231 410687 378134 327935
11001 327935 271877 321412 354532 300125 235169 256207 263204 311594 286885 281904 290958 208431
10989 208431 194122 182548 168380 192714 198587 141550 71182 65225 27214 67053 157151 204717
10977 204717 211664 184577 156920 171100 124588 180547 268141 172681 16389 -121748 -135821
10966 -135821 -87610 -94134 -111844 -81872 -67549 41613 146142 174846 145906 75933 36010
10955 36010 -56365 -37610 -5963 -10830 68031 -12740 -47537 13978 67379 72452 13285 5760
10943 5760 52262 28644 -22249 37681 63853 42538 -50301 -54073 -31390 75237 138831 72133
10931 72133 35040 84806 150831 114778 62648 53620 155883 217905 226759 170747 154499 156500
10919 156500 111489 2524 11272 67491 -40500 -178565 -235808 -149898 -108271 -90866 -38800
10908 -38800 -162831 -143563 -37273 19647 86868 187932 116978 -10287 -32068 -53584 22317
10897 22317 12042 53347 58419 8489 -13076 12141 45105 52316 -60139 -44216 14657 73253
10885 73253 -9735 -38355 -8541 -37717 -28223 75547 134498 59876 2334 78957 89844 41775
10873 41775 114550 101480 201835 314234 250568 235706 221339 157328 140243 272488 326893
10862 326893 260521 182379 67921 20750 2826 -51520 116232 143552 144880 84661 50840
10851 50840 -7499 -27459 -11604 37590 61130 124063 -11646 -91544 -47125 35352 81438
10840 81438 -34919 -95335 43457 54342 10860 -16830 22929 -445 38721 -92680 -106674
10829 -106674 -91301 2928 104244 116204 107164 57052 32435 15173 77162 100049 8225
10818 8225 9701 -76980 -27371 -7925 -13796 -20664 76682 71394 83960 63780 80716 75513 -4279
10805 -4279 -12064 24699 125944 155959 213814 183036 50188 69069 147032 152734 55704 21992
10793 21992 62050 177795 179348 229254 220845 138718 35609 -13552 -54724 -55379 -77155 -148547
10781 -148547 -100567 -160085 -151637 -141054 -101132 -89585 -76178 -72806 45230 187478 121625
10770 121625 3352 42100 137201 73705 56153 140829 140401 52455 11946 -1404 -33334 -51690
10758 -51690 -50199 -42026 -102783 793 63654 43480 93010 108835 115968 224831 249699 224321
10746 224321 201698 195253 210476 233902 385413 484169 362371 235117 196631 284067 317736
10735 317736 265684 247142 195348 222370 268249 308888 325789 401123 357409 245871 98776
10724 98776 184281 368578 449582 306570 200483 244582 357048 316088 351598 383020 357858
10713 357858 468605 493689 512476 439169 304648 259886 225652 252890 342097 330480 349974
10702 349974 427681 430827 346918 348756 382618 411842 458345 488178 468648 537676 628892 598225
10690 598225 517620 500159 575538 618322 618771 570297 616427 650618 691907 709856 744276 729286
10678 729286 763634 831913 812165 809288 835277 925185 1065036 1160966 992743 943968 941199
10667 941199 1030821 1208846 1205637 1277462 1361449 1597884 1737444 1814940 1825982 1894432 2060409
10656 2060409 2190196 2353966 2619291 2887054 3234893 3500010 3851551 4181724 4790916
10647 4790916 5432606 6098029 6891634 7893932 9060645 10465035 12072860 13758908 15596752
10638 15596752 17446555 19674538 22310656 25297692 29071472 34211528 41444448 51786806
10630 51786806 66999141 88495279 116746762 152497892 197708898 252180164 309790312
10623 309790312 362302578 407212904 444731991 467462386 471776531 456899341 426226758
10616 426226758 382556841 336540844 294444009 257058093 221923076 194696813 178627694
10609 178627694 170081295 164067610 156300102 145913695 135441041 127784680 124057628 124270949
10601 124270949 127797503 133337890 139770064 146241464 151627434 152928151 147147018 134956856
10593 134956856 121495239 110884250 104505142 102044644 102465561 104662909 107583078 110468666
10585 110468666 112410807 111403097 105448722 95604761 85312465 77310704 72124287 69213958
10577 69213958 67834483 67425442 67301029 67161607 66482205 64402215 60490042 55223749 49743707
10568 49743707 45121742 41492212 38550822 36283695 34525567 33105638 31796034 30714037
10560 30714037 29730777 28869859 27931163 27041168 26326718 25579121 24842945 24225907 23663686
10551 23663686 23052202 22380314 21832753 21391938 20744559 20159761 19642213 19122157 18688696
10542 18688696 18246133 17768332 17405140 17001409 16718417 16432933 16063016 15576938 15295615
10533 15295615 15076388 14859208 14696723 14402953 14073596 13729516 13358367 13058330 12851216
10524 12851216 12631832 12339581 12002740 11772645 11480131 11191920 10956632 10639401 10338554
10515 10338554 10124971 9860789 9586041 9471500 9358983 9143297 8986837 8793395 8622960
10506 8622960 8406468 8201415 8052959 7840057 7592534 7383279 7333471 7196324 7043656 6825974
10496 6825974 6708509 6679656 6590302 6470273 6364468 6141755 6072279 5982854 5812751 5680389
10486 5680389 5516887 5461311 5368571 5340539 5154499 4927004 4760163 4690124 4635095 4557627
10476 4557627 4555697 4445906 4301948 4230224 4111416 3998368 3923446 3907431 3907057 3868477 3688969
10465 3688969 3564654 3654209 3696902 3549291 3469194 3386024 3353779 3285217 3215623 3178890 3083989
10454 3083989 3085927 3051903 2939804 2868425 2811344 2763945 2817308 2816359 2569615 2482296 2464326
10443 2464326 2470538 2546266 2494178 2417256 2363055 2364357 2411638 2410121 2377429 2315363 2321721 2316846
10431 2316846 2334223 2444478 2441066 2365719 2354628 2188327 2099890 2158930 2067286 2099441 2106371
10420 2106371 2042229 1909296 1790886 1889846 1825480 1838909 1713715 1562798 1494673 1464833
10410 1464833 1474242 1535176 1522418 1515129 1516558 1444587 1333600 1398204 1415741 1341498 1253493 1148720
10398 1148720 1056382 1029405 1177951 1297457 1320370 1347960 1328989 1188990 1059345 1105415
10388 1105415 1085839 1174639 1214262 1133944 1033939 914133 850283 848649 834584 867844 865754
10377 865754 809535 810282 875466 848909 682690 690005 826962 896516 899085 806415 744688 726587
10365 726587 664519 546774 581485 604125 561624 581692 718910 703858 595671 646072 788010
10354 788010 735165 667575 719999 668935 657897 691286 706675 686716 652635 585227 562650
10343 562650 657039 613298 571041 644446 630913 557038 633448 667459 603213 566584 583796
10332 583796 578412 694747 685045 618087 523434 468123 443513 488175 642145 684957 544585
10321 544585 521348 510649 549027 586886 493077 450276 442968 518482 599784 577800 612571 724543
10309 724543 666463 603678 511717 439072 430749 428465 420934 402808 444515 481258 478661 511433
10297 511433 497656 367604 438773 538561 642546 614723 578361 616553 578982 521541 544266
10286 544266 479305 536842 572455 632242 625939 611620 583699 422522 338580 383429 452341
10275 452341 521952 459885 423536 531386 541356 570832 528207 467093 455291 454283 391586 365651
10263 365651 355560 400723 517655 552843 524820 484996 387573 395904 401710 244024 286378
10252 286378 472987 433750 406352 321530 194993 186117 270916 348418 279983 321671 308216
10241 308216 236882 155683 259887 299903 201434 186335 297167 366098 388672 394903 364543
10230 364543 249161 315337 349688 502454 607472 519009 464194 561063 577961 618167 752643
10219 752643 865644 1050316 1118468 1357289 1607419 1858867 1964491 2137016 2379254 2543268
10209 2543268 2538613 2470177 2353242 2192740 1956903 1647104 1398659 1198914 1077628 947305
10199 947305 801966 730451 676236 585547 618585 633570 637709 636177 709168 805301 838053 799057
10187 799057 731461 589251 617665 689993 757298 775371 791931 788912 704361 755649 720291
10176 720291 673388 671528 594333 573807 657108 765468 767043 678343 602019 633859 623716 508379
10164 508379 580278 827877 1015637 991482 907657 974441 892694 814591 759543 746365 803309
10153 803309 784503 723976 817547 819764 753202 754861 832142 778336 737869 728869 636887 570408
10141 570408 655121 643731 599513 588259 554655 494057 434831 427249 382463 369220 274729 151613
10129 151613 144508 266760 291519 280196 323375 248916 287645 464016 484554 468618 512569
10118 512569 467488 526330 554095 496495 453241 417565 375745 391553 296359 349261 243423
10107 243423 202513 301785 338594 307752 278444 338085 359430 344055 358723 233564 117053
10096 117053 176365 302255 303899 348518 414422 467525 374543 398778 369801 369622 358765 370065
10084 370065 468249 408579 235981 242941 297980 326832 313528 257316 269929 319341 390489
10073 390489 341961 304733 342013 374423 293134 294974 376700 289869 366194 397870 418330 380744
10061 380744 173011 71244 67500 87010 96717 179808 211062 235644 234755 161366 104376 205608
10049 205608 182249 74704 77094 67890 -23878 105484 219270 222076 186718 320827 318577
10038 318577 238557 131895 91692 200203 212254 190136 190176 258950 344761 385285 467572 506888
10026 506888 408289 310629 265239 154718 57510 89058 189627 221115 227042 144531 115074
10015 115074 61608 130402 137278 36906 67745 194047 214804 167998 163264 133348 156402
10004 156402 100642 38753 134032 183755 212353 301695 244465 110014 -397 39736 5537
9993 5537 40971 121444 122541 108620 186882 232141 91694 -52194 54548 217367 279524
9982 279524 314493 249516 298073 268481 222194 197618 184014 238900 209543 121666 177907 162951
9970 162951 171002 204557 157492 78012 66548 130578 147036 132122 218710 215655 43957 52981
9958 52981 14853 90589 230154 276751 322393 270054 259992 299766 137317 70905 135943
9947 135943 159464 261726 329431 301232 245832 382288 387439 249082 106453 139925 247908
9936 247908 288084 281183 366720 427877 321491 261796 280161 274326 143861 239331 320385 229450
9924 229450 236156 238750 188384 170374 58893 69803 96731 141038 236216 279518 226317 256085
9912 256085 211059 195092 213612 295031 221030 184795 183197 204614 127876 136079 278020 349621
9900 349621 431001 326790 196557 117766 44127 60122 112744 89819 98206 102167 83348 163341
9888 163341 233921 212244 105637 119513 204746 155605 154941 163018 188318 166722 159104 214221
9876 214221 239201 122152 95044 167610 292319 329587 245283 135765 102481 187358 224593
9865 224593 225083 264083 190347 169293 176328 100707 133662 134937 101549 66825 -12889 27200
9853 27200 108549 107546 86498 23251 63775 150264 160056 234371 279440 263044 207143 183906
9841 183906 136898 116522 137157 174182 99255 -42643 -81621 -34253 -61753 -114585 -73633
9830 -73633 131957 158483 100171 19537 124218 141089 102772 98856 126376 71830 55732 -22450
9818 -22450 -61530 -61149 55987 233238 252372 165008 27479 -55046 58201 104602 110393 106937
9806 106937 59494 155427 155839 159014 230178 166258 116903 32912 -105188 -119508 -104004 -101928
9794 -101928 -125043 -73203 -17498 8795 5716 42820 52342 67275 275457 435572 489786 525193
9782 525193 653449 774339 698740 487475 245836 218095 180005 94031 82875 169550 160002
9771 160002 69767 19102 15674 -18434 -15365 26344 -3769 -15610 46035 123222 209610 173927
9759 173927 109882 81483 124084 41462 -16625 1982 -52086 -76733 12754 15160 25020 43554
9747 43554 75481 121088 101431 37370 37895 128027 133792 200040 202560 221064 179588 101373 150087
9734 150087 182142 129303 211507 259057 161874 85402 -51708 -122549 -35189 3098 2189 102017
9722 102017 172769 132091 185859 181634 169108 79781 78522 82504 98592 141012 126519 57754
9710 57754 83118 167371 55925 -35082 -8270 31000 14636 5355 99722 128998 80906 118159
9698 118159 17079 -6969 -64902 -99355 -77501 3476 69542 36446 23313 21287 13211 57551
9686 57551 140685 138486 142902 171549 185481 83423 21565 -2433 -12200 -575 28738 17083
9674 17083 -14068 13015 65232 -62 17868 59002 77669 80759 145752 128245 52543 -12116
9662 -12116 -468 82320 177438 232749 407814 425451 416800 318886 228204 267386 277664 184332
9650 184332 26925 36083 72309 190561 146294 80303 141899 175109 171848 227652 158827 68899
9638 68899 -119552 -159396 -20354 52487 132728 211580 167236 181608 200704 170809 137111
9627 137111 228457 232705 179981 143370 69896 -44774 -78009 -7648 92994 116622 151028
9616 151028 136016 186548 206408 161347 100733 155934 111373 87386 67410 133906 103571 17181
9604 17181 -25438 -4597 1136 9082 -53341 6631 43045 89663 119818 190546 98405 61928
9592 61928 105959 62967 71927 -7543 -65663 -67235 46041 157024 131660 95829 152844 239461
9580 239461 190529 125677 53925 78922 227267 242483 194241 101369 110856 119149 156949 183193
9568 183193 142319 86750 65948 21210 -63293 26448 -1924 24762 95517 124822 102436 1477
9556 1477 -65342 -15835 -18243 -37364 -41540 -37994 -48675 -148058 -145871 -59160 -44828 -57427 -612
9543 -612 94532 174609 185634 46936 15071 -42187 -48001 -4092 65576 86450 106062 78575
9531 78575 -28026 2186 143209 177614 229035 321669 301517 243509 165936 107776 2938
9520 2938 -3966 12202 66707 91616 145670 158417 132046 88463 19152 -22356 89334 136765
9508 136765 46557 46743 33089 48042 53496 56727 38748 102692 95571 8350 -61098 6305 63938
9495 63938 76500 116524 32213 22482 -24114 6002 -9359 -97327 -1946 42754 154332 173670
9483 173670 163332 58032 -18670 -96328 -125243 -85518 -43662 -12205 -15361 6474 -19889 -3583
9471 -3583 -2730 -2280 5404 -34366 50779 34978 -48800 -104753 -117579 -22340 38380 58024 -24917
9458 -24917 -67745 -21166 32038 150423 171401 120149 128286 136694 108659 30478 -26141 -133
9446 -133 6813 -32673 -7197 59578 44703 82327 106638 111192 38683 41260 56497 -4090 -79753
9433 -79753 -99444 -63627 30158 -60997 -33852 2744 -5753 -59901 -123747 -133096 -40839 55317
9421 55317 5608 88284 212107 167548 96097 110728 178650 264079 237205 203759 188666 209790
9409 209790 251675 152268 117970 112924 112311 125559 176978 74483 -93604 -123725 14018 144031
9397 144031 53848 -44068 -111149 -94418 -63906 -107293 -62270 1606 -49462 -15673 59564 96039
9385 96039 83362 111592 102050 26473 -8958 -15737 2737 -26034 32262 50688 107195 154339
9373 154339 111418 36115 63040 40126 6805 46061 75982 57257 24821 29158 111595 142931
9361 142931 87368 133988 144274 96675 108822 48892 -45622 15887 30393 -51188 -7303 -67309
9349 -67309 -122661 -85832 22797 3437 27458 2451 -37621 12575 56359 25639 45479 56072
9337 56072 -15676 -122563 -95777 -89137 -51849 66891 68068 57646 47028 94836 105589 103755
9325 103755 87437 -2565 -89270 -156511 -159029 -64055 38920 73764 18313 -60250 -28188 22358
9313 22358 17316 78298 26555 30692 79883 23362 -14365 52875 36515 12214 95956 115167
9301 115167 46142 36021 57390 19678 74592 91218 131141 158346 91989 43757 75920 76794
9289 76794 46043 -45188 -22178 28515 72863 9239 -80042 -60826 -133263 -82046 32889 -5534
9277 -5534 -17413 57983 111867 141940 57131 -101932 -120534 -90303 54650 124101 151800 164789
9265 164789 179774 175862 143176 57699 3045 -5159 14879 57824 17591 -22137 -105597 -105406
9253 -105406 -103398 28762 46957 83667 42024 -1175 4565 64253 11126 27785 37522 52782
9241 52782 -7364 -27668 -91949 -165752 -117220 -46080 -33389 -85395 -51258 -22648 -9428 -25494
9229 -25494 293 70837 32653 8340 -110196 -122163 -108585 38383 85635 -4594 -95008
9218 -95008 -69727 -41772 17852 26287 37719 29723 61224 170914 165572 122457 107324 73664
9206 73664 26809 -64738 -62684 -67047 -71928 -68263 -3075 55383 50005 15944 -7037 60953 164745
9193 164745 126756 96131 34617 10779 56368 -26207 -80701 -49612 11088 69075 95825 77027
9181 77027 95265 83603 65805 39108 45445 -5306 19102 131257 153748 83790 -26252 -108701
9169 -108701 -121424 -117163 -14803 102301 73591 125218 95588 16705 172545 235685 153025
9158 153025 75002 101705 126077 107806 94113 49947 17270 51404 198303 249035 134684
9147 134684 63095 -30930 47956 195707 146639 35526 1403 67734 91180 102689 1386
9136 1386 -73301 13316 185065 231523 249037 164237 173260 118070 96712 112440 29310 115058
9124 115058 172161 166828 137099 72097 -14218 -36611 -64977 -6227 -43919 -75039 -30008 61102
9112 61102 83606 79541 72253 91413 78055 3810 -47290 -78526 -40065 20187 77446 163124
9100 163124 117679 33869 66418 101442 85851 31409 -16914 -183 -45533 -71456 -73740 -97972
9088 -97972 10409 65018 52408 37156 4969 -88260 -68078 27996 53420 3478 -20767 -46452
9076 -46452 -103125 -89601 -21119 15083 18264 -92031 -140842 -107587 -95149 -45454 51727 93157
9064 93157 124262 91836 65853 95536 41115 3736 -247 -92336 -61918 -121212 -120849 -87217
9052 -87217 -87361 -38803 113607 42352 -50001 67850 126604 34707 -12208 -16706 4614 38510
9040 38510 61392 97746 59379 -57940 -40773 46658 79519 -36418 -238349 -209200 -169470
9029 -169470 -74307 4232 79229 90907 164809 166499 149101 67053 821 -20768 -47700 13912
9017 13912 32961 29647 29662 765 -10399 23056 -1476 -57809 -13461 -106227 -44640 37028 49207
9004 49207 38978 38155 80051 117083 173177 246751 275600 236409 197607 121074 103433 -8580
8992 -8580 -14495 -42536 -89547 -68272 -13753 30428 -48732 -101519 24456 91020 77843 142421
8980 142421 171526 43933 -30446 39152 130636 147892 144470 57068 -18737 180592 190759
8969 190759 193572 101460 118461 199777 189413 61545 -41754 -51393 -18951 -118765 -111393 -4336
8957 -4336 91047 53891 27493 64896 -33402 -87012 -69285 33443 77462 10995 -13695 -28394
8945 -28394 -11653 40672 3014 -9735 -96504 -144087 -175723 -194558 -217628 -126556 -136451 -95250
8933 -95250 -103700 -66238 -71811 2429 109336 86866 87454 16144 16158 -17626 -46552 -91510 -80404
8920 -80404 -109637 -160678 -208727 -138285 -140167 -134180 -141396 -114672 -78470 -3744 -4747 -84109 -135885
8907 -135885 -173526 -226772 -174785 -58533 -6889 22927 -12219 -30364 -54115 -60016 -31133 -7620
8895 -7620 -1833 -40159 -26595 29131 26130 42537 35398 85360 224092 242598 119482 37367
8883 37367 35292 -45475 -112147 -61401 23816 52081 17310 -7212 -94482 -101458 -40220 25442
8871 25442 -27193 19786 104355 42729 78136 147163 277523 327633 231998 180955 99253 -12381
8859 -12381 -24267 -48222 45216 135004 69857 21368 17008 157362 172365 110444 32706 -57582
8847 -57582 -6473 -35392 -22493 93891 107428 -45688 -80245 -41580 43136 124749 81131
8836 81131 23785 39437 766 -52502 -95079 -81928 -118477 -32988 10948 47165 7580 35623
8824 35623 -49373 -142222 12052 144683 80093 -27213 -116582 -181529 -107029 -64412 -80070
8813 -80070 -66952 -92515 -25921 16891 48796 93534 16464 -11388 12433 -13967 -60033 37890
8801 37890 82315 15376 -7868 -52002 -36810 20466 59983 89754 68640 965 -34207 -96234
8789 -96234 -114841 -75757 -2663 63483 96411 171100 193793 157637 59358 -20898 -32740 32777
8777 32777 123991 103007 89297 83935 21069 -85348 -30014 73097 67244 65684 58484 113767
8765 113767 91581 -14243 -14420 543 35841 113672 78907 48507 112238 157224 188579 187652
8753 187652 138808 525 -111783 -162638 -92316 -75799 19790 -40742 -115936 -110552 -23178
8742 -23178 60886 51230 15564 93352 141160 135699 4117 -8861 92104 100132 79538 177026
8730 177026 175166 140515 25997 -26737 -60063 -61996 -86889 -72550 -69262 -8144 83783 142880
8718 142880 172513 195217 145114 -4297 -8984 8017 -24087 71966 88590 -43725 -101393
8707 -101393 -38926 -2172 110840 174539 54943 17220 -46099 -39169 -53301 6117 23569
8696 23569 70619 106162 109328 71701 75154 -174 -89360 -155887 -34434 116347 38544 -76448
8684 -76448 -146986 -169782 -159681 -100524 -29658 93582 82128 -42155 -16667 16491 22061 60674
8672 60674 146207 123530 121587 14762 -82428 -51205 54728 123165 58890 14101 -42182 41126
8660 41126 56778 61247 -20943 -94767 10112 130088 103565 42077 122968 116550 54729 45543
8648 45543 101690 243429 208212 90349 121124 127981 1764 18271 41892 -51255 -106311
8637 -106311 2504 175812 195444 104368 128884 162404 142523 111151 46871 -48265 -131137
8626 -131137 -104210 -11777 27284 -22396 -93792 -152221 -91009 53132 42329 72256 116070
8615 116070 42029 49912 153636 199334 185565 86459 29922 70133 164736 130940 47337 -29038
8603 -29038 -96081 -86109 -172710 -117845 -87507 -48759 -73280 -149696 -162436 -125304 -53062 16983
8591 16983 11628 75640 156745 128403 8978 -5578 41888 15941 -26612 7325 73906 153922
8579 153922 285346 174570 92077 80709 48013 78946 117138 -1860 -47391 -25511 40718
8568 40718 96932 115118 42604 27756 56194 66973 48536 -35621 -100529 -44849 -75661 -73704
8556 -73704 -66205 -80726 -77960 -52729 -108578 -136113 -52391 66434 177534 131221 42320 5008
8544 5008 84665 105651 58182 76120 98156 34066 12634 1605 85660 152163 83364 94218
8532 94218 31734 -86401 -110955 -29889 74160 9262 -22222 14565 63541 79882 88094 136265
8520 136265 27101 34921 100980 65193 33148 80638 94969 55378 -58872 -140898 -123213
8509 -123213 -79545 -11529 -32253 -47942 -138887 -130499 -140334 -219634 -151098 -32150 -32308 -69781
8497 -69781 -53074 -12755 36518 36098 121339 139055 208836 286790 181092 44737 26032 -5833
8485 -5833 -3440 55079 85390 69968 57404 24202 -76634 -134126 -72964 31606 68295 104227
8473 104227 54667 50526 34017 66920 4384 10292 1921 -51817 -56606 -108602 -195 55993
8461 55993 17109 -91260 -163649 -134655 -80457 -40719 -83324 -16643 22834 -24087 7834 54490
8449 54490 76637 95837 90824 119284 166532 164671 206139 189209 59480 34390 82018 183274
8437 183274 222961 279260 283404 181876 103265 106840 130603 245493 243552 89110 56228 46689
8425 46689 30555 100355 171417 171711 161402 172862 92206 27017 64853 63995 27369 39309 68319
8412 68319 199149 307894 237069 170064 58014 -39572 -51137 -17679 115825 198359 141368
8401 141368 38100 8552 50693 75621 117644 125737 58784 -11813 38755 3160 -69868 41948
8389 41948 39692 25401 68452 163998 86256 7139 7551 54900 67806 172840 125132 -9691
8377 -9691 -27453 -30854 -45099 -24870 -5419 -25704 -68763 -27330 46763 -9619 -28691 -18513
8365 -18513 78583 33510 39295 70465 11244 31030 -19328 -50520 -2457 13838 11707 -72367
8353 -72367 -52966 -95807 -72250 24614 152995 128598 146563 213246 74127 -9606 6979
8342 6979 67355 8643 52283 51722 -2012 79210 101505 56449 148381 194235 242677 283006
8330 283006 295292 175989 170083 196054 217538 183507 129825 36567 7911 97295 124403 175065
8318 175065 122444 15524 -11038 -79576 -54417 -86272 -88884 -126198 -107115 -91403 -66910 -40768
8306 -40768 -61837 -15233 -12691 65859 81024 104562 -52088 -101605 -45099 -39052 -61174 -184911
8294 -184911 -133826 -89482 -142648 -84510 44619 -76869 -135860 -85711 -176033 -233290 -194535
8283 -194535 -59771 -29426 -19319 28210 89574 151268 121803 -30797 -61589 -78563 -32547
8272 -32547 -26135 -17647 90748 140164 63393 26134 75615 99665 43817 59560 66774 63123
8260 63123 36679 37580 -34037 -74152 -40711 15670 41317 -9824 97756 158742 139054 45874
8248 45874 43159 -97810 -151543 -56567 -25066 93586 179054 100642 -23924 -34474 49102
8237 49102 43018 -25196 -79723 -68578 -15808 19245 -13570 -168989 -151545 -95071 -156658 -124457
8225 -124457 -188403 -92839 30438 101666 128530 124644 77068 52148 3911 147248 142266 52929
8213 52929 24713 19462 82352 43921 30369 76571 50110 -65513 -85847 -230644 -182930 -65842
8201 -65842 -2893 5032 90657 199821 165498 -7800 -23404 -28916 -66719 -56289 -38057 -11605
8189 -11605 -71629 -69268 -70940 -87130 -30071 -33384 -52935 -163855 -115710 -59412 -53816 -113425
8177 -113425 -119378 -75978 -44043 44033 50421 43902 59885 32537 -78114 -81482 20122 6819
8165 6819 23050 -36397 -33107 -22100 19292 152925 146709 24471 26979 101725 72857 33944
8153 33944 -22482 11937 51861 -57258 -128545 -138546 -246013 -155519 -58755 -44259 -43856 -31626
8141 -31626 -38068 -32117 -46722 -16182 72468 34964 -12070 55215 54862 -9412 -3801 18938 -69465
8128 -69465 -121571 -78085 -56091 -9826 -25349 -36257 -2614 83889 40570 14480 21651 46666
8116 46666 41186 7139 6625 -15452 37119 8243 8298 24359 100726 60960 49662 -13921 11891
8103 11891 97007 111662 208177 221551 120222 84473 67523 35194 -25766 -122001 -124227 -40393
8091 -40393 -56240 -72244 -34209 72600 118222 53030 -24363 -69526 -10882 63420 -388 -46802
8079 -46802 -157809 -163889 -119306 -72588 3778 35948 -37049 -21271 113582 14715 24109 33558
8067 33558 182731 219042 104794 75705 41060 -15159 44624 154389 166627 145397 141421
8056 141421 -24278 -102754 -28486 34823 -28516 -137429 -92554 -96102 -105447 -184226 -227887 -168048
8044 -168048 -15265 104900 58274 -2544 -39847 1495 42953 -38399 -152276 -151138 -100712
8033 -100712 -98722 -173599 -193043 -24578 27250 63979 16072 -17997 -87028 -109349 -96206 -54569
8021 -54569 -28528 39733 19361 -80964 -139380 1308 132057 149531 161264 75949 70066
8010 70066 -29478 -116584 -90444 -113362 -108183 -76864 -13422 18160 6028 53408 132743 89896
7998 89896 107978 66392 45847 121316 144562 93307 96366 31252 73615 101318 31405 -21223
7986 -21223 -14008 42227 45753 9966 38241 145052 131121 -10557 -97922 -193406 -210012 -156505
7974 -156505 -189318 -167469 -91610 -44982 -79138 -81183 -71475 -117730 -160365 -11179 55918 108472
7962 108472 107611 27127 -131198 -155968 -92790 -65430 55722 49451 56781 -28856 -69555 -62077
7950 -62077 -146726 -222945 -144080 -156861 -115845 -19562 12123 -13740 -18697 57132 106084 141090
7938 141090 91373 89177 23459 -39545 -37587 -15877 55116 133528 84328 -35696 -160710 -138449
7926 -138449 -17225 25334 -57551 4054 17429 -79242 -32035 48280 131209 97545 29553
7915 29553 94757 59529 -18277 -70041 -18829 -114431 -219203 -151254 -103195 -116353 -59064 37060
7903 37060 58127 -68388 -45708 75033 109563 3446 20495 144047 10755 -27231 56478
7892 56478 48989 35001 73922 99338 170493 200050 162064 108394 62759 52251 -1757 34270
7880 34270 -102377 -224227 -197288 -106343 -13502 48067 26448 -3324 -20652 30162 70643
7869 70643 94040 71572 139165 136128 54271 22345 -31074 -110056 -55520 9005 60760 -5481
7857 -5481 -145817 -129581 -74626 32919 45137 -10340 84851 91516 75755 52956 -4180 -9727
7845 -9727 14922 -3789 -21522 -37484 -69022 -59210 -166927 -128346 -32123 -10396 -37284 -14733
7833 -14733 -10692 -109780 -137128 -164534 -10608 107759 -14387 -7713 60985 41552 132980 201693
7821 201693 122171 20268 -11534 -139672 -230716 -233125 -176244 -176944 -138804 -103444 -87821 -64301
7809 -64301 -2643 85778 33424 -88843 -174775 -142507 -113751 -110481 -77423 -37539 -39531 79627
7797 79627 168549 159697 98112 127451 118085 25281 -51292 -122999 29546 218751 255092 244942
7785 244942 149250 43250 -70290 -135874 -36125 27339 89662 68942 123531 76933 82947
7774 82947 -20586 -70592 -136710 -208993 -107382 -20938 -175755 -264168 -238481 -121020 -49978
7763 -49978 18301 -6644 -39636 -48953 -101554 -53399 -4030 5081 52581 138383 159158 82184
7751 82184 63385 -5168 25192 52768 39257 57104 -13675 -155772 -174935 -140493 -73200 -21397
7739 -21397 -69257 60792 40612 41770 135354 185538 162480 135923 53592 115793 156866 228564
7727 228564 182596 149188 126064 647 1872 12177 23422 69209 159724 168093 78191 102975
7715 102975 64498 32512 13036 -40301 11814 -11232 94459 126844 45117 30853 13001
7704 13001 -16603 -57875 -131836 -124285 -174514 -74336 -65163 -76529 -50105 -136044 -121362 -35129
7692 -35129 -84519 -128391 -177221 -174801 -183547 -206275 -228932 -122450 -8469 -18280 -65787 -98758
7680 -98758 -109577 -41432 66319 50173 54555 29629 36441 5959 -45727 -50610 3667 36901
7668 36901 -547 86281 28742 -48012 -96170 -107645 -34667 -9851 -49431 -53281 -104471 -194639
7656 -194639 -231052 -178293 -95196 -71759 -98135 -87710 -62012 -75197 -76729 -74879 -119879 -131090
7644 -131090 -81363 -18344 60809 56630 9499 -36690 -152644 -82630 12772 33785 -21686 -42124
7632 -42124 -27811 22858 10727 -37615 37758 122780 134348 105677 99738 129891 30170 -22726
7620 -22726 -89772 -70672 -47603 5994 -12681 -10888 -73468 -106558 -93731 -47260 -99474 -178423
7608 -178423 -213977 -164086 -184596 -189961 -82365 -113913 -98233 -73958 -32217 -21687 -51563 -74194
7596 -74194 -20796 -8923 8270 -94826 -230435 -198323 -107509 -83134 -170156 -94522 -48093
7585 -48093 -70909 -131516 -122963 532 35987 -22134 -146502 -148260 -116892 -114483 -68448 27887
7573 27887 62514 64582 -14001 -120917 -136994 -134027 -81650 -44308 6983 -12902 -42447 -64657
7561 -64657 -26010 71576 63869 113078 125429 12549 -14286 9709 -3262 -123476 -132263 -37804
7549 -37804 7759 67420 67186 35718 -1937 -35515 -89956 -113837 -66247 46842 22560 -55960
7537 -55960 -64756 -98217 -113909 -115974 -31226 129014 261121 238170 166246 115538 -51009 -125281
7525 -125281 -27414 111811 78204 49614 72477 105100 101428 52116 33957 13570 32524 2243
7513 2243 27013 -2404 1732 57040 -42612 31975 63812 -39192 -44434 -31870 66315 106233
7501 106233 163756 164458 112169 131734 94410 -12604 -71026 -88714 -54294 -17443 63145 -29725
7489 -29725 -92519 -62033 97719 101726 19459 -60845 12471 -93896 -106963 -85703 -183929 -97448
7477 -97448 -34536 -55280 2044 -78486 -181634 -95212 20502 90844 92693 69731 5031 19950
7465 19950 -21982 -100663 -136574 -186772 -173181 -201959 -117715 28108 21122 -69114 -162588 -168479
7453 -168479 -111117 13219 8577 -39475 51620 64652 39805 -141090 -249332 -328388 -324584
7442 -324584 -263459 -109951 -14841 -30823 35518 69903 114288 173315 123284 -59231 -208712
7431 -208712 -167408 -144178 -173570 -48211 80426 38748 -26982 -143606 -247904 -264039 -139606
7420 -139606 -64010 15964 58864 115753 48815 108619 129102 140304 127768 73082 -72913
7409 -72913 -26065 138921 77352 70588 159893 160514 225808 254365 239163 98695 -21755 -67539
7397 -67539 -34144 6959 80305 194049 152698 33382 -75622 -126266 -137632 -60871 -12489
7386 -12489 34638 38419 -82863 -135107 -182459 -199760 -166588 -120889 -84140 -77766 -57547 -96165
7374 -96165 -32708 -87981 -131619 -145015 -37347 -28494 -8331 -14392 -34153 -7765 67381 46816
7362 46816 -27417 1657 7434 -47735 -29803 8102 96143 115826 84362 20236 -39238 -73457
7350 -73457 -50739 -78393 -98924 -88977 -70564 -41209 -10860 -36914 -63967 -85524 -71943 -71781
7338 -71781 -60398 -41612 82237 145191 133305 23567 -42781 33422 72036 44200 8272
7327 8272 -56623 -44268 -62686 6589 1175 -16061 -18185 -65198 -105638 -6246 145949 105441
7315 105441 65724 10595 -23798 -127362 -179647 -60150 -34450 20546 -389 45230 62678
7304 62678 -9628 -14649 108175 162608 136238 115630 -36982 -128646 -199217 -126483 -84154 -57551
7292 -57551 -118167 -98284 -18763 55152 53093 118493 111228 22820 -33174 37195 26875 78433
7280 78433 -2655 -134127 -173756 -91777 -78556 -7090 -28755 -135403 -114028 -167621 -15912
7269 -15912 132105 209072 180968 95965 48619 20925 -6314 -70764 -187307 -104195 -37536
7258 -37536 -53606 3090 42867 -9517 -44785 75513 217938 141736 8347 -18196 -27966
7247 -27966 -38238 -9789 54974 56572 91852 71772 14872 -36347 -87192 -144488 -116552 -95109
7235 -95109 -15115 -41049 -125309 -113224 -226794 -234537 -86111 68897 117923 -2243 -37672
7224 -37672 -27760 -59074 22014 -4480 -2960 21319 48975 20389 -16821 -71001 -164675 -208740
7212 -208740 -207557 -139591 -84508 16576 20026 61927 123802 43637 28140 55960 -26877 -6548
7200 -6548 -65653 -59098 -52435 -52484 -23894 21188 -30 -78652 -81852 -116576 -101823 -87424 -79511
7187 -79511 -40666 -18925 -18940 22651 -68624 -103822 -78184 -64337 -55346 -43052 -4331 74546 -29526
7174 -29526 -124543 -40887 -68698 24833 -19307 -124704 -118420 -78469 -116370 -225674 -245026 -203769
7162 -203769 -89640 -27347 -97194 -123215 -172581 -206977 -148524 -207116 -183923 -73958 -66532
7151 -66532 -90974 -119464 -149985 -191490 -101970 -100957 -116982 6072 30470 -31789 -76908 -118765
7139 -118765 -111269 -74908 -107784 5560 160779 82934 62338 25836 -61989 -65707 -105255 -150553
7127 -150553 -135787 -116926 -82226 -105411 -131909 -153088 -79661 -39632 -34931 57867 105696 83013
7115 83013 147123 70411 60591 53706 31238 -74925 -202612 -253017 -288190 -295653 -211560 -68451
7103 -68451 15968 3874 -45415 -48110 734 89373 -35641 -134840 -79805 -12670 68320 61062
7091 61062 15473 -27020 -1103 34913 83832 129283 99005 -22488 -36351 -8768 -42490 -6801
7079 -6801 24624 55409 32038 24596 -33285 -84780 -100043 -180648 -199917 -103818 -71278 -7170
7067 -7170 83193 126769 153992 183984 81810 125645 158116 109763 21490 64014 56656 -14169
7055 -14169 -6755 -40913 -22404 -40049 -6767 65173 69347 29467 -85119 15532 103049 42982
7043 42982 -52304 -79155 11231 60605 31923 50924 54026 97952 37691 -10306 -4436 49701
7031 49701 33478 21557 7918 26847 38341 2024 25499 107886 88942 69520 55271 -7170
7019 -7170 41752 72685 -12239 -19157 -25613 -5999 74058 -19393 21496 5583 49323 16436
7007 16436 4841 -97615 -141744 -175154 -116320 10193 93651 45816 -22589 -111965 -42994
6996 -42994 28248 86616 6960 -90651 -24851 18430 -38111 -28034 -67577 -104442 -160367 -131145
6984 -131145 -117839 -176188 -154618 -35697 -3388 -88510 -84395 -80994 -73138 -44684 -68484 -107620
6972 -107620 -142324 -119948 -70274 -95039 -124766 -88943 -62885 -7460 43744 -1976 107398
6961 107398 67835 71558 -5836 -90636 -154292 -139491 -136559 -92192 -12639 1351 109646 127392
6949 127392 36347 -41124 -81308 -118754 -103832 -105100 -46936 14082 -42083 -91298 12318 37685
6937 37685 86821 101828 102634 180700 245668 153957 24195 -55567 -53222 -10278 -70230 -101786
6925 -101786 -104805 -86323 -26368 -29819 2785 72475 72737 46794 66358 62727 47519 61759 20284
6912 20284 -15529 -166974 -144911 -10911 -26073 -2057 -55576 -77428 -52479 -96237 -125113
6901 -125113 -140338 -193207 -178950 -203513 -153438 -34090 -62417 -111361 -71301 -53396 -11894
6890 -11894 -133708 -160624 -88524 -35148 2575 -104267 -107586 -66451 -3075 96043 86212 85534
6878 85534 130225 156199 79979 -1495 -9851 -37486 -46307 -67392 -122351 -174659 -145072 -9049
6866 -9049 53139 82625 138187 86677 -19768 19435 86853 149769 132683 36572 11320 44763
6854 44763 87008 59661 -43584 -138935 -90613 30748 161805 108125 27553 29737 78133
6843 78133 26575 -84560 -105113 -69392 -147689 -238581 -241656 -192904 -93197 -75443 -35823 -60121
6831 -60121 -72822 -116167 -8157 8545 -27988 95020 130667 129735 168451 90301 91843 125268
6819 125268 96058 38040 121714 33125 -32689 -24991 -76327 -76098 -25671 -15371 22649 36358
6807 36358 -26448 -83555 -146944 -185046 -134739 -72848 -37758 -48282 6432 -34075 -66230 17243
6795 17243 -15261 -44906 -17468 -22396 -52664 -31419 -22100 -107452 -49495 58378 -19303 -40668
6783 -40668 44414 106660 121060 74241 2521 40581 47279 90017 75285 -42702 -81168 -76540
6771 -76540 -86913 -251390 -228273 -109721 -83726 -32475 -42274 -113352 -170467 -226347 -114689
6760 -114689 843 -20894 111806 221115 125310 81608 157729 233362 134089 24373 -56024
6749 -56024 10510 82184 85982 157195 119790 -50517 -168558 -82107 -80399 -151373 -101867 -61062
6737 -61062 -199722 -243232 -46989 18843 -57221 -82730 -25927 112491 -42340 -140348 -119987
6726 -119987 -126178 -114870 -144656 -52511 -31200 -48721 -83007 30053 58041 42961 137966 15202
6714 15202 -20589 -52484 22828 79957 17913 21841 1231 -61553 -41164 -35940 -85845 -90976
6702 -90976 -58619 9006 52998 11909 -151212 -251341 -141330 -18891 -7311 25958 43764
6691 43764 -32783 -85079 -118585 -110789 -96615 -142745 -112204 -113634 -43993 -117736 -185649 -228030
6679 -228030 -284849 -245759 -72580 -15995 -49898 99418 171375 88359 21337 12848 123320
6668 123320 45547 -11462 25847 56418 41688 40699 -78972 -126590 -127050 -39164 56912 81085
6656 81085 22873 -71851 -38601 56693 96315 124376 65006 -10930 -99458 -135025 -81034 -105773
6644 -105773 -112626 -128759 -143811 -289940 -288224 -285007 -348642 -202577 -165321 -167990 -196171 -200378
6632 -200378 -183219 -177053 -53226 -50597 -95246 -60626 -42198 -23409 -54031 -74173 -46583 -4764
6620 -4764 -54412 -15755 -22585 -82361 -47869 15599 28535 45410 -1199 -9724 14737 66570
6608 66570 99983 136207 194009 101523 6088 -22264 -16830 -64593 70842 102016 56719 -24236
6596 -24236 -74769 -115902 -66907 -153566 -165390 -52499 -3052 -117216 -146709 -69558 -40473
6585 -40473 17421 -29127 -22199 -38213 21036 95178 39863 35325 -10213 -37920 5881 195
6573 195 31334 76809 30505 41372 120971 187701 159021 72543 -3419 21223 44683 -4437
6561 -4437 13617 -68630 -15159 32250 146566 162634 64636 2655 -65092 -157363 -155982 -16991
6549 -16991 24958 68060 33453 -1352 103579 197925 105599 -703 25746 86488 53435
6538 53435 5632 -15049 -25778 -20839 -56687 -26502 53166 131768 114506 8039 -58085 -63602
6526 -63602 -48913 -79927 -143592 -94473 -95567 -32202 10361 -56029 -105416 -118928 -109997 -40331
6514 -40331 -104586 -123770 -31618 -12948 -67820 -38714 63720 84473 85285 50962 -488 72112
6502 72112 78365 -47601 -70240 -90408 -8411 56159 59735 -72107 -137276 -106928 -61668 -34494
6490 -34494 53169 91159 137845 76263 -35167 31271 86938 -72966 -156718 -181686 -75079
6479 -75079 50192 80990 -11636 -57350 -64248 -66224 -33980 -15828 23377 46814 41120 26464
6467 26464 -79559 -113847 -23052 -64804 -154163 -151547 -122466 -100211 -154245 -167241 -136842 -165913
6455 -165913 -99221 -23090 -20075 -71366 -55239 -2327 -69721 -87792 -4548 13760 -92430 -153469
6443 -153469 -31458 32825 -29340 -18686 28817 321 -16760 -39336 -45649 -59494 16006 1861
6431 1861 43849 43644 54550 28747 -62861 -62915 -26995 83251 91707 53252 67736 53790 2065
6418 2065 -34221 -53119 -17162 9656 129356 104479 -40619 -104514 -60097 -12531 18788 -6396
6406 -6396 -31782 -10397 -25267 -75138 -47571 -15794 -5100 -47115 -40327 60950 78459 -65027
6394 -65027 -39742 36524 34748 -29553 -73761 -33535 -31369 -45054 13236 3910 -29536 -13005
6382 -13005 -43183 -150013 -101258 -21632 -61054 -162625 -192379 -130176 -198614 -232205 -177028
6371 -177028 -185407 -164734 -96118 -17114 3974 71639 134276 96541 32872 21657 25667 -32269
6359 -32269 -3862 28118 -15967 -74282 -104593 -17813 58072 -17602 28931 22493 -17804 -110756
6347 -110756 -138711 -38677 -32606 -52835 -26031 62610 98388 49855 12568 15884 -20417 -47644
6335 -47644 3537 369 -25529 -13950 -47518 -64006 -50314 -28203 59854 44503 -62035 -135150
6323 -135150 -113621 -165735 -171808 -146384 -49953 20037 -60376 -126158 -216448 -246885 -144174 -19020
6311 -19020 -32154 -73342 -85792 -98159 -70552 -49549 -24119 -57782 -134145 -87503 -79625 -63536
6299 -63536 -64674 -127209 -129193 -99443 -128572 -54433 28759 105771 31442 12753 -15613 -65293
6287 -65293 21743 89611 -36336 -91513 -3538 1257 18376 90575 155835 164014 122822 138131
6275 138131 18777 -32683 -85524 20191 35296 15624 -36934 -123190 -234084 -202749 -81417
6264 -81417 -73281 -21677 -50359 -74465 -70751 -38291 -83973 -84444 -86199 -89434 -115309 -93999 -177311
6251 -177311 -233611 -235214 -257067 -205950 -94839 43821 186819 146291 -62434 -75344 -53068
6240 -53068 -37371 -45951 -11697 94004 182372 138243 -4285 66439 182652 118766 34710
6229 34710 -5318 -81450 -36591 66194 43721 33183 52128 59309 53217 34171 7557 -78660
6217 -78660 -104069 -78202 -57534 20769 12162 -23352 -67305 -141910 34961 120670 208331 163548
6205 163548 90606 89281 -22715 -53157 -64904 -61307 29650 38905 13485 66121 154503 114633
6193 114633 80368 100741 86109 76983 92146 -14426 -61594 -69499 -26829 -30522 -115412 -173754
6181 -173754 -149872 -58429 -36617 -95744 -149888 -187204 -200925 -134407 -134394 -206677 -185901 -86509
6169 -86509 84036 137615 58632 35187 16780 40003 14737 -8600 -40482 -75924 -77002 -82234
6157 -82234 -112757 -108334 -59534 -38913 -105221 -120897 -37382 -41985 -83863 -99654 -56075 -64993
6145 -64993 -65450 -145122 -199230 -105014 47591 169325 192907 163829 29817 -61630 -63430 61582
6133 61582 135315 95082 79209 31940 64011 50932 6172 66663 95424 48989 76026 74994
6121 74994 -13392 -19673 -4680 99008 108863 23205 62467 164803 191465 159436 150732 94421
6109 94421 40877 -9261 -15690 17164 -3217 -20283 -11005 15175 3519 75977 67681 43027
6097 43027 79656 30644 5340 19421 20313 41343 34849 33003 -824 -11270 -48024 -105905 -49847
6084 -49847 65924 126526 154677 129629 105427 152219 162536 97189 102826 128341 63927 39741
6072 39741 40638 84397 -18657 -217249 -84717 -681 -87535 -43994 -7073 90610 89324 -16516
6060 -16516 -42884 -108765 -23726 58520 -10951 3597 39302 121100 151334 156399 183738 134875
6048 134875 94968 109882 114917 28988 -11377 88497 71618 117514 92072 72437 -31723 -122341
6036 -122341 -157262 -50849 42652 -22250 -64394 -90212 -158640 -186874 -73277 -87660 -120511
6025 -120511 -44554 -35613 -19140 -81473 -125515 -146866 -72876 57589 150789 167186 130323 71544
6013 71544 -18226 -13034 124908 177498 190318 84716 -23490 19328 13331 -24714 44528 120160
6001 120160 151083 92820 -58221 -95223 3057 18009 21986 61051 116345 106522 56601 59238
5989 59238 -28305 -72008 21816 162602 113606 95779 86428 64962 -42709 -81092 -11848 -8136
5977 -8136 -23351 -146916 -79515 -17081 -109409 -164105 -135806 -67710 10325 34360 26239 28215
5965 28215 53277 142818 56279 -17688 742 77124 36371 -16984 19495 94277 94346 135751
5953 135751 39092 -11168 64813 121005 129421 154345 170077 39270 17876 66043 15646 -1955
5941 -1955 4641 23204 56336 22241 40678 74528 180652 118501 86244 1525 10695 72057
5929 72057 68529 79139 55742 25765 22775 27095 -15892 -94974 -134968 27452 72421 134657
5917 134657 165530 128753 160552 150202 136362 183982 137280 70776 28619 41747 29794 -15820
5905 -15820 96115 138597 -784 -11021 -3316 -79562 -115895 -8835 64540 -11482 -90259
5894 -90259 -178505 -251990 -126559 -82697 -40512 979 117983 108649 107760 86635 49050 3746
5882 3746 5991 38158 93865 140581 186734 161436 175837 77248 -59370 -45771 26275 1604
5870 1604 -148066 -156466 13931 95347 26228 -10774 -9938 89666 116768 114676 99971 33829
5858 33829 40725 95667 -31280 -78015 -65039 -64508 -23974 64394 102252 71623 10909 -32461
5846 -32461 -4997 76453 45571 -24540 -30783 9548 83242 14215 -27443 32193 103586 97485
5834 97485 -9889 -65629 -1671 21720 83159 19661 47697 -33055 -82657 -54715 -25605 -55761
5822 -55761 9277 47562 104298 18077 -26572 58585 14339 -22178 -67870 -63141 -27534 5292
5810 5292 -19360 -1203 -41795 20334 -15924 -55340 -70957 -5677 -32199 -38371 -64728 -83857
5798 -83857 -75253 -127119 -139848 -145489 -105822 -96199 -112290 -16456 73782 172638 166242 111228 -60431
5785 -60431 -81046 -19032 -271 -64522 -13355 28198 -40205 -5984 16706 107789 134104 98111
5773 98111 -907 -738 32941 60889 37836 -17860 33265 76165 66902 -34121 -181624 -131684
5761 -131684 -108917 -41704 -24207 -63066 -68578 -71938 -33239 -33046 -74005 -61988 -83977 -83538 -121916
5748 -121916 -22357 11814 60148 -2030 -70536 -32532 -65994 -54107 9243 60500 256 -68739
5736 -68739 -117327 -88539 -14822 22671 -5854 105115 160751 130357 -9406 -85751 -37359
5725 -37359 24927 153475 166815 8223 -56733 -118993 -153246 -74784 -71132 -105938 -25499 -25708
5713 -25708 -53856 -86881 -120067 -92806 18186 72579 95698 153142 82926 60565 93681 155968
5701 155968 82109 67231 52240 -10544 -1061 28889 14009 -58689 -152389 -148452 -92203 -63946
5689 -63946 -644 9404 -33839 8917 -857 95470 75088 -45594 -78507 35 27083 -5505
5677 -5505 -44442 -37534 84562 140254 56628 -123863 -183581 -126127 -141311 -121984 -5976 61698
5665 61698 49851 50731 68312 -36885 -57871 -199712 -173384 -117256 -104518 -139156 -169057 -241818
5653 -241818 -187080 -104414 -67478 -44897 267 37183 -18274 3089 26195 -35373 -81052 -63884
5641 -63884 -115229 -131375 -108358 -128153 -54077 15012 26017 75407 201108 224685 291200 306881
5629 306881 301966 176668 135744 146750 89196 5463 49696 73411 -33420 12828 52551
5618 52551 32456 15026 26449 76044 28503 13353 -10564 21217 96934 45164 -39720 -50776
5606 -50776 -51809 -22460 59090 82668 59415 10968 57714 89199 5176 -82038 -87130 -91222
5594 -91222 -85403 -49847 -160292 -179601 -16625 -10010 -42622 -86498 -4615 21297 55226 50328
5582 50328 -44122 -134033 -183592 -151327 -88864 -74726 -148284 -104724 -19701 -73182 -126754 -56223
5570 -56223 -37680 45190 119694 85916 21918 66044 190571 197789 75182 126929 70363 5896
5558 5896 -95878 -87230 -69359 -129484 -97282 11164 59424 116633 163622 73675 -98015 -157141
5546 -157141 -183076 -201602 -170539 -78269 26287 66516 66661 39290 -4847 -69053 -162628 -203968
5534 -203968 -213064 -171381 -117890 28597 95758 62524 46770 97864 108965 124540 40696 24087
5522 24087 36431 13721 -77624 -80200 -63099 -78917 -174967 -176816 -181869 -102064 -18553 -8735 24986
5509 24986 57712 17684 -73592 -144696 23025 135757 147052 109905 25687 -43879 15295
5498 15295 53349 93177 64368 55738 95618 149975 151693 115396 149074 180229 50908 9972
5486 9972 -2890 -77925 -87147 -10937 2519 13220 28499 -55519 -145480 -114377 -78818 -5094
5474 -5094 49394 8049 -53539 -173492 -134742 -126983 -149511 -135792 -86295 -94611 29752 64371
5462 64371 59635 -14507 -66609 -39145 45673 98336 142203 151366 55799 62098 45707 35348
5450 35348 -111708 -134873 -78923 -27975 -119369 -97943 -26373 6238 -38094 -43754 -89419 -164257
5438 -164257 -78479 -58172 21022 90774 99548 157890 156348 165236 57351 -60352 -133773 -99096
5426 -99096 -86272 -92903 -88518 -13729 41741 57987 104329 64769 -69721 -73652 1918 73984
5414 73984 15877 95286 88538 -33243 52909 170 -58336 -119691 -187657 -149257 -107240 -10677
5402 -10677 -8868 16452 -46169 49065 85589 35003 78338 142938 102426 -1743 -63390 -134442
5390 -134442 -195274 -206015 -225134 -162424 -55105 -94219 -112848 -101307 -54910 15906 60785
5379 60785 78540 55000 -77166 -59208 -65527 -222590 -249790 -201155 -117398 -97285 -47753 -69504
5367 -69504 -103374 -106466 -95911 -64180 -92373 -57717 -107887 -107101 -123962 -130348 -32233 -9920 144620
5354 144620 126357 35148 2373 -28885 -102887 -142057 -131610 -117389 -26620 113043 47057
5343 47057 -102277 -76407 -64746 -41985 -78782 -163233 -166108 -168270 -244556 -217563 -176373 -113014
5331 -113014 -152323 -53779 -35193 -29873 3428 31033 30114 26242 36104 21446 16933 -54239 -39505
5318 -39505 -47222 -122185 -89874 -62654 -36567 -74870 -95028 -41230 -51804 -9774 59599 48605
5306 48605 47599 36525 31506 57647 53425 -12551 -76059 -70070 -1315 -65913 -160162 -169291 -200339
5293 -200339 -169749 -117018 -116184 -74333 27213 14426 40997 70602 -10463 -100952 -165046 -170201
5281 -170201 -123241 -89364 -150893 -285086 -205305 2412 65364 2504 -8105 58442 58091 -9699
5269 -9699 -40345 35232 122433 157532 174744 144583 50586 -48487 60271 179237 180385 19725
5257 19725 9642 103070 138584 207066 212424 237820 252774 135066 25907 81408 9085 -68874
5245 -68874 -89218 -9195 45552 70680 69466 -26243 -112530 -96565 -49340 -25671 -49017 -127030
5233 -127030 -107580 -76331 -48048 -2089 8806 -31456 -148913 -197241 -179823 -171720 -66928
5222 -66928 -120028 -116896 -83091 -84792 -76689 -172667 -101181 2731 128632 252449 193502 52103
5210 52103 -69310 -125584 -128669 -35657 15969 7212 -2474 31507 34332 24354 -20457 4003 -103842
5197 -103842 -85912 -107100 -165672 -116796 -94677 -134642 -134790 -154836 -141827 -86633 -34346 92799
5185 92799 73654 45169 49282 38259 50347 31826 26329 -45067 -52246 -14968 -65899 -57885 42827
5172 42827 47918 35587 40553 62808 62322 -68266 -142350 -86253 33409 -7131 -36619 -69950
5160 -69950 -86641 -147104 -157620 -85408 1602 30904 26846 -28893 -88276 -118102 -13484 113483
5148 113483 208844 141304 85762 36475 -33835 12351 49571 -6419 57610 54175 36146 130978
5136 130978 142997 100804 43993 -30279 -113421 -145215 -57569 7149 -5025 9272 -96079
5125 -96079 -189085 -241546 -247302 -82641 22537 34890 -6702 -50709 8010 -75254 -138496 -120118
5113 -120118 -174442 -112566 -54844 -25621 -113910 -155829 -225715 -175327 -17890 27228 -13562
5102 -13562 -117191 -135323 -76053 -98995 -16544 -39187 -88993 -111973 -130219 30110 28321 47758
5090 47758 -75939 -128772 -64473 -161324 -202400 -137685 -142717 -59027 -99321 -118908 -167475 -151631
5078 -151631 -111799 -103272 -80154 48086 103447 88766 -33040 -117217 -181885 -208325 -119318
5067 -119318 -76964 26522 54577 11436 -35059 -162437 -82967 -5244 84766 88989 125311
5056 125311 51494 90609 96452 77411 38169 59559 47883 -14221 -24268 19851 42193 48491
5044 48491 83942 89955 24805 33061 82607 -25267 -124695 -77739 -16100 46383 124044 73425
5032 73425 -11001 -64279 -60738 30846 84099 89661 -23651 -116613 -103473 -39676 14565 -57340
5020 -57340 -46471 -81732 -92667 -115916 -69206 -43385 -30092 3727 6374 -64028 -58107 -6408
5008 -6408 10452 2841 85838 72169 -2208 28311 62348 -11660 -8162 56022 79234 67770
4996 67770 29548 -84561 -125209 -90792 -87539 -116133 -206286 -134681 -47930 7443 30227 -31380
4984 -31380 6562 -59761 -143329 -174719 -173762 -74442 -50634 -1616 34153 -22748 -68089 -106262
4972 -106262 -145808 -23248 27086 29468 46933 -26740 -73072 24175 72622 42026 -36155 -45466
4960 -45466 -60763 -73298 -43538 -92634 -42992 -114151 -114770 -39980 -36393 -30202 -82236 -142196 -188939
4947 -188939 -257464 -250238 -152507 9126 35405 -45476 -60766 -37318 -64329 -35448 -28839 37794
4935 37794 45460 -13100 35026 56619 -15214 -59310 32383 1158 -22655 -2228 51777 59821
4923 59821 -23765 -110277 -157608 -61998 20957 35757 58818 39898 -7785 -73471 -116476 -151297
4911 -151297 -45889 -17069 -128396 -163524 -83918 57599 47327 50908 -27107 -16115 7284
4900 7284 -67197 -93172 -117332 -105524 -114007 -107344 -124208 -156001 -107542 -148693 -124235 -148990
4888 -148990 -177425 -111264 1342 67157 -93951 -46117 -45539 -69373 -173736 -129905 -82387
4877 -82387 -37791 -108927 -148891 -107313 -73519 -21934 -17895 -33489 -82210 -141920 -145687 -79485
4865 -79485 -54986 -102938 -146869 -131675 -77009 -141432 -183805 -182322 -162124 -214690 -132639 -135680
4853 -135680 -200697 -201991 -151861 -82005 -68328 -86044 -108166 -88000 43011 7377 -106377
4842 -106377 -129046 -29496 78462 54344 -11055 12489 -14984 -126882 -216077 -214615 -217095 -184924
4830 -184924 -118301 -102765 -114013 -111974 -42718 62980 110676 66034 90225 119181 93785 39122
4818 39122 71439 67496 68766 -3836 -13935 67353 74356 13702 48953 75428 41546 -75616
4806 -75616 -177747 -163545 -119788 -53710 -62332 -10372 41901 31218 32694 -8965 -85232 -128371
4794 -128371 -108657 -82024 -73862 -58422 -2867 -15552 -3536 59581 32677 -4638 67820 119963
4782 119963 145215 111703 177643 163664 157579 120720 81171 43854 -110292 -76592 -32601 5832
4770 5832 47236 70324 -2826 -55216 -85378 -59913 -13639 -10311 3594 67913 -9167 -40053
4758 -40053 -75795 -67221 -65273 -58606 -130450 -101487 -37587 -62456 -155224 -194049 -174796 -261452
4746 -261452 -133599 -29885 1361 19573 37780 114085 152220 62601 -104655 -62434 78613
4735 78613 130436 90351 77231 -23718 -125801 -155299 -110654 -127813 -138953 76153 169914
4724 169914 176231 98545 71855 101980 45685 20919 -18562 -64604 -2783 61004 132568 136271
4712 136271 75026 87295 -142 8034 70552 28171 -4697 -2926 -85534 -163327 -152742 -52248
4700 -52248 -27303 2890 34108 60537 21492 -55830 -89938 -11072 12787 53620 47232 31135
4688 31135 -9369 -10750 1310 77368 92759 225703 166831 28965 -32297 -133436 -204249
4677 -204249 -178596 -132553 -238695 -353660 -259184 -97764 -116208 -158715 -103218 -105012 -108293
4666 -108293 -116491 15148 42167 38488 -11369 -94336 -27957 57780 127928 135884 124958 116516
4654 116516 123078 75023 94900 76521 141384 130970 20149 61465 117653 109459 -96079 -183874
4642 -183874 -94410 3245 -80157 -218205 -230686 -205118 -203488 -79804 93280 128720 131368
4631 131368 147261 140328 96508 110412 6870 -173231 -116351 -54643 -5197 -11855 -3716 21702
4619 21702 40132 -25856 -27874 -7864 40506 78266 108368 16555 -92035 -6918 32454 -53159
4607 -53159 -31935 -76477 -184101 -152471 -133811 -67453 -15661 -98880 -113593 -26783 30860 44923
4595 44923 -38115 -51045 -98973 -76784 -120870 -149867 -204339 -150422 18679 102388 98540 113300
4583 113300 80460 -36985 -57653 -51665 2656 -105222 -105952 -136111 -166780 -140528 -5637 11417
4571 11417 -7750 38796 78229 150633 237662 176828 152868 72492 62217 64215 139947 123192
4559 123192 136132 77735 6304 -63995 -68089 -8638 -49039 -99451 -113860 -138055 -33570 -30369
4547 -30369 -12749 -20937 -43319 -39688 -34938 39820 80159 122907 192412 143974 189484 183917 227970
4534 227970 302562 218289 96374 -10995 -84707 4548 101357 -29174 -159971 -114634 -375
4523 -375 114738 74728 113290 118380 145674 115195 141194 84138 56809 85294 106770 46251
4511 46251 -6704 -127988 -143099 -121338 -76176 -29583 39780 68372 85216 10396 -57721 -129451
4499 -129451 -165192 -96743 -115744 -102059 -31490 -85990 -157294 -66029 -9737 -76842 -40807 -72202
4487 -72202 -10532 79138 152729 152396 120808 53546 6967 17442 29330 13001 -10131 1554
4475 1554 -9088 -119273 -139502 -114109 -35978 39067 86492 87218 67882 6111 549 24777
4463 24777 29969 82178 9014 -45461 -18561 -20304 -110875 -90183 -78385 -140201 -156306 -87414
4451 -87414 -95374 -117218 -2198 103130 113429 102414 94174 23578 -27658 -37532 -11002 42814
4439 42814 -703 3983 -4220 -56734 -83025 -38556 -52229 -8372 97705 30366 -46552 -43531
4427 -43531 -16397 -11482 -84150 -125653 -80441 -76178 -110406 -95478 -100057 -127886 -2587 90168
4415 90168 73470 53098 50108 17547 -57803 -136418 -86508 -20580 -52620 -79630 -133774 -139054
4403 -139054 -132906 -46150 15260 63852 -51897 -58460 -29837 -114243 -108761 -71885 -172731 -161602
4391 -161602 -140370 -65528 -98784 -144635 -117274 -107228 -129131 -140942 -177025 -171094 -101378 21514
4379 21514 -15460 -15860 -53638 -40072 15384 6537 -10187 -76006 -61990 -50535 -87525 -43077
4367 -43077 -27497 -31801 -8247 -53470 -73910 -62933 -25052 -31145 -22057 46156 33611 -59537
4355 -59537 -140886 -30409 -24330 -23400 47708 51895 92571 101824 86412 76826 -40151 -153309
4343 -153309 -153255 -150695 -159324 -94754 62909 97612 140415 140703 127823 76187 48494 -39691 -15474
4330 -15474 13061 4238 67461 49791 -92922 -185010 -104674 -129740 -223014 -220790 -137027 -76913
4318 -76913 -81520 28541 3919 27939 41710 -33434 -100898 -58497 19068 87517 23624 -153224
4306 -153224 -101341 30239 -20752 -119050 -97347 -112036 -112147 -48864 -2396 31178 89843 68545
4294 68545 79190 11056 -13478 -22550 -95081 -117868 -85477 -153994 -197855 -194164 -234914 -240476
4282 -240476 -242237 -135624 -80002 -43736 77418 -24620 -155740 -67168 35603 -40267 -14123
4271 -14123 -46544 -96879 -106708 -110515 -23730 -12176 -70615 -35264 48612 66694 59087 46228
4259 46228 4413 -40327 68138 122304 71192 6146 36893 28646 -3065 -28741 34965 -34532
4247 -34532 -109280 -61825 -38959 -6849 57203 130594 60581 -55943 -96231 15265 59951
4236 59951 -17611 -75020 -86407 -123226 -112199 -156111 -116920 15460 91887 78906 -20907 -15716
4224 -15716 325 -86691 -147281 -106935 -135257 -77782 1972 97261 106319 97951 126816 162245
4212 162245 104472 39063 11498 40866 67501 -4546 -70669 -161978 -155705 -15371 41804 -23943
4200 -23943 -103854 -82281 -144339 -221628 -190304 -68466 -35214 -38740 -183432 -240551 -149713 -125081
4188 -125081 -76671 -104006 -97318 -120490 -103269 -161691 -36984 25695 20786 47777 -13088 -7567
4176 -7567 4905 -74697 -85943 -52418 45079 35003 -60097 -62580 -101302 -166080 -213178 -195389
4164 -195389 -234782 -132633 1735 66367 70804 61482 64358 133588 245084 98603 32589
4153 32589 54399 76541 15854 -19263 -76734 -65649 -10712 76481 43061 -85504 -128699 -71251
4141 -71251 -4225 -62273 -57024 -15074 -5283 -96006 -137382 -143565 -162011 -164635 -61792 -647
4129 -647 4059 18356 -28546 -170242 -217190 -80593 54930 50583 231 16843 -21456 -41325
4117 -41325 -5155 16462 -111698 -104430 15627 -23821 -73565 -68506 1585 -107839 -129857 -112485
4105 -112485 -131618 -94255 67481 55694 8908 -57010 -17866 105877 271527 280094 186856
4094 186856 41209 -26145 -75542 -126817 -53758 48134 34057 -9252 -65247 -69503 -45697
4083 -45697 -88316 -2908 86684 140778 129758 23186 -2865 96420 102063 83081 182014 150896
4071 150896 168376 158644 10257 -23593 35227 4876 20462 19022 14386 17087 -62939 -133432
4059 -133432 -92289 56196 205340 238380 105400 61286 109480 39147 -105371 -106206 -124459
4048 -124459 -59481 -23980 10542 -44331 -39566 18641 15089 8099 57677 15866 -5204 -49596
4036 -49596 -59890 -51578 135254 212918 118731 45109 -86621 -93453 -102985 -78704 6705 44680
4024 44680 -1041 -31434 -65384 -82520 -136211 -143503 -145833 -154384 -136323 -56081 -68886 -183098
4012 -183098 -189285 -171607 -129016 -113070 -120819 -124510 -106386 -116090 -56545 61477 101369 30430
4000 30430 -31309 -61671 -14826 -18176 -49097 -74867 -54525 59968 -8988 -97316 -126069 -63743
3988 -63743 17509 28118 34154 69022 136865 215946 77669 -38595 -29488 -39332 15426 41135
3976 41135 4539 -11992 47637 -24390 -70613 -108367 -68669 -57117 14777 24291 7725 20767
3964 20767 38620 -26850 -32893 -56353 21999 78187 -5445 -47178 26017 80213 68901 79560
3952 79560 43441 92206 17534 -43 24264 84230 -20414 -82183 -75362 -44796 -6046 54456
3940 54456 54227 -63867 -86510 -53890 -111222 -80850 -59651 -97276 -51958 -33702 -136512 -169833
3928 -169833 -93755 -105994 -78486 93151 139210 156307 211407 214378 189284 125145 24142
3917 24142 56082 12560 -39163 -39526 29882 77112 24198 -5899 25951 -28290 -14604 73469
3905 73469 101825 -8390 52566 22418 50293 96053 -14041 -97068 -139894 -212018 -181611
3894 -181611 -146029 -31043 -25948 -30973 -103885 -56756 -97173 -200918 -272905 -207720 -150704 -142218
3882 -142218 -61820 -153342 -232962 -120467 -92879 -66422 -46707 -88559 -87613 -29602 -8735 -25688
3870 -25688 -18155 114936 105168 65482 29958 -31059 -92287 -98671 -136949 -212050 -224106 -235776
3858 -235776 -153930 -136938 -101010 -78460 -86383 -69384 -132447 -237425 -234329 -126061 -65609 -15471
3846 -15471 -9517 -32173 -2713 -7601 -91512 -96273 12991 48133 51334 131156 101351 107755 91278
3833 91278 67880 40078 84566 93476 46869 51184 -42737 -77188 -68470 -88258 -95761 -39702 -34670
3820 -34670 -21574 -14814 45927 136064 62175 44468 -56927 -178589 -96756 -149715 -132591 -39977
3808 -39977 21935 982 -38463 -76656 -131615 -74834 60059 -35084 -7925 -8866 -18360 33193
3796 33193 73276 113171 125894 68096 -10829 -34078 43652 127294 115573 88508 62832 34386
3784 34386 -64000 -161191 -112991 -73157 9874 -33176 -13071 18938 55783 16895 -14348 -34616
3772 -34616 -52813 -79912 -14622 -49548 -80135 -62768 -42753 -12363 -37520 -17895 28305 -66804
3760 -66804 -65702 -85488 3224 76110 4004 85348 139322 177823 190409 191182 27302 -69914
3748 -69914 -25852 37058 -19418 -1947 -12184 -101745 -185856 -231763 -165912 -36810 -65314 -87751
3736 -87751 -30647 77551 178928 210537 127444 -16142 -57616 46125 -1070 15785 94783
3725 94783 90711 14589 2400 -85038 -125285 -9871 13943 44017 30555 -41131 -5134 -110158
3713 -110158 -144367 -58537 -10162 -6061 -87210 -85881 -65313 -45553 -18733 -52479 -395 -35196
3701 -35196 -128127 -102776 -141800 -208273 -172024 -183791 -168682 -114832 56087 71584 73940 70903
3689 70903 73156 -25652 20426 141914 213104 171493 29362 -42224 14145 87988 34655 -5373
3677 -5373 30433 55210 23810 83432 144148 182276 186917 164377 80456 110035 105374 -2100
3665 -2100 17792 -4508 18143 -47291 -57753 -10304 56036 36389 114547 46077 -39768 -62474
3653 -62474 51068 120328 104598 77205 33620 3133 -27424 -43639 -65362 -12772 2673 37790
3641 37790 63590 127901 152723 52285 -30944 -118045 -155419 -126566 -72681 -59753 -18615 57764
3629 57764 158962 180870 144517 183710 198334 99709 15978 1114 17017 49979 -34759 -139592
3617 -139592 -131218 8749 -28144 -65653 -58017 -51085 20107 -88294 -73602 -21958 89862 18313
3605 18313 -44059 -63395 -8638 -48357 -35448 -91827 -87225 -70404 -24159 5955 87717 67698
3593 67698 46849 48820 20308 25086 4587 -43845 -118362 -159170 -89102 -25860 -50979 -89910
3581 -89910 -101291 -98355 -188461 -247230 -312015 -251370 -96142 -43797 -13057 29054 160560 118179
3569 118179 18339 -164442 -143361 23407 109171 129682 117302 56614 105379 48809 48955 20267
3557 20267 -73621 -146018 -178862 -200406 -140915 -89185 -25671 101549 171093 64129 61066 84129
3545 84129 65621 50630 52418 48526 30227 -11931 31498 11210 -84428 -70418 -67949 -24306
3533 -24306 77266 58785 37912 94459 198092 183417 185675 219821 192559 185183 76667 7291
3521 7291 -6622 -126891 -156446 -102879 21989 72908 62591 8782 -24359 -53918 -103478 -71502
3509 -71502 -3461 -126200 -98265 -35322 -9687 -3718 70470 29299 11689 -8892 5579 -42489
3497 -42489 -68657 -9908 -10810 -52212 -22696 -3009 37549 -55051 -103611 -132831 -48505 -10935
3485 -10935 -30726 11013 -69263 -60608 -78073 9015 44556 158662 264027 196847 114547 140191
3473 140191 81419 10891 -46951 -32799 -40301 -4171 -17333 -2200 -99403 -159271 -97941 -57216
3461 -57216 72551 130264 28002 -10718 44776 32130 49868 126500 93362 51229 87398
3450 87398 67957 44658 47972 104985 61618 91769 -17412 -85486 -119694 -90223 -22204 -34654
3438 -34654 -31156 -63991 -46986 28656 -4901 8782 1536 31614 20078 28999 24100 -53265 -26451
3425 -26451 64480 123884 127025 113900 20364 38989 -7599 -13140 19038 93739 107111 30369
3413 30369 7165 70378 -2763 -74129 -142383 -158953 -215567 -215028 -83251 -8822 -36275 8537
3401 8537 78854 121976 100779 135914 31556 26487 6517 25791 55226 85557 141581 142108
3389 142108 128797 92934 76332 106242 187015 140057 31799 -81536 -41740 -12266 -43436
3378 -43436 -46027 -68281 -179129 -123516 1769 56958 11441 -27885 -40213 15411 23127 -141602
3366 -141602 -156894 -55716 -24593 -24690 -59413 -131235 -200649 -220813 -116931 -81918 -93001 -47319
3354 -47319 -314 -67055 -101860 21653 20076 -46706 -34014 -57210 -162849 -171080 -55613 -44660
3342 -44660 5248 16495 -20347 6854 92560 207581 163924 138099 97776 47580 52313 39376
3330 39376 -45673 -159025 -139349 -130195 -60142 17901 34713 116058 99867 8319 -41547 -52153
3318 -52153 -65758 -90796 -146344 -67919 34983 9844 -41227 51686 101162 143849 102936 32098
3306 32098 69670 -21062 -83899 -39282 14870 77045 5861 -96172 -131880 -161367 -162877 -31415
3294 -31415 40169 -84766 -192794 -146279 -33055 -36529 -42498 -119569 -215185 -136843 -85650 -94123
3282 -94123 -82740 -80832 -45806 -39017 -3606 10999 68567 102231 69818 53729 61109 105377
3270 105377 107996 -51808 -23535 2333 -8234 49777 60603 175466 164530 115081 66208
3259 66208 63511 75460 166663 125858 76354 19454 -91021 -72101 -47803 -1749 47775 98827
3247 98827 235116 293848 182375 51022 70494 151358 168093 178017 170147 115179 52682 -10881
3235 -10881 -118737 -94493 -137270 -151461 -106223 -127238 -88466 -169616 -190467 -112058 -56537 -13055
3223 -13055 -74203 -51592 -85669 -153028 -217 29238 48506 88096 -7204 -128005 -116988
3212 -116988 -2467 78265 24807 -72033 -48189 -1495 -792 -12080 95532 145828 137638 181522
3200 181522 205933 160033 78116 20542 -70795 -92428 -102117 -107131 -94687 -24418 107852 134270
3188 134270 19057 25539 66279 118581 86276 110231 46609 119881 212998 129258 168460 165339
3176 165339 21878 -107537 -185126 -217812 -179170 -48129 -19264 1786 -23174 -13615 -11137
3165 -11137 -47054 54003 76900 37170 25864 52154 68307 -24776 -101782 -88694 116245
3154 116245 171957 66043 48851 -11976 36189 44555 6991 17773 53204 53605 -59131 -40351
3142 -40351 127048 232673 152209 72238 69341 53402 63671 118062 110449 119391 91343 54130
3130 54130 -15912 -49273 -70267 11339 -89348 -117544 -15679 -10249 -123631 -233076 -184938
3119 -184938 -139937 -72536 -26678 -61446 -58137 -103912 -77166 -69798 -70467 -48771 -8975 20322
3107 20322 23427 -10296 -48703 -44794 -25368 24743 55515 -27409 -41025 13426 -48750 -102428
3095 -102428 -79407 -43868 -34546 -40855 -127613 -56131 103015 111356 31224 -51288 -16417 -30298
3083 -30298 51564 58319 124325 131468 174257 273053 170243 183049 123906 36285 -842 -13462
3071 -13462 -40681 -29937 -107235 -184537 -105886 34983 50978 77583 140696 116300 82822 12195
3059 12195 -2072 -8745 3414 9037 68435 80635 24635 -16512 7837 109692 122979 83006
3047 83006 30851 -29870 -71660 86783 191140 85435 63819 121033 76422 50893 -1238
3036 -1238 100130 305110 228695 76275 -58915 -115487 -51938 -138831 -115070 -64397 -28077
3025 -28077 -20134 60250 26343 -113393 -129486 -4538 113584 78575 -49083 -51910 -126788
3014 -126788 -91751 -43459 -83352 -126589 -125042 -217789 -239634 -165677 -31612 -9636 -28233 -15535
3002 -15535 8309 48784 33381 -65309 63866 73962 -3403 -52863 47623 63319 -26536
2991 -26536 -57963 -105994 -36649 154244 194951 83524 29384 30712 -8966 28124 56707 23002
2979 23002 15369 23082 2637 -44742 -12568 62771 22177 -84136 -154306 -157106 -99720 -135321
2967 -135321 -72708 -3168 10527 -87051 -61568 63661 94071 70841 8809 73476 125768
2956 125768 152787 190942 70395 40833 47813 68418 66149 62763 10843 -66052 41931 79600
2944 79600 22030 145293 141782 104846 75891 68202 23905 -17269 -2899 -27234 -95198 -123766
2932 -123766 -59582 -37408 -6847 31595 13777 -34392 -58556 3803 84989 87942 81302 7129
2920 7129 -91072 -29347 -16076 30795 47323 93671 -2199 -65757 -17897 37335 -11083 -28668
2908 -28668 -7669 9152 44098 109191 97922 61634 39216 -86783 -145664 -75028 -115604 -165372
2896 -165372 -161026 -69615 39960 60299 115017 43236 -71373 -211510 -208408 -191639 -98716
2885 -98716 -157991 -201451 -144803 999 89346 9957 -34739 -79029 -72406 -7581 -847 103619
2873 103619 132105 74831 -14730 -70867 -65812 -116044 -114568 -79497 -105484 -116609 -122468 -36703
2861 -36703 47892 49843 -9276 46054 94505 -18024 -81921 -74380 -97874 -13838 -52242 -115142
2849 -115142 -107079 -66847 -93392 21956 109987 61075 43712 59077 38517 84757 41249 53579
2837 53579 -23130 -87753 -5689 75481 144222 186660 118197 104046 54452 -9375 -27653 -65260
2825 -65260 21724 137445 76472 60441 107280 102405 -20211 16294 101008 32052 -94532
2814 -94532 -155829 -198572 -134025 -168338 -139923 -76128 -80833 -113069 -40573 -47913 -26326 21903
2802 21903 49795 56246 89012 104719 -5549 -24248 -35100 -61630 -18102 48127 82593 -20505
2790 -20505 -24287 37096 -16820 -90726 12373 38076 81482 127747 171466 113741 33375 65871
2778 65871 34001 -3321 1885 57109 -12133 -18513 -40521 -84957 -29005 20023 -9153 62879
2766 62879 107562 61003 -2377 -14955 7492 -14217 -46663 -48267 -41594 -4823 -16760 -68542
2754 -68542 -54539 -70567 -87617 -25182 11551 43117 90119 9134 -82601 -76249 -48964 36855
2742 36855 87602 56655 13170 -71653 -64443 69002 182971 232911 130882 7779 93
2731 93 -13018 -38020 -19835 51613 -10168 13556 -23341 -57782 -54497 1013 -34622 -104732 -124759
2718 -124759 -143803 -142709 -139607 -92377 46844 119266 72622 -3366 -21794 -73906 -72572 4906
2706 4906 -73129 -103921 -41800 6038 -46236 -146709 -191444 -141130 -85114 -111646 -175972 -205588
2694 -205588 -320146 -323445 -182422 -75107 -8306 30577 83083 100935 -3958 34555 52771
2683 52771 24414 23978 13441 -22462 -75038 -106266 -46050 26869 67327 17728 -37719 -42909
2671 -42909 -60492 -31866 167972 189310 84395 -52748 -36565 -63086 -27802 9567 53618
2660 53618 41821 21178 -20354 -40337 22589 -55814 -131767 -72466 -33753 16830 -21398 -35323
2648 -35323 -19090 24732 49974 23225 -4138 -29496 -27828 -33218 -13224 107275 46574 -49115
2636 -49115 -73393 27297 86316 88603 119609 192221 159445 57737 92078 86662 -22484 -154572
2624 -154572 -32454 15801 -38691 -79638 -136473 -96589 -71496 -152177 -73612 -17080 -131112
2613 -131112 -144401 -28536 -62697 -118043 -163705 -213332 -120564 -45324 -25500 102680 232908
2602 232908 208237 107699 -26 1431 72687 111870 140753 118693 -40389 -141863 -115458
2591 -115458 -99702 -136531 -105099 -47025 -103054 -62471 70210 56677 49730 136396 157345 168590
2579 168590 152450 128656 77031 14460 10997 58742 12759 -18427 -9048 -78223 -44207 -65283
2567 -65283 -49801 2306 9564 -97019 -106706 -56204 17723 67069 82245 66419 -991 -42656
2555 -42656 -14467 6722 62610 68118 72162 81054 167270 109179 95189 130967 160010 205469
2543 205469 153198 108632 15307 -10492 -37583 -25703 19210 73607 153961 121398 114841 143063
2531 143063 133971 107387 37624 104623 134733 97840 84814 17186 15167 78275 88968 126218
2519 126218 67281 -62176 -100971 -88936 -102161 4743 26028 -82102 -121628 -95247 16759
2508 16759 103565 -10552 40011 151189 161587 218946 142818 115656 146389 166396 220559
2497 220559 129985 127362 212315 293051 267054 190740 195436 169238 111676 44504 -13567 80994
2485 80994 98169 33168 96687 93742 -49052 -73151 -52622 -39761 18064 -54813 -59165 -24510
2473 -24510 33001 67379 65474 127669 70282 -20520 13289 32390 10632 43739 -86019 -92955
2461 -92955 23110 112528 94548 32487 -27119 -101688 -30531 50053 100043 108089 26687 -14152
2449 -14152 -15750 16201 17573 -67869 -128653 -213132 -195483 -69103 38573 14258 -18141 451
2437 451 4799 -74122 -66394 -30643 54566 21158 -75998 -166360 -208426 -168982 -78016 -31439 -56375
2424 -56375 -35791 -12036 33142 140468 150303 162736 135773 78844 42455 101431 111371 88044
2412 88044 22999 6974 48502 102870 102815 55128 136916 203553 131697 16554 12612 -74254
2400 -74254 -84457 40719 -1573 48060 54376 54979 57679 77792 66464 13713 -6673 -34717
2388 -34717 103830 114117 -20238 -25165 -21683 -38634 -18364 -52393 -107111 -35052 -62518 -146256
2376 -146256 -176602 -219719 -130591 -61675 -112059 -161590 -106280 -84262 -188631 -125100 -154096
2365 -154096 -168828 -203991 -109851 -75295 -131288 -126955 -67261 -115130 -111576 -102865 17557 29501
2353 29501 30667 164042 182424 157745 51988 -31137 -59872 -42971 -42529 -34504 -47278 -9491
2341 -9491 57246 -32545 -85429 -38422 -35234 8180 5779 -46183 -131682 -134602 -254405 -191424
2329 -191424 -89759 19476 58532 -18418 -66900 -142704 -26282 46884 113104 36845 -47501
2318 -47501 -81589 -50492 -583 72739 148796 80839 55896 64917 -47087 -75505 65763 34058
2306 34058 57323 144653 22967 -84774 -5813 -42907 -91806 -56664 -70859 -25834 83867
2295 83867 6592 -1002 33983 42092 14833 -51471 -110417 -130658 -149628 -186377 -168446 -147389
2283 -147389 -43181 82120 33919 45675 22383 17303 -1442 33081 78029 -21194 -161584
2272 -161584 -60851 -46924 -12174 59217 119163 29426 -11442 2481 -31520 -54197 -18635
2261 -18635 -32398 -62309 -72124 61768 96290 64920 21464 -911 18995 -21222 -67879 -111782
2249 -111782 -41181 -72916 20108 89172 33619 -23522 26928 52507 7189 -7543 22276 -51986
2237 -51986 -59736 -15064 4264 31262 -4380 -60677 1779 40650 -26354 -14975 -55655 -95981
2225 -95981 -95988 -138792 -161814 -155478 -88592 -34713 -512 -12138 -30809 7270 18206 76815 69696
2212 69696 -17162 -8370 14488 30705 -38059 -121889 -107638 -99344 -130626 -47608 -3752 22391
2200 22391 48622 46106 64225 38775 -67652 -108273 -106234 -95865 -54526 -17313 -88992 -161600
2188 -161600 -149080 -130143 -89197 -54107 -13612 -34657 -43789 -43659 -36058 -69386 -17504 5600
2176 5600 -23976 -78046 -58792 130927 184896 85002 3490 -37097 -24465 -16231 19931 81466
2164 81466 9153 -38076 -4821 -59630 -71955 17158 127884 102369 114324 117330 -42913 -130771
2152 -130771 -62465 -64052 -18791 -34758 -19721 154752 199419 52413 -24840 -79699 -43057
2141 -43057 71963 116821 57943 32433 52276 94527 58977 24365 -50547 -29798 -2318 80347
2129 80347 204419 207515 150806 145287 71561 3103 59795 35602 47159 152727 113739 117150
2117 117150 150120 153068 158572 133405 128431 71009 57057 108062 174128 266594 222245 43240
2105 43240 -67873 -81503 -95342 -102545 -68244 -143145 -172215 -127971 -42716 -70114 -64107 5858
2093 5858 22626 32904 23606 63010 28027 -71239 -66763 31363 43021 36708 170814 276866
2081 276866 151633 76960 43007 13912 3030 34980 61037 -41959 -6823 -15916 -65900
2070 -65900 -111603 -87142 36276 45441 76133 93273 5877 -5433 127640 111231 23004 21518
2058 21518 27353 -60106 49733 36780 -77913 -64086 -40046 48709 -39988 -83018 -51514 10274
2046 10274 -21155 -120459 -82977 -84343 -71396 -38917 90367 144027 112325 -26112 -102758 -72803
2034 -72803 -73740 -101773 -115004 -65998 8193 75657 93272 92330 41398 58637 -82301 -84066 77063
2021 77063 105020 100461 27355 -10786 -122772 -146769 -51840 -104644 -176954 -33669 71198
2010 71198 133300 -10512 -43354 -33554 -64777 -53948 -64093 15804 117697 30913 -52089 -42835
1998 -42835 -13853 -66253 -33765 92960 181181 109905 74392 39829 51970 90167 105683 197435
1986 197435 170565 122157 173513 80716 135553 174501 161487 162835 152777 130413 168686 50477
1974 50477 -102556 -80136 -36890 76691 26952 -107591 -116402 -109439 -28193 45160 65954 114123
1962 114123 98879 -10480 -85064 -214839 -240644 -211713 -41584 3023 -3473 -107830 -259516
1951 -259516 -292708 -228730 -78268 -71246 -133399 -146509 -113248 -92803 -55117 -110544 -13567 -37461
1939 -37461 -49780 -72312 -92286 -104268 -127618 -160956 -198124 -46267 44904 143196 193700 189662
1927 189662 147089 124239 49010 9254 -84391 -122311 -123973 -34699 50882 -33060 -97911 -34248
1915 -34248 -86304 -31159 19569 -31216 -75002 -81102 -91140 -22444 -783 -2118 -34997 4413
1903 4413 -18439 2346 4229 28670 37863 48251 43935 83928 68998 109832 121273 71146 -7825
1890 -7825 -43076 -123192 -182497 -152358 -162579 -105093 -56514 -48151 55956 181201 161702 101627
1878 101627 119701 149065 118578 -8190 -123478 -115323 -4113 19697 25004 41021 -5241
1867 -5241 46648 110739 55788 11752 -58729 -122563 -7728 39825 -28688 -93549 -117327 -79612
1855 -79612 -43677 -24354 -42316 -21121 -17048 36093 -10072 -46473 -38077 -65879 -34247 21082
1843 21082 -31529 -32745 -19943 -102487 -164630 -70679 -102118 -205281 -171433 -60354 -20225 -47396
1831 -47396 26999 -31761 -92757 -207520 -377861 -314943 -138607 47546 180750 159499 81617
1820 81617 89821 194767 109027 19133 30841 36995 -32043 -142 38000 -20087 -2785 87484
1808 87484 123042 -6954 44166 91443 131465 94857 102244 2254 51009 108083 87020 51749
1796 51749 36817 111894 94810 55939 27787 52908 24013 23014 -41887 -61253 -189 83349
1784 83349 23537 -14187 -26034 -78834 -109529 -67949 -65955 -37202 -24744 -67072 -122899 -124417
1772 -124417 -132750 -48798 -40065 -30222 -28078 12627 -11846 -13420 91799 59761 105009 134836
1760 134836 108114 134043 141892 48950 148092 226719 107528 35023 52078 74369 96073 109773
1748 109773 127354 96812 21170 30219 15476 19 -39709 -77420 -125388 -149644 -259031 -308290
1736 -308290 -231482 -103874 -50394 -46312 -53064 18760 34131 -68556 -158411 -80268 -72357 -3776
1724 -3776 48892 98351 14476 -14426 -28817 5191 30844 -10675 153297 122930 138163 81707
1712 81707 31516 -83790 -118429 -16514 -13436 -37393 -41730 -24565 -126518 -106157 -104264 -166361
1700 -166361 -98715 -20917 -4609 -67679 -52768 -26513 -19671 -23285 -48292 17022 99368 73598
1688 73598 62880 39800 -42785 -34174 -2962 -46461 -62343 19693 -5850 33535 77705 109848
1676 109848 -29050 -118666 -72951 -69558 -77070 -157733 -104170 2260 -46133 -122094 -77417 26585
1664 26585 69704 56715 -43091 -20197 -19727 -29990 11548 29508 44419 10438 -101120 -78973
1652 -78973 -112412 -106436 -39703 -4167 -31038 -54347 -33939 127839 102133 17307 -56634 -83200
1640 -83200 -120072 -153352 -142039 -189645 -137702 -57552 -70586 -9552 64395 50347 1220 19547
1628 19547 91301 136404 89099 46354 24793 38462 12527 19071 -33651 28658 24007 39234
1616 39234 85357 12687 -37476 -77367 -147781 -126619 -98213 -4565 40275 20531 53188 110604
1604 110604 144182 104542 121485 153935 74465 -16595 -35534 14537 4682 21026 -38247 -44226
1592 -44226 -122526 -138069 -103296 -82916 -70512 18068 4388 -20243 24492 113968 186120 172582
1580 172582 105366 91285 -20875 -71296 -111065 -111155 -97043 -50561 -107502 -76311 -30351 615
1568 615 9565 -66605 -109098 -91319 -84401 -108794 -63525 25348 27540 49547 88716 55444 71374
1555 71374 92494 113215 105955 66232 34562 -1920 -40884 -24864 -12285 -48372 -20349 54997
1543 54997 46512 73993 102845 71195 24865 -8428 -24775 -6803 -52377 2463 5744 44569
1531 44569 92969 28498 3879 -48883 -107740 -59176 -16374 60387 159764 174257 118659 68895
1519 68895 98032 30923 -39091 -114901 -52961 -90671 -140543 -213299 -238972 -162607 -125774 -181016
1507 -181016 -131267 -33790 46696 -83282 -144194 -200696 -182519 -109433 -6839 54570 72968
1496 72968 11102 53575 49752 -31644 -26319 -4608 31876 73519 79753 4564 -55476 -39415
1484 -39415 100715 107993 65072 56857 30181 36277 -48883 -101404 -82755 -69723 60940 40183
1472 40183 -9546 99108 77252 1575 81736 17905 -37235 -221802 -136946 -168520 -181323
1461 -181323 -126463 -9028 77339 89412 -50633 -179568 -304332 -254762 -207310 -111280 -54530
1450 -54530 9889 58350 138360 156752 168462 120760 107098 9424 -36314 23214 59026 71034
1438 71034 88357 56651 25843 54614 73787 10830 -101789 -53609 -22614 -96772 -93696 -136433
1426 -136433 -163444 -113620 -58517 -82685 26790 75466 -40637 -121296 4067 174208 175575
1415 175575 89740 41150 83645 50013 32343 71464 148782 130175 106709 88011 112642 159553
1403 159553 95950 24436 -3589 63484 150979 126006 184729 185607 73439 107625 84009 -7387
1391 -7387 -59624 -5620 44742 96242 70760 19765 41932 117002 131113 240090 258786 158156
1379 158156 74470 109932 166054 118485 115740 87698 39221 48792 -1801 -80679 -56626 -1882
1367 -1882 18029 71812 80176 48150 -17445 -57125 -80655 5951 68256 92088 104139 82596
1355 82596 65170 104792 94658 79794 21075 3867 63453 158235 136735 35335 121268 154498
1343 154498 104850 90408 14619 -28403 -71771 -56484 45442 122705 83538 59498 -26650
1332 -26650 -136980 -150677 -80871 -22709 22267 55302 3038 -89674 -34995 -47217 -132377 -121155
1320 -121155 -19030 55658 117234 61504 21616 74287 121768 132859 77816 9555 43064
1309 43064 22662 -14288 -47810 -30508 -79811 -122152 -51421 -34198 -48371 -89477 -100451 -77147
1297 -77147 16461 -7243 -70523 -24303 -54299 -88658 -42343 -46260 -91438 9970 71182 52740
1285 52740 50067 58666 8888 -9407 -8223 54423 88785 51433 -33196 48523 77828 101760
1273 101760 112513 62538 89146 65349 42242 22838 31743 76617 91383 59235 -12200 -11029
1261 -11029 14248 117921 161664 63608 76711 88573 136790 162882 148273 123794 137410 177918
1249 177918 80797 38881 2658 68448 23747 12499 102370 113596 -24782 -79194 -35354
1238 -35354 1847 -5008 -44449 -87529 -71757 -36647 -86034 -36078 42736 26247 -104942 -196744
1226 -196744 -158639 -19895 142965 7243 -48751 -25752 -10199 58989 99891 126049 156036
1215 156036 203801 209479 161070 147758 158549 125960 84054 140731 104469 149807 177595 151157
1203 151157 204331 146890 150047 224940 219386 169862 25857 -24312 -19477 -42500 -49838 -104452
1191 -104452 -4088 140980 169145 155096 151112 163688 190231 267949 422900 460719 334692
1180 334692 283347 231585 172676 107694 104733 116909 193596 180704 172567 195438 85792 -83781
1168 -83781 -31272 4544 274 -1918 -63291 -143733 -130553 -56699 30562 -81420 -110071 -50747
1156 -50747 9270 57473 52083 94730 65969 74789 108988 112792 25746 96235 40815 75307
1144 75307 154345 74027 24931 55915 18999 17607 1204 7345 31813 14828 -6140 -23708
1132 -23708 -30206 -57227 37389 125076 92382 100665 133189 87380 40383 -332 80532 109215
1120 109215 160242 130866 19569 27541 84113 41880 29658 75451 33475 -47263 -91442 -100187
1108 -100187 -37133 77752 95000 138294 70036 91016 91069 100461 72592 9970 -62215 16447
1096 16447 9125 -16304 23204 110478 131204 139305 37071 -44924 -86401 -128370 -68576 26728
1084 26728 -16306 -12705 -45564 -44702 64703 42437 67927 99326 142207 166755 78984 -22126
1072 -22126 22246 98570 16824 27875 -11946 36120 30785 -40569 52784 44559 22835 72591
1060 72591 60621 -44298 -97560 -118286 -127084 -6738 109809 91878 78076 115616 91075
1049 91075 142356 199739 223053 230317 113510 27515 18924 -20639 -2463 42429 -27503 -97174
1037 -97174 -135502 -81764 -76011 -69048 -77177 7306 58577 90924 73204 66131 84107 92629 167459
1024 167459 127865 52919 41940 54867 54903 -98688 -102603 -74478 -44903 -31656 7225 78717
1012 78717 81291 36123 17552 5443 -56119 -23014 66516 162769 228377 209180 106211 66839
1000 66839 100735 100568 22440 -39380 -24327 -6631 59175 -6850 36372 196964 310999 215670
988 215670 -1779 -74824 -86834 -84189 23978 102943 106218 110978 101917 80474 35195 -104451
976 -104451 -141670 -105200 -117516 -86913 121 14795 69849 119560 55755 12820 29653 -60566
964 -60566 -132029 -72212 10683 75867 112626 43172 68951 107063 173822 90339 23163 -38359
952 -38359 -147867 -58155 36171 89586 101258 217108 156605 165533 196129 172456 24269 -61795
940 -61795 81303 235992 187666 69800 -27990 16534 74214 90187 121697 84155 92095 88741
928 88741 92884 76446 81802 60518 -57530 -112662 -1723 -36359 -125608 -107763 -54937 -55561
916 -55561 -95613 -28294 -71777 15210 38390 48486 91187 44584 -43502 -96098 -62508 27333
904 27333 41848 -53408 -47590 -92252 -130460 -102664 -31167 32710 -33984 -23737 14692 -28489
892 -28489 41742 110413 159431 178013 85719 -55711 -138697 -157543 -245612 -352755 -295988 -251504
880 -251504 -169866 -156969 -117962 -90259 -98404 -72835 -93227 -77448 -43275 12811 91847 9138
868 9138 -13476 48484 56171 47701 40268 -56145 -48592 -13572 14284 104567 95241 96248 115918
855 115918 42710 16098 106539 137668 206380 154828 125411 128770 60309 -30347 -10553 45364
843 45364 163933 231062 142931 21230 -39876 -101969 -11120 44705 105806 47087 -27951 -66576
831 -66576 -35464 -10333 -4290 16798 -43771 17890 79820 75449 -22826 -79907 -75646 -88864 -49592
818 -49592 42438 100510 201547 256141 200233 107477 55897 40375 115552 142475 92678 88070
806 88070 102901 1182 28527 58798 20182 41169 64766 32543 98372 81880 28628 14224
794 14224 -68274 -55249 111364 177035 112738 21790 65852 46230 -64659 -56357 -68118 -40878
782 -40878 67218 99684 92636 10836 -55771 -80591 -53784 -52757 -19492 33648 77524 140406
770 140406 206916 179032 161564 64172 -13414 14261 54361 38256 -55462 4303 68428 -8950
758 -8950 -100877 -146496 -127467 -83037 -88486 -99785 -92536 -76295 -49388 57898 184263 203690
746 203690 105350 -21288 -146149 -66412 39762 -44060 -106827 -106543 -25943 -58581 -34904 32267
734 32267 95943 175150 174079 103472 -25368 8149 -56826 -159954 -69758 -46218 -57568 -130401
722 -130401 -184843 -91144 15037 98009 191763 260923 194729 132218 16954 -66778 -70877 -92266
$$ [...]
##END NTUPLES=NMR SPECTRUM
##END=
