##TITLE=Analysis number 322604
Compound Code btb 05552
Book Reference a+b
Project Code adrs
Chemist Name stores
##JCAMPDX= 6.0         $$ Bruker NMR JCAMP-DX V2.0
##DATA TYPE= NMR SPECTRUM
##DATA CLASS= NTUPLES
##ORIGIN= Bruker BioSpin GmbH
##OWNER= nmr
$$ XWIN-NMR		Version 3.5
$$ Mon Oct  2 10:17:05 2006 GMT Daylight Time (UT+1h)  MAYBRIDGE\nmr@NMR_250MHZ
##.OBSERVE FREQUENCY= 250.131544655141
##.OBSERVE NUCLEUS= ^1H
##.ACQUISITION MODE= SIMULTANEOUS (DQD)
##.ACQUISITION SCHEME= undefined
##.AVERAGES= 16
##.DIGITISER RES= 18
##SPECTROMETER/DATA SYSTEM= dpx250
##.PULSE SEQUENCE= zg30
##.SOLVENT NAME= CDCl3
##.SHIFT REFERENCE= (INTERNAL, CDCl3, 0, 16.522)
##AUDIT TRAIL= $$ (NUMBER, WHEN, WHO, WHERE, WHAT)
$$ ##TITLE= Audit trail, XWIN-NMR		Version 3.5
$$ ##JCAMPDX= 5.01
$$ ##ORIGIN= Bruker BioSpin GmbH
$$ ##OWNER= nmr
$$ C:\u/data/dgb/nmr/ADRS/40/pdata/1/auditp.txt
$$ ##AUDIT TRAIL=  $$ (NUMBER, WHEN, WHO, WHERE, WHAT)
(   1,<2006-10-02 10:16:21.38 +100>,<MAYBRIDGE\nmr>,<NMR_250MHZ>,
      <created by zg, POWCHK disabled, PULCHK disabled
       configuration hash MD5:
       E2 DF 36 D8 04 B2 41 60 5A D7 A3 38 5A 4B D0 FE
       data hash MD5: 64K
       F4 D7 0C D7 E1 15 A6 F7 B1 9F D6 57 3F 89 DC 39>)
(   2,<2006-10-02 10:16:44.07 +100>,<MAYBRIDGE\nmr>,<NMR_250MHZ>,
      <Start of raw data processing
       ef LB = 0.3 FT_mod = 6 PKNL = 1 SI = 32K 
       data hash MD5: 32K
       86 23 5E F9 D3 EF 7A B0 DE F5 91 7C 73 03 64 00>)
(   3,<2006-10-02 10:16:46.30 +100>,<MAYBRIDGE\nmr>,<NMR_250MHZ>,
      <apk 
       data hash MD5: 32K
       DB ED 7C BD AC A2 D7 61 8F CF D2 4B 40 CC F1 36>)
(   4,<2006-10-02 10:16:47.46 +100>,<MAYBRIDGE\nmr>,<NMR_250MHZ>,
      <abs ABSG = 5 
       data hash MD5: 32K
       7B BE 1F 9B 2E 36 C5 39 E4 9C 55 E4 54 12 06 DB>)
$$ ##END=
$$ 
$$ hash MD5
$$ D1 46 DF 46 C6 C4 A1 7F DE D4 D3 F5 5B 0B EB A3
##$RELAX= 
##$RELAX= 
##$RELAX= 
##$RELAX= 
##$RELAX= 
##$RELAX= 
##$RELAX= 
$$ Bruker specific parameters
$$ --------------------------
##$DU= <C:\u>
##$EXPNO= 40
##$NAME= <ADRS>
##$PROCNO= 1
##$TYPE= <nmr>
##$USER= <dgb>
##$AMP= (0..31)
100 100 100 100 100 100 100 100 100 100 100 100 100 100 100 100 100 100 
100 100 100 100 100 100 100 100 100 100 100 100 100 100 
##$AQSEQ= 0
##$AQ_mod= 3
##$AUNM= <au_zg>
##$AUTOPOS= <21 >
##$BF1= 250.13
##$BF2= 250.13
##$BF3= 250.13
##$BF4= 250.13
##$BF5= 500.13
##$BF6= 500.13
##$BF7= 500.13
##$BF8= 500.13
##$BYTORDA= 1
##$CFDGTYP= 0
##$CFRGTYP= 5
##$CHEMSTR= <none>
##$CNST= (0..31)
1 1 145 1 1 1 1 1 1 1 1 1 1 1 1 1 1 1 1 1 1 1 1 1 1 1 1 1 1 1 1 1 
##$CPDPRG= <>
##$CPDPRG1= <>
##$CPDPRG2= <>
##$CPDPRG3= <>
##$CPDPRG4= <mlev>
##$CPDPRG5= <mlev>
##$CPDPRG6= <mlev>
##$CPDPRG7= <mlev>
##$CPDPRG8= <mlev>
##$CPDPRGB= <>
##$CPDPRGT= <>
##$D= (0..31)
0 1 0 0 0 0 0 0 0 0.06 0 0 0 0 0 0 0.0002 0 0 0 0 0 0 0 0 0 0 0 0 0 0 
0 
##$DATE= 1159780578
##$DBL= (0..7)
120 120 120 120 120 120 120 120 
##$DBP= (0..7)
150 150 150 150 150 150 150 150 
##$DBP07= 0
##$DBPNAM0= <>
##$DBPNAM1= <>
$$ [...]
##$SUBNAM7= <"">
##$SUBNAM8= <"">
##$SUBNAM9= <"">
##$SW= 20.6930455092707
##$SWIBOX= (0..15)
0 0 3 0 0 0 0 0 0 0 0 0 0 0 0 0 
##$SW_h= 5175.983436853
##$TD= 65536
##$TD0= 1
##$TE= 296.16
##$TE2= 300
##$TE3= 300
##$TEG= 300
##$TL= (0..7)
0 120 120 120 120 120 120 120 
##$TP= (0..7)
150 150 150 150 150 150 150 150 
##$TP07= 0
##$TPNAME0= <>
##$TPNAME1= <>
##$TPNAME2= <>
##$TPNAME3= <>
##$TPNAME4= <>
##$TPNAME5= <>
##$TPNAME6= <>
##$TPNAME7= <>
##$TPOAL= (0..7)
0.5 0.5 0.5 0.5 0.5 0.5 0.5 0.5 
##$TPOFFS= (0..7)
0 0 0 0 0 0 0 0 
##$TUNHIN= 0
##$TUNHOUT= 0
##$TUNXOUT= 0
##$USERA1= <user>
##$USERA2= <user>
##$USERA3= <user>
##$USERA4= <user>
##$USERA5= <user>
##$V9= 5
##$VALIST= <valist>
##$VCLIST= <CCCCCCCCCCCCCCC>
##$VD= 0
##$VDLIST= <DDDDDDDDDDDDDDD>
##$VPLIST= <PPPPPPPPPPPPPPP>
##$VTLIST= <TTTTTTTTTTTTTTT>
##$WBST= 1024
##$WBSW= 4
##$XGAIN= (0..3)
0 0 0 0 
##$XL= 0
##$YL= 0
##$YMAX_a= 373116
##$YMIN_a= -507954
##$ZGOPTNS= <>
##$ZL1= 120
##$ZL2= 120
##$ZL3= 120
##$ZL4= 120
##$ABSF1= 16.522
##$ABSF2= -4.171173
##$ABSG= 5
##$ABSL= 3
##$ALPHA= 0
##$AQORDER= 0
##$ASSFAC= 0
##$ASSFACI= 0
##$ASSFACX= 0
##$ASSWID= 0
##$AUNMP= <proc_1d>
##$AZFE= 0.1
##$AZFW= 0.1
##$BCFW= 0
##$BC_mod= 0
##$BYTORDP= 0
##$COROFFS= 0
##$CY= 12.5
##$DATMOD= 1
##$DC= 0
##$DFILT= <>
##$DTYPP= 0
##$F1P= 14.0000005364418
##$F2P= -0.99999901652339
##$FCOR= 0.5
##$FTSIZE= 32768
##$FT_mod= 6
##$GAMMA= 0
##$GB= 0
##$INTBC= 1
##$INTSCL= 1
##$ISEN= 128
##$LB= 0.3
##$LEV0= 0
##$LPBIN= 0
##$MAXI= 10000
##$MC2= 0
##$MEAN= 0
##$ME_mod= 0
##$MI= 0
##$NCOEF= 0
##$NC_proc= -4
##$NLEV= 6
##$NOISF1= 0
##$NOISF2= 0
##$NSP= 0
##$NTH_PI= 0
##$NZP= 0
##$OFFSET= 16.522
##$PC= 1
##$PHC0= 157.2293
##$PHC1= 5.759675
##$PH_mod= 1
##$PKNL= yes
##$PPARMOD= 0
##$PSCAL= 4
##$PSIGN= 0
##$REVERSE= no
##$SF= 250.13
##$SI= 32768
##$SIGF1= 0
##$SIGF2= 0
##$SINO= 400
##$SIOLD= 32768
##$SREGLST= <1H.CDCl3>
##$SSB= 0
##$STSI= 32768
##$STSR= 0
##$SW_p= 5175.98343685301
##$SYMM= 0
##$S_DEV= 0
##$TDeff= 65536
##$TDoff= 0
##$TI= <Analysis number 999999
Compound Code 99
Book Reference 9
Project Code 9>
##$TILT= no
##$TM1= 0
##$TM2= 0
##$TOPLEV= 0
##$USERP1= <user>
##$USERP2= <user>
##$USERP3= <user>
##$USERP4= <user>
##$USERP5= <user>
##$WDW= 1
##$XDIM= 32768
##$YMAX_p= 298700866
##$YMIN_p= -665447
$$ End of Bruker specific parameters
$$ ---------------------------------
##NTUPLES= NMR SPECTRUM
##VAR_NAME=  FREQUENCY,     SPECTRUM/REAL,   SPECTRUM/IMAG
##SYMBOL=    X,             R,               I
##VAR_TYPE=  INDEPENDENT,   DEPENDENT,       DEPENDENT
##VAR_FORM=  AFFN,          ASDF,            ASDF
##VAR_DIM=   32768,         32768,           32768
##UNITS=     HZ,            ARBITRARY UNITS, ARBITRARY UNITS
##FACTOR=    0.157963299565203, 1,           1
##FIRST=     4132.6476996994, 0,             0
##LAST=      -1043.33573715361, 0,           0
##MIN=       -1043.33573715361, -665447,     0
##MAX=       4132.6476996994, 298700866,     0
$$ Real data points
##PAGE= N=1
##DATA TABLE= (X++(R..R)), XYDATA
$$ [...]
14378i2108J272r089L4904O2511M0512m6927J7613l8668n589j20119L7575P5262
14366d2851P9887J45263j26128J00472l5808l5647l1615q0069O2524P2757j29220
14355b0435j57583K74581J51751p2041j01286L7413P339k18933r7539m1262j29293
14344c67288R8390K36307o4949l9909p1725j5358J3489q7143N3365P2281L1231
14333a41309K136j35339R122n7135J59852K56047P947j62718o1025p9791N5918
14322a46295O484k9247O2602O15l1556K2158J81946O847o7147k42640l1681K07580
14310f0334J75972J27951r4873N4156j15080j45566r7907p5774L5616P9820J48733
14299C2714j9512q1376K5909L312J58678P2820j96384o5428o7060J8137n905M9571
$$ plain form
14378 -92108 -90836 -99925 -65021 -2510 38002 -8925 8688 -29980 -35569 -155688 -118113 -42851
14366 -42851 37036 182299 56171 156643 120835 85188 53573 -26496 36028 108785 -20435
14355 -20435 -178018 96563 248314 176273 74987 112400 119739 -99194 -196733 -237995 -367288
14344 -367288 -268898 -32591 -97540 -137449 -209174 -224532 -211043 -298186 -244821 -172540 -141309
14333 -141309 -139173 -274512 -265390 -322525 -162673 93374 101321 -61397 -122422 -202213 -146295
14322 -146295 -139811 -169058 -106456 -105841 -137397 -115239 66707 73554 6407 -236233 -267914 -60334
14310 -60334 115638 243589 148716 202872 87792 -57774 -155681 -231455 -195839 -116019 32714
14299 32714 13202 -68174 -42265 -38953 119725 192545 -3839 -69267 -136327 -118190 -124095 -74524
14287g4524m6932K7126J09262M5970q1475p0523J6718J70693O9047j47169M4160
14276F2353K3061m0292m2820j87103j9898L3415m4484m656M2366r4064L3239M4529
14264a94354J00759K6841J2805k2468J1200Q0060Q6478J20035N3106j8848j94361
14253F1253q0924l9604r7398j40277J29975J51297l9484L9155N6379k15808m5016
14242b20452K18297J85256J50267l9241N781j96016j39175J53401J32686O4376
14232C15180k6257K7445o3945j80457q7463j8035q7674J94013J08192j51961k39079
14221b10041K8333J88726l0816J27002M7465j18566R093M1419J04062k6801m3336
14210A16540O8239k43685p2304O8332J06531J15532M7238j14862j26938P7071
$$ plain form
14287 -74524 -121456 -94330 14932 60902 -20573 -91096 -74378 96315 165362 18193 62353
14276 62353 85414 45122 2302 -184801 -204699 -171284 -215768 -220424 -178058 -272122 -238883 -194354
14264 -194354 -93595 -66754 -53949 -76417 -65217 14843 101321 221356 274462 255614 61253
14253 61253 -19671 -59275 -156673 -296950 -166975 -15678 -55162 -16007 40372 -175436 -220452
14242 -220452 -2155 183101 333368 294127 299908 103892 -35283 118118 250804 315180
14232 315180 288923 316368 252423 71966 -15497 -33532 -121206 72807 180999 29038 -210041
14221 -210041 -181708 7018 -23798 103204 150669 32103 41196 82615 186677 159876 116540
14210 116540 184779 -58906 -131210 -62878 43653 159185 206423 91561 -35377 41694
14200D1694L5960r2409K1430j58224Q229N2167J48642P9563L0675N3723k6483
14189A94967k73576r1279N3450J59697j26121k917P23J16056M1648J785k6747
14178D7686J6048L6828j43392j8399r135L5499q6750j34730M4318R4164O2946
14167e4917J1758J79710k7317J38980j21539l20159J7384J6732L49526J67735
14157C57893J35188m2618j70152k33579q5768J13484N4694J34589Q3243j3331
14147C33643j25515P611j4053j57425m7644N2649L5529J6813r6955N8516j64506
14136a01337j3914j6846P4801K57069l4842J40336J54637k30678l1762J6353r6919
14125A16898L9087P626n6233q9242q2367p8400M0221Q6520J30812k5363j25673
$$ plain form
14200 41694 77654 -14755 6675 -151549 -143320 -91153 57489 137052 167727 221450 194967
14189 194967 -78609 -169888 -116438 43259 -82862 -85779 -85056 31000 72648 74433 47686
14178 47686 63734 100562 -42830 -61229 -70364 -34865 -121615 -256345 -212027 -117863 -54917
14167 -54917 -43159 136551 109234 248214 126675 -193484 -176100 -159368 190158 357893
14157 357893 493081 450463 280311 46732 -39036 74448 129142 263731 346974 333643
14147 333643 208128 215739 201686 44261 -3383 49266 84795 101608 4653 63169 -101337
14136 -101337 -115251 -132097 -57296 199773 164931 305267 459904 229226 197464 213817 116898
14125 116898 155985 163611 107378 18136 -64231 -142631 -102410 -15890 114922 89559 -36114
14114c6114l5356L8780k9584N6152N4393M0288k0679l992J15323o7381k13237
14103a01407j20703j3522K95542J56260P4288j55475k36922q5119J14488p4304
14093a46874n6757q0082J07255J71776r8339o2194k5934k5482J37998J55309J48271
14082B24947o6061l6488m4489m3223n5604k1328J28786j16982q1835J16481M9936
14071E4140Q786N9336r3590J635p3678q5761j27651J9868L5361K16568K4388j69834
14059a30432r6583K40966K53899k9098o2855k6610j00351P0335o7480p1423j9592
14048c9224l7953J31259K9190l4002j41887l0954n8011J2697J09916K0106o147
14037d5010J12618n5520M9625q6376Q693q2376Q326r3159P5934J04955M51m73
$$ plain form
14114 -36114 -71470 -32690 -62274 -6122 48271 88559 67880 63888 179211 111830 -101407
14103 -101407 -222110 -235632 59910 216170 290458 134983 -101939 -187058 -72570 -146874
14093 -146874 -203631 -283713 -176458 -4682 -103021 -165215 -191149 -216631 -78633 76676 224947
14082 224947 158886 122398 77909 34686 -20918 -42246 86540 -30442 -112277 4204 54140
14071 54140 62926 122262 28672 30307 -43371 -129132 -256783 -236915 -201554 15014 39402 -130432
14059 -130432 -227015 13951 267850 238752 175897 149287 48936 119271 51791 -19632 -39224
14048 -39224 -77177 54082 83272 49270 -92617 -123571 -181582 -168885 -58969 -38863 -45010
14037 -45010 67608 12088 61713 -24663 -15970 -98346 -90020 -183179 -107245 -2290 -1839 -2312
14025b312o0308J09525Q7927P3283j00609j14395r0112k7395P2100Q4995k8562
14014D137L9003k1846m7738k16908r8716L1014J11775J60268n946J12632Q1502
14003A49177j27645N1301J39823O9808o9039j83621n9823o0878N5865J46897K3544
13992A35409p9342n8784P6172j15801j72934j50152k4874J60695J10035J17882
13982a694J60437J14178J10629k0628j46421l06232j69203K23844J56084o0934
13972F0060q3902J0590j69069m8800J45158J23216j5566K0659J24586q9909m574
13961G2449M4480p6271J42648j13158O1823j11648k00465J2943J48683J7362m1073
13950d2227j68849N980K44203J27708K8797r9974k41059j5874r3022J07039N8241
$$ plain form
14025 -2312 -62620 46905 134832 208115 107506 -6889 -97001 -124396 -52296 32699 4137
14014 4137 43140 21294 -26444 -243352 -342068 -311054 -199279 -39011 -44957 67675 149177
14003 149177 21532 72833 212656 282464 213425 29804 -30019 -90897 -35032 111865 135409
13992 135409 56067 -2717 73455 -42346 -215280 -365432 -390306 -229611 -119576 -1694
13982 -1694 158743 272921 383550 362922 216501 -89731 -258934 -35090 120994 60060
13972 60060 -23842 -13252 -182321 -231121 -85963 37253 21687 42346 166932 77023 72449
13961 72449 116929 40658 183306 70148 131971 20323 -180142 -167199 -18516 -1154 -42227
13950 -42227 -211076 -205096 39107 166815 195612 95638 -145421 -161295 -254317 -147278 -89037
13939h9037m5207j0051l5083N1955R6972K6242N7513o993j69849O4029M2839q3924
13927a00594j31087r9810J06333m718J3565J39974J67243O4074M4157p7353M2742
13916A64526N5569j6958j56243n8659P8993J18671N1629j15338j32542M6396L7596
13905G3640n6787j65959j32584L2290K32372O8689j53786k06546J41596J49932
13895a7143O1317l0065j63744L9611j0575j06424J27763L54611j30587m1939J1421
13884I4246j87932m807j0219J01339R6977m235N1615k6480k19574r5635K35597
13873C0892p1292j6168r9232j4198j08274J20250K28963L5594J7009j08076Q659
13862B4127N685J70995L792p9679r926j1259j6118J49299P603r2642n3042j26381
$$ plain form
13939 -89037 -134244 -144295 -179378 -127423 -30451 -4209 53304 46311 -123538 -59509 -16670 -100594
13927 -100594 -231681 -331491 -225158 -229876 -216311 -76337 90906 154980 199137 121784 164526
13916 164526 220095 203137 46894 -11765 67228 185899 237528 122190 -10352 36044 73640
13905 73640 16853 -149106 -281690 -249400 -17028 51661 -102125 -308671 -167075 -17143
13895 -17143 44174 14109 -149635 -110024 -120599 -227023 -99260 255351 124764 82825 94246
13884 94246 -93686 -98493 -108712 -7373 89604 85369 136984 110504 -109070 -204705 30892
13873 30892 -40400 -56568 -155800 -169998 -278272 -158022 70941 106535 123544 15468 24127
13862 24127 29812 200807 204599 124920 114994 103735 87617 236916 244519 151877 98835 -27546
13850b7546m4327J72469K31230m3397j70668j04067j29151N5235l1367k54p4912
13839a66755p1083n9082J10911K54084Q0900j4282O4562J73648o3915j77329O946
13828A38605K6360j40783m9730r0211M1901p6204j2671J65378J03519q5626k80010
13817b59472K4740J423J8942l9111k6962K40132J14834J93254n4501j04973j13139
13806d833j68715Q0782M1960q3366M9602J50184n6501K8614o0957j05273O1549
13795f6954P2362K13470K44Q206l2594j60619J0635m4027j72411q8911q334j6166
13783b85099m496Q4459N1631K4947P401o6700j2995J24887K36309L5953J6815
13772B13112j24143q8160n0408n3485P0329m5023k6460K4289M1707q1832J6580
$$ plain form
13850 -27546 -71873 100596 331826 288429 117761 13694 -115457 -60222 -91589 -91843 -166755
13839 -166755 -237838 -296920 -186009 68075 148975 134693 199255 372903 308988 131659 138605
13828 138605 164965 24182 -25548 -115759 -73858 -150062 -162733 2645 106164 20538 -259472
13817 -259472 -234732 -233309 -214367 -253478 -280440 -40308 74526 267780 213279 108306 -4833
13806 -4833 -173548 -92766 -50806 -134172 -84570 65614 9113 37727 -23230 -128503 -66954
13795 -66954 5408 218878 219122 227328 194734 34115 44750 723 -171688 -260599 -268933 -285099
13783 -285099 -289595 -205136 -153505 -128558 -121157 -187857 -200852 -75965 160344 196297 213112
13772 213112 88969 809 -49599 -103084 -32755 -77778 -104238 -79949 -38242 -120074 -103494
13761a03494J33848J8555K9058q1494n4940J51493j210j86008l6258N8733n3431
13750a25148k13094L3558J54956J44802J43088j73727j86941l0548L7085J1207
13740b04762N7438j16328O0110K53557l0532k3185J09328R9242M24J9281j21097
13729A03476J09407M7705r0865j25179j68725N0678J87214m3224j5003J00651
13719A56135J6161K959j16896l0310K1562J65685j01910k15766p7995K23533J11829
13708A54987p4076r6522K3619J04196M7186L3282n6661r859M6656o4830Q551O2079
13696A78608j54119Q942O060L1610O1653l9396R4923m9903K8229Q6155M5366J29604
13684D27732j46058j16469n76j1733k03840j05627K2635N7548M0238N4920m7234
$$ plain form
13761 -103494 30354 48909 77967 -3527 -58467 93026 91816 -94192 -130450 -71717 -125148
13750 -125148 -338242 -304684 -149728 -4926 138162 -35565 -222506 -253054 -215969 -204762
13740 -204762 -147324 -263652 -203542 50015 19483 -3702 105626 204868 205292 224573 103476
13729 103476 212883 260588 169723 44544 -124181 -73503 113711 70487 55484 156135
13719 156135 172296 175255 58359 28049 49611 215296 113386 -102380 -180375 43158 154987
13708 154987 80911 -15611 8008 112204 159390 192672 136011 126152 172808 107978 116529 178608
13696 178608 24489 33431 39491 71101 132754 93358 188281 138378 166607 252762 298128 427732
13684 427732 281674 165205 164629 152896 -50944 -156571 -133936 -76388 -36150 18770 -28464
13673b8464J3477k3754M7775P7284K7446J0043K9084n9559j6961O6127L6597j12555
13661F6540j74413j11Q5441N0572r9838j62956m2763R2533J29237R853q1730K4311
13649a03324J42813K49997o308m0656j35139j4215J01599j93079p4539j7851Q0991
13638i711n6123J5469j04736k7387J8966J06252n187j6660m7269j13273k3905
13627b63564J21532J97192J7111l01083k6593M1225O2186J20568l7865J2837L7670
13616a8784k1910J67621r3881k02810j1001M1102M421j63203J81240Q573o3723
13605a72355N6260j15176R3291J86045j24731j01820o946J16047O0025J33486
13595A24126L7841o2579J16827N4821l1748j21822q0469O9294R858k03253k28388
$$ plain form
13673 -28464 -14987 -38741 9034 86318 113764 123807 152891 93332 76371 142498 179095 66540
13661 66540 -107873 -107984 -22543 28029 -71809 -234765 -277528 -184995 -55758 -45905 -127635 -103324
13649 -103324 39489 289486 283178 242522 107383 93168 194767 1688 -72851 -90702 -9711
13638 -9711 -65834 -50365 -155101 -182488 -163522 -57270 -62457 -79117 -126386 -239659 -263564
13627 -263564 -142032 55160 72271 -228812 -255405 -214180 -151994 -31426 -69291 -56454 -18784
13616 -18784 -40694 126927 33046 -169764 -180765 -139663 -135242 -298445 -117205 -108632 -172355
13605 -172355 -116095 -231271 -137980 48065 -76666 -178486 -185432 -69385 -9360 124126
13595 124126 161967 99388 216215 271036 239288 117466 36997 106291 116149 -87104 -315492
13584c15492M6562J97046r0800j38097P3150N0997p7887L5920Q3496O4540L7521
13573c3044O6531J1568J6362p669J06117l4695l2191j45720q2044l5806n2843
13562b23434J28519M4516R8345p9195j5012l3591J5449K1195L2933O182K3552
13551A9459L7697j28423j16338k2640J06795L3237J24295m7986P2120K7497j23240
13540a7527q7015j1742P3361O7240l1809q8932o6912n5974J4311J07624j22885
13529b20260L6287J16216J48271Q5919K7044j6445j9778K0728J34836j07177j50863
13518E4778m6302R5890n524r9204L8635N8593j04424o2170o7059k1777J51947
13507f617q7301J79811K57432l674k6949j3047k38040k03793j08273m6169M6251
$$ plain form
13584 -315492 -268930 -71884 -162684 -300781 -227631 -176634 -254521 -218601 -135105 -70565 -33044
13573 -33044 33487 45055 61417 53748 159865 125170 92979 -52741 -134785 -170591 -223434
13562 -223434 -94915 -50399 47946 -31249 -46261 -79852 -64403 -43208 -10275 -4093 19459
13551 19459 57156 -71267 -187605 -210245 -103450 -70213 54082 6096 78216 105713 -17527
13540 -17527 -104542 -116284 -42923 24317 -7492 -96424 -163336 -219310 -204999 -97375 -220260
13529 -220260 -183973 -67757 80514 166433 193477 177032 157254 177982 312818 205641 54778
13518 54778 8476 104366 98842 -362 38273 96866 -7558 -69728 -136787 -158564 -6617
13507 -6617 -93918 85893 343325 339651 312702 299655 61615 -142178 -250451 -296620 -250369
13496b50369J59506K39142J92341o0221k83005N2569N832k00341m4170J08834
13486g9882j00745l7388Q3146J73826P3020p7288l6790q4831q0335r0556l5492
13475b93315J79308P3609J23267j59577j68227O4133J62699K9192n1262O6435
13465B6262N4897m5779M0630J16851n7923m9290l8056o9013m5578j24667l1416
13454b23082Q717M3262Q2548L2327O3384O642j6311j06893o0072O5674l4313r1962
13442b30079P9662j56991r2476J53520J94329j37659Q8574j6381j62419N9150
13432b20770J18782J48997m7671o0517J35697K03555j62200q3721J2345J61643
13422B06140Q1761k3761j61881j76083J0690o671j44733L0906K32363J48977p3415
$$ plain form
13496 -250369 -90863 148279 340620 280399 -2606 49963 55795 -144546 -188716 -79882
13486 -79882 -180627 -218015 -134869 38957 111977 34689 -2101 -86932 -167267 -257823 -293315
13475 -293315 -114007 -40398 82869 -76708 -244935 -180802 -18103 11089 -40173 26262
13465 26262 81159 35380 76010 192861 134938 85648 47592 -21421 -66999 -191666 -223082
13454 -223082 -214365 -171103 -88555 -56228 7156 13798 -2513 -109406 -169478 -103804 -138117 -230079
13442 -230079 -150417 -307408 -399884 -246364 -52035 -189694 -101120 -117501 -279920 -220770
13432 -220770 -101988 47009 -662 -61179 74518 278073 115873 32152 44497 206140
13422 206140 287901 264140 102259 -73824 -63134 -69805 -214538 -183632 48731 197708 124293
13411A24293l6153n391j49890j28133K93868R3488j08901J92023J91893j22726
13401C44371r7062J95927P6592L1014j29524j7213k35441k85692q5575k7561M8501
13390a81663k6837M3580K6102Q6474Q7709p9429r9764O4182O5543R9765l0872
13379E4790r3779n4802O3401O8060J1470o6152O992j0951j03312r2090n2265J56329
13367a12309J45649M1740k2918P9913J04920j17552j89074J93310P3627r6414
13357A00892k22036j0629Q7011Q5396K9999R1376J08195q9224j99839O1796J14404
13346A57341J8554p5190j155k18438n7405J10162J0700J66395R0554j68920P5926
13335A08524L1859J3282j01354k12092k0333J03906r2070l8686J27726j99587
$$ plain form
13411 124293 88140 82749 -67141 -195274 98594 192082 83181 275204 467097 344371
13401 344371 247309 443236 519828 550842 421318 404105 168664 -117028 -202603 -230164 -181663
13390 -181663 -208500 -164920 -138818 -52344 35365 -44064 -143828 -79646 -14103 85662 54790
13379 54790 -38989 -93791 -30390 37670 49140 -17012 -10020 -20971 -124283 -216373 -268638 -112309
13367 -112309 33340 75080 52162 132075 236995 119443 -69631 123679 197306 100892
13357 100892 -121144 -131773 -44762 40634 70633 162009 270204 180980 -18859 42937 157341
13346 157341 175895 100705 99550 -118888 -176293 -66131 -55431 110964 201518 32598 108524
13335 108524 140383 153665 52311 -159781 -180114 -76208 -168278 -206964 -79238 -278825
13325b78825l9588J13714K8807J47687K7937q8198K3576J2990q642J82243K7513
13314A49214k828j3791k46005p1012M1662R8947R3011l6456j5476j27075j0595
13303a40404K1000l1387j9606n8280l4438K07554O3304j24384k22220K0111Q278
13292c10472R1103P6558N8621q8307O4785M1928J10633m3958k06914J04752K68798
13281A67527J89525j39725n4997j71249N1996R0007O0537j9654r8992j67976j41670
13270b34671J29090P1413Q7017O4602j64510L5931M2670J05875K28772Q194j55742
13259B18641k9967K5660j36288Q913N0310R2316j94620j67385P2192N6397j5827
13248a9658J35036o9799j3671j29473R7334O7672j17896J36371R3587M349k2807
$$ plain form
13325 -278825 -318413 -204699 -175892 -28205 -268 -88466 -64890 -51900 -60542 121701 149214
13314 149214 146386 132595 -113410 -184422 -142760 -43813 49198 12742 -2734 -129809 -140404
13303 -140404 -119404 -150791 -170397 -228677 -263115 -55561 7743 -116641 -338861 -318750 -310472
13292 -310472 -219369 -142811 -84190 -172497 -107712 -65784 44849 891 -206023 -101271 167527
13281 167527 357052 217327 162330 -8919 43077 133084 193621 173967 74975 -93001 -234671
13270 -234671 -105581 -34168 52849 117451 -47059 -11128 31542 137417 366189 374383 218641
13259 218641 188674 214334 78046 86959 137269 229585 34965 -132420 -60228 -3831 -19658
13248 -19658 115378 45579 31908 -97565 -231 67441 -50455 85916 179503 183852 161045
13237A61045q3683j2352m8221J01953R3290M035q6753j55498r2840r7876J0787
13226b06113n2755R856J04250R6301Q5901R4686p310R3226J5378l9242k04669
13215a0491m5279Q8902N2291k12241P7044R3838J39026j09620J035q1589r6305
13204a03389r7289R9235j94304p0762K10140K44194Q1067j38699k07271l5621
13194b12699J22638K00984J27156j01546k31418M8439j17508J96377J23936j56810
13184d51j23070L1676j2008j0696p4314j9996J09392m1877M7772J39673k0180
13173B5921j37500n1064J10536J17020J4102J2101j10017o0009J35522O7783q2592
13162D1803j86510r0079m9227P5153J44990p8521o6585P3692Q0891L4878k30008
$$ plain form
13237 161045 77362 65010 16789 118742 212032 216067 129314 -26184 -119024 -216900 -206113
13226 -206113 -258868 -249012 -144762 -48461 37440 132126 124816 218042 233420 194178 -10491
13215 -10491 -55770 33132 85423 -126818 -49774 44064 183090 73470 74505 -7084 -103389
13204 -103389 -200678 -101443 -295747 -366509 -156369 87825 168892 30193 -177078 -212699
13194 -212699 -90061 110923 238079 136533 -94885 -46446 -163954 32423 156359 -451
13184 -451 -123521 -91845 -103853 -114549 -188863 -208859 -99467 -141344 -93572 46101 25921
13173 25921 -111579 -162643 -52107 64913 79015 91116 -18901 -78910 56612 124395 41803
13162 41803 -144707 -234786 -284013 -208860 -63870 -142391 -208976 -135284 -54393 -19515 -249523
13151b49523O1245J40140Q4088k0273j19455O865J86089l8294j6178Q0263K9221
13140A44188O8988O6794J4396o3964j60519j41681j05860J07131N3616N983J8461
13129G533L8335J43901P0049j34582L4910J07154o3981k50407J926K08503n1045
13118A12296j60651j4743j31521q6535j8373R1007l3509K21356N8507J1413r0882
13107d1635n0551o2702M6778j27501k01740N4814J85617K00137J3518p7843N966
13096e5142q1307j6626J84754J5388l20839j03611J42785J12374N8005N9458k4614
13085b9375k11302J19834J65304J0241m5561k9047K2293Q4020l4144j26812P86
13074g3763J31657J7341M5386n1440j0155n2690k08617m6045J16943K9564k7657
$$ plain form
13151 -249523 -188278 -48138 35950 15677 -103778 -96913 89176 50882 34704 114967 144188
13140 144188 213176 279970 294366 230402 69883 -71798 -177658 -70527 -16911 -10928 7533
13129 7533 45868 189769 259818 125236 160146 267300 203319 -47088 -45162 163341 112296
13118 112296 -48355 -63098 -194619 -281154 -299527 -208520 -242029 -20673 37834 49247 -41635
13107 -41635 -92186 -154888 -108110 -235611 -437351 -382537 -196920 3217 16735 -61108 -55142
13096 -55142 -136449 -153075 31679 47067 -273772 -377383 -234598 -122224 -64219 -4761 -29375
13085 -29375 -240677 -120843 44461 54702 9141 -19906 2387 86407 52263 -74549 -73763
13074 -73763 57894 75235 120621 69181 59026 6336 -202281 -248326 -131383 -101819 -129476
13063a29476J20809R4543m2886j7359k3880o1506j43473j51726m866K17566R2315
13052d9939o3964J07139m8079L3455K08305J41627k554j03772r8356l9585j29984
13041d5707M2896r7048k1536j02319o3606J51811J85001K25832p7479k24085j2233
13030c8473n7377J08935q328j82245j00201J70589J87297l0192k11092o5081M1441
13019a84727L6764j30491J63896J02793j7736l6513M5825j7497P1960j0117O5570
13008H9727J06404q6827j66968p0184J29406J37986q530p1605m7448l5418n749
12997b9206l2130J9449J42755q482J63928R8595k51254j79089n9198Q8226m5235
12986i1641j28289O5853J02922j4419p0017M7461K51914p2908p6745j9001L8501
$$ plain form
13063 -129476 -8667 85876 42990 25631 1751 -59755 -203228 -354954 -359820 -142254 -49939
13052 -49939 -113903 -6764 -54843 -21388 186917 328544 325990 222218 123862 84277 -45707
13041 -45707 -2811 -99859 -121395 -223714 -287320 -135509 49492 275324 197845 -26240 -38473
13030 -38473 -95850 13085 4757 -177488 -277689 -107100 80197 50005 -161087 -226168 -184727
13019 -184727 -147963 -278454 -114558 -11765 -29501 -66014 -20189 -37686 34274 24157 89727
13008 89727 196131 109304 -57664 -127848 1558 139544 131014 59409 11961 -23457 -29206
12997 -29206 -61336 -41887 100868 92386 256314 354909 103655 -75434 -134632 -46406 -91641
12986 -91641 -219930 -154077 -51155 -65574 -135591 -88130 163784 90876 14131 -4870 33631
12975C3631m6377K05344J03094r3107j55669p2099q6515N5905j5936j30173P4703
12964a27199M9983J16387k3999j01462j08953L3920k2028J06460L0821O8500J50743
12953A73173j12541n2662n563M5808O0464j80629o5096n729J18472M045J02598
12942H2340L7704j358j3964j07406M9619q15j34913j38705L122l8131J36207J2373
12930a13927R050K7343J20129n4864n9306Q2403Q71k3999J3745k4113O2212l2471
12918G073O6928N12j48130J49452L2645l0649p4900n1836p7280N8726M8483j26584
12906a45560p6474J06289J57595L0370M526K2789L1616k20923p4483N9396J07569
12895B710J04072j25045P8029J01563j1757j4155q1022j25337R1161j14008k34950
$$ plain form
12975 33631 -12746 192598 295692 202585 46916 -25183 -111698 -55793 -71729 -201902 -127199
12964 -127199 -77216 39171 15172 -86290 -195243 -161323 -183351 -76891 -46070 22430 173173
12953 173173 60632 7970 2407 48215 108679 -71950 -137046 -142775 -24303 -20258 82340
12942 82340 120044 118686 104722 -2684 46935 46120 -88793 -227498 -224376 -262507 -126300 -113927
12930 -113927 -104877 -77534 42595 -12269 -71575 10828 11699 -12300 1445 -22668 39544 7073
12918 7073 74001 74513 -73617 75835 108480 77831 2931 -48905 -126185 -67459 -18976 -145560
12906 -145560 -222034 -115745 41850 72220 76746 99535 131151 -89772 -164255 -104859 2710
12895 2710 106782 -18263 59766 161329 149572 135417 54395 -70942 20219 -93789 -328739
12884c28739j8282M8250n9598M6127J42961J77571Q7337J19017R6478R8628j97870
12873B11880p5161K2061r9946j94505j14010j00238J47101O3342J38030R8106
12863I6660k07181p2020Q3888O6090l1586j21390J43079O3097R4268q0828j14573
12852h0496R8882J08685N3625k19383j26001m8662P0000K0465j9586j29905j03974
12841c76350N4398J61566M0067J5668J52885J85182j52709l06160j52883N5463
12831c22873Q8711M6329j0416N8571J48049J65957q3065L164J10786r0751o6454
12820D8008M0675q8610J23304r5883J908J71328J09790K3290k1983j89567K279
12809A24539L6004R4813J00143j16301j53090l0938J65969k3617l41467j83635
$$ plain form
12884 -328739 -347021 -298771 -358369 -312242 -169281 8290 95627 214644 311122 409750 211880
12873 211880 136719 158780 58834 -135671 -249681 -349919 -202818 -139476 -1446 96660
12863 96660 -110521 -182541 -98653 -32563 -64149 -185539 -42460 20637 114905 34077 -80496
12852 -80496 18386 127071 180696 -38687 -164688 -213350 -143350 -122885 -142471 -272376 -376350
12841 -376350 -321952 -160386 -120319 -104651 48234 233416 80707 -225453 -378336 -322873
12831 -322873 -234162 -187833 -198249 -139678 8371 174328 91263 94427 205213 114462 48008
12820 48008 88683 73 123377 27494 29402 200730 310520 333810 311827 122260 124539
12809 124539 160543 255356 355499 239198 86108 55170 221139 197522 -143945 -327580
12799c27580J57478Q4702J38003J64936j26978k32881j02820J54849K4550K64189
12789A98448J49129J72808Q793l02254j32969N0442J01969Q295r8022N5481P6455
12778B88575n747K9145j81787j00283j274j30874q8311K8188Q9026p9549M8867
12767a04024L0261p5865J75840K20654J20607k8172J18016j97808k97825P6659
12757C8343J936j851Q4729r8468o9585j14625j11416L7905K06954Q1184K0908
12746G6014L9295l898l8481j3218j59753r9949m890m0134j0669J49314n9101j20301
12734b85771j17073K20030K07594l7711n4769N0470J49264j68908m2462n9634
12724a38970o3127J31590J05222N1561j5151N7293q916k398O8007j58785k9451
$$ plain form
12799 -327580 -170102 -85400 52603 217539 90561 -142320 -245140 -90291 -65741 198448
12789 198448 347577 520385 529178 226924 93955 144397 246366 254661 156639 212120 288575
12778 288575 282828 311973 130186 29903 28629 -102245 -190556 -162368 -73342 -152891 -104024
12767 -104024 -73763 -149628 26212 246866 367473 339301 457317 259509 -38316 38343
12757 38343 40279 38428 123157 24689 -44896 -159521 -270937 -233032 -26078 55106 76014
12746 76014 115309 111411 72930 59712 -100041 -199990 -204880 -245014 -255683 -106369 -165470 -285771
12734 -285771 -402844 -182814 24780 -12931 -67700 -17230 132034 -36874 -79336 -138970
12724 -138970 -202097 -70507 34715 86276 71125 128418 119502 117104 185111 26326 -3125
12713c125j1765j8537O4781K3068J2876J11758J83822o2643j52080l4321j00026
12702A3808J25943o5525n2574k11400M2485O6236J17806q312k132J59134P9534
12691B65003J15443j7637j70592j94409q3466J10936N7414l87N8375n1123J0385
12680I9942m570j09925N474O553n4658r0963P1145P5831P5252O7061J41306j51547
12668A30901j27281m8267j33653R1716N6684j0675l2153m6048j04481m4762o6536
12657c34555K60653J91085q2840Q0162P7044k12735j25273l9409j27934J81418
12647a32384J45888k998k5284J07160J75799k1472O3368l703j79480j57045O5216
12636C5065K7680k2664j6860k6788l6886j8236L1133J09564r3056q8096K01698
$$ plain form
12713 -3125 -14890 -33427 31354 54422 67298 179056 362878 300235 148155 113834 13808
12702 13808 139751 74226 21652 -189748 -147263 -81027 36779 28467 26335 185469 265003
12691 265003 380446 362809 192217 -2192 -85658 25278 82692 82305 140680 89557 99942
12680 99942 95372 -14553 -9079 -2526 -57184 -148147 -77002 -1171 74081 141142 282448 130901
12668 130901 3620 -44647 -178300 -86584 -29900 -40575 -72728 -118776 -223257 -268019 -334555
12657 -334555 -73902 117183 34343 114505 191549 -21186 -146459 -185868 -313802 -132384
12647 -132384 13504 10506 -14778 92382 268181 246709 310077 306374 126894 -30151 35065
12636 35065 62745 40081 23221 -3567 -40453 -58689 -27556 82008 -11048 -99144 102554
12625A02554J51713j5545O6871l2616k05664j28162M6165M2589L7884j11782j67165
12614b13158n5794K546J7520K8312J25816R5748J15397J849n9689J08663L6248
12603B03458J12895n2382j6336J13115p5889k68983k50918p8384K4483K46027
12593d2914j61208r2931J38181J22027R8683m4750n5242o0040N580k9180J793
12582a20001K603R8966K7626j9073j7539J33600J27945n8814j08072j38341j3206
12571h4306m8084l00697k32360R5010K21796J87824Q1497K4698J8506J00794R4111
12560A58789q1462q6823l1055r8464Q7097N833L4035j30286L3172J4215l6091
12549a31040k9860L9155o7840J16924J62038r9660j12824R111q5074l4226q8405
$$ plain form
12625 102554 254267 238722 305593 272977 67313 -60849 -14684 27905 65789 -45993 -213158
12614 -213158 -268952 -266406 -248886 -220574 -94758 990 116387 118236 58547 167210 203458
12603 203458 316353 263971 247635 360750 284861 15878 -235040 -313424 -288941 -42914
12593 -42914 -204122 -297053 -158872 -36845 61838 17088 -38154 -98194 -92614 -121794 -120001
12582 -120001 -117398 -18432 9194 -9879 -27418 106182 234127 175313 67241 -71100 -84306
12571 -84306 -132390 -433087 -665447 -570437 -348641 -160817 -79320 -54622 -36116 64678 158789
12560 158789 77327 -9496 -40551 -139015 -51918 -46085 -12050 -142336 -109164 -94949 -131040
12549 -131040 -160900 -121745 -189585 -72661 89377 -10283 -123107 -113996 -199070 -233296 -321701
12538c21701O45J62474K68174n0602j62367J1080J32888K21820n1507L0037k907
12527B38034L0340M482j29383k13983j8073k3529K744L3827N7306k810j01395
12516a22440K5496j6326N4152Q6460j33888j10255l0931P4574j7535q0965J95443
12505g6215K92864q5595j52721j30947r4143Q5500L146R8145p0548n1340J10087
12494g1767J30299J28190j65003o7984J81861K4362P8831m725j58699j86381J4235
12483i6781J03994o484k9858J19442k5867k6610L9198O8704J82459Q5180j64774
12472B48603j77573m7237K3876m6532N1121n2364j35874P6331J41896J75408Q211
12461B65866j09236j59066o308q4542J995J32799Q6960k4162r8226m5969k9094
$$ plain form
12538 -321701 -321056 -158582 109592 58990 -103377 -92297 40591 262411 210904 240941 238034
12527 238034 268374 272856 143473 -70510 -88583 -112112 -109368 -75541 -18235 -21045 -122440
12516 -122440 -96944 -113270 -59118 27342 -106546 -216801 -247732 -173158 -190693 -271658 -76215
12505 -76215 216649 131054 -21667 -152614 -246757 -161257 -158111 -59966 -130514 -181854 -71767
12494 -71767 58532 186722 21719 -46265 135596 159958 238789 234064 75365 -111016 -96781
12483 -96781 7213 729 -29129 90313 64446 37836 77034 145738 328197 413377 248603
12472 248603 71030 23793 47669 1137 52258 -106 -135980 -59649 82247 257655 265866
12461 265866 156630 -2436 -8744 -93286 -91291 41508 128468 104306 6080 -39889 -68983
12450f8983j3521n0465j8068q656Q1935q854Q3632J9755j0235j15183q517J78936
12438F1776J03341p8036L2203L5728j71276J72472L987l2029K2764o7162m2537
12427D1231O055j13098l9391J03727J09085l6809j35321j85350O6294J52637L1453
12416E13L7470Q7023p9765k19413o2438J91556J18283J13361q858q7487k71468
12405a81223j31934J52314N0506N6859p8329O9276K4048j04366j5421q3232p8370
12394c19872K97933J29761L5523n9541q7545K581j6991j73762j42958J05378J997
12383b27496O2453J98216O1843j56576j78114J77762J65683N90k9101O9750m810
12372A40200M9460J00551J9624l1521j06056j29008n9382J18726l4833j13389
$$ plain form
12450 -68983 -82504 -132969 -151037 -159693 -77758 -86612 -2980 16775 6540 -108643 -117160 61776
12438 61776 165117 87081 119284 155012 -16264 156208 160195 128166 150930 83768 41231
12427 41231 47286 -65812 -105203 -1476 107609 70800 -64521 -249871 -183577 -30940 513
12416 513 37983 125006 45241 -174172 -236610 -45054 73229 186590 177732 90245 -181223
12405 -181223 -313157 -160843 -110337 -53478 -131807 -62531 -38483 -142849 -158270 -241502 -319872
12394 -319872 -21939 107822 143345 83804 -3741 -1160 -18151 -191913 -334871 -229493 -227496
12383 -227496 -165043 33173 95016 -61560 -239674 -61912 103771 104361 75260 145010 140200
12372 140200 189660 290211 309835 278314 172258 43250 -16132 102594 67761 -45628
12362d5628j07312j20796k8773J54557L65521J47958j03559j64716l9935J01994
12352A59311m1923j03335j00195N2886J29877k6788M3041P5287p1059k21748n29
12341a05175Q7327K6928k21104r7773l6099K08493n734J29802R0951j16287J11193
12330G2522o6639K537n6042m0488L7705N9261j1243L8638j45485k50056K3840
12319c35450K0245m0223r59q7978k2128J35367N1247J48281P7631o3156N5267
12308f1856J05316j4579q4409N2219J48451j47136j48557O0143L4764J23664l8463
12297B9557k5138K684r8478n8552n6054P1861J21252K67786o3363j88294J25179
12286A28440J02085N323o0012n0968j17007m3216j4984J181q4813q0468J7211
$$ plain form
12362 -45628 -152940 -273736 -302509 -147952 217569 365527 261968 97252 57317 159311
12352 159311 117388 14053 -86142 -33256 96621 69833 112874 188161 117102 -104646 -105175
12341 -105175 -17848 9080 -212024 -309797 -345896 -137403 -143137 -13335 77616 -38671 72522
12330 72522 5883 8420 -47622 -88110 -50405 8856 -2387 36251 -109234 -359290 -335450
12319 -335450 -315205 -355428 -356387 -444365 -466493 -331126 -279879 -131598 -53967 -117123 -61856
12308 -61856 43460 28881 -55528 -3309 145142 -1994 -150551 -90408 -55644 68020 29557
12297 29557 4419 7103 -91375 -149927 -205981 -134120 -12868 254918 191555 3261 128440
12286 128440 230525 235848 175836 124868 7861 -35355 -50339 -49158 -133971 -214439 -197228
12275a97228r7026J52883J90576q6047j42727Q641j43224P4927N7004Q9638K3248
12264f9335O0431L3570q2593J80732O1217k05987o388J40445J7593R7781j03940
12253A23526j57627N927J8974l1575J4058p432j8577J65997j0495k56311j58462
12242c11997m9360J40524K05160J4898j8004j10118Q2279n0134q9852O2097O4976
12231e9531R5569p169q2832J0966k864o4231j74591m8017K948M0756K30588k1066
12219g9474o2260O5877M0280M8126r5937j02359N8038J24108q764r6229j6149
12208a24743l3405P4721K04310l7809J793j17221j27000K23540R588O0638K2157
12197A56569j13281l6575R4215j14999k3936L7071J67026o7961k81394j4676J60558
$$ plain form
12275 -197228 -294254 -141371 49205 -36842 -179569 -170928 -314152 -239225 -182221 -92583 -69335
12264 -69335 -8904 24666 -57927 122805 184022 -21965 -28353 112092 129685 227466 123526
12253 123526 -34101 -28174 -9200 -40775 -26717 -34149 -52726 113271 102776 -153535 -311997
12242 -311997 -361357 -220833 -15673 -775 -18779 -128897 -46618 -96752 -186604 -124507 -59531
12231 -59531 36038 28869 -53963 -42997 -45861 -110092 -284683 -332700 -329752 -288996 -58408 -79474
12219 -79474 -141734 -75857 -35577 12549 -83388 -185747 -127709 -3601 -12365 -108594 -124743
12208 -124743 -158148 -83427 120883 83074 84867 -32354 -159354 64186 73774 134412 156569
12197 156569 43288 6713 100928 -14071 -38007 -936 166090 98129 -183265 -197941 -37383
12186c7383J3524k41725o5802J43609J14188N2690j7925m7750K1883J8265K882
12175d3544q8731r1346j02475P76p047J77404J21824M5102k4949j8306J79620
12164A48328q5863k25258R6574l0167k6401k5083j64052J05914K21861L4988P7720
12153A28561j0706J0554n2611K2368N037j07961m0375O9143m3032j35167k00929
12142c55118O4834K22895Q5185j15376j47345J61884K23077J11120j32735r3697
12132B4724r4152j48618M9429J41464J50794J64610j26469k19668j2635J53366
12122H2845p2124j49628l6467j1390J4850O4164k3634n0615j36357k3724N3809
12111b88271J00495K00771P0504N2748j59151k9384j08663j0774K07757p1725
$$ plain form
12186 -37383 -23859 -265584 -331386 -187777 -73589 -20899 -38824 -86574 -64691 -46426 -43544
12175 -43544 -132275 -223621 -326096 -325320 -332367 -154963 -33139 11963 -12986 -31292 148328
12164 148328 62465 -162793 -66219 -96386 -122787 -147870 -311922 -206008 15853 50841 128561
12153 128561 117855 128409 75798 98166 103203 -4758 -45133 24010 -19022 -154189 -355118
12142 -355118 -290284 -67389 17796 -97580 -244925 -83041 140036 251156 118421 24724
12132 24724 -69428 -218046 -168617 -27153 123641 288251 161782 -57886 -70521 82845
12122 82845 10721 -138907 -175374 -186764 -171914 -107750 -131384 -181999 -318356 -342080 -288271
12111 -288271 -187776 12995 83499 136247 -22904 -52288 -160951 -171725 36032 -35693
12101c5693j42405N6320L5986j5474j44617K8983L8883J9368J20953J07624p9701
12090i773l8756j03528O0808K829l8878J02620L3051L5053j08341J11043j32920
12079h6792k59789j97729M5826K20450O6354J3228J60052K52390n2429o0092j58342
12068e6873j69416J0444J24600J75529K8946L1926n6501j3892n9395k81832Q519
12057b57945L09894M4358n4632N7914j42749P0893j40337o1021P3697j29943J10742
12046a19129R7688m5233j30055J0779J2910l3717P5670J8249j90314K8335K01186
12035g3631j55209p714J32290N4145m1764j09489J16690j8149l0591R915J0546
12024a12961K8230j2327L0068l0570o8554q7431j5331J55126p3045N6621j5812
$$ plain form
12101 -35693 -178098 -121778 -85792 -101266 -245883 -216900 -178017 -158649 -37696 69928 -9773
12090 -9773 -48529 -152057 -91249 -88420 -127298 -24678 8373 43426 -64915 46128 -86792
12079 -86792 -346581 -544310 -498484 -278034 -211680 -198452 -38400 213990 161561 101469 -56873
12068 -56873 -226289 -215845 -91245 84284 113230 145156 88655 74763 15368 -266464 -257945
12057 -257945 51949 96307 41675 99589 -43160 27733 -112604 -173625 -99928 -229871 -119129
12046 -119129 -21441 -66674 -196729 -185950 -173040 -206757 -131087 -112838 -303152 -274817 -73631
12035 -73631 -228840 -236554 -104264 -50119 -91883 -201372 -84682 -102831 -133422 -123507 -112961
12024 -112961 -84731 -97058 -66990 -97560 -166114 -253545 -268876 -113750 -186795 -130174 -145986
12013a45986N3616k3308p8625r6623K2098O4257J71671j47180j29874L117q1222
12002c88059O2193M6324j2594K21297M9700n7623j48015j22547K08458L01807
11992A60941O7114m7918p3163j51058P6235J49671J47737j55691j40242l29062
11982b95436o1450J49175k8050r8816M9874J87550J13038l2607j37269P2732j6852
11971i8111r0087J8145J44788Q0142L7044p6122K4686O1560m8561N8555n6118
11960E5921O095K07392j24973m8099J36617J89137k9491k37945j98068q9385r0136
11949b22935M2749q1775o388J65280K8854k5976K8485q9319M6131K8686L9489
11938d6719K14042K3354j89019l6022l9488r3075r0453J02158J99634j2967r9314
$$ plain form
12013 -145986 -92370 -115678 -194303 -290926 -268828 -204571 -32900 -180080 -309954 -306837 -388059
12002 -388059 -325866 -279542 -292136 -70839 -21139 -78762 -226777 -349324 -140866 160941
11992 160941 228055 180137 106974 -44084 32151 181822 329559 173868 33626 -295436
11982 -295436 -356886 -207711 -235761 -334577 -284703 -97153 15885 -16722 -153991 -81259 -98111
11971 -98111 -188198 -170053 -25265 54877 91921 15799 40485 102045 53484 112039 55921
11960 55921 62016 269408 144435 96336 232953 422090 392599 154654 -43414 -132799 -222935
11949 -222935 -180186 -261961 -268349 -103069 -74215 -100191 -71706 -161025 -114894 -86208 -46719
11938 -46719 167323 190677 1658 -34364 -73852 -166927 -257380 -155222 44412 31445 -67869
11927f7869k6789Q2909J41565J25255k5627o0096m0602k43564r1386p425o6196
11916b79825j5658J45984q5495q6881P3581Q1298m7357N1661K31318k7688k4234
11905A6704l25528J01376J85222Q5229N0587k5387o5953j11825m5687j16562k6666
11894b78490J02987O5983R6255k90017k43518K14435k5610L3060K18544L3290
11884g3081p5122P5435J34101M6047j91548r5580K1799N7179n1165J20321O8478
11873C6864j1816k9552O0851N9245j71926j37446M77k684R8083M2522R5535o3672
11861b3519j0055q6328j83137K06072L8118m8415M0819J42057M884q717p8856
11850g077p84M1155O9140j4444J14682n2982k29442Q6504J75978l7378m3956N8008
$$ plain form
11927 -67869 -94658 -11749 129816 255071 229444 169348 128746 -114818 -206204 -213629 -279825
11916 -279825 -295483 -149499 -234994 -321875 -248294 -166996 -214353 -162692 68626 40938 16704
11905 16704 -308824 -207448 -22226 63003 113590 88203 22250 -89575 -135262 -251824 -278490
11894 -278490 -175503 -109520 -13265 -303282 -546800 -332365 -357975 -324915 -106371 -73081
11884 -73081 -148203 -72768 61333 107380 -84168 -179748 -157949 -100770 -151935 -31614 36864
11873 36864 25048 -4504 56347 115592 -56334 -193780 -193303 -195987 -97904 -55382 40153 -23519
11861 -23519 -33574 -119902 -303039 -96967 -58849 -107264 -66445 75612 80496 71779 -7077
11850 -7077 -7861 33294 102434 87990 202672 149690 -79752 6752 182730 145352 101396 159404
11838A59404q7392l5597M01k6134j15410k03494Q1045K2872J54145L5141R1119
11827G6100L984j79867J4431J42019o6880k5816J7953O2105l0195J91810j4816
11816A90828m5974j07707J2991N7874j13529J1291p633j5750m2268p74L4094J78170
11804A51613l0496q7739m1281J43667P4362m6351j54351J03918N3688j09681k1716
11793C5633M907m2899j6640l3880j5609Q0990J2113j3905J20393J23053N4064
11782C08220M1411j8938P2533r2412k05875J40810K7364q0892m9562l1154Q0140
11771A91645p785J6332j71011j12596m4677M4143L4003J30439L6333q0274r5026
11760e8474o8880M9567J76286L067j05380l9297j32252Q6396k1953M4049L8243
$$ plain form
11838 159404 72012 36415 36816 10682 -104728 -308222 -227177 -204305 -50160 -15019 76100
11827 76100 80084 -99783 -85352 56667 -10213 -36029 -18076 44029 13834 205644 190828
11816 190828 144854 37147 50138 108012 -5517 5774 -1859 -17609 -59877 -60651 -26557 151613
11804 151613 121117 33378 -7903 135764 210126 163775 9424 113342 167030 57349 35633
11793 35633 40540 -2359 -18999 -52879 -68488 12502 24615 10710 131103 254156 308220
11782 308220 349631 330693 403226 310814 104939 245749 273113 192221 142659 111505 191645
11771 191645 183860 200192 29181 -83415 -128092 -83949 -49946 80493 116826 36552 -58474
11760 -58474 -127354 -77787 98499 101566 -3814 -43111 -175363 -88967 -110920 -66871 -28628
11749b8628K874q4823J35284j82012k32276J60941J85937J54120K6843p6735k55019
11738a93494o2583K82843J80496k2350l9486n9119j13188k87306R7429K1370O5104
11727a30284Q1748Q1988j3597l1118J1226j30288l9976j86050k33954J32320J86301
11716b71684J8746Q7011R9442J33346J20197o5250J7496N2054l1984o023J3159
11705A66510j96939J6192q1159k3416J24803K382j504r8953j22125K8649J87334
11694A774L5713k043J45384Q9898J37638p5839j76198j57673j13469m6977M7492
11683a14300J06317Q2179M2032N9K4099J72527k39576j36203J12453m2572J0481
11672A7496P6391j55557r2849P7229O0977L2939j03798O1140L2692K8310k68803
$$ plain form
11749 -28628 -25754 -110577 24707 -157305 -389581 -228640 -42703 111417 138260 61525 -193494
11738 -193494 -256077 26766 207262 184912 145426 86307 -26881 -314187 -216758 -195388 -130284
11727 -130284 -48536 33452 19855 -11263 -37 -130325 -170301 -356351 -590305 -457985 -271684
11716 -271684 -252938 -165927 -66485 66861 187058 121808 139304 191358 159374 153351 166510
11705 166510 -30429 -14237 -95396 -118812 5991 8373 6869 -92084 -214209 -185560 1774
11694 1774 37487 35444 180828 270726 408364 332525 156327 -1346 -114815 -161792 -114300
11683 -114300 -7983 74196 116228 116287 140386 312913 73337 -62866 49587 7015 17496
11672 17496 93887 -61670 -154519 -77290 -16313 16626 -87172 -26032 6660 34970 -233833
11661b33833j31631J61201K07702Q7718m8196q0128J01718j08780m2144l8395
11651a24768r1183L3859k0312J7835l3849J27323J34323r10l2820J6247J63778
11640A89523R9732k09325j39888o3131j03097K8034J03252L36593K33234q3326
11630C91601l12203k22863P0207K49009q9418k22149j253M2444K5Q86k360J9965
11618g6109R7804N9036m0772n7923j54601Q260O822J60679J80860o0326o9806
11607E3924O9907o3553m5067J2257K4943R6310k9456J8737l2548j23194k05401
11596b23141q6229J12440J69791K7156k9630J32099K43605j57557k18262J45638
11586A15910m2162M8277l2554l5446j1341J2379j45037q6604J58459R8686O006
$$ plain form
11661 -233833 -365464 -204263 3439 91157 42961 -37167 64551 -44229 -86373 -124768
11651 -124768 -215951 -182092 -202404 -184569 -218418 -91095 43228 42318 9498 25745 189523
11640 189523 289255 79930 -59958 -123089 -226186 -198152 -94900 241693 474927 391601
11630 391601 79398 -143465 -73258 175751 86333 -135816 -137069 -94625 -94600 -93714 -96074 -76109
11618 -76109 21695 80731 39959 -17964 -172565 -164305 -157483 3196 184056 123730 53924
11607 53924 123831 60278 15211 27468 52411 148721 119265 138002 105454 -17740 -223141
11596 -223141 -309370 -196930 -27139 17 -29613 102486 346091 188534 -29728 115910
11586 115910 73748 122025 89471 54025 42684 55063 -89974 -176578 -18119 80567 86573
11575H6573M0065l5515L1111N1828K41324K6149k21806k39225l9810M5357J12958
11564I9009j42835J13793L8736o2170q3438j53238J61431N8195O1013J8760N1300
11553A60556l1862J5746o9287O1502m6416q4386O2085p9470j02293K2660M7462
11542d3703O2277P2801p8527n0940Q1235J3198j05920o9436j33532K57705k6198
11531b1040j69602q2362K11076m1806r8385l8118K65276J5637k8167J20123P7227
11520B09859J19951K4170j60490j98021k59956j9712R6847q1470L5750J14702
11510a18370J88842R9339M1457j4791P7509O6117j62674k91118K8409O4607j39987
11499a60660P0816J64427L3689N833j58051q1648J24623J44691p2445j37982l117
$$ plain form
11575 86573 126638 91123 122234 174062 415386 441535 219729 -19496 -59306 -13949 99009
11564 99009 -43826 69967 108703 46533 -36905 -190143 -28712 29483 90496 109256 160556
11553 160556 128694 144440 75153 136655 90239 5853 67938 -11532 -113825 -91165 -43703
11542 -43703 18574 91375 12848 -38092 43143 56341 -49579 -119015 -252547 5158 -21040
11531 -21040 -190642 -273004 -61928 -103734 -202119 -240237 25039 40676 12509 132632 209859
11520 209859 329810 353980 193490 -4531 -264487 -284199 -187352 -268822 -233072 -118370
11510 -118370 70472 169811 211268 196477 273986 340103 177429 -113689 -85280 -20673 -160660
11499 -160660 -89844 74583 108272 114105 -43946 -125594 -971 143720 71275 -66707 -69824
11488f9824Q269n6487J1029M1456J52483O2193n9309j14085J5845K7259P9612
11477I8441K10956R224L0773J23849j23002n01735j51902j2741l4966L7973Q1840
11466b31290p6769L7951R3342l7610j6415j02144r7657o437J8629O8652J75930
11455a73818j7218M9582J32824N8286j0587l985j2998R5510J08250j71150l1878
11444B2818j48723k4464J06841Q3663k8383q4520j41051j19448Q0446Q9221K41641
11433G8041l8692j02743J24766j31502L6316P080M764q3384R1983J34079p7572
11422D3136Q0563j88901J8062O967n0750m3226j56696j12278R8333J0433K28552
11411f5805J62361k68110k21970M2286m0200K8052R7138q4228J05147K01313n0866
$$ plain form
11488 -69824 -61555 -118042 -107013 -65557 86926 149119 89810 -24275 -8430 18829 98441
11477 98441 309397 318621 349394 473243 350241 -151494 -303396 -316137 -351103 -313130 -231290
11466 -231290 -308059 -270108 -176766 -214376 -230791 -332935 -430592 -437029 -418400 -349748 -173818
11455 -173818 -191036 -141454 -8630 49656 39069 35084 22086 117596 225846 54696 22818
11444 22818 -125905 -150369 -43528 40135 11752 -72768 -213819 -333267 -252821 -163600 78041
11433 78041 39349 -63394 61372 -70130 -33814 -26734 -21970 -105354 -13371 120708 43136
11422 43136 123699 -65202 -47140 -40173 -90923 -134149 -290845 -403123 -304790 -294357 -65805
11411 -65805 96556 -171554 -393524 -351238 -391438 -363386 -266248 -350476 -245329 -44016 -94882
11400i4882Q0467o5348Q844O0316M3412J73132P8319j94211j9830O2350j0885
11389A21684j16636n831j29228j93722K13094L0026p8735N6527J3111J02833K7829
11378D0952j60465N537N4258j7912j07058n1184J3659J1753J82220m8719j39012
11367b15971J06184J48941j12402k6094j00402q3577L1588O3568m6415m4595J72381
11356a06794P7861P5287j37818m4813K04246K02601j44624j80849K0806O1874
11346B7777L2874p0376m7063K6964R649Q306o1056p307o8963k8734J40244j08792
11334a46477j05480j30386J58815J46382N558k38406m3997J41133K05049J5230
11324G421n1196j72159R807J92383L7587j9622m5175j16452j01734r7778j9709
$$ plain form
11400 -94882 -14415 -79763 -70919 -10603 32809 205941 284260 90049 70219 132569 121684
11389 121684 5048 -783 -130011 -323733 -110639 -80613 -159348 -102821 -89710 13123 40952
11378 40952 -119513 -113976 -59718 -77630 -184688 -235872 -222213 -210460 -28240 -76959 -215971
11367 -215971 -109787 39154 -73248 -99342 -199744 -283321 -251733 -188165 -234580 -279175 -106794
11356 -106794 -28933 46354 -91464 -136277 67969 270570 125946 -54903 -34097 27777
11346 27777 60651 -9725 -56788 -29824 -20175 -11869 -72925 -80232 -149195 -177929 -37685 -146477
11334 -146477 -251957 -382343 -223528 -77146 -71588 -309994 -353991 -212858 -7809 7421
11324 7421 -43775 -215934 -206127 -13744 23843 4221 -40954 -157406 -259140 -356918 -376627
11313c76627J31154J34917J82275N353k25752J700R1461L3698O7968N3726j79881
11302h0008P7818J44716j99488m6757K15328K7410j07707j17778R3934J82715
11292A90183r5809j99855r5032l0377M3710N5791o3483R5916J3393J36787R6778
11281A48002k07980m716m3869R078N1870l4258K5618Q8928J30059j00775r7023
11270c5066J05315M5615M3868j69386m0661M6171R2171Q399o0364m4800N3466
11259D4728P1630l623n1335j94214K8706J19017L5606J2762J17040j41189J06865
11248A45993j131j29461n8048P0972K10113p676l8926r8086P705Q3056J24181
11237C08692R7871j78744p3602P924j59279j63540M9430Q4421J03384J15322q3713
$$ plain form
11313 -376627 -245473 -110556 71719 77072 -148680 -146980 -55519 -21821 46147 99873 -80008
11302 -80008 -2190 142526 -56962 -103719 111609 139019 31312 -86466 7468 190183
11292 190183 94374 -105481 -200513 -230890 -187180 -131389 -194872 -98956 -85563 51224 148002
11281 148002 -59978 -64694 -108563 -99485 -47615 -81873 -56255 32673 162732 61957 -35066
11270 -35066 70249 115864 159732 -9654 -50315 -4144 88027 96426 36062 -8738 44728
11259 44728 116358 112735 61400 -132814 -104108 14909 50515 63277 180317 39128 145993
11248 145993 144862 15401 -42647 28325 238438 230762 191836 93750 101455 184511 308692
11237 308692 406563 227819 154217 162141 2862 -160678 -111248 -26827 76557 191879 108166
11226A08166j61500K24289j0989k34223J53187L9742Q2813k2352j26198q6195
11216c3260J65337k3302k53118j17888J30975o613J16857m5670q379N297k10408
11205b80172M5288K20651L6086j4145k7519P6498N2291J27077n6763j31682j83094
11194a35484j06589m4823J70262Q9181N6355J8646L2230l6956R9907K2995j69892
11183d168M3808Q625L6801j45877p0688j86701l3583R0577O5029Q2924R0077j30539
11171a53715L6656K5603L2934L1594N5039p2458J04160k1328P4542k16281q7757
11160a91011K2069l2316K1515J55825J66947p8567j31911J6584J50642m784p6333
11149A8660Q2719J89819j37800j12326j30929j70718L0104K3818L1620n7973o3538
$$ plain form
11226 108166 -53334 170955 159966 -74257 78930 118672 201485 179133 52935 -33260
11216 -33260 132077 108775 -144343 -262231 -131256 -137869 -21012 -66682 -75061 -69764 -280172
11205 -280172 -234884 -14233 21853 7708 -19811 56687 108978 236055 179292 47610 -135484
11194 -135484 -242073 -286896 -116634 -27453 28902 47548 79778 42822 142729 165724 -4168
11183 -4168 39640 48265 85066 -60811 -131499 -318200 -351783 -261206 -196177 -113253 -23176 -153715
11171 -153715 -117059 -91456 -58522 -26928 28111 -44347 59813 38485 113027 -103254 -191011
11160 -191011 -168942 -201258 -179743 -23918 143029 64462 -67449 -50865 99777 94993 18660
11149 18660 101379 291198 153398 41072 -89857 -260575 -230471 -206653 -175033 -233006 -296544
11138b96544k1855N7109M1666K80778K68007K6543j35117j93588j91171N140k1367
11127a80399K9238O5821J23567K0819k35144j53781K34021J42640L0979k03959
11117a26198R9482K3746j46303k0334q7393L2306Q2361J25956N8906l8457o2371
11106e8299r7051M584j32177J07962M5505J5199L14147K25583l2958j83907k4889
11095A83699j06964o9902q790J19788o0244q9517p2340L3100J23945J14985p4882
11084I2878j55286j7300J40457j16815N3735O2855r9565J0940Q7124j385j72850
11073a15212k07498L4302R9369J44371q8996k7526r29J1379O5025J98545L9827
11062A52657p4488l593o0175o9687r476J81434j48393j99711j09055n3032L7662
$$ plain form
11138 -296544 -318399 -261290 -219624 61154 329161 355704 220587 26999 -164172 -159032 -180399
11127 -180399 -151161 -85340 38227 59046 -176098 -329879 -95858 46782 77761 -126198
11117 -126198 -26716 -2970 -149273 -169607 -257000 -224694 -142333 -16377 42529 4072 -58299
11106 -58299 -155350 -150766 -282943 -174981 -129476 -114277 199870 425453 392495 208588 183699
11095 183699 76735 6833 -1957 117831 57587 -31930 -104270 -71170 52775 167760 92878
11084 92878 -62408 -79708 60749 -56066 -2331 60524 -39041 -28101 59023 57638 -115212
11073 -115212 -322710 -288408 -189039 -44668 -133664 -161190 -162119 -150740 -85715 112830 152657
11062 152657 78169 74576 14401 -55286 -64762 116672 -31721 -231432 -340487 -393519 -355857
11051c55857J7826J40541K7959m0448P7134J35844j4013j4850j01089q0320J41368
11040f5905P5096k46l1307N4158M4182m9242p8760o8116j40688Q649q5779J23841
11028b14117p9788j07775l1183J39952M2090O741q5266K3865M3554J55387J56369
11017D9829r5678M8434k2396r0618j46913R104J39011L7639r6480K8101P2407
11006f7560J91825o8212j58889k2604j06503m2111M8129J85343k9767N3182l420
10995b0587l4569n4390L858O9741J7241j17753o2778j07257Q9360J78395J05748
10984F7009J61917J28413j64352q9459O2358L8142K0670J06037r4687p7376m0070
10973A18602k4970l13670N1610J24874n3011k39535j75700K06606K42436J17694
$$ plain form
11051 -355857 -338031 -197490 -169531 -209979 -132845 2999 -11014 -25864 -126953 -207273 -65905
11040 -65905 9191 8945 -22362 31796 75978 26736 -52024 -120140 -260828 -252179 -337958 -214117
11028 -214117 -293905 -401680 -432863 -292911 -250821 -244080 -329346 -305481 -261927 -106540 49829
11017 49829 -45849 2585 -19811 -110429 -257342 -248238 -109227 -71588 -168068 -139967 -67560
11006 -67560 124265 56053 -102836 -125440 -231943 -274054 -225925 -40582 -70349 -17167 -20587
10995 -20587 -55156 -109546 -105688 -35947 -18706 -136459 -199237 -306494 -217134 -38739 67009
10984 67009 228926 357339 192987 103528 165886 204028 224698 330735 236048 158672 118602
10973 118602 93632 -220038 -168428 -43554 -96565 -336100 -511800 -305194 -62758 54936
10963E4936M5087j19572j12870O2639K16073N1549o4720k20566O6733J00962l0999
10952D9252o1179J08110M7216Q0066j09631q5454j22269j12274J21950J06159
10942B1946K503j44954j46123J0284M0176R43J24259R9699P9695Q5699L1323m7073
10930A58377j00211O2895N4080M2684o4245M5313j53085l6454N1721q6117o9254
10919i4296N9778j1105k5472J08854j0165j35035N9263J19802n3660N729k193
10908B1500r7738l3616K7190r2512O7563J14791l4578j02924m8754K8833K73846
10897A23601m2735j57552j52449J20471R1531n3942o0796J11232m933O2163k0172
10886A6419Q3569J17850j6124j08187r0250p7228R622j2815J3006R6747R245k8975
$$ plain form
10963 54936 100023 -19549 -132419 -69780 146293 197842 133122 -87444 -20711 80251 49252
10952 49252 -11927 96183 143399 223465 113834 28380 -93889 -206163 -84213 21946
10942 21946 24449 -120505 -266628 -256344 -216168 -215225 -90966 8733 88428 174127 205450 158377
10930 158377 58166 121061 175141 217825 153580 198893 45808 9354 61075 -25042 -94296
10919 -94296 -34518 -45623 -71095 37759 27594 -107441 -48178 71624 17964 23693 21500
10908 21500 -76238 -109854 -82664 -175176 -107613 7178 -27400 -130324 -179078 -150245 123601
10897 123601 80866 -76686 -229135 -108664 -17133 -71075 -131871 -20639 -25572 36591 16419
10886 16419 99988 217838 201714 93527 3277 -73951 -64329 -77144 -64138 32609 41854 12879
10874A2879j43323j66862k4258M0254N6009L3721k3831j77510l041J7263J23538
10863b55161N0657P2363K29025j4554j72450n5043J63751J43881k8265l138m9134
10852H1932j3850j9213p9387q365R9647O7353j45121o0792l4968q5846N1595N5373
10840i1642k04437M6894J42495M4918r895m4195j44931K0030J00770p7124k1447
10829b38564J16439J09061J56846M2527n4992q3023J00355j59314j58461K0265
10819a48861J9747q1499O1500J5415p8944O2317M9821O1330J60697Q8514k17595
10808g558L1896J30678m8668n8905q1248k7973M223J28194j5456m7321M6278j84642
10796a30502L6702P1813l6696J13687N6428j28837Q4137J04224J1097m0207k21776
$$ plain form
10874 12879 -130444 -297306 -321564 -281310 -225301 -191580 -215411 -392921 -395962 -378699 -255161
10863 -255161 -204504 -132141 96884 82330 -90120 -145163 18588 162469 134204 131066 81932
10852 81932 68082 48869 -30518 -38883 60764 128117 -17004 -77796 -112764 -198610 -147015 -91642
10840 -91642 -296079 -249185 -106690 -61772 -71667 -115862 -260793 -240763 -139993 -217117 -238564
10829 -238564 -122125 -13064 143782 186309 131317 48294 148649 -10665 -169126 -148861
10819 -148861 -129114 -210613 -149113 -133698 -212642 -150325 -100504 -39174 121523 210037 -7558
10808 -7558 24338 155016 106348 47443 -33805 -61778 -57555 70639 55183 7862 54140 -130502
10796 -130502 -93800 -21987 -58683 55004 111432 -17405 66732 170956 182053 141846 -79930
10785g9930r7797j01388O9233Q8530n9885o0025O1289Q3541R0254K46868l6702
10774B03988O5929K39550o9768k77154j58422M8873o0398j61391j03068K4827
10764b47034M8994m5851l6955R3808J02318j64297j11132N672P2318J20680P5793
10753h5686q4255R7208o0539N9505p088O8989j1212O2163J84981m3801k7851K5814
10741A78228j145j80402p0196l2473O6490N9315N4014q9393j57826J83397K8142
10730C8151j69286j0455N0859l7635j17261K2206J74664J8732j3553J1618r5189
10719a27149l9768j29824k35711n4827J9293M1824J10104J35965K33253P1257
10709B4417m542P9134m4920L5066l590L842q9006M0681N8820j07770j52258l8482
$$ plain form
10785 -79930 -177727 -279115 -209882 -121352 -181237 -241262 -179973 -96432 -6178 240690 203988
10774 203988 269917 509467 439699 162545 4123 52996 -7402 -168793 -271861 -247034
10764 -247034 -198040 -243891 -280846 -187038 -84720 -249017 -360149 -354477 -282159 -161479 -85686
10753 -85686 -169941 -72733 -133272 -73767 -80855 -11866 -23078 39085 224066 180265 152414 178228
10741 178228 177083 -3319 -73515 -105988 -39498 19817 73831 -15562 -173388 10009 38151
10730 38151 -131135 -141590 -90731 -128366 -245627 -223421 -48757 -30025 -43578 -31960 -127149
10719 -127149 -166917 -296741 -532452 -587279 -567986 -526162 -416058 -280093 -46840 24417
10709 24417 19875 99009 54089 89155 85565 89407 401 41082 99902 -7868 -160126 -198608
10697a98608M4503k5016o9557J21745N1223N2524L7699j83716j8996J67691q4259
10686a04767N3732n6297Q14n296O4095r4251k1439O0440J03132K9593r905o4918
10674d5067j05674N6116R2046q3883k32071o7399J34607K22083J19794N3997j25479
10663A9070J9779M8698M4402n9110n6298k7770j41578J2786J14363J28726m7086
10652E5982j69184j13662l6756K5658R2795J97085L3400o7813q6480m1695l389
10641a14059l7504K14617J69441p7976j50496q0229k9166P7972J549j35420j78943
10630c40214N3143Q2286J98505J30815J00548R6145l6252j20250r7811n5968p2288
10619f1341L6468j01768j25814L40659j61019p2604K03000J28835j17557K5156
$$ plain form
10697 -198608 -154105 -179121 -248678 -126933 -75710 -23186 14513 -169203 -188199 -20508 -104767
10686 -104767 -51035 -107332 -106518 -111814 -47719 -141970 -163409 -102969 163 29756 19851 -45067
10674 -45067 -150741 -94625 -2579 -86462 -318533 -385932 -251325 -29242 90552 144549 19070
10663 19070 38849 87547 131949 72839 16541 -11229 -152807 -140021 -25658 103068 55982
10652 55982 -113202 -226864 -263620 -237962 -145167 51918 85318 17505 -68975 -110670 -114059
10641 -114059 -151563 63054 232495 154519 4023 -76206 -105372 -27400 -25851 -161271 -340214
10630 -340214 -287071 -204785 -6280 124535 225083 321228 284976 164726 66915 10947 -61341
10619 -61341 -24873 -126641 -252455 88204 -72815 -145419 57581 186416 68859 94015
10609I4015M7115j41575l52810j89627J28912j0311P6182K94641J90508j01633
10599C5417k04000o1613J66O2235M6096n4305m1681p0073j18439P110J24602J66391
10587a08094M0907r2890L7263J15527R3459q6526k00587J10294R7950r3116Q2703
10576c110L9492j51910L9561J44502q0844L2022M8485m952J3778j13913n0575
10565h7464O2546J02602Q6079p7834j52685p5735j17439N8937m2265q1533Q0368
10554b44423J30201J01604J5516J1723j4062j8971l7804j4230M4275r015l8482
10543g3668N3426P7987n616j09997k7177J10540l1170k26352O1562N4447j6588
10532a32606M2298O7811J36226J07769j28884j63756q4207k13728o4814O9905
$$ plain form
10609 94015 141130 -445 -353255 -542882 -413970 -424281 -348099 -53458 137050 35417
10599 35417 -168583 -230196 -230030 -167795 -121699 -176004 -217685 -287758 -406197 -399087 -274485 -108094
10587 -108094 -67187 -160077 -122814 -7287 86172 -354 -200941 -90647 7303 -85813 -3110
10576 -3110 36382 -115528 -75967 68535 -12309 19713 68198 63246 77024 -36889 -87464
10565 -87464 -24918 77684 163763 85929 -66756 -142491 -259930 -200993 -243258 -324791 -244423
10554 -244423 -114222 -12618 2898 14621 559 -18412 -56216 -70446 -26171 -35186 -73668
10543 -73668 -20242 57745 52129 -57868 -85045 25495 -5675 -232027 -170465 -116018 -132606
10532 -132606 -90308 -22497 113729 221498 92614 -71142 -155349 -369077 -433891 -363986
10522c63986K29389K04728O3395j18456j14714J44458J43005M7554J6639r5245
10512A56767j33649j08775r62R3849R4078q5908N6766J82399J32886m3837o4452
10501B79162j12275j49176j04720J79672o0277p9786L9327R3673m8968m3328J30161
10490A23465N8367m7482j11404j15070P0506K06970Q3024o8068j96609L6241q1291
10479d1351J50289J44745j74314j9881p7662j25595M0788J02920j03773N3977
10469d9857L03442J26442k44563k56659l1751j00127n4561p90K09505J44638K2467
10458F8186J53005R3364n8860j76966j11568J09556M4314l887q9912O8443k1265
10447G4410Q2831r2470j82868j13456k8041J59125j4242L3117M5493J81235P6704
$$ plain form
10522 -363986 -134597 70131 133526 15070 -99644 44814 187819 235373 252012 156767
10512 156767 23118 -85657 -86619 7230 101308 15400 72166 254565 387451 343614 279162
10501 279162 166887 17711 -87009 92663 32386 -47400 -8073 85600 36632 -6696 123465
10490 123465 181832 134350 22946 -92124 -21618 185352 268376 200308 3699 39940 -41351
10479 -41351 108938 253683 79369 59488 -18174 -143769 -102981 -61 -103834 -49857
10469 -49857 253585 380027 135464 -121195 -152946 -253073 -307634 -308424 -98919 45719 68186
10458 68186 221191 314555 255695 78729 -32839 76717 121031 117144 27232 95675 74410
10447 74410 157241 64771 -118097 -231553 -259594 -100469 -114711 -81594 -36101 145134 221838
10436B21838K4967j52537j17323N9663m6979P6324M0350O7172j56440k04483o4613
10425b52061K47683P8003n5684J14519j62884k72679R3507J03699J20486j3062
10415A527l652r2888Q9468n4390R8467Q2375L3932m1152P7861O5149j38791M7343
10403A65249J6058n6461j39949m5292P510o6389j1319K43120J38640j06197P8948
10392B23918M7468N2426J03676k4580j54745p804K1053j95609k2684J04295j3588
10381A33826j17811j48178K1238P6510Q5730O9027l239p0380j05038j76190J8178
10370b16327j38676j3214p766O8890j1140L10182J01487J3476j31732r9696M3847
10359h0669N093j34892J6614J94468R8093J65334P6465l5418r0930M4870K18001
$$ plain form
10436 221838 246805 94268 -23055 36608 -10371 65953 106303 173475 17035 -187448 -252061
10425 -252061 -4378 73625 17941 132460 -30424 -303103 -209596 -105897 14589 1527
10415 1527 -2125 -95013 -5545 -59935 38532 120907 154839 113687 191548 256697 117906 165249
10403 165249 181307 124846 -15103 -60395 -52885 -119274 -130593 112527 251167 144970 223918
10392 223918 271386 323812 427488 402908 248163 240359 261412 65803 43119 147414 133826
10381 133826 16015 -132163 -110925 -34415 51315 120342 117103 46723 -58315 -234505 -216327
10370 -216327 -355003 -368217 -375983 -307093 -318233 -8051 93436 106912 -24820 -124516 -80669
10359 -80669 -75576 -210468 -193854 614 98707 264041 340506 305088 214158 259028 477029
10348D77029K27095P7500k5302J22452K22857M0827m4760N2993O9296L9153r3953
10337A165187M2453M4678j10366j22768k13362j80891m9241j72467p0073k18194
10327A14956o3579N9591Q5124k2308j55744j59989l9303J97389J38695Q5413L7426
10316B77671j5305P2694k0407j29604j38585q3054O5801J82681K5435m0249l9494
10305A57584p032L1107p5801P4509J8010p7025j7889R453J51681K7142l0571m811
10293B56357m5801j37174J89055p2678k41522j31528J32908J89170k7506n9881
10283E1400q8301J61477J99477k6841k37784j67133J01073l9872j03199j9750
10273a69453N9968j21375N9568J38948Q8542p4283k7449J50633Q242J24533J21644
$$ plain form
10348 477029 704124 781624 756322 878774 1101631 1142458 1097698 1150691 1219987 1259140 1165187
10337 1165187 1207640 1252318 1141952 1019184 805822 624931 575690 403223 333150 114956
10327 114956 51377 110968 196092 173784 18040 -141949 -181252 16137 154832 240245 277671
10316 277671 262366 335060 314653 185049 46464 -36590 29211 211892 237327 197078 157584
10305 157584 150552 181659 105858 180367 198377 121352 103463 112916 264597 291739 261168 256357
10293 256357 210556 73382 262437 189759 -51763 -183291 -50383 138787 111281 51400
10283 51400 -36901 124576 324053 297212 59428 -107705 -6632 -46504 -149703 -169453
10273 -169453 -109485 -230860 -171292 -32344 56198 -18085 -45534 105099 113341 237874 359518
10262C59518j07347j73545J0613n2023p159n866K1322O8500O3157j2876j05115
10251E9179L4605J2029L1962j56849P6460J85290j04041Q327r5663j37727l3807
10240a20235Q8314J50552O1151j2063o8445J3522j214j18426r269o2611P3810
10229d914R3036l1385p3420O6457p6013m891J17847j791j20J6872J89729j40887
10217A50520j75519j16701P5271j4889J33577L9195p3164P6723Q3799j3684q5645
10206G9483O538M8535l4607j19226J2151K09916j10894k77432j56168j9910J46527
10195b15087J17387J1864J14541J33740J4004p8519j47893k16372o9438J63645
10185a72128n8849o6978J10633j5749N7397K9351N1506k6894Q9186Q7193p3458
$$ plain form
10262 359518 252171 78626 89239 37216 30057 24191 45513 114013 177170 164294 59179
10251 59179 93784 105813 137775 -19074 57386 242676 138635 146962 51299 -86428 -120235
10240 -120235 -31921 118631 179782 167719 99274 112796 111582 -6844 -16113 -78724 -4914
10229 -4914 88122 56737 -16683 49774 -26239 -31130 86717 84926 84806 101678 291407 150520
10217 150520 -24999 -141700 -66429 -81318 52259 91454 18290 95013 178812 165128 79483
10206 79483 86021 134556 99949 -19277 -7126 202790 91896 -185536 -341704 -361614 -215087
10195 -215087 -97700 -85836 28705 162445 176449 97930 -49963 -266335 -335773 -172128
10185 -172128 -230977 -297955 -187322 -203071 -145674 -116323 -64817 -91711 -2525 84668 11210
10174A1210R6016J33383L8412k95715o079K6193O6119j26386J8775j34788q8915
10163b61775j6287J15775J22154Q9412m2933n8922J18551O1265K6502Q4047q4275
10152A53514l2625K5791J09126J32802q2044k35996l58447n4875P5632J44650
10142a22472P4010n6553r5857q382r4039K0451N3287J18253J31590P0538j81594
10131i0768o2105n6009P2078K361o7933R4014j3006l4754j8340m5062M7773p5153
10119b46904J7370N8672j28469j71239L6963J40661J76843J00360K19257O5037
10109B68551p4541j70443j02992L2811j01001p1544R4867K00787k2987k92721
10099b39213j94839K29055J88146K9232n4083m8259L7009K8216J71306j01050
$$ plain form
10174 11210 107226 240609 279021 -16694 -22773 3420 69539 -56847 -38072 -172860 -261775
10163 -261775 -278062 -162287 -40133 49279 6346 -52576 65975 127240 153742 237789 153514
10152 153514 120889 146680 255806 388608 306564 70568 -287879 -342754 -267122 -122472
10142 -122472 -48462 -105015 -200872 -209254 -303293 -282842 -229555 -111302 20288 90826 -90768
10131 -90768 -152873 -208882 -136804 -134443 -202376 -108362 -121368 -156122 -174462 -219524 -171751 -246904
10119 -246904 -229534 -170862 -299331 -470570 -433607 -292946 -116103 -15743 203514 268551
10109 268551 194010 23567 -79425 -46614 -147615 -219159 -124292 76495 53508 -239213
10099 -239213 -434052 -204997 -16851 12381 -41702 -89961 -52952 -24736 146570 45520
10089D5520j68358j72628R4323J49847m3106Q0403L3237L4779M2790Q6643m791
10078A78659j15536r0566O6204O0749N6920m9489m5356j48217j02174q3210j31703
10067d03719O0228J55050J94673J21928J153P3789j27371L668N6105p1481Q2946
10056A46969K08984j26668k47913N6706J03518J57696p7716q9278o8616L7768
10046A01450P9845j28292r7393k8711J11983J83975M950j58103o5634j54681q0687
10035b31298m287K62004O7138j35139l6329N3647M0063L544Q4427K2459o7630
10024E8599j25888K628J68541j5395j3957J61973O8124r1838l1516r6548K2035
10013A06758J67092N8942o0152L5998R1259k5324p9246j15939o4361K2359j58251
$$ plain form
10089 45520 -122838 -295466 -201143 -51296 -94402 -13999 19238 54017 96807 183450 178659
10078 178659 63123 -27443 38761 99510 156430 106941 61585 -86632 -188806 -272016 -403719
10067 -403719 -343491 -188441 6232 128160 129313 203102 75731 79399 135504 64023 146969
10056 146969 355953 229285 -18628 38078 141596 299292 221576 132298 63682 101450
10046 101450 181295 53003 -44390 -73101 38882 222857 227807 69704 4070 -150611 -231298
10035 -231298 -235585 26419 93557 -41582 -77911 -24264 15799 19343 103770 126229 58599
10024 58599 -67289 -64661 103880 88485 74528 236501 304625 212787 181271 84723 106758
10013 106758 273850 332792 272640 308638 399897 374573 295327 179388 115027 137386 -20865
10002b0865j02436J58903P8819j62555j68275n9805Q6269p1206Q6512O6437Q9137
9991a9065m7122j99741l753M4387N0111r4693l3012L2068N3557J11567k9197J5449
9979a19444O1998k308j84718j7485Q3107J05686J33742j55857j47065l9638J32283
9968a49699O0173K39170J31478J1620j54847q0171K2577R3676K8769n0743j21503
9957C0500r666j4431j1403Q2672M0349j4388o876P3419j40716j34683K15698M8517
9945A58992m0028j7674R8026k602j6507q1436J6347o275J28967j35086j95243
9934i2519J19796j3912p0475p4182L4121m180p0966k45J5787j30826J47736J87775
9922D7910L5755q4432K8220J16844j23736m8162J2027n6824k7488n8014K38746
$$ plain form
10002 -20865 -123301 35602 114421 -48134 -216409 -276214 -189945 -261151 -174639 -108202 -19065
9991 -19065 -66187 -265928 -269681 -225294 -175183 -269876 -302888 -270820 -217263 -105696 -134893 -119444
9979 -119444 -57446 -59754 -244472 -261957 -178850 -73164 60578 -95279 -242344 -281982 -149699
9968 -149699 -89526 149644 281122 292742 137895 57724 80301 173977 202746 152003 30500
9957 30500 20834 6403 -5000 77672 118021 103633 96757 170176 29460 -105223 110475 158992
9945 158992 118964 101290 199316 196714 180207 98771 115118 108843 237810 102724 -92519
9934 -92519 27277 13365 -57110 -131292 -97171 -101351 -172317 -172562 -156775 -287601 -139865 47910
9922 47910 83665 -767 27453 144297 20561 -27601 -15574 -72398 -99886 -157900 80846
9911H0846J48132j83152q2653o1473k00766j56474j75892M3496J6658J66267J27911
9900b77100k902Q4969M1058N9326J62532k3387q48K9562n4549j46767m8352q011
9888a84469q9487j25099J000J43174L8527K04832K2943j74676k3063P0391l508
9877a19435k36816k3827J33636P9975R064O6143J03060j15467K5127J30913j32862
9866h0489r3679Q6535K15468M9101j6770p7204j60670m7828Q4388l7223K3472
9855e4899K04639J0524l3482Q6083J4890j46549j22497r3320l5819j4051J17165
9844f7316L9446O7224j8639N4447R2573R8310J3373O7774l9526j82142L3245j5458
9832A43311O5701n8536j8885K5085k4224j91015p3070J07204K01329j4712r4402
$$ plain form
9911 80846 228978 45826 -36827 -98300 -299066 -455540 -631432 -587936 -571278 -405011 -277100
9900 -277100 -280002 -195033 -153975 -94649 67883 44496 43648 73210 18661 -128106 -176458 -184469
9888 -184469 -273956 -399055 -398055 -254881 -216354 -11522 11421 -163255 -186318 -115927 -119435
9877 -119435 -356251 -380078 -246442 -166467 -157403 -91260 11800 -103667 -78540 52373 -80489
9866 -80489 -174168 -87633 127835 176936 160166 82962 -77708 -125536 -41148 -78371 -54899
9855 -54899 149740 160264 126782 212865 227755 81206 -41291 -134611 -170430 -184481 -67316
9844 -67316 -27870 39354 20715 75162 167735 266045 279418 347192 307666 125524 158769 143311
9832 143311 209012 150476 131591 156676 132452 -58563 -131633 -24429 176900 162188 67786
9821F7786j2490m6451k43258Q7100K44498Q1207k0640j52142o0323J13256m9384
9810I159J30851j25362j97346M4931J56522J08743o3752r2411Q6887n2637m0486
9799c4901L1910M0162q383M179l6757j09477j11816J12919J53311k3575j43483
9788a25911l6324l2429m1394P6364k4876o4289N9912q4063N7752R2447J73568
9777E0757l4873m5246j38800j11865J02754K18744o8641K5088m3993j11691j81283
9766c39049k0252J9613J73546J73939j8792o1578N4494n8595k4491K348L996L1244
9754f3577K55611J82064j51627j61768J11984J27017Q8692j56081j94224P0385
9744A08476j9372p3303N888P2168j63174j84308J41484J13449P3775J55342m9252
$$ plain form
9821 67786 55296 8845 -234413 -147313 97185 178392 157752 5610 -54713 58543 9159
9810 9159 140010 14648 -182698 -137767 18755 127498 63746 -28665 58222 5585 -34901
9799 -34901 -2991 37171 28788 32967 -3790 -113267 -225083 -112164 41147 17572 -125911
9788 -125911 -162235 -194664 -236058 -159694 -184570 -248859 -188947 -273010 -215258 -122811 50757
9777 50757 15884 -29362 -168162 -280027 -177273 41471 -27170 -2082 -46075 -157766 -339049
9766 -339049 -359301 -339688 -166142 7797 -10995 -72573 -18079 -76674 -101165 -98817 -94821 -63577
9754 -63577 192034 374098 222471 60703 172687 299704 388396 232315 38091 108476
9744 108476 89104 15801 21689 93857 -69317 -253625 -112141 1308 75083 230425 181173
9733A81173j38758m9395q4788r1422P7311n7043P9114O5032K3073j06749j5824
9722a18276p1919j04256L7657J4133L207P8978L3049O44J58938j39110j83650
9711b90605R8521J28854m9591P2975Q0225j47465m7434k4138J29955j28379P694
9700a69388J44832L6064q173l2248r8272P3939Q637l7145m5870o1012J11495n7439
9688a34580p4413Q9140n5757L947j02310O7337L7369K24739R5978m0471k2664
9677H8315l7288o4797j26119K908j0731m1801J15472Q2163j00409J05033j48305
9666a35559L934J27567Q5572j8978k11372J90679O9372J50992j84336k6570K7420
9655G8721L7674j67046L4744J38856j1856r2647j3807j05590l6738K7935l4951
$$ plain form
9733 181173 42415 -6980 -91768 -183190 -105879 -162922 -83808 -18776 4297 -102452 -118276
9722 -118276 -190195 -294451 -256794 -242661 -239454 -160476 -127427 -126783 32155 -106955 -290605
9711 -290605 -192084 -63230 -112821 -39846 40379 -107086 -154520 -178658 -48703 -177082 -169388
9700 -169388 -24556 11508 3335 -28913 -127185 -53246 -44609 -81754 -127624 -188636 -77141 -134580
9688 -134580 -208993 -119853 -175610 -171663 -273973 -206636 -169267 55472 151450 110979 88315
9677 88315 51027 -13770 -139889 -136981 -147712 -189513 -74041 8122 -92287 12746 -135559
9666 -135559 -131625 -4058 81514 62536 -148836 41843 111215 262207 77871 51301 78721
9655 78721 116395 -50651 -15907 122949 111093 18446 4639 -100951 -137689 -109754 -144705
9644a44705j00540k8184R4597O4942j99595J26023K3491J1439J24864m7373l9228
9633a14269j46492R4373R2139j05486r5817J22982j877K5998Q2694P7026L6809
9622F8080P9120q1726N4197m2383j59567n0902r2517p3772Q4802l6113O4960J01911
9610h3910r6188J10625P9061j54150L474J33259P1702Q9789J7432q255J32336
9599B95175m4600k06408j78818r3335L724J87082L0413K4550m8278j18648k97041
9588d46184L4077K46143L0701q3148J05204K26243m958Q0633l8593p7985n266
9577F6867M2747M8119J1753j59453m3483k3758J3744o7475K48797J8775j95354
9566c8721r7079k858Q2084o955M4528Q56j03442L8678P5508k2672L5285m425j35816
$$ plain form
9644 -144705 -245245 -273429 -178832 -113890 -313485 -187462 -163971 -152532 -27668 -75041 -114269
9633 -114269 -260761 -166388 -74249 -179735 -275552 -152570 -154447 -128449 -45755 31271 68080
9622 68080 147200 65474 119671 77288 -82279 -133181 -225698 -299470 -214668 -250781 -185821 -83910
9610 -83910 -180098 -69473 9588 -144562 -141088 -7829 63873 153662 171094 162839 295175
9599 295175 250575 44167 -134651 -227986 -224262 -37180 -6767 17783 -30495 -149143 -446184
9588 -446184 -412107 -165964 -135263 -218411 -113207 113036 108078 188711 150118 72133 66867
9577 66867 109614 157733 169486 10033 -33450 -57208 -43464 -110939 137858 156633 -38721
9566 -38721 -135800 -138658 -56574 -63529 -19001 -18145 -121587 -82909 -7401 -30073 5212 787 -135029
9553a35029n6220j1427m5302J10960O8529j71565m437K24840J40727j35316j55937
9542a70177N2211J18016J00271m3664k5499n5079k58130J48899J45670N4505O0054
9531A27077p2581j31706j2020K52369J7869k24991j82738N7819l1062M6666J60674
9520G376M2173J2672J32178p7316l9360J33081o9432o9269n2517j09203n7428
9509a47045J05877n0527p5776J05711K56095N536k01845j14235k4119K10880J98958
9498B69510o9939j8555j38653J81547J15249R7201l9836J3743p1442j62619q2900
9487I3306l8659j02479Q6291K4207J29749M1737N5085j10195r5613J73929Q5692
9476C43050n2872j23839k16868R5998K5149j74409j30395k0736N0505R0247R1567
$$ plain form
9553 -135029 -191249 -202676 -247978 -137018 -68489 -240054 -244491 -19651 121076 -14240 -170177
9542 -170177 -117966 50 100321 56657 31158 -23921 -282051 -133152 12518 67023 127077
9531 127077 54496 -77210 -89230 163139 181008 -43983 -226721 -168902 -199964 -153298 7376
9520 7376 49549 62221 194399 117083 77723 210804 141372 72103 19586 -89617 -147045
9509 -147045 -41168 -91695 -167471 -61760 194335 199871 -1974 -116209 -140328 70552 269510
9498 269510 199571 181016 42363 223910 339159 436360 396524 410267 338825 176206 93306
9487 93306 54647 -47832 38459 62666 192415 234152 289237 179042 83429 257358 343050
9476 343050 290178 166339 -50529 45469 70618 -103791 -234186 -254922 -204417 -114170 -22603
9465b2603k59254j52947l549R8637J24924P5588J13497p7686o2108J49552m6983
9454f2932p298K27218R8288k1088J9799q1816R3190J34498p6199j03629p650o7040
9442A45341r2404M5916j11314J70461J54362N1357k3313j81215j18062n9964j30158
9431a48993J32990j8961J40103J87529k54691r9305o53K0703P371M870j65323
9420a94360j89037q7401J22891K5051R4095J26715K32534J93559l1469j04783
9410A87795j03767j63888M9748Q3300J61940p8321j51259o6334J7780r3484K0218
9399a36272j20560L4397R5242N9490J66417N5744j79619l7872j33144M5884K60850
9388A10557J13541k07929J22502J79089j8276m3780R8893p2784l01504j45717
$$ plain form
9465 -22603 -281857 -434804 -438353 -339716 -214792 -139204 -25707 -103393 -165501 -15949 -62932
9454 -62932 -70230 156988 255276 234188 253987 172171 265361 399859 323660 220031 212381 145341
9442 145341 52937 98853 -12461 158000 312362 363719 340406 159191 41129 -18835 -148993
9431 -148993 -16003 -34964 105139 292668 37977 -61328 -61981 -41278 -33907 -29037 -194360
9420 -194360 -383397 -470798 -347907 -322856 -228761 -102046 130488 324047 292578 187795
9410 187795 84028 -79860 -30112 53188 215128 136807 -14452 -80786 -63006 -156490 -136272
9399 -136272 -256832 -222435 -127193 -67703 98714 154458 -25161 -63033 -196177 -150293 110557
9388 110557 224098 16169 138671 317760 299484 255704 354597 281813 -19691 -165408
9378a65408J39723O1737j20382K3353K03012j6812j02497j49773J37943j53458
9368a42562J37784R2614M4445K2202j3461j48532n0358J22614N205p7099j21695
9357a28843m110L12348N0581M9146J12293j47690j25881n7741Q0462o7173j54292
9346h0900j7995J83367M7093O4115m3744n3684Q7656r5944j32630j2028k4321
9335g9015K4063J944n1732J42710J74977J0705J20905J1916M7035j17979k60057
9324B5472r0851j1040o6194q4189K09156Q8813M7853j1023j14941j02224J6503
9313i2665O1149J76938R4848Q7864j45762k50982N6169J93568o6799j40350n8428
9302h4450L2363o766J27014J13413j76904N1485J21812N3632N7929N8784l6574
$$ plain form
9378 -165408 -25685 36052 -84330 -60977 142035 125223 22726 -127047 10896 -142562
9368 -142562 -4778 87836 132281 154483 141022 -7510 -57868 64746 69951 -7148 -128843
9357 -128843 -132953 179395 229976 279122 391415 243725 117844 60103 140565 73392 -80900
9346 -80900 -98895 84472 131565 195680 151936 98252 185908 89964 -42666 -54694 -79015
9335 -79015 -54952 -53008 -104740 37970 212947 223652 344557 356473 403508 285529 25472
9324 25472 -65379 -76419 -142613 -226802 -17646 71167 119020 107997 -6944 -109168 -92665
9313 -92665 -31516 145422 240270 328134 182372 -68610 -12441 181127 114328 -26022 -84450
9302 -84450 -52087 -58853 68161 181574 4670 56155 177967 231599 289528 348312 311738
9291C11738j19168l4659J6093J61431L4192j65069m6787K5300k56410j85489J03750
9280a55078K34505R9661n8364n5718J01126k22884r1574J2264K22008J14687j4829
9269A85804J53277K8816o1973k57941j11889k2549O1777K49174M7816k68599j57525
9258a53812P3243j0621N0697J03053j12984q37R0440J52439J790K1085k1394j03832
9246H9267j23584J42556J32563J4875M888o5002r8113M3476J8753j40096k6446
9235f863R1309P4837j10934L5094j27836M0269Q8089J75811J16598L0450K1885
9224D28709N4217n4004k19694o6590l5599L0192J80755j6858J4797J08641k6892
9213C97674j02956R3896K4500J4796J15332L5623r2110m7474j00130r3405j6130
$$ plain form
9291 311738 192570 157911 174004 335435 369627 204558 157771 183071 -73339 -258828 -155078
9280 -155078 79427 179088 120724 65006 166132 -56752 -148326 -136062 85946 200633 185804
9269 185804 339081 367897 305924 47983 -63906 -86455 -24678 224496 272312 3713 -153812
9258 -153812 -80569 -91190 -40493 62560 -50424 -51261 39179 191618 193408 214493 193099 89267
9246 89267 -34317 108239 240802 255677 260565 195563 97450 140926 159679 19583 -6863
9235 -6863 84446 159283 48349 83443 -44393 -4124 83965 259776 376374 406824 428709
9224 428709 482926 428922 209228 142638 107039 137231 317986 301128 315925 424566 397674
9213 397674 294718 388614 413114 427910 543242 578865 486755 439281 339151 245746 229616
9202B29616J82713J58848k9739N8227m971n5806J61312J89650q7385l6495p4872
9191F91098n1103j27341k24185L5760J22746o7528p7581m5642k21628N3031J95500
9180B83127q9769Q4491J94660Q8683j30106k2778l6245j05763L5150J49719J04690
9169E55859l5052L9478m3204P8175J30611p9977k02701K8724P6113j21209J2517
9158D39334j7681K7897J47080p7132j02517J58510J72844R1314P9359j4098l41269
9147E63641j13320O0464J93795J07097l862j23007r5838J93784L06574K88590
9137A377918j78589r6744J46407j963O6233p1748j31516R8383M8521J08180J20560
9126A485642J21791P1497j93019N2751K5277K2777N5424N8144j02817J9946k2006
$$ plain form
9202 229616 412329 571177 541438 599665 594694 538888 700200 889850 802465 765970 691098
9191 691098 639995 512654 288469 324229 446975 379447 301866 256224 34596 87627 283127
9180 283127 193358 277849 472509 561192 431086 408308 372063 266300 301450 451169 555859
9169 555859 520807 560285 517081 595256 725867 645890 443189 471913 548026 426817 439334
9158 439334 421653 449550 596630 519498 416981 575491 748335 839649 919008 904910 563641
9147 563641 450321 510785 704580 811677 807815 684808 588970 782754 1089328 1377918
9137 1377918 1199329 1102585 1248992 1247029 1313262 1241514 1109998 1208381 1256902 1365082 1485642
9126 1485642 1607433 1678930 1485911 1538662 1563939 1586716 1642140 1700284 1597467 1617413 1595407
9115A595407O0184L24224M50012J99212K77111L53423K54679N52558O81337M14370
9105E162517N97034O20117N01709M77702N98705J025729J267136J490274J860634
9096A3601557K468857K980202M176072N745355P919440J1269575J7257625K8027166
9088I3445849M1454187M4788655L1800652K5255631K9251332K1675560k5141849
9081B62530017p8903385o1223008l3775161j9139833j1933866q168737n654436
9074D3731591l919907k518376j846006j766981j775359j482169j664860k015357
9066B6742576k068128j952730j557485j270688j001593r36043q79115p50303m53656
9057A5872835n48478m48574n42844n28116k88381m48019k26442k54835l92383
$$ plain form
9115 1595407 1655591 1979815 2429827 2629039 2906150 3259573 3514252 4066810 4748147 5162517
9105 5162517 5759551 6379668 6881377 7359079 7957784 8983513 10250649 11740923 13601557
9096 13601557 16070414 19050616 23226688 28972043 36891483 48161058 65418683 93445849
9088 93445849 134900036 179688691 211489343 236744974 265996306 287671866 262530017
9081 262530017 183626632 122403624 88628463 69488630 57554764 49386027 43731591
9074 43731591 39811684 37293308 35447302 33680321 31904962 30422793 28757933 26742576
9066 26742576 24674448 22721718 21164233 19893545 18891952 17955909 17076794 16326491 15872835
9057 15872835 15324357 14875783 14332939 13804823 13516442 13068423 12841981 12587146 12194763
9048A2194763m91886n02000l07360k63027k69494l26611k45082j56295k05651
9039I427357k77742j13418k57799k68558k67964j36578k84943l19204m6937j72123
9029G282091j94924k05226k7151m393n0559j39733m8890k60059l34352k42933
9019E773871j98507k84801l03700j45224p2062J9128N5656k09261j85654j47538
9009D301908k9750k16110r2371p2376j45291k03543O6487j8462L5674k4587j21799
8998C479780j14224j44146p16m0878l1689j99575P6333K7319j15683p7691j71527
8987B687303K3623J64110j8572k89930l78595o8893q4684J5410j58789R3460j35398
8976A849045R977J80459j91824j00037j8450k29724p7205m616K15089J66614L5738
$$ plain form
9048 12194763 11702877 11200877 10893517 10630490 10360996 10034385 9789303 9633008 9427357
9039 9427357 9149615 9036197 8778398 8509840 8241876 8105298 7820355 7501151 7454214 7282091
9029 7282091 7087167 6881941 6854790 6850397 6799838 6660105 6611215 6351156 6016804 5773871
9019 5773871 5575364 5290563 4986863 4841639 4769577 4788705 4844361 4635100 4449446 4301908
9009 4301908 4272158 4056048 3963677 3891301 3746010 3542467 3608954 3590492 3626166 3601579 3479780
8998 3479780 3365556 3221410 3220694 3179816 3148127 2948552 3024885 3052204 2936521 2858830 2687303
8987 2687303 2710926 2875036 2856464 2566534 2187939 2119046 2034362 2049772 1890983 1984443 1849045
8976 1849045 1859022 2039481 1847657 1747620 1729170 1499446 1422241 1417625 1632714 1799328 1835066
8965A835066j07764l4998O0362j62244l1974k3419k29518k24032J09275l7225
8955A153529j37710O7483J62138J9817k05530n0804m5237j07780r5183L7709N3609
8944H52041J53952L1235j65404j02372Q097J19624k443n5735j01871j805P8099
8933H13418P2280j85998j60322J4405q9127m3746J18104K0622o3502k7205N368
8922D74297J8734o9589p2451O4357j72651k22642K0559J5322n758j4432Q6352
8911A22098L8116O6267j459m1800Q4277J6138k9343q4031o1813j5620O0396J03060
8899B56286M1719j10185P5803M0120j19086M5753J50098p48j26171j20832J09928
8888B42685O3956l4633j63048k5985r7733q4095j9109P8032J08991K38810J16831
$$ plain form
8965 1835066 1727302 1692304 1752666 1590422 1558448 1535029 1305511 1081479 1190754 1153529
8955 1153529 1015819 1083302 1245440 1265257 1059727 1008923 963686 855906 760723 798432 852041
8944 852041 1005993 1037228 871824 769452 777549 897173 894730 838995 737124 735319 813418
8933 813418 885698 699700 539378 553783 464656 420910 539014 559636 496134 468929 474297
8922 474297 493031 423442 350991 415348 242697 20055 40614 55936 50178 35746 122098
8911 122098 160214 226481 225022 183222 267499 283637 254294 170263 108450 92830 153226 256286
8899 256286 298005 187820 263623 303743 184657 230410 380508 379760 253589 132757 242685
8888 242685 306641 272008 108960 82975 -14758 -98853 -117962 -39930 69061 307871 424702
8877D24702k03252j31905J5082l131k5087q167Q4561K1279j10775l1778j9846
8866A1683p5198K01089L0393j03605N0391J3383M3219J5523K8054R2007K777J6863
8854C26579O0124j7888K7503p0853j75830r735j5482Q3915K31658L7632j54799
8843C22824j02723J1040K5451j62062j47530r7901R4294K00893j4567Q6096j08319
8832A07496j28805o295o8458m6219J96089L05582L6614j34668j32805j6907P8022
8821A89646j44038m2102K1625j10622q1103R5503J17742j34537j669J05451O8676
8810H4572N7827J21478M4483q8940J5433n3334j7069j51654l8486j57883r791
8799a93364J87457l269j25835L6689J62566J21531M4559m2444R09J7656m9604
$$ plain form
8877 424702 221450 89545 104627 101496 76409 68242 152803 174082 63307 31529 11683
8866 11683 -63515 137574 167967 64362 114753 128136 171355 186878 214932 306939 309716 326579
8854 326579 386703 368815 396318 325465 149635 139900 124418 208333 439991 477623 322824
8843 322824 220101 231141 256592 94530 -53000 -150901 -56607 144286 129719 215815 107496
8832 107496 -21309 -27604 -96062 -142281 53808 359390 396004 261336 128531 111624 189646
8821 189646 45608 3506 25131 -85491 -166594 -71091 46651 -87886 -89555 15896 84572
8810 84572 142399 263877 308360 219420 234853 181519 164450 12796 -25690 -183573 -193364
8799 -193364 -5907 -9176 -135011 -98322 64244 185775 230334 187890 188799 206455 156851
8788A56851l5511K2933N4376j4245j58513j47304p1258J47435j3271l6243J95357
8777A00607l1098l0961O4861k73J87839J17923k4143r6608r2052k5295k5020P8698
8765B24478j9922O3803j70700m4773o7786l6585J79680K8789K2483K4731L0962
8754B35160k51958p1813q4914j61953k7337J84226Q3465Q4239J33639K02090j16217
8743B08627k56193M6714o3612p993R4258P8663J70009N0529j72127R085r7672
8732F0288n3141j38270l9154M9420Q1145N3731j04993n2327n8588P2712M465J06282
8720a8430Q089j30351J02226M3833j03113k9537N0269K4558J69947J05250N7423
8709B80164j3369j11613J05676P4986j42895K1604J16201j04655p5347j52855
$$ plain form
8788 156851 121340 144273 198649 184404 25891 -121413 -192671 -45236 -58507 -94750 100607
8777 100607 69509 38548 103409 103136 290975 408898 384755 288147 196095 170800 145780 224478
8765 224478 204556 268359 97659 52886 -14900 -51485 128195 156984 179467 204198 235160
8754 235160 -16798 -88611 -173525 -335478 -362815 -178589 -95124 -10885 122754 324844 208627
8743 208627 -47566 -852 -64464 -72457 21801 100464 270473 321002 148875 157960 60288
8732 60288 7147 -131123 -170277 -120857 -39712 14019 -90974 -143301 -201889 -129177 -124712 -18430
8720 -18430 -10341 -140692 -38466 5367 -97746 -127283 -77014 -52456 117491 222741 280164
8709 280164 266795 155182 260858 335844 192949 214553 330754 226099 150752 -2103
8699b103j66088J02492N2154j34534K7570L0139K1239m5556R0150J4859q5159
8688i4837N6760K38367J56493K4632j39004Q522P8033O1611j88416k61248l2868
8677i1955J86130K18954K7135m1733r4584o2592k3175q882j20208K8410n6149
8666c8649N4710O9465R3647M2531O2187J31255j8020j82627r2143M1483l50K38761
8654D02250n4936r2895j13529M9206J56755o6496J11119Q254n451O8870J1945
8643D75092j28924j00612j34019j4811J24014j04514k20269O110J17350J7125
8633C6542J06565M215P0019n9883q2720Q1627j11160k49828M8955K35974J42813
8622B23119J95416L7523j12735j03836l4120K6427p7706o4201j1004l5771K57057
$$ plain form
8699 -2103 -168191 -65699 -13545 -148079 -120509 -90370 -69131 -114687 -24537 -9678 -94837
8688 -94837 -38077 200290 356783 381415 242411 250933 328966 390577 202161 -59087 -91955
8677 -91955 94175 313129 340264 298531 203947 141355 118180 109298 -10910 17500 -38649
8666 -38649 16061 85526 179173 221704 283891 415146 397126 214499 122356 163839 163489 402250
8654 402250 347314 254419 140890 190096 346851 280355 391474 399728 394277 463147 475092
8643 475092 346168 245556 111537 96726 220740 116226 -104043 -97933 19417 36542
8633 36542 143107 147322 217341 157458 74738 156365 45205 -204623 -155668 80306 223119
8622 223119 418535 456058 343323 239487 205367 231794 154088 89887 78883 43112 300169
8611C00169n4556j52497o9857j96131N3128O9318J03237Q1525O2517p4557K0824
8600A43120m591k00496J7762J8831J45997J93167j98526k1184N0843l8657Q6598
8589A92864R5637K2250k6254o0442j63900O8296J15495J98185l9113k96168M8208
8578A55058J5496P8778L7508P1125k00956j65238k5605O2296j54212l7953L6222
8567a27481J53461p2433N1446J8068J37144j52877j28581J15216J81027o596P552
8556A75946J32801m7053q1209Q5425m5875n2234r8336J41129K35936N9107o6054
8545D39583o8189k6348k5202j01287L8334P1213k2827j82687k01173K3458J01754
8534D6629J7377K3849K6198m3516j26347J05356m9908j38888J15876J54690J38885
$$ plain form
8611 300169 245613 93116 23259 -172872 -119744 -50426 52811 134336 196853 122296 143120
8600 143120 138529 -61967 -44205 -25374 120623 313790 115264 94080 144923 106266 192864
8589 192864 288501 310751 284497 224055 60155 128451 243946 442131 403018 106850 155058
8578 155058 170554 249332 286840 357965 157009 -8229 -33834 28462 -125750 -163703 -127481
8567 -127481 25980 -46453 4993 23061 160205 7328 -121253 -6037 174990 168394 175946
8556 175946 308747 261694 180485 265910 220035 167801 69465 210594 446530 505637 439583
8545 439583 371394 345046 319844 218557 256891 328104 305277 122590 -78583 -55125 46629
8534 46629 64006 87855 114053 70537 -55810 49546 -362 -139250 -23374 131316 270201
8523B70201j30122r3477J32596P0538k19063j21850O04l9718P0685J37683J26375
8512B04452P4095j31263q7952L6153j56898j65948J01514Q6120L214o2987J35116
8501C5616L4721j59896K9425K03834Q5931K50902n818j73328j03309n6816J4282
8490A55544J1687p6073P0793K17924M2295q5158r8632j05406o0969k8014J20615
8479A64606j0750k21625R887Q4327j38954J37095J03998P9233j4732O2911j15236
8468A40760L8905k226r4844o6265m5279J2003K3368J40358Q5305J7087R7470j7309
8456C29333p7530j28462j26796J3035J15059N5065m2668O0262k7844j09127p0753
8445a0426N8762K09744o4354P3479k6285m8838j13906j10445n2031j0964K29391
$$ plain form
8523 270201 140079 46602 179198 249736 30673 -91177 -90573 -130291 -59606 78077 204452
8512 204452 278547 147284 59332 95485 -61413 -227361 -125847 -39727 -36513 -99500 35616
8501 35616 70337 -89559 -60134 143700 229631 480533 474715 301387 198078 141262 155544
8490 155544 167231 91158 161951 379875 422170 337012 238380 132974 72005 43991 164606
8479 164606 153856 -67769 -57882 26445 -112509 24586 128584 207817 193085 255996 140760
8468 140760 179665 177439 82595 16330 -28949 -16946 6422 146780 232085 249172 346642 329333
8456 329333 251803 123341 -3455 9580 124639 179704 137036 197298 169454 60327 -10426
8445 -10426 48336 258080 193726 267205 240920 192082 78176 -32269 -84300 -95264 134127
8434A34127M3518r6414O9323n3924J4421j53379j13793o1816r6207l847J40539
8423a77452K83005J77448j19484j62132o8992K3799J91329k4515j15787r5213
8413h7994M9758P8381K1349J40508r5717m4339k5221n8973R5968j2572N9437O0380
8401A80965k25174n8382P0444M9899N8658J55798m8464q8560q4218P0085L946
8390H4997J2861j39729M5882K30783n9676r9569J4471j06434o0795J0025R103
8379e8081N771L4119l1079j27327M7039M1304J69821J17855n5801J45265p1751
8368B17135l7669P4283j29391J8027J7246m2114m006l3583o3474J5894N9865j28462
8356c6249K4471q0574M1075N6218o6304L5938N3488P008L5442L08640J83468k1384
$$ plain form
8434 134127 177645 81231 150554 96630 111051 -42328 -156121 -217937 -314144 -317991 -177452
8423 -177452 105553 283001 163517 1385 -67607 -43808 147521 123006 7219 -87994
8413 -87994 -38236 40145 61494 202002 106285 61946 36725 -22248 73720 61148 120585 180965
8401 180965 -44209 -102591 -32147 17752 76410 232208 183744 95184 10966 81051 84997
8390 84997 97858 -41871 4011 234794 175118 75549 90020 -16414 -77209 -67184 -58081
8379 -58081 -52310 -18191 -49270 -176597 -129558 -88254 81567 199422 143621 288886 217135
8368 217135 179466 253749 124358 142385 159631 117517 113511 79928 16454 32348 92213 -36249
8356 -36249 -11778 -92352 -51277 4941 -61363 -25425 28063 35071 70513 379153 562621 541237
8344E41237k17084l21158o4384K19602K6171Q3652k8107k24897j73492N9604Q0166
8333a8690P164m9857J12100N3758Q435P2284J31145j04607m1020L0498O1322L2616
8321B95148n8642j87598J83436O5269j39172p717K9554r0109j62982k5059O0536
8310c7336K352R610J12494M2576j43629j02580J30531K19300k8983l40282l1164
8299a67111K27770J55135q9376j04712n176P2309p8044l81473q8970J56371J26373
8288a76904L9196P8935Q4251L0105M0552N3564p5372O0557J42007J05694j08483
8277B74102k24613o0962O3873J2498M6556J48792q2835j76600j58108o5668Q0140
8266a42825J8692N8747J044L5957N3464O7594j67269j50582J22996K50661L6748
$$ plain form
8344 541237 324153 2995 -61389 158213 184384 268036 239929 15032 -158460 -98856 -18690
8333 -18690 -11526 -61383 50717 104475 112910 185194 316339 211732 170712 201210 262532 295148
8321 295148 236506 48908 232344 297613 158441 150724 180278 90169 -72813 -97872 -37336
8310 -37336 -34984 -25374 87120 129696 -13933 -116513 14018 233318 204335 -135947 -167111
8299 -167111 60659 215794 126418 21706 16530 88839 10795 -370678 -459648 -303277 -176904
8288 -176904 -137708 -58773 25478 55583 96135 149699 74327 134884 276891 382585 274102
8277 274102 49489 -11473 52400 64898 111454 260246 177411 811 -157297 -222965 -142825
8266 -142825 -124133 -65386 -64342 -28385 25079 92673 -74596 -225178 -102182 148479 185227
8255A85227K45599p6868j54273r2504l0443j58979N9590M4141o4795j9728J4456
8244d8577j8157J33297o0329k38430o2713j0936O4415o4790J1207k8488N8331
8233b65170P6040J29027n5651k9985Q2514J2457q3917o9868Q035l0134j67540
8222c94192l5122J52707K38421J16146N8704k01882p7278K8003J80884k5923q9577
8211d9109o8420M1417n0868N9552j8743m3658k2799K4379K32179J6472j26924
8200f522k9626J16467R7395j40763J4186l3768j24150R8224j3496M2210m4730
8189b4573N4567J49966j0465p7186J9399J13840K0918p0686k4376j34348j31992
8178a14936J89438j46595o0516m5794p6353j49576J25971K05852R3279K9504n4320
$$ plain form
8255 185227 430826 353958 199685 107181 76738 -82241 -22651 21490 -43305 -63033 -48577
8244 -48577 -66734 66563 6234 -232196 -294909 -305845 -241430 -306220 -295013 -323501 -265170
8233 -265170 -189130 -60103 -115754 -145739 -63225 -50768 -134685 -204553 -196518 -226652 -394192
8222 -394192 -429314 -276607 -38186 77960 136664 -65218 -142496 -114493 66391 40468 -49109
8211 -49109 -117529 -76112 -126980 -67428 -86171 -129829 -152628 -128249 103930 120402 -6522
8200 -6522 -36148 80319 177714 36951 51137 17369 -106781 -8557 -22053 20157 -24573
8189 -24573 29994 179960 169495 92309 111708 225548 246466 175780 151404 17056 -114936
8178 -114936 74502 -72093 -132609 -178403 -254756 -404332 -278361 -72509 20770 50274 -4046
8167d046N3921K3135j08321n9839k00992q3445J02708O5266J60342J65831l0679
8156H3881K2620J0185n3051o1406k1356O1110K01322N4535j4230p4837K3483o818
8144B25438j98113q2950J00631O7280j00712k14398N7424Q2237p3360o1938J24178
8133g4283L8911R394r0762j29404K04628J58034O2242m7279r4330n0710Q1887
8122F8328K3183l6755o431p1545K9505q1034l7988N7676K38624o2882k74964R0009
8110f4274K74569n2545l1983l9517j35415O7156m807l0250K98388j4047J3879
8099B81154K6221r2852j33394n7682L1479M0743p1188O8806Q6582j33738j48905
8088a02774o4437P5956M2411R0580L6070P8163j48494n4883O1673m2107j08128
$$ plain form
8167 -4046 49875 73010 -35311 -95150 -296142 -379587 -276879 -211613 -51271 114560 83881
8156 83881 106501 116686 63635 2229 -19127 41983 243305 297840 283610 208773 232256 225438
8144 225438 27325 -55625 45006 112286 11574 -202824 -145400 -63163 -136523 -198461 -74283
8133 -74283 -35372 -25978 -116740 -246144 -41516 116518 178760 131481 37151 -13559 68328
8122 68328 91511 54756 48325 -23220 6285 -74749 -112737 -55061 183563 120681 -154283 -64274
8110 -64274 210295 157750 125767 86250 -49165 17991 13184 -17066 281322 267275 281154
8099 281154 307375 214523 81129 23447 54926 95669 24481 93287 179869 46131 -102774
8088 -102774 -167211 -91255 -48844 41736 77806 155969 7475 -47408 14265 -27842 -135970
8077a35970K9210R9255J30067N7140j39317k22044N2382K1152J76818J75311N0398
8066B94402o902N1000k40470j36845k07773R1627K9025L5538L473Q3689j37945
8055a41181k9408j5137O1713m1402J00509R3289P2814K3827K0264P5549P8910
8044B99747q431k73218p3981j920l2828K91744J64455n5258j09266J7107j11929
8033A06222M2376J11281p3211L1266J03716m5748k30736l5883K8052R0757N7645
8022A85737J0778J7210j07619j59485n7435k1248j59632M7563J36747n3359j0503
8011a71246J29642J72691j62405Q3633J23754p3233R4386J53446M5006Q3400j58025
8000C21049l47643j51342J65979K85601J21235l1076j71550o0488j05882r0670
$$ plain form
8077 -135970 -106760 -7505 122562 179702 40385 -181659 -129277 -108125 68693 244004 294402
8066 294402 287500 338500 98030 -38815 -246588 -154961 -125936 -90398 -86925 -3236 -141181
8055 -141181 -170589 -185726 -124013 -165415 -64906 28383 101197 125024 145288 220837 299747
8044 299747 291316 18098 -55883 -57803 -90631 201113 365568 310310 201044 218151 106222
8033 106222 148598 259879 186668 217934 321650 275902 45166 9283 37335 128092 185737
8022 185737 196515 213725 106106 -53379 -110814 -132062 -291694 -244131 -107384 -160743 -171246
8011 -171246 -41604 131087 -31318 52315 176069 102836 197222 350668 395674 479074 321049
8000 321049 -26594 -177936 -11957 273644 394879 363803 192253 131765 25883 -64787
7990f4787O2088k7828P7470N0075o9044j7577r8238J8873J34223J38308q3109
7979A20454J599O4124j31425k6871J31022J0076k3949o1595J20458J12496P7438
7968C93827J6120O921K4099r0611o1048P2264M1044k90693m2875K24884L4467
7957C28399m989J92156j54615k80895j29230j31207q8757K82918J92868k9326
7947A77322P5046J33171r7523k01830k2781L4469J56729J36690l0533r8156P3648
7936C36252J5999K6286o6863p5614J3681m2843j52806K4947N5307k9026J55713
7925B61033J14204P5516J4199j22508Q1811K0776j23116j42022k7212Q4928J071
7914B38680Q7437J26293p16j62446K2778R3393o3718J81980P0390j97592j27200
$$ plain form
7990 -64787 -2699 -30527 46943 97018 27974 10397 -87841 -68968 65255 203563 120454
7979 120454 122053 186177 54752 27881 158903 168979 145030 83435 203893 316389 393827
7968 393827 409947 416868 440967 350356 289308 361572 402616 111923 69048 293932 328399
7957 328399 323410 515566 360951 80056 -49174 -180381 -269138 13780 206648 177322
7947 177322 252368 385539 288016 86186 63405 97874 254603 391293 360760 262604 336252
7936 336252 352251 378537 311674 236060 249741 206898 54092 79039 134346 105320 261033
7925 261033 375237 450753 464952 342444 424255 445031 321915 179893 152681 237609 238680
7914 238680 326117 452410 451694 289248 312026 405419 341701 523681 594071 396479 269279
7903B69279r758J68350M9419j43005r3239M0881Q1909J63695n4452j13241m1341
7892C18497K6343j08808j45011O6897R2924j21791j72147J2160K03964J42348
7882C15376J24002k6843n8809J85566P3080k65599j60351j10440k82J61018R2177
7871C28895j06761L7799k54580j65287P0572J77634K1208r6681j6902j13556j5534
7860a33193O3813J34623J58703l4384J70677l5657p1105O6126M5738m3732p5206
7849B46403r8291o4278M5749M3466j09465Q705Q3602J11891J66610r883j37116
7838B87393j32062k15081L9098J02905O2187R9341j36878L1920p5059j14502M3308
7827g430J3165J20125K0235L460P4826J29708j8281k28051j99928o9924r9324
$$ plain form
7903 269279 259521 427871 477290 334285 241046 281927 363836 527531 473079 359838 318497
7892 318497 344840 236032 91021 157918 250842 129051 -43096 -30936 173028 315376
7882 315376 439378 412535 353726 539292 612372 346773 186422 75982 75700 236718 328895
7871 328895 222134 259933 5353 -159934 -89362 88272 109480 12799 -4103 -117659 -133193
7860 -133193 -69380 65243 223946 189562 360239 324582 253477 319603 365341 321609 246403
7849 246403 148112 83834 129583 173049 63584 72289 155891 267782 434392 424509 287393
7838 287393 155331 -59750 -20652 82253 144440 243781 106903 138823 63764 -50738 -7430
7827 -7430 5735 125860 146095 149555 224381 354089 335808 107757 -92171 -162095 -261419
7816b61419R5616J82165J04489J3676j69003j73782j59663m1944J39920J1145
7806b58800K0928M7960K47709J0180J3605M1421n8032J45810K00732p4642j26253
7795B10618k30465q4018m3918M9612J13398J56518j19454l6192o5710Q0443O5323
7784I6155p2281j11850J47903N1723p6887j06947J077R2159M3438J5896j07928
7773b7542o0973o5647o9859l8785j29998j64J04474K59112O3561q1480J20740
7762G3439k2752j05313k9083J8821J4218J11287m6392q7263J23096Q844j68241
7751a09339J17974m8093k37630j31418K21925R8641J96598J68374j04241k24064
7741e1273q3176l31653o2025R9778J42790O6908N3104r958M6291J55041J17316
$$ plain form
7816 -261419 -165803 16362 120851 134527 -34476 -208258 -367921 -409865 -269945 -258800
7806 -258800 -237872 -189912 57797 67977 81582 123003 64971 210781 411513 336871 210618
7795 210618 -19847 -103865 -147783 -98171 15227 171745 52291 16099 -49611 30832 96155
7784 96155 23874 -87976 59927 111650 34763 -72184 -71107 21052 64490 80386 -27542
7773 -27542 -88515 -154162 -224021 -262806 -392804 -392968 -288494 -29382 34179 -47301 73439
7762 73439 50687 -54626 -83709 -64888 -50670 60617 14225 -73038 50058 58902 -109339
7751 -109339 8635 -39458 -277088 -408506 -186581 -87940 108658 277032 172791 -51273
7741 -51273 -134449 -466102 -528127 -428349 -285559 -218651 -165547 -175505 -129214 25827 143143
7730A43143p1339j4892Q6079j1497l8789j56876k1862J67084Q0632j03855K1547
7719G9375R0107N7938J6444j4458q9699k87502J38073J30032j76416n0347o0414
7708a66867J94208P0191j47338q8697r9188M7183k25283j8753N0550L1268K9265
7697c23461J58801J03802j09559Q4281J22311q8563k5971J04887r0413Q8103Q9743
7686A13961k77903j98426l662O9827n7682k8594Q8365M8695N1653K03952k1503
7675a1317K4405J3505L9586q5323j32783j26739J29368l6602R167p969J18760
7664f5942l345Q6899J22412j11709O272L0901j49600P4706J02645J64024k5837
7653B31426k23469j32620N6362J97743J70208j54173q6801J6214j17280K9887
$$ plain form
7730 143143 71804 56912 142991 131494 92705 -64171 -86033 81051 161683 57828 79375
7719 79375 169482 227420 243864 229406 139707 -147795 -9722 120310 -56106 -106453 -166867
7708 -166867 27341 97532 -49806 -138503 -237691 -190508 -415791 -434544 -383994 -352726 -323461
7697 -323461 -164660 -60858 -170417 -86136 36175 -52388 -78359 26528 -63885 24218 113961
7686 113961 -163942 -362368 -366030 -296203 -353885 -382479 -294114 -245419 -193766 10186 -11317
7675 -11317 13088 26593 66179 -19144 -151927 -278666 -149298 -185900 -176733 -184702 -65942
7664 -65942 -69287 17612 140024 28315 34587 65488 -84112 -9406 93239 257263 231426
7653 231426 7957 -124663 -68301 129442 299650 145477 58676 74890 -42390 -12503
7643a2503N5268O094K08882Q2575M3149k45600l2990J38762p1017R813p5455K152
7631A09130m6156j00607J24152k1441r4745K24680J14875j24424k64971k0791
7621a00298L19613J63249p7527l05540k83886o8009K39651J75464J16277p5632
7611A03362j08168q6291p579J07566j45339p8525M5987R6253Q0345j2107j13445
7600a17941k04357P43P0294M0023J28658O4055r104R2922J2138L5610j06157k03274
7588a96390l3693J82312L7528j72891K08709O4013j06564k17998J8175J20798
7578i6001J10231J36453j41351p5588N1336K4410n2526p7361R2864q4809k4350
7567a36692K31164J08777j37100k80822j52095K16421k5653n6330J67422J4573
$$ plain form
7643 -12503 42765 48859 257741 340316 383465 137865 104875 243637 172620 182433 106978 109130
7631 109130 62974 -37633 86519 65078 -29667 195013 309888 185464 -79507 -100298
7621 -100298 219315 382564 305037 -503 -284389 -352398 -112747 62717 178994 103362
7611 103362 -4806 -91097 -98676 8890 -136449 -214974 -168987 -72734 7611 -4496 -117941
7600 -117941 -322298 -321555 -251261 -211238 -82580 -18525 -27629 65293 77431 113041 6884 -196390
7588 -196390 -230083 -47771 -10243 -183134 25575 89588 -16976 -234974 -216799 -96001
7578 -96001 14230 150683 9332 -66256 -14920 9490 -43036 -120397 -27533 -112342 -136692
7567 -136692 94472 203249 66149 -214673 -366768 -150347 -176000 -232330 -64908 -50335
7557e0335n0364l3849K867M859Q3507R9687m655j30951M0197K10053j03471q5184
7545a7639K7712q8002p5859Q9111M2361O6547k9662k04460Q996K94989J24113
7534B38207o9740k36288q9555p0348l5899m9659J28033J18044l4631R5806O8310
7523F2280o9487k1962N1625l3906q4376J08695R0600n193j31230N2405J46299
7512A65750N2039l8339n2261k30902J66564J01074n0138j8342q8261k16732J34153
7501g5395P9209P6649J7320L5870P9676p9380O8885J233p566o8555J96460M1798
7489C66204k338l1739j26077j1793L090j43425L365o8900m1874Q7767L7270j35964
7477f4414r2028K5336n6008o2076J45534J61144J63861N0481j25652j38491M2745
$$ plain form
7557 -50335 -100699 -134548 -131681 -126822 -43315 56372 51717 -79234 -39037 171016 67545 -17639
7545 -17639 10073 -77929 -153788 -64677 -22316 44231 14569 -189891 -180895 114094 238207
7534 238207 168467 -67821 -157376 -227724 -263623 -313282 -185249 -67205 -101836 -6030 62280
7523 62280 -7207 -29169 22456 -11450 -95826 12869 103469 98276 -32954 19451 165750
7512 165750 217789 179450 127189 -103713 62851 163925 113787 95445 7184 -209548 -75395
7501 -75395 3814 80463 97783 133653 213329 133949 202834 204067 196501 127946 324406 366204
7489 366204 363866 332127 206050 194257 197347 53922 57287 -11613 -53487 34280 71550 -64414
7477 -64414 -156442 -131106 -187114 -249190 -103656 57488 221349 271830 146178 7687 50432
7466E0432J87449r0854j39249k2426p285l6808M1129p1859P3013J97442J06086
7455B87070o3414M4879O0603J9700n8274j8923j01862p9362p3494N3740J244k5595
7443D6312J86684j83596j53817m5278p9765n2098l8088J03545J16792r7355N6287
7432a40377J31596o0765q4558j90838m9728Q0340Q7685k4818J47498j4872j75903
7421b94740o4606j801J26287N7168j1430J35528J05584j0170p100O3930r1491
7410G159j35875o6974O3801q48o0654k1715K9011O7403N8738j197K3301j6593
7398e4443m6655J93770P9729j82219j9517r4208L3231J89570J93426N3934j69269
7387A77349j07774J5186J2739m0009q5997n0293q3204N9927l6213J29195O9993
$$ plain form
7466 50432 237881 147027 7778 -14648 -21933 -58741 -17612 -89471 -16458 180984 287070
7455 287070 223656 268535 329138 348838 290564 271641 169779 90417 16923 70663 71907 46312
7443 46312 232996 49400 -104417 -149695 -229460 -281558 -319646 -216101 -99309 -196664 -140377
7432 -140377 -8781 -69546 -154104 -344942 -394670 -314330 -226645 -251463 -103965 -118837 -294740
7421 -294740 -359346 -361147 -234860 -177692 -189122 -53594 51990 41820 34720 98650 7159
7410 7159 -128716 -195690 -131889 -132737 -193391 -215106 -186095 -118692 -59954 -61151 -37850 -54443
7398 -54443 -101098 92672 172401 -9818 -29335 -123543 -90312 99258 292684 346618 177349
7387 177349 69575 84761 97500 57491 -28506 -78799 -162003 -102076 -138289 -9094 60899
7376F0899j61357j51709N6166K1587J78143L17248j01625k04504j70533J82286
7366B6601J37240j35752j1162m2175q2549P1874q6285j9405J59472K20969m3906
7355A94922m1309q5891L5770o5429j20936m0612J09278Q6719J37676k6123j9286
7344A64779j7479j05198j51446m0328O0872J38803K13713m7143k10679j82075
7334a76181l2681R0492n9284P4457m5107J16263K6163O4162j8537j65893M6432
7323g9714Q3395n5935O2048P9581q6500M377K9827R4896k4759J3892l8879J9432
7311A01661l5840j5066p2056j9469k6082J80800L6145k01396j46149L9071J39767
7300a8614k2481j1177r7363j14866J95708K91332R4073j45480o9633J02558p8542
$$ plain form
7376 60899 -100458 -252167 -196001 -174414 3729 320977 219352 14848 -155685 26601
7366 26601 163841 28089 16927 -25248 -107797 -35923 -122208 -141613 17859 238828 194922
7355 194922 153613 67722 103492 38063 -82873 -123485 -14207 72512 210188 184065 164779
7344 164779 147300 42102 -109344 -149672 -88800 50003 263716 216573 5894 -176181
7334 -176181 -208862 -118370 -177654 -103197 -148304 -32041 -5878 58284 39747 -126146 -79714
7323 -79714 3681 -52254 9794 89375 2875 7252 37079 131975 107216 121108 82229 101661
7311 101661 65821 50755 -21301 -40770 -66852 113948 150093 -51303 -197452 -158381 -18614
7300 -18614 -41095 -52272 -149635 -264501 -68793 222539 316612 171132 101499 204057 125515
7289A25515l4579Q3982r2295j33142j68661K9481K79786K4165Q0790J14983r2344
7278B17681l01336j51879K3433Q8932J47970n7697j38696k9120K33098J41633
7268A74019L7151j80127q4316J29498j23239j69714o6431J09052P285Q5942J3106
7257f7774j53043J57950K33738N6741j0910J4558k00534r9810J20276j02953o1962
7246a13723K01407m8623n6809k6353J0303J72571L3217J49646n5134j00255o203
7235A60044J51467p8382k21782j00738j23496m9147J19652N4586J6534j32742
7225b04004j40402R2175M1037J2084q8507j8051O3851J74039J29956l870L0098
7214H8406J58890o1255k06233j47562J5976M5249L769j7880Q2906J8419j05222
$$ plain form
7289 125515 90936 174918 82623 -50519 -219180 -189699 90087 114252 195042 310025 217681
7278 217681 -83655 -235534 -212101 -123169 24801 -32896 -171592 -200712 32386 174019
7268 174019 211170 31043 -53273 76225 -47014 -216728 -283159 -174107 -166822 -80880 -67774
7257 -67774 -220817 -62867 170871 227612 216702 231260 30726 -69084 51192 -51761 -113723
7246 -113723 87684 39061 -17748 -44101 -33798 138773 171990 321636 266502 166247 160044
7235 160044 311511 233129 11347 -89391 -212887 -262034 -142382 -87796 -71262 -204004
7225 -204004 -344406 -252231 -211194 -199110 -287617 -305668 -241817 -67778 62178 58308 88406
7214 88406 247296 186041 -20192 -167754 -151778 -106529 -102760 -120640 -37734 -19315 -124537
7203a24537M3636J19879n6755j71807Q3091P8053N4191J03429j36671k17455J48665
7192g6281R1849k8176L1895j58789o2288J37525L3394o8977P4551O1725O268J69233
7180B11929o7437j28083Q6252j76553J40440P2948J0924O5247l3419j08012k14753
7169a40517p7826n508J77412K8451m9287l7418l989O9249Q0867j926j69843n8520
7157a88855Q9445P7771R897R2648o5894m0659Q5187J31970O9308j55657j25812
7146b0651j10214j048n0025l6078k4763o4812J18750J74171J1289m9357o150J28723
7134F9835j62678j70871K5784O6053O1512K1182K01758J25278p5888j8881K7075
7123A70159q1582j26802j15424k1856J98509P3742k45208j69558L6489J81206
$$ plain form
7203 -124537 -80901 38978 -17777 -189584 -106493 -28440 25751 129180 -7491 -224946 -76281
7192 -76281 15568 -12608 19287 -139502 -201790 -64265 -30871 -99848 -25297 36428 42696 211929
7180 211929 144492 16409 102661 -73892 66548 139496 150420 215667 182248 74236 -140517
7169 -140517 -218343 -223851 -46439 -17988 -67275 -104693 -108682 -39433 41434 39508 -130335 -188855
7157 -188855 -99410 -21639 -11742 80906 15012 -25647 59540 191510 260818 105161 -20651
7146 -20651 -130865 -131913 -181938 -218016 -242779 -307591 -188841 -14670 -3381 -52738 -58888 69835
7134 69835 -92843 -263714 -237930 -171877 -110365 -89183 112575 237853 161965 143084 170159
7123 170159 88577 -38225 -153649 -175505 23004 96746 -148462 -318020 -281531 -100325
7113a00325J68564P377P6608Q9225n5974q3976o8494o9371J2136k27890m66P3366
7101a79220k5650M0196P207k023N993M972m8715k8378P3522Q3585O799n3699j57567
7088b72978j73298j0587L12647M706L4682J64972K75j680J51381o156O1941q413
7076B57492j4124j7862J05989m2188l62361j43601J74346J90905L6865j44939
7066D0522q7630J79253L6658j66216m3667k2872J80901L3584L9854J35436j20103
7055B05720j78300L1623J04692k0830j85011n4258J43413R3421R853j45008p6393
7044g1078J12856O1537o8316j27231K7145N9956N5943O6013L5699r5071L1250
7033H8703K6954j33471L4772R334q8131l6666R6436P6382K9574p7493j55121p5262
$$ plain form
7113 -100325 68239 75616 152224 241449 185475 101499 33005 -36366 -24230 -252120 -252586 -179220
7101 -179220 -204870 -164674 -157467 -159490 -153497 -148525 -197240 -225618 -152096 -68511 -61712 -115411 -272978
7088 -272978 -446276 -456863 -144216 -139510 -104828 60144 60419 58739 210120 203964 265905 257492
7076 257492 243368 225506 331495 289307 -73054 -216655 -42309 148596 185461 40522
7066 40522 -47108 132145 168803 2587 -41080 -63952 116949 150533 190387 325823 205720
7055 205720 27420 59043 163735 142905 -42106 -96364 47049 140470 150323 5315 -71078
7044 -71078 41778 103315 34999 -92232 -65087 -5131 50812 116825 152524 57453 88703
7033 88703 115657 -17814 16958 26292 -61839 -98505 -2069 74313 103887 26394 -128727 -203989
7021b03989N5136J8058N6004M6916J44696M8291p7216k31880N3684J21936j13651
7010h2015O0016Q9048N9541L5427j16703j89119q1784N7623J44627P8558J29706
6999A84925L5058J94063k18309n9492M7747j06837r8209l7148J02152k7800o4936
6988d8786K4979j8653k01938j82727L2882K55229J42424P9205m9375k495Q6555
6977A17300Q2953j56378k19706o9575P1871k6834N7929J03184J40734P5669k941
6966A74206k3172j02683Q3437p9842j31509P7347m7688K9656p5379j9756j7033
6955a32416N4681P5188o9374k70436L4302J11520Q5960K18726N9587k8376r0342
6944D9020l2563o5209n5869J37801J96137j14864k10086p421k6293r4249n6228
$$ plain form
7021 -203989 -148853 -130795 -74791 -27875 116821 165112 87896 -143984 -90300 31636 -82015
7010 -82015 -21999 67049 126590 162017 45314 -143805 -225589 -167966 -23339 55219 184925
6999 184925 219983 414046 195737 136245 183992 77155 -21054 -58202 43950 16150 -48786
6988 -48786 -23807 -42460 -244398 -427125 -394243 -139014 3410 82615 33240 30745 117300
6977 117300 200253 43875 -175831 -245406 -173535 -200369 -142440 -39256 101478 177147 174206
6966 174206 151034 48351 131788 51946 -79563 -2216 -49904 -20248 -95627 -115383 -132416
6955 -132416 -77735 -2547 -71921 -342357 -308055 -196535 -110575 108151 167738 139362 49020
6944 49020 16457 -48752 -104621 33180 229317 114453 -95633 -103054 -129347 -223596 -279824
6933b79824M69J31040N9306k930j7350J07422P9156j7686p6633P98L7046k35834
6921b15020j6433J51792m4312J48016J04339K034j59368J63675Q2696K5360j00793
6910A41986p6670O3831m587j97339j77119O5935K01789j0847n3264P9889M35O9078
6898A03117j8509o6568l5686o8877N0370N2883R9286j25688r8207P2691Q8139
6887E2951J08607j8718j36527p168m5179O7229R6951j4909J31218l2252j67813
6876C4390j40734N236J77712J2683l6892O2990O6537n2615j091j54440M8592K5867
6864D8235j90125j24187j16391K03267P5645k20302k31550K23001M13022j5246
6854F5369j38289l1650j45767j40881J02597J99611k4509q3451p5654o495l6353
$$ plain form
6933 -279824 -279355 -148315 -89009 -91939 -109289 -1867 77289 59603 -17030 -16232 20814 -215020
6921 -215020 -231453 -79661 -123973 24043 128382 130416 -28952 134723 217419 242779 141986
6910 141986 65316 129147 124560 -72779 -249898 -183963 17826 6979 -46285 33604 34039 103117
6898 103117 84608 18040 -17646 -86523 -36153 16730 116016 -9672 -107879 -35188 52951
6887 52951 161558 142840 6313 -855 -46034 21195 118146 103237 234455 202203 34390
6876 34390 -106344 -101108 76604 89287 52395 115385 181922 129307 128216 -26224 22368 48235
6864 48235 -141890 -266077 -382468 -179201 -103556 -323858 -555408 -332407 80615 65369
6854 65369 -72920 -104570 -250337 -391218 -288621 -89010 -113519 -196970 -272624 -279119 -315472
6843c15472K11858J71118L757p6074P9173k04157q9030P1643J88945m529k0797
6832A6435L8041o1257q9130O6825p6493j55842L1749k6473J20279J70599r938
6821B4795q727J18320K9225m1995k20755n436J6930P1807J91740j72446j20207
6810a16749k8507o4734J2828K26994O4464j50189K6363j17109p4591O5465N1880
6799a03885J9940l077j18508Q5835K51304Q9637n5635j55979k12340Q7092R3126
6788b2490k8123L3041q9904j01267L4992J21753O0365L1505j4887K7837o4854
6777a2032N181j08086j0845J40446J51283j41749J60384J22364j16416j84996
6767E534L0831J479J31438M8649j12346j30317k24619O9797J9497O8231j07716
$$ plain form
6843 -315472 -103614 67504 71261 -4813 74360 -129797 -218827 -147184 41761 37232 16435
6832 16435 54476 -6781 -95911 -29086 -105579 -261421 -229672 -256145 -135866 34733 24795
6821 24795 16068 134388 163613 121618 -99137 -104573 -87643 -15836 175904 3458 -116749
6810 -116749 -145256 -209990 -197162 29832 94296 -55893 -29530 -146639 -221230 -155765 -103885
6799 -103885 -83945 -87022 -205530 -119695 131609 221246 165611 9632 -202708 -115616 -22490
6788 -22490 -50613 -17572 -107476 -208743 -173751 -51998 8367 39872 24985 52822 -12032
6777 -12032 -6851 -114937 -125782 14664 165947 24198 184582 306946 190530 5534
6767 5534 36365 37844 169282 217931 105585 -24732 -249351 -179554 -160057 -91826 -199542
6756a99542l1170J35075L4192R1071j19196K588j9572j19374P6582m9400P7108
6745a21638J29468K2193k4169k13325n3091N6552J10047O7075P7725J87685O8036
6734C06558j85216p8661J87091R894k01263k6645N1898J48058p4697j54491L0385
6723A2911R8970m9793P1544j59414k9562J39130O8989K3014r4748j34713j66738
6712b20410p3204j09582Q8090L57354J88735j406j08769M5748J02195r7084j50061
6701B1606O7209J9453j97020l0885K57171J30112P7321O3478m4886n649j36458
6690B21452j29808M7130K8736M6224p7332J60494p1991j46987j17361O0361J73037
6679A93955J30511r775n8938j8839l3431p2688K7537j0349j4832J86385L942j09071
$$ plain form
6756 -199542 -230712 -95637 -61445 29626 -89570 -86982 -106554 -225928 -149346 -198746 -121638
6745 -121638 7830 30023 5854 -207471 -260562 -204010 -93963 -26888 50837 238522 306558
6734 306558 121342 42681 229772 239666 38403 11758 63656 211714 137017 -17474 12911
6723 12911 111881 62088 133632 -25782 -55344 83786 152775 175789 81041 -53672 -220410
6712 -220410 -293614 -403196 -315106 42248 230983 229577 120808 166556 268751 171667 21606
6701 21606 88815 108268 -88752 -119637 137534 267646 344967 408445 363559 357910 221452
6690 221452 91644 138774 167510 213734 136402 296896 224905 77918 -39443 20918 193955
6679 193955 324466 314691 255753 236914 203483 130795 158332 147983 133151 319536 323478 214407
6667B14407L598O5958l5783j71640Q6422j13673K2147J40998r249k7453K232o7807
6655A10157P119j04648j05739R149O303O9426l7360J35779m247j64641L1762J23464
6643G6524L7366M4831p1585l64354n9672K14862J2313N5803J76654J70673k9988
6632B63427k24263n6473j23940r8352q8937L6325R2287m78n2359J44212R9686
6621h865K0606p0690K9412K6918J42035J16672p6241l04452k0758l7713k38248
6610d21324n6400K47443K90579R3062j2813p0897r5609L30M9310J768p9510j16430
6598a70491m3273j15591n6485J54689J59184J04171q2197J59509L6951k1715r4129
6587C0623k0691j69166K8319J81171j2004J34123k1085r4444R3320r8249j08312
$$ plain form
6667 214407 218005 283963 248180 76540 162962 49289 71436 212434 203185 175732 177964 110157
6655 110157 117276 12628 -93111 -83962 -77659 -8233 -45593 90186 85939 -78702 -46940 76524
6643 76524 113890 158721 87136 -277218 -336890 -122028 -109715 -53912 122742 293415 263427
6632 263427 39164 -17309 -141249 -239601 -328538 -292213 -199926 -200404 -252763 -108551 -8865
6621 -8865 11741 -58949 -29537 -2619 139416 256088 179847 -124605 -145363 -183076 -421324
6610 -421324 -477724 -230281 60298 153360 140547 69650 -25959 -25629 23681 25449 -54061 -170491
6598 -170491 -213764 -329355 -385840 -231151 -71967 32204 -49993 109516 146467 124752 30623
6587 30623 9932 -159234 -130915 50256 38252 172375 151290 56846 150166 51917 -56395
6576e6395q0146k46359J26643J81504J6366L2901J07213K02556L5973k24980M4383
6565A39659R6021j00360j61109J19601R412r8860k1771J3365L6500j04046j87127
6554b58715j15628J20430P6383K01080J06192j08424N4790P3305j03111j53825
6544a07523p097M9619q0456k921k7340M3818j8208M0099k1903n598O4796Q1532
6532H818J18555l280K5137k5506M954n2233R2722j7438o2223j4024R1285K5410
6520A92177j85085j36484l6655R3995M862l6104J24246J09265q0429j49044p9286
6509a78542n1104M4060N1631N9016L506L4280K00182K417n6218m6769R1870o8321
6497H6008j37194n1031N9397N3620k22081m1708L13526J77299J76117P1787r4141
$$ plain form
6576 -56395 -136541 -382900 -256257 -74753 -58387 -25486 81727 284283 320256 95276 139659
6565 139659 235680 135320 -25789 93812 103224 4364 -17407 -4042 32458 -71588 -258715
6554 -258715 -374343 -253913 -177530 23550 129742 21318 76108 149413 46302 -107523
6544 -107523 -114620 -65001 -145457 -148378 -175718 -131900 -150108 -110009 -131912 -137510 -72714 8818
6532 8818 127373 124093 149230 123724 128678 76445 169167 151729 89506 75482 166767 192177
6520 192177 7092 -129392 -166047 -72052 -67190 -103294 20952 130217 49788 -99256 -178542
6509 -178542 -229646 -185586 -133955 -74939 -71433 -37153 163029 165446 109228 62459 154329 86008
6497 86008 -51186 -102217 -42820 10800 -211281 -252989 60537 237836 413953 485740 391599
6486C91599j50336p6732j37230l4284O3567n5828p4896m9451m9189L4341K29428
6475I0989r3802p5236p2634k26813j3985J04033J71698O9200N9372O7365p0424
6464I763n3295J65211J3874j66094j39254n3056J02966P3922k9575K4658j25876
6453a76756J32523J11204k458q3385o5712m0750J65149k7935k670m5837j1487
6442d8114l3929q3960j7871l6128q7832N2566J92584Q5771L2259q038o9951r8796
6430a21439M7446k08737J7824J13696j11865l7105j9350L3566K4787m5483r897
6419c16557O2009J06019L3691R7123q94K8133o4725p2580j0094o8707K0297M4134
6407a42151n383J10704Q8866p298o5582n4813r0481K44435J339Q069n314O3540
$$ plain form
6486 391599 241263 164531 27301 -6983 56584 756 -74140 -123591 -172780 -138439 90989
6475 90989 -2813 -78049 -150683 -377496 -391481 -287448 -115750 -46550 12822 80187 9763
6464 9763 -43532 121679 135553 -30541 -169795 -222851 -119885 -45963 -75538 -50880 -176756
6453 -176756 -44233 66971 64513 -18872 -84584 -125334 39815 11880 9210 -36627 -48114
6442 -48114 -82043 -166003 -183874 -220002 -307834 -255268 -62684 23087 55346 47308 -22643 -121439
6430 -121439 -73993 -282730 -264906 -151210 -263075 -300180 -319530 -285964 -261177 -306660 -316557
6419 -316557 -254548 -148529 -114838 -17715 -18609 9524 -55201 -127781 -137875 -206582 -186285 -142151
6407 -142151 -147534 -36830 52036 44738 -20844 -75657 -166138 78297 79636 87705 82391 145931
6395A45931N795o6687j07229o336k27621j56457j1515p2306K30528K26859L9000
6384c8p6260M3660n4372k02486m6550k5299M288o2971j2146l79K55395J93265
6372A6107l3768k14826R9307Q6818N8706J3414Q1831L5700l8906j18840m9272
6361f3729K3080j9518L0257k5531J10950J11135j39154q9007L7763J48288J17027
6350B41561j7434k12890J15633q0804j57590K8897J58497K3875J4952P6441J34440
6339C25578p3045j13910n5933l1197o893n5923o7434n4430P8478J64817N840j11293
6327D655j43787j05507q8987Q6770K3986J03040o9744j30692m0265O2023j845
6316c00353Q3141M9274L8764J73351P7584K0013p8716L4551N5295o1470p3770
$$ plain form
6395 145931 151726 85039 -22190 -28526 -256147 -412604 -424119 -496425 -265897 -39038 -38
6384 -38 -76298 -32638 -87010 -289496 -336046 -361345 -357057 -420028 -432174 -432553 -177158 16107
6372 16107 -17661 -232487 -133180 -46362 12344 25758 107589 143289 104383 -14457 -63729
6361 -63729 -40649 -60167 -29910 -55441 55509 166644 27490 -61517 -23754 124534 241561
6350 241561 224127 11237 126870 46066 -111524 -82627 75870 99745 114697 191138 325578
6339 325578 252533 138623 82690 51493 44600 -11323 -78757 -133187 -54709 110108 115948 4655
6327 4655 -139132 -244639 -333626 -246856 -222870 -119830 -189574 -320266 -360531 -298508 -300353
6316 -300353 -217212 -167938 -129174 44177 121761 141774 63058 97609 152904 91434 17664
6305A7664n6175k5967n6920J14836l5084j28011P4256J55967J20225m915M2138
6294B18014K5988J6554j34003J33571L4959j11667M4517L0722j30468m2230J19153
6283B05110l6146n6217O9886j5282j39390J46036J35077J144k03675q7507n0883
6272c1847k7137M77n413J06828Q3622o8889R6300J0897n7478p8798j813m6478
6260a9729J13111J8641J18186R3613l3215j82408q3936P8917J23074L4664m5765
6249B15153N8231j21790j1818K5603q1445o1351q0384J11456J32380n5543p8306
6238E2186q7235j11749M8546K3796R6254r572J25910l4621q0596j27413j38071
6227b42565p9062j1030O3952K5883Q3083m1819O93L9913J96319J08660m5643m9874
$$ plain form
6305 17664 -38511 -64478 -121398 -6562 -41646 -169657 -95401 60566 180791 175876 218014
6294 218014 244002 260556 126553 260124 295083 183416 227933 258655 128187 85957 205110
6283 205110 168964 112747 182633 167351 27961 173997 309074 310218 106543 19036 -31847
6272 -31847 -58984 -58507 -63920 42908 126530 57641 153941 164838 107360 28562 26749 -19729
6260 -19729 93382 112023 230209 323822 290607 108199 24263 103180 226254 260918 215153
6249 215153 273384 151594 139776 165379 83934 22583 -57801 53655 186035 130492 52186
6238 52186 -35049 -146798 -98252 -74456 21798 12226 138136 103515 22919 -104494 -242565
6227 -242565 -321627 -332657 -268705 -242822 -159739 -201558 -200865 -160952 35367 144027 98384 48510
6215D8510n485L7460J4585J00252q8570r5220n6840n2855M7971M7451K8236o7853
6203d2358J4675K3810r291O2995J06433n865j46380k5026J2157k10398K5510J49479
6191d4259r532k7451P2k9399N9782K32353J9003k01091j75262R51R3011M6985
6179c4837K7681k9834J7906p6292k44O9754K3713l4707j6658j52806j83412J23314
6167b66422J43255j05187N0407J9343K08324m8335q5564p8089J52005J77775n07
6156A67005J72452L6643k99715j03017P5655j6716R9605P9727m4234m9414j74410
6145e6419j45609O7605J17221N2959N5680Q926k5751j4860P2180o3514j33004
6134f4586N9121J6645O7868o939j85803k9841R1592K8175j11161n7653N2463L4486
$$ plain form
6215 48510 43025 80485 95070 195322 106752 11532 -45308 -98163 -50192 -2741 25495 -42358
6203 -42358 -27683 -3873 -13164 49831 156264 150399 4019 -21007 -8850 -219248 -193738 -44259
6191 -44259 -53791 -81242 -81170 -110569 -50787 181566 200569 -522 -175784 -174833 -81822 -34837
6179 -34837 -7156 -36990 -19084 -95376 -95620 -25866 -2153 -36860 -53518 -206324 -389736 -266422
6167 -266422 -123167 -228354 -177947 -158604 49720 1385 -84179 -162268 -10263 167512 167005
6156 167005 339457 376100 76385 -26632 49023 32307 131912 211639 167405 117991 -56419
6145 -56419 -202028 -134423 -17202 35757 91437 100363 74612 59752 131932 68418 -64586
6134 -64586 -5465 11180 79048 72109 -113694 -143535 -51943 -23768 -134929 -192582 -140119 -105633
6122a05633r4515J7046m0691J04364p171R4668p5522K4567J11153J81800j1367
6111A98699j98697p2449J3959j15464l1666J22647J83682j64390j36228J6099
6101a83808j2873l0526J49500J32753J78561J6958L5752q9278r1440J00557j3799
6090A92357o9861L0682N5242N3637j42101p7643N0049p1744N6865L3413J16288
6079B27184L8147k6148n7000M0522j04330r4828j55736J17867M2616j2000k0490
6068d196J9184J4931P5743l1717m0758J49934P4946j69557l6658p3377j68187
6057a89712j1258k3000k131J09258P3110Q0948L4635J4639p4113Q6008j16460
6046a8076M5091J23168Q3652J24052O7235j63459l05897p7289R3934K07440J28839
$$ plain form
6122 -105633 -200148 -183102 -223793 -119429 -126600 -31932 -107454 -82887 28266 210066 198699
6111 198699 2 -72447 -58488 -173952 -205618 -82971 100711 -63679 -199907 -183808
6101 -183808 -196681 -227207 -77707 55046 233607 250565 286317 197039 105599 206156 192357
6090 192357 122496 153178 208420 262057 119956 42313 92362 20618 77483 110896 227184
6079 227184 265331 239183 182183 222705 118375 23547 -132189 -14322 28294 16294 -4196
6068 -4196 14988 29919 105662 73945 33187 183121 258067 88510 51852 -21525 -189712
6057 -189712 -200970 -223970 -226101 -116843 -43733 37215 71850 86489 12376 98384 -18076
6046 -18076 27015 150183 233835 357887 425122 261663 -44234 -121523 -27589 179851 308690
6035C08690m4236r5149o0823m8785o0367r9949Q3631l7607N3593J84610o5356
6024A18252q7614q4736O9226R7224r3183o7392J8344k7188j05130j61410K04490
6013a19117J47891J7524M4223O2800K15238m621j18029j84933j77402O059o8799
6002a79166j10131j668O8106k5293k23612J559K14711L15799J03371r6718j12747
5991d5789k1395O51J12406m4725j20076k2880K53839P3554k3882l3456J2501j80067
5979c9319q8197k4397J05061K13882O4869j59334P9947P5207l9824L20k56847
5968f8632p5212J43412J69613J9131R7901O603j51771j43977M85j1115K3055k5499
5956a6006k2643m3391p4459J60088J66872N7011K3327n1983j09572m9680M6664
$$ plain form
6035 308690 264454 169305 108482 59697 -670 -100619 -16988 -54595 -1002 183608 118252
6024 118252 30638 -54098 15128 112352 19169 -48223 -29879 -57067 -162197 -323607 -119117
6013 -119117 28774 46298 90521 153321 368559 363938 245909 60976 -116426 -110367 -179166
6002 -179166 -289297 -290965 -222859 -248152 -471764 -470205 -255494 60305 163676 66958 -45789
5991 -45789 -67184 -66533 45873 1148 -118928 -141808 112031 185585 161703 128247 140748 -39319
5979 -39319 -127516 -151913 -46852 167030 231899 72565 152512 227719 187895 188215 -68632
5968 -68632 -143844 -432 169181 188312 286213 292816 141045 -2932 -2447 -13562 9493 -16006
5956 -16006 -38649 -82040 -156499 3589 170461 227472 250799 198816 89244 39564 86228
5945H6228l0255n9460K8695n6989j25377K79866l277N3361o2003n9290O8927L4151
5933A54577l362J2468J8953m8884j4453Q873k16213K8361J50900k9823n1552L2226
5921D2071O6722l5113j82415k426M2559Q4997l9125j61291N8976P5111O4622Q3719
5909I8407Q853r7206l1489J1860J67326n6072k27065K9103N8235k8266K09795
5898A43481m94j39413p5277q2217j12692n6236Q7391J53778L27283N9982j94681
5887A10905r0241K5450M9339l2474R4581J7250j06198J9983J15R9667n2093j62253
5875b5969K7585j355k11381K29845p1463j65370M9197J44376r246J53084J78990
5864B98293q2374j57908K9172R1660Q6153J01278k29540m6796q4145j19588P487
$$ plain form
5945 86228 55973 -3487 25208 -31781 -157158 122708 119431 172792 110789 51499 120426 154577
5933 154577 151215 163683 182636 133752 119299 128172 -88041 -59680 91220 61397 9845 42071
5921 42071 108793 73680 -108735 -111161 -68602 16395 -22730 -184021 -125045 -49934 14688 98407
5909 98407 107260 10054 -21435 -9575 157751 101679 -125386 -96283 -38048 -66314 143481
5898 143481 142987 3574 -71703 -153920 -266612 -322848 -235457 -81679 245604 305586 110905
5887 110905 20664 46114 95453 62979 157560 174810 68612 88595 88710 188377 136284 -25969
5875 -25969 1616 261 -211120 18725 -52738 -218108 -168911 -24535 -33781 119303 298293
5864 298293 215919 58011 87183 178843 264996 366274 136734 89938 5793 -113795 -106308
5853a06308M2593k8102n9592o7858L4139Q8815m0554J62520m8296R9187J09177
5842A85721L8025k32401L3763L1572o9045O0583l74j83093j29933P3480j0706
5831b02408m3104J58608q1211Q5247K70993n6923j22018j25122R0966P3389J1143
5820E9560Q294J431j396j1171k5517O329J11017j81022p8745j19695J61357J81966
5808A12408l3234K0485j59911j32022m9705K0419n1358Q7484K42452K992j9520
5797D0490j21556K1584P5718l6950j4473j18620N6774j21434l1343m1606q3k8465
5785c19964J83173j34554m3198P9573K44517n0960j05374j19322K1728r89k1612
5774b66982J0649j07764n269K31410J04589Q530N5925P9220M0084j91274j49541
$$ plain form
5853 -106308 -63715 -91817 -151409 -219267 -185128 -96313 -136867 25653 -22643 76544 185721
5842 185721 223746 -8655 25108 56680 -12365 48218 47844 -135249 -265182 -191702 -202408
5831 -202408 -245512 -86904 -168115 -82868 188125 131202 9184 -115938 -24972 48417 59560
5820 59560 67854 69285 67889 56718 31201 37530 148547 -32475 -111220 -230915 -69558 112408
5808 112408 79174 99659 -60252 -192274 -241979 -221560 -272918 -185434 57018 60010 40490
5797 40490 -81066 -59482 16236 -20714 -35187 -153807 -97033 -218467 -249810 -291416 -291499 -319964
5785 -319964 -136791 -271345 -314543 -234970 9547 -41413 -146787 -266109 -244381 -245370 -266982
5774 -266982 -256333 -364097 -369366 -137956 -33367 -24837 31088 110308 150392 -40882 -190423
5763a90423P8085J54039o326P978q799j20103Q4035L1665q3878J10667n6751j05317
5751a05128O2849Q8665Q4370q2091P3938K705j3716O6977o1762j50357j24869
5740a58419j64029n2993J98739Q2204K11100K91555N6210q5695j31856j43044
5730A03772O3799n3099K0981j34246r8854o7087k3797R3170J39216N2958L2203
5719A29016K0651L7187K39887j1184k09100j47182k5198o3584R6752J2287K7023
5708A06555j3368J4665J01434j19663N0333p6421j36520o7688j64770K1697N804
5697b77942K20485J78631j39843k21531L8818J57538J18569k6033j54951J13884
5687G625M3020j67483O4610M4506J82164l3806n6690j02548j0310M9114j166O7259
$$ plain form
5763 -190423 -112338 41701 35375 43353 34554 -85549 -1514 30151 -53727 56940 189 -105128
5751 -105128 -42279 46386 130756 48665 122603 125308 111592 178569 116807 -33550 -158419
5740 -158419 -322448 -375441 -176702 -94498 116602 408157 464367 378672 246816 103772
5730 103772 167571 114472 135453 1207 -97647 -164734 -188531 -95361 43855 96813 129016
5719 129016 149667 186854 426741 415557 206457 59275 34077 -29507 67245 79532 106555
5708 106555 93187 107852 209286 89623 139956 63535 -72985 -140673 -305443 -283746 -277942
5697 -277942 -57457 121174 -18669 -240200 -201382 -43844 74725 48692 -106259 7625
5687 7625 50645 -116838 -52228 -7722 174442 140636 83946 -18602 -28912 20202 19036 86295
5675H6295O6294j60648j46085J09718K72022n9794j69280p1828L3952N2427k3087
5664a0014K4241J79777m5450r0369K4161n1625q2868o1950K26376J7433j90039
5653f0327j25742l9084J54726J73121R4082o7355q2984n1964K2259J69649q6933
5642I9448j84815P0009K9187N0944k03616q5298J08729L8250K5034M3717J19025
5631A10614n0709j24229j84023l9706K56093J42531n3503j88878o9384M9014M9846
5620a02334O280R4312k5692q902N454m1549m2631M3627R6217J44379j1106j28079
5608B9976j11713R4364K2608p1971j73083J2522J13631J64599m289j57788n4921
5597a36065l3249N8585J56231M3766J18220o5029N4416R2167n6085r2344k34285
$$ plain form
5675 86295 152589 -8059 -154144 -44426 227596 167802 -1478 -73306 -39354 13073 -10014
5664 -10014 14227 194004 148554 58185 82346 30721 -52147 -114097 112279 129712 -60327
5653 -60327 -186069 -225153 -70427 102694 196776 129421 46437 -5527 16732 186381 99448
5642 99448 -85367 -15358 13829 64773 -138843 -224141 -115412 -77162 -52128 -8411 110614
5631 110614 59905 -64324 -248347 -288053 -31960 110571 57068 -131810 -201194 -152180 -102334
5620 -102334 -96054 -1742 -27434 -36336 -30882 -72431 -115062 -71435 24782 169161 158055 29976
5608 29976 -81737 12627 35235 -36736 -209819 -197297 -83666 80933 76644 -81144 -136065
5597 -136065 -169314 -110729 45502 89268 207488 142459 196875 289042 232957 140613 -93672
5586i3672k7758R5795K4616J31388Q294J926j48267j66109l1737k4102K07965
5575b1661l6359j29039N457Q5896M6461M3352q2677J8903O6490o5677K200J21252
5563E4598n8729L506p9591M4273l6967J5771K51505J09456o7957l4306M8176r4328
5551A55407J74944J2969q490J5961j28879j1405M2415l3316J66j78667M370m804
5539D0671j30879k55118P5752k6697l256J16960J86297j4051Q0845K4579o6800
5528B8303j76906J11279J90618N4409j33539m3023J76968K9104j81007k70437
5518b14231j26861J16573J40298J27668K2131J9221l9794j43734k9930o7515M4269
5507a51905O2506m1580M565K9833l5356J9880L7418l5406J63779K94499J6399
$$ plain form
5586 -93672 -121430 -25635 -1019 130369 138663 140589 -7678 -173787 -205524 -229626 -21661
5575 -21661 -58020 -187059 -181602 -95706 -49245 -5893 -88570 -69667 -3177 -68854 -66654 54598
5563 54598 -4131 -625 -80216 -35943 -72910 -57139 194366 303822 235865 201559 249735 155407
5551 155407 330351 343320 334830 350791 221912 210507 252922 219606 219772 41105 45475 40671
5539 40671 -90208 -345326 -269574 -296271 -299527 -182567 3730 -10321 70524 95103 28303
5528 28303 -148603 -37324 153294 207703 74164 31141 208109 237213 56206 -214231
5518 -214231 -341092 -224519 -84221 43447 65578 84799 45005 -98729 -128659 -196174 -151905
5507 -151905 -89399 -130979 -126414 -96581 -131937 -112057 -74639 -110045 53734 348233 364632
5496C64632m6850n9313k3477j67119k44249J26687K23668k19311o7042N4842J99323
5485A41791q936K5056r5984J33407o930j02005k12981n840o1884Q6204J43216
5474C5114K14410j28729j47233N5006J02722o4387j12881K7373N8428o1372L5054
5463A3505j4301o75J05336q1306p3622P4877J4912j01146N7233o7246O3900J54918
5451A46385L7934q2528n2546k3718M1813Q8056j90018o2786N3855O2744L18445
5440C37636Q2546k19647o6399r88k3747N17J7504P4191P6698j91935j68685k9771
5428a12080m5498R826k1528R1222Q3365J15027J4111o1874r4238J15296k8578
5417F5051j00215L1247J41038l5752q27j14854k8538P1453j553p7487O8719m4335
$$ plain form
5496 364632 317782 258469 234992 67873 -176376 -49689 173979 -45332 -112374 -57532 141791
5485 141791 132855 157911 61927 195334 188404 86399 -126582 -132422 -194306 -108102 35114
5474 35114 249524 120795 -26438 28568 131290 66903 -45978 -18605 39823 -21549 13505
5463 13505 -796 -1471 103865 22559 -51063 23814 38726 -62420 -5187 -72433 -8533 146385
5451 146385 184319 101791 49245 25527 67340 155396 -34622 -97408 -43553 19191 337636
5440 337636 420182 200535 134136 133148 109401 109918 127422 201613 278311 86376 -82309 -112080
5428 -112080 -157578 -147752 -169280 -78058 5307 120334 134445 72571 -21667 93629 65051
5417 65051 -35164 -3917 137121 101369 100542 -14312 -42850 28603 27050 -50437 18282 -26053
5405b6053L9822J71984o6463l2950j72910j78138M0091K84908J53648j34936k9710
5394D9293P9783r233Q540n5414k24270m4310m2274J10588k3970l3790J42416J58346
5382A15705L8661k3173o3659N4195J07686j30060k52076K0346p4781l4438K37305
5371d289P4560m0949l8329k0167n6293q408L9419K32250k6731o2602r8579j07951
5359a18069P429m1796O7342J59504q2595r1082R5575Q4805j29203k1233K22930
5348A53607m4824q8447p7372J52387M2803k85466k21446L6107J26884j46929j27824
5337d80520k8384J65458J70561J377J57557J40465K9967n9048N7433M1412j16888
5326G9390K1079q6048O869J92465J14271O5952j71412j39615k49825j12614R9906
$$ plain form
5405 -26053 13769 185753 119290 86340 -86570 -264708 -224617 60291 213939 79003 49293
5394 49293 129076 119843 128383 72969 -151301 -195611 -237885 -127297 -151267 -185057 -42641 115705
5382 115705 154366 131193 67534 121729 229415 99355 -152721 -132375 -207156 -241594 -4289
5371 -4289 70271 29322 -9007 -29174 -85467 -93875 -54456 177794 151063 88461 -10118 -118069
5359 -118069 -110640 -152436 -85094 74410 -8185 -99267 -3692 81113 -48090 -69323 153607
5348 153607 108783 20336 -57036 95351 138154 -147312 -368758 -332651 -205767 -352696 -480520
5337 -480520 -508904 -343446 -172885 -171508 -13951 126514 156481 97433 154866 196278 79390
5326 79390 100469 14421 21290 213755 328026 393978 222566 82951 -166874 -279488 -179582
5315a79582L3476K19061K74226R6157k01113R7141J37112o4293j44700L718j01331
5304A69872N5732j99742j51305L2153J5431j13893J06793J35205L0530j23523
5294d2747R8969J43455k15228P6584P5382N583j45225l7116R3390k4421j67074
5283a38448m707R5978r829r079M8423j19351n811N0929n0614j357k13258J36506
5271b20618J77085J29734k4402j06833J7296j2824P2864j7551J03623j01842r2909
5260g6377m3823M8274Q8530p4299l2391J10377j11457r6911M9597J3625q6420
5249b11275P8819R49n4103j05697m3355J25926J03805o5446p2035L07098M8033
5238A12719k19521J3928R8822q4529Q6k8888j25672J87312k7515r0204K5192o6096
$$ plain form
5315 -179582 -146106 72955 347181 443338 242225 339366 476478 412185 267485 271203 169872
5304 169872 225604 25862 -125443 -93290 -77859 -191752 -84959 50246 80776 -42747
5294 -42747 56222 199677 -15551 61033 136415 141998 -3227 -40343 53047 28626 -138448
5283 -138448 -143155 -47177 -57006 -66085 -17662 -137013 -142824 -91895 -142509 -143866 -357124 -220618
5271 -220618 -43533 86201 61799 -45034 -27738 -40562 32302 14751 118374 16532 -76377
5260 -76377 -120200 -71926 16604 -57695 -90086 20291 -91166 -188077 -138480 -124855 -211275
5249 -211275 -132456 -131507 -185610 -291307 -334662 -208736 -104931 -170377 -242412 64686 112719
5238 112719 -106802 -92874 5948 -78581 -78495 -107383 -233055 -45743 -73258 -163462 -138270 -204366
5226b04366J212J85122O5473O3657k8463O829j82665p6806p903n4936l6921Q2909
5214a86858J20006Q3916n2004N7960k2405k02201l3577O8022m3965o8011J28679
5203a50438J64755k754M8572P5636n725J4872p5922j21594k9420L0426K1250M3242
5191A2900j43043O3060J19848j82599j73449J5794O7842L1239K26104M4379n6483
5180B5592n5238P3109J99312J6218l5794M1533Q278m3591N5739j40062o1940k3687
5168E9469R6106k9085Q8455j03439j40967L3169J03128J8152p1600R212o9869
5157g269J38912j20518n044J18469j6851p5768J3821l7508K916P785n6296n5511
5145i2862L0029L7848r2676p3459m2946J2431O3738j8145j53344J7493L39280
$$ plain form
5226 -204366 -203154 -18032 47441 111098 82635 89464 -93201 -170007 -177910 -232846 -269767 -186858
5214 -186858 -66852 17064 -34940 23020 615 -201586 -235163 -167141 -211106 -279117 -150438
5203 -150438 14317 11563 60135 135771 130046 144918 68996 -52598 -82018 -51592 -30342 12900
5191 12900 -130143 -67083 52765 -129834 -303283 -287489 -219647 -188408 37696 82075 25592
5180 25592 -29646 43463 242775 258993 223199 264732 273010 229419 285158 145096 83156 59469
5168 59469 155575 126490 214945 111506 -29461 3708 106836 124988 53388 62600 -7269
5157 -7269 131643 11125 6081 124550 107699 31931 45752 8244 11160 18945 -37351 -92862
5145 -92862 -62833 -24985 -117661 -191120 -234066 -221635 -157897 -176042 -329386 -311893 27387
5134B7387J86958j56045r8748M0065p9604j9105P4711j56846M641J15427n5763
5123a16922N3359J7934R7413J80291j67487l4530K1454N369K2205O3436K268J923
5111A46713m6935j52188N8495J97033p2866k08058j64937o9715q4220K48881J00066
5100d7731l642l3676J33760j59668k60701j53901J05417J95185M2955R5765Q2680
5089c557k4738O9442j75351k06143L330p3502N4826K39677J41880l4019k40873
5078b49028j71567l808J41946J79954J08922J1377o6955J18589N9967r5478R1412
5067A25331k078M6512J70243n9816j43219m2730m9187j14877j3712J1080N7400
5056a5053o1817j82602J1304N0866J10885J54662j37674L577J93384R2678p8803
$$ plain form
5134 27387 214345 58300 -40448 -383 -79987 -99092 -24381 -181227 -176586 -61159 -116922
5123 -116922 -63563 -45629 51784 232075 64588 30058 51512 56881 79086 142522 144790 146713
5111 146713 99778 -52410 6085 203118 130252 -77806 -242743 -312458 -396678 -147797 -47731
5100 -47731 -51373 -85049 48711 -110957 -371658 -525559 -420142 -224957 -182002 -86237 -3557
5089 -3557 -28295 41147 -134204 -340347 -337017 -410519 -355693 -116016 25864 -8155 -249028
5078 -249028 -420595 -424403 -282457 -102503 6419 17796 -49159 69430 129397 33919 125331
5067 125331 123253 169765 340008 280192 136973 94243 45056 -69821 -83533 -72453 -15053
5056 -15053 -76870 -259472 -248168 -197302 -86417 68245 -69429 -65852 127532 220210 141407
5045A41407L3184r8542N0365l4330j15037m1890p1275J18658M8040j31841j19094
5034b20355R4166J23839K9770j11245n9862J89194L7437j98111M0625J18410J02445
5023A46313J5719J39780n9624j72049j79915o463J4041P9130k2526r551P6962
5012B1817m934r6101j15478Q4148m0677p2749l5131M1739q5727p8045J38341J3044
5000b29753P6513K67850L2388J31574j44621j46645J56345o483j75089j10234
4990a48155k7753J92792J8867l6676j34188R450M587n6036J66112J34044o2283
4979F0761k0530j51234q6699j5715J39943J15926L1935K5281j7914J4678O2744
4968A59176q4471j99447j79748J64555Q266j841P6329J67742q9918N8735m2088
$$ plain form
5045 141407 174591 76049 126414 92084 -22953 -64843 -136118 -17460 30580 -101261 -220355
5034 -220355 -126189 -2350 27420 -83825 -143687 45507 82944 -115167 -74542 43868 146313
5023 146313 162032 301812 242188 70139 -109776 -116239 -102198 -23068 -45594 -55145 21817
5012 21817 16883 -79218 -194696 -110548 -151225 -223974 -259105 -217366 -303093 -381138 -242797 -229753
5000 -229753 -153240 114610 146998 278572 133951 -12694 143651 137168 -37921 -148155
4990 -148155 -175908 16884 35751 -925 -135113 -125663 -121076 -177112 -11000 123044 60761
4979 60761 40231 -111003 -197702 -213417 -73474 42452 74387 99668 81754 96432 159176
4968 159176 74705 -124742 -304490 -139935 -131669 -133510 -57181 110561 20643 79378 37290
4957C7290j30844j0023J36403n3958L8204l1599Q3362J80662r4425L8238J46433
4946C39743j03640j13485M3668M5128j01240n3955J51270J06527o9852k77083
4936c2919n7207l5466J07582K7490O512J73068Q1742j06464n3104M6819k2169
4925A35884M323o2082j64524Q9338K7101j8559L795M7843M7541J7832L0015j09005
4913D9502k24890j35809J19169l1291q784J73065N4234j9994p5227r5180j15953
4902c11158J79692J29587N5427K5239Q212K48613L4288j15570k37043p2283J62485
4891A07489K8063j7409k14096J71447J36648j47025l9684j16756o0250J8132J02670
4880c0771J40949J09295m3344j23746j6678J13150J10817k9535j59212j38103
$$ plain form
4957 37290 -93554 -103577 32826 -21132 17072 -14527 68835 249497 155072 193310 339743
4946 339743 236103 122618 166286 211414 110174 56219 207489 314016 244164 -32919
4936 -32919 -90126 -125592 -18010 9480 15992 189060 270802 164338 111234 158053 135884
4925 135884 140207 78125 -86399 2939 30040 11481 15276 63119 110660 128492 158507 49502
4913 49502 -175388 -311197 -192028 -223319 -232103 -59038 -4804 -24798 -100025 -195205 -311158
4902 -311158 -131466 -1879 53548 78787 86999 335612 369900 254330 17287 -54996 107489
4891 107489 135552 118143 -95953 75494 212142 65117 25433 -91323 -151573 -133441 -30771
4880 -30771 110178 219473 176129 52383 35705 148855 259672 230137 70925 -67178
4870f7178Q9993m2830k9100K9397L6891Q9342L0124j03391j0397M4222Q3569n3303
4858I7339j98683m2695m5757K12871k3398r7992R7153J72089j01621l4891N7905
4847I2320q8039j67297J5092J18378K1727n8649o8339K5347p8747n1954L2991
4836b07170J43531q1836j56692q539J26884Q7040K0920k7088Q8571m0225m0588
4825i5192j02771m377O2022q889n1485K5320N3019p4797k5967L93732J54923m5741
4813B79797k45564O3427J6582k06368m7431Q698M227J25292R3723L8799p6313
4802E4869r3136r3033K0911L9657j03481M9840J19776O0617P7969J21508j14463
4791A41034j38031j08302J69839J10167j14937k86483j15686K03903J50063o778
$$ plain form
4870 -67178 22815 -20015 -49115 -19718 17173 106515 136639 33248 22851 67073 150642 97339
4858 97339 -101344 -144039 -189796 23075 -323 -98315 -1162 170927 69306 34415 92320
4847 92320 4281 -163016 -147924 -29546 -7819 -66468 -134807 -109460 -188207 -240161 -207170
4836 -207170 -63639 -145475 -302167 -310706 -183822 -96782 -75862 -102950 -14379 -54604 -95192
4825 -95192 -197963 -202340 -140318 -149207 -200692 -175372 -122353 -197150 -223117 170615 325538 279797
4813 279797 34233 97660 114242 -92126 -139557 -130859 -126632 -1340 92383 131182 54869
4802 54869 -38267 -131300 -110389 -70732 -174213 -124373 -4597 56020 133989 255497 141034
4791 141034 3003 -105299 64540 174707 59770 -226713 -342399 -138496 11567 4789
4781D789K1704j79013J14085M194k41036p2840J180L4195R904o1326J34410J21162
4769a08592N4311m2198o4425p175j07936K4954J93290K8799j38358k39192J32454
4758b74068J04178J5931P0874n3412j02017K52107k9147k18379l2357l5454R1021
4747b10723L9808J66807J46930j23647j72263Q3528K2814L6972o217k5403o7218
4736a08612J90548J1066p875n640p8667j79914N8092L6553q3495L0801J884k6515
4724a61774P6215j03373N5682K8681N7356r593o6071Q545l1999M9311k0467J29008
4712A1521j02379j44298l2794M4503m6076J52312J92261P5529n6380j02773l0072
4701c8646j08986r284J47841o300l9857p650R4887j97944j85762n4150N3371l1633
$$ plain form
4781 4789 26493 -152520 -38435 -34241 -275277 -348117 -346937 -312742 -302838 -364164 -229754 -108592
4769 -108592 -54281 -96479 -160904 -168079 -276015 -251061 -57771 -28972 -167330 -406522 -274068
4758 -274068 -169890 -153959 -83085 -136497 -238514 13593 -15554 -233933 -266290 -301744 -210723
4747 -210723 -170915 -4108 142822 19175 -153088 -69560 -46746 -9774 -15991 -41394 -108612
4736 -108612 81936 93002 85127 79487 820 -179094 -121002 -84449 -167944 -137143 -135259 -161774
4724 -161774 -85559 -188932 -133250 -104569 -47213 -56806 -122877 -114332 -146331 -97020 -117487 11521
4712 11521 -90858 -235156 -267950 -223447 -269523 -117211 75050 150579 94199 -8574 -38646
4701 -38646 -147632 -156916 -9075 -15375 -55232 -62882 32005 -165939 -351701 -405851 -352480 -384113
4689c84113J22549J09032J23095J52730j08804j53725K7881L396l22178j07742
4679e37879O969R1790K25516N3140J9539k8266m4528k5513R2782K8443R7796M2696
4667B2485j26009R0013M4347K9862n6791l7944J11672J32420k61429P6000J10081
4656A34707j55044k11238p7851O5486Q0803N4268Q5295K1500M915L6335N6213
4645I5389p7760j7579J03614m9768j15119m8816j72167p7747J27184J33375j7127
4634a16521l7532k7676N2428J98712M8875r4438r8307O2968O8149k5539j58602
4623a27483j6820J69011l0867O4358k0424o5253j35018M1882K82634K0775j21689
4612F1106o3409j56470m8706J13581J96551k5080j61071k1111J56251L5525k2770
$$ plain form
4689 -384113 -261564 -152532 -29437 123293 14489 -139236 -111355 -107959 -430137 -537879
4679 -537879 -530910 -439120 -213604 -160464 -140925 -169191 -213719 -239232 -146450 -118007 -20211 22485
4667 22485 -103524 -13511 30836 60698 3907 -34037 77635 210055 -51374 24626 134707
4656 134707 -20337 -231575 -309426 -243940 -163137 -108869 -23574 -2074 2841 39176 95389
4645 95389 17629 50 103664 53896 -61223 -110039 -282206 -359953 -232769 -99394 -116521
4634 -116521 -154053 -181729 -129301 69411 118286 23848 -74459 -11491 56658 31119 -127483
4623 -127483 -144303 24708 -6159 58199 37775 -27478 -162496 -120614 162020 182795 61106
4612 61106 -2303 -158773 -207479 -93898 102653 77573 -83498 -104609 51642 87167 64397
4601F4397j5307L8089j14448j87895Q7202p8464J03712o7871Q614j00386N918
4590b56439n8037M4899J11188J30372N9794Q6266m33q5159j62195j14400L005
4579b41139L2692J11574N0425r7292q1129K0863L2768j2439K04701J67670j5880
4568A72814j29254j67162m1585J60071M3834j55592J01154J55612R549O9624j38926
4557H0139n6087P4251J13405q55o0713k21698j73801J48604R2763L4108J45088
4546A75204J68828j88188k98172N9286K229K5942N7822M3582o4282M7242P6829
4535A06322Q7294K2523m0451o5998l7400j93952N4621Q2246r6159j56113J9367
4524b17700k9992k7463j57265K4336J17728R732K1675O3280J84099J45427q4273
$$ plain form
4601 64397 49090 87179 -27269 -215164 -127962 -206426 -102714 -170585 -161971 -262357 -256439
4590 -256439 -314476 -269577 -158389 -28017 31777 118043 117610 32451 -129744 -244144 -241139
4579 -241139 -208447 -96873 -46448 -143740 -224869 -204006 -171238 -183677 21024 188694 172814
4568 172814 43560 -123602 -165187 -5116 38718 -116874 -15720 139892 149441 219065 80139
4557 80139 24052 98303 211708 210853 150140 -71558 -245359 -96755 -3992 30116 175204
4546 175204 344032 155844 -142328 -83042 -80813 -54871 2951 46533 -17749 29493 106322
4535 106322 193616 216139 175688 109690 72290 -121662 -67041 15205 -80954 -237067 -217700
4524 -217700 -247692 -275155 -432420 -408084 -290356 -280624 -258949 -195669 -11570 133857 49584
4513D9584l7516J15460N1954m8987k37915j50456O8274N294r331N7563J18693
4502a7383J98787L9892M5119j23452j12210P7805l0811o7775J985k1334J48986
4491A39609j35978j20096Q8639K06054k9539O4074M2780j146j06970j40130j25101
4480a17804J17076J84634j10488k1250o9777r5278k6436j27787n3643J01249P6104
4469a43400j5212j2486P0679k3010N1517K39102k7279K9771L9571M213O1717m4452
4457B30731k62900k64236j34421l2271M5816M77651J45047j82748Q8414J8580
4447A29663l9213m5428j45389N0649J02173j0969N7380j8769n1566n170m1663
4436a8302m8896o0796J30649R020j62689L3878k791J5927Q5588p952p9762l0964
$$ plain form
4513 49584 12068 127528 179482 130495 -107420 -257876 -189602 -184308 -193639 -136076 -17383
4502 -17383 181404 221296 266415 142963 30753 108558 77747 9972 11957 -9377 139609
4491 139609 3631 -116465 -27826 178228 148689 212763 255543 254397 147427 7297 -117804
4480 -117804 -728 183906 73418 52168 -17609 -112887 -139323 -267110 -320753 -219504 -143400
4469 -143400 -158612 -171098 -100419 -123429 -71912 167190 139911 169682 209253 213466 275183 230731
4457 230731 -32169 -296405 -430826 -463097 -417281 60370 205417 22669 111083 129663
4447 129663 90450 45022 -100367 -49718 52455 41486 98866 80097 28531 23361 -18302
4436 -18302 -67198 -127994 2655 11675 -151014 -117136 -119927 -104000 -18412 -26364 -106126 -137090
4424a37090Q1475L3213j6386J18304J90213N3686p4010o5719j9754j59877K1563
4413B5618m7578j36248J60289N3252J27589j47474j77474k7817j55051l8126P4472
4402b88548J06966J16753m8850r1936r3710N658O0671J6621J1038J07431K7M3471
4390e4408j10934n4445J57419j0781J21471m1563n4577j54298J071J17301R3154
4379I410j10142J35164J35347o9782m4495j29140O2814P3875L780L6692j9470
4368H4053J20505J48113j01171j85262j25214R5970n3048j24110R0546J01535
4358E1917J9161j50509Q6259O8237j22560m7943J14863P0473m0724j48125K24396
4347A25445o648J33456Q4428j04968j57617J28387L3714r3275m8103K2791R389
$$ plain form
4424 -137090 -55615 -22402 -38788 79516 269729 323415 249405 183686 163932 4055 25618
4413 25618 -21960 -158208 2081 55333 182922 35448 -142026 -169843 -324894 -363020 -288548
4402 -288548 -181582 -64829 -113679 -205615 -299325 -293667 -232996 -216375 -205337 -97906 -97879 -54408
4390 -54408 -165342 -219787 -62368 -73149 48322 6759 -47818 -202116 -201045 -83744 9410
4379 9410 -100732 34432 169779 99997 55502 -73638 -10824 63051 66831 103523 84053
4368 84053 204558 352671 251500 66238 -58976 36994 -16054 -140164 -49618 51917
4358 51917 71078 -79431 6828 75065 -47495 -95438 19425 89898 49174 -98951 125445
4347 125445 118797 252253 336681 231713 74096 202483 236197 142922 94819 117610 126999
4336A26999q5335J9567o0157N574J48688j54511j09804m2962R4153N2599o2115
4325f7304q2328L0885p0884R8513q8953l8586K8644j5611q9660K6479O4764J26212
4313g7829J72857L7965j44934m5566P1719j55396q0647J50633K27939L600l5638
4302A24703o1414j22271j10900k5888R3801O2600l7493J19045J06949p4617m6334
4291B8181n7950q7221l8204j44683j63577l0002J5017K70458J04684M7633L6931
4280a8733o3328j69011m4047m9282P8975R9306P9872n9693k13564M0388M7947
4269b71170l753J84301K2882r2616K9189p290J69711o402J9316O903Q9589O0356
4257B01016l3704j73708k8788j8484M3530J3463M1023o2827J25423k1101j00593
$$ plain form
4336 126999 41664 61231 1074 6648 155336 825 -108979 -151941 -57788 -5189 -67304
4325 -67304 -149632 -118747 -189631 -91118 -180071 -218657 -190013 -205624 -295284 -268805 -204041 -77829
4313 -77829 95028 132993 -11941 -57507 14212 -141184 -221831 -71198 156741 160341 124703
4302 124703 63289 -58982 -169882 -195770 -101969 -39369 -76862 42183 149132 74515 28181
4291 28181 -29769 -116990 -155194 -299877 -463454 -493456 -478439 -207981 -103297 -55664 -18733
4280 -18733 -82061 -251072 -295119 -344401 -265426 -166120 -86248 -145941 -359505 -319117 -271170
4269 -271170 -274923 -90622 -67740 -160356 -131167 -138457 31254 24852 44168 51071 140660 201016
4257 201016 167312 -6396 -35184 -53668 -10138 3325 44348 -18479 106944 85843 -14750
4246a4750o3740J18351J14946j89546N922J55825J21739q9551j47703r029q6043
4235h3579J07731O9259k5584J04482J51718r3068j34762K4013J8975J46778j0524
4224B75439J4990l3608j70202p4261j89408j28019l6193J18738m685J81012J86601
4213A40404l03340n7622J7549R2129q3028P7028N5114J39280J69527j11177k04341
4202f8477o2685q3732J11127p8416o575J1017L8417j17965J12205J02353l1726
4191g4457k1757K7428n4426n9924J14404m1643M3867J06127J48388j01668k00067
4180a13728M8950j66848K8298K51823K05784q855J00100k83093j92007J20409
4170i167K07964N0487q7012j93322J6386J98338M9575k21203k9730P6627k39240
$$ plain form
4246 -14750 -78490 39861 154807 -34739 -28817 127008 248747 159196 11493 2464 -83579
4235 -83579 24152 93411 67827 172309 324027 230959 96197 120210 139185 285963 275439
4224 275439 290429 256821 86619 12358 -177050 -305069 -341262 -222524 -227209 -46197 140404
4213 140404 -162936 -220558 -203009 -110880 -193908 -116880 -61766 77514 247041 135864 -68477
4202 -68477 -131162 -214894 -103767 -182183 -188758 -177741 -139324 -257289 -145084 -42731 -74457
4191 -74457 -96214 -68786 -123212 -183136 -68732 -110375 -66508 39619 188007 86339 -113728
4180 -113728 -64778 -231626 -203328 48495 254279 245424 345524 62431 -129576 -9167
4170 -9167 198797 249284 162272 -31050 -14664 183674 233249 12046 -17684 58943 -180297
4159a80297r2130j1772J54320M4937j4416O4318L85K226J80922N5957q2705j09751
4147A1994j09608O6060J39422J36761k4959J8083J24557q5916k73111R1359n2986
4136D1656q5660J02398O2285k5231r0033j98575J43715L7198O5392l3323j1588
4125H234Q8129J48914L9769o5496J6848k1318j68955p183J7275p4864j92674j22462
4113c33783L8225K40559K47288j410k27610j87697m6602J79882J09708K7584K5327
4102G1471j57048j18628J01628R7381P6154L1299r7745o5010N585n4990p641N701
4090a11843j55841J93573J88127p7215k07103M8674m1962J00898J36960L5907
4080A10175L4266J30081P425j19112k5666m2475j12702L3398n6183k1856J34548
$$ plain form
4159 -180297 -272427 -284199 -129879 -84942 -99358 -35040 -34655 -32429 148493 204450 121745 11994
4147 11994 -97614 -31554 107868 244629 219670 237753 362310 276394 3283 94642 41656
4136 41656 -44004 58394 120679 95448 5415 -193160 -49445 -12247 53145 19822 8234
4125 8234 96363 245277 285046 219550 236398 215080 46125 38942 56217 -18647 -211321 -333783
4113 -333783 -295558 -54999 192289 190879 -36731 -224428 -271030 -91148 18560 46144 71471
4102 71471 -85577 -204205 -102577 -5196 70958 102257 4512 -60498 -54913 -109903 -117544 -111843
4090 -111843 -267684 -74111 114016 36801 -170302 -121628 -163590 -62692 74268 110175
4080 110175 144441 274522 281947 162835 137169 94694 -18008 15390 -40793 -62649 71899
4069G1899J43347N4276o235J26314k1268k07523k00638J07623M7169q8563m7336
4058b0935M9331j680r7960o369J2482J21905J11056L9211J9443j22572k03791
4047i9879n2814J70831N2519j94456o6696R1260J43326j3610p4034o2648J93747
4036H7546m2333j04685O9542J15670M0842j52710r5167j3395O8519j02423l7725
4025a66319L0051K22816K6273l0818n5978J9886J56892j08855m5644P4397Q24
4014A23525o2554l0931J16671L8795j13683L6522o2743j75701M7392n116J28489
4003D0666J07164j9093j13919j63343M4599Q225j14560K3736N7638m0722k8882
3992a98491O806J14923j0790l7167J5744L6371M453n1721J7131o0863J48679o6380
$$ plain form
4069 71899 215246 269522 263287 389601 368333 160810 -39828 67795 114964 26401 -20935
4058 -20935 28396 26716 -71244 -77613 -65131 56774 167830 207041 226484 103912 -99879
4047 -99879 -152693 18138 70657 -123799 -190495 -99235 44091 30481 -43553 -106201 87546
4036 87546 45213 -59472 10070 125740 166582 13872 -81295 -94690 -26171 -128594 -166319
4025 -166319 -136268 86548 112821 82003 26025 45911 202803 93948 48304 122701 123525
4014 123525 60971 30040 146711 185506 71823 108345 45602 -130099 -82707 -87823 40666
4003 40666 147830 128737 14818 -148525 -103926 -95701 -210261 -186525 -128887 -169609 -198491
3992 -198491 -191685 -76762 -87552 -124719 -108975 -72604 -68151 -119872 -102741 -163604 -14925 -81305
3980h1305q248k4965J37886O3620j2082L3664l4937m3807j2949J80889p431k07843
3968a7508j65255J99713M1582p7442N9795J6973L862J0657N8139q288j13758O605
3956A5075P0832O4064j29158O4481P815p4739N9435n3949m7327J71359j38759
3945I129m703O5948k5435j7277k8443N9074k398j3624K2558j0088O366N6931J59575
3932B77613j22366j15812J2123j14721k27794K1202m74J83095L6148l3301M9262
3921c5025J35316Q5308K4622N8266j35590k02491j97308m8385J66513K57492O4215
3910A72933j35675o6551K2820q9714K328j1532N0681M2898j3376l478q4806o943
3898a20415J29024J6975j08837J51451L2150J24502J21835J842m3339M9593j44798
$$ plain form
3980 -81305 -89553 -114518 23368 86988 74906 108570 73633 29826 16877 197766 190335 -17508
3968 -17508 -182763 16950 58532 -18910 40885 57858 61720 72377 130516 122228 8470 15075
3956 15075 85907 149971 20813 85294 93109 18370 77805 23856 -23471 147888 9129
3945 9129 4426 70374 44939 27662 -781 58293 55895 42271 64829 54741 61107 118038 277613
3932 277613 155247 39435 51558 -63163 -290957 -269755 -270229 -87134 -50986 -84287 -35025
3921 -35025 100291 185599 210221 268487 132897 -69594 -266902 -315287 -148774 108718 172933
3910 172933 37258 -29293 -6473 -96187 -93859 -105391 -54710 -11812 -25188 -28666 -113472 -120415
3898 -120415 8609 25584 -83253 68198 100348 224850 346685 348527 305188 354781 209983
3887B09983j69476p2366K10267J13j70321q2364j14862K66327J40000j24297j42225
3876d9221L9100k6882j05788N900J16594j13883j4563O5077K9945p1920O7756
3865e7885R9417l3857K3599J25715j21107j92015O3011m8103j01890J86579K4184
3854c2352J27854J51670m4989k35472j11364m7163K35251J68027p9335J03061
3844B35188J1473k14505N3845J59844j13865j48292P871K6845J3155m2544J77188
3833A66203j88526j08318P6672m8893P9184N4922K09954r676l9593k09197k1779
3822c9047J09147N873P9874n7693j8630O9221K4778n5595O4364k03703k90323
3811c11734o6542J39303J78568P8606j24658N125n7111o108j94468K081K09557
$$ plain form
3887 209983 40507 -31859 178408 178521 8200 -74164 -189026 77301 217301 93004 -49221
3876 -49221 -10121 -37003 -142791 -136891 -20297 -134180 -148743 -83666 -53721 -125641 -57885
3865 -57885 41532 7675 31274 156989 35882 -156133 -93122 -141225 -243115 -56536 -32352
3854 -32352 95502 247172 202183 -33289 -144653 -191816 43435 211462 132127 235188
3844 235188 246661 32156 86001 245845 131980 -16312 -8441 18404 31559 -10985 166203
3833 166203 -22323 -130641 -53969 -102862 -23678 31244 241198 231522 191929 -17268 -39047
3822 -39047 70100 75973 155847 98154 79524 148745 173523 117928 182292 -21411 -311734
3811 -311734 -378276 -238973 -60405 18201 -106457 -101332 -158443 -164551 -359019 -356938 -147381
3800a47381r2390J82398J40048J16079m6658j07709m6162n206r3802Q7522j16481
3789a29742p6477K22893M4406m6874k1566q3067m6853j54075j56764O340J66811
3778b74968K45307J97250j8727j40597N3881J65050j28775m1762j88312r7630
3768b29283n852N6174M8475K23376Q1328k6389j34668k55456N2192J69306R5620
3757G4823l6872R3671O7854j66699p8178J02773q6967j95294J13422N7514K5319
3746b8634J70848j172l3905r5144m6203J99878P1609K7133q2069j86720k39176
3735b43555J78858J92281k27724j12926l7074L08991J33786K7676J8323o7672
3725A70964n2684M1612k06504l8133Q5369q9198O438O8052k913j1719j1336j49783
$$ plain form
3800 -147381 -239771 -57373 82675 198754 152096 44387 -1775 -6981 -100783 -13261 -129742
3789 -129742 -206219 16674 61080 14206 -7360 -90427 -137280 -291355 -448119 -441779 -274968
3778 -274968 -29661 167589 148862 8265 62146 227196 98421 56659 -131653 -229283
3768 -229283 -235135 -178961 -130486 92890 174218 147829 13161 -242295 -190103 -20797 74823
3757 74823 37951 131622 199476 32777 -45401 57372 -29595 -224889 -111467 -53953 -28634
3746 -28634 142214 141042 107137 11993 -34210 165668 237277 264410 182341 -4379 -243555
3735 -243555 -64697 127584 -100140 -213066 -250140 58851 192637 220313 238636 170964
3725 170964 118280 159892 -46612 -84745 624 -88574 -82136 -14084 -16997 -28716 -40052 -189835
3713a89835J0266J20758K9389n7489j1992j34021P7965J62740j5163j4924J0041
$$ plain form
3713 -189835 -179569 -58811 -29422 -86911 -98903 -232924 -154959 7781 -7382 -22306 -12265
$$ [...]
##END NTUPLES=NMR SPECTRUM
##END=
