##TITLE=Analysis number 322605
Compound Code btb 06459
Project Code adrs
Chemist Name stores
##JCAMPDX= 6.0         $$ Bruker NMR JCAMP-DX V2.0
##DATA TYPE= NMR SPECTRUM
##DATA CLASS= NTUPLES
##ORIGIN= Bruker BioSpin GmbH
##OWNER= nmr
$$ XWIN-NMR		Version 3.5
$$ Mon Oct  2 10:24:37 2006 GMT Daylight Time (UT+1h)  MAYBRIDGE\nmr@NMR_250MHZ
##.OBSERVE FREQUENCY= 250.131544655141
##.OBSERVE NUCLEUS= ^1H
##.ACQUISITION MODE= SIMULTANEOUS (DQD)
##.ACQUISITION SCHEME= undefined
##.AVERAGES= 16
##.DIGITISER RES= 18
##SPECTROMETER/DATA SYSTEM= dpx250
##.PULSE SEQUENCE= zg30
##.SOLVENT NAME= CDCl3
##.SHIFT REFERENCE= (INTERNAL, CDCl3, 0, 16.522)
##AUDIT TRAIL= $$ (NUMBER, WHEN, WHO, WHERE, WHAT)
$$ ##TITLE= Audit trail, XWIN-NMR		Version 3.5
$$ ##JCAMPDX= 5.01
$$ ##ORIGIN= Bruker BioSpin GmbH
$$ ##OWNER= nmr
$$ C:\u/data/dgb/nmr/ADRS/50/pdata/1/auditp.txt
$$ ##AUDIT TRAIL=  $$ (NUMBER, WHEN, WHO, WHERE, WHAT)
(   1,<2006-10-02 10:24:12.74 +100>,<MAYBRIDGE\nmr>,<NMR_250MHZ>,
      <created by zg, POWCHK disabled, PULCHK disabled
       configuration hash MD5:
       E2 DF 36 D8 04 B2 41 60 5A D7 A3 38 5A 4B D0 FE
       data hash MD5: 64K
       7B 62 B4 04 71 CC F9 E2 9B D6 3A EC DD 32 67 9B>)
(   2,<2006-10-02 10:24:25.71 +100>,<MAYBRIDGE\nmr>,<NMR_250MHZ>,
      <Start of raw data processing
       ef LB = 0.3 FT_mod = 6 PKNL = 1 SI = 32K 
       data hash MD5: 32K
       83 4E 9B 75 C8 B0 39 93 41 30 1E 38 7E 04 55 0E>)
(   3,<2006-10-02 10:24:27.40 +100>,<MAYBRIDGE\nmr>,<NMR_250MHZ>,
      <apk 
       data hash MD5: 32K
       F4 DA 8C 10 9F D9 34 89 58 5F 30 1C 89 33 26 2A>)
(   4,<2006-10-02 10:24:28.15 +100>,<MAYBRIDGE\nmr>,<NMR_250MHZ>,
      <abs ABSG = 5 
       data hash MD5: 32K
       2B BD CF 39 A0 02 02 1D 14 26 EC 7B 2C 4F 22 5D>)
$$ ##END=
$$ 
$$ hash MD5
$$ AB 1B 71 EA D7 3C 8C 03 A2 B2 69 82 1F 48 6F C2
##$RELAX= 
##$RELAX= 
##$RELAX= 
##$RELAX= 
##$RELAX= 
##$RELAX= 
##$RELAX= 
$$ Bruker specific parameters
$$ --------------------------
##$DU= <C:\u>
##$EXPNO= 50
##$NAME= <ADRS>
##$PROCNO= 1
##$TYPE= <nmr>
##$USER= <dgb>
##$AMP= (0..31)
100 100 100 100 100 100 100 100 100 100 100 100 100 100 100 100 100 100 
100 100 100 100 100 100 100 100 100 100 100 100 100 100 
##$AQSEQ= 0
##$AQ_mod= 3
##$AUNM= <au_zg>
##$AUTOPOS= <22 >
##$BF1= 250.13
##$BF2= 250.13
##$BF3= 250.13
##$BF4= 250.13
##$BF5= 500.13
##$BF6= 500.13
##$BF7= 500.13
##$BF8= 500.13
##$BYTORDA= 1
##$CFDGTYP= 0
##$CFRGTYP= 5
##$CHEMSTR= <none>
##$CNST= (0..31)
1 1 145 1 1 1 1 1 1 1 1 1 1 1 1 1 1 1 1 1 1 1 1 1 1 1 1 1 1 1 1 1 
##$CPDPRG= <>
##$CPDPRG1= <>
##$CPDPRG2= <>
##$CPDPRG3= <>
##$CPDPRG4= <mlev>
##$CPDPRG5= <mlev>
##$CPDPRG6= <mlev>
##$CPDPRG7= <mlev>
##$CPDPRG8= <mlev>
##$CPDPRGB= <>
##$CPDPRGT= <>
##$D= (0..31)
0 1 0 0 0 0 0 0 0 0.06 0 0 0 0 0 0 0.0002 0 0 0 0 0 0 0 0 0 0 0 0 0 0 
0 
##$DATE= 1159781051
##$DBL= (0..7)
120 120 120 120 120 120 120 120 
##$DBP= (0..7)
150 150 150 150 150 150 150 150 
##$DBP07= 0
##$DBPNAM0= <>
##$DBPNAM1= <>
##$DBPNAM2= <>
##$DBPNAM3= <>
$$ [...]
##$SUBNAM7= <"">
##$SUBNAM8= <"">
##$SUBNAM9= <"">
##$SW= 20.6930455092707
##$SWIBOX= (0..15)
0 0 3 0 0 0 0 0 0 0 0 0 0 0 0 0 
##$SW_h= 5175.983436853
##$TD= 65536
##$TD0= 1
##$TE= 296.16
##$TE2= 300
##$TE3= 300
##$TEG= 300
##$TL= (0..7)
0 120 120 120 120 120 120 120 
##$TP= (0..7)
150 150 150 150 150 150 150 150 
##$TP07= 0
##$TPNAME0= <>
##$TPNAME1= <>
##$TPNAME2= <>
##$TPNAME3= <>
##$TPNAME4= <>
##$TPNAME5= <>
##$TPNAME6= <>
##$TPNAME7= <>
##$TPOAL= (0..7)
0.5 0.5 0.5 0.5 0.5 0.5 0.5 0.5 
##$TPOFFS= (0..7)
0 0 0 0 0 0 0 0 
##$TUNHIN= 0
##$TUNHOUT= 0
##$TUNXOUT= 0
##$USERA1= <user>
##$USERA2= <user>
##$USERA3= <user>
##$USERA4= <user>
##$USERA5= <user>
##$V9= 5
##$VALIST= <valist>
##$VCLIST= <CCCCCCCCCCCCCCC>
##$VD= 0
##$VDLIST= <DDDDDDDDDDDDDDD>
##$VPLIST= <PPPPPPPPPPPPPPP>
##$VTLIST= <TTTTTTTTTTTTTTT>
##$WBST= 1024
##$WBSW= 4
##$XGAIN= (0..3)
0 0 0 0 
##$XL= 0
##$YL= 0
##$YMAX_a= 501711
##$YMIN_a= -582677
##$ZGOPTNS= <>
##$ZL1= 120
##$ZL2= 120
##$ZL3= 120
##$ZL4= 120
##$ABSF1= 16.522
##$ABSF2= -4.171173
##$ABSG= 5
##$ABSL= 3
##$ALPHA= 0
##$AQORDER= 0
##$ASSFAC= 0
##$ASSFACI= 0
##$ASSFACX= 0
##$ASSWID= 0
##$AUNMP= <proc_1d>
##$AZFE= 0.1
##$AZFW= 0.1
##$BCFW= 0
##$BC_mod= 0
##$BYTORDP= 0
##$COROFFS= 0
##$CY= 12.5
##$DATMOD= 1
##$DC= 0
##$DFILT= <>
##$DTYPP= 0
##$F1P= 14.0000005364418
##$F2P= -0.99999901652339
##$FCOR= 0.5
##$FTSIZE= 32768
##$FT_mod= 6
##$GAMMA= 0
##$GB= 0
##$INTBC= 1
##$INTSCL= 1
##$ISEN= 128
##$LB= 0.3
##$LEV0= 0
##$LPBIN= 0
##$MAXI= 10000
##$MC2= 0
##$MEAN= 0
##$ME_mod= 0
##$MI= 0
##$NCOEF= 0
##$NC_proc= -5
##$NLEV= 6
##$NOISF1= 0
##$NOISF2= 0
##$NSP= 0
##$NTH_PI= 0
##$NZP= 0
##$OFFSET= 16.522
##$PC= 1
##$PHC0= 158.078
##$PHC1= 0.431729
##$PH_mod= 1
##$PKNL= yes
##$PPARMOD= 0
##$PSCAL= 4
##$PSIGN= 0
##$REVERSE= no
##$SF= 250.13
##$SI= 32768
##$SIGF1= 0
##$SIGF2= 0
##$SINO= 400
##$SIOLD= 32768
##$SREGLST= <1H.CDCl3>
##$SSB= 0
##$STSI= 32768
##$STSR= 0
##$SW_p= 5175.98343685301
##$SYMM= 0
##$S_DEV= 0
##$TDeff= 65536
##$TDoff= 0
##$TI= <Analysis number 999999
Compound Code 99
Book Reference 9
Project Code 9>
##$TILT= no
##$TM1= 0
##$TM2= 0
##$TOPLEV= 0
##$USERP1= <user>
##$USERP2= <user>
##$USERP3= <user>
##$USERP4= <user>
##$USERP5= <user>
##$WDW= 1
##$XDIM= 32768
##$YMAX_p= 525337038
##$YMIN_p= -605927
$$ End of Bruker specific parameters
$$ ---------------------------------
##NTUPLES= NMR SPECTRUM
##VAR_NAME=  FREQUENCY,     SPECTRUM/REAL,   SPECTRUM/IMAG
##SYMBOL=    X,             R,               I
##VAR_TYPE=  INDEPENDENT,   DEPENDENT,       DEPENDENT
##VAR_FORM=  AFFN,          ASDF,            ASDF
##VAR_DIM=   32768,         32768,           32768
##UNITS=     HZ,            ARBITRARY UNITS, ARBITRARY UNITS
##FACTOR=    0.157963299565203, 1,           1
##FIRST=     4132.6476996994, 0,             0
##LAST=      -1043.33573715361, 0,           0
##MIN=       -1043.33573715361, -605927,     0
##MAX=       4132.6476996994, 525337038,     0
$$ Real data points
##PAGE= N=1
##DATA TABLE= (X++(R..R)), XYDATA
$$ [...]
25028a7363N7153K3238j28315n0080R6041M5478J3036M1048Q4068J92475q6430
$$ -17363 39790 63028 -65287 -115367 -19326 26152 39188 80236 164304 356779 270349
25017B70349j30095j26267j47124O7138k9067j7068K6402j47884k14863J52814
$$ 270349 140254 13987 -133137 -65999 -95066 -112134 -85732 -233616 -448479 -295665
25007b95665J52895J51685Q8059j91162r9298K21499K05918O9050j1342l6790
$$ -295665 -142770 8915 96974 -94188 -193486 28013 233931 302981 291639 254849
24997B54849r4181m287n246k8895r8730M4985J16757j2573q7246p2594l4312p9927
$$ 254849 160668 156381 151135 122240 23510 68495 185252 172679 85433 12839 -21473 -101400
24985a01400k18647j18977J21656J6613l9887r5622P7118J18494M2141J62073
$$ -101400 -320047 -439024 -317368 -300755 -340642 -436264 -359146 -240652 -198511 -36438
24975c6438n3056P816J32301M9568o6423j30790L2717m4367O7962J38831K6629
$$ -36438 -89494 -81678 50623 100191 33768 -97022 -64305 -108672 -40710 98121 124750
24964A24750O1706M125O505m9117m3622Q6567j21885j07855p9265j57125J26364
$$ 124750 186456 190581 197086 147969 104347 190914 69029 -38826 -118091 -275216 -148852
24953a48852O968Q2073K4837m8636N990m2340P034K07407Q2178j27574j01449
$$ -148852 -141884 -59811 -34974 -83610 -77620 -119960 -112926 94481 176659 49085 -52364
24942e2364L3366j6401r3489j00571j37909l1898J75312M1932n4783J7897p4538
$$ -52364 -18998 -35399 -128888 -229459 -367368 -399266 -223954 -182022 -236805 -218908 -293446
24931b93446l7498Q5341J62925J80540K3148o8089j8783j24786p421K6050j12239
$$ -293446 -330944 -245603 -82678 97862 121010 52921 34138 -90648 -98069 -72019 -184258
24920a84258P4375Q0335j00326n9994j52366j09188K95764J01276J45400n0903
$$ -184258 -109883 -29548 -129874 -189868 -342234 -451422 -155658 -54382 91018 40115
24910D0115j3474j37747N5396Q9973K4044j30564p8271J16726k1770j35428j3146
$$ 40115 26641 -111106 -55710 34263 58307 -72257 -150528 -33802 -55572 -191000 -204146
24899b04146K3747l3401J98523J48595R4237j61084P455k6264R0259N2658M6821
$$ -204146 -180399 -213800 -15277 133318 227555 66471 73926 47662 137921 190579 237400
24888B37400j9113p2574M375J7763l6618l5414p9641N3658J1938k112p3943j48532
$$ 237400 218287 145713 150088 167851 131233 95819 16178 69836 81774 79662 5719 -142813
24876a42813J22058N1512j01989j25464J09642J21064L1258R2147j28322k9625
$$ -142813 -20755 30757 -71232 -196696 -87054 34010 65268 157415 29093 -532
24866e32J18783n5880j36337P0296O2121J47856K9283j40776k09011n1921J86142
$$ -532 118251 62371 -73966 -3670 58451 206307 235590 94814 -114197 -166118 20024
24855B0024m245j55020Q7178J43680O2225l7721j9742M1100K4435m4831r7369
$$ 20024 15779 -139241 -52063 91617 153842 116121 96379 137479 161914 117083 19714
24844A9714o8076J28233Q3216o6395m881J11276J18137O8025j75570j0874l9859
$$ 19714 -48362 79871 163087 96692 91811 203087 321224 389249 213679 202805 162946
24833A62946q5097j64740M6210N9872J99601k0767j16014j14361m1345J45011
$$ 162946 77849 -86891 -40681 19191 218792 198025 82011 -32350 -73695 71316
24823G1316J13494M7694j00847k2691M896j72427L585M7468J05941k2559r4291
$$ 71316 184810 232504 131657 108966 113862 -58565 -54980 -7512 98429 75870 -18421
24812a8421J6138j21625o0307J28230M7963m4840j15490p4109K0870K08041J01345
$$ -18421 -2283 -123908 -184215 -55985 -8022 -52862 -168352 -242461 -221591 -13550 87795
24801H7795R8934N8750K4784p0946j28288j53633L9630L4664Q7612q6231j22809
$$ 87795 186729 245479 270263 199317 71029 -82604 -42974 -8310 79302 -6929 -129738
24790a29738O3142K26533p3475j09521P9616N4342j5025k26158o3136J26220J12030
$$ -129738 -66596 159937 86462 -23059 56557 110899 95874 -130284 -193420 -67200 44830
24779D4830K08528M664q1163l0183O2145J60676O3447l12210l44840l5315J43810
$$ 44830 253358 258022 176859 146676 208821 369497 432944 120734 -224106 -259421 -115611
24768a15611J53563o4397Q0488r203j46371J9324l0712j31622J83732J92018J02671
$$ -115611 37952 -26445 54043 44840 -101531 -82207 -112919 -244541 -60809 131209 233880
24757B33880l3891j88174o6915J16428P409k36088j41129K00787J58573J06091
$$ 233880 199989 11815 -55100 61328 68737 -167351 -308480 -107693 50880 156971
24747A56971O4566n4555k27550j36978M4128o875j52916J41839J36991M4259N5556
$$ 156971 221537 166982 -60568 -197546 -153418 -160293 -313209 -171370 -34379 9880 65436
24736F5436L8760M780k46069j03175O863n9627P9924M0248O2289n5393P851m513
$$ 65436 104196 108976 -137093 -240268 -233405 -293032 -213108 -172860 -110571 -165964 -158113 -162626
24724a62626j9040Q7028N6986l8500R7409q7867q3720M6316J36386P5114j16484
$$ -162626 -181666 -94638 -37652 -76152 21257 -66610 -150330 -104014 32372 107486 -8998
24713h998O6365j00528o0046J33791o5730J7102J23004Q0387o8590l6464J52986
$$ -8998 57367 -43161 -103207 30584 -35146 -18044 104960 185347 116757 80293 233279
24702B33279q5649j62553j16794M4531K60777J98037k91878l7996Q2778j51787
$$ 233279 147630 -14923 -131717 -87186 173591 371628 79750 41754 124532 -27255
24692b7255j08119o1606J27864L6383J16549l1021p368Q5526j27206p7936Q4762
$$ -27255 -135374 -196980 -69116 -32733 83816 52795 45427 130953 3747 -74189 10573
24681A0573J33301J57871J02986p6727k1511o5134o8004j07925j10015P2401K53579
$$ 10573 143874 301745 404731 328004 306493 241359 173355 65430 -44585 27816 281395
24670B81395P5178j96902l2792n7690Q425j4901j45112n8928J06189K80789m9530
$$ 281395 356573 159671 126879 69189 77614 62713 -82399 -141327 -35138 245651 196121
24659A96121j88244j69526k00807J80406Q5145Q0861K2407J99730J39639n6023
$$ 196121 7877 -161649 -362456 -182050 -96905 -16044 6363 206093 345732 289709
24649B89709k1017q9881L828J1708L1773n2564o8880L1704j1887r8179o0152R7780
$$ 289709 268692 178811 182639 194347 226120 173556 104676 136380 124493 26314 -33838 63942
24637F3942N6601M8731l1192k68810J6560J39489Q5714O719q168p4243q2393N3878
$$ 63942 120543 169274 138082 -130728 -114168 25321 111035 117754 109586 35343 -47050 6828
24625F828Q1831K6319j5743j2355j13863q7331K32384M1987j42460j45007R1474
$$ 6828 88659 114978 99235 86880 -26983 -114314 118070 160057 17597 -127410 -35936
24614c5936L24858J05996j42754k5650j38390j8421R0960r4216l4160J28144J3119
$$ -35936 288922 394918 252164 226514 88124 69703 160663 66447 32287 160431 173550
24603A73550P7534j8464j55525j6111m1002l7738j6016J43236J07891k20488r6645
$$ 173550 251084 232620 77095 60984 19982 -17756 -33772 109464 217355 -3133 -99778
24592i9778J03132K02846O5993N4393j45199o3796j0467n4932M4282j5891p1908
$$ -99778 3354 206200 272193 326586 181387 117591 107124 52192 96474 80583 8675
24581H675J29190O1243j29668j64274l2369r5858J33856J32765O2709L0928O082
$$ 8675 137865 199108 69440 -94834 -127203 -223061 -89205 43560 106269 137197 143279
24570A43279J7472j68936k52249m8945K07945K56873J40491q9487j61548q802
$$ 143279 160751 -8185 -260434 -309379 -101434 155439 295930 206443 44895 36093
24560C6093L8153k6038r6112j89548J56288J43599N6851R6074n3876q5566l9320
$$ 36093 74246 48208 -47904 -237452 -81164 62435 119286 215360 161484 75918 36598
24549C6598p7878O5464L4317j09896p867j56150j65522Q6731K76929p805p8714
$$ 36598 -41280 24184 58501 -51395 -59262 -215412 -380934 -294203 -17274 -25079 -103793
24538a03793J26902p8064P3390k5499l8639j5921j36198m9879k333k331K63214
$$ -103793 23109 -54955 18435 -7064 -45703 -61624 -197822 -247701 -250034 -252365 10849
24527A0849R7939p6909p7805N0745k36877l0772l3281K63284M6746j09336q6187
$$ 10849 108788 31879 -45926 4819 -232058 -262830 -296111 -32827 13919 -95417 -181604
24516a81604Q5964n367J37607Q1252m7955n3347k0617R8406J74251P46q5707q1237
$$ -181604 -95640 -101007 36600 117852 69897 16550 -4067 94339 268590 269336 183629 102392
24504A02392K9524P3951J8568j25484l6216j38940L6521J11610N103j73462o9341
$$ 102392 131916 205867 224435 98951 62735 -76205 -39684 71926 77029 -96433 -165774
24493a65774L2571J8j34836L9264J31166Q3436J2141j73292L136L8943O5298J01969
$$ -165774 -133203 -133185 -268021 -228757 -97591 -14155 -2014 -175306 -172170 -133227 -67929 34040
24481C4040l8609j43670j5603K8127J42008k4705M149r8874K7190Q815J6687K1585
$$ 34040 -4569 -148239 -163842 -135715 6293 -18412 -14263 -113137 -85947 -77132 -60445 -38860
24469c8860j3214n9527R1532j2162q4344L8600o664J70026J71207J31674n2905
$$ -38860 -52074 -111601 -20069 -32231 -116575 -77975 -84639 85387 256594 388268 335363
24458C35363k6466r0521j59267M6551o4874m8766l2664J31892J96378J7833j78257
$$ 335363 308897 218376 59109 105660 40786 -7980 -40644 91248 287626 305459 127202
24447A27202M1055p7617q5193j28856m8571J73070Q5217R533j9813J56257p6504
$$ 127202 168257 90640 5447 -123409 -171980 1090 86307 95840 76027 232284 155780
24436A55780m3346K3025j44996l4544n7804j03896P4134O9111M6203K01721r3603
$$ 155780 112434 135459 -9537 -44081 -101885 -205781 -131647 -62536 -16333 185388 91785
24425I1785m0122P431M2270J4893j113k21230M0324J35788r2858l3414j46813
$$ 91785 51663 59094 101364 116257 115144 -106086 -65762 70026 -22832 -56246 -203059
24414b03059P8593P559J10271l166n9799m8319P6746L8676k8820P2351j67197
$$ -203059 -124466 -116907 -6636 -9802 -69601 -117920 -41174 -2498 -31318 41033 -126164
24403a26164j82521M2631j5458J59145J31319j5577L058J47704R8034O4770m6996
$$ -126164 -308685 -266054 -281512 -122367 8952 -6625 -3567 144137 242171 306941 259945
24392B59945q1352N7013k41466o1970J66016q3652j447K30917K79903o6930k41103
$$ 259945 178593 235606 -5860 -67830 98186 14534 13087 244004 523907 456977 215874
24381B15874j16007j6794j46762j75303P1209m6316O3221N6406J64938l1728k1574
$$ 215874 99867 83073 -63689 -238992 -167783 -214099 -150878 -94472 70466 38738 17164
24370A7164p2390j69314K2270N2848q473j9622K172R3953O4507j02075Q200l7537
$$ 17164 -55226 -224540 -202270 -149422 -157895 -177517 -175345 -81392 -16885 -118960 -110760 -148297
24358a48297M948J28372K00786k6690M0931r7873j11772j4001J668N9497J38462
$$ -148297 -143349 -14977 185809 159119 200050 102177 -9595 -23596 -21928 37569 176031
24347A76031n0599k36500j83182R1312K44665J27072L4413p5621r5786J37768
$$ 176031 125432 -111068 -294250 -202938 41727 168799 203212 127591 31805 169573
24337A69573J29444m5882k03751j44757j10408J28617J01250q5620N9418j2462
$$ 169573 299017 253135 49384 -95373 -205781 -77164 24086 -61534 -2116 -14578
24327a4578j44341R9647J22393j27028k1901r066J29746M9101P6476M5089n5049
$$ -14578 -158919 -59272 63121 -63907 -85808 -94874 34872 83973 160449 205538 150489
24316A50489O2997J48550k10166j67951j71083k2341M5509J1245J50662Q3501
$$ 150489 213486 362036 151870 -16081 -187164 -209505 -163996 -152751 -2089 81412
24306H1412J01481l3518k04919o2844j58336k1948J3886J85595P2421J31864J18571
$$ 81412 182893 149375 -55544 -118388 -276724 -298672 -284786 -99191 -26770 105094 223665
24295B23665j24723o691j1268m440Q7432L8212n9172j88021r8745j4994K2007
$$ 223665 98942 92251 80983 76543 163975 202187 143015 -45006 -143751 -158745 -136738
24284a36738n8447j33987j65930J40613l0771Q8506J67356J39855p1689l5516
$$ -136738 -195185 -329172 -495102 -354489 -385260 -296754 -129398 10457 -61232 -96748
24274i6748M4556J40118m741q043m5109j12885r5717J68352r0387l6417J18995
$$ -96748 -52192 87926 83185 75142 30033 -82852 -178569 -10217 -100604 -137021 -18026
24263a8026M1378j4323O3942j15091q508J23088J63788K0376k46914j35027Q6647
$$ -18026 23352 9029 72971 -42120 -50628 72460 236248 256624 9710 -125317 -38670
24252c8670N2637J08688J54942k0590L9372R529j40051j12192m0048k50748j53632
$$ -38670 13967 122655 277597 257007 296379 305908 165857 53665 13617 -237131 -390763
24241c90763O7628J10581J0412L6825K6415j7637J95047o3379p5260j6101J16320
$$ -390763 -323135 -212554 -202142 -165317 -138902 -156539 38508 -24871 -100131 -116232 88
24230H8j02030J4366K39117K0398m4151J6077N1457j29375M302j14o0316p7346
$$ 88 -101942 -87576 151541 171939 127788 143865 195322 65947 70249 70135 9819 -67527
24218f7527j27702m4563M928J5479J39710n2628J05986P7905K5428l9359j27753
$$ -67527 -195229 -239792 -234864 -219385 -79675 -132303 -26317 51588 77016 37657 -90096
24207i0096j25529O3880J68231R7215K22509J33985j08831l7725j74561j90848
$$ -90096 -215625 -151745 16486 113701 336210 470195 361364 323639 149078 -41770
24197d1770o0196q6585J4455R0138r7429J20492P5257J19434l8362j56747J12253
$$ -41770 -101966 -188551 -174096 -83958 -181387 -60895 14362 133796 95434 -61313 50940
24186E0940M6999q8025j8556l4272l0713J82913J00298J5195j00935p4042M2449
$$ 50940 97939 9914 -8642 -42914 -73627 109286 209584 224779 123844 49802 92251
24175I2251j37002q2952j3936J55890J76839o5823P1532q7071k18859k22008L3065
$$ 92251 -44751 -127703 -141639 14251 191090 125267 196799 109728 -109131 -331139 -298074
24164b98074k9906K08037J8654p5645J01297J20858M5140K5898J7284j52465J923
$$ -298074 -327980 -119943 -101289 -176934 -75637 45221 90361 116259 133543 -18922 -16999
24153a6999N5348j28434o0689J71132J31643l4115l5980m2167N9796j2373j92123
$$ -16999 38349 -90085 -150774 20358 152001 117886 81906 39739 99535 87162 -104961
24142a04961k0208j0869j38276j52668J16998K41942J14758J0779J04691q47j00420
$$ -104961 -125169 -136038 -274314 -426982 -309984 -68042 46716 57495 162186 161339 60919
24131F0919l9337m771o501m0434J42237M2956m2356o4467J8212Q3565j12570j42785
$$ 60919 21582 16811 10310 -30124 112113 155069 112713 48246 66458 150023 37453 -105332
24119a05332N5619N4923Q1154j8278j00178K7891j29602p0341O472J44427r7034
$$ -105332 -49713 5210 86364 68086 -32092 -4201 -133803 -204144 -197672 -53245 -150279
24108a50279J2143K6441p3123P317Q0829P1057O5257m5571l4331J45331M7797
$$ -150279 -138136 -111695 -184818 -177501 -96672 -25615 39642 -5929 -40260 105071 152868
24097A52868j28461j31340J00254n9520j35585J60277J10412j178j77893q0183
$$ 152868 24407 -106933 -6679 -66199 -201784 -41507 68905 67727 -110166 -190349
24087a90349l0089m5106R259N6377n9204J57049J1650M0052O7619J15654M328
$$ -190349 -220438 -265544 -256285 -199908 -259112 -102063 -90413 -50361 17258 132912 137240
24076A37240q8789J36189N1405j79155k05876K7591J62026N2154p7534j8681j0970
$$ 137240 48451 184640 236045 56890 -148986 -121395 40631 92785 15251 -3430 -14400
24065a4400j78895j5269K30179N1925k2978K7332j5378L1563P3577n4623j77683
$$ -14400 -193295 -208564 21615 73540 50562 77894 62516 94079 167656 113033 -64650
24054f4650k8717J59419R293j71605j37744J07905P93J04710M2502P7151J11270
$$ -64650 -93367 66052 75345 -96260 -234004 -126099 -125306 -20596 21906 99057 210327
24043B10327j4892j74713M4681k9632J4994j28242j1539M0377P3669J1483r4040
$$ 210327 195435 20722 65403 35771 50765 -77477 -89016 -48639 25030 36513 -57527
24032e7527k2984q0336J5573J95343L9617j91581j96289q5038K484L3587M0747
$$ -57527 -80511 -160847 -145274 50069 89686 -101895 -298184 -383222 -380738 -347151 -306404
24021c06404L27283R2887o5790N1180l1782j27478n5684J54773K21761m1195p7100
$$ -306404 20879 113766 47976 99156 67374 -60104 -115788 38985 260746 219551 142451
24010A42451j9823M5829m9828q0480j87789k7555K1975n810O9529J7755J11574
$$ 142451 122628 168457 118629 38149 -149640 -177195 -155220 -161030 -91501 -73746 37828
23999C7828J15012J81965k20654j93608J51058k4064R3587Q9098j9372Q0312L1587
$$ 37828 152840 334805 114151 -79457 71601 47537 141124 230222 210850 291162 322749
23988C22749k14399J20553M196r8440j22401p4881q1270P8889L1145k4993J05737
$$ 322749 108350 228903 233099 134659 12258 -62623 -143893 -65004 -33859 -58852 46885
23977D6885O025m1951o0323p1097L9974j123O0094j13055K2728Q1881l3915m7212
$$ 46885 52910 10959 -49364 -120461 -80487 -81610 -21516 -134571 -111843 -29962 -63877 -111089
23965a11089J87363j04014j51478k1797j15481j45808J82992J97318J09602K05517
$$ -111089 76274 -27740 -179218 -201015 -316496 -462304 -279312 -81994 27608 233125
23955B33125n7382j06611N3199R4479J938j8068j77516j5393q1448J7513k7445
$$ 233125 175743 69132 122331 216810 218748 200680 23164 7771 -73677 -56164 -83609
23944h3609j2976l0402p9093j5467n3647J28173K0120J37813K00617N4732q6692
$$ -83609 -96585 -126987 -206080 -221547 -275194 -147021 -126901 10912 211529 266261 179569
23933A79569p4411j23470q5914j5556N053L9976j0398k8151R7650J65403K2007
$$ 179569 105158 -18312 -104226 -119782 -114729 -74753 -85151 -113302 -15652 149751 171758
23922A71758k15124q2239K5627J50736k9829p0765O5538N6863J6037L8651j94746
$$ 171758 -43366 -125605 -99978 50758 20929 -49836 15702 72565 88602 127253 -67493
23911f7493m7993O8564J85451N1309j22711J9798J5596j85671R1938R2655j17706
$$ -67493 -115486 -46922 138529 189838 67127 86925 102521 -83150 8788 101443 -16263
23900a6263j16152M743N7224R866J1453r5555L7325J01022p8962K840q2223L8769
$$ -16263 -132415 -127672 -70448 -60582 -49129 -144684 -107359 -6337 -85299 -82459 -164682 -125913
23888a25913J27190J3399j02099o8157m3422N5118J74226P282q5662j26402K18313
$$ -125913 1277 14676 -87423 -155580 -199002 -143884 30342 37624 -48038 -174440 43873
23877D3873N7188r6464l0885O6516K71450m5580j2763k5043n8573k3888k9330
$$ 43873 101061 4597 -26288 40228 311678 266098 253335 228292 169719 145831 116501
23866A16501M456J32738j10690l3173r555O5950j7077k07316n9424L0850l1604
$$ 116501 120957 253695 143005 109832 100277 166227 149150 -58166 -117590 -86740 -118344
23855a18344L5134K3117j1062R1322K6355K709j01995j37712R6970J46749L5422
$$ -118344 -83210 -60093 -71155 20167 46522 49231 -52764 -190476 -93506 53243 88665
23844H8665J0545l5661j12144Q4442P7545k14040K0255q1250p9748k7040M4181
$$ 88665 99210 63549 -48595 35847 113392 -100648 -80393 -161643 -241391 -268431 -224250
23833b24250J84817J38269J7013n4789Q1374j5176j24025j92343j59368J39481
$$ -224250 -39433 98836 115849 61060 142434 127258 3233 -189110 -348478 -208997
23823b08997K33251j22543o6018L4883J5001j03960L5133N0375L6930k1439J30625
$$ -208997 24254 -98289 -164307 -129424 -114423 -218383 -183250 -132875 -95945 -117384 13241
23812A3241J86848r1661k22516r1786P3084K2852O0195r3287J2367k2677m3907
$$ 13241 200089 108428 -114088 -205874 -132790 -109938 -49743 -143030 -130663 -153340 -197247
23801a97247J2931J79224J09908l1577M3743P4702k12121j14700M1401M5785J27213
$$ -197247 -184316 -5092 104816 73239 116982 191684 -20437 -135137 -93736 -47951 79262
23790G9262n6294j21480Q9880K21207J1355r3848r1078j5085Q2446K0704j59235
$$ 79262 22968 -98512 -8632 212575 223930 130082 39004 23919 106365 127069 -32166
23779c2166J9051J7080j09274j50705r7601N5834K02712J12577L166Q243o2042
$$ -32166 -13115 3965 -105309 -256014 -353615 -297781 -95069 17508 20674 28917 -33125
23768c3125Q786k2914q7324j74811J7500k1778J0679M9155K46872Q5344r7999
$$ -33125 -24339 -47253 -134577 -309388 -291888 -313666 -302987 -253832 -6960 78384 -19615
23757a9615p2071q867R3558M8505K9368o8558o452r6185M63j3023J11751K7951
$$ -19615 -91686 -100553 -6995 41510 70878 2320 -4132 -100317 -99854 -112877 -1126 26825
23745B6825o0149k3089N7879j04892p1838J7296p7820M8893J33066N3389N1785
$$ 26825 -33324 -56413 1466 -103426 -175264 -157968 -235788 -186895 -53829 -440 51345
23734E1345J13539L7255n7521o6654N8768n6853n7148o6792r0595j37246J45394
$$ 51345 164884 202139 144618 77964 136732 79879 22731 -44061 -134656 -271902 -126508
23723a26508N7453R6826J285o4098J93j43348j0948J2564J19979J21372j40432
$$ -126508 -69055 27771 29056 -35042 -34849 -178197 -189145 -176581 -56602 64770 -75662
23712g5662j02111j2377J93535N3067o0244r5656m1971l144J28181J8340Q8114
$$ -75662 -177773 -190150 3385 56452 -3792 -99448 -141419 -144563 -16382 1958 90072
23701I0072j32984j64734n1590L969M9745J22134J29199L4506p4566J8884J69265
$$ 90072 -42912 -207646 -259236 -255267 -205522 -83388 45811 80317 5751 24635 193900
23690A93900l8336N2599j46488o2008m1900r4068j73288J47352L5248N4335l1589
$$ 193900 155564 208163 61675 -333 -42233 -136301 -309589 -162237 -126989 -72654 -104243
23679a04243p8198L8985p5535R0535J16085l9242j53628j42082J21430p2676L3288
$$ -104243 -182441 -143456 -218991 -128456 -12371 -51613 -205241 -347323 -225893 -298569 -265281
23668b65281q8699K20454L59936o5788j19760j70639o2563Q1244j8549k1288j41344
$$ -265281 -353980 -133526 226410 160622 40862 -129777 -192340 -111096 -129645 -150933 -292277
23657b92277n7155K31965J65255R037k2519j21869M4278p4087M609j11122j92357
$$ -292277 -349432 -117467 47788 56825 34306 -87563 -43285 -117372 -112763 -223885 -416242
23646d16242j78276J31532L14196K31572J05699O3394j97983q4754J54134K9023
$$ -416242 -594518 -462986 -148790 82782 188481 251875 53892 -30862 123272 152295
23636A52295r0290L1J9202l2095k6237J92865L8518m7628j2062n9729J5084N6071
$$ 152295 62005 62036 81238 49143 22906 215771 254289 206661 194599 134870 149954 206025
23624B06025j90046k1376L7136M8662j63321p7779Q758l1535O5709O425k690q361
$$ 206025 15979 -5397 31739 80401 -82920 -160699 -151941 -183476 -117767 -111342 -114032 -122393
23612a22393j82059j49258J02473K24948J39659O7359M3506J80439K3747k48644
$$ -122393 -304452 -453710 -351237 -126289 13370 80729 124235 304674 328421 79777
23602G9777j64465j50576q4237P3907J31740L5303q7040j80324M4640J06993j23990
$$ 79777 -84688 -235264 -319501 -245594 -113854 -78551 -165591 -345915 -301275 -194282 -318272
23591c18272k0571J32504J17804J28530K9879J1401J1259j63000j7927m276L1439
$$ -318272 -338843 -206339 -88535 39995 69874 81275 92534 -70466 -88393 -92669 -61230
23580f1230k2569J7204J31250J54813j32793j62562p7811p4917l7518O8710J42620
$$ -61230 -83799 -66595 64655 219468 86675 -75887 -153698 -228615 -266133 -197423 -54803
23569e4803j4413j0360J35220p455n6797m7696l36J30761n042k8366q0765p841
$$ -54803 -69216 -79576 55644 48189 -8608 -56304 -56640 74121 69079 40713 -40052 -47893
23557d7893l6245k2712Q2171L5569j03345j33803J56575R7232q8400O0936j90829
$$ -47893 -84138 -106850 -24679 10890 -92455 -226258 -69683 27549 -60851 85 -190744
23546a90744K1867Q5412J56047P4142j29789J5784J04824m2455k7669l4908m5971
$$ -190744 -168877 -83465 72582 146724 16935 32719 137543 95088 67419 32511 -13460
23535a3460j45853K5335J16582J72091J39636j59181j7373k9731p3817l0488j0787
$$ -13460 -159313 -133978 -17396 154695 294331 135150 117777 88046 14229 -16259 -27046
23524b7046p2086K0926O8953j19581P0132Q9484m960o5765l5003O9293k3691j31805
$$ -27046 -99132 -78206 -9253 -128834 -58702 30782 25822 -39943 -74946 -5653 -29344 -161149
23512a61149k01241p2633P6460L0225J09830L8803R7165N7845O8526K45644J840
$$ -161149 -362390 -435023 -358563 -328338 -218508 -179705 -82540 -24695 43831 289475 291315
23501B91315k05618l4017J8685m6505J37802J38360r0442P488k08772j19740J00445
$$ 291315 85697 51680 70365 23860 161662 300022 209580 217068 8296 -111444 -10999
23490a0999K8255K3963j35617p0977J47629p6563j31995L748n0305J26055P678
$$ -10999 17256 41219 -94398 -165375 -17746 -94309 -226304 -222556 -272861 -146806 -139128
23479a39128M9792l4368J65613K52479M0347m0631K0606p0147P1218l4463j43218
$$ -139128 -89336 -123704 41909 294388 334735 294104 314710 244563 315781 281318 138100
23468A38100k02997K1641J3473n7093M0075J42465J73729o3719o3785k74830J570
$$ 138100 -64897 -43256 -29783 -86876 -46801 95664 269393 205674 141889 -132941 -131371
23457a31371Q3325q2212N6734l7373r0468K4076J43901r9931n9696J9479j18737
$$ -131371 -48046 -130258 -73524 -110897 -201365 -177289 -33388 -133319 -193015 -173536 -292273
23446b92273p2598J51924J86341O8004j45456J41718J70362k4706j48909j01793
$$ -292273 -364871 -212947 -26606 41398 -104058 37660 208022 183316 34407 -67386
23436f7386R4643r4872J44740N9567q3670n227j07742m7280N246L549P9478J83097
$$ -67386 27257 -67615 77125 136692 53022 47795 -59947 -107227 -101981 -98432 -18954 164143
23424A64143l5983r0245j39241J2297O6785Q6602j6363L2462M682J0580N8952
$$ 164143 128160 37915 -101326 -89029 -22244 64358 47995 80457 85139 95719 154671
23413A54671k6152L9262o9108k74501q5638J0838q7511L737J5953K9442J76379
$$ 154671 128519 167781 98673 -175828 -261466 -250628 -338139 -334402 -318449 -289007 -112628
23402a12628r1095j33263J70777N2967J57284r068p9192j54583o2367J02773J35060
$$ -112628 -203723 -336986 -166209 -113242 44042 34974 -44218 -198801 -261168 -158395 -23335
23391b3335J37583j63842k11194J1518k2356K91229M5146j1129j7064L3589J07374
$$ -23335 114248 -49594 -260788 -249270 -271626 19603 64749 53620 36556 70145 177519
23380A77519J70591l5480p7676m9353q9127K114p2828j84732l8954P3234J66830
$$ 177519 348110 312630 234954 185601 96474 98588 25760 -158972 -197926 -124692 42138
23369D2138K3714O4997j33013o4101q71L2008L9106O5419N4930q4289O9479p3208
$$ 42138 65852 130849 -2164 -66265 -67136 -35128 3978 69397 124327 40038 109517 36309
23357C6309j53312n3162J63544Q7362P122m9263m5689j15337m7044J36902j51435
$$ 36309 -117003 -170165 -6621 80741 87863 38600 -7089 -122426 -169470 -32568 -184003
23346a84003N497n1924Q5363K54609o6889j9547k7219j06996n1283K25899P1973
$$ -184003 -178506 -230430 -145067 109542 42653 23106 -4113 -111109 -162392 63507 135480
23335A35480q4113K43673J41366L0604r767o5042r4665k64160k5048l8665J2173
$$ 135480 51367 295040 436406 467010 457243 392201 297536 33376 8328 -30337 -18164
23324a8164j3696J06497M844k3296R0980J16909L3805j50633l8645p1876q6865
$$ -18164 -31860 74637 79481 56185 147165 264074 297879 147246 108601 36725 -50140
23313e0140m1972N6423K04813n5324j06556L4979O1586j85848r8159N1789N7482
$$ -50140 -92112 -35689 169124 113800 7244 42223 103809 -82039 -180198 -128409 -70927
23302g0927j83252J23216K27027K1802k24012J98224J20266j11859k21525k11924
$$ -70927 -254179 -130963 96064 117866 -106146 92078 212344 100485 -121040 -332964
23292c32964O1900R5756J37898R801r0977P3428r2422K5623J80963o0776k6050
$$ -332964 -271064 -175308 -37410 -27609 -118586 -45158 -137580 -111957 69006 8230 -17820
23281a7820j09076J45596m30J24296N9226m0727j55097m0745j01576j4455j0506
$$ -17820 -126896 18700 18270 142566 201792 161065 5968 -34777 -136353 -150808 -161314
23270a61314K3796J68871O3073n2226p6338q1234K15400j1403m3934J05550m4294
$$ -161314 -137518 31353 94426 42200 -34138 -115372 100028 88625 44691 150241 105947
23259A05947M3945p9594r6070j42207Q893R5403R5879K4627j1777J26420k3411
$$ 105947 149892 70298 -25772 -167979 -159086 -63683 32196 56823 45046 171466 148055
23248A48055k25358r5374n9981j12923J26894J24464l992K13335O63j31379j14948
$$ 148055 -77303 -172677 -232658 -345581 -218687 -94223 -98215 115120 115783 -15596 -130544
23237a30544l4036j5112j04115j62867R7751j2411p3870K29576J06432N0452K7970
$$ -130544 -164580 -179692 -283807 -446674 -348923 -361334 -435204 -205628 -99196 -48744 -20774
23226b0774j60734M5538N8489Q5774Q4185j6183m431l2657K3366r2504j35360
$$ -20774 -181508 -135970 -77481 8293 92478 76295 71864 39207 62573 -29931 -165291
23215a65291j43608M7700n8688K4382L64142r539n8882j181K6888q9295L3135
$$ -165291 -308899 -261199 -319887 -295505 68637 59098 216 -965 25923 -63372 -30237
23204c0237M2090N571n6923p9898j21781J45691P1098k445l2878K17637j36784
$$ -30237 11853 17424 -39499 -119397 -241178 -95487 -24389 -26834 -59712 157925 21141
23193B1141l3140L3621O6120M2402m9978K265n0930j09277p9852r045N1620l8215
$$ 21141 -11999 21622 87742 130144 80166 82431 31501 -77776 -157628 -166673 -115053 -153268
23181a53268k16007J30108J84267n3909o3928j56345L4036J63561O7675n724L1737
$$ -153268 -369275 -239167 -54900 -108809 -172737 -329082 -295046 -131485 -63810 -69534 -37797
23170c7797m7282j09873j14232j7330r395P1313L7313J53247m0921j41578o8265
$$ -37797 -85079 -194952 -309184 -326514 -335909 -264596 -227283 -74036 -114957 -256535 -324800
23159c24800R6872R0954j78892o4094J34844K42508M1866k6655N4331J02598j65187
$$ -324800 -227928 -136974 -315866 -379960 -245116 -2608 39258 12603 66934 169532 4345
23148D345j15084j75048j6277Q0499M2846P9669l5653j40422N6834J1974J32639
$$ 4345 -110739 -285787 -302064 -221565 -178719 -99050 -134703 -275125 -218291 -206317 -73678
23137g3678O1723j10142j29052P2273J1238L7415J32985K4556L1668q4712j91128
$$ -73678 -11955 -122097 -251149 -178876 -167638 -130223 2762 27318 58986 -25726 -216854
23126b16854L0100P1643K17385J64898J1302j64163l6738j09125k31148L5370
$$ -216854 -186754 -115111 102274 267172 278474 114311 77573 -31552 -262700 -227330
23116b27330m678m801O1842K3917O4707j18818K31856J35980o5958k05095J20716
$$ -227330 -232008 -236809 -174967 -151050 -86343 -205161 26695 162675 96717 -108378 12338
23105A2338J23090j38112m5441N5241J26574P7972O0514r1080j6678j10780k95194
$$ 12338 135428 -2684 -48125 7116 133690 211662 272176 181096 164418 53638 -241556
23094b41556R7445j28892j30290O2868o3247O569J30960J86051J49389J7720j70493
$$ -241556 -144111 -273003 -403293 -340425 -403672 -397103 -266143 -80092 69297 87017 -83476
23083h3476P5218O1677n0330M119J12588l0949l1669n7188n6150n5283o8005O0945
$$ -83476 -8258 53419 3089 7208 119796 88847 57178 -10 -56160 -111443 -179448 -118503
23071a18503J87296R6649j34613j65777R0436j69385j92512n1314J64053M1577
$$ -118503 68793 165442 30829 -134948 -44512 -213897 -406409 -457723 -293670 -252093
23061b52093k4091J13956N2241k104j6325L1496M9045n2088L7364j51574j43634
$$ -252093 -276184 -162228 -109987 -112091 -128416 -96920 -47875 -99963 -62599 -214173 -357807
23050c57807J37156P2864Q153k3355j2291m1549J86211j12460J28607R3771O457
$$ -357807 -220651 -147787 -139634 -162989 -175280 -216829 -30618 -143078 -14471 79300 85757
23039H5757l2297R4993l5712k2613q2780L8630j09171m1280N5295K3436J6128
$$ 85757 53460 148453 112741 90128 7348 45978 -63193 -104473 -49178 -25742 -9614
23028i614Q0229n5208Q789Q2945J8332j09188j02306j82581j45319J65368J35706
$$ -9614 70615 15407 24196 107141 125473 16285 -86021 -268602 -413921 -248553 -112847
23017a12847N478k59173j48977J81453L490n1674J89491J60312m2906j05902K2184
$$ -112847 -107369 -366542 -515519 -334066 -330576 -382250 -192759 -32447 -75353 -181255 -159071
23006a59071M6419L9578J9335n0592o207o3930j07804K5640n7727L4162J4842
$$ -159071 -112652 -73074 -53739 -104331 -110538 -174468 -282272 -256632 -314359 -280197 -265355
22995b65355K9985q2570j32002j3318J83146K36631P5712N9342J55218J1604j88408
$$ -265355 -235370 -317940 -449942 -463260 -280114 -43483 32229 91571 246789 258393 69985
22984F9985k0011M0877N8121m6674P7605J78139J15155j22423j99555m7834j75538
$$ 69985 49974 90851 148972 102298 179903 358042 473197 350774 151219 103385 -72153
22973g2153n5263P505j5021N3851Q4293N3764m4146O8066m7285l9949m6755J49654
$$ -72153 -127416 -119911 -134932 -81081 3212 56976 12830 80896 33611 -6338 -53093 96561
22961I6561l2666r5638l8084J8686L7651n2908l9555l7336j12544O705J20816
$$ 96561 63895 -31743 -69827 -51141 -13490 -66398 -105953 -143289 -255833 -249128 -128312
22950a28312J035M2767p0615K669J41927p646j82395j43279L7819Q6755J5345
$$ -128312 -127277 -84510 -155125 -152456 -10529 -18175 -200570 -343849 -306030 -219275 -203930
22939b03930R0936J4401o9209m6652k6302J64695K65049J7818p8844n021J12355
$$ -203930 -112994 -98593 -167802 -214454 -240756 -76061 188988 206806 127962 122941 235296
22928B35296j32431j90579K4178J18085l4221j73369r504k368j17991j7572j904
$$ 235296 102865 -87714 -63536 54549 20328 -153041 -162545 -164913 -282904 -300476 -302380
22917c02380j5634m5869J73832K73882L1615j38596j03772N4755J67478O8967
$$ -302380 -318014 -363883 -190051 83831 115446 -23150 -126922 -72167 95311 164278
22907A64278P2419n8383q6991q4553o1981O8596J18538K711j54838J08948J25453
$$ 164278 236697 178314 91323 6770 -55211 13385 131923 134634 -20204 88744 214197
22896B14197J0474j28030j58835k50190q3540K62993J60259J4353j3557r5520
$$ 214197 224671 96641 -62194 -312384 -395924 -132931 27328 41681 28124 -67396
22886f7396P529N9172K7561m1683j2007j25046J859J96207p576m5664j757M2077
$$ -67396 -59867 -695 26866 -14817 -26824 -151870 -150011 46196 38620 -7044 -8801 33276
22874C3276L3914J0537o6555p2637p3881r5173J93064Q2433j7262k12301j1229
$$ 33276 67190 77727 11172 -61465 -135346 -230519 -37455 44978 27716 -184585 -195814
22863a95814J25364K9138J16184M2365p22j0339j96719J7742J53913o7047l4499
$$ -195814 -70450 -41312 74872 117237 116515 106176 -90543 -72801 81112 14065 -20434
22852b0434j3936K4121J56209l163m0995p7760J0057J51678O4387j33364j4739
$$ -20434 -34370 -10249 145960 142797 101802 24042 34099 185777 250164 116800 102061
22841A02061J83489J40452q2818j39500j79582L1906R7111O0532m8136l1670k19512
$$ 102061 285550 426002 343184 203684 24102 56008 153119 213651 165515 133845 -85667
22830h5667r3806m8082n8004J33454J560J5489P5757J5338r4500j75763J84254
$$ -85667 -179473 -227555 -285559 -152105 -150545 -135056 -59299 -43961 -138461 -314224 -129970
22819a29970J36649j26298R69q090J8957L4752K22871J4723p9724j94058q0469
$$ -129970 6679 -119619 -118650 -126740 -107783 -73031 149840 164563 84839 -109219 -189688
22808a89688j05136K1534K59278P7106j13172q0219j14478J91739m8180P5711
$$ -189688 -294824 -273290 -14012 63094 -50078 -130297 -244775 -53036 -101216 -25505
22798b5505J27634N0087N4059p8399j7159q7287j46232l3580J65218l4803K9439
$$ -25505 102129 152216 206275 127876 110717 23430 -122802 -156382 8836 -25967 3472
22787C472o8072N6822j8026j20886k1300J62423R3152j91702o9035J60575P1646
$$ 3472 -64600 -7778 -25804 -146690 -167990 -5567 87585 -104117 -173152 -12577 59069
22776E9069m2384m6929j39775r5296O2168K5194J79410M0337j0336j03332r1367
$$ 59069 16685 -30244 -170019 -265315 -203147 -177953 1457 41794 31458 -71874 -163241
22765a63241J45888K26759Q751p3228r2158k9139Q0167l1024m8023k0652j19564
$$ -163241 -17353 209406 218157 144929 52771 23632 103799 72775 24752 4100 -115464
22754a15464J42827J10194j38653O5447m7694O2482J12853L5343r0723k4297j4992
$$ -115464 27363 137557 -1096 64351 16657 79139 191992 227335 136612 112315 97323
22743I7323j20048q1234J7467j62538j39769J9707J04222J64250P5721P0740r5620
$$ 97323 -22725 -103959 -86492 -249030 -388799 -369092 -264870 -100620 -24899 45841 -49779
22732d9779o0993M3970J42135n7313O2680J42029j54617M1064P6938j48064j10863
$$ -49779 -110772 -66802 75333 18020 80700 222729 68112 109176 186114 38050 -72813
22721g2813j7360r406r5130R3697K5238l5500P1404O8864j44492j19273J98018
$$ -72813 -90173 -99579 -194709 -101012 -75774 -111274 -39870 28994 -115498 -234771 -36753
22710c6753J23366J30549n9702k35184j55693M9040K0391n427J57534L0681R1666
$$ -36753 86613 217162 157460 -77724 -233417 -184377 -163986 -169413 -11879 18802 110468
22699A10468L0431p1458K4747j5875j64522k0946J94944N7216k8317M314J10335
$$ 110468 140899 69441 94188 78313 -86209 -107155 87789 145005 116688 121002 231337
22688B31337J15845J6848j50164q1573r8539L9306J70624J1078k9234p7067j1799
$$ 231337 347182 364030 213866 132293 33754 73060 243684 254762 225528 148461 136662
22677A36662N442M4856J18846p061r4248J9856k6994k09902j82289j5245p9172
$$ 136662 142104 186960 305806 298745 204497 224353 197359 -12543 -194832 -210077 -289249
22666b89249m2265n2350J66932K07998j32232J10073n3944J20849j6891m5945
$$ -289249 -331514 -383864 -216932 -8934 -141166 -31093 -85037 35812 18921 -27024
22656b7024R8229p0635m4795O2428j6384n3326q064P382j8025J10598J94807r2418
$$ -27024 71205 570 -44225 18203 1819 -51507 -59571 -52189 -70214 40384 235191 142773
22644A42773j23894M9526j4964q0465Q3725L0075l8530J45769O4542k2585L3621
$$ 142773 18879 68405 53441 -27024 56701 86776 48246 194015 258557 235972 269593
22633B69593j84611j41726j25664K2208q3712K9321R3180n7231r843L57306K1770
$$ 269593 84982 -56744 -182408 -160200 -243912 -214591 -121411 -178642 -188485 168821 190591
22622A90591j71244j52026R6150J79988j53221p1178Q5970p2191r1607M150j773
$$ 190591 19347 -132679 -36529 143459 -9762 -80940 5030 -67161 -158768 -154618 -156391
22611a56391m3583J65404J03301O1513o9105m3251O5651n9746l2887r9220J5746
$$ -156391 -199974 -34570 68731 130244 61139 17888 83539 23793 -9094 -108314 -92568
22600i2568l2481j53125j05150M7730k2597O5763J30943K05842n0957o3625J26223
$$ -92568 -125049 -278174 -383324 -335594 -358191 -292428 -161485 44357 -6600 -70225 55998
22589E5998P8455r8440j08460j70680j47375N8018J52738R4124M7030K3669n3601
$$ 55998 134453 36013 -72447 -243127 -390502 -332484 -179746 -85622 -38592 -14923 -68524
22578f8524q2895J06911Q8626l937K1024o7178J43650K4399l14577k93983J05297
$$ -68524 -151419 -44508 44118 40181 61205 -5973 137677 162076 -152501 -446484 -341187
22567c41187R6520k9444n798J11381P3312m4038J02459L8557j00778o7863j0617
$$ -341187 -244667 -274111 -279909 -168528 -95216 -139254 -36795 1762 -99016 -166879 -177496
22556a77496K18871M738r0726p8798O623j32887n3878J00253J34355N6083l9548
$$ -177496 41375 46113 -44613 -123411 -116788 -249675 -303553 -203300 -68945 -12862 -52410
22545e2410J09033J90492n1547k3101j34464M8839l962P9674M0786j33403J9456
$$ -52410 56623 247115 195568 172467 38003 86842 82880 162554 203340 69937 89393
22534H9393J5416j50002M5881J34387K0838p9724J28710j1117j6755l0037r7777
$$ 89393 104809 -45193 688 135075 155913 76189 204899 193782 177027 146990 49213
22523D9213l6291p1860m9897J2018K3541L9399K5616r6589K182J80701L3885m9087
$$ 49213 12922 -58938 -108835 -96817 -73276 -33877 -8261 -104850 -102668 78033 111918 62831
22511F2831N8774p2207l8353R1277P3996k24207j02945n7468q0002M2631K6770
$$ 62831 121605 49398 11045 102322 176318 -47889 -150834 -208302 -288304 -245673 -218903
22500b18903j734m4771P5702N0263j33932J06214K70361j02026r2666j4449K6466
$$ -218903 -220637 -265408 -189706 -139443 -273375 -167161 103200 1174 -91492 -105941 -79475
22489g9475p4053j24088P5648J08785K52409R1242n9021o2408l226j17642j37498
$$ -79475 -153528 -277616 -201968 -93183 159226 250468 191447 129039 125813 8171 -129327
22478a29327J336k6319r2883R1591O1108j09259k950J64519K7794P137n2456p8454
$$ -129327 -127991 -154310 -247193 -155602 -94494 -203753 -206703 -42184 -14390 -7253 -59709 -138163
22466a38163K1284L6641J1202R7150Q4192J2892p0315q5698j3977J39188l4332
$$ -138163 -116879 -80238 -69036 28114 112306 125198 54883 -30815 -44792 94396 60064
22455F0064r4301j16957j03557J20573n713j15806o1631K0472J66673J38493J69546
$$ 60064 -34237 -151194 -254751 -134178 -139891 -255697 -317328 -296856 -130183 8310 177856
22444A77856q895j09068K2392J12354j20940q5028N3324k5814k40510R5202N9355
$$ 177856 168961 59893 82285 194639 73699 -11329 41995 16181 -224329 -129127 -69772
22433f9772O16j03025J10250R2262J5540k8612j21305k6384l880J98049k4046
$$ -69772 -69156 -172181 -61931 30331 45871 17259 -104046 -130430 -134310 63739 39693
22422C9693m5150k5965R8722l4160J06644P8793j4186k19034r1253J02619N6050
$$ 39693 -5457 -31422 67300 33140 139784 218577 204391 -14643 -105896 -3277 52773
22411E2773l9163j76162j18028L8798O3479J12750P3759l1051L7901n3830R8335
$$ 52773 13610 -162552 -280580 -241782 -178303 -65553 8206 -22845 15056 -38774 59561
22400E9561r6397l7114q3881J00174J31363j23011j13428n8005m7362R943J8857
$$ 59561 -36836 -73950 -157831 -57657 73706 -49305 -162733 -220738 -268100 -258157 -239300
22389b39300m5186J24936Q0334M8102K4419N4562l016j2385L9850p3616o6236
$$ -239300 -284486 -159550 -79216 -31114 -6695 47867 44851 32466 72316 -1300 -67536
22378f7536k133o4675j31588m8945J0784J13819J47578J19864Q1148J6834o8525
$$ -67536 -69669 -134344 -265932 -314877 -304093 -190274 -42696 77168 158316 175150 106625
22367A06625o4799n0943J8882j1567l636J28345q8798J5077p7197j0087P9307
$$ 106625 41826 -9117 9765 -1802 -5438 122907 34109 49186 -28011 -38098 41209
22356D1209Q7732k1863R079O5635r3822k2017o605J0735n767j73888p233K7826
$$ 41209 128941 107078 116157 181792 87970 65953 59348 70083 64316 -109572 -116805 -88979
22344h8979j44135r0359M7517J83162k4659j32291j41766n273l5997R2899J58899
$$ -88979 -233114 -323473 -275956 -92794 -117453 -249744 -391510 -396783 -432780 -339881 -180982
22333a80982R7150m309P7447J00349j15762j34411K8432M6438N1639L5240R9322
$$ -180982 -83832 -88141 -10694 89655 -26107 -160518 -132086 -85648 -34009 1231 100553
22322A00553j9105n9364m807r7189L5417K9455p4388p2800O6640J75167J62253
$$ 100553 81448 22084 17277 -79912 -44495 -15040 -89428 -162228 -95588 79579 241832
22311B41832l2957j36656j26982j35517m4435M7946J24865n2140j9151o7587j58881
$$ 241832 208875 72219 -54763 -190280 -234715 -186769 -61904 -114044 -133195 -200782 -359663
22300c59663n7500J47433K10307L255l3115O2924j62866j31262O0812J01534j2378
$$ -359663 -417163 -269730 -59423 -56168 -89283 -26359 -189225 -320487 -259675 -158141 -170519
22289a70519J30696N2638j05869O8476J5120l8022j4563p9942J49300J79879m6180
$$ -170519 -39823 12815 -93054 -24578 -9458 -47480 -62043 -141985 7315 187194 141014
22278A41014o7884J2896r7267j29450J69742Q9309K4171L7646k7039q8885q0788
$$ 141014 73130 86026 -11241 -140691 29051 118360 142531 180177 153138 64253 -16535
22267a6535P724j46482L7696J52622R3295p311P9143J01937l7867j01144j64610
$$ -16535 -8811 -155293 -117597 35025 128320 121009 200152 302089 264222 163078 -1532
22256a532M2495N8893L9494q0390j53670N3937N1845j29049j8274N9253j16585
$$ -1532 40963 99856 139350 58960 -94710 -40773 11072 -117977 -136251 -76998 -193583
22245a93583Q8453R1750J05295J08446r2777m32J20336j21720j46489n6595j0062
$$ -193583 -105130 -13380 91915 200361 107584 107152 227488 105768 -40721 -97316 -107378
22234a07378l6050P8653n5361J33539k343j46944q3841J08202J41881q379Q0203
$$ -107378 -143428 -64775 -120136 13403 11060 -135884 -219725 -111523 30358 21979 102182
22223A02182p5208J1050k6836q069p5603L1757m1815n1412j66932J55190J20156
$$ 102182 26974 38024 11188 3119 -72484 -40727 -82542 -133954 -300886 -145696 -25540
22212b5540n5748j97121j79269M9959J62831K02848P1969j05105m0490k2374L0010
$$ -25540 -81288 -278409 -457678 -407719 -244888 -42040 29929 -75176 -115666 -138040 -108030
22201a08030M1673P1736o2959L2419j21253Q6075R8620j16756j60496P7798K8872
$$ -108030 -66357 5379 -57580 -25161 -146414 -60339 38281 -78475 -238971 -161173 -132301
22190a32301k3631N0121q5778q6719J06389l2944j10960p8611K10523K24003R3362
$$ -132301 -155932 -105811 -191589 -278308 -171919 -204863 -315823 -394434 -183911 40092 133454
22179A33454P3783J4865j48549p5581M1797k6640Q638j46863M581o8895j4189
$$ 133454 207237 222102 73553 -2028 39769 13129 21767 -125096 -120515 -189410 -203599
22168b03599J7909J86152N5233J4707j7362j27529M8409O7777J26661l1079r2355
$$ -203599 -185690 462 55695 70402 53040 -74489 -26080 41697 168358 137279 44924
22157D4924o1169j19552O6351J46398N3185j7989k4147p3217j26695K2653M3251
$$ 44924 -16245 -135797 -69446 76952 130137 112148 88001 14784 -111911 -89258 -46007
22146d6007J85763m0800R2342M9019j28058j9276J0289p7258p4793P8400p3204
$$ -46007 139756 98956 191298 240317 112259 92983 103272 26014 -48779 29621 -43583
22135d3583j19314O2584J81467P1779j80513l3230j199n3026j7604k9549j9546
$$ -43583 -162897 -100313 81154 152933 -27580 -60810 -62009 -115035 -132639 -162188 -181734
22124a81734K77772R3913J5986J53064L1801j14927J1776q9547N5121j28372j88895
$$ -181734 96038 189951 205937 359001 390802 275875 287651 198104 253225 124853 -64042
22113f4042k8823J20321L2155Q1029L840k13675o0568o923O4614J35913J02948
$$ -64042 -92865 27456 59611 140640 144480 -69195 -129763 -136686 -72072 63841 166789
22102A66789k2493j39358o7296j2755j28878k63148L8038L83389J69720j78802
$$ 166789 144296 4938 -62358 -75113 -203991 -467139 -429101 -45712 124008 -54794
22092e4794j66861m3488K10367Q9075J42207m3827p6494j8327M0663J41195o5204
$$ -54794 -221655 -265143 -54776 34299 176506 132679 56185 37858 78521 219716 154512
22081A54512r6736p4228l2572N0082q5377j94227Q0559K65367N7614m4764l8284
$$ 154512 57776 -16452 -49024 1058 -84319 -278546 -197987 67380 124994 80230 41946
22070D1946J5488k8760P3587K17319l5363j25807j01369j54456L7232J01707m2108
$$ 41946 57434 28674 102261 319580 284217 158410 57041 -97415 -60183 41524 -584
22059e84Q4349M6922j01870o760r050m6909p9392O9252m6540M4625K6171O2253
$$ -584 83765 130687 28817 22057 13007 -33902 -113294 -44042 -90582 -45957 -19786 42467
22047D2467j8574J4980p2728k4579l8110J24837j8244q9506R1469N6443k33564
$$ 42467 23893 38873 -33855 -58434 -96544 28293 10049 -79457 12012 68455 -165109
22036a65109l1335J66802J27317R3916k71466K2707K03158p4637r4069n9675J75175
$$ -165109 -196444 -29642 97675 191591 -79875 -57168 145990 71353 -22716 -82391 92784
22025I2784J4412k83975j82726o0526J45650M1542P8133J7082J06381j7897K6692
$$ 92784 107196 -176779 -359505 -420031 -274381 -232839 -154706 -137624 -31243 -49140 -22448
22014b2448J40202O193j3292p3304m2755J09772j0798j3037k06884L3419J71175
$$ -22448 117754 123947 110655 37351 -5404 104368 93570 80533 -126351 -92932 78243
22003G8243n2091L8124j66249n5363K2606J60354K05724J7174p6373j13896p4352
$$ 78243 26152 64276 -101973 -157336 -134730 25624 231348 248522 172149 58253 -16099
21992a6099j63582j48126J32607Q5340N5495N2736J09271o9387k98908l3510K52656
$$ -16099 -179681 -327807 -195200 -109860 -54365 -1629 107642 38255 -260653 -294163 -41507
21981d1507q9233k4426j05064J6408R4854K8575J04430r550J2967o6926J5033
$$ -41507 -130740 -155166 -260230 -243822 -148968 -120393 -15963 -25513 -12546 -79472 -64439
21970f4439j1314R2485j28724J1372J80321q8663j95057q8187O2146R1455j111
$$ -64439 -75753 16732 -111992 -100620 79701 -8962 -204019 -292206 -230060 -138605 -139716
21959a39716K0322J42698R8729r249k08251q6969J33985m6545j3010o8560m4325
$$ -139716 -119394 23304 122033 112784 -95467 -182436 -48451 -94996 -108006 -176566 -220891
21948b20891n5033N9941J33113M6462k8091k3885m5440J07691k3375k0703n3582
$$ -220891 -275924 -215983 -82870 -36408 -64499 -88384 -133824 -26133 -49508 -70211 -123793
21937a23793q2965k08384K17502K24912M9027j34629j65327l9810O5701n8215
$$ -123793 -206758 -415142 -197640 27272 76299 -58330 -223657 -263467 -197766 -255981
21927b55981J42629J23421j8939o6869M6771O3586k6207q8031p5547P9467M0795
$$ -255981 -113352 10069 -8870 -75739 -28968 34618 8411 -79620 -155167 -75700 -34905
21916c4905j5663J29474r8363K5287J03319P779R882o9841j00187P1881N4668
$$ -34905 -50568 78906 -19457 5830 109149 116928 126810 56969 -43218 28663 83331
21905H3331q6855J30758M1251J24677P5372o2936j11444l9202j7560l5157n3532
$$ 83331 -3524 127234 168485 293162 368534 305598 194154 154952 137392 102235 48703
21894D8703n4072l1020k0872K3053j05734K0879Q0663j65097J1174M1460J99007
$$ 48703 -5369 -36389 -57261 -34208 -139942 -119063 -38400 -203497 -192323 -150863 48144
21883D8144K10916r3535k13493j3625J17920j26788k8320J5031N0880M2904N4030
$$ 48144 259060 165525 -47968 -61593 56327 -70461 -98781 -83750 -32870 10034 64064
21872F4064m5936j18012J34503M9506j21642r4420N5399Q4329J74372j3330o4985
$$ 64064 18128 -99884 34619 84125 -37517 -131937 -76538 7791 182163 168833 103848
21861A03848r3524k5366M0598J74818l6863n957j36894n5318q8000j46523P4184
$$ 103848 10324 -15042 25556 200374 163511 157554 20660 -34658 -122658 -269181 -194997
21850a94997J69600J4633L220J01269M8918p043l091l9232k8860o5823l6116l5688
$$ -194997 -25397 -10764 -7544 93725 142643 135600 132509 93277 64417 -1406 -37522 -73210
21838g3210M7624o765q7086J3567K7954J63752l9807Q5172K9629j7947j32763
$$ -73210 -25586 -32351 -119437 -105870 -77916 85836 46029 131201 160830 142883 10120
21827A0120j24104R8904k0803n4211k5033O0465K7103J49708j47649j71069n6076
$$ 10120 -113984 -15080 -35883 -90094 -115127 -54662 -27559 122149 -25500 -196569 -252645
21816b52645j05655O3861J11560O0625O7421O9080j245q4646n8951j8397p1295
$$ -252645 -358300 -294439 -182879 -122254 -54833 14247 13002 -71644 -130595 -148992 -220287
21805b20287Q1676p008K6482R6241q4317j81775L1570J05042l5465r6208K2678
$$ -220287 -138611 -145619 -119137 -22896 -107213 -288988 -257418 -152376 -187841 -284049 -261371
21794b61371J33913J39379J92228P023j26567j4984M2258K1657n0196p4972p2945
$$ -261371 -127458 11921 204149 211172 84605 69621 111879 133536 83340 8368 -64577
21783f4577J43850N1885j12419o6345J2415K17521l252O2950M0465k09548k79469
$$ -64577 79273 131158 18739 -47606 -35191 182330 179078 242028 282493 72945 -206524
21772b06524M3191J86472K11096m7305r2659L1708j00350o6421J01040N2254q9642
$$ -206524 -163333 23139 234235 186930 94271 125979 25629 -40792 60248 112502 22860
21761B2860j55329J9374Q9586Q277j03879j4417O6369L5074l6900p2976N4659
$$ 22860 -132469 -113095 -23509 -15232 -119111 -133528 -67159 -32085 -68985 -141961 -87302
21750h7302P0858m8361M9749r2446q6783o4025N3798J44159R4056o7549k5267
$$ -87302 -16444 -64805 -15056 -107502 -194285 -258310 -204512 -60353 33703 -33846 -59113
21739e9113n930k6317K7593m03K38173n0902j65013o9606j5261q4884m8810R7811
$$ -59113 -65043 -91360 -63767 -64170 174003 123101 -41912 -111518 -126779 -211663 -260473 -162662
21727a62662M3262M0328K23909l6289j11710j12633N3252J39172j6352q3774l2830
$$ -162662 -119400 -79072 144837 108548 -3162 -115795 -62543 76629 60277 -23497 -56327
21716e6327K9132J63213M2536k2726O671j55784M9300m6997q3759K3278n1784
$$ -56327 -27195 136018 178554 155828 162499 6715 56015 9018 -74741 -51463 -103247
21705a03247n9008p3703R3867J49322N7987j2331m083q9146l0165J97369q1723
$$ -103247 -162255 -235958 -142091 7231 65218 52887 48804 -40342 -70507 126862 45139
21694D5139n2292k3032J4911k9723J02627J7745p1792P793N1708p179p1204n0783
$$ 45139 -7153 -30185 -15274 -44997 57630 75375 3583 11376 63084 55905 -15299 -66082
21682f6082j1564Q5003O3677K28426K5068j04790j34457r3668q9039N2703Q5982
$$ -66082 -77646 7357 71034 299460 324528 219738 85281 -8387 -97426 -44723 41259
21671D1259k1181m4833j79375J66645P2529k5068r7780L6368o0549Q657J67228
$$ 41259 20078 -24755 -204130 -37485 35044 9976 -87804 -51436 -111985 -103328 63900
21660F3900N290k03804j96116J2140L04953J51692j30396j89721J29908J26322
$$ 63900 69190 -134614 -330730 -318590 -13637 138055 7659 -182062 -52154 74168
21650G4168n0052J20030Q2099O847k30360r4729m83M9627j056O8267j69287n8838
$$ 74168 24116 144146 226245 233092 2732 -91997 -92480 -42853 -43909 24358 -144929 -203767
21638b03767K0220J68757m6360q3106J28362J17562L0298L4350r2407j23094o404
$$ -203767 -183547 -14790 -61150 -144256 -15894 101668 131966 166316 73909 -49185 -55589
21627e5589M1055M3523J56256J52458k98628l4691n6316K3382K6695P0078O1405
$$ -55589 -14534 28989 185245 337703 39075 4384 -51932 -28550 -1855 68223 129628
21616A29628K2644M7253p1159k0913O029o9052L8211N0051q1347j99802n4061
$$ 129628 152272 199525 128366 107453 113482 44430 82641 132692 51345 -148457 -202518
21605b02518O0663J75662L3437j47937j58898j59062p243J70177J36480p8205
$$ -202518 -141855 33807 67244 -80693 -239591 -398653 -405896 -235719 -99239 -177444
21595a77444J01363Q8753q6140j2176J45371J16643M2466o6273r3641J26037l1538
$$ -177444 -76081 12672 -73468 -85644 59727 176370 218836 152563 58922 184959 153421
21584A53421k5074J08310r7942j55686J24407R5162K565j34728m4997N632j68147
$$ 153421 128347 236657 138715 -16971 107436 202598 205163 70435 25438 31070 -137077
21573a37077m1114O7341R819R0104O8097n7323j48638k6872J58284J03879N147
$$ -137077 -178191 -110850 -101031 -10927 57170 -153 -148791 -175663 -17379 86500 91647
21562I1647j44000p6070l4118J13725m812j11943O939J31267n358j7832J17657
$$ 91647 -52353 -128423 -162541 -48816 -53628 -165571 -158632 -27365 -32723 -50555 67102
21551F7102J8803l4481j67783r0808j6373j66719j26929K4966K01079J14260L36640
$$ 67102 85905 51424 -116359 -207167 -223540 -390259 -517188 -492222 -291143 -176883 159757
21540A59757L7144o3715Q0873R1859N5432L0674Q9194k42272j56172p1141K5292
$$ 159757 196901 133186 214059 305918 361350 392024 481218 238946 82774 11633 36925
21529C6925J09286m885J5715O2645p2354j29867N2687J5468K2823o9540l131j40389
$$ 36925 146211 141326 157041 219686 147332 17465 70152 85620 108443 38903 35772 -104617
21517a04617R95J1900m5951L3315n0058Q1827N8251M4727j53995j26842L6523
$$ -104617 -103622 -91722 -137673 -104358 -154416 -72589 -14338 30389 -123606 -250448 -213925
21506b13925K14254P5166j72272J05922J86533o8388j25239o2110m7263N9320
$$ -213925 329 75495 -96777 9145 195678 127290 2051 -60059 -107322 -48002
21496d8002J19730o2470Q6798O1121J1307o0108O7630P2481q9254n9947j26266
$$ -48002 71728 9258 96056 157177 168484 108376 176006 248487 159233 99286 -26980
21485b6980j50044J59536m6382O8950K0926J03442R0700j6063M2970m6056n7479
$$ -26980 -177024 -17488 -63870 5080 26006 129448 220148 204085 247055 200999 143520
21474A43520m6718J53073j26539j14405q7907j24297J09790k528J12643N8357
$$ 143520 96802 249875 123336 8931 -78976 -203273 -93483 -96011 16632 74989
21464G4989n6119k54569m2368Q2706J62504o8143j48607m2436K637J11704r6316
$$ 74989 18870 -235699 -278067 -195361 -32857 -101000 -249607 -292043 -289406 -177702 -274018
21453b74018P0569N6690j03444p9253J32657J56877P1845K6339n2880k42141J4732
$$ -274018 -203449 -146759 -250203 -329456 -196799 -39922 31923 58262 5382 -236759 -222027
21442b22027n1134J0294q8446J23725J62264J37178j5266j75847m6870p3978J59281
$$ -222027 -273161 -262867 -351313 -227588 -65324 71854 56588 -119259 -166129 -240107 -80826
21431h0826M3952J8140P511J39993J7715q7072j69165J7338J33089K8789j34752
$$ -80826 -36874 -18734 -11223 128770 146485 59413 -109752 -92414 40675 69464 -65288
21420f5288l4830o412P4254R994l2891J08607Q6363J35897M6470j62549o8839
$$ -65288 -100118 -106530 -32276 -22282 -55173 53434 139797 275694 322164 159615 90776
21409I0776q6111K0442p877l5091O5961J36952O2957N5698O6361L0950j85244
$$ 90776 4665 25107 17230 -17861 48100 185052 248009 303707 370068 401018 215774
21398B15774j74839J18277P2300j3357j31666M5335J33077j275q2240Q8105p9153
$$ 215774 40935 159212 231512 218155 86489 131824 264901 263626 181386 269491 190338
21387A90338k2439O8585o4372j6491n3795P6179o2487l6096J92164k8806n2004
$$ 190338 167899 236484 172112 155621 101826 178005 115518 79422 271586 242780 190776
21376A90776J04337j18518j57370j00107k7005L4235o8188P8807J65080q6687
$$ 190776 295113 176595 19225 -80882 -107887 -73652 -141840 -63033 102047 15360
21366A5360r0521P2252r8742m1325J4386J15314J16787n9069r0496l2018Q3258
$$ 15360 -75161 -2909 -101651 -142976 -128590 -13276 103511 44442 -46054 -78072 5186
21355E186r9989p8489K10179J69034O9837j20914k89238k0433J29442M5212O7069
$$ 5186 -94803 -173292 36887 205921 275758 154844 -134394 -154827 -25385 19827 86896
21344H6896J5516j49028q5007K5167L1272O6599p782m6048q5805R9566K14368
$$ 86896 102412 -46616 -131623 -106456 -75184 -8585 -16367 -62415 -148220 -48654 165714
21333A65714q9478j3948O7174l2286J0471N6347J2731j2929q2316m1944k1482
$$ 165714 76236 62288 129462 97176 107647 163994 176725 163796 81480 39536 18054
21322A8054R1265j6466j74919k8661J46053J38410n1102m1509k5780P94J54268
$$ 18054 109319 92853 -82066 -110727 35326 173736 122634 81125 55345 56139 210407
21311B10407J30154q8286j16799j40546n4534j16042j6264j09645J3461J08703
$$ 210407 340561 252275 135476 -5070 -59604 -175646 -191910 -301555 -288094 -179391
21301a79391O3287J42921M54r9148m6969j25068o045J0967L6084j2141J06597
$$ -179391 -116104 26817 27271 -71877 -118846 -243914 -249959 -238992 -202908 -215049 -108452
21290a08452P9834R2627R5033R0002m4648q5799J19230k4208k58492j28110l4666
$$ -108452 -28618 64009 159042 249044 204396 118597 237827 213619 -44873 -172983 -207649
21279b07649P4270N2840n4093q2999r7994K5838L2984J42234J23543l4040J06130
$$ -207649 -133379 -80539 -134632 -217631 -315625 -289787 -256803 -114569 8974 -25066 81064
21268H1064P0598j43006k26752N0539J54369Q1012k9405P226l225N4813j5795
$$ 81064 151662 8656 -218096 -167557 -13188 67824 38419 45645 42420 97233 81438
21257H1438k763j38998m0125l4358j14694O3242K14261M5046n1798L2759k1228
$$ 81438 78675 -60323 -100448 -134806 -249500 -186258 28003 73049 21251 54010 32782
21246C2782O2335O1090r9705j70441J162L1479K03110K38830o5287j28188j05797
$$ 32782 95117 156207 56502 -113939 -112777 -81298 121812 360642 295355 167167 61370
21235F1370K8465M7189M2633J10272j17466j29481j07613k7533j503J29795J41531
$$ 61370 89835 137024 179657 289929 172463 42982 -64631 -92164 -93667 36128 177659
21224A77659Q137Q39J75316J4390k00292n0401k8831j8824N7550k3032j28089
$$ 177659 185796 186635 361951 376341 176049 125648 96817 77993 135543 112511 -15578
21213a5578P0842k8872l4849N4591J80958J65785j087m8145n5394k9052m1206
$$ -15578 55264 26392 -8457 46134 227092 392877 391790 343645 288251 259199 217993
21202B17993j67933j20861J38478k083K0199Q4009O9723l1866P2850r6548q9780
$$ 217993 50060 -70801 67677 65594 85793 169802 239525 207659 280509 183961 94181
21191I4181j59484r055K50425j58043k0012p162q5453L8852r9459j4829L5110
$$ 94181 -65303 -74358 176067 18024 -1988 -9150 -94603 -55751 -155210 -170039 -134929
21180a34929K9518p7257J06161J66211O5542j17160j2938N6471O480m6333J6166
$$ -134929 -105411 -182668 -76507 89704 155246 38086 25148 81619 88099 41766 57932
21169E7932l1347j17192l5942R3206J48554N2235l8373R004J0317K5624j47341
$$ 57932 26585 -90607 -126549 -33343 115211 167446 129073 138077 148394 174018 26677
21158B6677n5709N5977O6449j4211j91213k24794J03465J13002J963Q5682m9794
$$ 26677 -29032 26945 93394 79183 -112030 -336824 -233359 -120357 -118394 -32712 -82506
21147h2506k23877k7312L1839n9238K48785M1328L8674J05439L7278j8296J23404
$$ -82506 -306383 -333695 -301856 -361094 -112309 -70981 -32307 73132 110410 92114 215518
21136B15518M5511L6190R1513j60395o2982l962J05366j53052j28455l478J21177
$$ 215518 261029 297219 388732 228337 165355 161393 266759 113707 -14748 -18226 102951
21125A02951J17007M4003K0349Q7530L0486L2176j45102j3748P0202m0661j90193
$$ 102951 219958 263961 284310 371840 402326 434502 289400 275652 345854 305193 115000
21114A15000k39988k27136m0605M7198J93080L28471l8212j02366J4054P0955
$$ 115000 -124988 -352124 -392729 -345531 -152451 176020 137808 35442 49496 120451
21104A20451j37919q5205J4505P9899r7550o2988J01702q9570q0402N7901N5842
$$ 120451 -17468 -102673 -88168 -8269 -105819 -168807 -67105 -156675 -237077 -179176 -123334
21093a23334j19729K9181p1592J20147O2557J26969O4260j5387r6076j93N1412
$$ -123334 -243063 -213882 -285474 -165327 -102770 24199 88459 73072 -23004 -23197 28215
21082B8215k3559P8075m4438q9251M0416P6669p0318j06482m5653J42036J67084
$$ 28215 4656 82731 38293 -50958 -10542 66127 -4191 -110673 -156326 -14290 152794
21071A52794O9736l6413m1040j46574N7262J65246L593r2722j69335o1487j55364
$$ 152794 222530 186117 145077 -1497 55765 221011 224604 131882 -37453 -98940 -254304
21060b54304P6439J70646M5237J55993J56805k15400n2999O5341r0606j3340m0883
$$ -254304 -177865 -7219 38018 194011 350816 135416 82417 147758 57152 43812 2929
21049B929M4654l7571j27199q3178J404K30790j3197k7935Q8972j37913p3680
$$ 2929 47583 10012 -117187 -200365 -198961 31829 18632 -9303 79669 -58244 -131924
21038a31924o8616j67767q3615J95903j7285J15238Q1284j19465j31208j40118
$$ -131924 -200540 -368307 -451922 -256019 -273304 -158066 -76782 -196247 -327455 -467573
21028d67573K23261J07124j4975M0172J5387j56019p2332N6104k2233j21662M4793
$$ -467573 -244312 -137188 -152163 -111991 -96604 -252623 -324955 -268851 -291084 -412746 -367953
21017c67953K62295J42150n0239l4313n4175L6834K1990J31209P3966o5339k36834
$$ -367953 -105658 36492 -13747 -48060 -102235 -65401 -43411 87798 161764 96425 -140409
21006a40409j2173L560L3150K2106J2790M624j5898J4810n1814J23869K614r3619
$$ -140409 -152582 -149022 -115872 -93766 -80976 -76352 -92250 -77440 -129254 -5385 -2771 -96390
20994i6390l6941l2204J7005J6526J20200J06001N071o733P2964M2808J18835
$$ -96390 -133331 -165535 -148530 -132004 -11804 94197 99268 92535 165499 208307 327142
20983C27142M3390q1883l0640p5412o2552k20214l4824J7976J21291K9766k8105
$$ 327142 370532 288649 258009 182597 120045 -100169 -134993 -117017 4274 34040 5935
20972E935j27694j3562J3008k1488n5876Q3494k2576j9734M0299J03883J5397
$$ 5935 -121759 -135321 -122313 -143801 -199677 -116183 -138759 -158493 -118194 -14311 1086
20961A086m0953J0207j876q5711p5859J20933K48520q0286L9974M2521k15001
$$ 1086 -39867 -29660 -31536 -117247 -193106 -72173 176347 96061 136035 178556 -36445
20950c6445j2509K36968j9193J7672m2992p9790k11416N0014j1148m2718j7923
$$ -36445 -48954 188014 168821 186493 143501 63711 -147705 -97691 -108839 -151557 -169480
20939a69480M4966O7436N816J58036m2492j65093l0300J36081K2576p6556J8548
$$ -169480 -124514 -57078 -51262 106774 64282 -100811 -131111 4970 27546 -49010 -30462
20928c0462M1379J45827R7191k5370k4491j00186j19365L3280M6263j06563p7864
$$ -30462 10917 156744 253935 228565 204074 103888 -15477 17803 64066 -42497 -120361
20917a20361M7367o7925q8686L7057k8367l4604j3002N2867Q5729L8456j9449
$$ -120361 -72994 -140919 -229605 -192548 -220915 -255519 -268521 -215654 -129925 -91469 -110918
20906a10918M520J61608j05090q9130p830M3539Q2692J28444J4957K4353n5614
$$ -110918 -106398 55210 -49880 -139010 -146840 -103301 -20609 107835 122792 147145 91531
20895I1531j99634J6836N9308N726o5782J0839R6652L4640J4383K8702J78471
$$ 91531 -108103 -91267 -31959 -26233 -92015 -81176 15476 50116 64499 93201 271672
20884B71672j02696l1295j36988n2983J4628J6658J09092n1794n4916K06576K8892
$$ 271672 168976 137681 693 -52290 -37662 -21004 88088 36294 -18622 187954 216846
20873B16846k28548j03027J26463P0037k6118l4821o0778M701j46010l4387P4716
$$ 216846 -11702 -114729 11734 81771 55653 20832 -39946 -35245 -181255 -215642 -140926
20862a40926L4662O7582K1481J20228p57j14240j78443Q3712J59541m2245j54440
$$ -140926 -106264 -38682 -17201 103027 102270 -11970 -190413 -106701 52840 10595 -143845
20851a43845K1815J4904J00845J42955k2166j05659m9529k46970j38137K12097
$$ -143845 -122030 -107126 -6281 136674 114508 8849 -40680 -287650 -425787 -213690
20841b13690J34542J31350J96817J06490l2389k10130l3061m2261j32711N2208
$$ -213690 -79148 52202 249019 355509 323120 112990 79929 37668 -95043 -42835
20831d2835J58042J38496j9891j32440j00193j8580j11625j99218q1413J35409
$$ -42835 115207 253703 233812 101372 1179 -17401 -129026 -328244 -409657 -274248
20821b74248J69959O6822P0982L780M1080j18035Q295M7414J48622N4621M3756
$$ -274248 -104289 -37467 33515 37295 78375 -39660 -31365 16049 164671 219292 263048
20810B63048L2414L8312n0611r569q101j20990P271k7727P0278J33062p2264q0428
$$ 263048 295462 333774 283163 273594 265493 144503 151774 124047 194325 327387 255123 174695
20798A74695j1783j2448q5914k46846j87008L5510J58852L2829J7395J99159k4374
$$ 174695 162912 150464 64550 -182296 -369304 -333794 -174942 -142113 -124718 74441 50067
20787E0067j49000j00193N1193K36924O7798j73344j26500q9231J14805R0310
$$ 50067 -98933 -199126 -147933 88991 156789 -16555 -143055 -232286 -117481 -27171
20777b7171O1425J9642j00821k9650r7595p0984j14970R0735O6450l2924l9736
$$ -27171 34254 53896 -46925 -76575 -174170 -245154 -360124 -269389 -202939 -235863 -275599
20766b75599J6992Q9929J25238J76799Q9561p5377p6881q8493j78410r7120l1803
$$ -275599 -258607 -168678 -43440 133359 222920 147543 70662 -17831 -196241 -293361 -325164
20755c25164J66510K47529L7787p7991k085O8089j36212J7149P9182o7123k00900
$$ -325164 -158654 88875 126662 48671 46586 114675 -21537 -4388 74794 7671 -193229
20744a93229o2049K158J43313n5827j6379k2694N5250J22131J75774J0501j65233
$$ -193229 -255278 -253120 -109807 -165634 -182013 -204707 -149457 -27326 148448 158949 -6284
20733f284J95740J35728j98618j22818J12562j18401L5460P0410m679K1019N1777
$$ -6284 189456 325184 126566 3748 116310 -2091 33369 103779 99100 120119 171896
20722A71896J2740o8706j23915q0202k3955J5248L4501j03141J82922k4781J25996
$$ 171896 184636 115930 -7985 -88187 -112142 -96894 -62393 -165534 17388 -7393 118603
20711A18603J17558p3639r8617r4404J4282O749r3505O0625M2996Q1848P6512
$$ 118603 236161 162522 63905 -30499 -16217 -9468 -102973 -42348 648 82496 159008
20700A59008K8155m4933j56629j1039J65134k61928j16029J95430M5749J64611
$$ 159008 187163 142230 -14399 -25438 139696 -122232 -238261 -42831 2918 167529
20690A67529R3482m5384j29453j35055O9182o3655k8340J33294r9920j5633N8788
$$ 167529 261011 215627 86174 -48881 20301 -43354 -71694 61600 -38320 -53953 4835
20679D835j15001j5232K18534J68294n3942k30673J5048M794j30151K25969M2878
$$ 4835 -110166 -125398 93136 261430 207488 -23185 -8137 -3343 -133494 92475 135353
20668A35353r0829J61210J12422K9901l3918j26174K5779M4790j40177j36601
$$ 135353 44524 205734 318156 348057 314139 187965 213744 258534 118357 -18244
20658a8244J8749N3434O9924J44969k76641o2463J57147q0049l8241J94339Q106
$$ -18244 505 53939 123863 268832 -7809 -70272 86875 6826 -31415 162924 171030
20647A71030k18322j16920j11882P5306J17407N477Q4351Q6385M2369n1189L9206
$$ 171030 -47292 -164212 -276094 -200788 -83381 -77904 6447 92832 135201 84012 123218
20636A23218j5153j7490k315n449p5427k5489J38599R8648n5572q5658r5666j0329
$$ 123218 108065 90575 88260 82811 7384 -18105 120494 219142 163570 77912 -17754 -28083
20624b8083k05164J03263J94015N0138n4884k8302k3581l7494p2645O1978j611
$$ -28083 -233247 -129984 64031 114169 59285 30983 7402 -30092 -102737 -40759 -42370
20613d2370Q1407Q7584R239L4968j0353j21138J24368K2244K4008J52756k3603
$$ -42370 39037 126621 135860 170828 160475 39337 163705 185949 209957 362713 339110
20602C39110j03128o6995r5490J11368K2680j53489k4183N2154J49087J06643
$$ 339110 235982 168987 73497 184865 207545 54056 29873 82027 231114 337757
20592C37757j36806j46764k13234P401L6834O6598j00435M4710N3289J7502j12831
$$ 337757 200951 54187 -159047 -151646 -114812 -48214 -148649 -103939 -50650 -33148 -145979
20581a45979O4465J29291J13936M7766r5470m5965Q7139p7576j04965j5864K2899
$$ -145979 -81514 47777 161713 209479 114009 68044 155183 77607 -27358 -43222 -20323
20570b0323K41463J95351n2990K0407j87516P9280q8750j26489l7494j59396n0556
$$ -20323 221140 416491 363501 383908 196392 275672 186922 60433 22939 -136457 -187013
20559a87013N2414J64280k4283l729K1730j06747j7852j1535P6774K16483l4490
$$ -187013 -134599 29681 5398 1669 23399 -83348 -101200 -112735 -35961 180522 146032
20548A46032p7721j17628q1583j02107K83490J50773l1248j06030J24379o5509
$$ 146032 68311 -49317 -130900 -233007 50483 201256 170008 63978 188357 122848
20538A22848j03746p3415n797M9210P6382J03706l6371K942o6359L5623P6886
$$ 122848 19102 -54313 -60110 -10900 65482 169188 132817 135759 69400 105023 181909
20527A81909J0457j61140k5172N2259p4509m7947K1586P5591n7082K0395j02482
$$ 181909 192366 31226 6054 58313 -16196 -64143 -42557 33034 -24048 -3653 -106135
20516a06135p852K44764J19564j0278k20424j35654o8662P6598J12597M6996M4885
$$ -106135 -113987 130777 250341 240063 19639 -116015 -184677 -108079 4518 51514 96399
20505I6399P7695O9350O8920j49140m0183J06543m4580N1304k27869n7730L9575
$$ 96399 174094 243444 312364 163224 123041 229584 185004 236308 8439 -49291 -9716
20494i716r1386L8219J18241M150j45705J3871J84152n266r9183q1712K3119r0075
$$ -9716 -101102 -62883 55358 59508 -86197 -72326 111826 106560 7377 -74335 -51216 -141291
20482a41291j01751p1130M9520J46255J203n1036Q1131J48374M3988j46376p7447
$$ -141291 -243042 -314172 -264652 -118397 -117194 -168230 -87099 61275 105263 -41113 -118560
20471a18560r0733J69875M996O5816R7907R3302o284j01027J01032p9155k6238
$$ -118560 -209293 -39418 -34422 31394 129301 222603 216319 115292 216324 137169 110931
20460A10931M3222r2339J33785P7697K7051Q0795j68361j07743Q5975m0415o0285
$$ 110931 154153 61814 195599 273296 300347 381142 212781 105038 191013 150598 90313
20449I0313O8060r7137n5642J44604R5656j27846j35359J02215Q8341k2498J40597
$$ 90313 158373 61236 5594 150198 245854 118008 -17351 84864 173205 150707 291304
20438B91304J0285p5633L1528o7012J78844N6775j09823n2341M766j1287O6756
$$ 291304 301589 225956 257484 190472 369316 426091 316268 263927 268693 257406 324162
20427C24162K3219Q1529j16998m4545J60727j43962k04031R43m4303j8447J25669
$$ 324162 347381 428910 311912 267367 428094 284132 80101 81044 36741 18294 143963
20416A43963J14987k9401M4049L021J91993K32799j44034j68436J07958J8914
$$ 143963 258950 229549 273598 276619 468612 701411 557377 388941 496899 515813
20406E15813j18386j52690l0836p4802m495J30426o1436q5561R3731O8338O4386
$$ 515813 397427 244737 213901 139099 134604 265030 203594 118033 211764 280102 344488
20395C44488P735n6545q0003J11799j545K0786K1094r0711o9574L8023J7959j10075
$$ 344488 352223 295678 215675 327474 325929 346715 367809 277098 207524 245547 263506 153431
20383A53431J16062r2541j55382M4293M694M4120Q1234m9664j35904K7212J06868
$$ 153431 269493 176952 21570 65863 70557 114677 195911 146247 10343 37555 144423
20372A44423N0166p2627P8379J37945p0698n7050J05264j69905p4802J02097k0184
$$ 144423 194589 121962 200341 338286 267588 210538 315802 145897 71095 173192 153008
20361A53008j461M9105k736n174N0301R6145R5362J02897l3485j20655o089P1957
$$ 153008 151547 200652 197916 192742 243043 339188 434550 537447 503962 383307 377218 449175
20349D49175q9727k0330n2768m1200L7033r0486K7056j49405o6351J41218P5253
$$ 449175 359448 339118 286350 245150 282183 191697 218753 69348 2997 144215 219468
20338B19468j01147R68r0153J91775K06773M3073L2124r2202j0459J74403m3135
$$ 219468 118321 119289 29136 220911 427684 470757 502881 410679 400220 574623 531488
20327E31488R1158R2266M6228J4741j7415N8741O6598K54324L05910K45490J46295
$$ 531488 622646 714912 761140 775881 758466 817207 883805 1138129 1444039 1689529 1835824
20316A835824Q0793J3029m9115K42285J50236K05593J30711P7859P5369J54619
$$ 1835824 1916617 1929646 1880531 2122816 2273052 2478645 2609356 2687215 2762584 2917203
20306B917203Q2877J11369R3939j99866j8197j48594p4141Q4294j39075j39622
$$ 2917203 3000080 3111449 3205388 3005522 2987325 2838731 2764590 2848884 2709809 2570187
20296B570187k76398j85834M5563n4428j61187k10479k18134j78045k2442r1776
$$ 2570187 2293789 2107955 2153518 2099090 1937903 1727424 1509290 1331245 1308803 1217027
20286A217027j91601l69963j22088J0432R5027L9452j53282j05786K40620J81978
$$ 1217027 1025426 655463 533375 543807 638834 678286 525004 419218 659838 841816
20276H41816O542q8212j53830j16277L9424k2132R6624K47530j26291p2800L9698
$$ 841816 848358 760146 606316 490039 529463 507331 603955 851485 725194 652394 692092
20265F92092K7717l4342K25425L1845L8619J37196J57493J31117r0937M0193J54142
$$ 692092 719809 685467 910892 942737 981356 1118552 1276045 1407162 1316225 1356418 1510560
20254A510560M3555r8507M4516K33384p6238p4531j4787O4753R2683J1582K5928
$$ 1510560 1554115 1455608 1500124 1733508 1657270 1582739 1567952 1632705 1725388 1736970 1762898
20243A762898l927o6557q5036j05942m8555l8465M1397j7051j83527k18591r2036
$$ 1762898 1758971 1692414 1607378 1501436 1452881 1414416 1455813 1438762 1255235 1036644 944608
20232I44608q6581j84054K2503L9151J3832j32356j09900Q3185o1222O6426J04460
$$ 944608 858027 673973 696476 735627 749459 617103 507203 590388 529166 595592 700052
20221G00052p8522j45J33957L5476R7042J34008p7082k84291k7541J36619K38811
$$ 700052 621530 621385 755342 790818 887860 1021868 944786 660495 632954 769573 1008384
20210A008384K25249J92255K13704J55269j35184j0185J06803J36354M2892J51347
$$ 1008384 1233633 1425888 1639592 1794861 1659677 1649492 1756295 1892649 1935541 2086888
20200B086888j0417l16782q4061R869k0474J46799O940p8963k2544q6469j5192
$$ 2086888 2076471 1759689 1675628 1685497 1665023 1811822 1818762 1739799 1717255 1630786 1615594
20189A615594q5988m5983Q1894j78200o1346L509k23837n6771k58480k12127j17955
$$ 1615594 1529606 1483623 1565517 1387317 1325971 1329480 1105643 1048872 790392 578265 460310
20178D60310L9314l8686p4859J08290K08123p4065J8264m4047L0209N373j14413
$$ 460310 499624 460938 386079 494369 702492 628427 646691 602644 632853 638226 523813
20167E23813o3682j24456k2213m9362p2649O5356J60069L3580J6504R16k06189
$$ 523813 460131 335675 313462 264100 191451 256807 416876 450456 466960 467876 261687
20156B61687O1257k4381J9822J84l7100n9532j572N7421J05082J51611q8367j28936
$$ 261687 322944 298563 318385 318569 281469 221937 220365 277786 382868 534479 446112 317176
20144C17176L0972R2488K6989j09527j97409k3186J54216Q158J1424j1127j29706
$$ 317176 348148 440636 467625 358098 160689 137503 291719 299877 311301 300174 170468
20133A70468J9091j0679j8751M1453j4928J49408J96907r1638k8517j6229j03490
$$ 170468 189559 178880 160129 201582 186654 336062 532969 441331 412814 396585 293095
20122B93095j32233j8118K11164M5711k2249k7694k54871l2175J08983K4810J33457
$$ 293095 160862 142744 353908 399619 377370 349676 94805 62630 171613 196423 329880
20111C29880J23583j42761k5979J00465R2913N4810K5058P4188l0250j05783r7196
$$ 329880 453463 310702 284723 385188 478101 532911 557969 632157 601907 496124 398928
20100C98928j14697o5667j46953q789J9397O700j6135k4566J60915R4059P0529
$$ 398928 284231 218564 71611 62822 82219 88919 72784 48218 209133 303192 373721
20089C73721o6731k8328O4112r8563o9892J4808k5392P2696J71037j34799q0466
$$ 373721 306990 278662 342774 244211 174319 189127 163735 236431 407468 272669 192203
20078A92203m8270J96092j11929j52807o1503O2892K66237J3715j47139Q9166
$$ 192203 143933 340025 228096 75289 13786 76678 342915 356630 209491 298657
20068B98657J73417K43978L1775k9611j93970n9437N7433j817q5750N2562j20269
$$ 298657 472074 716052 747827 718216 524246 464809 522242 520425 434675 487237 366968
20057C66968k9824J8005O7434R8490o4756o5889M1620o5666O1285k9150o6862
$$ 366968 337144 355149 422583 521073 456317 390428 432048 366382 427667 398517 331655
20046C31655j02596J14916J64028R1615j81134j85207k49734m8615R9587J37185
$$ 331655 229059 343975 508003 599618 418484 233277 -16457 -65072 34515 171700
20036A71700O5798o5029q9354j72754K24519K29681M2656p186L7552o4935j0418
$$ 171700 237498 172469 83115 -89639 134880 364561 407217 400031 437583 372648 362230
20025C62230R2620J05726J70750j19201J7808n8364j94149p9851O7124J78430
$$ 362230 454850 560576 731326 612125 629933 571569 377420 297569 364693 543123
20015E43123n049k48222M0383Q9100l8258l9345K28853J38870j14371j9752K5439
$$ 543123 538074 289852 330235 419335 381077 341732 570585 709455 595084 575332 600771
20004F00771j15640J89686j41813m2019N4107o5965j15432q22J00959q1165o0455
$$ 600771 485131 674817 533004 490985 545092 479127 363695 362873 463832 382667 322212
19993C22212J01539J92872m8157R9685K0124J51587J22128J12488n0398k64409
$$ 322212 423751 616623 568466 668151 688275 839862 961990 1074478 1024080 759671
19983G59671j04571R2786J3304L7009O3272P4008O257O0147Q698l782M3752k58476
$$ 759671 655100 747886 761190 798199 861471 935479 941736 1001883 1010581 1006799 1050551 792075
19971G92075j26359L1428R9818J43833Q0097q1610M3461K0232m5173k7748m3817
$$ 792075 665716 697144 796962 940795 1020892 939282 982743 1002975 957802 930054 886237
19960H86237k1328K3863j7729p5587O3571K29814r0688k1624l6506m5600M8879
$$ 886237 864909 888772 871043 795456 859027 1088841 998153 976529 940023 894423 943302
19949I43302j57712M3550j566j96408M6122J90797J31213M1661m868M9964L2280
$$ 943302 785590 829140 827574 631166 677288 868085 999298 1040959 1036091 1086055 1118335
19938A118335n2872R2386M7595k35690R710R5491j10414j41064J08000J61286
$$ 1118335 1065463 1157849 1205444 969754 979464 1074955 964541 823477 931477 1092763
19928A092763J19662J34415M4452o5020J84616R5977j15157L386q5457n1311m2366
$$ 1092763 1212425 1346840 1391292 1326272 1510888 1606865 1491708 1495094 1409637 1358326 1315960
19917A315960k8872L4174P1258L125M509J26975J57032L1649q1477P0708K7800
$$ 1315960 1287088 1321262 1392520 1395645 1400154 1527129 1684161 1715810 1634333 1705041 1732841
19906A732841j15220j64360k1766J61285N9857j4660j43505j7338r3593j06000
$$ 1732841 1617621 1453261 1431495 1592780 1652637 1637977 1494472 1477134 1383541 1277541
19896A277541J37948L4920K2301P6446P584j1913o7070J95337P2368P9034j60614
$$ 1277541 1415489 1450409 1472710 1549156 1556740 1544827 1477757 1673094 1745462 1824496 1663882
19885A663882j9036J0657j11939Q4298M7730k2380J287p1520o0917J31365J36121
$$ 1663882 1644846 1655503 1543564 1627862 1675592 1653212 1654499 1582979 1522062 1653427 1789548
19874A789548Q0605K39442J04692j37009J88626J95562J66607j9265r06K27373
$$ 1789548 1870153 2109595 2214287 2077278 2265904 2461466 2628073 2608808 2607902 2835275
19864B835275J81556K3352k6812R8719K50647J50302J49596Q4943k04664K1201
$$ 2835275 3016831 3040183 3013371 3112090 3362737 3513039 3662635 3747578 3542914 3564115
19854C564115j4352o5437J48691K67637j37414j68659l4339j94386k55552j35495
$$ 3564115 3549763 3484326 3633017 3900654 3763240 3594581 3560242 3365856 3110304 2974809
19844B974809j757M65M5819m3909j2596j33361p7860N1258J36485O8155N1783
$$ 2974809 2973052 2973517 3019336 2975427 2962831 2829470 2751610 2802868 2939353 3007508 3059291
19833C059291j4123n8001O190P8401J11305J13633Q8437J78273J45316P8627J63864
$$ 3059291 3045168 2987167 2993357 3071758 3183063 3296696 3385133 3563406 3708722 3787349 3951213
19822C951213L84727J22040O8653K23852L09648K30922K30797L85119L24361M20429
$$ 3951213 4335940 4457980 4526633 4750485 5060133 5291055 5521852 5906971 6231332 6651761
19812F651761M42933N79744M77893K48151M41338N23365O23016P27246P88498
$$ 6651761 7094694 7674438 8152331 8400482 8841820 9365185 9988201 10715447 11503945
19803A1503945R18703R62557R85527J098575J339355J415320J809306K323593
$$ 11503945 12422648 13385205 14370732 15469307 16808662 18223982 20033288 22356881
19795B2356881L061082M329097N556307P208709R094248J1659668J4870376J7364865
$$ 22356881 25417963 29747060 35303367 42512076 51606324 63265992 78136368 95501233
19787I5501233J7944876J8814229K2016036K3798467K2270951J8300803J8321356
$$ 95501233 113446109 132260338 154276374 178074841 200345792 218646595 236967951
19780B36967951K2270370K3604563K0192788J9498228K4398258K8065940K8099621
$$ 236967951 259238321 282842884 303035672 322533900 346932158 374998098 403097719
19773D03097719K6735235K7938667K3972797J6781675J1316591J0566763M927591
$$ 403097719 429832954 457771621 481744418 498526093 509842684 520409447 525337038
19766E25337038n676526j2884242j2413203j1470381j3141269j4016642j3531001
$$ 525337038 519660512 506776270 494363067 482892686 469751417 455734775 442203774
19759D42203774j4397148j8881706j5964130j3354179j8100676k8856675l1215440
$$ 442203774 427806626 408924920 392960790 379606611 361505935 332649260 301433820
19752C01433820k5384968k2887047k7188446k9369847k4016058j8291814j5243941
$$ 301433820 276048852 253161805 225973359 196603512 172587454 154295640 139051699
19745A39051699j3892959j1299603q212294o058172m965663m098342l287311k393804
$$ 139051699 125158740 113859137 105646843 99588671 94623008 90524666 87237355 84843551
19737H4843551j820382r47472K4975J401465L215638O008241Q742423J2014240
$$ 84843551 83023169 82075697 82100672 83502137 86717775 92726016 101468439 113482679
19729A13482679J6444794J9778505K1121454K2464051K2423227K0206743J7648759
$$ 113482679 129927473 149705978 170827432 193291483 215714710 235921453 253570212
19722B53570212J2762946J0673819J0454698O441718M215551N249158M530463
$$ 253570212 266333158 277006977 287461675 293903393 298118944 303368102 307898565
19715C07898565j569699n731400m474627q437973j3482611j2363088j1514969
$$ 307898565 306328866 300597466 296122839 287684866 274202255 261839167 250324198
19708B50324198r984418r032252r696915q557958q369135j0618025j4397009j4755002
$$ 250324198 240339780 231307528 221610613 213052655 204683520 194065495 179668486 164913484
19700A64913484j4079728j6473523j5675143j2293362j0492828q442466o113895
$$ 164913484 150833756 134360233 118685090 106391728 95898900 87456434 81342539
19693H1342539m541441l265658k414685j840855j338959j153250n20441O6895
$$ 81342539 76801098 73535440 71120755 69279900 67940941 66787691 66267250 66334145
19685F6334145O41391J993497L531312N705818Q661347J2014328J5994579K0410555
$$ 66334145 66975536 68969033 72500345 78206163 86867510 98881838 114876417 135286972
19677A35286972K2677040K3969714K5228562K3290353K0760231J6709573J2256631
$$ 135286972 157964012 181933726 207162288 230452641 251212872 267922445 280179076
19670B80179076J2330214J0482144O509304P089622Q393095N336911j115283j515134
$$ 280179076 292509290 302991434 309500738 316590360 324983455 330320366 329205083 327689949
19662C27689949k376379r305036j0612937j0376448j0114825q446930r454040
$$ 327689949 325313570 316008534 305395597 295019149 284904324 276457394 267003354
19655B67003354r987456r657507j1200088j6400880j9424493j8545434k0551587
$$ 267003354 257015898 247358391 236158303 219757423 200332930 181787496 161235909
19648A61235909k2166861j8274140j4880059j2694885r694840o675657n066236
$$ 161235909 139069048 120794908 105914849 93219964 83525124 76849467 71783231
19641G1783231m140493l452268l022786k679744k412980k156371k115219j958009
$$ 71783231 67642738 64190470 61167684 58487940 56074960 53918589 51803370 49845361
19633D9845361j667001j567872j599224j383285j250272j210326j252969j053145
$$ 49845361 48178360 46610488 45011264 43627979 42377707 41167381 39914412 38861267
19625C8861267j084188p85332p15646p09621p79738p67088j001552q87042q16140
$$ 38861267 37777079 36991747 36276101 35566480 34786742 34019654 33018102 32131060 31314920
19616C1314920r73381q26952p18942p01687o12036o99111q12587q29570o87862
$$ 31314920 30341539 29514587 28795645 28093958 27481922 26782811 25970224 25140654 24452792
19607B4452792n77727o19688n97939m50121n09587p89505n67877o97449m90358
$$ 24452792 23875065 23255377 22657438 22207317 21697730 20908225 20340348 19642899 19152541
19598A9152541m61661n59746n10967l59134k93628l94776l04883k39570k92298
$$ 19152541 18690880 18131134 17620167 17261033 16967405 16572629 16267746 16028176 15735878
19589A5735878l09532k58338l73313k46286j62589p3851k17984k21126j18476
$$ 15735878 15426346 15168008 14794695 14548409 14385820 14311969 14093985 13872859 13754383
19580A3754383L6121k6137j74322n4909o7520j71565k34778k38404j88799k11430
$$ 13754383 13790504 13764367 13590045 13535136 13467616 13296051 13061273 12822869 12634070 12422640
19570A2422640k04269j70211M4762l8005j58551k90905j88496l61987l17407k30172
$$ 12422640 12218371 12048160 12092922 12054917 11896366 11605461 11416965 11054978 10737571 10507399
19560A0507399m42173l63559l19075l37180l06115k84122k75968l38034k34056
$$ 10507399 10065226 9701667 9382592 9045412 8739297 8455175 8179207 7841173 7607117
19551G607117j55641j57067j38176j62513j05380k20163r635q5637j52706N5503
$$ 7607117 7451476 7294409 7156233 6993720 6888340 6668177 6658542 6572905 6420199 6475702
19541F475702j17737k60485j09212P2717K22010K35046K9736J0498J37357K5415
$$ 6475702 6357965 6097480 5988268 6060985 6282995 6518041 6547777 6558275 6695632 6721047
19531F721047r6508J6330l1673r3834k04142k35120j06211j34627j88269k65328
$$ 6721047 6624539 6640869 6609196 6515362 6311220 6076100 5969889 5835262 5646993 5381665
19521E381665j12482l77284m45106j35546j17867j9563J9236k06961j14432j69115
$$ 5381665 5269183 4891899 4446793 4311247 4193380 4173817 4193053 3986092 3871660 3702545
19511C702545j10972n4396j65893o7004N6380J02085k75923j23235R623n2814
$$ 3702545 3591573 3537177 3371284 3304280 3360660 3462745 3186822 3063587 3073210 3020396
19501C020396k27669m4685J01595j6036R3331J37735K1104o3220O0819o6484o2526
$$ 3020396 2792727 2748042 2849637 2833601 2926932 3064667 3085771 3022551 3083370 3016886 2954360
19490B954360j07823j66064J55353J23442J64772K16898J78058Q7280N0633M1033
$$ 2954360 2846537 2680473 2835826 2959268 3124040 3340938 3518996 3606276 3656909 3697942
19480C697942N4112m1510m9788L4939n2073r7195j98356J2095p3396R590j43283
$$ 3697942 3752054 3710544 3660756 3695695 3643622 3546427 3348071 3360166 3286770 3296360 3153077
19469C153077j94362l10105j88956k8265J237j55447L2134k2190p9652R2345p688
$$ 3153077 2958715 2648610 2459654 2431389 2432626 2277179 2309313 2287123 2207471 2299816 2292128
19458B292128j28469m961J16646J58632j21178n7292P5260K2736R7084j21679
$$ 2292128 2163659 2158698 2275344 2433976 2312798 2255506 2330766 2353502 2450586 2328907
19448B328907j29760n0013n3563k03172N5508K12030k0713J15265J08894J50861
$$ 2328907 2199147 2149134 2095571 1892399 1947907 2159937 2139224 2254489 2363383 2514244
19438B514244J17850J29942j03605j90351j00151P4347o4311J27616J62044L993
$$ 2514244 2632094 2762036 2658431 2468080 2367929 2442276 2377965 2505581 2667625 2671618
19428B671618k3453O9245R7847l2719k616r7827j24253r0880j42253O3346N7022
$$ 2671618 2648165 2717410 2815257 2782538 2779922 2682095 2557842 2466962 2324709 2388055 2445077
19417B445077r1986j40526J47499j6604j87468j50325J10350J67034J18322O3702
$$ 2445077 2353091 2212565 2360064 2343460 2155992 2005667 2116017 2283051 2401373 2465075
19407B465075J74606p8356m3609K019j93917J20783J63865k78776j49772l7562
$$ 2465075 2639681 2561325 2517716 2519735 2325818 2446601 2610466 2331690 2181918 2144356
19397B144356J80119L3972J1862O8471J90575n2083L8578R3920L3115L349K7027
$$ 2144356 2324475 2358447 2370309 2438780 2629355 2577272 2615850 2709770 2742885 2746234 2773261
19386B773261m9042J64263J34670J19822J86414K14746K2493J20205M17380K66164
$$ 2773261 2724219 2888482 3023152 3142974 3329388 3544134 3566627 3686832 4104212 4370376
19376D370376J75414K16367J95218L37087M98057O13645P26278O31765M71091
$$ 4370376 4545790 4762157 4957375 5294462 5792519 6406164 7132442 7764207 8235298
19367H235298N45685P25984P24974Q99232J114817J525325J901602K319582L561970
$$ 8235298 8780983 9506967 10231941 11131173 12245990 13771315 15672917 17992499 21554469
19358B1554469M958537O193172P518707R803316J2374419J4299518J4496462J4440838
$$ 21554469 26513006 32706178 40224885 50028201 62402620 76702138 91198600 105639438
19350A05639438J6435587J7847644J7119607J3729460J2999093J4177263J3402429
$$ 105639438 122075025 139922669 157042276 170771736 183770829 197948092 211350521
19343B11350521J1396776R330296R020464M653215J768295K961839K312365l602507
$$ 211350521 222747297 232077593 241098057 245751272 247519567 250481406 252793771 249191264
19335B49191264r061774p122868o309034q908673j1976125j0760704j2216454
$$ 249191264 240129490 233006622 226697588 217788915 205812790 195052086 182835632
19328A82835632j5002183j3622436j1879338j2671383j5861013j4145579j0509904
$$ 182835632 167833449 154211013 142331675 129660292 113799279 99653700 89143796
19321H9143796q550372q135918o743412m963326l136702k056613j542370r33829
$$ 89143796 80593424 72457506 65714094 60750768 57614066 55557453 54015083 53081254
19313E3081254l07704L38467Q98479K064077L784065N972049P770598R735340
$$ 53081254 52773550 53112017 54010496 56074573 59858638 65830687 73601285 83336625
19305H3336625J2979905J6802354J9294836J9464999J9529758K2221290K3750398
$$ 83336625 96316530 113118884 132413720 151878719 171408477 193629767 217380165
19298B17380165K2262495J7068875J6509313J7959699J6773585J4030850J1318237
$$ 217380165 239642660 256711535 273220848 291180547 307954132 321984982 333303219
19291C33303219J0486491N001486K544060L975743K838564o507714j3158830j0286327
$$ 333303219 343789710 348791196 351335256 355310999 358149563 351641849 338483019 328196692
19283C28196692r429662j3704707j8353775j6351356j8316688k1391213j9638912
$$ 328196692 318767030 305062323 286708548 270357192 252040504 230649291 211010379
19276B11010379j7468229j8888034k2129608j9160251j4581257j2384771j1985583
$$ 211010379 193542150 174654116 152524508 133364257 118783000 106398229 94412646
19269I4412646j0259481p403589n393026m470535l680429l096998k669815k634342
$$ 94412646 84153165 76749576 71356550 66886015 63205586 60108588 57438773 54804431
19261E4804431k358571k103834k022301j993735j717232j533914j378440j336260
$$ 54804431 52445860 50342026 48319725 46325990 44608758 43074844 41696404 40360144
19253D0360144j494059j458039r83205r34656j020468r05977q50453r85898p18977
$$ 40360144 38866085 37408046 36424841 35490185 34469717 33563740 32713287 31727389 31008412
19244C1008412o65436o77798o09895o32629n94880n69509o49988l84333m97050
$$ 31008412 30342976 29665178 29055283 28422654 27827774 27258265 26608277 26223944 25726894
19235B5726894m34700l24176n98560m20665l28132l12681k42547k12123n20582
$$ 25726894 25292194 24968018 24369458 23948793 23620661 23307980 23065433 22853310 22332728
19226B2332728m52375l86134n24809m79373m13806n34001m78371l83019m88411
$$ 22332728 21880353 21494219 20969410 20490037 20076231 19542230 19063859 18680840 18192429
19217A8192429n37554n45974o73264m26577l86424l96553m56564m65325l48468
$$ 18192429 17654875 17108901 16435637 16009060 15622636 15226083 14769519 14304194 13955726
19208A3955726l66479l31481k81716m43092n06278k69023j40359j40026m44692
$$ 13955726 13589247 13257766 12976050 12532958 12026680 11757657 11617298 11477272 11032580
19199A1032580m11098l02197l19229j69612n6591k08224k92217k21595j65513
$$ 11032580 10621482 10319285 10000056 9830444 9773853 9565629 9273412 9051817 8886304
19190H886304J01999O5000j03277j57800j48027q9448J2581j12232j60100p5788
$$ 8886304 8988303 9053303 8950026 8792226 8644199 8554751 8567332 8455100 8295000 8219212
19180H219212K6442K04971L28985K72207J39737R4291N1935q2828J34671R7617
$$ 8219212 8245654 8450625 8779610 9051817 9191554 9285845 9337780 9254952 9389623 9487240
19170I487240k26311k80950k42155q9843j37876k42024l24623l89351l86968l36151
$$ 9487240 9260929 8979979 8737824 8647981 8510105 8268081 7943458 7554107 7167139 6830988
19160F830988k77165l23709l04429k13736o6574K2318j78392l67770j52680r7571
$$ 6830988 6553823 6230114 5925685 5711949 5645375 5667693 5489301 5121531 4968851 4871280
19150D871280j90833j251r5531j28028m28k2820m7233r107Q1035J1564J23209
$$ 4871280 4680447 4679196 4583665 4455637 4455209 4432389 4385156 4376049 4457084 4468648 4591857
19139D591857N0158K10115K94014O5895k7898L321J02421Q0289Q5447J52282J02719
$$ 4591857 4642015 4852130 5146144 5212039 5184141 5187462 5289883 5370172 5455619 5607901 5710620
19128E710620K25378M32362L54811J01679o2416j89302j0881P822J9515j0422
$$ 5710620 5935998 6368360 6723171 6824850 6762434 6573132 6562251 6570073 6589588 6579166
19118F579166j45660j01855L4138j05861k67050l35093k24188j52085k97559k78259
$$ 6579166 6433506 6331651 6365789 6259928 5992878 5657785 5433597 5281512 4983953 4705694
19108D705694j40627k06432j79509n2003j04422j40184K8171J16260J0038j42798
$$ 4705694 4565067 4358635 4179126 4127123 4022701 3882517 3910688 4026948 4036986 3894188
19098C894188k27701k882N0420q7734n0183R1330Q259q4811Q0325J44876Q2859
$$ 3894188 3666487 3663605 3714025 3626291 3576108 3667438 3675697 3590886 3671211 3816087 3898946
19087C898946J54715J55548J93950M79025M13564K90290K03842L63038M13292
$$ 3898946 4053661 4209209 4403159 4882184 5295748 5586038 5789880 6152918 6566210
19078F566210L53277K94330K92191L35218M43188K25351J11333K66872M45391
$$ 6566210 6919487 7213817 7506008 7841226 8284414 8509765 8621098 8887970 9333361
19069I333361M03017L27521N03540O59494R57986J436785J949706K795659L982825
$$ 9333361 9736378 10063899 10567439 11226933 12184919 13621704 15571410 18367069 22349894
19060B2349894N660439P480092R555782J1866091J5236541J9514968K2856218
$$ 22349894 28010333 35490425 45046207 56912298 72148839 91663807 114520025
19053A14520025K3265458K2346192K4853767K6973942K4134061J5044479N998080
$$ 114520025 137785483 160131675 184985442 211959384 236093445 251137924 257136004
19046B57136004O148686N913886l676718j7107817k2201859j8770097j6393463
$$ 257136004 263284690 269198576 265521858 248414041 226212182 207442085 191048622
19039A91048622k1581143k6546010k2615219j6614193j3019535j2250108j1059631
$$ 191048622 169467479 142921469 120306250 103692057 90672522 78422414 67362783
19032F7362783q143340n560311l711897k722227k007027j871406j357152q83205
$$ 67362783 59219443 53659132 49947235 47225008 45217981 43346575 41989423 41106218
19024D1106218p58847o83935p43177o67110l27212j79946k42411q4553K85630
$$ 41106218 40347371 39663436 38920259 38253149 37925937 37745991 37503580 37419027 37704657
19015C7704657P34934J224330J940700K997406M643144P411917J0705680J3727828
$$ 37704657 38439591 39663921 41604621 44602027 49245171 56657088 67362768 81090596
19007H1090596J7238647K2156938K8577552L4048362L5871798L4467158L7256497
$$ 81090596 98329243 120486181 149063733 183112095 218983893 253451051 290707548
19000B90707548M1573566L8595721K6071492J1658761Q968425R810791k039798
$$ 290707548 332281114 370876835 396948327 408607088 417575513 427386304 425346506
18993D25346506k3205849l4242446l1012265k6442314l2062117m1022170l7851229
$$ 425346506 402140657 367898211 336885946 310443632 278381515 237359345 199508116
18986A99508116k8878686k2353437k0069033j8420612j4456455j0185636p158494
$$ 199508116 170629430 148275993 128206960 109786348 95329893 85144257 77985763
18979G7985763n431619m365954l710537l010789k347293k040593j996981j800196
$$ 77985763 72554144 68188190 64477653 61466864 59119571 57078978 55081997 53281801
18971E3281801j363281j123073j193140j343444j246912j004016o97098m75265
$$ 53281801 51918520 50795447 49602307 48258863 47011951 46007935 45310837 44835572
18963D4835572m44493N203R57200J900322L130417M466777O026732P952171J0602592
$$ 44835572 44391079 44396282 45353482 47253804 50384221 54850998 60877730 68829901 79432493
18954G9432493J3206817J3907821J3219482J4386588J6567460J5638449J0945644
$$ 79432493 92639310 106547131 119766613 134153201 150720661 166359110 177304754
18947A77304754M604802K882010L948985N8787q826336j4276046j3524070j1166863
$$ 177304754 181909556 184791566 188740551 188799338 179973002 165696956 152172886 141006023
18939A41006023j2600839j6973313j6294030j2598985r748532q323695q032400
$$ 141006023 128405184 111431871 95137841 82538856 72790324 64466629 56434229
18932E6434229o912838n000798l277358k583731j947759j574451j423465j261867
$$ 56434229 49521391 44520593 41243235 38659504 36711745 35137294 33713829 32451962
18924C2451962j343615j041461j025089r14400o63624o17876q71112j056773p82188
$$ 32451962 31108347 30066886 29041797 28127397 27463773 26845897 25974785 24918012 24135824
18915B4135824o43911r10715r98613p68097o47039n50588n60873n89014m74893
$$ 24135824 23491913 22581198 21582585 20814488 20167449 19616861 19055988 18466974 17992081
18906A7992081n72206p07310m64295l77140n17709m11637k78198k59546k76461
$$ 17992081 17419875 16712565 16248270 15871130 15353421 14941784 14663586 14404040 14127579
18897A4127579k58036k33899l34757k44736k23758k87809m60732j90018l27709
$$ 14127579 13869543 13635644 13300887 13056151 12832393 12544584 12083852 11893834 11566125
18888A1566125l00203k91900m00865k33651l19382l65112k12631o9211j60491
$$ 11566125 11265922 10974022 10573157 10339506 10020124 9655012 9442381 9373170 9212679
18879I212679k66795j37655p5063j85638j10677j07881k24287l14815k16370k87977
$$ 9212679 8945884 8808229 8733166 8547528 8436851 8328970 8104683 7789868 7573498 7285521
18869G285521j95753j30217j67534k75815j6456j36488j5402K8998k59511k82518
$$ 7285521 7089768 6959551 6792017 6516202 6499746 6363258 6347856 6376854 6117343 5834825
18859E834825k30147j90386j10196r7762j54389k37073k16135k3419N783k74452
$$ 5834825 5604678 5414292 5304096 5206334 5051945 4814872 4598737 4575318 4581101 4306649
18849D306649r3853j44892l3701j9775j12543k58912k06104J6452m8464k49296
$$ 4306649 4212796 4067904 4034203 4014428 3901885 3642973 3436869 3453321 3404857 3155561
18839C155561j90079O9395J79926R2237m1406k39746j08547k18226j8937P2434
$$ 3155561 2965482 3034877 3214803 3307040 3265634 3025888 2917341 2699115 2680178 2752612
18829B752612r9967r0458j53053L0275J41476M8663R484J7621O4315J15786k0845
$$ 2752612 2652645 2562187 2409134 2439409 2580885 2629548 2639032 2656653 2720968 2836754 2815909
18818B815909J07703J85296N4038O7338R5958J36932M6255k9166P0182j01802
$$ 2815909 2923612 3108908 3162946 3230284 3326242 3463174 3509429 3480263 3550445 3448643
18808C448643K9115J23930m7103r7349j07226m3303o0414k0476l119j41128N2099
$$ 3448643 3477758 3601688 3554585 3457236 3350010 3306707 3246293 3225817 3222698 3081570 3133669
18797C133669k3497p4735k26991j76489n6280k9681p5019l17168q4773l6754j65616
$$ 3133669 3110172 3035437 2808446 2631957 2575677 2545996 2470977 2153809 2069036 2032282 1866666
18786A866666l23491l6090K75109J61814K8921q7004j33100j66683Q4J8549J24684
$$ 1866666 1543175 1507085 1782194 1944008 1972929 1885925 1752825 1586142 1586226 1604775 1729459
18775A729459J01187J64696K34906K54148R504K86393J96182k1186J32057j6925
$$ 1729459 1830646 1995342 2230248 2484396 2493900 2780293 2976475 2955289 3087346 3070421
18765C070421k39275j69998Q4631Q0032j70464q1521J7800O7019N7744J05572
$$ 3070421 2831146 2661148 2745779 2825811 2655347 2573826 2591626 2658645 2716389 2821961
18755B821961J31244k1593k35148p4207J0158k35377n8729n6571r8655K3843r8717
$$ 2821961 2953205 2931612 2696464 2622257 2632415 2397038 2338309 2281738 2183083 2206926 2108209
18744B108209l75666j94429j4868j29636q4249n4247N5657M8221q1410m9570j32479
$$ 2108209 1732543 1538114 1523246 1393610 1309361 1255114 1310771 1358992 1277582 1228012 1095533
18733A095533n6294o6007n9119P6496Q4010j96651j82134R8147K43203J75661
$$ 1095533 1039239 973232 914113 990609 1074619 877968 695834 793981 1037184 1212845
18723A212845m3124L4082m0770j4160L3554j39822m2670M1352j18855R2035j27974
$$ 1212845 1169721 1203803 1163033 1148873 1182427 1042605 999935 1041287 922432 1014467 886493
18712H86493p7932j1975J0731M7959k3908K1373P5186o8264l0835P5471j3607
$$ 886493 808561 796586 807317 855276 831368 852741 927927 859663 828828 904299 890692
18701H90692l8628j00614K3217l676m0044p2898O4565j01663M9171O1922L9257
$$ 890692 852064 751450 774667 770991 730947 658049 722614 620951 670122 732044 771301
18690G71301N4929P4298K85691N9531Q2995J18561L7440L7826M4237j9927R2740
$$ 771301 826230 900528 1186219 1245750 1328745 1447306 1484746 1522572 1566809 1546882 1639622
18679A639622K30717K07392J54731Q6990J51514Q6469R4975J25934j07200k31269
$$ 1639622 1870339 2077731 2232462 2319452 2470966 2557435 2652410 2778344 2671144 2439875
18669B439875k42747m9490K28433M4306j70346j30472q7033p8020n59Q3029o9223
$$ 2439875 2197128 2147638 2376071 2420377 2250031 2119559 2032526 1954506 1953947 2036976 1967753
18658A967753K981J00886r6857j3581j42721k99382k47908k3847j03775l5285
$$ 1967753 1970734 2071620 1974763 1961182 1818461 1519079 1271171 1247324 1143549 1108264
18648A108264j7642j03972k6053m2532q3812q5361n5721j30942k46845J1347K2562
$$ 1108264 1090622 986650 960597 918065 834253 748892 693171 562229 315384 326731 349293
18637C49293J19371K0899R3656o4062p0367j9422o7381k3892J4267J3356o7630
$$ 349293 468664 489563 583219 519157 448790 429368 361987 338095 352362 365718 298088
18626B98088q6117J9590R8312O9148j8522N3313O7963Q4728k3044j38678q6422
$$ 298088 211971 231561 329873 399021 380499 433812 501775 586503 563459 424781 338359
18615C38359M8594q1039n6462L7767J34334k8896P3962p9081l1046M755l0739
$$ 338359 386953 305914 249452 287219 421553 392657 466619 387538 356492 361247 330508
18604C30508m4608O9172N0428K55143k6851p0473N1437r0894j51122p3626P2890
$$ 330508 285900 355072 405500 660643 633792 563319 614756 523862 372740 299114 372004
18593C72004o1356K35615L1836j34435R5466J58538K19739J75375p6045q3263
$$ 372004 310648 546263 578099 443664 539130 697668 917407 1092782 1016737 933474
18583I33474R7169J59669n5672k4049J0868O4284J10682r3700r9474l071j9233
$$ 933474 1030643 1190312 1134640 1110591 1121459 1185743 1296425 1202725 1103251 1100180 1080947
18572A080947K7318j77578L7517R4232J23326j79878l6113N2146J7865m1779Q9272
$$ 1080947 1108265 930687 968204 1062436 1185762 1005884 969771 1021917 1039782 998003 1087275
18561A087275n3323m3894j6989J72866o3434k53060q9817j186J57563Q2069Q4837
$$ 1087275 1033952 990058 973069 1145935 1082501 829441 739624 738438 896001 978070 1062907
18550A062907Q0914J30959N9848j61478m3645n0884P6759m9349o0586O9038K38119
$$ 1062907 1143821 1274780 1334628 1173150 1129505 1078621 1155380 1106031 1045445 1114483 1352602
18539A352602K8347j0839Q3090L77060n2043r6344j9715L3251n0655q7761r328
$$ 1352602 1380949 1370110 1453200 1830260 1778217 1681873 1662158 1695409 1644754 1556993 1547665
18528A547665M0036o695R9180K9776J57743J69475n0177l4321J33916M2927M6405
$$ 1547665 1587701 1581006 1680186 1709962 1867705 2037180 1987003 1952682 2086598 2129525 2175930
18517B175930K08978K34367P4336K71616L24589N7094n5789P6825n3031j71718
$$ 2175930 2384908 2619275 2693611 2965227 3289816 3346910 3291121 3367946 3314915 3143197
18507C143197j12390p2524j58880j62851p7016r7494r8590r3358K9807R886M8361
$$ 3143197 3030807 2958283 2799403 2636552 2559536 2462042 2363452 2270094 2299901 2309787 2358148
18496B358148j45472j19996P436j2272j69667k35600o7031N3488j9159k49378
$$ 2358148 2212676 2092680 2100116 2087844 1918177 1682577 1615546 1669034 1649875 1400497
18486A400497k26820O3169N2413O0017O9298k17099p5973j651J87159K38896R9638
$$ 1400497 1173677 1236846 1289259 1349276 1418574 1201475 1125502 1123851 1311010 1549906 1649544
18475A649544M1281k5122N568P4616J5547J0095J47696L56868O3189J24008K38695
$$ 1649544 1690825 1665703 1671271 1745887 1761434 1771529 1919225 2276093 2339282 2463290 2701985
18464B701985J51234J26090J67303J73576K14209j6583l64050j32266j76803j62834
$$ 2701985 2853219 2979309 3146612 3320188 3534397 3517814 3153764 3021498 2844695 2681861
18454B681861m4278p562l50251n04487k79048l3435K7207p6429J3696J17086j63054
$$ 2681861 2637583 2630021 2279770 1775283 1496235 1462800 1490007 1413578 1427274 1544360 1381306
18443A381306r3105n9456o7765J12999O6172L08876R1192J61897K09588L01024
$$ 1381306 1288201 1228745 1160980 1273979 1340151 1649027 1740219 1902116 2111704 2412728
18433B412728O6370m3927l10098k76961n898M1643j7272k46091k53944q3692j5855
$$ 2412728 2479098 2435171 2125073 1848112 1842214 1883857 1866585 1620494 1366550 1282858 1267003
18422A267003J11873j06902J7189r2433K4684R0119J1237K73711J92786R0416
$$ 1267003 1378876 1271974 1289163 1196730 1221414 1311533 1322770 1596481 1789267 1879683
18412A879683p2303J24831O8454L7085p1573k10649j47127p1209j44188r0024
$$ 1879683 1807380 1932211 2000665 2037750 1966177 1755528 1608401 1537192 1393004 1302980
18402A302980k21850K2233N0033M0852j12655j92618J3193J860m9544K01767J75836
$$ 1302980 1081130 1103363 1153396 1194248 1081593 888975 902168 904028 854484 1056251 1232087
18391A232087O1753J87203J12370R2115k3819k2766N2575k18323o2896R6284K339
$$ 1232087 1293840 1481043 1593413 1685528 1661709 1638943 1691518 1473195 1410299 1506583 1508922
18380A508922j91416k02513j18962k8381J7907r1074N7861p5223k99570k68383
$$ 1508922 1317506 1114993 996031 967650 985557 894483 952344 877121 577551 309168
18370C09168k3282J30330K21920M1847m0344K950o1824n3996m7202K11424N6125
$$ 309168 285886 416216 638136 679983 639639 642589 580765 526769 479567 690991 747116
18359G47116J723j04653j48132j23886P362k7920o2964J870L04637J19891m9652
$$ 747116 748839 644186 496054 372168 379530 351610 288646 290516 595153 715044 665392
18348F65392o8577n6521N5412p9266L6023k9746p0202P041J99857j01188R6082
$$ 665392 596815 540294 595706 516440 552463 522717 452515 459556 659413 558225 654307
18337F54307P4955j66572n87q46o3116k4874o7519P5678J37176J08030o3526j5621
$$ 654307 729262 562690 562103 561257 498141 473267 405748 481426 618602 726632 663106 647485
18325F47485j50360q349k5452P444m4604K34681j93113j31653J65836K44023J42609
$$ 647485 497125 488776 463324 470768 426164 660845 467732 336079 501915 745938 888547
18314H88547R3464K79203N5563j34037J22984J44917R9653M8582p7428j41807
$$ 888547 982011 1261214 1316777 1182740 1305724 1450641 1550294 1598876 1521448 1379641
18304A379641J21635L0293l0422j01538l0045j97296l9696M4030j29499k8331
$$ 1379641 1501276 1531569 1501147 1399609 1369564 1172268 1132572 1176602 1047103 1018772
18294A018772m7783k87843j73189j9685p7529j24140O9967n8193J37652O0234
$$ 1018772 970989 683146 509957 490272 412743 288603 358570 300377 438029 498263
18284D98263l1782j05950M7626N2126Q6905m8558j26221M3849N5988J37771J2753
$$ 498263 466481 360531 408157 460283 547188 498630 372409 416258 472246 610017 622770
18273F22770j81301K701K12759J30122m6782K72610J12478J89723J39108J89899
$$ 622770 441469 444170 656929 787051 740269 1012879 1125357 1315080 1454188 1644087
18263A644087J85083K56314M02694M49823K98872l1248O3988O0837J26867N1527
$$ 1644087 1829170 2085484 2488178 2938001 3236873 3205625 3269613 3330450 3457317 3508844
18253C508844n1683j03362k94712k39098m1931j95323l30809n6495k86368j55339
$$ 3508844 3457161 3353799 3059087 2819989 2778058 2582735 2251926 2195431 1909063 1753724
18243A753724l56099k09282q0698j88467j51309m6334j50317l6669m2732N075
$$ 1753724 1397625 1188343 1107645 919178 767869 721535 571218 534549 491817 496892
18233D96892J30220k3829J12456m4563k2163P1084N1038j94146j03896J73961
$$ 496892 627112 603283 715739 671176 649013 720097 771135 576989 473093 647054
18223F47054N3145j45436o1832N6684r0782J70639K06734Q0875L04472M15121
$$ 647054 700199 554763 492931 549615 458833 629472 836206 917081 1221553 1636674
18213A636674J42711q868m4119K71692K09163J79250J93914J75580r742P2521
$$ 1636674 1779385 1770517 1726398 1998090 2207253 2386503 2580417 2755997 2746255 2818776
18203B818776q7669j27930j78779j97490l00721l25690l15454j47827m4139j10314
$$ 2818776 2731107 2603177 2424398 2226908 1926187 1600497 1285043 1137216 1093077 982763
18193I82763N1986l4777r7845M1461p0505j16238O077p5302k2561q12n2838p8366
$$ 982763 1034749 999972 902127 943588 873083 756845 762922 687620 665059 664247 611409 533043
18181E33043m2075j5119J56135J08960j9938j02121K7438q7080r1431j9012j99277
$$ 533043 490968 475849 631984 740944 721006 618885 646323 559243 467812 448800 249523
18170B49523o5780K91097L17752P8236o1688j16233j9620j06293J12091J92748
$$ 249523 183743 474840 792592 870828 809140 692907 673287 566994 679085 871833
18160H71833j17944k3132M4684k7112q5163k7988o5982n4066J08770M9750N3018
$$ 871833 753889 730757 775441 748329 663166 635178 569196 515130 623900 673650 726668
18149G26668J28188J9636r3730j65361l1655J56819j5929J05827M6131L8402J87461
$$ 726668 854856 874492 780762 615401 583746 740565 724636 830463 876594 914996 1102457
18138A102457J7627K7598j03830O8907K02112J66196K01312R9100K57534K24003
$$ 1102457 1120084 1147682 1043852 1112759 1314871 1481067 1682379 1781479 2039013 2263016
18128B263016M12644L04698M07072K81371N30253P22912P10798J152155J921576
$$ 2263016 2675660 2980358 3387430 3668801 4199054 4921966 5632764 6784919 8706495
18119H706495K526768L728692O196148J0931557J9690374K7895589K5582680J9537138
$$ 8706495 11233263 14961955 21158103 32089660 51780034 79675623 105258303 124795441
18111A24795441K1252648J0419987J77739k6815313n0143467k9704397j4222466
$$ 124795441 146048089 156468076 156645815 129830502 79687035 49982638 35760172
18104C5760172p656821m502313k959654k127147j624284j449671j312487j109232
$$ 35760172 28103351 23601038 20641384 18514237 16889953 15440282 14127795 13018563
18096A3018563r79920r44059m71037l79645n75019m72201l06318l26421n45369
$$ 13018563 12038643 11094584 10623547 10243902 9668883 9196682 8890364 8563943 8018574
18087H018574n98741k42953l04939k23347j91780j44186k41078j82102k97874
$$ 8018574 7419833 7176880 6871941 6648594 6456814 6312628 6071550 5889448 5591574
18078E591574j36750p4402P7115j94590k68033k48249k54961k7955k5847q8083
$$ 5591574 5454824 5380422 5457537 5262947 4994914 4746665 4491704 4463749 4437902 4349819
18068D349819j09214j43558k51964j22640m8530Q2184j57019m1380n7232K8435
$$ 4349819 4240605 4097047 3845083 3722443 3673913 3756097 3599078 3557698 3500466 3528901
18058C528901R31k48177k00029j68894n105K1818n5550r2072Q3781P6718j39899
$$ 3528901 3529832 3281655 3081626 2912732 2907627 2929445 2873895 2781823 2865604 2942322 2802423
18047B802423j71317l9695j1501P0517j00844o1186L2257k7446L1415n2437l39680
$$ 2802423 2631106 2591411 2579910 2650427 2549583 2488397 2520654 2493208 2524623 2472186 2132506
18036B132506L1818J36710J03630m6796P6718J04866J86084J33085J70126R4691
$$ 2132506 2164324 2301034 2404664 2357868 2434586 2539452 2725536 2858621 3028747 3123438
18026C123438J35489J69198K47921J32607K03968R3911J01043Q6751j44633k9585
$$ 3123438 3258927 3428125 3676046 3808653 4012621 4106532 4207575 4294326 4149693 4120108
18016D120108J25430K77711k0887j01666j69189q0354j37189k66693l03012l68094
$$ 4120108 4245538 4523249 4502362 4400696 4231507 4151153 4013964 3747271 3444259 3076165
18006C076165k16657j46675j55962j33888k94j39321k73947j47147J69503l8125
$$ 3076165 2859508 2712833 2556871 2422983 2422689 2283368 2009421 1862274 2031777 1993652
17996A993652k66019k95442O3776R5371r9337l8280J12012J0620j72689j96286
$$ 1993652 1727633 1432191 1495967 1591338 1492001 1453721 1565733 1576353 1403664 1207378
17986A207378l9832J56338J87329K24622K140p7641j8246J44992J41030j23482
$$ 1207378 1167546 1323884 1511213 1735835 1737975 1660334 1642088 1787080 1928110 1804628
17976A804628R4461J57147L1945K68447K04807j490Q652O2869M051r586J6357
$$ 1804628 1899089 2056236 2088181 2356628 2561435 2559945 2568597 2631466 2635517 2625931 2642288
17965B642288k0954p5195r7215J85076J92686q2073l68978k91762k96404l6560
$$ 2642288 2621334 2546139 2448924 2634000 2826686 2744613 2375635 2083873 1787469 1750909
17955A750909j46251k94211k22185l1599o1310j36236m7742p9969j64173p0790
$$ 1750909 1604658 1310447 1088262 1056663 995353 859117 811375 731406 567233 496443
17945D96443P4139l1025K2151R1285n0974N178K6199O7828M3056k55120k23209
$$ 496443 570582 539557 561708 652993 602019 607197 633396 701224 744280 489160 265951
17934B65951J00496J5492N9599N1941M7187m173j8284P9956j7791O885M1063p5150
$$ 265951 366447 381939 441538 493479 540666 536493 518209 598165 580374 587259 628322 553172
17922E53172j02553q5353J723Q9929Q6114m5608M7915j68199k53412M2902Q7976
$$ 553172 450619 365266 366989 456918 543032 497424 545339 377140 123728 166630 254606
17911B54606N3082J67205O5079K9721j78036n5580j8456r4942R102j49528P13
$$ 254606 307688 474893 539972 569693 391657 336077 317621 222679 231781 82253 82966
17900H2966J32530J0992j86670o371p3633p4482J04744K6401Q9797R5823j96067
$$ 82966 215496 226488 39818 33447 -40186 -114668 -9924 16477 106274 202097 6030
17889F030M5820J14522l4897o0413Q4757J72172J12524P6164j08685k25n3397
$$ 6030 51850 166372 131475 71062 155819 327991 440515 516679 407994 407769 354372
17878C54372p7732j10377j16632J04383K38048L0622j45830k8569j20192J0639
$$ 354372 276640 166263 49631 154014 392062 422684 276854 248285 128093 138732
17868A38732J06337j03118j61688J08078J50986J68949q2305k43947Q693N1762
$$ 138732 245069 141951 -19737 88341 239327 408276 325971 82024 90717 142479
17858A42479j71113O1507L5833J45080J09966r8508L4112O7779n2976O2492o1615
$$ 142479 -28634 32873 68706 213786 323752 225244 259356 327135 274159 336651 275036
17847B75036L4245J75607J51833N7486J15643K69509J65462J95256L09050L24760
$$ 275036 309281 484888 636721 694207 809850 1079359 1244821 1440077 1749127 2073887
17837B073887Q5386J57553K16755l8403M9987J58954R4502R6149P2553K14201
$$ 2073887 2159273 2316826 2533581 2495178 2545165 2704119 2798621 2894770 2967323 3181524
17827C181524Q2977R5528K82075J23486J58086J51350J95567J60959J54871q3236
$$ 3181524 3264501 3360029 3642104 3765590 3923676 4075026 4270593 4431552 4586423 4503187
17817D503187r8705j26401j67773o8439R6858j87208j97059j10964j96431j35964
$$ 4503187 4404482 4278081 4110308 4041869 4138727 3951519 3754460 3643496 3447065 3311101
17807C311101r8513j01411o5195k68650m31910l97800l31181l07449j81470O1521
$$ 3311101 3212588 3111177 3045982 2777332 2345422 1947622 1616441 1308992 1127522 1189043
17797A189043K10l8593Q5240k05849j12947J8264k02238j71384J12416J61061
$$ 1189043 1189253 1150660 1235900 1030051 917104 935368 733130 561746 674162 835223
17787H35223o2511j07727m4241r9651j68154K16688J17017R2925j49076k85209
$$ 835223 772712 664985 620744 521093 352939 569627 686644 779569 630493 345284
17777C45284K0776P7379M3076j5464O5249P8794L0231j87491l35774J75213j0317
$$ 345284 366060 443439 486515 471051 536300 615094 645325 457834 122060 297273 286956
17766B86956p3975J77486J29689p05J15372j01492k60387J7624n0221R2625Q3093
$$ 286956 212981 390467 520156 519451 634823 533331 272944 290568 240347 332972 416065
17755D16065j5314o4638Q3081j6449J01699P1262K15094J25268J70465L83861
$$ 416065 400751 336113 419194 402745 504444 575706 790800 916068 1086533 1470394
17745A470394L00448K59367K62345L06636J62305m9726J99220J26809j23754j42233
$$ 1470394 1770842 2030209 2292554 2599190 2761495 2711769 2910989 3037798 2914044 2771811
17735B771811j0760l7715j63441k79567j48256j22598q4893K11870J96481R9103
$$ 2771811 2761051 2723336 2559895 2280328 2132072 2009474 1924581 2136451 2332932 2432035
17725B432035p3825j39820k38079k4734K2158L5997j07684m9178q8541j40376
$$ 2432035 2358210 2218390 1980311 1955577 1977735 2013732 1906048 1856870 1768329 1627953
17715A627953l00444k63891r6151k05901j83260j07118J48555J75399o9004L1522
$$ 1627953 1327509 1063618 967467 761566 578306 471188 619743 795142 726138 757660
17705G57660k30587j80976J80237l1727k9008K6082J61308J06028L0277K22034
$$ 757660 527073 346097 526334 494607 465599 491681 652989 759017 789294 1011328
17695A011328K60318L71683J71400K34966K45156O7564p050L2451n3589L928Q167
$$ 1011328 1271646 1643329 1814729 2049695 2294851 2362415 2355365 2387816 2334227 2338155 2346322
17684B346322j94517j18170j47881j97573P5528R9083j10275o3126L5871N803
$$ 2346322 2151805 2033635 1885754 1688181 1763709 1862792 1752517 1689391 1725262 1731065
17674A731065M001M4061K0140l229j392j87593r8517P4289M4511n545l22439l29855
$$ 1731065 1735066 1779127 1799267 1796038 1794646 1607053 1508536 1582825 1627336 1621791 1299352 969497
17662I69497j31377r0590o6338j12227j92967m0602m978Q4775J08338J05127n6057
$$ 969497 838120 747530 681192 568965 375998 335396 330418 415193 523531 628658 572601
17651E72601j18125R59J83465j28043j15851M0082Q5361j1201L1342q2804M7117
$$ 572601 454476 455435 638900 510857 395006 435088 520449 509248 540590 457786 504903
17640E04903k45604j71266O0191L9606J6390P5162j9741o691K5063j82029k1112
$$ 504903 259299 88033 148224 187830 204220 279382 259641 252950 278013 95984 74872
17629G4872m9082j0191R5028j11392M0188Q5535J8881k9286R4709R622k5157r0523
$$ 74872 25790 15599 110627 -765 39423 124958 143839 114553 209262 218884 193727 103204
17617A03204n4268k3001M7072j56615r3915J03360J97057J33537M8196r2277j11347
$$ 103204 48936 25935 73007 -83608 -177523 -74163 122894 256431 304627 212350 101003
17606A01003j64628q8799J88801j5769j91787r4800J28018K36860N8155K5508
$$ 101003 -63625 -152424 36377 20608 -171179 -265979 -137961 98899 157054 182562
17596A82562q2623O4842m753R8301K5369j21450N5944Q4889j68623k00713J5742
$$ 182562 99939 164781 160028 258329 283698 162248 218192 303081 134458 -66255 -50513
17585e0513J58883N3846M0561r3128j30901J1006q270J49572J15730j05169j55342
$$ -50513 108370 162216 202777 109649 -21252 -10246 -18516 131056 246786 141617 -13725
17574a3725l2894J4550K05174k1313J6247p838r8573L7461J13878M4989J2671
$$ -13725 -46619 -32069 173105 151792 168039 160201 61628 99089 212967 257956 270627
17563B70627k15J14480n9950K998j10008q5505o4028n5646K1086P5419Q0088j29439
$$ 270627 270412 384892 324942 327940 217932 132427 68399 12753 33839 109258 189346 59907
17551E9907K8469M4473j26799q3988J13795M0094n0602o800O7715J86691J38077
$$ 59907 88376 132849 6050 -77938 35857 75951 25349 18549 86264 272955 411032
17540D11032m1359j40080j39435q5676P684P0972Q7158j59104J0562J09781J1012
$$ 411032 369673 229593 90158 4482 12166 83138 170296 11192 21754 131535 142547
17529A42547m8056J29315o9155j47811R6497m5661R5879l908r2185j09800M4981
$$ 142547 94491 223806 154651 6840 103337 57676 153555 149647 57462 -52338 -7357
17518g357J18741N5630j85285p6161n1808j06579j47439J59099J72419M6301j20272
$$ -7357 111384 167014 -18271 -94432 -146240 -252819 -400258 -241159 -68740 -22439 -142711
17507a42711j20346K9472K62508J66149q6968j62550q4214j82601o887K73198
$$ -142711 -263057 -233585 28923 195072 108104 -54446 -138660 -321261 -328148 -54950
17497e4950J21317P3984o8572o3418r3655L5464J3610l2452k3673K8824J23837
$$ -54950 66367 140351 71779 8361 -85294 -49830 -36220 -68672 -92345 -63521 60316
17486F0316j46227N9258J87056k5489r9035O4449L0604p6437l287k3986J5233
$$ 60316 -85911 -26653 160403 134914 35879 100328 130932 54495 51208 27222 42455
17475D2455J02999p889L8406j11809j25991L1912j2953J61244J346r1297j09261
$$ 42455 145454 137565 175971 64162 -61829 -29917 -42870 118374 119720 28423 -80838
17464h0838j566j00303K5116R1415J38108J22645R7133o4857p568J08438J56464
$$ -80838 -82404 -182707 -157591 -66176 71932 194577 291710 226853 219285 327723 484187
17453D84187K9349k14429j28392K379q4424j1951J90047L44434Q4449L804J9705
$$ 484187 513536 299107 170715 173094 88670 76719 266766 611200 695649 699453 719158
17442G19158J0546k48319j32762j16102p5874l5249n8843Q9136j28269j0500p651
$$ 719158 729704 481385 348623 232521 156647 121398 62555 151691 23422 12922 5271
17431E271L1076K05314R5598J7106L0084p2586p3607o3556j03602j11564j95765
$$ 5271 36347 241661 337259 354365 384449 311863 238256 174700 71098 -40466 -236231
17420b36231J25614R8306J49003j9793q4853n6733N238o739j07209J89639J56060
$$ -236231 -110617 -12311 136692 116899 32046 -24687 -19449 -26188 -133397 56242 212302
17409B12302J29136j58848j16639M4320N651j52402L6083P6025M051j00800r3830
$$ 212302 341438 182590 65951 110271 115922 -36480 -397 75628 79679 -21121 -114951
17398a14951J34018q5911J40749k814J6937p804J21738K202O2597o6571m7682
$$ -114951 19067 -66844 73905 71091 88028 80224 201962 204164 266761 200190 152508
17387A52508m3123O2377k1793l9267j47660Q0144M7655j51794q514j89798J35240
$$ 152508 109385 171762 149969 110702 -36958 43186 90841 -60953 -69467 -259265 -124025
17376a24025M3893K9922o3259j73845O3954J13869l4012J21885Q9964N0942k2343
$$ -124025 -80132 -50210 -113469 -287314 -223360 -109491 -143503 -21618 68346 119288 96945
17365I6945j97778o5406M090K27442k7511j31045n7332J12152J3296p4623p1747
$$ 96945 -100833 -166239 -162149 65293 37782 -93263 -150595 -38443 -25147 -99770 -171517
17354a71517J81861K087K3167J42072j8415J60134m6k07342o2170J01698k5541
$$ -171517 10344 12431 35598 177670 159255 319389 319343 112001 49831 151529 125988
17343A25988K6176P5746j0516j11926j25630l6784j45075R8119K19801r9971j45079
$$ 125988 152164 227910 217394 105468 -20162 -56946 -202021 -103902 115899 15928 -129151
17332a29151J55503M6632J272k1377j75519m3789M4062o4788K15249j341q9893
$$ -129151 26352 72984 74256 52879 -122640 -166429 -122367 -187155 28094 26753 -63140
17321f3140J01667j15083l9348m5693N131j4458Q9731K2452K1811p4146R5282
$$ -63140 38527 -76556 -115904 -161597 -156466 -170924 -81193 -58741 -36930 -111076 -15794
17310a5794M3618j25562k0640P8161O5644j17098J2148Q8762O6807q7347o533
$$ -15794 27824 -97738 -118378 -40217 25427 -91671 -79523 9239 76046 -11301 -17834
17299a7834j6062l2566L0644l4459J77005j3600p1869P3569p1616m8431r241N129
$$ -17834 -33896 -66462 -35818 -70277 106728 93128 21259 94828 23212 -25219 -34460 -29331
17287b9331j2575J00570M9878J28741r0025p5862L14Q8877l1161j21145J05271
$$ -29331 -41906 58664 108542 237283 147258 71396 71710 160587 129426 8281 113552
17276A13552J63660k0777j17158L4336j01185j21696o2893L6540L16305n8906
$$ 113552 277212 256435 139277 173613 72428 -49268 -112161 -75621 240684 181778
17266A81778j04951j51435m4350O8161K427J61956O0180q4933j10107N8853O7393
$$ 181778 76827 -74608 -118958 -50797 -48370 113586 173766 88833 -21274 37579 104972
17255A04972p7104n4187n4675n2370J81289N7762k7572M893m1928p4346j39565
$$ 104972 27868 -26319 -80994 -133364 47925 105687 78115 83008 41080 -33266 -172831
17244a72831j6143p5415R716J14716O3838K14542j3570r2701n9699n370j42799
$$ -172831 -188974 -264389 -254673 -139957 -76119 138423 124853 32152 -27547 -32917 -175716
17233a75716N1990Q9221L719P967Q7444m6737p7502K519R2838Q5774P4597j18990
$$ -175716 -123726 -34505 -30786 -22819 64625 17888 -59614 -57095 35743 121517 196114 77124
17221G7124k07616j59827O7538J25370m3139n4481K22941k7239p1818J22131j13281
$$ 77124 -130492 -290319 -222781 -97411 -140550 -195031 27910 671 -71147 50984 -62297
17210f2297k37700j5543J33429J48621L1809j40582J88490M6436j31100J88622
$$ -62297 -299997 -315540 -182111 -33490 -1681 -142263 46227 92663 -38437 150185
17200A50185n494j76792M0725L8947j30605n6446M9905K49987o4070j25643j2453
$$ 150185 144691 -32101 8624 47571 -83034 -139480 -89575 160412 96342 -29301 -41754
17189d1754m6328o1198R0729p9447j08173J20065k0408j06135Q6694j3053n6281
$$ -41754 -88082 -149280 -58551 -137998 -246171 -126106 -146514 -252649 -165955 -179008 -235289
17178b35289n5681Q0297J72945j05567n2522k0000j2554P9684l482o1065M4371
$$ -235289 -290970 -210673 -37728 -143295 -195817 -215817 -228371 -148687 -152169 -213234 -168863
17167a68863M5136N1492K55438K713p9319r4199N475J08023o8869J14680J91082
$$ -168863 -123727 -72235 183203 185916 106597 12398 17873 125896 57027 171707 362789
17156C62789M84k82573n9382J8465j08911k8713K71239M8972l8248l5522j9361
$$ 362789 363273 80700 21318 39783 -69128 -97841 173398 222370 184122 148600 129239
17145A29239J03782j19019p0960J79074k4387j28614K7749J14680J37736p2976
$$ 129239 233021 114002 43042 222116 197729 69115 96864 211544 349280 276304
17135B76304k9202L1066p6547N3759m1763j16435j13562j0851O3470J00321j73175
$$ 276304 247102 278168 201621 255380 213617 97182 -16380 -27231 36239 136560 -36615
17124c6615p5358O0201O0147q9428k5393m0854K484O3654R7995R0523J4208p015
$$ -36615 -111973 -51772 8375 -81053 -106446 -147300 -144816 -81162 16833 107356 121564 114549
17112A14549j2823l8322O062J31776l1950o0079J47600j54192j78829r0590j25429
$$ 114549 101726 63404 69466 201242 169292 109213 256813 102621 -76208 -166798 -292227
17101b92227j6351J09956o3480R3673J92556P1906m0092L2398k607j96912M4499
$$ -292227 -308578 -198622 -262102 -168429 24127 96033 55941 88339 85732 -111180 -66681
17090f6681L3933p5193P9623J90158J20834P9467j57212k46504j69718j3307J32885
$$ -66681 -32748 -107941 -28318 161840 282674 362141 204929 -41575 -211293 -224600 -91715
17079i1715P0978M082O5745J28608k0681j08686J40337J0243o4338L5740K5408
$$ -91715 -20737 -16655 49090 177698 157017 48331 188668 198911 134573 170313 195721
17068A95721K6861p3625k2084m7248m6725N9108r3177m6112J04770N7267k7498
$$ 195721 222582 148957 126873 79625 32900 92008 -1169 -47281 57489 114756 87258
17057H7258p0937j19006L9312l2011q3059n4924R8220Q0504J2970N4964P4659
$$ 87258 16321 -102685 -63373 -95384 -178443 -233367 -135147 -54643 -41673 13291 87950
17046H7950n4093M9715L6701l00j61163m4020j80485k6824K08939Q4469j79321
$$ 87950 33857 83572 120273 119973 -41190 -85210 -265695 -292519 -83580 889 -178432
17035a78432j7336o2865p8647J94350J30721o6758o5166l1282K34649J46952m4383
$$ -178432 -195768 -258633 -337280 -142930 -12209 -78967 -144133 -175415 59234 206186 161803
17024A61803J13021p2852J09k787q9877k55908p699J16960k7841j53743j00633
$$ 161803 274824 201972 202081 199294 109417 -146491 -154190 -37230 -65071 -218814 -319447
17013c19447Q5212J41763l3307L5148K0565J34356l46o6077k5358N6189J41116
$$ -319447 -234235 -92472 -125779 -90631 -70066 64290 63944 -2133 -27491 28698 169814
17002A69814N4934j1934L0582P074j99421j96667O7632K03069R4611R5057Q3492
$$ 169814 224748 212814 243396 250470 51049 -145618 -77986 125083 219694 314751 398243
16991C98243j35681k33669j2074j03416k9618J32616J83629J29777K1065p2620
$$ 398243 262562 28893 16819 -86597 -116215 16401 200030 329807 350872 278252
16981B78252o6181m6623m5866M3783m9248j26189R4951R1097j74486q5350J86556
$$ 278252 212071 165448 119582 163365 114117 -12072 82879 173976 -510 -85860 100696
16970A00696n0611o9560q3671j24829J36036J18966p7773k31322N2879K2114Q1474
$$ 100696 50085 -19475 -103146 -227975 -91939 27027 -50746 -282068 -229189 -207075 -125601
16959a25601N0391j1303L4233M5969N6156J8660n0216k8257j9385j9605m2719
$$ -125601 -75210 -86513 -52280 -6311 49845 68505 18289 -9968 -29353 -48958 -91677
16948i1677J02761L7704j30672J2145r3063p2273p1601J51204L0002l5374J4616
$$ -91677 11084 48788 -81884 -69739 -162802 -235075 -306676 -155472 -125470 -160844 -146228
16937a46228J02369J77950J4060o8588L2967o8714j9944K7001m820o1607l8302
$$ -146228 -43859 134091 148151 79563 112530 43816 23872 50873 46053 -15554 -53856
16926e3856r7641L6408J17825l9065j05577N2852O5951j64406k936j56992j49881
$$ -53856 -151497 -115089 2736 -36329 -141906 -89054 -23103 -187509 -190445 -347437 -497318
16915d97318J44137K61139K7355n1623J72457j7711r3926r8240l1528J60494j5018
$$ -497318 -353181 -92042 -64687 -116310 56147 38436 -55490 -153730 -185258 -24764 -39782
16904c9782q2072R5937j7388k02466P4011J78185K2397j67455R90J13965O481
$$ -39782 -121854 -25917 -43305 -245771 -171760 6425 28822 -138633 -137643 -23678 -17197
16893a7197N7697P4450l1562k56631n0351N6431m1434k7109l2904o9508j12143
$$ -17197 40500 114950 83388 -173243 -223594 -167163 -208597 -235706 -268610 -338118 -450261
16882d50261J44042K76479k3798K28949J35395p2993m2195r4943J4079L6936j55451
$$ -450261 -306219 -29740 -53538 175411 310806 237813 195618 100675 114754 151690 -3761
16871c761k06325J12268J29915k4918Q1036q7593j63766L5286K4987J30189N2424
$$ -3761 -210086 -97818 32097 7179 88215 622 -163144 -127858 -102871 27318 79742
16860G9742L4825p529j11391K666k72696o7072K15806q405R390Q3622J38793J4429
$$ 79742 114567 107038 -4353 -1687 -274383 -341455 -125649 -134054 -124664 -41042 97751 112180
16848A12180k15737j42779J83792O1240k4858L9159J0750r0331k9410q2693p1767
$$ 112180 -103557 -246336 -62544 -1304 -26162 12997 23747 -66584 -95994 -178687 -250454
16837b50454O8602J36187J31424K12602N2326l10034o1883J56255J77093k7658
$$ -250454 -181852 -45665 85759 298361 350687 40653 -21230 135025 312118 284460
16827B84460r4666q4419N3191J3392n3354j5089p8834r232j22254p3558k6593
$$ 284460 189794 105375 158566 171958 118604 103515 24681 15449 -106805 -180363 -206956
16816b06956m4805K05694J72175j05117q1398R4777l4826j25244J00710M3419
$$ -206956 -251761 -46067 126108 20991 -60407 34370 -456 -125700 -24990 18429
16806A8429K2670l2250j02197j32415k3326O0243P1388l6273L1278k7160k5329
$$ 18429 41099 8849 -93348 -225763 -249089 -188846 -117458 -153731 -122453 -149613 -174942
16795a74942J70001J10004K03314P1551n6550j44006p0410m1085J9094r818N7119
$$ -174942 -4941 105063 308377 379928 323378 179372 108962 67877 86971 77153 134272
16784A34272n0215L0162L3301j70228k7072q9638L8270m3589Q5593K83390K2937
$$ 134272 84057 114219 147520 -22708 -49780 -139418 -101148 -144737 -59144 224246 247183
16773B47183k20016r9413o4907k4582m9583j06232Q8732J04273J16077L1321o9519
$$ 247183 27167 -72246 -137153 -161735 -211318 -317550 -228818 -124545 -8468 22853 -46666
16762d6666K8306J11304j397j7136M751L6398k4712j8022j70376j28924k4810
$$ -46666 -18360 92944 91547 74411 79162 115560 90848 72826 -97550 -226474 -251284
16751b51284Q0373J03830P8964J08383l8164J410R996O4407k0502Q3747L8470
$$ -251284 -170911 -67081 11883 120266 82102 83512 93508 157915 137413 221160 259630
16740B59630J49003j09617n5396j45945j32737j08644J16938J79772j35322K8501
$$ 259630 408633 299016 243620 97675 -35062 -143706 -26768 153004 17682 46183
16730D6183J96578q2361j15516J5688J40400J11241j02874J4541L895l0507q1214
$$ 46183 242761 160400 44884 60572 200972 312213 209339 223880 227775 197268 116054
16719A16054j16351k3928P3273L7308j22979p3317J4996J59425Q3133o7559K2993
$$ 116054 -297 -24225 49048 86356 -36623 -109940 -94944 64481 147614 80055 103048
16708A03048L5504j29856j60148J87741J01181o0046k2910J9929o4584j6167J4048
$$ 103048 138552 8696 -151452 36289 137470 77424 54514 74443 9859 -6308 7740
16697G740j08318j31760j61463q003J60484O5885j584o4845Q8910J59577p526
$$ 7740 -100578 -232338 -393801 -401804 -241320 -175435 -177019 -241864 -152954 6623 -903
16686i03Q2094j0227R7622N4488j09567p7450n564m3820m1376J0471J02752J44258
$$ -903 81191 70964 168586 223074 113507 36057 30493 -13327 -54703 -44232 58520 202778
16674B02778j1411L6713n864j54131P2645K48427J17878j39092j59542r7887k52111
$$ 202778 191367 228080 222216 68085 140730 389157 507035 367943 208401 110514 -141597
16663a41597o9378R574J65087J38659q1770q866L8286K20806O9528q2270k37923
$$ -141597 -210975 -201401 -36314 102345 20575 11709 49995 270801 340329 258059 20136
16652B0136M8804j46149j21623q3745Q3398J56925P2952K3778L760L1363j38158
$$ 20136 68940 -77209 -198832 -282577 -199179 -42254 30698 54476 58236 89599 -48559
16641d8559O7321q5157o2731j65612J5758M7209J81088J38897p6123q2126K5319
$$ -48559 18762 -66395 -129126 -294738 -278980 -231771 -50683 88214 12091 -70035 -44716
16630d4716M1473K02537j9065j93027k5374O0969j9044k8627r2492N8980K1318
$$ -44716 -3243 199294 180229 -12798 -38172 22797 3753 -24874 -117366 -58386 -37068
16619c7068R2274l5574O9703K00870k2009m7646l9280R096n8622Q5968j0569j37780
$$ -37068 55206 19632 89335 290205 268196 220550 181270 190366 131744 217712 207143 69363
16607F9363j65085k6894L4531J66296l4575q6924q294Q9224M9308J54381j66824
$$ 69363 -95722 -122616 -88085 78211 43636 -43288 -51582 37642 86950 241331 74507
16596G4507j15683P3446n3093Q4566J08156r9459M3145P8480j1549j32558n0200
$$ 74507 -41176 32270 -20823 63743 171899 72440 115585 194065 182516 49958 -242
16585b42q767J79584R9270n3479j91682r3619J5342O943M6581l9407R5638M905
$$ -242 -9009 170575 269845 216366 24684 -68935 -53593 -46650 -69 -39476 56162 61067
16573F1067j8812J1395j5821n5198N0108J08811M5346o3441J2347M0682L1110
$$ 61067 42255 53650 37829 -17369 32739 141550 186896 123455 135802 176484 207594
16562B07594k3267q1355o8689m6425j16809J03693L9024j9932M3449K7632k14514
$$ 207594 184327 102972 34283 -12142 -128951 -25258 13766 -6166 37283 64915 -149599
16551a49599j8506J30576l2332Q6803j19220k67284j11119m01Q8512J69041J37030
$$ -149599 -168105 -37529 -69861 16942 -102278 -369562 -480681 -481082 -392570 -223529 -86499
16540h6499l2740r025Q30j8030q8122J2990J62518J09316N2350m9565j88080l8910
$$ -86499 -119239 -128264 -127434 -145464 -233586 -220596 -58078 51238 103588 54023 -134057 -172967
16528a72967Q6918N95J629K49582N3219p4079j55125q8035J05171O9466P4133
$$ -172967 -86049 -85454 -83825 165757 218976 144897 -10228 -98263 6908 76374 150507
16517A50507j02161q2760p9467N0066P4118J09333P3190j6470p1708J5392J39837
$$ 150507 48346 -34414 -113881 -63815 10303 119636 192826 176356 104648 120040 259877
16506B59877K4397j97474l5799l149j4292J21644j71509j67634J47255J2402j3492
$$ 259877 284274 86800 51001 47852 33560 155204 -16305 -183939 -36684 -24282 -37774
16495c7774m7138n9149J07582J2706j82190Q7852J39595O4840J71726m9375j45729
$$ -37774 -84912 -144061 -36479 -23773 -205963 -118111 21484 86324 258050 208675 62946
16484F2946j09066O279p5645J17210N0949P8932O3976j60930m4902o7178L8671
$$ 62946 -46120 -39841 -115486 1724 52673 131605 195581 34651 -10251 -77429 -38758
16473c8758j7338J05064R6175r526J4422q3585j11388o5014L6635k4107M8941
$$ -38758 -56096 48968 145143 135617 150039 66454 -44934 -109948 -73313 -97420 -48479
16462d8479l0727j4176j35167K9951J58164J63704k5782j20105N8775N6756j10896
$$ -48479 -79206 -93382 -228549 -198598 -40434 123270 97488 -22617 36158 92914 -17982
16451a7982r629k4849M8325K54524K8403j78184O8513R2145q599l6018j10967
$$ -17982 -27611 -52460 -4135 250389 278792 100608 169121 261266 252667 216649 105682
16440A05682j56393m1897j20446Q4508J98658j3656j23467J9584K24689m197J5739
$$ 105682 -50711 -92608 -213054 -128546 70112 56456 -67011 -47427 177262 173065 188804
16429A88804j33027j87953r9300P7240K19929K1102l7729Q8996o5727o0272J630
$$ 188804 55777 -132176 -231476 -154236 65693 86795 49066 138062 72335 12063 13693
16418A3693q3901R5025l3753o6052j18897q6739j06856L3173L4661j4475J79894
$$ 13693 -70208 24817 -8936 -74988 -193885 -280624 -387480 -354307 -319646 -334121 -154227
16407a54227P035K10850R2975o2446O854j49064j33456P5955N8945Q481K240k3257
$$ -154227 -147192 63658 156633 94187 101041 -48023 -181479 -105524 -46579 -38098 -35858 -59115
16395e9115M3314M402r907n4835l9704R1242K52016R0174j58790j18092J27314
$$ -59115 -15801 -11399 -21306 -76141 -115845 -24603 227413 317587 158797 40705 168019
16384A68019J72528M0771j92926l4439j18003j12471J13353L3606K6335j66004
$$ 168019 340547 381318 188392 153953 35950 -76521 36832 70438 96773 -69231
16374f9231n1510J32897P3688l284R6389r4596j36435Q1611Q8125p3044j97603
$$ -69231 -120741 12156 85844 82560 178949 84353 -52082 29529 117654 44610 -152993
16363a52993j95669j6237J88994N3902J32451O5152L7223K063j8420j2542n6889
$$ -152993 -348662 -364899 -175905 -122003 10448 75600 112823 114886 96466 83924 27035
16352B7035l4028N5151j63691j61528J00784J71105j8006j85826R5708J98726
$$ 27035 -6993 48158 -115533 -277061 -176277 -5172 -23178 -209004 -113296 85430
16342H5430Q958j19011k4138J6487m0821j39115N0348o4703R9641L30258R8911
$$ 85430 94388 -24623 -48761 -32274 -73095 -212210 -161862 -226565 -126924 203334 302245
16331C02245j87343o4580M6054K9669j07180k2207j3534J4690J38900J85589j55200
$$ 302245 114902 50322 96376 126045 18865 -3342 -16876 -2186 136714 322303 167103
16320A67103m0786k8723K8576o5271q7029m8894K04333P3063j14055j24207l3056
$$ 167103 126317 97594 126170 60899 -26130 -75024 129309 202372 88317 -35890 -68946
16309f8946Q2095J32412K57605o1778j56568m9451p685J33893j3666j6701k3553
$$ -68946 13149 145561 403166 341388 184820 135369 127684 261577 247911 231210 207657
16298B07657j7209J45680j31717j1025j6646p6877k1058l8871J16718O0885j7298
$$ 207657 190448 336128 204411 193386 176740 99863 78805 39934 156652 217537 200239
16287B00239K513k8195n3635Q3460M1626k8002n1473J1414J91686j91464k29056
$$ 200239 202752 174557 120922 204382 246008 218006 166533 177947 369633 178169 -50887
16276e0887q8413o2752P8113L1082J79409N7090p6852j91533q7518o579L3635
$$ -50887 -139300 -202052 -123939 -92857 86552 143642 66790 -124743 -212261 -218840 -185205
16265a85205R8233j05996J49041J77994R120Q6672R2573R2472k08300j71208K3229
$$ -185205 -86972 -192968 -43927 134067 143187 229859 322432 414904 206604 35396 58625
16254E8625M8058j32474r3645N2641p370P6860l8091J2386K35978L3337M1003
$$ 58625 106683 -25791 -119436 -66795 -74165 2695 -35396 -23010 212968 246305 287308
16243B87308J0787L6441j08279p2019p8793K8383k91667j01430M3897K1756l4005
$$ 287308 298095 334536 226257 154238 75445 103828 -187839 -289269 -245372 -223616 -257621
16232b57621n7980K08745J05612j49864n9151J17525K05662m5963j89025P2364
$$ -257621 -315601 -106856 -1244 -151108 -210259 -92734 112928 66965 -122060 -49696
16222d9696P5737p9777n5074j10318O7419O2969J12206J2714o3535r8178J068
$$ -49696 26041 -53736 -108810 -219128 -151709 -88740 23466 36180 -27355 -125533 -124465
16211a24465k09792j75060K03021K75283N448q7687l8120m8822J25980N1872j03556
$$ -124465 -334257 -509317 -306296 -31013 -25565 -113252 -151372 -200194 -74214 -22342 -125898
16200a25898r6713l5377J87077J61092J71362j79041j42314o770P9397m0813n1318
$$ -125898 -222611 -257988 -70911 90181 261543 82502 -59812 -66582 12815 -27998 -79316
16189g9316Q5428M6064K8175p1887l0373o7622L11148P9132q253j33229j03812
$$ -79316 6112 52176 80351 8464 -21909 -89531 221617 300749 292496 159267 55455
16178E5455J50452J39646j23798J8607j87274j05038m8125J61691j05099j89118
$$ 55455 205907 345553 221755 240362 53088 -51950 -100075 61616 -43483 -232601
16168b32601K15823J74935R9916k34902j23192j978J09663O900m4742R2591m7021
$$ -232601 -16778 158157 258073 23171 -100021 -101999 7664 14564 -30178 62413 15392
16157A5392r1462Q757Q0788Q5202J41710q1494k8499P6781n0870j13760l6553
$$ 15392 -76070 -67313 13475 98677 240387 158893 130394 207175 156305 42545 5992
16146E992j06287l0627P6035M0788j14352p3192M8008o3282J25027K57522J31927
$$ 5992 -100295 -130922 -54887 -14099 -128451 -201643 -153635 -216917 -91890 165632 297559
16135B97559o0226j032K48073o4156r9759K0268k31369n8959n7050M7113j23514
$$ 297559 237333 236301 484374 420218 320459 340727 109358 50399 -6651 40462 -83052
16124h3052q6220J36087J42882r9624j65829J7561J14705O2796Q9155K2518M3392
$$ -83052 -169272 -33185 109697 10073 -155756 -138195 -23490 39306 128461 150979 194371
16113A94371J248N6155j34818N2120n078j35027r8740j2607P3036j0946j0009
$$ 194371 195619 251774 116956 169076 163998 28971 -69769 -82376 -9340 -20286 -30295
16102c0295M4114P138l1957J5075R7355P1890l4023l012k8592J0540j08091m6599
$$ -30295 13819 20957 -11000 4075 101430 173320 139297 136285 107693 118233 10142 -36457
16090c6457J55024j14595K1163J14300m44O8076j47985O2154o9336p7139L1443
$$ -36457 118567 3972 25135 139435 138991 207067 59082 121236 51900 -25239 6204
16079F204l7011m651m8873k8053j66874J19825R7704P4211l0031j1574o5103n3996
$$ 6204 -30807 -35458 -84331 -112384 -279258 -159433 -61729 12482 -17549 -29123 -94226 -148222
16067a48222K3577j08432k1526K8837J30787P9586J28146P6126j10157R4509q5519
$$ -148222 -124645 -233077 -254603 -225766 -94979 -15393 112753 188879 78722 173231 87712
16056H7712j38985K6801l1446O0175N413K271q3869J05739J0834L3483k7489o9002
$$ 87712 -51273 -24472 -55918 4257 9670 11941 -71928 33811 44645 78128 50639 -18363
16044a8363k19846n0323N4778J2274l5074J47694J10548M2380N9716p1144K1106
$$ -18363 -238209 -288532 -233754 -221480 -256554 -108860 1688 44068 103784 32640 53746
16033E3746l6018Q8590k3411k2439l3309O6133O8420K9672L4578l7822N2837J11694
$$ 53746 17728 106318 82907 60468 27159 93292 161712 191384 225962 188140 240977 352671
16021C52671q6361J31796p3421j15282R2038l0864j00514J8162r099j29794J4897
$$ 352671 266310 398106 324685 209403 301441 270577 170063 188225 179126 49332 64229
16010F4229P570n8310N8341M6081l279r0171j9739m8591O3855n6227J43720R365
$$ 64229 71799 13489 71830 117911 114632 24461 4722 -43869 19986 -36241 107479 116844
15998A16844j35252M6990K07877J05113k00550m2991Q9934R0229j37398n4695
$$ 116844 -18408 28582 236459 341572 141022 98031 187965 278194 140796 86101
15988H6101j6905P2994L4665M1365k00886j60751K47217J71843J27612j33555
$$ 86101 69196 142190 176855 218220 17334 -143417 103800 275643 403255 269700
15978B69700j94566j310j37917j19779j35792J01105J3006q5001k6426J24587
$$ 269700 75134 73824 -64093 -183872 -319664 -218559 -205553 -290554 -316980 -192393
15968a92393J23975J14327J9955M48J1781l2905j48904K04393J69972n5108k9866
$$ -192393 -68418 45909 65864 66312 78093 45188 -103716 100677 270649 215541 185675
15957A85675j6527m74j49349m7665m0556L177J14531j22970J5165J41182O1432
$$ 185675 169148 168674 19325 -28340 -68896 -65719 48812 -74158 -58993 82189 143621
15946A43621l8307m3977J744j7017q6356k7488k0781k50739l5159m6273K19615
$$ 143621 105314 61337 63081 46064 -40292 -67780 -88561 -339300 -374459 -420732 -201117
15935b01117J05384P019J01835R6727j38853O9102j09260j46638p6361L7106Q7116
$$ -201117 -95733 -88714 13121 109848 -29005 40097 -69163 -215801 -292162 -255056 -167940
15924a67940P1605l9857j55857J07665m9260J20796J7765j04542n3003P6238k9109
$$ -167940 -96335 -136192 -292049 -184384 -233644 -112848 -95083 -199625 -252628 -176390 -205499
15913b05499m5817N8569J53523k9521l5518j2821r6810j58294o1608K76649K75670
$$ -205499 -251316 -192747 -39224 -68745 -104263 -117084 -213894 -372188 -433796 -157147 118523
15902A18523K15094N3664O9829N4232j37009k54421j5363P2885J84591o2957N9740
$$ 118523 333617 387281 457110 511342 374333 119912 104549 177434 362025 299068 358808
15891C58808m7138j43670j3472J3586q2518K2893K7901J587O00P9764L6352l8492
$$ 358808 311670 168000 154528 168114 85596 108489 136390 137977 138577 218341 254693 216201
15879B16201j67367j33534l3938J21872J53476L4422O6812j2823L2373j14796
$$ 216201 48834 -84700 -118638 3234 156710 191132 257944 245121 277494 162698
15869A62698j96666p943P9628M9432l7245N8089K2986k2641k7059j07495j00699
$$ 162698 -33968 -41911 37717 87149 49904 107993 130979 108338 81279 -26216 -126915
15858a26915J89325L3925J33520O8j49362j57134q1427J78462j00460j32258N1381
$$ -126915 62410 96335 229855 229923 80561 -76573 -158000 20462 -79998 -212256 -160875
15847a60875P4759m0656J26183J45270p1399q0623J10787O231p2902J00797O3568
$$ -160875 -86116 -126772 -589 144681 73282 -7341 103446 109677 36775 137572 201140
15836B01140j91897j03571N2198J18619p689j61056j99476j30225J51620J96355
$$ 201140 9243 -94328 -42130 76489 68800 -92256 -291732 -421957 -270337 -73982
15826g3982J08943o9294L6950l2526M1385p4645j47215m0903r001M2529J86007
$$ -73982 34961 -34333 2617 -29909 11476 -63169 -210384 -251287 -260288 -217759 -31752
15815c1752N7182r1232M6481L1487M3467L8792Q4896j66666l70035J7131J76408
$$ -31752 25430 -65802 -19321 12166 55633 94425 179321 12655 -357380 -340249 -163841
15804a63841J80783K2192p5204R8882J08866J00256j3576r2104j6823o9954r6317
$$ -163841 16942 39134 -36070 62812 171678 271934 258358 166254 149431 79477 -16840
15793a6840r6025P718L1152j29986Q779n4943J04736Q6546p3712L5507J8517J09168
$$ -16840 -112865 -105147 -73995 -203981 -195202 -250145 -145409 -58863 -132575 -97068 -78551 30617
15781C0617L6483L2256p5838p1086l9179J51386J00388K6753M9903j25411j99567
$$ 30617 67100 99356 23518 -47568 -86747 64639 165027 191780 241683 116272 -83295
15770h3295L8110R1608m0307j23622J07468L690O9773P6011J8607K8817j11920
$$ -83295 -45185 46423 6116 -117506 -10038 -6348 63425 139436 158043 186860 74940
15759G4940p3459m7521k64573p8621P1208O1009J30854K27313j82480N5245m6577
$$ 74940 1481 -46040 -310613 -389234 -318026 -257017 -126163 101150 -81330 -26085 -72662
15748g2662j27794j11756N6056J5338K2568K08298J75511L4935n4855J9433j45387
$$ -72662 -200456 -312212 -256156 -240818 -218250 -9952 165559 200494 145639 165072 19685
15737A9685J7970J40781m6406j83621M3725k4527n1375P2066K46R2246O7725M3340
$$ 19685 37655 178436 132030 -51591 -7866 -32393 -83768 -11702 -11456 80790 148515 191855
15725A91855q5367l73119o746N2058L8656L4642L8976p626O3142R5957R6668k4590
$$ 191855 106488 -266631 -273377 -221319 -182663 -148021 -109045 -116671 -53529 42428 139096 114506
15713A14506j21793J67231n51q0928k26584J05965J22662J33283k7964q2423j7720
$$ 114506 -7287 159944 159393 78465 -148119 -42154 80508 213791 185827 103404 85684
15702H5684p8893j9736k8826j0504j4443r8301J99571p158m3884J2263M5049j5223
$$ 85684 6791 -12945 -41771 -52275 -66718 -165019 34552 27394 -16490 -4227 40822 25599
15690B5599M4336p6121l8562m8055L5846L0225J17673J30229j27706J7775J37402
$$ 25599 69935 -6186 -44748 -92803 -56957 -26732 90941 221170 93464 111239 248641
15679B48641J364k62760L0381j5316J3490j56238J30103Q6764k9998M7039J35012
$$ 248641 250005 -12755 17626 2310 15800 -140438 -10335 76429 46431 93470 228482
15668B28482j14268j02540p5900n9956m6470P065j81017Q6582J77012O1250P1551
$$ 228482 114214 11674 -64226 -124182 -170652 -163587 -344604 -258022 -81010 -19760 51791
15657E1791J06728K2137j81221j01266o8688J30378K20478j6903N0324n0915j16017
$$ 51791 158519 180656 -565 -101831 -170519 -40141 180337 163434 213758 162843 46826
15646D6826O3438n6494M6056Q948p7589j08249P4325K06553q1592o9119Q5177
$$ 46826 110264 53770 99826 108774 31185 -77064 -2739 203814 122222 53103 138280
15635A38280R543J0390o3315l4282J06378j8807n6115j90202j68052j9744J45045
$$ 138280 147823 158213 94898 60616 166994 148187 92072 -98130 -266182 -285926 -140881
15624a40881k15J01201r2136k430J84852J24182j34242j75376O2968K37003J8144
$$ -140881 -141096 -39895 -132031 -134461 50391 174573 40331 -135045 -72077 164926 183070
15613A83070l0104k4800n1956k8719N5941j2946k4218J00801R2171l3960o6603
$$ 183070 152966 128166 76210 47491 103432 90486 66268 167069 259240 225280 158677
15602A58677K9745O4860q3285q2460j52423K895Q3263J06814m2570n8879k0075
$$ 158677 188422 253282 169997 87537 -64886 -61991 21272 128086 85516 26637 6562
15591F562P883O6549m6207r0770J8887p7260K3752l1416j08969m1967L8562J44666
$$ 6562 14445 80994 34787 -55983 -37096 -114356 -90604 -122020 -230989 -272956 -234394 -89728
15579h9728J58682J02213o5758k4250j52480j39056Q7442j04929R7513R3303l1368
$$ -89728 68954 171167 105409 81159 -71321 -210377 -122935 -227864 -130351 -37048 -68416
15568f8416J42691L6968Q7843p2547m3889J3572J1528m3324J1587M3651O2073
$$ -68416 74275 111243 199086 126539 82650 96222 107750 64426 76013 119664 181737
15557A81737L3706j65338q7658R9215J9340N4039Q3163l3741j20964q8481k0273
$$ 181737 215443 50105 -37553 61662 81002 135041 218204 184463 63499 -24982 -45255
15546d5255N8204q1275j46233l3959R1026M0755m741R9409J33323J44832q352
$$ -45255 12949 -68326 -214559 -248518 -157492 -116737 -121478 -22069 111254 256086 247734
15535B47734m8111m140o564j01205q5261M0949N3107j07594N222P344r5653j68046
$$ 247734 199623 195483 188919 87714 2453 43402 96509 -11085 -5863 1481 -94172 -262218
15523b62218J11536J70220l4470n5765J37539Q2017j6732M2673K9854o9543p2886
$$ -262218 -150682 19538 -14932 -70697 66842 148859 132127 174800 204654 135111 62225
15512F2225P4890o9256o914o2391K3740J17308o0130p859m921q961m8517k44493
$$ 62225 137115 67859 60945 -1446 22294 139602 79472 71613 66692 57731 9214 -235279
15500b35279o3513R9612L9216K1666J46398j6719J3767J4589P6390l9012P5908
$$ -235279 -298792 -199180 -159964 -138298 8100 -8619 5148 19737 96127 57115 133023
15489A33023j32185j33804P741P8288q2015j41762J6140m6934j5948O6407J89893
$$ 133023 838 -132966 -125225 -46937 -128952 -270714 -254574 -301508 -317456 -251049 -61156
15478f1156n2008j57822m8165J76460j12002j42642J32369J43127J73083N856
$$ -61156 -113164 -270986 -319151 -142691 -254693 -397335 -264966 -121839 51244 57100
15468E7100j9069r9198j38673m4563J32028J13763n3821O4595J5976N8975q8405
$$ 57100 38031 -61167 -199840 -244403 -112375 1388 -52433 12162 28138 87113 -1292
15457a292p249k0327J46777J9666r9749P6047j33506r5463L6625l362O9891J8319
$$ -1292 -8541 -28868 117909 137575 37826 113873 -19633 -115096 -78471 -81833 -11942 6377
15445F377L0486R9596n7356J06554R8100j40522k43615N1414J62619j1298R9966
$$ 6377 36863 136459 79103 185657 283757 143235 -100380 -48966 113653 102355 202321
15434B02321k9553j11448j17508k1719J02292L7526j7281j37494r1442j9803O1617
$$ 202321 172768 61320 -56188 -77907 24385 61911 44630 -92864 -184306 -204109 -142492
15423a42492p2377o0976N9191o8663J02491J77108k8226j04502J55571j12227
$$ -142492 -214869 -275845 -216654 -285317 -182826 -5718 -33944 -138446 17125 -95102
15413i5102J4357J30151J31853j8912P774R9327q9022j24191j43403k02188J6524
$$ -95102 -80745 49406 181259 162347 170121 269448 180426 56235 -87168 -289356 -272832
15402b72832j40868j07478M6221J21686L1209K24166J43486n7335M5514J02155
$$ -272832 -413700 -521178 -474957 -353271 -322062 -97896 45590 -11745 33769 135924
15392A35924N1309L4491j68756j44778K6569o2900P7753L5841n0102p3148n7480
$$ 135924 187233 221724 52968 -91810 -65241 -128141 -50388 -14547 -64649 -137797 -195277
15381a95277J03480N5895R3829O9218j1417J27573j73419j15709j7214J24205
$$ -195277 -91797 -35902 57927 127145 115728 243301 69882 -45827 -63041 61164
15371F1164J22447m0383k37642K4503j61946O4301j5984l1427j5828K0893K2602
$$ 61164 183611 143228 -94414 -69911 -231857 -167556 -183540 -214967 -230795 -209902 -187300
15360a87300j291k2887n1851m0050J42888J80860m9098J3315M5569N7466M0965
$$ -187300 -188591 -211478 -263329 -303379 -160491 20369 -28729 -15414 30155 87621 128586
15349A28586j42724j06811Q3033J23792k3140p1592r1670o484j66639J8426J35109
$$ 128586 -14138 -120949 -37916 85876 62736 -8856 -100526 -107010 -273649 -255223 -120114
15338a20114J35012n1349m240o599J33254Q2697m3631j41896k19080j16062J69822
$$ -120114 14898 -36451 -40691 -47290 85964 168661 125030 -16866 -235946 -352008 -182186
15327a82186K85890P4684N1119M27M6067j09272n4822q6077k06074J08822K45019
$$ -182186 103704 178388 229507 229934 276001 166729 111907 25830 -180244 -71422 173597
15316A73597J36286n2683j76050k6190p257j74547J7059O6778L5713J11465J2180
$$ 173597 309883 257200 81150 54960 47703 -126844 -109785 -43007 -7294 104171 116351
15305A16351l1552q3575L8361K70208k9387k13563p4393R1976k9592j33267n6518
$$ 116351 84799 1224 39585 309793 280406 66843 -7550 84426 54834 -78433 -134951
15294a34951Q3665O563l0877L2219K31066q3324j04457O779k6183p481m968P0386
$$ -134951 -51286 -44723 -75600 -43381 187685 104361 -96 6683 -19500 -26981 -31949 38437
15282C8437k837j41921J24911J6867R3069K20294K8941j54326n5539n3631m4578
$$ 38437 35600 -106321 18590 35457 128526 348820 377761 223435 167896 114265 69687
15271F9687K2984j12247k14984P6184J70486M8444p1360J81082R4050J721k06397
$$ 69687 92671 -19576 -234560 -158376 12110 60554 -10806 170276 264326 266047 59650
15260E9650k54747j6774J00502J2026L8216M0351j8916o9811L1882j06130j00096
$$ 59650 -195097 -211871 -111369 -99343 -61127 -20776 -39692 -109503 -77621 -183751 -283847
15249b83847m3278M8854m382o670L5375K02809j592R075o8645j42683J11129q0118
$$ -283847 -327125 -278271 -282653 -289323 -253948 -51139 -52731 -43656 -112301 -254984 -143855 -223973
15237b23973o4034M9801J75782N2867j65842j54393J44857J56626M5883j64065
$$ -223973 -288007 -238206 -62424 -9557 -175399 -329792 -184935 -28309 17574 -146491
15227a46491M1175M1288j16244r8126J9601K20144J18399j89556j83711O6751
$$ -146491 -105316 -64028 -180272 -278398 -258797 -38653 79746 -109810 -293521 -226770
15217b26770J57085O5450N0978l6989l6684K1665O0411R5915k210p1483p109n5411
$$ -226770 -69685 -4235 46743 9754 -26930 -5265 55146 151061 148851 77368 70259 14848
15205A4848N4276j8252M5454N7795J1398P3480q4740k08940j2948R2290Q5088
$$ 14848 69124 50872 96326 154121 165519 238999 154259 -54681 -67629 24661 109749
15194A09749j09330j09464j00027L5191J22980m64k18646p6812N1076J49468L695
$$ 109749 419 -109045 -209072 -173881 -50901 -51365 -270011 -346823 -295747 -146279 -142584
15183a42584J12805M1051K9784K6580k2298q6212K6521J65478L6147k29961r4617
$$ -142584 -29779 11272 41056 67636 45338 -40874 -14353 151125 187272 -42689 -137306
15172a37306k6218l472P4795Q5974k2964j26175j0003R6554R1774o1834j0758
$$ -137306 -163524 -166996 -92201 -6227 -29191 -155366 -165369 -68815 22959 -38875 -49633
15161d9633J35774J82697r9879J3417K6694j87932j71577j409L3929J47361J16782
$$ -49633 86141 268838 168959 182376 209070 21138 -150439 -151848 -117919 29442 146224
15150A46224J17462M1899l0184q8717l1045j2727q1730n8107N9871j805j38512
$$ 146224 263686 305585 275401 186684 155639 142912 61182 3075 62946 61141 -77371
15139g7371m8892J25088j6330J9573P9950j0985j61402j51889K9570J64968Q0742
$$ -77371 -126263 -1175 -17505 2068 82018 71033 -90369 -242258 -212688 -47720 33022
15128C3022P9401r624O9394p5065j02144R0215O8732J11424M906j20458o0627
$$ 33022 112423 102799 172193 97128 -5016 85199 153931 265355 270261 149803 89176
15117H9176r6744j14461j14683n9930J90929Q4810Q0966j80629o6256J17443K5572
$$ 89176 -7568 -122029 -236712 -296642 -105713 -20903 60063 -120566 -186822 -69379 -43807
15106d3807o3516q3602R2960J32820R6040p3599j4195M4778K0250R7888j11814
$$ -43807 -107323 -190925 -97965 34855 130895 57296 43101 87879 108129 206017 94203
15095I4203k6078p4156m6618O7335j29178p017J71360J1675M6443P3167n1926
$$ 94203 68125 -6031 -52649 14686 -114492 -121509 49851 61526 107969 181136 129210
15084A29210r4866j14590J38741J22302Q7064j82314m5954m3068J06158r0528
$$ 129210 34344 -80246 58495 180797 267861 85547 39593 -3475 102683 12155
15074A2155p5730j530l2121J25018j51566j08913J31237K59019l599r1037m2906
$$ 12155 -63575 -65105 -97226 27792 -123774 -232687 -101450 157569 153970 62933 20027
15063B0027O6998j27215l4068P5273k0071j14913J32430O5941P5309r3249L873
$$ 20027 87025 -40190 -74258 1015 -19056 -133969 -1539 64402 139711 46462 50335
15052E0335n6789m5435q3352J43816K36242l1772q8948p4936N6101j36184l2471
$$ 50335 -6454 -51889 -135241 8575 244817 213045 124097 49161 105262 -30922 -63393
15041f3393N1116k5123J91026N1503r7851N9926J02418j14495q5640j5650k60901
$$ -63393 -12277 -37400 153626 205129 107278 167204 269622 155127 69487 53837 -207064
15030b07064l14216P601L18370K83147R0482J20389j10394j05438j9935Q7481
$$ -207064 -521280 -513679 -195309 87838 178320 298709 188315 82877 62942 150423
15020A50423O430P1084j0057l8843p1108P8105r3191j09101R3418K19447j22069
$$ 150423 156853 227937 217880 179037 107929 186034 92843 -16258 77160 296607 174538
15009A74538J8167J60387O5067j89301j70323l539r4868r1286k7701J84372n1240
$$ 174538 192705 353092 418159 228858 58535 54996 -39872 -131158 -158859 25513 -25727
14998b5727j7989j19200R8145K5738k7159r759J29411J4564p168J9209m7454q5548
$$ -25727 -43716 -162916 -64771 -39033 -66192 -75951 53460 68024 60856 80065 32611 -52937
14986e2937l4424J06605R1205Q8658n4783L5000q9971J6202k6736q2243k0382
$$ -52937 -87361 19244 110449 199107 144324 179324 89353 105555 78819 -3424 -23806
14975b3806J74875J31676l0574k17646k47568n2746K44702K12498j11749k05145
$$ -23806 151069 282745 252171 34525 -213043 -265789 -21087 191411 79662 -125483
14965a25483J25745J08561r6105o8767j54897o7515J83869J60434M107l6323M7919
$$ -125483 262 108823 12718 -56049 -210946 -278461 -94592 65842 69949 33626 81545
14954H1545r9439M21R9436j64787j17212j7211J60221R0498P9783R124O603J06069
$$ 81545 -17894 -17473 81963 -82824 -200036 -217247 -57026 33472 113255 122379 128982 235051
14942B35051k8436m4746j16373j26200O7180j4774K32022Q46j57109o003q327
$$ 235051 206615 161869 45496 -80704 -13524 -28298 203724 204570 47461 41458 33131
14931C3131j43573p2638P2331Q7145J69844L7496l807l7835J47635l1101j55489
$$ 33131 -110442 -183080 -110749 -23604 146240 183736 179929 142094 289729 258628 103139
14920A03139p588J07835R4067o1503n8645L6737m0239k31607Q5692K02180o15
$$ 103139 95551 203386 297453 235950 177305 214042 173803 -57804 27888 230068 229453
14909B29453K0812K2631p1885j48979k30421j24889L8909O3666j2579j44026J1529
$$ 229453 250265 272896 201011 52032 -178389 -303278 -264369 -200703 -213282 -357308 -345779
14898c45779m4106P0766J50880R9320n5055L2004J05339J62674K3721j67861l5718
$$ -345779 -389885 -319119 -168239 -68919 -123974 -91970 13369 176043 199764 31903 -3815
14887c815o5796n9603J95148P5576j33190j50478k1591m5753Q3597J5528J2146
$$ -3815 -69611 -129214 65934 141510 8320 -142158 -163749 -209502 -125905 -110377 -98231
14876i8231Q1401K14995L9478n4230r1799j64355q333P0939n3299j45478n6477
$$ -98231 -16830 198165 237643 183413 91614 -72741 -81074 -10135 -63434 -208912 -265389
14865b65389M4710j8150l7116j14743J33661J09437M4053J38211o1928j04022
$$ -265389 -220679 -238829 -275945 -390688 -257027 -147590 -103537 34674 -27254 -131276
14855a31276J04014K3747J62001J01257N6735k0026j32670m5881R4192J3364p875
$$ -131276 -27262 -3515 158486 259743 316478 296452 163782 117901 212093 225457 217582
14844B17582O6702M9304n8806r1534p6915j21651n1505M6003Q8745o2784q5089
$$ 217582 284284 333588 274782 183248 106333 -15318 -66823 -20820 67925 5141 -79948
14833g9948J81358n2984l8558O0073j19896m5505J7515O7581o941J13004K54995
$$ -79948 101410 48426 9868 69941 -49955 -95460 -77945 -10364 -17305 95699 350694
14822C50694o9110j77032k074P8636j13104k56962J8165K08293L5495k1609N9308
$$ 350694 281584 104552 102478 181114 68010 -188952 -170787 37506 73001 51392 110700
14811A10700j09145l1434n8310O5893K0590p2238n5722J48420J22714p1169j46933
$$ 110700 1555 -29879 -88189 -22296 -1706 -73944 -129666 18754 141468 70299 -76634
14800g6634J8449m397o6868k4969J08358Q3980l1926l8907K3537q8763L2528J48784
$$ -76634 -58185 -62582 -129450 -154419 -46061 37919 5993 -32914 -9377 -98140 -65612 83172
14788H3172j819J575k9193j37953k0196J98343J08017m4248k53674k8498J38483
$$ 83172 81353 82928 53735 -84218 -104414 93929 201946 157698 -95976 -124474 14009
14777A4009J84394j42398j21627j0980j20528N7358J68268K5520O1893N282j37548
$$ 14009 198403 56005 -65622 -76602 -197130 -139772 28496 54016 115909 121191 -16357
$$ [...]
##END NTUPLES=NMR SPECTRUM
##END=
