##TITLE=Analysis number 322720
Compound Code btb 12976
Project Code adrs
Chemist Name fudan
##JCAMPDX= 6.0         $$ Bruker NMR JCAMP-DX V2.0
##DATA TYPE= NMR SPECTRUM
##DATA CLASS= NTUPLES
##ORIGIN= Bruker BioSpin GmbH
##OWNER= nmr
$$ XWIN-NMR		Version 3.5
$$ Sat Oct 14 10:59:15 2006 GMT Daylight Time (UT+1h)  MAYBRIDGE\nmr@NMR_250MHZ
##.OBSERVE FREQUENCY= 250.131544655141
##.OBSERVE NUCLEUS= ^1H
##.ACQUISITION MODE= SIMULTANEOUS (DQD)
##.ACQUISITION SCHEME= undefined
##.AVERAGES= 16
##.DIGITISER RES= 18
##SPECTROMETER/DATA SYSTEM= dpx250
##.PULSE SEQUENCE= zg30
##.SOLVENT NAME= DMSO
##.SHIFT REFERENCE= (INTERNAL, DMSO, 0, 16.522)
##AUDIT TRAIL= $$ (NUMBER, WHEN, WHO, WHERE, WHAT)
$$ ##TITLE= Audit trail, XWIN-NMR		Version 3.5
$$ ##JCAMPDX= 5.01
$$ ##ORIGIN= Bruker BioSpin GmbH
$$ ##OWNER= nmr
$$ C:\u/data/dgb/nmr/ADRS/260/pdata/1/auditp.txt
$$ ##AUDIT TRAIL=  $$ (NUMBER, WHEN, WHO, WHERE, WHAT)
(   1,<2006-10-14 10:58:52.74 +100>,<MAYBRIDGE\nmr>,<NMR_250MHZ>,
      <created by zg, POWCHK disabled, PULCHK disabled
       configuration hash MD5:
       49 4B E0 1D 92 C2 6B 37 9F E6 65 BC 52 41 86 1D
       data hash MD5: 64K
       95 9B 47 9F AC 87 0E 07 3A 53 2D C8 EF 0E 29 82>)
(   2,<2006-10-14 10:59:04.81 +100>,<MAYBRIDGE\nmr>,<NMR_250MHZ>,
      <Start of raw data processing
       ef LB = 0.3 FT_mod = 6 PKNL = 1 SI = 32K 
       data hash MD5: 32K
       92 B5 AD 27 10 27 49 E5 81 F4 35 18 5C 9A C6 D4>)
(   3,<2006-10-14 10:59:06.37 +100>,<MAYBRIDGE\nmr>,<NMR_250MHZ>,
      <apk 
       data hash MD5: 32K
       A0 63 C4 00 7E 21 24 38 DF 59 D3 E4 6A A4 35 05>)
(   4,<2006-10-14 10:59:07.15 +100>,<MAYBRIDGE\nmr>,<NMR_250MHZ>,
      <abs ABSG = 5 
       data hash MD5: 32K
       1F 0E 33 99 6E FB 93 89 5A 4D C3 FF 71 4E CA A7>)
$$ ##END=
$$ 
$$ hash MD5
$$ 92 89 2D 2D 60 A6 06 D5 78 B8 A4 37 D6 0C 89 BE
##$RELAX= 
##$RELAX= 
##$RELAX= 
##$RELAX= 
##$RELAX= 
##$RELAX= 
##$RELAX= 
$$ Bruker specific parameters
$$ --------------------------
##$DU= <C:\u>
##$EXPNO= 260
##$NAME= <ADRS>
##$PROCNO= 1
##$TYPE= <nmr>
##$USER= <dgb>
##$AMP= (0..31)
100 100 100 100 100 100 100 100 100 100 100 100 100 100 100 100 100 100 
100 100 100 100 100 100 100 100 100 100 100 100 100 100 
##$AQSEQ= 0
##$AQ_mod= 3
##$AUNM= <au_zg>
##$AUTOPOS= <3 >
##$BF1= 250.13
##$BF2= 250.13
##$BF3= 250.13
##$BF4= 250.13
##$BF5= 500.13
##$BF6= 500.13
##$BF7= 500.13
##$BF8= 500.13
##$BYTORDA= 1
##$CFDGTYP= 0
##$CFRGTYP= 5
##$CHEMSTR= <none>
##$CNST= (0..31)
1 1 145 1 1 1 1 1 1 1 1 1 1 1 1 1 1 1 1 1 1 1 1 1 1 1 1 1 1 1 1 1 
##$CPDPRG= <>
##$CPDPRG1= <>
##$CPDPRG2= <>
##$CPDPRG3= <>
##$CPDPRG4= <mlev>
##$CPDPRG5= <mlev>
##$CPDPRG6= <mlev>
##$CPDPRG7= <mlev>
##$CPDPRG8= <mlev>
##$CPDPRGB= <>
##$CPDPRGT= <>
##$D= (0..31)
0 1 0 0 0 0 0 0 0 0.06 0 0 0 0 0 0 0.0002 0 0 0 0 0 0 0 0 0 0 0 0 0 0 
0 
##$DATE= 1160819931
##$DBL= (0..7)
120 120 120 120 120 120 120 120 
##$DBP= (0..7)
150 150 150 150 150 150 150 150 
##$DBP07= 0
##$DBPNAM0= <>
##$DBPNAM1= <>
##$DBPNAM2= <>
##$DBPNAM3= <>
$$ [...]
##$SUBNAM7= <"">
##$SUBNAM8= <"">
##$SUBNAM9= <"">
##$SW= 20.6930455092707
##$SWIBOX= (0..15)
0 0 3 0 0 0 0 0 0 0 0 0 0 0 0 0 
##$SW_h= 5175.983436853
##$TD= 65536
##$TD0= 1
##$TE= 683.16
##$TE2= 300
##$TE3= 300
##$TEG= 300
##$TL= (0..7)
0 120 120 120 120 120 120 120 
##$TP= (0..7)
150 150 150 150 150 150 150 150 
##$TP07= 0
##$TPNAME0= <>
##$TPNAME1= <>
##$TPNAME2= <>
##$TPNAME3= <>
##$TPNAME4= <>
##$TPNAME5= <>
##$TPNAME6= <>
##$TPNAME7= <>
##$TPOAL= (0..7)
0.5 0.5 0.5 0.5 0.5 0.5 0.5 0.5 
##$TPOFFS= (0..7)
0 0 0 0 0 0 0 0 
##$TUNHIN= 0
##$TUNHOUT= 0
##$TUNXOUT= 0
##$USERA1= <user>
##$USERA2= <user>
##$USERA3= <user>
##$USERA4= <user>
##$USERA5= <user>
##$V9= 5
##$VALIST= <valist>
##$VCLIST= <CCCCCCCCCCCCCCC>
##$VD= 0
##$VDLIST= <DDDDDDDDDDDDDDD>
##$VPLIST= <PPPPPPPPPPPPPPP>
##$VTLIST= <TTTTTTTTTTTTTTT>
##$WBST= 1024
##$WBSW= 4
##$XGAIN= (0..3)
0 0 0 0 
##$XL= 0
##$YL= 0
##$YMAX_a= 440433
##$YMIN_a= -294554
##$ZGOPTNS= <>
##$ZL1= 120
##$ZL2= 120
##$ZL3= 120
##$ZL4= 120
##$ABSF1= 16.522
##$ABSF2= -4.171173
##$ABSG= 5
##$ABSL= 3
##$ALPHA= 0
##$AQORDER= 0
##$ASSFAC= 0
##$ASSFACI= 0
##$ASSFACX= 0
##$ASSWID= 0
##$AUNMP= <proc_1d>
##$AZFE= 0.1
##$AZFW= 0.1
##$BCFW= 0
##$BC_mod= 0
##$BYTORDP= 0
##$COROFFS= 0
##$CY= 12.5
##$DATMOD= 1
##$DC= 0
##$DFILT= <>
##$DTYPP= 0
##$F1P= 14.0000005364418
##$F2P= -0.99999901652339
##$FCOR= 0.5
##$FTSIZE= 32768
##$FT_mod= 6
##$GAMMA= 0
##$GB= 0
##$INTBC= 1
##$INTSCL= 1
##$ISEN= 128
##$LB= 0.3
##$LEV0= 0
##$LPBIN= 0
##$MAXI= 10000
##$MC2= 0
##$MEAN= 0
##$ME_mod= 0
##$MI= 0
##$NCOEF= 0
##$NC_proc= -5
##$NLEV= 6
##$NOISF1= 0
##$NOISF2= 0
##$NSP= 0
##$NTH_PI= 0
##$NZP= 0
##$OFFSET= 16.522
##$PC= 1
##$PHC0= -48.49971
##$PHC1= 11.58787
##$PH_mod= 1
##$PKNL= yes
##$PPARMOD= 0
##$PSCAL= 4
##$PSIGN= 0
##$REVERSE= no
##$SF= 250.13
##$SI= 32768
##$SIGF1= 0
##$SIGF2= 0
##$SINO= 400
##$SIOLD= 32768
##$SREGLST= <1H.DMSO>
##$SSB= 0
##$STSI= 32768
##$STSR= 0
##$SW_p= 5175.98343685301
##$SYMM= 0
##$S_DEV= 0
##$TDeff= 65536
##$TDoff= 0
##$TI= <Analysis number 999999
Compound Code 99
Book Reference 9
Project Code 9>
##$TILT= no
##$TM1= 0
##$TM2= 0
##$TOPLEV= 0
##$USERP1= <user>
##$USERP2= <user>
##$USERP3= <user>
##$USERP4= <user>
##$USERP5= <user>
##$WDW= 1
##$XDIM= 32768
##$YMAX_p= 346951452
##$YMIN_p= -973916
$$ End of Bruker specific parameters
$$ ---------------------------------
##NTUPLES= NMR SPECTRUM
##VAR_NAME=  FREQUENCY,     SPECTRUM/REAL,   SPECTRUM/IMAG
##SYMBOL=    X,             R,               I
##VAR_TYPE=  INDEPENDENT,   DEPENDENT,       DEPENDENT
##VAR_FORM=  AFFN,          ASDF,            ASDF
##VAR_DIM=   32768,         32768,           32768
##UNITS=     HZ,            ARBITRARY UNITS, ARBITRARY UNITS
##FACTOR=    0.157963299565203, 1,           1
##FIRST=     4132.6476996994, 0,             0
##LAST=      -1043.33573715361, 0,           0
##MIN=       -1043.33573715361, -973916,     0
##MAX=       4132.6476996994, 346951452,     0
$$ Real data points
##PAGE= N=1
##DATA TABLE= (X++(R..R)), XYDATA
$$ [...]
$$ plain form
23125 -163866 19003 174278 140774 6400 -153266 -362008 -192557 -153044 -161465 -245776
23115 -245776 -250999 -163633 -219116 -105303 107042 296471 301015 338381 472374 476097 439002
23104 439002 190968 -131515 -327305 -281374 -198421 127441 198308 185464 -133534 -209488
23094 -209488 13582 44093 -31640 -230583 -196561 -291411 -240185 -276884 -296036 -160109 -109663
23083 -109663 -100985 -219400 -113949 -3703 -93862 -26976 -48274 -186135 -211821 -104771 -140528
23072 -140528 -197665 -118106 -94590 -167693 -492137 -437818 -291053 -496160 -409957 -114902 -78820
23061 -78820 -9844 231591 243983 119612 147327 193276 309160 254546 278395 622888 439399
23050 439399 270241 237659 -17729 -90510 -203003 -176264 -9859 208134 141332 32608
$$ packed form
23125a63866J82869J55275l3504j34374j59666k08742J69451L9513q421q4311
23115b45776n223Q7366n5483J13813K12345J89429M544L7366J33993L723l7095
23104D39002k48034l22483j95790M5931Q2953L25862P0867j2844l18998p5954
23094b09488K23070L0511p5733j98943L4022r4850N1226l6699j9152J35927N0446
23083a09663Q678j18415J05451J10246r0159O6886k1298j37861k5686J07050l5757
23072a40528n7137P9559K3516p3103l24444N4319J46765k05107Q6203K95055L6082
23061g8820O8976K41435J2392j24371K7715M5949J15884n4614K3849L44493j83489
23050D39399j69158l2582k55388p2781j12493K6739J66405K17993o6802j08724
$$ plain form
23040 32608 -16344 100178 132191 59121 116255 -17683 23249 -56471 -129754 -63159 6619
23029 6619 55344 105166 -44562 58172 -6330 -210567 -198817 -162298 -242652 -389250 -380353
23018 -380353 -414034 -109193 -166480 -50677 -306478 -540768 -631359 -655663 -482558 -113820
23008 -113820 93513 23125 40394 40739 14312 51680 -52727 117159 120959 35152 -10945
22997 -10945 167356 106357 69262 112988 59152 -87944 -46721 52221 41568 66795 -224369
22986 -224369 -230256 -113939 285366 300267 137919 177338 -55111 -187481 -355186 -515849
22976 -515849 -335114 -109039 -49813 -79008 -44883 -101897 65842 106470 95840 122377 180315
22965 180315 -30799 -92687 -149917 41799 260425 468498 449037 311452 172588 159026
$$ packed form
23040C2608m8952J16522L2013p3070N7134j33938M0932p9720p3283O6595O9778
23029F619M8725M9822j49728J02734o4502k04237J1750L6519q0354j46598Q897
23018c80353l3681L04841n7287J15803k55801k34290r0591k4304J73105L68738
23008a13820K07333p0388J7269L45k6427L7368j04407J69886L800q5807m6097
22997a0945J78301o0999l7095M3726n3836j47096M1223R8942j0653K5227k91164
22986b24369n887J16317L99305J4901j62348L9419k32449j32370j67705j60663
22976e15849J80735K26075N9226k9195L4125n7014J67739M0628j0630K6537N7938
22965A80315k11114o1888n7230J91716K18626K08073j9461j37585j38864j3562
$$ plain form
22955 159026 197960 173581 144851 98074 13322 -8802 61642 274800 311139 304517 305672 119135
22943 119135 8431 16843 -546 -139243 -186698 -51297 -186580 -246197 -73396 -53471 -130122
22932 -130122 -418085 -511054 -588643 -488238 -232615 -276306 -230210 -179746 -70853 -201466
22922 -201466 -310855 -401393 -551109 -598231 -527811 -218027 -81717 -182496 -332247 -132194
22912 -132194 198617 -24208 -221627 -171515 -93161 -161132 194778 11959 63473 211455
22902 211455 222064 128182 150414 40687 -27692 -71096 -13163 133716 -119462 16263 51400
22891 51400 -206902 -164908 43715 -28923 46175 27745 -37203 -138280 -264290 -321521 -155568
22880 -155568 22420 -176737 -183076 -248619 -232731 -255592 -166284 -218169 -417180 -270239 53241
$$ packed form
22955A59026L8934k4379k8730m6777q4752k2124P0444K13158L6339o622J155j86537
22943A19135j10704Q412j7389j38697m7455J35401j35283n9617J72801J9925p6651
22932a30122k87963r2969p7589J00405K55623m3691M6096N0464J08893j30613
22922b01466j09389r0538j49716m7122P0420L09784J36310j00779j49751K00053
22912a32194L30811k22825j97419N0112P8354o7971L55910j82819N1514J47982
22902B11455J0609r3882K2232j09727o8379m3404N7933J46879k53178J35725L5137
22891E1400k58302M1994K08623p2638P5098j8430o4948j01077j26010n7231J65953
22880a55568J77988j99157o339o5543J5888k2861Q9308n1885j99011J46941L23480
$$ plain form
22869 53241 36636 -333313 -182212 160228 155120 -97900 -229885 -106998 -259831 -482453
22859 -482453 -183916 38390 5825 -201278 -300279 -131098 25936 98598 209212 256535
22849 256535 27176 -271838 -389820 -26568 124549 59109 -28556 -8420 -261573 -388403
22839 -388403 -428342 -277668 -234337 -249404 -123985 99131 310153 32225 -300180 -183673
22829 -183673 -195583 -188318 -96693 -163216 -340170 -284171 10309 208736 146433 -146007 -294964
22818 -294964 -65551 139984 414573 147525 -166487 -478924 -746975 -596411 -193853 -1273
22808 -1273 6480 -185371 -74834 -190165 -275372 -498 149251 212691 136612 -65230 -257918
22797 -257918 -284984 -244732 -296197 -169677 -344149 -187814 96927 93195 -40232 -2542 -8779
$$ packed form
22869E3241j6605l69949J51101L42440n108k53020j31985J22887j52833k22622
22859d82453K98537K22306l2565k07103r9001J69181J57034P2662J10614M7323
22849B56535k29359k99014j17982L63252J51117o5440q7665K0136k53153j26830
22839c88403l9939J50674M3331j5067J25419K23116K11022k77928l32405J16507
22829a83673j1910P265R1625o6523j76954N5999K94480J98427o2303k92440j48957
22818b94964K29413K05535K74589k67048l14012l12437k68051J50564M02558J92580
22808a273P753j91851J10537j15331q5207K74874J49749O3440p6079k01842j92688
22797b57918k7066M0252n1465J26520j74472J56335K84741l732j33427L7690o237
$$ plain form
22786 -8779 148329 137725 -147243 -334113 -324640 -218408 -256290 -190402 -171198 88251 182217
22775 182217 -168899 -603547 -745944 -392194 -248342 -390420 -334818 -393568 -351784 -445599
22765 -445599 -414653 -217101 7179 72084 -43454 -16273 -16930 91267 47448 -133184 -170007
22754 -170007 -6364 -42286 -75925 -10939 191489 299354 275187 256927 122582 126481 -77663
22743 -77663 -86245 234839 370680 95809 -63518 28037 159808 151378 -37599 -262231 -258673
22732 -258673 -193741 -93914 -54911 -44925 -114979 53805 -54336 -327904 -82976 31604 -56206
22721 -56206 -238128 -60212 -95894 -320826 -309234 -109357 -77052 151144 178890 36529
22711 36529 -163181 -286986 -210328 -83354 -62327 39525 233970 202170 -28401 -441257
$$ packed form
22786h779J57108j0604k84968j86870R473J06232l7882O5888J9204K59449R3966
22775A82217l51116m34648j42397L53750J43852j42078N5602n8750M1784r3815
22765d45599L0946J97552K24280O4905j15538K7181o57J08197m3819j80632l6823
22754a70007J63643l5922l3639O4986K02428J07865k4167j8260j34345L899k04144
22743g7663q582L21084J35841k74871j59327R1555J31771q430j88977k24632L558
22732b58673O4932R9827L9003R986p0054J68784j08141k73568K44928J14580q7810
22721e6206j81922J77916l5682k24932J1592J99877L2305K28196K7746j42361
22711C6529j99710j23805P6658J26974K1027J01852J94445l1800k30571m12856
$$ plain form
22701 -441257 -619853 -645887 -597532 -328728 -79438 17407 101874 28344 51257 25656 -43063
22690 -43063 -915 99573 -41578 -19281 -37713 -25995 6174 132366 242508 426525 455778
22679 455778 354246 175087 -42428 -167847 -170128 -21190 215793 8700 -31884 -5986
22669 -5986 -66839 -113724 -128755 -123823 -148458 -164463 -225773 236898 72472 -158817 133185
22658 133185 244212 3920 -190189 -192923 -125123 -200636 -145294 -177649 -215649 -247326 -246445
22647 -246445 -257597 -80581 21668 50837 130338 164162 87410 173308 136136 -71741 -5379
22636 -5379 90788 96687 23970 -226826 -189260 -136041 -228915 -205484 -244594 -361738 -100991
22625 -100991 -245690 -208334 -100946 22083 292461 383425 287709 198837 225793 293005 -24572
$$ packed form
22701d41257j78596k6034M8355K68804K49290R6845Q4467p3530K2913k5601o8719
22690d3063M2148J00488j41151K2297j8432J1718L2169J26192J10142J84017K9253
22679D55778j01532j79159k17515j25419k281J48938K36983k07093m0584K5898
22669e986o0853m6885j5031M932k4635j6005o1310M62671j64426k31289K92002
22658A33185J11027k40292j94109k734O7800p5513N5342l2355l8000l1677Q81
22647b46445j1152J77016J02249K9169P9501L3824p6752Q5898l7172k07877O6362
22636e379R6167N899p2717k50796L7566N3219r2874K3431l9110j17144K60747
22625a00991j44699L7356J07388J23029K70378R0964r5716q8872K6956O7212l17577
$$ plain form
22614 -24572 -244655 -106621 155985 386261 489156 165961 -195599 -130363 -56558 -158571
22604 -158571 -48135 183032 300838 108909 152503 131492 136845 212285 337884 137322
22594 137322 -75225 -349247 -373571 -459291 -405844 -516016 -271649 74425 160285 166619 195495
22583 195495 283851 64086 -101952 -37053 -140817 -273565 -394134 -419543 -311204 38835
22573 38835 193793 151176 54167 -95085 -102497 -10468 -140237 3944 -8619 -16038 -214418
22562 -214418 -312150 -108741 -84303 -161425 -101914 66630 -78154 -351466 -456248 -316785
22552 -316785 -207295 -310779 -127642 21304 48033 49950 116920 160779 68895 -76932 126431
22541 126431 241028 151136 68072 137956 -97080 -33036 127163 196719 55160 118142 265535
$$ packed form
22614b4572k20083J38034K62606K30276J02895l23195l61560O5236P3805j02013
22604a58571J10436K31167J17806j91929M3594k1011N353P5440J25599k00562
22594A37322k12547k74022k4324q5720N3447j10172K44367L46074Q5860O334K8876
22583A95495Q8356k19765j66038O4899j03764j32748j20569k5409J08339L50039
22573C8835J54958m2617r7009j49252p412R2029j29769J44181j2563p419j98380
22562b14418r7732K03409K4438p7122N9511J68544j44784k73312j04782J39463
22552c16785J09490j03484J83137J48946K6729J917O6970M3859r1884j45827K03363
22541A26431J14597q9892q3064O9884k35036O4044J60199O9556j41559O2982J47393
$$ plain form
22530 265535 346839 451160 341724 111456 -204996 -303019 -147749 -37323 -158110 -258413
22520 -258413 -144558 -214620 -127809 71106 -56778 -437839 -482136 -371619 -131934 54316
22510 54316 151470 112833 175483 226683 107203 -106251 -373031 -590571 -446209 -387383 -443793
22499 -443793 -214366 33385 -71000 -303122 -323867 -101999 -124703 -410630 -575380 -545360
22489 -545360 -209506 -72917 -139543 -315922 -336774 -249393 -177992 20738 167532 72226
22479 72226 -31472 -76426 -48839 -157438 -226064 -96436 -112353 -376888 -466108 -151483 163624
22468 163624 231054 140640 107983 157517 154702 84109 38615 200084 164694 259915 78793
22457 78793 135040 398247 348808 397533 232676 241864 -11852 -108005 -11546 49118 32890
$$ packed form
22530B65535Q1304J04321j09436k30268l16452r8023J55270J10426j20787j00303
22520b58413J13855p0062Q6811J98915j27884l81061m4297J10517K39685J86250
22510E4316R7154l8637O2650N1200j19480k13454k66780k17540J44362N8826n6410
22499d43793K29427K47751j04385k32122k0745K21868k2704k85927j64750L0020
22489e45360L35854J36589o6626j76379k0852Q7381P1401J98730J46794r5306
22479G2226j03698m4954K7587j08599o8626J29628j5917k64535q9220L14625L15107
22468A63624O7430r0414l2657M9534k815p0593m5494J61469l5390R5221j81122
22457G8793N6247K63207m9439M8725j64857R188k53716r6153R6459O0664j6228
$$ plain form
22446 32890 -52986 102967 184143 195634 174450 6647 -104255 -145224 -132473 -239576 -335816
22435 -335816 -244639 20132 129640 237804 544607 585494 298305 235358 227757 197381 350225
22424 350225 148109 -217784 -32061 -14591 -219617 -62804 -135348 -359477 -184515 -133824
22414 -133824 -134230 -206817 -331998 -272565 -114815 -61448 259039 385555 232785 111919 36641
22403 36641 116277 -66176 -364267 -557866 -438804 47998 202154 73861 -59199 19666
22393 19666 176150 254016 231295 -29332 29543 337319 78070 -20176 -179142 -142322 -246795
22382 -246795 -233788 -192005 -61015 198128 154822 17729 -256300 -249246 -151469 -120001 -46753
22371 -46753 -169627 -254478 -195607 -274951 -503038 -340633 -141449 34528 82177 -21707
$$ packed form
22446C2890q5876J55953Q1176J1491k1184j67803j10902m0969J2751j07103r6240
22435c35816R1177K64771J09508J08164L06803M0887k87189o2947p601l0376J52844
22424C50225k02116l65893J85723J7470k05026J56813p2544k24129J74962N0691
22414a33824m06p2587j25181N9433J57750N3367L20487J26516j52770j20866p5278
22403C6641P9636j82453k98091j93599J19062M86802J54156j28293j33060P8865
22393A9666J56484P7866k2721k60627N8875L07776k59249r8246j58966L6820j04473
22382b46795J3007M1783J30990K59143m3306j37093k74029P054R7777L1468P3248
22371d6753j22874q4851N8871p9344k28087J62405J99184J75977M7649j03884
$$ plain form
22361 -21707 106611 -44200 -207508 -376144 -95352 -86196 -203185 -238820 -199047 -261682 -264324
22350 -264324 -290990 -176133 -46094 -221608 -258742 -255323 -310626 -471715 -389042 -318949 176256
22339 176256 264390 383171 320483 311056 27363 236033 141386 78951 -186382 -142390 -249901
22328 -249901 -334931 -307559 -290648 -301868 -273834 -290297 -446407 -380037 -178536 5369 58646
22317 58646 56047 -45603 -178662 -235843 -242292 -139109 -88708 -214155 -60916 19858 -80927
22306 -80927 -121478 -191000 -32108 -34676 124789 265015 272122 -16723 -55081 -137922 -282389
22295 -282389 -191715 6877 -97166 -205614 -46821 102353 98184 176813 -30524 -203322
22285 -203322 -247201 -88045 -70009 -102684 -96095 129862 -60213 -293413 -125647 -89119 10222
$$ packed form
22361b1707J28318j50811j63308j68636K80792R156j16989l5635L9773o2635k642
22350b64324k6666J14857J30039j75514l7134L419n5303j61089Q2673P0093M95205
22339A76256Q8134J18781o2688r427k83693K08670r4647o2435k65333M3992j07511
22328b49901q5030K7372J6911j1220K8034j6463j56110O6370K01501J83905N3277
22317E8646k599j01650j33059n7181o449J03183N0401j25447J53239Q0774j00785
22306h0927m0551o9522J58892k568J59465J40226P107k88845l8358q2841j44467
22295b82389R0674J98592j04043j08448J58793J49174m169P8629k07337j72798
22285b03322m3879J59156J8036l2675O589K25957j90075k33200J67766L6528R9341
$$ plain form
22274 10222 125840 97229 95412 309220 248958 -53780 -10577 -13753 35642 -75596 -95081
22263 -95081 -107980 -76154 -66660 39767 121250 39696 -16821 -111044 -97983 -328251 -449691
22252 -449691 -263416 152910 375291 470567 425638 202548 -2507 -38180 187197 225156
22242 225156 154999 209852 124962 290175 257114 146518 49929 -46080 14764 196888 190223
22231 190223 -49136 -260441 -399855 -58175 -75748 -92272 -139622 29353 3622 -104637
22221 -104637 9782 -58088 -104027 -123156 -256687 -359950 -315239 41108 142068 52996
22211 52996 205709 256869 104005 -54466 -10670 -74320 13098 154758 345240 174418
22201 174418 75472 -28944 -232550 -146881 -70328 -242595 -219566 -147060 -69331 72729 -128518
$$ packed form
22274A0222J15618k8611j817K13808o0262l02738M3203l176M9395j11238j9485
22263i5081j2899L1826R494J06427Q1483q1554n6517r4223J3061k30268j21440
22252d49691J86275M16326K22381R5276m4929k23090k05055l5673K25377L7959
22242B25156p0157N4853q4890J65213l3061j10596r6589r6009O0844J82124o665
22231A90223k39359k11305j39414L41680j7573j6524m7350J68975k5731j08259
22221a04637J14419o7870m5939j9129j33531j03263M4711L56347J00960q9072
22211E2996J52713N1160j52864j58471M3796o3650Q7418J41660J90482j70822
22201A74418r8946j04416k03606Q5669P6553j72267K3029P2506P7729J42060k01247
$$ plain form
22190 -128518 -15345 -49734 -335405 -209121 85136 107893 -255574 -90164 -32021 -30597
22180 -30597 -157998 -313860 -297171 -210319 -13659 166126 316653 285358 230782 217031 97119
22169 97119 -302537 -495254 -153372 -195474 -174357 -161606 203358 463621 300024 248833
22159 248833 104052 -48003 -239192 -86430 -147760 -227470 -285888 -192910 -172019 -419057
22149 -419057 -460990 -211129 -174210 -116031 -48520 -100288 -130898 -336527 -212956 22385 -124338
22138 -124338 -140824 -51916 -29382 12309 -5597 107737 44317 -32985 -96801 -117747 20231
22127 20231 111701 297038 82472 -87445 -25850 4051 -64176 -319422 -490610 -468421 -533666
22116 -533666 -431078 -23159 227409 196973 123973 14200 -54128 -210085 -229971 -281442
$$ packed form
22190a28518J13173l4389k85671J26284K94257K2757l63467J65410N8143J424
22180c0597j27401j55862J6689Q6852J96660J79785J50527l1295n4576j3751j19912
22169I7119l99656j92717L41882m2102K1117J2751L64964K60263j63597n1191
22159B48833j44781j52055j91189J52762o1330p9710n8418R2978K0891k47038
22149d19057m1933K49861L6919N8179O7511n1768l0610k05629J23571K35341j46723
22138a24338j6486Q8908K2534M1691j7906J13334o3420p7302o3816k0946J37978
22127B0231R1470J85337k14566j69917O1595K9901o8227k55246j71188K2189o5245
22116e33666J02588M07919K50568l0436p3000j09773o8328j55957j9886n1471
$$ plain form
22106 -281442 92065 382063 315430 295134 192418 125303 57646 79752 -70597 -129064 -292378
22095 -292378 -373760 -478047 -521146 -267230 -186196 -104042 -99834 -44738 6079 75238 62653
22084 62653 137590 146241 29187 -62501 183984 88155 -140232 -225806 -44853 50094 -71172
22073 -71172 -316294 -125774 -20094 -164460 -371159 -123522 -185979 -349887 -418462 -118627
22063 -118627 -99525 -197312 -300580 -68799 33780 105514 111186 -121433 17969 -163132
22053 -163132 -424693 -158853 -198347 -395542 -519295 -570199 -543490 -261247 -103211 -76228
22043 -76228 -93771 -89703 23037 82623 110467 -16018 -30068 -160782 -30730 150775 105255
22032 105255 94840 -10555 -182531 -200213 -294241 -434244 -525017 -665929 -664820 -670795 -491017
$$ packed form
22106b81442L73507K89998o6633k0296j02716o7115o7657K2106j50349n8467j63314
22095b92378q1382j04287m3099K53916Q1034Q2154M208N5096N0817O9159j2585
22084F2653P4937Q651j17054r1688K46485r5829k28387q5574J80953R4947j21266
22073g1172k45122J90520J05680j44366k06699K47637o2457j63908o8575K99835
22063a18627J9102r7787j03268K31781J02579P1734N672k32619J39402j81101
22053a63132k61561K65840l9494j97195j23753n0904K6709K82243J58036K6983
22043g6228j7543M068J12740N9586K7844j26485j4050j30714J30052J81505m5520
22032A05255j0415j05395j71976j7682r4028j40003r0773j40912J109n975J79778
$$ plain form
22021 -491017 -171161 252415 320493 325392 74299 -102311 -11638 20289 122631 211641 280127
22010 280127 -71120 -250394 -148461 103138 -57895 -63839 8275 68334 243467 384617
22000 384617 467199 292209 241022 -13529 8054 315377 378744 313881 58992 121026 81551
21989 81551 107947 9003 -129912 -290958 -167222 68881 186761 142360 127276 20934
21979 20934 -65743 -49560 58063 -150273 -292382 -461578 -238143 -118688 -148841 -279057
21969 -279057 -252882 -252533 -164372 25665 301702 221333 -48395 -236274 -165522 -25645 151538
21958 151538 109781 210581 -58276 -28159 217257 360168 270514 154305 225284 183705
21948 183705 -58063 -42486 -418019 -392316 -76266 93999 -103058 -370352 -46955 54910
$$ packed form
22021d91017L19856M23576O8078M899k51093j76610R0673L1927J02342Q9010O8486
22010B80127l51247j79274J01933K51599j61033n944P2114O0059J75133J41150
22000C84617Q2582j74990n1187k54551K1583L07323O3367o4863k54889O2034l9475
21989H1551K6396r8944j38915j61046J23736K36103J17880m4401j5084j06342
21979B0934q6677J6183J07623k08336j42109j69196K23435J19455l0153j30216
21969b79057K6175L49Q8161J90037K76037q0369k69728j87879P0752J39877J77183
21958A51538m1757J00800k68857L0117K45416J42911q9654j16209P0979m1579
21948A83705k41768J5577l75533K5703L16050J70265j97057k67294L23397J01865
$$ plain form
21938 54910 72761 -2191 -83940 -6622 -19374 157423 397815 215745 123855 79476 -41267
21927 -41267 -317534 -400670 -329861 -139354 -163229 -260750 -347910 -388776 -333359 -134203 -225357
21916 -225357 -155284 -225962 -264727 -298265 -323238 -177180 -119824 -107719 -169356 -24914 186486
21905 186486 187103 321702 335948 156303 63818 -113638 -351512 -490132 -395364 -364257 -318604
21894 -318604 -287493 -363722 -241687 -151502 -25619 229430 321451 198205 66490 -15479
21884 -15479 206014 248555 -138536 -108052 53168 -20276 15207 216122 162144 197682 63964
21873 63964 -42337 -10132 -57596 -89099 -81227 -214696 -204479 13522 24463 -170188 -384058
21862 -384058 -317221 -330971 -246775 -185673 -167159 -295097 -315237 -135905 -93928 -200044 5497
$$ packed form
21938E4910J7851p4952q1749P7318j2752J76797K40392j82070r1890m4379j20743
21927d1267k76267q3136P0809J90507k3875r7521q7160m0866N5417J99156r1154
21916b25357P0073p0678l8765l3538k4973J46058N7356J2105o1637J44442K11400
21905A86486O17J34599J4246j79645r2485j77456k37874j38620R4768L1107M5653
21894c18604L1111p6229J22035R0185J25883K55049R2021j23246j31715q1969
21884a5479K21493M2541l87091L0484J61220p3444L5483K00915n3978L5538j33718
21873F3964j06301L2205m7464l1503P872j33469J0217K18001J0941j94651k13870
21862c84058O6837j3750Q4196O1102J8514j27938k0140J79332M1977j06116K05541
$$ plain form
21851 5497 319868 376228 383792 254608 281087 434449 17534 -85301 37037 192140 153112
21840 153112 57233 -212761 -134645 122623 101577 133089 119789 11632 -36601 -204413 -155385
21829 -155385 -101530 -170158 -141640 -64635 63993 82462 75275 14957 -245054 -318215 -110068
21818 -110068 77417 71600 44350 65683 150489 124317 -217641 -276695 -262589 -137257 -209397
21807 -209397 -165724 -20704 4766 -135072 -199724 -295528 28744 10605 19037 240134 325296
21796 325296 32397 -30814 19234 101318 54621 39789 -215015 -25874 -39572 -136535 -254602
21785 -254602 -62562 -103232 -162498 -122277 -62131 -175810 -285221 -205296 82685 137989 -79209
21774 -79209 -112084 14754 51317 -82222 -372833 -259566 34186 70474 165221 81476 -177836
$$ packed form
21851E497L14371N6360P564j29184K6479J53362m16915j02835J22338J55103l9028
21840A53112r5879k69994P8116K57268k1046L1512j3300j08157m8233j67812M9028
21829a55385N3855o8628K8518P7005J28628J8469p187o0318k60011p3161K08147
21818a10068J87485n817k7250K1333Q4806k6172l41958n9054J4106J25332p2140
21807b09397M3673J45020K5470j39838o4652r5804L24272j8139Q432K21097Q5162
21796C25296k92899o3211N0048Q2084m6697j4832k54804J89141j3698r6963j18067
21785b54602J92040m0670n9266M0221O0146j13679j09411P9925K87981N5304k17198
21774g9209l2875J26838L6563j33539k90611J13267K93752L6288R4747q3745k59312
$$ plain form
21763 -177836 -133934 40363 124560 -18223 -291719 -218106 -146094 -386 283559 315239
21753 315239 89397 33865 -45258 -156136 -141455 16105 64769 -67634 112082 28925
21743 28925 -164890 -261399 -219320 -203227 -166764 -195826 -165038 -73864 -73444 185517 96381 -29267
21731 -29267 -314432 -355634 -176974 -109392 -178310 -192118 -241341 -168518 109244 13233 -83564
21720 -83564 -11003 305110 590504 484305 444210 344353 43744 -162018 -325477 -114223
21710 -114223 19231 -255849 -326227 -302749 -304461 -289223 -72121 -151856 -391683 -370095 -109764
21699 -109764 77447 -137471 -247281 -319554 -192198 -49129 -127101 -397848 -470334 -207996
21689 -207996 64108 57491 -107553 -105287 -59939 -177216 -132520 -136842 -100749 13722 171074
$$ packed form
21763a77836M3902J74297Q4197j42783k73496P3613P2012J45708K83945L1680
21753C15239k25842n5532p9123j10878J4681J57560M8664j32403J79716q3157
21743B8925j93815r6509M2079J6093L6463k9062L0788R1174M20K58961q9136j25648
21731b9267k85165m1202J78660O7582o8918j3808m9223P2823K77762r6011r6797
21720h3564P2561L16113K85394j06199m0095r9857l00609k05762j63459K11254
21710a14223J33454k75080p0378K3478j712J5238K17102p9735k39827K1588K60331
21699a09764J87211k14918j09810p2273J27356J43069p7972k70747p2486K62338
21689b07996K72104o617j65044K266M5348j17277M4696m322L6093J14471J57352
$$ plain form
21678 171074 58065 -114540 106520 228270 163694 92474 222884 61112 218807 335881
21668 335881 286923 166414 159076 55890 -392520 -448444 -127191 40580 413018 361490
21658 361490 242976 -78739 -287656 -279297 -188623 -20630 952 7653 -164642 -99591 -153683
21647 -153683 -198741 -299722 -430822 -114270 57362 65245 154498 149290 -44123 -11437 -70389
21636 -70389 -294843 -436134 -401933 -118935 -18979 -108679 -65999 17726 134340 173411 70195
21625 70195 169318 6025 -33676 78075 -44587 -45762 -154145 -257263 -434805 -198989
21615 -198989 54956 -23849 -231605 -198095 -310505 -494834 -374781 -318903 -193485 -146406
21605 -146406 -71436 -49725 19613 133879 -96533 -254498 -275609 -389292 -376914 -357060 96851
$$ packed form
21678A71074j13009j72605K21060J21750o4576p1220J30410j61772J57695J17074
21668C35881m8958j20509p338j03186m48410n5924L21253J67771L72438n1528
21658C61490j18514l21715k08917Q359R0674J67993K1582O701j72295O5051n4092
21647a53683m5058j00981j31100L16552J71632P883Q9253n208j93413L2686n8952
21636g0389k24454j41291L4201K82998R9956q9700M2680Q3725J16614L9071j03216
21625G0195R9123j63293l9701J11751j22662j175j08383j03118j77542K35816
21615a98989K53945p8805k07756L3510j12410j84329J20053N5878J25418M7079
21605a46406P4970K1711O9338J14266k30412j57965k1111j13683J2378J9854M53911
$$ plain form
21594 96851 377636 469916 653600 639775 668398 374002 188003 332038 167467 68621
21584 68621 5958 118189 49827 167893 316639 156567 -2846 59166 128115 86261 13117
21573 13117 -4509 -58552 -50312 40818 267960 280381 277668 221411 -33346 -73092 -66827 5360
21561 5360 -174526 -162055 736 102570 -62297 -161618 -81205 111348 -28319 -88853 -187288
21550 -187288 -143196 -139207 14406 -9175 -55971 -178823 -192182 -177566 142161 170082 -185633
21539 -185633 -155929 -406066 -582965 -477999 -607796 -531506 -338048 137219 56487 -221318
21529 -221318 -218333 -24827 172952 172355 53053 -52746 89225 308918 81623 118881 232900
21518 232900 53706 -88162 -121786 -84653 -15330 15918 3463 -26554 -232668 -328855 -307050
$$ packed form
21594I6851K80785R2280J83684j3825K8623k94396j85999J44035j64571r8846
21584F8621o2663J12231o8362J18066J48746j60072j59413O2012O8949m1854p3144
21573A3117j7626n4043Q240R1130K27142J2421k713n6257k54757l9746O265P2187
21561E360j79886J2471J62791J01834j64867r9321Q0413J92553j39667o0534r8435
21550a87288M4092L989J53613k3581m6796j22852j3359J4616L19727K7921l55715
21539a85633K9704k50137j76899J04966j29797P6290J93458M75267q0732k77805
21529b21318K985J93506J97779n97j19302j05799J41971K19693k27295L7258J14019
21518B32900j79194j41868l3624L7133O9323L1248j2455l0017k06114r6187K1805
$$ plain form
21507 -307050 -149485 50327 161170 -115376 -214891 -135761 -24896 116563 -92651 -406387
21497 -406387 -645948 -633148 -391804 -361985 -161613 -188479 -107943 47882 162409 -115612
21487 -115612 -217361 -139580 -94933 161238 404414 101583 -312713 -495137 -308609 -17282
21477 -17282 -96902 -32995 49921 25183 92080 114409 339092 418957 211767 11732 -268486
21466 -268486 -524649 -438612 -338097 -315844 -446740 -432749 -372949 32649 160602 14236
21456 14236 -156435 -110319 -86000 -51144 -218934 -362561 -555505 -216847 127840 138072
21446 138072 126370 336676 431697 329317 188091 203379 250356 232219 267926 47735 -3858
21435 -3858 -60958 -161623 -281161 -320801 -436002 -399005 -212478 -257586 -88723 53745 88584
$$ packed form
21507c07050J57565J99812J10843k76546r9515P9130J10865J41459k09214l13736
21497d06387k39561J2800K41344K9819K00372k6866Q0536J55825J14527k78021
21487a15612j01749P7781M4647K56171K43176l02831m14296j82424J86528K91327
21477a7282p9620O3907Q2916k4738O6897K2329K24683P9865k07190k00035k80218
21466b68486k56163Q6037J00515K2253j30896J3991N9800M05598J27953j46366
21456A4236j70671M6116K4319L4856j67790j43627j92944L38658L44687J0232
21446A38072j1702K10306R5021j02380j41226J5288M6977j8137L5707k20191n1593
21435c858n7100j00665j19538l9640j15201L6997J86527m5108J68863J42468L4839
$$ plain form
21424 88584 -61513 -112593 32939 24322 -166343 -303908 -321833 -212780 -108084 -189197 -224018
21413 -224018 -61383 290840 441972 489827 244667 181736 281168 52819 -183849 -50179
21403 -50179 198742 99113 200522 314615 359034 357038 -8476 -306306 -214616 -219388 13520
21392 13520 92002 193693 190520 26332 -125993 -281184 -464674 -571085 -326230 -42216
21382 -42216 70271 -17034 -65541 -300787 -335654 -267476 -127353 186878 55582 84838 92603
21371 92603 137171 34697 -90593 -313486 -318023 -192949 -231566 -283714 -136807 -61912 -163780
21360 -163780 -131899 150659 205011 219003 187006 285636 280917 17274 -55221 103272 -991
21349 -991 -264135 -243226 -211491 -243342 -118612 -94971 -85361 -201688 -135997 -190835 -143959 -145955
$$ packed form
21424H8584j50097n1080J45532q617j90665j37565j7925J09053J04696q1113l4821
21413b24018J62635L52223J51132M7855k45160o2931R9432k28349k36668J33670
21403e0179K48921r9629J01409J14093M4419j996l65514k97830R1690m772K32908
21392A3520P8482J01691l173j64188j52325j55191j83490j06411K44855K84014
21382d2216J12487q7305m8507k35246l4867O8178J40123L14231j31296K9256P765
21371I2603M4568j02474j25290k22893m537J25074l8617n2148J46907P4895j01868
21360a63780L1881K82558N4352J3992l1997R8630m719k63643p2495J58493j04263
21349i91k63144K0909L1735l1851J24730K3641R610j16327O5691n4838M6876j996
$$ plain form
21337 -145955 -162864 65116 249755 -102199 -109340 -74823 -8593 49126 140048 5534 -172892
21326 -172892 -121126 -26104 -129483 -237855 -129595 -270933 -165738 17426 -35472 22552
21316 22552 -34554 24477 -49325 -121334 -239301 -306303 -211891 48191 187102 286041 458092
21305 458092 552084 567203 462030 184737 -67488 -231175 -30411 239290 193636 -79183
21295 -79183 -313957 -344803 -161467 113399 273518 269193 81429 -105910 -118341 -105849 -65183
21284 -65183 87236 201311 -67570 -227179 -43388 -30787 -132970 -34304 -155182 -70347
21274 -70347 -245346 -255149 -244339 -358890 -313211 -184314 -155988 13636 41847 -194301 -471223
21263 -471223 -481512 -533271 -565513 -385811 -306903 -249211 -100526 -182949 -334948 -187288 -6073
$$ packed form
21337a45955j6909K27980J84639l51954p141L4517O6230N7719R0922j34514j78426
21326a72892N1766R5022j03379j08372J08260j41338J05195J83164n2898N8024
21316B2552n7106N9031p3802p2009j17967o7002R4412K60082J38911R8939J72051
21305D58092R3992J5119j05173k77293k52225j63687K00764K69701m5654k72819
21295g9183k34774l0846J83336K74866J60119m325j87764j87339j2431J2492M0666
21284f5183J52419J14075k68881j59609J83791J2601j02183R8666j20878Q4835
21274g0347j74999r803J0810j14551M5679J28897K8326J69624K8211k36148k76922
21263d71223j0289n1759l2242J79702P8908N7692J48685q2423j51999J47660J81215
$$ plain form
21252 -6073 -45596 -35529 -80696 -16178 129105 -140647 -77044 -24983 -26425 132784 288836
21241 288836 272759 233622 282975 108435 -144897 -59031 -64829 -165750 -215489 -157929 -100849
21230 -100849 -138132 -167933 56001 318 69821 217230 148402 463137 563270 476159 385378
21219 385378 412162 242289 111988 97045 51273 89902 -134825 -404102 -238063 -97186
21209 -97186 -199446 -351789 -380545 -277176 94304 -90922 -280113 -168273 116203 270620
21199 270620 367553 569890 566743 328949 -91363 -238602 -130905 -281885 -296443 -335606
21189 -335606 -260437 -190054 -306258 -442862 -268763 -106337 -107559 -99839 -13095 -4819 -240743
21178 -240743 -176627 153743 245670 14817 -123178 32867 27120 29150 60748 -110663 -100093
$$ packed form
21252f073l9523J0067m5167O4518J45283k69752O3603N2061j442J59209J56052
21241B88836j6077l9137M9353j74540k53332Q5866n798j00921m9739N7560N7080
21230a00849l7283k9801K23934n5683O9503J47409o8828L14735J00133q7111r0781
21219C85378K6784j69873j30301j4943m5772L8629k24727k69277J66039J40877
21209i7186j02260j52343k8756J03369L71480j85226j89191J11840K84476J54417
21199B70620R6933K02337l147k37794m20312j47239J07697j50980j4558l9163
21189c35606P5169P0383j16204j36604J74099J62426j222P720Q6744Q276k35924
21178b40743O4116L30370R1927k30853j37995J56045n747K030L1598j71411J0570
$$ plain form
21167 -100093 -162994 99314 90093 -88841 54488 182383 100919 -10246 -115017 -4614
21157 -4614 84595 -88282 -179076 107475 16083 -174515 -185164 -201825 -69579 143132 280140
21146 280140 110884 -348067 -279766 -306742 -459183 -184803 -129542 -325940 -608078 -754763
21136 -754763 -750418 -554178 -255791 -141358 -242833 -55647 -187517 -214782 38441 173276
21126 173276 -116682 -5877 86023 -29151 1813 -40610 -109651 -68965 -79263 -40537 -51827
21115 -51827 -8767 -164962 -291834 -253269 -138994 83357 85724 29565 34057 -3264 80316
21104 80316 120723 -15315 -88150 141045 263180 -73132 -317233 -291383 -188182 -371600
21094 -371600 -388550 -572170 -315207 18528 -170217 -313639 -440631 -476622 -426842 -296458
$$ packed form
21167a00093o2901K62308r221j78934J43329J27895q1464j11165j04771J10403
21157d614Q9209j72877r0794K86551r1392j90598j0649j6661J32246K12711J37008
21146B80140j69256m58951O8301k6976j52441K74380N5261j96398k82138j46685
21136g54763M345J96240K98387J14433j01475J87186j31870k7265K53223J34835
21126A73276k89958J10805R1900j15174L0964m2423o9041M0686j0298L8726j1290
21115e1827M3060j56195j26872L8565J14275K22351K367n6159M492l7321Q3580
21104H0316M0407j36038p2835K29195J22135l36312k44101K5850J03201j83418
21094c71600j6950j83620K56963L33735j88745j43422j26992l5991M9780J30384
$$ plain form
21084 -296458 -154614 -225293 616 -18307 -14816 -302468 -379074 -342971 -122986 23420 -8573
21073 -8573 -212665 -120426 -185189 -234421 -80881 74838 58806 -58413 -167906 -127143 -14306
21062 -14306 247369 321881 114730 83522 221938 321317 52486 -147136 -194676 -120616 -344349
21051 -344349 -433409 -341568 -261980 17489 -132024 161357 124203 -38755 -146506 -47739
21041 -47739 -157784 -70076 -247408 -447580 -442801 -387903 -365869 -300914 -373394 -401247 -122114
21030 -122114 -213858 -162598 -142142 -104314 -124213 -5476 107729 77612 -61857 2293 -159565
21019 -159565 -100682 -86137 -152546 -282132 -295666 -256986 -114207 333750 218307 -7844
21009 -7844 -141565 -273142 -365301 -249601 -68053 -41799 -169095 -135388 -50834 -96979 -104664
$$ packed form
21084b96458J41844p0679K25909j8923L491k87652p6606L6103K19985J46406l1993
21073h573k04092R2239o4763m9232J53540J55719j6032j17219j09493M0763J12837
21062a4306K61675P4512k07151l1208J38416R9379k68831j99622m7540P4060k23733
21051c44349q9060R1841P9588K79469j49513K93381l7154j62958j07751R8767
21041d7739j10045Q7708j77332k00172M779N4898K2034O4955p2480k7853K79133
21030a22114r1744N1260K0456L7828j9899J18737J13205l0117j39469O4150j61858
21019a59565N8883J4545o6409j29586j3534L8680J42779M47957j15443k26151
21009g844j33721j31577r2159J15700J81548K6254j27296L3707Q4554m6145p685
$$ plain form
20998 -104664 7648 -108442 -127137 216663 -23635 -379003 -2099 78783 -31738 76676
20988 76676 181659 -119778 -458376 -583120 -430296 -256855 -287610 -191878 -140443 -46573
20978 -46573 27422 -112580 -64982 -126447 -207648 -184125 -306010 -344640 -428976 -263256 18360
20967 18360 193657 287906 69478 -96458 -105754 -249549 -245198 -234786 -180631 121083 56018
20956 56018 158585 -337 -185768 -410986 -387893 -136758 -66096 13922 217358 -87913
20946 -87913 -355033 -314924 -353973 -542938 -327156 -110048 -70526 -427459 -387261 -365104 -271081
20935 -271081 -161494 -50789 -78968 -66869 -90498 -378877 -589948 -530308 -162866 -66967
20925 -66967 -252525 -408868 -219524 -152831 -398410 -297523 -196975 -243639 -233911 -283862 18378
$$ packed form
20998a04664J12312j16090j8695L43800k40298l55368L76904Q0882j10521J08414
20988G6676J04983l01437l38598j24744J52824J73441l0755R5732N1435R3870
20978d6573P3995j40002M7598o1465q1201K3523j21885l8630q4336J65720K81616
20967A8360J75297R4249k18428j65936r296j43795M351J0412N4155L01714o5065
20956E6018J02567j58922j85431k25218K3093K51135P0662Q0018K03436l05271
20946h7913k67120M0109l9049j88965K15782K17108L9522l56933M0198K2157R4023
20935b71081J09587J10705k8179J2099k3629k88379k11071N9640L67442R5899
20925f6967j85558j56343J89344O6693k45579J00887J00548m6664R728m9951L02240
$$ plain form
20914 18378 360307 286112 454985 335849 339965 90846 110715 -161894 -210385 -241932 -276690
20903 -276690 -224918 -359650 -445917 -422661 -203523 -157996 -139481 -169510 -249937 -172805 14816
20892 14816 -55040 18539 217473 28182 129277 -42572 70454 532 -224992 -323114
20882 -323114 -243316 -485702 -528666 -670218 -526127 -336998 -578016 -723949 -510974 -305838
20872 -305838 -208506 -267602 -23591 67537 -127914 -116086 -169073 -343590 -179250 -90900 -171156
20861 -171156 -190793 -143582 -117901 -181012 -111963 119020 255378 149216 -166442 -104676 31855
20850 31855 100761 -145788 -360385 -415692 -195871 -129917 73572 321336 380251 298740 161452
20839 161452 140721 134650 92421 135405 -35992 -175437 -121457 -8182 14352 36679 164925
$$ packed form
20914A8378L41929p4195J68873j19136M116k49119J9869k72609m8491l1547l4758
20903b76690N1772j34732q6267K3256K19138M5527J8515l0029q0427P7132J87621
20892A4816o9856P3579J98934j89291J01095j71849J13026o9922k25524r8122
20882c23114P9798k42386m2964j41552J44091J89129k41018j45933K12975K05136
20872c05838R7332n9096K44011R1128j95451J1828n2987j74517J64340Q8350q0256
20861a71156j9637M7211K5681o3111O9049K30983J36358j06162l15658O1766J36531
20850C1855O8906k46549k14597n5307K19821O5954K03489K47764N8915q1511j37288
20839A61452k0731o071m2229M2984j71397j39445N3980J13275K2534K2327J28246
$$ plain form
20828 164925 188960 73450 88764 -67949 -61708 252425 182891 -90869 -160383 10539 -79702
20817 -79702 87008 244407 250513 109298 -39106 -29645 -101229 -185889 -42748 -80162 52017
20806 52017 61975 -173355 -49817 101131 77280 -94252 272663 331116 174068 55709
20796 55709 17039 12120 148153 -48351 -323696 -149376 177997 132229 66177 251185 256415
20785 256415 95042 -67021 40196 150305 94454 -108892 -278183 -118520 71797 -155484
20775 -155484 -182393 5547 79807 74931 114835 44464 57995 145271 68292 -94131 -262913
20764 -262913 -434236 -212640 194448 76966 101597 305256 365622 322946 132677 -83208
20754 -83208 -111941 -31031 159801 349943 365667 379915 392434 462934 342845 157649 -78816
$$ packed form
20828A64925K4035j15510J5314j56713O241L14133o9534k73760o9514J70922r0241
20817g9702J66710J57399O106j41215j48404R461p1584q4660J43141l7414J32179
20806E2017R958k35330J23538J50948k3851j71532L66915N8453j57048j18359
20796E5709l8670m919J36033j96504k75345J74320L27373m5768o6052J85008N230
20785B56415j61373j62063J07217J10109n5851k03346j69291J59663J90317k27281
20775a55484k6909J87940P4260m876L9904p0371J3531Q7276p6979j62423j68782
20764b62913j71323K21596M07088j17482K4631K03659O0366m2676j90269k15885
20754h3208k8733Q0910J90832J90142J5724J4248J2519P0500j20089j85196k36465
$$ plain form
20743 -78816 -268422 5558 -44316 -88024 -122562 -312620 -264582 -158783 -16351 145668
20733 145668 -64542 -40085 -157037 -189671 76151 112857 -85616 6396 69313 49738 156648
20722 156648 50457 109709 500045 513257 111783 -83318 -126014 -275994 -53363 -69474
20712 -69474 90419 156651 158964 220595 196165 283153 1896 -221318 -93920 298487 181885
20701 181885 159233 -83875 -130199 -18593 -196796 -222021 -123188 9537 334682 283062
20691 283062 137570 -168722 -156262 -4276 40758 -7967 -132140 -467375 -534183 -550838
20681 -550838 -346764 -15897 112557 75899 95505 342351 340130 160995 135948 158941 102513
20670 102513 -25561 -48930 73335 -94478 1205 168153 75220 -78728 166798 143227
$$ packed form
20743g8816j89606K73980m9874m3708l4538j90058M8038J05799J42432J62019
20733A45668k10210K4457j16952l2634K65822L6706j98473R2012O2917j9575J06910
20722A56648j06191N9252L90336J3212m01474j95101m2696j49980K22631j6111
20712f9474J59893O6232K313O1631k4430Q6988k81257k23214J27398L92407j16602
20701A81885k2652k43108m6324J11606j78203k5225R8833J32725L25145n1620
20691B83062j45492l06292J2460J51986M5034m8725j24173l35235o6808j6655
20681e50838K04074L30867J28454l6658J9606K46846k221j79135k5047K2993n6428
20670A02513j28074k3369J22265j67813R5683J66948r2933j53948K45526k3571
$$ plain form
20660 143227 47837 -83806 4310 25589 -35017 160920 477132 548841 493245 302222 95567
20649 95567 -121520 -433417 -344192 -343722 -453554 -284854 -289690 -206469 -235563 -594447 -691929
20638 -691929 -497745 -410500 -223924 30117 171753 250335 220018 152466 -75492 -35078
20628 -35078 -32666 -284825 -158318 97793 282860 437479 414040 346381 74783 -67886
20618 -67886 -26326 -42467 -155272 -164095 -80438 -28321 125133 147671 -54784 -328885 -298937
20607 -298937 -101546 -141264 -389053 -456323 -58767 254123 -18432 35568 167971 273137
20597 273137 263517 40675 -58180 -213697 -251305 -154350 -145844 -66907 -55255 -46649 -136874 -88844
20585 -88844 78031 209770 280905 322134 253813 124726 -56343 99206 288096 309860
$$ packed form
20660A43227r5390j31643Q8116K1279o0606J95937L16212P1709n5596j91023k06655
20649I5567k17087l11897Q9225M70j09832J68700m836Q3221k9094l58884r7482
20638f91929J94184Q7245J86576K54041J41636P8582l0317o7552k27958M0414
20628c5078K412k52159J26507K56111J85067J54619k3439o7659k71598j42669
20618f7886M1560j6141j12805q823Q3657N2117J53454K2538k02455k74101K9948
20607b98937J97391l9718k47789o7270L97556L12890k72555N4000J32403J05166
20597B73137r620k22842r8855j55517l7608R6955Q506P8937J1652Q606r0225M8030
20585h8844J66875J31739P1135M1229o8321j29087j81069J55549J88890K1764
$$ plain form
20575 309860 304420 53583 -34007 -64258 -22928 71158 118999 -201482 -289424 -49120 16034
20564 16034 92992 349394 525916 247798 67170 111766 221387 144959 54614 184248
20554 184248 63900 -12875 23107 -56140 -104829 -251027 -311267 -29978 238274 166780 352540
20543 352540 433355 366824 203640 170125 13829 -110652 -83121 -45104 -43912 129630 239334
20532 239334 260529 194750 107952 152226 307842 209313 377348 527274 459696 118254 -194992
20521 -194992 -262394 -159042 -29175 170581 123629 80512 48508 62309 173708 110395 178665
20510 178665 -21623 -7179 24035 -109881 -26971 21936 53923 128888 173165 106151 42789
20499 42789 83527 66920 -92659 -322583 -265184 -172572 -261661 -390379 -266160 -196523 -118700
$$ packed form
20575C09860n440k50837q7590l0251M1330R4086M7841l20481q7942K40304O5154
20564A6034P6958K56402J76522k78118j80628M4596J09621p6428r0345J29634
20554A84248j20348p6775L5982p9247m8689j46198o0240K81289K68252p1494J85760
20543C52540Q0815o6531j63184l3515j56296j24481K7531L8017J192J73542J09704
20532B39334K1195o5779q6798M4274J55616r8529J68035J49926o7578l41442l13246
20521a94992o7402J03352J29867J99756m6952m3117l2004J3801J11399o3313O8270
20510A78665k00288J4444L1214j33916Q2910M8907L1987P4965M4277o7014o3362
20499D2789M0738j6607j59579k29924N7399R2612q9089j28718J24219O9637P7823
$$ plain form
20488 -118700 -38586 -12436 -43808 8129 264289 447789 251119 14583 83034 189329
20478 189329 186589 108960 -70684 -60109 48046 121086 97868 -132277 -85844 -167776 -242545
20467 -242545 -221070 -257837 -108608 -59204 -133704 -55379 64297 155171 333134 156852 22376
20456 22376 -48980 48829 -4876 -122683 -54918 -3873 35350 48079 116520 143532 62003
20445 62003 26627 88824 -66682 22239 -44315 -115290 67948 77787 -297221 -204371 118911
20434 118911 289329 344236 240713 335431 352885 43258 -148391 -115449 90909 1689
20424 1689 50941 19259 44577 71944 -269431 -375590 -272086 -296439 -241637 -231847 -261277
20413 -261277 -98106 7500 -67545 -205533 -290437 -85650 -11184 22181 -2623 61524 342809
$$ packed form
20488a18700Q0114K6150l1372N1937K56160J83500j96670k36536O8451J06295
20478A89329k740p7629j79644J0575J08155P3040k3218k30145M6433q1932p4769
20467b42545K1475l6767J49229M9404p4500P8325J19676R0874J77963j76282j34476
20456B2376p1356R7809n3705j17807O7765N1045L9223J2729O8441K7012q1529
20445F2003l5376O2197j55506Q8921o6554p0975J83238R839l75008R2850L23282
20434A18911J70418N4907j03523R4718J7454l09627j91649L2942K06358q9220
20424A689M9252l1682K5318K7367l41375j06159J03504k4353N4802R790k9430
20413b61277J63171J05606p5045j37988q4904K04787P4466L3365k4804O4147K81285
$$ plain form
20402 342809 465893 389205 337090 446026 584759 484642 378970 222114 148965 -70071
20392 -70071 65779 39870 -43439 -159852 -77473 -166950 -81738 87062 263431 99711 -162261
20381 -162261 -336085 -96261 186031 376289 318138 190511 104047 -164101 -236854 -48596
20371 -48596 223663 300980 267320 246187 150358 47675 10662 -133205 -221853 -158187 -176296
20360 -176296 -228432 -164962 -16076 -109341 -259150 26268 351384 279756 143540 -44881
20350 -44881 -119490 -62233 -49401 -34804 -71296 66903 131005 149569 182936 -64121 -345020
20339 -345020 -593370 -465778 -284848 -148355 117015 197822 315189 515455 642059 545225
20329 545225 559387 283232 74989 177715 200945 171122 -2656 -49362 -260383 30960
$$ packed form
20402C42809J23084p6688n2115J08936J38733j00117j05672j56856p3149k19036
20392g0071J35850k5909q3309j16413Q2379q9477Q5212J68800J76369j63720k61972
20381a62261j73824K39824K82292J90258n8151j27627q6464k68148p2753J88258
20371d8596K72259P7317l3660k1133r5829j02683l7013j43867q8648O3666j8109
20360a76296n2136O3470J48886r3265j49809K85418L25116p1628j36216j88421
20350d4881p4609N7257J2832J4597l6492J38199O4102J8564L3367k47057k80899
20339c45020k48350J27592J80930J36493K65370Q0807J17367K00266J26604r6834
20329E45225J4162k76155k08243J02726K3230k9823j73778m6706k11021K91343
$$ plain form
20319 30960 243975 26196 -37540 300299 141378 -13794 -111289 -144613 -54892 41280 82804
20308 82804 273861 359675 149777 -11729 -185416 -389263 -515157 -389649 -142210 95211
20298 95211 206648 421529 351053 46847 -75951 -227971 -272857 -304041 -207931 -156319 62787
20287 62787 149027 -70030 -306467 -460513 -551837 -170944 60586 -21720 -90445 -185256 -237263
20276 -237263 -231101 -22407 12293 -91468 -219542 -353439 -328839 -273861 -122415 -142059 -330012
20265 -330012 -249733 -130908 -35319 115771 410864 225803 16102 -64514 -276514 -562067
20255 -562067 -515842 -352673 -315985 -261085 -246489 -120402 141048 112883 98569 30389 -52901
20244 -52901 -68948 241635 130258 -84629 -253950 -292381 -270089 -242328 -17561 -47972 48468
$$ packed form
20319C0960K13015k17779o3736L37839j58921j55172r7495l3324Q9721R6172M1524
20308H2804J91057Q5814k09898j61506j73687k03847j25894J25508K47439K37421
20298I5211J11437K14881p0476l04206j22798j52020m4886l1184R6110N1612K19106
20287F2787Q6240k19057k36437j54046r1324L80893K31530q2306o8725r4811n2007
20276b37263O162K08694L4700j03761j28074j33897K4600N4978J51446j9644j87953
20265c30012Q0279J18825R5589J51090K95093j85061k09701q0616k12000k85553
20255e62067M6225J63169L6688N4900J4596J26087K61450k8165j4314o8180q3290
20244e2901j6047L10583j11377k14887j69321l8431K2292K7761K24767l0411R6440
$$ plain form
20233 48468 181989 360721 155542 -244028 -48662 -75404 -189757 48733 61939 -10937
20223 -10937 53853 20738 209665 261550 -5116 -212514 73251 404958 398105 389507 234320
20212 234320 85301 186740 127785 -46552 -63174 -263824 -219461 -154863 -164820 -56079 142810
20201 142810 242783 377175 329246 158551 43633 80212 32201 58676 296625 308365 553106
20190 553106 318008 -49623 -259081 -181782 -175760 -89898 -47537 -10741 55191 35722 -162313
20179 -162313 -101075 -93796 39709 137615 49269 63727 35556 -89050 -182364 -231189 -324099
20168 -324099 -311490 -125257 24458 33965 -119047 -278423 -294798 -12659 218225 279363
20158 279363 327313 250018 220538 88134 -62238 101623 245716 378063 203630 -58977
$$ packed form
20233D8468J33521J78732k05179l99570J95366k6742j14353K38490J3206p2876
20223a0937O4790l3115J88927N1885k66666k07398K85765L31707o853q598j55187
20212B34320j49019J01439n8955j74337j6622k00650M4363O4598r957J08741J98889
20201A42810R9973J34392m7929j70695j14918L6579m8011K6475K37949J1740K44741
20190E53106k35098l67631k09458P7299O022Q5862M2361L6796O5932j9469j98035
20179a62313O1238P279J33505R7906q8346J4458k8171j24606r3314m8825r2910
20168c24099J2609J86233J49715R507j53012j59376j6375K82139K30884O1138
20158B79363M7950p7295k9480j32404j50372J63861J44093J32347j74433k62607
$$ plain form
20148 -58977 -340719 -324956 -272179 -175056 -36534 -70616 -42898 248890 431741 403114 237989
20137 237989 -11466 -64146 48469 139625 -10912 -101326 181623 385854 434355 154396
20127 154396 158046 186799 91209 10056 17964 82154 151563 233835 168439 -29790 -132085
20116 -132085 38611 375530 395563 298925 202608 261648 -39114 -100016 21174 257227
20106 257227 494042 588242 655850 601169 543276 246389 277655 422521 345525 15694 -221839
20095 -221839 -261377 -154418 -203310 -207788 -176588 -89233 -72321 84938 147492 264886 291923
20084 291923 65785 -124579 -250617 62665 440598 510614 321809 389682 337170 95309
20074 95309 -180322 18669 158599 214591 231719 173174 123980 -74004 139963 328266
$$ packed form
20148e8977k81742J5763N2777R7123J38522l4082K7718K91788J82851k8627j65125
20137B37989k49455n2680J12615R1156j50537r0414K82949K04231M8501k79959
20127A54396L650K8753r5590q1153P908O4190O9409Q2272o5396j98229j02295
20116a32085J70696L36919K0033r6638r6317N9040l00762o0902J21190K36053
20106B57227K36815R4200O7608n4681n7893k96887L1266J44866p6996l29831k37533
20095b21839l9538J06959m8892m478L1200Q7355J6912J57259O2554J17394K7037
20084B91923k26138j90364j26038L13282L77933P0016j88805O7873n2512k41861
20074I5309k75631J98991J39930N5992J7128n8545m9194j97984K13967J88303
$$ plain form
20064 328266 245925 135333 54618 70024 54997 307622 256074 -41761 -215614 -201398 -393516
20053 -393516 -424500 -262765 -157642 -75744 101931 98483 -50101 138683 148958 230676 112253
20042 112253 17298 51785 202658 124901 -134856 17898 23756 183085 280569 444860 328862
20031 328862 126787 57138 -16505 74066 12024 71596 342909 225866 168179 252192 172227
20020 172227 224773 574313 672251 495835 590406 766740 744236 558152 700192 797157
20010 797157 894539 947995 1040322 1004521 1085838 1051047 888814 648278 408346 524360 247757
19999 247757 21275 62409 74472 66711 117060 247868 188581 121701 406012 305492 175920
19988 175920 48481 -156416 -166722 -263336 -658 40676 256867 407739 397920 315756 231128
$$ packed form
20064C28266q2341j10592q0715J5406j5027K52625n1548k97835j73853J4216j92118
20053c93516l0984J61735J05123Q1898J77675l448j48584J88784J0275Q1718j18423
20042A12253r4955L4487J50873p7757k59757J52754N858J59329R7484J64291j15998
20031C28862k02075o9649p3643R0571o2042N9572K71313j17043n7687Q4013p9965
20020A72227N2546L49540R7938j76416R4571J76334k2504j86084J42040R6965
20010G97157R7382N3456R2327l5801Q1317l4791j62233k40536k39932J16014k76603
19999B47757k26482M1134J2063p761N0349J30808n9287o6880K84311j00520j29572
19988A75920j27439k04897j0306r6614K62678M1334K16191J50872r819q2164q4628
$$ plain form
19977 231128 27907 -9371 110937 165388 223439 98321 -88737 -143303 31380 249750
19967 249750 420344 578440 846156 819014 892894 1262061 1353675 1324739 1159513 861521
19957 861521 511519 480844 612776 651392 1012285 1354867 1181062 758357 436945 499089
19947 499089 660758 713707 793276 661048 612652 293929 192528 196982 365861 536315
19937 536315 417752 188733 -66708 -143941 98132 153277 312947 409583 405008 297662
19927 297662 338526 269225 127895 -9583 -26276 94780 174981 99264 -100865 -221495
19917 -221495 -75211 -115151 -132946 109608 392608 794937 797486 653277 404855 353885
19907 353885 417401 520750 539623 517120 408651 14683 -186992 -142673 -229898 -70135
$$ packed form
19977B31128k03221l7278J20308N4451N8051j25118j87058n4566J74683K18370
19967B49750J70594J58096K67716k7142P3880L69167R1614k8936j65226k97992
19957H61521l50002l0675J31932L8616L60893L42582j73805m22705l21412O2144
19947D99089J61669N2949P9569j32228m8396l18723j01401M454J68879J70454
19937E36315j18563k29019k55441p7233K42073N5145J59670R6636m575j07346
19927B97662M0864o9301j41330j37478j6693J21056Q0201p5717k00129j20630
19917b21495J46284l9940j7795K42554K83000M02329K549j44209k48422n0970
19907C53885O3516J03349J8873k2503j08469l93968k01675M4319q7225J59763
$$ plain form
19897 -70135 193712 304422 4292 -170099 -112354 136375 367316 270889 342577 331871
19887 331871 374215 319346 240039 85795 504980 804583 838689 665391 489250 236109
19877 236109 319715 322893 288205 469651 232414 -14638 103141 85595 138644 339490 427264
19866 427264 363656 356358 353340 300723 160868 61514 6594 7337 195759 184837 218482 226470
19854 226470 288546 268931 355669 492030 624544 664406 363448 430227 684119 451326
19844 451326 292332 238266 221248 190090 232396 341600 409520 138636 -70865 83905
19834 83905 602574 461805 291586 272997 419642 479941 469604 414607 517950 527296 366902
19823 366902 292590 146541 52573 56234 -100234 -44628 240562 271816 265574 347269 376853
$$ packed form
19897g0135K63847J10710l00130j74391N7745K48729K30941r6427P1688j0706
19887C31871M2344n4869p9307j54244M19185K99603L4106j73298j76141k53141
19877B36109Q3606L178l4688J81446k37237k47052J17779j7546N3049K00846Q7774
19866D27264o3608p298l018n2617j39855r9354n4920P43J88422j0922L3645P988
19854B26470O2076j9615Q6738J36361J32514L9862l00958O6779K53892k32793
19844D51326j58994n4066j7018l1158M2306J09204O7920k70884k09501J54770
19834H3905N18669j40769j70219j8589J46645O0299j0337n4997J03343R346j60394
19823C66902p4312j46049r3968L661j56468N5606K85190L1254o242Q1695K9584
$$ plain form
19812 376853 480820 313856 364446 331923 300714 465025 384263 172461 172615 22595 -83658
19801 -83658 151930 118960 -134950 -76389 139765 139409 213317 498717 520226 160166 78619
19790 78619 231956 443626 259322 215729 317862 252279 256057 137314 -72332 -21650 164714
19779 164714 341123 248760 60980 -134790 -314710 -90233 335021 304747 186400 203262
19769 203262 92125 25759 -186356 -369005 -431190 -194368 -57707 18984 -157359 -269536
19759 -269536 -240599 48529 509744 537585 347313 179286 267299 506506 555271 560533 151426
19748 151426 50403 214315 59040 98776 77896 -4527 53287 197399 294740 510409
19738 510409 616172 714405 654711 756365 776113 688915 619229 653977 992496 1216070 1367304
$$ packed form
19812C76853J03967j66964N0590l2523l1209J64311q0762k11802J54j50020j06253
19801h3658K35588l2970k53910N8561K16154l56P3908K85400K1509l60060q1547
19790G8619J53337K11670j84304m3593J02133o5583L778j18743k09646N0682J86364
19779A64714J76409r2363j87780j95770j79920K24477M25254l0274j18347J6862
19769B03262j11137o6366k12115j82649o2185K36822J36661P6691j76343j12177
19759b69536K8937K89128M61215K7841j90272j68027Q8013K39207M8765N262m09107
19748A51426j01023J63912j55275L9736k0880q2423N7814J44112R7341K15669
19738E10409J05763R8233n9694J01654J9748q7198o9686L4748L38519K23574J51234
$$ plain form
19727 1367304 1433897 1415989 1329708 1301278 1279064 1159139 1303761 1300639 1380743 1216573 1152611
19716 1152611 956931 830788 676040 757559 890691 673793 556064 619097 766749 444766
19706 444766 249659 213619 120860 -153915 -130653 24219 152906 273143 346093 609753
19696 609753 529673 485319 542802 507994 489288 577306 911274 1012372 824271 714909 997169
19685 997169 1120040 990059 1101960 1204136 1278725 1219838 1118410 1098851 1367078 1680487
19675 1680487 1815355 1809216 1756268 1791148 1934548 2216260 2149911 1894911 1832113 1937358
19665 1937358 2040168 1989086 2205019 2405604 2500508 2185567 1941316 2151495 2135802 1950124
19655 1950124 1744323 1478350 1387548 1452087 1639457 1506885 1527349 1493413 1372651 1215424
$$ packed form
19727A367304O6593j7908q6281k8430k2214j19925J44622l122Q0104j64170o3962
19716A152611j95680j26143j54748Q1519J33132k16898j17729O3033J47652l21983
19706D44766j95107l6040r2759k74775K3262J54872J28687J20237P2950K63660
19696F09753q0080m4354N7483l4808j8706Q8018L33968J01098j88101j09362K82260
19685I97169J22871j29981J11901J02176P4589n8887j01428j9559K68227L13409
19675A680487J34868o139n2948L4880J43400K81712o6349k55000o2798J05245
19665A937358J02810n1082K15933K00585R4904l14941k44251K10179j5693j85678
19655A950124k05801k65973r0802O4539J87370j32572K0464l3936j20762j57227
$$ plain form
19645 1215424 1186163 919985 655423 923385 951433 751813 601032 693712 714744 867988
19635 867988 863369 671925 646562 692195 414706 509109 655848 749794 612244 492846 423507
19624 423507 445151 698094 601043 518718 560923 760999 1005976 1093635 949114 1031731 989651
19613 989651 978529 865673 717651 811375 986017 890659 948100 691580 611106 643787 932036
19602 932036 1134084 1074409 980726 1068100 1246778 1077912 973994 982198 1007424 1069345 1103745
19591 1103745 1153133 1229144 963031 685346 626036 796050 1101283 1360417 1432900 1302293
19581 1302293 1239767 1477298 1535027 1559285 1529128 1521903 1369461 1342400 1272681 1447837 1729933
19570 1729933 1702779 1286620 968871 688071 738430 940490 990236 849190 852314 916604
$$ packed form
19645A215424k9261k66178k64562K67962K8048j99620j50781R2680K1032J53244
19635H67988m619j91444k5363M5633k77489R4403J46739R3946j37550j19398o9339
19624D23507K1644K52943r7051q2325M2205K00076K44977Q7659j44521Q2617m2080
19613I89651j1122j12856j48022R3724J74642r5358N7441k56520q0474L2681K88249
19602I32036K02048n9675r3683Q7374J78678j68866j03918Q204K5226O1921L4400
19591A103745M9388P6011k66113k77685n9310J70014L05233K59134P2483j30607
19581A302293o2526K37531N7729K4258l0157p225j52442k7061o9719J75156K82096
19570A729933k7154m16159l17749k80800N0359K02060M9746j41046L124O4290
$$ plain form
19560 916604 1192008 1655626 1608482 1464961 1606663 1483135 1319589 1225391 1551163 1593831
19550 1593831 1727452 1525643 1598163 1549983 1416864 1553962 1650658 1690847 1792451 1678129
19540 1678129 1581686 1696290 1557388 1637658 1687821 1777971 1668394 1757464 1939925 2278420
19530 2278420 2346234 2623115 2799133 2740564 2816388 2988903 3164608 3269395 3659091 3740706
19520 3740706 3780502 3820020 3843022 4039690 4015478 4144593 4477867 4661773 4857137 4968769
19510 4968769 5083612 5493299 6015644 6406495 6690276 7192000 7901796 8708112 9464381
19501 9464381 10059366 10706436 11370560 12211891 13073470 14042839 15246897 17023375 19480953
19492 19480953 22592106 26988263 33201330 42054508 54373979 71386123 93973661 121000936
$$ packed form
19560I16604K75404M63618m7144j43521J41702j23528j63546r4198L25772M2668
19550A593831J33621k01809P2520m8180j33119J37098R6696M0189J01604j14322
19540A678129r6443J14604j38902Q0270N0163R0150j09577Q9070J82461L38495
19530B278420O7814K76881J76018n8569P5824J72515J75705J04787L89696Q1615
19520C740706L9796L9518K3002J96668k4212J29115L33274J83906J95364J11632
19510D968769J14843M09687N22345L90851K83781N01724P09796Q06316P56269
19501I464381N94985O47070O64124Q41331Q61579R69369J204058J776478K457578
19492A9480953L111153M396157O213067Q853178J2319471J7012144K2587538K7027275
$$ plain form
19484 121000936 150168587 177068451 197093822 208373488 208367361 201414669 198269014 203608934
19476 203608934 213381826 217539754 211281421 189148594 151400158 112585992 83438296
19469 83438296 63584442 50176955 41005635 34844652 30428169 27313548 25128834 23235012
19461 23235012 22133986 21388987 20876505 20481107 20253948 19828280 19664700 19621467 19707997
19452 19707997 19525008 19238695 19135148 19453481 19725992 20261780 20941998 22261743 23951939
19443 23951939 26069180 29300512 33457344 39801878 49498221 63383256 83613295 110308951
19435 110308951 141387897 175063579 206119206 227761391 238234501 233539436 219759793
19428 219759793 212439789 215816392 223450316 225332179 216163028 191283131 152850012 114411775
$$ packed form
19484A21000936K9167651K6899864K0025371J1279666o127o952692l145655N339920
19476B03608934R772892M157928o258333k2132827l7748436l8814166k9147696
19469H3438296j9853854j3407487r171320o160983m416483l114621k184714j893822
19461B3235012j101026p44999n12482l95398k27159m25668j63580m3233Q6530
19452A9707997j82989k86313j03547L18333K72511N35788O80218J319745J690196
19443B3951939K117241L231332M156832O344534R696343J3885035K0230039K6695656
19435A10308951L1078946L3675682L1055627K1642185J0473110m695065j3779643
19428B19759793p320004L376603P633924J881863r169151k4879897l8433119l8438237
$$ plain form
19420 114411775 85135744 64904646 50964432 41201219 34475239 29974745 26840807
19413 26840807 24578670 22561296 20658653 18979091 18023093 17110608 16197462 15319320 14224923
19404 14224923 13299986 12519450 11552296 10622785 10044232 9622726 8913859 8348822 8053194
19395 8053194 7651326 7296852 7085828 6868325 6434152 6203042 6092918 5803555 5702010
19386 5702010 5298766 4964368 4685606 4639772 4584981 4531638 4635348 4453998 4390364 4289515
19376 4289515 4151895 4022594 4233570 3746482 3484630 3491439 3467616 3761769 3858233 3566860
19366 3566860 3410558 3353939 3214375 3276238 3201783 2945050 2886457 2592189 2434225 2619676
19356 2619676 2658364 2609564 2685072 2552251 2680082 2552660 2435511 2253832 2292358 2553327
$$ packed form
19420A14411775k9276031k0231098j3940214r763213o725980m500494l133938
19413B6840807k262137k017374j902643j679562r55998r12485r13146q78142j094397
19404A4224923r24937p80536r67154r29511n78553m21506p08867n65037k95628
19395H053194m01868l54474k11024k17503m34173k31110j10124k89363j01545
19386E702010m03244l34398k78762m5834n4791n3343J03710j81350o3634j00849
19376D289515j37620j29301K10976m87088k61852O809k3823K94153R6464k91373
19366C566860j56302n6619j39564O1863p4455k56733n8593k94268j57964J85451
19356B619676L8688m8800P5508j32821J27831j27422j17149j81679L8526K60969
$$ plain form
19346 2553327 2672410 2503812 2373162 2081816 1988328 1973080 1957397 1893538 2189107 2156922
19336 2156922 2158957 2213006 2066996 2197484 2470265 2350926 2329149 2473589 2682034 2623889
19326 2623889 2676562 2936588 2734140 2747195 2781823 2648925 2755773 2833351 2762380 2525673
19316 2525673 2486753 2591171 2872499 2971721 2967918 2762340 2539637 2491400 2635531 2682910
19306 2682910 2670221 2523612 2431753 2533020 2871400 2985987 2573194 2253225 2075300 1870983
19296 1870983 1827240 1959264 1944224 1999935 1863192 1417457 1392722 1488428 1477029 1434688 1399430
19285 1399430 1543505 1639499 1929130 1903617 1660477 1766654 1812450 1645904 1627992 1757696
19275 1757696 1893554 1997585 1872189 2094454 2173788 2359568 2313785 2150294 2158507 2191825
$$ packed form
19346B553327J19083j68598j30650k91346r3488j5248j5683o3859K95569l2185
19336B156922K035N4049j46010J30488K72781j19339k1777J44440K08445n8145
19326B623889N2673K60026k02448J3055L4628j32898J06848P7578p0971k36707
19316B525673l8920J04418K81328R9222l803k05578k22703m8237J44131M7379
19306B682910j2689j46609r1859J01267L38380J14587m12793l19969j77925k04317
19296A870983m3743J32024j5040N5711j36743m45735k4735R5706j1399m2341l5258
19285A399430J44075R5994K89631k5513k43140J06177M5796j66546j7912J29704
19275A757696J35858J04031j25396K22265P9334J85780m5783j63491Q213L3318
$$ plain form
19265 2191825 2256036 2542560 2991592 3109488 2951096 2909597 3122014 3193239 3137952 2637940
19255 2637940 2639856 2851653 2963061 3196754 3283362 3311727 3522342 3598632 3373085 3209804
19245 3209804 3348652 3596033 3934232 4000125 4004810 3814567 3798544 4216707 4573309 4700144
19235 4700144 4795151 4907831 5380255 5427308 5669706 6270966 6747262 6983875 7124786 7515137
19225 7515137 8055802 8708574 9508019 10145280 10518764 10956030 11710204 12862508 14097044
19216 14097044 15364345 16933184 18384781 20111019 22535915 25598270 30253074 37006738
19208 37006738 46504012 59856519 78895861 104484762 135693448 166107016 188341661
19201 188341661 202451148 209127836 204910323 196093079 195811735 203935415 208671207 205878151
$$ packed form
19265B191825O4211K86524M49032J17896j58392m1499K12417P1225n5287n00012
19255B637940J916K11797J11408K33693Q6608K8365K10615P6290k25547j63281
19245C209804J38848K47381L38199O5893M685j90243j6023M18163L56602J26835
19235D700144R5007J12680M72424M7053K42398O01260M76296K36613J40911L90351
19225G515137N40665O52772P99445O37261L73484M37266P54174J152304J234536
19216A4097044J267301J568839J451597J726238K424896L062355M654804O753664
19208C7006738R497274J3352507J9039342K5588901L1208686L0413568K2234645
19201A88341661J4109487O676688m217513q817244k81344Q123680M735792k793056
$$ plain form
19193 205878151 196712589 172629124 134088047 97892075 72999435 57192274 46767669
19186 46767669 39460173 34404726 30884222 28491785 26418454 24851938 23788864 23098127
19178 23098127 22602354 21936101 21907856 21877783 21609584 21312473 21155641 21136161 20916343 20985650
19168 20985650 21332068 22056939 23153192 24556117 26366200 28427346 30809461 34572323
19160 34572323 40130399 48496013 60546717 78561886 104552922 138779136 178013753
19153 178013753 210970982 231570517 243783030 243837824 228399337 213849912 213177779 218346341
19145 218346341 218328623 211434872 194194001 161253375 121967292 89946416 68079817
19138 68079817 53808182 44113787 37219700 32227037 28449743 25623488 23631082 21854947
$$ packed form
19193B05878151r165562k4083465l8541077l6195972k4892640j5807161j0424605
19186D6767669p307496n055447l520504k392437k073331j566516j063074o90737
19178B3098127m95773o66253k8245l0073k68199k97111j56832j9480k19818O9307
19168B0985650L46418P24871J096253J402925J810083K061146K382115L762862
19160C4572323N558076Q365614J2050704J8015169K5991036L4226214L9234617
19153A78013753L2957229K0599535J2212513N4794j5438487j4549425o72133N168562
19145B18346341j7718o893751j7240871l2940626l9286083l2020876k1866599
19138F8079817j4271635r694395o894087m992663l777294k826255j992406j776135
$$ plain form
19130 21854947 20526927 19185463 17868508 16429164 15456036 14844314 13857704 13153198 12692221
19121 12692221 11715669 10501938 9802541 9324382 8855205 8484429 8175467 7739033 7187216
19112 7187216 6799696 6669578 6412265 6294032 6195894 6024789 5703258 5251112 4941545 4856931
19102 4856931 4780014 4879745 4815223 4684200 4316376 3880208 3683921 3858800 3696004 3564555
19092 3564555 3205988 2989350 3085760 3285349 3431316 3459585 3288843 3376204 3392666 3137886
19082 3137886 3066828 3046554 2980414 2827558 2710275 2529696 2535132 2378207 2432638 2601532
19072 2601532 2649642 2529304 2277087 2381874 2520954 2477885 2264164 2193931 2071297 1986473
19062 1986473 1820328 1638419 1625565 1910120 2015121 1614206 1399295 1525560 1510751 1385106
$$ packed form
19130B1854947j328020j341464j316955j439344r73128o11722r86610p04506m60977
19121A2692221r76552j213731o99397m78159m69177l70776l08962m36434n51817
19112G187216l87520j30118k57313j18233r8138j71105l21531m52146l09567q4614
19102D856931p6917R9731o4522j31023l67824m36168j96287J74879j62796j31449
19092C564555l58567k16638R6410J99589J45967K8269j70742Q7361J6462k54780
19082C137886p1058k0274o6140j52856j17283j80579N436j56925N4431J68894
19072B601532M8110j20338k52217J04787J39080m3069k13721p0233j22634q4824
19062A986473j66145j81909j2854K84555J05001m00915k14911J26265j4809j25645
$$ plain form
19052 1385106 1237503 1350067 1389542 1377941 1344592 1215211 1448912 1829996 1602069 1167964
19042 1167964 1391221 1554684 1503117 1199061 1161467 1116906 1340149 1218590 1080715 1221646
19032 1221646 1359541 1178317 1250898 1455387 1368562 1279001 1335131 1486316 1638271 1564943
19022 1564943 1393494 1190590 902524 996161 973269 825667 858346 847441 816229 1086515
19012 1086515 943955 647233 497432 469589 350504 562372 523739 689018 663003 466454
19002 466454 379844 185864 338218 725152 984514 1188413 1240927 952860 826579 924560
18992 924560 626818 280005 304139 459462 550688 552367 453307 492420 696627 538193 520502
18981 520502 437967 344367 276690 361100 336619 331481 527443 647879 802862 573075 436767
$$ packed form
19052A385106j47603J12564L9475j1601l3349j29381K33701L81084k27927m34105
19042A167964K23257J63463n1567l04056l7594m4561K23243j21559j37875J40931
19032A221646J37895j81224P2581K04489q6825q9561N6130J51185J51955p3328
19022A564943j71449k02904k88066R3637k2892j47602L2679j0905l1212K70286
19012A086515j42560k96722j49801k7843j19085K11868l8633J65279k6015j96549
19002D66454q6610j93980J52354L86934K59362K03899N2514k88067j26281R7981
18992I24560k97742l46813K4134J55323R1226J679r9060L9113K04207j58434j7691
18981E20502q2535r3600o7677Q4410k4481n138J95962J20436J54983k29787j36308
$$ plain form
18970 436767 391102 473422 442860 349397 398352 427932 584706 806370 851597 951737 1019587
18959 1019587 1010276 932434 845026 896555 820555 891992 1253800 1592659 1603823 1628609 1684578
18948 1684578 1454547 1553740 1935970 2260858 2206965 1819532 1850715 1879557 1772546 1768867
18938 1768867 1680927 1682003 1428604 1337604 1305751 1184255 1084401 928395 813557 642550
18928 642550 551836 635002 949836 1049501 960624 985071 1210114 1430023 1231579 1035693
18918 1035693 965352 824683 980009 942793 987593 1001554 1009062 966842 1159942 1326763 1150328
18907 1150328 979014 941231 985471 1285100 1304907 1533362 1599228 1767650 2250753 2503953
18897 2503953 2628295 2552761 2607945 2727334 2764314 2648689 2740094 2506259 2682895 2408339
$$ packed form
18970D36767m5665Q2320l0562r3463M8955K9580J56774K21664M5227J00140O7850
18959A019587r311p7842q7408N1529p6000P1437L61808L38859J1164K4786N5969
18948A684578k30031R9193L82230L24888n3893l87433L1183K8842j07011l679
18938A768867q7940J076k53399r1000l1853j21496r9854j56006j14838j71007
18928F42550r0714Q3166L14834R9665q8877K4447K25043K19909j98444j95886
18918A035693p0341j40669J55326l7216M4800J3961P508m2220J93100J66821j76435
18907A150328j71314l7783M4240K99629J9807K28455O5866J68422M83103K53200
18897B503953J24342p5534N5184J19389L6980j15625R1405k33835J76636k74556
$$ plain form
18887 2408339 2262608 2213354 1891378 1686572 1673255 1639147 1469562 1407364 1395865 1232629
18877 1232629 1135834 1302208 1423710 1313490 1243447 1365894 1423700 1479900 1603633 1358437
18867 1358437 1115730 1125613 1284592 1301857 1388418 1162655 868168 893844 972375 920669 943917
18856 943917 1017517 1213256 1253403 1204521 1221470 1035366 1012311 1029713 1050130 1069123 1175142
18845 1175142 945652 794115 1013525 1033895 1212512 1533196 1383138 1515961 1485634 1249114
18835 1249114 1118017 1201904 1150240 1347802 1373454 1576169 1303373 1379827 1515932 1684341
18825 1684341 1705687 1703273 1910542 2078898 1800570 1657109 1563260 1470082 1415030 1630943
18815 1630943 1636157 1685950 1894379 1975300 2027148 2156214 2074980 2131473 2471708 2604654 2537805
$$ packed form
18887B408339j45731m9254l21976k04806j3317l4108j69585o2198j1499j63236
18877A232629r6795J66374J21502j10220p0043J22447N7806N6200J23733k45196
18867A358437k42707R883J58979J7265Q6561k25763k94487K5676P8531n1706K3248
18856I43917P3600J95739M0147m8882J6949j86104k3055J7402K0417J8993J06019
18845A175142k29490j51537K19410K0370J78617L20684j50058J32823l0327k36520
18835A249114j31097Q3887n1664J97562K5652K02715k72796P6454J36105J68409
18825A684341K1346k414K07269J68356k78328j43461r3849r3178n5052K15913
18815A630943N214M9793K08429Q0921N1848J29066q1234N6493L40235J32946o6849
$$ plain form
18804 2537805 2388600 2574918 2599999 2414219 2180808 2114806 1934083 1706168 1610041 1661189
18794 1661189 1687306 1668967 1629537 1640298 1565979 1517143 1494272 1512207 1876983 2057172 2298592
18783 2298592 2486737 2375305 1993384 1762789 1540112 1247563 1311233 1284070 1066462 1107607
18773 1107607 1058560 1287543 1407734 1424731 1523477 1507590 1655592 1789434 1945874 2247354
18763 2247354 2568739 2587410 2331137 2181530 2012571 1985267 1813643 1578069 1491920 1360146
18753 1360146 1365658 1565093 1536808 1612709 1588116 1421842 1293932 1298211 1188696 981462 809232
18742 809232 857031 936957 1122092 948898 787291 836431 1157415 1163770 1340040 1580287
18732 1580287 1566404 1488567 1586337 1697378 1507595 1255269 1409087 1646233 1652299 1477945
$$ packed form
18804B537805j49205J86318K5081j85780k33411o6002j80723k27915r6127N1148
18794A661189K6117j8339l9430J0761p4319m8836k2871J7935L64776J80189K41420
18783B298592J88145j11432l81921k30595k22677k92549O3670k7163k17608M1145
18773A107607m9047K28983J20191J6997R8746j5887J48002J33842J56440L01480
18763B247354L21385J8671k56273j49607j68959k7304j71624k35574q6149j31774
18753A360146N512J99435k8285P5901k4593j66274j27910M279j09515k07234j72230
18742H09232M7799P9926J85135j73194j61607M9140L20984O355J76270K40247
18732A580287j3883p7837R7770J11041j89783k52326J53818K37146O066j74354
$$ plain form
18722 1477945 1538244 1820660 2009738 1988219 2294999 2539784 2237364 2092786 2121388 2100143
18712 2100143 1800390 1604127 1431723 1383405 1307942 942815 813646 760990 892075 1259583
18702 1259583 1314594 1284754 1240670 1390432 1436406 1234477 1179072 1217648 1256064 1380692 1450307
18691 1450307 1693104 1760995 1650924 1602043 1623713 1649181 1541904 1446900 1748958 2079480
18681 2079480 2237354 2312439 2245213 2100678 2294259 2595347 2619062 2571724 2687105 2950635
18671 2950635 3276275 3656462 3794338 4130891 4769038 5344083 5476000 5425964 4842152 4289696
18661 4289696 3925388 3368425 2904260 2312327 1894904 1921987 1822814 1782388 1850370 1855981
18651 1855981 1803953 1624185 1852567 2134253 2328642 2456711 2553652 2685578 2807287 2738598
$$ packed form
18722A477945O0299K82416J89078k1519L06780K44785l02420j44578K8602k1245
18712B100143k99753j96263j72404m8318p5463l65127j29169n2656J31085L67508
18702A259583N5011k9840m4084J49762M5974k01929n5405L8576L8416J24628O9615
18691A450307K42797O7891j10071m8881K1670K5468j07277r5004L02058L30522
18681B079480J57874P5085o7226j44535J93581L01088K3715m7338J15381K63530
18671B950635L25640L80187J37876L36553O38147N75045J31917n0036n83812n52456
18661D289696l64308n56963m64165n91933m17423K7083r9173m0426O7982N611
18651A855981n2028j79768K28382K81686J94389J28069R6941J31926J21709o8689
$$ plain form
18641 2738598 2613205 2450493 2407041 2404580 2324479 2212645 2271348 2331185 2385270 2832350 3013019
18630 3013019 3138010 3362718 3450713 3630357 3665154 3576784 3529130 3122307 3099280 3278390
18620 3278390 3294653 3181703 3018763 2911872 2828795 2579255 2352855 2339507 2393695 2390115
18610 2390115 2520885 2317479 2140606 2351004 2360471 2390218 2099620 1783214 1518708 1262884
18600 1262884 1122315 1124283 1132875 1083533 1034258 907257 866077 913078 916107 920247 613562
18589 613562 589686 976334 1111609 1065457 893462 667138 593215 523346 646862 1140211
18579 1140211 1369997 1235030 967405 865481 975310 993153 730872 478796 320227 355141
18569 355141 596880 561539 363973 461222 532160 676797 613465 581324 657212 595512 629454
$$ packed form
18641B738598j25393j62712m3452k461q0101j11834N8703N9837N4085M47080J80669
18630C013019J24991K24708Q7995J79644L4797q8370m7654m06823k3027J79110
18620C278390J6263j12950j62940j06891q3077k49540k26400j3348N4188l580
18610B390115J30770k03406j76873K10398R467K9747k90598l16406k64506k55824
18600A262884j40569J968Q592m9342m9275j27001m1180M7001L029M140l06685
18589F13562k3876L86648J35275m6152j71995k26324p3923o9869J23516M93349
18579A140211K29786j34967k67625j01924J09829J7843k62281k52076j58569L4914
18569C55141K41739l5341j97566R7249P0938J44637o3332l2141P5888o1700L3942
$$ plain form
18558 629454 571496 587837 540822 668587 608237 500570 343609 293870 289107 304690 428867
18547 428867 607274 732749 751991 917551 687679 460072 481222 349773 295235 403453
18537 403453 638404 664791 479502 653548 1018242 1105615 1103633 1206688 1163566 949984
18527 949984 741035 639318 592921 750165 832653 720108 534055 518780 637820 639717
18517 639717 663048 532639 618377 534874 304096 125866 129212 262868 304529 130644 252659
18506 252659 336343 128190 49554 203056 404692 520981 548538 778138 852967 673723
18496 673723 467229 482106 670267 769623 488426 304156 268192 497863 547862 731072
18486 731072 566318 524246 482191 553693 342076 241381 478378 561246 786753 858059
$$ packed form
18558F29454n7958J6341m7015J27765o0350j07667j56961m9739m763J5583J24177
18547D28867J78407J25475J9242J65560k29872k27607K1150j31449n4538J08218
18537D03453K34951K6387j85289J74046L64694Q7373j982J03055m3122k13582
18527I49984k08949j01717m6397J57244Q2488j12545j86053j5275J19040J897
18517F39717K3331j30409Q5738q3503k30778j78230L346J33656M1661j73885J22015
18506B52659Q3684k08153p8636J53502K01636J16289K7557K29600P4829j79244
18496F73723k06494J4877J88161R9356k81197j84270l5964K29671M9999J83210
18486G31072j64754m2072m2055P1502k11617j00695K36997Q2868K25507P1306
$$ plain form
18476 858059 951611 747819 686510 540481 617365 872296 992783 763818 667102 869978
18466 869978 773653 763772 945882 895541 870858 885392 835737 709333 865445 802000 1062245
18455 1062245 1184521 1187464 1114598 1220488 1324811 1194191 1132574 918376 694855 786458
18445 786458 1099292 1084235 922763 843476 1009892 1189385 1400581 1358143 1159409 1020814
18435 1020814 1029222 1198892 1157404 1013125 943008 1017829 1236960 1480687 1552297 1322311
18425 1322311 1454993 1705544 1693375 1514800 1289503 1176615 1086407 1071076 1082116 1012562
18415 1012562 1081318 1206741 1211526 1113384 1261096 1241666 1396771 1464989 1493020 1533751 1429716
18404 1429716 1312081 1450804 1656811 1688045 1824216 1785638 1752983 1614708 1548046 1367323
$$ packed form
18476H58059R3552k03792o1309j46029P6884K54931J20487k28965r6716K02876
18466H69978r6325r881J82110n0341k4683J4534m9655j26404J56112o3445K60245
18455A062245J22276K943p2866J05890J04323j30620o1617k14198k23521R1603
18445G86458L12834j5057j61472p9287J66416J79493K11196m2438j98734j38595
18435A020814Q408J69670m1488j44279p0117P4821K19131K43727P1610k29986
18425A322311J32682K50551j2169j78575k25297j12888r0208j5331J1040o9554
18415A012562O8756J25423M785r8142J47712j9430J55105O8218K8031M0731j04035
18404A429716j17635J38723K06007L1234J36171l8578l2655j38275o6662j80723
$$ plain form
18394 1367323 1342133 1486407 1211354 1334563 1551179 1629765 1461242 1290529 1080047 1113485
18384 1113485 1189129 1199424 1078364 1092832 1070098 850720 762413 845283 963481 1041879 1247929
18373 1247929 1307794 1135563 1042127 1097705 1069332 950496 745198 718616 720385 852777 1229568
18362 1229568 1170979 1143492 921080 1005818 946119 1046105 1271812 1099108 731300 729057 890613
18351 890613 772701 941778 974101 976787 1025260 1075760 1060356 971636 901636 804688 947055
18340 947055 1164808 1062887 818985 863257 895867 712702 678497 626233 850091 960127
18330 960127 947748 941575 885955 733264 835611 943352 1106805 1107926 1075052 983085 866363
18319 866363 779823 1058400 777381 515715 755464 756426 873026 804324 757973 775584 575511
$$ packed form
18394A367323k5190J44274k75053J23209K16616P8586j68523j70713k10482L3438
18384A113485P5644J0295j21060J4468k2734k19378q8307Q2870J18198P8398K06050
18373A247929N9865j72231r3436N5578k8373j18836k05298k6582J769J32392L76791
18362A229568n8589k7487k22412Q4738n9699R9986K25707j72704l67808k243J61556
18351H90613j17912J69077L2323K686M8473N0500j5404q8720p0000r6948J42367
18340I47055K17753j01921k43902M4272L2610j83165l4205n2264K23858J10036
18330I60127j2379o173n5620j52691J02347J07741J63453J121l2874r1967j16722
18319H66363q6540K78577k81019k61666K39749R62J16600o8702m6351J7611k00073
$$ plain form
18308 575511 409585 513922 545370 586377 813484 688273 747781 1322592 1417385 1223042
18298 1223042 1358377 1386585 1254287 1173187 1297268 1295131 1321642 1447154 1341409 1170783
18288 1170783 1413458 1521859 1556510 1537193 1330679 1450201 1648682 1657601 1594404 1469464
18278 1469464 1286500 1115603 1155808 1339109 1405124 1626301 1829869 2035677 2041709 1821236
18268 1821236 1662519 1700659 1656242 1731407 1520881 1312901 1363090 1478276 1390209 1452034
18258 1452034 1490286 1767603 2133843 1922944 2073362 2550095 2580558 2458892 2442038 2574826
18248 2574826 2474370 2369085 2668207 2667583 2636481 2615599 2773338 3027111 3099441 3020541 3026598
18237 3026598 3308607 3634369 3605478 3625825 3780086 4007323 4158383 4177655 4237028 4232392
$$ packed form
18308E75511j65926J04337L1448M1007K27107j25211N9508N74811R4793j94343
18298A223042J35335K8208j32298q1100J24081k137K6511J25512j05745j70626
18288A170783K42675J08401L4651j9317k06514J19522J98481Q919o3197j24940
18278A469464j82964j70897M0205J83301O6015K21177K03568K05808O032k20473
18268A821236j58717L8140m4417P5165k10526k07980N0189J15186q8067O1825
18258A452034L8252K77317L66240k10899J50418M76733L0463j21666j6854J32788
18248B574826j00456j05285K99122o24l1102k0882J57739K53773P2330p8900O057
18237C026598K82009L25762k8891K0347J54261K27237J51060J9272N9373m636
$$ plain form
18227 4232392 4524953 4752827 4882246 5195540 5953082 6503655 6897376 7341907 7521111
18218 7521111 7478702 7417276 7146264 7132333 7236691 7638575 8183072 9155465 10184257 11251988
18208 11251988 12560731 14376284 16660326 19725375 23748378 29294832 37268952 48706237
18200 48706237 65167644 87536731 114133670 142506388 170019535 188865323 194103164
18193 194103164 181352559 150396811 113919236 84081996 63140823 48819831 38861970
18186 38861970 32067692 27152337 23768949 21202745 19169810 18094448 17264119 16465259
18178 16465259 15664475 15111997 14638795 14411121 14270193 14354577 14644438 15121422 15329174
18169 15329174 15292683 15204325 14912774 14745767 14923175 15401836 16114226 17484564 19183740
$$ packed form
18227D232392K92561K27874J29419L13294P57542N50573L93721M44531J79204
18218G521111m2409o1426k71012j3931J04358M01884N44497R72393J028792J067731
18208A1251988J308743J815553K284042L065049M023003N546454P974120J1437285
18200D8706237J6461407K2369087K6596939K8372718K7513147J8845788N237841
18193A94103164j2750605l0955748l6477575k9837240k0941173j4320992r957861
18186C8861970o794278m915355l383388k566204k032935j075362q30329p98860
18178A6465259q00784n52478m73202k27674j40928Q4384K89861M76984K07752
18169A5329174l6491q8358k91551j67007J77408M78661P12390J370338J699176
$$ plain form
18160 19183740 20671472 22547715 24979156 28046722 32435908 37966089 45856835 57122661
18152 57122661 73295026 96419216 129025488 171412357 220495920 272219097 318549124
18145 318549124 346093408 346951452 313937854 252519826 188234008 138470620 103813629
18138 103813629 80007215 63496591 51992953 43607644 37286797 32765006 29279969
18131 29279969 26603227 24455825 22702489 21179420 19702082 18476094 17685400 17234425
18123 17234425 16773715 16253689 16050721 15982019 15687280 14909028 14289368 14097947 14023387 14249206
18113 14249206 14483586 14581947 14966868 15442088 15711204 16453510 17450694 19113638 21640932
18104 21640932 25362828 30780375 38687508 50464681 67102362 88346104 112317955
$$ packed form
18160A9183740J487732J876243K431441L067566M389186N530181P890746J1265826
18152E7122661J6172365K3124190L2606272M2386869M9083563N1723177M6330027
18145C18549124K7544284Q58044l3013598o1418028o4285818m9763388l4656991
18138A03813629k3806414j6510624j1503638q385309o320847m521791l485037
18131B9279969k676742k147402j753336j523069j477338j225988p90694m50975
18123A7234425m60710n20026k02968o8702k94739p78252o19660j91421p4560K25819
18113A4249206K34380R8361L84921M75220K69116P42306R97184J662944K527294
18104B1640932L721896N417547P907133J1777173J6637681K1243742K3971851
$$ plain form
18097 112317955 137485484 158351360 168056817 164107356 142750308 110315497 80617515
18090 80617515 59157367 44523778 34764739 28007058 23418698 20010702 17471199 15458216
18082 15458216 13700997 12505673 11283685 10183449 9257124 8640203 8056427 7861662 7736072
18073 7736072 7610807 7314722 6993246 6690738 6466623 6420336 6107150 5886492 5645671 5426191
18063 5426191 5375818 5074782 4788461 4757529 4717174 4297099 3863219 3649535 3514592 3302395
18053 3302395 3141473 2899936 3127598 3201308 3111306 2950128 2875760 2797494 2613886 2562916
18043 2562916 2294755 2309756 2276695 2074646 1990478 2039633 2182025 2117917 1988653 2084217
18033 2084217 1966175 1807562 1804020 1910359 1957178 1778099 1796809 1895845 1821105 1871391 1684721
$$ packed form
18097A12317955K5167529K0865876R705457l949461k1357048l2434811k9697982
18090H0617515k1460148j4633589r759039o757681m588360l407996k539503k012983
18082A5458216j757219j195324j221988j100236r26325o16921n83776j94765j25590
18073G736072j25265k96085l21476l02508k24115m6287l13186k20658k40821k19480
18063E426191n0373l01036k86321l0932m0355m20075m33880k13684j34943k12197
18053C302395j60922k41537K27662P3710r0002j61178p4368p8266j83608n0970
18043B562916k68161J5001l3061k02049q4168M9155J42392o4108j29264R5564
18033B084217j18042j58613l542J06339M6819j79079J8710R9036p4740N0286j86670
$$ plain form
18022 1684721 1662224 1647070 1495727 1569544 1855568 1772616 1656063 1645567 1683964 1828605
18012 1828605 1536286 1266390 1344971 1399750 1509095 1457620 1286500 1265194 1388591 1520560
18002 1520560 1395078 1327068 825980 570191 600963 690734 740559 730879 738129 806261 833663
17991 833663 903809 1102598 903480 756823 717205 617638 654011 528549 362460 374586
17981 374586 311473 378872 512105 776248 777679 502454 689415 928539 901300 1034764
17971 1034764 1020181 674616 441227 263980 296528 387958 288460 287705 324034 354566 456019
17960 456019 617303 712480 888954 839152 693055 621584 436139 253124 217750 439048
17950 439048 496218 546152 783541 877476 715860 672086 634059 681925 789692 490281 387217
$$ packed form
18022A684721k2497j5154j51343P3817K86024q2952j16553j0496L8397J44641
18012A828605k92319k69896P8581N4779J09345n1475j71120k1306J23397J31969
18002A520560j25482o8010n01088k55789L0772Q9771M9825r680P250O8132K7402
17991H33663P0146J98789j99118j46657l9618r9567L6373j25462j66089J2126
17981C74586o3113O7399J33233K64143J431k75225J86961K39124k7239J33464
17971A034764j4583l45565k33389j77247L2548R1430r9498p55L6329L0532J01453
17960D56019J61284R5177J76474m9802j46097p1471j85445j83015l5374K21298
17950D39048N7170M9934K37389R3935j61616m3774l8027M7866J07767k99411j03064
$$ plain form
17939 387217 465920 376046 233849 276998 230880 20883 -74235 98193 343263 477008
17929 477008 533628 470505 366047 92024 57595 151902 209999 158466 343142 521394 472210
17918 472210 525172 530772 536352 513127 304564 327605 507377 622815 612568 610037 526500
17907 526500 301042 244755 209948 286527 334514 144335 -67463 -94379 -66354 95361 189278
17896 189278 258466 186672 88647 110059 319296 460863 356660 423644 374046 95693 95022
17885 95022 120949 75457 120198 217913 365273 436814 349834 275588 247268 189988 297022
17874 297022 333441 444557 396119 277364 320966 423867 418895 418424 385682 236641 277177
17863 277177 330393 327510 313966 232215 279118 403184 366257 285629 424447 540595 222328
$$ packed form
17939C87217P8703q9874j42197M3149m6118k09997r5118J72428K45070J33745
17929D77008N6620o3123j04458k74023l4429R4307N8097n1533J84676J78252m9184
17918D72210N2962N600N580k3225k08563K3041J79772J15438j0247k531q3537
17907E26500k25458n6287l4807P6579M7987j90179k11798k6916K8025J61715R3917
17896A89278O9188p1794r8025K1412K09237J41567j04203O6984m9598k78353o71
17885I5022K5927m5492M4741R7715J47360P1541q6980p4246k8320n7280J07034
17874B97022L6419J11116m8438j18755M3602J02901m972m71l2742j49041M0536
17863B77177N3216k883j3544q1751M6903J24066l6927q0628J38818J16148l18267
$$ plain form
17852 222328 84684 111326 141857 108891 410981 442863 214782 135664 447562 656527
17842 656527 558397 376646 336634 343278 235100 284812 341384 262344 252383 244130 281916 133184
17830 133184 107658 283903 298834 229160 87510 431831 520059 312709 452000 498009
17820 498009 300627 -151414 -243648 -141827 153620 443906 155287 73742 141260 203152
17810 203152 295337 196999 159917 340182 304699 291264 -45234 -164359 38568 158689
17800 158689 158887 -18315 -55652 168068 418985 643617 485337 202647 242079 295175 390173
17789 390173 359437 369971 583039 800640 631709 597183 416651 328238 448979 354847
17779 354847 366088 503187 308544 51203 -51539 -41114 74980 225746 113902 -63586
$$ packed form
17852B22328j37644K6642L0531l2966L02090L1882k28081p9118L11898K08965
17842F56527r8130j81751m0012O644j08178M9712N6572p9040r961q253L7786j48732
17830A33184k5526J76245J4931o9674j41650L44321Q8228k07350J39291M6009
17820D98009j97382m52041r2234J01821K95447K90286k88619q1545O7518O1892
17810B03152R2185r8338l7082J80265l5483j3435l36498j19125K02927J20121
17800A58689J98j77202l7337K23720K50917K24632j58280k82690L9432N3096R4998
17789C90173l0736J0534K13068K17601j68931l4526j80532q8413J20741r4132
17779C54847J1241J37099j94643k57341j02742J0425J16094J50766j11844j77488
$$ plain form
17769 -63586 168063 147356 135252 202556 111254 195767 245731 170711 -10918 -124179 -155918
17758 -155918 133679 100714 -40948 -138303 36710 390954 221409 288840 334127 91177
17748 91177 -272826 -348116 -251979 38292 109047 22963 -83749 43271 154398 32124
17738 32124 -35386 186860 148659 -153726 -188301 57 106344 229436 206712 209261 341066
17727 341066 466744 333133 277273 384200 266629 186347 97310 237740 316246 349013
17717 349013 410117 539619 734839 859125 1122919 1088822 883210 746740 662495 439668
17707 439668 210108 56854 -5530 203384 186995 175991 277868 280503 -78569 -295834
17697 -295834 -267261 -181755 97277 213890 314191 158562 -75266 -59939 219808 527805
$$ packed form
17769f3586K31649k0707j2104O7304r1302Q4513M9964p5020j81629j13261l1739
17758a55918K89597l2965j41662r7355J75013L54244j69545O7431M5287k42950
17748I1177l64003p5290R6137K90271P0755q6084j06712J27020J11127j22274
17738C2124o7510K22246l8201l02385l4575J88358J06287J23092k2724K549J31805
17727C41066J25678j33611n5860J06927j17571q0282q9037J40430P8506L2767
17717C49013O1104J29502J95220J24286K63794l4097k05612j36470q4245k22827
17707D39668k29560j53254o2384K08914j6389j1004J01877K635l59072k17265
17697b95834K8573Q5506K79032J16613J00301j55629k33828J5327K79747L07997
$$ plain form
17687 527805 623566 638349 393864 335539 266665 302275 355541 446180 383902 425070 477291
17676 477291 359532 242796 494220 580357 452704 448504 667748 754678 645454 645214 512009
17665 512009 524581 560777 478853 638165 750065 668836 524339 417559 297861 125472
17655 125472 14874 169727 132627 -88679 -111909 -107390 -20316 44879 154253 191110 295761
17644 295761 378523 282592 273941 284229 227274 224758 194697 308810 374548 430111 504133 368579
17632 368579 519855 675380 845374 722755 357166 449015 638300 779704 726284 915968
17622 915968 887056 1027292 1151689 1121906 1210018 1196367 1072703 1050684 865733 660853
17612 660853 668612 540455 441044 260980 192440 9819 407132 536556 465731 274323
$$ packed form
17687E27805R5761J4783k44485n8325o8874L5610N3266R0639o2278M1168N2221
17676D77291j17759j16736K51424Q6137j27653m200K19244Q6930j09224k40j33205
17665E12009J2572L6196q1924J59312J11900q1229j44497j06780j19698j72389
17655A25472j10598J54853l7100k21306k3230M519Q7074O5195J09374L6857J04651
17644B95761Q2762r5931q651J0288n6955k516l0061J14113O5738N5563P4022j35554
17632C68579J51276J55525J69994j22619l65589R1849J89285J41404n3420J89684
17622I15968k8912J40236J24397k9783Q8112j3651j23664k2019j84951k04880
17612F60853P759j28157r9411j80064o8540j82621L97313J29424p0825j91408
$$ plain form
17602 274323 294573 434471 324286 455586 586573 557918 460282 468110 600189 305446
17592 305446 23599 -13062 11959 197050 195172 20923 40989 3452 -148670 -267003 -229234
17581 -229234 -385385 -369653 -95854 71908 408475 647877 786614 813175 637952 529680
17571 529680 635030 683474 763664 795891 839226 774366 641566 553388 412691 400994 301408
17560 301408 297617 237652 340968 304944 141809 238930 353679 383504 431768 512792 417870
17549 417870 322445 255936 224825 223269 -18997 -220604 50593 381031 287257 172435 166429
17538 166429 259782 232173 207224 183931 98341 61629 262828 382169 319078 277409 180048
17527 180048 312609 214704 11864 -238 -54479 75650 101759 22025 185957 -5149
$$ packed form
17602B74323K0250J39898j10185J31300J30987k8655r7636P828J32079k94743
17592C05446k81847l6661K5021J85091j878j74249K0066l7537j52122j18333L7769
17581b29234j56151J5732K73799J67762L36567K39402J38737K6561j75223j08272
17571E29680J05350M8444Q0190L2227M3335o4860j32800q8178j40697j1697r9586
17560C01408l791n9965J03316l6024j63135R7121J14749K9825M8264Q1024r4922
17549D17870r5425o6509l1111j556k42266k01607K71197L30438r3774j14822o006
17538A66429R3353k7609k4949k3293q5590l6712K01199J19341o3091m1669r7361
17527A80048J32561r7905k02840j2102n4241J30129K6109p9734J63932j91106
$$ plain form
17517 -5149 -116007 -129669 -113077 -261435 -303636 -201626 26030 12629 -4515 -34355 -115236
17506 -115236 18181 -53443 -136662 -160015 -257656 -408027 -214103 -28310 101831 64196
17496 64196 31268 14481 -8177 194967 138193 150618 192509 224992 225084 323148 442782 388775
17484 388775 287496 258439 362356 526595 497727 574506 649701 713773 642145 454349 285754
17473 285754 231877 264391 230263 267740 464282 527608 261778 192739 -16368 62051 81866
17462 81866 61765 59475 174911 276656 456540 309582 136 -161160 -42265 87465
17452 87465 108663 370660 625513 336352 -45048 50914 -4871 531 100163 71505 -39378
17441 -39378 140722 290515 562606 522372 278832 115267 362972 577142 580419 669200
$$ packed form
17517e149j10858j3662J6592j48358m2201J02010K27656j3401j7144k9840q0881
17506a15236J33417p1624q3219k3353r7641j50371J93924J85793J30141l7635
17496F4196l2928j6787k2658K03144n6774J2425M1891L2483R2R8064J19634n4007
17484C88775j01279k9057J03917J64239k8868P6779P5195O4072p1628j87796j68595
17473B85754n3877L2514l4128L7477J96542O3326k65830o9039k09107P8419J9815
17462H1866k0101k290J15436J01745J79884j46958l09446j61296J18895J29730
17452H7465K1198K61997K54853k89161l81400R5962n5785N402R9632k8658j10883
17441c9378J80100J49793K72091m0234k43540j63565K47705K14170L277Q8781
$$ plain form
17431 669200 870033 653685 637394 463823 379801 474846 588712 615416 656226 667699 580707
17420 580707 426210 233738 26112 -201702 150602 320754 143845 196477 -30286 -250086
17410 -250086 -138571 89675 351726 226672 119597 97446 281067 561980 532823 179133
17400 179133 71219 165679 291130 224307 213049 216298 163708 121638 55977 107807 415996
17389 415996 228931 -79815 -51042 -9538 301756 458147 345345 334918 281309 174788
17379 174788 109436 258092 175544 348504 419217 172152 23067 167788 267262 214452
17369 214452 126634 205053 410543 602117 732069 675489 360945 197295 69030 39771
17359 39771 -63999 -31333 -75423 180770 -191480 -339465 34359 -110231 -52867 25316
$$ packed form
17431F69200K00833k16348j6291j73571q4022R5045J13866K6704M0810J1473q6992
17420E80707j54497j92472k07626k27814L52304J70152j76909N2632k26763k19800
17410b50086J11515K28246K62051j25054j07075k2151J83621K80913k9157l53690
17400A79133j07914R4460J25451o6823j1258L249n2590m2070o5661N1830L08189
17389D15996j87065l08746K8773M1504L11294J56391j12802j0427n3609j06521
17379A74788o5352J48656q2548J72960P0713k47065j49085J44721R9474n2810
17369B14452q7818P8419K05490J91574J29952n6580l14544j63650j28265k9259
17359C9771j03770L2666m4090K56193l72250j47985L73824j44590N7364P8183
$$ plain form
17349 25316 19651 6343 26913 69995 226592 322320 101828 -148856 -316292 -30966 127888
17338 127888 -30879 -197717 -223347 -202472 -107047 -52302 -207537 -78089 -123405 -17940
17328 -17940 135290 108489 54997 197303 199198 8555 -158466 29714 98090 -176526 -37601
17317 -37601 19037 -137070 -440581 -447914 -394197 -371102 -367869 -385536 -386237 -307183 -261649 -65171
17305 -65171 163462 181993 150473 -83961 -115873 107210 369266 369640 243014 194518 378785
17294 378785 394762 340801 372100 307737 301391 202935 -31112 -116322 -207793 -343878 -293641
17283 -293641 -169293 11668 -57412 -337733 -471300 -461585 -445418 -324303 -287686 19806
17273 19806 257774 323381 190132 37126 30501 -159617 -205800 -1800 325 -51915 -82852
$$ packed form
17349B5316n665j3308K0570M3082J56597R5728k20492k50684j67436K85326J58854
17338A27888j58767j66838k5630K0875R5425N4745j55235J29448m5316J05465
17328a7940J53230k6801n3492J42306J895j90643j67021J88180O8376k74616J38925
17317c7601N6638j56107l03511p333N3717K3095L233j7667p01P9054M5534J96478
17305f5171K28633J8531l1520k34434l1912K23083K62056L74j26626m8496J84267
17294C78785J5977n3961L1299o4363o346r8456k34047q5210r1471j36085N0237
17283b93641J24348J80961o9080k80321j33567R715J6167J21115L6617L07492
17273A9806K37968O5607j33249j53006o625j90118m6183K04000K125n2240l0937
$$ plain form
17262 -82852 -90820 -242101 -526820 -752599 -730501 -679908 -578767 -448464 -426928 -276348 -384547
17251 -384547 -495316 -472520 -137952 -41504 397 95421 380069 220923 25356 62598
17241 62598 16244 165262 186244 171365 241309 274358 -33230 -42554 -81260 -3389 105565
17230 105565 196258 283384 313144 103917 -349376 -652648 -532348 -266226 -299078 -442368
17220 -442368 -225970 30367 45933 20124 -137498 7806 148872 222354 84990 255899
17210 255899 327167 115484 71032 -72050 66794 187647 60077 233737 461033 170551
17200 170551 -155161 -302125 -398492 -208149 -232892 -126047 -306917 -285460 -214915 -185732
17190 -185732 -140859 -2520 141188 -2483 -192438 106140 287227 432575 243492 -80644
$$ packed form
17262h2852p968j51281k84719k25779K2098N0593J01141J30303K1536J50580j08199
17251c84547j10769K2796L34568R6448M1901R5024K84648j59146j95567L7242
17241F2598m6354J49018K0982j4879O9944L3049l07588r324l8706P7871J08954
17230A05565R0693Q7126K9760k09227m53293l03272J20300K66122l2852j43290
17220d42368K16398K56337J5566k5809j57622J45304J41066P3482j37364J70909
17210B55899P1268k11683m4452j43082J38844J20853j27570J73660K27296k90482
17200A70551l25712j46964r6367J90343k4743J06845j80870K1457P0545K9183
17190a85732M4873J38339J43708j43671j89955K98578J81087J45348j89083l24136
$$ plain form
17180 -80644 -30066 182998 142201 226619 273104 88812 -33687 -219791 -113604 80791
17170 80791 257256 230894 26215 -149605 -170150 103634 291544 235240 73363 244986
17160 244986 272274 241618 -79845 -99562 36282 -140076 -193793 -138606 -42182 -217870 -193591
17149 -193591 95850 193148 207846 350887 450963 400073 376982 330005 243083 294697 392704
17138 392704 425459 351566 72230 -151560 -195393 -135734 -184815 -158068 18188 151833 291722
17127 291722 492402 502172 308949 18053 -2797 120338 -52623 -345 -52606 -87796 -85744
17116 -85744 -6334 -12428 -126358 -238388 -264754 -72158 63441 295637 223132 -134139 -90464
17105 -90464 179678 70409 -151617 -255450 -99194 -24656 -299186 -366559 -174938 -52867
$$ packed form
17180h0644N0578K13064m0797Q4418M6485j84292j22499j86104J06187J94395
17170H0791J76465k6362k04679j75820k0545K73784J87910n6304j61877J71623
17160B44986K7288l0656l21463j9717J35844j76358n3717N5187R6424j75688K4279
17149a93591K89441R7298J4698J43041J00076n0890k3091m6977q6922N1614R8007
17138C92704L2755p3893k79336k23790m3833N9659m9081K6747J76256J33645J39889
17127B91722K00680R770j93223k90896k0850J23135j72961N2278n2261l5190K052
17116h5744P9410o094j13930j12030k6366J92596J35599K32196p2505l57271M3675
17105i0464K70142j09269k22026j03833J56256P4538k74530o7373J91621J22071
$$ plain form
17095 -52867 -131082 -231417 51896 261294 210533 231926 200700 166569 144310 258885 288530
17084 288530 128036 2969 -221872 -206400 -98061 -40896 166684 161335 173111 -125671
17074 -125671 -239866 -195224 18854 -22281 -49879 1469 -57629 -73468 -89903 -157054 -96604
17063 -96604 -15410 33046 -118983 -288014 -233731 -127768 -217525 -151001 -30797 128555 234850
17052 234850 137613 -125701 -402672 -474964 -380143 -385633 -236503 -371365 -465493 -415948 -409554
17041 -409554 -245748 -180968 -95431 154226 269551 141532 46826 243014 329844 236982
17031 236982 245378 -24522 -143723 -108198 -278488 -389329 -389745 -308078 -200376 -136585 -68423
17020 -68423 -29772 -329520 -251444 -194826 -154223 -109628 -149028 -268553 -296895 -93697 -106863
$$ packed form
17095e2867p8215j00335K83313K09398n0761K1393l1226l4131k2259J14575K9645
17084B88530j60494j25067k24841J5472J08339N7165K07580n349J1776k98782
17074a25671j14195M4642K14078m1135k7598N1348n9098j5839j6435o7151O0450
17063i6604Q1194M8456j52029j69031N4283J05963q9757O6524J20204J59352J06295
17052B34850r7237k63314k76971p2292R4821n490J49130j34862r4128M9545O394
17041d09554J63806O4780Q5537K49657J15325j28019r4706J96188Q6830r2862
17031B36982Q396k69900j19201L5525j70290j10841m16Q1667J07702O3791O8162
17020f8423L8651k99748P8076N6618M0603M4595l9400j19525k8342K03198j3166
$$ plain form
17009 -106863 -89041 -146789 -63626 -1076 -67640 -133957 -122724 -272850 -461388 -330412 -195297
16998 -195297 -308546 -386190 -450537 -369202 -212642 -147238 -41679 13766 99463 177289 -73309
16987 -73309 -356940 -254395 -197185 -277386 -21192 73833 -172612 -289865 -278830 -491860
16977 -491860 -418502 -124480 -25765 -124436 -209029 4855 149148 -39477 -288230 -231648
16967 -231648 -22607 95519 101441 -14912 -8084 -89701 -133500 -53212 -277898 -236616 -309782
16956 -309782 -266769 -327765 -526427 -549306 -525654 -563076 -392649 -144102 -33335 -141074
16946 -141074 -346690 -152539 -106848 27332 -240162 -351458 -517602 -374417 -276035 -311809
16936 -311809 -88852 187367 281962 217872 91449 112229 109810 -93107 -370864 -427079 -294360
$$ packed form
17009a06863J7822n7748Q3163O2550o6564o6317J1233j50126j88538J30976J35115
16998a95297j13249p7644o4347Q1335J56560O5404J05559N5445Q5697P7826k50598
16987g3309k83631J02545N7210q0201K56194R5025k46445j17253J1035k13030
16977d91860P3358K94022R8715r8671q4593K13884J44293j88625k48753N6582
16967b31648K09041J18126N922j16353O828q1617m3799Q0288k24686M1282p3166
16956c09782M3013o0996j98662k2879K3652l7422J70427K48547J10767j07739
16946a41074k05616J94151M5691J34180k67494j11296j66144J43185R8382l5774
16936c11809K22957K76219R4595o4090j26423K0780k419k02917k77757n6215J32719
$$ plain form
16925 -294360 -180136 -267034 -234803 -153821 -148248 -201636 -310621 -317813 -367135 -233840 -62199
16914 -62199 127584 85097 23084 126677 136970 225572 289088 333268 474546 311350 91298
16903 91298 267984 299311 394644 295466 170441 45178 145507 1618 44646 339841
16893 339841 351046 98304 8184 -138538 79805 -121149 -213530 -152412 -29196 -29057 -290224
16882 -290224 -500581 -326181 -395117 -505490 -675272 -604108 -339611 -232870 -209827 -132133
16872 -132133 83896 291176 146307 102580 218193 290570 348538 151568 38104 5450
16862 5450 -158182 -393885 -421653 -198581 -38472 -82670 -148665 -78527 256189 389392 202593
16851 202593 49079 74922 272213 63701 -69168 -210127 -369641 -162179 69063 41084
$$ packed form
16925b94360J14224q6898L2231Q0982N573n3388j08985p192m9322J33295J71641
16914f2199J89783m2487o2013J03593J0293Q8602O3516M4180J41278j63196k20052
16903I1298J76686L1327R5333r9178j25025j25263J00329j43889M3028K95195
16893C39841J1205k52742r0120j46722K18343k00954r2381O1118J23216J39k61167
16882b90224k10357J74400o8936j10373j69782P1164K64497J06741K3043P7694
16872a32133K16029K07280j44869m3727J15613P2377N7968j96970j13464l2654
16862E450j63632k35703k7768K23072J60109m4198o5995P0138L34716J33203j86799
16851B02593j53514K5843J97291k08512j32869j40959j59514K07462K31242k7979
$$ plain form
16841 41084 -63769 -35932 -252570 -202781 -254258 -120839 -337353 -368170 -158158 14255
16831 14255 102544 154684 -44359 -206864 -61201 77961 48478 -172901 -185316 -276487 -299987
16820 -299987 -56661 34993 -3790 -105883 -374345 -387690 -113624 -42873 -62861 -232582
16810 -232582 -127846 -116819 153607 186635 -56946 -329433 -382869 -108234 60485 63853
16800 63853 144648 241537 448197 318355 125224 -145998 -221686 -158737 -56548 -110741 -301448
16789 -301448 -240056 -227628 -279734 -264661 -115829 -18052 144981 174967 -78588 -202850 -384979
16778 -384979 -188063 -61475 4535 75624 220370 101628 150608 -44509 -125311 -187206
16768 -187206 -133981 -174700 -89361 242534 171390 143454 439587 402991 130523 89607 94322
$$ packed form
16841D1084j04853K7837k16638M9789n1477J33419k16514l0817K10012J72413
16831A4255Q8289N2140j99043j62505J45663J39162k9483k21379j2415r1171k3500
16820b99987K43326R1654l8783j02093k68462j3345K74066P0751j9988j69721
16810b32582J04736J1027K70426L3028k43581k72487n3436K74635J68719L368
16800F3853Q0795R6889K06660j29842j93131k71222p5688O2949J02189n4193j90707
16789c01448O1392J2428n2106J5073J48832R7777J63033K9986k53555j24262j82129
16778c84979J96916J26588O6010P1089J44746j18742M8980j95117q0802o1895
16768a87206N3225m0719Q5339L31895p1144k7936K96133l6596k72468m0916M715
$$ plain form
16757 94322 15096 79743 165187 -15775 -3272 105177 112047 39131 -72440 -69032 272604
16746 272604 184827 -33672 -269223 -59944 -67663 -119118 90993 125397 195111 243886 259465
16735 259465 188040 171233 221928 238481 176348 154830 373302 240921 98267 164379 206358
16724 206358 34464 -29142 -45759 -341927 -249424 35343 79614 97939 23355 187212 383221
16713 383221 288553 164842 2012 -69261 107560 103411 9851 -162713 -259793 -282713 -401722
16702 -401722 -592367 -504520 -477738 -475209 -597892 -716329 -511889 -430809 -661627 -676872 -603188
16691 -603188 -731978 -770280 -688307 -341085 -328195 -357836 -304378 -105810 -47214 111258 238379
16680 238379 279664 283462 85014 82241 7148 151461 177775 -85305 -176426 -340645 -458480
$$ packed form
16757I4322p9226O4647Q5444j80962J2503J08449O870p2916j11571L408L41636
16746B72604q7777k18499k35551K09279p719n1455K10111L4404O9714M8775J5579
16735B59465p1425j6807N0695J6553o2133k1518K18472j32381j42654O6112M1979
16724B06358j71894o3606j6617k96168R2503K84767M4271J8325p4584J63857J96009
16713C83221r4668j23711j62830p1273J76821m149r3560j72564r7080k2920j19009
16702d01722j90645Q7847K6782K529j22683j18437K04440Q1080k30818j5245P3684
16691f03188j28790l8302Q1973L47222J2890k9641N3458J98568N8596J58472J27121
16680B38379M1285L798j98448k773p5093J44313K6314k63080r1121j64219j17835
$$ plain form
16669 -458480 -469708 -434887 -299437 -178417 -197987 -260984 -167508 -104613 -143963 -65087 153312
16658 153312 236773 144097 -48396 -28909 83643 355988 458445 217048 173970 120068
16648 120068 56601 210221 207691 -44715 -124703 -198185 -135948 25221 56917 -25136 -210813
16637 -210813 -323189 -149067 -52145 35442 -85036 -167388 -152732 -211272 -320884 -212405
16627 -212405 23512 115790 -62604 -222942 -395576 -500501 -400689 -249953 -153693 -3510
16617 -3510 75357 -30103 -124376 -28620 -134498 83833 171791 28420 -271628 -92295 132173
16606 132173 207856 152345 -66244 -302366 -279430 -285914 -162277 -61471 34121 87265 38537
16595 38537 -274545 -354468 -116344 101551 80806 -276783 -409122 -216735 -183126 -22645
$$ packed form
16669d58480j1228L4821J35450J21020j9570o2997R3476O2895l9350P8876K18399
16658A53312Q3461r2676j92493J9487J12552K72345J02457k41397m3078n3902
16648A20068o3467J53620k530k52406p9988p3482O2237J61169L1696q2053j85677
16637b10813j12376J74122R6922Q7587j20478q2352J4656n8540j09612J08479
16627b12405K35917R2278j78394j60338j72634j04925R9812J50736R6260J50183
16617c510P8867j05460r4273R5756j05878K18331Q7958j43371l00048J79333K24468
16606A32173P5683n5511k18589k36122K2936o484J23637J00806R5592N3144m8728
16595C8537l13082p9923K38124K17895k0745l57589j32339J92387L3609J60481
$$ plain form
16585 -22645 68999 154679 225446 230876 165481 413703 376689 178663 -31886 -24887 -79399
16574 -79399 -28868 -60605 -88669 6181 2183 -54901 -179215 -70503 17009 -19148 -215409
16563 -215409 -200544 -281547 -305751 -114950 89057 115666 133226 43118 9374 215273 400941
16552 400941 396013 255388 132967 85236 112273 260949 225280 45558 78188 33744 -33971
16541 -33971 -57739 8663 -23022 -81495 -197970 -108427 -49007 -129381 -144149 -228176 -223496 68573
16529 68573 93942 4049 15994 11273 149241 383248 724816 561554 262903 25081 -256553
16518 -256553 -324803 -299782 -318803 -403587 -184663 68901 178902 -99287 -375370 -337179
16508 -337179 -340298 -414208 -518976 -406519 -232386 -29901 66021 157236 183487 -57466 -145125
$$ packed form
16585b2645R1644Q5680P0767N430o5395K48222l7014j98026k10549O999n4512
16574g9399N0531l1737k8064R4850l998n7084j24314J08712Q7512l6157j96261
16563b15409J4865q1003k4204J90801K04007K6609J7560r0108l3744K05899J85668
16552D00941m928j40625j22421m7731K7037J48676l5669j79722L2630m4444o7715
16541c3971k3768O6402l1685n8473j16475Q9543N9420q0374j4768q4027M680K92069
16529F8573K5369q9893J1945m721J37968K34007L41568j63262k98651k37822k81634
16518b56553o8250K5021j9021q4784K18924K53564J10001k78189k76083L8191
16508c37179l119p3910j04768J12457J74133K02485R5922R1215K6251k40953q7659
$$ plain form
16497 -145125 64254 200925 241715 229002 106066 -96272 -139213 -337408 -363375 -342248
16487 -342248 -424035 -394940 -312490 -501230 -576739 -440024 -141502 -183900 -198372 -182151 -171734
16476 -171734 59206 -12475 -67860 30079 -33344 29627 180958 403533 183191 -8817
16466 -8817 -90694 13743 -92499 -288161 -269476 -352726 -256689 -326269 -195317 -121619 -249273
16455 -249273 -257905 -245667 -222461 -287892 -252397 -129826 -479869 -556484 -228448 -287001 -354292
16444 -354292 -173623 -1908 -198754 -334537 -594810 -517074 -150989 -25636 -13173 -17192
16434 -17192 52283 66423 -131022 -312936 -14663 23598 143881 -159087 -188323 -150038 25627
16423 25627 129415 189733 273092 408188 162530 -112278 33816 179008 224658 265988
$$ packed form
16497a45125K09379J36671M0790j2713j22936k02338m2941j98195k5967K1127
16487c42248q1787K9095Q2450j88740p5509J36715K98522m2398j4472J6221J0417
16476a71734K30940p1681n5385R7939o3423O2971J51331K22575k20342j92008
16466h817q1877J04437j06242j95662J8685q3250R6037o9580J30952P3698j27654
16455b49273q632J2238K3206o5431L5495J22571l50043p6615L28036n8553o7291
16444c54292J80669J71715j96846j35783k60273P7736L66085J25353J2463m019
16434a7192O9475J4140j97445j81914K98273L8261J20283l02968k9236L8285J75665
16423B5627J03788O0318Q3359J35096k45658k74808J46094J45192M5650M1330
$$ plain form
16413 265988 -3676 -160369 -372670 -245696 -146485 -188233 -167837 -223029 -145449 -298278
16403 -298278 -308130 -237358 -176774 -256724 -390205 -322929 -369274 -376146 -117310 -35450 174952
16392 174952 264628 350641 356837 273160 32036 -231273 -185395 -227908 -357552 -415246 -384459
16381 -384459 -412472 -225775 -226408 -382485 -339255 -40129 27175 -10815 21692 24918 -142990
16370 -142990 -90472 15660 -210946 -355600 -317755 -326114 -439135 -315381 -114896 74053
16360 74053 4422 -22121 -96986 -343278 -653836 -799742 -708122 -324434 -233382 -260541 -172395
16349 -172395 -377162 -484110 -269665 -114338 -114488 -160729 -263131 -228448 -277320 -278979 -247283
16338 -247283 -31100 201629 319732 19872 -151613 -67209 -65680 21661 28663 65221 185336
$$ packed form
16413B65988k69664j56693k12301J26974R9211m1748K0396n5192P7580j52829
16403b98278r852P0772O0584p9950j33481O7276m6345o872K58836Q1860K10402
16392A74952Q9676Q6013O196q3677k41124k63309M5878m2513j29644n7694L0787
16381c84459k8013J86697o33j56077M3230K99126O7304l7990L2507L226j67908
16370a42990N2518J06132k26606j44654L7845q359j13021J23754K00485J88949
16360G4053o9631k6543p4865k46292l10558j45906R1620L83688R1052k7159Q8146
16349a72395k04767j06948K14445J55327j50m6241j02402L4683m8872j659L1696
16338b47283K16183K32729J18103k99860j71485Q4404J529Q7341P002L6558J20115
$$ plain form
16327 185336 318999 290007 35683 -134295 -220202 -287524 10656 -58047 -248997 -250247 -170986
16316 -170986 -4539 -121141 -102920 -110250 -30983 -132773 -365633 -218979 -103372 -198957
16306 -198957 -195055 -259696 -224196 -17426 -143881 -188203 -112241 78552 39820 105150 174157
16295 174157 62966 -151109 -476328 -473881 -172709 -81239 86005 -11888 -8027 111530 -40044
16284 -40044 -77856 -107126 -165893 -94410 70086 -32417 5880 -98756 2720 79333 -210634
16273 -210634 -324629 -212401 -31858 -13109 -104357 -382318 -527584 -567564 -480532 -374604
16263 -374604 -180876 -14883 506 -74059 -294860 -339927 -311955 -280780 -363980 -586473 -612638
16252 -612638 -252349 27203 63755 -742 27309 169389 65992 -18182 -37000 -35979 -134872
$$ packed form
16327A85336J33663k8992k54324j69978q5907o7322K98180o8703j90950j250P9261
16316a70986J66447j16602J8221p330P9267j01790k32860J46654J15607r5585
16306a98957L902o4641L5500K06770j26455m4322P5962J90793l8732O5330O9007
16295A74157j11191k14075l25219K447L01172R1470J67244r7893L861J19557j51574
16284d0044l7812k9270n8767P1483J64496j02503L8297j04636J01476P6613k89967
16273b10634j13995J12228J80543J8749r1248k77961j45266l9980Q7032J05928
16263c74604J93728J65993J5389p4565k20801m5067K7972L1175q3200k22493k6165
16252f12638L60289K79552L6552o4497K8051J42080j03397q4174j8818J021r8893
$$ plain form
16241 -134872 -147318 -146087 -295469 -156155 -55641 -169002 20780 114018 168812 113951 -31396
16230 -31396 73968 -69794 -14756 -105364 -81126 -78996 -96066 -228865 -178336 -353644 -195016
16219 -195016 -246889 -259660 -296020 -285715 13345 86522 -136507 -22891 99643 186220 92350
16208 92350 -76352 -284548 -307107 -148730 12140 -21284 -260098 -491823 -608699 -577186
16198 -577186 -699128 -770236 -694694 -500761 -164838 -267173 -381587 -273742 -623907 -779107
16188 -779107 -794690 -569093 -280581 -89692 -40725 -262165 -365601 -286365 -159278 -297929
16178 -297929 -207028 -127894 -56288 -70646 -284617 -271870 -174281 -133689 -135985 33724 -2316
16167 -2316 -139017 -20386 120646 135653 -130480 -67044 72471 108345 -139965 -216418 -348824
$$ packed form
16241a34872j2446J231j49382J39314J00514j13361J89782R3238N4794n4861j45347
16230c1396J05364j43762N5038r0608K4238K130j7070j32799N0529j75308J58628
16219a95016n1873j2771l6360J0305K99060P3177k23029J13616J22534Q6577r3870
16208I2350j68702k08196k2559J58377J60870l3424k38814k31725j16876L1513
16198e77186j21942p1108P5542J93933L35923j02335j14414J07845l50165j55200
16188g79107j5583K25597K88512J90889M8967k21440j03436P9236J27087j38651
16178b97929R0901P9134P1606j4358k13971J2747R7589M0592k296J69709l6040
16167b316j36701J18631J41032J5007k66133O3436J39515L5874k48310p6453j32406
$$ plain form
16156 -348824 -280197 -128910 -163089 -184579 -70203 -146099 -14947 122893 88568 -66666
16146 -66666 -399549 -476859 -104861 -46725 -199218 -46380 -268421 -351003 -327951 -218417
16136 -218417 -32945 -108969 -106830 -151015 -32913 -27451 -33439 -155902 -260831 -168946 -38260
16125 -38260 -90030 -156463 -45406 -100044 45375 -8882 106424 173098 198020 183040 365448
16114 365448 231750 15539 -331746 -511216 -511460 -493009 -483587 -526494 -292622 -151970 -40494
16103 -40494 -201864 -251530 -292864 -495157 -622288 -516228 -426165 -55888 -134103 -280719
16093 -280719 -143264 71982 -76404 -58704 -52377 -36931 -70830 82586 171685 210840 228827
16082 228827 -58643 -294344 -470064 -251204 112655 128003 69255 -64736 69207 -14727
$$ packed form
16156c48824O8627J51287l4179k1490J14376p5896J31152J37840l4325j55234
16146f6666l32883p7310L71998N8136j52493J52838k22041q2582K3052J09534
16136b18417J85472p6024K139m4185J18102N462n988j22463j04929R1885J30686
16125c8260n1770o6433J11057n4638J45419n4257J15306O6674K4922j4980J82408
16114C65448j33698k16211l47285j79470k44J8451R422m2907K33872J40652J11476
16103d0494j61370m9666m1334k02293j27131J06060R0063L70277p8215j46616
16093b80719J37455K15246j48386J7700O327J5446l3899J53416Q9099L9155J7987
16082B28827k87470k35701j75720K18860L63859J5348n8748j33991J33943q3934
$$ plain form
16072 -14727 -112578 -106240 -113563 -21370 -35152 -130482 -187766 -106934 244935 178833 -55106 -113119
16060 -113119 14826 94005 105893 32705 295984 324374 186833 68446 -53655 -85025
16050 -85025 19663 219090 297325 369579 280987 62748 162621 130942 -6062 -233267 -125729
16039 -125729 -15911 85837 263328 414438 513544 440282 419603 230353 -69938 -60382
16029 -60382 48420 -28356 -194449 -144798 -10949 180752 238583 308404 208624 -31149 -40835
16018 -40835 41898 55068 -17405 -162493 -266174 -277930 -201286 -95350 -169046 -305181 -467590
16007 -467590 -334661 4805 180671 362785 388814 240444 196391 225129 32770 -18276
15997 -18276 -23731 -71091 -204645 -242131 -177668 -73091 -32380 13357 -128183 -204719 -367594
$$ packed form
16072a4727r7851O338p323R2193j3782r5330n7284Q0832L51869o6102k33939n8013
16060a13119J27945P9179J1888p3188K63279K8390j37541j18387j22101l1370
16050h5025J04688J99427P8235P2254q8592k18239R9873l1679j37004k27205J07538
16039a25729J09818J01748J77491J51110R9106p3262k0679j89250l00291R556
16029f0382J08802p6776j66093M9651J33849J91701N7831O9821r9780k39773r686
16018d0835Q2733J3170p2473j45088j03681j1756P6644J05936p3696j36135j62409
16007d67590J32929L39466J75866J82114K6029j48370m4053K8738j92359n1046
15997a8276n455m7360j33554l7486O4463J04577M0711M5737j41540p6536j62875
$$ plain form
15986 -367594 -447295 -300188 -193764 -221298 -94469 -65597 -28021 -19960 3825 -65270 70263
15975 70263 -48136 -296166 -286284 -164165 -209544 -221602 -237256 -306460 -331911 -352222 -416637
15964 -416637 -299361 -180508 -200323 -271083 -289862 19967 214558 223146 365651 461022 288766
15953 288766 275899 406337 139977 -180458 -158924 -207821 -269896 -70400 37143 -195680
15943 -195680 -92288 180807 42628 -90969 -198766 -209496 -296394 -330618 -289522 -157413
15933 -157413 -217301 -86856 8994 45012 8855 43398 -11120 -73918 -195431 -444261 -271977
15922 -271977 -57397 -110188 -176147 -39478 -67958 -4462 63678 -84128 -239254 -279302 -301029
15911 -301029 -365476 -452601 -366192 -200220 -151382 -53563 70619 14944 -264039 -454883 -520442
$$ packed form
15986c67594p9701J47107J06424k7534J26829K8872L7576Q061K3785o9095J35533
15975G0263j18399k48030R882J22119m5379j2058j5654o9204k5451k0311o4415
15964d16637J17276J18853j9815p0760j8779L09829J94591Q588J42505R5371j72256
15953B88766j2867J30438k66360l20435K1534m8897o2075J99496J07543k32823
15943a95680J03392K73095j38179j33597j07797j0730q6898l4224M1096J32109
15933a57413n9888J30445R5850L6018l6157L4543n4518o2798j21513k48830J72284
15922b71977K14580n2791o5959J36669k8480O3496O8140j47806j55126m0048k1727
15911c01029o4447q7125Q6409J65972M8838R7819J24182n5675k78983j90844o5559
$$ plain form
15900 -520442 -360286 -379773 -373125 -282097 -222077 -303417 -173964 -259535 -258646 -47485 173051
15889 173051 119805 -226063 -434219 -312986 -110134 54812 395035 191533 105533 63842
15879 63842 126804 122746 226642 126657 7147 2762 44487 216694 193476 130499 129902 243979
15867 243979 373013 642963 588580 414935 269384 52799 34557 -45395 -38048 77408
15857 77408 17640 -114032 -9732 103570 12375 -242848 -221845 -120846 16885 30054
15847 30054 114641 133742 4595 68069 184904 -48891 12666 60571 -30530 -178082 -256120
15836 -256120 -76496 -97515 -457215 -763105 -642513 -299439 -263864 -350991 -377899 -675591
15826 -675591 -682496 -459587 -244821 -117106 -19968 56312 115367 190406 214888 273085 155520
$$ packed form
15900e20442J60156j9487O648R1028O0020q1340J29453q5571Q89K11161K20536
15889A73051n3246l45868k08156J21233K02852J64946L40223k03502q6000m1691
15879F3842O2962m058J03896r9985j19510m385M1725J72207k3218o2977n97J14077
15867B43979J29034K69950n4383j73645j45551k16585j8242p9952P347J15456
15857G7408n9768j31672J04300J13302r1195k55223K1003J00999J37731J3169
15847C0054Q4587J9101j29147O3474J16835k33795O1557M7905r1101j47552p8038
15836b56120J79624k1019l59700l05890J20592L43074L5575q7127k6908k97692
15826f75591o905K22909K14766J27715R7138P6280N9055P5039K4482N8197j17565
$$ plain form
15815 155520 121357 322522 175975 369589 211282 59370 77947 68229 6706 -82076 20871
15804 20871 30746 264088 413834 51883 -28571 -156658 -33875 -157941 -279789 -299889
15794 -299889 -290037 -259238 -115141 -56214 -155455 -126682 -210887 -282897 -223963 10320 24429
15783 24429 -153600 60990 -41940 -98243 66460 256378 325263 338689 166050 30701
15773 30701 35975 -127474 -253172 -188599 -178701 -134918 -280978 -167357 -56791 104130 73584
15762 73584 -49350 -118247 106518 -113052 -439684 -198134 -138699 85564 137184 105998
15752 105998 116821 85840 -80526 -16856 132209 -210778 -239152 -127670 20817 143421
15742 143421 -51501 -362225 -365227 -183429 -19486 64412 -32476 -20208 4187 8911 -70914
$$ packed form
15815A55520l4163K01165j46547J93614j58307j51912J8577r718o1523q8782J02947
15804B0871R875K33342J49746l61951q0454j28087J22783j24066j21848k0100
15794b99889R852L0799J44097N8927r9241K8773q4205p2010N8934K34283J4109
15783B4429j78029K14590j02930n6303J64703J89918O8885J3426j72639j35349
15773C0701N274j63449j25698O4573R898M3783j46060J13621J10566J60921l0546
15762G3584j22934o8897K24765k19570l26632K41550N9435K24263N1620l1186
15752A05998J0823l0981j66366O3670J49065l42987k8374J11482J48487J22604
15742A43421j94922l10724l002J81798J63943Q3898r6888J2268K4395M724p9825
$$ plain form
15731 -70914 -146282 33222 211653 19510 -58497 51343 40722 57327 -289185 -500463
15721 -500463 -449799 -277261 5547 64763 -169456 -408192 -265149 136847 177962 337306
15711 337306 339383 83034 -275526 -250784 -172479 -210488 -259607 -274788 -214809 -23476 97126
15700 97126 -34422 -47394 -223722 5414 86615 -336065 -661862 -541811 -228830 -39973
15690 -39973 -25590 -57769 -147741 -206825 -260575 -531972 -475061 -240718 -312057 -275444 -166115
15679 -166115 -61092 -118512 -150340 -96179 -121457 -163697 -54569 140630 172414 69827 -12243
15668 -12243 -120926 -68060 -146309 -282418 -389269 -326928 -313994 -403607 -472317 -422479 -403414
15657 -403414 -309441 -287918 -347948 -232527 -194569 -110159 -576 123654 92254 -169101 -359610
$$ packed form
15731g0914p5368J79504J78431j92143p8007J09840j0621J6605l46512k11278
15721e00463N0664J72538K82808N9216k34219k38736J43043M01996M1115J59344
15711C37306K077k56349l58560K4742P8305l8009m9119j5181N9979J91333J20602
15700I7126j31548j2972j76328K29136Q1201m22680l25797J20051L12981J88857
15690c9973J4383l2179q9972n9084n3750k71397N6911K34343p1339L6613J09329
15679a66115J05023n7420l1828N4161k5278m2240J09128J95199L1784j02587q2070
15668a2243j08683N2866p8249j36109j06851O2341J2934q9613o8710M9838J9065
15657d03414R3973K1523o0030J15421L7958Q4410J09583J24230l1400k61355j90509
$$ plain form
15646 -359610 -430459 -549817 -424575 -477511 -336142 -225284 -300800 -444093 -285019 -108967
15636 -108967 -220308 -298043 -243089 -269720 -351009 -261013 -323699 -492970 -186829 17880 42993
15625 42993 85 10829 157623 32384 203659 251189 262064 203381 244003 386915 71893
15614 71893 -75841 -171707 33208 177373 91234 -38637 -137025 -264135 -394668 -240786
15604 -240786 -13987 -129441 -259631 11462 176198 1062 8719 -180598 -278420 -128003
15594 -128003 43161 -104353 -102427 -41180 -6883 -79546 73933 329686 448914 260287
15584 260287 -198722 -334671 -290700 -203810 100359 172728 -4625 -65014 24941 -111206
15574 -111206 -37570 -113894 -473959 -526043 -390758 -396299 -405393 -84017 -117661 -212555 -272356
$$ packed form
15646c59610p0849j19358J25242n2936J41369J10858p5516j43293J59074J76052
15636a08967j11341p7735N4954k6631q1289Q9996o2686j69271L06141K04709K5113
15625D2993m2908J0744J46794j25239J71275M7530J0875n8683M0622J42912l15022
15614G1893j47734r5866K04915J44165q6139j29871r8388j27110j30533J53882
15604b40786K26799j15454j30190K71093J64736j75136P657j89317r7822J50417
15594a28003J71164j47514J926O1247L4297p2663J53479K55753J19228j88627
15584B60287m59009j35949M3971Q6890L04169P2369j77353o0389Q9955j36147
15574a11206P3636p6324l60065n2084J35285n541r094L21376l3644r4894n9801
$$ plain form
15563 -272356 -294693 -471998 -516352 -535781 -405508 -264287 -305259 -232982 -245860 -131851 -159533
15552 -159533 -250167 -157795 173364 70151 14662 -46252 -112289 110573 178835 124803 66883
15541 66883 67846 -38454 -876 -41228 -74587 -129311 -47008 -98484 -184224 -121374 -317672 -607213
15529 -607213 -458785 -39570 -94643 -109043 -138110 -141175 66116 87570 22288 -41686 73085
15518 73085 164472 -18354 -244888 -435603 -192504 10124 -315194 -398921 -374398 -312537
15508 -312537 -291178 -260139 -105536 -3582 101146 118422 176726 155253 99579 -64159 -40127
15497 -40127 22013 -54911 57809 65265 143790 256799 299913 441690 405334 279198 22902
15486 22902 -45488 -106618 -169395 -213314 -264934 -562572 -245651 137850 124853 39816 72188
$$ packed form
15563b72356k2337j77305m4354j9429J30273J41221m0972P2277j2878J14009k7682
15552a59533r0634R2372L31159j03213n5489o0914o6037K22862O8262n4032n7920
15541F6883R63j06300L7578m0352l3359n4724Q2303n1476q5740O2850j96298k89541
15529f07213J48428M19215n5073j4400k9067l065K07291K1454o5282o3974J14771
15518G3085R1387j82826k26534j90715K43099K02628l25318q3727K4523O1861
15508c12537K1359L1039J54603J01954J04728J7276N8304k1473n5674j63738K4032
15497d0127O2140p6924J12720P456P8525J13009M3114J41777l6356j26136k56296
15486B2902o8390o1130o2777m3919n1620k97638L16921L83501j2997q5037L2372
$$ plain form
15475 72188 -15499 -342957 -448407 -476855 -374763 -184685 -307515 77309 209823 -15553
15465 -15553 -132432 -297280 -246794 -306115 -284873 -305039 -107158 165901 334368 211514
15455 211514 -23358 -72420 -88670 -75825 10294 268998 277506 300306 331304 143708 21279
15444 21279 48274 95446 232586 231878 131547 147446 17330 8064 -120513 -326799 -578896
15433 -578896 -567440 -248216 -60143 -47737 -28261 251871 251494 251516 190998 -1501 -243856
15422 -243856 -333848 -348975 -442996 -541970 -228982 -66226 -38320 -128559 -55088 -234251 -349902
15411 -349902 -195767 -65043 48926 301833 216671 177686 -77389 -313644 -302829 -241741
15401 -241741 -319862 -443706 -418492 -327659 -178215 -104199 -46116 -162887 -105959 -147444 -223611
$$ packed form
15475G2188q7687l27458j05450k8448J02092J90078j22830L84824J32514k25376
15465a5553j16879j64848N0486n9321K1242k0166J97881K73059J68467j22854
15455B11514k34872m9062j6250J2845Q6119K58704Q508K2800L0998j87596j22429
15444B1279K6995M7172J37140p08j00331J5899j30116r266j28577k06286k52097
15433e78896J1456L19224J88073J2406J9476K80132l77K2o0518j92499k42355
15422b43856q9992j5127r4021r8974L12988J62756K7906r0239P3471j79163j15651
15411c49902J54135J30724J13969K52907q5162l8985k55075k36255J0815O1088
15401b41741p8121j23844K5214R0833J49444P4016N8083j16771N6928m1485p6167
$$ plain form
15390 -223611 -103413 -138667 -142494 -4510 90481 133447 42818 16802 31400 30096 21023 -186944
15378 -186944 -13742 119061 189389 12000 -106817 45813 -100309 -30715 -8718 79872
15368 79872 128793 71800 421305 125215 -435770 -582405 -492052 -625259 -772449 -525406
15358 -525406 -476069 -551468 -352327 -375352 -346321 -205672 -129620 -58726 23287 4711 116144
15347 116144 207450 -58285 -226203 -261969 -355 -7946 -5784 -64226 -138707 -70117 -43257
15336 -43257 -2341 140521 111503 -186747 -111754 39012 -236418 -402891 -202570 -48072
15326 -48072 -102422 -316993 -271440 -191364 -89829 -94245 -193991 -417662 -487786 -266978 -83416
15315 -83416 -57361 -23618 -168019 -227260 -106378 142147 235390 178365 -15988 -116281 -95553
$$ packed form
15390b23611J20198l5254l827J37984R4991M2966r0629k6016J4598j304r073k07967
15378a86944J73202J32803P0328j77389j18817J52630j46122O9594K1997Q8590
15368G9872M8921n6993L49505k96090n60985j46635R0353j33207j47190K47043
15358e25406M9337p5399J99141k3025K9031J40649P6052P0894Q2013j8576J11433
15347A16144R1306k65735j67918l5766K61614p591K162n8442p4481O8590K6860
15336d3257M0916J42862k9018k98250P4993J50766k75430j66473K00321J54498
15326d8072n4350k14571M5553Q0076J01535m416r9746k23671p0124K20808J83562
15315h3416K6055L3743j44401n9241J20882K48525R3243n7025j94353j00293K0728
$$ plain form
15304 -95553 -55820 -230545 -265866 -81831 24027 -29161 142917 81075 -115125 -26439 32268
15293 32268 381593 259705 185379 158705 71739 -127083 -241562 -250205 -360193 -424277 -239518
15282 -239518 -156425 -223745 -210804 -340570 -207712 -95644 -161904 -370675 -442842 -512073 -402816
15271 -402816 -392968 -326484 -584268 -720986 -625015 -405334 -252337 -111259 191162 -62750
15261 -62750 -322480 -394338 -290853 -244501 -364653 -375048 -341439 -51862 160929 72790 7196
15250 7196 -27013 -103822 -204296 -213994 -68523 34241 99353 155146 -88463 -125846 -86720
15239 -86720 46701 120758 -76466 -199314 9753 -8814 -4719 -50692 -128477 -5921 90441
15228 90441 59669 -75456 -200671 -145574 -344229 -402964 -393857 -300121 -222846 -60834 244666
$$ packed form
15304i5553L9733j74725l5321J84035J05858n3188J72078o1842j96200Q8686N8707
15293C2268L49325j21888p4326k6674q6966j98822j14479q643j09988o4084J84759
15282b39518Q3093o7320J2941j29766J32858J12068o6260k08771p2167o9231J09257
15271d02816R848O6484k57784j36718R5971K19681J52997J41078L02421k53912
15261f2750k59730p1858J03485M6352j20152j0395L3609K89577K12791q8139o5594
15250G196l4209p6809j00474r698J45471J02764O5112N5793k43609l7383L9126
15239h6720J33421P4057j97224j22848K09067j8567M095m5973p7785J22556R6362
15228I0441l0772j35125j25215N5097j98655n8735R107R3736P7275J62012L05500
$$ plain form
15217 244666 86400 -59246 -134090 -98481 -193451 43957 -53371 -135786 -3418 171819
15207 171819 -24499 -55327 25929 181090 119000 12458 -87535 -77121 -38559 86246 171516
15196 171516 296812 254792 76939 128495 309753 340992 507312 464869 332820 127543
15186 127543 45371 92838 234445 97937 18071 60703 231250 -40537 56851 188412
15176 188412 155024 81909 122797 220584 67895 -117260 -152569 -399028 -521215 -532305 -314749
15165 -314749 -156944 -29226 -160807 -258336 -84303 -105986 -208526 -80963 -137491 -236866
15155 -236866 -441506 -677217 -767187 -663079 -691560 -507499 -538791 -407155 -420861 -504142
15145 -504142 -630738 -371319 -254322 -425810 -232060 61330 178286 131342 6139 9986
$$ packed form
15217B44666j58266j45646p4844L5609r4970K37408r7328q2415J32368J75237
15207A71819j96318l0828Q1256J55161o2090j06542r9993J0414L8562J24805Q5270
15196A71516J25296m2020j77853N1556J81258L1239J66320m2443j32049k05277
15186A27543q2172M7467J41607j36508p9866M2632J70547k71787R7388J31561
15176A88412l3388p3115M0888R7787j52689j85155l5309k46459j22187j1090K17556
15165c14749J57805J27718j31581r7529J74033k1683j02540J27563n6528r9375
15155b36866k04640k35711q9970J04108k8481J84061l1292J31636j3706q3281
15145e04142j26596K59419J16997j71488J93750K93390J16956m6944j25203L847
$$ plain form
15135 9986 27098 -174633 -263577 -146995 -171955 -114319 -72471 -198589 -314809 -237829 -95949
15124 -95949 -160241 -79619 -4775 15306 -3399 16951 56906 -145616 -277403 -275779 -231655
15113 -231655 -480670 -575859 -521427 -508226 -624462 -556345 -232822 -262574 -378377 -345614 -173092
15102 -173092 -111992 -143969 -142736 -119684 -274888 -256507 -154737 -74860 -35968 -84363 -169051
15091 -169051 -186887 -122559 -30435 -13641 -147775 -158444 -185107 107238 136038 15140 2225
15080 2225 -79357 -148235 -127291 -157411 -258543 -52757 115758 44998 186567 -119798 -373060
15069 -373060 -365165 -262780 -289718 -202570 -259604 -278683 -91385 -117162 30883 -107688 -179781
15058 -179781 -354748 -371193 -73160 39239 -197304 -324700 -467387 -415062 -245674 -302976
$$ packed form
15135I986J7112k01731q8944J16582k4960N7636M1848j26118j16220P6980J41880
15124i5949o4292Q0622P4844K0081j8705K0350L9955k02522j31787J624M4124
15113b31655k49015r5189N4432J3201j16236O8117L23523k9752j15803L2763J72522
15102a73092O1100l1977J233K3052j55204J8381J01770P9877L8892m8395q4688
15091a69051j7836O4328R2124J6794j34134j0669k6663K92345K8800j20898j2915
15080B225q1582o8878K0944l0120j01132K05786J68515p0760J41569l06365k53262
15069c73060P895J02385k6938Q7148n7034j9079J87298k5777J48045j38571p2093
15058a79781j74967j6445K98033J12399k36543j27396j42687N2325J69388n7302
$$ plain form
15048 -302976 -249288 -108077 -127331 -129803 -170880 -338268 -305877 -115604 57569 -145677 -245462
15037 -245462 -313164 -352982 -297891 -431988 -249493 -57631 -116703 -89891 224064 135639 -31143
15026 -31143 -22919 -130944 -262125 -451976 -512530 -326918 -283020 -234081 -209809 -210870 -164349
15015 -164349 -210470 53450 284003 243453 -40252 -128431 41256 43558 -16101 -32712 4685
15004 4685 -101259 -216736 -177725 -140321 -372465 -481107 -334241 -170158 -108625 -125116 -18053
14993 -18053 -18021 -115575 -9930 20460 5513 -59531 110372 10204 -196971 -434979 -479778
14982 -479778 -554879 -596716 -536026 -528367 -430768 -477024 -627124 -736041 -758633 -779501 -533701
14971 -533701 -263115 -373216 -651296 -302746 -246473 -286749 -422654 -402528 -192321 4498
$$ packed form
15048c02976N3688J41211j9254k472m1077j67388L2391J90273J73173k03246r9785
15037b45462o7702l9818N5091j34097J82495J91862n9072K6812L13955q8425j66782
15026c1143Q224j08025j31181j89851o0554J85612M3898M8939K4272j061M6521
15015a64349m6121K63920K30553m0550k83705q8179J69687K302n9659j6611L7397
15004D685j05944j15477L9011L7404k32144j08642J46866J64083O1533j6491J07063
14993a8053L2r7554J05645L0390j4947o5044J69903j00168k07175k38008m4799
14982d79778p5101m1837O0690P659R7599m6256j50100j08917k2592k0868K45800
14971e33701K70586j10101k78080L48550N6273m0276j35905K0126K10207J96819
$$ plain form
14961 4498 -88549 -5680 44261 -156842 -262874 -338261 -238174 -117288 -60965 -50504 -157858
14950 -157858 -167406 -315326 -328671 -167489 -95253 -1206 -56677 28422 -15499 -71478 176011
14939 176011 34297 -147908 -165994 -65936 218228 324440 304241 71523 -240737 -382284
14929 -382284 -334307 -376840 -365823 -214970 -182208 -131607 -445159 -560728 -344580 -178839
14919 -178839 -187549 -202749 -126420 -151401 -173182 -66816 -55258 54960 -23118 -60584 10679
14908 10679 65275 -153326 -334911 -188662 -5293 -108759 -160543 -259419 -268559 -185509 -146607
14897 -146607 109925 131699 51560 136272 314264 214081 147732 140974 -4174 52491 -77156
14886 -77156 -175618 -273410 -141891 -173454 -207024 -109211 -162169 -276005 -315375 -439375 -501810
$$ packed form
14961D498r3047Q2869M9941k01103j06032p5387J00087J20886N6323J0461j07354
14950a57858r548j47920j3345J61182P2236R4047n5471Q5099m3921n5979K47489
14939A76011j41714j82205j8086J00058K84164J06212k0199k32718l12260j41547
14929c82284M7977m2533J1017J50853L2762N0601l13552j15569K16148J65741
14919a78839q710j5200P6329k4981k1781J06366J1558J10218p8078l7466P1263
14908A0679N4596k18601j81585J46249J83369j03466n1784r8876r140Q3050L8902
14897a46607K56532K1774q0139Q4712J77992j00183o6349o758j45148N6665j29647
14886g7156r8462r7792J31519l1563l3570R7813n2958j13836l9370j24000o2435
$$ plain form
14875 -501810 -451363 -532855 -706021 -802801 -962752 -639739 -233194 -502980 -738196 -790085
14865 -790085 -489607 -395573 -307687 -136240 -83371 -38777 -254845 -504834 -445595 87705
14855 87705 327307 94488 59836 955 -316983 -317005 90529 188972 139968 85117 174650
14844 174650 255726 16950 -281177 -241883 -302704 -220500 14026 119853 15089 -103715
14834 -103715 160529 146547 324235 489225 352014 279896 361071 201454 146844 -19350
14824 -19350 5434 74248 246032 358774 166435 -31518 -49543 -68993 -71499 -60894 -17677
14813 -17677 -76796 78906 157995 60877 137556 77686 24405 -40133 -77976 -128110 -235538
14802 -235538 -356601 -665496 -722420 -308806 -97246 72129 266625 237265 95410 -12029
$$ packed form
14875e01810N0447q1492j73166r6780j59951L23013M06545k69786k35216n1889
14865g90085L00478R4034Q7886J71447N2869M4594k16068k49989N9239N33300
14855H7705K39602k32819l4652n8881l17938k2M07534R8443m9004n4851Q9533
14844A74650Q1076k38776k98127L9294o0821Q2204K34526J05827j04764j18804
14834a03715K64244j3982J77688J64990j37211p2118Q1175j59617n4610j66194
14824a9350K4784O8814J71784J12742j92339j97953j8025j9450k506J0605M3217
14813a7677n9119J55702P9089r7118P6679n9870n3281o4538l7843n0134j07428
14802b35538j21063l08895n6924M13614K11560J69375J94496k9360j41855j07439
$$ plain form
14792 -12029 -223720 -338507 -131928 -4320 177088 62415 224679 97797 -16237 -10826
14782 -10826 -18295 40624 51653 -78091 118230 300334 -26268 -191150 -178028 -106130 -135499
14771 -135499 -294076 -157899 70685 229844 115868 -16089 -120673 -239890 -457944 -580196
14761 -580196 -463436 -503205 -371391 -365927 -306820 -410767 -535338 -709987 -358507 -350625 -223662
14750 -223662 24237 2927 18689 57389 33354 -4479 158001 7545 -318879 -313687 -300059
14739 -300059 -387438 -135610 33161 19470 -23346 -28650 16412 -200353 -256791 -217848 -159705
14728 -159705 -225955 -179147 -100900 95396 30176 -74180 134989 228998 144953 22385 -105142
14717 -105142 57991 9322 26530 168761 61343 123149 202963 199149 105890 277147 484690
$$ packed form
14792a2029k11691j14787K06579J27608J81408j14673J62264j26882j14034N411
14782a0826p469N8919J1029j29744J96321J82104l26602j64882J3122P1898k9369
14771a35499j58577J36177K28584J59159j13976j31957j04584j19217k18054j22252
14761e80196J16760l9769J31814N464N9107j03947j24571j74649L51480P882J26963
14750b23662K47899k1310J5762L8700k4035l7833J62480j50456l26424N192J3628
14739c00059q7379K51828J68771j3691m2816n304M5062k16765n6438L8943N8143
14728a59705o6250M6808P8247J96296o5220j04356K09169R4009q4045j22568j27527
14717a05142J63133m8669J7208J42231j07418O1806P9814l814r3259J71257K07543
$$ plain form
14706 484690 471144 252303 38000 -96235 -98758 -103811 -31793 -182433 -231673 -178323 -132239
14695 -132239 84643 112130 -25422 -43015 -311434 -553997 -613089 -513685 -255901 -249974 -129495
14684 -129495 -50463 -209788 -197225 -240393 -345168 -328569 -301059 -354731 -229995 178386 346485
14673 346485 155444 183796 70698 -207834 -321256 -4056 270229 297007 13728 -77213
14663 -77213 -150115 -542042 -506560 -388992 -388909 -440700 -430650 -280107 28884 31401 4421 282096
14651 282096 275548 -4158 -360809 -379828 -170067 -137275 -348071 -300491 -117860 -76724 -56054
14640 -56054 -47911 -57384 57197 150178 94032 2686 211313 419538 185782 -152449 -369788
14629 -369788 -332672 -206441 -45897 82489 -60705 -191207 -20916 37248 262018 375952
$$ packed form
14706D84690j3546k18841k14303j34235k523n053P2018j50640m9240N3350M6084
14695a32239K16882K7487j37552j7593k68419k42563n9092R9404K57784N927J20479
14684a29495P9032j59325J2563m3168j04775J6599K7510n3672J24736M08381J68099
14673C46485j91041K8352j13098k78532j13422L17200K74285K6778k83279r0941
14663g7213p2902l91927L5482J17568Q3n1791J0050J50543L08991K517k6980K77675
14651B82096o548k79706l56651j9019K09761L2792k10796M7580J82631M1136K0670
14640e6054Q143r473J14581R2981n6146r1346K08627K08225k33756l38231k17339
14629c69788L7116J26231J60544J28386j43194j30502J70291N8164K24770J13934
$$ plain form
14619 375952 330205 180966 58172 -202475 -150275 38334 -58087 46578 168827 91003
14609 91003 109057 -140755 -201965 -120580 -75955 -112042 -89727 28039 156861 95968 -297705
14598 -297705 -678429 -686047 -561847 -299241 -100434 -151067 -56511 223923 201169 205006 76155
14587 76155 -138016 -71399 34301 -79413 -101514 -387124 -483354 -229713 -11417 -11250 -348075
14576 -348075 -347214 -283511 -355788 -447911 -194769 136868 181089 133880 129197 124699 66901 -85505
14564 -85505 -203293 -172721 -69927 -174821 -460332 -232202 -105873 -114697 -110472 -184962 -319135
14553 -319135 -94307 -33378 -204504 -332236 -302942 -311715 -338901 -175674 -18649 -217793
14543 -217793 -344469 -87607 344322 210215 97535 -81295 -78579 6087 84475 -44296
$$ packed form
14619C75952m5747j49239j22794k60647N2200J88609r6421J04665J22249p7824
14609I1003J8054k49812o1210Q1385M4625l6087K2315J17766J28822o0893l93673
14598b97705l80724p618J24200K62606J98807n0633R4556K80434k2754L837j28851
14587G6155k14171O6617J05700j13714k2101k85610r6230K53641K18296J67l36825
14576c48075Q61O3703p2277r2123K53142L31637M4221m7209m683m498n7798j52406
14564h5505j17788L0572J02794j04894k85511K28130J26329q824M225p4490j34173
14553c19135K24828O0929j71126j27732K9294q773k7186J63227J57025j99144
14543b17793j26676K56862M31929j34107j12680j78830K716Q4666P8388j28771
$$ plain form
14533 -44296 -204647 44394 72723 164968 222981 279063 358348 414143 334512 390608 258097
14522 258097 79865 -267777 -332619 -136446 -25525 -211512 -225216 -277568 -304595 -264892
14512 -264892 -56088 201710 306777 321841 356874 349648 168769 170809 -33387 -258987 -488859
14501 -488859 -362728 -168348 -42325 145379 210882 -54479 -182924 19679 -13924 91011
14491 91011 13536 -102070 -7883 -203526 -163250 -25697 -27754 -90266 -199805 -194726 -41106
14480 -41106 -163234 -178519 -39086 -166778 -118490 -264132 -328756 -379012 -357989 -267221 -394872
14469 -394872 -359447 -250656 -237526 -220226 -127125 35435 109272 135953 -69448 -63863 -184347
14458 -184347 -191339 -147609 -162521 -231915 -313503 -280268 -309842 -256605 -283956 -165131 -27833
$$ packed form
14533d4296j60351K49041K8329R2245N8013N6082P9285N5795p9631N6096j32511
14522B58097j78232l47642o4842J96173J10921j85987j3704n2352k7027L9703
14512b64892K08804K57798J05067J5064L5033p226j80879K040k04196k25600k29872
14501d88859J26131J94380J26023J87704O5503k65361j28445K02603l3603J04935
14491I1011p7475j15606R4187j95643M0276J37553k057o2512j09539N079J53620
14480d1106j22128j5285J39433j27692M8288j45642o4624n0256K1023R0768j27651
14469c94872L5425J08791J3130J7300R3101J62560P3837K6681k05401N585j20484
14458a84347o992M3730j4912o9394q1588L3235k9574N3237k7351J18825J37298
$$ plain form
14447 -27833 56078 169408 227900 20451 -228829 -277853 -66310 -10624 -5240 -98384 -30930
14436 -30930 69821 176295 290406 223742 170420 -41895 -48815 -283242 -115337 -26337 55642
14425 55642 247587 145612 -34246 308 -93362 -143611 -271544 -230018 -310663 -184251 -1218
14414 -1218 221219 256998 243101 435669 556317 321338 197941 237318 243741 -12524 -300594
14403 -300594 -333989 -58179 46696 118400 46459 -31927 -14311 -97179 -321741 -196953 -53346
14392 -53346 79047 138719 34751 1979 119045 209863 -88821 79277 28401 -85140
14382 -85140 59168 283787 283539 168738 -78545 -451254 -467352 -283964 -43761 48724 -165592
14371 -165592 -199665 -283359 -29586 65178 -86449 -43038 -418707 -398805 -202006 -128031 -162208
$$ packed form
14447b7833Q3911J13330N8492k07449k49280m9024K11543N5686N384r3144O7454
14436c0930J00751J06474J14111o6664n3322k12315o920k34427J67905Q9000Q1979
14425E5642J91945j01975j79858L4554r3670n0249j27933M1526q0645J26412J83033
14414a218K22437L5779j3897J92568J20648k34979j23397L9377O423k56265k88070
14403c00594l3395K75810J04875P1704p1941p8386J7616q2868k24562J24788J43607
14392e3346J32393N9672j03968l2772J17066R0818k98684J68098n0876j13541
14382h5140J44308K24619k48j14801k47283l72709j6098J83388K40203R2485k14316
14371a65592l4073q3694K53773R4764j51627M3411l75669J9902J96799P3975l4177
$$ plain form
14360 -162208 -202053 -233397 -32917 129657 90044 305329 339640 169565 -16013 -209889
14350 -209889 -177331 -28408 111334 40657 -303748 -313013 -217390 29013 325198 318287 85856
14339 85856 -19604 5453 -17870 -4446 -12727 -169808 -419654 -662075 -486304 -157519 2906
14328 2906 -107188 -190308 -226680 -408484 -677868 -510245 -215051 -217754 -310083 -364771 -312854
14317 -312854 -346009 -404067 -476886 -288483 -285426 -370341 -128871 -187817 -222120 -104982 62195
14306 62195 -50261 -114403 -289814 -362582 -285855 -117649 -59570 -151392 96298 253523 518921
14295 518921 479590 218885 -94608 -86371 169261 101345 28983 317413 239797 146274 166998
14284 166998 154302 301630 350529 420236 68316 -199974 -299313 -246150 -122314 -247743
$$ packed form
14360a62208l9845l1344K00480J62574l9613K15285L4311j70075j85578j93876
14350b09889L2558J48923J39742p0677l44405r265R5623K46403K96185o911k32431
14339H5856j05460K5057k3323J3424q281j57081k49846k42421J75771L28785J60425
14328B906j10094q3120l6372j81804k69384J67623K95194k703r2329n4688N1917
14317c12854l3155n8058p2819J88403L057q4915K41470n8946l4303J17138J67177
14306F2195j12456o4142j75411p2768P6727J68206N8079r1822K47690J57225K65398
14295E18921l9331k60705l13493Q237K55632o7916p2362K88430p7616r3523K0724
14284A66998j2696J47328M8899O9707l51920k68290r9339N3163J23836j25429
$$ plain form
14274 -247743 -150030 -199669 -83983 253442 208186 -16163 -175395 -15075 115715 29409
14264 29409 194607 280707 235661 96315 -35639 85572 212832 -141544 -182466 67910
14254 67910 160399 200509 385937 318438 7539 -124971 -283684 -209826 -90498 146900
14244 146900 -24767 -173366 -140833 -2180 126120 12660 -195258 78387 18860 -96516
14234 -96516 -62814 -282965 -295991 -114288 -131592 -163668 -310051 -351360 -471185 -399765 -336965
14223 -336965 -193546 -104313 -95277 -178846 -326800 -163182 -9533 -50714 -290315 -113738
14213 -113738 -271090 -361179 -391066 -370973 -391839 -393550 -434744 -329357 -391976 -625058 -637688
14202 -637688 -526541 -168268 -203587 -169267 123221 267347 185204 -91927 -288675 -454442
$$ packed form
14274b47743R7713m9639J15686L37425m5256k24349j59232J60320J30790q6306
14264B9409J65198Q6100m5046j39346j31954J21211J27260l54376m0922K50376
14254F7910R2489M0110J85428o7499l10899j32510j58713P3858J19328K37398
14244A46900j71667j48599L2533J38653J28300j13460k07918K73645n9527j15376
14234i6516L3702k20151j3026J81703j7304l2076j46383m1309j19825P1420O2800
14223c36965J43419Q9233R036q3569j47954J63618J53649m1181k39601J76577
14213a13738j57352r0089k9887K0093k0866j711m1194J05387o2619k33082j2630
14202f37688J11147L58273l5319L4320K92488J44126q2143k77131j96748j65767
$$ plain form
14192 -454442 -472875 -164799 -180578 -51921 53764 31261 -145893 -369461 -224400 -31292
14182 -31292 22369 24375 390523 519688 211591 -65239 -110330 -230759 -168512 -99201 -147431
14171 -147431 -213513 -158859 116912 229818 61691 -80984 -65148 -124120 -7672 -28855
14161 -28855 81064 150528 -18479 -204053 -101219 -338475 -306499 -243900 -236983 -58519 -14648
14150 -14648 -55380 -198973 -340866 -211823 165465 222355 191723 93840 167347 462014 391315
14139 391315 139162 22538 104603 272133 108951 -72285 -37332 163115 135242 1182
14129 1182 313937 368695 248869 310289 79731 -290812 -356047 -166830 -169171 -526914 -470119
14118 -470119 -196987 -237090 -438959 -298626 -224910 -208975 -174676 -149189 -213649 -352936 -414059
$$ packed form
14192d54442j8433L08076j5779J28657J05685k2503j77154k23568J45061J93108
14182c1292N3661K006L66148J29165l08097k76830m5091j20429O2247O9311m8230
14171a47431o6082N4654K75771J12906j68127j42675J5836n8972J16448k1183
14161b8855J09919O9464j69007j85574J02834k37256L1976O2599O917J78464M3871
14150a4648m0732j43593j41893J29043L77288N6890l0632r7883P3507K94667p0699
14139C91315k52153j16624Q2065J67530j63182j81236L4953K00447k7873j34060
14129A182L12755N4758j19826O1420k30558l70543o5235J89217k341l57743N6795
14118d70119K73132m0103k01869J40333P3716J5935L4299K5487o4460j39287o1123
$$ plain form
14107 -414059 -533910 -475781 -190363 -157191 -241558 -245315 -208908 -72522 -157970 20448 214311
14096 214311 159957 81660 -63241 -31989 50769 58465 -40415 -202213 -270738 -198846 -123042
14085 -123042 -190969 -245832 -108596 67846 53028 237887 235778 227922 192615 13461 24706
14074 24706 130399 68954 51651 45395 -126200 -191149 -94648 175570 322081 388000 179606
14063 179606 -217604 -337802 -249163 -241493 -51382 217466 505666 202906 163352 247232
14053 247232 154712 5508 -119651 41900 38627 -168476 -263221 -99687 18565 -24628
14043 -24628 90663 192296 212211 231354 191918 -246360 -268573 -129517 -218265 -307961 -89760
14032 -89760 242984 23231 -52914 15876 133564 53810 -149100 -5223 -10948 48974 104734
$$ packed form
14107d14059j19851N8129K85418L3172q4367l757L6407J36386q5448J78418J93863
14096B14311n4354p8297j44901L1252Q2758P696r8880j61798o8525P1892P5804
14085a23042o7927n4863J37236J76442j4818J84859k109p856l5307j79154J1245
14074B4706J05693o1445j7303o256j71595o4949R6501K70218J46511O5919k08394
14063A79606l97210j20198Q8639P670J90111K68848K88200l02760l9554Q3880
14053B47232r2520j49204j25159J61551l273k07103r4745J63534J18252m3193
14043b4628J15291J01633J9915J9143l9436m38278k2213J39056q8748q9696K18201
14032h9760L32744k19753p6145O8790J17688p9754k02910J43877n725N9922N5760
$$ plain form
14021 104734 103940 156485 -70309 -204935 -254352 -202625 21265 141658 192824 304964 346558
14010 346558 297912 -20860 -86391 128427 242529 211193 330164 129496 -76914 -12834
14000 -12834 210492 356165 407458 271704 55429 51330 49081 -31783 64298 -26230 -217427
13989 -217427 -115307 -32549 157999 287101 6265 -201649 -317133 -175921 -373943 -512807
13979 -512807 -368847 -162323 -188661 -92659 112408 62152 59693 -3132 -267022 -226926 -37571
13968 -37571 -55237 14256 297586 289306 79160 -143940 -164359 -233066 -227357 -172940 -222708
13957 -222708 -180634 -119335 -30575 -194184 -327094 -474060 -146076 -108115 -112522 -62395 -25097
13946 -25097 -130326 -177356 -265510 -184111 -135088 -86691 -285320 -94420 37942 -158931 -90843
$$ packed form
14021A04734p94N2545k26794j34626m9417N1727K23890J20393N1166J12140M1594
14010C46558m8646l18772o5531K14818J14102l1336J18971k00668k06410O4080
14000a2834K23326J45673N1293j35754k16275m099k249q0864R6081r0528j91197
13989b17427J02120Q2758J90548J29102k80836k07914j15484J41212j98022j38864
13979e12807J43960K06524k6338R6002K05067n0256k459o2825k63890M0096J89355
13968c7571j7666O9493K83330q280k10146k23100k0419o8707N709N4417m9768
13957b22708M2074O1299Q8760j63609j32910j46966L27984L7961m407N0127L7298
13946b5097j05229m7030q8154Q1399M9023M8397j98629J90900J32362j96873O8088
$$ plain form
13935 -90843 156900 17091 6434 21060 -202516 -183287 -39853 130933 -98332 -127762
13925 -127762 48698 150551 64146 -1836 -207747 -277342 -188662 5944 145258 145312 87678
13914 87678 81311 83481 223640 268488 443411 130929 -232848 -236724 -235153 8641 -93390
13903 -93390 -266247 -168499 49884 114843 3826 -34648 116353 265117 245867 -97796
13893 -97796 -284811 -196531 23871 240986 300557 132353 2836 49109 58684 93977 195746
13882 195746 252747 133890 -60507 -7384 -63744 -168125 -2274 155101 -11580 -121656
13872 -121656 -57947 -71213 -70293 119236 89331 55989 219557 -137482 -333349 -443954 -164108
13861 -164108 -47162 -111019 -97273 70489 108322 193913 326120 103829 -108302 -160188
$$ packed form
13935i0843K47743j39809j0657J4626k23576J9229J43434J70786k29265k9430
13925a27762J76460J01853q6405o5982k05911o9595Q8680J94606J39314N4n7634
13914H7678o367K170J40159M4848J74923l12482l63777l876J571K43794j02031
13903i3390j72857R7748K18383O4959j11017l8474J51001J48764j9250l43663
13893i7796j87015Q8280K20402K17115N9571j68204j29517M6273R575L5293J01769
13882A95746N7001j18857j94397N3123n6360j04381J65851J57375j66681j10076
13872a21656O3709j3266R20J89529k9905l3342J63568l57039j95867j10605K79846
13861a64108J16946o3857J3746J67762L7833Q5591J32207k22291k12131n1886
$$ plain form
13851 -160188 -98454 146011 195470 119666 44092 -18002 46394 -15352 -354809 -439271 -177563
13840 -177563 -108288 -259125 -126098 -32112 -138564 -89548 -188675 -322596 -245634 10479
13830 10479 42573 71887 102208 118167 140289 78149 243686 480281 308257 92061 60984
13819 60984 186189 301008 288522 222354 328332 289746 137133 -12008 -215429 -244856
13809 -244856 -348913 -409379 -235607 -56407 64397 38842 -27418 -82054 -216843 -141673
13799 -141673 -314519 -509097 -391720 -158487 -73496 -80537 -190497 -187121 -265052 52937 213559
13788 213559 88642 -142721 -170164 -248640 -353499 -431461 -254755 767 87935 111985
13778 111985 -5371 -202821 -119763 -167502 -351634 -369161 -291274 -294531 -337496 -359523 -195945
$$ packed form
13851a60188O1734K44465M9459p5804p5574o2094O4396o1746l39457q4462K61708
13840a77563O9275j50837J33027R3986j06452M9016r9127j33921P6962K56113
13830A0479L2094K9314L0321J5959K2122o2140J65537K36595j72024k16196l1077
13819F0984J25205J14819j2486o6168J05978l8586j52613j49141k03421k9427
13809b44856j04057o0466J73772J79200J20804k5555o6260n4636j34789P5170
13799a41673j72846j94578J17377K33233Q4991p041j09960L376p7931L17989J60622
13788B13559j24917k31363k7443p8476j04859p7962J76706K55522Q7168K4050
13778A11985j17356j97450Q3058m7739j84132j7527P7887l257m2965k2027J63578
$$ plain form
13767 -195945 -227991 -245725 -48980 -30779 139448 134299 44492 -132820 -387880 -388494 -282506
13756 -282506 -68371 119509 140724 120484 87965 134474 -123172 -401198 -362646 -225705
13746 -225705 -348792 -519002 -366389 -368075 -400558 -199594 -174365 -113252 -223854 -347486
13736 -347486 -274084 -456123 -460618 -465053 -405023 -416366 -418426 -364354 -245446 -307964 -179024
13725 -179024 55203 191465 163841 169418 213017 -248 -152437 -161917 -333139 -398973 -233925
13714 -233925 -243599 40260 -299761 -534705 -327055 -139297 -128355 -277485 -153378 52841
13704 52841 205460 111956 -26352 -155813 -320604 -220747 32637 62751 -107927 -192585
13694 -192585 -160523 -48094 12039 116309 89746 -34525 -199084 -101352 -28335 59802 90491
$$ packed form
13767a95945l2046j7734J96745J8201J70227n149q9807j77312k55060o14J05988
13756b82506K14135J87880K1215k0240l2519M6509k57646k78026L8552J36941
13746b25705j23087j70210J52613j686l2483K00964K5229O1113j10602j23632
13736c47486P3402j82039m495m435O0030j1343k060N4072J18908o2518J28940
13725a79024K34227J36262k7624N577M3599k13265j52189r480j71222o5834J65048
13714b33925r674K83859l40021k34944K07650J87758J0942j49130J24107K06219
13704E2841J52619r3504j38308j29461j64791R9857K53384L0114j70678q4658
13694a92585L2062J12429O0133J04270k6563j24271j64559R7732P3017Q8137L0689
$$ plain form
13683 90491 -124733 -147463 -132616 -174121 -151572 -133907 -135892 -129442 199047 256264 271911 267782
13671 267782 159908 66561 36826 72268 91097 5201 -301342 -477929 -387980 -262031 -237182
13660 -237182 -162485 -124297 -287043 -296084 -97970 38903 51881 273944 349975 204066 132911
13649 132911 252593 150238 297988 263911 308651 368737 293447 229484 92454 -164827
13639 -164827 -101579 60011 42335 -39037 -200074 -214712 -175266 -120446 -20223 98869 -8374
13628 -8374 -76269 -172764 -71080 -95861 -218411 -411189 -231515 -47939 57558 16995 -208044
13617 -208044 -395879 -433154 -392843 -203819 -226264 -240244 -162297 -122897 -147442 48431 55541
13606 55541 -115549 -186620 -189536 -145257 -124669 -24776 49727 -19970 37156 -138822 -431933
$$ packed form
13683I0491k15224k2730J4847m1505K2549J7665j985O450L28489N7217J5647m129
13671B67782j07874r3347k9735L5442J8829q5896l06543j76587Q9949J25949K4849
13660b37182P4697L8188j62746r041J98114J36873J2978K22063P6031j45909p1155
13649A32911J19682j02355J47750l4077M4740O0086p5290o3963j37030k57281
13639a64827O3248J61590j7676q1372j61037j4638L9446N4820J00223J19092j07243
13628h374o7895r6495J01684k4781j22550j92778J79674J83576J05497m0563k25039
13617b08044j87835l7275M0311J89024k2445j3980P7947L9400k4545J95873P110
13606E5541j71090p1071k916M4279K0588R9893P4503o9697N7126j75978k93111
$$ plain form
13595 -431933 -531615 -145406 77659 84348 126566 -16970 -8361 -123890 -344882 -486519 -276290
13584 -276290 -90184 33744 153185 59629 104218 75428 85469 185934 89288 -46416
13574 -46416 -99837 -136650 -278542 -60918 55099 -452 -43102 251392 326192 131240 10238
13563 10238 -150387 -32106 -80213 102141 153925 150881 -31265 25452 68745 166944 77125
13552 77125 280732 276098 368193 146350 -188067 -379400 -381889 -305659 -254475 -225716 -104174
13541 -104174 -728 -3976 61138 57670 276637 286559 215356 120174 -2420 91312 -20761
13530 -20761 -129322 65815 118728 273838 370015 500880 423962 261632 -39220 -61699
13520 -61699 -196651 -254957 -30612 20619 -5919 -55957 -190967 -229711 53233 206327 64842
$$ packed form
13595d31933r9682L86209K23065O689M2218j43536Q609j15529k20992j41637K10229
13584b76290J86106J23928J19441r3556M4589k8790J0041J00465r6646j35704
13574d6416n3421l6813j41892K17624J16017n5551m2650K94494P4800j94952j21002
13563A0238j60625J18281m8107J82354N1784l044j82146N6717M3293R8199q9819
13552G7125K03607m634R2095k21843l34417j91333k489P6230N1184K8759J21542
13541a04174J03446l248O5114l468K18967R922p1203r5182j22594R3732j12073
13530b0761j08561J95137N2913J55110R6177J30865p6918j62330l00852k2479
13520f1699j34952n8306K24345N1231k6538n0038j35010l8744K82944J53094j41485
$$ plain form
13509 64842 93250 231481 122580 -256554 -212518 -63520 -64334 -29565 351250 568576 439452
13498 439452 91774 -115241 46549 245330 258579 -34200 -178423 -64787 31500 207636
13488 207636 224496 123998 210247 142608 333518 370180 358263 159390 121687 153156 46242
13477 46242 39561 173547 84232 57654 148244 123619 -85608 -195351 -151291 -39372 268600
13466 268600 561471 562051 311340 55231 4926 -189651 -178088 -74300 187316 153362 -19786
13455 -19786 -16798 291560 213276 208267 327530 411769 433573 187123 189093 217975 335537
13444 335537 370651 88766 47295 102901 180550 170205 264276 464774 354647 227875 -36851
13433 -36851 -110915 -137099 -37469 -1185 136016 325084 392757 412898 282115 50787 205059
$$ packed form
13509F4842K8408J38231j08901l79134M4036J48998q14L4769L80815K17326j29124
13498D39452l47678k07015J61790J98781J3249k92779j44223J13636R6287J76136
13488B07636J6860j00498Q6249o7639J90910L6662j1917j98873l7703L1469j06914
13477D6242o681J33986q9315k6578R0590k4625k09227j09743M4060J11919L07972
13466B68600K92871N80k50711k56109n0305j94577J1563J03788K61616l3954j73148
13455a9786K988L08358p8284n009J19263Q4239K1804k46450J970K8882J17562
13444C35537L5114k81885m1471N5606P7649j0345R4071K00498j10127j26772k64726
13433c6851p4064k6184R9630L6284J37201J89068O7673K0141j30783k31328J54272
$$ plain form
13422 205059 175383 110568 -11148 -184816 -112618 15351 -18778 49867 -84301 -250612
13412 -250612 -306493 -99660 -69958 -47328 21043 6895 153002 256638 157387 234229 262483
13401 262483 -874 -7070 74879 39778 -35552 -20904 16687 156417 295307 349077 295181
13390 295181 322827 413325 613321 563871 455646 332810 184871 145201 238078 84491
13380 84491 6709 31767 41882 101195 214398 143147 -93608 -169332 -46090 98385 226595
13369 226595 413774 518946 465272 423431 505298 388795 131453 -110831 -130072 4034
13359 4034 -134516 -54802 -27404 -22769 -96671 -186892 -74977 159312 184456 116866 161719
13348 161719 156660 19411 -10443 191085 343735 337918 356670 225962 254857 459187 293600
$$ packed form
13422B05059k9676o4815j21716j73668P2198J27969l4129O8645j34168j66311
13412b50612n5881K06833K9702K2630O8371j4148J46107J03636r9251P6842K8254
13401B62483k63357o196Q1949l5101p5330J4648L7591J39730J38890N3770n3896
13390B95181K7646R0498J99996m9450j08225j22836j47939l9670R2877j53587
13380H4491p7782K5058J0115N9313J13203p1251k36755p5724J23242J44475J28210
13369B26595J87179J05172n3674m1841Q1867j16503k57342k42284j9241J34106
13359D034j38550P9714K7398M635p3902r0221J11915K34289K5144o7590M4853
13348A61719n059j37249k9854K01528J52650n817J8752j30708K8895K04330j65587
$$ plain form
13337 293600 199361 115961 13374 -221680 -119802 -17694 -121113 -4386 228289 -75882
13327 -75882 -90116 -57819 -35520 127346 151083 384383 324599 254254 223879 41188 -6737
13316 -6737 -9013 -272629 14393 171335 197714 235350 254809 7198 -442786 -347066 -344151
13305 -344151 -161822 -195558 -201309 -176954 -122433 -178780 -177740 -250113 -220928 -114054 -164275
13294 -164275 -175052 -94832 -71958 -31155 148617 146264 21067 58569 10236 13897 -300684
13283 -300684 -416864 -354240 -267473 -246219 32934 303496 295573 195564 475142 455481 335352
13272 335352 145545 106203 316990 364350 318117 323876 319056 185099 157776 78072 -199276
13261 -199276 -64849 103758 -27195 -265016 -100516 -62889 111342 291794 244653 125506
$$ packed form
13337B93600r4239q3400j02587k35054J01878J02108j03419J16727K32675l04171
13327g5882j4234L2297K2299J62866K3737K33300n9784p0345l0375j82691m7925
13316f737k276k63616K87022J56942K6379L7636J9459k47611m49984R5720K915
13305c44151J82329l3736n751K4355N4521n6347J040p2373K9185J06874n0221
13294a64275j0777Q0220K2874M0803J79772k353j25197L7502m8333L661l14581
13283c00684j16180O2624Q6767K1254K79153K70562p923j00009K79578j9661j20129
13272C35352j89807l9342K10787M7360m6233N759m820j33957k7323p9704k77348
13261a99276J34427J68607j30953k37821J64500L7627J74231J80452m7141j19147
$$ plain form
13251 125506 302393 54916 -377393 -444279 -227380 75510 273172 268920 69439 100202
13241 100202 -3752 -75689 -34712 -102085 -41279 32978 -52974 -102845 45633 35066 -72486
13230 -72486 -15431 -37067 -45496 56562 -141000 -194826 118168 191162 216047 325560 583358
13219 583358 667570 462507 400899 259624 276180 233831 6183 -12387 -13263 126011 80636
13208 80636 -111240 -31625 -94780 -153433 -96677 112222 282238 370767 275061 231117 443565
13197 443565 352095 191261 128180 310385 319695 259788 315717 -89803 -69401 76872 263857
13186 263857 352038 102075 -175701 -139224 -132751 -230043 -325631 -226729 20536 240514 463414
13175 463414 506595 525148 476477 505550 628616 834812 849633 733928 448035 243574
$$ packed form
13251A25506J76887k47477m32309o6886K16899L02890J97662m252j99481L0763
13241A00202j03954p1937M0977o7373O0806P4257q5952m9871J48478j0567j07552
13230g2486N7055k1636q429J02058j97562n3826L12994P2994K4885J09513K57798
13219E83358Q4212k05063o1608j41275J6556m2349k27648j8570q76J39274m5375
13208H0636j91876P9615o3155n8653N6756K08899J70016Q8529r5706m3944K12448
13197D43565r1470j60834o3081J82205R310n9907N5929m05520K0402J46273J86985
13186B63857Q8181k49963k77776L6477O473r7292r5588R8902K47265K19978K22900
13175D63414M3181J8553m8671K9073J23066K06196J4821j15705k85893k04461
$$ plain form
13165 243574 133357 78092 119113 314794 55587 -1238 70040 105296 182036 120409 252221
13154 252221 183496 123267 113680 189860 251927 251784 136474 262107 225526 314556 312139 184785
13142 184785 -9626 120724 98047 113474 421264 372706 280168 287502 169411 240409 174441
13131 174441 -85055 -185158 -110162 117955 182742 306285 372408 402319 720289 692686
13121 692686 496321 401973 572847 665616 373906 -11393 -99717 -207646 -106507 246872
13111 246872 112832 345781 444309 409942 454298 518883 684107 686154 507251 597012 528153
13100 528153 281613 144452 124091 -15079 124678 292123 42982 27631 237163 38908
13090 38908 39508 430664 396814 176665 44938 139927 174674 375566 357819 262147 157363
$$ packed form
13165B43574j10217n5265M1021J95681k59207n6825P1278L5256P6740o1627J31812
13154B52221o8725o0229r587P6180O2067j43j15310J25633l6581Q9030k417j27354
13142A84785j94411J30350k2677J5427L07790m8558r2538P334j18091P0998o5968
13131A74441k59496j00103P4996K28117O4787J23543O6123K9911L17970k7603
13121F92686j96365r4348J70874R2769k91710l85299q8324j07929J01139L53379
13111B46872j34040K32949R8528l4367M4356O4585J65224K047j78903Q9761o8859
13100E28153k46540j37161k0361j39170J39757J67445k49141j5351K09532j98255
13090C8908O00L91156l3850k20149j31727R4989L4747K00892j7747r5672j04784
$$ plain form
13079 157363 601594 1107289 1280686 1445331 1784884 2035982 2235126 2382273 2179451 1909631
13069 1909631 1759240 1309260 1004128 831243 445427 225245 158792 390531 525721 358413
13059 358413 348708 385420 503726 330554 246465 144319 15248 7074 44433 -44393 18527
13048 18527 151705 364004 280525 305578 226003 100461 72027 287574 303943 484404 729124
13037 729124 921972 835734 836628 1219177 1565745 2058325 2882136 4017006 4996441 5733732
13027 5733732 6183409 6061380 5194120 4178432 2926057 1992460 1531210 1286226 1239894
$$ packed form
13079A57363M44231N05695J73397J64645L39553K51098J99144J47147k02822k69820
13069A909631j50391m49980l05132j72885l85816k20182o6453K31739J35190j67308
13059C58413r705L6712J18306j73172q4089j02146j29071q174L7359q8826O2920
13048A8527J33178K12299q3479K5053p9575j25542k8434K15547J6369J80461K44720
13037G29124J92848q6238Q94L82549L46568M92580Q23811J134870R79435P37291
13027E733732M49677j22029q67260j015688j252375r33597m61250k44984m6332
$$ [...]
##END NTUPLES=NMR SPECTRUM
##END=
