##TITLE=Analysis number 323431
Compound Code cc 01402
Book Reference 451/181
Project Code adrs
Chemist Name evam
##JCAMPDX= 6.0         $$ Bruker NMR JCAMP-DX V2.0
##DATA TYPE= NMR SPECTRUM
##DATA CLASS= NTUPLES
##ORIGIN= Bruker BioSpin GmbH
##OWNER= nmr
$$ XWIN-NMR		Version 3.5
$$ Wed Oct 25 10:09:34 2006 GMT Daylight Time (UT+1h)  MAYBRIDGE\nmr@NMR_250MHZ
##.OBSERVE FREQUENCY= 250.131544655141
##.OBSERVE NUCLEUS= ^1H
##.ACQUISITION MODE= SIMULTANEOUS (DQD)
##.ACQUISITION SCHEME= undefined
##.AVERAGES= 16
##.DIGITISER RES= 18
##SPECTROMETER/DATA SYSTEM= dpx250
##.PULSE SEQUENCE= zg30
##.SOLVENT NAME= CDCl3
##.SHIFT REFERENCE= (INTERNAL, CDCl3, 0, 16.4489)
##AUDIT TRAIL= $$ (NUMBER, WHEN, WHO, WHERE, WHAT)
$$ ##TITLE= Audit trail, XWIN-NMR		Version 3.5
$$ ##JCAMPDX= 5.01
$$ ##ORIGIN= Bruker BioSpin GmbH
$$ ##OWNER= nmr
$$ C:\u/data/dgb/nmr/ADRS/1220/pdata/1/auditp.txt
$$ ##AUDIT TRAIL=  $$ (NUMBER, WHEN, WHO, WHERE, WHAT)
(   1,<2006-10-25 10:09:12.50 +100>,<MAYBRIDGE\nmr>,<NMR_250MHZ>,
      <created by zg, POWCHK disabled, PULCHK disabled
       configuration hash MD5:
       49 4B E0 1D 92 C2 6B 37 9F E6 65 BC 52 41 86 1D
       data hash MD5: 64K
       B4 AF A8 D8 9C ED AC EB A7 34 FB AB A3 64 0B 2D>)
(   2,<2006-10-25 10:09:24.92 +100>,<MAYBRIDGE\nmr>,<NMR_250MHZ>,
      <Start of raw data processing
       ef LB = 0.3 FT_mod = 6 PKNL = 1 SI = 32K 
       data hash MD5: 32K
       92 EA A0 FC D0 6F 72 97 DC 0C 6D 94 7E 2A 0E B8>)
(   3,<2006-10-25 10:09:26.61 +100>,<MAYBRIDGE\nmr>,<NMR_250MHZ>,
      <apk 
       data hash MD5: 32K
       15 0C A1 97 E4 56 76 48 52 0D 93 CA 48 A8 E8 D1>)
(   4,<2006-10-25 10:09:27.36 +100>,<MAYBRIDGE\nmr>,<NMR_250MHZ>,
      <abs ABSG = 5 
       data hash MD5: 32K
       0F 07 6A A1 D2 2D FD E6 B6 A9 06 0F 70 92 5A 4D>)
$$ ##END=
$$ 
$$ hash MD5
$$ 1A 53 56 BB 27 D8 8A 1F 3F 54 8C 69 D9 99 70 D5
##$RELAX= 
##$RELAX= 
##$RELAX= 
##$RELAX= 
##$RELAX= 
##$RELAX= 
##$RELAX= 
$$ Bruker specific parameters
$$ --------------------------
##$DU= <C:\u>
##$EXPNO= 1220
##$NAME= <ADRS>
##$PROCNO= 1
##$TYPE= <nmr>
##$USER= <dgb>
##$AMP= (0..31)
100 100 100 100 100 100 100 100 100 100 100 100 100 100 100 100 100 100 
100 100 100 100 100 100 100 100 100 100 100 100 100 100 
##$AQSEQ= 0
##$AQ_mod= 3
##$AUNM= <au_zg>
##$AUTOPOS= <6 >
##$BF1= 250.13
##$BF2= 250.13
##$BF3= 250.13
##$BF4= 250.13
##$BF5= 500.13
##$BF6= 500.13
##$BF7= 500.13
##$BF8= 500.13
##$BYTORDA= 1
##$CFDGTYP= 0
##$CFRGTYP= 5
##$CHEMSTR= <none>
##$CNST= (0..31)
1 1 145 1 1 1 1 1 1 1 1 1 1 1 1 1 1 1 1 1 1 1 1 1 1 1 1 1 1 1 1 1 
##$CPDPRG= <>
##$CPDPRG1= <>
##$CPDPRG2= <>
##$CPDPRG3= <>
##$CPDPRG4= <mlev>
##$CPDPRG5= <mlev>
##$CPDPRG6= <mlev>
##$CPDPRG7= <mlev>
##$CPDPRG8= <mlev>
##$CPDPRGB= <>
##$CPDPRGT= <>
##$D= (0..31)
0 1 0 0 0 0 0 0 0 0.06 0 0 0 0 0 0 0.0002 0 0 0 0 0 0 0 0 0 0 0 0 0 0 
0 
##$DATE= 1161767351
##$DBL= (0..7)
120 120 120 120 120 120 120 120 
##$DBP= (0..7)
150 150 150 150 150 150 150 150 
##$DBP07= 0
##$DBPNAM0= <>
##$DBPNAM1= <>
$$ [...]
##$SUBNAM7= <"">
##$SUBNAM8= <"">
##$SUBNAM9= <"">
##$SW= 20.6930455092707
##$SWIBOX= (0..15)
0 0 3 0 0 0 0 0 0 0 0 0 0 0 0 0 
##$SW_h= 5175.983436853
##$TD= 65536
##$TD0= 1
##$TE= 683.16
##$TE2= 300
##$TE3= 300
##$TEG= 300
##$TL= (0..7)
0 120 120 120 120 120 120 120 
##$TP= (0..7)
150 150 150 150 150 150 150 150 
##$TP07= 0
##$TPNAME0= <>
##$TPNAME1= <>
##$TPNAME2= <>
##$TPNAME3= <>
##$TPNAME4= <>
##$TPNAME5= <>
##$TPNAME6= <>
##$TPNAME7= <>
##$TPOAL= (0..7)
0.5 0.5 0.5 0.5 0.5 0.5 0.5 0.5 
##$TPOFFS= (0..7)
0 0 0 0 0 0 0 0 
##$TUNHIN= 0
##$TUNHOUT= 0
##$TUNXOUT= 0
##$USERA1= <user>
##$USERA2= <user>
##$USERA3= <user>
##$USERA4= <user>
##$USERA5= <user>
##$V9= 5
##$VALIST= <valist>
##$VCLIST= <CCCCCCCCCCCCCCC>
##$VD= 0
##$VDLIST= <DDDDDDDDDDDDDDD>
##$VPLIST= <PPPPPPPPPPPPPPP>
##$VTLIST= <TTTTTTTTTTTTTTT>
##$WBST= 1024
##$WBSW= 4
##$XGAIN= (0..3)
0 0 0 0 
##$XL= 0
##$YL= 0
##$YMAX_a= 529235
##$YMIN_a= -356540
##$ZGOPTNS= <>
##$ZL1= 120
##$ZL2= 120
##$ZL3= 120
##$ZL4= 120
##$ABSF1= 16.44895
##$ABSF2= -4.244223
##$ABSG= 5
##$ABSL= 3
##$ALPHA= 0
##$AQORDER= 0
##$ASSFAC= 0
##$ASSFACI= 0
##$ASSFACX= 0
##$ASSWID= 0
##$AUNMP= <proc_1d>
##$AZFE= 0.1
##$AZFW= 0.1
##$BCFW= 0
##$BC_mod= 0
##$BYTORDP= 0
##$COROFFS= 0
##$CY= 12.5
##$DATMOD= 1
##$DC= 0
##$DFILT= <>
##$DTYPP= 0
##$F1P= 14.0000005364418
##$F2P= -0.99999901652339
##$FCOR= 0.5
##$FTSIZE= 32768
##$FT_mod= 6
##$GAMMA= 0
##$GB= 0
##$INTBC= 1
##$INTSCL= 1
##$ISEN= 128
##$LB= 0.3
##$LEV0= 0
##$LPBIN= 0
##$MAXI= 10000
##$MC2= 0
##$MEAN= 0
##$ME_mod= 0
##$MI= 0
##$NCOEF= 0
##$NC_proc= -5
##$NLEV= 6
##$NOISF1= 0
##$NOISF2= 0
##$NSP= 0
##$NTH_PI= 0
##$NZP= 0
##$OFFSET= 16.44895
##$PC= 1
##$PHC0= -47.43339
##$PHC1= 5.354944
##$PH_mod= 1
##$PKNL= yes
##$PPARMOD= 0
##$PSCAL= 4
##$PSIGN= 0
##$REVERSE= no
##$SF= 250.13001827016
##$SI= 32768
##$SIGF1= 0
##$SIGF2= 0
##$SINO= 400
##$SIOLD= 32768
##$SREGLST= <1H.CDCl3>
##$SSB= 0
##$STSI= 32768
##$STSR= 0
##$SW_p= 5175.98343685301
##$SYMM= 0
##$S_DEV= 0
##$TDeff= 65536
##$TDoff= 0
##$TI= <Analysis number 999999
Compound Code 99
Book Reference 9
Project Code 9>
##$TILT= no
##$TM1= 0
##$TM2= 0
##$TOPLEV= 0
##$USERP1= <user>
##$USERP2= <user>
##$USERP3= <user>
##$USERP4= <user>
##$USERP5= <user>
##$WDW= 1
##$XDIM= 32768
##$YMAX_p= 502783915
##$YMIN_p= -443351
$$ End of Bruker specific parameters
$$ ---------------------------------
##NTUPLES= NMR SPECTRUM
##VAR_NAME=  FREQUENCY,     SPECTRUM/REAL,   SPECTRUM/IMAG
##SYMBOL=    X,             R,               I
##VAR_TYPE=  INDEPENDENT,   DEPENDENT,       DEPENDENT
##VAR_FORM=  AFFN,          ASDF,            ASDF
##VAR_DIM=   32768,         32768,           32768
##UNITS=     HZ,            ARBITRARY UNITS, ARBITRARY UNITS
##FACTOR=    0.157963299565203, 1,           1
##FIRST=     4114.37611746144, 0,            0
##LAST=      -1061.60731939157, 0,           0
##MIN=       -1061.60731939157, -443351,     0
##MAX=       4114.37611746144, 502783915,    0
$$ Real data points
##PAGE= N=1
##DATA TABLE= (X++(R..R)), XYDATA
$$ [...]
18698D565977O6545j6237j50315q1100j53165k05543j26061j68231j17487r4166
18688C520217r1151N7791r9666j21635o3437k21217j54286j09987r357j16352
18678B590920k39748j45609n2497k823j22706j62799r1179j8265r8658k2986J365
18667A635015l7649j23027j75324n3564j44408m1110Q398r0678J1651n4428o7927
18656H66949l0856p3891K0358L0138p5789k088j0297N2237o8370j77566P418M2478
18644E80721m5859J602n5563p6606Q6219Q091o5991J1320L6188n4154l7232n356
18632C83380l0301q978K0025L7309J00419J14678J85766J90810J73067K79154
18622A445329K38719J07046K7300j5489O1607j52674k85508j98923K7154L16303
$$ plain form
18698 4565977 4632522 4616285 4465970 4384870 4231705 4026162 3900101 3731870 3614383 3520217
18688 3520217 3429066 3486857 3387191 3265556 3202119 2980902 2826616 2716629 2707272 2590920
18678 2590920 2351172 2205563 2153066 2150243 2027537 1864738 1773559 1755294 1656636 1633650 1635015
18667 1635015 1597366 1474339 1299015 1245451 1101043 1059933 1068331 977653 989304 934876 866949
18656 866949 836093 762202 782560 812698 736909 734821 724524 776761 708391 530825 538243 580721
18644 580721 534862 536464 480901 404295 490514 498605 432614 443934 480122 425968 388736 383380
18632 383380 353079 344101 364126 401435 501854 616532 802298 993108 1166175 1445329
18622 1445329 1684048 1791094 1818394 1802905 1864512 1711838 1426330 1227407 1254561 1570864
18612A570864L81093K54595N1792o7744k05034r6740j96046l18157k21365k11041
18602I42217r2310l7263j44355r4953N0439p1127j75102j18413J10939J8808l6121
18591C52759j10286N137K1477j00097o7320J44919Q2149m8021p562o5638N768
18580B13285k5201J26974m8609N6631J35416K75575L99992M20266K90546j8185
18570A826690M1402j01079j25785k30368k06714k0702K24880K16152J71531J90452
18560A986459j0285j34066j50154q3832j65360j58920k75299j45454r7067p5472
18550F90550j01137k0004n6048q3707m8266L6266K5687J1574j16788k3478J5850
18539C30499K446o0554o7582O3459M6489N836o3935r4845l3824p8386N239P7812
$$ plain form
18612 1570864 1951957 2206552 2258344 2190600 1985566 1888826 1692780 1374623 1153258 942217
18602 942217 849907 812644 668289 573336 623775 552648 377546 259133 370072 388880 352759
18591 352759 242473 247610 269087 168990 101670 246589 328738 280717 273155 207517 213285
18580 213285 188084 315058 266449 323080 458496 734071 1134063 1554329 1844875 1826690
18570 1826690 1868092 1767013 1641228 1410860 1204146 1183444 1408324 1624476 1796007 1986459
18560 1986459 1976174 1842108 1691954 1608122 1442762 1283842 1008543 863089 766022 690550
18550 690550 589413 569409 513361 429654 381388 417654 443341 454915 338127 314649 330499
18539 330499 332945 272391 204809 268268 314757 320593 256658 161813 127989 49603 54842 132654
18527A32654n2883k615n7312j8965k5666o6766j18831m0766J27583N8193P0053
18516D679L4522O1687P2719P0195o3313L1942N7704l4003m2265j01907L178N0768
18504A45906p7697l6205P2774L569j8859j8689n0562J04205m0497j5031j0908
18493E8006M5143M5789M5898M4750J17295N2407m7366o0958j48208O1602o9869
18482A44489m4070N2437l1132j6418r4479r390K0968J357n0306r3583O8504J2430
18470c9193J9279m3131k6527J4384R8056P0592L0170k235J165J31446K3839J150
18458B78995j00183r2973p5371K1532j1288R2164J71884K60868M58724K95407
18448A299759J772o4753k5169m3009L2733o7882q8330J5603K01264N9582O0678
$$ plain form
18527 132654 79771 77156 19844 879 -24787 -91553 -210384 -251150 -123567 -65374 4679
18516 4679 39201 100888 173607 243802 180489 212431 270135 236132 193867 91960 95138 145906
18504 145906 68209 32004 104778 108347 89488 70799 20237 124442 83945 68914 58006
18493 58006 103149 148938 194836 239586 356881 409288 361922 300964 152756 214358 144489
18482 144489 100419 152856 121724 105306 10827 1437 22405 23762 -26544 -120127 -51623 -39193
18470 -39193 -19914 -63045 -89572 -75188 22868 93460 123630 121395 122560 254006 277845 278995
18458 278995 178812 85839 10468 32000 20712 112876 284760 545628 1004352 1299759
18448 1299759 1301531 1236778 1211609 1168600 1201333 1133451 1045121 1060724 1261988 1321570 1382248
18437A382248N1288p3981j76657j38487j71176j41654p5193n2891j76737j50960
18427B75800M5748l9924p8967P583Q8976J13902o0591l3495P3198K418j56897
18416B37751p1126N6108N2525N398m7325q349Q6694O6697Q627o4729M465k0788
18404C05948l9373P8823J21476J63640K50061L09981J69053J47468l1547j74851
18394A300679k2784p9353j16953j19300R4933K41658J25324J19089l4787q8950
18384A419556l7532k28030k05806k16053l55938k30754O8437Q6240O8603j3571
18374C55152L1125o680j40287N0098M6357L9593L2033O7262l7071j16671n8101
18363B62810L766P2996N7408r1976L6770O1203N074o1498k4326N2041k4359j1579
$$ plain form
18437 1382248 1433536 1359555 1182898 1044411 873235 731581 656388 603497 426760 275800
18427 275800 321548 281624 202657 210240 299216 413118 352527 319032 392230 394648 237751
18416 237751 166625 222733 275258 280656 233331 224982 311676 378373 387000 322271 326736 305948
18404 305948 266575 345398 466874 630514 880575 1190556 1359609 1507077 1475530 1300679
18394 1300679 1277895 1198542 1081589 962289 1057222 1298880 1424204 1543293 1508506 1419556
18384 1419556 1382024 1153994 948188 732135 376197 145443 213880 300120 368723 355152
18374 355152 386277 379597 239310 289408 335765 375358 407391 474653 437582 320911 262810
18363 262810 266576 339572 396980 305004 341774 402977 408051 346553 322227 374268 349909 338330
18351C38330o4918m1417j1927r1864m4969J0509J73856r3182j13279K8132M4548
18340A33819P2751L4027N2815J03442j7934r0031l5240J5204k2803q8929p5936
18329H1185J7277J08579n5213j406J25668J03948J13865l5496j39848j28881n8040
18318A31638J0497R4692Q6508n8757p2086n7636l6201R9823N4766M9058j134J09512
18306D10680p316r7123j12374r1830J28829L1785j34587L5045J33839R6658J00805
18295D94411O8350Q4897J1098j05538L11M3201P6986K7707L6785k209J18946J05113
18283I60058K25373K20321N4400j40766p2637L3161j25307j63240J1830J14232
18273A117425J41380N3301k8335q1436n3605j59736k17553j99356j56250j0822
$$ plain form
18351 338330 273412 231995 220068 128204 83235 93744 267600 174418 61139 89271 133819
18340 133819 206570 240597 293412 396854 378920 288889 253649 268853 246050 157121 81185
18329 81185 98462 207041 151828 150422 276090 380038 493903 458407 318559 189678 131638
18318 131638 142135 236827 323335 264578 192492 134856 98655 198478 253244 302302 301168 410680
18306 410680 403364 306241 193867 102037 230866 262651 128064 163109 296948 393606 494411
18295 494411 562761 647658 658756 553218 553529 596730 673716 701423 738208 735999 854945 960058
18283 960058 1185431 1405752 1460152 1319386 1246749 1279910 1154603 991363 1003193 1117425
18273 1117425 1258805 1312106 1283771 1202335 1148730 988994 771441 572085 415835 405013
18263D05013L3171K9004m3872k0109M8430Q861p9455q5752j77674J3267P7790
18252B08674n0260n9995K8996L4443J42916M5107j04286o0437J03635j0264P2558
18241C51087Q6727N8517M7694L627M5457R4055J3286P0359K97298K77527K17719
18230A563353p4412q7981r1736r6968q8199O582M5445J51991J75425Q8327q5115
18219A506712j77379o8032k7967k34002k57044k59728n1085K3252j12309o3196
18209B79222N632K6672l0068O0354M8746j02386q7434l9425m7430j8773J06775
18198B01885R9825R8932J01800J78348J28468m1851k05356k87458n8522J26610
18188C42681J59484p785O9120J27907K7809j48950n6999J15450M5039n5569p7817
$$ plain form
18263 405013 438184 467188 423316 403207 451637 460498 381043 295291 117617 130884 208674
18252 208674 158414 98419 127415 161858 304774 349881 245595 185158 288793 278529 351087
18241 351087 437814 496331 544025 547652 593109 687164 700450 770809 1068107 1345634 1563353
18230 1563353 1488941 1400960 1309224 1212256 1124057 1130639 1176084 1328075 1503500 1591827 1506712
18219 1506712 1329333 1261301 1233334 999332 742288 482560 431475 454727 342418 279222
18209 279222 284854 311526 281458 341812 390558 288172 200738 161313 113883 95110 201885
18198 201885 301710 400642 502442 680790 809258 767407 562051 274593 216071 342681
18188 342681 502165 494380 563500 691407 719216 570266 513267 628717 673756 618187 540370
18177E40370m8605r4199j00514J10228J24284j6807n9250Q1610J15425o4890Q992
18166E96644O4637L8307N0322J2231q6558L2176K394j9726j0892l9294J3344J12665
18154G66250K25661L20511K52233R7014J69090j34347p32k2115n4715j19849p5976
18143A423025j6459j22702J4507o5644n4377j14503l5597J58069J10368J70362
18133A467049Q6427q1399L0795J80740K95971K65303J74072J68166L44233L84127
18123C315484L61269K76140N21942P61344J137555J699691K812780M725581Q306343
18114B3918129J4964230K5120546L5348191L5306732J6155462j0158441j8841987
18107A21812862q977264j2231136k7461727k5996628j5762653q470689m786425
$$ plain form
18177 540370 491765 397566 297052 407280 531564 514757 455507 537117 652542 587652 596644
18166 596644 661281 699588 749910 762141 675583 707759 710153 690427 679535 640241 653585 766250
18154 766250 991911 1312422 1564655 1661669 1830759 1696412 1695680 1673565 1618850 1499001 1423025
18143 1423025 1406566 1283864 1298371 1232727 1178350 1063847 1028250 1186319 1296687 1467049
18133 1467049 1553476 1472077 1502872 1683612 1979583 2244886 2418958 2587124 2931357 3315484
18123 3315484 3676753 3952893 4474835 5236179 6373734 8073425 10886205 15611786 23918129
18114 23918129 38882359 64002905 99351096 134657828 150813290 140654849 121812862
18107 121812862 112835598 100604462 73142735 47146107 31383454 22912765 18126340
18100A8126340l170808k354792j769876j352430j233998j067267q21325o90852
18092E664992o57379m97167l54939k47946l14739k38785k81230j35482j22171
18083B815154k52531j79369k09582j48641K5177o6859J9616m757m7215L4525k259
18072A983259J1303o9518j30315n3672J10873J36724J08022R1084k4882m4279
18062B118599J5024k4231l7112j0379m8090K7052L8122J53642J24361K13946K37497
18051B808431L53257J33813Q1736p4108j69898j55419k92119l94636l70866k74508
18041A645683j27398o0414j45004j8727m8994o4871o7119n2422p1890M3039O6275
18030A098158J14979n3204m2390j2074j40346J1772l409J1823O3000M413J28092
$$ plain form
18100 18126340 14955532 12600740 10830864 9478434 8244436 7177169 6355844 5664992
18092 5664992 5007613 4510446 4155507 3907561 3592822 3354037 3072807 2937325 2815154
18083 2815154 2562623 2383254 2173672 2025031 2050208 1983349 2002965 1998208 1950993 1985518 1983259
18072 1983259 1994562 1925044 1794729 1741057 1851930 1988654 2096676 2187760 2162878 2118599
18062 2118599 2133623 2109392 2072280 2061901 2013811 2040863 2078985 2232627 2356988 2570934 2808431
18051 2808431 3161688 3295501 3377237 3303129 3133231 2977812 2685693 2291057 1920191 1645683
18041 1645683 1518285 1457871 1312867 1294140 1245146 1180275 1113156 1060734 988844 1031883 1098158
18030 1098158 1213137 1159933 1117543 1105469 965123 976895 973486 985309 1048309 1052722 1180814
18019A180814n8239p3372J60178J49826P703j46423J5748J25663m3147r9389j07305
18008A112057J9831q9964R54J43120J07319j231q7850J11867J50869o5975o3036
17997A337961l7633P5496J3175k5979p0400q482k6766p9127L2848R5278J76761
17986A483132l7880l3851P1072J72167J18864J64026J23297O259o5160J7659J5855
17975B035440J01678J99393K52593K44861L00925L64824K83295P8789J23942J76865
17965D162605K64216L38394L18067K23584J46220L62549L53583K37690K53169
17956F660077N13152P84742R66678J068186J195572J272879J770275K931809M751715
17947B1915085Q007425J3695638K3274028L6224591M6442002L9946414J3566300
$$ plain form
18019 1180814 1122575 1049203 1209381 1359207 1366910 1220487 1236235 1361898 1318751 1219362 1112057
18008 1112057 1131888 1041924 1042878 1185998 1293317 1292086 1204236 1316103 1466972 1400997 1337961
17997 1337961 1300328 1375824 1388999 1363020 1292620 1284138 1257372 1178245 1211093 1306371 1483132
17986 1483132 1445252 1411401 1482473 1654640 1773504 1937530 2060827 2067086 2001926 2019585 2035440
17975 2035440 2137118 2336511 2589104 2833965 3134890 3499714 3783009 3861798 3985740 4162605
17965 4162605 4426821 4765215 5083282 5306866 5453086 5815635 6169218 6406908 6660077
17956 6660077 7173229 7957971 8924649 9992835 11188407 12461286 14231561 17163370 21915085
17947 21915085 29922510 43618148 66892176 103116767 149558769 189505183 203071483
17940B03071483j4858532j6941318p049272j4548557k3451362r543653J3750554
17933A30429343L3058633L7213062J7181687j3319509k5454439j5190500j8071326
17926A45846951l4914364l4152231k2091029j2673016p506186m650343k896291
17919B6963491j808438j413085r45226j35901L26302J33553m57737q66682n42593
17910B1253684k62296n93163q35490l70940L21089J069275J780944J755185J090360
17901B5208648O15245R06080J755485K809537M897137R441436J7134513K9918206
17893I2686287M7797492O3507494N9210630K5203376j6680996k6231104j1661851
17886B33831328j8211795l3985148j9436167J1556243L8912288M8522615K7144800
$$ plain form
17940 203071483 188212951 171271633 164222361 149673804 126222442 116678789 130429343
17933 130429343 163487976 200701038 217882725 204563216 179108777 163918277 145846951
17926 145846951 110932587 76780356 54689327 42016311 34510125 29859782 26963491
17919 26963491 25155053 23741968 22796742 22660841 22987143 23120696 22662959 21796277 21253684
17910 21253684 20991388 20398225 19562735 19191795 19512884 20582159 22363103 24118288 25208648
17901 25208648 25823893 26729973 28485458 31294995 36192132 45633568 62768081 92686287
17893 92686287 140483779 203991273 263201903 288405279 271724283 245493179 233831328
17886 233831328 215619533 181634385 162198218 173754461 212666749 261189364 288334164
17879B88334164j1524132l3401522k2709685k2275736m3467076m6818885l2144123
17872G5993005j9015870j1280867p027738m653133l396725k450908j511062l12945
17864B6343757N25861J68726r24995j728109j445135j068568j844154k284377
17856A7743006j467241l89422M58885J086834R08170j67451j343536j405238r56043
17847A4467964j541565j979396j462814r33269n01397r1026K03716J05772J2608
17838H280593j58659l32636l51387l60336l10917r6037K02351M20568L71130K98325
17828G962995L0761l85145n59612m59753m99015o29319n01034l82070l23396k36046
17818D018366j05631j27923O483o3509j39118q6354n6392n5189j39281j78487
$$ plain form
17879 288334164 276810032 243408510 220698825 198423089 154956013 108137128 75993005
17872 75993005 56977135 45696268 38668530 34015397 30618672 28167764 26656702 26343757
17864 26343757 26869618 27038344 26113349 24385240 22940105 21871537 20027383 17743006
17856 17743006 16275765 15886343 16345228 17432062 18340232 18172781 16829245 15424007 14467964
17847 14467964 12926399 10947003 9484189 8550920 8049523 7958497 8162213 8267985 8280593
17838 8280593 8121934 7789298 7437911 7077575 6766658 6670621 6872972 7293540 7664670 7962995
17828 7962995 7993756 7608611 7048999 6589246 6090231 5460912 4959878 4577808 4254412 4018366
17818 4018366 3912735 3784812 3791295 3727786 3588668 3502314 3445922 3390733 3251452 3072965
17808C072965j57317k10136j81894j68718m1322m2939p0908n1609J375p1286q7148
17797A991063o4153j29846j38348j88231j12524J00174k9957n314j2041o820k7079
17786A376924j13213r2814j6539o485J07105J06481k7515o8539p3731r4482j22907
17775I74285p5992l5917p3417p6157j5693n4697j6610j48743n7661K2157L4852
17764D76407R2194K80949K80316J19227J47709J8050Q4569j6779j74334k52960
17754A055348K7732J15731J81877J35177L8102P8679o3924j29172o5083p8174
17744A296293k79597J5814J28196O6393K5885J27655J11307j03332J0809L0728
17734A430151M2197J19587O0847J4971J84815M41288P95704J307845J795707K072792
$$ plain form
17808 3072965 2915648 2705512 2523618 2354900 2313578 2270639 2199731 2148122 2149497 2078211 1991063
17797 1991063 1926910 1797064 1658716 1470485 1357961 1458135 1428178 1422864 1410823 1404003 1376924
17786 1376924 1263711 1170897 1154358 1147873 1254978 1361459 1333944 1265405 1191674 1097192 974285
17775 974285 898293 862376 788959 712802 697109 642412 625802 477059 419398 441555 476407
17764 476407 568601 849550 1129866 1249093 1396802 1414852 1499421 1482642 1308308 1055348
17754 1055348 1083080 1198811 1380688 1515865 1553967 1632646 1568722 1439550 1374467 1296293
17744 1296293 1016696 1032510 1160706 1227099 1252984 1380639 1491946 1388614 1399423 1430151
17734 1430151 1472348 1591935 1652782 1667753 1852568 2293856 3089560 4397405 6193112 8265904
17724H265904J466851m6872j046852p64855p06294j473989j701033j164929p16374
17715B111557l97437k49271n2200p1277n7844L2915l8036k811m2929m9561o7949
17704A115157O79J09149J14930O2890J39308M8753J68559M2974j99635k03416
17694A399348J3302K2490P5926l1458K68K03069J16475M8117J29338J88242R6913
17683B262030J16376J78658K50870L63815O76643J066420J745576K604129K629351
17674A1893868J793114M34962o83999j072798j267999j674866j863456j614077
17666E944749r86010o61717m93791j81226q031P8920L67264N19633M22173K33663
17656E235627K74945J33370k69472k70712j43068k78348k59577j99290J055K68400
$$ plain form
17724 8265904 9732755 9685883 8639031 7874176 7167882 5693893 3992860 2827931 2111557
17715 2111557 1714120 1464849 1412649 1341372 1283528 1316443 1278407 1275596 1232667 1183106 1115157
17704 1115157 1115836 1224985 1339915 1402805 1542113 1590866 1759425 1802399 1602764 1399348
17694 1399348 1412650 1435140 1511066 1479608 1479876 1682945 1799420 1847537 1976875 2165117 2262030
17683 2262030 2378406 2557064 2807934 3171749 3848392 4914812 6660388 9264517 11893868
17674 11893868 13686982 14121944 13437945 12365147 11097148 9422282 7558826 5944749
17666 5944749 4958739 4297022 3803231 3622005 3613974 3692894 4060158 4579791 5001964 5235627
17656 5235627 5510572 5643942 5374470 5103758 4960690 4682342 4422765 4223475 4224530 4492930
17646D492930K19160K66961K62351M21290M54429M64056Q08865J042461J300427
17637I732930J623224K089927L244720N112992P863240J2669406K0278232L3000304
17629I5614975N0434123O3293888N3586360J7057192k1255283k6671754j7328078
17622B14731423l1288250m9286442m2206772k7016566j6757325j0919388p272170
17615B9984510m905100l505477k556681j861873j279089p62527l07019R5568P6542
17606A4978854M8582l829j91670n09937p09941n54428l22611k29527j13179P5266
17596A2467580J62391J77736J56438p1111K00769M27252N82044P37437J184987
17587A6025523J799593K447644L651089N472354Q517108J3076489K0170107L1871371
$$ plain form
17646 4492930 4712090 4979051 5241402 5662692 6117121 6581177 7390042 8432503 9732930
17637 9732930 11356154 13446081 16690801 21803793 29667033 42336439 62614671 95614975
17629 95614975 146049098 209342986 262929346 279986538 258731255 232059501 214731423
17622 214731423 183443173 134156731 91949959 64933393 48176068 37256680 29984510
17615 29984510 25079410 21573933 19017252 17155379 15876290 15113763 14806744 14902312 14978854
17606 14978854 15027436 15023607 14831937 14322000 13612059 13057631 12735020 12505493 12392314 12467580
17596 12467580 12629971 12807707 12964145 12893034 13093803 13521055 14103099 14840536 16025523
17587 16025523 17825116 20272760 23923849 29396203 37913311 50989800 71159907 103031278
17579A03031278N1714328P9704540J01889790Q8913307L0730082l4101608m7114499
17572C74767218k9591707m8158884p9167258p0596265m5200532k6816362j7058439
17565E8177771j1487849p815622n800006m617634l483267k616273j920914j310175
17557A9126031j005983p56939n83267n97218m26744n11890o79977n22482p9729
17548A3961802R2030k5667o0987r0214j2911k89931o06337m54009l13771k79399
17538A1920606k86228K2571M36389Q56056J538666K474801L979829N689999Q371428
17529C5004117J2497816K0368644L2066354M2137666L8558340J5163116j3369459
17522A82426594k1123293j2983356j9072411l3125424l0343181j9622536j1676120
$$ plain form
17579 103031278 154745606 234450146 336339936 425253243 455983325 421881717 374767218
17572 374767218 345175511 297016627 217849369 147253104 102052572 75236210 58177771
17565 58177771 46689922 38874300 33074294 28456660 24973393 22357120 20436206 19126031
17557 19126031 18120048 17363109 16779842 16182624 15755880 15243990 14564013 14041531 13961802
17548 13961802 14053832 14028165 13967178 13876964 13864053 13574122 12967785 12513776 12200005 11920606
17538 11920606 11634378 11656949 12093338 12949394 14488060 16962861 20942690 26632689 35004117
17529 35004117 47501933 67870577 99936931 142074597 180632937 195796053 182426594
17522 182426594 161303301 148319945 129247534 96122110 65778929 46156393 34480273
17515C4480273p243258m922366l448434k595519k107673j645355j245563j054861
17507A0217244r47734q02174n32167m94913m43145l26478l33342k39694r3302
17498F004295o3921J54455J47297O1623p2478k10245k22029l34467l82363m64970
17488D617197m71676n45779m15544j90165K6479J70286K55152L38756J94043k7780
17478C950969j65061k12065q9361j88196l57386l92021r7941j99540j50054n2231
17468B047113J02641K9335O4342M3322j3687n7972r6325m1440j56160j31381q1146
17457A708642j89409j93628q5775K9850K7679j7497k4291q4177j44142N9303K37919
17446A324474L48730K39792J8205j61337k84152j40789j29129r7376j71115j19620
$$ plain form
17515 34480273 27237015 22314649 18866215 16270696 14163023 12517668 11272105 10217244
17507 10217244 9269510 8467336 7935169 7440256 6997111 6670633 6337291 6097597 6004295
17498 6004295 5940374 6094829 6242126 6303749 6231271 6021026 5798997 5464530 5082167 4617197
17488 4617197 4145521 3599742 3184198 2994033 3020512 3190798 3445950 3784706 3978749 3950969
17478 3950969 3785908 3573843 3484482 3296286 2938900 2546879 2448938 2249398 2099344 2047113
17468 2047113 2149754 2179089 2243431 2286753 2273066 2215094 2118769 2077329 1921169 1789788 1708642
17457 1708642 1519233 1325605 1239830 1269680 1297359 1279862 1255571 1171394 1027252 1086555 1324474
17446 1324474 1673204 1912996 1931201 1769864 1485712 1344923 1215794 1118418 947303 827683
17436H27683o0448M5382M6865P8792L5514l1003o0886O0112J13428N1946J14959
17425A222344J20072K74977L59531L35797O0768k44080j08791j44608l28035k11679
17415A336296R448J52973K41443L24050J60652o1035p6017q2805j92719l57217
17405A455069k06386k68367k15565r5817l6023j6955p0237j54723j23085j5191
17395B52720o8666k4526j39075j86051r8060O604O8311Q2945K05550K45724K2817
17384C68293p025K05257J58420N518m7011Q5208Q619m9860j05202j38249O3805
17373E47773K72219K21366M9664K2055L4579O6001j04818j34757j63694j16449
17363F93939j9430J22283J73626P2513p438r161k9330r5400j81248j16206j51928
$$ plain form
17436 827683 767235 812617 859482 938274 973788 942785 881899 942011 1055439 1107385 1222344
17425 1222344 1342416 1617393 1976924 2312721 2373489 2129409 2020618 1876010 1547975 1336296
17415 1336296 1345744 1498717 1740160 2064210 2224862 2163827 2087810 2005005 1812286 1455069
17405 1455069 1248683 980316 764751 668934 632911 615956 545719 390996 267911 252720
17395 252720 184054 159528 20453 -165598 -263658 -257054 -188743 -105798 99752 345476 368293
17384 368293 361268 566525 724945 730463 683452 768660 777279 727419 622217 483968 547773
17373 547773 819992 1041358 1091022 1113077 1147656 1213657 1108839 974082 810388 693939
17363 693939 674509 796792 970418 1042931 1035493 1026332 997002 901602 720354 604148 452220
17352D52220q2305l1236k363j06915l0693K1915p9147j38702P9137J16345n163
17341A93093r6297j21588j07328j31083K6505R0691K4411O4927J05107J31812
17331A80250N086L7880O0334J4001j05911k9985J7183P9313j4090p1937K2651
17320A94775J53374m6218q998n8125r4832P838P8366J07658p3337j0553K0124
17309B70072q2371o9238N9827M2965L1459r133o9258k178q9586j67146p6091M8833
17297a11845P8636J78511L1973r8034N260J10168P214n4462k1553L1817l4860
17286A22825l1937j5988M5504k6021p5754m2321j4617J00253L5561o9711j16160
17275h8366q2127N5728l2983o3438l466R281m4647J01343J74581J61230P6735
$$ plain form
17352 452220 369915 338679 336316 229401 198708 220623 141476 2774 81911 198256 193093
17341 193093 96796 -24792 -132120 -263203 -236698 -146007 -121596 -56669 48438 180250
17331 180250 185336 223216 283550 297551 191640 161655 178838 258151 244061 172124 194775
17320 194775 348149 301931 292933 234808 139976 147814 226180 333838 260501 249948 270072
17309 270072 187701 118463 178290 221255 252714 243581 174323 172145 82559 -84587 -160678 -111845
17297 -111845 -33209 145302 177275 79241 84501 194669 201883 147421 125868 157685 122825
17286 122825 90888 74900 120404 94383 18629 -23692 -38309 61944 97505 27794 -88366
17275 -88366 -170493 -114765 -147748 -211186 -214652 -205371 -250018 -148675 25906 187136 263871
17264B63871K7399Q4710O3586o9272j07188n9804k998J7009k7203j53525n9737
17253b3152J6964J5233N2738m0285J7486q216j7033P5712o590k088N9024l7688
17241A02105n6331J20506P379k02647l8462P2941O1525N7554J2545k1749L1731
17230A47097K3247R0867L2060p0425k59829m9760K6952o1887j28299O4813J34081
17219e1083R9147J9015k5897O1207J14573m6861q1013Q1048l0085p2613r9825
17208c2387l8155O8675k5615l5784l492J31606K4177M5076L7437N6404n730M989
17196B27201j56097m9356L3605M2725J09785J5691l9583l6544k5933n0537m7326
17185B3631O8880O2939J281q4191j44580l407m6099N4159J2292O2429J18774P6616
$$ plain form
17264 263871 291270 375980 439566 370294 263106 203302 200304 217313 190110 36585 -23152
17253 -23152 -6188 9045 61783 21498 38984 30768 13735 89447 82857 80769 139793 102105
17241 102105 45774 166280 173659 -28988 -67450 5491 67016 124570 137115 115366 147097
17230 147097 170344 261211 293271 222846 -36983 -86743 -59791 -121678 -249977 -185164 -51083
17219 -51083 48064 67079 41182 102389 216962 170101 89088 170136 140051 67438 -32387
17208 -32387 -70542 -1867 -27482 -63266 -66758 64848 89025 134101 171538 227942 222212 227201
17196 227201 71104 21748 55353 98078 207863 223554 183971 147427 121494 70957 23631
17185 23631 92511 155450 156731 72540 -72040 -75447 -121546 -67387 -55095 7334 126108 202724
17173B02724o8835K311M2818k0265j87727j8588N9333R61j16123K2264L6016L1316
17161a3795m6299P5562L0640l2770m2567r0139O654L2743k369n124n6680J4841
17149a29303J13491O3655N547j40535J915P3576Q0901Q5100K1085p2258r931Q6919
17137A80162O1681J11945r9197j99953l2692o5252J7840r2263K9543J842L3736
17126e2608J5998O662M0417j9572r7115N8958L4529L1876l7445L2802n2698M1736
17114C540J56642J6260K7555M5016K7734K3750m3775Q326M4755K45852M93648
17103A049303L76636J00230p4604j18429j59463k28006l59235j92570j43904o6596
17093A83362Q7075P9738N1162r3459q7892j37137j15016m0927l6822p2725K4510
$$ plain form
17173 202724 133889 136200 179018 158753 -28974 -47562 11771 12732 -103391 -81127 -45111 -13795
17161 -13795 -60094 15468 46108 13338 -29229 -119368 -112714 -79971 -82340 -87464 -144144 -129303
17149 -129303 -15812 47843 53390 -87145 -85230 -11654 69247 154347 175432 103174 93243 180162
17137 180162 241843 353788 254591 54638 21946 -43306 -25466 -117729 -88186 -86344 -52608
17126 -52608 -36610 -29948 10469 -9103 -106218 -47260 -12731 19145 -18300 14502 -38196 3540
17114 3540 160182 176442 203997 249013 276747 300497 256722 265048 309803 555655 1049303
17103 1049303 1425939 1526169 1451565 1333136 1173673 945667 586432 393862 249958 183362
17093 183362 270437 350175 401337 307878 219986 82849 -32167 -73094 -109916 -182641 -158131
17082a58131Q5040r536k7868J31073k7259l3522J54429Q2995j13758j59630Q9755
17071A3588J07949N3954n3585L044j1520L3754J05912r575m3415j01741j0417
17060H7948l7486R1841J17748O444J51518J80135K95538N10956O44276L87352
17050B436270k4437j78141j89903j35365m28887n05967m63385k23440j1959j06566
17040A68220q4611o9444p283Q8406M4990J2772N4816j0714P512K9824n4352l5258
17028A44878O1855j402K3813O476p3110J0508l181j14238n4819m4052p2875J1119
17016a05028k468J56557R8461J3120J0201k40805j63481j9150O4290K05003M0429
17005E7129O5866J90417J83142J98377K59354J26157N9160n2188k8853r739m5805
$$ plain form
17082 -158131 -73091 -82627 -110495 20578 -6681 -40203 114226 197221 83463 -76167 13588
17071 13588 121537 175491 121906 124950 113430 147184 253096 243521 200106 98365 87948
17060 87948 50462 142303 260051 266495 418013 598148 893686 1404642 2048918 2436270
17050 2436270 2411833 2233692 2043789 1908424 1479537 973570 510185 286745 274786 168220
17040 168220 83609 14165 6882 95288 140278 153050 207866 197152 204664 234488 180136 144878
17028 144878 206733 205331 229144 235620 162510 173018 169837 55599 780 -43272 -116147 -105028
17016 -105028 -107496 49061 147522 160642 170843 -69962 -233443 -252593 -188303 16700 57129
17005 57129 122995 313412 496554 694931 954285 1080442 1139602 1087414 1058561 1048822 1003017
16994A003017l01335k13296j12445j77264j46905K1477K3689p0888k2633L0001
16984C3418J64763J85935L387j02118p9331Q8028p268j3991k5071N8207r3971
16973B11988r2037q4926j38676K9246K00944N4768q0701r9879j04707L2899q5058
16962a56139j21785l428J5541J18023J99590N367j03367q0710q0164M64K9241
16951a77367k2475L5707J06659n3097L0777J82943n859r7935p3330j43104k4660
16940b41741J01149R8160O9771k4624o1918q0596O4911J54634n1222o4728k0234
16929e6438J37736o6870j06528K3461J8078m6317J9390L8129M6350J6100R770
16918C2861j62541k14653q7694N1397P8852J8978P1913J12451L953J9494M1699
$$ plain form
16994 1003017 701682 488386 375941 198677 51772 73249 96938 26050 3417 33418
16984 33418 198181 384116 387503 285385 206054 294082 286814 272823 247752 305959 211988
16973 211988 119951 35025 -103651 -74405 126539 181307 100606 727 -103980 -71081 -156139
16962 -156139 -277924 -281352 -265811 -147788 51802 57169 -46198 -126908 -207072 -206608 -177367
16951 -177367 -199842 -164135 -57476 -110573 -79796 103147 97288 -647 -73977 -217081 -241741
16940 -241741 -140592 -42432 27339 2715 -59203 -139799 -74888 79746 28524 -36204 -56438
16929 -56438 81298 14428 -92100 -68639 -50561 -96878 -77488 -39359 6991 23091 32861
16918 32861 -129680 -344333 -432027 -380630 -301778 -282800 -210887 -98436 -94483 -74989 -33290
16907c3290m1331l1059L7472R998P1095j00392P172J33102L3094P8933n740o5625
16895I3429j34792j16923K2264k093L1168P1165k1895j69117R1715K07570k3730
16884D8761l5519J7039K9314l768j24371K0008M6096Q0262M1122j01664m5955
16873b8675N9002L6431q3967k8092M9273P6108J9423L2633j45163l9642q0934
16862a33603m2383N2165l9216J16846L0096j07237n4462Q8873M5354R3066M4476
16851I3975l5665m3818j20405q6745K0749J89009j5674k03353j0296J13694J3367
16840h5162p3143n8909P3591J18046O1788q6811j1648j4652M8239J29105p8206
16829B2238M4756O8444N6424n1909o1340j1819m6834r2499M8742k9359p3746M371
$$ plain form
16907 -33290 -74621 -105680 -68208 -58210 12885 -87507 -80335 52767 85861 164794 159054 93429
16895 93429 -41363 -158286 -136022 -138115 -106947 -35782 -57677 -226794 -135079 72491 48761
16884 48761 13242 30281 59595 55827 -68544 -48536 -2440 77822 118944 17280 -28675
16873 -28675 30327 66758 -17209 -45301 3972 80080 99503 132136 -13027 -52669 -133603
16862 -133603 -175986 -123821 -163037 -46191 -16095 -123332 -177794 -88921 -43567 49499 93975
16851 93975 58310 14492 -105913 -192658 -171909 17100 1426 -201927 -212223 -98529 -85162
16840 -85162 -158305 -217214 -143623 -25577 36211 -50600 -62248 -76900 -28661 100444 22238
16829 22238 66994 135438 191862 139953 78613 66794 19960 -72539 -23797 -53156 -126902 -122531
16817a22531q841J35397K367J5738N4173J5107n8947p4207O2973j5124K3444M2202
16805G1751p0579N8617k4237m6727N7609J18068J00310o9667j31372j57300Q5863
16794g664J31609j18274n3969L536M3858l1683n273m3338j16383Q1466J33855
16783A7740j3600l3092N0394p418P9688O7168m5611k8966q9665m9708J11592P0125
16771A28647q0965k01860O0644l5148l1078L1084k9361K7650l5276J55129Q3506
16760G2972l0413o5564j03656n1331L3432R6541P1061M9375j9486J5425J16961
16749A85317K2549Q3123n7630j53554k8504j19450n958J77774n9280p0749Q9513
16738F3151P7162R5997j39347r6145N9935J27457j33427k4491k6115L7176J0911
$$ plain form
16817 -122531 -131372 4025 6392 22130 76303 91410 32463 -41744 21229 6105 29549 71751
16805 71751 1172 59789 35552 -11175 46434 164502 264812 195145 63773 -93527 -7664
16794 -7664 123945 5671 -48298 -44762 -904 -32587 -37860 -81198 -197581 -116115 17740
16783 17740 4140 -28952 21442 14024 93712 160880 115269 86303 -3362 -53070 58522 128647
16771 128647 47682 -154178 -93534 -128682 -159760 -128676 -158037 -130387 -165663 -10534 72972
16760 72972 42559 -23005 -126661 -177992 -144560 -48019 23042 72417 52931 68356 185317
16749 185317 207866 290989 233359 79805 51301 -68149 -74107 103667 44387 -26362 63151
16738 63151 140313 236310 96963 818 60753 188210 54783 30292 4177 41353 52264
16727E2264q984o6501J3305O3512N417K9490q0314j05008J9594p0622L8557R6303
16715a2987o7193l4423J07677Q0832J6270P4062L6064j20081n099l0031r656O156
16703D1591q5480O1533J37871l8522j27633K0342j1359j02470j27251j4582J04476
16692a41484J08300L8417m5557p5454M0839k5116P75L5838p5332o331k8183k0832
16680a94120Q0344N132n2776n2554J784J01581R2654K02434R5573l9425o7626
16669A73001j44992m4275j08421l3280J2040N478J07273o7163j6970P4743M5075
16658B509j2227l8747L6091N6549M5327q5444n6402q9687j01530M2897L3024Q8893
16646g8747k0956N8523k7800R6535N6107j80729m2959J8715R9612J10585o9523
$$ plain form
16727 52264 43280 -23221 -9916 53596 59013 88503 8189 -96819 -77225 -147847 -109290 -12987
16715 -12987 -80180 -114603 -6926 73906 90176 164238 200302 80221 75122 45091 35435 41591
16703 41591 -43889 17644 155515 116993 -10640 9702 -1657 -104127 -231378 -245960 -141484
16692 -141484 -33184 5233 -40324 -115778 -74939 -100055 -99280 -63442 -138774 -145105 -173288 -194120
16680 -194120 -113776 -108644 -161420 -213974 -212190 -110609 -17955 184479 280052 240627 173001
16669 173001 28009 -16266 -124687 -157967 -145927 -140449 -33176 -100339 -117309 -42566 2509
16658 2509 -9718 -48465 -12374 44175 89502 4058 -52344 -142031 -243561 -200664 -167640 -78747
16646 -78747 -99703 -41180 -68980 27555 83662 -97067 -140026 -121311 -21699 88886 19363
16635A9363m3720N6538o2608R904R368k3452l9782o724l1891l7233O4136N8964
16623b7137k3957j59384N1288R4254n185j3044l9608O8764q2940m2531K2547R2921
16611f4012J0875L2972k4576J9364j00314R258M8403O489m3460K9884O920k2340
16599i0537j34367L600m6358L2743R3696Q4367R4773r92L3084o1047j44785M8041
16587h7782k0658P4556Q9229J0638j03572n2446l3477J41573o2118l3765l4606
16576a12428k8867n5855N9509q191J9697J12706k7679K6253O4188P0105l4915
16565H4523n9994j07397R7898J16951k1558o5948m7315l7486O3369Q958p4478
16554d2477M7499O5240J2937r8259j32755n1427n4619p0836K00722J64653L2564
$$ plain form
16635 19363 -24357 32181 -30427 -20523 -11155 -34607 -74389 -81113 -113004 -150237 -86101 -27137
16623 -27137 -51094 -210478 -159190 -64936 -70121 -83165 -122773 -54009 -136949 -179480 -156933 -64012
16611 -64012 -53137 -20165 -44741 -25377 -125691 -116433 -68030 -61541 -105001 -75117 -68197 -90537
16599 -90537 -224904 -221304 -267662 -234919 -141223 -56856 37917 36925 70009 8962 -135823 -87782
16587 -87782 -108440 -33884 55345 65983 -37589 -90035 -123512 18061 -44057 -77822 -112428
16576 -112428 -141295 -197150 -137641 -145832 -126135 -13429 -41108 -14855 49333 119438 84523
16565 84523 24529 -82868 15030 131981 110423 44475 -2840 -40326 23043 32001 -42477
16554 -42477 5022 70262 83199 -15060 -147815 -199242 -253861 -324697 -123975 40678 73242
16543G3242n6532m9621N7177K1669M496o5453m3132O897J8490K3747L4932o6327
16531d0415j17446Q430R5508j8081O0866J12304J4085r9233j13440r6158o623
16520b00203m1362p1555R6567J14932P3185L6221l6504J07900l7897j10093m0828
16509a09637J04559K965j09070j3841K2083N1193j2285J4526p4114j518L3415
16498i1724L5804M0184n2144q7371q2141r6470R145J0545O6197N3087J22649J22469
16486E0230j2003k5121j28473n7365J16842J2637o9699J7404k5345q7563l0257
16475b38713J22880M0040M4490j6209o5119j10733o016n2982k539L2214Q277J24979
16463a19431J16658j5335N1755P5210n5801j13062O1247o406q6027J6946j5743
$$ plain form
16543 73242 16710 -32911 24266 45935 50431 -15022 -58154 -51257 -32767 -9020 25912 -40415
16531 -40415 -157861 -149431 -53923 -72004 -11138 101166 115251 16018 -97422 -193580 -200203
16520 -200203 -241565 -313120 -216553 -101621 -28436 7785 -28719 79181 41284 -68809 -109637
16509 -109637 -5078 -2113 -111183 -125024 -102941 -51748 -64033 -49507 -123621 -125139 -91724
16498 -91724 -55920 -15736 -67880 -155251 -237392 -333862 -324717 -314172 -247975 -194888 -72239 50230
16486 50230 38227 13106 -115367 -172732 -55890 -43253 -112952 -95548 -120893 -208456 -238713
16475 -238713 -115833 -75793 -31303 -47512 -112631 -223364 -229380 -282362 -284901 -252687 -244410 -119431
16463 -119431 -2773 -18108 33647 108857 53056 -60006 1241 -5165 -91192 -74246 -89989
16452h9989j03688J62525J08452K3192n0502q5269o9832p2036M1193K7644j9777
16441a28087J31873Q8025Q9722j00303j83326k3579m4464p4455j05208J76907
16431a72895j02555l2416K33296K27151O328m23r8513j43683L7914J10234q81
16420F3557j08136J16696K6879o4962p4715o8763Q9300L0528j2527K9883n4189
16409b6449m0023j06351r4053P8874J30448Q6721j8308r1132M4073J14468M0757
16398A19025n6245j3762j18408P033n2440q2357L4027l869O2205J07197J13056
16387A15462q9809j14817j9322L0285Q191M3896J7386n6447p4388k1828n0007
16376b11398R6171Q3045P134K4357K3429p0432l0189J6306Q5376K5784o0776p24
$$ plain form
16452 -89989 -193677 -31152 77300 100492 49990 -35279 -105111 -177147 -135954 -108310 -128087
16441 -128087 3786 91811 181533 81230 -102096 -125675 -170139 -244594 -349802 -172895
16431 -172895 -275450 -307866 -74570 152581 158909 158486 59973 -83710 -45796 64438 63557
16420 63557 -44579 72117 98996 34034 -40681 -109444 -20144 10384 -2143 27740 -26449
16409 -26449 -66472 -172823 -266876 -188002 -57554 29167 10859 -80273 -36200 78268 119025
16398 119025 62780 49018 -69390 -62357 -114797 -197154 -163127 -166996 -104791 2406 115462
16387 115462 25653 -89164 -108486 -78201 -70010 -26114 -8728 -65175 -139563 -161391 -211398
16376 -211398 -115227 -32182 -25048 -691 22738 -47694 -77883 -61577 23799 49583 -11193 -11917
16364a1917K1626M1378K916j8825j29449l13K777k3970j03633j2020j3325O2028
16352a82727J39021N839p549r2884L0085J4086Q703O552L4028O9752o6426o4948
16340a06468L639Q4853l7315k6580M816Q634j0058P4344k5922q7475Q3399O2205
16328B8072N312q7610j94064J711J3532k722j0947N3423L7424J08335J57287J2715
16316A22468n2708p6988l6257K8000P780j51553r5459j0979J8239l9738o4596
16305c51791J19972N5860n9568N764J07556k3951M4362N0830r3839j15235J8737
16294b41303J06476L7886p0800N0438L0912K0016J10427m7043j49069o0353N6862
16283a55551J02885l6095k8145J7675J43961M5685p9322l8801o9551r2712O7239
$$ plain form
16364 -11917 9709 51087 54003 35178 -94271 -94584 -91807 -115777 -219410 -231430 -244755 -182727
16352 -182727 -43706 -37867 -45416 -138300 -108215 -94129 -85426 -78874 -44846 24906 -41520 -106468
16340 -106468 -102829 -17976 -55291 -81871 -77055 -68421 -78479 -4135 -30057 -117532 -34133 28072
16328 28072 33384 -54226 -248290 -246579 -233047 -235769 -246716 -193293 -155869 -47534 109753 122468
16316 122468 69760 -7228 -43485 -15485 -7705 -159258 -254717 -265696 -247457 -287195 -351791
16305 -351791 -231819 -175959 -235527 -229763 -122207 -146158 -101796 -50966 -144805 -260040 -241303
16294 -241303 -134827 -96941 -167741 -117303 -86391 -66375 44052 -2991 -152060 -212413 -155551
16283 -155551 -52666 -88761 -116906 -99231 44730 90415 11093 -27708 -97259 -189971 -122732
16272a22732J40142J2277j35614j2864P7409J4291p2250n6316j0178m7068J11850
16261a01053Q6596q071r9163m6133l0406M858J0094K5615Q2629l0793r312M4828
16249g0311O2506O9477k9522p7034o6809p1465J19092k9903r1163N5910k788O5131
16237f6879j0518m916k740r0025j42290m1806R6480K5416N0477L6843n4889j2874
16225b17721M790L3612J49575R9879M4853J4179j7462p8839j0996j21733j15806
16214b15669J44241P6793O6974k1650p235l1589j61942j29556J29865Q0165N1066
16203a8537Q471q7344m2835N848P0911O0114j56427P3740O61L7796l2232r0598
16191a70432K5611K7896j12062O317K0763k3536P5958M5550j0814m3740J15276
$$ plain form
16272 -122732 17410 29687 -105927 -118791 -41382 -27091 -99341 -155657 -165835 -212903 -101053
16261 -101053 -14457 -22528 -121691 -167824 -198230 -193372 -183278 -157663 -75034 -105827 -115139 -70311
16249 -70311 -7805 61672 32150 -44884 -111693 -183158 -64066 -93969 -185132 -129222 -132010 -66879
16237 -66879 -77397 -82313 -85053 -175078 -317368 -359174 -262694 -237278 -186801 -149958 -204847 -217721
16225 -217721 -212931 -179319 -29744 70135 114988 129167 111705 32866 21870 -99863 -215669
16214 -215669 -71428 5365 72339 50689 43454 11865 -150077 -279633 -149768 -69603 -18537
16203 -18537 -10066 -97410 -140245 -134397 -63486 -3372 -159799 -86059 -85398 -47602 -79834 -170432
16191 -170432 -144821 -116925 -228987 -222670 -201907 -225443 -149485 -103935 -114749 -158489 -43213
16180d3213L8971j15350J6564N1346J54476q658j27237J5050o941n9041r1267
16169a75300R1038J4038k0212r3859n2202q4716m7528K22717Q5735j2006p2904
16158a45199j06463Q738J0309L8775N0499K110m6583L9664Q4605R0985p6787r7178
16146a46525M4013m9197O6886R8932l4551p4403K124M4447R7923n4827K4579M5011
16134F4412j816l9639j80074J13509o203O0681N2248k5383M2617K3593n2596q9925
16122c8576j59763k4918J1178M4857N3062M0809P9702J00203m1816n1889M7174
16111F0023k7056p6579M527J54119n5035r4171M985P9128j00877l9974P0403M784
16099a5723p3920j7474Q2895N4031P3445M5735j56815j39326K1395P3913J28840
$$ plain form
16180 -43213 -4242 -119592 -103028 -51682 102794 94136 -33101 -18051 -24992 -84033 -175300
16169 -175300 -84262 -70224 -90436 -184295 -236497 -321213 -368741 -146024 -60289 -72295 -145199
16158 -145199 -251662 -242924 -232615 -193840 -143341 -141231 -187814 -148150 -63545 27440 -49347 -146525
16146 -146525 -102512 -151709 -84823 14109 -20442 -94845 -92721 -48274 49649 -5178 19401 64412
16134 64412 62596 22957 -157117 -43608 -49811 10870 63118 37735 80352 103945 51349 -38576
16122 -38576 -198339 -223257 -212079 -167222 -114160 -73351 6351 106554 64738 12849 60023
16111 60023 32967 -43612 -39085 115034 59999 -34172 -29187 49941 -50936 -90910 -20507 -15723
16099 -15723 -89643 -107117 -24222 29809 103254 148989 -7826 -147152 -125757 -51844 76996
16088G6996O7258M7125M5620j09755j6052j45686j08060L419J69580m2448n8750
16077g0753K8560R7214j7277m8003k8528r3766l247K8861N2572l3906l3142k7119
16065a48534M7162J57746Q6204J11954L96r7363j50584l2419J07752M667L877
16054I0858P9512q0821k487j7628k0724j0114o7529O627M0768k4073M9109P0793
16042A14291N5217O596j13486j10150K406M8381n496p2463j17222m4149Q3492
16031a52583K08544l8768q0243K9253k6707j03375L185J77324j7051K8417Q6813
16020A14809n7050J6680P1126n8630m7888l8634j9873K975r979O1495O5495L0657
16008A31183l6551k3264m4547k4480j15684j8695n422k4334p7227L9255J2826
$$ plain form
16088 76996 144254 191379 236999 127244 111192 -34494 -142554 -139135 30445 -12003 -70753
16077 -70753 -42193 55021 37744 -10259 -38787 -132553 -135800 -106939 -54367 -88273 -121415 -148534
16065 -148534 -101372 56374 142578 254532 254928 157565 6981 -25438 82314 86981 90858
16054 90858 170370 89549 87062 69434 48710 38596 -28933 -22306 18462 -5611 43498 114291
16042 114291 169508 176104 62618 -47532 -45126 3255 -2241 -74704 -191926 -236075 -152583
16031 -152583 55961 17193 -63050 -33797 -60504 -163879 -160694 16630 -421 27996 114809
16020 114809 57759 74439 145565 86935 39047 413 -19460 -16485 -26464 35031 100526 131183
16008 131183 94632 71368 26821 2341 -113343 -132038 -137460 -161794 -239021 -199766 -186940
15997a86940N2125Q7655O215o6530r9392J9868J16355J61174N3434n267Q934j43118
15985D513k25664k529Q0535k8795R2258P8933J00470P3848j7566q4303j13270
15974d1570r1783o1888P1869Q0392O1886K2368K6416K4794j069j7116N43o481
15962F8361k9080o4574N3034P9176j29488m3945K8028q1393q5092J08483J25308
15951B8818L7910j36245R158P6354O8869r2557l7278L4131L3923o268P952R8824
15939A23591L438j95605o937l3024n4823M9774J75158J34988p5566k9028p7111
15928A4855j48102K9103J95504K9150n2023J30194M9386j98298n1388P7290M7208
15917A22879q360n8370Q9168R443L2920p7105j34830j2309J5075l4685o2441K5476
$$ plain form
15997 -186940 -134815 -47160 -40945 -107475 -206867 -186999 -70644 90530 143964 138697 147631 4513
15985 4513 -221151 -223680 -143145 -171940 -79682 -749 99721 173569 156003 71700 -41570
15974 -41570 -133353 -195241 -123372 -42980 18906 41274 67690 92484 91415 74299 74842 68361
15962 68361 39281 -25293 27741 106917 -22571 -66516 -38488 -119881 -204973 -96490 28818
15951 28818 66728 -69517 -60359 15995 84864 -7693 -44971 -10840 23083 16815 24767 123591
15939 123591 127029 -68576 -75513 -108537 -163360 -113586 61572 196560 120994 91966 14855
15928 14855 -133247 -104144 91360 120510 68487 198681 248067 49769 -1619 75671 122879
15917 122879 114519 56149 145317 154760 187680 110575 -24255 -36564 -21489 -56174 -118615 -93139
15905i3139l2556Q0439R7811N5422j43553j39481P6399J70958O4770j10826j1512
15894A4732M9279j9453r4842k9963P3955M7376j38864L379N690j03562l9385j1865
15882b43523J24116l2813q3418J45027J85811P9064q8743L1478m1328q3865M202
15871c992Q9310l7030p3648p9589J2723r394P2859m7204k7077J11825j1303q0278
15859h2798r8471p2703o5999O1130M389R5719O5978m3916j7808M8475l8796L2860
15847a11940P1743o189j09995k8659P234M7612K6762N8875j049N3618p3926P4615
15835H701J3114j02817o2826m1384M1644m4050m1356k3032N2186L6148n3459P774
15823b09357J41156J21501O2017n406l50r1572q0161J8985M013n2176m7821l7876
$$ plain form
15905 -93139 -125695 -45256 52555 107977 -35576 -175057 -98658 72300 137070 26244 14732
15894 14732 64011 44558 -50284 -80247 -6292 41084 -97780 -94401 -88711 -192273 -231658 -243523
15882 -243523 -119407 -152220 -235638 -90611 95200 174264 85521 116999 75671 -8194 -3992
15871 -3992 85318 48288 -25360 -104949 -92226 -101620 -28761 -75965 -103042 8783 -2520 -82798
15859 -82798 -181269 -253972 -319971 -258841 -254452 -158733 -92755 -136671 -154479 -106004 -144800 -111940
15847 -111940 -40197 -46386 -156381 -185040 -177806 -130194 -103432 -44557 -45606 8012 -65914 8701
15835 8701 21815 -81002 -143828 -185212 -143568 -187618 -228974 -252006 -199820 -163672 -217131 -209357
15823 -209357 -68201 53300 115317 109911 109561 17989 -62172 -43187 -39174 -91350 -139171 -177047
15811a77047r291m2104J01533P2923j08572l2012P8447Q493o6474q883m9121p7938
15799c10046J36949J38856k4443k6923k0788L1912j5152r925r7616j5875L4310
15788a78741J6633J65357M0663q8844J0380o0630M8811L7287N8090r7002q2279
15777a30275j8740M0722K9292J0116R5389k5636k3050L4143K6542K9152j31872
15766f4217P85Q3197L3849j76215l4562L8247J34373Q0598M9271m9447m0515m2378
15754A2986k1177n6600q3767O8226R9000j54126j0206J9572R4766J34442J44900
15743B48016L651l0214j20384j18049q0050M2394k7744j6661l468O1903J27629
15732H7023r8465n778P6086P4662m5045r0626j5451n2215m2552r7635J9319J13721
$$ plain form
15811 -177047 -186338 -228442 -126909 -53986 -162558 -194570 -116123 -107630 -174104 -182987 -232108 -310046
15799 -310046 -173097 -34241 -58684 -85607 -106395 -74483 -89635 -99560 -197176 -213051 -178741
15788 -178741 -162108 3249 43912 -44932 -34552 -95182 -46371 -9084 49006 -47996 -130275
15777 -130275 -149015 -108293 -79001 -68885 26504 868 -22182 11961 38503 67655 -64217
15766 -64217 -63432 19765 53614 -122601 -157163 -118916 15457 96055 145326 95879 55364 12986
15754 12986 -8191 -64791 -148558 -80332 18668 -135458 -145664 -126092 -31326 103116 248016
15743 248016 251667 221453 101069 -16980 -97030 -54636 -82380 -99041 -102509 -40606 87023
15732 87023 -11442 -17220 58866 133528 88483 -2143 -17594 -69809 -112361 -209996 -190677 -76956
15720g6956O3564n0175L2406O636j11481L2171P9316K4012p1834l5853K756J4568
15708i0870m1428K3604j13878p5219J5400O2012K14209J16455q732j80583K1023
15697e8007N5715j78494o1970l4656n0591R311J53692N9825M6976J44093O4203
15686A50097j9137k9956k5891O5192k3419l0009j37660o4527O7112q9265M8435
15675h9028j8632l8713l3906l2521Q0523K28602j9531p9005P6112m5036o1047
15664c2182J37672R7250L6445o2338j61236j20418J02142k2167j6735L9163N8310
15653E5906o0209j03488K8945J2193K8861q662N8351K1869N7835j32394j72588
15642b13381n2246l4195P221k8432J25800J10480J22397O3938J5327j04966j10623
$$ plain form
15720 -76956 -13392 -63567 -31161 -24525 -136006 -103835 -24519 -507 -72341 -108194 -105438 -90870
15708 -90870 -132298 -108694 -222572 -297791 -282391 -220379 -6170 110285 101553 -79030 -58007
15697 -58007 -2292 -180786 -242756 -277412 -328003 -318692 -165000 -105175 -58199 85894 150097
15686 150097 130960 101004 75113 140305 116886 86877 -50783 -115310 -48198 -137463 -89028
15675 -89028 -107660 -146373 -180279 -212800 -132277 96325 76794 -2211 73901 28865 -32182
15664 -32182 105490 202740 239185 176847 15611 -104807 -2665 -24832 -41567 -2404 55906
15653 55906 -4303 -107791 -78846 -66653 -37792 -46454 11897 33766 91601 -40793 -213381
15642 -213381 -265627 -299822 -292601 -321033 -195233 -84753 37644 101582 116909 11943 -98680
15631i8680N5010j8736j9565J32346K1908j5157N1127l5817m6714q8750m841O2016
15619e853J11795J10009R1699O3344q0666j48513j1739p6833j10395l6863J4890
15608g9125L6184n2205K6464K7273l7106m3948J6582J15323L9923j90501J0038
15597a31098N8456j21396k3963m8465k3158Q5684K00503K6372p2539n0533r555
15586a09692N5166N4897m9297n7037L5830N020M6838p9607l8786L2750Q2270L9361
15574A7713O6140M08j9142q5715Q0864J29246K0014j64700j95549l8411m7904
15563b37036q0394Q1635K01094l8185p0258J10640J16209l6524o7999o0298M8460
15552c2656N0007j2319p6919J36437j0092J08822q8848k02254M5157k0718M922
$$ plain form
15631 -98680 -43670 -62406 -81971 50375 72283 57126 108253 72436 25722 -63028 -67869 -5853
15619 -5853 105942 215951 307650 370994 290328 141815 130076 53243 -57152 -94015 -79125
15608 -79125 -42941 -95146 -68682 -41409 -78515 -122463 -105881 9442 49365 -141136 -131098
15597 -131098 -72642 -194038 -218001 -266466 -289624 -203940 -3437 22935 -49604 -100137 -109692
15586 -109692 -54526 371 -48926 -105963 -70133 -65113 -18275 -97882 -136668 -103918 -21648 17713
15574 17713 83853 84261 65119 -20596 60268 189514 209528 44828 -150721 -189132 -237036
15563 -237036 -317430 -235795 -34701 -72886 -143144 -32504 83705 47181 -20818 -81116 -32656
15552 -32656 17351 5032 -71887 64550 54458 163280 74432 -127822 -82665 -103383 -98461
15541i8461l2740l5791J8501q2443L5005M851O9732k8584O720Q8027n7646m0765
15529a53594J06168J06000N9771o9207J3696l7882j1945m192L3493m973j22961
15518h5626P6042J28690m0830j27978K1910R6697N5984J16626o4572j00819O668
15507H2792l0054J3315q0015o7544m7469L6622P3795M9062J3149J01657J3032
15496A58342L9266M7886p9215l4427J7300J9001j18691q3821l2813J41657Q5310
15485A59795p6857j69163j26110J02740K9334n1993l8933J7624j1771q0683o8361
15474c14378J05412R6279M0502N7479N375N8007N6498o568j07084r1601J4969
15463h5110J00570k2590J5941p637n3727m4123j28019L6120J10808R0328K0509
$$ plain form
15541 -98461 -131201 -166992 -148491 -230934 -195929 -191078 -121346 -149930 -143210 -55183 -112829 -153594
15529 -153594 -47426 58574 118345 49138 62834 24952 13007 8815 42308 37335 -85626
15518 -85626 -9584 119106 78276 -49702 -27792 68905 124889 241515 176943 76124 82792
15507 82792 52738 66053 -13962 -81506 -128975 -92353 -18558 30504 43653 145310 158342
15496 158342 197608 245494 166279 131852 149152 168153 49462 -34359 -67172 74485 159795
15485 159795 82938 -86225 -212335 -109595 -80261 -132254 -171187 -153563 -165334 -246017 -314378
15474 -314378 -208966 -112687 -72185 -14706 -9331 48676 105174 98606 -8478 -100079 -85110
15463 -85110 15460 -7130 8811 1174 -52553 -96676 -224695 -188575 -77767 12561 33070
15452C3070k4165J266L8076l854o3374j21382l3785j7086J02128J01379K1659
15441C3932O0945L2875k4336j06478N7667M0771j3226r7289N4978M8749k4894
15430F3694m3402j209j18895j7246m4290l0342P3225n1591L2263R8758j6596n1173
15418a06804J28140M5795k5714l6246M1266m0290p1362J30777k0196l942N5156
15407I6580j2209o4546p5414r5791J32635p6961k1780l4256j93676O732K32400
15396a06286M0406p4313J01705L5212p5105O0969Q6427M4166p610k6220j64758
15385h5407J5370M3870r3529N7485N2197Q851k176K3510m9958L7662R4826p3865
15373B8836l6375m6246n0590M4471J56632k7907r8285l0144N0748J34273L612
$$ plain form
15452 33070 8905 10171 48247 44393 -18981 -140363 -174148 -191234 -89106 12273 33932
15441 33932 94877 127752 103416 -3062 54605 95376 82150 -15139 39839 88588 63694
15430 63694 20292 19083 -99812 -117058 -161348 -191690 -118465 -170056 -137793 -39035 -55631 -106804
15418 -106804 21336 67131 41417 5171 46437 6147 -65215 65562 45366 41424 96580
15407 96580 84371 19825 -55589 -151380 -18745 -95706 -117486 -151742 -345418 -338686 -106286
15396 -106286 -65880 -140193 -38488 -3276 -78381 -17412 69015 113181 105571 79351 -85407
15385 -85407 -70037 -26167 -119696 -62211 -10014 -1163 -3339 20171 -29787 7875 102701 28836
15373 28836 -7539 -53785 -104375 -59904 96728 68821 -29464 -59608 -8860 125413 129025
15362A29025m0245m1223p3400N5961M9269q0176q4912M959N6149J02195l901p5919
15350b218j46366n1835J80804Q0461j37439r648L5571J46105J2373j9990l5077
15339E2741n427r9277o3444q0097J04845N278j3081R5914J25632R0032j80912
15328C2204j23302j7013J14941j5213P3142N5312m1667m1885J02829l5648J0449
15317A14149k09534j03905R1091J55191q5131Q6153M4610o9725j68033o1980Q3338
15306a23776P2857J5035P7200l8143j08359L3470o3077q0547J7223O306J01483
15295i0328M8199k1684l6633k916l3732j80257j1785K65389J39187p0915M337
15284H862j9963l8352o6670k0671o1375J2379K1079q1745q1578J2174J17268P3348
$$ plain form
15362 129025 88780 47557 -25843 30118 79387 -789 -85701 -80742 -24593 77602 73701 -2218
15350 -2218 -148584 -200419 -19615 60846 -76593 -86241 -50670 95435 107808 87818 52741
15339 52741 47314 -51963 -115407 -195504 -90659 -85381 -98462 -2548 123084 213116 32204
15328 32204 -91098 -108111 6830 -8383 64759 120071 78404 36519 139348 103700 114149
15317 114149 -95385 -199290 -108199 46992 -38139 48014 92624 22899 -145134 -207114 -123776
15306 -123776 -50919 -35884 41316 3173 -105186 -71716 -134793 -215340 -198117 -191811 -90328
15295 -90328 -42129 -63813 -100446 -103362 -137094 -317351 -329136 -63747 75440 4525 8862
15284 8862 -11101 -49453 -116123 -136794 -198169 -185790 -164711 -246456 -328034 -315860 -198592 -125244
15272a25244J14141r4612p4052P5590L4679M7450L4691l9628N8509j822j80034
15261a50332n9685K8875o168J68292R692R97J6750q5654L4091N4361j8340j54641
15249a61762o3212M4209M4096K6189j15217p4466L0594Q0614J144O3270L8594
15238h5947R9220J2450n9106l6793L7786k5651M5648O9057q6358j79453J46760
15227f2387J56531N5515r921j32661r6343M8865L0275l9723m2543J4342p965M8625
15215c7390L5495K4115q2248j23119o4494q6716M3864J33046J2924k1851L8692
15204a27682K2758P7461N7403l6167N7655J4566j34514m0144L1697M8975o2653
15193i0645J6621L6343m8156N6647o8196n104N2275M5818p1395p7300N9868M0963
$$ plain form
15272 -125244 -11103 -105715 -179767 -104177 -69498 -22048 12643 -26985 31524 29702 -150332
15261 -150332 -210017 -181142 -187310 -19018 -9326 -8329 8421 -77233 -43142 11219 -7121 -161762
15249 -161762 -224974 -180765 -136669 -110480 -225697 -300163 -269569 -188955 -187811 -124541 -85947
15238 -85947 13273 25723 -33383 -70176 -32390 -58041 -12393 56664 -29694 -209147 -62387
15227 -62387 94144 149659 139738 7077 -89266 -40401 -10126 -49849 -92392 -78050 -86015 -37390
15215 -37390 -1895 22220 -60028 -183147 -247641 -334357 -290493 -157447 -144523 -166374 -127682
15204 -127682 -104924 -27463 29940 -6227 51428 65994 -68520 -108664 -76967 -27992 -90645
15193 -90645 -74024 -37681 -85837 -29190 -97386 -102490 -50215 -4397 -75792 -153092 -93224 -52261
15181e2261j9398n4891M2475p362q5633j5211Q8644K9543j0659K05607J18543
15170B39397q0677O0410m9315k4428R048j8681p0681k4031p7609L182n1037J1359
15158g3063J158n2776J31833q6314j429R0528k0830K1758J22499N6978Q7291L5473
15146C13106r9981k5412j42139q4692k2673K6015J73366J09766L4229q3578j89047
15135H960M9296l3231q9907k1457j42834l7623J7148O2276j76601l404K09870
15124a57507J03866J7816P121j46195p0420N1000K515J67939Q9305l7298j7067
15113A1075M7941l4256p644l835L8197l3567l9852p9283N245M4426N3641k4232
15101b2144o4337n0141R454l6375M477J93387J06622n0173M6380q1965j48703
$$ plain form
15181 -52261 -71659 -126550 -84075 -91437 -177070 -192281 -103637 -74094 -84753 120854 239397
15170 239397 158720 219130 169815 145387 154435 135754 65073 41042 -36567 -33385 -84422 -73063
15158 -73063 -71905 -124681 7152 -79162 -80591 9937 -10893 10865 133364 190342 277633 313106
15146 313106 213125 187713 45574 -39118 -61791 -35776 137590 247356 281585 198007 8960
15135 8960 58256 25025 -64882 -86339 -229173 -266796 -249648 -187372 -363973 -367377 -157507
15124 -157507 -53641 -35825 -28704 -174899 -245319 -194319 -191804 -23865 65440 28142 11075
15113 11075 59016 24760 17116 13281 51478 17911 -21941 -101224 -95979 -51553 2088 -22144
15101 -22144 -86481 -136622 -127168 -163543 -159066 34321 140943 90770 137150 55185 -93518
15090i3518K4118J9334k5731J02421j5964l8235K1500J34571J5354j11876q6102
15079e4128K4474n5071q0458J6126J68422M8206n2681n8699O8135O1633j9434
15068F6525N849K0386j61342o9576J16688O25k45326L602r0878q9904N8349J56091
15056b28911J07622K98N6176M5055K0715l8654p4039n3226q6848k1490P9061M8520
15044a45721M1054N0256M222k1860j01144o861M0889J43451j7888p9868n8833
15033a52303P5799O7071K6671j47900j27131o0086n5323o610J22932J02842J2991
15022a41047j2780K4303p8319N8852J41708L6575m5051l3269M5210l9421j00393
15011a43632n8437J10567l141M3110k5394J1900L21q8459K540k4156k4484m5531
$$ plain form
15090 -93518 -69400 -50066 -75797 26624 10660 -27575 -6075 128496 143850 31974 -54128
15079 -54128 -29654 -84725 -165183 -149057 19365 67571 14890 -43809 24326 85959 66525
15068 66525 72374 92760 -68582 -138158 -21470 -20845 -266171 -262569 -353447 -443351 -385002 -228911
15056 -228911 -121289 -120991 -64815 -19760 955 -37699 -111738 -164964 -251812 -273302 -194241 -145721
15044 -145721 -104667 -54411 -50189 -72049 -173193 -180054 -139165 4286 -13602 -93470 -152303
15033 -152303 -76504 -9433 17238 -130662 -257793 -317879 -373202 -379812 -256880 -154038 -141047
15022 -141047 -153827 -129524 -207843 -148991 -7283 29292 -15759 -49028 -3818 -43239 -143632
15011 -143632 -202069 -91502 -94643 -51533 -76927 -65027 -64706 -153165 -150625 -174781 -199265 -244796
14999b44796k8198N3043M9724J7425N8365K1392j64104j9577M0058O1543Q855
14988a46270K37m9843L9991O9559m8987J47391P5841J14174O8883j37845o6583
14977F6548q7925j01131k4559R491j9612M3603J72308P7529m5389p5716m4410
14966b9263L1787q4427o8279O8045m9080J8779J36107j08484j5647k118K3789
14955g8791J6937Q2560J14708r8915J6234J3505q8697j01637o5939P2149o770
14944a24656m3702J46766L0119K7182k0771j31628O3564J226j3454J58795L5291
14933A28732n5398o4724j03715n4511K2965l233N55J7602L5233m0305q2504N7154
14921a42149M2844P9877N7903j8051j9476m319N8998j16317P3825R0027m749j47560
$$ plain form
14999 -244796 -272994 -219951 -170227 -152802 -94437 -73045 -237149 -256726 -216668 -155125 -146270
14988 -146270 -146033 -195876 -155885 -86326 -135313 12078 87919 202093 270976 133131 66548
14977 66548 -21377 -122508 -147067 -137576 -157188 -113585 58723 136252 90863 15147 -29263
14966 -29263 2524 -81903 -150182 -82137 -131217 -112438 23669 -84815 -100462 -102580 -78791
14955 -78791 -61854 20706 135414 36499 52733 66238 -22459 -124096 -190035 -117886 -124656
14944 -124656 -168358 -21592 8527 35709 14938 -116690 -53126 -51900 -65354 93441 128732
14933 128732 73334 8610 -95105 -149616 -126651 -129884 -129329 -111727 -76494 -116799 -199303 -142149
14921 -142149 -99305 -19428 38475 20424 948 -3371 55627 -60690 13135 103162 98413 -49147
14909d9147j91025J06524J30536j3918m7967R971J28862J43142j04798q2885N7864
14898H7159J02797j7983j36913o5332r4215l5186R0956P3309K6674k2556j1325
14887b615m1537o9191K8478M7602L3641j23019n1156K3536k4651l480k9056J4173
14875a97275N5229J0963j37153m0854O2797J06845J13170m4574k6461N7658r8660
14864a38315n4929N0881q004j03920n5697J12769J13876R700L6813O027N3504
14853B2705K7044q4386q7907p3418N6456n9156N2283l826l6526q0615J02874P8231
14841h6241Q2801R56m6483n3430n3572M465O1366J4076J3723N9673J8187l6701
14829b1180l5806O2394O8117M7252r1332k7649j2925M09O8624O7995P4725o6052
$$ plain form
14909 -49147 -240172 -133648 -3112 -17030 -64997 -55026 73836 216978 112180 29295 87159
14898 87159 189956 171973 35060 -30272 -124487 -159673 -68717 4592 31266 8710 -2615
14887 -2615 -44152 -113343 -84865 -37263 -3622 -126641 -177797 -154261 -178912 -182392 -211448 -197275
14875 -197275 -142046 -131083 -268236 -309090 -246293 -139448 -26278 -70852 -97313 -39655 -138315
14864 -138315 -193244 -142363 -150367 -254287 -309984 -197215 -83339 -73639 -36826 -30799 22705
14853 22705 49749 -34637 -122544 -195962 -139506 -198662 -146379 -150205 -186731 -267346 -164472 -86241
14841 -86241 -3440 -2484 -48967 -102397 -155969 -151504 -90138 -76062 -62339 -2666 15521 -21180
14829 -21180 -56986 5408 73525 120777 29445 1796 -11129 -10720 57904 125899 200624 134572
14817A34572p1799J4461l513l2965L5661l0106R834r333r8049j07602l1283p63
14805a90885O0930J02903n4876R699J25072M4386m1382M2525k8o0013L295J4276
14793E5902p6678M4000j7601j16230N6012p6079k9148N2944k9836l6242l4170
14782b07126o7816M9914J00882L3K253Q3186J24956O2068p0476n6213q4320J6786
14770d5873L3464L2920q6250L110L1922n66k8564j62430N0368K0199j19071J54034
14758a16737J65383N7934o3291q5141j5247Q6297r99q4082M1110o7992K4747M2155
14746a5863j1690J3755Q149j476O9945J57753O8046r6638N6567p5483j11178M2236
14734A04123j02656k7790m4002l0404l788Q2151l1814j44946n1278k779k1126
$$ plain form
14817 134572 62773 77234 73721 40756 76417 46311 56145 46812 -51237 -158839 -190122 -190885
14805 -190885 -129955 -27052 -81928 -72229 52843 97229 55847 98372 98344 38331 41626 55902
14793 55902 -20776 23224 5623 -110607 -54595 -130674 -159822 -106878 -136714 -172956 -207126
14782 -207126 -274942 -225028 -124146 -124113 -121860 -38674 86282 148350 77874 21661 -62659 -45873
14770 -45873 -12409 20511 -65739 -62629 -30707 -31273 -59837 -222267 -171899 -151700 -270771 -116737
14758 -116737 48646 106580 43289 -41852 -57099 29198 28199 -55883 -14773 -82765 -58018 -15863
14746 -15863 -27553 -13798 -5649 -7125 62820 220573 288619 191981 248548 173065 61887 104123
14734 104123 1467 -26323 -70325 -100729 -104517 -22366 -54180 -199126 -250404 -253183 -274309
14723b74309o708J04477L9014l1837J87776J8069L2091L1407j38123r6538L5766
14712i8915J08884J0101R609P7308R1497k0563k11621q8390K0260J08828L0439
14701C7437L0748n649n5017J3052K2207K8475k6401j51890J33555K8567o2219
14690g135j7305l5014Q471k8811K6759Q2623J05482L2998J6119o8880p6985K4252
14678F2574j02503k4824J50703J46886K7607r066m0991j6110j48303p4216o904
14667c5147J40449n1938j29658Q0587M9652k9404l9868n588n3074l3038l2693
14656a39720o294p276J569N6505Q4886L3949n7853J4301o709j21599o1844J36238
14644g3847O031p2286J48464O9693n2389j45556J7556Q7669P4283n6485o1313
$$ plain form
14723 -274309 -281017 -176540 -137526 -169363 18413 36482 68573 99980 -38143 -134681 -98915
14712 -98915 9969 20070 29679 106987 198484 177921 -33700 -122090 -101830 6998 37437
14701 37437 68185 62536 7519 20571 42778 71253 44852 -107038 26517 55084 -7135
14690 -7135 -24440 -59454 -50983 -79794 -53035 29588 135070 168068 184187 115307 38322 62574
14678 62574 -39929 -64753 85950 232836 260443 251377 210386 194276 45973 -28243 -35147
14667 -35147 105302 53364 -76294 4293 53945 24541 -15327 -20915 -73989 -107027 -139720
14656 -139720 -146014 -153290 -151721 -95216 -10330 23619 -34234 -19933 -26642 -148241 -210085 -73847
14644 -73847 -67816 -140102 8362 78055 25666 -119890 -102334 -14665 59618 3133 -58180
14633e8180J2051L5756n0488N7042m6025o6540n5859J20940J84582P9369J3553
14622B26201J2656o2444j16090m4560J00909N0275r1401j37963m166l8548M1673
14611f3458J26154K4806K0831l3738o5143K820q4008k3420P2783K5824J23572
14600A27023k7583n6344K0711l3535j11989m2131L363R0928K2810q1527R0601
14589B327J59888m9619o8295Q683P3729k3586Q275m5491j2673K3587J9935o1104
14577C5656o1241J7348N863l6180L5647J52997j1824q412j47180j53555J2396
14566a58485l7526L1356L1201J19135R3046J10756j49351j27312j623l5137j7242
14555a41182n213L5309J00175Q3512M5455j04166k6158R0452J35123j16666j27480
$$ plain form
14633 -58180 -46129 -10373 -60861 -3819 -49844 -116384 -172243 -51303 133279 212648 226201
14622 226201 238857 176413 60323 15763 116672 166947 75546 -62417 -66583 -105131 -63458
14611 -63458 62696 87502 108333 74595 9452 12272 -71736 -95156 -22373 3451 127023
14600 127023 99440 43096 63807 30272 -81717 -123848 -120485 -29557 -6747 -88274 2327
14589 2327 162215 112596 44301 52984 126713 103127 111402 65911 53238 76825 96760 35656
14577 35656 -25585 -8237 -2374 -38554 -2907 150090 138266 129854 -17326 -170881 -158485
14566 -158485 -196011 -164655 -133454 -14319 78727 189483 40132 -87180 -88803 -123940 -141182
14555 -141182 -146395 -111086 -10911 72601 118056 13890 -12268 78184 213307 96641 -30839
14544c0839p2257n0635O7469O7388P9591N0939l7603K4544O2765K8123o6451j04087
14532A8947l2040L2628J23194R215K3482k765k4956K0912j6810j65800k942j5498
14520c2433O7994Q5155M5466q3106j05546j50116p9296P5208J34336p4234k9961
14509a46533J03801j6171l0218N370L472M0342M2130O8562K1653K1856l8146l1218
14497D4900J3309p6253q4518p0861K4319L2546m2215O2572O8363j48014o187J28134
14485e3905l1158j2101j1841P2936K9959j3600n1063M3362L9475O6344L1784p3428
14473C6764M6645L8265n2823j7711m0196k2089m2939k7398r5520P0797M3572K4049
14461c8584k5854m40M7172q6114q9065M7672N6021R5224O2921M9466j2593j59141
$$ plain form
14544 -30839 -103096 -153731 -86262 -18874 60717 111656 74053 98597 161362 189485 123034 18947
14532 18947 -13093 19535 142729 151944 175426 172661 147705 168617 151807 -13993 -16935 -32433
14520 -32433 35561 120716 166182 83076 -22470 -172586 -251882 -176674 -42338 -116572 -146533
14509 -146533 -42732 -58903 -89121 -83751 -80279 -39937 2193 70755 92408 114264 76118 44900
14497 44900 58209 -18044 -102562 -173423 -149104 -116558 -158773 -96201 -27838 -175852 -182039 -53905
14485 -53905 -85063 -97164 -109005 -36069 -6110 -19710 -70773 -27411 12064 78408 110192 36764
14473 36764 83409 121674 68851 51140 10944 -11145 -54084 -81482 -177002 -106205 -62633 -38584
14461 -38584 -64438 -64878 -17706 -103820 -192885 -145213 -89192 6032 68953 118419 105826 -53315
14449e3315N9638R4580K2822J12798k4057M1081L8627p6834o4171m0308j08941
14438A920j0708J8328K0314q1059j20976K178J379P1571l760j95470J66436J09470
14426b0377j37387j20926r267J26643J71365K05657m5152j07670k0191r0702M672
14415d3335J27990M1051r7306n7812m9693N8644r147L06Q164n9970j6183J5114
14403h2177L1292J05827J35249L263j07318j10836L8390o2175r6458P3474J35356
14392F3887L5088m3581m1221j56030J8617N9542J44462J23346P093K5282P1597
14381C08082j06501j66770p4571P8530J17189m896J623j03384r0708N0607J1200
14370B0401O1248j317k3273j09288J01158M5041p7454L160j5161k6875N6480j42805
$$ plain form
14449 -53315 6323 100903 123725 236523 212466 253547 292174 215340 151169 110861 1920
14438 1920 -8788 9540 29854 -51205 -172181 -170003 -168624 -97053 -100813 -296283 -129847 -20377
14426 -20377 -157764 -278690 -287957 -161314 10051 215708 170556 62886 42695 -48007 -43335
14415 -43335 84655 125706 28400 -29412 -79105 -20461 -29608 -29302 -21138 -81108 -97291 -82177
14403 -82177 -50885 54942 190191 193454 86136 -24700 13690 -48485 -144943 -71469 63887
14392 63887 98975 55394 14173 -141857 -123240 -63698 80764 204110 211203 236485 308082
14381 308082 201581 34811 -39760 38770 155959 151063 152686 49302 -41406 9201 20401
14370 20401 81649 80332 57059 -52229 48929 93970 16516 19676 4515 -22360 34120 -108685
14358a08685j23789r4148K16745K19871K5863j9290m1284n3899j2522L5970m1964
14347B868o2961J00754K02914m9189j35899o2485j02238k6332J9479J72419N0916
14336A10246j6501J7681K4m4304o4712J01377O7373k9688m414J60269J43622J9048
14324D60021j4228j24820r8987M9632q8488j45865j27717o5547l5350K7286O9771
14313i4292J08584P887o4602J8171j00395J9082J09152J68412j18010k19135L2542
14302a32604O0444J14622J03526P191K3394m5919K1677m1584n0865l6778L0868
14291E3972J53560L7619o6964l3543j03952j35987k888l2515J580L8026J22016
14280C0924J40131j0663j5670o5194j2403k4868l535Q996M1689n0519j90462J8636
$$ plain form
14358 -108685 -232474 -326622 -109877 109994 135857 116567 75283 21384 8862 44832 2868
14347 2868 -60093 40661 243575 194386 58487 -3998 -106236 -132568 -113089 59330 110246
14336 110246 93745 111426 111450 67146 2434 103811 171184 141496 137082 297351 440973 460021
14324 460021 445793 320973 221986 271618 183130 37265 -90452 -155999 -191349 -164063 -94292
14313 -94292 14292 22179 -42423 -24252 -124647 -105565 3587 171999 53989 -165146 -132604
14302 -132604 -72160 42462 145988 153179 176573 130654 152331 110747 59882 23104 53972
14291 53972 207532 245151 178187 144644 40692 -95295 -98183 -130698 -129118 -91092 30924
14280 30924 171055 160392 144722 79528 67125 42257 38722 47718 89407 38888 -151574 -132938
14268a32938J34485l1904m2786l4673N0323J11381j84635j37739J13402J8981
14258a36103j25408M3143J39459K7480J37635J32668j13169k8892L507k5093l0588
14247B4639N8548n7769Q9101K4694q6212L8371P578K6703J30079J3303q5297q8235
14235I5503j54675o6244O8322K6065j1765J01693J03928q4470L9271l8636K298
14224H1290K3844Q3541l1100n9069M6592j8983q966o0141j03158o3784p1139J2834
14212a68239J18028J28786k2068J4955N430L1976n7383m4430j35503L4383Q2483
14201a1582m6016J51279Q8840j15685q538q990l820k7022j01699M4841R9940l7459
14189B4089m039l3584p5792q4540n052J9666J04246L1706m4183n3113J328k484
$$ plain form
14268 -132938 1547 -30357 -73143 -107816 -57493 53888 -130747 -268486 -155084 -136103
14258 -136103 -261511 -218368 -78909 -51429 86206 218874 105705 76813 80320 55227 24639
14247 24639 83187 25418 114519 139213 53001 91372 98950 125653 255732 269035 183738 95503
14235 95503 -59172 -125416 -57094 -31029 -42794 58899 162827 78357 117628 78992 81290
14224 81290 105134 188675 157575 98506 145098 126115 117149 57008 -46150 -109934 -181073 -168239
14212 -168239 -50211 78575 56507 71462 76892 108868 51485 7055 -128448 -94065 -11582
14201 -11582 -57598 93681 182521 66836 58298 49308 45488 18466 -83233 -38392 61548 24089
14189 24089 20050 -13534 -89326 -173866 -178918 -159252 -55006 -23300 -67483 -120596 -119268 -121752
14177a21752L4602m259M9007o1856k3465R4504J42138j23719j27198L5006J5544
14166i1448q3105L6031J19738J8263R3077J34551M0396j46960o5017n0805J03663
14155A08384q3578m0167J02607m2477q4447K2722R2323J1694L4497P8116P6314
14144B75988o7463j28050K4162q6510l1993Q0141n5618L8777Q4601j12190o8962
14133d7117R3817J33995N1974j45107m5466n7138q5264n726Q7934q802J2517M5014
14121C0631K6878Q0462R2773k7292j54165M104k8390M7102K4924J23707K4724
14110B45458n6215j39736l4562Q8541l3735r0265r3726l0485J13134J40624K5502
14099A34535r1960k1833q632J34929r314m028o875o6956o4863m6877K2590J9012
$$ plain form
14177 -121752 -87150 -91409 -42402 -104258 -127723 -33219 108919 -14800 -141998 -106992 -91448
14166 -91448 -174553 -138522 -18784 -521 92556 227107 267503 120543 55526 4721 108384
14155 108384 24806 -15361 87246 44769 -39678 -16956 75367 87061 121558 199674 275988
14144 275988 208525 80475 104637 18127 -13866 66275 10657 49434 134035 21845 -47117
14133 -47117 46700 180695 232669 87562 42096 -15042 -100306 -106032 -18098 -26900 -14383 30631
14121 30631 57509 137971 230744 203452 49287 53391 25001 72103 97027 220734 245458
14110 245458 189243 49507 14945 103486 69751 -20514 -114240 -144725 -31591 109033 134535
14099 134535 42575 20742 12110 147039 137725 133697 126822 59866 -4997 -51874 -29284 -10272
14087a0272r6921k9258J28435P5418M5551J02769N1870p3115n1323R236j5501
14076A36889r507N072p6392N8360N4485M9144M7212m3776j3280J1037K4861p052
14064B37053K01971L04293M21072N79383L25754O8189j7916j20995k15350k87624
14054A495830k75564l39659k03886p1571q6615L424J24298L03716K82936J97292
14044A430201R4424N590j29620k4743L0525m1387M6990J31199J20612L35366M26966
14033B426123n705j6676q745j46780l54666k69145j33215j94353n2685K19482
14023A463635J63754J66276M4380q0364j07877j82419k27694j47126k0324m9987
14013A022254O3699K1515J29850L96484M56175L83881J60551j19471j96148k25324
$$ plain form
14087 -10272 -107193 -136451 -8016 67402 112953 215722 267592 194477 143154 152390 136889
14076 136889 127382 132454 56062 114422 168907 218051 265263 221487 208207 219244 244105 237053
14064 237053 439024 743317 1164389 1743772 2069526 2137715 2119799 1998804 1783454 1495830
14054 1495830 1220266 880607 676721 605150 518535 521959 646257 949973 1232909 1430201
14044 1430201 1524625 1530215 1400595 1375852 1406377 1364990 1411980 1543179 1663791 1999157 2426123
14033 2426123 2420418 2403742 2394997 2248217 1893551 1624406 1491191 1296838 1244153 1463635
14023 1463635 1627389 1793665 1838045 1757681 1649804 1467385 1239691 1092565 1072241 1022254
14013 1022254 1085953 1107468 1237318 1633802 2089977 2473858 2634409 2514938 2318790 2093466
14003B093466k40722l53188l91174l43357j98242j48854J7491m1451N563q57N3485
13992D52160o6883o2113j03962j0450l8925N0711J14496l6459K2759J0949m5209
13981B87074J0903p1429q621j0088M0117k3147P0054m3909J3515m8152l0077M5355
13969B31595M2206r0377l9030m4351J22534R7268o547M9873k9998n3350K20q0726
13957A99317k8469J21326J08036L8994r7006j52416P6654R1084O9821j22012N6177
13946C61506k4767o7495J2959k1502o8674l4089L8733P136j4475L3143N7591o6729
13934B13337o047R1976M2477J40253J33802R8100J41950M07817K75848K07281
13924A746794K13408R4137k30932k06661k35148k88532j19053j30828n7617j15676
$$ plain form
14003 2093466 1852744 1499556 1108382 765025 566783 417929 435420 393969 399532 398675 452160
13992 452160 385277 323164 219202 208752 169827 220538 335034 298575 321334 332283 287074
13981 287074 297977 226548 217927 207839 247956 224809 294863 250954 264469 216317 186240 231595
13969 231595 273801 183424 144394 100043 222577 319845 313298 363171 333173 279823 280043 199317
13957 199317 170848 292174 400210 439204 342198 189782 266436 357520 427341 305329 361506
13946 361506 336739 269244 282203 260701 192027 157938 196671 203807 189332 222475 280066 213337
13934 213337 207290 299266 341743 481996 615798 713898 855848 1263665 1539513 1746794
13924 1746794 1960202 2054339 1823407 1616746 1381598 1093066 974013 843185 785568 669892
13914F69892j10254K2128J29422K08602K66642O6867P7514N9016q046j602J4129
13903A394310l9227J64427L62931K51271J70508J2636j07289j25060k33071k63450
13893A587986k33131j92739j4755M4211J27742J71027Q2307L42R2099j03903j48223
13882A412963q8381j92861j74980p7247J16585K73632K22112L23735L79874L17868
13872B513300J52524K9391o6898j98409k84099l08136m66198k73985j36659j29748
13862H31083j79109j63339j66244M6130J72057O2391J70764J7583q1861j598N0350
13851G58207o9879m6804P5135o357Q9760R1302m7526J23688J29299L832r1965
13840A008692k06481n6069m0324P571k3843l3790k2118Q7138K0336K4276M986
$$ plain form
13914 669892 559638 581766 711188 919790 1186432 1253299 1330813 1389829 1381783 1380181 1394310
13903 1394310 1355083 1519510 1882441 2133712 2304220 2316856 2209567 2084507 1851436 1587986
13893 1587986 1354855 1162116 1147361 1191572 1319314 1490341 1572648 1572990 1665089 1561186 1412963
13882 1412963 1324582 1131721 956741 879494 996079 1269711 1491823 1815558 2195432 2513300
13872 2513300 2665824 2695215 2628317 2429908 2145809 1837673 1371475 1097490 960831 831083
13862 831083 651974 488635 322391 368521 540578 602969 773733 791316 709455 707857 758207
13851 758207 688328 641524 716659 710302 800062 891364 843838 967526 1096825 1100657 1008692
13840 1008692 802211 746142 705818 713389 689546 655756 633638 720776 741112 765388 770374
13829G70374L0940n7137l0408J53809j3406k3592L0121J22503N4297j40540q3500
13818H13461M8140J560J9531k6913L7641j07369R1718R1812L4237J10269J39357
13807A253444L24336K67855K47042N22179O48777J139649J573124J396651J061870
13798H434927R24235M14346j19973p62187j018994r91377j092296r74880p98133
13789D015668l30105p810K67504M86312O17780O63677P51172P36989O92390L09513
13779H203090k2791L02773R25413J099037J048372P83212L39621o5019n79213
13770A2034495j149517j488595j429145j205638r70352m16307J73357O98193R57525
13761G204016P97870M39037K89527J88247p8041p50317q05051n92690k66607K17773
$$ plain form
13829 770374 801314 744177 713769 867578 854172 830580 860701 983204 1037501 896961 813461
13818 813461 861601 863161 882692 855779 893420 786051 877769 969581 1003818 1114087 1253444
13807 1253444 1577780 1845635 2092677 2614856 3263633 4403282 5976406 7373057 8434927
13798 8434927 9359162 9773508 9653535 8891348 7872354 6880977 5788681 4813801 4015668
13789 4015668 3685563 3677753 3945257 4431569 5049349 5713026 6464198 7201187 7893577 8203090
13779 8203090 8180299 8483072 9408485 10507522 11555894 12339106 12678727 12613708 12034495
13770 12034495 10884978 9396383 7967238 6761600 5791248 5374941 5548298 6246491 7204016
13761 7204016 8001886 8440923 8730450 8918697 8840656 8090339 7285288 6692598 6425991 6643764
13751F643764P76109J618834K548040K917377K071258L06616j019652j321835
13743A4540511j497109k127189k299291j999851j389516j071176o34500m02486
13735C119393j77044j30494j99325k21646j33824p6899n8104J43622p947r89R4975
13724B351718J29758J64799P8300L0873L865l0035O908j40680j5544J4862O6140
13713B660964m5315n0260R1071k7912n6092j08521k5541J02928M0897n7157L5665
13702B560727j07556L2359Q2095j03901j7139J09030q7582Q9668L3845P5427J00571
13691B767544n9475j5739j5205l3944n2016M2025J62102J32386N2328M0210N0935
13680C071151K2530j448N3363M5672o9071m3483K7793j09077p9714m8439p0409
$$ plain form
13751 6643764 7419873 9038707 11586747 14504124 16575382 16881998 15862346 14540511
13743 14540511 13043402 10916213 8616922 6617071 5227555 4156379 3521879 3119393
13735 3119393 2942349 2811855 2612530 2390884 2257060 2180161 2122057 2265679 2257732 2256743 2351718
13724 2351718 2481476 2646275 2724575 2755448 2759313 2729278 2736186 2595506 2579962 2594824 2660964
13713 2660964 2615649 2565389 2656460 2628548 2572456 2463935 2438394 2541322 2582219 2525062 2560727
13702 2560727 2453171 2485530 2567625 2463724 2446585 2555615 2468033 2557701 2591546 2666973 2767544
13691 2767544 2708069 2692330 2677125 2643181 2591165 2633190 2795292 2927678 2980006 3020216 3071151
13680 3071151 3093681 3092233 3145596 3191268 3122197 3078714 3106507 2997430 2917716 2869277 2798868
13669B798868n0260o42J0669l5073p9796M973J09303Q061J07553J2267J08781
13658B994704N5531K288j76634j44886J128O9015n1295o4922J3702N7455P838
13647B763924l2810j76674L923J12541J72863K40586K07940K36117L07984P3386
13637C909780P0053o679K4573J56898O1759j533Q3285J60794K10633L33668L08789
13626E312020L29134J62293K03222J59875J88372J66989r1910N0135J14723J72353
13616F767206L31145L68945L21898M42375M47785N21065O70374P56193J002094
13607A1629080J116044J477971J682185J887340K237950L023543M319216O123955
13599C3497284R268696J4432663K1969136L0025506L3441157K8121857J7373031
$$ plain form
13669 2798868 2748608 2747966 2758635 2723562 2643766 2648739 2758042 2766103 2873656 2885923 2994704
13658 2994704 3050235 3052523 2875889 2731003 2732131 2801146 2749851 2684929 2698631 2756086 2763924
13647 2763924 2731114 2554440 2558363 2670904 2843767 3084353 3292293 3528410 3836394 3909780
13637 3909780 3979833 3973154 3997727 4154625 4216384 4214851 4298136 4458930 4669563 5003231 5312020
13626 5312020 5641154 5803447 6006669 6166544 6354916 6521905 6429995 6480130 6594853 6767206
13616 6767206 7098351 7467296 7789194 8231569 8679354 9200419 9870793 10626986 11629080
13607 11629080 12745124 14223095 15905280 17792620 20030570 23054113 27373329 33497284
13599 33497284 42765980 57198643 79167779 109193285 142634442 170756299 188129330
13592A88129330J1946306J6990720J8584122N011429j3886299k3964962k1855042
13585A80955604j7624651k0171730k1920305j6131075p095323K577349J3630460
13578A14220329K6977634M1416429N0879973M6263075K9629168J6193995J9559619
13571C45140222J9815526j176520j9910685j2251421N146772Q453393m557791
13564C40659496k1177931k9946642k7845720k5471606k9186085k8290016j7254835
13557A61486661p77703J9148812M0222696N3752320M5412517J4134814j7373934
13550C16006183k2047525j4427463k2521756l0422643j5712111J1231895L7792960
13543B59899540N5910379N6085948L7418758J8380803K0075545L2120832K2892110
$$ plain form
13592 188129330 200075636 217066356 235650478 240661907 226775608 202810646 180955604
13585 180955604 163330953 143159223 121238918 105107843 98012520 100589869 114220329
13578 114220329 141197963 182614392 233494365 279757440 309386608 325580603 345140222
13571 345140222 364955748 363779228 343868543 331617122 336763894 345217287 340659496
13564 340659496 319481565 289534923 261689203 236217597 207031512 178741496 161486661
13557 161486661 160708958 179857770 220080466 273832786 319245303 333380117 316006183
13550 316006183 293958658 279531195 257009439 226586796 210874685 222106580 259899540
13543 259899540 315809919 371895867 409314625 427695428 447770973 479891805 502783915
13536E02783915j0506874m2265470n4787618m8618419m5390601n3151230n4700362
13529A93363341m3948543l0731180k0734068j4338073j0461303q329496p137074
13522E7683604n797772m541956l820920l142525k502149j820712j199393m05624
13514C4452553K16305M15049N1484k44225n49415j012781j689598j938524j786024
13505B7914824j739050j521541j234447r69107q02278q04122p69751n18892k99951
13496A9255685m30640m27968p9100R1464J12085N7973Q3382r0161l62099l26911
13486A7883710j02245k2394M7330J11625M02261N30597Q46060R02104O98032P44274
13476B2041354O09611O85228Q64272Q70001J100414J534875K098001K578003L038545
$$ plain form
13536 502783915 492277041 450011571 395223953 346605534 301214933 248063703 193363341
13529 193363341 149414798 118683618 97949550 83611477 73150174 64820678 57683604
13522 57683604 51885832 47343876 43522956 40380431 37878282 36057570 34858177 34452553
13514 34452553 34668858 35083907 35135391 34891166 34341751 33328970 31639372 29700848 27914824
13505 27914824 26175774 24654233 23419786 22450679 21648401 20844279 20074528 19555636 19255685
13496 19255685 18825045 18397077 18317977 18409441 18521526 18579499 18662881 18572720 18210621 17883710
13486 17883710 17781465 17759071 17806401 17918026 18320287 18850884 19696944 20599048 21297080 22041354
13476 22041354 22650965 23336193 24200465 25070466 26170880 27705755 29803756 32381759 35420304
13467C5420304L628676M625011N967193Q192305J1878064J7891606K7289019M1047352
13459A55939530N7498304O8647392O3467407M1290889K0607659K1986811L2826414
13452D62264406K2015539j1540274m2312571n2201479m2211819l6773544m2404226
13445B56836032l7576682j6164426J1728227L6496004M7318237L1682638k493685
13438C27826345k6602424k2458342j9613800l4569942l9276042k4193044m640867
13431A56471884J3076294K8207281L7203342L3837967J9542136P884485J1587631
13424C07811020K0516753J7368467N471910r3029O067079J5713789N890590k4414695
13416C54331884m6542977m0865213l1221385l6430239l8827327k8691673j5876049
$$ plain form
13467 35420304 39048980 43673991 49641184 57833489 69711553 87603159 114892178 155939530
13459 155939530 213437834 282085226 345552633 386843522 407451181 429437992 462264406
13452 462264406 484279945 472739671 430427100 378225621 336013802 299240258 256836032
13445 256836032 219259350 203094924 214823151 251319155 298637392 330320030 327826345
13438 327826345 301223921 278765579 259151779 224581837 185305795 161112751 156471884
13431 156471884 169548178 197755459 234958801 268796768 288338904 296223389 307811020
13424 307811020 328327773 345696240 351168150 351075121 357142200 372855989 378746579 354331884
13416 354331884 307788907 266923694 235702309 199272070 160444743 131753070 115877021
13409A15877021n042340M694021J4709693K4139129K8768021K4133392J2694980
13402B19973917N710823R968426J2567927P39884j7871056k8576356k6878148
13395A75635417k1674457k3697219k6789338k3137418j6435475j1072226p507087
13388D5322197n442612m075225l304913k868020k143554j859466j478370j189285
13380B2960752r97221r50766r59041r07675q85987p66398q54725q34098p65190
13371A5039651o84177p02374n27443l72202l67849l21391l33123r8857j89284
13362A1442951k52728j08127l31107l31034l25745l99498m54713m11643l37317
13353H491039l42810k78278l20022k66840j66413j34566r0063r2454k2281o344
$$ plain form
13409 115877021 110834681 115528702 130238395 154377524 183145545 207278937 219973917
13402 219973917 225684740 235653166 248221093 248960977 231089921 202513565 175635417
13395 175635417 153960960 130263741 103474403 80336985 63901510 52829284 45322197
13388 45322197 39879585 35804360 32499447 29631427 27487873 25628407 24150037 22960752
13380 22960752 21963531 21012765 20053724 19146049 18260062 17493664 16638939 15804841 15039651
13371 15039651 14355474 13653100 13125657 12753455 12385606 12064215 11731092 11632235 11442951
13362 11442951 11190223 11082096 10750989 10419955 10094210 9694712 9239999 8828356 8491039
13353 8491039 8148229 7869951 7549929 7283089 7116676 6982110 6892047 6799593 6777312 6770968
13343F770968M6659j09531k50255k59597k00761k42485n8401j44640k58331j67455
13333E126171k16939l36820k50824k16338q9803j46627l3078j24549q9470j13698
13323C508025k5018r4336K8025q7591j01715j97559r5074r7100j31344j82631
13313B523682o3385M2531J52979m7754j36950j03646n1980j87493m6185l4571
13303B047228r3308j34089j85262n8630o9726p6603M9499l6193k60026K0224k6976
13292A176138r8304k1676P5099n6517p9480P052j943o7768n8996m3716j7700p7321
13280G34868q6247O7819R689j5066k3398q9851j57928j80488j09356o7761L6933
13269A19214Q8424M1635n7987n7860M9424K1089J01945J27633K4744J16547R3506
$$ plain form
13343 6770968 6817627 6708096 6457841 6198244 5997483 5754998 5696597 5551957 5293626 5126171
13333 5126171 4909232 4572412 4321588 4105250 4015447 3868820 3835742 3711193 3621723 3508025
13323 3508025 3483007 3388671 3416696 3329105 3227390 3029831 2934757 2837657 2706313 2523682
13313 2523682 2460297 2502828 2655807 2608053 2471103 2367457 2315477 2127984 2081799 2047228
13303 2047228 1953920 1819831 1634569 1575939 1506213 1429610 1479109 1442916 1182890 1203114 1176138
13292 1176138 1077834 1056158 1131257 1074740 995260 1002312 1000369 932601 873605 829889 812189 734868
13280 734868 648621 716440 726129 711063 687665 597814 439886 259398 150042 82281 119214
13269 119214 207638 249273 191286 133426 182850 203939 305884 433517 458261 574808 668314
13258F68314o6052j31723m2451r4546k7161k0651K7492Q8559O516R9101N4142
13247E61540q766j7930j42801q1402p6410j15916o3044L8537O3768J6475j1472
13236A62579J08104N7061J09427k0378R7991N8849N5652J11834O5635K1744O7525
13225H96023n0012n0734J39651M6726J0604j78737j42553j36014l7184K1089k7181
13214D91678P2873K2553L0201P9860K5260N2634j4431r4473K2753r03M1636L4304
13202G63945j6650k00873m7521R2209L4450P8400K7941p230p3553j08809j27162
13191D15147o4297J8110J03812n6160j01230M4658N237k3897M2320q0249o760
13180B96691j242k4372Q2471Q8886J11236Q630j01093j6645P432n1765J5020J34633
$$ plain form
13258 668314 602262 470539 428088 333542 306381 285730 313222 401781 408297 507398 561540
13247 561540 552774 534844 392043 310641 234231 118315 55271 93808 157576 174051 162579
13236 162579 270683 327744 437171 416793 514784 573633 629285 741119 806754 828498 896023
13225 896023 846011 795277 934928 981654 992258 813521 670968 534954 497770 518859 491678
13214 491678 564551 587104 617305 697165 722425 775059 760628 666155 688908 688005 729641 763945
13202 763945 747295 546422 498901 591110 625560 703960 731901 724671 651118 542309 415147
13191 415147 350850 368960 472772 416612 315382 360040 365277 341380 383700 303451 296691
13180 296691 295449 271077 353548 442434 553670 562300 461207 444562 451994 400229 415249 549882
13168E49882m4871k672N1485k23140j06081K8383j7990J15341P8209o2900k7389
13157C38257j35781q9780o7258M4818j8462J1901q8234K1973P9325p702P8209
13146A67266N4293p7486j3100J53047Q2156P218m1209l5795Q1221K154q5564J6603
13134C10804j8142N8393K2121k7743m2500P123R949K774K2154j9660R9267L5857
13122D60397j9185m651J17454l2087L7847r448J50104K67395M38151L77396L64813
13111B148186L67946K56196K9271j64197k43848k81906k03841k80292l89392j75449
13101A062674o3579Q656J91273J71506K64788J24076P058j91144n4751O0894j70189
13090A411262j07868m4055J04919L07340K72457K31562J94089J65168P2752r7581
$$ plain form
13168 549882 505011 502339 553824 330684 224603 252986 234996 350337 428546 365646 338257
13157 338257 202476 112696 45438 90256 71794 83695 -4539 17434 96759 89057 167266
13146 167266 221559 144073 130973 284020 366176 373394 332185 296390 377611 379765 294201 310804
13134 310804 292662 351055 373176 345433 302933 310056 320005 322779 344933 325273 424540 460397
13122 460397 441212 436561 554015 521928 559775 550327 700431 967826 1405977 1783373 2148186
13111 2148186 2516132 2772328 2801599 2637402 2393554 2111648 1907807 1627515 1238123 1062674
13101 1062674 999095 1007751 1199024 1370530 1635318 1759394 1766452 1575308 1520557 1581451 1411262
13090 1411262 1303394 1259339 1364258 1671598 1944055 2175617 2369706 2534874 2607626 2510045
13080B510045j25092k22701j87829n9925q2032r907k165k9987j89648l20729j75199
13069A104831J9838J7950j94984j9172L5564J93076J53356J78535L19846K39725
13059B048565J48746R9781k5866k77043l08843k44422k40870k31001p2857j42403
13049G53787j99783q7140j58183J698K1087L9327K6740M884M9902n5439l6378
13038C60502j97247o3460J98267L2814j46991m3378o4198j3907o4430P3107Q5370
13027A56449k4402m4984j7230K0352P4980K0542Q7430K0204R9349q5298j47295
13016A60097l2434o1554O9261K39987R5990M308k01447j1758r5413o6054R5388
13005A96371l2246j37614j7242J02641Q4455J25868N6452j08008l6878J24398
$$ plain form
13080 2510045 2384953 2162252 1974423 1914498 1832466 1822559 1820394 1790407 1600759 1280030 1104831
13069 1104831 1124669 1142619 947635 928463 964027 1157103 1310459 1488994 1808840 2048565
13059 2048565 2197311 2297092 2271226 1994183 1685340 1440918 1200048 969047 896190 753787
13049 753787 554004 466864 308681 310379 331466 370793 397533 402417 452319 396880 360502
13038 360502 163255 99795 298062 330876 183885 140507 76309 62402 -2028 71079 156449
13027 156449 132047 87063 69833 90185 165165 185707 273137 293341 392690 307392 160097
13016 160097 127663 66109 135370 375357 471347 475655 274208 262450 167037 100983 196371
13005 196371 164125 26511 9269 111910 196365 322233 378685 270677 233799 358197
12995C58197L3391r4324m4324Q1066J0354J32148J12306M0670J42849K17387R5329
12984A085049L59169M24448L26290J60619J04931L7583p3562k05896l77396l55207
12974A486028k71709k77469j62136j21586J67054K44822K50027K23271M2831o5963
12964A515170m1878O7416m5785j13842o2447P8881J07133J90361K13454K81113
12954B189576K34528O5745j73104k23639k09624j07456J0201j55826K3136k69
12944A653268J2147o085m5631p7731k02960j91408j58836j49223O811M2L0752
12933H71146M9040J64305M41186L93621J31156o7290p8295l6135j38668j89232
12923A540834l20422j21693o8726k04106k05872j8277N6462m6090J6365r4970
$$ plain form
12995 358197 391588 297264 252940 334006 344360 476508 588814 629484 772333 989720 1085049
12984 1085049 1444218 1868666 2194956 2355575 2460506 2498089 2424527 2218631 1841235 1486028
12974 1486028 1214319 936850 774714 653128 820182 1065004 1315031 1538302 1581133 1515170
12964 1515170 1473292 1540708 1494923 1381081 1318634 1397515 1504648 1695009 1908463 2189576
12954 2189576 2424104 2489849 2316745 2093106 1883482 1776026 1786227 1630401 1653537 1653268
12944 1653268 1665415 1659330 1613699 1535968 1333008 1141600 982764 833541 840352 840394 871146
12933 871146 920186 1084491 1525677 1919298 2050454 1983164 1904869 1868734 1730066 1540834
12923 1540834 1220412 1098719 1029993 825887 620015 601738 658200 612110 628475 533505
12913E33505p7652k8041k6796m4659p5419p2035L5026j20782k2527J28281O0273
12902B89174m0076o1405j3471O1725p8749j94497m0440J4383J10736O1516J08708
12891B17604J9639q31o2401j45160n6772P6904J03509J7928p2864p9262P638J23804
12879A49736O6256P168l3095l388q1587n2798k9248m6925N1662P5842P4323P6250
12867B54196j49336o7615r3378J05155M0587k8168N0024J00575l4138q8667k5014
12856F4221M0724k1117j26549J1082K9114J32841M1901l5993Q7064R0249j10315
12845B03222r0786m747n8361k04208m3370K18635N0760K1989Q1459n8477n9311
12834E6805R0591J45261n1625j48962n7267N0263n3250p9457N5016M3051n9658
$$ plain form
12913 533505 455853 427812 401016 356357 280938 208903 243929 123147 100620 228901 289174
12902 289174 249098 187693 174222 235947 157198 -37299 -77739 -63356 47380 108896 217604
12891 217604 237243 236412 174011 28851 -27921 48983 152492 170420 97556 18294 25932 149736
12879 149736 215992 223160 190065 186677 105090 52292 23044 -23881 27781 103623 177946 254196
12867 254196 104860 37245 -56133 49022 89609 61441 111465 212040 177902 89235 64221
12856 64221 104945 83828 -42721 -31639 -2525 130316 172217 136224 223288 313537 203222
12845 203222 112436 107689 49328 -154880 -198250 20385 71145 93134 174593 116116 56805
12834 56805 147396 292657 241032 92070 34803 85066 31816 -47641 7375 50426 -9232
12823i232k2357n8363L8880l3758J5793M2894N2827J16716r33q3775L8798J3390
12811A10880n8210m5609N5391N8825J870q9880m1402J6866j797k1972n6874k5442
12799i7354K2103J18533O2617j30693Q993Q1645o9458p9087M0517J7523k2094
12788d6755R692P0029j6480o1910p8312j34961J2855J65138O0996O0571o800M1962
12776G6025o8683n6638N6040J45515M8846l1020o904j67044q3742l7868L7377
12765h8096J08521O2698N0012J39682K3320m3394q3470n1171j2920O5227j10543
12754E9866q3372L4767L2068m2207j80541o3122J57163P0718j34995n3378O5868
12743a37165J27494Q3409j52782j4686M2504L9281J48073L8415j09292j10754
$$ plain form
12823 -9232 -31589 -89952 -51072 -84830 -69037 -26143 26684 143400 142467 58692 97490 110880
12811 110880 52670 7061 62452 121277 123147 33267 -8135 8731 6934 -15038 -71912 -97354
12799 -97354 -75251 43282 105899 -24794 -15801 65844 -3614 -82701 -42184 -24661 -46755
12788 -46755 -37063 32966 16486 -45424 -123736 -258697 -245842 -80704 -19708 40863 34063 76025
12776 76025 7342 -49296 6744 152259 201105 170085 163181 -3863 -87605 -125473 -88096
12765 -88096 20425 83123 133135 272817 296137 252743 169273 118102 105182 170409 59866
12754 59866 -23506 11261 43329 1122 -179419 -242541 -85378 -14660 -149655 -203033 -137165
12743 -137165 -9671 73738 -79044 -93730 -51226 -11945 136128 174543 65251 -45503
12733d5503K3682L4202j6184P8357N4159J28814m7422k29760j2571N6923r56j228
12721B2513l3795M7794O9342K4091l4094j34435q5639m3529N0351M8101J47315
12710G8015R2323r6954m1986k2722j24778L3078M4787J5573J12522N4640q0759
12699F3739q9434R4578J1661n3468o9201j08835j04974N4903J13285N8682k1833
12688e0897O730K1036r1211j8122k0060J30062R7580j29q9048q0724p2962K4489
12676a43256Q2611L5103J41161J38438J580j0393j01923p9907k0883Q0300O9988
12665A92819m073q4850j32971J629J19958m8225p087J38405N1399L1790k6933
12654B31861j55603j13291n4590M0490N0370M6056j4337j5351Q1629L4310J9945
$$ plain form
12733 -45503 -21821 12381 -3803 74554 128713 257527 210105 -19655 -32226 24697 23741 22513
12721 22513 -11282 36512 105854 129945 95851 -38584 -124223 -167752 -117401 -69300 78015
12710 78015 170338 73384 31398 8676 -116102 -83024 -38237 -22664 89858 144498 63739
12699 63739 -25695 68883 80544 27076 -42125 -150960 -255934 -201031 -87746 -29064 -50897
12688 -50897 -44167 -23131 -114342 -132464 -152524 -22462 75118 74989 -14059 -94783 -167745 -143256
12676 -143256 -60645 -25542 115619 254057 255637 245244 143321 63414 42531 122831 192819
12665 192819 188746 103896 -29075 -27446 92512 44287 37200 175605 227004 258794 231861
12654 231861 76258 -37033 -91623 -51133 -763 45293 30956 15605 97234 131544 151489
12643A51489j3138j05709k0563J39635J01564L0628R6740l0352j40031n0314o5321
12632I4628J67J2796q9159q9672l8338Q746m9436j7035M3771R5293J38674N6951
12620A67386J6221j10703j4068n8183q0036k9150m3778r246O8746K7147J01838
12609C6174J08003l730n0388M4021Q623J7782J6179j06332k7918j5561o8336j7461
12597e8944l726N6528P3626O2315P725P4285p7025j7995o1688J5703Q9905O7000
12585B27709J18430o4307q9994o2104r8352r7869j9392n5864P6976K9104m2518
12574g8181k4145L6884R6873J03902n62j27370p6981m8005J28226K38107j4894
12563B33854j62298j27743j14019k0991J3389N0379O6926J00563J20500O7658
$$ plain form
12643 151489 138351 32642 12079 151714 253278 283906 380646 350294 210263 159949 94628
12632 94628 94795 107591 18432 -71240 -109578 -100832 -150268 -167303 -123532 -28239 110435 167386
12620 167386 183607 72904 58836 653 -79383 -108533 -152311 -161557 -92811 -65664 36174
12609 36174 144177 140447 90059 134080 142703 160485 176664 70332 42414 26853 -41483 -58944
12597 -58944 -62670 -6142 67484 129799 137524 211809 134784 116789 55101 70804 160709 227709
12585 227709 346139 281832 191838 129734 31382 -66487 -85879 -141743 -64767 -35663 -78181
12574 -78181 -102326 -65442 31431 135333 134771 7401 -69580 -117585 10641 248748 233854
12563 233854 71556 -56187 -170206 -191197 -177808 -127429 -60503 40060 160560 228218
12553B28218k1962j16763l720L9688Q4251j7989J5264K7229j0605m9857j30551
12542D3203N5375p526p0091K6782m4168M520j20569k03483O496O7684Q4323q8351
12530b45805j0680J59196p047j6799M3995j9262J17252J7030L0408N4717p291
12519A15714r7189m4046j18701n9605O15J86743Q8522o5513j47004j04081l6784
12508b81329N4995J13248K5999l0520J03838J27901J0370J6504j4606l6336q2977
12497G087j5977k995k5672j9457l6286J300O5984P2175j06828k8488l636k4925
12485a17718p7818o3012J20900r844L1864J53888l577m7232k9083k991K3198j6972
12473c8397J00120o368l6256o0280J4624n3817l0261J47689O9221o110r8939j0714
$$ plain form
12553 228218 206256 89493 85773 125461 209712 191723 206987 234216 223611 173754 43203
12542 43203 98578 91052 20961 47743 3575 8095 -112474 -315957 -309461 -241777 -157454 -245805
12530 -245805 -256485 -97289 -104336 -121135 -77140 -96402 20850 37880 68288 123005 115714
12519 115714 18525 -25521 -144222 -203827 -203212 -16469 72053 6540 -140464 -244545 -281329
12508 -281329 -226334 -113086 -87087 -117607 -13769 114132 124502 141006 126400 90064 7087
12497 7087 -8890 -11885 -37557 -57014 -93300 -92000 -26016 46159 -60669 -89157 -92793 -117718
12485 -117718 -195536 -258548 -137648 -147492 -115628 38260 34683 -12549 -41632 -44623 -21425 -38397
12473 -38397 61723 55355 19099 -41181 -26557 -80374 -110635 37054 106275 100165 1226 -9488
12461i488J07149P3336L3985m1562o1831l0830l5873q1102n5265P1096K34458
12450B04073o6277o1083j1483J2792n2571N09J7165j7279J01227M41n5020m1623
12438C0871j063L353L7575o5106N3949j29839m5872k042K9123Q3418R100L2941
12426C6408q3053n1588J79126M89j24670j3404j34932R5168J08243N9384q6854
12415a5683L7708K6939L3726P2632M4264q7918k1749n4234j20580L545K3510r9332
12403a57172Q9015L9528q2090K8071n630M7388J8386J9757Q2849L9694J01078
12392B20874m8272Q86N7692L0090n6305j34827L8554M3964q2350n4214J00294
12381A16386J7552m1039r1955m3382L4853j9020R7087K2716N2265Q5133r2577
$$ plain form
12461 -9488 97661 170997 204982 163420 101589 70759 34886 -46216 -101481 -30385 204073
12450 204073 137796 76713 65230 78022 25451 25960 43125 25846 127073 127514 72494 30871
12438 30871 29808 33161 70736 5630 59579 -70260 -116132 -118174 -89051 -5633 3467 36408
12426 36408 -46645 -98233 80893 81382 -43288 -56692 -191624 -96456 11787 71171 -15683
12415 -15683 22025 48964 82690 155322 199586 111668 89919 35685 -84895 -81350 -57840 -157172
12403 -157172 -68157 -28629 -110719 -82648 -88278 -40890 -22504 -2747 80102 119796 220874
12392 220874 172602 173488 231180 261270 204965 70138 108692 152656 70306 16092 116386
12381 116386 133938 92899 944 -42438 -7585 -26605 70482 93198 145463 230596 138019
12370A38019m1132R8463j11349j55644O271L3162m3145O1730K6947j3872q19L759
12358B390J3039l2793j10039k6902q050N3469J61353P3771J1923k7634j81142
12347g0615o3176K6276J36907o627k45375l5996K0750M6367l5366O9756j13704
12336b70803J3815K34569R7920J15289K7076L650q5126j55931m299l9963j5147
12325g8950j3991J23749K6031q0536o3474l4351L158J29219N9073k7155j06877
12314f4104o0931N6076M2953o3566L5516J12592j8185p562K5781M1737N6095r4323
12302F2079k0281j02718n7305J8805J2373k620O1406R3209J09606j17986r1879
12291c5311K15097J19875M8220p8362r1840j22772n8730J5278j4756q7228k4475
$$ plain form
12370 138019 96887 195350 84001 -71643 -65372 -32210 -75355 -13625 13322 -550 -1369 2390
12358 2390 15429 -17364 -127403 -154305 -162355 -108886 52467 126238 138161 110527 -70615
12347 -70615 -133791 -107515 29392 22765 -222610 -258606 -237856 -191489 -226855 -157099 -270803
12336 -270803 -256988 -22419 75501 190790 217866 221516 136390 -19541 -23840 -63803 -78950
12325 -78950 -92941 30808 56839 -23697 -87171 -121522 -118364 10855 69928 42773 -64104
12314 -64104 -125035 -68959 -26006 -89572 -54056 58536 40351 32789 58570 100307 156402 62079
12302 62079 41798 -60920 -118225 -99420 -87047 -89667 -28261 64948 174554 56568 -35311
12291 -35311 179786 299661 347881 269519 177679 54907 -3823 11455 -3301 -90529 -115004
12280a15004j811Q6115j2247N0769Q499r3057J5573J47097K782j26475M2348M082
12268H671p1430L6622J3672r7006P7432R7528K3051m1689r4657m6865J27166q482
12256B4013m7124O0630j3658K8276p33J6823n7094p4933O2730J35383m6508o941
12244H0864k5933j34430M5823Q0111k7366Q4510J10824q7478p6208l3128P6351
12233I3940p4724j27171J23274L5439M2036k2529m7812M4881j9414l9940j4602
12222f622R6252R2580m6683p3132K0117k0814n6373l8769n5042L4910J38768o2337
12210B2855j19325P5207Q7279R373n1566j27905j24174J27309q3639j0012J18672
12199g5926q6746o8764J06592N449l9439m2140J18449L0681J29243n6640r2147
$$ plain form
12280 -115004 -116815 -30700 -42947 7822 16321 -76736 -61163 85934 88716 -37759 4589 8671
12268 8671 -62759 -26137 -12465 -109471 -32039 65489 88540 46851 -47806 -94671 32495 24013
12256 24013 -23111 37519 23861 52137 51404 68227 11133 -63800 -1070 134313 87805 80864
12244 80864 54931 -79499 -33676 46435 19069 103579 214403 126925 50717 17589 93940
12233 93940 19216 -107955 15319 50758 92794 70265 22453 67334 47920 7980 -6622
12222 -6622 89630 182210 135527 62395 82512 61698 5325 -33444 -88486 -53576 85192 22855
12210 22855 -96470 -21263 66016 75389 23823 -104082 -228256 -100947 -184586 -194598 -75926
12199 -75926 -162672 -231436 -124844 -119395 -158834 -200974 -82525 -51844 77399 20759 -71388
12188g1388m9628L4219P4629j1024j0011j5718M1502Q0234J1014o0398q1276m7288
12176a05133j0417J24999J39557j09083j34535n5981r9533P9600J08961P1794
12166A0229m0300j0711M565j59196K1117N0191R751N7455O4715o6979o0007J10127
12154i043J76804l4427k2641K5587j95685N1418M327K2405j6012J3568j6936k242
12142b877J2519p3891j26778n3058L6200L1778K5510J14176K5421N466m5850m1646
12130i3030J12035N7961L5558j06710j30766J13616J35833j21154j60606o6401
12120b23664Q0428J00094N1032l7458j04576n7024R2053J3100o569L6031J6742
12109c9811K5784n2230j34751J18405P9946k6850N658M9547p107m3178m8748o7242
$$ plain form
12188 -71388 -121016 -86797 -12168 -23192 -33203 -48921 -7419 72815 83829 23431 -57845 -105133
12176 -105133 -115550 9449 149006 39923 -94612 -150593 -250126 -170526 -61565 10229
12166 10229 -30071 -40782 -36217 -195413 -174296 -124105 -114354 -56899 7816 -59163 -119170 -9043
12154 -9043 167761 133334 110693 136280 -59405 -7987 -3660 18745 2733 16301 -635 -2877
12142 -2877 9642 -64249 -191027 -244085 -207885 -176107 -150597 -36421 -11000 -5534 -51384 -93030
12130 -93030 19005 76966 112524 5814 -124952 -11336 124497 3343 -157263 -223664
12120 -223664 -143236 -43142 7890 -29568 -134144 -191168 -99115 -86015 -92584 -56553 -39811
12109 -39811 -14027 -66257 -201008 -82603 -2657 -29507 -23849 25698 18591 -24587 -73335 -140577
12097a40577j10158R5697J66582n0101K1594J8256J06819M7494r8709r7856n28
12086d1487l6077j40440L4752M2705N566J4820J04979J6074R9670j0753n7260
12075C2549k7650J10881P167j36741L4730L0085n4416J0831J13023J9192k7998
12064A11653N462K306J20701k0891l2252l2442n3751n8465l4713q0866Q4893M1635
12052E3270o8042L2786J34594j08078j07350k5890K2610N2923M5177J3551K809
12041D8360P026j1191o4689K5080M3086R0445M352J5390L5126M3789j39817j17753
12029b0796r7269J01516P0924J44418J20129R2957j6360p6306j68911j49789P238
12018G751q1120j8507k0826M6506o9699Q7540k281R9556J9656j3997j81106O4341
$$ plain form
12097 -140577 -250735 -155038 11544 -38557 -16963 1293 108112 155606 56897 -40959 -41487
12086 -41487 -77564 -218004 -183252 -140547 -134981 -120161 -15182 892 100562 89809 32549
12075 32549 4899 115780 122947 -13794 20936 51021 -3395 7436 120459 139651 111653
12064 111653 117115 119421 240122 219231 186979 154537 100786 42321 7608 -73258 11635 53270
12052 53270 -14772 18014 152608 44530 -62820 -88710 -66100 -13177 32000 45551 48360
12041 48360 55386 44195 -20494 4586 47672 138117 142469 157859 192985 236774 96957 -20796
12029 -20796 -118065 -16549 54375 198793 318922 411879 395519 319213 150302 513 7751
12018 7751 -73369 -91876 -112702 -66196 -135895 -48355 -50636 48920 68576 54579 -126527 -62186
12006f2186Q0362n618n0050j88755J09166r480n0172q606J30181R5816j04171
11995f3513r5744K9028M8055J2771L645P9441L7865K7180K5134j7008n634k766
11983G8454O0574j0572l3041l6325k0277n8134P5058l065K6185O4346L0944j17523
11971E6624j63677L043J03850R4463J1865J21041j6742k00918r2324J24645Q4090
11960A25960l6279Q9539L9200r6537o6499o175J03215M3470j4429N9112q2858
11949A57719n5500j03895j7597r1465j78923J59986K05380N1314j7677l170K715
11938A08887o9088m8668m0405M1422J00983o6780m3319J36843P4605n1952r6958
11927D5570K4168j9478o5892J56604J11896p2010j43582N9305J5345o4702l4983
$$ plain form
12006 -62186 18176 12558 -37492 -226247 -117081 -126561 -176733 -185339 -55158 40658 -63513
11995 -63513 -159257 -130229 -82174 -69403 -65758 13683 51548 78728 103862 86854 81220 78454
11983 78454 139028 128456 95415 59090 38813 -19321 55737 52672 78857 143203 174147 56624
11971 56624 -107053 -104010 -160 94303 106168 227209 210467 9549 -82775 41870 125960
11960 125960 89681 179220 218420 121883 55384 49209 152424 195894 181465 240577 157719
11949 157719 102219 -1676 -19273 -110738 -289661 -129675 75705 127019 109342 106172 108887
11938 108887 39799 -8869 -49274 -7852 93131 26351 -16968 119875 194480 142528 45570
11927 45570 69738 50260 -15632 140972 252868 180858 37276 96581 111926 47224 12241
11916A2241q7643L313K993J5736J25815L1209r3594r4297M84k265n3635Q294k2567
11903a53916m0110L1870m7209J38184L6809r2511o2343J46681Q7189J06396k9664
11892A21376j58879Q039Q6808l3298q5026j84766L022J10549J18638O4622r5701
11881d4616m0158M4735q4165m2725P4871j8845l9351j3076N2572K5085l4771M0039
11869h0405Q0818R9554p861j6797j5078j26171q208n3766M0782M7835Q1546j7169
11857B5080J8668O5297M4116l3236k3972l3060o2659l1333O4779J21686k6425
11846A28941l5222j3894K7440k5297N1148m5000o4109p0038J12635J11977j07268
11835G1313q0840l9069N4729O6032J29533J0635j57284o3132p2889j8808J10537
$$ plain form
11916 12241 -75402 -72089 -69096 -53360 72455 103664 10070 -84227 -83743 -86008 -139643 -131349 -153916
11903 -153916 -194026 -162156 -209365 -71181 -34372 -126883 -189226 -42545 44644 151040 121376
11892 121376 -37503 -29464 57344 24046 -60980 -245746 -242724 -132175 -13537 51085 -44616
11881 -44616 -84774 -40039 -124204 -166929 -92058 -110903 -150254 -163330 -110758 -85673 -120444 -80405
11869 -80405 413 99967 92106 75309 60231 -65940 -74148 -127914 -87132 -39297 42249 25080
11857 25080 43748 109045 153161 119925 95953 62893 234 -31099 33680 155366 128941
11846 128941 93719 79825 107265 81968 133116 88116 24007 -46031 66604 178581 71313
11835 71313 -9527 -48596 6133 72165 201698 212333 55049 -8083 -80972 -99780 10757
11824A0757J4136p4044K4305O3290J9850l4428j70381l1639J08805P7993j61902
11813a53258q9941K9126J58245K4734K7336m5252J5306l1781j4088m5093n384
11802a30050J22811O2676j49394Q6128m8534Q1057o5912J4650Q1857m5265r9612
11791h9588M8278l7329q0038R3877O0928p6474N378Q4016j3142q3339k843N2376
11779c7900k2230r6564J2649O2811O9955K5975m9151l628O6855J11354N854M2523
11767A88503j05078k17123n1373J08984J03350M7470J14674P0009j00960j57834
11757F22q1278K44708R494p7094j29358m207J08849k8497n7940n2340l337J48937
11745G8559K866P152K971j08836p2580R6647j7597q3534K0064N2393L5965l0820
$$ plain form
11824 10757 24893 -49151 -24846 38444 58294 23866 -146515 -178154 -69349 8644 -153258
11813 -153258 -243199 -214073 -55828 -31094 -3758 -49010 -33704 -65485 -79573 -124666 -130050
11802 -130050 -7239 55437 -93957 -7829 -56363 24694 -41218 -26568 55289 10024 -89588
11791 -89588 -41310 -78639 -158677 -64800 -3872 -80346 -74968 9048 -4094 -87433 -90276 -37900
11779 -37900 -60130 -156694 -144045 -81234 -11279 14696 -34455 -38083 28772 140126 145980 188503
11767 188503 83425 -133698 -185071 -76087 27263 74733 189407 259416 158456 622
11757 622 -80656 164052 173546 96452 -32906 -37113 71736 43239 -14701 -67041 -70378 78559
11745 78559 81425 88577 91548 -17288 -89868 6779 -10818 -94352 -74288 -21895 14070 -16750
11733a6750j28513k9276M8213N7931J85067k1840l8275N6446M6864j3847Q7213
11722B33233r9295l0760n8944j6031M0966M2750k7024o9317N1769Q932l9550M271
11710D1000m1212N8757O3048L2152N9359n1980n6404j29708N189O7208M1035J35871
11698B24315K1731k4826r3722m5971N3105j8692j20459j18691j4458L1313M5754
11687f0601o3441l1096R6889q5202p4064N8088j7810R3518P9037J20482L6445
11676A52245q981j27926n4986n893N1292J08452P7685q0898j74309k9634J66050
11665G3097p595l7920k3124l3898o244j6225r8249k1915j1315K2797R1814J6811
11653e1966j11047J3620J67447M9024m2949P579M4439j07468j303L7223k0183
$$ plain form
11733 -16750 -145263 -174539 -126326 -68395 116672 94832 56557 113003 159867 146020 233233
11722 233233 133938 103178 44234 28203 69169 111919 84895 15578 67347 76279 36729 41000
11710 41000 -212 58545 121593 153745 213104 161124 104720 -24988 -19799 47409 88444 224315
11698 224315 246046 221220 127498 81527 134632 115940 -4519 -123210 -137668 -106355 -60601
11687 -60601 -124042 -155138 -58249 -143451 -217515 -159427 -177237 -83719 -4682 115800 152245
11676 152245 143264 15338 -39648 -45541 5751 114203 191888 110990 -63319 -92953 73097
11665 73097 65502 27582 4458 -29440 -35684 -51909 -150158 -172073 -183388 -160591 -68777 -51966
11653 -51966 -163013 -149393 18054 67078 24129 31708 76147 -31321 -32624 4599 -15584
11642a5584M9720K67j6584N6663K0l5296j45927r1799P8095j5901j09785l6495
11630b82606J31987M7555p7818J13413J10341k650n0516j6074N0430M4352p788
11619F0626r222r5435q4611m0909K5296Q4031m7934r5544L1129J08983Q1420L9644
11607E7474m4275q5368O7325j28512j20412R3703J69773k8060J761l7014O9197
11596A5592P9309L4515l8379Q540l1718P9959K7041l7391k4088l1479n854J9146
11584I5193j02925K2070l7169j58598M5225M0231M4399k9628J1383n16M6404J20237
11572I6306k3660K8379J6862j4356p099l5924L9995k2103N7952j4559p6956k6254
11560A8583J56838L1618j02159p5032r406r1693O6787J794M7817J3998j0112P61
$$ plain form
11642 -15584 34136 34403 17819 74482 74502 39206 -106721 -198520 -120425 -136326 -246111 -282606
11630 -282606 -150619 -103064 -180882 -67469 42872 40222 -10294 -26368 24062 68414 60626
11619 60626 51404 -44031 -128642 -169551 -144255 -60224 -108158 -203702 -172573 -63590 17830 57474
11607 57474 13199 -72169 -4844 -133356 -253768 -160065 9708 -18352 -16591 -53605 15592
11596 15592 94901 129416 91037 99577 67859 147818 174859 137468 113380 81901 76047 95193
11584 95193 -7732 14338 -22831 -181429 -136204 -95973 -51574 -81202 -69819 -70335 -23931 96306
11572 96306 72646 101025 117887 103531 96432 60508 100503 78400 136352 121793 44837 18583
11560 18583 175421 207039 104880 29848 20442 -71251 -4464 -2670 45147 59145 49033 49794
11548D9794l1792Q1542j05822j29739P0681J1636J6180j9937l9313J62168J1555
11537G6953o4289n0781L2998r6117o5003J04835L4713k4778N9717J15371J5908
11526A39527o8428o9256Q2850P4864J415j34737N4650n4260o0272K7423K2765
11515A6541m2658k3203j43759k6150K02732R4776j7365j57387K2518o778M0461
11504d0272O9042k7530N2427K6211j26719r1212p836J06648O4047Q366J922N4161
11492H9255K9016j2073n6008N0084N9720q1428J0738Q3612O0597L497n326j05614
11480A26070O7200J5549o9836k10141j4900K0458J9025J3235o1370m0244l9183
11469a74137J68460K07627J0922p3382o0210J1379p2542r4600j7986N5337O1416
$$ plain form
11548 49794 18002 99544 -6278 -136017 -65336 -53700 -37520 -57457 -96770 65398 76953
11537 76953 12664 -38117 -5119 -101236 -166239 -61404 -26691 -51469 8248 123619 139527
11526 139527 71099 1843 84693 159557 160972 26235 80885 26625 -33647 -6224 16541
11515 16541 -26117 -49320 -193079 -219229 -16497 78279 60914 -96473 -73955 -80733 -40272
11504 -40272 28770 1240 53667 79878 -46841 -138053 -145889 -39241 24806 33172 35094 89255
11492 89255 118271 106198 50190 100274 159994 78566 89304 172916 233513 237010 231684 126070
11480 126070 193270 208819 138983 -71158 -86058 -65600 -46575 -33340 -94710 -134954 -174137
11469 -174137 -5677 201950 212872 139490 79280 90659 18117 -76483 -94469 -39132 22284
11458B2284r7339l088O2144J08987J17273p5970M9870Q0483j41561J1531k46j04543
11446B9825M5135n5350j04557m1996n378l9933k24j068N2588P6312p5855j778
11434a22279N1233M799j1248k0407J69637L875j59146m6574p5495J8631J82334
11423d640R8613M2224L8664n2303o9219R8000q5636r0164q156J4096m2173l7002
11411i7696M4621k7345r0433O4372K4525K6073Q5806L0661j11956j11100M7672
11400a14800P1614M9734o4037l724j16562q8772K09J08041O5121J1496J50900
11389F9220K906p2017j25378j01695M2298K5774R1458J39023J33270L4858j8291
11378B21426j53613j15078j17464j0054J19779m8897l7510K021l9052n987J13118
$$ plain form
11458 22284 -75055 -78143 -15999 92988 210261 134291 184161 264644 123083 134614 134368 29825
11446 29825 74960 19610 -84947 -126943 -132321 -172254 -172478 -173546 -120958 -44646 -120501 -122279
11434 -122279 -71046 -66247 -77495 -97902 71735 75610 -83536 -130110 -205605 -186974 -4640
11423 -4640 93973 136197 174861 122558 53339 151339 65703 -24461 -32617 -18521 -60694 -97696
11411 -97696 -53075 -80420 -170853 -106481 -81956 -55883 29923 60584 -51372 -162472 -114800
11400 -114800 -43186 6548 -57489 -61213 -177775 -266547 -266338 -158297 -93176 -81680 69220
11389 69220 72126 109 -125269 -226964 -184666 -158892 -67434 71589 204859 239717 221426
11378 221426 67813 -47265 -164729 -174783 -55004 -103901 -141411 -139390 -178442 -184429 -71311
11367g1311m279j1994R5387K6969O6103j00604r0487r1238k4413K1277Q3790N9250
11355d1550p4339r006N9551o826J404n249Q191q5176K1157R1105o6275q2551K2923
11342a66641n3323l3930J17194O8875l5569m8159N9085R8293m732k2064m7034
11331f8005J27816Q914r0592j61023p2512O3286R7092M3041r2771l8551K6020
11320a57285L4358J19034N6010Q0942m3438j18141q293J32266J13531M706j39185
11309G4505j70435j4469O2410R6281Q8144J3882J0378j39679J6585N5392K589
11298I5583m324N1685n3222R796l5100L5793o892P8534k1373k8364n883r5789
11286B0444P2160P8436Q8838j25305q0827q4817j1589m2398Q7093J8388q4718
$$ plain form
11367 -71311 -75590 -87584 7803 34772 100875 271 -90216 -181454 -205867 -184590 -100800 -41550
11355 -41550 -115889 -124895 -65344 -72170 -70766 -76015 -67824 -153000 -131843 -40738 -107013 -189564 -166641
11342 -166641 -219964 -253894 -136700 -67825 -103394 -151553 -92468 5825 1093 -20971 -68005
11331 -68005 59811 68725 -21867 -182890 -255402 -192116 -95024 -51983 -144754 -183305 -157285
11320 -157285 -122927 -3893 52117 133059 89621 -28520 -36813 95453 208984 213690 74505
11309 74505 -95930 -110399 -47989 48292 136436 150318 160696 21017 37602 92994 95583
11298 95583 91259 142944 89722 99518 64418 100211 93319 171853 150480 122116 116233 20444
11286 20444 92604 171040 259878 134573 53746 -31071 -42660 -85058 2035 20423 -64295
11275f4295m0533J2883O529K8134O612P5945M0546j39770j4348O7835m1315L729
11263e8048n0534l0846J222L7105j0787m2553J16267J66360R751j02913j6337
11252A8687N8578J00718m7574j72725l8839M9012k5144j09291K3451N3837P5840
11241a3450l661k5752Q3988j9063j16347M3671O2540O2208l5628j7938n4863q139
11229d2434M4946K14J04894J0649J15598q4031j98896j7552O1692o9281q3973
11218a58174J9053q084P0609m5797L495K4754M7284K2936N6707l1401j9310K2255
11206D327p22l8285N2656j22501l639N2889L6690O8915l4859r4788K0523J7755
11194d1039k0597J7521J8772o4460J83961M7511j4954L8224J147p6159k6966k509
$$ plain form
11275 -64295 -104828 -91945 -85416 -57282 -50670 25275 65821 -73949 -88297 -20462 -61777 -58048
11263 -58048 -108582 -139428 -138206 -101101 -111888 -154441 -38174 128186 137937 35024 18687
11252 18687 77265 177983 130409 -42316 -81155 -32143 -57287 -166578 -143127 -89290 -13450
11241 -13450 -17111 -42863 41125 22062 -94285 -50614 11926 74134 38506 20568 -34295 -42434
11229 -42434 2512 2726 107620 118269 233867 149836 -49060 -66612 -4920 -74201 -158174
11218 -158174 -139121 -147205 -76596 -122393 -118898 -94144 -46860 -23924 32783 1382 -17928 4327
11206 4327 3605 -34680 17976 -104525 -108164 -55275 -18585 50330 15471 -79317 -58794 -41039
11194 -41039 -61636 -44115 -25343 -89803 94158 141669 126715 164939 166086 89927 62961 60452
11182F0452k6464o4638M6881J9619o0163p7138n6253N2901J35431R3305r1931
11171C2002l2668j1159o0956P2824q56m0122n1967O584O2230K26101O5755k3201
11159B44567n8228j52297K9735n702j32781q0292o7614J11749N6385l0427p3528
11148a58433J07181K0975m3680L5283P0778n3302l3145j28014P9532J15649M7916
11137F0740n250J37131M4714o6870r3704j11415j8579O5679J6660p5835q1006
11126a27735R1665J10863m7096k6812K1745J9839K417L6251n6142o6576N6081
11115A4500k5664J8953P4776M3992L3435p7462j9347p8656p1363J6650L5030P2988
11103C7832O0506K0198n8261K1961L8448O1074O9141k6439J2573l9028j3309j23891
$$ plain form
11182 60452 33988 -30650 16231 35850 -24313 -101451 -157704 -104803 30628 123933 32002
11171 32002 -666 -11825 -72781 43 -813 -40935 -92902 -86318 -24088 202013 267768 244567
11159 244567 186339 34042 63777 58075 -74706 -154998 -222612 -110863 -54478 -84905 -158433
11148 -158433 -51252 -30277 -73957 -38674 32104 -21198 -54343 -182357 -102825 12824 60740
11137 60740 55490 192621 237335 170465 76761 -34654 -53233 12446 29106 -46729 -127735
11126 -127735 -36070 74793 27697 885 22630 42469 44886 81137 24995 -41581 14500
11115 14500 -11164 7789 82565 126557 159992 82530 63183 -15473 -86836 -70186 -35156 37832
11103 37832 98338 118536 60275 82236 120684 181758 250899 224460 237033 198005 184696 60805
11091F0805o462L6325L7430n2344K6853J4204k8033o0611k9410k8537J05445K2494
11079I8159o5025l2913k5814J2489K8459j0621o0566J4133p8734p1838O3406N2304
11067g6561k2153l8794O8300N9626J8144O0858L462l7443n5126M2704J30862k1266
11055A32613j55339j7781N6653L620j3480R3479L6237J05724k00564r8768n2018
11044a09624K3032K3287r87Q8496j2130r2412J00763Q0288j12856L9450p7203
11033d9896m7531N5280M0259J09709k6517J8383r0260p5236Q2674L4811m6797
11022D879K6753j1760k0256l2099P4987J99561j44662j23575M1683Q313J2577
11011C6401n3098J1800Q6243j4341q3427j07429O0340J76402P3337m5927o5947
$$ plain form
11091 60805 54343 90668 128098 75754 102607 116811 88778 28167 -1243 -29780 75665 98159
11079 98159 33134 221 -25593 -13104 15355 4734 -55832 -41699 -120433 -192271 -128865 -76561
11067 -76561 -98714 -137508 -69208 -9582 8562 69420 72882 35439 -19687 23017 153879 132613
11055 132613 -22726 -40507 16146 19766 6286 99765 136002 241726 41162 -57606 -109624
11044 -109624 -86592 -63305 -64292 24204 12074 -80338 20425 100713 -12143 27307 -49896
11033 -49896 -97427 -42147 -1888 107821 81304 99687 9427 -65809 16865 51676 4879
11022 4879 31632 19872 -384 -32483 42504 242065 97403 -26172 15511 23824 36401
11011 36401 -16697 -4897 81346 67005 -16422 -123851 -63511 112891 186228 140301 74354
11000G4354j08243J51386O1214j32626q2689M5931o398j5629j21918k7149M0455
10989a21312J831j6983J06400J17843L2815n8494L1875k4114P8697p4638j91828
10978a17908n2432R2911Q189K4494J07200O5511q2122k085J5806J1474L8468m2192
10966F7314j05455J2376K9708L1872R0822q4079q1026l736m6259q101l1888Q5154
10954d3298q35j6355M9700J55227o353J4033O1086J9608M7448l9481r9840j11516
10942B9424j69658q495R3308M3994j0573m9520j58748k5542J61039j4560j18169
10931b27500j5789P5499O1364n4766q9061k0849J52766k599O9984j3952n5867
10920a20770O3396M7379j2164R6960R8402q0200l4777K4241O5136j3503J9642
$$ plain form
11000 74354 -33889 117497 178711 46085 -36604 9327 2929 -12700 -134618 -161767 -121312
10989 -121312 -119481 -136464 -30064 87779 120594 62100 93975 69861 148558 73920 -117908
10978 -117908 -170340 -77429 -69240 -44746 62454 127965 45843 43758 59564 71038 109506 67314
10966 67314 -38141 -25765 3943 35815 126637 42558 -38468 -42204 -88463 -96564 -128452 -43298
10954 -43298 -44133 -60488 -10788 144439 138086 152119 213205 232813 280261 240780 140940 29424
10942 29424 -140234 -148729 -55421 -11427 -22000 -71520 -230268 -255810 -94771 -109331 -227500
10931 -227500 -243289 -167790 -106426 -161192 -250253 -271102 -118336 -120935 -50951 -64903 -120770
10920 -120770 -57374 -9995 -22159 74801 173203 93003 58226 82467 147603 134100 153742
10909A53742K4789j01389n7688J2054r5507O063N2856k6812n3581R9030k4544
10898a0987p9804O786K06300K3498j58863m7279R4771j0353j45058m5661n7634
10887b24284M9760J62347R7924l5010m9619R5463R497k0374K5966m48R0809M5392
10875B47423n8075q9370K7083o5212r3177m6421n7222J7958N8742l3056r6479
10864a87806Q682j37055l4626N8744Q2549R6826K7567m8K8412L9994o6261J30376
10852D7354J11980j5967o2090l9726n668M2262M0906O7187J0188o0858j05011
10841C0557n2649k7132J15343N2181p4042J4100J09734K8630l3063o1534j38793
10830c6668k7963m159J5235j8946K4132J45275J4031M8475r4737p3532o7811j2056
$$ plain form
10909 153742 178531 77142 19454 31508 -63999 -57936 -5080 -31892 -85473 13557 -10987
10898 -10987 -90791 -84005 122295 145793 -13070 -60349 34422 24069 -120989 -166650 -224284
10887 -224284 -174524 -12177 85747 50737 1118 96581 106078 85704 111670 111222 202031 247423
10875 247423 189348 99978 127061 61849 -31328 -77749 -134971 -117013 -58271 -91327 -187806
10864 -187806 -179124 -316179 -350805 -292061 -209512 -112686 -85119 -85167 -56755 -16761 -83022 47354
10852 47354 159334 143367 81277 41551 35883 78145 119051 186238 196426 135568 30557
10841 30557 -22092 -49224 66119 118300 44258 58358 168092 196722 163659 102125 -36668
10830 -36668 -64631 -68790 -53555 -72501 -48369 96906 110937 159412 64675 -8857 -76668 -88724
10818h8724N1431L3700K8024k463m5289P1344k4515k4319L7608n340J2976o9244
10806b4811o2048l0283N7313K0468K5222n3593j8237L2760R0222R9539R326O087
10794A51965p7913M2170o775r2736n0149K1571M5447K3520r7996l0816k44846
10783c16558J0033K0738k1263J10028K26662J18488L075j51880r448L0497J0746
10772C1118R2816m7169k7682k9064j61889k46J12862L6998j1927n8527j3333j3155
10760h9198K5317L9850j53523j05786P7718L3372L1397J88364l5149R0917N7727
10749A61006K6821l2743M3917m660k0182o5947J2121n8430j552P7483N11o9985
10737F8360j26701K7842J66414J44989l4536p7756j32399j55859M109O7009O8178
$$ plain form
10818 -88724 -37293 -3593 24431 21968 -23321 48023 23508 -811 36797 31457 44433 -24811
10806 -24811 -86859 -117142 -59829 -39361 -14139 -67732 -85969 -53209 37013 136552 145878 151965
10794 151965 74052 116222 109447 16711 -33438 -11867 33580 57100 -40896 -71712 -316558
10783 -316558 -306525 -285787 -307050 -197022 29640 148128 151203 -677 -10125 20372 31118
10772 31118 123934 76765 49083 20019 -141870 -142116 -29254 7744 -4183 -62710 -76043 -89198
10760 -89198 -63881 -24031 -177554 -283340 -205622 -172250 -140853 47511 12362 103279 161006
10749 161006 187827 155084 199001 194341 174159 108212 120333 61903 60351 137834 138345 68360
10737 68360 -58341 -30499 135915 280904 246368 168612 36213 -119646 -115537 -48528 19650
10726A9650j72090j08708J34051J87723J12762J16070M0130j21324q2353j0241
10716A15670l1973K5371k4428n3452n8717l8587k0129K4809N7864m257J686k0326
10704b6469R4030K1902n9482n7118q2486n3833K9478m6159r816Q7388m4352N0843
10692i6074k3621q0680M8467M5416j8508P5962P7890K2483o153m530J10400K9496
10680A80548p9830p5690K974r2762K2453Q9627J18154O026Q8885j11435j4276
10669A34674O6161P1064J9909j28821j37549J44066J02087m9707j05513N511J05197
10658B27079p2370j30831j79601l6495K42658J12352j9190n2019j80161K295L6586
10647d9697q1051P768J29349P0429J7920P5614k7265J41679m4438j29394j22076
$$ plain form
10726 19650 -152440 -261148 -127097 60626 173388 289458 329588 208264 125911 115670
10716 115670 83697 109068 84640 31188 -27529 -66116 -86245 -61436 -3572 -7829 -6143 -26469
10704 -26469 67561 89463 29981 -27137 -109623 -163456 -133978 -180137 -189953 -102565 -146917 -96074
10692 -96074 -119695 -200375 -151908 -106492 -125000 -49038 28852 51335 45182 40652 151052 180548
10680 180548 100718 25028 28002 -64760 -42307 47320 165474 171500 260385 148950 134674
10669 134674 200835 271899 291808 162987 25438 169504 271591 221884 116371 121882 227079
10658 227079 154709 23878 -155723 -192218 50440 162792 143602 91583 -88578 -86283 -49697
10647 -49697 -130748 -122980 6369 76798 94718 170332 143067 284746 240308 110914 -11162
10636a1162P7578j25549n4845J12284P4310l1072J12989k7476J093m4823j49677
10625f6350j10465j05286R2581Q4239M6350r7146p2973J12811Q6678N7415l8906
10614a1052n2683M1510R8475N2977N4507o5987j22525j20832L7665J3262R341
10603f5342R2261J01964J3542k8306j2925j07964j12947n8218M4068k9643o3183
10592b26693R2633L1710q659j3110N486J6100j6184m9674J63970R5092j12096
10581b1425j4132n1330R1472N8188P2550m5238o5887n2132k5517J56392n6444
10570D6497o5074q9304M2195R9833J82220M1211q2003j31596p1978l7167L4933
10559c0233P0321k2293K7279L3505L1820P8075k0530O6854n3163r3342p4841J7356
$$ plain form
10636 -11162 66416 -59133 -113978 -1694 72616 41544 154533 127057 128150 83327 -66350
10625 -66350 -176815 -282101 -189520 -105281 -58931 -156077 -229050 -116239 -29561 27854 -11052
10614 -11052 -63735 -22225 76250 129227 183734 117747 -4778 -125610 -87945 -74683 -65342
10603 -65342 26919 128883 142425 114119 101194 -6770 -119717 -177935 -133867 -163510 -226693
10592 -226693 -134060 -102350 -111009 -124119 -118633 -102533 -118717 -168391 -4421 90671 -21425
10581 -21425 -35557 -86887 4585 62773 135323 90085 24198 -27934 -53451 102941 46497
10570 46497 -18577 -107881 -65686 34147 216367 257578 175575 43979 -27999 -65166 -30233
10559 -30233 40088 17795 45074 78579 110399 188474 167944 234798 181635 88293 13452 30808
10547C0808j1213m8322j8909J55390P6940j45377r3806m0734n6924n4315R0150
10536a16312J10488l760q6283J03166p1053J68969J59179m6383j4720l4793l337
10525A65161O0920M0162n8766j42557K8824O1056P8837m102j15932K6285n2900
10514H6988J6623l1773r7670N4140J53845N3257j02175j21357l8490n4279R1544
10503A0653N8975j23780K5323J19801m3969j6801Q2352J10613J20521l0970r8968
10492B13750q0618r2376j10312K3347K03808O0769p9143J2387J0075O3498m3179
10481A82006r6355j4353j08523P6689J47244l2057j47753J5739o9873Q4409O6740
10470A03913Q3419O0507O1068l4148m3743L9975k9900L0820j00940p7643Q7763
$$ plain form
10547 30808 19595 -28727 -47636 107754 184694 39317 -54489 -95223 -152147 -206462 -116312
10536 -116312 -5824 -9584 -95867 7299 -63754 105215 264394 218011 203291 168498 165161
10525 165161 226081 266243 207477 64920 93744 154800 233637 229535 113603 139888 86988
10514 86988 103611 71838 -25832 28308 182153 235410 133235 11878 -26612 -80891 10653
10503 10653 69628 -54152 -28829 90972 47003 30202 112554 223167 343688 312718 213750
10492 213750 133132 40756 -69556 -46209 157599 218368 139225 151612 161687 225185 182006
10481 182006 85651 71298 -37225 39464 186708 154651 6898 22637 -47236 37173 103913
10470 103913 187332 247839 308907 274759 231016 270991 241091 271911 170971 93328 181091
10459A81091J07448K7167l4009m0125q7004p4963J9509j0107n1859j4703P4080
10448I6525R1384j3724j05813j16308Q896J5183N1620l5181Q396M8471N7430r5107
10436A1772K0825N5603q3427p6419O5181m2711j23020J19389J14789j32479J42606
10425G2109n0084j35941N4419J72344J03143p8294n9719p0774k3329M766Q9969
10414G8609k5013J1537o0920j11081R6587Q9119K2148N6516l8879j9325R562j5615
10402I3245P450N7257N5427Q4473N6120n8087Q653j08742l5136q177o0490k6228
10390F5765j08962q5793P2689N2185K5482N8203m6994r2772L0867J04268K1514
10379I6452j7712R612k9827p7484Q8277K4862o2978j0853l4437J20164P7288j80969
$$ plain form
10459 181091 288539 315706 281697 241572 154568 79605 99114 89007 37148 22445 96525
10448 96525 187909 174185 68372 -47936 -39040 -23857 27763 -7418 978 49449 106879 11772
10436 11772 32597 88200 4773 -71646 -6465 -49176 -172196 -52807 61982 -70497 72109
10425 72109 22025 -113916 -59497 112847 215990 137696 77977 7203 -16126 -11360 78609
10414 78609 53596 65133 4213 -106868 -10281 78838 100986 157502 118623 99298 108860 93245
10402 93245 100695 157952 213379 297852 353972 295885 304538 195796 160660 152483 91993 65765
10390 65765 -43197 -128990 -56301 -4116 21366 79569 32575 -60197 -29330 74938 96452
10379 96452 78740 88352 58525 -18959 69318 94180 31202 20349 -14088 106076 183364 2395
10367B395p8863J26396L4657m794O3908p7864l540Q0886R6070O0341r7124j1461
10355A91007q4877o9713m309J74712Q0421R560J95100j0270k10881j82391r9461
10344a1102J4471P1270M9648j3351L6K4090J25972n3636j57269n8176K325l1981
10332c7703L4428J65276l5134j0190M5360M6638N1453O359j50229r7786n0671
10321c2199j7134R7202N9333O7292q7532J3105R6764R3353j5172j06453o8437
10310A00122n8516o5411p8491J10585M4367M4276j4903L6956j7594m4951M0487
10299I6927q0945j24208P0320P3102p8210Q0387P666P2299J06345N0478M3934
10288C18095j61366p0666q1593n675Q451P8252P6873n0871l7273l4262m2949n8393
$$ plain form
10367 2395 -76468 49928 84585 79791 143699 65835 62295 143181 239251 299592 202468 191007
10355 191007 106130 36417 32108 206820 287241 296801 491901 481631 270750 88359 -11102
10344 -11102 3369 74639 124287 110936 110972 135062 261034 207398 50129 -8047 -5722 -37703
10332 -37703 -3275 162001 126867 116677 162037 208675 260128 266487 116258 18472 -32199
10321 -32199 -49333 47869 107202 174494 86962 100067 196831 290184 275012 168559 100122
10310 100122 41606 -23805 -102296 8289 52656 96932 82029 118985 101391 56440 96927
10299 96927 15982 -108226 -37906 35196 -43014 37373 45039 117338 223683 274161 318095
10288 318095 156729 86063 4470 -1205 7246 85498 162371 111500 74227 39965 -2984 -61377
10276f1377m4476L2291j4272k3301O0750O4045l2361N4082M530P894Q6141o69
10264A33277J10472l8559j11150k4595m8061O3268Q734r6870p5463N3743M6286
10253B1082q8978O9186M1262R2678l7436p9542J17216Q7909m1351M4558p93M6654
10241B72445k363m5338o3492q1724k5030R7485J3079n1110m3583j31740n9259
10230a20630k7858J13282J58204Q1920m2755J4191n1186J3081l6857Q0713J7761
10219A99866j56497k7949R1570m8536p3890R286M4257R7388K9272r7507Q741K8691
10207A04692l4095o4551j8380P2147J50439K1636q6534J2203j3236N7198J9191
10196B20710j00612o9138k8790r098R1847L16388K43424k7819j06682j12347j13758
$$ plain form
10276 -61377 -105853 -73562 -87834 -111135 -50385 13660 -18701 35381 39911 47805 133946 133277
10264 133277 243749 205190 94040 69445 21384 84652 93386 -3484 -78947 -25204 21082
10253 21082 -67896 1290 42552 135230 97794 18252 135468 223377 182026 226584 225791 272445
10241 272445 270082 224744 161252 79528 54498 151983 165062 113952 70369 -61371 -120630
10230 -120630 -148488 -35206 122998 204918 162163 176354 125168 138249 101392 182105 199866
10219 199866 43369 15420 106990 58454 -15436 -6150 38107 135495 164767 67260 76001 104692
10207 104692 70597 6046 -12334 59813 210252 231888 145354 157557 144321 201519 220710
10196 220710 120098 50960 22170 13072 104919 421307 664731 636912 530230 417883 304125
10185C04125O2458j26680p7908k6798Q2458M7284n522j5201m1019K721j6423J13349
10173C02844m2355K17M1420J7659J1972n845l9746p9847o1120M809r1995J7405
10161G5418m0958m7893J8061q27q5761L2521J07952P5488K7798r0968j83683m9515
10149a62367J31850P8810P9151O7821L5415j1023j53495m4586R8292j02535l5682
10138a8349K0428m4510o0250J17354J06127p3744O2341J5245L1136p2348q0956
10127B474m0133J20916P5500m8782k4593l4229o686o1592o2622j4569P8895K2390
10115F969k0430J11286J04889o9178l1175q1694j1273q0490O0917J44806P557
10104A42184k0239j0897L5443J03252J02520q0510o9619o836k4498j6502n9199
$$ plain form
10185 304125 366583 239903 161995 135197 217655 264939 259417 244216 203197 205918 189495 302844
10173 302844 260489 260706 302126 319785 331757 325912 286166 206319 145199 150008 58013 75418
10161 75418 34460 -13433 4628 3801 -81960 -49439 58513 134001 161799 70831 -112852 -162367
10149 -162367 -30517 48293 127444 195265 230680 219657 66162 21576 119868 17333 -18349
10138 -18349 2079 -42431 -102681 14673 120800 47056 109397 124642 155778 83430 2474
10127 2474 -37659 83257 158757 109975 85382 51153 44467 -17125 -79747 -94316 -15421 6969
10115 6969 -13461 97825 202714 133536 102361 20667 9394 -71096 -10179 134627 142184
10104 142184 121945 111048 146491 249743 352263 271753 202134 195298 170800 154298 95099
10093I5099p1727J0956J08592J28625R720l6101K8839l2369L1818j2242r4358
10082A66852j5668j8378o9727O1513J22848j227P9418M4482j63932j05992O0335
10071A60524O701O3319J57838J47095O9052r4841l6119P7682J30663J10008M5918
10060H37840J07627J83492K86531M51145O00623J058953J909412L377093N597014
10051A4409730Q159966Q524592M156186k055802m685292k201525k540453o437796
10043A7329606o304892l901133k170285j256140p61411l53742l41785l70153k68192
10034A601873j16632j31464j80269o2452J32206k0956j74776j27942J6434j87287
10024G48735q9174n5996o4688p6093L7501L6436Q8003O0900k2495p9574q1673
$$ plain form
10093 95099 23372 34328 142920 271545 281265 245164 274003 241634 273452 261210 166852
10082 166852 151184 132806 63079 124592 247440 246213 325631 370113 206181 100189 160524
10071 160524 167225 230544 388382 535477 604529 509688 473569 551251 681914 791922 837840
10060 837840 945467 1128959 1415490 1866635 2467258 3526211 5435623 8812716 14409730
10051 14409730 22569696 31094288 35250474 33194672 28509380 26307855 23767402 17329606
10043 17329606 11024714 7123581 4953296 3697156 2935745 2582003 2240218 1870065 1601873
10034 1601873 1485241 1353777 1173508 1111056 1243262 1222306 1047530 919588 936022 748735
10024 748735 659561 603565 538877 462784 500285 536721 624724 685624 663129 583555 501882
10013E01882N3312J64519R864j03618q2550M8180l759K6588L0948j34288k41680
10002B69398r1031O2953J04152R954K221j2559l777j23602j2856L3802J6212J2316
9990B67183M0718J42183j9665j8544J269j54549j84528O067Q417m6708R944j04737
9978e2950j33778K8587m3471N8772K03296J36634Q4097r2525j26410j26344m925
9967f9017J45777J16430N873k2209j02373J7284M2819J40121J47913O2272j33670
9956C51220K7124j18996j48071n8498L8681P0421k244k9828r6787m2926K689R3662
9944H6447j30410j5532J36300J14181O7133j69248j37179l9063n1284Q9794Q0599
9933C1738l3155L8647O0175n941k4710J3514P4277p099j57254k5795J24971R8366
$$ plain form
10013 501882 555194 719713 729577 625959 543409 591589 587830 614418 645366 511078 269398
10002 269398 178367 241320 345472 355426 357647 345088 341311 217709 204853 238655 254867 267183
9990 267183 307901 450084 430419 411875 413144 258595 74067 80134 88551 41843 51787 -52950
9978 -52950 -186728 -158141 -201612 -142840 60456 197090 281187 188662 62252 -64092 -69017
9967 -69017 76760 193190 199063 176854 74481 91765 134584 274705 422618 484890 351220
9956 351220 378344 259348 111277 52779 91460 161881 159637 129809 33022 -9904 -7215 86447
9944 86447 -43963 -59495 76805 190986 258119 88871 -48308 -87371 -138655 -48861 31738
9933 31738 -1417 37230 97405 91464 66754 80268 154545 147446 -9808 -35603 89368 187734
9921A87734m3336J03185M5998N2455o8556j63818M7746J9377j6315j06331K6975
9910H5114m7261j49185K266M78j40455K0931J15662L0057Q9602M7352K1828k3776
9898E2613J30503J49429N2179m4113j23074n4953j7522N3552L0441N238K6647
9887B60940o2211j46020l9713k4527J744K8976R6L9193L3550o1544K1966J0291
9875F2741j39259Q0868m019m3227l1653L9506M8459J4168L4198p1493l6719p71
9863d7201L6911L6036J61908k7586j31736q3840o139P3204l6329N6592J23325
9852A55145R2936m5613j9247r1370J495r8130j2343O7595J29849K6891p8334M8596
9840A77470n947j89717k7379l8024K532K7817Q2930j6226k0337Q8867O409J7385
$$ plain form
9921 187734 144398 247583 293581 346036 277480 113662 161408 180785 164470 58139 85114
9910 85114 37853 -111332 -109066 -108588 -249043 -228112 -112450 -82393 7209 54561 76389 52613
9898 52613 183116 332545 384724 340611 217537 162584 145062 198614 229055 234293 260940
9887 260940 198729 52709 12996 -11531 -9787 19189 19285 58478 92028 30484 52450 62741
9875 62741 -76518 4350 331 -42896 -74549 -35043 13416 27584 61782 -9711 -46430 -47201
9863 -47201 -10290 25746 187654 160068 28332 -55508 -61647 11557 -24772 31820 155145
9852 155145 248081 202468 183221 91851 93346 -4784 -17127 50468 180317 207208 128874 177470
9840 177470 171523 -18194 -45573 -83597 -81065 -53248 29682 13456 -6881 81986 88395 105780
9828A05780O2384Q7998j03141k4426L3671p1152K6717M4473j15600j19651m3159
9817a16106j07694N1015J01950K7239o3562k9725Q7269j8257J40570R8496l2159
9806A39036p2093l0498r906J53813M230q1938o3674J09145K4100m3661N9308n6812
9794A31050o7615O2883J3401K9504p40r8452r620l4469O0346M1759O6102m9135
9782A45014n3388l9312Q4580Q5018r7029j35193K4694M7856P3626Q2434l051p3672
9770A41577m3467M5528N5618p0199j1517o5493o2884j2425N0532l7789K5936p2495
9758e7078m143O9573j3536n7610l0621L1497N15J1781m8097k8082n7726L2963
9746a50564P5108J05547M6880l15O5400k6345j33916m8380R7606k734o4472K6053
$$ plain form
9828 105780 168164 256162 153021 128595 162266 91114 117831 162304 46704 -72947 -116106
9817 -116106 -223800 -172785 -70835 -43596 -107158 -136883 -49614 -67871 72699 171195 139036
9806 139036 66943 36445 26539 180352 184582 102644 38970 148115 172215 128554 187862 131050
9794 131050 63435 126318 139719 169223 168483 70031 60411 25942 86288 128047 194149 145014
9782 145014 91626 52314 136894 221912 124883 -10310 14384 62240 135866 218300 215249 141577
9770 141577 98110 143638 199256 129057 117540 52047 -10837 -23262 27270 -10519 15417 -57078
9758 -57078 -61221 8352 -5184 -62794 -93415 -61918 -61403 -49622 -97719 -125801 -183527 -150564
9746 -150564 -75456 30091 76971 76656 142056 115711 -18205 -66585 31021 28287 -36185 -10132
9734a0132O1937J7402M3223n0263n4661J32101R6664p7822o7739r121j7742J511
9722F5358j24453k6498J7612J14887K0657M4621K8834j04185j07068k9463Q6217
9711a3481J9985N937L1534K5525r5364j25954R8766R7471J7815R3598N048q7363
9699G3517J0166Q5219P1026k1242l7863O1105l3421p5994N9126k8682r6483k0075
9687D6399p3859R1168J19158j5288j96808L910O2608j3288q5539j287P8744l3355
9675a7437o7365o1951O5093J30136K13660l1426k10989r0088L109K3325m4582
9664h8515R8476J66585M6805q9763L5374r2429o3740j9378K8n6848L5897J16143
9652H8635N5036L0969k8407l5340o255p1163L2755K613r3254m698J36061L3035
$$ plain form
9734 -10132 51805 69207 112430 62167 7506 139607 236271 158449 90710 81589 63847 65358
9722 65358 -59095 -85593 -67981 46906 67563 112184 141018 36833 -70235 -99698 -13481
9711 -13481 6504 12441 43975 69500 -25864 -151818 -53052 44419 62234 155832 160880 73517
9699 73517 83683 168902 239928 218686 180823 241928 208507 132513 191639 162957 66474 46399
9687 46399 -27460 63708 182866 167578 -29230 -25320 37288 24000 -61539 -62826 15918 -17437
9675 -17437 -84802 -146753 -81660 48476 262136 230710 19721 -70367 -67258 -43933 -88515
9664 -88515 9961 176546 223351 133588 168962 76533 12793 -6585 -6557 -63405 -27508 88635
9652 88635 143671 174640 146233 110893 104638 33475 66230 68843 -24411 -29109 106952 139987
9640A39987Q6616j9755q7682p4339P3935L8761L1708O266n2426L1973l913K1389
9628A92520j7709n2557j2979j55858L4014J51936O2659q7790J532J1793j02976
9617B4585q542M5526o8417n2406M7798J35242M7751R117j04743J1849L6181j7883
9605A06058p7734k4296J26288O7489l6114o1883J132l7423m8361q0836j6691R721
9593g2650R4418J4633l1543M2146N588p0368J8079o8981l9307J05232J31394j28929
9581b88J6280M7549p0694k6330q3634N8347J07123O3441m9845n4782L029k9555
9569a9359l4946J9444R3730j6484r0209Q889m449k4460O070O1792k2726n5398
9557g8106J20555l1711J14729Q1637J0858n4840n964l8867r1792R2013J72537
$$ plain form
9640 139987 226603 206848 119166 44827 118762 157523 189231 195497 143071 175044 171131 192520
9628 192520 174811 122254 109275 -46583 -12569 139367 202026 114236 115768 127561 24585
9617 24585 16043 61569 -6848 -59254 -11456 123786 171537 180654 75911 87760 123941 106058
9605 106058 28324 4028 130316 197805 161691 99808 100940 63517 15156 -65680 -82371 -72650
9593 -72650 21768 36401 4858 47004 52592 -17776 303 -68678 -107985 -2753 128641 -288
9581 -288 15992 63541 -7153 -33483 -117117 -58770 48353 111794 61949 7167 10196 -19359
9569 -19359 -54305 -34861 58869 42385 -47824 -38935 -43384 -67844 -61774 18 -22708 -78106
9557 -78106 42449 10738 125467 207104 217962 163122 157158 118291 26499 118512 291049
9546B91049o522m0276j3064o8180M8448L2165R694l0076k4640o409O4230l2672
9534B23747L5517n5299n0984k358P2886p6788o1698j9189m7021r0735l4552j1208
9522a17682J18446P1247k531k7917R4377k7315j04929r823M6378N51j7770L4984
9510E8016P9285j1243O8883m1903l6169k7866k2882P2056J8187j04436O3452N1920
9498A67300o122p4131l6596j23052L4775J62873O1588l6887l4084K6848J01437
9487B43949j14246m0067J39031m4015j12679j3786R1494m8465j0170J10044r4764
9476A06326R1217n9127j98446N801R2207J5097M1487K4043j68401K2902Q439J72643
9464A54188J04399j42663j28648J24660P7976m42n5953j77630q322O0770M6498
$$ plain form
9546 291049 284527 244251 231187 163007 211455 243620 253314 223238 198598 192189 256419 223747
9534 223747 259264 203965 152981 150623 223509 146721 85023 65834 18813 -71922 -106474 -117682
9522 -117682 764 72011 69480 41563 135940 108625 3696 -6127 40251 40802 23032 58016
9510 58016 137301 126058 194941 153038 116869 89003 66121 138177 156364 51928 115380 167300
9498 167300 161178 87047 50451 -72601 -37826 125047 186635 149748 115664 142512 243949
9487 243949 129703 89636 228667 184652 71973 58187 149681 101216 91046 201090 106326
9476 106326 197543 138416 -60030 -54229 37978 53075 94562 118605 -49796 -26894 -18455 154188
9464 154188 258587 115924 -12724 111936 189912 189470 133517 -44113 -52435 8335 54833
9453E4833J111N0240r2627j5784J06737o6127p993Q6806M0914L5069q2468n2995
9441E7716k7710L7058o841j8491L4376J1330n0924p747J10602J17365r7159m9184
9429A10391l1563j6156o8340o7593O129L8663J69805J03170k165k4715J4561L8924
9417B71111L8912P8417p3030j01069k8638J8179l0290l5119j30271L0465M826
9406D3493M5746R312n5235r1271O8163P9171K0618j3331o0919m7968j0297M9256
9394C6738L7202Q727M2657Q7231q7398J9033K6010P9165p553j47375j2637M7452
9382A29252O8547J2390n1049M652M0824j4948j15349r2504j07978M6492J27990
9371D8319N8443l8405K8939p2469K8464R3091k3047q2783O739O5867J5906j3887
$$ plain form
9453 54833 55944 106184 13557 -2227 104510 38383 30390 117196 158110 193179 110711 57716
9441 57716 30006 67064 60223 41732 76108 87438 36514 28767 139369 256734 159575 110391
9429 110391 78828 62672 -5668 -73261 -67132 -28469 141336 244506 242341 217626 232187 271111
9417 271111 310023 388440 315410 214341 185703 203882 173592 138473 8202 38667 43493
9406 43493 89239 98551 43316 -47955 20208 99379 119997 106666 45747 -2221 -12518 36738
9394 36738 73940 82667 125324 212555 125157 144190 170200 249365 241812 94437 81800 129252
9382 129252 197799 210189 159140 163792 204616 189668 74319 -18185 -126163 -79671 48319
9371 48319 106762 68357 97296 24827 53291 146382 123335 40552 47291 113158 129064 115177
9359A15177N9782J0733j41903J40913R7243q9424j56288o239j331K3173P278J7808
9347G6922O79J5716o170p0717n6906K9819P333J26925l3164J02071n328q7089
9335A00091n1260M1195K4578j6460r908q6811q7165O1013M4150M7327o164m6795
9323A3791L6223p1521j00957R5391P1942N9961P8471R3073j5213j43156M594k2575
9311A00024K1665K2952j9510j17530o599R2564R360m3094j3514P4954j3596j5608
9299I2068o0515J3584J06757J949j1319j8493P9632o7758O3761J04366j65783
9288A38249k5740j1513J06917k3909j24969M6717n9696O1985P3992N7332l4892
9277B04473J5995J8712J0812K1610j0487m1325M5173m0930m3304n8672L8557N5085
$$ plain form
9359 115177 174959 185692 43789 184702 281945 192521 36233 29994 28663 51836 59114 76922
9347 76922 77601 93317 87147 16430 -40476 -10657 -3324 123601 90437 192508 187180 100091
9335 100091 48831 90026 114604 98144 88236 1425 -85740 -24727 19423 66750 60586 13791
9323 13791 50014 -21507 -122464 -27073 44869 104830 183301 276374 261161 118005 122599 100024
9311 100024 121689 144641 125131 7601 1002 93566 102926 59832 46318 121272 107676 92068
9299 92068 31553 45137 151894 153843 142524 124031 203663 135905 199666 304032 138249
9288 138249 112509 100996 207913 184004 59035 105752 46056 108041 182033 239365 204473
9277 204473 220468 239180 249992 271602 261115 219790 264963 224033 180729 122057 160614 215699
9265B15699Q3626J12545j58474j02694J9001j2010K5924m5894k1688J20392k7011
9254B09416n2224O4045m2345j05354Q3179P2058j6485Q3444r5785p7686o7789
9243E4474k8087J29498K5961k0954j01819j65R0068N5496L2860j30790j15125
9232h583o2658m4306J39751N9742l035q5003k4500M1053K9315m7816k4279K8592
9220a727J39210J24p2089q2043J09156Q1345l3891o6206J9707K0679J614K0861
9208A36740m8398M6690Q031j1706N4437k0816P3408M864j1830q6956n1624J44778
9196B37618J13964K9908p2323n2826j12962p5882n2069q691M8518M8855J35585
9185B39695L0920j79329p2228k0689k3368j12903L6703J85996K8550N5638l3428
$$ plain form
9265 215699 299325 411870 253396 150702 169703 157693 183617 137723 116035 236427 209416
9254 209416 157192 221237 178892 73538 156717 228775 212290 295734 199949 122263 54474
9243 54474 26387 155885 181846 160892 59073 58908 148976 204472 237332 106542 -8583
9232 -8583 -71241 -115547 24204 83946 80911 -4092 -28592 12461 41776 -6040 -30319 -1727
9220 -1727 137483 137607 65518 -16525 92631 173976 140085 73879 93586 114265 115879 136740
9208 136740 88342 135032 143063 131357 185794 164978 238386 243250 231420 144464 92840 237618
9196 237618 351582 381490 309167 256341 143379 67497 15428 6737 55255 104110 239695
9185 239695 270615 91286 19058 -1631 -24999 -137902 -101199 84797 113347 168985 135557
9174A35557Q5660m7788l3785m4454m5403O3776J07628n5064j79662p2502J24801
9163C8764Q0895k1765k7551O9467L7322q6434j8119L5149Q629l1096M9324R057
9151A43642k4128m9627l5820J21967m5876n3962k1729J355R9706r906m7120L7183
9139A15685J7998P6916K6917j062M6517P985j8170n4736q6617L1982k6218k5881
9127A11316o2571L1936J73529J08387j38766n7399J51130O4058p4575p0133m1548
9116A95364P0008J11535L617j85823q1000q946Q8206K97M7776l7249P8830O5210
9104C47825n6645o0362K6986n2771Q571j3346R998J9739Q4140n1709k7208O1919
9092B97137N0536p0794p8423j42153L2733N0126O1998K5261j2271L3042j19192
$$ plain form
9174 135557 221217 173429 139644 95190 49787 113563 221191 166127 -13535 -86037 38764
9163 38764 119659 97894 70343 139810 177132 90698 72579 107728 116357 85261 134585 143642
9151 143642 119514 69887 34067 156034 110158 56196 34467 35822 135528 125622 78502 115685
9139 115685 133683 210599 237516 236454 282971 290956 272786 218050 131433 163415 137197 111316
9127 111316 48745 80681 254210 362597 223831 166432 317562 381620 307045 236912 195364
9116 195364 265372 376907 380524 194701 113701 104755 192961 193258 241034 203785 282615 347825
9104 347825 291180 230818 257804 205033 213604 200258 210256 229995 314135 262426 235218 297137
9092 297137 347673 276879 198456 56303 89036 139162 201160 226421 214150 247192 128000
9081A28000o7626L5242J09112J22021K4421o2289j9015p3676p5939m5974o2278
9070A1999J7538Q3865p0208L2869J30031l5769j1317J47361l3195o5308j9394
9059A88472n7023j05830L3516R2962l4959l4930L7670O0m3902J22365K8031P086
9047B33518R8315m5232l4255K4930M2246j72074k18223K4269J55954l6199l764
9036F9485M9627N7146j16154J20091J6332J7876Q941o5756l6172Q0287R0912l6734
9024B55881p1982l2771j5682M3590k5214m1643N112l422M7838r2625j17635p357
9012e5910J70676J00595j1600n8850R023p326q5111l0041J29158L5469K3134o9011
9000A50206k8960k0747o1094J413P8317J17313O5693K9865p672J6909N351M7593
$$ plain form
9081 128000 60374 95616 204728 326749 351170 288881 269866 196190 120251 74277 11999
9070 11999 29537 113402 43194 76063 206094 170325 159008 306369 273174 207866 188472
9059 188472 131449 25619 59135 152097 117138 82208 119878 119938 76036 198401 226432 233518
9047 233518 331833 286601 252346 277276 319522 147448 -70775 -46506 109448 73249 69485
9036 69485 119112 176258 60104 180195 196527 214403 223344 157588 121416 201703 292615 255881
9024 255881 183899 151128 135446 179036 153822 112179 117291 113869 161707 69082 -48553 -55910
9012 -55910 114766 215361 203761 144911 153934 146608 61497 31456 160614 196083 219217 150206
9000 150206 121246 100499 39405 40818 119135 236448 302141 332006 324334 341243 346594 394187
8988C94187j28917l4499K7133p6079n0921Q4280J34796q0282m7024k2973q5179
8977A14522n8136l4662l4555k8082j1553M3008J03157P2087n263M4157o7701j03727
8965C3252N5252K13543J40283q0277j52118m0265M255O6950r087n9636J936J62666
8953C36754J9782j04840k6438l6423j8444j2612q269j16571R806J08891p3784
8942G7852q5288J49947K2208Q461j03196j7075k9401m6487l8067m6221N3256J38593
8930H4582Q6804K617j17951P9848J54311O8832L962J18373k02564j33688J0783
8919A55909M8457p6985R230N8320O3945k239N495J16307J85649J38452k2181p0402
8907F09957k28915j29453N7962N5502K8807J6738j33811q0213O6950M9274N5936
$$ plain form
8988 394187 265270 230771 257904 181825 130904 215184 349980 269698 222674 199701 114522
8977 114522 56386 21724 -12831 -40913 -52466 -9458 93699 165786 160523 204680 136979 33252
8965 33252 88504 302047 442330 362053 209935 169670 173925 240875 231788 172152 174088 336754
8953 336754 356536 251696 225258 188835 170391 157779 149510 32939 42745 151636 77852
8942 77852 -7436 142511 164719 173180 69984 52909 23508 -22979 -61046 -107267 -54011 84582
8930 84582 171386 174003 56052 135900 290211 359043 363005 481378 278814 145126 155909
8919 155909 204366 127381 136611 194931 258876 256637 262132 378439 564088 702540 680359 609957
8907 609957 381042 251589 309551 365053 393860 410598 276787 196574 263524 312798 368734
8896C68734r3877j47926j36845j0939J14920J70233N7907j398j09379o9277J30736
8885B72889J2312j9261N729k9819n2844n1077M5988J34010L3724K19206R4550
8874F65407q7562Q6625k519M8441k1135P1321J3239j729j0170J27317J24533K40447
8862A254215L14309K73793L3783j83116r9739k33892k95944j95441l17510q3902
8852D66556q1727j31652k5885K1754K0092l0387n0883M5051N7450J4179k4859
8841B79689r7633j11831j17113L1897P6032N0491J5907q2640k078P2877P1253
8830A86851O0309K164J6397O1693L8012j17219j6609J7630L6050r890j4977N6671
8818C17082j09457o3589P4480O0918k0313j24485l5206l110l1815k2964n9071
$$ plain form
8896 368734 274857 126931 -9914 -20853 94067 264300 322207 320809 211430 142153 272889
8885 272889 285201 265940 271669 241850 189006 137929 183917 317927 351651 570857 665407
8874 665407 577845 664470 661951 710392 689257 760578 773817 772088 761918 889235 1013768 1254215
8862 1254215 1568524 1842317 1876100 1692984 1593245 1359353 1063409 867968 550458 466556
8852 466556 384829 253177 227292 249046 269138 238751 187868 232919 290369 304548 279689
8841 279689 182056 70225 -46888 -14991 61041 111532 127439 44799 42721 115598 186851
8830 186851 247160 249324 265721 327414 365426 248207 231598 249228 285278 275388 260411 317082
8818 317082 207625 144036 218516 279434 259121 134636 99430 96320 64505 41541 -17530
8807a7530K6238J4489R3548k3710j6622r9505J0739p3123R6229Q7509J2125n1078
8795E9309j47496k72P8868J31643N7005j1136p3264j54184l5396R4912Q9260N9301
8783A48550J74229O7820K2615N2166j23943j092n0788J7718n1169j03937M0238
8772A92407M8241Q9906m3715j04785q0361j4194j02118m92J00058P4337n898K195
8760A55581K7093o8374k6037P2215n5658M794j2753k9714o0156J56189P8348Q2324
8748C23852p604K704M5618M5829o9768L5147O2862N7063l7424K307k5955J3109
8736D47740K0083n4710j7423j07904j21812n1366N2419J3548J00356M3161J32014
8725D56106j6349O841K4488Q1614L3429l0202J30381L3183m1191j43672o1699
$$ plain form
8807 -17530 8708 23197 116745 93035 76413 -23092 -12353 -85476 10753 98262 110387 59309
8795 59309 -88187 -88459 -9591 122052 179057 167921 94657 -59527 -94923 -11 89249 148550
8783 148550 322779 390599 413214 465380 341437 340345 289557 307275 256106 152169 192407
8772 192407 240648 330554 286839 182054 101693 87499 -14619 -15111 84947 159284 153386 155581
8760 155581 182674 114300 88263 160478 104820 109614 96861 67147 6991 163180 241528 323852
8748 323852 316248 318952 364570 410399 340631 375778 438640 495703 458279 460586 434631 447740
8736 447740 467823 413113 395690 287786 165974 114608 167027 180575 280931 324092 456106
8725 456106 439757 446598 471086 552700 586129 555927 686308 719491 678300 534628 472929
8714D72929M0708j53260K384M7424m949r0703J2082K9478k2262k666m0874R0994
8702C81285O3139j07850Q0125J37222O4021Q27j3017r2192M5302L0921J03494
8691F93277L4763m5057K9562O1706L6025J45079j58355p6577n8838j1481O7902
8680G18006K8806J47771J33131j8569n6427j6768o6770p7258m0882J01810N8259
8669I11109J7363j02602M283n637k0554n6469k5300j62660P8149Q4296K9510O2816
8657H14304K2084J08291P7289K7235k5308R1134M3721q4693N5799O8486N7093
8646A255435m1650M3167J05083J21936P5989q7016M2797J35391O8622j67658k4788
8635A527308K5274q042j05333Q8970J01030M5448L0173J04863J70052K39689Q492
$$ plain form
8714 472929 513637 360377 362761 410185 405236 314533 326615 356093 333831 331165 290291 381285
8702 381285 444424 336574 416699 553921 617942 618769 605752 513560 558862 589783 693277
8691 693277 728040 682983 712545 774251 810276 955355 797000 720423 661585 650104 718006
8680 718006 746812 894583 1027714 1009145 952718 935950 869180 791922 751040 852850 911109
8669 911109 928472 825870 830153 824516 803962 747493 722193 559533 637682 721978 751488 814304
8657 814304 836388 944679 1021968 1049203 1023895 1115029 1158750 1074057 1129856 1198342 1255435
8646 1255435 1213785 1256952 1362035 1483971 1559960 1472944 1515741 1651132 1719754 1552096 1527308
8635 1527308 1552582 1544540 1439207 1528177 1629207 1674655 1704828 1809691 1979743 2219432 2227924
8624B227924Q0097J07020K76442K28068R3794M3277K2813K02954L19125K47842
8614C849356L1039P1837L6205Q9337O3853j06305j15807J9958o5498j17069r6842
8603C660064p4615q9969j79544j25017n9660q8210j07604o6379N9508N8665J26703
8592C113942k8896j64940j01525j25723k40092k62662j13283k9387k12845k22351
8582A612238k34948j15889n332O5835p4905r5143j24907n4390q4475j19980l9750
8571G28354m4090j00199P1484q101j51893n8655L7236J1125O7935J25372J5952
8560F94520j05283j71534m8478J18155p691K398M0799J10593P8081n2063P6389
8549G35886q2220l18759q8490j845r8434L0535J67563O892J6009Q1810j8321j22888
$$ plain form
8624 2227924 2308021 2415041 2691483 2919551 3013345 3056622 3079435 3282389 3601514 3849356
8614 3849356 3880395 3952232 3988437 4077774 4141627 4035322 3919515 3939473 3873975 3756906 3660064
8603 3660064 3585449 3495480 3315936 3190919 3131259 3043049 2935445 2869066 2928574 2987239 3113942
8592 3113942 3085046 2920106 2818581 2692858 2452766 2190104 2076821 2047434 1834589 1612238
8582 1612238 1377290 1261401 1256069 1321904 1246999 1151856 1026949 972559 888084 768104 728354
8571 728354 684264 584065 655549 647448 495555 436900 474136 485261 553196 678568 694520
8560 694520 589237 417703 369225 487380 479689 482087 522886 633479 711560 659497 735886
8549 735886 653666 334907 246417 244572 146138 176673 344236 351128 367137 448947 430626 307738
8537C07738n5776q085o1595M3640R023J9154n3940j14157P5272R9750J232M9727
8525C11983P208k8995j6310j6284K3309q2474j04847k1809R0966O1760j7504k0230
8513A86773l5962l392L5316p7092N680R8845o7142k5852O3129n357P476M4308
8501B26730J30488n1491j10363J4907R2853L5231m4763m1607K0259L3099J8284
8490C23627J0137j36092K3481n5214j09765m133q453k4005k0060M523J08970L7044
8478A50060Q5080m5914m8774k9811J50649J8784k01647j98329M8336R8151J57236
8467A83821K830j19986O5274J1240n2862J19675J11231J6432k3218L979L4266
8456C52682O469q1292n5555K5902J48378j2306j85336j97529k1927J03535N5135
$$ plain form
8537 307738 251962 243877 182282 225922 234945 254099 200159 86002 161274 261024 262256 311983
8525 311983 319191 290196 273886 257602 280911 198437 93590 71781 162747 224507 207003 186773
8513 186773 150811 147419 182735 105643 111323 210168 143026 117174 180303 174946 182422 226730
8501 226730 357218 305727 195364 210271 303124 338355 293592 251985 272244 305343 323627
8490 323627 333764 197672 221153 165939 56174 52041 43588 19583 -477 4046 113016 150060
8478 150060 235140 189226 140452 110641 261290 280074 78427 -119902 -71566 26585 183821
8467 183821 186651 66665 131939 143179 90317 209992 321223 337655 314437 318416 352682
8456 352682 359151 277859 222304 248206 396584 384278 198942 1413 -20514 83021 138156
8445A38156J26278J31775P0804r2671j4340m2749o86j0463J2668J62n2420n5003
8433B11511M4866J05573J424o2466q9952O972j0435O1888l356n0369r446J7263
8421B23473M0439J10873J19444O9807P4071m1865m7195K8858m7693J4175k1445
8410E22942N280j02297k00533n1326J2004L1615q2847j05750J10947P2090j0217
8399B01908R5034p4779j39012J3510Q0230M0412J01238K5781j00379j83931j77433
8388a17421L1441P9770M3011J4686K6447M0718J44408J53534q2238P0547J23326
8377E28229K131r1727o500j2616j8094K1006J8451j43692q2344K1724J95144P7440
8365E09152j09305j81294O5345o7379p5593J06036j7839j11475j9982R6160j9597
$$ plain form
8445 138156 264434 396209 467013 374342 360002 317253 316567 306104 318772 318934 266514 211511
8433 211511 256377 361950 363374 300908 210956 217928 207493 269381 266025 215656 206210 223473
8421 223473 263912 374785 494229 564036 638107 596242 549047 577905 530212 544387 522942
8410 522942 528222 425925 225392 174066 186070 217685 134838 29088 140035 212125 201908
8399 201908 296942 222163 83151 96661 176891 217303 318541 344322 243943 60012 -117421
8388 -117421 -85980 -6210 36801 51487 77934 118652 263060 416594 334356 404903 528229
8377 528229 530360 438633 432133 419517 401423 422429 440880 297188 214844 236568 431712 509152
8365 509152 399847 218553 283898 216519 140926 246962 229123 117648 97666 193826 174229
8354A74229q7428m1559j36111j19310J9767J24193J52932n0349Q853R0477O1521
8343A97215J41407m0254j73969L7257R886n5594p6060j8520q4753O4849O4080
8332F5544M172J04675m3362O2933J0984j10481P4138p7620o3347J01219Q4565
8321B13420M27n5027M854l6062m1593j50088J4408J46900L3766j6516R5497o277
8309B03709k31157J01168J06242M5047m3535k657J21884O195L3618L3984j16872
8298B57626j77889j23727M207J29638R6698Q2732M0365K6569j02922J4987N0125
8287B98409m1306l8513o7519Q4508J87354p1220n7596K1464M709j13728N8258
8276B64820J2163j82092N0716O1861r5810L4768Q7540J7664m4048o7208M7901
$$ plain form
8354 174229 86801 45242 -90869 -210179 -190412 -66219 86713 36364 45217 135694 197215
8343 197215 338622 298368 124399 161656 171542 115948 39888 21368 -63385 1464 65544
8332 65544 69716 174391 131029 193962 204946 94465 168603 90983 27636 128855 213420
8321 213420 213847 158820 163674 127612 86019 -64069 -49661 97239 131005 114489 209986 203709
8309 203709 -27448 73720 179962 225009 181474 178817 300701 306896 340514 374498 257626
8298 257626 79737 -43990 -39783 89855 186553 269285 309650 336219 233297 248284 298409
8287 298409 257103 218590 151071 235579 422933 351713 294117 315581 320290 206562 264820
8276 264820 276983 94891 145607 207468 111658 146426 233966 251630 207582 140374 188275
8265A88275J5217j7137j09311M2016o0930o3542k7482l4537K2113L9729j3222
8254a8811P1616l5855K1716M8410L5702o0152P5606K5622k0860N8970n2310m7784
8242A01870J5070n859j08928o6798m0585L0333J04197J02047j979o5371j3950
8231E0047m7353j0285k16M7943l0507l7937L6719M6575N5719K6883l3j49660l6846
8218d8951n0286l9672O7987O9237N4087j46316j13064J9454Q5979L8340M4441
8207a8764O3230K0160K1629n584Q6951O9449J08095N9562Q9500o3526j40262m5830
8195B44610n6007m4372j05228p0140k5036N1176J26057O3619m8911j62760j18710
8184a45702M5600J34619m862J8876J47078N9519J1340o0556j32380r9077l3142
$$ plain form
8265 188275 203492 186355 77044 119060 58130 -5412 -32894 -67431 -45318 -5589 -18811
8254 -18811 52805 16950 38666 87076 122778 62626 138232 163854 142994 201964 149654 101870
8242 101870 116940 111081 2153 -64645 -105230 -74897 29300 131347 129368 63997 50047
8231 50047 2694 -7591 -7807 40136 9629 -28308 8411 54986 110705 137588 137555 -12105 -48951
8218 -48951 -99237 -138909 -70922 -1685 52402 -93914 -206978 -187524 -101545 -63205 -18764
8207 -18764 44466 64626 86255 80671 167622 237071 345166 404728 494228 430702 290440 244610
8195 244610 188603 144231 39003 -31137 -56173 -4997 121060 184679 135768 -26992 -145702
8184 -145702 -100102 34517 29655 48531 195609 255128 266468 205912 73532 -25545 -58687
8173e8687J08468n8185j07868N8032N8266P5768l7990J0751n9627n7075M0658
8162b7489R1379R6300n8534L6907J56168J45127J15953K51290K11194j9482r6317
$$ plain form
8173 -58687 49781 -8404 -116272 -58240 26 75794 37804 48555 -11072 -68147 -27489
8162 -27489 63890 160190 101656 138563 294731 439858 555811 807101 1018295 998813 902496
$$ [...]
##END NTUPLES=NMR SPECTRUM
##END=
