##TITLE=Analysis number 323182
Compound Code cc 02005
Book Reference 496/70/4
Project Code adrs
Chemist Name anns
##JCAMPDX= 6.0         $$ Bruker NMR JCAMP-DX V2.0
##DATA TYPE= NMR SPECTRUM
##DATA CLASS= NTUPLES
##ORIGIN= Bruker BioSpin GmbH
##OWNER= nmr
$$ XWIN-NMR		Version 3.5
$$ Wed Oct 18 10:08:03 2006 GMT Daylight Time (UT+1h)  MAYBRIDGE\nmr@NMR_250MHZ
##.OBSERVE FREQUENCY= 250.131544655141
##.OBSERVE NUCLEUS= ^1H
##.ACQUISITION MODE= SIMULTANEOUS (DQD)
##.ACQUISITION SCHEME= undefined
##.AVERAGES= 16
##.DIGITISER RES= 18
##SPECTROMETER/DATA SYSTEM= dpx250
##.PULSE SEQUENCE= zg30
##.SOLVENT NAME= CDCl3
##.SHIFT REFERENCE= (INTERNAL, CDCl3, 0, 16.522)
##AUDIT TRAIL= $$ (NUMBER, WHEN, WHO, WHERE, WHAT)
$$ ##TITLE= Audit trail, XWIN-NMR		Version 3.5
$$ ##JCAMPDX= 5.01
$$ ##ORIGIN= Bruker BioSpin GmbH
$$ ##OWNER= nmr
$$ C:\u/data/dgb/nmr/ADRS/870/pdata/1/auditp.txt
$$ ##AUDIT TRAIL=  $$ (NUMBER, WHEN, WHO, WHERE, WHAT)
(   1,<2006-10-18 10:07:41.41 +100>,<MAYBRIDGE\nmr>,<NMR_250MHZ>,
      <created by zg, POWCHK disabled, PULCHK disabled
       configuration hash MD5:
       49 4B E0 1D 92 C2 6B 37 9F E6 65 BC 52 41 86 1D
       data hash MD5: 64K
       F8 EB 75 B6 7B 08 46 9A 35 D1 7B CA 6A E8 DF C0>)
(   2,<2006-10-18 10:07:53.02 +100>,<MAYBRIDGE\nmr>,<NMR_250MHZ>,
      <Start of raw data processing
       ef LB = 0.3 FT_mod = 6 PKNL = 1 SI = 32K 
       data hash MD5: 32K
       0B 9C 56 D8 54 44 91 6E C9 B5 2C 54 4E BC FF 12>)
(   3,<2006-10-18 10:07:54.77 +100>,<MAYBRIDGE\nmr>,<NMR_250MHZ>,
      <apk 
       data hash MD5: 32K
       1E 1E 19 6F 3E 80 F7 48 4F FB 5E 07 5D 4A E7 A5>)
(   4,<2006-10-18 10:07:55.56 +100>,<MAYBRIDGE\nmr>,<NMR_250MHZ>,
      <abs ABSG = 5 
       data hash MD5: 32K
       44 F9 10 4D 69 60 5B 4A AB 65 A9 93 4E 89 FF 29>)
$$ ##END=
$$ 
$$ hash MD5
$$ 2A AE F1 C5 91 9A 4B 87 3A EB 4C 60 06 EE 50 A1
##$RELAX= 
##$RELAX= 
##$RELAX= 
##$RELAX= 
##$RELAX= 
##$RELAX= 
##$RELAX= 
$$ Bruker specific parameters
$$ --------------------------
##$DU= <C:\u>
##$EXPNO= 870
##$NAME= <ADRS>
##$PROCNO= 1
##$TYPE= <nmr>
##$USER= <dgb>
##$AMP= (0..31)
100 100 100 100 100 100 100 100 100 100 100 100 100 100 100 100 100 100 
100 100 100 100 100 100 100 100 100 100 100 100 100 100 
##$AQSEQ= 0
##$AQ_mod= 3
##$AUNM= <au_zg>
##$AUTOPOS= <5 >
##$BF1= 250.13
##$BF2= 250.13
##$BF3= 250.13
##$BF4= 250.13
##$BF5= 500.13
##$BF6= 500.13
##$BF7= 500.13
##$BF8= 500.13
##$BYTORDA= 1
##$CFDGTYP= 0
##$CFRGTYP= 5
##$CHEMSTR= <none>
##$CNST= (0..31)
1 1 145 1 1 1 1 1 1 1 1 1 1 1 1 1 1 1 1 1 1 1 1 1 1 1 1 1 1 1 1 1 
##$CPDPRG= <>
##$CPDPRG1= <>
##$CPDPRG2= <>
##$CPDPRG3= <>
##$CPDPRG4= <mlev>
##$CPDPRG5= <mlev>
##$CPDPRG6= <mlev>
##$CPDPRG7= <mlev>
##$CPDPRG8= <mlev>
##$CPDPRGB= <>
##$CPDPRGT= <>
##$D= (0..31)
0 1 0 0 0 0 0 0 0 0.06 0 0 0 0 0 0 0.0002 0 0 0 0 0 0 0 0 0 0 0 0 0 0 
0 
##$DATE= 1161162460
##$DBL= (0..7)
120 120 120 120 120 120 120 120 
##$DBP= (0..7)
150 150 150 150 150 150 150 150 
##$DBP07= 0
##$DBPNAM0= <>
##$DBPNAM1= <>
$$ [...]
##$SUBNAM7= <"">
##$SUBNAM8= <"">
##$SUBNAM9= <"">
##$SW= 20.6930455092707
##$SWIBOX= (0..15)
0 0 3 0 0 0 0 0 0 0 0 0 0 0 0 0 
##$SW_h= 5175.983436853
##$TD= 65536
##$TD0= 1
##$TE= 683.16
##$TE2= 300
##$TE3= 300
##$TEG= 300
##$TL= (0..7)
0 120 120 120 120 120 120 120 
##$TP= (0..7)
150 150 150 150 150 150 150 150 
##$TP07= 0
##$TPNAME0= <>
##$TPNAME1= <>
##$TPNAME2= <>
##$TPNAME3= <>
##$TPNAME4= <>
##$TPNAME5= <>
##$TPNAME6= <>
##$TPNAME7= <>
##$TPOAL= (0..7)
0.5 0.5 0.5 0.5 0.5 0.5 0.5 0.5 
##$TPOFFS= (0..7)
0 0 0 0 0 0 0 0 
##$TUNHIN= 0
##$TUNHOUT= 0
##$TUNXOUT= 0
##$USERA1= <user>
##$USERA2= <user>
##$USERA3= <user>
##$USERA4= <user>
##$USERA5= <user>
##$V9= 5
##$VALIST= <valist>
##$VCLIST= <CCCCCCCCCCCCCCC>
##$VD= 0
##$VDLIST= <DDDDDDDDDDDDDDD>
##$VPLIST= <PPPPPPPPPPPPPPP>
##$VTLIST= <TTTTTTTTTTTTTTT>
##$WBST= 1024
##$WBSW= 4
##$XGAIN= (0..3)
0 0 0 0 
##$XL= 0
##$YL= 0
##$YMAX_a= 540868
##$YMIN_a= -419369
##$ZGOPTNS= <>
##$ZL1= 120
##$ZL2= 120
##$ZL3= 120
##$ZL4= 120
##$ABSF1= 16.522
##$ABSF2= -4.171173
##$ABSG= 5
##$ABSL= 3
##$ALPHA= 0
##$AQORDER= 0
##$ASSFAC= 0
##$ASSFACI= 0
##$ASSFACX= 0
##$ASSWID= 0
##$AUNMP= <proc_1d>
##$AZFE= 0.1
##$AZFW= 0.1
##$BCFW= 0
##$BC_mod= 0
##$BYTORDP= 0
##$COROFFS= 0
##$CY= 12.5
##$DATMOD= 1
##$DC= 0
##$DFILT= <>
##$DTYPP= 0
##$F1P= 14.0000005364418
##$F2P= -0.99999901652339
##$FCOR= 0.5
##$FTSIZE= 32768
##$FT_mod= 6
##$GAMMA= 0
##$GB= 0
##$INTBC= 1
##$INTSCL= 1
##$ISEN= 128
##$LB= 0.3
##$LEV0= 0
##$LPBIN= 0
##$MAXI= 10000
##$MC2= 0
##$MEAN= 0
##$ME_mod= 0
##$MI= 0
##$NCOEF= 0
##$NC_proc= -2
##$NLEV= 6
##$NOISF1= 0
##$NOISF2= 0
##$NSP= 0
##$NTH_PI= 0
##$NZP= 0
##$OFFSET= 16.522
##$PC= 1
##$PHC0= -49.79221
##$PHC1= 6.441816
##$PH_mod= 1
##$PKNL= yes
##$PPARMOD= 0
##$PSCAL= 4
##$PSIGN= 0
##$REVERSE= no
##$SF= 250.13
##$SI= 32768
##$SIGF1= 0
##$SIGF2= 0
##$SINO= 400
##$SIOLD= 32768
##$SREGLST= <1H.CDCl3>
##$SSB= 0
##$STSI= 32768
##$STSR= 0
##$SW_p= 5175.98343685301
##$SYMM= 0
##$S_DEV= 0
##$TDeff= 65536
##$TDoff= 0
##$TI= <Analysis number 999999
Compound Code 99
Book Reference 9
Project Code 9>
##$TILT= no
##$TM1= 0
##$TM2= 0
##$TOPLEV= 0
##$USERP1= <user>
##$USERP2= <user>
##$USERP3= <user>
##$USERP4= <user>
##$USERP5= <user>
##$WDW= 1
##$XDIM= 32768
##$YMAX_p= 312212662
##$YMIN_p= -262869
$$ End of Bruker specific parameters
$$ ---------------------------------
##NTUPLES= NMR SPECTRUM
##VAR_NAME=  FREQUENCY,     SPECTRUM/REAL,   SPECTRUM/IMAG
##SYMBOL=    X,             R,               I
##VAR_TYPE=  INDEPENDENT,   DEPENDENT,       DEPENDENT
##VAR_FORM=  AFFN,          ASDF,            ASDF
##VAR_DIM=   32768,         32768,           32768
##UNITS=     HZ,            ARBITRARY UNITS, ARBITRARY UNITS
##FACTOR=    0.157963299565203, 1,           1
##FIRST=     4132.6476996994, 0,             0
##LAST=      -1043.33573715361, 0,           0
##MIN=       -1043.33573715361, -262869,     0
##MAX=       4132.6476996994, 312212662,     0
$$ Real data points
##PAGE= N=1
##DATA TABLE= (X++(R..R)), XYDATA
$$ [...]
24259 13000 18511 22759 15913 14638 17180 21455 27909 31707 26717 18412 224 -12359 1585 -1402
24245 -1402 2660 15897 16730 19395 12617 8538 10545 21039 24535 27359 26292 18362 2131 -19388
24231 -19388 -26218 -9063 6942 -3596 -6884 -3297 -12698 -14996 -9616 11557 14777 11559 4496
24218 4496 -8061 -11990 -8951 -7556 -6409 -4283 5304 7060 12186 -320 -2337 -13353 -20755 -6875
24204 -6875 -14397 -3928 17146 11224 6697 -4375 2318 4073 13119 5736 -13121 -8111 -6208 -10809
24190 -10809 -13624 -10468 -173 7587 -635 -12019 -815 10560 27983 31485 27701 25035 22753
24177 22753 18881 14657 68 -24969 -18746 3363 10527 18381 11181 2342 -10606 -26183 -20807
24164 -20807 -12204 -21032 -3541 25852 35202 21177 11864 885 -2452 -11801 -19882 -17233 -15565
24151 -15565 -15690 -16098 -15053 -27917 -31128 -25477 -8496 -1379 -1170 7469 -610 -10886 -17015 -20894
24137 -20894 -21343 -12602 -23153 -9632 -9584 -14478 -23724 -26264 -17770 7886 6852 -11856 -15705 -1447
24123 -1447 10901 -62 -17877 -11201 10269 9276 18758 37450 25136 9882 9406 6397 -2113
24110 -2113 -8490 -2133 -15253 -17415 -9973 -12944 -11615 -8467 -6598 -5308 -14379 -14299 -353 1737 -7091
24095 -7091 3399 18859 1310 -20380 -17606 8235 12768 3875 -8056 -6337 -15417 -15431 7587
24082 7587 5873 286 8715 8191 -3078 -4490 -6298 -1368 -473 -10265 -14684 -11535 -22765 -24113 -7018
24067 -7018 5819 17784 12132 26671 29209 31189 26389 15281 -3995 -16588 -468 1603 -13024
24054 -13024 -26171 -23400 -13887 -18834 -21530 -11032 -16601 -24196 -11938 2808 14440 21339 15041
24041 15041 11369 -4725 -20507 -20368 -4827 -920 5202 5630 5062 -1424 -416 15422 7885 -8990
24027 -8990 -41546 -49000 -19486 1960 8008 10345 13224 4055 -1144 8817 5284 -9803 -13303 -27366
24013 -27366 -12196 -13165 7804 6953 2427 171 15566 17491 19585 17209 6219 -4344 -5238 -6364
23999 -6364 -17829 -15691 -9888 -13854 -19990 -14026 -21134 -25485 -12753 149 7249 7577 32 -318
23985 -318 2306 2559 -6135 -13257 -24311 -9170 13100 5908 -321 -10437 -19044 -16146 6305 7260
23971 7260 2264 5313 9174 6858 6427 8154 13629 -1214 6338 16300 7390 11096 7297 1060 -4289
23956 -4289 -698 -4401 -12542 -20849 -19616 -18872 -5680 9085 24182 27300 36160 21294 -10779 -14513
23942 -14513 1919 2814 6704 12817 21493 12894 4662 4167 6440 -6394 -12845 -16628 -11190 -5711
23928 -5711 -8627 -4508 8107 10408 3838 -18167 -33451 -40321 -34804 -14055 10630 25279 18017
23915 18017 -6747 -26896 -39064 -45993 -39221 -24531 -18807 -2882 3648 -3064 2741 -8553 -16698
23902 -16698 -12501 -2587 -10011 -17043 -12775 -3090 -3401 -13798 -12269 4515 31743 26284 14025 5189
23888 5189 8764 -1159 -8211 -4043 20203 15057 13842 16072 -34 -11551 -17854 -30118 -44944
23875 -44944 -29551 432 12976 8506 -4387 -16998 -9740 -21052 -13256 7308 16398 8019 10817
23862 10817 4926 5333 15343 19668 7630 -5059 2217 20560 12944 8106 -13551 -7678 -581
23849 -581 17099 25027 22938 22350 18353 2683 -8217 13777 19453 26156 27947 4045 -24516 -30936
23835 -30936 -12452 14902 -1207 -21093 -32722 -15679 -6591 -5113 -2031 -8183 -18236 -22381 -27004
23822 -27004 -19416 -15006 -2937 2808 -6883 -6594 4685 5129 -9092 -13880 -16534 -14555 -17893 -22612
23808 -22612 -11435 -6344 559 -576 -4176 61 -1422 -4983 -6116 -10077 -1060 1198 -685 -1181
23794 -1181 -6663 -3050 15960 17439 -1009 -2115 -17781 -29935 -28547 -20577 -23093 -12315 -20691
23781 -20691 -20266 -9856 -9029 -5334 823 1965 -3953 -12353 -20772 -34556 -33065 -25059 -22179 -12089
23767 -12089 -14275 -7687 -7222 -6471 -2880 7498 13214 6763 2359 -15912 -12694 -2620 9984 10579
23753 10579 70 -3307 -287 5953 -5055 1635 18500 12690 -4005 5991 27836 20803 8420
23740 8420 -7571 -12154 -12988 -23685 -25560 -27287 -47837 -50906 -37656 -13395 1460 5169 9616
23727 9616 2141 -9957 -23220 -26952 -33717 -33092 -25553 -19129 -4670 16962 7420 -9678 -19084 -19152
23713 -19152 -12598 2652 267 -1411 -1854 -12196 -1716 18045 24242 27027 15489 13976 3239
23700 3239 -21708 -28269 -21555 -10935 -2525 11898 4978 -11775 -13125 -7869 -3486 1245 12135
23687 12135 6608 -2773 -4996 -4158 -4652 -10380 14630 16367 -1200 -6589 12601 22211 4380 1075
23673 1075 -5241 1001 4425 9993 9760 15827 20935 -3105 -6684 -4270 -2104 -12976 -13906 -16328 -14808
23658 -14808 -10904 -10188 -10107 -14384 1482 -12309 -20725 -7736 11768 16696 21472 4042 -4629 -16194
23644 -16194 -26307 -13989 -7873 4836 8616 10847 8307 8666 25992 18531 -931 -6945 -9444
23631 -9444 -23992 -29480 -18854 -971 11904 13222 24965 17200 12143 1407 -2737 -10722 -19306
23618 -19306 -13095 -17536 -17608 7977 18856 15911 31019 47090 24001 11451 23158 30687 31993
23605 31993 24737 12137 10006 -16702 -12071 -2588 10614 19226 18916 8416 13274 29587 36793
23592 36793 35473 20318 -8987 -6090 -5272 1828 16328 24728 24274 23774 15619 13416 13471 17210 37767
23577 37767 35792 19673 8949 4213 1343 -12653 4475 1265 1839 -12731 -6858 394 -5798
23564 -5798 -12124 -6082 691 15700 9901 -2765 13532 30596 31937 35449 28596 35673 29334 16646
23550 16646 15723 20228 12495 1445 6698 14504 12521 4214 -4078 -10903 -1299 -3459 -3304 -1649 -5820
23535 -5820 -18591 -19650 -3805 11012 -7144 -8509 2870 12510 12597 6083 10573 -3205 -12448 13722
23521 13722 7705 -10397 -8706 -5989 3906 4205 -7167 -6141 -7698 -15626 -8375 2952 -11380 -2315
23507 -2315 -5860 -9215 -3681 -12484 -15715 -10496 -10098 5133 18145 15987 17093 13575 4914 -8593
23493 -8593 -1030 2314 6045 2558 8829 -5421 5572 -1702 -17759 -7504 -15744 -31303 -21694
23480 -21694 -7902 22170 16830 6113 -1215 -7732 -15758 -16679 -14532 4494 3700 -4979 -12980 -6573
23466 -6573 12466 27154 11796 -4858 -6044 -10368 -12319 -5796 900 -4742 -5774 -14053 -13782 -11161
23452 -11161 -7469 -7770 -5560 -15240 -23227 -8332 -8760 -22029 -28487 -35591 -22862 8451 -136 8612
23438 8612 9165 -16720 -31707 -12184 -894 -7833 -12706 -9997 -2867 -2266 -19858 -18808 -11619 248
23424 248 -4492 -24177 -10698 10940 5190 2886 10290 -2230 -4975 -6908 -12046 7907 -9847
23411 -9847 -19314 -17602 -14007 -4370 -6855 5438 8374 19538 15529 23709 22456 15181 21952 26647
23397 26647 31609 17811 7166 -2926 -3796 -2742 -3507 15957 18860 596 3387 8309 6188 -290
23383 -290 10867 20692 15211 26358 33955 28340 4945 -1276 12646 28740 11861 -5623 279
23370 279 206 -12816 -8654 1974 19422 8076 -4112 7732 4270 -9450 -24745 -40234 -46067
23357 -46067 -43417 -28259 -22934 -10872 -15437 -26605 -6635 15150 15847 100 2235 -7704 -12949
23344 -12949 -15872 -19403 -28824 -22104 -15523 -22983 -41857 -33827 -12421 -24440 -36816 -48116 -38294
23331 -38294 -12579 5546 9824 17064 21602 -2527 -3370 -367 -6340 -24611 -17743 -32868 -51838
23318 -51838 -59124 -36354 -32267 -28016 -16643 -11684 -1579 -1518 -13234 -6758 -13116 -8114 689 -8572
23304 -8572 -22758 -5257 3648 -9703 -2569 3167 -13365 -23387 -13441 17644 6202 1892 -1363
23291 -1363 -1390 -3681 345 6492 -4240 -11073 -1754 16570 17905 23599 18991 -695 -22378 -3292
23277 -3292 18119 25286 7636 10042 4519 -3807 3675 4340 -11612 -23302 -16011 -12669 -4428 -6784
23263 -6784 -30521 -29738 -16742 -8145 6131 -1815 -19927 -39225 -32388 -19976 -9849 4857 6014
23250 6014 -1505 -7122 -7932 -4975 -1560 -8423 -13524 8149 8002 3649 1098 11730 10229 -1726
23236 -1726 -3310 -5377 -3849 5152 3980 11190 8998 3638 7771 6172 -5676 -8749 -2711 -16075
23222 -16075 -25593 -13140 -1544 5784 -4450 -7326 -1213 -10589 -17663 -9258 11465 11541 -2747 -11493
23208 -11493 -24363 -34227 -35583 -26807 -27023 -25873 -18439 -23771 -9674 -3848 -12276 -10295 -3491 467
23194 467 9829 13475 -413 -4231 -4612 8827 19772 31676 30141 11807 -502 -5549 8108
23181 8108 31047 25680 -3809 -18021 6540 17834 14171 18344 22459 39534 37727 25641 12677
23168 12677 -4783 -15991 -22556 -15006 -8920 -6658 -2512 -7528 4589 20327 14234 -4998 -6502
23155 -6502 -10205 -17078 -7817 -13699 -5536 -5362 -3687 16873 5397 -7694 -14938 -18382 -18823 -7379
23141 -7379 -4466 -2098 -4731 8637 -11853 -28259 -13789 -12338 -16040 -15380 6121 10169 -11619
23128 -11619 -18112 -7395 -10649 -15416 -4763 14697 5844 -11508 449 23709 21504 21638 27261
23115 27261 31609 9449 -4352 -17956 -15927 -9619 -17691 -21153 -19046 -7440 -10031 -7340 -7734 -23520
23101 -23520 -18685 -15662 -12087 -6404 11842 18409 23669 52263 60343 34342 7603 5792 20484
23088 20484 16649 12120 14176 2162 -6022 -4827 15892 22101 29525 13435 -12636 -19949 -22955
23075 -22955 -19347 -28451 -19167 9060 17962 28346 21033 18664 8756 16906 10438 16303 19117 11334
23061 11334 14225 19431 1088 -2742 -2926 6518 14415 2796 -1790 6166 8652 15463 18851 -16154
23047 -16154 -23941 -12936 10790 19665 24542 17684 16916 -4859 -17391 -10705 -11957 -9657 -12053 -21207
23033 -21207 -24861 -14255 -1996 -6813 -1071 6298 28301 19396 10550 14760 10522 6131 -14545
23020 -14545 -14271 -15283 -23603 -32152 -19745 -14166 -18382 -23819 -15722 3204 6302 -2725 -13748 -6611
23006 -6611 6585 6535 14558 1268 2874 4894 -4418 5345 15901 17808 11376 6558 11259 1223
22992 1223 -18868 -9592 7946 5663 9745 7650 9463 12612 10224 -11540 -21216 -17840 10377 13971
22978 13971 -5622 -9954 -1302 4668 -20166 -19410 -3617 6889 9970 14154 12559 5729 -15886
22965 -15886 -7910 6370 7230 6320 7169 20184 4089 716 10160 24658 32096 19808 10947 3570
22951 3570 -15755 -30964 -23093 -10115 1815 6895 16021 19595 7728 -4502 -14473 1532 8017
22938 8017 12310 14844 6603 4164 -1719 -4760 5571 6541 -274 -5605 -8729 1692 8188 25406
22924 25406 20290 4194 7746 14416 31889 47426 28691 11162 -7338 -20859 -23154 -12921
22912 -12921 -14843 909 4686 -422 -9363 -10376 -5686 6325 10162 1286 -10937 -7803 -15940 -6881
22898 -6881 -5387 4008 4096 14966 8579 -3690 -21076 -11311 -9889 -9224 -3295 2462 1273 -7780 -2692
22883 -2692 9189 661 -20793 -5434 -7835 -10149 -2483 11301 15863 16256 12031 26812 9983
22870 9983 -3660 6863 22652 10539 2223 18407 34589 24453 13677 12082 9423 -2163
22858 -2163 -5294 10874 11562 9989 -2749 -3509 7418 24282 23902 4748 -15903 -16967 8718 20713
22844 20713 22246 22594 18009 7378 -2494 8973 14611 15466 11475 -7020 -17856 -16374 -11518 -2715
22830 -2715 3148 -550 9521 27874 34705 21131 11709 20047 31261 17884 3311 -3763 16009
22817 16009 8161 23249 12559 6949 -6791 7043 30543 41642 31357 3137 -11839 -17289
22805 -17289 -10169 -3213 8310 5751 -13477 -25511 -15641 7952 22817 13095 6771 10817 9628
22792 9628 6474 -2405 9131 28137 26943 17690 25988 39830 29825 19506 18645 7744 8269 -2705
22778 -2705 11226 15395 13199 16966 11122 11433 9185 6619 -6838 -3349 -7551 -6994 -2833 -4457 -192
22763 -192 6532 15508 10361 6641 -509 -8144 -3861 -112 219 3338 2420 -7636 -20503 -14304 -55
22748 -55 -1642 -2491 -8440 -22114 -25340 -16437 -1282 -690 -4662 853 -3143 -2890 -8413 -8510 -3839 -1037
22732 -1037 -5084 -6881 -15414 3483 23742 9505 2040 11470 2089 -14461 8579 20207 12374
22719 12374 4141 -4480 -3616 11115 7175 -745 -4570 -4273 4539 9831 16548 4579 -15121 -15322
22705 -15322 -10262 -15510 -14194 -22 5483 794 3529 2943 1490 3699 13423 -9869 -18928 -8636
22691 -8636 15272 5366 -10423 -13220 -2110 5853 -4037 -2993 4681 5434 -2777 -2619 8976 1309
22677 1309 -16157 -11716 -4269 -9575 -5386 1694 -13670 -8901 2464 4399 -1719 -16691 -13305 12477
22663 12477 22961 11710 11112 4242 -7423 -4277 4385 24155 20386 12523 8783 516 -18060
22650 -18060 -26498 -20777 -26397 -31958 -18473 -11054 4299 -11487 -21147 -7095 -8117 -12947 -14776
22637 -14776 -12951 1203 15946 9714 20181 35696 26785 5102 -6698 6527 -278 -7530 -12509
22624 -12509 -5164 3747 929 18998 35956 25918 18358 32008 18909 -5411 -15383 -3408 4939
22611 4939 15690 9378 -1735 -3555 10614 13782 -1483 -15991 -34356 -34662 -19554 -11662 -13968
22598 -13968 -26896 -22632 -14656 -17375 3742 13720 8242 6992 -15129 -43632 -29943 -28444 -24142
22585 -24142 -26315 -23760 -35223 -28782 -17706 -14491 -24945 -7884 10108 11834 6749 20322 36698
22572 36698 37764 37282 23171 20978 17934 3609 -2193 18360 37102 19366 1480 -14170 -29772
22559 -29772 -26322 -29410 -29193 -25191 -21084 -17785 -9531 3145 14424 19488 1182 -33951 -41613 -22312
22545 -22312 -22509 -16763 -26921 -29381 -29009 -22786 -27792 -34548 -31242 -33392 -15048 -5218 -2689 -9181
22531 -9181 -16496 -6578 -21562 -35773 -20183 -16388 -12075 -3299 -5806 -15622 -18865 -19983 -17636 -5529
22517 -5529 -8267 -11170 -7745 -5599 -15529 -10166 -462 3083 2211 4279 13771 23378 6181 -4227
22503 -4227 -9852 -4468 -5755 -27294 -29243 412 5527 2686 7603 13829 10695 212 -2084 12258
22489 12258 2171 -11327 -12704 -3481 6135 -357 -9665 -22867 -22279 -9920 -5860 -3050 -18304
22476 -18304 -27301 -12749 -479 -12423 -20065 -31559 -24427 -16731 -14459 -15412 -18388 -1508 -5292
22463 -5292 -10387 -10191 -17054 -31716 -30942 -32821 -13585 -13448 -13 10389 7384 8220 19554 26578
22449 26578 21207 10993 3698 -1405 5103 2938 -4078 5964 9990 -12840 -16671 -17481 -10736 4967
22435 4967 15972 -5723 1526 2408 3514 -12400 -23234 -2643 8208 8048 -3344 -9507 -2924
22422 -2924 -5705 -5628 -1166 4442 2760 -8911 -3877 8288 20499 27321 27600 23036 25605 37426
22408 37426 54439 44286 40716 21648 18927 12047 13441 6780 -8889 -17968 -2978 -6301 -8072
22395 -8072 -11763 -9509 -3260 2482 15672 8990 -11179 -4441 1954 8485 3214 -257 -1724 -5413
22381 -5413 -1463 8033 1993 4226 -1315 -10257 -4027 -1411 -3446 -2477 -1942 -898 -2618 8446 8623
22366 8623 -6885 -22335 -25896 -11168 -9794 2037 -4383 -7655 -7424 -13021 -18693 -14914 -10202 -4014
22352 -4014 2999 -6442 -7932 -18569 -13196 -6753 -3525 3789 4861 1839 7638 490 -2259 575
22338 575 -2944 -23615 -23229 -7655 -15536 -11308 -14261 -21049 -7852 291 -4046 -15082 -1573 -16273
22324 -16273 -25608 -21151 -15678 -11300 -2340 4527 19492 5880 -5479 16975 35491 26984 8195
22311 8195 1651 -3273 -7614 -9648 -9967 -6365 -23048 -30806 -18551 -3539 -1944 -10546 2006 9569
22297 9569 -4695 378 13430 7952 -15971 -19086 -4891 6058 -8511 -14381 -29587 -33522 -29272
22284 -29272 -21441 -19001 -528 4194 -9489 -26306 -28834 -18694 -21164 -27066 -29371 -11431 8559
22271 8559 1313 -19909 -19394 -8759 -11500 -22603 -23265 -16546 -20962 -32839 -20956 -5663 20871
22258 20871 20978 5121 7233 2930 207 -8727 -19447 -22802 -12259 -329 5888 8864 -663 3180
22244 3180 2042 -2899 -12563 -7092 8879 22764 15063 9660 2738 9034 12695 4047 13705 5743
22230 5743 -5446 -16427 -14161 8564 7922 5474 6759 5745 -1644 -4783 -15836 -21779 -7806 -17012
22216 -17012 -19472 -366 324 3624 2275 12972 7321 -2139 -4963 1613 -3791 15037 17703 -8787
22202 -8787 -16944 -18651 -29454 -29778 -32919 -44597 -37178 -19918 -13522 -2421 5389 6796 -178 -23398
22188 -23398 -15353 -1136 6480 5201 -6865 -9615 10417 8563 -4164 -9722 4607 21252 2680
22175 2680 -11192 -26496 -27135 -13795 -7455 8134 25754 33515 25713 8920 1505 1591 5597 2727
22161 2727 7194 11092 5262 12493 12386 18399 21447 9725 -10665 -22573 -27102 -16750 -28428 -14501
22147 -14501 -3328 -2324 -20906 -47490 -38892 -23291 -25999 -14292 -9463 -15017 -2512 -15114 -9944
22134 -9944 -15021 -17668 -16723 -10939 -16813 -22838 -2691 2195 -4913 -3970 -3432 -5240 -11480 -5917 -18792
22119 -18792 -16819 -16838 1634 -6739 -19926 -30665 -47598 -48486 -39783 -27115 -21621 -10042 4353
22106 4353 -1139 2022 12495 8197 4211 9218 8732 15277 14347 1181 -14171 -21082 -20418 -19867 -33242
22091 -33242 -36889 -23530 -12851 2575 11170 7978 -16620 -24570 -23014 -8844 -13258 -13109 6388
22078 6388 3087 -863 -5439 10076 21025 16481 -4224 -8248 -5671 7731 -7427 -17526 -9386
22065 -9386 -6693 -6306 3655 -4933 -15058 4106 18732 5767 -14357 -20371 3315 21623 19738
22052 19738 20563 22166 9250 4617 8322 754 -8777 -16509 -16315 -12756 -24904 -14092 -1075 -7813
22038 -7813 -8096 -2168 -5572 -7196 -7946 -13981 -1295 8001 9522 24982 32923 28644 12990 1927
22024 1927 315 701 -14853 -9513 8173 20706 17560 14141 2015 -2200 3167 -8767 -7268 -7811
22010 -7811 -15449 -14273 -27794 -17089 -7278 4389 19574 22690 8558 9961 15177 6106 -1523
21997 -1523 -3564 -5317 -743 -2459 -14882 -9587 3226 15160 6640 2505 6107 3869 1532 -5471
21983 -5471 -7455 599 1857 12733 9082 9369 8796 -206 -610 -6636 -3514 -3010 -8547 -9380 -10531 -13245
21967 -13245 -13465 -17564 -9160 3203 24814 20204 -1984 -17677 -8271 -4829 5327 9983 7426
21954 7426 11169 2855 -3828 1171 -1105 1265 -3007 -19993 -15994 -2476 -1005 849 7594 -86
21940 -86 5864 5307 -6848 -13173 -13200 -5651 1561 11800 32313 28882 16261 13020 22940 37267 19740
21925 19740 13218 7794 624 -11254 -9330 -3688 -1454 6945 14251 15658 1008 6417 7906 2787
21911 2787 -11296 -21532 -13783 -11004 -13951 -13629 -22260 -25106 -15068 -14114 -8045 -7552 -17492 -20507 -22417
21896 -22417 -7000 7667 2420 -11970 -12976 4497 16741 11791 7185 14937 15658 -7752 -20989
21883 -20989 -17500 -30788 -30967 -15341 1871 15426 14058 -2591 -16462 -17619 -6208 -12670 -11552
21870 -11552 10769 20991 28619 22038 4343 -4567 9272 8539 -4331 -6618 -5641 -1212 2469 9080
21856 9080 8385 6932 10203 -2518 5163 -3682 6575 20038 19857 17714 8281 2951 -11143 -9572
21842 -9572 -20845 -27817 -26403 -12254 13931 25726 23848 4642 -9190 -11429 -5016 10014 13188
21829 13188 3270 10064 16033 22153 9886 -8826 -5416 -719 15726 13045 -8452 -7643 -12316 -5412
21815 -5412 7820 8057 7972 21988 22934 15555 20645 23786 30456 12462 21736 26634 24505 12284 9289
21800 9289 1586 -19717 -30740 -28937 -32947 -38430 -28845 -5173 887 3278 4204 6249 5911 6293 9740
21785 9740 4659 838 -2511 -2922 -15335 -16480 -14946 -13774 -3976 8411 -7349 -1699 23461 26008
21771 26008 10805 3828 -10690 -16469 -8388 -6968 -5215 5265 6851 3738 -4009 4315 6684 18155
21757 18155 16495 9345 15762 8400 4333 -9784 -18772 -25380 -20750 -19774 -18254 -9654 -15962 -12371
21743 -12371 -1770 17697 22343 13663 7705 434 3352 16541 2019 -6995 -10286 6139 17512
21730 17512 13554 15336 9661 5863 10623 8971 9880 9008 1544 1919 -10285 -9136 -16537 -21154 -22037
21715 -22037 -6924 9629 25340 17993 -3379 -16351 -4829 -11260 -4882 4494 2882 16479 25834
21702 25834 25468 11628 2770 -421 -13740 -16388 2171 -13567 -13023 -19163 -18643 -14680 -24172 -22501
21688 -22501 -23218 -9901 258 -1084 11301 16993 12136 -15309 -30450 -13343 -12594 -7319 -9152
21675 -9152 -5405 -5082 -13641 -24481 -23791 -6713 -23359 -28462 -5430 853 -3335 -2315 7113 18093
21661 18093 11331 2115 237 11110 11182 -1748 -5608 -8274 -8751 -13409 -13143 -19997 -23933 -23160 -25200
21646 -25200 -27788 -40414 -28407 1770 4532 6843 -2111 -6188 11461 3613 -5801 -6610 -5252 -7690
21632 -7690 -5894 -3299 -18884 -33752 -42028 -50560 -35460 -30806 -43911 -36542 -8816 -7226 -18566
21619 -18566 -37131 -42787 -24208 -22006 -24323 -14767 -5238 -9662 -8095 6524 21223 26493 24654
21606 24654 18268 8557 29968 23110 -2831 809 -3229 2247 -2603 -24406 -26611 -17128 -1261
21593 -1261 -4786 -1666 -8446 -13518 -10803 6256 15911 22218 25312 18504 14182 7733 11435 2016
21579 2016 5974 31400 49886 35753 11363 3375 5217 1396 -757 -2188 -8317 -13440 -6285 -4310
21565 -4310 1910 15034 12576 12057 3446 -6463 -6966 8685 23878 16551 4963 8294 20184 19486
21551 19486 14125 27230 19286 10917 -10709 -13657 1957 22369 33660 50123 41908 25724 6530
21538 6530 -11532 5434 10324 -10802 -23769 -10923 -12941 -5197 4621 -3021 -11158 -20597 -31284
21525 -31284 -45638 -32492 -33103 -15594 -2361 -29258 -30455 -34086 -34751 -20386 -13776 -4503 -2397
21512 -2397 -11881 -18375 -15683 -2730 -9992 -8484 -11468 7854 9694 23884 32304 18060 7133
21499 7133 3417 -4660 -2464 -6485 520 4403 -13579 -11757 -1548 9923 14373 13564 5134 3500
21485 3500 8565 4337 4543 10780 8023 1313 5154 -2184 -3303 8389 11429 -278 -3090 1905
21471 1905 2414 -11490 -33307 -46555 -46534 -44886 -12597 -2699 8414 12061 7006 -5336 -17812 -10646
21457 -10646 -7320 -15711 -27332 -53170 -52074 -40562 -25397 -26083 -31064 -36074 -32042 -36172 -22771
21444 -22771 -10086 -7170 -11077 1227 2625 -1370 -12068 -154 25320 35818 36553 22223 1132
21431 1132 -5267 -15194 -9631 -5812 -11569 -1404 4577 9209 -6255 -10905 -10097 8588 7205 -10091
21417 -10091 -11339 -9772 -8678 591 -6576 1429 14231 5396 1527 -6249 -7122 -29258 -37972 -38335
21403 -38335 -34387 -19116 -32591 -34634 -28202 -27150 -35334 -15487 7991 -2434 -2737 1019 3187
21390 3187 11170 7572 3969 6326 11105 13937 14744 5583 13239 12389 1628 10260 2463 -554 871
21375 871 -5383 -8313 -9475 -14982 -2308 9882 -1827 -15856 -24897 -17273 -11218 -3394 5228 1304
21361 1304 -8901 -6375 263 -19667 -21751 -19842 -16068 -26597 -11887 -24246 -43098 -37876 -27819
21348 -27819 -10624 -13275 -14165 -8503 -11802 -9317 -10993 -7725 -7280 -13559 -19655 -27414 -19698 4711
21334 4711 15425 12951 -2610 -10454 -12145 -15236 -7314 13653 17096 2841 5551 -2773 -4161 2625
21320 2625 -4944 -15757 -7097 10248 23822 9047 -11766 -24346 -25251 3302 8808 -2087 -17081
21307 -17081 -19135 -4635 -5371 -12193 -4201 5819 8435 -2222 -10631 -9607 -2050 14463 7369 11631
21293 11631 3192 5846 -7780 -15784 -10248 7423 11428 5890 3305 1638 8248 14075 7892 10942
21279 10942 22120 16234 -8202 -19560 -20424 -9026 -6045 8797 8700 6691 5536 6257 2978 3612
21265 3612 -10997 -13225 11628 24664 8273 5833 19071 -1316 -17252 -24080 -18236 -17311 2013
21252 2013 21501 31476 18287 13847 19167 14294 6923 20966 17269 -8548 -26387 -26394 -22319 -18790
21238 -18790 -580 2338 -707 -3844 -10690 -18793 -16292 -18449 -2435 -2822 2603 6249 4043 -2017
21224 -2017 -778 14080 7879 -3322 -19213 -13212 908 5074 6663 11233 22172 5338 -3908
21211 -3908 -8048 686 15742 25861 16292 14569 19361 19274 -3238 -16719 -19220 1029 13942 2911
21197 2911 -3048 -8119 -5666 12946 6409 -13221 -10323 -8403 -7888 -15708 -11367 -15705 -6695 -3495
21183 -3495 10709 32935 26110 17319 -10772 -14950 -2140 -5746 -2166 2578 2502 -2624 -13859 -20807
21169 -20807 -15526 3391 12966 6869 -19171 -10856 7517 -12558 -17724 -27592 -10264 5433 -1327
21156 -1327 -1045 -14016 -11867 -9427 1090 8665 29860 29029 18829 26436 25652 25317 24856 25192 13679
21141 13679 15226 20357 14305 5010 277 3271 1502 -13088 -15997 -11114 -21754 -29618 -28508 -11486
21127 -11486 2922 7379 13768 7666 5709 -10053 -1964 21569 32338 36630 19873 9404 -1715
21114 -1715 -17605 -11894 -2205 -5196 -6904 -10297 -16649 -23190 -19436 -9958 -16274 -10547 -8276 -2672
21100 -2672 18175 19284 1247 -3659 -5706 -15238 475 5095 10909 3276 -1240 6679 19500 20664
21086 20664 28174 22086 25950 17973 7380 4489 -5346 4358 3488 -1277 7424 2308 -10331 -3373
21072 -3373 2779 10812 16325 -8236 -38663 -34356 -17666 -192 -10906 -5702 -8111 -17360 -13321
21059 -13321 375 -10626 -10737 -11229 -4551 -2325 718 1854 6613 -21 -575 -3159 -7783 -6902 -3625
21044 -3625 -3069 6590 4476 -17009 -16198 -16646 -12978 -6106 -6521 -1378 11443 4105 -10432 -14781 -12051
21029 -12051 -11471 -20947 -26850 -13758 -6414 -22681 -16186 -16762 -4690 -8877 -27963 -35392 -29133 -5814
21015 -5814 3188 -16485 -15376 1383 -9525 -17699 5804 31490 31912 16060 -9924 -22730 -5051
21002 -5051 5769 3889 -11917 -32458 -20138 -14926 -16584 -7968 99 -3849 -7374 -15586 -12019 -15431
20988 -15431 -20518 -9073 -461 7246 19864 7516 -3384 8585 9904 -13025 105 5636 18120
20975 18120 4673 -11574 -19540 -10631 -1086 -4969 -23780 -22985 -8984 5889 11949 7266 -12593
20962 -12593 -17766 -26050 -10887 -3958 14918 25904 14327 -11252 -3847 -3168 328 -3016 5281
20949 5281 14904 9020 -9859 -16751 -7949 -8912 -8878 5547 -3296 -7832 6789 16779 6220 13117
20935 13117 20569 16532 11490 9523 -9049 -10242 -8573 -18890 -13750 16609 37022 46872 27534
20922 27534 10418 -879 -7269 1012 4396 -780 -6492 -26366 -40224 -30277 -17121 -20673 -9608
20909 -9608 -14749 -17281 -11258 -5577 -12463 -7691 -4389 -1552 -15395 -27595 -2304 13205 23428
20896 23428 22494 9980 5086 -13416 -9216 787 -1332 -4830 -7728 3 6363 -3850 -3263 -10252
20882 -10252 -20349 -5964 -18881 -19998 -9772 -3489 -8401 7240 15817 9122 -11119 -17413 -27909
20869 -27909 -39223 -41273 -36128 -11921 -10295 -5434 -12597 -5342 -15530 -16530 -18264 -16231 -16407 -888
20855 -888 9608 934 3351 13321 1599 -9092 -12591 -4599 8241 8403 -1828 -2204 -6485 8697
20841 8697 2096 -12491 -8340 -4027 5896 8297 8908 9977 4351 -7965 -1054 -3757 -8104 -18832
20827 -18832 -15528 -18183 -15055 -12787 -24010 -36703 -25599 -27246 -36441 -37002 -26611 -12424 -13311 -9777
20813 -9777 -22970 -10865 8097 9289 -4729 3829 8742 -4232 -12476 -17541 -15377 -6813 -16389
20800 -16389 -23487 -19250 -11593 -13183 -6945 4278 6785 -8133 -755 -3223 -9898 -14344 69 7690
20786 7690 -3626 -1688 -13238 -11787 -12688 -30245 -30877 -23543 -13339 -26284 -14088 -8610 -24246
20773 -24246 -28121 -25695 -28272 -29377 -18933 -16536 -13157 -19221 -29589 -6796 12721 11187 17026
20760 17026 23990 16047 12210 19842 3296 -16205 -9792 1077 -1723 -1966 2308 4637 26175 33858
20746 33858 2693 -12597 -13704 -13432 -11920 -15017 -18102 -23309 -22871 -714 13312 -12235 -12901 -1515
20732 -1515 -7948 -441 3500 5031 8191 -7102 -11646 -11037 -19846 -26025 -4953 6773 9931 6000
20718 6000 -11396 1123 9359 6940 8665 -12621 -27531 -34541 -18632 -21163 -22862 -1669 8080
20705 8080 4527 4667 -5322 -7986 -11647 -4356 930 5425 453 -18411 -19170 -27012 -13984 9469
20691 9469 303 1181 2239 -8415 -8519 -2985 6583 26714 8292 1019 812 -12998 -18932 -22766
20677 -22766 -16782 -225 14779 12996 3913 9362 -7791 -7146 7851 104 -16473 -3260 5527
20664 5527 -1157 8045 6860 -2451 -8424 -11179 970 7369 7192 -1324 9244 26442 14144 15252
20650 15252 26386 23677 29030 26830 14453 25614 23973 21942 18064 -538 -2290 12442 15933
20637 15933 18049 24463 25852 21393 14927 -1602 -2810 2365 5898 -756 -15959 -27247 -29608 -25199
20623 -25199 -18108 -11476 -5114 6154 -11891 -22271 -16709 -22609 -13142 -16294 -13006 10123 9757 -892
20609 -892 2306 6578 -1348 497 -24 3398 15069 7892 -700 -3276 -11262 -9948 -20946 -27196 -26960
20594 -26960 -13426 6314 -4819 -17092 -8100 -6354 4584 6961 -2479 26710 40415 47565 33363
20581 33363 23627 16905 -5702 -10923 1497 3950 987 -8999 17561 38866 23182 6254 -1111
20568 -1111 -11864 -12306 -12216 -17522 -12213 -10151 -2639 -4898 -16973 -21111 -27402 -1420 -2404 -11255 -12525
20553 -12525 -14055 -19894 -5863 -2737 -37 13888 16571 984 -1609 -5618 -12148 2235 10665
20540 10665 -4906 -4736 4112 12134 12298 12721 -986 -12648 -13578 -25021 -22662 -5299 11658 -515
20526 -515 -41199 -36412 -15704 8946 12991 10719 -37 -22629 -24938 -12040 -9188 4031 9878
20513 9878 14178 19234 20314 7088 2015 10022 20428 12395 -194 -1620 -15121 -17278 -20500 -22268
20499 -22268 -24895 -18177 -12312 -13411 -6840 1473 -5027 1683 6196 -18751 -26941 -13077 -8093 2494
20485 2494 -3728 -20411 -21785 -22948 -10427 -26434 -39887 -31108 -2988 5594 -7387 -283 4252
20472 4252 9950 5652 -15740 -28464 -22480 2716 12652 6425 9093 8548 2188 -9505 -18007 -23210
20458 -23210 -35278 -41238 -21856 -12942 -21526 -13926 -6557 -9988 -8453 6218 27386 16066 -2321
20445 -2321 -8781 -1532 1555 7582 3721 11888 7443 11628 14639 22768 14720 2572 -1671 -5807
20431 -5807 -12358 -20377 -30632 -27696 -19667 -23977 -12429 1839 2367 -661 12702 2130 3454 10051
20417 10051 2982 5474 7313 2872 8393 -7214 -18397 -23273 -33812 -20849 -10788 -15032 -27671
20404 -27671 -25339 -21237 -14548 -13537 -1667 6196 7467 -409 1173 13302 12499 -11531 -10490 -15608
20390 -15608 -13708 -12715 -32217 -30192 -25945 -4854 -4926 -6213 -10467 -23747 -12424 11143 7975 4192
20376 4192 8357 13594 9714 1411 -6214 -14485 -18067 -17844 -12915 -30721 -17201 13142 14320 15978
20362 15978 13542 10628 3141 -3705 8496 12419 10157 17142 9132 11438 7244 14008 17575 8194
20348 8194 -7538 -15458 -22411 -23339 -11246 -18 -1149 -9152 -8604 2072 -7567 -27989 -38838 -25492
20334 -25492 -7244 -5535 -20403 -24176 -38712 -46850 -41616 -20562 -10439 -23310 -11461 -9454 -11865
20321 -11865 -10570 -22997 -26067 -22559 -14662 -5806 -2223 2941 -10593 -11347 3454 4542 -18702 -25440
20307 -25440 -16163 -22302 -15435 -23730 -23108 -25606 -35885 -31981 -14448 -26760 -14116 7080 -5058
20294 -5058 4490 27240 21457 2857 -17468 -19552 -18068 -11018 -14722 -29642 -20368 -16652 -20137 -10518
20280 -10518 -4073 -1522 11297 14393 17582 7793 -24160 -17744 -25805 -17357 -4683 8052 -9392
20267 -9392 -20404 -12481 -24649 -16950 6252 3397 210 6910 9765 -4311 -2625 6695 -2396 -623
20253 -623 3066 -1436 4293 -12096 -15786 -15625 -17708 -25147 -24820 -20211 -5474 -8215 -13084 -18250 -11772
20238 -11772 14045 29082 26797 13466 -6499 -5031 4666 6080 5585 -13332 -25762 -30808 -32498
20225 -32498 -24456 -7345 -828 -20718 -32133 -24119 -24432 -10192 17310 2065 -14165 -15091 -15782
20212 -15782 -16612 -9279 -19402 -39560 -33269 -12725 -9958 -18416 -27431 -14860 -13610 -20710 -14601 -29887
20198 -29887 -36272 -19788 -14710 -5138 -14672 -16481 -16243 -8913 6308 8275 2714 -191 6945 6407
20184 6407 11324 13429 3115 8159 10694 4365 -6243 -12800 -3263 4664 2599 9513 -94 -5216
20170 -5216 -11472 -11488 -1176 19171 22723 13461 11289 28107 38485 27285 26907 10262 -1953 -2313
20156 -2313 605 -6217 -3546 -3987 -17675 -3434 -5980 -26946 -11970 1996 -4461 -9343 -5193 -11482
20142 -11482 -8673 4782 3267 4009 14234 23364 10819 9001 18617 18953 32098 43369 28874
20129 28874 16649 16178 20747 14473 20802 10384 9362 9096 6906 20876 18006 5832 -4124 895
20115 895 18470 18663 10563 13486 6730 -5775 1243 2370 2713 12144 21515 15949 -13290 -13166 -13472
20100 -13472 -3267 3987 9877 20867 14685 15513 24183 22569 1977 -8555 -9179 -3311 15314 12011
20086 12011 3452 -1435 421 -6759 8255 23448 37376 22222 20301 18021 12971 4182 5246
20073 5246 19741 13794 14917 32257 34099 37840 24472 1776 -196 8986 2352 4382 7945 12587
20059 12587 16564 6406 -4487 -919 -10292 -17131 -17924 -25014 -6121 10850 2164 -10777 -26515
20046 -26515 -11698 3586 1831 3771 5742 152 -14119 -24996 -5902 -19074 -28081 -29095 -31295
20033 -31295 -25940 -7760 14447 15979 7655 17114 20560 567 -15308 -16706 -11939 -5160 11396
20020 11396 15228 9337 17568 13173 4657 9905 8302 4231 16992 30708 30889 25638 29403 38827
20006 38827 22893 -3520 -12334 -15827 -20589 -18323 -12732 -12311 -24965 -9073 7904 11719 -320
19993 -320 327 13389 -975 -2476 312 22151 42903 43795 30758 18987 14740 2998 5056 5225
19979 5225 8082 7414 8491 8008 1912 17975 28848 18985 1235 -19745 -18363 -4283 -7458 -20291
19965 -20291 -16721 -14378 -7442 3052 21466 49258 57312 37334 29797 20003 25706 36191 47479
19952 47479 28170 13125 -7135 -16058 -1363 14389 20812 14680 9738 12672 14738 3453 -20975
19939 -20975 -26793 -812 4078 -9967 -5985 -13961 -9290 -2871 3298 13203 22223 19412 16761 6190
19925 6190 -3660 8357 12575 12470 16141 12706 15309 10708 8814 -16406 -29037 -18268 -12624 -2414
19911 -2414 -3465 -13673 -11164 -14165 -22400 -13326 -8660 -13704 -7864 -2143 7497 6696 -4728 -11051
19897 -11051 -6092 1360 3549 137 -4032 -8916 -5943 -3815 2474 6788 12284 -2099 9431 20410
19883 20410 6403 -2237 5766 7888 -301 1369 -11614 -22867 -16397 -14602 -182 13718 19062
19870 19062 276 -9054 5993 21904 26460 17382 11829 17921 32958 37122 19084 10436 5512
19857 5512 -9788 -14748 -10569 11581 14162 885 -12676 -6537 -767 -1216 -6549 8843 12802 14266
19843 14266 21926 16597 5575 -3923 368 11316 14369 27359 21353 1868 -11374 -271 -6572
19830 -6572 -9465 -7069 -233 -9101 -14887 -26964 -30148 -22238 -13773 -15475 -14501 13384 14281 19314 20741
19815 20741 11650 9833 29508 37580 12138 11487 10391 19268 24888 20963 29348 27682 22335 15220
19801 15220 -1949 2385 2129 8875 14548 -4902 -22349 -12563 3043 16107 25017 35775 32449
19788 32449 14880 7188 13799 20370 2050 -9831 463 2683 -484 -2108 8979 10610 -14638
19775 -14638 -19883 -26466 -18052 -11453 -20372 -20835 -27353 -29886 -18141 -9188 -12842 -15916 -19276 -12938
19761 -12938 -26232 -25506 -13397 -5843 218 -9670 -17265 -30180 -27669 -13213 -7043 -9473 -12385 -25973
19747 -25973 -29288 -8901 3620 14614 11236 8266 17568 7421 -3427 -2452 10938 5841 -3672
19734 -3672 5877 -2681 -22277 -29044 -12940 -11725 5148 9920 18250 5727 -7004 -7219 -10633 1934
19720 1934 4845 1250 9221 13159 85 -4698 -10055 -3601 8851 5041 -10946 -8741 -4146 -10673
19706 -10673 -6832 -5629 4730 15592 9942 -15437 -18153 -20266 -15642 -1810 5748 1288 6140
19693 6140 598 7980 5467 -5571 -1043 -9795 -15231 -3528 -1009 -7476 9370 7732 -1058 4551
19679 4551 17719 17178 21566 8226 -7853 -19930 -20053 -11319 -9014 4819 -5834 -6923 -4691 -18203
19665 -18203 -37341 -39640 -20456 -7831 -6414 -13253 -21729 7406 28416 20029 3952 3019 17078
19652 17078 19952 15757 4560 -8690 -12920 -26743 -18311 -16880 -22286 -30981 -33600 -31333 -28332 -23442
19638 -23442 -27336 -24727 -2384 5227 4396 -11133 -19342 -21726 -7957 -24583 -32177 -24938 -17971 2084
19624 2084 3722 -1934 -923 13774 33349 30899 25795 7580 1378 -5653 -18730 -12928 -27014
19611 -27014 -13554 -8406 -2811 -4959 -13038 -9993 -17325 -18164 -18082 -13237 -18193 -22327 -12304 222
19597 222 17791 15489 4643 -8174 -8558 -1643 87 13400 11205 3733 1506 8524 12710 17038
19583 17038 20616 24719 26722 16819 25862 22559 9629 4650 7407 2687 -4010 -7782 -8124 -10712
19569 -10712 -13218 -3260 -10999 -12545 -5463 12691 11393 10201 27742 46142 25601 31457 31441 19292
19555 19292 23342 25814 31610 10360 -7136 -1785 12864 7091 -5243 -7023 1839 -14497 -9951
19542 -9951 16081 22991 10095 1651 12515 17307 8134 -1971 -661 17494 28136 20589 8204
19529 8204 -793 -4083 -524 -1025 13757 26451 16335 -5420 -4790 -11352 -20372 -8546 387 6760
19515 6760 5943 4612 4658 4148 -6798 -17084 -21658 -18268 -12741 -6711 -8718 -13769 -4156 -7161 628
19500 628 10630 17708 6248 13610 39641 48792 50022 36666 20378 19770 21684 20976 20303 30549
19486 30549 36451 40996 23717 5607 -9735 -9288 -16462 -7539 -266 -9031 -20032 -2677 2344
19473 2344 2815 -6170 -3715 13772 21751 -2380 -10827 -5461 -5635 1898 -1893 -8697 -4438 11186
19459 11186 19188 33942 36510 29734 8860 7069 9407 11919 8595 -11597 -11865 -2892 -3959 -11305
19445 -11305 -24378 -34829 -11542 4625 7559 2203 10557 8891 -501 -16268 -16361 -3150 -16445
19432 -16445 -15020 -2928 -8382 -5324 -5847 1836 6241 -7058 1641 13988 -2867 -2013 8441 18932
19418 18932 6267 -6721 -6963 -6563 -20787 -20626 -6370 -1435 -23681 -28118 -93 8796 12860 16288
19404 16288 7785 -11770 -3461 -14898 -17718 -13706 -809 2478 8073 -6279 -18542 -14196 -9032
19391 -9032 -567 -1629 -12806 -18431 -21602 -3430 3752 19213 25353 24261 10755 5785 2068 -2388
19377 -2388 12789 19613 27662 40260 44501 49850 57068 53060 26644 27423 52356 85472 117829
19364 117829 170031 212890 233915 259053 295992 368093 424387 415551 379285 368314 400494 408321
19352 408321 376315 345922 349775 380576 396031 397168 367626 344511 336515 311855 289205 239500
19340 239500 169571 141157 107741 82839 74481 59617 51701 53810 42881 46009 45691 40978 35428
19327 35428 41168 40869 40734 31175 24246 28936 22392 10577 12945 5510 2517 1474 4084 13090 20781
19312 20781 13038 6066 17392 10257 4928 22407 15870 4444 -3181 -7443 3181 4636 27911
19299 27911 42521 32105 21228 18436 11799 5015 8779 5260 16426 16630 18125 30922 29272
19286 29272 11893 -1066 -3972 -4040 -8102 4313 6736 10234 406 -1810 3292 -11976 -23815 -16442
19272 -16442 -5950 -736 10774 21481 -8222 -26980 -15839 -11011 -7216 14751 29487 6692
19260 6692 5157 3390 7003 1486 -2737 354 5088 11988 11504 18993 28514 16352 16737 -3640 -11933
19245 -11933 -19015 -15828 -7734 -619 -2426 -13243 -17488 1861 3899 -6043 -2539 3257 4879 6295
19231 6295 10251 3571 -658 -5605 -8957 -544 2132 612 2574 -2059 -6974 3165 4310 5422
19217 5422 7656 19535 36920 29673 9169 385 6205 -1353 -5012 -3688 3671 12113 8311 14947
19203 14947 24031 25156 5196 -4382 -8826 -6067 -9271 -5480 2047 -8704 -9551 9640 6101 -4048
19189 -4048 -5568 1058 17073 16489 1755 -4532 -2725 7510 -3124 -3881 164 -4654 8194 10719
19175 10719 7829 13855 -1450 -8720 -14084 -13310 -7359 13107 17526 10113 5923 -15737 -22321 -10063
19161 -10063 -2518 5362 -1469 456 8441 -425 -6885 7960 26036 20497 18946 14285 10986 -3156
19147 -3156 -25 10986 7328 -7874 -27131 -21648 3351 16728 21525 23179 17776 2288 -18915
19134 -18915 -22885 -17370 -11374 -23858 -32509 -18982 -3962 10096 9396 -2242 -14867 -8512 5365
19121 5365 21058 17207 14816 14919 6878 10622 -2425 726 13224 12830 18087 11610 15180 10504
19107 10504 12149 -9147 -14263 7477 12968 12917 8375 -1615 3956 5449 5754 6293 3516 -1739 12239
19092 12239 16736 29713 23383 12613 4423 14022 12345 22218 22063 27683 17775 13638 19046 11413
19078 11413 16705 3148 -4567 6881 16432 20328 28699 38462 49957 60977 48885 38492 31408
19065 31408 26927 30544 24716 24929 3704 4819 6240 8390 25082 20430 5197 3210 11010 6656
19051 6656 10300 19422 37231 26718 24578 41310 47241 37389 42287 35350 20448 28706 41150
19038 41150 42095 40168 28131 16955 23197 27958 39215 50256 35819 23546 22884 22012 16251 11454
19024 11454 -2189 -14200 -31197 -71019 -84944 -84474 -74026 -57144 -54384 -45484 -56636 -56353 -52020
19011 -52020 -50659 -43166 -48581 -51665 -46113 -28436 -26339 -26601 -32957 -17821 -17992 -28539 -33363 -26283
18997 -26283 -11146 4584 22080 22743 1276 1984 -2670 -9657 -500 14012 8663 7300 23427
18984 23427 15214 -2519 -207 612 -6162 805 13604 18032 26654 23398 30516 57336 57693 72154
18970 72154 84433 82429 71143 71130 71881 81182 89938 86033 91207 99358 98527 111807 115316 106328 109117
18955 109117 117476 122736 121194 98826 80509 65230 47437 41794 42826 38161 30687 11309 10814
18942 10814 21065 18721 21055 38550 32677 23094 14151 -7832 -19262 -4105 902 1293 4915
18929 4915 2982 -12654 -22757 -14024 11466 21794 18070 30359 37016 24481 11988 416 -1058
18916 -1058 -5610 14630 26656 20366 25463 38675 33931 20888 8309 2794 20575 38115 46679
18903 46679 39853 48087 49496 41564 48953 45015 38207 23725 9054 8677 18225 18932 6174 5310
18889 5310 16172 26107 27875 29260 23210 15306 -5490 -4835 6239 9889 4787 5639 26376 38587
18875 38587 35129 30595 29531 38186 41832 40026 45125 56909 55262 44590 42277 59376 65882 63717
18861 63717 68947 76326 76580 65728 82124 92982 92512 66202 54393 70636 68753 53287 44860
18848 44860 48316 68484 80949 81725 77477 68611 74191 95936 127640 128541 128737 120800 114453 135796
18834 135796 170435 195069 197124 178881 162599 156378 167460 164721 157919 158499 172222 173301 151084
18821 151084 150323 134110 133126 123386 137974 132445 122221 123760 131061 146083 161344 173438 181238
18808 181238 195463 199147 217437 264395 301850 337455 381543 419431 479241 546687 569904 561782
18796 561782 544916 543139 553759 552323 524288 507266 508295 537778 573740 600187 640360 710467
18784 710467 752764 761917 795604 848276 908417 942404 944260 975114 1024566 1057744 1071921 1061252
18772 1061252 1004182 975853 943705 889086 801387 712597 679763 637290 612543 614954 638602
18761 638602 655336 695481 735127 787353 835970 885292 928603 951567 954699 958876 973720 1005880
18749 1005880 1008782 1031076 1078656 1149393 1229572 1307659 1366731 1430735 1524102 1646657 1754637
18738 1754637 1854758 1972674 2119717 2259945 2383264 2541191 2750431 2980206 3192199
18729 3192199 3483521 3905191 4450895 5130594 6071666 7455547 9648431 13181198 18482406
18720 18482406 25051006 31605831 38353590 45695011 53557892 61893733 66788091 63140301
18712 63140301 60244042 61486553 65920211 68073962 62586431 60022683 62013666 66321605
18704 66321605 71495911 72058655 64421139 58307017 55020272 52982978 46390493 33594988
18696 33594988 24650058 19535789 16231400 13864932 12064487 10536600 9100807 7977108
18688 7977108 7146822 6540901 5946527 5289932 4756977 4357927 4055871 3816227 3562993
18679 3562993 3274647 3063512 2911861 2783015 2598533 2452830 2346923 2282674 2212044 2092035
18669 2092035 1975458 1887567 1836126 1800069 1731268 1649974 1607960 1574932 1548284 1523127 1450878
18658 1450878 1370474 1297286 1239149 1179791 1066674 960169 901927 867567 826357 799655 779749
18647 779749 755252 723263 704477 680030 666387 647138 620787 595205 578566 558001 552557 538379
18635 538379 527305 509981 493871 480589 468315 441391 426882 436096 436430 439266 434306 434448 449255
18622 449255 481866 483390 488513 482368 468749 462776 456638 463661 455961 433699 421268 422464 420162
18609 420162 423050 394232 367859 351639 348395 345809 354776 328266 296232 267883 245079 246366
18597 246366 245732 226101 211918 207274 198609 190960 173746 164209 165398 172473 174012 182042 173769 168418
18583 168418 166719 166819 169220 174640 176372 166893 170517 163322 157263 155142 147412 147103 176169 183875
18569 183875 180983 166818 141002 130429 126603 122828 121153 105528 109008 100693 84912 74873 79932
18556 79932 76736 83584 78930 76315 75875 62245 62336 60677 50651 48436 43692 50922 28871 23073
18542 23073 42052 49593 57047 63478 77343 72369 63366 81247 98767 105668 88351 93938 82165
18529 82165 56447 50213 54648 53643 58218 48311 31808 8072 -5075 8840 17253 21386 32392
18516 32392 34131 31374 15770 6832 1039 8408 24947 51219 61210 70602 95687 147417 224429
18503 224429 276980 314344 365805 437509 495544 509111 472896 433670 413207 414517 376610 313996
18491 313996 273302 255471 233551 199462 187131 171087 165067 171324 167510 181390 215678 264229
18479 264229 326771 388043 451677 515344 533522 498739 464468 446960 454670 418811 348959 277338
18467 277338 226842 194122 171251 151665 135832 112318 96028 81108 71702 51575 39945 35107
18455 35107 39753 47887 41878 40295 66201 85169 67021 57723 65026 84231 86237 78310 50882
18442 50882 37378 43704 42667 49805 56445 52943 47581 51226 51579 60511 72411 74663 83292 66360
18428 66360 47305 50351 58136 58814 49416 41651 45513 31871 3718 -1889 -316 9690 13847 5432
18414 5432 2264 10832 26710 48416 51306 57255 60786 83475 91080 104642 116550 114592 102506
18401 102506 98735 99040 80521 67561 67643 93244 93211 68448 45366 53954 51390 55720 56783 59098
18387 59098 63257 68753 82391 73947 67570 68462 54573 43542 30478 20160 28638 24549 36092
18374 36092 53693 51947 48379 62691 73700 55777 51570 58593 69740 87063 103534 113558
18362 113558 109197 108079 113256 124995 131534 121666 115991 123610 114843 85955 83622 92558 88500 68227
18348 68227 75715 110404 105562 73065 72054 77837 83480 109972 141187 151210 137141 135164 140209
18335 140209 140548 161364 165613 163536 170698 166605 159913 150523 135692 126556 100503 100258 102002 97411
18321 97411 97585 111509 104634 100623 117039 136902 143750 147387 151053 158226 158289 155071 165781 165678
18307 165678 160196 160301 165089 186267 208909 215657 218490 221155 233647 240071 222362 212296 228967
18294 228967 224335 228823 246756 247523 255778 280954 288108 305325 307686 311743 320943 310950 315467 345246
18280 345246 383967 411617 441955 464848 500313 543292 584119 632128 692763 758598 857801
18269 857801 968506 1080889 1200414 1301574 1350314 1427758 1533151 1608106 1632060 1612338
18259 1612338 1617143 1665259 1750022 1826078 1952024 2149937 2384317 2687061 3113585 3683337
18249 3683337 4406876 5400605 6856816 9115122 12798449 18304700 24952327 31429803
18241 31429803 38054307 45196263 52731770 60346544 63487552 57674550 52672612 50334601
18233 50334601 49217495 44090591 32097102 23571555 18979208 16179315 14222470 12997463
18225 12997463 12470679 12685215 13949921 16850721 21828947 28193325 34497744 40982695
18217 40982695 48039153 55492992 63187967 66816752 60862036 55199002 52434138 51058470
18209 51058470 46008178 33478204 24018546 18696732 15203601 12470807 10372461 8735926
18201 8735926 7427133 6354905 5481805 4832200 4325437 3916096 3594688 3334439 3112401
18192 3112401 2954736 2833023 2725489 2646903 2531054 2425088 2348446 2273257 2204580 2094331
18182 2094331 1974416 1850529 1742515 1636216 1551040 1429460 1299631 1221447 1160984 1124272
18172 1124272 1084330 1035652 989189 969729 932180 881539 852044 827719 809268 781982 749587
18161 749587 718870 701340 689030 676542 652700 620844 592433 579270 567436 552344 543917 545914
18149 545914 518215 499979 492101 494022 504413 494460 463408 449589 457706 458356 461071 466176 480531
18136 480531 486258 492462 523237 553275 570204 571440 570678 565956 548877 543115 558694 601458 627453
18123 627453 668657 738875 836364 970210 1137196 1394633 1801228 2466525 3620934 5501314
18113 5501314 7948754 10206084 12115103 13707315 14769656 15639147 15700868 11845428 7600119
18104 7600119 5414339 4234548 3443601 2810143 2298851 1884230 1551717 1289216 1114852
18095 1114852 975438 854156 766226 691480 635535 572761 515092 481280 476039 469572 465994
18084 465994 439554 417446 403500 398545 381126 374098 361807 350195 336341 312828 286045 272161
18072 272161 286739 300040 309188 333669 353363 387574 419526 455051 511286 555121 577000 554858
18060 554858 533375 536232 561667 573235 544833 518221 502546 522139 550615 565061 505460 452712
18048 452712 438638 404079 350008 285162 257053 235898 192557 165523 157822 165747 172760 167762
18036 167762 154749 157430 156009 154540 153443 145321 145346 137778 119450 122955 114515 95349 100262 95357
18022 95357 85751 68364 62174 75245 79179 83382 81876 83415 76072 81809 79728 77691 67875 70333
18008 70333 67453 54580 55450 40221 50160 60266 60785 58736 48678 47029 61779 63954 76190
17995 76190 83951 79763 91824 105472 120822 145073 146133 154803 164938 191074 185724 177470 156967
17982 156967 144075 153620 140474 111833 93435 90343 74725 57505 41785 42576 47779 76678
17970 76678 96762 121466 138944 136729 134068 150095 164034 173218 171526 163265 164051 167363 155011
17957 155011 126737 101374 89014 78708 66960 41257 36815 52112 46234 41326 44489 34500
17945 34500 41662 62710 64664 62538 65791 64441 55774 69848 72982 77457 64533 57445 69666
17932 69666 78370 94771 101069 103361 92731 94204 90514 70349 44192 34725 31152 40283 57079
17919 57079 50923 28925 23169 29789 24288 37403 51591 59280 63543 72018 67135 84335 90317
17906 90317 90013 87762 89880 88304 75832 62288 48130 19709 8636 15406 28236 23737 16543
17893 16543 18156 9793 5575 -2436 -7538 -9893 -12176 2810 5165 13560 14211 14852 24267 23618 15072
17878 15072 5397 7627 3961 -13742 -27303 -12095 4492 18734 11919 -5428 -6590 7482 13946
17865 13946 9726 16571 31040 37086 26753 36453 31207 24766 1536 7942 12100 1607 -5931
17852 -5931 -7016 -12927 -7831 -3076 5220 11487 25364 34418 31448 30393 33620 19824 12518 4460
17838 4460 1001 7102 4170 -4125 -6348 1304 1803 -2584 -3535 -13677 -11981 -26060 -32064 -20824
17824 -20824 2463 2662 9852 18808 32967 36527 14597 -5227 -12852 -5782 -13103 -11574 -5459 -11832
17810 -11832 8100 28595 31177 35434 31939 33533 20883 5261 -7951 -14485 6639 26366 7949
17797 7949 5405 4233 15214 16370 10019 5238 5582 -3969 -7414 -9838 -8518 -12929 4717 29935
17783 29935 40023 35973 25817 13989 16845 27282 41381 41343 16478 -5989 -5850 1562 6323
17770 6323 7075 18441 8098 2757 -9695 -13435 9029 30778 21083 -706 -21056 -15331 2162
17757 2162 10716 17677 26670 25219 8028 10028 6879 7214 18399 20199 11023 1777 -5065 -9338
17743 -9338 -9525 3321 387 -20111 -27494 -16437 -14381 -17174 -22805 -16492 -15750 -10805 1172 11145
17729 11145 7613 13993 11108 5574 7873 16977 8509 -979 6427 15230 23937 13210 4539 11165
17715 11165 18974 17305 12776 10174 19296 33936 25651 17812 14327 14339 15394 33277 33783 32633 20924
17700 20924 3209 -13696 -7555 18580 34271 20967 7415 -1363 3891 6081 8455 9477 9159
17687 9159 12135 9913 19366 12430 8928 11280 16851 20541 24080 34452 55941 89571 135319 177349
17673 177349 216412 252512 298746 351517 340506 310190 287629 268626 269383 251039 200275 140530
17661 140530 123763 104640 89870 92188 100684 105996 100570 92027 134715 169376 206228 225796
17649 225796 265604 310613 361617 377955 346180 324137 318261 334352 315544 257827 227604 235099
17637 235099 237092 259612 274920 286744 299812 300587 278087 228705 206130 207594 216943 224333 237781
17624 237781 251166 254916 267572 267300 213800 149051 124106 131893 145359 189439 213496 221740
17612 221740 242318 235848 223083 215439 184647 153490 164359 176465 187056 212803 231640 225455
17600 225455 229667 249305 247036 210373 167765 122682 86799 61634 56873 62483 57474 37377
17588 37377 32423 36494 28777 29366 26706 22657 27824 14372 -1359 8098 6853 7522 20602 30529
17574 30529 28715 36064 29428 20818 18376 13466 12306 9402 27426 45726 43728 53753 41676
17561 41676 12665 -475 -4467 11190 20666 6736 -2524 11690 21752 7505 -1332 13816
17549 13816 22486 27529 19523 4047 2507 -4028 13435 10799 19493 9946 -8644 -14993 3739
17536 3739 11141 -4222 10679 6168 -6867 -16732 -14751 -5833 -9982 -13706 10690 13526 -4482
17523 -4482 -22143 -15568 -12506 -14039 -12961 -7905 -6907 -14957 -4024 24362 12928 726 14535
17510 14535 23001 25545 19636 22127 13688 -5907 -11201 4108 2435 899 -2200 14809 9643 -1786
17496 -1786 -8790 -9612 -1420 15232 23466 32571 36957 35212 55642 46495 4461 -26396 -27664 -929
17482 -929 21085 14871 933 -6240 7420 33279 32322 9571 -16779 -25720 -19519 -7884 6178
17469 6178 3941 -16536 -12620 -2797 -5122 -12260 -7487 -1040 -4877 -969 2807 6581 19634 26642
17455 26642 26857 31590 26314 31594 34744 37480 48052 55326 54987 57649 74405 88365 99204 98397
17441 98397 102398 102914 87518 66207 48156 34774 44977 42434 26944 15514 5886 3479 -5958
17428 -5958 -5297 2528 9041 16328 9954 19078 29160 20292 26161 39063 38832 42266 39781 11990
17414 11990 -4398 -5870 2053 9715 27496 21182 29125 34677 35418 23313 11065 12404 27499
17401 27499 27460 8307 7567 19661 9951 -2267 -6869 -4117 -857 16134 25114 37345 23042 10261
17387 10261 10291 3151 -16085 -26087 -12193 -11719 -16228 -20319 -15627 -9078 -4205 -22797 -35898 -23879
17373 -23879 -9551 -14213 -2706 4000 -10586 -23213 -31443 -20843 -17157 -31139 -28914 -40158 -37804
17360 -37804 -40896 -29106 -34217 -58680 -73276 -60620 -30781 -22493 -24664 -24059 -23135 -32210 -42833
17347 -42833 -39256 -24630 -22325 -20028 -7410 -3291 -2346 6006 12467 23769 17296 14670 14903 1718
17333 1718 2393 38 9015 42641 45889 61543 53447 56860 78285 80742 50567 46838 56453 70185
17319 70185 71432 61054 64609 73667 84443 88136 80737 75318 62865 60925 57848 47688 35304
17306 35304 50175 62211 69157 79840 68630 59547 41387 30944 36901 37890 41728 47369 48948
17293 48948 50468 59591 62913 63599 68629 61256 60018 42812 29403 29941 18140 8136 11402 8199
17279 8199 5563 1196 3808 17623 25672 39208 33507 26595 12921 10765 14606 27377 39452
17266 39452 24677 24927 29330 55846 60118 49007 48316 38216 33742 34215 43639 43118 49660 55341
17252 55341 61116 59470 62889 34034 21982 24860 38254 46298 37245 24522 17896 33216 23205
17239 23205 27090 35606 21273 27144 26590 36674 35467 31600 24057 23627 29339 20999 24363 40572
17225 40572 45896 63402 59587 48140 55384 42410 12099 -100 7969 1556 20093 33857 27877
17212 27877 34123 19439 21277 22039 18990 11936 5227 4553 10339 18698 10885 17118 30778 54758
17198 54758 74727 88389 100028 116716 116682 92018 74828 86944 101984 91598 85910 89770 91008
17185 91008 92622 86652 79333 77620 87072 99385 99195 105752 94535 96689 96817 86787 58698 59399
17171 59399 70650 79870 87462 103327 128386 132538 117426 105116 111259 129144 140140 141420 155394
17158 155394 171667 169923 155235 157246 171018 188417 216360 241812 243096 275913 330549 379736
17146 379736 399037 419265 435358 440814 419219 381905 370910 388495 442459 479325 530048 562430
17134 562430 603855 633277 643952 618956 600117 575929 536221 511207 511824 527123 549860 562148
17122 562148 575174 586147 607045 614086 568534 513635 497329 524285 582439 646334 676786 689587
17110 689587 715871 749149 756383 738854 748731 765769 798693 848197 896942 907348 908914 937636
17098 937636 997179 1093964 1181176 1287937 1401784 1484664 1575334 1632148 1646371 1705362 1830439
17087 1830439 2048158 2308303 2607972 2981388 3441694 4041414 4822633 5905899 7653192
17078 7653192 10567861 15145578 21168283 27159676 32389123 36911540 40231531 42717373
17070 42717373 43640293 37241693 28847310 25830354 27159870 30880928 34837433 38355063
17062 38355063 41342685 43282740 44612501 43660077 35057099 26147368 22137164 21589044
17054 21589044 23655902 27670961 32046836 35963807 39408071 41899083 43694205 44246630
17046 44246630 38126023 29513499 26046310 26914380 30178312 33740473 36863840 39438617
17038 39438617 40965662 41819762 40653410 32032963 22286868 16706016 13494357 11368118
17030 11368118 9774470 8511605 7430000 6339954 5460550 4825363 4333128 3906840 3514256
17021 3514256 3180722 2916359 2704786 2564100 2462379 2348451 2256622 2172062 2051119 1924582
17011 1924582 1813426 1707299 1600486 1507791 1438075 1376320 1347904 1326513 1286348 1253099 1218729
17000 1218729 1189826 1121159 1012930 936172 894863 867668 852884 843896 824445 802174 758532
16989 758532 725763 710413 680286 647167 614829 574751 544418 521813 513729 506247 493284 468747
16977 468747 447319 440234 454940 462807 456798 467034 476529 509300 532599 535296 526791 507237 474099
16964 474099 441387 420536 405254 380000 367390 381900 388569 367356 355010 332722 291552 264207
16952 264207 255136 273963 297063 294498 294396 299712 318799 332559 332732 322946 303896 285477 270669
16939 270669 269482 265662 249616 253148 250385 255234 273827 266184 229113 200995 198872 192387 173041
16926 173041 166906 157592 132949 119021 121075 132728 156300 139905 142112 153086 152065 134618
16914 134618 123590 122272 106526 99242 112394 124318 136147 136056 117579 105470 97328 101641 102809
16901 102809 96682 83583 73927 85009 108197 103938 92083 79044 82234 85769 90711 77436 67722
16888 67722 76625 91296 96972 97739 100897 99459 111353 112530 98281 81056 71560 78726 70374 63155
16874 63155 42274 39995 56637 65634 62711 70476 83419 70334 60398 63369 52452 43598 36601
16861 36601 26149 36051 54077 61411 62220 41316 35345 29468 24173 29559 27823 12972 27722
16848 27722 37081 35491 25196 14519 23407 33111 43310 44534 39263 35679 31285 26952 24882 27918
16834 27918 28726 21484 16908 4626 8039 16274 40385 47198 29072 24726 29889 34967 37758 34595
16820 34595 11847 -4080 21330 27496 28063 25263 25380 14219 36539 36200 26116 13808 7473
16807 7473 10928 12390 -2354 -9894 3337 12510 12412 -3975 -9572 -11222 2395 5065 -3589 1433
16793 1433 8869 26944 36195 19939 -10366 -18866 -8188 21032 32428 41366 47928 32638 32673
16780 32673 32591 33145 48192 57078 37176 14039 11479 17684 23578 27283 37353 27379 17870 27199
16766 27199 36577 55828 84902 79276 72119 56703 43431 39995 45590 46724 46191 65427 53120
16753 53120 51802 64995 67134 54855 39134 48746 54297 44345 29718 37514 37719 30653 43441
16740 43441 59443 90277 107129 82572 58134 36345 19129 21968 33283 63814 88696 80950
16728 80950 69983 56798 46938 15363 -9238 -5632 9667 8524 8694 7139 -4806 -19631 -15055
16715 -15055 -20584 -30163 -33693 -32935 -23696 -16903 -24496 -13237 6317 17620 7085 14032 13277 5920
16701 5920 -7854 -10346 -16974 -9170 -21025 -23058 -15015 -12162 5865 -5202 -19685 -20093 -20792 -7102
16687 -7102 2233 6859 9294 4945 469 4538 -3801 6337 14793 9128 -5686 -12119 -20513 -21410
16673 -21410 -22833 -12996 1228 -136 -2906 -1974 12023 28406 32378 24365 22537 8311 6218 10441
16659 10441 1071 -7328 -6240 -25923 -38764 -41789 -39861 -21440 2605 7257 20655 18125 3222
16646 3222 1028 -10596 -25034 -31327 -7225 18722 12159 -6869 -10913 1769 1592 -5745 -10773
16633 -10773 -14282 -24075 -17359 5733 10587 18568 10591 7128 15908 14285 5049 -10430 -18776 -19070
16619 -19070 -17076 -10345 -17631 -24095 -25937 -14768 -27 10120 12111 2600 -10899 -6081 4701
16606 4701 3125 -8749 -14074 3220 9795 22651 19870 2979 -6940 -16702 -8270 2588 -13052
16593 -13052 -30385 -23571 -1824 1363 -6071 4769 1563 -8784 -2210 5189 10887 4677 4076 -10036
16579 -10036 -18600 -11091 -5609 3966 26454 22361 -3010 -15636 -12542 -9232 -22247 -16715 -10958
16566 -10958 -7605 -9410 3329 12037 13645 13787 15492 10693 2437 10932 11836 14102 8489 10957 24771
16551 24771 27711 7307 5033 12720 -7343 -18215 -15959 -818 1959 9629 2697 1912 -1689 -15100
16537 -15100 -21973 -14274 -10418 -2029 -5833 -999 -8556 -7695 2540 2679 3475 470 6491 -2392 -3471
16522 -3471 5393 17634 22490 24268 42497 48309 33534 27797 23703 26207 35126 52182 61127 90414
16508 90414 129329 137069 145918 173072 199084 212852 232066 242781 191252 135073 111343 117478
16496 117478 154045 178493 193245 211730 223173 259758 246100 189193 147320 124328 143842
16485 143842 157990 161926 180376 215171 245158 262711 278396 262893 211653 173139 160654 176902
16473 176902 165181 179464 207799 217926 217629 226462 210988 162831 114022 99241 76359 47968
16461 47968 40133 31296 48624 42697 33788 33581 32632 35247 33095 17596 12334 7751 2558 -470
16447 -470 -2360 3812 22797 11756 -6935 -3574 3146 15262 18215 11655 6472 -7398 -9709 -2753
16433 -2753 -6530 3644 4242 -9597 -18887 -29773 -10938 5935 15216 9058 16361 16958 7232 7413
16419 7413 -792 1694 4680 11101 4348 -13949 -21892 -3253 -2565 -14997 -19553 -20464 -9094 854
16405 854 8183 2059 620 6412 432 -24762 -17370 -10593 -15384 -16736 -8232 -2707 -5613 -7609 3686
16390 3686 9908 6216 -6764 -29558 -25893 -3934 -18 6068 3067 -2041 402 -10437 -24445
16377 -24445 -34737 -38251 -17194 1523 21227 16603 3532 -10328 -10389 4484 8575 16337 30335
16364 30335 17079 10062 6650 -6620 -12458 2137 9851 13346 12428 2482 2003 -1714 3527 -6199
16350 -6199 -9762 -13656 -33118 -41463 -28034 -25978 -21525 -9401 -3420 -3405 -3520 -17923 -25223 -20545
16336 -20545 -6102 2190 -15214 8171 24290 28565 13657 -13451 -14512 -15287 -6573 1723 -2663
16323 -2663 -2597 4072 4259 6829 19326 35088 20315 12781 3675 16366 12398 12110 8035 -443 975
16308 975 -7309 -8221 -1778 -1793 511 7553 4212 -525 607 -5160 8971 17608 10097 -1492 -15676
16293 -15676 -14905 -12143 1256 24596 19092 7776 -11141 -12951 -5046 -4064 -12927 -14140 -9030 -12874
16279 -12874 -23171 -15932 -6935 -10088 -6539 -8034 -1308 -161 13895 20393 15693 10988 7140 15180
16265 15180 4044 1061 -8611 -10782 -3474 -7490 -12272 -6254 -7718 -6300 -3432 -3303 -1259 -4913
16251 -4913 3300 9974 15260 14044 -368 136 2299 5651 -3217 -17071 -27976 -42977 -34154 -11332
16237 -11332 -9849 -3225 -4311 -3331 14148 21460 24307 23570 19158 9405 -15246 -11795 -11690 -6734 19277
16222 19277 33611 31117 39977 32151 23957 27934 19566 18485 21837 15739 3458 -7889 -33649
16209 -33649 -47083 -57456 -48311 -19102 -7816 -12293 -28369 -39994 -24439 -9973 -13136 -27168
16197 -27168 -52277 -44907 -16914 -12899 -24914 -13243 -8470 -9591 -23518 -28983 -20753 -24564 -16796
16184 -16796 -12597 -17199 -14256 -9317 -142 7014 15556 14772 2948 113 5854 10420 5395 3653
16170 3653 14495 20328 21983 10346 -9674 -19874 -11551 -11412 -10394 -10728 -1985 6252 -10903 -16883
16156 -16883 -1743 9725 933 -8480 -4295 -6729 -454 2658 -6058 11751 1097 -4323 -20428
16143 -20428 -40101 -42537 -19720 15353 17662 7352 3564 14436 15721 10128 17751 14269 19540
16130 19540 13856 14046 11495 7583 -3648 12837 13918 -202 4151 9061 5651 -1312 -4549 1550
16116 1550 1080 -1009 -5099 -2012 5534 16000 18126 12863 -4276 -6433 5662 6512 11100 10898 -1296
16101 -1296 -11834 -12633 -2328 -8869 -21108 -20717 -9436 -6152 -15177 -26203 -20163 -10669 -7563 -13613
16087 -13613 -15116 -12209 -9720 -5688 5780 14133 9252 18268 8514 -13747 -9386 -1256 5367 -5269
16073 -5269 -19923 -25314 -18635 -11571 -7697 -600 9114 23231 16804 5703 13709 16829 11661 6867
16059 6867 -4522 -13506 -16235 2757 15773 2571 2353 -8172 4315 544 7514 12418 20852
16046 20852 19821 12280 1675 5549 -123 -3955 8843 3239 -17200 -24179 -7803 21411 36277
16033 36277 19160 9138 16620 3828 -8370 -14369 -2795 5109 11807 11125 17949 5532 -10196
16020 -10196 -10513 -15618 -31865 -29408 -8596 15548 17957 8656 6075 1904 8306 17468 7861 3469
16006 3469 1748 -4721 -10230 -11910 -15303 -15650 -1800 2573 989 -10319 -15781 -30564 -15957 -3848
15992 -3848 10958 27261 32280 21143 14560 22555 11575 -397 -14067 -24492 -28277 -9589 -10394
15979 -10394 -13204 -12685 -18323 -23927 -29139 -11576 1513 22916 34272 25018 28178 19556 12587 12678
15965 12678 1263 15831 22306 22340 14649 5900 -15533 -24273 -28854 -38483 -46425 -33791 -23158 -10641
15951 -10641 -4034 -6148 -12667 -13876 -7925 -15719 9275 8316 -6846 -14900 -14729 2384 13729 1977
15937 1977 456 -4488 -22180 -19427 -5802 -14707 -16678 -7637 -1136 -11826 -18980 -5334 -2553 -6421
15923 -6421 -13692 -13943 -6415 7208 18481 12194 -4676 6025 2821 -3081 -4358 8118 4952 12444
15909 12444 6556 1519 -2911 -4948 -27007 -42663 -20266 7804 -5496 -14284 -5999 -15631 -20621
15896 -20621 -22229 -23124 -27322 -13930 -904 8435 7851 2989 23986 19357 5602 -14702 -32382
15883 -32382 -25484 -8475 -6480 -5476 -8819 -13286 1943 20578 11965 -21581 -22080 4449 -472
15870 -472 -4657 4779 8498 3900 -14073 -16878 -15391 -14296 11679 22471 26549 11958 -10217 -10072
15856 -10072 -13143 -18305 -12565 -16634 -20180 -20549 -15267 -4006 -7439 -15031 -32091 -25552 -8758 -13557
15842 -13557 -17601 4818 6445 12987 -4944 -11952 -8054 -3042 -7656 2757 -600 -1816 -1336 8721
15828 8721 17891 17122 4094 -4157 -3771 119 -11094 -18718 -3654 9085 20047 19198 -2276 -13062
15814 -13062 -6219 -10543 -3956 -3807 -13317 -3372 2409 -16637 -31664 -42089 -30147 -4499 -10770
15801 -10770 -29055 -43852 -48965 -46276 -17181 -14905 -24438 -21873 -17201 6467 22776 20617 11957
15788 11957 2521 7527 -4778 -25884 -23430 -5068 4104 3605 -7865 -9822 -4645 -4548 5154 7609
15774 7609 12866 6543 -7052 -22446 -21345 -9986 -1212 -5293 -12972 -15671 -19489 -11526 -15235 -27946
15760 -27946 -18261 -7055 -651 -3958 -3820 -3198 -4531 -6154 -2856 -2211 7380 11598 1542 3155 3504
15745 3504 -3004 -7658 -12846 -16863 -11902 -611 5127 17885 12963 -1631 -5116 -9962 -16691 -11645
15731 -11645 -6218 21650 25969 3103 -92 -5570 -3235 23428 36413 26757 12272 9909 15705
15718 15705 27037 14861 20389 31046 23999 7929 14285 8987 -8849 -5849 7532 2148 1221
15705 1221 1715 -8484 570 13667 24452 7961 13407 23198 22952 13809 14990 13522 2737 112
15691 112 3759 3415 -5164 -4548 -8680 -11083 -7812 5558 8747 310 -20840 -19344 3589 19346
15677 19346 9224 4189 12182 33548 40641 39270 34460 6119 5825 8706 8543 -691 -13311 -18620
15663 -18620 -21791 -12854 -5198 5020 -3138 -10226 6324 17793 19945 14992 5425 5213 -3028 -2498
15649 -2498 -11355 -8015 -1354 -5052 -2990 -20662 -26958 -3843 -4611 -24798 -11567 -20690 -25897 -11304
15635 -11304 -6321 13022 26090 16134 -2072 87 -6678 1889 12104 -894 -19084 -27096 -9509
15622 -9509 -3056 1462 2746 192 7977 8193 8398 -2220 6417 15902 2255 -1923 12858 13446 -4026
15607 -4026 -14583 -2447 -12269 -18983 -8603 -9600 -23839 -26709 -10077 -9440 -15737 -15868 -22667 -36096
15593 -36096 -33548 -7813 2227 437 2123 5365 -6650 -26498 -32550 -32099 -33161 -38017 -26323
15580 -26323 -20774 -7284 570 54 -4521 -22367 -25001 -7009 -420 9596 11054 11923 18366 24153
15566 24153 20900 17237 4346 -6969 -9421 -12767 1433 16783 10135 9708 -913 -8942 -8298 -22732
15552 -22732 -10135 -1843 -4195 10665 -4713 -22923 -49642 -51024 -29727 -15372 3284 13595
15540 13595 19350 17249 17487 18165 9512 -6691 -13913 -2832 4262 5135 4044 -4709 11349 20024
15526 20024 2141 -2204 -3745 -8980 -10687 -697 1248 938 -3612 1629 7571 -9352 -13833 -9527
15512 -9527 -5389 -13786 -18277 -10385 10042 13626 20915 20425 874 3075 -11881 -27594 -41529 -44616
15498 -44616 -28468 -33283 -25077 -7684 -6962 -10416 -11353 -5582 -7347 -20683 -23857 -14353 -7943 -697
15484 -697 -4735 -8076 -18191 -39285 -37174 -47966 -33120 -14827 -11608 7520 4731 -10563 1676
15471 1676 5606 -2391 -16692 -21052 -25533 -34750 -35533 -23568 -19730 -31690 -21534 -3862 10202
15458 10202 3411 -25224 -24540 -5901 -7990 -11924 -25278 -25007 -27056 -32064 -31845 -29504 -30521 -28135
15444 -28135 -27305 -21180 -25289 -25969 -39143 -43927 -17210 4018 -13503 -18569 -5349 11725 22966
15431 22966 19501 18009 19404 16675 1765 -4987 -3687 1357 -3073 -10031 -2662 6477 -160 -318
15417 -318 -1158 8611 6325 -6604 3595 2767 43 2729 10879 12431 -4612 -14846 4101 -10085
15403 -10085 -7465 -919 1125 -3274 4063 4612 -12641 -7077 -1063 -6206 -20107 -31070 -10720 1043
15389 1043 -4227 -4858 -3739 -3248 3317 9795 6075 -3731 -11134 -13717 -11848 -5442 4162 -21888 -34867
15374 -34867 -14192 10994 20024 11827 -6170 -15377 -10347 3730 16518 14420 6792 -8949 -9979
15361 -9979 -16857 -12416 -97 21151 17877 25463 19724 21506 25087 16566 4303 -9413 -17297 -26699
15347 -26699 -21001 -14578 -649 3309 1255 7721 25166 34439 14684 2800 -14069 -27575 -20190
15334 -20190 -10713 -20507 -28986 -13810 6132 11925 25765 26624 25418 20344 21589 10702 10667 21925
15320 21925 12457 -10128 -37149 -30022 -24061 -15103 -2951 -4203 1964 -5814 -12089 -10774 -4370 -10110
15306 -10110 -2286 -1960 -3720 -15729 -4880 -1288 -11147 -14644 -11726 -11874 -6273 -9243 -7674 6528
15292 6528 11821 15349 2396 2327 18262 33659 23880 18694 8118 -14243 -27030 -19816 -10295 -4448
15278 -4448 -8591 -3819 4463 -8604 -7654 -2905 -8420 -17296 -13496 3530 16567 3662 -22857 -17802
15264 -17802 -8794 1606 9394 -1813 13541 16742 11513 11490 18979 12029 9589 -8052 -15985 -29987
15250 -29987 -31536 -19455 -17329 -11639 -5968 -14176 -3097 8107 654 -12180 -36004 -38936 -15287
15237 -15287 5259 -3703 1434 -1692 1513 4291 3383 -4799 2131 6081 -2959 -1131 -6005 -22825
15223 -22825 -10060 11149 22216 19668 -631 2115 12707 -5709 -21456 -7565 21362 11999
15211 11999 14798 15969 14963 10070 4243 16997 30106 23155 12309 -7647 -28172 -22866 -12199
15198 -12199 -911 10281 9194 13591 6294 -1489 2671 -9167 -15900 -22177 -27200 -1515 5944
15185 5944 -5208 -21028 -24889 -12890 3970 22883 16830 4774 -4834 -6282 395 -16977 -32806
15172 -32806 -26821 -10506 -7295 -11336 -13885 -23953 -29655 -37742 -30869 -24957 -18798 -2510 10195
15159 10195 19000 15570 15371 6622 2996 -1542 -15885 -7548 -6409 -5063 -1843 -15010 -28245 -34024
15145 -34024 -15242 -2415 3403 5612 7950 8623 -4578 -9057 14483 19149 7849 654 -4270
15132 -4270 -17180 -19461 -6674 7424 -4178 -20204 -17716 -22600 -16711 -6720 4891 12994 21183
15119 21183 5950 15404 37207 23597 814 1918 -66 712 1082 -7195 -7112 7327 7108 -13627
15105 -13627 -25113 -11533 -17480 -17160 3498 8030 -1815 -9207 -14268 -11976 -6780 -12381 15497 10437
15091 10437 -9610 -6582 -11454 -16980 -13871 -18454 -16044 -7880 4070 7335 7817 -10323 -11764 2609
15077 2609 8064 12235 2135 -8830 -25680 -36245 -23264 -5474 -14458 -17240 -17780 -27423 -32734
15064 -32734 -23357 -12787 -8670 -648 -6885 -4452 -7845 -11989 -12949 -7563 5917 19004 15269 1688
15050 1688 3068 21258 16200 7217 3166 -265 7809 8336 -2934 -11920 -7498 -6710 -8409 4074
15036 4074 2921 5997 12859 10051 6876 1386 3438 1111 -8279 -5790 4353 21975 21186 36169
15022 36169 37341 20395 -3366 -23111 -32377 -7588 3289 5131 -12989 -5881 -8685 -10472 -8605
15009 -8605 -1298 -774 9229 3496 585 11749 2616 -9182 -375 7274 -7101 -12239 -11826 -4579
14995 -4579 7667 7759 544 -7891 -14610 -15326 7231 10782 1626 -1815 -9 2807 -2935 7044 10681
14980 10681 7670 -8532 -3224 -915 1471 8850 1677 -7007 -20796 -25105 -29032 -25121 45 5842
14966 5842 12638 20045 9281 14709 13186 -11312 -21746 -24917 -14690 -4929 -2744 8697 15501
14953 15501 4968 -4683 -10604 -1607 9823 14773 17516 16113 3407 5578 24636 32835 18865
14940 18865 22954 30260 39640 41349 42406 47386 40789 35701 22438 13780 2539 427 -1991 -21547
14926 -21547 -24033 -19283 -9674 -3626 -5119 5285 -4206 -12326 -15930 -21322 -12178 -10562 -207 -4844
14912 -4844 -26246 -20968 -2386 -616 -6687 5093 10662 -9336 -19901 -20023 -21722 -4465 -12747
14899 -12747 -24362 -34049 -21366 -5367 -16381 -28296 -27124 -24335 -11057 16308 25379 7047
14887 7047 -8705 -7920 -6351 9696 17198 14454 16096 -1823 -2714 -6371 -16201 -5889 4280 -18903
14873 -18903 -28906 -15467 861 11743 1675 7262 17027 11054 -5978 -22175 -13198 -140
14861 -140 6008 15281 21904 11305 10386 -1517 1154 -4956 -14618 -8603 2536 -14097 -12920 391
14847 391 -11689 -8131 7357 12925 7546 -11538 -27457 -32859 -24610 -18006 -26358 -29290 -21511 -21154
14833 -21154 -22439 -9040 -1334 -3102 -13897 -10343 5074 26223 33087 17301 19078 4355 -5492
14820 -5492 -4775 -2198 5008 15671 677 -998 1929 11881 5817 -9083 -18960 -13199 1297 -6247
14806 -6247 -10830 -20565 -32698 -20781 -13768 -13571 -7776 -16785 -15987 -20366 -29163 -26225 -22675 -1881
14792 -1881 -3494 -10378 595 14987 25783 33068 12880 -2965 -4647 -10350 -14127 -35048 -19960
14779 -19960 564 16057 12382 2614 1388 425 -16217 -33589 -38630 -31902 -17080 -17064 -23913 -14448
14765 -14448 -3481 4777 12152 21445 17837 15536 11145 16304 23951 24582 36164 33711 14689 67
14751 67 -4524 -10459 892 10781 12038 8029 -3682 -12938 -13185 -10813 -8647 -8370 -3257 393 1334
14736 1334 4960 4926 9786 5782 -12702 -31645 -48916 -22828 -12210 -16450 4564 2948 1385 1882
14722 1882 -11704 -27549 -21475 -7883 -8317 2507 18359 32081 38671 17760 721 -2851 4822
14709 4822 -561 16281 6464 -23123 -36738 -24828 -16886 -16168 -21901 -25219 -23256 -13821 -10723 -11415
14695 -11415 -8781 -6285 -5760 -8973 482 -784 -6055 -4009 -13391 -29984 -19043 -3232 -6490 873
14681 873 21892 22692 22671 14683 736 -1696 -212 6425 10247 14095 -13167 -16442 -23023 -28855 -29537
14666 -29537 -31210 -38019 -37738 -18243 -16597 -19380 -14023 -6670 4595 13637 1902 -5254 7661 6395
14652 6395 -1979 -9758 -11806 -18847 -1957 7313 4163 1199 899 2376 -9457 -7447 14009 6961
14638 6961 -4393 -8694 -3962 -1978 -10197 -18417 -25484 -30922 -21972 -8155 -13623 -16723 5147 9064
14624 9064 3976 -1423 -11089 -11237 -14435 -28410 -29530 -13597 -2213 -2512 -1732 9231 -145 -5413
14610 -5413 -12536 -14050 -21802 -13293 -5337 -788 9001 12667 3117 -9650 128 -4337 -5942 9660
14596 9660 18516 12967 12161 7520 -10998 4267 -1741 -9144 -5096 458 -5693 -1470 6058 13386
14582 13386 1415 -24983 -37234 -35284 -14050 -4384 -8395 -5708 1662 -8864 -12530 -18865 1362
14569 1362 6931 -6519 -13660 -10195 -3868 -1568 1546 -1174 -6258 -7815 2393 1187 17699 19463
14555 19463 16275 9073 -2429 -10990 -9928 6905 17279 38921 39521 36650 21130 16506 20863
14542 20863 20595 6306 5735 6024 12833 12959 5500 -13420 -15903 -14966 -11037 -30625 -30398 -19391 -11837
14527 -11837 -16622 -6880 -4807 -13542 -27118 -25058 -15821 8401 9754 -12236 -5996 -9646 -26375
14514 -26375 -24895 -12968 -11908 -9239 -12077 -9145 -9473 -12275 -11387 -3027 -557 -9703 -18339 -220
14500 -220 17478 5992 3495 21454 34303 21507 2020 -2283 4371 -13298 -11522 3856 11721
14487 11721 -490 -27707 -43261 -24799 -7557 12537 17966 15568 2277 -2842 -2271 -9620 -17508
14474 -17508 -765 8767 7414 18128 27302 -300 -6998 -4323 -9838 -9434 2925 -3251 -29372
14461 -29372 -35431 -31138 -23868 -25097 -15822 -583 6214 -9452 -12559 -4333 2696 1840 12707 22666
14447 22666 32863 29696 51881 25495 10863 9924 -4715 -23587 -25612 -15717 -17265 -2853 396
14434 396 10545 1516 1870 13262 1412 -28747 -25350 -12736 -18209 -12713 -1866 -313 4528 21880
14420 21880 26131 29049 29888 20703 15626 22231 23556 31108 25475 19750 16383 11749 8937 9406 13936
14405 13936 8145 -4752 -429 7392 3088 -4707 8848 -2673 -14789 -22072 -3779 7843 53
14392 53 -8817 -21047 -24570 -15605 5756 20817 12919 3470 16051 18515 25717 14811 -10512 -14912
14378 -14912 -10288 -4119 -4331 -8874 -7768 -7141 4020 2023 -5616 -12659 -4575 3169 -8031 -7904 12818
14363 12818 27711 21357 12306 8012 2338 17986 17304 8976 2691 2506 -2103 -9785 -5700 -947
14349 -947 -6808 1970 -6988 -8623 -75 9186 12132 -3094 -14731 -19780 -1543 -3327 -7746 -5621
14335 -5621 -9585 -13262 -16641 -8426 -3309 13829 28213 33471 29164 12076 3913 11206 23931 31827
14321 31827 26823 23812 40300 51010 44756 37231 24536 22858 31595 37533 41420 32045 34302 24265
14307 24265 5233 -7718 -4778 -20948 -15696 -623 1445 13114 12661 10341 -5228 -2523 5302
14294 5302 9780 25249 30708 25927 14301 5645 6489 737 -9060 1441 19371 17398 7432 3340
14280 3340 27042 30656 18527 6038 3957 -222 6852 16378 19498 4507 -6348 -25643 -31455
14267 -31455 -19765 -10014 -8406 -14180 -17099 -16766 -12582 14925 24687 6909 2679 12020 11538 11424
14253 11424 16489 3028 12692 5012 -11742 -25076 -11632 2947 14873 -9343 -26170 -12946
14241 -12946 -10608 -15691 -474 2712 2841 -1212 -3246 -8689 6644 9371 11825 -7565 -892 2400
14227 2400 8092 -7737 -4064 9660 19043 17113 18876 13321 -15037 -20237 -10505 -7508 -2325 5304
14213 5304 -2902 6 9087 9678 8026 5140 3910 7566 6192 -4338 -17877 -29962 -33645 -16072
14199 -16072 -881 -5045 -6545 -5725 5807 781 154 1009 -864 -20281 -31380 -31189 -33644 -26336
14185 -26336 -20482 -16252 3347 13260 4332 8216 24837 26398 25075 19001 21688 39040 26872
14172 26872 13959 8224 -12711 -24216 -24361 -28082 -9343 -2501 -6999 -12818 -25250 -22745 6859
14159 6859 28832 32310 16226 20052 24656 5581 -7294 -4967 -5194 -6877 -13767 -20007 -19723 -11423
14145 -11423 4872 16821 31363 32387 19169 18200 32711 41940 30827 6165 10985 10418 2441
14132 2441 -14319 -23098 -14375 -13002 -15485 -5402 -15348 -28117 -17493 5579 20563 28649 22156
14119 22156 21834 18058 1618 637 11171 10071 2606 -7051 -11842 514 4654 2460 7953 10639
14105 10639 8044 -12659 -15852 474 15112 25933 17138 18424 28239 12409 16648 10152 -594
14092 -594 -17491 -16051 4235 -4650 -18325 -21332 -36374 -35977 -19969 -11286 -13565 -26397 -33896 -15672
14078 -15672 -292 13372 6507 3920 10257 11590 6898 1199 -5595 -618 -5566 -13204 -13757 -7550
14064 -7550 3308 21967 9583 6369 17758 20494 34910 32283 14009 12226 28814 37400 38815
14051 38815 39453 36128 34327 26054 23994 22566 26900 26686 33594 30328 18397 8489 1632 5512 1707
14036 1707 -15796 -4201 8959 9150 15607 10839 10035 1615 569 819 15311 19631 11035 16745
14022 16745 18212 20052 5619 -656 -7404 -5038 9876 25596 20894 -5804 -7846 7676 22788
14009 22788 24725 14637 2407 -7280 4126 -7378 -16008 -9833 7777 23252 24567 24536 9291
13996 9291 11147 20439 10856 21950 33330 15049 333 -10492 -13958 -9726 8334 15272 19396
13983 19396 41759 43678 36223 37430 33390 27465 28738 36986 27835 33458 41472 54715 61075 48538
13969 48538 38842 33825 32521 31746 22604 24753 32375 33729 31282 18236 12933 30532 37038 35539
13955 35539 40756 50735 44695 49208 61393 55206 57111 52824 64026 65971 60447 62569 53560 63760
13941 63760 69292 71003 70031 75531 85561 96883 117313 133787 165516 199615 232982 317035 458375
13928 458375 666899 913444 1139371 1333163 1489349 1598074 1676168 1609564 1196757 807904
13918 807904 584555 453561 373848 320794 255760 195258 173256 169378 146320 131818 125686
13907 125686 112822 107066 101179 92944 79049 79993 85756 80793 68967 66076 58017 59401 58530 42641
13893 42641 34095 42641 51464 64562 75471 84144 89587 107868 99247 84788 69126 53959 47239
13880 47239 62725 65667 68821 68425 59622 62268 72909 92575 115453 121149 114074 127618 142869
13867 142869 147438 154089 158057 163186 182176 215505 259898 295982 354801 415459 493016 604426
13855 604426 801715 1149380 1721595 2584914 3616943 4555013 5384828 6038756 6464328
13846 6464328 6812100 6522498 4591576 2992608 2158020 1688805 1362805 1116856 928195
13837 928195 764172 629516 534027 462550 403912 366263 334595 303738 271710 238862 222994
13826 222994 208443 204330 199444 175436 167739 148312 129509 111732 99775 108979 118723 126442 118896
13813 118896 124139 123580 118245 120607 118082 111686 117334 109074 98598 104960 99209 81169 83879 84156
13799 84156 69865 67144 74528 73902 60002 60279 85162 81526 78580 92099 100392 88012 79186 90797
13785 90797 83600 77705 59896 35081 38267 36452 21860 28567 42009 26157 33248 60374 70337
13772 70337 81103 74987 47356 24255 8701 11767 23773 37164 35122 31320 28899 7757 -9799
13759 -9799 -44194 -91525 -131457 -175048 -204202 -234478 -262869 -235875 -186974 -142085 -118500 -103708
13747 -103708 -78130 -55983 -49513 -36118 -31085 -43001 -61005 -57065 -40798 -19550 -16064 -12818
13735 -12818 -6873 7051 22591 15749 25374 18488 14382 6908 12506 32920 21487 27224 31390
13722 31390 22103 16927 19837 23946 16146 9393 15291 36786 51011 55549 54811 53979 67165 78947
13708 78947 70354 88138 110296 145887 189004 228078 236053 264275 325747 341222 338011 309203
13696 309203 278373 272788 225172 167737 128021 101422 83380 82671 79878 78912 74674 72834 57535
13683 57535 36880 30130 36471 43870 38118 28544 27705 33807 35959 44709 43099 46512 29092 15630
13669 15630 11779 10651 14433 30198 40788 44829 28561 19466 19018 29204 21604 21588 29461 27522
13655 27522 34533 54979 67924 58743 50785 55318 72936 99225 101014 82915 64398 76642 81976
13642 81976 71758 79199 97534 91257 88060 84883 99220 115234 125436 126261 125004 142565 109659
13629 109659 26838 -17429 -53722 -82802 -101843 -109283 -108791 -72632 -38439 -6545 12957 21303
13617 21303 28262 34221 36397 38670 46701 41246 7667 289 12014 25522 48642 44464 43169
13604 43169 63484 54971 40868 41850 31845 37355 39726 73955 113688 120977 129583 126597 131367
13591 131367 147953 150921 157947 149405 136296 117163 114521 87751 91449 95669 87752 79083 63361
13578 63361 65719 81910 122574 161490 205721 236099 276581 315874 348386 394634 414058 406645
13566 406645 397692 404356 407152 401074 375538 349062 299667 246862 223247 216705 197851 171014
13554 171014 179703 189195 176490 185765 179179 167055 192737 212992 211380 222601 245555 259213
13542 259213 277946 292140 296455 320376 336917 335703 321180 301377 273745 259768 272968 278529
13530 278529 276973 301638 324149 318101 312088 316575 337111 351485 351400 370506 374304 371107 391297
13517 391297 398061 388686 377842 377354 369429 385008 397284 445595 496860 535009 552461 590414
13505 590414 619845 641150 676244 694858 699097 692520 720400 772206 816925 835227 851494 861527
13493 861527 878578 904367 932878 971414 1010840 1058467 1123062 1159710 1210779 1286067 1370625
13482 1370625 1467867 1583509 1680845 1769655 1887157 2029633 2172441 2316077 2469273 2635306
13472 2635306 2833870 3084144 3351321 3646225 3962443 4288637 4654324 5114267 5653031
13463 5653031 6296734 7124651 8193060 9558094 11214472 13294897 15969640 19404593
13455 19404593 23980327 30498913 40396064 57101715 85295528 127270349 174886113
13448 174886113 216246334 251767107 279079757 296885110 312212662 292490186 203847897
13441 203847897 135204967 99585804 78478684 63267189 51408926 41983981 34543072
13434 34543072 28715634 24171133 20769447 18170237 15784771 13750674 12185477 10941177
13426 10941177 9913147 9045384 8277696 7666162 7183745 6751924 6336291 5933259 5582613
13417 5582613 5283987 5000060 4766842 4552335 4339789 4137466 3959895 3791711 3636883
13408 3636883 3462134 3290699 3119050 2985531 2868394 2751459 2637137 2550432 2452875 2355858
13398 2355858 2281004 2200151 2125426 2072904 2028350 2000901 1951389 1906495 1872975 1827725 1785489
13387 1785489 1724401 1610641 1500030 1442993 1409303 1358465 1328209 1309773 1293593 1248127 1204590
13376 1204590 1180682 1135355 1078350 1040170 1019446 994542 967086 951023 930543 893858 864425
13365 864425 844326 815012 776360 743161 719435 713635 700738 673337 624638 585925 550694 540664
13353 540664 522351 483309 469436 474147 472973 470221 470108 473613 465817 441538 438992 453720 453535
13340 453535 445105 436166 438834 430683 420120 401066 386024 367564 340433 289177 273121 284704
13328 284704 287354 258284 247269 244732 229427 230979 239685 249815 276861 301749 321050 375756
13316 375756 453805 506843 504733 477227 452131 418259 386029 330026 285218 266822 245726 233485
13304 233485 207932 183674 161541 166625 165639 148801 134369 117591 121698 159097 179831 192935
13292 192935 194785 191742 193442 179233 164534 150502 145771 133445 153298 168460 175789 191126
13280 191126 186929 179585 176143 168059 163167 159455 161585 158742 142873 136279 159483 184381 211326
13267 211326 217384 238238 253599 250813 224496 166002 103441 62697 47052 51797 50503 58994
13255 58994 76742 52073 44160 43126 52658 54856 51910 74934 97257 105911 100821 83161 76457
13242 76457 93870 99099 95257 79663 66292 54055 50181 57428 68759 68461 73907 82139 83500
13229 83500 96246 114642 109046 97100 84874 91644 86795 93211 109881 113702 98900 84012 63400
13216 63400 43892 31433 27317 29023 28854 34805 46245 51046 46760 62120 57024 39468 33154
13203 33154 13302 734 5218 21766 17762 13559 40219 38735 28580 23201 23758 27382 27735 30663
13189 30663 19707 28186 45240 33266 21140 31229 40550 38783 51282 61663 64158 66380 62651
13176 62651 72245 68820 59970 61935 58967 64659 55590 34256 30250 26156 37405 57132 51076 36854
13162 36854 39816 49376 55449 48680 42483 26736 18334 37406 54213 54392 55533 61103 59978 54086
13148 54086 57196 69001 87045 89429 113357 148420 205743 251907 291821 297221 292480 296543 301952
13135 301952 280554 242787 192876 139127 93304 79405 59886 54937 48395 37555 22578 12871
13123 12871 4399 16740 43855 43500 37086 46239 32800 16327 22874 18719 18248 21160 15406 3922
13109 3922 7555 2480 8097 15483 14970 4934 24200 34916 24381 24053 14062 17741 35741 49497
13095 49497 36168 36450 30880 12924 -2850 1145 -839 -15816 -12610 -1912 12929 16825 24584
13082 24584 30122 37431 30940 18452 -1931 10285 28753 30249 26434 23085 25456 16743 19272
13069 19272 28927 39468 388 -23890 3391 7826 -8923 -11154 -17303 -17752 -13431 -22459 -7466
13056 -7466 10417 18296 26795 10225 -3574 -12577 -10809 1724 28739 47192 33961 25125 14973
13043 14973 6222 25598 23583 11092 13931 5491 18090 18000 10118 -3087 -1906 -661 4196 5382
13029 5382 966 8570 10619 -3695 -1046 23755 27264 19435 9098 21474 23107 11990 8337
13016 8337 12417 11623 5341 9312 11317 25159 30835 19630 10591 -3019 -3924 -6771 8550 2898
13002 2898 2928 21018 31062 36368 47103 38996 23323 5711 13302 26843 53067 59090 39922
12989 39922 42552 42908 24167 13687 27326 38090 53412 60682 67274 64096 60987 57257 60337
12976 60337 56494 71793 81723 87414 116588 135440 133372 180850 267994 382551 564688 800549
12964 800549 1031804 1237237 1395017 1515143 1618992 1663015 1395293 946795 671151 521239
12954 521239 405480 302416 240758 206453 168520 162877 167809 159248 140510 118172 117132 109546
12942 109546 88414 61247 58878 51777 47092 46361 49891 36413 30237 45004 35969 32084 8716
12929 8716 11738 14960 9024 2865 -9674 -16846 -3784 14545 27356 12599 4216 -9939 -6441
12916 -6441 1738 18252 18480 3674 16830 1834 -9308 -13199 -8239 -907 11324 9813 -1275
12903 -1275 -5790 8848 8928 -194 8682 30453 26809 25844 13429 13304 15688 13159 14699 19772 18474
12888 18474 12016 1379 -307 -18221 -21486 -6166 218 29770 30435 24325 7390 -77 -1084
12875 -1084 4120 6615 23991 26111 6581 -5558 -21675 -21346 -11267 -14484 -16977 -15598 2890
12862 2890 17182 12988 -4179 -13383 -5599 9977 19221 34095 27903 15619 -3898 3035 12342
12849 12342 24492 21861 21112 27214 32220 24488 25078 33236 9192 2785 6418 -7827 -2763 2925
12835 2925 5011 2778 8948 20970 12141 11582 13363 15907 20058 38216 45788 36977 4636 -234
12821 -234 9741 8792 -2323 -9683 -22625 -20166 1360 7579 12348 10270 -5175 -21245 -11078 2476
12807 2476 8259 631 -14816 -12895 -316 12752 7147 2875 2094 7773 8616 7527 -83 17014
12793 17014 23051 29974 29491 29295 -1667 -17141 -1681 -5177 -1606 5567 19796 14122 17319 27825
12779 27825 33593 28581 31822 34216 22811 10901 10336 -1646 -4636 -9686 -11678 -12122 -201 8392
12765 8392 14825 1919 -6104 1742 3661 -4789 -11765 -15337 -373 4006 10345 6579 11173 2738
12751 2738 -7674 -22882 -28278 -15493 6689 7675 8391 5117 10125 22545 22773 21146 11881 -6117
12737 -6117 -6444 754 3702 -4038 -1465 10809 10285 7235 -2706 -7058 -1558 -1282 9996 14444 13257
12722 13257 173 -14943 -3815 2119 -3059 -5390 12995 35017 25282 22257 5864 6887 2241
12709 2241 14790 23040 28131 28607 30262 24903 12047 -6182 -20872 1452 -6208 -9208 2977
12696 2977 3337 2768 -3229 3286 -2165 -5639 -8280 -16008 -14623 -16639 751 7003 19888 31648
12682 31648 23720 17061 11283 -3776 10029 9982 8147 7908 11435 4849 -5736 -2168 -5981 -11552
12668 -11552 -22848 -27371 -15389 -13210 3093 7726 1594 6209 17929 23844 28253 24836 22378
12655 22378 5552 -4370 -9119 1382 19068 23948 8101 5700 -6684 -18381 -12973 -21307 -25465
12642 -25465 -20281 5791 953 -6205 -14069 -16627 -9403 -13274 -8791 5081 6338 4029 -6293 -7122
12628 -7122 -16166 -19141 -25901 -28304 -12904 -8668 -21074 -9242 -4703 71 18524 15712 492
12615 492 -13636 -4958 3949 9314 8411 -1946 -1716 -10390 -2091 -6137 -953 7661 13092 11968 9966
12600 9966 14627 8825 -8644 -16754 -15863 -9057 -2661 -2776 -5411 -12442 -6218 -23631 -19540 -14683 -34242
12585 -34242 -28074 -31433 -13922 -6300 1256 737 -8962 -12231 -542 10170 -347 -20249 -14859
12572 -14859 2439 8285 9459 5536 11043 21117 13167 -5724 4576 13388 4866 -8196 -17280
12559 -17280 -9575 -16720 -41899 -59186 -58369 -19223 -689 -4821 -8632 5483 -1428 -10239 -16967
12546 -16967 7518 12927 16627 15023 6228 1004 5010 -16549 -25490 -6268 -2106 4145 5220 -5349
12532 -5349 -2977 -8582 -18340 -2963 11816 5353 -3776 -7207 -8765 -10279 -3147 1776 -13640 -23206
12518 -23206 -6019 5294 12008 10920 8658 15601 21209 25937 10686 -920 1466 9570 9224 2658
12504 2658 -6874 -7775 -1400 -1071 1988 16946 13391 15963 18896 4334 -2910 -7258 12772 25282
12490 25282 37078 23965 17157 6052 -537 6549 12027 12804 14922 25384 23140 19016 22476 36527
12476 36527 32887 25866 27470 10520 10347 6092 -2938 -11263 1956 16133 24688 29739 31890 15691
12462 15691 -3891 9346 6875 3824 -2109 -15632 -21598 -11079 -12459 -15112 -14778 -2160 -5672
12449 -5672 1820 9610 5392 9891 12697 10357 -393 -1775 -852 -8241 -5703 -1973 15792 25893
12435 25893 29824 28568 20079 10511 12817 16403 13644 13318 4130 5099 -10659 -18729 -8414 11996
12421 11996 26218 30747 34304 13769 250 7225 25909 23366 -713 -19914 -16641 4390 -2785
12408 -2785 -13755 -9556 -4150 -9765 -12985 -18501 -24743 -12011 -9358 -5362 -2001 14804 13048 8159
12394 8159 -7683 -9469 -4461 -13451 -27377 -37695 -14373 8103 143 3491 -1196 7027 5125
12381 5125 6811 12149 -2155 3328 5535 618 -6171 -7332 -14250 -16975 -23339 -29776 -22472 -12375
12367 -12375 -6907 -14849 -6706 -5172 5231 21730 13680 -1541 -10404 624 19109 10858 -1059
12354 -1059 -10352 3651 6934 11766 2731 -17259 -15489 -6152 -5524 -1722 -39 8405 9772 5359
12340 5359 4100 807 11085 18380 -2334 -525 -8910 -17585 -1176 11402 9093 9053 19226 32822
12326 32822 16901 -36 4369 6831 5043 -16430 -10639 4992 -2383 -9593 -10142 -3506 6511
12313 6511 19871 18978 6608 8428 8916 -5069 -9235 4431 -16897 -30111 -28171 -8317 14270
12300 14270 10927 2713 -3206 3595 15235 378 -7486 -356 19677 20000 2184 -13268 -12404 -4827
12286 -4827 -8245 3204 -6113 3139 19498 3937 -10852 -11723 -8772 -13892 65 2008 -3025 -4432
12272 -4432 2298 11158 5893 4014 -11788 -21855 -20969 -7915 -7544 -16803 -13205 -12663 -1759 -3507
12258 -3507 -19102 -10838 8699 20157 22627 17511 18136 12874 17468 36640 54984 44237 20483
12245 20483 7373 -6380 -20788 -17416 -16245 -28328 -24515 -11929 -10155 -18067 -11681 -8661 -9926
12232 -9926 -13874 -30783 -31675 -18310 -5138 535 -17303 -36451 -37477 -24263 -2654 10514 15999
12219 15999 16475 23799 21704 13684 -4832 -24408 -25329 -6955 -2312 -7372 -4720 10264 13428 17648
12205 17648 12813 4930 -5729 5257 -5286 -24389 -14504 -6847 -1057 1896 4294 -1460 1141
12192 1141 2527 -13936 -14726 -6686 350 -397 5193 3017 39 -1378 10291 24508 27076 29901
12178 29901 25772 13203 -314 8574 26763 32658 56797 37339 33329 43166 60224 72116 70273
12165 70273 43067 13183 7165 8078 9406 7545 12442 13712 3048 -3611 5612 9779 11172 -2600
12151 -2600 -4199 8545 17004 18195 11696 19769 23088 15251 29327 31203 32091 36614 35408 47137
12137 47137 38181 39425 37576 38671 39570 39481 35082 45995 65232 94025 143316 169825 167956 167120
12123 167120 176716 183098 170519 142466 106825 86754 71906 53296 41226 28065 10447 1856
12111 1856 14050 17303 29596 30428 21970 24576 28337 12722 8526 2435 7434 23754 38211 31724
12097 31724 29650 44884 53228 50297 50697 45139 25524 7701 28902 48424 49161 57630 65786 80241
12083 80241 109770 126911 145845 182749 210073 188356 170081 150457 111924 89071 65377 45791
12071 45791 33053 33450 34917 19057 7822 15101 23581 11906 2454 -1963 2747 25703 31190
12058 31190 18475 -780 3376 21873 11244 -6524 -19588 -30589 -17261 1660 1249 -5897
12046 -5897 -11389 -13494 -17752 -6425 11683 8780 7802 11351 23464 43107 61457 66834 59229 70299
12032 70299 73615 61433 43748 37943 30820 38985 41407 33050 35178 39647 12744 -3855 740
12019 740 -19621 -20719 236 13278 6454 -5628 -15778 -19393 -15596 -14415 -4380 -382 -20837
12006 -20837 -6149 -1785 -10656 11364 1985 7082 14210 17987 -1114 -12224 -10057 -1508 5175
11993 5175 -713 -16300 -14333 -8928 4040 -600 -10334 -17110 -8673 -2090 7273 -6036 -21765 -34832
11979 -34832 -37015 -30216 -28292 -38011 -17784 3107 28075 21225 -2165 -13734 -4115 10858 7382
11966 7382 -12298 -22042 -20442 -22462 -12105 -1696 -6970 -8387 -5672 -9607 -4215 1976 -6807 2295
11952 2295 2310 7466 5664 1250 -3894 -1016 6009 -4881 -11480 -3725 3677 -4609 -20432 -25240 -24307
11937 -24307 -24385 -17746 -21471 -27984 -36957 -25523 -14891 4208 -931 -88 7814 3617 -9572 -18062
11923 -18062 -19635 -21409 -10723 5808 6459 16048 11436 2717 7634 5179 -1046 6460 -5252 -22511
11909 -22511 -17401 -3570 2539 -7910 -10548 -15447 4478 20771 29710 34412 15533 -11534 -5071
11896 -5071 1588 5763 3229 688 1855 1478 -13785 -18369 -5092 10504 10841 22622 15528 16435
11882 16435 19796 9261 13105 24727 25303 14970 -2098 -11585 -204 548 6706 903 13997
11869 13997 11405 -6326 -15022 -17703 -21632 -16407 -16361 -12550 -4391 -1118 -18289 -20533 -14210 -23797
11855 -23797 -2374 3675 1991 2049 -12294 -20723 -20329 -24182 4321 3887 1859 -1440 -7231 4065
11841 4065 11501 17355 25365 20919 761 4843 29621 15489 994 232 -5673 -3484 15210 13908
11827 13908 3147 -5366 2199 -8896 -1557 -2538 -6188 2293 8264 5917 10061 21426 13577 -1793
11813 -1793 -4964 9385 2739 -10308 -7086 -17421 -23249 -20389 -7167 -1910 -2167 84 149 6786
11799 6786 17812 -4458 -29560 -29383 -13522 11228 688 1337 11118 24479 -488 -5627 5940
11786 5940 13499 5170 -9985 -8395 -8625 -24210 -33075 -17946 -18662 -7205 -10387 -19859 -22452 -35213
11772 -35213 -51189 -47248 -38805 -36691 -37922 -39379 -29711 -23264 -31611 -16221 7271 12043 19166 15432
11758 15432 -9144 -24660 -15918 -17244 -23618 -17243 3706 -3796 -13575 -10231 -5132 -3792 -5544 -9394
11744 -9394 -9881 5202 5818 965 -7752 -4934 -3945 -7277 -9594 -12129 -11052 -899 -6201 2118 1348
11729 1348 4251 14241 2223 -10317 -9470 9118 27329 7925 -2895 1009 -2904 -18890 -12030
11716 -12030 -18144 -24100 -26419 -25696 -18499 345 19485 14463 930 1309 11615 10405 4414 3198
11702 3198 4858 -2099 657 16294 16020 20404 28966 11104 -7869 15246 8304 -4693 -5940 -17627
11688 -17627 -15977 -6850 -1756 -50 2202 12110 18967 -13877 -28253 -32124 -22920 -25072 -33364 -22466
11674 -22466 -525 10638 5743 -1758 -1046 17855 10959 700 -2704 -3796 -6108 -13069 -10201 -8449
11660 -8449 4408 28027 23775 22607 27920 9754 2017 -12416 -24178 -22059 -9231 -3413 -3871
11647 -3871 -1709 2744 -882 5286 -5361 -12627 -12726 -15015 5106 19984 23859 10728 -1913 11913
11633 11913 16151 15595 1523 -17406 -12828 -22077 -25404 -30045 -23948 -14746 -3142 9973 8584 1786
11619 1786 -27 -10988 -15808 -9538 3290 6439 -11188 -15572 -2414 5639 2317 -15245 -19968
11606 -19968 -17911 -4207 6645 10010 15671 13159 12106 21820 15671 -1375 3220 13176 17509 7241
11592 7241 -1884 -270 16135 20032 -274 -17160 -576 -4640 -21170 -25630 -13491 1126 5075
11579 5075 12942 17909 12208 -1959 -12010 -23484 -17102 -7548 -3120 5826 8928 2840 -8150 -15148
11565 -15148 -3257 2740 -175 -8313 -9685 2246 5512 9729 8139 3690 6788 1088 6824 3729
11551 3729 -2147 16257 32368 26537 11188 -2465 -9243 -785 10451 17351 12770 4756 -11283
11538 -11283 -20091 -19091 -8534 -2779 -5468 -7198 -11839 -22753 -16771 -3439 -1807 727 20772
11525 20772 36364 34237 24413 4806 5306 18686 11359 355 1372 8979 21951 36292 23752
11512 23752 6900 -527 3728 999 -25809 -24178 -10931 -16913 -28864 -18043 -4819 -13318 438
11499 438 -3264 -6913 2426 17893 19303 4397 -205 4511 5421 14945 26364 3085 -10762 -14070
11485 -14070 -12318 -8234 309 -4135 -3854 -7784 -7014 138 5712 16063 9104 -6814 -2089 -738
11471 -738 -19198 -32438 -46739 -43038 -36738 -36253 -36626 -36411 -32400 -25338 -16878 -13391 -22645 -29769 -33729
11456 -33729 -15080 1001 20350 33717 27433 10113 -3584 3116 22529 21691 25334 16736 28691
11443 28691 28510 3297 -13578 -13185 -11083 -10360 1642 18544 7519 1163 858 5516 1744 -4470
11429 -4470 -4373 323 18188 1162 -20468 -23426 -8941 2352 1833 -18730 -18379 -13697 -17938 -5884
11415 -5884 -4932 -23820 -19080 -24229 -20574 -1389 11053 24141 24709 25546 23329 17319 7146 255
11401 255 11833 4880 -21183 -36537 -25222 -461 3895 6411 1454 12967 7582 1632 727 -4461
11387 -4461 -851 -2745 -6594 -6921 -11970 -16812 -5464 -16365 -19277 -29458 -30904 -16124 -20589 -14841
11373 -14841 -672 -3263 -6385 -5702 11399 13965 1925 2631 9421 1591 9465 7117 8040 -6253
11359 -6253 -8362 -1414 6538 15791 5387 -11456 -17786 -3396 3397 -7683 -12884 -30921 -26164
11346 -26164 -16170 -28134 -23439 -22592 -21252 -2902 4139 10261 -2607 -11452 -6448 14555 25990
11333 25990 27428 1105 -16502 -15156 -11935 -14830 -4659 4887 21961 24077 5341 -13398 -26703
11320 -26703 -36286 -32587 -14039 3066 11313 11061 355 -13781 -9864 7817 11983 -6898 -10195
11307 -10195 180 17043 19138 11403 5507 5472 3421 -13124 -13986 -7427 4175 4493 197 844 -14206
11292 -14206 -4919 -5507 10379 16174 -6703 -20654 -16791 -11272 573 10974 7405 14131 21894
11279 21894 11445 119 11497 19470 28099 32332 15052 2696 -5413 -11126 -8465 4508 10649
11266 10649 12271 18084 20896 39227 25216 23857 21579 17210 20057 26974 43429 50679 46349 42697
11252 42697 32991 21615 6307 -13698 -26640 -20776 -17041 -19538 -22319 -20552 -3468 -11337 -13125
11239 -13125 -6457 2197 14981 13222 15269 15362 -5000 -22219 -18796 -9158 -7669 -10174 11208 3881
11225 3881 -17100 -32282 -37534 -5698 14774 2504 -15177 10 5228 -2743 1609 9613 11053
11212 11053 612 -9861 4979 7624 -10566 -25306 -29143 -25404 -11696 -2381 13010 -183
11200 -183 -11802 -33831 -32187 -13658 -1776 1020 897 -5296 -4122 -4591 1957 1829 -3448 2645 353
11185 353 -18396 -42839 -42319 -23413 -7985 -725 6495 -10131 -14537 -2764 -1518 -15149 -8174
11172 -8174 -1075 15848 14941 28080 17886 2766 -14393 -33265 -25352 -21762 -14525 -9391 670
11159 670 -4907 -1598 -3644 -20342 -24840 -22079 -29094 -30675 -15093 1098 14027 -10836 -37390
11146 -37390 -40834 -45657 -27651 -12722 3068 -8348 -13675 -11950 -13819 -40313 -25953 -8509 -4266
11133 -4266 -20428 -19034 -5333 10902 6708 8887 5863 11260 8888 4304 23108 30769 7036
11120 7036 -8933 -9583 -10905 -11912 -16985 -19606 -2876 14315 -3636 -15416 9868 18838 12807
11107 12807 -2363 -9705 -10330 -23381 -44428 -54337 -51454 -40609 -45604 -42635 -42126 -32231 -7584 51
11093 51 -4901 -3207 -58 -3364 -5507 10195 1212 2118 -90 8442 4773 -3934 -8216 7836 16017
11078 16017 -3915 -5314 6726 15266 14332 11502 2766 -12928 -661 6994 10773 24692 25815
11065 25815 22890 15391 4024 -8373 -13367 -6399 -1107 -545 11642 9667 11067 12707 21408 5153
11051 5153 -17315 -16877 -9597 -20833 -10739 11184 6742 -20709 -26642 -16453 -2509 -4269 -14349
11038 -14349 -6165 3881 1019 -6888 -9320 -9116 -12893 -6232 12411 22180 18218 -1758 -4896 3285
11024 3285 16102 23542 25080 25935 28798 27579 6387 -4813 -13882 -11778 -4055 2082 -12067 -20037
11010 -20037 -3520 11000 13557 3800 12274 12260 4627 2298 -16978 -5643 -2152 -22809 -10638
10997 -10638 -2946 -1369 -12615 268 11603 11031 13662 16191 12889 7329 8093 8159 7820 8535 -3853
10982 -3853 1527 -3762 -4472 -2722 -8671 -10295 -9177 -2066 -4557 -1421 3319 -6162 -8847 -10179 1825
10967 1825 7971 -7861 -22034 -21399 -14632 -9858 -8122 -3040 1435 14602 20177 11339 -13196 -23405
10953 -23405 -29432 -36900 -5521 2912 4278 8223 4087 -10054 341 21374 -3587 -4614 -2183
10940 -2183 1291 -12979 -27115 -27410 -26881 -9603 7921 5817 7753 14005 23325 12378 21693 12708
10926 12708 9102 11075 -2230 -2495 7229 -5647 -10594 -15571 -7495 -9732 -12508 327 22532 16630
10912 16630 -4212 -2231 20380 8218 17435 10798 -6363 -495 8472 -1050 732 10112 2284
10899 2284 9211 19484 2067 -27282 -35917 -32273 -29299 -23720 -9436 5475 493 539 -6475 -4220
10885 -4220 1725 9867 3095 -7292 -21748 -19047 -9993 -1360 2642 -10012 -20363 -22398 -8785
10872 -8785 -591 -15602 -14167 2349 25814 27008 20451 16300 1151 -8237 -15289 -19211 -2535
10859 -2535 -456 -1598 -20038 -31468 -15653 -8353 -1271 -7681 -2739 -248 -10580 -8872 -3727 -16022
10845 -16022 -18358 -30226 -40499 -30903 -24323 -26459 -35975 -43147 -38999 -35162 -31696 -26168 -26995 -8978
10831 -8978 -3639 12284 28571 42599 21420 1765 -13612 -15448 -15350 -5330 -6218 -5307 -12466 -8403
10817 -8403 -8827 -27838 -34857 -13242 -4897 1237 -2055 -402 11442 25315 24512 30717 26596 4208
10803 4208 22080 20273 14114 7169 -8404 -10818 9177 14760 7270 3328 2601 -20884 -27066 -19324
10789 -19324 -13013 -9876 -4554 -16975 -649 5985 5278 8173 5345 -619 6808 14456 -12487 -16686
10775 -16686 -7336 -12503 -23502 -22914 -8354 -4146 3612 16740 7979 7774 8478 10380 -6384 -6882
10761 -6882 -5641 -90 -3020 -1816 -1065 -12941 -5830 -3851 -8775 -11482 -15923 -17685 -9185 6487
10747 6487 17060 31794 23078 13131 8937 11868 21913 33642 33697 25749 12076 1576 4853 9604
10733 9604 5554 -157 -11560 809 765 8954 2974 -4815 755 4696 -7156 -23263 -21303 -19204
10719 -19204 -17105 -17132 -6454 -19143 -16221 -9757 -14231 2652 10493 13646 9370 11740 6380 4001
10705 4001 736 1083 1873 -5600 3365 15147 7763 -5731 -17989 -12875 -2258 10980 -6502 -18276
10691 -18276 -7489 2263 -6743 -15892 -12534 -13334 -13989 -8682 9456 18914 29533 34391 9251 -10660
10677 -10660 4971 -6172 -20275 -20274 -8972 -24355 -30081 -23792 -12406 -13052 -16409 -20245 -9822 -2335
10663 -2335 -8078 -9761 5868 13128 12499 1734 -20298 -21218 -3219 1556 5738 7062 -1905 4033
10649 4033 13429 24806 20529 12411 -4688 -13345 -14353 -7765 -5471 -6709 -1382 -787 9542 14050
10635 14050 12421 11677 14131 11749 -7933 -14241 -18677 -10297 10267 18775 16837 15144 -12125 -21476
10621 -21476 -18631 -22375 -20433 -3161 8760 2105 12299 15143 15511 6012 -1215 2756 -9528 -11610
10607 -11610 -997 11171 4954 11675 14808 8174 290 -7241 -1501 -50 -4276 -2011 -1025 -7665
10593 -7665 -5688 -9357 -7243 -12812 -9235 -2593 11026 13324 3456 -8803 -30988 -30131 -19785 -10679
10579 -10679 -1226 -1683 -11136 -31835 -34581 -14557 -59 9175 24296 21642 -802 -30237 -28187
10566 -28187 -17191 -25973 -24047 -22804 -14132 3788 19520 8838 -809 7131 18641 2255 -13437
10553 -13437 -7417 17322 26739 22116 21872 14277 10803 13106 34470 35627 32694 48808 73349 88948
10539 88948 86015 93442 126803 176551 265326 426306 616270 792309 945345 1082814 1176919
10528 1176919 1236173 1267744 1020478 623927 411139 316939 253913 213484 171530 138412 104003
10517 104003 91694 75993 60532 60307 54079 28689 29173 30524 50036 69962 56284 41495 41563
10504 41563 40629 28870 21631 25420 27137 -1934 -5158 -4229 19654 30011 36933 47803 43135 31159
10490 31159 33583 23542 11021 4729 13778 20723 17030 12446 17154 25325 14275 17904 24446 21868
10476 21868 30218 24956 22309 9194 -1844 8148 3238 19568 30144 16395 11403 13745 12432
10463 12432 10733 15752 16635 11144 1581 -10061 -2498 11357 -742 -8616 -4273 -11122 -20437 1981
10449 1981 11482 2049 4712 18441 30620 31986 19565 2055 -5962 -8868 -15800 -494 -2971
10436 -2971 -11152 -20605 -29347 -37300 -29056 -10495 8673 8076 7082 8123 2607 -4209 1855 -2691 -19840
10421 -19840 -18485 -20427 -13964 -18113 -11531 -24313 -25158 -21544 -19223 -12169 -3824 -5024 -20500 -9115
10407 -9115 -7777 -4199 -2104 -15972 -18391 -9903 -7025 366 -9210 -11198 -10050 -7624 -13293 -15927
10393 -15927 -11299 -8530 -13027 -8296 -11537 10439 16480 4396 18765 8232 9730 11818 22488
10380 22488 11775 11106 26956 32220 21090 630 -25792 -25780 -23466 -26877 -14096 -6637 -12512 -12000
10366 -12000 -26417 -32350 -24131 -35478 -42710 -30628 -28057 -21776 -23479 -26838 -21725 -11375 2606
10353 2606 6730 9876 5317 -8443 -20757 -19307 -18625 -15952 -9615 -20821 -29876 -31243 -25955 -12666
10339 -12666 -16 223 4908 12299 14010 -1093 -11091 -4730 -2242 14958 6128 -15768 -18083 -19888
10325 -19888 -18500 -22751 -14734 -6052 -25207 -28366 -29979 -38522 -38124 -41801 -28411 -6224 1583 5951
10311 5951 -6384 -22900 -17471 -26478 -26903 -8474 4060 4778 10091 17320 3350 -13689 -18240 -9276
10297 -9276 -6814 -4196 -11918 -6388 3619 16860 6927 12540 23668 20041 8883 717 1105 -7610
10283 -7610 -24580 -27873 -27303 -36775 -31359 -32971 -28193 -20363 -7334 5838 12190 24591 29728 27273
10269 27273 11326 -4215 -457 16728 22668 26888 22613 6566 -2985 -5975 -1662 17639 18897
10256 18897 14248 30243 23388 18844 2486 -11730 -13939 -1871 -153 3567 19194 25583 22438
10243 22438 7854 -4888 -5513 1552 14938 20246 4936 -4934 -4049 11041 11002 1689 -20388 -16346
10229 -16346 -2903 12371 8385 -20178 -25086 -3568 -379 6383 -3242 -2522 -1806 -11502 118 -4490
10215 -4490 -9901 -1920 269 7616 15981 10449 8504 3534 1619 7959 15202 841 -5041 8373
10201 8373 6847 2619 11583 18458 11708 -8080 -16296 -5295 -2515 -1047 9419 16722 16142 -1087
10187 -1087 -18881 -16370 42 -13428 -15760 -9286 364 22062 9000 11259 11600 9162 12024 2404
10173 2404 8547 9880 33584 25785 14345 2307 -12631 -5462 15365 24669 37901 23756 11415
10160 11415 5131 5516 14214 22150 8555 756 -8201 -9000 -8732 -10877 -16516 -5285 -3548 -33218
10146 -33218 -31917 -14376 -18459 -5833 -1495 -3989 -15796 -19245 -33424 -38242 -19231 -9661 -19876
10133 -19876 -11552 -4825 -5239 -19293 -19909 -10290 -17654 -29395 -20272 -2011 -3644 -21851 -24739 -12572
10119 -12572 -2506 2283 -4859 -3152 -8956 -12867 -8917 -5795 13875 33345 17136 -5893 -1348
10106 -1348 -2417 2935 2253 5656 5232 16452 15743 13059 10121 -135 -8350 -15462 -21014 -12386 -1660
10091 -1660 2491 6769 -1879 9039 15827 11648 5608 -134 -3460 2311 -6205 -1359 15230 2881
10077 2881 -3000 -1031 -3777 970 2064 -2067 -1721 -5169 -26323 -27107 -16059 -15360 -19604 -24193 -12203
10062 -12203 8230 15090 -870 -237 9362 9049 8667 -3440 -10305 2697 3531 10160 14553 31952
10048 31952 25589 24628 37309 55599 66688 74921 95366 134662 190773 280216 449332 641151
10036 641151 810308 963914 1096327 1203943 1309426 1323664 955387 595014 424856 323298
10026 323298 268528 222296 200049 181258 145857 111292 80489 66953 55333 46258 34829 33595
10014 33595 28040 23966 20562 36720 33265 8232 15185 13244 9850 16079 15451 13953 19308 13577
10000 13577 25398 25634 9020 -4813 -134 1388 -2469 10179 13743 -4712 -14672 -4903 -19380
9987 -19380 -31219 -17740 7752 27164 34611 28826 9723 4919 7095 12471 7914 -5502 -4950
9974 -4950 -2341 -13990 -2987 14060 24474 18256 6601 9771 8530 -255 -4052 20497 23290
9961 23290 30778 26959 28127 27160 25340 21215 5218 -8014 -15364 -16300 -13667 -15469 1401 1806 2898
9946 2898 -1712 8229 10093 -1206 -17233 -11010 -2612 8966 19227 34192 38129 29104 9268
9933 9268 1071 -2391 -29314 -38644 -26237 -10019 6799 25445 19026 14842 22468 16339 25778 39789
9919 39789 35737 14394 -12769 -11588 -14445 -22787 -3564 5123 -836 14590 16677 14794 20027 45183
9905 45183 68588 47040 27841 30975 39288 17846 -7328 -17126 -16811 -7235 300 -253 -4230 -5017
9891 -5017 -6121 5835 -2288 -7314 -182 1690 -7711 2695 9491 404 -10248 -20571 -15469 -9182
9877 -9182 -7682 -2451 9168 16676 18541 14601 -4327 -16532 -26488 -15450 -16470 -17013 -15434 -10457
9863 -10457 -4312 7828 13562 6622 6520 -4324 -18677 896 16955 11456 -4426 3712 21623
9850 21623 9485 8991 -10885 -10758 -17974 -7748 17370 22499 -6328 -11262 13067 179 -17542
9837 -17542 -13521 -12227 -22029 -14190 2849 21593 51082 68175 64393 59550 42133 36128 15671
9824 15671 13619 11021 -166 32199 47279 23964 13111 -3298 -17027 -9026 -1946 -1129 -19346
9811 -19346 -23807 -12103 2153 12474 12889 11124 -9214 -19679 -10811 -11079 -14994 -11539 -7413 -12532
9797 -12532 2449 12954 9094 -2810 10201 22499 20839 16571 3769 532 -1321 -17750 -27591
9784 -27591 -16551 -8038 10875 13842 6568 8160 -4947 -4981 17174 7329 19899 31414 14785
9771 14785 1310 -8784 -13630 -18000 1765 12827 19171 -2796 -18644 -28158 -24240 -21152 -22492
9758 -22492 -19758 -5022 6724 4839 186 10910 10988 2798 344 -1755 18203 17199 12351 -9650
9744 -9650 -25642 -24716 -4722 110 -11513 -13210 -6468 1784 10474 18474 11148 -5971 -6343 -12747
9730 -12747 -19182 -17777 -26508 -29172 -21897 -13708 -12274 -4657 -3783 -1788 -12428 -1725 7427 11635
9716 11635 28744 19894 105 -29339 -27609 -16840 -8571 -13379 -6583 -6742 -22865 -4755 -12677
9703 -12677 -24866 -15122 -23359 -21268 -4989 5831 13576 12533 -2148 -911 -1309 -6521 -16165 -12632
9689 -12632 -271 1092 -1306 -7499 -10787 -17862 -15462 3759 13311 6693 -15989 -17292 -6508 2070
9675 2070 18798 14814 6913 12410 11196 8417 -4842 -11532 12863 26547 22948 16300 -3420 -15981
9661 -15981 -6535 1839 4145 -6757 -12010 -13716 1860 8023 14763 11352 17842 24603 4893 -6012
9647 -6012 -9286 -4629 -5799 -15921 -14697 -12511 -9097 1860 12463 28492 13879 5939 9005 8264
9633 8264 8040 3985 2779 20666 15194 14184 23048 11893 7436 12110 20009 20320 12954 6636 6058
9618 6058 -1310 396 2632 9258 21812 26771 29392 4890 -28307 -23807 -16720 -15022 669 4443
9604 4443 10687 4412 -5054 9366 3695 -2208 74 17575 31142 27473 11003 5797 4495 10314
9590 10314 10217 -3378 -10982 8185 2531 10657 6997 17431 10782 -1134 1835 1893 10010 28770
9576 28770 37602 4403 -6462 -5937 -5714 5294 9152 -4037 -5025 -9591 -15205 -14409 2864 14876
9562 14876 18982 14300 9462 -7941 -19782 -13756 -9985 1230 12916 1905 -10890 -96 19195
9549 19195 8226 -22369 -26708 -16925 -13846 -24283 -25125 -6581 -12251 -4738 -7044 -16893 3108 17440
9535 17440 19786 29712 21412 16462 7682 -11182 -1339 5302 30434 36623 30686 29639 12073 -6297
9521 -6297 400 -37 -5751 -5296 5068 8262 -2623 -9185 -2100 8711 24956 23238 24357 8613
9507 8613 10899 14814 23491 255 -11850 -13576 -7576 -11193 -14608 -15611 -9528 -3280 -2140 383
9493 383 10069 14930 5542 -11528 -13810 -10885 -16309 -34480 -45863 -41905 -17962 -19213 -11756 -26397
9479 -26397 -29895 -4313 4818 8227 -4215 8111 23308 19553 18059 20477 14961 27749 38608
9466 38608 25142 5820 -4532 -4158 8238 18073 29452 18251 9770 664 -2611 -2275 877 10396
9452 10396 -1041 -4199 -8472 -11735 -9880 -11125 -11597 -28302 -15822 8218 15329 6387 -10102 -5994
9438 -5994 11921 9638 3280 6995 -15911 -21836 -17582 -13418 -1439 13857 3224 -10293 -18570
9425 -18570 -3732 -1569 -20837 -25853 -17874 -6322 4677 28355 24183 11019 14330 -237 3866
9412 3866 15990 20303 20930 13887 7516 -8427 -8024 -1768 5692 9424 -4250 10036 6580 -753
9398 -753 -549 15766 23045 9237 -21824 -31049 -23531 -2954 8703 29047 38740 42515 33065 7384
9384 7384 7768 11965 6088 9755 15824 7136 12288 15268 23471 35334 24841 19889 2734 10870
9370 10870 14375 13303 18686 27792 17675 8949 12944 25960 29759 28139 7322 -6716 -11226 1957
9356 1957 18005 27513 35355 32642 8873 -4383 14594 25279 15670 20041 16621 10901 4302 15621
9342 15621 14280 16673 23406 42902 45665 37894 28455 15345 18714 17487 5725 3768 10497 17120
9328 17120 30514 32416 21085 26874 19610 23051 18263 12368 620 -178 29084 42059 44209 53270
9314 53270 50087 45948 38266 36352 44994 49849 49099 21338 17438 37595 37201 35061 37754 44782 45218
9299 45218 30494 34457 27745 41793 49139 45477 36804 35792 50645 42461 31968 28949 23657 20577
9285 20577 39230 55480 49856 38389 41701 47701 51199 53565 56784 71652 73501 67606 75659 89993
9271 89993 94089 67623 66258 62681 66833 68098 79336 98524 93124 84052 91938 104853 115203
9258 115203 105957 111073 103652 92405 97106 100853 99738 87454 98465 113006 116376 125261 139249
9245 139249 145559 135304 155262 168057 164733 177070 181426 195970 214582 221218 218545 227395 232188
9232 232188 247992 274531 295636 298449 314367 337914 374288 412936 428656 440110 462762 509339
9220 509339 551526 613004 676496 722590 771776 827580 903544 991744 1087088 1209265 1351357
9209 1351357 1519793 1678316 1853012 2050889 2267621 2512471 2767052 3017900 3272036 3507629
9199 3507629 3695792 3831954 3916854 3943828 3921229 3821540 3658012 3473366 3250667 2987513
9189 2987513 2745484 2530518 2302421 2084414 1891456 1720256 1587612 1461973 1343697 1220984
9179 1220984 1115154 1034942 973209 895052 821696 765034 708722 655216 612602 571705 540697
9168 540697 512149 496688 470599 449096 421399 388281 357252 342044 320393 314348 298403 276020
9156 276020 267208 252208 243147 229395 231011 221668 220442 230617 215330 201373 176107 184598 194928
9143 194928 174842 162767 166771 159092 138430 135238 139988 142398 134221 122823 122482 119266 96488
9130 96488 75732 73640 92590 105436 91890 83241 87043 96496 93340 108473 113275 108361 94848
9117 94848 89990 87033 83333 96473 106654 88378 91268 85584 65151 49450 57505 57888 53689 65838
9103 65838 73087 68625 74715 76929 63027 39813 27935 19776 5834 6652 38475 46917 46127 47343
9089 47343 43893 33735 57749 72539 64874 53245 40074 48881 47320 52080 53438 40465 44268
9076 44268 43741 40389 42451 46493 32725 30476 30851 36226 40253 48867 43352 40590 33992 30284 24100
9061 24100 27724 37157 46239 49831 54979 40048 42611 35419 26809 27201 25753 15798 20287 26029 34526
9046 34526 26629 21023 29403 32700 18983 23763 31853 29356 18340 1996 6151 12266 15277 655
9032 655 -10067 -376 8866 6085 7692 190 -11279 -11290 -3061 -3356 -21551 -14040 -2977 9824 28935
9017 28935 38343 20559 18145 15713 12446 11477 15499 20266 14623 15863 23969 23936 32605 30889 14627
9002 14627 5849 16358 33605 25316 2302 2779 1079 6696 6709 740 19229 15170 13018 6939
8988 6939 712 -3186 9547 10550 -818 8307 8795 -6038 -18585 -13470 -11275 -11737 3480 7679
8974 7679 4086 -893 -1502 -2932 156 3806 12458 18338 3670 4086 19046 16839 13976 8881 -1500
8959 -1500 -9420 2285 20897 21587 19801 12332 6677 8259 10276 10106 14662 -295 -12544 -13726
8945 -13726 -6603 -4357 3264 5331 -5509 -7057 -14693 -3910 6014 6279 1126 571 1802 -5802 -9189
8930 -9189 4363 15474 10607 -6590 -1592 -331 -11084 -22022 -24880 -26734 -10801 3065 5192
8917 5192 1263 3915 10906 13542 11778 20690 18352 13464 12241 25766 33973 15475 1158 20257
8903 20257 20890 19919 23408 13764 8206 12811 15136 23976 33433 17271 6626 -4517 5205 16356
8889 16356 22184 16097 20028 18603 -2476 -17674 -8593 -5498 -4598 4829 -2359 2214 13688 4892
8875 4892 -223 8753 25836 29732 11141 -2244 -24232 -25961 -20903 -13071 -8817 -5521 -9445 -19722
8861 -19722 -25212 -8168 3601 16507 36624 29686 6174 5859 7906 3571 -4629 -15347 -17858
8848 -17858 -2559 13203 16259 28413 40534 26881 5401 10744 33359 36010 24444 18660 -5513
8835 -5513 -17270 -16400 4111 19332 12780 5863 -315 6607 3039 -3331 -17188 -28781 -31059 -27964
8821 -27964 -12295 1328 -11309 -19770 -13536 5620 22304 19963 5693 -12376 -16194 -10159 -3082
8808 -3082 -9454 -21847 -19076 -1127 2242 -9507 -17583 -16102 -23443 -35732 -30598 -22040 -2301 13007
8794 13007 9802 -4789 9630 7216 9676 13591 4031 -1596 -4801 602 14137 24748 21891 19770
8780 19770 -1395 -8063 5087 11810 422 -9492 -2079 5763 16581 26263 26416 -11151 -16389 334
8766 334 -4404 2987 4957 14042 7319 -4597 -10262 -9227 -21733 -17453 -12930 -4101 -12490 -34859
8752 -34859 -40337 -35829 -26672 -15473 -20441 -37069 -16913 -8496 2450 1951 2016 7001 4787 -14062
8738 -14062 -11249 4618 -2434 -6700 2278 10567 13899 8904 13213 24671 25730 15825 -2988 -1127
8724 -1127 192 8546 14799 13430 5184 3529 9186 1619 -25540 -21854 -16950 -13318 -5396 -13216 -18404
8709 -18404 2680 15404 10334 3006 -646 1690 11577 9155 3773 299 -2486 -11284 -5698 2604
8695 2604 -5796 7663 21751 10438 5917 4020 10531 37547 21789 11874 14441 11385 7989 17787
8681 17787 21913 20065 29702 33388 32970 30161 26963 40808 47599 46411 26666 7755 9376 13716
8667 13716 24840 28229 19707 18560 28064 36580 41543 29799 28858 13382 6197 8429 12455 20975
8653 20975 28402 22473 14065 34647 44817 51369 54563 56503 55475 54384 37983 38808 34151 37853
8639 37853 38136 56410 44324 34342 36910 31503 22732 23546 22153 25923 30212 34391 45555 44971 39351
8624 39351 44069 35946 34242 53090 70484 63905 66656 60175 55680 56906 43880 51653 60039 65126
8610 65126 64847 71239 83662 55963 63008 78911 78164 67084 71883 68833 68408 62065 73444 86886
8596 86886 76522 80316 73616 73390 77373 96669 98760 91513 93430 92482 81328 81584 90035 86209 79565
8581 79565 68022 61965 58891 53806 50584 46136 40842 36774 39514 35425 38487 38456 38598 32546 41268
8566 41268 29907 14991 15167 40483 50107 57356 55596 54629 40210 19185 19902 43454 68751 113539
8552 113539 154211 162802 170879 177896 181680 215564 197275 139062 89789 65705 55303 54047 45823
8539 45823 52459 44712 45072 55557 48897 50397 36244 37053 30568 22717 16170 16312 25476 10415 9751
8524 9751 1870 -6792 9992 22090 21169 35376 37792 31456 14499 18363 25731 37735 47594 59198
8510 59198 79088 130151 194801 246494 307049 362760 391563 392769 341025 250706 189283 152460
8498 152460 112837 89867 79397 70884 60241 41744 37280 46810 59581 43492 21831 12969
8486 12969 17807 12937 6606 1766 11448 31466 36209 35067 40450 28158 10631 6906 8520 20049
8472 20049 19798 17532 24529 46411 67622 74127 82159 91081 101659 107448 142869 177683 204544
8459 204544 215684 198609 155395 116894 84522 57000 52358 52898 43527 33114 33538 34942 31770
8446 31770 34127 33494 36313 27323 21644 16731 12056 3117 5928 5763 12379 11117 11226 15769 35647
8431 35647 26255 8164 16562 27605 39260 32909 40098 39087 24329 15031 13354 26867 39654
8418 39654 34447 27981 23501 15536 21232 21749 17158 18485 22645 24520 24502 15634 1385 -4804 12657
8403 12657 15439 2625 13205 5917 -3643 300 -3482 2515 10801 8555 5295 106 -1328 10531
8389 10531 17338 7498 -7928 674 -2779 -7134 -7810 -8289 -18739 -17759 -19527 -20067 -33023 -31641 -23071
8374 -23071 -22618 -22246 -9332 3857 10319 3886 -1757 -1623 13923 10945 26112 20024 18902 25263
8360 25263 15280 15212 19573 18243 21543 20714 14566 14231 23502 22284 21823 16818 11124 22426 38375
8345 38375 29897 15415 6965 3512 -11009 -4660 -13224 -10807 -467 -11906 499 18747 18941
8332 18941 28058 35125 39583 42209 33949 14099 21804 39542 47473 50111 39641 42963 19121 1618
8318 1618 -631 13208 14793 9724 14187 9805 -10030 -10914 -10792 -6156 10706 9405 2909 6196 5281
8303 5281 -7786 3386 2273 -9575 -7831 -5285 -53 -5070 6059 8656 13965 7592 747 -1195
8289 -1195 8680 5259 3923 -5043 -15713 -24653 -26668 -29065 -15741 7681 16039 16412 10077 26468
8275 26468 31279 27883 16893 6603 4215 6774 3849 -10661 -2873 11087 9724 -1713 -7597
8262 -7597 -19521 -29820 -22789 -3830 28439 33137 34035 33326 13158 5342 14922 -3538 -6822 -4800
8248 -4800 3329 9362 4997 -44 -13863 -22711 -2693 17273 9314 2347 -6734 -6825 -2987 -9210 -3263
8233 -3263 4839 6073 2203 11620 19974 15022 -8423 -22874 -14510 -8441 6571 -763 -18007 -11847
8219 -11847 -6871 8824 15429 -390 -4663 3734 833 -11584 4047 20278 959 -23206 -22246
8206 -22246 -24679 -48324 -48674 -45506 -41649 -34524 -35521 -38200 -27167 -24453 -20102 -7366 10323 9816
8192 9816 9748 18688 18085 28622 30532 25418 572 -12662 -1009 793 -2721 -2433 6582 12091 22847
8177 22847 21861 11999 7367 -580 -4347 6236 -5491 -14189 -10381 -5811 -1234 -11045 -22140 -23248
8163 -23248 -12376 -10813 -24242 -20399 -11950 794 3319 4928 4634 1020 1762 5189 9815 10527 3143
8148 3143 3761 11481 9125 5742 16128 9620 -2789 -8385 3256 -992 6227 6730 8403 1150 -15341
8133 -15341 -12309 -7529 -12136 -17437 507 5054 -7855 -12497 8561 -2682 9059 -565 1260
8120 1260 5789 -4894 6673 -7121 -17818 -7952 -13284 -14163 -13339 -12891 -10418 2807 12892 2134
8106 2134 2903 17744 13993 -8048 -4796 2080 18765 24301 15456 12414 13074 4083 -2007 10783
8092 10783 10954 -475 -317 6801 8204 10369 2218 -995 -13650 -10441 -6213 -7171 5733 28903
8078 28903 14353 1312 3089 7772 1929 -10554 -14596 -5266 1312 -528 -4587 23442 34595
8065 34595 32615 19212 20886 16772 -6429 5706 13515 22161 13612 3548 1358 -4059 8078
8052 8078 12190 9610 -1068 -10248 -13916 -2974 11404 6666 10297 10876 9740 2443 -10000 -13988
8038 -13988 73 3140 12082 35144 42091 46903 40103 41453 45910 36416 20411 17289 20616 24548
8024 24548 22385 15861 11202 13888 10319 6714 386 -4972 20301 40580 45434 40375 39879 47348
8010 47348 39245 31374 29019 21774 6577 3900 10733 18866 11165 13625 30147 47088 57023 51393
7996 51393 41072 30629 46582 62806 61263 76995 106487 104440 121092 127470 101950 91040
7984 91040 76209 60833 49695 59551 86456 98460 87002 82043 82835 69871 67304 37015 25992
7971 25992 49874 49459 42852 53065 46961 23043 10416 15145 11733 -6603 4414 14018 5044
7958 5044 12357 8917 21971 37221 30874 39296 52618 56791 71552 79483 79118 70178 82558 95259
7944 95259 77861 61020 80698 107134 107792 83723 66134 73723 63349 45127 55249 45637 38058
7931 38058 32900 26807 22594 7877 10112 17380 15295 6669 452 12037 21270 24446 38029 33416
7917 33416 23220 15478 9640 7565 7849 11062 3411 18957 22762 28892 33719 42292 51428 51850 44268
7902 44268 42245 31885 23375 13302 10043 12411 12497 16539 5086 3028 2522 3074 -16514 -10321 -6661
7887 -6661 11692 3917 -13420 -35494 -41781 -36713 -26672 -24160 -14369 -6207 1739 -6226 -3005 -291
7873 -291 4753 16554 14377 3483 -5026 -4541 -10880 -4128 7212 8833 -9870 -10891 -991 11838
7859 11838 5312 -776 5549 671 -4646 -5787 -10470 -8966 -4336 7757 13460 17985 14620 8766
7845 8766 -8633 -19653 -23046 5783 31657 25039 5223 -2215 -7788 -24157 -31989 -24944 -15444
7832 -15444 6984 27657 28429 20937 22649 40016 32910 12379 -21 8789 4108 8288 -4162
7819 -4162 -4544 -8277 -18370 -21645 -16182 -14321 -8880 1450 738 -4004 5975 23223 13355 19018 29625
7804 29625 28844 2001 -22357 -30270 -22215 -14557 -12121 -5635 977 -6266 -26191 -35493 -31282 -22168
7790 -22168 -24692 -28336 -22001 -15677 -11986 -12195 -7578 -1510 -1230 -14721 -8567 -1798 2130 -10055 8766
7775 8766 18540 19849 20085 5277 -6650 -3535 2209 11172 30908 21102 -6933 -17837 -17579 -9513
7761 -9513 17121 17972 16845 -15266 -16734 5765 21108 14953 -7053 -15962 -5816 14308 21970
7748 21970 13427 -5603 -3099 -17193 -6076 4231 947 10244 16145 21761 26956 31668 24220 1360
7734 1360 -18853 -16186 -15978 -4988 -2126 -1205 524 7194 -7276 -15647 -12850 -7206 -280 822 4281
7719 4281 11196 3855 -13810 -29339 -7189 -6145 -5107 15722 11640 8437 15308 10561 14947 25558
7705 25558 14826 3236 -2212 -8895 13206 13802 4026 -15549 -30168 -28798 -28487 -9899 -13773 -20208
7691 -20208 -12523 -15189 314 20449 15023 5265 -545 -3334 -10471 -23266 -26010 -22755 -4627 5034
7677 5034 -3277 -353 -9935 1654 12557 -1290 -7006 -6975 -3618 -3476 -4059 -1476 3638 10994 3741
7662 3741 -10680 -30162 -16861 1624 1272 1199 -507 -4524 -7023 -24065 -25205 367 -3968 -12437
7648 -12437 7167 6363 12949 10919 18400 21032 6769 -10607 -5882 562 22134 19104 8130 21818
7634 21818 19900 14462 7489 4345 -6051 1139 25317 29728 22507 1465 -13624 -16787 -10109 -8099
7620 -8099 18408 24388 54592 43805 14888 -13041 -21482 -29794 -26267 -12981 -12449 -20409 -11223 -10279
7606 -10279 3987 -1301 -8037 354 -3695 590 -8051 -15303 -20939 -23458 -11712 -16075 -12406 -13706
7592 -13706 -1415 -5330 -10367 -13451 3014 5562 3910 5285 -9017 -32161 -42989 -39907 -21762
7579 -21762 -12905 -11617 -10808 -28707 -18761 -9316 8103 5786 -281 6873 8693 7364 7181 2964 20871
7564 20871 10626 14148 39228 23434 11380 8123 20449 25791 30030 33823 23132 10524 -5964
7551 -5964 -3649 -18197 -15878 5687 -2990 -3657 8334 18489 15760 -4562 10219 -13340 -38177
7538 -38177 -32619 -9051 -16891 -25064 -26604 -11725 -5584 -23307 -21792 -7722 5228 -13058 -21071
7525 -21071 -19574 -6255 -4683 1214 10839 15538 2026 -22075 -14622 5873 6836 -2926 -1832 -2662
7511 -2662 -240 790 2240 2771 -8418 -14580 -21539 -15107 -12007 -4350 -5529 -17224 -14713 -2456
7497 -2456 -1965 4438 11094 22731 18147 11460 -16041 -8655 -5373 -8952 -19205 -18944 -15018 -2610
7483 -2610 -1207 -370 -1357 -4902 -910 13068 26606 1059 5463 19559 14287 -880 3659 -6579
7469 -6579 -14987 -4550 7065 4720 -1000 7252 13055 15214 11717 6068 7159 9754 -14702 -32954
7455 -32954 -24007 -12503 -3134 -7719 -5091 -14785 -22217 -19937 2210 7420 -3805 8449 240 -6732
7441 -6732 612 1241 -948 -1688 -6634 -7242 -10977 -16309 8 14838 20634 11236 -8031 -28000 -34805
7426 -34805 -37346 -51952 -44366 -38176 -26800 -15439 -13968 -16757 -11467 -3923 368 1467 -675 -694
7412 -694 1529 -1089 2151 -15831 -36289 -29814 -15287 -4973 9724 2875 -7774 1551 1656 -2268
7398 -2268 -9077 -18729 -14302 -5509 -22353 -16021 -8199 365 -2336 -2749 -10058 -11755 -2984 995 239
7383 239 3968 7453 1714 -9544 -11576 -9512 -17771 -19571 -8899 -14375 -12871 -1844 -9395 -5879
7369 -5879 -4453 3881 -879 -10969 -10176 -3653 -1066 6401 12462 10927 -9564 -24508 -30453 -30047 -23931
7354 -23931 -21732 -14703 -16954 -2133 -2246 -8843 -5851 -3178 518 11116 23556 26793 27013 15851
7340 15851 5763 -2510 -17206 -12302 4229 5106 -4162 -676 2388 19734 11012 -15154 -19463 -16648
7326 -16648 -7632 -12724 -7306 10368 25711 19429 15028 18673 16673 11558 1724 5883 6639 -6022
7312 -6022 -13173 -12672 -13918 -18530 -25245 -11407 -4043 -3590 -9291 -7202 1958 13720 14525 7658 614
7297 614 -5221 -12762 -5082 23613 17934 8625 1678 8353 506 -6526 -7832 -6054 -12656 -8420 9951
7282 9951 4659 -9987 -13130 -21521 -24266 -18702 -14526 -10766 -8413 -15688 -3979 12056 19997 21067
7268 21067 23153 7943 2131 -4696 -281 12276 6517 -4425 -1235 -2679 -404 11221 16003 16490
7254 16490 17842 10327 7805 25902 22506 15926 5441 7094 6300 5271 14207 19930 13093 -2984
7240 -2984 -8741 -5982 -11833 -24452 -40023 -43261 -22707 -18859 -16632 -10129 -6794 -4381 2693 -1855
7226 -1855 -783 1995 4386 6055 7479 -16398 -4624 18590 26296 18995 1278 -8997 -8017 -16851
7212 -16851 -12092 -6917 -2551 8656 2435 8094 14558 19935 3694 -10310 -7215 897 -12481 -24670
7198 -24670 -17706 -20630 -42127 -29635 -6454 11104 28650 18489 10160 5226 14118 1355 -24420
7185 -24420 -28639 -21473 -17271 -15223 -10723 1745 -3154 -8189 -22 -12511 -12345 -3996 1772 -1966
7171 -1966 -7737 9427 3278 -3053 -9703 -17775 -10267 -8448 -18207 -27412 -29732 -17706 -4755 -4563
7157 -4563 -9400 -21591 -23363 -23318 -14892 -7608 3177 233 -3389 -12592 -14581 -6234 4200 -10483
7143 -10483 2563 -3164 -332 -1979 2120 -6977 -8374 -14497 -17460 -1023 -3864 -11856 -5524 3301
7129 3301 15982 -6994 -15985 -5025 15109 22296 14241 15639 1596 -1983 -15146 -21867 6130
7116 6130 20907 15798 9089 10662 2193 -10559 -891 9347 20407 21254 12899 20287 14916 -154
7102 -154 -18142 -24360 -18104 -17236 -4191 -6080 -11336 -15300 -9699 -4653 -4805 1069 12624 1090 -5413
7087 -5413 9510 8157 3136 16155 3135 -6913 -12157 -7207 9660 22492 30231 30284 15326 6548
7073 6548 -8303 -5607 1880 -4922 789 664 -6812 -18606 -26857 -15416 -6427 -14872 -10117 -16080
7059 -16080 -21185 -20375 -20894 -31734 -12089 -6980 -20221 -23542 -16044 -20744 -17220 -20126 -17196 -10923
7045 -10923 -13331 -12580 -3957 -461 -3703 -10517 -9371 -7993 -13886 -10116 -15588 -26447 -17653 -21249 -30284
7030 -30284 -19230 -22337 -30876 -40088 -35482 -29172 -29037 -8602 -1614 8611 -1321 -21091 -16411 -11540
7016 -11540 -12723 -20969 -32963 -32584 -22873 -16218 -19198 -7906 15944 28101 18769 -10779 -29168
7003 -29168 -28071 -9102 14054 20223 25480 17770 2410 -12445 -17222 -21451 -4358 -3240 -3096 -5600
6989 -5600 2804 -946 -25640 -37708 -40796 -20479 -1200 21494 33367 12893 -9097 -8427 -7312
6976 -7312 -16599 -10356 -6228 -6074 -2585 -8550 -16416 -12438 -2030 6162 7153 2476 -10655 -8467 -19254
6961 -19254 -14052 -7416 -8521 -7645 -11989 -21970 -19357 -9477 -5578 1996 5904 910 906 -4977 -14239 -9158
6945 -9158 2942 16875 15332 16715 13812 5882 -20741 -29554 -25754 -25185 -9503 -17668 -17133 -15671
6931 -15671 -15296 3617 12382 4541 4101 514 -4445 -17925 -10988 6193 18195 10778 -7782 -3732
6917 -3732 15891 20744 17971 11908 12434 -3025 -1471 5855 7157 -435 -6960 -19331 -30167 -27525
6903 -27525 -19565 -16410 -9990 6154 18670 17598 -1487 -20441 -23700 -22819 -23356 -13743 -21165 -29840
6889 -29840 -17356 8253 17064 9600 -7363 -8015 20147 56546 54075 40799 12873 5605 -8029
6876 -8029 -8288 -13796 -24383 -23385 -18176 -39494 -31023 -25660 -19123 -16214 -15475 -22484 -21377 -9304 -853
6861 -853 -3072 -7109 1735 -3766 -4203 -14320 -15378 -21694 -11662 348 12425 13109 11625 13683 8485
6846 8485 10056 11840 1258 -21648 -4548 9131 16491 8797 -9117 5460 22203 21557 16915
6833 16915 13713 17377 11410 4338 21979 27038 13883 -279 800 -7772 -8525 -7790 -10310 14661
6819 14661 19421 18650 5744 -1965 9769 18953 15178 15379 26776 17332 13431 19243 11940 7104
6805 7104 -3100 -10979 -28913 -32825 -20791 11250 18175 6348 -6156 -7660 -4639 -6275 -30472
6792 -30472 -21672 -7598 -7843 -16918 -21621 -11863 -34 3848 -9665 -15521 -2471 -9319 -8739 -15708
6778 -15708 -10287 6679 -5545 -14143 -7138 -18353 -23322 -13982 -15430 -10037 -23149 -20015 -11168 -17382
6764 -17382 -19700 -18375 -7184 -7329 1132 -4968 -15605 -14712 -11775 -4945 -13879 -30487 -25350 -11201
6750 -11201 -20411 -31839 -41987 -28239 -9398 -7881 -5645 -9234 -10957 -10393 -14405 -8826 4230 19361
6736 19361 21057 6947 -14299 -8989 -1349 4161 -1041 12765 11168 6331 -5828 -5841 -6253 -7807
6722 -7807 -7402 -4190 -2772 21438 18155 19104 17931 6238 -11632 -3077 -11334 -13236 -22147 -23062 -21905
6707 -21905 -13297 -757 6969 12384 16625 16172 -3095 -5280 -14392 -12617 -25424 -13163 5185 9481
6693 9481 11615 3063 -5268 -6563 15784 29237 23839 10099 1894 -6752 -2472 -5411 -1595 3633
6679 3633 8092 6305 -843 -280 1626 -5029 -11233 -8551 -13063 -10896 -6488 -3902 4438 9189 3413
6664 3413 6318 -10640 -19630 -8276 334 11362 14737 18945 6422 3865 5415 8874 13587 11281
6650 11281 -12123 -32317 -21248 -31821 -34189 -22607 -5524 7957 11909 7190 7046 3507 2698
6637 2698 -4851 -11248 -11130 -9877 4490 6067 -1138 348 9572 5366 2638 6895 -2850 -3038 2398
6622 2398 576 -3748 -8367 6317 11676 2828 -14040 -1378 9967 3924 -5314 3946 20280 11239
6608 11239 4154 -107 2761 14411 6922 -1703 -6987 11768 11839 5555 11650 29694 25096 1265
6594 1265 -3861 -6803 4173 4889 -4304 748 18301 23925 5027 -15304 -8419 7106 14037 3546
6580 3546 -3996 -12882 -20704 -20701 4325 3605 -7389 -12106 -1298 10650 10436 4017 -8677 -7473 5180
6565 5180 -4383 -596 4522 6954 -3898 3262 7211 5551 2839 -1893 -5395 -5814 -3786 -1086 -1118
6550 -1118 11919 14508 11493 21479 24363 -4103 -16722 6476 15441 606 -13573 -5948 -12439
6537 -12439 -35798 -37857 -14157 -4919 -13361 -20376 -20806 -14557 -12527 -13936 -4793 6877 19161 18773
6523 18773 11842 5365 8856 6741 11872 9864 -2795 -4724 -14924 -8453 -1625 8760 9814 -4519
6509 -4519 -22679 -3407 -7720 1486 -1273 -14215 -13662 -11894 -5316 80 9837 8399 13013 6924
6495 6924 -14669 -15104 -10209 1369 8324 13702 4269 -3571 6866 12642 4305 -8468 1865 1622
6481 1622 -3138 1421 15266 22256 14008 5850 0 -5566 -10848 -25279 -31001 -23297 -13979 -15514
6467 -15514 5972 29514 11951 -12582 -8787 -12130 -4096 -4846 -7426 -773 8496 19309 32953
6454 32953 30136 34936 20118 8866 -855 -12127 -13478 -7988 5990 9874 -7092 2375 4809
6441 4809 -2626 -7515 -12994 3881 13416 20083 9917 10560 10897 5401 -5750 -26097 -24348 -24615 -23234
6426 -23234 -9793 3591 -1172 -9037 -9153 6827 10797 7424 11585 10009 -10620 -5285 -3494 -5939
6412 -5939 -2323 -7353 -14734 1099 21271 25921 27792 -1854 -12731 -9729 -12749 -8900 -8142 -516
6398 -516 8015 3938 6455 10496 1937 -14819 -13700 -3628 -4793 -9104 -7936 -9415 -15702 -26089
6384 -26089 -27354 -26006 -19603 -25247 -11299 3862 14005 13954 9939 -7810 -22533 -36370 -25623
6371 -25623 -6101 20872 21079 -1509 -12072 -10633 11490 3298 -22950 -29792 -24958 -19337 -9397
6358 -9397 -8504 -1749 4483 -7814 3378 10063 -1158 -11560 -13266 5071 6717 499 -19382 -30328
6344 -30328 -15174 -1885 7109 15042 12379 3713 7062 5259 26275 27550 20371 22336 10768 22257
6330 22257 26281 15012 7545 -9266 -16574 -9337 -22918 -19434 -17277 -31605 -22921 -4435 -3610 -11944
6316 -11944 -18274 -15081 -20540 -19684 -3368 13759 7815 3337 21987 15632 12030 5715 6808 -1537
6302 -1537 304 4947 7180 11241 13742 -1893 -14800 -8656 -14475 -28083 -19219 -7680 1562 2848
6288 2848 -2497 -6871 -1736 -6731 -26961 -23699 -30991 -42117 -32492 -43002 -47433 -41866 -9342 -7888
6274 -7888 -7182 -7273 16890 29593 6398 627 -5778 -5211 -1132 -9873 -9419 -19357 -21041 -14703 -13677
6259 -13677 -26425 -20622 -8764 -10663 -18834 -9357 7457 12685 8825 15439 19358 9712 5111 1180
6245 1180 -5011 5974 12083 193 5720 1966 -4054 -9875 -3705 507 13952 19456 8818 -5041
6231 -5041 -5398 1184 11515 7081 1704 -5312 -12358 -3712 7910 22545 15401 14039 11705 19776
6217 19776 27239 6466 1389 1871 16999 185 -22258 -14838 -10475 -4230 -1738 29 -760 -18660
6203 -18660 -27818 -17605 -8770 -5701 -4525 7432 10650 16840 1464 -8400 -4817 4274 14480 17788
6189 17788 12068 -3172 10033 20067 13996 20040 21898 31382 59416 52004 35195 33410 17980
6176 17980 5792 -502 -3971 -10186 -13746 95 -6680 -13409 12076 19004 13620 1816 7877 1781
6162 1781 -5496 -8436 -16802 -17986 -3460 10460 13551 23317 18219 18395 13670 2143 -1435 8193
6148 8193 2129 -16255 -18839 -25521 -29342 -38162 -26517 -16152 -1346 2727 -17439 -29891 -24846
6135 -24846 -24782 -21884 -26061 -15146 -9258 -23859 -14556 1475 -13762 -27038 -26709 -17336 -18442 -5236
6121 -5236 7013 -2040 -5443 -7857 -17195 -27098 -14220 -219 10573 17056 11581 -12767 -8264 -17069
6107 -17069 -19932 -14314 5692 15433 16537 18395 6701 6349 15610 4808 12171 13914 4204 5017
6093 5017 11025 11354 4444 -3987 3438 13407 12580 8331 -5697 -20407 -39760 -33022 -21207 -9420
6079 -9420 12711 12296 13292 18980 23326 32905 15228 -1202 4694 12949 1627 2011 -989 -1405 938
6064 938 8517 3954 6100 8038 4014 69 -15104 -17153 -12331 -14968 -21809 -22341 -16710 -6716 -6401
6049 -6401 -11580 -3798 -1551 -7355 -23756 -17555 -2030 -10539 -17676 3716 1162 -9995 -6785 -13047
6035 -13047 -20370 -23726 -26385 -37095 -25061 -25957 -17497 -6390 3591 5706 8594 -1419 -15758 -11883
6021 -11883 -11039 -1225 -2992 -11198 -13959 -6409 -12904 -15361 -4173 5536 12141 1341 -8094 -14046
6007 -14046 -20365 -12806 -14029 -28671 -19357 -10472 3179 6096 12171 8436 -9704 -12102 -16566 -14623
5993 -14623 -10380 -19201 -9623 -10761 -7893 4068 15129 10047 -4456 3442 10176 4166 -967 -3446
5979 -3446 -2763 -2085 -18497 -40152 -36742 -8720 4990 -3907 -16329 -30763 -18354 -10953 -7029 2117
5965 2117 33242 30972 13643 10695 10208 5924 -4531 -3706 18144 18384 -1959 -7877 -5142 -5764 3721
5950 3721 7165 7253 4459 -3767 -5356 4649 14266 9269 5114 4468 -2990 2644 17339 11323 -4101
5935 -4101 -25293 -23802 -14457 3702 19416 15178 18071 9415 -11302 -20124 -15929 -16014 -15446 -9359 -12447
5920 -12447 5563 1103 -12655 -3424 7494 11789 6895 779 -14546 -17420 -25520 -13409 -10320
5907 -10320 -17063 361 14032 8536 -4098 -10337 -16241 -15850 -7003 -12913 -5254 -600 -3169 -1764
5893 -1764 6384 16407 7319 18083 19661 -5952 -5261 6629 6329 -3849 -14685 -18114 -22750 -6633
5879 -6633 -659 1686 6064 18941 17788 8621 -14312 -15594 -13700 4002 -1174 570 5435 -7447
5865 -7447 -956 -4226 -7041 1811 5751 11297 18492 24506 23031 10730 -2762 -7385 6804 22531
5851 22531 17674 5955 -5378 -12584 -266 14421 4214 10375 17440 16799 8473 11765 20405 37143
5837 37143 47401 30421 16739 23075 7409 -4401 -17776 -30904 -32572 -12628 4700 -8150
5825 -8150 -30230 -35100 -18868 -6422 2260 -4868 -5374 -4124 -12519 -10182 -3442 4626 -7595 -15446
5811 -15446 1084 1643 -12159 -22738 -606 6772 -10146 -13825 -13779 -18675 -18371 -20639 -17930 -15632
5797 -15632 -4460 3958 7507 25838 45601 43847 20498 -18291 -34135 -15715 -8810 -6802 -11571
5784 -11571 -7248 992 10301 7242 -902 1739 4076 -13951 -19264 -21908 -22898 -4644 -15336 -12449
5770 -12449 -9630 -10301 9996 25096 24502 6029 -3739 -6986 -8067 12842 1296 1866 7697 8929
5756 8929 -5878 5544 21054 18247 12185 7786 6410 -3287 -14199 -4787 10389 12074 -2011
5743 -2011 -152 -13949 -3153 9843 10470 6119 -7595 -36905 -50452 -27501 -22419 -14660 -6452
5730 -6452 -14620 -14594 -9194 -16209 -20639 -22833 -25635 -9291 -9494 -17868 1949 -479 -9406 -315 6376
5715 6376 2330 6095 3723 12343 5724 306 -6351 -11414 -15226 -11264 -21170 -28344 -33503 -9575 13336
5700 13336 26718 18644 7574 -4896 -14642 -16692 -17882 -11459 -14149 -24346 -980 -1102 -15944
5687 -15944 -23482 -23405 -35224 -38306 -27096 -13369 -12883 -16331 -21712 -20093 -30396 -19461 -15311 4529
5673 4529 6586 5091 7057 16384 12779 2599 -9805 -20856 -16629 -1313 -2040 -861 1057 1638
5659 1638 -15745 -31 4901 305 -3211 1523 6743 -872 -9185 -11709 5315 16532 2926 -4886
5645 -4886 -86 12120 28259 28064 -9156 -27355 -20254 -6222 -8929 -13992 -7158 -9182 -19565 -22355
5631 -22355 -30678 -34675 -16060 -13388 -26171 -9027 23042 26577 9120 -17488 -19170 -10943 -9602
5618 -9602 -11203 11410 10174 1938 8594 15744 3184 4080 1759 5927 -8629 -5944 -2156 -2187 7279
5603 7279 11841 14395 12229 4352 -1231 8251 16304 34013 30969 19850 18642 26718 19002 10164
5589 10164 5520 6303 -4635 -16810 -5273 3876 8288 4647 7551 14570 3278 -1786 6832 -2764
5575 -2764 -692 9041 9857 -1137 -14236 -20958 -14824 -6711 5147 5306 13055 3374 -9884 -11827
5561 -11827 -7482 -5952 -9029 -12936 -21627 -15435 -12509 3194 -7388 -10605 537 2599 16029 19469
5547 19469 7756 8021 11370 -73 -15083 -38504 -58663 -44870 -37559 -20512 -21638 -21336 -3031
5534 -3031 -6279 -23676 -33306 -33892 -11812 -16691 -10597 -5542 -9638 -3416 13669 9432 2694 -5602
5520 -5602 -8784 -17541 -19637 4256 1883 -11740 -11105 4035 3164 -1981 -15204 -22877 -23828 -16089 -24443
5505 -24443 -30347 -36825 -21030 -12209 -13811 -6399 -7697 -14453 -14151 -3656 -2303 7550 10125 1438
5491 1438 -10323 -33053 -33016 -27855 -18575 -12504 -7330 -5745 -5687 -16127 -11683 1770 3738 -1796 -5616
5476 -5616 -893 -1753 -9336 4432 4287 3224 -25104 -35705 -17773 -19089 -9555 12183 31920 35567
5462 35567 26213 6865 1493 19826 9724 -8586 -24832 -20612 -17292 -3703 -117 1918 15217
5449 15217 3538 -23428 -31400 -24946 -14113 330 14352 18243 15830 10945 13512 -646 -17661
5436 -17661 -25234 -29691 -28086 -26630 -21473 -15801 -17994 -16185 -17602 -21319 -23991 -560 8563 17015
5422 17015 24622 7245 -10374 -17371 -11194 11161 22084 18977 4072 891 0 2391 10524 -4743
5408 -4743 -22815 -12221 -2926 -9773 -21267 -50980 -58838 -52906 -38617 -36307 -21611 -26088 -23042
5395 -23042 -16901 -11858 -15617 -21168 -28739 -7655 6057 12687 12747 14810 14059 -787 -6779 13599
5381 13599 25839 17094 -6026 -16683 -14358 -21698 -24726 -8011 -5926 -7500 -11895 -4706 -22064
5368 -22064 -26646 -15036 13771 26665 23471 20301 12107 6342 -7833 -4223 10328 6893 -4573
5355 -4573 -11735 599 11779 19284 17633 4793 -4008 -8734 -14474 -22672 -39839 -45996 -21713 2862
5341 2862 13431 -254 -544 6588 17001 13074 7230 -2458 1915 12606 6078 1259 -3968 -9437
5327 -9437 -5153 4394 12932 691 -7874 -7004 4308 15493 18083 19396 8530 -8302 -4415 -2079
5313 -2079 -12399 -14591 451 20212 5366 3198 6426 2989 -5014 -4291 4685 2758 254 -1231
5299 -1231 -7112 -18651 -14576 -5982 3529 -13035 -11440 7228 11139 13976 12226 6259 -3177 2474
5285 2474 -4031 -17044 -9467 5937 7042 4098 2055 454 -18049 -36364 -23248 -3096 -7284
5272 -7284 -22553 -23441 -19684 -3632 3885 -4900 -17076 -12250 -9837 -1270 1367 1139 -4789 -17103
5258 -17103 -20703 -36833 -32790 -14720 -9665 -4466 -12906 -23860 -26022 -19677 -10672 -16867 -14418 -8562
5244 -8562 -23953 -22919 -4245 -3861 -18048 -31315 -36924 -35195 -31095 -26062 -13020 -14758 -22945 -22620
5230 -22620 -34954 -39801 -30085 -19910 -24294 -18990 -4201 -3015 2020 4928 5177 451 -9431 -18793
5216 -18793 -3588 13789 18403 19504 4119 3877 296 -5534 5407 14434 32372 8722 6797
5203 6797 12865 13486 25938 38740 31970 28295 11265 10223 14002 2466 2060 16134 29852 27502
5189 27502 2427 -7421 -3380 1227 -469 4051 -2772 -8833 -1793 3765 4264 -10280 -18619 -23019
5175 -23019 -12544 -16349 -13292 -2921 12781 30935 22471 10580 -2859 -8843 -26889 -41440 -28067
5162 -28067 -14446 -2957 7099 10913 15513 10785 29357 25577 13241 11701 21750 19980 9884
5149 9884 5025 20183 18695 16240 2622 -1626 -14868 -17607 -4756 -1197 5156 -9421 -32851
5136 -32851 -30898 -21593 -28532 -19773 -13417 -16228 -2788 -130 -5887 -10185 -17054 -12409 -5741 -3533
5122 -3533 -498 4735 -2798 11186 28680 21503 4382 -2883 -10836 -31276 -28909 -15889 -9261 223
5108 223 -1903 -15883 -22749 -29568 -11339 -8990 -7152 -10038 -14058 -3372 9783 -7067 -28317 -21724
5094 -21724 -2944 3582 -3391 -10560 -9076 -23857 -18290 -11954 -10528 -12537 -19961 -5878 2373 4734
5080 4734 13933 16540 -1163 -14958 -16503 -8837 -12371 -13988 -6514 17960 15066 -496 -21091 -24604
5066 -24604 -6453 10420 7939 5241 -11338 328 25955 39975 30932 8405 4947 -3208 -15764
5053 -15764 -25697 -20764 2677 16807 6538 -19298 -26272 -12992 9485 10912 15067 7600 2494
5040 2494 13286 -2276 -5013 -4014 -4718 5975 1579 -8567 -4776 -3447 -12426 -8221 -1682 -1670 13449
5025 13449 4844 -5127 -1738 -6647 2774 12770 10722 15541 18444 23334 1381 -13598 -2671 5179
5011 5179 3519 -8319 -14585 -14516 -5866 14561 18834 9145 18974 33258 17018 -14778 -26595 -17872
4997 -17872 6291 18341 4540 -14204 -18522 -14473 -22202 -27110 -20662 -10374 1850 11316 3241
4984 3241 10173 -6039 -8792 -10955 -16504 -14332 -21937 -39635 -42244 -47346 -33762 -22538 -27378 -29632
4970 -29632 -14761 -12957 -5752 -4477 5042 1242 -18944 -25869 -27635 -16911 -1860 10411 19826
4957 19826 26972 11346 -6201 1721 14434 15533 -83 -8565 -6450 -10468 -14276 -4329 4667 -5940
4943 -5940 5192 2906 -14322 -24835 -28991 -23392 932 84 -16987 -5928 -435 -47 -9823 -20323
4929 -20323 -7719 15617 14390 14156 3193 -13759 -6403 -3315 3813 4135 14200 6708 -11958 -4050
4915 -4050 3976 840 -10796 -23684 -22216 -41509 -49784 -18844 2701 6518 32599 36068 11284
4902 11284 5700 19460 14885 13784 19948 15637 5884 3436 -3879 1966 17065 24160 6414 8733
4888 8733 6306 -5832 -25279 -28856 -35868 -31627 -29738 -21910 -22648 -1263 737 8996 13385 5148
4874 5148 8664 6630 562 -7872 -12267 -14537 -14070 -18750 -18479 -16393 -2864 6031 1183 7672 8935
4859 8935 2234 -20409 -40997 -39586 -29913 -9110 11635 11338 13731 7353 3558 9589 4735 -10587
4845 -10587 -13792 2255 13625 19600 32776 25248 13255 13145 5184 13664 24780 15766 9491 8599
4831 8599 2441 3566 -3127 -20294 -19425 5404 11973 8202 11454 9001 3961 -4397 -18424 -11257
4817 -11257 -5298 3226 13984 13076 -1615 7016 18317 28388 17079 6177 -10241 567 10940
4804 10940 4946 -12186 -7489 -4486 -15079 -26682 -14513 3265 -6712 -16281 -11003 -12194 -735
4791 -735 -5559 5318 6323 12917 11907 22326 32344 19799 14729 5877 -12246 -10709 -1630 -8685
4777 -8685 -10444 -14118 -20100 -31776 -21492 -101 1090 -6178 5811 -16152 -37342 -41149 -33925
4764 -33925 -40775 -36328 -37272 -16247 -7070 4279 20625 7569 -8675 -4538 7521 4528 2151
4751 2151 7276 -1692 395 11452 4540 -11185 -656 23300 14711 -17537 -9033 9693 6840
4738 6840 -4727 2516 3044 -13533 -23720 -6216 2912 -2734 -107 1787 7721 21294 6501 1279
4724 1279 -8553 -10504 -4737 -17223 -32242 -31791 -21677 -1812 3649 13404 4369 -184 2535 5998
4710 5998 8341 6300 -5585 -22583 -32012 -38481 -34370 -33592 -27331 -24673 -15984 3303 8256 -3797
4696 -3797 -8454 -15208 -1971 10583 4550 7968 30788 31319 18926 15482 7688 5575 123 -7373
4682 -7373 -2451 8302 4251 14539 11120 20268 29256 11895 -4590 9904 13701 9321 15164 983
4668 983 -5381 -10927 -14834 -11903 -25463 -20141 -6341 4083 -75 6152 16418 24728 25764 17210
4654 17210 22877 7313 1946 7754 19240 25569 20621 2316 -18577 -20801 -23659 -33947 -29876
4641 -29876 -16171 -8721 -13049 -16522 -2031 -15924 -44313 -47698 -44614 -39188 -20337 -4579 24597
4628 24597 21691 12023 6653 3095 -128 2884 8996 18394 -1132 -8557 -13288 4586 22269 17087
4614 17087 10244 26751 9893 -4812 -15391 7493 15572 12871 2008 180 -628 -6598 -5213
4601 -5213 -10140 -940 -5849 -16711 -24628 -16158 -5717 -9078 -9608 -10606 -8854 -7257 -4559 -9634 -23033
4586 -23033 -21754 353 3601 205 1794 1027 21478 23711 26908 13378 9864 6520 11332 16402
4572 16402 -9020 -16756 -10108 -8234 -5545 1857 -727 -1795 13721 36836 48580 26603 876
4559 876 -2148 6593 10526 5901 15491 38850 48005 43395 33650 33280 38016 16458 10692 16250 11050
4544 11050 5901 3230 3692 34332 39076 34092 32292 21487 29306 21728 20757 17399 2549 -5857
4530 -5857 -2506 2970 7265 696 1251 4643 6303 -1651 6878 466 -19766 -25384 -19467 -16977 427
4515 427 5092 2007 6534 20198 5143 -2390 -6960 -17395 -30418 -28505 -29605 -15993 -3254 -906
4501 -906 4420 -6677 -10956 -16390 -14381 -4606 3408 23849 24635 17267 14040 8087 -5227 -2133 -7148
4486 -7148 -19252 -9881 6240 1520 -1873 -1428 -6902 504 7181 11605 19598 9670 980 1828 10003
4471 10003 17222 18316 12606 22304 20816 12126 5136 625 -3128 -17311 -14436 -13683 -12850 -16000 -22509
4456 -22509 -18754 6640 21365 -1123 -14128 -14509 -17967 -25461 -32577 -24582 -16273 -14213 -4357 3006
4442 3006 16252 20740 27528 5329 -21834 -19388 -11845 -6958 -12069 -8287 9808 11434 984 8308
4428 8308 23516 30348 26767 594 -12929 -5687 4826 7060 11266 19413 12235 10609 1229 -13698
4414 -13698 -26178 -2973 13360 7429 5135 5027 2409 -3094 -10307 -14546 -17925 -19757 -2405 6492
4400 6492 11362 19808 13258 13667 21205 24965 23995 13380 8669 5327 6147 -1605 -4473 -6705 -4618
4385 -4618 -11560 -4792 12019 9607 3908 10178 13979 254 2310 9181 10374 -608 -21299 -14856
4371 -14856 -4391 -8171 6692 5629 -3015 -4351 7304 11742 12864 5475 -6238 1308 -1027 14075
4357 14075 23403 11014 17408 15601 25180 22392 21703 19033 22246 29080 14330 8383 16955 12867
4343 12867 9560 1599 14113 3011 -8860 -14673 12024 14854 23335 10281 11771 11574 178
4330 178 -415 -2426 -2073 12646 19959 15249 13195 4530 12977 10193 14403 15936 17737 11312 -330
4315 -330 586 -15462 -12424 -15984 -1485 6554 3398 5960 5067 -4851 -6494 -1729 -12 13924 17850
4300 17850 13001 27047 38901 24113 12329 -1079 -7599 -13434 -24008 -19268 -14543 -7260 42
4287 42 -14794 -22708 -26491 -20221 -11310 -22885 -30786 -8697 10614 20690 13918 -9169 -14006 -20365
4273 -20365 -15099 7802 9949 9012 -1466 -9026 -19454 -13796 -8541 -8253 -3784 -17882 -19539 -3425
4259 -3425 -7744 -1884 1551 1746 3379 3800 2699 9772 17817 19973 -4855 -9077 1876 -444 -8085
4244 -8085 -2427 -770 -15300 -16990 10240 -1911 -20678 -18871 -18039 -25690 -26758 -5253 2177 -6167
4230 -6167 -14760 -15590 -14747 -17701 -22040 -22261 -812 11741 13425 4351 -11612 -29420 -23705 -4182
4216 -4182 2916 8299 4405 -2408 -22646 -25783 -11216 8900 16044 22831 14837 -652 -1312 -27
4202 -27 5984 10004 2559 -14730 -18508 -15018 11019 20399 2908 8910 5998 3729 17961 17334 24031
4187 24031 10464 17600 10915 633 -4621 -7084 -9466 -1186 1588 -1230 3358 4012 14619 22276
4173 22276 16385 12593 5764 452 -4169 -16101 -16665 -14986 3879 108 -11704 -20433 -26423 -9723
4159 -9723 5797 18530 23335 24142 22788 35876 42705 23476 15275 6422 2881 1052 -9181 -14544
4145 -14544 -4478 -8058 -23351 -21389 3485 26079 6877 -6170 -3831 -12459 4399 20139 25415
4132 25415 19959 -4485 -56 22122 38024 27784 10364 3650 6779 -1648 4880 5275 12675 8535
4118 8535 4202 6643 14921 7091 -8460 5258 14263 2954 -5095 -954 -7202 -3094 -3359 -4254 -5281
4103 -5281 -2027 2062 6182 9772 19819 18130 17685 19511 17389 13583 10836 9348 -4003 -79 1715
4088 1715 9369 7100 2339 7285 4390 -16033 -7740 5276 8317 4098 -14920 -27392 -31016 -15269
4074 -15269 1056 2589 -2826 -5063 -1742 633 6144 4301 -2638 8352 7560 416 2475 5531
4060 5531 9313 4973 3885 13970 8237 -10567 -11342 -7760 -8951 -6348 23127 28585 20198 11807
4046 11807 4431 4013 2897 8883 6563 -1849 -7308 7292 17208 7351 4051 -596 -9326 -3532 -13242
4031 -13242 -23052 -28727 -45069 -21601 -15700 -9400 -9325 -1315 14259 12283 17670 8157 -528 -6123
4017 -6123 -14341 -28611 -28318 -18867 2327 14484 6848 2784 19781 22638 18274 22526 11020 -5047
4003 -5047 -6054 -1509 -1702 -9917 -18726 -8107 14247 35301 24354 27488 21957 16843 18988 13641
3989 13641 -1188 -10500 -16676 -28145 -13521 -2972 3731 12664 21059 -2244 -15553 -9154 263
3976 263 1864 9161 19735 26241 18282 4936 -3541 796 5445 1883 4717 4545 2089 -3272 1832
3961 1832 8395 12266 6239 -6579 -5567 6357 10112 7298 20077 10172 4726 -1528 -5173 -13642
3947 -13642 -11183 -2925 22976 26589 25845 10907 10985 17177 18279 5664 12374 5731 4995 274 -3772
3932 -3772 -2633 15023 6586 -2596 -24185 -38075 -37567 -12873 5396 286 -3772 -6962 -878 -10803
3918 -10803 -21676 -28663 -27996 -16291 -8659 7631 -4393 -20062 -14306 -12998 -8360 -10572 -11969 3862
3904 3862 16802 18501 17448 7301 8704 12667 11757 2074 -4293 2375 8513 12977 11424 18564 13861
3889 13861 1751 5878 -6814 4167 8107 -17864 -27284 -33363 -38051 -34740 -32413 -18487 -9807
3876 -9807 -6124 -5586 -3516 13935 30681 40852 34507 7098 142 2851 7149 15537 11003 1986
3862 1986 -8513 -16925 -11323 9714 5007 -1427 -15356 -21815 -24567 -12960 -8958 -14231 -4596 17532
3848 17532 21425 18540 5710 -20754 -19927 -3880 -26852 -16988 -13664 -21523 -30581 -44670 -33765
3835 -33765 -17836 -5107 -9285 -4954 -1893 -1679 16238 11117 -3400 -7172 -344 -5259 -11447 -18267
3821 -18267 -23183 -12261 -14892 -7109 12353 4418 -2581 -3381 3730 14420 31944 34013 17074 3977
3807 3977 998 -3865 1607 -17183 -34440 -24994 -13817 -1831 10801 10345 5559 -350 -3717 -8841
3793 -8841 -13855 -533 9871 -34 2475 1038 -6587 -8285 -599 -3464 -10676 -16802 -11459 2167
3779 2167 14994 15546 12956 4839 16476 33985 37435 20327 18103 26536 16100 7780 4989 -4792
3765 -4792 -23126 -27345 -20922 -6783 -8755 428 1717 2107 172 -17852 -15923 -9001 -11071 -12632
3751 -12632 -597 -3833 -2722 -7744 8515 12485 9624 3130 1571 5724 -3706 -981 -3872 -1456
3737 -1456 17423 21468 20173 19566 18150 12414 -1677 -12721 -4690 -14785 -16248 -3656 9781 6330
3723 6330 14656 8809 1761 -1316 -5865 -31497 -37411 -36204 -12892 1285 -14232 -19063 -3131 -2168
3709 -2168 2340 2437 11343 10508 10310 10100 38475 36530 20279 2202 -9059 -10488 -8724 5408 4195
3694 4195 -2743 -962 -5518 -5284 -10434 -17822 -15237 2824 15456 15686 -7947 -24696 -33400 -17404
3680 -17404 376 8447 5355 -12697 -9488 -554 -5862 -5420 1154 -18302 -15217 174 8199 13736
3666 13736 8971 -114 8680 17520 10998 12053 -3715 -5806 -5497 -20569 -25606 -19665 -10224 -4099
3652 -4099 -7026 -11693 -31914 -32617 -13312 14160 16511 -2957 -33299 -22819 -9693 -18263 -22576
3639 -22576 -964 7324 -8524 429 -6099 1417 12455 14916 2201 4741 17227 17132 -7419 -4625
3625 -4625 3396 3322 3184 -14998 -21225 -22980 -35361 -39400 -24239 -20500 -17210 10808 11023 -11317 -27147
3610 -27147 -24771 -12865 -29351 -24972 -25567 -29651 -29529 -10431 9773 8989 10870 6030 5128 3885 -8508
3595 -8508 -7602 -1459 4009 5885 1364 -3690 7245 5286 1613 4187 4370 13147 3466 3242 2424 -16186
3579 -16186 -35939 -41213 -38384 -17269 1875 8799 1004 -16217 -16911 -5407 -2120 -11943 -21415 -20250
3565 -20250 -4754 -7584 -7073 167 4411 1106 -23983 -37503 -22540 -7904 385 8146 -5716
3552 -5716 -28584 -35732 -19671 -13498 -19903 -20672 -18654 -4500 8208 3848 1727 -16352 -18445 4023
3538 4023 14056 10396 6449 3245 14173 19047 14583 21735 25850 18245 15765 1538 -10012 -16600
3524 -16600 -14055 -10734 4331 12467 8058 19936 20736 -3462 -26273 -29060 -29636 -32350 -28486 -25213
3510 -25213 -32931 -35533 -3785 5732 1208 3733 7521 13186 4384 -2271 -13302 -11046 -6794 -5877
3496 -5877 -7760 -8271 -4825 -16412 -2146 6112 1360 -15559 -8339 -15736 -24836 -30718 -21559 -13085
3482 -13085 -14872 -10086 -9135 -18111 -4650 -5544 -6528 4071 3061 7451 8235 10214 7367 10103 8682
3467 8682 14021 13520 13866 9417 11526 24553 32970 10786 -14846 -26617 -32602 -29233 -17228 -9814
3453 -9814 8545 18380 11894 5793 -2668 -21459 -31926 -8741 6585 4187 5395 4179 9084 17753
3439 17753 19072 13911 21277 16254 12276 6884 10204 31246 37218 26341 29225 30391 18523 2323
3425 2323 -2781 -166 -2556 6827 14495 17307 21319 25045 17641 20296 4165 -3046 2349 10383 25569
3410 25569 30336 22853 24894 24798 23676 26745 20629 6727 13214 9493 9602 -4882 -12138 -1281 1992
3395 1992 3881 11288 15998 15297 7583 -7872 -19962 -9203 -8414 -13584 -6362 -1197 -6179 -5461 -6608
3380 -6608 -3075 6644 10012 -3119 -9590 -9193 -17531 -19919 -28099 -3808 -4559 4548 5148 -7280 -15533
3365 -15533 1484 15446 11052 3117 9124 9278 -8605 -15357 -28777 -23235 -17335 -10672 4455 11392
3351 11392 11150 4609 13 -2273 -15331 -39291 -45015 -51108 -24293 -9131 -1415 4002 -4122 -4465
3337 -4465 -6562 -10857 -6438 7299 5199 12911 -2077 -6457 -300 17732 35419 34657 30448 29429
3323 29429 34759 22503 21313 18434 17181 14793 3486 -2282 -20280 -27259 -15321 -8985 -6013 -12430
3309 -12430 -4272 926 -9997 -5810 -4060 9566 29167 28804 35148 33048 21327 21976 29189 21045
3295 21045 3491 9712 11253 10957 502 -19105 -12702 5833 11004 -65 -1298 -14577 -28222
3282 -28222 -25754 -25442 -17065 3322 11627 -3034 -14300 -20312 -6486 321 4385 -5581 -421 15898
3268 15898 6792 6967 -6582 -17069 -15089 2153 -1278 -8059 -14959 -25384 -7104 16579 38584
3255 38584 28880 29094 30479 25080 1796 6897 10277 -5088 -14838 -7812 -2790 12952 5994 -14211
3241 -14211 -3936 4253 1231 -8905 -27720 -23090 -15054 -8071 -4040 2768 455 -13770 -21840 -4338
3227 -4338 -4173 -10810 1300 12363 3725 -16902 -31283 -27630 -15439 -4954 3 4051 17878
3214 17878 17427 16052 25145 37632 27577 12257 -9535 -19450 -13846 -11770 1774 7273 5200 7306
3200 7306 -5855 3395 18571 21533 -2147 -1651 1076 12475 3001 851 4497 4122 155 -3230
3186 -3230 1272 10830 12666 -5090 -13420 -18785 -28610 -17812 -2977 -2575 -22384 -28524 -26337 -11298
3172 -11298 -12286 -8124 -15633 -19596 -9487 818 -7384 -5227 909 -6605 -9098 -103 7598 6038
3158 6038 -2533 -12528 -8366 10363 7225 -6471 -4253 11138 24822 16163 -5698 -11134 3362
3145 3362 9405 18951 24499 22081 10940 18100 8657 8056 5150 -10727 -4507 3907 -18931 -15172
3131 -15172 -19397 -22142 -23326 -30723 -22953 -8429 -5926 7427 6221 6668 15404 16171 11320 11034 6099
3116 6099 -1688 -15602 -20384 -14210 -17054 -24818 -33072 -18550 -15313 -17125 -8842 -8984 -11278 -15017 369
3101 369 5411 -3959 -14006 -9120 1987 -7517 3446 3987 -21937 -18375 -11230 -15910 -24783 -22476
3087 -22476 -23391 -16189 9074 19543 22738 20940 14214 6434 1255 3191 -9492 6717 21817 17527
3073 17527 11128 16428 4670 -230 -5026 3446 1193 9971 20659 32510 13686 -9353 -3832
3060 -3832 3204 -17248 -37431 -27879 -18850 -8195 556 29208 26715 3149 -6813 -2435 12369
3047 12369 10478 20289 16794 18017 -4367 -29795 -27797 -4664 3556 -5368 -10404 -2681 -3495 -15465
3033 -15465 -9850 -11752 -10926 -10053 9977 -664 7451 21870 24466 5227 -3246 3395 -1888 -7927
3019 -7927 -32386 -39152 -24959 -18262 -17061 -8071 3538 2186 -7312 -8592 -478 198 -10515 -8075
3005 -8075 11512 21378 7080 -10582 -14951 -17809 -8627 12874 5621 -2116 -3717 -6746 -6471 -2559
2991 -2559 -309 -8772 1465 5190 13663 8865 15332 -3300 -15001 -11033 -9465 -17397 -9780 -7179
2977 -7179 -15662 -1059 6752 11850 7461 8545 -1642 5868 12895 -337 4836 16826 15228 14100
2963 14100 6314 -1880 975 -2108 -13873 -9946 -11612 -6521 -8256 -5911 -7293 -22453 -37598 -43947
2949 -43947 -44868 -39995 -43595 -39546 -37356 -33974 -28965 -15330 -18124 -7262 1010 10167 15245 35147
2935 35147 32212 18761 26312 13954 8826 22742 21706 20681 18235 4462 4857 -1370 3961 4577
2921 4577 11384 33390 31234 45735 29518 -2931 -12182 -5061 -19185 -14593 -13734 -10687 -1210 15752
2907 15752 12377 17567 35232 30656 17396 -6336 -16506 -12036 -7453 -8223 4947 5201 15866 26189
2893 26189 14918 5837 -5490 100 -7918 -16590 -2454 2388 13461 16927 23423 26143 32535 31155
2879 31155 28793 31300 32107 41726 14319 4062 19001 33442 26801 21153 7008 -3370 -1763
2866 -1763 6627 -290 -10510 -20567 -16679 -1657 4219 7999 5596 3928 6491 -6664 -10780 1950
2852 1950 9170 7320 10760 2581 6001 2687 -1651 -226 -13164 -10461 -366 17813 26980 12824
2838 12824 7082 -9246 -35315 -23800 -7546 2945 15559 4635 11430 32077 40142 24602
2826 24602 11194 -8494 -12852 1855 16884 21199 8330 7114 14190 19883 21072 20345 21652 24877
2812 24877 25446 41907 32512 10078 -650 -8025 -11914 -11967 -6242 -2613 -2916 -3705 4667 20085 15165
2797 15165 1705 -15309 -6621 4986 4208 -4530 -6111 -13124 -10832 -26445 -37578 -25409 -20132
2784 -20132 -22504 -5678 1312 14978 14157 2182 -10323 -26318 -18959 -35318 -32005 -16531 -6819
2771 -6819 1404 -8406 -17284 -14417 8988 20015 6738 -2308 2471 10193 -11580 -14964 8712 17686
2757 17686 14088 -13139 -8973 -3865 -8131 3991 6785 2069 -13504 -28049 -28016 -24375 -1871 4877
2743 4877 15849 24075 36173 51257 27123 9273 7508 8962 6186 11516 11419 13407 12456 2410
2729 2410 -5856 -627 5711 9125 19449 33443 25188 21174 12598 -17905 -22058 -17136 -12452 -20568
2715 -20568 -28630 -25768 -20536 -2175 9618 8562 -9545 -37512 -40072 -21214 -2599 4713 11144
2702 11144 3760 -14050 -20083 -21394 -13943 6111 11446 11792 11812 30760 39846 42626 23558 -2837
2688 -2837 -10220 -2784 6778 18974 9083 13645 36800 32054 12032 -13056 -7855 -3942 -4430 9972
2674 9972 20502 35006 30821 15583 -12902 -18627 -21960 -12502 3549 -1699 -13161 -21249 -24798
2661 -24798 -9331 11977 20790 17206 10806 5939 -6797 -23795 -33158 -13322 13270 13762 2985
2648 2985 -12043 -19762 -20940 -9429 -9210 -9404 -6402 2968 368 -6328 -3534 -7933 7577 29701
2634 29701 16008 -7105 -5962 17826 10487 6636 -351 -14095 -8306 1312 -5603 -6040 10086 19144
2620 19144 8745 1315 814 -18672 -29915 -20868 -20715 -25840 -11382 6724 14072 21346 24432 9571
2606 9571 -14155 -11937 23601 33327 23989 33212 39228 36953 29492 23772 34451 34950 21463 4145
2592 4145 8250 2313 17356 23917 7175 -12454 -23382 -15192 -2503 -15947 -18159 -17693 -21172 -13373
2578 -13373 7519 18491 6704 17684 32053 23043 9392 3885 -8116 -5995 -7413 -6013 -16931
2565 -16931 -11521 -9368 -11696 -23551 -19719 -5226 1792 -12631 -23686 -12263 -12704 -14040 -1825
2552 -1825 17493 11457 6587 7838 23457 26184 29763 34172 26167 19132 20978 18713 7404 3818
2538 3818 3991 878 2708 22709 21287 15040 -1753 -14516 -3098 -644 -12568 -25935 -23983 -19085
2524 -19085 -17991 1018 24297 24005 12067 7069 12842 3948 -2768 4176 13730 20919 41507 56309
2510 56309 43750 30864 27878 17726 -9305 -23944 -28808 -24008 -19281 -19020 -9485 -15477 138
2497 138 13674 19057 16194 -3149 -10375 -12461 -25846 -11417 10586 -1217 -5787 8373 6736
2484 6736 14815 12280 19046 19479 4063 -13669 -23249 -2509 9062 399 -1465 -15599 -25074 -14874
2470 -14874 -22834 -21412 -13233 -15060 -4631 -5722 -841 -10256 -16040 -28945 -16148 3885 2681 -3401
2456 -3401 -2060 -14005 -16139 -10168 -2428 -14620 -17241 -13290 -8837 8925 27163 26136 1146 -7220
2442 -7220 -2579 4927 13881 15656 20767 17251 21756 20062 10557 4795 -4757 5063 22569 20076 6191
2427 6191 6326 7891 1158 -8421 8281 6377 3689 1233 3313 3011 7801 4308 -7279 -9079 10623
2412 10623 31337 27301 12404 -60 -17008 -38694 -43769 -34425 -11596 381 -2698 -3338 -4418
2399 -4418 -11103 -2966 10847 23136 10617 13805 13934 5187 -13503 -2505 11651 10761 -8212 -7393
2385 -7393 2198 -928 9405 473 -9541 -1339 26875 35851 18256 8373 5998 7623 22379 23652
2371 23652 22723 11910 -5290 -1288 5562 2207 3316 -3615 -4550 -9602 -13775 -9906 -7597 -17475 -24079
2356 -24079 -28975 -31156 -22702 -10890 -2836 2091 -17341 -32644 -9770 10121 3433 -21148 -37373
2343 -37373 -26118 247 734 -4381 4659 657 6222 9402 15975 5098 12666 32541 32093 27844
2329 27844 14008 3002 1896 7278 -8295 -12055 -4382 -2523 13180 9005 24429 28047 3219
2316 3219 -14501 -18436 -11498 -10906 -6853 -4205 -5186 -10723 -858 1914 -15431 -24510 -9411 -7294 -13201
2301 -13201 -17048 -3980 3254 -2226 -19335 -4223 14430 13661 4507 -23664 -37293 -21888 -13852
2288 -13852 -13892 -12210 -16295 -13673 1657 -3828 -10545 -13528 -18222 -9986 -5131 -3273 -2398 -1449 -9359
2273 -9359 3225 9349 -6028 -4002 -8022 -13826 -1061 2809 1292 7078 2025 7832 10076 3038
2259 3038 7550 20408 19439 28535 28831 9066 -21301 -20866 2495 21264 16946 7576 7560 9550 21160
2244 21160 15350 15887 20881 19488 19169 3459 -18392 -13454 -5233 -3431 -3425 6752 901 -8535 4884
2229 4884 22306 1211 -10891 -7678 -12151 -4482 19720 21308 15810 11931 36 -16857 -3744
2216 -3744 8958 9623 13294 -3492 5225 9644 8824 -4310 -16247 -20187 -20422 -15976 -8666 8008
$$ [...]
##END NTUPLES=NMR SPECTRUM
##END=
