##TITLE=Analysis number 322809
Compound Code cc 03626
Book Reference 407/131/2
Project Code adrs
Chemist Name andyw
##JCAMPDX= 6.0         $$ Bruker NMR JCAMP-DX V2.0
##DATA TYPE= NMR SPECTRUM
##DATA CLASS= NTUPLES
##ORIGIN= Bruker BioSpin GmbH
##OWNER= nmr
$$ XWIN-NMR		Version 3.5
$$ Mon Oct 16 09:03:35 2006 GMT Daylight Time (UT+1h)  MAYBRIDGE\nmr@NMR_250MHZ
##.OBSERVE FREQUENCY= 250.131544655141
##.OBSERVE NUCLEUS= ^1H
##.ACQUISITION MODE= SIMULTANEOUS (DQD)
##.ACQUISITION SCHEME= undefined
##.AVERAGES= 16
##.DIGITISER RES= 18
##SPECTROMETER/DATA SYSTEM= dpx250
##.PULSE SEQUENCE= zg30
##.SOLVENT NAME= CDCl3
##.SHIFT REFERENCE= (INTERNAL, CDCl3, 0, 16.522)
##AUDIT TRAIL= $$ (NUMBER, WHEN, WHO, WHERE, WHAT)
$$ ##TITLE= Audit trail, XWIN-NMR		Version 3.5
$$ ##JCAMPDX= 5.01
$$ ##ORIGIN= Bruker BioSpin GmbH
$$ ##OWNER= nmr
$$ C:\u/data/dgb/nmr/ADRS/400/pdata/1/auditp.txt
$$ ##AUDIT TRAIL=  $$ (NUMBER, WHEN, WHO, WHERE, WHAT)
(   1,<2006-10-16 09:03:07.63 +100>,<MAYBRIDGE\nmr>,<NMR_250MHZ>,
      <created by zg, POWCHK disabled, PULCHK disabled
       configuration hash MD5:
       49 4B E0 1D 92 C2 6B 37 9F E6 65 BC 52 41 86 1D
       data hash MD5: 64K
       49 C5 D9 07 92 92 97 C3 E1 89 7B CC 90 E0 12 8E>)
(   2,<2006-10-16 09:03:25.74 +100>,<MAYBRIDGE\nmr>,<NMR_250MHZ>,
      <Start of raw data processing
       ef LB = 0.3 FT_mod = 6 PKNL = 1 SI = 32K 
       data hash MD5: 32K
       2E 49 BA B2 F1 CD 2F C6 C6 CD 3D 57 14 90 4B 88>)
(   3,<2006-10-16 09:03:27.58 +100>,<MAYBRIDGE\nmr>,<NMR_250MHZ>,
      <apk 
       data hash MD5: 32K
       D8 B6 1F 32 12 C9 41 9A 18 79 86 BB 05 A3 9F 9F>)
(   4,<2006-10-16 09:03:28.33 +100>,<MAYBRIDGE\nmr>,<NMR_250MHZ>,
      <abs ABSG = 5 
       data hash MD5: 32K
       CE 2C BE 56 62 06 AB BD F4 F6 F1 78 22 2E 34 2B>)
$$ ##END=
$$ 
$$ hash MD5
$$ 9E 9D 1D 1A AC F1 4B 2E F5 7D 87 38 12 44 89 4C
##$RELAX= 
##$RELAX= 
##$RELAX= 
##$RELAX= 
##$RELAX= 
##$RELAX= 
##$RELAX= 
$$ Bruker specific parameters
$$ --------------------------
##$DU= <C:\u>
##$EXPNO= 400
##$NAME= <ADRS>
##$PROCNO= 1
##$TYPE= <nmr>
##$USER= <dgb>
##$AMP= (0..31)
100 100 100 100 100 100 100 100 100 100 100 100 100 100 100 100 100 100 
100 100 100 100 100 100 100 100 100 100 100 100 100 100 
##$AQSEQ= 0
##$AQ_mod= 3
##$AUNM= <au_zg>
##$AUTOPOS= <26 >
##$BF1= 250.13
##$BF2= 250.13
##$BF3= 250.13
##$BF4= 250.13
##$BF5= 500.13
##$BF6= 500.13
##$BF7= 500.13
##$BF8= 500.13
##$BYTORDA= 1
##$CFDGTYP= 0
##$CFRGTYP= 5
##$CHEMSTR= <none>
##$CNST= (0..31)
1 1 145 1 1 1 1 1 1 1 1 1 1 1 1 1 1 1 1 1 1 1 1 1 1 1 1 1 1 1 1 1 
##$CPDPRG= <>
##$CPDPRG1= <>
##$CPDPRG2= <>
##$CPDPRG3= <>
##$CPDPRG4= <mlev>
##$CPDPRG5= <mlev>
##$CPDPRG6= <mlev>
##$CPDPRG7= <mlev>
##$CPDPRG8= <mlev>
##$CPDPRGB= <>
##$CPDPRGT= <>
##$D= (0..31)
0 1 0 0 0 0 0 0 0 0.06 0 0 0 0 0 0 0.0002 0 0 0 0 0 0 0 0 0 0 0 0 0 0 
0 
##$DATE= 1160985786
##$DBL= (0..7)
120 120 120 120 120 120 120 120 
##$DBP= (0..7)
150 150 150 150 150 150 150 150 
##$DBP07= 0
##$DBPNAM0= <>
##$DBPNAM1= <>
$$ [...]
##$SUBNAM7= <"">
##$SUBNAM8= <"">
##$SUBNAM9= <"">
##$SW= 20.6930455092707
##$SWIBOX= (0..15)
0 0 3 0 0 0 0 0 0 0 0 0 0 0 0 0 
##$SW_h= 5175.983436853
##$TD= 65536
##$TD0= 1
##$TE= 683.16
##$TE2= 300
##$TE3= 300
##$TEG= 300
##$TL= (0..7)
0 120 120 120 120 120 120 120 
##$TP= (0..7)
150 150 150 150 150 150 150 150 
##$TP07= 0
##$TPNAME0= <>
##$TPNAME1= <>
##$TPNAME2= <>
##$TPNAME3= <>
##$TPNAME4= <>
##$TPNAME5= <>
##$TPNAME6= <>
##$TPNAME7= <>
##$TPOAL= (0..7)
0.5 0.5 0.5 0.5 0.5 0.5 0.5 0.5 
##$TPOFFS= (0..7)
0 0 0 0 0 0 0 0 
##$TUNHIN= 0
##$TUNHOUT= 0
##$TUNXOUT= 0
##$USERA1= <user>
##$USERA2= <user>
##$USERA3= <user>
##$USERA4= <user>
##$USERA5= <user>
##$V9= 5
##$VALIST= <valist>
##$VCLIST= <CCCCCCCCCCCCCCC>
##$VD= 0
##$VDLIST= <DDDDDDDDDDDDDDD>
##$VPLIST= <PPPPPPPPPPPPPPP>
##$VTLIST= <TTTTTTTTTTTTTTT>
##$WBST= 1024
##$WBSW= 4
##$XGAIN= (0..3)
0 0 0 0 
##$XL= 0
##$YL= 0
##$YMAX_a= 430258
##$YMIN_a= -427927
##$ZGOPTNS= <>
##$ZL1= 120
##$ZL2= 120
##$ZL3= 120
##$ZL4= 120
##$ABSF1= 16.522
##$ABSF2= -4.171173
##$ABSG= 5
##$ABSL= 3
##$ALPHA= 0
##$AQORDER= 0
##$ASSFAC= 0
##$ASSFACI= 0
##$ASSFACX= 0
##$ASSWID= 0
##$AUNMP= <proc_1d>
##$AZFE= 0.1
##$AZFW= 0.1
##$BCFW= 0
##$BC_mod= 0
##$BYTORDP= 0
##$COROFFS= 0
##$CY= 12.5
##$DATMOD= 1
##$DC= 0
##$DFILT= <>
##$DTYPP= 0
##$F1P= 14.0000005364418
##$F2P= -0.99999901652339
##$FCOR= 0.5
##$FTSIZE= 32768
##$FT_mod= 6
##$GAMMA= 0
##$GB= 0
##$INTBC= 1
##$INTSCL= 1
##$ISEN= 128
##$LB= 0.3
##$LEV0= 0
##$LPBIN= 0
##$MAXI= 10000
##$MC2= 0
##$MEAN= 0
##$ME_mod= 0
##$MI= 0
##$NCOEF= 0
##$NC_proc= -2
##$NLEV= 6
##$NOISF1= 0
##$NOISF2= 0
##$NSP= 0
##$NTH_PI= 0
##$NZP= 0
##$OFFSET= 16.522
##$PC= 1
##$PHC0= -40.45147
##$PHC1= 1.728124
##$PH_mod= 1
##$PKNL= yes
##$PPARMOD= 0
##$PSCAL= 4
##$PSIGN= 0
##$REVERSE= no
##$SF= 250.13
##$SI= 32768
##$SIGF1= 0
##$SIGF2= 0
##$SINO= 400
##$SIOLD= 32768
##$SREGLST= <1H.CDCl3>
##$SSB= 0
##$STSI= 32768
##$STSR= 0
##$SW_p= 5175.98343685301
##$SYMM= 0
##$S_DEV= 0
##$TDeff= 65536
##$TDoff= 0
##$TI= <Analysis number 999999
Compound Code 99
Book Reference 9
Project Code 9>
##$TILT= no
##$TM1= 0
##$TM2= 0
##$TOPLEV= 0
##$USERP1= <user>
##$USERP2= <user>
##$USERP3= <user>
##$USERP4= <user>
##$USERP5= <user>
##$WDW= 1
##$XDIM= 32768
##$YMAX_p= 328987811
##$YMIN_p= -180426
$$ End of Bruker specific parameters
$$ ---------------------------------
##NTUPLES= NMR SPECTRUM
##VAR_NAME=  FREQUENCY,     SPECTRUM/REAL,   SPECTRUM/IMAG
##SYMBOL=    X,             R,               I
##VAR_TYPE=  INDEPENDENT,   DEPENDENT,       DEPENDENT
##VAR_FORM=  AFFN,          ASDF,            ASDF
##VAR_DIM=   32768,         32768,           32768
##UNITS=     HZ,            ARBITRARY UNITS, ARBITRARY UNITS
##FACTOR=    0.157963299565203, 1,           1
##FIRST=     4132.6476996994, 0,             0
##LAST=      -1043.33573715361, 0,           0
##MIN=       -1043.33573715361, -180426,     0
##MAX=       4132.6476996994, 328987811,     0
$$ Real data points
##PAGE= N=1
##DATA TABLE= (X++(R..R)), XYDATA
$$ [...]
23029 -3120 -15740 -65022 -70939 -40625 -5230 6200 10263 -8934 -25815 -41258 -45529 -35897 -13127
23016 -13127 -24198 -40915 -46975 -21111 2719 9677 4740 16833 14606 8851 -6728 -37716 -26604
23003 -26604 3217 14391 35337 45598 40909 35870 -4633 -1502 21944 54075 48919 31867
22991 31867 -12158 -34495 -18917 -12988 7737 -1292 -4521 16877 -6908 -19935 -18135 -48878
22979 -48878 -13713 -29922 -42431 -26748 -5093 -18161 -58909 -56375 -49136 -25190 25939 77312
22967 77312 99872 52093 40789 35140 -7837 -178 4286 1476 19162 33226 30067 6647 -11974
22954 -11974 -21340 -10931 -6176 -4041 3959 -20468 -19248 -5559 -3483 -4197 -6936 -2497 15419 19714
22940 19714 27352 37180 14198 -17036 -17601 -35568 -16191 -13520 17208 34723 -7429 -35559 -49406
22927 -49406 -48289 -12937 476 -33448 -23957 -12204 -6723 -27052 -39399 -32567 -25774 -19007 -11252
22914 -11252 -11028 -16039 7405 9694 -15627 -45012 -40271 -6123 2700 -14167 -7859 60286 83626
22901 83626 62855 19987 -23799 -27704 -16528 -30494 -9241 13728 44038 76265 55563 39066
22889 39066 -4889 -21966 -18686 -22872 -27645 -61022 -44533 -20707 -10421 -21925 -21885 -37879 -18574
22876 -18574 11165 -8738 -22843 -1468 27411 18836 24912 34874 24833 56126 39576 17914
22864 17914 -23031 -54152 -58833 -13208 35033 46865 31046 41139 14715 -3485 -676 23246
22852 23246 26679 -18354 -25200 -41237 -30930 -40790 -42649 -30816 -36597 -45893 -63013 -58135 -23327
22839 -23327 -31473 -32295 -18003 -36808 -43312 -11494 10358 10197 22506 34423 12857 -8560 -3202
22826 -3202 3038 -5147 -11452 10937 18349 -4815 -17606 19169 51573 58282 34941 23969 29387
22813 29387 32539 40239 15124 -6899 -17668 -1485 -15552 -53627 -24778 -5628 4458 15760
22801 15760 29219 2350 -30587 -45466 -45921 -38295 3283 17978 -760 -12740 -4829 16349
22789 16349 25660 -602 -28221 -48530 -62542 -53254 -72444 -75092 -58750 -14483 3916 14386
22777 14386 -2356 -1922 3027 -11396 -60382 -60365 -48258 -45870 -44024 -30280 -46199 -41049 -2941
22764 -2941 -12403 -27960 4404 -19601 -36908 -27260 -13356 -15515 -3790 -10479 -6224 -30901 6911
22751 6911 38336 20234 -20224 -36940 -4918 -4086 13036 -5086 -18429 -19225 -29731 -20680 -29174
22738 -29174 -44574 -63294 -87970 -96543 -52951 -26106 -16280 -25308 -26294 -28937 -1214 24165 32805
22725 32805 -2939 -16196 -5975 -24122 -29728 -36353 -27413 -33631 -62326 -47877 -27988 -8577
22713 -8577 7190 -6338 -18094 -45256 -34869 -3216 4682 4400 -21187 -32716 -5575 23185
22701 23185 31615 55140 44836 44308 42349 19332 -6020 -37183 -23461 -1580 13296 16057 7904
22688 7904 1540 -7644 -18466 9771 57286 59778 56735 40860 32595 2565 -24152 -35619 -26359
22675 -26359 -47304 -65077 -72441 -63396 -31347 -16216 -29953 -32222 -48099 -66287 -59389 -49621 -35660
22662 -35660 6584 48342 44860 34402 31306 56693 37627 13739 5014 46625 57238 41299
22650 41299 -6745 -24875 -14524 -13885 -8352 469 -28435 -40480 -22420 -19525 -40800 -19543 246
22637 246 1406 11863 29345 -4069 -25922 -7693 -4948 23582 11544 -6958 11061 16521 18716
22624 18716 9659 -18249 -20549 899 2667 -8523 -7310 -195 4810 -37807 -55225 -59000 -81640
22611 -81640 -42816 -51025 -65885 -84084 -62278 -56987 -63482 -57763 -38802 -20536 -6167 3718 15247
22598 15247 7855 -4243 16500 56667 38107 37650 1983 -20970 -37251 -45631 -26114 -797
22586 -797 4967 -6373 22467 50524 20035 -6292 3678 35196 31533 35089 20541 9645 -15273
22573 -15273 -23892 -42757 -27097 -17273 -27752 -14731 -18530 6980 26024 24257 23061 -7135 -14839
22560 -14839 -20409 9956 -950 14131 -14627 -63510 -62931 -52739 -36086 -20590 -4000 33578
22548 33578 47528 32399 16575 21968 20161 4496 -11055 -2455 23215 17047 4375 21991
22536 21991 23916 -20610 -41585 -87673 -50207 -7038 3894 38238 14247 4005 -3575 -19298
22524 -19298 -5153 3567 9168 17174 33279 14824 -11977 -23742 -18140 -45640 -61846 -62805 -44374
22511 -44374 5473 35731 11791 7113 -4970 -41243 -51027 -33989 13459 612 -3409 5273
22499 5273 50502 46997 -1509 -11681 -19937 -23652 21888 25818 -10873 -33351 5747 36068 14698
22486 14698 7088 3448 -15085 -18275 16819 14827 8591 -2667 8095 26891 770 -26384 -48413
22473 -48413 -59412 -4040 12761 2099 -15299 -23196 2723 44668 51668 53842 53684 6968 -36958
22460 -36958 -61613 -66817 523 48444 21496 -30420 -20271 34614 50607 41164 33307 16809
22448 16809 22962 3952 11621 27706 39945 48419 44911 -3682 4787 11908 13637 25332 10524
22435 10524 270 -19383 6563 -4503 -22907 -14662 -11156 -28758 -46380 -40991 -17401 -17231 -11663
22422 -11663 18274 24196 6819 7572 4586 23202 10004 -10841 10453 3571 14796 37543 51122
22409 51122 24710 27507 25957 -9082 -17333 -17183 4812 33298 33263 1458 19098 43237 27833
22396 27833 4317 -14040 -2713 23999 25331 1112 11398 33028 12036 -12273 -8196 12590
22384 12590 21800 6193 9342 8380 -3716 3992 -36514 -45261 -27590 -26387 -40044 -13235 4819
22371 4819 34389 45697 36759 18886 6855 29923 64182 42292 29149 29452 25733 20518 55155
22358 55155 42207 18563 -2988 7537 18547 39315 64824 57256 19037 25545 20405 15576
22346 15576 29414 36919 31897 18125 19101 26806 30378 51287 49615 33935 -11036 -49329 -37314
22333 -37314 26260 50891 44260 41966 39262 41905 68693 53826 26098 19704 -2551 -1444 13437
22320 13437 -10426 -67698 -76390 -44106 -41580 -57070 -43693 -26828 -23564 -27671 -15610 -35285
22308 -35285 -71667 -28205 17636 21904 56767 58092 55512 34125 31804 37140 -13751 -54066 -29447
22295 -29447 22363 32612 5625 -6261 6217 16290 33719 55712 64429 44266 9472 -30763
22283 -30763 -57341 -38715 -27746 -32107 -58394 -56600 -50672 -37027 2213 8114 20354 18856 9388
22270 9388 29367 29210 29483 37659 31969 51872 64325 27911 8817 21509 22780 -6667 19872
22257 19872 34928 -8967 -31580 -18227 -20467 1219 4363 10002 3409 1308 307 -10584 -31176
22244 -31176 -31310 -37841 -48539 -18813 -6793 -21388 -226 4536 -27528 -27544 -8290 -17321 -42198
22231 -42198 -45321 -16882 -28056 1474 20003 -18611 -50020 -53218 -74919 -60928 -30177 -6669
22219 -6669 -16619 -6714 -9374 -16034 -38167 -24608 -32362 -45087 -15043 -29620 -66255 -75778 -30339
22206 -30339 22179 24185 -12891 -52182 -23486 26750 58402 33030 -11738 -41702 -46550 -55492
22194 -55492 -43541 -36154 -18620 24638 17835 -8605 -22228 -12214 -1507 -9922 -23318 -29387
22182 -29387 -20434 2930 15268 23624 42343 31595 55965 55651 33869 20565 34664 41289 43884
22169 43884 43096 -751 2885 19332 18003 41149 46547 24087 26291 967 1452 38923 16037
22156 16037 -12626 -15598 -21781 -34061 -32040 -49156 -20986 2463 11898 16282 19797 23919 6543
22143 6543 9649 -22390 -23562 -6568 7229 -18605 -7761 36029 22126 -5395 13959 14817 -29119
22130 -29119 -85806 -67724 -24401 -41083 -41206 -18047 -32183 -66360 -93951 -63358 -4430 20806
22118 20806 36394 24894 12664 10477 -25700 -28416 3235 10113 -43992 -76537 -33396 13500
22106 13500 -5570 -13211 -4235 -3471 -4481 -26934 -39766 -4653 32897 37158 15651 23787 2626
22093 2626 -27631 -46889 -21200 -6639 -11946 -1319 10428 -25943 -55982 -48964 -41431 -38596 -49323
22080 -49323 -62672 -42839 -78890 -62231 -39165 -41771 -48605 -20945 26406 49485 27776 -4570
22068 -4570 -20121 -35397 1851 17891 9133 18849 1747 -33922 -56424 -75360 -41707 -21090
22056 -21090 -11804 -14828 -13782 -36296 -35794 -23667 4916 12330 7354 -4096 -8909 -12485 -44508
22043 -44508 -44006 -32506 17995 21660 4374 -8610 3999 -33140 -34147 -46883 -51285 -56559 -50175
22030 -50175 -19272 -21515 -11230 26995 47288 18055 -10993 -1267 4563 3609 -5481 1320 -22851
22017 -22851 -24031 12347 4322 5503 -17343 -38513 -37152 -40227 -41642 -46002 2835 42704 49879
22004 49879 27026 51947 74572 45766 48649 19822 299 -5756 -51367 -45381 -9357 -2124
21992 -2124 -6577 45519 44062 40363 27767 19691 23721 46823 38407 17247 7270 -18552 -52978
21979 -52978 -23970 19440 40721 42867 15091 -15647 -7243 8179 742 3062 6056 6694 32762
21966 32762 16553 21693 38526 31673 31079 30718 -13917 239 -7376 -19550 -18080 -22237 -38831
21953 -38831 -42339 -26177 6208 20487 -26415 -16905 -7908 -12125 -20510 7322 22328 32583 27516
21940 27516 14726 -1479 -50957 -35089 -10729 -131 -6174 7404 1609 25109 25163 -12200 16832
21927 16832 -6922 -46065 -30855 -12271 -30578 -48276 -55633 -11373 24200 16395 -1081 -12893
21915 -12893 -2161 29391 26674 21770 -6840 25006 -25 -43648 -53520 -32539 -68419 -58628
21903 -58628 -12034 -706 1361 25105 23659 -7930 11324 -2594 -20769 -9154 7280 -13865
21891 -13865 -26960 -19780 -35042 -34746 -24674 -41792 -38494 -40639 -34510 -40721 -33218 -27925 -38033
21878 -38033 -44613 -27357 -7559 28589 57317 13854 -17997 -4158 21451 48393 12489 -29207
21866 -29207 -33653 -258 19514 21900 26884 24880 30017 23678 12015 22131 20410 46540 15362
21853 15362 -5403 -15193 -8868 19721 21536 27577 -9410 -28679 -1734 22448 42754 49266 40428
21840 40428 59590 81473 58937 28410 -19929 -20514 -7934 3674 -13432 -18914 -23470 -17664 -19935
21827 -19935 -62564 -66019 -33235 7335 21801 6517 19380 34977 11585 14544 3064 -5793
21815 -5793 -12384 -32391 -36181 -40778 -24070 18620 1365 -20721 -21067 -8895 -5888 533 -15032
21802 -15032 -17914 3549 -3029 -43619 -56446 -42191 -44673 -42010 -29112 2459 524 -19632 -10501
21789 -10501 13738 41954 46232 47232 13646 5586 7542 12380 26353 5407 -12933 -34999 -23397
21776 -23397 -13263 3681 18076 27050 20924 10228 30525 24032 -33046 -47045 -28959 -44363
21764 -44363 -32840 -29322 -42649 -7347 -3441 2926 12938 -12513 -19476 -9598 6780 28996 7130
21751 7130 22528 29413 2820 -22395 -37419 -24882 -26491 -37836 -15670 4911 12189 3077 1784
21738 1784 16766 20950 -4296 -2575 14093 47338 41358 48405 41348 3731 -44324 -67078 -69927
21725 -69927 -33799 -1659 -22616 -19558 -21124 -22470 -25246 -49886 -57044 -48261 -55558 -59158 -59873 -79408
21711 -79408 -80930 -67997 -33358 -63155 -54410 -51036 -49697 -76847 -74286 -33451 10615 15950 14815
21698 14815 -5197 -17957 -2066 19125 27641 32330 7177 8992 9405 27796 55006 77302 57284
21685 57284 35637 28267 34462 16948 -16496 -5884 17173 -34010 -65563 -45063 -13504 29004
21673 29004 33246 -14739 -34847 -19083 -23963 12421 28650 -5750 3474 -14675 -38720 -20820
21661 -20820 -23108 -22827 -36836 -35339 10440 31026 19279 2705 7648 -1310 15230 4049 -654
21648 -654 -37426 -45552 -5525 5697 -1499 18128 38003 59137 85685 74402 62438 24217
21636 24217 -10737 -29636 -44894 -67964 -31809 -32241 -42998 -61202 -37706 -27018 -15991 -1707
21624 -1707 -47619 -36368 -5322 922 18547 38531 37946 6693 -9564 16281 30882 35123 48763
21611 48763 41366 23035 40631 21949 14110 24066 7884 -34406 -80284 -80783 -48348 10211 13823
21598 13823 19600 -10018 -29677 -278 7814 6423 4926 7834 12384 -7928 -21265 16317 36358
21585 36358 41917 36769 18115 21705 8367 -38204 -29124 -34684 -33367 -10665 -26621 -58347 -45006
21572 -45006 -35684 -9806 -6040 -17541 -6658 10671 40539 69729 72604 57012 37888 49765
21560 49765 43975 43184 69547 61520 57044 67545 97894 102056 60417 50099 68708 74058 81908
21547 81908 78776 56109 34194 8862 -1253 26996 36145 40984 29044 14396 14739 31338 14306
21534 14306 25585 26739 2428 -21557 -21295 -23376 -33050 -35277 -49500 -70226 -71343 -35762 15876
21521 15876 19448 33490 48798 66515 53673 26564 14265 37799 40715 33472 -14536 -23095
21509 -23095 -6087 9150 -3098 17560 35760 19389 7645 14576 51275 74020 76282 84271
21497 84271 46833 5863 -930 43566 78180 55534 41173 35648 1137 8350 49346 62681
21485 62681 36197 60672 47346 10825 -2185 30206 31911 24974 33966 5422 26713 50997
21473 50997 38676 14977 19524 -7250 -1918 1822 -41963 -56046 -87465 -108925 -71423 -13538
21461 -13538 10420 -29633 -51118 -77444 -64932 3994 43862 12181 -4983 -3650 6249 23561
21449 23561 26087 49352 48312 38159 11809 15148 -9855 -3217 24686 38113 12751 9485 -13636
21436 -13636 -7496 -18523 6948 44018 67991 73789 83146 69866 50242 66405 32733 -10205
21424 -10205 -12150 -12197 -15033 -23057 -14298 819 -2336 -20739 -35837 -32948 -18406 -61358 -86222
21411 -86222 -71031 -58867 -32479 11229 24249 -18241 -42690 -40286 -33763 -9721 739 20671
21399 20671 48023 58762 49435 73000 62041 44589 53264 5818 -2272 21011 31755 19234
21387 19234 20304 21653 -13869 -37379 -37246 -19712 -2574 27176 47501 47665 3156 -7419 -14307
21374 -14307 -30072 -13595 6062 4453 16328 19230 -11087 -18235 -21461 -42815 -63020 -87263
21362 -87263 -52093 -18015 -11820 -1681 -8328 -10973 -10110 -6371 -13675 -27634 -25898 -10014 -134
21349 -134 -21288 -44424 -21534 19833 27363 38840 37703 34695 9453 -7754 -23453 -21694 -30771
21336 -30771 -3525 47813 74788 50651 63330 49026 5149 32621 58121 48489 26699 34692
21324 34692 18750 -21369 -28624 -4458 -1262 -3220 -18068 -42855 -26043 -8088 -18703 4297
21312 4297 -10835 6208 18490 15724 17029 13677 13616 33121 10564 -18591 -19221 -24380 -30260 -4909
21298 -4909 22665 34601 21178 22685 28308 -7510 151 15100 18458 13051 13947 23317 34925
21285 34925 60440 70822 51309 16400 8840 10370 14724 24289 45410 38852 11681 -8144 23948
21272 23948 53560 9142 -3653 -22367 -37684 -4662 33684 13177 -2197 -7382 -3865 -3917 16004
21259 16004 33742 39444 41651 -735 7417 39113 40895 26929 29808 36777 28870 22363 17806
21246 17806 4751 14477 25230 36757 28351 7111 -18590 -27097 -75340 -77906 -70022 -74784 -46783
21233 -46783 -45101 -40836 -31365 -12099 30060 43521 26686 10800 -17147 -49424 -42984 -26544
21221 -26544 -21882 -21183 -28463 -37013 -13913 -11516 -21199 -42425 -28332 24523 28942 25352 25105 19357
21207 19357 8758 19426 36455 22870 17337 35225 27431 9621 3697 -28051 -41194 -23109
21195 -23109 7904 27810 106 -23619 -4636 -31435 -34373 -22799 -39480 -28126 -26491 -15216
21183 -15216 -2468 25101 30858 -1418 4225 -25625 -18337 3500 -3078 -26002 -11259 14636
21171 14636 -13740 -16736 14162 -17697 -52750 -19739 8408 29456 3351 -6278 3433 4093 -6062
21158 -6062 -3461 12798 22422 -12049 -3354 -15389 -8861 31192 29107 14931 -4824 16162 22005
21145 22005 31264 -10934 -18988 3518 23532 -16977 -54399 -53538 -48159 -58345 -56529 -59655 -67603
21132 -67603 -47987 -6174 10344 37012 49760 31603 28613 14825 7756 10607 9634 35222 3300
21119 3300 -19925 13774 28861 24119 10865 -17422 -12625 7931 28443 34654 41032 82813 98480
21106 98480 63558 20731 38238 68160 50267 -3423 -2470 54746 63453 43797 40494 13278
21094 13278 -40471 -65855 -56685 -49580 -29332 -29526 -31087 -17765 -21645 -10315 18224 52072 74010
21081 74010 66229 38635 17615 23820 43204 14023 -8253 -8012 -42899 -31854 3264 7962 23652
21068 23652 44153 43336 36788 20033 14627 23599 26487 4905 -13975 -19029 -11314 -4713 -8945 -32617
21054 -32617 -44310 -62178 -53900 2020 23426 6659 -6911 -37833 -25808 -40020 -37142 -5046
21042 -5046 4503 -15360 15800 26050 35028 26764 6376 10152 30825 778 -10535 5982 104
21029 104 -15922 3731 -37759 -68485 -26305 24808 11805 12210 33528 18266 -31993 -51523
21017 -51523 -41826 -36145 -21145 -11616 -6795 -7959 5546 8586 -27225 -31914 -28559 -27223 -34430 -5245
21003 -5245 30362 25799 14913 9845 39167 41140 12894 7170 16943 16172 -411 -28643 -27455
20990 -27455 2570 20160 13031 13125 42737 59020 38098 36795 33166 -13192 -28694 -601 -16941
20977 -16941 -34748 -16290 7312 17466 -12348 -1507 3147 9330 26624 -9555 -35364 -42034
20965 -42034 -29620 2838 14104 -5546 -10408 -8577 -34287 -57303 -12527 17337 6518 -20589
20953 -20589 -21727 -17925 -16959 -13224 13235 30111 11879 -5989 -6044 -23367 -17820 -1757 33427
20940 33427 54732 43042 15624 14648 -6761 -19386 7218 20026 8473 38237 34794 26001
20928 26001 5727 15471 -11464 -21344 -11588 -18129 -27937 -6779 4526 5779 6129 -18351 -24628
20915 -24628 -18806 -26099 -789 8202 7746 -13358 -26257 -31289 -18676 -13880 -9300 -25252 -24660 -27374
20901 -27374 -27027 -25258 -2134 -13815 -23787 402 6857 1193 -15202 -31967 -62203 -62490 -10632
20888 -10632 4712 -15572 -35432 -52987 -49501 -66292 -40306 21071 23258 -12755 -35539 -44889
20876 -44889 -37516 -4037 -8935 -18397 -13291 3768 24801 30840 35490 22781 -5815 140 23375
20863 23375 45738 32679 8320 4203 17985 29653 -4540 -1079 -5537 -6616 -17713 -46581
20851 -46581 -23568 15579 21567 -25991 -27094 -36822 -41256 -33669 -19556 -3346 18222 25017 39450
20838 39450 29911 15517 -2794 -55651 -43799 -9208 15443 8609 30408 68180 47272 -12604
20826 -12604 -6972 29682 58826 29735 -4614 -13527 8993 28246 19669 -14156 9188 3093
20814 3093 11535 -7557 -23501 -8327 8084 7839 -3354 2433 -18509 -43470 -28933 14890 18848
20801 18848 15740 -10149 -45663 -70063 -90993 -71380 -24119 -12284 -32579 -41227 -62426 -60864
20789 -60864 -24695 -9600 -4479 -14309 -21371 -33663 -21260 -7887 -23520 -468 30214 50238
20777 50238 13829 17998 20471 3864 -30032 -50118 -56144 -27847 -10476 8662 25754 24277
20765 24277 15527 7834 16862 33171 31418 6166 3123 8117 7189 4424 9439 8691 10530 8486
20751 8486 5166 17315 27257 16792 -6691 784 -21212 -50167 -47277 -33400 -13465 2268 25376
20738 25376 3995 -25715 -36717 -39412 -11003 28152 75615 81794 61474 44192 19771 21865
20726 21865 29028 25092 8235 14325 -24365 -11873 57408 106130 86549 68666 19413 -2189
20714 -2189 -10420 13049 41893 32357 21175 21930 24961 -11833 -14514 14770 51727 21107 -23636
20701 -23636 -33831 -31981 -37756 -38934 -16030 18652 50039 66067 49417 23845 29326 32397 7827
20688 7827 -12799 -183 2105 10164 -136 16391 -6685 -22670 -28778 -18089 -6055 -24476
20676 -24476 -51687 -43672 -54364 -45369 -21196 -8436 6369 -1226 -7707 -13119 -7874 -19470 -62471
20663 -62471 -34801 24096 34889 24175 27078 -12711 -61430 -29984 -25092 -44687 -47741 -17497
20651 -17497 -14189 -38916 -24528 -12277 -444 -2250 10482 -4042 27279 74473 77226 50869
20639 50869 9396 -28417 -48250 -52285 -33026 4235 8024 -3903 13558 -3132 6753 51207
20627 51207 16663 6516 -8246 -3383 6603 -22804 -28618 -50724 -39715 -51868 -57953 -45445
20615 -45445 -42738 -28431 -16588 -24670 -8308 19901 -10194 -35388 -45127 3057 29352 -1206
20603 -1206 -5711 -31603 -37922 -28195 -33714 -28078 -18324 7981 22894 -8810 -42728 -61706 -61594
20590 -61594 -40746 3039 8850 -10399 -15658 -7890 -22492 -7863 -18432 -15255 4780 22023
20578 22023 28158 12851 -18120 -12377 -2846 -23891 -17417 -11259 4888 63429 75179 36080 -10318
20565 -10318 -46681 -26565 23073 46066 35869 61697 32935 12200 16523 -11675 -9713 -42748
20553 -42748 -22036 17599 47279 13798 3380 -6336 -240 2524 -19330 -26329 -6836 8138
20541 8138 19493 39767 9691 -18320 -21892 -23668 -73457 -53344 -35835 -44822 -48049 -23353 -5756
20528 -5756 -14306 -7763 2861 20559 33214 49915 12059 -36086 -73493 -61877 -50495 -44968
20516 -44968 -41674 -24973 -1280 13103 26910 12814 19166 22335 1015 -10144 8799 69299
20504 69299 68140 -6432 -28807 -25239 -7560 -3815 -8075 -7663 -28165 -19164 -38017 -52119 -35777
20491 -35777 -31498 -40842 -38026 -2897 -15904 767 19078 -19010 -32681 -6065 11177 27769
20479 27769 -12224 -4245 -9110 -58628 -91639 -20215 15894 8703 16012 35216 20202 21597 15075
20466 15075 4166 -7788 -21531 -6572 20924 -10035 -43616 -40596 -30522 -13109 -14397 -7731
20454 -7731 1276 -325 -11438 8402 11322 -4146 13347 8119 -37072 -26914 -7708 -8810 -37989
20441 -37989 -11875 33722 31427 63386 46898 24619 27255 8203 -36943 -67215 -17784 16896
20429 16896 14615 12204 -7938 -10398 12308 -6237 -14166 -14303 -17246 -17847 -44196 -63956 -53284
20416 -53284 -2249 -6022 -17408 275 11465 25777 1185 -41048 -39920 -29514 -21441 -13999
20404 -13999 -19524 -22016 -3665 -1565 -24239 -3246 27029 37346 18175 19976 6658 20960
20392 20960 3497 2285 7760 -9353 -24891 -36210 -16926 32143 3377 -16434 -6845 4609
20380 4609 -6739 -25458 -40407 -15066 -10147 20537 64552 46027 36386 53701 31765 17638
20368 17638 -5272 -24484 -22530 -19547 -739 9301 -799 32923 33954 15413 -23302 -35022
20356 -35022 -894 9071 -7470 -8186 -2052 18193 24063 -1067 -23292 -50102 -28569 -11074 -12866
20343 -12866 20730 11174 -7036 -30422 -35139 -36286 -54394 -28196 6463 44122 35379 22309
20331 22309 -7119 -40681 -52764 -57791 -29614 2475 -11681 -19339 -30513 -37595 -35601 -57913
20319 -57913 -65740 -36276 -18265 8360 19522 16352 10047 -1969 29682 29058 6750 5236 15182
20306 15182 31036 26566 19612 44312 59930 52214 46623 24181 -2998 -19735 -36965 -62123
20294 -62123 -35227 -32539 -66660 -93103 -78801 -67720 -90152 -92406 -45882 -3332 -8984 2484
20282 2484 -19329 -18364 -26493 -44562 -32198 -37715 -62629 -53834 19251 34458 16239 26457 13366
20269 13366 16726 -8965 -34241 -21575 4455 48354 68365 34206 5972 6751 41667 13512
20257 13512 -4364 -14273 27255 36285 -1319 -32681 -42007 -36051 -42340 -11230 -15585 -44725 -61009
20244 -61009 -61093 -55271 -41522 -6015 -12245 -4876 -12713 -49355 -48322 -31652 -6635 23212 11285
20231 11285 7250 -46256 -81524 -81610 -68653 -39722 -37915 -29390 24281 54076 29811 -1677 6508
20218 6508 12277 -18860 -16322 -17670 -5127 5652 4835 15597 10238 18518 30394 59847 88937
20205 88937 106954 91613 79857 80620 26674 3750 24324 39151 42792 31481 36756 40202 48737
20192 48737 41848 7185 15838 26799 12469 -502 27542 12429 -16036 -34475 -35885 -29361
20180 -29361 -16534 -23055 -1037 11927 -1390 -1917 16936 4021 5971 6109 7419 9836 2598
20167 2598 -4211 3367 -6289 -12351 -12095 -18255 -27558 -25706 -5499 10732 25241 13341 -7836 -27087
20153 -27087 -17281 858 -13962 -19968 -24407 12123 29486 -14426 -22431 4612 33036 33474 40841
20140 40841 28537 15862 26394 10071 -28775 -50740 -21528 -16725 -23863 -23824 -83 37254 41926
20127 41926 47337 69441 67580 38267 -13231 -41383 -33567 -10533 -1318 -21340 -19728 -25219 -2042
20114 -2042 20433 2489 -21564 -42292 -19596 -27426 -67814 -92748 -29991 -26387 -22235 9136
20102 9136 12651 4179 -9122 -6114 -12142 -15928 -33120 9633 59258 31910 -15137 -29619 -12467
20089 -12467 -15929 30466 27286 -6631 -15606 -3743 26521 11984 -16811 -11107 -2561 -13102 -29980
20076 -29980 -47803 -67411 -76930 -55778 -42300 -31810 -26211 -23553 -2947 26693 30338 11706
20064 11706 26575 41933 7119 8987 6586 -25899 -13191 22387 54698 48034 22887 2749
20052 2749 -29184 -169 11743 15772 24424 39504 36201 35891 19361 -11848 -14894 -1550 30354
20039 30354 27657 30777 34738 24910 8962 6296 -518 413 -15677 16771 73177 73431 33140 -11760
20025 -11760 -37239 -34389 8712 7414 -29250 -29690 -19228 -28652 -48692 -61518 -46839 -1418 15133
20012 15133 9304 1575 13821 13284 26985 -4335 1552 1439 -7899 -16305 -6814 4669 25520 37237
19998 37237 15969 2485 5098 20859 22297 18772 29945 -5192 -19828 -42272 -10794 32862
19986 32862 38766 52033 47947 53902 30236 25385 25684 8708 15809 24109 19652 11979 21749 20043
19972 20043 -5028 -19749 -29142 -6034 21641 -667 -37941 -24882 -4841 2198 -8744 -14044
19960 -14044 -48389 -63689 -53602 -32524 -38124 -11500 574 8814 42326 66116 59658 53019
19948 53019 67170 30314 18112 3815 28600 51645 68350 46803 8842 -21024 -19130 -626
19936 -626 1266 12181 21960 31698 14130 -2789 -888 4939 -19247 -33418 -37420 -4270 29506
19923 29506 45540 53138 72684 21377 11452 -7249 -9060 -30023 -41068 -34717 -31766 -2697 24135
19910 24135 -7385 -23979 -23443 -18889 -29612 -61293 -42898 -32136 -31180 -53766 -54191 -34747 32131
19897 32131 50111 10424 49576 82416 61691 22959 6346 8482 8557 16698 13830 58570 59905
19884 59905 40210 34775 19261 -8969 -33752 -27561 -18901 -31414 -16724 11427 32247 25246
19872 25246 7572 -16081 -19689 -24713 -62090 -33351 -12625 -13647 -26344 -34664 -31147 -18617 907
19859 907 13228 30257 -497 27128 63345 51569 47620 28878 37055 25773 1164 9496 8520
19846 8520 -5694 -27753 -25561 -17921 -3428 6151 23809 44140 23981 -10976 -39953 -32393 -21317
19833 -21317 468 25052 41939 28942 5779 -8197 24847 27472 -4617 21036 27685 22292
19821 22292 35125 7068 -6379 -6529 -27275 -32364 -19782 10362 49184 19405 -7717 1818
19809 1818 -22501 -27773 -64435 -71649 -37558 -14669 -1104 5367 25840 18637 -4012 -41221 -50487
19796 -50487 -34394 -47354 -12345 54699 43621 35015 55635 42647 56062 60681 58167 33104
19784 33104 24065 -2336 -3203 14441 34171 38136 27656 11505 12697 31127 23743 -1356 -12221
19771 -12221 -24343 -52807 -13642 -13395 -12740 -15505 19647 52127 26604 19963 -32058 -35074 -14083
19758 -14083 -1869 7399 -27769 -9900 -8380 -26434 -16876 -15494 26195 35177 14152 25859 48268
19745 48268 25004 -4335 -25492 -41241 5321 36870 24246 -2292 15583 19542 -13149 -8169
19733 -8169 -10816 -458 16134 6878 420 -351 11292 6091 -8361 -8662 -6023 -37526 -17201 18406
19719 18406 9504 -5074 -6524 -10050 16829 13364 1543 33805 4744 -37336 3 49517
19707 49517 20309 13410 40677 69650 70118 26119 18835 28142 23668 -547 7624 25158 5291
19694 5291 -5290 25646 49639 60966 56218 76940 83472 51109 48620 64447 49298 17017
19682 17017 4583 -18228 -36856 -1881 27969 34942 23027 18621 11319 14137 25036 29513 28818
19669 28818 32996 12181 8862 -17830 -35414 -24893 651 11376 2172 9606 26604 23959 6021
19656 6021 7884 18318 -7457 -11623 -14462 3403 -278 14733 23003 34372 47712 48431 74631
19643 74631 54509 22965 -9245 -41696 -5936 31298 55465 74440 67230 18712 13045 10787
19631 10787 25227 21972 -7102 -356 28728 62593 54460 95893 122795 138774 139675 159116 203542
19618 203542 255061 268856 263760 250729 256933 246279 248172 249163 249343 282773 309504 275177 229332
19605 229332 186225 141631 118355 128796 124729 143677 123148 61120 32301 59069 57893 62676
19593 62676 88093 66532 60747 56256 34472 20771 7547 17088 45106 29951 43688 52759
19581 52759 53088 37017 20967 24514 35253 27266 21268 9704 -17523 -11331 10077 11279 -3431
19568 -3431 18988 14979 12761 40732 40158 24235 61417 87481 86953 103625 89601 58223 27446
19555 27446 4343 -121 -580 11619 12275 54355 94919 80638 24475 44440 102515 114468 66078
19542 66078 40820 -5428 -46175 -19781 -28092 -21833 -24360 -12527 2873 -45225 -39127 -1215
19530 -1215 -2061 32919 39872 10889 11832 22585 40342 58328 17274 25616 21546 28154 31543 16773
19516 16773 3059 -4809 26487 37447 4599 -25784 -14273 1629 63534 67965 24834 16997
19504 16997 9316 19341 4830 35917 36841 10065 -10501 12899 10151 -3973 3659 8922 13825
19491 13825 -23164 -39524 -37570 -43997 -29746 -2686 32623 60346 68771 24933 -20480 -2472
19479 -2472 -9293 -1435 44295 49888 24923 2358 -14504 -18654 11728 15522 -4129 -16481 -15537
19466 -15537 -19525 -42757 -19555 -4601 -46436 -47836 -21183 -15371 -2551 5757 20845 23555 28099
19453 28099 9249 2600 -8131 -12449 9265 19633 20851 19969 -3375 -38605 -17608 -1309 3848
19440 3848 -16784 19932 5307 -30513 -11103 24237 51716 62507 62864 53051 36529 -11414
19428 -11414 -18304 1396 17256 45237 18115 16694 10394 -24615 -21992 -22782 -28096 -31263 -41828
19415 -41828 -51208 -22848 8692 3105 -9120 15747 -3820 -10634 19354 30651 36031 -1187
19403 -1187 -4485 29544 50654 48315 52973 76802 52563 28818 29617 30154 23606 52576 76404
19390 76404 68926 51162 32598 27552 16514 26392 55780 65825 21316 -5479 -8812 21883
19378 21883 72519 50977 54150 60690 46894 28967 8219 37159 68108 76700 79665 60933
19366 60933 46820 37875 68953 85446 81748 61871 74893 68068 30308 30540 40213 46459 75880
19353 75880 65475 41866 83201 64314 31373 32002 22185 -21935 -36173 6456 8932 42923
19341 42923 34989 25678 73486 87397 46276 40089 16201 43401 20463 16243 32537 37452 47242
19328 47242 45311 3647 3146 45615 57105 35011 38698 31638 10557 5296 16458 8792 -7852
19315 -7852 12510 18765 -7991 -17584 7834 35556 67545 84767 104979 70463 56898 26266
19303 26266 -1485 4546 30716 33146 38819 56193 72275 87568 101603 85614 84207 94911
19291 94911 104874 131828 136748 165755 173180 189669 223668 282660 297181 315809 325525 344051
19279 344051 292224 302538 339206 347592 318155 291945 264806 260889 263118 241108 188926 146479
19267 146479 123377 110338 147465 159388 153403 154234 126544 133298 140970 107643 60196 65496 91872
19254 91872 127386 160636 153036 137439 118347 92739 79393 44316 16362 13033 32533 55716
19242 55716 72693 101059 110398 130356 122744 111539 91723 97360 91491 78348 117035 107959 67042
19229 67042 61451 89872 60041 23492 9774 21954 42645 41696 29042 40168 52552 29536
19217 29536 39495 8760 19570 57544 60804 44320 29927 45037 63690 81154 61441 41520
19205 41520 36589 53677 81985 29013 14931 50799 39130 83629 124613 133608 124790 98014
19193 98014 84483 94734 142763 131830 93291 78191 88804 62753 77186 122676 108482 111163
19181 111163 100169 79286 78519 96539 111668 102695 89626 77621 75112 99892 106228 119246
19169 119246 124455 125270 139279 144325 122882 108360 112739 145828 154098 137995 105659 79471 45598
19156 45598 46201 37540 61790 65682 90979 104137 106362 112376 101557 68625 77180 98745 130954
19143 130954 133189 136759 176853 163292 139299 126246 98038 101320 142653 168594 182208 172503
19131 172503 144989 119809 139237 192997 202464 148514 143612 181221 181120 138707 111216 104343
19119 104343 100008 66104 52705 62818 64127 83584 102662 112550 86670 46497 85735 116604
19107 116604 135996 158924 152383 127779 126765 136226 147643 149529 121066 128495 162076 166553 157201
19094 157201 141496 111846 114739 133106 144014 171786 180252 218010 204834 235930 283107 310578
19082 310578 310421 306094 315366 307137 294649 318557 353152 355591 338171 350242 358195 345808 360145
19069 360145 392537 403078 395789 406668 391449 381859 372068 405204 394050 366236 409766 421317
19057 421317 448765 478969 497638 505197 479975 495632 538871 565328 593363 623912 653105 669997
19045 669997 710489 735610 775942 774992 815498 857619 922549 997644 1104101 1221913 1316104
19034 1316104 1483437 1646573 1785278 1914877 2006677 2072959 2165525 2277166 2439624 2679646
19024 2679646 2898293 3148177 3398865 3639890 3913931 4311465 4910382 5704466 6729674
19015 6729674 8262632 10491456 13880088 19102706 26747225 36623062 47293449 55855397
19007 55855397 59137459 58352126 53693821 48067171 45597634 47460667 52964875 59737081
18999 59737081 63566838 62118871 56493526 46329238 35511735 26707911 20249042 15882154
18991 15882154 12907121 10820060 9254250 8071324 7195924 6541867 6060886 5659877 5320800
18982 5320800 4999744 4686557 4400367 4124091 3836630 3628818 3491563 3380734 3274333
18973 3274333 3208198 3122569 2957838 2721248 2525600 2369344 2195007 2017694 1883420 1792390
18963 1792390 1709041 1600757 1526931 1466197 1440044 1405777 1331042 1321139 1247391 1165882 1107349
18952 1107349 1073654 1010301 971541 933824 908472 919100 912586 861373 822779 809330 785277
18941 785277 813078 793736 755596 726717 664977 612674 612733 622331 639964 645547 612953 579397
18929 579397 549850 555687 512365 490197 528047 565198 524141 484189 435729 437930 408361 408108
18917 408108 409635 422228 443365 429702 392630 389542 379465 327447 327215 328600 320448 326773 319808
18904 319808 325814 350054 340892 329503 342493 319374 311069 281374 287776 303279 316729 306742
18892 306742 274363 235850 258659 282267 280294 282732 273367 252835 243207 274146 253077 200550
18880 200550 176575 208176 255021 286660 273386 259333 280960 275268 279808 312273 284479 243439
18868 243439 229694 195389 181970 194601 194314 196851 186036 183827 195698 189929 185049 153043 147599
18855 147599 152582 137684 90803 93088 110939 127034 140137 108790 93026 90808 101132 126946
18843 126946 121316 131844 129743 133977 126822 119248 102556 90636 118501 84445 63520 61396 87920
18830 87920 120779 120961 80001 69618 91189 93947 69543 79861 41268 2891 607 7763 1130
18817 1130 7081 -22745 -40713 -26215 -6038 -10999 -681 -9159 11401 59411 84890 127430
18805 127430 115634 98681 73128 114141 144034 166234 139647 101710 87325 80524 109961 125471
18793 125471 115640 106268 94928 108231 106319 91148 75651 59695 65350 75559 83645 89665 105900
18780 105900 130328 133536 97924 91715 118400 163503 192576 196957 156493 156458 235052 323158 428155
18767 428155 406069 285301 194748 148332 173239 178248 146896 88979 98490 148935 182682 164691
18755 164691 179514 179296 150107 127751 165323 187698 175519 197837 233436 252346 209026 157625
18743 157625 141779 179582 161409 138978 190508 211624 192988 198164 196533 163028 164765 178607
18731 178607 171100 152214 129819 112214 114245 105017 82986 110793 141671 165018 146450 140652
18719 140652 195018 231414 248592 218761 206380 160340 140051 121981 141862 182186 187606 207827
18707 207827 222995 248737 255376 255500 251001 252027 263891 281265 301040 322535 363994 387255
18695 387255 370675 341091 339754 349914 335058 352738 363887 339399 349556 347963 356790 382690
18683 382690 401916 410634 439252 463054 451092 444440 443086 466525 483430 479399 478630 484168 508499
18670 508499 530207 550819 555401 581074 614481 666513 697917 727650 770211 821908 898120 955169
18658 955169 1021324 1092961 1181215 1240601 1271088 1305789 1343532 1377508 1440340 1560033 1651504
18647 1651504 1715297 1791277 1876355 1958734 1997360 2048301 2125552 2279656 2458557 2652506 2883871
18636 2883871 3152656 3478369 3852157 4247208 4731268 5404264 6233820 7278433 8656224
18627 8656224 10468847 12989141 16492651 21198062 27172905 34084401 41053304 46792503
18619 46792503 50227916 51463918 50840677 49033861 47656864 47661194 49022395 50924159 51838278
18610 51838278 50775740 47711126 42510281 35897283 29400697 23744541 19214036 15756825
18602 15756825 13177956 11250479 9776917 8603439 7685676 6939846 6273358 5721523 5259578
18593 5259578 4889230 4534712 4221404 3980400 3739019 3543275 3385301 3286364 3182142 3127800
18583 3127800 3016653 2860397 2744888 2626517 2486580 2361756 2252819 2165919 2093430 2007287
18573 2007287 1942577 1856957 1753659 1647190 1559046 1453429 1381372 1323535 1272834 1230774 1193598
18562 1193598 1123733 1024737 951424 925769 946364 932682 893675 881469 873904 856808 837997
18551 837997 797689 739055 721139 755190 752584 708768 676075 658464 621118 593963 588226 580545
18539 580545 549534 486692 448474 439298 444238 463066 478485 459938 427794 400001 377949 396975
18527 396975 424630 410743 406575 396285 378267 401829 368463 345311 352804 331537 326776 316875
18515 316875 282911 274412 267833 237921 258276 281415 294570 276605 244801 260852 276402 285007
18503 285007 288476 254914 246934 275072 299476 292478 275153 223876 186041 188055 189183 186058 175461
18490 175461 168097 164135 192350 221894 212567 210086 221866 221761 205455 178306 172308 111128 45341
18477 45341 66180 97868 110167 116137 135674 108909 118434 138211 112563 101648 135186 137702
18465 137702 107237 78452 88212 104439 72561 80494 132821 139631 83876 32562 46955 43985
18453 43985 57449 74994 94300 63868 46455 49906 21806 29036 80110 91863 51414 39537
18441 39537 69021 61352 55451 61097 54891 33882 2170 -11813 -10843 -30952 -19408 -11907 -23327
18428 -23327 -11862 -23238 -37609 -17867 12678 36713 35833 14506 -18056 -10268 1895 28179
18416 28179 24417 38322 25827 10645 28084 28171 28727 65579 83369 73817 50887 31368 26505
18403 26505 30803 46140 52306 42234 64893 66761 65305 96963 130775 160416 204653 238209
18391 238209 292208 326405 290285 281786 239959 231524 260253 258139 252456 261648 265170 295389 265808
18378 265808 194344 156268 135602 69246 38266 37080 25879 4723 18416 52897 40360 31765
18366 31765 18413 37253 54468 57976 69921 57412 29118 16098 12485 19395 17334 39321
18354 39321 49527 60349 55819 9632 4409 -3184 4932 7703 -1094 19772 20604 -2847 -1881 -19476
18340 -19476 -19161 -39672 -14548 2029 8358 10116 6582 1323 -7060 -926 19988 -9648 -55697
18327 -55697 -67691 -8200 -6734 78 35509 37569 36748 44038 39509 19223 4437 13050 17904
18314 17904 9685 -15708 5167 14650 -780 -12354 -22527 -19623 -17645 -12513 11561 55223 60826
18301 60826 64191 32174 1478 528 -6493 -19538 -29196 -32811 -6821 28639 48529 37581 46726
18288 46726 50658 30415 10051 27356 30981 24053 -3698 -38342 13800 32624 37936 14976
18276 14976 5427 30841 33484 52625 48102 9902 -3097 -4603 -23270 -16053 -20628 4484 38886
18263 38886 36494 16981 45638 79071 89295 75235 59644 20559 10500 12795 31973 4815
18251 4815 -33931 -58606 -39604 22298 22262 10012 14932 27481 61520 71767 25424 30585 58401
18238 58401 70511 72140 71113 57767 49802 14611 -24558 -9012 5881 4576 -15388 -21967 -20479
18225 -20479 -5489 13321 41801 62576 40763 38479 36381 40531 29691 24074 30082 59545 27995
18212 27995 11301 -8821 -15122 -9925 19669 41391 66474 84932 55636 45735 43456 43696 48172
18199 48172 29048 7667 -1021 28372 51482 47566 30430 34344 6242 12507 10412 5903 5148
18186 5148 -13251 18490 72946 85025 52150 43230 54617 43416 24156 33261 62982 58967
18174 58967 42952 60651 46831 85019 101217 140329 119028 99692 58169 42048 103773 172616
18162 172616 152474 134630 130428 126790 119734 128158 148573 133710 140682 134899 143086 125263 109315
18149 109315 135380 187147 226025 234085 252637 290246 273720 254925 270030 292441 329610 363140
18137 363140 358251 349337 361909 406281 438855 504822 566076 621182 695786 747296 769616 846723
18125 846723 939998 1039248 1153645 1340759 1617309 1902071 2253450 2719236 3329030 4227339
18115 4227339 5632423 8029658 12378778 20351655 33295604 48357375 52629650 37779708
18107 37779708 22859217 14670372 10222385 7664995 6111670 5099220 4293481 3610302
18099 3610302 3088663 2709672 2429068 2189365 1962605 1772584 1608179 1466077 1346082
18090 1346082 1248366 1146224 1089313 1033781 984445 954855 913738 855856 820851 763383 710852
18079 710852 650783 618459 595698 593215 579653 565620 543200 503752 471301 482209 446722 405741
18067 405741 339470 328160 327894 306472 286538 266358 259337 255173 238518 240970 234752 234970 230744
18054 230744 231960 265481 283499 274806 249399 234732 265999 239630 239776 228366 248002 222262
18042 222262 208892 199016 218835 217808 195248 181884 178472 152384 117913 81840 103926 127926
18030 127926 97789 97910 110364 99216 121351 145482 91607 55470 31462 28649 40525 62540
18018 62540 70452 98348 93901 70910 68862 69546 21063 24476 13401 22445 24651 46903 53448
18005 53448 54095 58055 71110 41569 54885 77417 91085 72022 34281 -5187 -15653 -6590
17993 -6590 14596 1956 6195 1621 -9553 -17038 -23657 -3863 38038 75112 79690 63993 50301
17980 50301 44294 36315 36151 37131 52629 38709 77280 82271 72405 39646 47867 51414 79157 100508
17966 100508 72888 71337 62331 19675 49328 54353 59219 67862 83573 94267 79887 107808
17954 107808 149963 184099 179554 183696 183685 189981 213513 257648 251953 229373 206306 228122 245853
17941 245853 263905 262653 216270 176945 149051 126991 115062 74146 48954 50111 45190 28465
17929 28465 46298 1680 -56437 -79372 -58515 -39054 -40052 -65651 -106662 -66932 -21888 -3134
17917 -3134 16857 -5759 -26475 -6882 -5853 9201 20932 50494 25784 -3663 -5833 9789
17905 9789 -11545 -32425 -9913 -12746 -26323 7059 15906 -8896 -18931 -3279 5584 19212
17893 19212 -10616 -10341 -2198 4322 8413 28899 35327 27480 7030 -3581 -31479 -23417 -10568
17880 -10568 -25827 -47173 -41769 -29234 -35285 -21573 -32295 -40273 -64135 -69101 -46148 -67026
17868 -67026 -53667 -58355 -50245 -40847 -22955 -14037 -11797 8999 9567 -11116 -40371 -50486 -38655
17855 -38655 -34760 -12494 -3149 13094 18166 -16586 -35943 -27595 -17790 -21145 -36207 -42559 -40928
17842 -40928 -39884 -36575 19674 14448 -11567 -24093 -19717 -44562 -64540 -51353 -37220 -32461 -53231
17829 -53231 -40371 -3892 23089 43369 18269 10938 -9982 -12748 10110 46613 69995 47843
17817 47843 28266 19128 8175 -8247 -31347 -34313 -29477 -60286 -57033 -8692 20192 35395
17805 35395 22743 38173 33648 26919 30353 2446 2109 8318 14559 -17113 -13700 -40635 -29354
17792 -29354 -7667 -11981 -28344 -13622 22372 55233 31601 8462 21357 1689 16582 42467
17780 42467 28022 30227 33020 50262 125677 180114 173507 143576 81541 27764 45504 41737
17768 41737 51590 59102 43094 13820 -8013 -14382 20822 48598 57341 72312 101406 137879
17756 137879 126410 105850 78208 42890 24387 15955 38835 46722 51848 67007 19835 565
17744 565 28058 11648 -4212 5369 -35137 -32989 8972 29183 32229 42717 8321 7514 16306
17731 16306 37672 48306 21400 -4553 -3829 25897 -4325 21962 23398 5888 -11603 -24358
17719 -24358 6918 45248 86539 73220 90258 116644 181966 268927 302247 268727 202183 153863
17707 153863 144269 135123 118601 92838 64449 67070 63694 56640 50232 83910 61905 20343 48611
17694 48611 77484 73063 60907 67799 68612 20794 6179 31171 29998 45096 54221 28815 43625
17681 43625 60693 51805 56852 41639 25007 39808 49075 27436 5988 40260 29081 23666
17669 23666 67385 106978 107781 84029 83935 76930 87693 104932 109681 43714 17079 24478 53439
17656 53439 66784 49125 42657 29560 -7289 20688 89562 127013 98257 87347 85708 67248
17644 67248 51495 35696 30096 30637 37114 10767 7335 -16086 -20379 -12010 -26274 -32986 -34108
17631 -34108 -31881 -7939 2502 -27074 -77993 -79720 -70142 -21530 48579 60336 29540 -544
17619 -544 -8287 5200 -12376 -36710 -33586 -56650 -75130 -56075 -21535 -14218 -23808 -17190 4558
17606 4558 22840 34914 26025 15838 36779 41565 4146 -8593 -13104 -18548 -29332 -11447 1297
17593 1297 -6153 -7109 14447 23629 19492 29287 61663 43872 16002 -28241 -75598 -39463 -3850
17580 -3850 -41806 -43077 -24456 -33842 -17800 -25783 -37817 -32098 -17089 -16977 -11744 -7988 -15493 2096
17566 2096 14662 3927 9183 15384 26091 57866 47166 33841 60136 42563 71167 64986
17554 64986 13051 -41480 -41321 -23776 -9923 -531 7218 -37017 -111466 -113216 -44872 -35781 -34315
17541 -34315 -32861 -42639 -39239 -27481 -58015 -79637 -23091 -6605 -15188 -2814 -1161 -3835 8867
17528 8867 1726 3961 -22929 -31363 -31866 -40728 -58180 -46231 -35534 -65444 -98008 -96379 -80999
17515 -80999 -72257 -50280 -35613 -32464 -28267 3413 20760 6023 -19294 -36314 -23361 -24969
17503 -24969 -29416 -26961 -23752 -19444 -13843 -21529 -23334 -21316 -15892 7009 -28275 -65930 -63844 -29744
17489 -29744 -19103 -9219 -10301 -19959 -5815 11094 12762 8532 24028 26235 18599 -26463 -28498
17476 -28498 -1166 -1893 -29731 -29548 -2345 4015 -25746 -33455 -14775 -1998 -25815 -32861 -47552
17463 -47552 -65247 -55274 -50225 -47610 -37833 -17267 7211 -12045 -32086 -47564 -53421 -47961 -42276
17450 -42276 -46304 -8118 17828 16170 76504 146991 222591 302922 269105 176237 76544 21889
17438 21889 -17941 -34698 -12873 4901 -6462 8413 9843 12426 14687 -7411 4679 -14722
17426 -14722 -45435 -75458 -80810 -22692 -11515 -16567 -11713 -34229 -56267 -40573 -38457 -44297 -35450
17413 -35450 -19893 -25252 -48049 -62032 -19533 12172 -6463 -14970 -15410 -34986 -48915 -38663
17401 -38663 -39623 -17253 -22604 -43117 -19317 -19479 -42320 -60133 -17315 -32936 -44693 -37854 -44874
17388 -44874 -75126 -58053 -43846 -46470 -22636 -10765 -8479 6757 29837 12231 -30757 -58851
17376 -58851 -30853 2487 21644 25195 20578 7008 12727 -40 -55902 -51944 -31333 -21220
17364 -21220 -13457 -11832 -25932 23172 26054 -19151 -13824 12382 11826 12380 5872 15165 16103 -16041
17350 -16041 -20073 -12432 -15936 -18413 3794 -9190 -33289 -13373 -1996 18115 31651 51027
17338 51027 11663 -39025 -37924 -40825 -25063 1936 -17730 -33282 -31514 -23876 -23507 -6570 -71
17325 -71 -29109 -20381 -16655 -14596 -7474 -4516 -11530 -28350 -39358 -21563 -21774 -41509 -66445 -58132
17311 -58132 -55158 -16124 20948 50505 49402 -20796 -56992 -51049 -34873 -41087 -36107 -18796 -1410
17298 -1410 -4107 -24337 -26002 -49765 -22269 6764 -22194 -194 12055 14348 24893 16688 49346
17285 49346 55376 39623 -39212 -79096 -71105 -89393 -83595 -72992 -36658 -19414 4768 39080
17273 39080 37732 2921 -26105 -32313 -40034 -44345 -33029 -34959 -12763 11423 -16383 -14772 -18812
17260 -18812 -18606 -29291 -8560 8314 -10509 -24023 -17715 -24131 1266 29495 -7980 -35596
17248 -35596 -13344 -14303 -16184 -42414 -47488 -14171 19299 3003 -11638 18720 20319 5454 16377
17235 16377 33688 53945 54069 16816 15733 -16132 -16180 -32689 -33970 -38058 -10149 7485 -21076
17222 -21076 -54004 -38988 -6484 -21673 -51696 -80964 -104596 -69340 -16623 23663 12136 -2317
17210 -2317 -9690 10479 8083 -13957 -10598 -30195 -50605 -39304 -4431 5043 35840 27231 12783
17197 12783 29518 39665 41157 60246 100850 80273 54617 70997 63945 67286 26015 -12336
17185 -12336 -28033 -21538 10912 23003 -25060 -74065 -69996 -53274 -65858 -55164 -33887 -28683
17173 -28683 -31861 -20587 -30944 -24724 -51678 -58421 -25129 -25572 -35245 -3480 8475 25092 28267
17160 28267 17453 48448 57427 49569 24583 27108 31290 40012 47764 12865 -1835 -3873 8206
17147 8206 24392 42078 28012 46175 37307 29858 -111 -66 3622 23187 -33886 -25694 -25169 -18791
17133 -18791 -458 10303 -2386 13296 12513 21469 40660 16678 -729 -18269 -33925 -38827
17121 -38827 -52677 -34032 -41169 -83807 -82076 -72755 -85651 -50230 -22383 -13245 -15651 -9059 -15555
17108 -15555 -51693 -89255 -104729 -78780 -61407 -19534 11698 -25671 -53161 -37528 -16469 6397
17096 6397 5990 -8444 -22138 -36956 -48037 -67449 -77609 -49935 -49067 -20065 -18196 -5924 -1485
17083 -1485 3225 7929 5804 -19152 -26724 -57019 -85285 -49692 10698 5137 17578 46534 23808
17070 23808 -26874 -30393 -9891 31190 30704 1305 -11407 -22021 -29908 -79956 -128695 -121705 -89860
17057 -89860 -60303 -34455 -75453 -81269 -62689 -19580 15070 7938 -16760 -50235 -68241 -47153
17045 -47153 -11012 20684 -9384 -51275 -32509 -3160 -9120 -7630 -15960 -32225 -33228 -31749 -51557
17032 -51557 -45444 -52365 -47425 -27663 -16251 -31003 -10181 28944 46806 48232 58150 37964 -3021
17019 -3021 -30890 -13159 -9182 -9227 10681 -11143 -29251 -29453 -21873 -3274 11245 -27857 -44330
17006 -44330 -28420 42 856 -20579 -39486 -18494 -33144 -38906 -10143 25436 14004 -19280
16994 -19280 -44509 -22406 -12911 -887 20467 -27654 -67667 -43013 -39418 -57866 -72719 -78346
16982 -78346 -80069 -80232 -36671 -2539 -2339 24654 11376 -3085 -35300 -44958 -34893 -26420 -14523
16969 -14523 6108 5950 -7736 -19279 -17940 -51492 -90517 -61338 -49144 -25247 -11849 -7934
16957 -7934 -15051 -8024 -24258 10623 30659 14131 -29556 -37065 -19499 -15277 -18840 -49681 -72470
16944 -72470 -72417 -85054 -70480 -43918 -31146 -37432 -18115 4287 -7201 -53544 -40813 -25881
16932 -25881 -4922 -2478 12917 21895 -8528 -11882 -16875 -13121 -1725 -2726 6491 18890 14940
16919 14940 -17474 -56273 -85940 -48645 -59958 -65827 -7634 5055 6093 -9343 -28973 -31903
16907 -31903 -26743 -6748 -8788 -17884 9595 -8347 -22522 -58898 -88415 -68240 -14968 747
16895 747 -11716 -14258 -2252 -14327 -45869 -37405 -38236 -31453 -22591 -24822 -27411 -19176 -65831 -81335
16881 -81335 -46228 -20732 -54854 -62233 -38577 -20183 -8125 40915 72448 71176 55121 37262
16869 37262 25883 25685 9490 30105 26710 23973 -11174 -7300 -7649 -8437 15485 26918 -16376
16856 -16376 -62293 -67156 -30954 -20594 -18912 -1752 -35125 -55349 -29316 3952 -3291 -33788
16844 -33788 -60880 -60742 -55373 -37456 -16742 34506 57203 40031 18422 -14208 -74987 -104290
16832 -104290 -59759 -24883 -2132 5714 -2947 -27469 -42756 -33056 -26874 -37462 -27290 -7975
16820 -7975 7547 39996 42467 2977 -29870 -37429 -31796 -36904 -22805 -6757 -39715 -62318 -51895
16807 -51895 -27482 -1507 -10409 -19701 -5858 5174 1563 -26412 -44050 -19450 -10715 -27745
16795 -27745 -76967 -91694 -79943 -51059 -78194 -62661 -52080 -40125 -11828 12900 28560 5546
16783 5546 -17974 5636 8678 42436 70508 57430 18657 -19654 -65089 -101227 -89043 -73895
16771 -73895 -17220 32332 60568 48452 10055 -176 -21879 -12026 11894 24512 -19151 -36963
16759 -36963 -6946 608 15473 12275 -5730 -1984 2608 8294 -33801 -69126 -93040 -62273 -29077
16746 -29077 -30758 -32907 -56140 -43658 -21240 -1826 4332 10083 -10345 -25427 -10678 -5237 -25957
16733 -25957 -40777 -42493 -28092 -13734 -10507 -27035 237 25636 2019 -13000 -18484 -95317
16721 -95317 -120028 -95170 -71532 -53110 -58023 -57556 -36856 -25868 30742 48440 19132 -12626
16709 -12626 -40757 -40656 -21101 -6727 5991 -1388 -3133 -2190 -24865 -35068 -16622 -31484 -44945
16696 -44945 -59516 -53512 -50299 -61014 -52723 -53399 -45363 -68198 -70124 -44076 -39291 -16360 -26911
16683 -26911 -65820 -51778 -9327 -28000 -54689 -38777 -52843 -61339 -55392 -46531 -54222 -52079 -71774
16670 -71774 -69966 -53520 -52381 -44024 -50697 -65770 -48612 -26230 -33833 -64502 -58678 -33165 -29480
16657 -29480 -48862 -47454 -35585 -48939 -79116 -99108 -56304 -19839 43 4017 903 -6911
16645 -6911 -3725 -35350 -48839 -72482 -46899 -1257 -27193 -36937 -39616 -32752 -54361 -63284 -38602
16632 -38602 -16301 -13596 -714 10407 -11794 -23896 -17284 -10855 -2930 -1612 -9873 11001 13169
16619 13169 -3830 -8237 -13201 -30643 -22582 -7765 29606 31074 -6505 -37576 -62558 -41759
16607 -41759 -17490 -6985 -18483 -24869 -35973 -46692 -28191 -34978 -44976 -49757 -13502 -51154
16595 -51154 -22735 -20130 -31232 -48050 -46827 -27499 -45399 -61558 -15982 25334 13343 28333
16583 28333 33169 20660 16419 16240 26161 34244 30140 40793 16010 8295 -5145 16808 52469
16570 52469 49821 69716 79044 71401 61945 58018 46332 25594 33423 40338 17988 -16594 -49878
16557 -49878 -72818 -59638 -29304 -3056 -610 5901 15005 10056 21375 55097 82890 51474
16545 51474 28390 7263 37032 13748 -16705 -46073 -48091 -21889 -19577 -26499 8405 26715
16533 26715 -8665 -19199 -14374 6584 3095 -21049 -24365 -32775 -40158 3413 38678 15620 -10641
16520 -10641 -50646 -43594 -31683 -19070 -44 6008 5846 -7683 -14437 -48210 -65436 -60069 -79900
16507 -79900 -58031 -13733 -10573 -8479 -7293 -7579 -1701 2681 -19458 -29440 -40615 -41679 -27297
16494 -27297 1616 30663 17460 11082 -16768 -30574 -66606 -80131 -66295 -20673 27681 30871
16482 30871 20834 14996 5485 27086 50387 34387 23711 -6024 -1955 13041 38555 11872
16470 11872 7927 -20 -23777 -23476 -32065 -1850 34807 35638 12305 -20835 -32320 -15306 -31941
16457 -31941 -26309 -23862 -24710 -44499 -86371 -73827 -77498 -71678 -18846 -4819 -19621 -19307 -10427
16444 -10427 -29019 -21218 -23297 6655 40215 11818 -25549 -38596 -23929 -483 8290 -4248
16432 -4248 50269 54902 45933 26735 -2241 -25542 5672 9057 -14404 -18141 -15787 -922 -4730
16419 -4730 -12707 3407 26621 16882 -16810 -34359 -51843 -58635 -41511 -29408 1674 -106 -5890
16406 -5890 -3444 247 17096 41894 12017 -21054 -21494 -36299 -18026 -4705 -6135 -13775 -23445
16393 -23445 8113 34651 67833 76000 48375 15191 -19359 -40018 -39119 -20017 -4008 7589
16381 7589 -8901 -65172 -82957 -91283 -108934 -94578 -80168 -54635 -93851 -106202 -86413 -63008
16369 -63008 -19708 13494 10520 -42422 -46445 -46166 -30653 -29912 -53932 -22926 9980 18312 -7035
16356 -7035 -12277 -24192 -6634 -20359 -15717 -28554 -17747 -363 1260 -12141 -21868 -24120 -22125
16343 -22125 31231 40776 -5326 -20029 4736 21992 41346 61146 33912 32516 11928 2024
16331 2024 -20505 -5375 22233 17557 -10335 -14856 -10719 -27801 -16827 -4521 8382 21395
16319 21395 40239 43687 32601 14383 36646 62267 39512 46991 43331 23732 -13290 -32753
16307 -32753 -42543 -17637 9195 21284 -10018 -41133 -36253 5152 20200 29892 15588 29819
16295 29819 29770 -20030 -15948 -56072 -29994 16950 -2681 -2282 -13613 -36645 -21545 -51394 -47429
16282 -47429 -26352 -41590 -35181 -25188 -15848 -9091 1958 14735 36850 9556 25411 4548
16270 4548 1397 -15755 -22520 -3178 28592 28503 12994 -13510 -16285 -2934 20950 24203 41702
16257 41702 60721 16963 31590 29955 23975 26065 11829 663 -20576 -34136 -25686 -18634 -21160
16244 -21160 -10193 -39967 -64902 -104030 -113207 -100543 -47678 -33441 -14930 -31464 -52441 -23377
16232 -23377 27912 6742 -4729 -11590 -21857 -55245 -38604 6512 18205 -3390 -2491 6632
16220 6632 -13109 -25397 13550 28451 -2714 -10206 -11792 -9901 -9859 -6260 3193 13068 -20828 -35291
16206 -35291 -11546 13971 11496 16607 -3970 -33965 -29956 -4261 -11246 -25807 -24740 -25785 -2648
16193 -2648 24062 26336 4601 -37392 -66130 -66028 -22051 29574 22389 5740 8323 -989 -32773
16180 -32773 -41105 -32631 -12317 34532 39048 17047 6944 12582 4119 8213 -7596 29133 49313
16167 49313 30351 11824 -21070 -18344 -699 -21263 -45348 -38007 -8110 -15161 -20082 -5034
16155 -5034 1813 30433 38108 -4619 9975 16228 10935 25516 3342 -28794 -49917 -54699 -41810
16142 -41810 -48869 -12662 206 8341 1473 -35932 -35385 -36320 -35273 -30341 -37469 -19857 -36550 -41965
16128 -41965 -36132 -19175 -30796 -39908 -24151 -60495 -54131 -21227 -33023 -56140 -57129 -74896 -57388
16115 -57388 -55319 -16532 9563 -8807 -17416 19038 33410 48414 52907 -1727 -31500 -3685
16103 -3685 30153 -6815 -52167 -50788 -35728 -22357 -11505 -41244 -43390 -46168 -60284 -72017
16091 -72017 -49516 -29452 15840 -10948 -22383 -40330 -77167 -49835 -27942 -51257 -56315 -40765
16079 -40765 -26263 -31984 -73752 -57337 -54599 -35235 -1273 -22654 -54762 -53639 -78058 -73358
16067 -73358 -27181 -8205 -15553 -29850 -9849 15493 40525 36884 50376 33455 10393 28012
16055 28012 9030 -27385 -30371 -29376 -21734 -51548 -36899 1791 7558 184 9162 -21446 -72569
16042 -72569 -71627 -59131 -22300 28866 53380 48154 30508 4533 -65793 -106304 -94864 -62200
16030 -62200 -80592 -77108 -59049 -68523 -85533 -75349 -67816 -79224 -74213 -46863 -17148 -22550 -53761
16017 -53761 -74682 -35688 -15491 -25353 -45277 -34118 -20712 -34595 -20896 -19018 2586 59157
16005 59157 56332 4816 -29495 -39012 -58020 -20559 -15023 -20113 -12255 -19614 -53355 -92058 -103946
15992 -103946 -91629 -61323 -47840 -15463 -1801 5692 41479 58582 11722 -21639 -38855 -16560
15980 -16560 -22892 -37138 -43153 -20208 -12764 -5861 3439 -10748 -4235 -12389 -16421 -11771 -11754 -12395
15966 -12395 -7683 16603 9036 -5039 -5413 -21908 -20963 -20966 -14539 16564 15484 -16402 -32541 -18532
15952 -18532 8717 2943 15417 37121 822 -5239 11598 22001 6984 -11043 -12353 -22661
15940 -22661 -23881 -34784 -13649 -3360 7070 23703 28363 54387 50044 16033 -2862 -8319
15928 -8319 -2111 -11788 -30247 -37599 -30511 -6172 20943 6804 -30046 -23069 -7946 -39846 -36725
15915 -36725 9726 9315 8198 29797 21125 10379 -3154 16520 15496 4680 9929 11000 15553
15902 15553 7409 6732 -9976 -50743 -65811 -60259 -53676 -80916 -37731 -31127 -41896 -24997 -14653
15889 -14653 -33680 -19685 26012 33722 14912 23064 4751 7291 20280 32930 30913 115
15877 115 -31592 -22146 -5909 18101 -6824 -17100 -23302 -23507 8459 38336 48526 43508 18516
15864 18516 -22200 -28154 -20747 -18340 -13734 -1357 14314 2470 -20335 -39437 -17168 -19234 -6082
15851 -6082 -23653 -26508 -42632 -34382 -38897 -44026 -51624 -38669 14520 48328 15264 -15440 -17200
15838 -17200 3967 9532 5505 -6729 2099 26897 -11903 -29546 -41025 -26406 -14323 -22780
15826 -22780 -41496 -48457 -58038 -36918 -57339 -91071 -100234 -43929 -34132 -33109 -16722 -8604 -13119
15813 -13119 -50096 -27836 2264 28764 1431 -14867 -25419 2237 22184 -7411 -4297 16227
15801 16227 15277 47776 45732 17318 -31922 -47613 -34366 -25726 -52116 -32051 -14066 -33829
15789 -33829 -32210 -24548 -33626 -46861 -35075 -8398 12948 30146 5140 -27388 -14371 -27937
15777 -27937 -47483 -37591 -73332 -51999 -51077 -55547 -35000 28144 51735 3258 17066 128
15765 128 -35705 -39025 -27409 -20205 30339 15009 -1105 10523 -8888 -18412 -4921 -8214 4042
15752 4042 -4224 1772 7200 1644 9574 27809 666 -29259 -24800 1633 53274 39023 8833
15739 8833 -27222 -31469 -9165 3740 -7095 -29371 -34572 -17074 -30924 -50183 -46380 -35422
15727 -35422 -39543 -41518 -30762 -21564 33597 60690 18473 15911 26000 25145 16901 32229 19211
15714 19211 17973 30920 2293 5917 5444 -22995 -67037 -45135 -8902 15884 33875 21770
15702 21770 22994 16801 2525 8587 22168 626 318 -17694 -34961 6200 38304 27554 -439
15689 -439 11067 3808 -35072 -27805 -54978 3275 72482 96372 68953 75389 48363 23212 32675
15676 32675 18654 30669 37886 31716 10698 8392 -9308 20553 33950 12975 26096 7113
15664 7113 -8082 3889 5707 8867 14623 15020 21696 29860 32837 14349 16929 13166 3675 -635
15650 -635 8638 32427 17229 -32278 -83131 -54068 4221 33091 27128 9187 25794 -9302
15638 -9302 -21905 13275 25656 -2055 -7289 -31063 -27899 -11638 -14071 -56099 -67027 -63724 -75089
15625 -75089 -57906 -29541 -25506 -14496 -17046 -38298 -68254 -59854 -55862 -69363 -51943 -45340 -7793
15612 -7793 12779 16880 209 -17664 -35564 -37724 -31688 -51963 -39578 -5465 22826 4021
15600 4021 -43793 -29580 -3255 26482 22287 27707 40251 41110 -15154 -16324 13051 19959 12407
15587 12407 -35314 -40064 -18287 2347 -3917 -26483 -26078 -7515 -5918 954 8521 767 13947
15574 13947 14814 -25361 -12691 -1072 9961 7784 -14208 -12501 14805 20498 22156 9380 -8846
15561 -8846 -27980 -13767 -19596 23332 66511 12015 -27278 -16629 9283 31945 34837 36536
15549 36536 10445 -37710 -57451 -40244 -28987 4431 6938 10668 33230 757 -27008 -9732
15537 -9732 -22057 -55723 -60270 -26242 -11193 4698 -22848 -31970 -26752 -22181 -25941 -20481 17700
15524 17700 74542 68422 55868 38064 21769 25398 22641 -5903 -22141 -30001 -36003 -38253 -36134
15511 -36134 3766 12050 913 -5069 -17341 -11778 -2211 -18208 -24102 -7898 -1295 37392 27709
15498 27709 -23595 -75653 -65821 -13157 16062 57020 48610 25272 27154 10533 45404 37444
15486 37444 42966 48365 47806 73164 53465 40324 19331 6267 7486 22266 18300 35568 18375
15473 18375 -6129 -19566 -11602 3424 -10556 2297 -7288 -4312 10177 1016 -4072 12548 44292
15460 44292 37478 40242 44908 14391 -6165 -30615 -28404 -28004 -42901 -573 12217 8778 -34974
15447 -34974 -24602 42910 78391 59255 31645 8912 2468 -11565 9276 20464 22812 20847
15435 20847 40282 47734 51758 38126 -3441 -38183 -54052 -25517 -9124 -7370 13384 -6392
15423 -6392 -16535 -18094 -31039 -19997 -10882 -25332 -3852 18323 6791 -11642 -8907 26055
15411 26055 38243 34913 49274 34952 19260 18396 17923 32122 31992 33483 42565 43674 15096 1869
15397 1869 49437 30592 -16946 -68886 -85478 -74715 -67377 -37412 -16510 -40812 -29548 -6094
15385 -6094 -24462 -15253 2797 507 -3220 -20084 -25736 -40800 -42978 -38375 -57066 -70949 -43387
15372 -43387 -8288 -3558 9017 13635 -15505 -19722 -10873 27930 -12146 -28496 -41316 -39753 -44366
15359 -44366 -31685 -16385 -55942 -88549 -76378 -68739 -66951 -66772 -54923 -47158 -19466 -7114 -15502
15346 -15502 -17916 13226 66071 71473 44130 38899 27176 -14722 -52568 -24305 10056 34689
15334 34689 46545 2215 21087 50311 24346 31445 2691 -39249 -64260 -67944 -38377 -11935
15322 -11935 4288 9774 -19181 -28630 -36835 -18383 -20224 -40572 -54174 -33202 -8441 2575
15310 2575 7941 28873 10416 -1778 -7774 -26295 -34898 -55751 -65984 -50903 -19056 -1761
15298 -1761 9372 15838 13263 7542 -14984 -30589 -21167 5008 33861 -2219 -35996 -19999 -30373
15285 -30373 -22627 -11272 -37180 -36582 -54064 -68871 -46041 -37829 -40534 -30715 -45778 -25528 -32544
15272 -32544 -29873 -14282 -34173 -31083 -15964 -10899 -4584 16349 18467 10287 19839 56704 78709
15259 78709 104202 49289 19505 15637 16687 38365 47187 13975 7117 -10198 -27264 -24052 -36049
15246 -36049 -15049 3313 30431 31984 13518 9084 -7024 -7422 -8912 -25283 -5018 -9071 11163
15233 11163 52516 71318 89292 77516 35262 20521 14430 -2936 -21201 -32864 -8027 -129
15221 -129 -21341 -44023 -51479 -41106 -43085 -39989 -62583 -83212 -72377 -59555 -61792 -29313 -6500
15208 -6500 -4637 -5852 38052 83901 98934 49595 9247 7167 -2540 1450 -21758 -9799 -5484
15195 -5484 26827 35662 -13155 -47819 -41760 -41194 -26710 -25766 -36363 -60271 -55117 -33869 3432
15182 3432 11427 -7285 -19500 -27173 -17825 -3364 -9324 -36772 -70773 -100516 -64631 -26676 -7314
15169 -7314 -3574 10823 23889 6167 9256 18870 66712 66322 35188 11508 -11217 3774 58136
15156 58136 48243 -291 -27392 -27358 -12666 25023 34322 1066 -13011 -11698 -13349 5454 13908
15143 13908 -5810 -23985 -19377 -3496 19597 29613 69272 61449 44107 51818 45583 19542
15131 19542 32 -6790 9339 34503 21531 -8089 -10611 -5483 -12783 -23793 -11474 34544
15119 34544 38159 5700 -6811 -5441 5 -32083 -27079 3304 10465 37672 35862 32410 49992
15106 49992 17389 -5500 15488 35190 22453 19760 21617 36154 -2045 -32877 -59210 -37081
15094 -37081 -23815 -11739 -5981 -13830 -8959 3533 17029 73310 63017 24611 -15380 6724
15082 6724 24125 -7442 -11590 586 11960 31788 23946 496 -31183 -15127 15207 -3925
15070 -3925 -19158 -9215 -27240 -58376 -73043 -48146 -33128 -3341 36287 23564 18161 34199
15058 34199 22858 25280 34389 23253 38764 51963 28019 11393 -17160 169 35178 50648
15046 50648 98722 110447 72331 97141 115248 100516 90570 43512 24735 24324 11742 20698
15034 20698 31279 33560 52186 40881 26041 34841 44756 67496 57445 56569 76363 129407 182551
15021 182551 168953 144322 137479 130284 135137 137408 68987 31896 34535 25815 30902 20361 24756
15008 24756 -9125 410 24404 43422 61724 53631 18583 1554 15181 20585 19444 34967
14996 34967 18604 16937 3197 -13650 -32268 8408 -5271 -3551 12627 44375 81322 36249
14984 36249 -588 -1218 15580 47048 74777 43758 -8852 -53054 -40676 -28462 -19783 -11319
14972 -11319 -4762 -15228 -27380 -25871 -5935 33335 29183 21692 32391 51483 81558 61913
14960 61913 24766 9641 -10709 6961 42803 46575 35290 27066 25503 34000 22684 -12778
14948 -12778 -54531 -65291 -46369 -53194 -39894 -19353 -1886 -8116 -14515 -21932 -23065 -4704 -3735
14935 -3735 -19408 -34264 -29261 7430 20598 -9102 -9934 15636 23038 35706 57109 53731 51444
14922 51444 40389 5884 74 4123 8099 18145 32692 5498 20077 31143 22584 -11306
14910 -11306 -30958 -26115 -15935 -7103 -13524 -14359 -8409 -4528 -9251 26701 28674 26915 2180 6182
14896 6182 19650 14873 6113 10407 14248 3784 24827 32737 13863 -18027 -53763 -40456 -42341
14883 -42341 -42616 -27279 -36367 1777 16834 -14452 -45647 -53234 -51055 -74511 -47996 -27639 -30644
14870 -30644 -26729 -883 28422 32468 14190 54284 63887 41808 -1313 -32210 -35890 -9199
14858 -9199 7163 -13505 -11437 -10246 11671 34037 23342 25950 25607 41172 67167 63905 44000
14845 44000 31349 -10434 -21240 178 59467 106318 81330 56339 48557 18580 8030 11882
14833 11882 -21926 -55240 -47178 -45188 -54084 -40181 -15086 -44083 -29086 1611 20910 24835
14821 24835 14748 20032 6404 1454 371 -13625 19128 35015 30275 30162 3065 -27611 -48454
14808 -48454 -38667 -44883 -56823 -40461 -19600 13825 42 -24889 -25486 12595 15982 254 -9152
14795 -9152 -1320 21266 21850 18524 40496 22809 -15400 -9453 -5199 -5182 -16161 -2173 -38881 -36807
14781 -36807 -3137 3422 -10255 -31754 -4054 15485 28872 46801 52673 25600 14743 20526
14769 20526 7235 -22200 -3638 9726 1751 -6712 6040 11563 3402 -29929 -40657 -40786 -44692
14756 -44692 -76028 -3364 17658 -3341 -8000 -29460 -29057 -3426 -13264 -17387 7090 13543 24264
14743 24264 3109 -33100 -38329 -8086 -25990 -14731 -27267 -54425 -27774 4278 -12828 -17151
14731 -17151 6661 65456 51103 32012 18006 5427 -1304 -17210 -33651 -12190 15942 10761
14719 10761 -20124 -11047 -4664 -7414 -14170 -25520 -5088 432 -55042 -63762 -56052 -56477 -47662 -34798
14705 -34798 -26598 -31891 -8930 19104 -25789 -47756 -62040 -51676 -36764 -4566 20315 47762
14693 47762 27497 -34025 -70654 -48436 -22892 -22212 -6314 2718 -31066 -37325 -33632 -18296 -19082
14680 -19082 -28969 -23126 6406 34839 16274 -9433 -26633 -9277 37445 69229 83787 79971
14668 79971 54310 16903 19412 18858 27949 31573 29892 21311 3887 -17406 -13548 -371 -15363
14655 -15363 7631 33786 31181 30489 40940 35699 17434 22228 32359 27364 3593 -13725 3488
14642 3488 23014 45209 25696 24668 16086 3101 -12898 774 37360 76752 63997 21524
14630 21524 -24516 -4370 24113 7063 -10508 -12532 -16765 203 35269 14915 28980 62010
14618 62010 34019 -5865 -21431 -16703 40304 66645 28516 19439 43416 51130 28045 33837
14606 33837 40444 -1900 9925 20789 46690 44451 50287 55262 38014 39643 31379 49275 31213
14593 31213 -6087 -19133 -29162 -45059 -32952 14390 36763 14385 24735 21703 -25512 -43113
14581 -43113 -33108 -18939 -42095 -54575 -66162 -7468 -11417 -9160 -48991 -52975 -20104 52066
14569 52066 79569 52954 42443 56583 30286 8510 -5364 -35001 -23833 -16834 -9414 18829
14557 18829 -9584 -31170 -17021 -17997 -16577 -53507 -26402 19612 15804 30479 24238 -2378 -3448
14544 -3448 8722 8490 5223 -4256 -7435 -17929 -16169 -21204 9563 19326 35895 67598 35827
14531 35827 -11062 -16872 -26259 -25013 16235 46904 47416 60963 57956 29607 34291 33810 30488 57074
14517 57074 72868 37692 5595 9775 -5524 -22602 -15878 5023 57188 44212 37389 49492
14505 49492 51421 20760 20489 23985 -7505 -7867 9196 20922 23397 25078 13397 -26450 -25296
14492 -25296 13847 52803 44931 45558 52947 73688 99988 78290 43743 5069 -24770 -32332 -303
14479 -303 13507 -6790 -13150 -18602 -36697 -17667 -32197 -36002 -32320 -37883 -65261 -50209 -17741
14466 -17741 22102 15389 25493 25200 36565 21265 22437 41497 64676 36882 8823 -23481
14454 -23481 -17741 -5022 -9036 -1432 -4117 35352 64541 67943 68129 47091 25110 -12497 -37741
14441 -37741 -2916 12481 3447 19256 38016 3494 -9860 6313 -423 6416 36799 47429
14429 47429 39102 15111 -40592 -68918 -71406 -56985 -9968 -5665 -8308 -4132 27951 16731 14677
14416 14677 25887 2974 -7072 22893 53417 61181 49727 69288 78765 73794 48629 23678
14404 23678 36351 68357 82188 76790 63504 67393 61841 46614 43337 40302 17562 -220 8272
14391 8272 32679 27976 5519 15115 26936 12426 -18831 -25909 -21911 -5579 -24138 -24817 -43545
14378 -43545 -50723 -20196 5798 36416 10956 1091 8916 1828 -23546 -30552 -18285 -760 -5897
14365 -5897 -1520 27733 30616 13198 4589 27010 41437 27457 29241 24725 22961 29437 54764
14352 54764 79012 30233 -24907 -14022 -17989 -863 17316 -19702 -29875 -18054 -29308 -33743
14340 -33743 -35064 -58956 -14314 21969 13971 -7527 -24235 -23613 -19813 -31938 -36502 -59958 -82226
14327 -82226 -55986 -8079 3236 8974 -1650 -129 29714 41965 -11030 0 15604 -3527
14315 -3527 9174 18727 46175 66937 78379 69054 16422 4491 9386 3376 23159 41772 34665
14302 34665 20142 40543 62002 66962 39884 11819 8150 -1662 -24435 -17931 -2302 -8925 -16779
14289 -16779 13632 23767 30550 18937 5739 2830 32236 63485 57383 17658 -6387 -10576
14277 -10576 6658 8450 -20351 -1742 -5871 4540 -23788 -49094 -46979 -17701 40725 57904
14265 57904 48659 24913 22979 52071 65860 43692 16088 -2948 -9558 3438 43108 43427 44845
14252 44845 27112 4110 13802 10957 -4389 -26501 -30322 -30792 -29831 19947 68268 56801 54692
14239 54692 17902 -17458 -19546 -33222 -2226 -16678 -46555 -33477 20777 27056 23138 7395
14227 7395 -37542 -48354 -20176 -7688 -18339 -9090 2036 -11050 -27540 -28923 -33212 -37771 -1012
14214 -1012 18504 13656 -21270 -26226 -10422 22896 40611 35739 30412 1198 16577 23589 47192
14201 47192 28026 60023 87430 81801 62161 55755 46798 28333 20595 -3908 -58795 -7856
14189 -7856 24104 45707 38574 1048 -18198 -19916 -2370 9780 -6722 9200 14605 -8500
14177 -8500 13074 17965 -2708 -49 -26709 -47624 -15723 1376 -6866 -15345 9537 55609 80306
14164 80306 52352 11262 10201 32678 48801 61419 47183 41170 15006 16239 23636 20678 -1467
14151 -1467 -1937 -18327 -73073 -47683 -9671 -28143 -13161 61526 73811 55140 -7741 -14872
14139 -14872 -1141 31397 46912 51854 44689 31602 40076 6877 -16178 -52383 -77091 -53962
14127 -53962 -16809 18145 3952 -6409 2837 -6618 7016 27909 45097 24555 -6026 -3133
14115 -3133 18329 4000 3034 26679 30708 40035 9134 -3097 -17076 -39050 -30948 -18348 -38913
14102 -38913 -67069 -59681 -7802 -1954 5108 36820 49139 49623 39193 45165 4050 1699 26106
14089 26106 50305 48821 64487 57055 52404 41134 10511 -11354 -4568 24314 14918 182 18452
14076 18452 46854 49130 84249 71805 45249 2695 -1684 -23864 -28806 -23199 26042 34398 24314
14063 24314 6816 -6695 -10770 13690 20224 -402 -23661 -19714 -23047 -19536 -15108 -34281 -23707
14050 -23707 -9010 31432 74337 81743 62438 58155 79726 38929 -14234 -18731 1145 -17786
14038 -17786 -20920 -7107 -3082 10819 32422 19701 5448 2382 18487 59642 76168 47295
14026 47295 17647 41431 58364 41430 55399 61134 35294 -6409 -14082 30376 74848 110546
14014 110546 106975 76903 71752 87947 76373 62263 25089 -28453 -57051 -36203 -35928 -17553
14002 -17553 16201 61619 63929 71637 51164 19155 -26691 -27522 4579 45161 64256 54091
13990 54091 50172 31627 29243 33824 38839 30456 13283 4038 3362 -1741 -2187 -17885 -20020 2554
13976 2554 -3737 15246 52277 44378 1488 -43111 -30593 -25765 5456 -19640 -7319 14026
13964 14026 30253 26059 20514 59084 68830 64973 94264 74439 56886 23033 14812 13126 0
13951 0 1248 18609 28125 4550 -10782 -2589 -26088 -23594 -35859 -43666 -31569 -10916 18346
13938 18346 48090 48596 6566 -6380 36683 50198 41971 36061 15715 14612 -678 28322 42769
13925 42769 25139 8402 6304 3035 16682 27455 12529 10332 31369 89031 72431 37904
13913 37904 2256 -15322 -10122 -11645 -21448 -33100 -3504 12057 10270 -8130 -6137 -4855 -9864
13900 -9864 -26905 -41679 -53023 -56796 -26171 -5213 3163 -5984 -10776 -29839 -38660 340 39005
13887 39005 20921 -1029 -12305 -16988 -2586 20692 34791 22914 40232 32173 25948 12317
13875 12317 15354 17837 29335 44037 57766 39225 19555 4154 4359 1009 19379 41540 42137
13862 42137 38746 58002 66128 34144 -5447 24667 68324 78610 70000 53176 63148 86417
13850 86417 79614 48941 41429 38746 36333 -1595 -7440 22527 42406 41234 85237 94611 76899
13837 76899 36795 9599 -16322 -6577 31594 46096 -272 -3949 5664 -3809 2575 27300 20054
13824 20054 45076 45884 26045 23536 47207 53014 41491 15262 -3209 3325 11524 23012 14272
13811 14272 34639 21998 2873 15044 27089 25689 11233 -26960 -19805 16439 6481 7395 14254
13798 14254 27307 28058 61048 84337 71288 54686 54254 40863 33180 22544 21491 31182 36119
13785 36119 20000 153 -16726 -14512 -12146 -18999 -19005 -7067 -17152 -13528 -16477 -1409 27488
13772 27488 56806 47732 39214 30211 30129 20337 54229 87052 66787 29496 -27185 -15547 51566
13759 51566 103687 85204 67257 48405 26215 53738 65795 59006 55699 11293 -9536 7753
13747 7753 -11430 -13216 -18780 -34172 -20253 4467 22024 15604 23016 27165 -6076 -27861 -28163
13734 -28163 -19375 -16069 -8610 2589 39189 43832 13742 25646 51624 59285 47155 46382 46887
13721 46887 44713 72002 52686 31752 9780 -421 11255 37945 35343 26389 6702 2206
13709 2206 2406 20725 15199 35401 47903 35620 33397 24903 10034 -3872 -7304 -5386 192
13696 192 -30402 1841 49765 65828 75370 63506 5519 -12145 -6655 40815 81548 71029
13684 71029 27730 37312 39180 21433 4793 -7247 -3645 35838 25736 14640 -2839 -11912
13672 -11912 2712 30036 76414 85726 48695 45854 48112 31696 28849 10705 -24820 -49201
13660 -49201 -45930 -11682 2310 -2564 -1363 15615 47009 50567 58010 37885 4475 5103 -11254
13647 -11254 -18407 -29674 -40634 -31413 -21710 13926 26639 39845 32418 -3936 -14899 -2934
13635 -2934 16673 13025 6241 -2608 25180 20555 18642 22237 24534 -15777 -7546 26800 43229
13622 43229 38737 28310 41808 32598 36069 37274 62632 46455 32544 28751 31629 33649 32680
13609 32680 46336 67506 33788 24672 37583 27613 41755 80988 77447 65134 58449 35769
13597 35769 45214 85040 41073 33426 30179 15199 28102 53815 72137 69520 76967 95099 63787
13584 63787 -6649 15117 -1627 -27991 -14049 -40074 -20749 20032 36795 39534 68720 64141
13572 64141 12625 -20977 -18875 -148 35830 20185 42461 67557 87175 65934 53721 16898
13560 16898 18669 23330 12779 -17523 -17927 -10319 -6934 5133 -7572 -12784 -2856 2099 16116
13547 16116 18802 44246 71616 81789 71993 37409 19707 3721 23765 70211 92898 116291
13535 116291 84767 74694 86918 80928 61729 29347 17429 40820 51512 2961 -19656 -36137
13523 -36137 -12809 9503 2911 -25348 -3324 35200 54604 73364 59680 41527 34499 45521
13511 45521 5032 -25295 -14569 -9785 -16949 16405 26305 65154 75854 70126 30032 26185 19017
13498 19017 23344 50426 65571 68723 73211 73751 64617 66412 58117 46346 85860 52412 25745
13485 25745 56488 38965 49374 70105 80407 72186 49697 53412 33107 45855 74453 111909
13473 111909 119103 131887 89448 69752 80410 54334 47036 66305 48078 45056 20007 17686
13461 17686 28139 32198 33271 15999 21358 27782 31707 23360 11558 28043 47826 45878 52257
13448 52257 50365 58804 55703 40704 40479 45765 49958 65119 72376 65847 56989 37443 44192 57163
13434 57163 24335 -5470 11061 22385 8989 -3834 11717 23083 19543 26189 -3025 -11866
13422 -11866 21839 51892 67960 68792 48215 27694 26661 37143 30853 19139 9339 30223 31894
13409 31894 8109 14417 52350 49941 12855 25627 18047 23060 24432 47672 38841 19807 51946
13396 51946 68779 52610 31186 48954 66881 45843 47735 50184 48291 25122 11077 19105
13384 19105 24878 62711 65435 73260 102409 114512 96880 92619 82946 73315 82091 89339 73450
13371 73450 36143 16195 13094 11010 -11944 -4829 -6636 11899 57067 84874 65818 84756
13359 84756 98353 104040 120963 80140 48184 83186 82262 48550 40592 58260 55487 90650 113186
13346 113186 111701 115041 141006 144742 95203 86530 122828 123169 57831 -9223 3792 49230 58133
13333 58133 52284 49327 45450 52665 70017 80617 83756 95493 108910 88578 48932 44934 51866
13320 51866 22425 37263 45284 49962 81406 88927 79678 77828 101445 108842 103937 67519 93024
13307 93024 102753 104317 93419 64594 58578 36741 39805 66706 90793 109858 104225 37408 38852
13294 38852 73689 60637 24347 -2690 -6493 -3384 43352 36252 21794 50185 74679 78912
13282 78912 89473 106098 115394 104081 86210 112009 94823 84709 119493 101161 82530 69625
13270 69625 55656 47207 41546 64170 84397 49297 31665 43425 70467 46674 49681 49984 66702
13257 66702 84880 94673 50703 34449 38807 46398 67686 106836 125799 91581 49817 82968
13245 82968 87643 58749 48380 117815 130980 91792 76783 86005 79555 80813 62682 81140
13233 81140 103052 119752 138766 115284 60456 54442 74054 66182 50751 52014 83514 95387
13221 95387 94049 96445 121211 108823 47013 7278 14451 43616 69184 78698 110024 103309 74339
13208 74339 68331 66911 98372 97514 112212 82745 50744 42665 32468 42081 41280 46244 58564
13195 58564 102218 170152 200050 175862 156234 136471 120061 91295 67045 81690 133939 146893
13183 146893 134132 126965 94893 57988 47388 73871 72567 108412 115558 111208 99644 91334
13171 91334 73576 88530 115129 94951 113543 139841 168246 150102 121962 115471 138409 158800
13159 158800 145186 119779 98739 104444 88993 80138 108939 137186 159588 167005 205322 267971
13147 267971 339964 361899 325697 275570 234560 216310 242283 254569 243161 244133 250846 252189
13135 252189 254368 250048 227505 155976 142894 105273 109795 102695 112274 134968 134793 145717 165727
13122 165727 206502 210618 164031 161156 163566 177603 185089 189734 194705 200156 188498 186548 233204
13109 233204 247792 262311 292034 327517 434493 553653 687196 897978 1159086 1408839
13099 1408839 1660157 1806815 1863397 1788263 1577509 1366941 1116829 885901 732393 626168
13089 626168 550747 486223 426426 382015 349574 325052 315308 299128 244538 225096 203006 236723
13077 236723 245794 239504 200605 178613 167645 164606 185037 203976 185847 175546 188205 207292
13065 207292 194110 167653 184307 192493 209802 204556 218148 265845 254037 219929 205548 236765
13053 236765 238623 199833 189036 177061 143114 144232 136739 160202 214528 241987 239494 215065
13041 215065 241758 244301 185293 176172 173408 183917 169724 117116 93569 99607 120321 122050
13029 122050 93447 88573 91805 131610 148279 149453 139275 147150 172339 201348 213915 227542
13017 227542 188041 184894 185660 174049 191724 199493 156014 115647 130688 145132 156754 177658
13005 177658 154387 126375 144915 152692 174518 193946 179274 161113 164770 157124 176959 161457
12993 161457 135269 145492 132065 145490 166935 123987 118213 133092 170404 191598 185954 163635
12981 163635 144732 111405 97855 138709 134024 130843 97814 81221 94119 158000 170091 145584
12969 145584 137436 143398 156261 145243 120730 142881 171817 188159 167266 187977 212186 235095
12957 235095 228072 241730 237231 245101 233532 209389 210629 211348 206824 185360 184180 189457 185332
12944 185332 190658 199993 202375 209891 222395 245117 255904 265001 257198 225917 190130 185391 195911
12931 195911 190403 161113 126253 143058 168816 125865 112015 131486 127304 149068 153184 163140
12919 163140 184409 212209 213164 236847 279241 292145 278183 303465 346587 381388 453858 496156
12907 496156 548535 523018 433518 379435 314991 276626 280033 214537 182537 211049 243864 247319
12895 247319 242437 234698 235194 228559 203274 185936 191883 261026 263380 213149 177435 191857 198216
12882 198216 256116 290985 277820 268309 261742 284532 264677 267156 278082 227302 237238 270991
12870 270991 288358 264223 246832 232200 211880 203367 213730 224239 225866 219030 185342 190803
12858 190803 177387 180390 181645 202409 236600 246210 263983 306321 332820 298402 268684 316972
12846 316972 346071 348225 364163 419857 455795 465075 478359 475844 444129 434462 428813 409983
12834 409983 385480 353826 336496 293213 283260 298943 333666 313893 312104 316034 355159 341214
12822 341214 336122 367985 359850 367722 382919 388533 394426 392708 355762 339367 311661 307069 314013
12809 314013 329989 349703 392034 415684 368159 337800 336305 325514 323040 302377 322221 354216
12797 354216 389164 422127 431763 442024 464589 470052 485798 517724 521690 534264 557906 577457
12785 577457 620916 680673 775679 877296 921789 928610 888485 801011 684221 607730 576162
12774 576162 532599 516159 529482 510242 475492 446508 484310 521764 535929 551815 557501 540441
12762 540441 538539 555866 539650 542134 509440 513011 519227 501947 547954 615131 663746 642511
12750 642511 624885 644047 656667 658783 666305 696886 759078 783445 742031 744030 769938 772271
12738 772271 798374 848913 882841 903005 919829 951737 959943 931766 940244 939332 980873 1027140
12726 1027140 1047406 1094096 1125699 1105148 1108091 1130726 1175788 1195990 1213108 1256820 1289476
12715 1289476 1351587 1389827 1389267 1397906 1480114 1564311 1625501 1698249 1764572 1826715 1912126 2021022
12703 2021022 2080755 2160875 2268515 2348597 2392717 2437004 2508619 2547385 2611341 2700047 2785794
12692 2785794 2888439 2987842 3094550 3202463 3360262 3522984 3723028 3928791 4138661 4336521
12682 4336521 4544580 4797943 5123327 5532291 6005656 6528499 7146736 7858292 8612648
12673 8612648 9399205 10283045 11316026 12584411 14150843 16173134 18797649 21929741
12665 21929741 25627277 30037307 35483061 42800051 53547424 70317426 97075456 138180874
12657 138180874 194096536 254565639 302124268 328987811 319961805 278927687 226000440
12650 226000440 168027271 121116118 90290437 70712961 57757504 48685604 41873468
12643 41873468 36480619 31959896 28042408 24678380 21759888 19284252 17246766 15554278
12635 15554278 14176222 13086582 12179056 11433949 10810019 10288530 9778627 9277625 8788405
12626 8788405 8329901 7851599 7360945 6958156 6612236 6294026 6023003 5757896 5471144
12617 5471144 5233522 5010092 4787860 4582222 4387931 4171403 3972912 3786472 3591191
12608 3591191 3428394 3299613 3196710 3056238 2938731 2810121 2714657 2636671 2563311 2472210
12598 2472210 2387127 2337068 2271998 2200838 2140164 2137394 2105351 2051762 1970696 1861407 1803625
12587 1803625 1776008 1744685 1674515 1580626 1505684 1482380 1431286 1391911 1372579 1359658 1316555
12576 1316555 1219875 1170148 1128661 1092972 1098352 1082591 1064225 1054559 1042235 1053177 1053332 1017932
12564 1017932 967844 904806 882706 881799 870109 840230 785675 720720 710650 709970 702520 678678
12552 678678 630345 627522 638266 632925 625813 609289 619117 606844 579250 540091 526285 504750
12540 504750 501309 512963 533702 550631 544508 551097 530117 531539 499316 500179 513274 554317 623885
12527 623885 587680 516701 470321 422651 374283 355094 312382 291360 276827 283836 289406 277505
12515 277505 207462 177385 175138 160293 167239 195033 189706 176043 161170 134407 130730 136575
12503 136575 150730 124482 120626 117039 106750 110575 124805 168856 170170 166504 132416 114823
12491 114823 131543 160040 156212 101046 135755 169112 179756 193970 202145 182154 197174 204045
12479 204045 191102 172843 103687 21406 -10626 -25239 -73518 -70846 -71686 -77312 -86454 -112563
12467 -112563 -164177 -180426 -174797 -138986 -98301 -65049 -55239 -66571 -59379 -28063 -21522 -26348
12455 -26348 -22032 32418 41967 39053 31923 43188 56327 29783 -47472 -98414 -40126 6516
12443 6516 -2323 -19519 -29550 -39218 -26127 -11870 -9525 -36446 -76369 -66290 -51261 -14862
12431 -14862 -2766 -16548 -38102 -21475 -25708 -43901 -50615 -71593 -75301 -64113 -58113 -40252
12419 -40252 -9379 17331 6464 -39368 -41797 -34284 -36920 -12340 -9484 3146 -50216 -74061
12407 -74061 -60675 -51278 -43297 -43061 -38986 -19901 3580 20059 6787 -316 30983 9381 -28006
12394 -28006 -35505 -57780 -97878 -87822 -50584 -22143 -19960 -16656 -7042 -21058 -32125 -25766 -23742
12381 -23742 -41240 -38605 -45676 -45609 -18554 -18506 -23489 -30776 -27146 -6479 -518 -16147 -60372 -36716
12367 -36716 -53742 -111894 -116637 -93903 -63644 -58115 -34056 -13075 -44903 -46072 -42977 -24326
12355 -24326 -19699 -9078 -5320 -42266 -58298 -68997 -65355 -20128 -47729 -91397 -90460 -64741 -48057
12342 -48057 -33870 -23430 6972 -11268 -17819 20418 9431 -11249 -4865 11518 7401 11442
12330 11442 -12701 -44018 -39229 -58593 -56601 -62332 -63941 -45818 -49322 -83887 -89538 -84857 -73398
12317 -73398 -45209 -31466 -45634 -52140 -71332 -94878 -90718 -62850 -52506 -48203 -60288 -64459
12305 -64459 -65555 -61599 -93886 -66752 -47265 -6282 -19416 -88181 -134906 -136532 -112690 -104151
12293 -104151 -110206 -116391 -90448 -30633 -18551 -20453 -64303 -79952 -78052 -60282 -42230 -62629
12281 -62629 -81061 -70280 -72773 -73366 -71310 -70941 -77710 -80382 -94712 -66236 -45771 -62370 -95864
12268 -95864 -103449 -116210 -133143 -128801 -113666 -124100 -144967 -117256 -99948 -91620 -100147 -103397 -127619
12255 -127619 -94342 -57469 -37126 -61968 -76258 -82957 -53056 -53539 -71297 -69879 -69331 -66222 -37815
12242 -37815 -25731 6855 21301 15352 -3930 5000 24939 5229 -17932 -31816 -30564 -49792
12230 -49792 -58936 -57829 -39690 -18028 -1624 -5406 -19739 -13592 18674 43567 54953 24110
12218 24110 -10527 8540 69356 125276 162109 144143 188451 189048 272640 438061 627829 886906
12206 886906 1197229 1419533 1542900 1512452 1320015 1052513 766050 527896 389872 327114
12196 327114 262013 195783 159402 147070 135837 104396 47540 3597 18784 23498 25894 30888
12184 30888 -9558 -67545 -30898 11190 25643 2478 37349 51025 35159 32937 62900 26213
12172 26213 -5093 -23129 -46514 -11568 24073 39109 28607 11092 -23820 -21984 6319 15251
12160 15251 -4831 1824 4371 -15035 -26198 -39273 -46806 -54745 -78265 -94759 -122900 -128850 -98366
12147 -98366 -85915 -69278 -57953 -33019 18644 -10345 -29801 -25026 -32356 -40235 -46433 -34421
12135 -34421 -59644 -62782 -54698 -62888 -75791 -69396 -27723 732 4003 -7150 -17860 -29257 -42141
12122 -42141 -32045 -26836 -14177 2052 15599 27763 39286 22208 -11557 -50931 -91742 -78538
12110 -78538 -56187 -27596 10581 30180 21188 45300 45853 1870 -29514 -53691 -71871 -36965
12098 -36965 -28996 -16424 26372 22334 12285 12017 28765 15145 -25770 15714 28068 -11632
12086 -11632 -43050 -39891 -24332 6507 3333 463 -13101 -32221 -49954 -52886 -60327 -32931 9549
12073 9549 39636 12311 -35335 -56489 -37345 -26798 -8525 -12709 -35267 -39045 -24241 1710
12061 1710 -46121 -59695 -58680 -29434 -7834 -7355 -20645 -16711 -34033 -27246 -22902 -22010 -25904 -35684
12047 -35684 -80322 -95080 -42799 -29966 -30087 -23267 -1707 -3459 -46726 -46915 -54702 -106571 -96824
12034 -96824 -37891 -32459 -11520 25988 -7168 -40619 -67334 -75415 -46689 -43629 -42455 -22120
12022 -22120 4568 -3724 -38385 -56008 -37748 -40014 -28149 -9441 -43168 -18853 -10463 -25485
12010 -25485 -44720 -27840 -45612 -26031 2425 150 -32388 -35411 -27965 -9666 11749 31038
11998 31038 9973 -9665 -12158 4241 4904 -33070 -67358 -48971 -27271 -15149 -3996 7308
11986 7308 35598 107 -34214 -45839 -48041 -66403 -64049 -48729 -43019 -9980 -21360 -19578 -6814
11973 -6814 -29625 -29165 -27419 -32774 -38703 -9560 -9995 -29399 -37950 6075 70389 56721 26639
11960 26639 5048 -28160 -46853 -21923 -10182 10160 -803 -9521 7882 -9129 -5079 1591
11948 1591 1614 19045 21592 15362 -2786 -33932 -62201 -29498 -20505 -23220 -15490 -26264 -31398 -4438
11934 -4438 25480 18115 -16533 -54724 -54767 -43599 -6491 14992 25641 14873 -5028 -17862 -26617
11921 -26617 -47092 -57160 -51743 -44520 -10701 41230 29560 -4445 -8685 -9153 21221 6320 -4672
11908 -4672 4026 40870 45823 50315 71106 65121 39857 33209 20294 53844 60385 43648 56441
11895 56441 37475 24993 20444 33900 42907 49920 54999 67234 83129 105669 104977 74571 52829
11882 52829 62947 88497 83256 69039 59896 76339 62795 52286 75129 74057 47038 52959
11870 52959 69495 99524 91116 91154 90477 107124 109123 90814 100754 86223 114449 142394 135702
11857 135702 140683 199523 285169 302475 335806 359449 413584 445438 466208 414815 359890 302819
11845 302819 258589 216748 213461 192004 158486 134426 104699 97981 119988 143537 114805 107460
11833 107460 111152 121574 113066 117569 84213 78734 76298 78153 71973 77138 68644 34787 44641
11820 44641 44275 47833 93095 117968 105994 68842 62769 59043 58471 47533 44747 21545 22905
11807 22905 12082 -18665 -14647 -17370 1442 6581 -7033 -7941 -3056 13463 6133 -48642 -30775
11794 -30775 -22784 -28104 -11576 -19262 4036 34814 43883 58142 36581 -13028 -30589 -24869 -25949
11781 -25949 -17137 -19584 -20551 -4472 -194 21076 20703 -30100 -29258 -8595 -1861 6327 25380 42865
11767 42865 13334 2344 -311 14220 13862 -2071 -31298 -30707 -26456 -1905 27320 28785 21307
11754 21307 23976 15711 -2259 -26751 -19568 40678 46336 16816 -2214 -11065 -18589 15333 27828
11741 27828 33513 51550 78875 74318 81692 85103 75340 56173 40880 27277 22359 19726 23262
11728 23262 22319 -8862 -10828 22206 -10367 -39623 -44031 -30766 -20950 -18865 5353 32804 51787
11715 51787 41182 23545 -17811 -53475 6797 -1502 -5760 -14145 -17851 48997 84532 81070 40256
11702 40256 34058 66852 46491 53644 33527 35737 22275 27876 44290 55140 87051 107473
11690 107473 72385 23420 35481 17893 -902 5250 5187 -23824 -37518 -40611 -35980 -28664 -55329
11677 -55329 10780 53170 28326 13663 2440 -14182 -12711 2403 15350 20470 46502 36211
11665 36211 56300 54183 48395 45778 62600 47984 50072 75314 96995 116505 115929 110577 113119
11652 113119 75143 17043 6473 17163 52328 74552 90590 80067 73822 65427 44496 21941
11640 21941 -17050 -24491 -870 45082 38841 11550 11042 38028 -3525 -17015 -40588 -49381 -24409
11627 -24409 -33569 -7916 1723 4614 11605 2842 -7351 -26001 -6385 30241 38457 74926 115567
11614 115567 114784 122478 114354 91148 91596 103787 54665 28360 25250 22062 -590 35610 84900
11601 84900 66636 49761 23781 -11050 -13179 6630 -14398 -5003 3208 -32714 -30928 -10667
11589 -10667 -3575 -5085 7987 1512 4729 -6417 -31510 -39266 -38143 -25711 -35598 -29658 -20651
11576 -20651 -25164 -21441 -34369 -39420 -33414 -14896 -12698 -16083 -19743 -15290 -2884 27247 41528
11563 41528 37545 77733 89294 46171 -11839 -8316 11203 12255 -2071 -13740 -41195 -25756
11551 -25756 -4741 13048 398 -8746 -9666 -1078 9800 27239 42994 70111 66152 78991 78702
11538 78702 30241 23145 45022 21386 -4080 5481 5827 -26942 -66785 -79626 -48060 -42593 -18358
11525 -18358 -12532 449 -18419 -40656 -24973 -5983 -23118 -48119 -48752 -58209 -64741 -38732 -45462
11512 -45462 -50284 -37873 -12032 -33306 -52036 -82947 -105027 -93230 -50309 -14312 -18390 -38029
11500 -38029 -46146 -31926 -23670 -29949 -21166 11226 -6488 -21085 -50533 -52215 -32185 -18713 -5733
11487 -5733 -13980 -14492 8884 -2894 3064 4809 -7206 -7390 16271 37572 31298 -2052 -27997
11474 -27997 -16985 6598 11232 -5920 -21335 5739 -7344 10857 20755 11530 4463 9818 19656
11461 19656 12015 -12685 -40755 1880 37525 34554 7453 -15427 -23934 -2372 -8373 -16878 -27631
11448 -27631 -48261 -10188 13720 -2101 -48868 -39931 -26505 -35592 -44383 -66534 -54758 -77849
11436 -77849 -68642 -39552 -10575 7140 -15945 -8090 34362 43492 68934 27411 9503 -21192
11424 -21192 -23709 -36590 1804 38252 29950 21760 25193 24904 17469 -24603 -37602 -33820 -20128
11411 -20128 -13936 -18610 -40144 -57090 -67291 -72203 -91523 -82705 -73920 -45892 -45629 -42665 -48666
11398 -48666 -56957 -54005 -24103 3291 10124 17807 2 -48108 -34352 -22027 -13375 1705 -13654
11385 -13654 -17020 14973 40059 75470 41264 24061 -26331 -21200 -11369 -202 3221 -5801 13945
11372 13945 18759 -21594 -17811 -21822 -28231 -2673 -1255 -248 -31507 -37195 -20748 -24635 -22664
11359 -22664 -18884 -2342 -30510 -71819 -55162 -32664 -24348 -23136 -31391 -14272 -38717 -48127 -39859
11346 -39859 -15780 -8634 -4538 -13166 -58047 -64332 -34335 -40925 -55177 -42821 7829 28090 -26367
11333 -26367 -42005 -41500 -81924 -88934 -65451 -19115 6243 43644 27685 34935 28963 2648 -7427
11320 -7427 -3935 -16446 108 13432 14129 14821 -2612 -9289 7490 9758 16019 9092 9170 4281
11306 4281 -30996 -58098 -61099 -50973 -26688 -26391 -13169 -8762 -10989 -3426 9172 8074 9586
11293 9586 22923 41694 -23055 -48429 -36320 15990 47407 -25108 -44542 -57453 -39384 -37143
11281 -37143 -48191 -67933 -71501 -74783 -89434 -49837 -41890 -24125 -26468 -31765 -30183 -6604 2833
11268 2833 -30165 -58926 -69766 -54873 -71237 -82844 -40773 -20900 -4130 18231 19422 -798
11256 -798 -1246 576 -11760 -46561 -70563 -33001 -603 13675 -11646 -13535 -28804 -24973 -16318
11243 -16318 -9862 -11435 -11485 10631 7763 28859 -2494 -9369 -29454 -57273 -45317 -10355 2583
11230 2583 35370 25534 -16916 1181 -16405 -45850 -8887 26541 38042 38970 30458 -15162 -31493
11217 -31493 -21224 -30242 -48080 -28849 13655 3236 6173 11584 22174 10903 13216 38135
11205 38135 47263 -13056 -52441 -17702 -14561 11091 5837 -14312 -22444 -33379 -60900 -64439 -55417
11192 -55417 -65616 -71074 -77403 -82023 -46039 -36115 -24195 -37772 -43514 -36329 -26436 9098 38730
11179 38730 30489 48722 44250 12188 -3921 1697 4918 -11900 7365 32204 23205 2793 -17381
11166 -17381 -42557 -29333 -53148 -23306 -3627 8848 40758 34821 10214 -20868 -17824 -41235
11154 -41235 -28711 -29697 -4227 18320 7735 -13213 -43606 -50453 -43760 -31611 -10180 -53452
11142 -53452 -52151 -35309 -26688 -27628 -11670 -35654 -58277 -42840 -2211 -4189 -13314 9103 -22130
11129 -22130 -37003 8881 40693 43927 26394 805 -11875 -13342 -8008 11050 22923 14677
11117 14677 -42154 -75069 -81398 -58187 -44671 -34364 -57265 -29971 -28877 -10869 6401 -32077
11105 -32077 -40462 -11999 -40099 -57566 -6273 -779 -4345 29191 24826 -6452 -12917 18959 36832
11092 36832 25884 13190 19843 -4673 2275 -4999 -11676 25387 50185 50410 27329 18101 23459
11079 23459 46076 20717 14087 30954 37920 34377 54046 58684 46267 14661 -23457 -28575 -38298
11066 -38298 -34967 -14683 -24622 -34281 -38763 -129 -6647 1181 16460 33548 5093 -10381 12812
11053 12812 6822 18466 -5433 -29260 -14997 4037 14569 8262 19408 -8992 -18752 4125
11041 4125 40700 51634 50027 66724 41594 31632 -5304 -19477 -13755 12942 48725 21682
11029 21682 11381 11574 46809 47243 75487 60433 13470 -14516 9443 -349 19061 42995 43276
11016 43276 27038 18285 16070 37527 82740 70216 63063 56377 68799 51589 35315 26212 35405
11003 35405 63343 68911 68804 38625 8207 28272 42173 46264 32281 -18962 -30418 -794
10991 -794 10484 1189 6406 -15191 -16971 701 35009 43440 12416 14625 17389 -5271 -12300
10978 -12300 -22610 21177 71138 97468 106771 73704 21597 -8757 -31029 -20173 2035 4850
10966 4850 -21235 -1817 8150 11565 33091 38588 46783 41285 7408 4446 36130 47725 21897
10953 21897 25791 33211 17827 18244 23883 5953 15000 11178 -15952 -64301 -10079 38626 27449
10940 27449 -6614 -58394 -43502 -44790 -34564 -42120 -79504 -95787 -75446 -69133 -55114 -37941
10928 -37941 -23640 -2436 -5276 -20201 -47409 -76178 -36945 7540 -5398 -14915 -14107 935
10916 935 3092 4503 921 -19729 -18802 5573 14837 21254 8947 -27487 -47464 -45155 -57062 -39360
10902 -39360 -28754 3661 13870 3222 -1540 10171 16638 16184 35041 27185 36068 11386 -4798
10889 -4798 -2023 -14381 -15580 -39995 -54635 -63698 -54929 -13856 -17277 -43964 -54057 -40528 -3632
10876 -3632 -42260 -35494 -11904 -57039 -40855 13276 4387 -28212 -13646 9494 20717 41371
10864 41371 39086 22867 9722 -5501 -4639 565 -14881 173 -8685 -33730 -19392 -37772 -36434
10851 -36434 -40409 -42125 -37684 -39352 -25365 -17098 -27853 -20883 -22308 -40627 -59505 -26886 1732
10838 1732 4346 -9304 22224 49547 43121 17344 -9999 -53743 -63612 -69205 -46212 -3627 13853
10825 13853 -3325 13339 26567 15258 -2266 -9061 -24800 -65245 -68457 -42899 -10686 -2965
10813 -2965 7084 3559 -7321 -27523 -10871 -29894 -22905 -42241 -53812 -33484 -10004 -30657
10801 -30657 -48844 -25927 21575 39455 13904 -102 14261 -10295 -3557 14969 -4261 -12330
10789 -12330 -24808 -28919 -26109 -18232 -39232 -33120 -13961 4530 26557 16023 -4557 -15148
10777 -15148 -2984 7964 10584 26757 3621 2527 -14122 -45041 -44795 -33951 -24497 -17111 -3389
10764 -3389 31283 53143 64798 74253 38936 18566 3536 -5425 7047 2341 -37886 -29881 -21217
10751 -21217 -24798 -32014 -23058 3124 35615 29518 9336 13097 20989 19025 31041 8370 -21025
10738 -21025 -20020 -20862 -23613 4686 46328 46831 22603 6602 8525 8787 47510 59633 50680 31996
10724 31996 -19010 -10353 -10931 -31768 -20670 -11407 -21381 10627 25821 3533 16765 25200 10561
10711 10561 10044 31316 51024 44829 1215 -19040 -37820 -38372 -33490 -20157 -10170 -5906 979
10698 979 32633 76048 76180 41663 24528 38453 33277 30744 10672 31437 56253 63799 55183
10685 55183 50757 80631 103662 117188 107921 100428 103256 116882 112917 95184 111880 145099 128146
10672 128146 123174 123246 106323 124691 147370 180312 227968 217438 210148 224916 230517 228527 219370
10659 219370 227733 240790 231715 221479 222941 221669 226997 231062 220949 245086 240749 243348 233618
10646 233618 193017 166864 166222 181961 171828 166169 155698 132975 102217 90587 110503 103226
10634 103226 109804 129105 116516 79158 56936 41485 50190 98261 111085 67693 57935 84020
10622 84020 106767 99935 61175 40557 18018 19133 48290 47946 29933 53373 78501 87092 62879
10609 62879 40201 18090 779 11054 25661 13363 24208 20864 15301 21321 3825 27926
10597 27926 77984 58390 33027 14396 16949 36659 79180 100416 82324 63892 62245 16321
10585 16321 2234 -3965 -3725 25054 22468 -19367 -23196 -31144 -34591 -45738 6286 43719 55392
10572 55392 52025 69375 37131 23166 5084 -10160 -11261 -16070 20600 40745 31510 9266
10560 9266 2016 22747 6684 -1774 2446 17201 2872 6655 12448 54322 44895 46222 70538
10547 70538 80813 54593 22779 -1259 -10458 18759 37287 11809 1062 -1297 6970 1707
10535 1707 -5631 -19303 -21635 -4144 32702 12499 -15419 15840 19333 18178 8240 10197 30906
10522 30906 14071 31192 46470 73352 80781 93805 67812 84286 83003 75730 32692 12059
10510 12059 51824 39502 38760 49900 52392 48202 38494 30680 213 -11568 7341 22353 28412
10497 28412 31110 40341 28541 1359 3072 27415 22698 13162 -12400 -11254 1143 21573 8740
10484 8740 6849 22252 28871 81541 98450 68226 47834 30201 25543 26646 50949 69895 55967
10471 55967 24296 -6530 -34464 -24212 15588 25582 14344 12564 20120 35049 48844 43835
10459 43835 11125 -15479 -28670 -32550 -9683 876 -1360 -21629 -40932 -60068 -53814 -15279
10447 -15279 13253 11704 33923 47989 22340 -1664 11976 40170 -12570 -36518 -30550 -46670
10435 -46670 -56271 -61029 -42180 -6400 -2811 -10205 -9628 -18406 -6218 -21731 -38393 -22561 1118
10422 1118 -15361 -3467 18422 14343 2973 -30645 -30638 -22376 25271 31702 47473 44017 -784
10409 -784 -15753 14160 42782 24685 20720 38899 55430 6713 -6597 -10629 2049 4540 30121
10396 30121 7197 19661 23505 2647 -10933 -13127 -26483 -43853 -29957 -33422 -14003 -29536
10384 -29536 -36614 -39543 -18248 -26620 -1846 28019 25318 -6789 -17374 -43497 -59117 -57563 -59633
10371 -59633 -36924 -16894 4619 34716 22127 -9813 -16585 -11683 -1567 7692 17586 -3777
10359 -3777 -34056 -3953 20252 20931 23371 17875 39357 42691 11989 7810 14478 44526 71841
10346 71841 46898 34731 4111 -3374 -14985 -7383 -6947 -8922 2834 23268 42302 567 -23728
10333 -23728 -56558 -55584 -11904 9225 9865 49085 74838 55983 29074 4884 32277 56611
10321 56611 66272 61676 41877 11740 159 -23781 -22533 7254 21829 22139 -1207 -29722 -10816
10308 -10816 -6176 23801 34319 43230 49152 25458 2492 478 50678 59026 41856 42751 35595
10295 35595 57336 62800 57464 63861 97586 98319 108525 83458 42581 23761 -44123 -51049 -13301
10282 -13301 23750 24878 45789 64955 85462 89402 107809 115137 66523 37142 11945 -10521
10270 -10521 -19805 -16980 32304 78996 53306 20931 40256 31222 8614 -2226 -13410 9915
10258 9915 29686 30741 23223 28890 17573 -17220 -22571 -5410 6976 18331 18670 46189 55292
10245 55292 21264 39898 70546 79978 69617 50539 29568 20355 35598 39526 37028 42988 39482
10232 39482 53772 36362 726 26697 67326 57226 53100 38315 42380 60021 46879 44628
10220 44628 73050 50249 12498 5325 16789 41934 53667 44092 41257 22881 34007 51998
10208 51998 56472 22456 16302 16833 14742 16466 -16265 -7379 -1201 -9001 -24384 -40565 -21143
10195 -21143 -4777 17221 -1833 -23392 -13263 -9013 16124 284 -17767 3158 21732 15314
10183 15314 26093 15281 -33516 -36417 -9647 -7437 26635 36916 33523 -6505 4770 40656
10171 40656 107979 113886 90464 81386 45054 40024 65319 37661 25399 16701 28416 31666 36969
10158 36969 19415 13723 22172 30720 33709 44747 37348 25445 20538 -13379 -797 1321 -11114
10145 -11114 2163 13342 7310 7440 -6415 -15472 16667 25890 50359 56963 53039 62032 74200
10132 74200 42864 30968 8738 15161 14517 -4990 -34918 -47517 -338 27355 20020 32430
10120 32430 44808 32774 33121 70294 77222 44848 50436 69146 67731 50283 3742 -12681 4970
10107 4970 12020 16264 -481 -9055 -575 -8711 -21538 -24675 -21489 -8592 -10200 1619 15182
10094 15182 12036 8965 27088 34393 12844 -350 16402 40158 23413 779 2909 -16269
10082 -16269 -20546 15518 41329 17490 9614 23663 -21011 -11951 -11834 -10419 20443 36491 26536
10069 26536 41749 70080 38333 11617 -37568 -52715 -30439 20293 57660 68733 83493 65745
10057 65745 73693 77535 74317 40606 11164 16116 2115 -35504 -26679 -14381 5227 17069 55277
10044 55277 33211 -11753 -979 34262 85614 89787 41910 -6707 4678 30562 49615 61983
10032 61983 47044 44706 52449 47180 30278 -62 -16589 16427 37298 37017 57130 71031 51428
10019 51428 26348 23034 16505 -1412 26389 -412 14953 -7950 36194 43716 38917 47955 34683
10006 34683 29165 55345 32362 18547 4728 -3942 -20677 -34473 -38496 -42622 -50475 -32744 -9536
9993 -9536 -7101 -2282 -1761 15158 27014 9815 3061 -1268 11578 11681 38476 17376 17154 49497
9979 49497 30197 -33610 -41106 628 19321 33673 43296 46438 20305 -5745 -1128 -15818 -3572
9966 -3572 8800 9516 13827 49748 65523 72246 46443 15012 4820 16780 4669 -26272 -1332
9953 -1332 21612 25558 32387 63073 53824 27259 48032 36661 21650 46320 51459 32662 21482
9940 21482 21068 -4161 8998 27532 19434 10398 50708 38179 19164 24641 13095 6781 16917
9927 16917 46060 52266 41584 18369 12199 -2675 -535 -43607 -31868 -46195 -27877 13923
9915 13923 12773 10296 10905 58458 58039 92089 90309 69771 42366 -14066 -6126 -12075 -15374 5440
9901 5440 43636 41503 63934 63493 25953 14885 7608 -8735 -766 -2909 -30744 -28321 11048
9888 11048 18739 22553 46239 25702 23257 56240 89510 97602 105161 86812 82297 82986 64349
9875 64349 79495 83176 98928 82536 78314 78976 68878 35598 37446 47935 62451 60317 54589
9862 54589 88311 78056 66018 60448 85262 90832 110560 127378 121310 84002 75784 64450 68047
9849 68047 105265 141451 171772 199078 271934 357585 565886 829868 1132181 1308253 1156997
9838 1156997 833506 550548 361662 232390 200956 188515 198528 189006 135761 97731 89165
9827 89165 109243 93843 73063 91257 128843 128100 126854 156830 118276 53687 14768 5444 7618
9814 7618 13786 7428 13355 4763 13134 60556 70424 92525 146014 139097 125004 91552 45497
9801 45497 15494 26422 54183 78832 63433 42439 47339 55286 44102 40056 20438 -389
9789 -389 2152 12931 70213 74779 50990 19926 11475 34485 67688 47917 57126 94212 99344
9776 99344 85261 42842 17590 38339 55051 49505 31617 41693 33932 54451 93086 77160
9764 77160 36917 26674 40471 27178 51881 83478 92432 89524 68017 49174 78654 98449
9752 98449 106138 98012 98056 111985 127167 99636 66474 25451 10355 -3296 -1804 30516 35784
9739 35784 39828 37061 23211 44095 57193 60545 52907 34249 19265 39886 74261 93041 92416
9726 92416 112273 112791 98958 101983 93488 66438 47569 57418 68828 71746 82715 91040 56428
9713 56428 43249 51067 50795 24049 48817 97949 121739 127838 115894 86186 76613 58360 -2647
9700 -2647 9010 58850 62899 54643 62396 68821 21540 1461 31804 60027 84797 100603 108530
9687 108530 125225 97895 89161 65454 54920 58792 39876 18367 52383 58857 45668 47427
9675 47427 58867 51288 12749 20720 61823 55763 43089 38586 45311 25260 16590 55469 58204
9662 58204 47922 30383 17468 32516 48577 75200 64456 52574 75126 80160 80884 77385 95879
9649 95879 76746 87074 101952 102962 122502 150264 138051 96315 110336 111618 95370 78208
9637 78208 45084 55024 82426 82053 98316 87144 87319 133380 122652 115364 127889 123917 96357
9624 96357 74721 44147 37706 70897 114524 127107 133883 119514 91892 63134 64308 69218 87380
9611 87380 88429 103573 131014 141207 100221 82658 84739 111386 144254 134127 127144 132544 152346
9598 152346 123217 71893 73842 102880 124980 151622 154522 158212 135705 134226 168024 193046
9586 193046 176852 160073 180912 179558 155487 144852 176560 197930 182538 190345 183670 124370
9574 124370 62037 76847 113983 130172 129448 154928 189272 179824 169951 201318 236208 219585
9562 219585 177584 183201 193310 183631 182878 235061 232068 187790 141643 146526 178904 176000 200120
9549 200120 207063 213041 185268 177290 180209 191704 209797 216608 246745 245748 208020 211085 212350
9536 212350 215386 219743 185130 174593 175335 170363 188435 241224 263614 270542 241330 213500 192068
9523 192068 232117 240673 230082 235033 227241 251966 250699 216665 192764 209015 218370 226566 254467
9510 254467 251264 233303 234005 250715 265754 282773 256669 220186 192646 189416 232888 248130
9498 248130 264506 276980 286842 305422 312552 304387 296606 279400 271209 289432 326386 314579 295539
9485 295539 294933 301065 291139 255297 252035 271896 298911 306028 260139 261033 260803 293684 314851 345656
9471 345656 335023 300457 286636 288416 312096 354536 359883 355511 365632 341218 323874 330971
9459 330971 344776 327111 302376 308276 335981 370083 395569 387949 394085 393410 368901 331562 327321
9446 327321 333894 378399 409967 367754 372138 371905 383689 379709 385470 368890 350508 370135 394343
9433 394343 408376 420976 436894 461363 469343 485186 502500 502356 496329 455716 441589 473977
9421 473977 487919 479020 479517 495079 565217 605292 564002 562008 572449 574321 586734 611208 573114
9408 573114 565470 604994 638528 662086 654412 656995 700392 722406 757433 753652 738285 758846
9396 758846 768942 765499 800686 790010 797183 816760 846159 866963 892561 946916 964175 962058
9384 962058 929488 936565 988570 1029441 1047283 1080850 1116642 1187393 1206145 1242565 1285792 1325201
9372 1325201 1360012 1369500 1436295 1511952 1575107 1587178 1612626 1662632 1708925 1755697 1806747 1875476
9360 1875476 1922932 1939005 1990336 2055179 2121546 2215510 2299151 2421318 2530266 2604579 2668755
9349 2668755 2750363 2871194 2999243 3134057 3279954 3427013 3578435 3721815 3905625 4073832
9339 4073832 4235639 4441173 4663371 4919200 5155382 5413293 5758328 6081542 6410199 6807328
9329 6807328 7208247 7636842 8124326 8641845 9168869 9747511 10381559 11027408 11757799 12552868
9319 12552868 13340736 14131506 14971792 15862998 16708647 17481039 18223162 18892618 19461450
9310 19461450 19932863 20270408 20425773 20420909 20275972 19955224 19479541 18907987 18201573 17448316
9300 17448316 16691349 15889042 15060656 14276326 13520846 12787786 12040879 11335343 10725394
9291 10725394 10119154 9466837 8913139 8418670 7992402 7593189 7189330 6791924 6470880
9282 6470880 6168470 5854427 5546387 5286975 5036524 4836182 4634081 4416057 4202415 4006078
9272 4006078 3851170 3686306 3512168 3372029 3238651 3115758 2997582 2922373 2837658 2715878
9262 2715878 2589828 2499841 2388011 2301162 2237512 2170814 2111243 2046755 1956742 1888898 1825399
9251 1825399 1757948 1718909 1665559 1644047 1611459 1590946 1511483 1438511 1378641 1360508 1342031
9240 1342031 1293664 1241473 1216413 1173762 1143625 1131165 1095888 1066118 1029376 981583 934501
9229 934501 929119 898276 892396 883717 845140 832136 824622 811026 780517 733133 728226 733800 709551
9216 709551 698522 657885 658990 691866 667735 637568 643113 654655 681727 641328 589297 551289
9204 551289 558698 599884 620771 615920 588234 532735 505497 482577 482579 461964 449011 450064 415832
9191 415832 382021 351604 336307 333259 350049 340924 362715 389264 386817 379122 388386 379479 372128
9178 372128 349558 329183 332957 340250 349786 347496 334167 350923 349563 322402 294921 258055 256514
9165 256514 292049 320221 297749 263602 236580 220655 208109 211046 201006 188011 202977 218372
9153 218372 219153 190286 144174 160455 175869 181856 231990 237236 222920 208335 176921 162209
9141 162209 160525 181247 195822 209605 228025 212026 191171 144870 108466 122970 147368 176697
9129 176697 168213 145506 144833 96476 66006 65199 82986 99658 64931 73009 115328 119627 90748
9116 90748 90331 122111 123420 152537 148005 173954 204619 222029 252833 272990 280694 242380 179646
9103 179646 177188 144297 121577 122922 115040 114416 123687 75282 49604 56194 85712 114438 118506
9090 118506 95872 89710 90616 119741 92758 58521 54248 67301 101176 95493 83404 92982 85589
9077 85589 66127 69477 91774 77625 76335 49757 61623 97959 142611 143980 146679 125077 156690
9064 156690 235333 322275 355790 367812 310648 250117 213007 145568 82184 86213 112801 145381
9052 145381 155770 128464 119409 129659 135358 138431 132620 112516 71595 90359 73999 56865
9040 56865 89416 93985 95244 85599 74544 113755 128318 120299 101872 83367 55743 65757 85178
9027 85178 89720 99947 84754 44868 57720 64563 34061 15613 29359 92804 143652 184771
9015 184771 187711 172229 132043 112142 119510 133560 137868 99856 94456 107596 135270 149234
9003 149234 126940 99582 100869 96776 87092 87864 74491 58509 65335 76193 17188 24812 11995
8990 11995 14975 31658 57162 72018 52275 76032 74979 70201 65328 48309 38457 40611 46322
8977 46322 36674 49516 60201 68785 64563 89004 101692 103865 111314 141594 163095 152999 129657
8964 129657 90999 68616 62543 37811 20351 -14985 -22111 15771 41801 28830 41698 52912
8952 52912 42345 25229 10043 34659 80083 85095 39813 40113 70207 56667 49324 57127 40600
8939 40600 57201 49734 54316 52833 69265 68014 48182 63407 83147 75405 60435 48774 71822
8926 71822 82739 73125 67687 77524 59310 42479 44434 43200 87365 89663 78347 89301 70334
8913 70334 79995 88442 57567 63078 79880 85727 81971 50578 91956 95945 93673 56743 32546
8900 32546 26978 24396 27138 61532 104958 109230 73533 85114 94951 57759 73611 99230 89958
8887 89958 79516 102229 136086 132534 89168 56495 45241 37888 24416 52832 65845 64006
8875 64006 81248 94410 106033 101217 44955 2359 9228 66999 91368 88614 58403 50536 56679
8862 56679 82666 99916 114688 106848 108641 158200 234605 299173 324099 294605 229548 186290
8850 186290 134228 86875 48394 -8126 1779 21763 31137 42718 41930 32631 41696 16253 20356
8837 20356 40348 50947 64030 44432 66042 61516 23355 -14717 -1986 27850 35303 50828
8825 50828 68024 40384 45654 48057 34519 14746 -3875 -11276 -3796 28638 43427 14595 7875
8812 7875 25154 47078 50740 25756 24477 45207 73548 82169 67106 24560 14618 10206 -1113
8799 -1113 9670 10482 13276 7812 12720 22681 27369 56579 61473 70114 52998 20124 -3370 24082
8785 24082 14592 -10289 4243 -11849 -40454 6602 55069 79413 85441 76109 91836 46112
8773 46112 30618 46285 33035 8676 -11232 -4457 -10541 -19213 -18178 318 17587 40472 50680
8760 50680 45741 31081 27730 32252 52249 76111 102688 81692 46331 66686 98696 71456
8748 71456 64158 57946 62334 60874 57045 28380 34313 59447 59525 35321 52478 85105 86239 55697
8734 55697 35344 32784 70587 64709 31972 -4097 2562 25013 42037 33659 -398 -31500 483
8721 483 34848 21981 11357 51961 84828 98658 112688 121547 122071 131656 95765 85296 81504
8708 81504 48812 22311 46269 36478 34937 40205 63142 57688 42583 57065 66770 54821 78613
8695 78613 82331 101511 111875 90521 109574 99001 86187 95229 101536 137978 106640 117261
8683 117261 129672 148574 133016 148483 154756 169540 160276 114187 99435 116807 138498 128084
8671 128084 139774 126855 129712 123618 100253 67940 92370 120455 142478 163991 146862 103584
8659 103584 106264 94474 92337 72161 102861 164934 175675 178584 200793 224820 236869 243648
8647 243648 219372 249837 286634 257084 244763 254657 289051 373585 465831 526815 496433 396518
8635 396518 310295 299156 263199 263495 269737 294841 334418 314532 285762 271172 264632 262425 263892
8622 263892 286219 313450 300000 271230 287986 344922 402342 432020 451858 473847 484156 544903
8610 544903 602993 607048 598135 625313 629009 609393 617308 660684 665826 618480 619953 616973 627641
8597 627641 637935 693725 805760 952923 1099000 1074854 907698 734097 647426 617295 577550
8586 577550 540963 529640 517674 464123 419499 381424 379500 348738 347756 335106 307027 293566
8574 293566 285225 303703 286571 222259 182854 170468 181855 189794 166137 162498 155163 169440
8562 169440 142221 114838 80505 55647 73191 68088 90484 70875 91843 148945 202435 235586
8550 235586 259426 353768 452004 447862 374282 304437 276445 236346 218197 195703 172689 128627
8538 128627 114626 76814 68697 95847 92604 84194 109095 103078 70982 72066 101591 87670 64585
8525 64585 66097 99430 97400 70141 55933 63475 95385 115807 97715 62678 43912 3683
8513 3683 -12792 -3809 11018 2516 3368 36837 50982 53246 88094 86506 97003 87250 51316
8500 51316 41962 54853 106305 120344 90887 43938 9624 -15299 6083 57396 95628 70528
8488 70528 20493 565 14458 16280 54674 59577 77465 82723 83457 87926 115179 82865 15825
8475 15825 15636 50551 81029 53366 33027 36945 19151 675 23920 40593 36108 66225 79231
8462 79231 84001 65576 51240 63122 52620 26824 52752 64853 97385 98574 96122 96671 103613
8449 103613 127320 86175 71867 64832 89520 79717 93833 96733 83564 57305 61607 45704
8437 45704 61223 42990 40029 26538 -2076 28831 40791 34937 63115 62824 46954 53616 89863
8424 89863 126741 180504 233184 265348 260640 193026 164382 120223 110276 107637 99693 97964 59408
8411 59408 43441 42914 73036 120531 140794 109236 69506 55383 63919 82472 96798 113044
8399 113044 134178 121869 115720 103328 108364 118128 96004 113984 147471 155912 115119 106856 109809
8386 109809 117468 115281 100317 126793 177418 221801 211521 247565 288008 336320 427000 475833
8374 475833 437805 335948 274739 245427 235356 210858 149357 94596 94712 62653 94110 61174
8362 61174 55664 68312 102612 95026 69856 16448 11794 23998 26742 38745 19129 -7800 -15663
8349 -15663 24824 65744 57152 37297 44055 51880 41042 63594 93708 71340 77578 105926 140567
8336 140567 131764 190195 226234 244209 287074 320429 346878 322125 289419 215501 150674 111060
8324 111060 102037 119514 92485 56439 46493 51826 49654 27525 10886 10061 4539 21308 7539
8311 7539 -15114 -45465 -34289 -5276 -543 4206 51755 59097 73569 69252 43319 18521 17524
8298 17524 6044 825 16917 49754 45193 22090 59457 89001 89223 94986 70608 83701 98908
8285 98908 70031 70885 37485 30627 14290 -26045 -14222 -22238 -30116 -2141 -2001 -18162 9625
8272 9625 50030 10312 -19513 9836 -1755 -7278 5678 18517 36305 32979 23976 36017 26760
8259 26760 27016 20992 -5565 -21939 -23537 -29983 -65907 -80082 -36979 -21124 -34100 -27847 5851
8246 5851 1673 19212 36343 29470 51981 58376 47849 12889 -14278 -35468 -25598 -8803 18182
8233 18182 32958 32981 19051 -23058 -50337 -77420 -96789 -85423 -34781 51022 65397 63091 39876
8220 39876 -7251 -34964 -18935 -19129 -8270 31178 17224 18191 50111 91583 47718 9327 45765
8207 45765 66436 59070 45029 14625 24179 28769 20305 -17256 -30221 -19845 -30010 -47883 -35638
8194 -35638 -25428 -26255 -7103 -22915 -34535 -63121 -40729 -25901 -31068 1462 5534 -10265 -1761
8181 -1761 3869 -33379 -17764 18334 -13929 -58612 -80097 -70736 -48028 -13980 -22485 -2635 24891
8168 24891 31493 4764 2145 14403 19933 24245 20255 -10844 -7718 -43675 -31830 -17174 -13324
8155 -13324 -9439 15906 44932 31387 3821 1152 -5637 45258 104091 114873 105460 78962 26764
8142 26764 -4158 22732 56883 54575 58401 57161 26614 27415 30493 2636 -9439 -23385 -32351
8129 -32351 -19511 -10646 19772 24678 41318 27293 7742 23134 25669 -443 -21363 5492
8117 5492 31696 31821 16981 9659 37514 30669 29489 25338 33665 58913 79258 125965 152653
8104 152653 91951 5085 -8757 -26469 -1018 4115 -1052 -12773 -34086 -44279 -24153 -42561
8092 -42561 -31297 12202 18476 11491 -6553 4343 -18197 -10720 -26039 -13799 11532 5707 15061
8079 15061 13630 -10598 -8571 -9490 -26915 -45031 -27173 -322 27169 21856 35689 25788 -6172
8066 -6172 -2166 -3341 -1408 10747 20128 15899 24226 17912 30915 39273 57951 51247 19294 -4188
8052 -4188 17522 58096 64737 40471 46294 37664 57564 122290 159844 179379 184194 197397 212454
8039 212454 227648 237971 239820 227693 208462 219484 232325 230100 235842 251425 260780 230176
8027 230176 193064 196984 202374 152477 159519 171194 168636 174408 181372 196234 217580 204157 164264
8014 164264 131747 136172 145111 147576 144727 153509 184654 241300 288682 312745 316200 310616 323295
8001 323295 402893 457534 460617 529225 674067 789919 847408 807908 721494 634126 558420
7990 558420 495621 437753 408843 416059 473391 528569 626516 692592 697274 590458 444763 353585
7978 353585 270267 215460 187956 160449 180987 194040 215326 187993 149447 158155 181987 179363
7966 179363 202415 191069 161895 176979 162229 143581 171554 206301 247062 301069 353242 392505
7954 392505 432776 494835 568781 581462 586238 580508 554904 521076 486837 448325 409460 413148
7942 413148 504769 567215 528908 482069 434790 380262 309716 245193 184852 177048 158383 108252
7930 108252 85909 113838 116914 52011 57868 73964 61191 79124 96885 111496 130875 108865
7918 108865 85449 62508 64881 97215 148780 184564 209114 245302 273452 270739 252522 218166
7906 218166 175643 172438 152927 145607 163514 157784 138760 116514 82110 75991 38509 -5088
7894 -5088 294 -10623 -1581 -11866 5429 8717 -9873 -3490 -9847 21043 11396 14875 10939 4473
7880 4473 -277 12326 20834 26706 -14424 -51227 -50038 -26148 -18768 -12845 16748 46632 69913
7867 69913 56136 -366 -5164 16444 24836 7465 18707 29677 31962 47623 9007 1899 21118
7854 21118 19212 8784 16238 24569 1631 -8880 17333 28907 -9810 -22751 -11325 21209
7842 21209 22516 -4466 -56733 -61115 -14264 -5786 -1969 -16 15533 13233 18137 7854 9051
7829 9051 -12119 -767 16573 1315 2145 -9908 7653 10112 -7708 -4138 1050 -22 1843
7816 1843 -77001 -131205 -104393 -73282 -46066 -26887 -8242 -12774 -25406 -75077 -84105 -60677
7804 -60677 -32510 3519 -10381 8678 33224 7046 -16129 -7579 -5626 -1666 -4120 -23743 -27054
7791 -27054 -25103 -21207 -28253 -32016 -594 3483 6047 1398 -28292 -40299 -55301 -24074 -2775
7778 -2775 12017 16444 15004 29378 19450 -1981 -49537 -40866 -27161 -36976 -36094 -24291 -11563
7765 -11563 1730 -18799 -20880 -31004 -46917 -47769 -38580 -53887 -53862 -27199 -24081 -25563 -37733 -27179
7751 -27179 -2931 12230 19062 4668 11679 1767 6838 1740 -44323 -49608 -60221 -44344 -27015
7738 -27015 -28019 -4959 10323 16980 -3564 -33317 -75993 -74570 -55601 -61953 -69507 -46025 -30179
7725 -30179 -28507 -39468 -54291 -35369 -7610 15180 -9460 -22254 -6625 -25864 -37454 -34320
7713 -34320 -33866 -47266 -36129 -29045 -52396 -68571 -107719 -94078 -71652 -55352 -20682 -17041 758
7700 758 19551 9783 11842 -8879 -39648 -34788 4293 36281 36525 43970 46095 18387 14874 33626
7686 33626 22552 31857 3219 -36902 -24067 -12120 -26135 -23459 -12549 -13539 -62167 -81548 -58671
7673 -58671 -42290 -27906 -20003 1418 9244 -11579 7749 27374 26234 23084 -1340 -37239 -56651
7660 -56651 -84429 -71905 -46214 -11788 -14151 8831 37382 46236 43376 27986 10846 -8576
7648 -8576 -16228 8791 24351 20224 18642 18867 13495 8500 -7909 4314 32011 36041 19075 -4810
7634 -4810 16825 58622 33925 12008 2901 24057 22346 24577 24250 413 -2817 -16355 21849
7621 21849 48111 29976 24314 -4488 -7370 -315 4998 -33223 -26110 -17709 -4381 -10986 -15161
7608 -15161 -8888 -3524 -26371 -24405 3381 -13973 -4928 10273 18536 16081 12723 -4574 -38619
7595 -38619 -24882 -5180 -35606 -31190 -3471 5989 26329 20310 2843 -25424 -48123 -20508
7583 -20508 -11504 -8244 -11589 -27119 -97929 -95532 -47850 -18775 1057 2025 -18666 -25508 -15222
7570 -15222 -15860 -6021 54332 37613 13165 5145 -2031 -11079 -24513 12531 17462 25333 8327
7557 8327 24690 17902 -22425 -18826 -24855 -38513 -34956 517 6560 6115 -476 -15518 -712 20440
7543 20440 17237 -26064 -39905 -14787 7329 23029 -9317 -50673 -50268 -60795 -24549 8083
7531 8083 -3836 -11572 -3661 8392 3291 4627 16350 30063 28345 3695 -19447 -39519 -6868
7518 -6868 15340 38860 36267 11348 10468 7335 25316 3812 -38336 -48379 -16496 -5099 23059
7505 23059 32068 30268 19190 5599 -7087 -8200 18624 46986 45403 -6685 -19192 -26773 -25986
7492 -25986 -2098 -15218 -37329 -24081 -12656 12559 7725 24981 24265 15425 40620 22551 -15422
7479 -15422 -8699 262 2787 -14619 -33983 -46731 -65585 -77365 -66961 -54800 -38914 -38949 -59068
7466 -59068 -53765 -29074 -58258 -71312 -66536 -41634 -50480 -48201 -23488 -23627 -65126 -75960 -56167
7453 -56167 -26355 -36399 -35141 -18005 -14726 -25577 -23196 17560 10818 5595 -3486 -14309 -15758
7440 -15758 7665 64906 35572 -609 -14429 -9574 1574 16694 6120 -22101 -42424 -10931
7428 -10931 31034 44265 48147 -8383 -40300 -71538 -78148 -78778 -67026 -34006 -4626 27258 40388
7415 40388 42653 56175 49191 37832 42333 46794 63617 24984 20647 20816 4038 4261 -21945 -45495
7401 -45495 -36763 7448 44373 36349 -17279 -40712 -57026 -71815 -88654 -60185 -40358 -27077
7389 -27077 -19738 29753 31300 62657 63030 20589 -19640 -15212 -210 37176 54757 20788 -6805
7376 -6805 -13150 1398 -22892 -57311 -58675 -12896 3559 9569 -3848 448 14569 18268 -4155
7363 -4155 1549 20579 9323 -26520 -33751 -6396 -14393 -34923 -49693 -33704 -9997 -14516 -36991
7350 -36991 -43603 -29045 -10155 -26165 -30106 -58997 -87557 -88315 -48721 -32976 -17181 3695 11461
7337 11461 -49943 -65707 -36281 -26554 -2085 24690 19107 46451 48083 30636 39587 33403 -15634
7324 -15634 -32140 -2997 36643 9276 -2365 7421 17759 -15849 -26689 -27339 -11224 45703
7312 45703 39577 46179 58036 33505 18092 -1065 -36671 -50661 -41292 -39556 -19577 19101 -22277
7299 -22277 -28569 -35538 -28032 -8424 -16136 -27427 -4442 -18096 -50347 -56314 -66864 -36627 -163
7286 -163 22425 22541 4014 -7732 -22025 -12507 7523 13825 1100 6836 -21055 4564 11059
7273 11059 2572 6689 -9921 -4631 10363 -10311 -45916 -44071 -37166 -1455 20 26777 20515
7260 20515 4691 -11618 -20383 17366 24969 30057 16441 3521 -12257 -22809 -1160 24555
7248 24555 -21843 -65317 -38560 -48019 -47208 -27748 3657 1694 -15300 -11141 -7622 -19419 -30065
7235 -30065 -39361 -55245 -50753 -40048 -22941 -17286 -25023 -30778 -21045 -20241 -13409 -26819 -9840 -26526
7221 -26526 -66426 -56985 -50254 -34766 6622 -3636 -55403 -42894 -4685 -6195 -4409 -6472 -7923
7208 -7923 -2159 -34552 -78273 -120493 -70702 9428 14651 -8462 -26078 -25151 1610 38391 37431
7195 37431 54502 45238 25990 -14582 -58050 -68352 -51249 -63805 -53747 -10141 45992 36816
7183 36816 -12811 -14449 -15266 -33315 -36486 -41807 -38235 -20310 4930 3393 -14629 -35191 -51837
7170 -51837 -93831 -99364 -78283 -57533 -36431 -56889 -78313 -62500 -29615 -2765 14310 2397
7158 2397 -1945 -16985 -25930 -20252 -32314 -16899 27737 29114 18480 8749 16008 -4708 -36173
7145 -36173 -14997 -2840 -10287 444 13272 -16515 -10906 -21083 -28950 -31970 -46900 -32664 6568
7132 6568 -4167 -10932 -56584 -56503 -41651 -22295 7727 10285 20452 9866 7852 25045 33805
7119 33805 21816 11058 -8754 -8804 555 -9628 -7097 -8349 2179 -9274 -19151 -12310 -29393
7106 -29393 -57641 -59126 -48496 -52865 -65738 -47387 -20328 -5738 -14873 -32569 -69441 -66053 -47887
7093 -47887 -40862 -45047 -36697 -23514 -16253 14207 38214 2716 -14437 875 10968 31820 15963
7080 15963 5588 -2773 -51541 -58773 -56966 -14733 -16230 -55370 -61926 -71477 -39293 -29029 -52851
7067 -52851 -7693 14035 -4867 -13475 -13455 -20986 -25880 5177 31845 1879 -23232 -29448 -18272
7054 -18272 -27794 -52236 -50972 -5366 39455 8358 -15284 5013 4196 1633 17718 9752 6335
7041 6335 32203 22411 4593 -22703 -56302 -41608 -10159 14636 43733 28145 -157 -21810
7029 -21810 -46218 -51797 -17866 -12337 -24757 -50005 -57007 -59010 -62425 -43242 -32062 3214 -10192
7016 -10192 9554 56670 43197 15131 -5071 13606 39554 19613 -24232 -47690 -59558 -58280
7004 -58280 -63219 -64795 -50943 -52418 -59620 -46993 -47540 -64157 -51593 -29619 -32234 4897 -6301
6991 -6301 -55180 -46431 -24252 4317 34936 50408 33306 -21292 -20425 11447 2342 -9921 -7398
6978 -7398 -896 -16286 -32209 -27551 -908 -28277 -43157 -28211 9372 5341 -15363 -4075 -252
6965 -252 -26530 -55355 -54511 -49075 -55742 -59494 -54550 -56222 -72176 -60658 -19391 3483 17798 12108
6951 12108 -1356 -22237 -33373 -34504 -57475 -65053 -41980 -22569 -48844 -46778 -43639 -2448 971
6938 971 -20191 4630 -28705 -44325 -14926 3677 871 16585 14534 18806 39032 33634 29772
6925 29772 15534 10740 28865 6459 -12007 1123 4329 -5541 5605 -24184 -45364 -31221
6913 -31221 -33907 -24961 -4040 35061 53311 23486 -7423 -27575 -27815 -444 48638 56924 40316
6900 40316 22821 -14486 -22349 -35595 -21080 -375 21778 734 -13105 -12252 36817 44422 31446
6887 31446 44529 56914 8071 -7265 -15794 -33096 -39469 -55042 -47077 -14860 -5992 -24593 -49526
6874 -49526 -56454 -20454 17924 11583 -19701 -27072 -32698 15109 28611 10001 -30905 -35502 -31123
6861 -31123 -29868 -23113 -35959 -37306 -42294 -67230 -83276 -55510 -33135 -36882 -16934 -13556 -25856
6848 -25856 -33595 -30861 4324 38722 13343 -19565 -20075 -29906 -14852 8983 -11008 17802 2821
6835 2821 -5337 -4403 -13649 -1757 -33232 -36112 -11819 -19751 -21485 7017 1108 -2719 9270 -8583
6821 -8583 10502 3283 -27141 -44089 -41416 -54600 -43575 -64810 -68904 -64186 -53113 -28584 -37726
6808 -37726 -48504 -22135 3176 20624 7618 34451 39358 48350 37651 6896 -5103 -6310
6796 -6310 -16019 -30828 -13257 -5969 15865 2664 -14862 -27788 -36263 -31140 -19364 -14549 -29615
6783 -29615 -37549 -27191 -13456 -17663 -2396 -12432 -26951 -28612 -4663 16121 5408 31017
6771 31017 24854 20356 5421 -13820 -20168 29400 51703 48108 46971 25115 16816 -12746 -31699
6758 -31699 -22274 18195 -5891 -6083 -5732 -12225 -20414 12279 25125 32898 11115 -24420 8914
6745 8914 -11644 -12321 -307 8996 38782 29888 46387 36664 9940 -26511 -20875 16198 10169
6732 10169 -4855 -17755 -3671 2665 -29431 -36016 -69999 -41341 -10996 246 6841 7284 36221
6719 36221 43772 25717 27149 47710 50542 90363 125669 179285 226879 218883 151527 86886 63493
6706 63493 61862 51908 77532 62996 16320 15529 64358 44163 17485 3470 -19936 -29585 -36860
6693 -36860 -32205 -42850 -49413 -26357 -907 -27706 -24886 -40923 -54676 -29999 -13673 -3236
6681 -3236 4538 -14383 -18092 -13489 -25670 -39470 -16423 2967 20281 -122 10139 -12060 -15894
6668 -15894 -18994 19468 22533 -19495 -21695 15983 23506 -6956 -18395 -34876 -25477 -11866 624
6655 624 -32926 -27350 -1634 -11544 9942 51231 51011 38128 2879 5345 32144 35320 37756 18126
6641 18126 20729 46201 55207 40386 51840 56108 -23902 -83450 -70669 -44792 -40132 -28536 -13925
6628 -13925 12197 60539 70895 41036 -8464 -48119 -50611 -30770 -64013 -75363 -50161 -25828
6616 -25828 -25188 -27420 -18639 -40324 -25816 -16842 -31784 -36289 -31564 -53605 -63576 -14002 8218
6603 8218 1523 -12038 -23401 -33985 -31801 -34879 -23556 -11003 -15992 -40914 -22143 -1976 -17891
6590 -17891 -2667 15893 2883 -39961 -37974 -43800 -51141 -15444 3875 17139 -5815 -9424 5293
6577 5293 28830 6202 -30362 -23643 -37968 -33035 -41057 -26404 -8832 15876 -2417 -3367 28761
6564 28761 49749 18690 8680 52514 50422 24731 -5644 -24190 -17411 -11112 9077 -5244
6552 -5244 -43374 -33311 4871 7199 39321 47203 20316 23521 8586 18028 4841 -22055 -41560
6539 -41560 -25937 24779 41933 28045 11981 20372 3629 8756 19624 24254 30185 3689 -25058
6526 -25058 -16042 -43194 -17270 11136 -5434 -21683 -24151 -4765 12872 11155 -7869 -8212 7277
6513 7277 21665 25029 40862 53625 38898 5519 11163 6440 36104 32733 10133 -9945 -31802
6500 -31802 -41308 -65778 -58511 -13921 13779 -5462 -4747 -18612 -6873 3113 -3681 -21891 -4797
6487 -4797 -2644 7044 -3321 -17620 4955 28862 -12591 -31771 -51453 -24746 19679 54821
6475 54821 86861 61114 43010 33764 9515 -18557 -62033 -56298 -9290 -5020 16663 6814 -26373
6462 -26373 -8313 -9325 -30690 -29574 -42180 -39448 -12065 -35123 -62761 -86485 -82959 -55434 -35090
6449 -35090 17756 40943 42034 59136 49315 22023 10985 15439 48260 51206 28546 5209 -3195
6436 -3195 -21647 -49496 -46998 -35065 -44854 -36694 -27495 -12055 -13910 -43016 -41997 4793 13961
6423 13961 -3363 -4242 23847 18436 -22766 -8517 11840 4025 11679 -3559 -10803 2673 -17025
6410 -17025 -20032 29115 33502 -24294 -21622 658 8950 11640 30776 19699 18131 54330 51531
6397 51531 31092 13609 -6809 -23171 -28271 -4648 -2565 8568 26927 5252 -51546 -39528
6385 -39528 -16191 26299 12620 13834 -5545 -27965 -15005 3888 11524 -15878 -8732 15730
6373 15730 32520 62578 62805 79355 86317 51637 30259 19325 3124 14005 32986 48115
6361 48115 18486 -19658 -26971 -14244 128 11732 -992 -15546 -17680 -51371 -67385 -57298
6349 -57298 -49299 -76719 -60372 -31995 6217 -16972 -41370 -50188 -49504 -35717 -41114 -31153 -30237
6336 -30237 -18010 -8681 10906 25083 28161 -30844 -70009 -49687 -37858 -2728 8203 14069
6324 14069 -2831 -22423 -19698 -17077 -22503 -26503 -23464 -20066 -4635 -21079 -22226 -14364 -20667 -10003
6310 -10003 16912 37943 18566 37345 45504 14337 -37742 -67467 -56413 -8062 35462 31546
6298 31546 19065 6283 -10935 -74432 -64329 -50783 -37589 -15174 -4979 2842 589 -2132
6286 -2132 -10446 -16597 -18236 -35724 -41031 -37284 -48000 -39953 -41894 -42289 -54679 -51848 -30059 -4951
6272 -4951 -21461 -34782 -51235 -42282 -41470 -31464 -48358 -53360 -55739 -52157 -33687 -17044 18072
6259 18072 -4972 -55403 -75116 -69876 -78875 -63850 -2296 22561 29957 5900 -10319 1605
6247 1605 -28084 -37543 -3153 35549 32617 30096 -829 6274 28862 17070 2556 -9384 17732
6234 17732 36953 37969 33078 11231 1853 1544 -29776 -61049 -57367 -17106 -23126 22394 31917
6221 31917 2552 -12956 -3221 2525 7209 3163 14419 -8104 2441 8383 34550 33128 62307
6208 62307 61746 77641 79322 76244 45798 32881 7973 -10627 -20112 -14654 -774 25937 40799
6195 40799 21930 4858 -5997 26189 46922 5049 18694 18328 46441 49342 16206 5644
6183 5644 19357 13463 -26610 -61254 -46202 -30743 -34962 -30487 1160 34774 22872 9832 17580
6170 17580 -21696 -31117 28361 18960 -14972 -39879 -43032 -29793 -5136 -11125 8928 23221 22906
6157 22906 -12244 -26004 -13233 -21396 -18016 -35438 -29823 -16937 -15711 -26891 -44817 -60554 -46957
6144 -46957 -30430 -42591 -28808 -22410 -18030 -3997 -29065 -12626 17765 -3120 -5637 319 -23638
6131 -23638 -19040 -19580 -14 -14743 -28136 -25593 -3728 17285 19498 -11051 -10979 -29695 -36025 -41167
6117 -41167 -34113 7747 37351 32578 7434 -3208 579 11898 -12429 -22400 -4447 2290 -6329
6104 -6329 -4415 1836 -5705 -19186 -13162 -26513 -47032 -4514 34535 29712 26152 55388 38867
6091 38867 5801 -49970 -19963 32677 27473 3140 -18274 25467 19640 6624 -11717 -7651
6079 -7651 8782 21524 -19458 -39241 -45579 -40948 -18259 7935 28019 35316 33034 32500 28579
6066 28579 18035 6669 -27049 -12120 24846 -4546 -16501 -4023 11730 5080 14231 15129 -3612
6053 -3612 3159 53289 64964 39858 18734 -4205 -23898 -36907 17318 37680 26389 17850
6041 17850 -2427 2711 -6540 -27173 -55493 -26612 8613 34757 33677 9925 12954 6147 -6950
6028 -6950 14654 -25750 -64474 -61514 -43293 -21523 -9658 -10879 -30545 -389 -2859 -15067 -29581
6015 -29581 -9900 16001 20263 5261 12844 6074 -13146 -17129 -25396 -22689 -49713 -52379 -44779
6002 -44779 -39975 -17951 -1091 -3683 -805 24555 48370 23557 -7877 -15306 -28539 -17550 -3771
5989 -3771 6821 2154 27471 29939 21003 43162 52804 19109 -33763 3251 24747 -25512 -33964
5976 -33964 -16674 6149 22884 19187 20633 32736 34439 48638 27292 3357 -5857 -1673 -4387
5963 -4387 1478 16944 54377 60209 1978 -44297 -35494 641 32755 22441 -34577 -31977 -15037
5950 -15037 -14458 -12760 -9898 -10810 4032 2452 7711 -6589 -7666 -9460 21462 39658 37269 -2986
5936 -2986 13546 25767 -4712 -8504 -3903 -39542 -32071 -44421 -43921 -3844 2571 -17713 86
5923 86 17110 -1861 -26010 -33108 -13500 14693 15213 11153 -4263 -14528 -9525 18584 13423 7669
5909 7669 21915 28333 38337 40447 66315 95228 93150 85848 78567 73893 69961 53732 9857
5896 9857 3877 21390 -9625 -16706 -12649 -7977 -19859 -39039 -19497 -25750 -2781 21751 35687
5883 35687 15942 22866 23539 35577 35642 23337 11243 4526 -16167 -23543 16422 42221 11177
5870 11177 -6591 -15557 -24117 -43067 -30524 -13777 11026 13065 33755 34088 16937 -10376 -19364
5857 -19364 -34181 -33858 -35051 -1305 39944 38777 8098 -12104 3106 -4139 -20735 -51154 -58802
5844 -58802 -70476 -106723 -103107 -81833 -67652 -56082 -21822 12690 -1013 1910 -4585 -54116
5832 -54116 -79045 -72804 -26324 -26786 -32852 -28264 -5746 28195 34048 33251 22211 23967 23657 13856
5818 13856 15693 15660 -243 -26589 -1021 -30125 -74267 -63481 -59530 -34887 -23876 -51389 -53364
5805 -53364 -46643 -22709 -24931 -35949 -44359 -11296 -2908 18711 12515 -15381 -29903 -49234 -42360
5792 -42360 -28831 -32708 -38956 -32450 -33439 -29253 -20560 -3760 10110 5880 -4182 -19693 -38310
5779 -38310 -14761 6642 33967 51187 23037 -22088 3528 -4060 -33719 -31978 -21449 -20825 -11512
5766 -11512 -11053 -7057 -567 -38339 -66665 -79639 -43748 -807 13456 8119 -5020 -140 22780
5753 22780 4518 -26739 -19260 -34627 -66609 -90663 -73666 -27549 4896 27663 40871 32048
5741 32048 29101 11819 30744 31130 10669 -33481 -51295 -34937 -22015 -18538 8091 25959 26404
5728 26404 26182 6688 3380 7251 -26513 -31297 366 5497 -9080 8380 15047 12103 -3091
5715 -3091 -12636 -33213 -48238 -59308 -38699 -38230 -17677 -14148 -18526 -22078 -10636 -25038 -59095
5702 -59095 -31623 -15320 -18384 -10003 -51551 -46792 -34112 -29777 -19525 -44320 -79998 -29429 -4047
5689 -4047 18558 38587 19377 -2540 -20309 -21356 -26249 -52813 -72083 -56926 -34041 -1520
5677 -1520 956 -15052 -41775 -41967 -25337 -15337 -15821 3919 45149 31825 12631 -1861 3032
5664 3032 6575 8729 42705 55137 27508 -13425 -30417 -71923 -61210 -85391 -104955 -95951 -52892
5651 -52892 -43827 -28054 -18559 -26683 -54588 -39441 -27419 -35965 -22681 -27933 -28150 -40344 -68534
5638 -68534 -61779 -45415 -32841 -15816 -15031 -11296 -10164 -10925 -18613 -6419 9049 -13740 -10516 10435
5624 10435 5482 2525 7073 5820 -4348 1547 -21936 1074 -926 -12281 -23690 -24879 -26506
5611 -26506 -6878 -32654 -43365 -43703 -43547 -23701 -11545 17613 19983 6406 -12332 -18960 -19430
5598 -19430 13610 17726 -25308 -35976 -33955 -36600 -64550 -85911 -83175 -56985 -55121 -46181 3114
5585 3114 14482 6024 -22068 -18225 -22535 -17978 19263 42202 42951 8103 -28105 -25562 -13028
5572 -13028 18656 23992 30190 12502 4578 24386 41715 34999 18488 25104 36284 50808 39803
5559 39803 19435 -12724 -25971 -17735 -35647 -35750 10573 22350 9068 24629 35275 20243
5547 20243 3462 -31972 -21184 -6164 -21469 -18345 1558 -2269 -6573 -10169 4942 4015 3544
5534 3544 6078 13524 33741 32747 -15055 -57058 -37432 7897 15572 13114 7981 -427 -2885 -3512
5520 -3512 -29565 -64996 -55532 -39018 -59531 -77340 -66592 -33296 -2579 2216 8123 32336 37456
5507 37456 32868 28682 32340 13449 9997 -272 -23917 -9004 129 -10097 -8082 -18956 -22063
5494 -22063 -4605 5462 15284 27865 20377 -23454 -57433 -52776 14746 55520 58856 44307 36757
5481 36757 16628 30540 43188 3076 -17969 -17306 282 30431 22515 -13941 -64404 -74633
5469 -74633 -50218 -31730 -28491 -42138 -26091 16644 11576 -3707 1767 -12596 8650 27328
5457 27328 42567 16474 23217 34443 4574 -28511 12566 19680 -7752 22149 19192 1457
5445 1457 -7809 -12647 -9318 -1412 21158 -4600 -24100 -55413 -77764 -67964 -54021 -17002 -25547
5432 -25547 -18817 21892 20980 -7012 -21899 -28740 -6882 -4032 -13149 -17371 -34762 -34117 -42516 -52210
5418 -52210 -39390 -23369 13362 10556 19347 15795 9023 18908 34245 -5114 1712 21106 17636
5405 17636 12398 -17859 -22036 -53025 -31579 -38423 -25908 -18826 -22595 -31797 -14245 -38489 -85599
5392 -85599 -80714 -49910 -22766 5823 -8182 -28608 -53707 -49538 -38025 -28101 -45123 -60516
5380 -60516 -70207 -103658 -95885 -61520 -58034 -80291 -62619 -16117 16649 23139 30432 41364 42838
5367 42838 42233 4673 1956 -7458 -6953 -7042 17533 36422 34641 65741 75599 49995 14765 9997
5353 9997 16835 -962 10534 7066 24721 59738 58401 48182 39518 12650 16331 21749 24213
5340 24213 -19097 -69570 -50219 -39014 6749 46637 17375 -11100 -45229 -38008 -8117 2792
5328 2792 -6501 -7387 29008 16973 34127 41982 21273 6866 -29553 -53217 -29542 -15231 -26927
5315 -26927 -40964 -39229 -3653 14929 16380 1207 6465 11340 16794 4027 -9113 -26924 -22518
5302 -22518 -37931 -32838 -39419 -68082 -45581 -21022 7070 -19395 -3548 40466 24735 -4554
5290 -4554 -28701 2771 21395 20768 26813 50113 18333 -9860 15829 61100 36267 1529 19621
5277 19621 -10488 -34806 -27181 -16951 6701 -14229 -27290 -11954 -19339 -26365 -10704 -12464 -67177
5264 -67177 -58885 -13249 31295 43979 19358 -5042 -43850 -8066 25979 6795 -38248 -49818
5252 -49818 -16477 -18232 -25090 -31966 -5784 4742 -17871 -27852 -16504 24793 8387 -26664 -27092
5239 -27092 -29982 -28590 -12586 422 -9565 -1366 -3187 -21 -34039 -17072 -16722 -32672 -32715 -37929
5225 -37929 -65317 -75711 -88227 -40089 -20142 -39342 -11297 -17132 -17220 -16168 1697 7385 -11115
5212 -11115 23802 60916 42602 27007 21562 28306 27091 -4651 -34088 -51776 -35142 -12036
5200 -12036 -5521 13854 59243 36169 -5013 -18752 -3687 -5112 -7869 6886 -16080 -48632
5188 -48632 -32178 -24163 -22022 -15291 -62277 -78228 -60395 -76664 -59323 -72958 -77785 -26320 26484
5175 26484 60150 57166 7285 -5469 21389 26763 5174 -28840 -41953 -38038 3543 24497
5163 24497 23055 -3628 -25706 -9193 15675 18044 27563 9685 18894 3721 -25329 -77367 -65893
5150 -65893 -17171 -8269 -2321 7261 -19128 -43009 -31729 -4841 21758 -4094 -46304 -57137
5138 -57137 -36900 -15894 -24761 -36732 -37727 -46148 -46006 -34257 -20318 -7314 13798 25367 30310
5125 30310 22669 993 3744 14843 8909 -23643 -26508 -36319 -45728 -54083 -21489 4922 13460
5112 13460 7456 -4326 -8462 8388 9787 54575 44946 25060 5221 -18848 -14778 7493 24199
5099 24199 21779 12782 11732 18838 15100 11239 15230 19858 42637 4441 -30731 -29667 -18008 -32014
5085 -32014 -20882 -30361 -30554 -9141 11848 22235 -6663 -62376 -52630 -20263 -24234 -55043 -77036
5072 -77036 -36929 32413 67138 69267 35440 11035 32161 29760 21582 29077 66871 19340 10611
5059 10611 23942 28856 23148 7235 15147 -7325 -4524 19713 20890 7239 7037 35992 21608
5046 21608 6443 11123 7557 -10142 -3815 -5776 -20007 -59292 -61825 -18004 -11893 -14640 -21342
5033 -21342 -50582 -35897 -20162 -32900 -31615 -9481 30558 47678 15227 -11213 -28283 -30953
5021 -30953 -40314 -60983 -61833 -48688 -44830 -43899 -40506 -26181 7788 21220 8152 -16500 7834
5008 7834 12550 -2871 11080 33387 4209 -13841 19163 25760 -4128 -20134 5981 16717
4996 16717 8163 21095 8033 -2006 3743 -15826 -13548 -14810 24654 -9585 -9966 15070 12627
4983 12627 -26185 476 15418 -18501 -35769 -23529 -45987 -70343 -20353 15866 10302 -34298
4971 -34298 -71678 -91197 -92106 -74012 -36879 -17737 -4726 30686 10461 -22819 -24812 -30959 -17742
4958 -17742 4806 14426 20131 25043 21849 38079 52629 45199 32272 16457 5704 25093 46712
4945 46712 50576 31533 11883 7073 32225 41925 27312 30393 22802 46269 53778 21639 -15362
4932 -15362 -3835 264 -16695 -14804 -13454 20207 28085 -19048 -20214 -22413 9007 13752 -14934
4919 -14934 -28839 -12968 20875 39867 2861 -10633 -5977 4451 24737 19337 -14784 -17070
4907 -17070 -40915 -67685 -71137 -51569 7586 29010 14919 -690 -36539 -3079 30370 41519
4895 41519 19705 24772 46341 27663 343 16276 26250 264 -47061 -39401 -15110 -6411 8115
4882 8115 17118 7826 19799 16829 -5796 -2107 -18945 -47339 -37127 -8351 -9735 34285 66662
4869 66662 71568 106922 70548 20784 4105 -27232 -18074 -76 3315 -7210 -3533 42165 25738
4856 25738 -7623 -11786 -9426 -5969 -6111 -41621 -63872 -36813 -30277 -36274 -40266 -53027 -40328
4843 -40328 -10636 5283 -9113 -18118 -54068 -46755 -21590 7282 -13565 -54412 -32726 -9087
4831 -9087 -32151 -44093 -23032 -21740 14428 38555 41153 53938 22235 -2543 12229 23750
4819 23750 41278 84263 84117 36271 9426 -41263 -59684 -78195 -59782 -35754 -65843 -56527
4807 -56527 -24397 -4301 6205 -14201 -10691 -19063 -21209 -41301 -32300 -1862 7129 13481 27881
4794 27881 22516 21471 10175 -16536 -33324 -45836 -22861 12618 13726 -12503 22575 49029
4782 49029 48044 35132 2297 1303 23484 28798 18255 18097 -6136 -6964 4557 9451 2142 2741
4768 2741 -4394 2850 -16081 -13376 -45876 -55282 -37895 4960 8638 -23125 -62492 -31063 -614
4755 -614 -15396 10824 40596 33330 23779 41453 42413 13920 -49412 -55056 -43419 -36152 -11924
4742 -11924 5710 -1457 25118 18496 -6600 -27628 -46567 -22660 10378 5951 18637 36516
4730 36516 23272 -4561 -45055 -17291 -10705 -8568 -19950 -18856 12362 55332 27045 2132
4718 2132 -25334 -51007 -50399 -57703 -66500 -48669 -16994 24660 44205 41852 6176 -10388 -38921
4705 -38921 -50388 -43441 -28539 21119 23330 52533 44368 9514 7685 12192 25197 40894 24282
4692 24282 27867 25993 6854 -14830 -41134 -38665 -37493 -20031 -6288 -15404 -9078 -1330 24094
4679 24094 34389 5615 -4734 -415 -15850 -23998 -15054 -12077 -19685 -8800 8673 13859 27433
4666 27433 75456 76735 78596 65355 57700 -7445 -47863 -45716 -59605 -83347 -93856 -48969 -1259
4653 -1259 32913 61505 51355 63964 41394 22504 29856 34018 16330 12565 20726 47077 39294
4640 39294 9229 -13553 -15757 -5681 1300 -17893 -31673 -51552 -26380 -7293 -22577 -20916
4628 -20916 29871 50097 40245 52264 31543 -2270 -22601 -30042 -39993 -18962 -10395 -37366 -37114
4615 -37114 -30082 3535 35398 41204 45706 47978 20131 -32518 -35131 -38393 -31291 -13175 -12880 -30060
4601 -30060 -36982 -25327 -20446 -2806 -9973 13026 12282 -17524 -15934 -37736 -52991 -47553 -43250
4588 -43250 -3968 23755 31153 23175 1533 -41221 -59041 -21785 106 9794 1823 28078 23592
4575 23592 -20490 2638 32243 -2153 -29003 -61631 -56740 -7691 5001 -23170 -49729 -46646
4563 -46646 -18195 -26581 -40344 -46271 -36555 -6575 11315 21758 8884 -25864 -22713 -6715 -5138
4550 -5138 -6247 2947 33890 22509 6439 22599 -11767 -27066 -29971 -18350 -15560 17468 13138
4537 13138 -25182 -56776 -33996 539 -812 19022 40054 38094 21110 -2065 -24815 -48259
4525 -48259 -57091 -32091 -21026 11350 43463 66319 44712 17247 4447 -27859 -36237 -39924
4513 -39924 -38785 -30533 9074 7184 6731 -7675 -20759 -39089 -32165 -17560 -4504 -15219 -31605
4500 -31605 -53039 -42742 -15589 -10272 -14585 -59353 -70234 -39259 -36317 3487 18775 4678
4488 4678 -22724 -41633 -35886 -43231 -9027 -4052 10067 44365 60699 36811 60229 50256 25920
4475 25920 69631 78911 38544 12086 17248 19929 31404 48544 73576 45579 41294 71056 67267
4462 67267 35209 32829 15002 7460 32902 31661 15638 12604 10677 -12749 -32142 -19805 17415
4449 17415 55015 5624 -39340 -39363 -8039 -9836 4658 21711 31241 27157 -6944 -40585 -47088
4436 -47088 -1600 -4120 -25849 -46040 -29033 -41760 -64480 -47498 1706 4059 -14258 -25984
4424 -25984 -9881 10993 50051 53960 44561 52129 35438 14782 15115 34049 56779 63329 35695
4411 35695 -29448 -65672 -52201 -14745 -12301 -21076 8308 29405 3476 -18653 -12691 -19859 -13277
4398 -13277 4127 25487 -27878 -53910 -35970 -28384 -20513 -19934 4120 19681 26549 21481 31334
4385 31334 23787 36401 42082 8943 9773 6340 29573 58683 61701 38990 42893 26348 5996
4372 5996 51243 81988 65034 18443 20553 42145 33713 5946 -12581 -19630 -22006 -32786 -19394
4359 -19394 -13528 -18926 -916 12844 6976 6035 -2293 -23814 -45842 -71417 -39489 4512 -10474
4346 -10474 -6732 -21690 -11211 15233 9079 -11435 -24674 -17635 -43116 -41937 -37050 -57602 -39824
4333 -39824 -30340 -25345 -37945 -3533 17666 34615 36643 21666 -4447 -41576 -34240 -10119 -9223
4320 -9223 -36232 -56062 -40847 -25610 22643 -851 -31226 -19355 -17484 -4336 13362 9229
4308 9229 8861 -11909 -27660 9305 29791 7293 -12389 428 23647 18167 20907 1968 -27452
4295 -27452 8579 40784 59082 21465 12564 17265 3991 985 1273 -1495 26700 28366 10591
4282 10591 -13458 -20466 -25611 933 19044 41582 39133 11421 18336 10992 -9890 -9874 -13394 -2300
4268 -2300 35310 21705 16861 8293 10901 28472 5233 -32277 -42199 -43225 -44406 -42709 -60884
4255 -60884 -36250 -37920 -20655 -17505 2832 20405 -10973 -3147 8308 -16553 -37009 -37681 -34807
4242 -34807 -32235 -31473 -18983 -20690 10191 55911 29605 19548 -25232 -58243 -47109 -39022 -14093
4229 -14093 -23709 -28105 -7358 -5018 -16435 -58413 -41090 -37833 -43500 -36848 -3456 146 11258
4216 11258 -4855 -32637 -45339 -50472 -35456 -49046 -59310 -38870 -26808 -26720 12262 41327 21674
4203 21674 -29780 -31150 -24074 -7272 -640 -10102 -10199 -17777 -25373 -23517 -57373 -69775 -72133 -41088
4189 -41088 -43771 -23042 -18351 -28807 -6843 -7888 10492 30788 44961 39844 42351 69863 32967
4176 32967 12066 -9146 -13177 -18443 -45925 -61901 -47434 -42964 -45130 -45320 -49257 -32778 -35120
4163 -35120 -39838 -61343 -55423 -25460 6786 30641 35019 12336 -6440 -8613 -17309 7773 -1295
4150 -1295 6044 23707 7471 -24075 -63118 -83222 -110040 -84526 -55647 -27679 -23624 -41927
4138 -41927 -40074 -26602 -11808 4879 -6135 7847 8931 8780 -13120 -29876 -13564 -20664 -54401
4125 -54401 -81459 -49949 -3658 5382 20730 31332 17634 -903 1020 -7322 -29041 -53350
4113 -53350 -58661 -48675 -7323 9775 6166 7695 36935 48525 32759 -12935 -30003 569 49797
4100 49797 13434 -12078 -33991 -45063 -20306 4060 -3971 18130 5562 -5861 2397 7905
4088 7905 -7995 -55393 -29938 -10300 -26184 -43460 -58718 -48450 -41504 -22449 -17350 -1152
4076 -1152 -8551 -18879 -20164 -14107 -7494 -17102 -30408 -50544 -36214 -56486 -89927 -108021 -53059
4063 -53059 -34573 -24753 -21014 -18708 -42694 -49242 -75464 -51333 -28187 -26033 6101 14194 4831
4050 4831 -5009 2649 -5068 -58685 -51889 -3417 4115 -25441 -28171 -10002 2585 33300 48973
4037 48973 33359 19610 35094 45814 19698 1302 -11393 -3753 18436 27353 -7105 -17496
4025 -17496 -25089 -31232 -13707 -11069 -18135 -11094 8728 24499 6805 2586 19589 42118 35088
4012 35088 16170 -8193 5960 32555 41740 65035 63254 59702 61477 43282 19650 3905 29091
3999 29091 41906 12562 9424 -10835 -30045 -28564 -6647 -15147 -14185 -4803 -11702 1186 12919
3986 12919 -13548 -27472 -25840 -36464 -20544 -26994 -38094 -30745 -20222 -10248 -21193 -10231 1171
3973 1171 -36817 -45104 -36132 -992 18010 34963 29305 25433 7580 8924 23072 24927 -6075
3960 -6075 -63713 -52474 -14514 -5759 44766 53266 27723 5658 8196 14979 3685 -17496 -29846
3947 -29846 -20665 -20371 -6733 17321 11839 -26433 -9943 -9658 -43127 -55220 -48967 -32342 -24717
3934 -24717 -3553 -9844 -15699 -32986 -10213 9411 18801 17621 19196 4759 -57839 -19876 6214
3921 6214 19600 28685 16184 10969 10891 -8954 -11627 -10575 -24558 -11817 6175 -444 18150 2965
3907 2965 -15816 -25281 1245 50688 74865 84485 67534 56005 58261 38460 28783 35521 12301
3894 12301 -26504 5150 10778 15096 21939 39310 50952 44401 10243 16699 32205 44375 40664
3881 40664 18858 4761 15228 12495 11678 13246 -18644 -40351 -18771 37067 41305 -10753 -74540
3868 -74540 -38590 8545 5234 -4916 -30207 -23241 -24640 -37748 -16953 4880 10640 24961 29281
3855 29281 5309 9815 19401 12099 -11660 -22865 -21690 -18346 -27587 -33314 -7732 34775 50516
3842 50516 54408 63568 51247 20817 27241 12437 -7895 -15599 15456 20292 10304 15200 -10465
3829 -10465 -17373 9810 44269 33925 12629 -4881 -6870 -21727 -65939 -66039 -39571 -31176 -38245
3816 -38245 -19617 -21974 1573 16673 22808 32246 19795 12218 17310 21972 37318 49834 70809
3803 70809 61612 52134 50971 30390 4457 17533 4392 -8117 -456 -16568 -62520 -65499 -9032
3790 -9032 12164 -7030 -19209 -25151 -33268 -32015 -1550 26228 43625 63011 74581 52482 34040
3777 34040 29183 34181 8255 10479 19309 29713 50176 36195 18121 24455 26738 17802 -19306
3764 -19306 -40059 -14797 -21104 -28096 -33837 -39120 -17901 9122 53444 38504 47831 26795 15821
3751 15821 16847 -7902 -14382 -3226 -8432 -25722 -40751 -20471 -6139 -16498 -7633 8346 22808
3738 22808 10332 19202 -13807 -2048 14292 22357 -11079 2627 35376 48293 66715 79761
3726 79761 68827 48091 -3977 -16530 -18710 26031 52220 54203 16910 -10960 -4029 -309 -6524
3713 -6524 2843 5351 11467 22598 8103 20737 26656 -12128 -15339 16109 19654 53703 80875
3700 80875 45585 3333 -41544 -39258 -44676 -38854 -17853 -3134 9507 11011 1132 6788 -3444
3687 -3444 -6174 -20846 -17337 -3227 -3566 907 -6601 -12119 10004 -9790 -26192 -6350 -3478 -12767
3673 -12767 -12149 12192 13990 10885 30468 12319 4744 11555 40531 32671 25308 21181 11436 17783
3659 17783 16440 -8038 -35916 -21358 24094 66828 45622 41927 51247 37869 4348 44992
3647 44992 9115 -24759 -16021 -22445 -31998 399 -8829 3110 -982 -18174 -60517 -71678 -31517
3634 -31517 -21976 -35069 -17819 -29427 -31706 -21464 -46569 -34375 -6804 27163 16938 -7910
3622 -7910 -7007 12839 37933 9059 9796 -3154 -10359 -24592 -15668 8097 14183 56448 69594
3609 69594 60675 49493 45965 32247 -5910 16063 -187 -23627 -37460 -55218 -50554 -48261 -53183
3596 -53183 -29139 -12569 -19698 -24378 -12557 19270 43788 42532 44775 14097 -19126 -5962 4038
3583 4038 -14030 -7164 814 -31082 -16817 414 64604 57879 -6616 -15923 -10897 -16217 -365
3570 -365 2200 26205 42359 31276 39693 43113 46530 39443 7506 3346 8223 -15090 -51569 -51901
3556 -51901 -26696 -17486 -7472 -13409 1578 43756 84296 89701 65919 23895 16116 40550 65320
3543 65320 58595 82462 93246 90928 69421 35340 30301 -12205 -49670 -74683 -52271 -31412
3531 -31412 -27499 -45696 -51247 -29154 -30206 -22954 -10874 -3846 2121 -15520 -63532 -39272 -17482
3518 -17482 7117 5291 -46169 -33881 1707 -849 32751 47384 44177 16753 208 19354
3506 19354 40499 54710 34865 43324 65142 66080 28483 605 22239 3243 -9942 -14191 2183
3493 2183 15048 12853 10188 -8642 -12332 -575 -10918 -5955 -9035 -8550 17278 37483 49278
3480 49278 44056 37857 36853 51001 37021 9828 46577 67492 54818 53390 48646 23401 27687
3467 27687 -3289 -29048 -35916 -77238 -62430 -36995 -44917 -34788 1664 26113 -626 -30948
3455 -30948 10618 62500 74678 55396 9586 18389 44072 30373 16441 9567 -6982 10219
3443 10219 25112 56155 103172 91564 72364 11641 -6927 35740 44581 22458 26126 48054
3431 48054 68864 80003 71958 82171 66426 37625 23921 49512 55247 33182 9500 16603
3419 16603 30998 18606 40874 43966 33290 58624 52557 19752 -1868 -40790 -41723 -31663 -11285
3406 -11285 -33324 -25358 8487 10465 16596 -10332 -25441 -22119 -30195 -14171 -2866 4558 17537
3393 17537 -29206 -62015 -39249 306 27911 44996 56405 33904 2706 -2334 7509 -14010
3381 -14010 -19625 -11979 2297 -20869 -36552 -3131 -10329 -3828 -24126 -23980 -20372 -3830 16430
3368 16430 -2103 9552 26475 15573 21511 24355 14204 19366 24800 26721 23118 11524 -9883
3355 -9883 -21019 -22773 2469 -11331 -34139 -8340 34462 54880 41406 39938 -3017 -59418
3343 -59418 -56706 -51019 -20126 10483 40332 10510 -24943 -11055 -13376 9214 -17026 -15885 -7381
3330 -7381 17553 18011 7538 28224 31113 23739 10008 -3976 22177 21951 1554 -30507 -25596
3317 -25596 -29954 -7455 7317 17632 37570 77941 60899 34089 18257 43683 54227 37422
3305 37422 37953 15741 1925 16637 4973 -41381 -55047 -23543 29861 44651 27275 -20067
3293 -20067 21327 33789 44125 62508 47661 16329 22040 10558 -10640 -23242 -25661 -56175
3281 -56175 -51322 -43028 -52588 -37485 -24379 -32560 -175 6389 -18321 -44057 -42387 -43208 -46746 -23958
3267 -23958 -6016 4489 16252 1155 -4851 15334 41676 44176 34069 18553 -13706 -24040
3255 -24040 -34564 3984 -3189 -31866 -1351 -29274 -36558 -27193 5608 -1053 13190 31035 2947
3242 2947 -16577 -26498 -10022 -13147 -11966 -20902 -14426 4893 6886 11918 9324 40 2074 -1518
3228 -1518 -14921 -37120 -48676 -27413 21711 24131 12737 -6297 1077 -19267 -21552 -16995 -37091
3215 -37091 -28290 -16974 183 6117 10294 4174 24661 34401 17021 -19272 -25429 -20532 -12960
3202 -12960 -22211 -45457 -39519 -28530 -13641 -5123 -3037 -24456 -56364 -86102 -84787 -23346 18940
3189 18940 -9417 -16301 -22629 11263 23259 -16979 -13594 21633 52725 29643 27217 45772 25701
3176 25701 34309 35354 3636 -20605 -34002 -33792 -14541 -5037 -2110 -5494 20414 26312 15673
3163 15673 33806 56399 50952 23132 -4724 -9266 -8277 -58655 -66249 -40584 -15884 3940 3470
3150 3470 -11633 -11744 -2400 4409 14278 12122 12302 21600 14280 27805 16687 17444 26120 26164 16520
3135 16520 7892 -35891 -58609 -28390 -3494 20109 28444 10566 9963 305 -12438 14351 26764
3122 26764 27553 -1759 6922 10571 3377 14213 15845 -34609 -75512 -42310 -3865 11962 -22537
3109 -22537 -21716 -8034 -17404 -24103 -2414 -22457 -45892 -32174 -64683 -88474 -76028 -44087 -34090
3096 -34090 -20094 -7778 1625 6193 -6850 -22399 -336 18902 24603 2658 1927 1012 20613
3083 20613 10457 -20617 363 19822 8667 26197 11400 -25845 -40569 -16652 -10490 3227
3071 3227 23685 25221 -2476 -21750 -40202 -47266 -39321 -29666 571 14467 10971 16259 6127
3058 6127 -2178 -4804 -19865 8765 48155 26452 -21956 -40835 7714 24100 20018 -2191 -10702
3045 -10702 -16989 -27412 -30074 -11056 13987 26464 4250 -17179 4601 4669 -23339 -16802 13642
3032 13642 21541 -6045 -6374 -38637 -57099 -28825 -9034 -38183 -46373 -24496 -42241 -34199 -17549
3019 -17549 758 -17128 -3172 -7453 -971 32772 40014 15304 -7605 -2384 -17587 -15373 20769
3006 20769 10905 -21910 -21672 7309 33733 43143 38232 70591 31137 12986 9770 5549 -14158
2993 -14158 -4478 1235 -7410 -32169 -24641 -16146 -30268 -31794 -52847 -41106 -22557 -29299 -24354
2980 -24354 18425 6049 -21759 -26898 -24871 -25946 -43310 -30822 -39548 -45986 -28898 -5548 7922
2967 7922 23490 8639 6117 39693 40083 23033 10506 -4416 10487 29285 -3601 -2138 -6718
2954 -6718 -15890 -36164 -48510 -37815 -27003 17311 37607 7692 -10415 -28985 -23665 -17814 -5453
2941 -5453 22680 31380 29125 35707 37618 53230 27325 22202 9282 6603 -37244 -24231 -8202
2928 -8202 -3132 3432 14876 31397 -2608 -8456 6810 -18203 -11480 54825 60912 40671 11328
2915 11328 11107 873 2089 17322 59890 54712 34893 -7326 9930 1949 -7449 7317 2454
2902 2454 -17348 -4092 13953 22885 37751 33863 41706 31196 34044 4636 -29823 -24802 -18478
2889 -18478 -2938 -7550 5187 7601 19615 47005 22320 -9317 6170 19908 7849 -5375
2877 -5375 3010 4166 -14628 -25971 -24324 -4575 677 9001 -1588 -562 -3678 21375 22250 40613
2863 40613 3399 -18905 10225 -11647 -27965 -37040 -5105 31316 55796 56482 31842 13400
2851 13400 -2708 -5520 -21620 -30770 -8125 -10708 13438 14287 27359 29892 44217 62993 40393
2838 40393 27301 36189 34165 12896 20473 36502 41863 7323 3497 -22725 4056 43370 32445
2825 32445 36878 48085 55961 28977 -885 -3996 -17087 -28806 -33359 -8099 5268 1253 -26042
2812 -26042 430 -35480 -64225 -38139 -19441 -14844 -13217 -13610 -26395 -30223 1391 46487 51462
2799 51462 45261 18299 -11532 -20962 -12264 -23205 -27296 -13421 21193 34657 27291 51311 16675
2786 16675 -18723 -17685 4738 11897 7634 4811 -28170 -10607 -21932 -43382 -34469 -27059 26138
2773 26138 53272 15997 -12252 38643 45602 -7039 -9934 34050 43238 25972 5805 -5911
2761 -5911 -10769 12106 2091 -27142 -35754 -15081 33139 44315 17763 17923 23085 -137 725
2748 725 1312 -22658 -19598 3973 -30383 -34360 -391 42310 55691 52618 54500 7638 -55117
2735 -55117 -23919 -13686 -19697 -16217 3441 20897 28296 21327 20863 20730 13501 13370 1795 -24725
2721 -24725 -22465 -41409 -41373 -6966 -187 6816 27409 7079 -3543 -9784 -13573 -15288 -12917 -44441
2707 -44441 -34034 -5296 31052 37910 27355 3634 12241 12205 -12978 -28524 18486 24392 -14628
2694 -14628 -9239 -23345 -19048 -13270 -16451 -31461 -23927 -1897 -8719 -22338 -40065 -16689 -6798
2681 -6798 -5158 -4516 7873 46205 32980 -15365 -39383 -62121 -43291 -35924 -26314 -13548 12616
2668 12616 -14977 -7425 -4511 15070 49678 20776 -14096 -23080 -32038 -32438 -2800 1755 -17274
2655 -17274 -11869 810 -13847 4135 20216 22988 38443 65484 54176 33317 15220 -9728
2643 -9728 -24407 -27363 -22179 -30808 -42462 -44321 -65252 -66787 -46124 5483 12758 30926 29911
2630 29911 30009 21973 8791 7068 -8142 -30329 26464 33420 49268 17055 -27303 -17308 -5852
2617 -5852 6865 26132 13734 29442 40543 33165 44659 26657 1346 -24787 -14113 -12258
2605 -12258 -11380 -21925 -21855 -26795 -30715 -41023 -12328 -12616 -9097 26701 24301 -7331 -40961 -69428
2591 -69428 -41368 -16773 -37671 -44652 -20384 17737 18226 30013 37777 22970 -19437 -40173 -10377
2578 -10377 2339 -10223 -37496 -60178 -68680 -64830 -114 -9357 -44613 -45650 -49949 -19905 32516
2565 32516 37956 5683 -31613 -47418 -52562 -31197 4931 -9836 -52692 -49625 -18871 -11485 -3862
2552 -3862 -27028 -47804 -29537 -17317 6497 8953 1388 8592 12271 9207 -4471 -11208 22102
2539 22102 35620 25315 24965 -6772 28733 41001 18922 18868 9996 -6561 -12692 -6242 13284
2526 13284 10039 -8671 -27928 -18673 -23449 -30198 -47420 -86070 -95615 -56646 -11503 5044 1088
2513 1088 -16638 3237 27533 18666 27512 60259 62817 35832 28329 8381 11153 52376 68192
2500 68192 28278 -4807 21213 35133 3889 -19591 -27629 -40580 -23249 -4505 7974 22747
2488 22747 -3198 -11407 -35673 -3041 1259 27939 42370 29078 2843 4376 2929 15829 24285
2475 24285 11977 13974 16841 9502 -9844 7392 30555 51251 65827 44245 3484 25532
2463 25532 48919 85231 78441 65553 46613 10564 -9167 -20395 -31439 -40292 -33276 -6135
2451 -6135 22738 59181 55164 19388 -32504 -20669 -4119 398 -5738 29625 38933 17782 18830
2438 18830 44219 76395 60873 32873 12758 -40852 -40552 -26080 -22004 -18331 15216 8285 -6198
2425 -6198 20995 -9108 3326 8357 -20260 -4087 -30930 -45716 -46695 -30977 -51486 -46957 8863
2412 8863 15242 -13641 7784 -3405 -17025 14936 59808 58265 22099 26535 51479 78689 60275
2399 60275 33999 23203 11832 -14814 -27197 -25401 -13269 -23977 -7805 10421 9167 -1940
2387 -1940 -18493 -22137 -44098 -25461 8515 -3426 -20412 19162 44958 37129 24452 -4542
2375 -4542 -33842 -47613 -53256 -31922 -25626 -34307 -38628 -15908 -10675 -24304 -19667 14586 26730
2362 26730 44428 17086 21705 26449 22191 5949 14518 52033 36407 2327 4329 44794 56556
2349 56556 34253 39510 18583 11352 6484 32247 23369 33011 38917 42344 32567 17545 18098 9504
2335 9504 27930 12785 8296 20462 8573 -1786 -8507 29071 -1831 -19666 15920 6867 -11917
2322 -11917 -5946 8222 17724 3883 20888 67417 28687 33841 40395 40527 10465 -7895 28773
2309 28773 34785 28036 52330 41117 3664 20643 31133 -7909 -19826 -20402 13144 50148 32775
2296 32775 21569 24547 19223 20216 31868 46321 48674 55254 67052 94860 70020 37296 -5229
2283 -5229 -26871 4520 21036 39153 49569 29558 6450 -7637 8602 9226 -9041 -12196 -5630
2270 -5630 -18322 -26104 -34727 -9427 25006 9745 -8150 -407 11379 25470 28621 27754 4049
2257 4049 -21757 -14475 14376 38801 42208 20384 3000 8474 36942 30378 9516 -15229 -11763
2244 -11763 -20627 -6095 -22719 -9524 24285 3239 3267 23351 26034 9100 -12932 -17577 -757
2231 -757 29145 52215 39382 13843 1231 -478 -6522 -32431 -12880 -13941 -18755 -19498 6330
2218 6330 33697 30603 23054 9633 -25279 -2164 1958 9882 -7401 -45682 -22347 -1756 15032
2205 15032 -1743 -15827 -43438 -40569 -35820 3095 12375 17481 2308 -28250 -25424 -5428 19134
2192 19134 28369 -7821 -27890 -28926 -2640 31638 35905 -2691 -82 -1504 23622 27448 -17687
2179 -17687 -29799 3527 -4784 -32323 -18889 8300 8113 -23953 -25652 -14608 14769 40342 21379
2166 21379 34836 54307 55724 57425 28203 40095 40074 46724 25733 20953 5063 -21690 -21799 33673
2152 33673 45906 21151 34963 49646 25504 3772 -19125 -32520 -28811 -21251 -29078 -34516 -23719
2139 -23719 3508 18317 22359 48361 60693 46854 2245 -17911 3467 27172 -4364 -15501
2127 -15501 -13690 -42408 -46743 5531 19521 -8442 -25332 7807 33342 -8564 -33614 -67742
2115 -67742 -64385 -48052 -5729 24646 25995 348 -34368 -33001 1457 23035 -11999 -34652
2103 -34652 -25469 -17661 2157 -11740 4391 -2731 -14029 -2017 11841 34225 41865 43460 11834
2090 11834 -2870 -19863 -7726 5831 39276 49022 16357 18571 37029 11193 -7167 5493
2078 5493 -12625 -27075 -16085 8563 6904 27913 46058 26452 2119 -5532 -6528 43596 50938
2065 50938 -154 -18796 342 -11285 -30906 -2048 38191 30254 26668 7766 19713 30866
$$ [...]
##END NTUPLES=NMR SPECTRUM
##END=
