##TITLE=Analysis number 323441
Compound Code cc 05839
Project Code adrs
Chemist Name af chempharm
##JCAMPDX= 6.0         $$ Bruker NMR JCAMP-DX V2.0
##DATA TYPE= NMR SPECTRUM
##DATA CLASS= NTUPLES
##ORIGIN= Bruker BioSpin GmbH
##OWNER= nmr
$$ XWIN-NMR		Version 3.5
$$ Wed Oct 25 10:33:07 2006 GMT Daylight Time (UT+1h)  MAYBRIDGE\nmr@NMR_250MHZ
##.OBSERVE FREQUENCY= 250.131544655141
##.OBSERVE NUCLEUS= ^1H
##.ACQUISITION MODE= SIMULTANEOUS (DQD)
##.ACQUISITION SCHEME= undefined
##.AVERAGES= 16
##.DIGITISER RES= 18
##SPECTROMETER/DATA SYSTEM= dpx250
##.PULSE SEQUENCE= zg30
##.SOLVENT NAME= CDCl3
##.SHIFT REFERENCE= (INTERNAL, CDCl3, 0, 16.4543)
##AUDIT TRAIL= $$ (NUMBER, WHEN, WHO, WHERE, WHAT)
$$ ##TITLE= Audit trail, XWIN-NMR		Version 3.5
$$ ##JCAMPDX= 5.01
$$ ##ORIGIN= Bruker BioSpin GmbH
$$ ##OWNER= nmr
$$ C:\u/data/dgb/nmr/ADRS/1250/pdata/1/auditp.txt
$$ ##AUDIT TRAIL=  $$ (NUMBER, WHEN, WHO, WHERE, WHAT)
(   1,<2006-10-25 10:31:45.33 +100>,<MAYBRIDGE\nmr>,<NMR_250MHZ>,
      <created by zg, POWCHK disabled, PULCHK disabled
       configuration hash MD5:
       49 4B E0 1D 92 C2 6B 37 9F E6 65 BC 52 41 86 1D
       data hash MD5: 64K
       A5 32 74 10 D9 D0 98 E1 E3 3E 85 2F C7 F2 93 F8>)
(   2,<2006-10-25 10:32:34.00 +100>,<MAYBRIDGE\nmr>,<NMR_250MHZ>,
      <Start of raw data processing
       ef LB = 0.3 FT_mod = 6 PKNL = 1 SI = 32K 
       data hash MD5: 32K
       05 20 B4 32 A0 03 E2 81 01 5C 7D 98 47 BD E9 8D>)
(   3,<2006-10-25 10:32:41.42 +100>,<MAYBRIDGE\nmr>,<NMR_250MHZ>,
      <apk 
       data hash MD5: 32K
       16 31 CD CD F3 8A 6F CE 3C 56 EA 4A D7 6C 72 1A>)
(   4,<2006-10-25 10:32:49.08 +100>,<MAYBRIDGE\nmr>,<NMR_250MHZ>,
      <abs ABSG = 5 
       data hash MD5: 32K
       67 DA C3 C5 F7 2E A3 A5 63 0E 83 FD 22 C9 9A B1>)
$$ ##END=
$$ 
$$ hash MD5
$$ E8 DF 38 C5 52 D8 66 73 2D A5 A9 C8 AC 21 6D 93
##$RELAX= 
##$RELAX= 
##$RELAX= 
##$RELAX= 
##$RELAX= 
##$RELAX= 
##$RELAX= 
$$ Bruker specific parameters
$$ --------------------------
##$DU= <C:\u>
##$EXPNO= 1250
##$NAME= <ADRS>
##$PROCNO= 1
##$TYPE= <nmr>
##$USER= <dgb>
##$AMP= (0..31)
100 100 100 100 100 100 100 100 100 100 100 100 100 100 100 100 100 100 
100 100 100 100 100 100 100 100 100 100 100 100 100 100 
##$AQSEQ= 0
##$AQ_mod= 3
##$AUNM= <au_zg>
##$AUTOPOS= <9 >
##$BF1= 250.13
##$BF2= 250.13
##$BF3= 250.13
##$BF4= 250.13
##$BF5= 500.13
##$BF6= 500.13
##$BF7= 500.13
##$BF8= 500.13
##$BYTORDA= 1
##$CFDGTYP= 0
##$CFRGTYP= 5
##$CHEMSTR= <none>
##$CNST= (0..31)
1 1 145 1 1 1 1 1 1 1 1 1 1 1 1 1 1 1 1 1 1 1 1 1 1 1 1 1 1 1 1 1 
##$CPDPRG= <>
##$CPDPRG1= <>
##$CPDPRG2= <>
##$CPDPRG3= <>
##$CPDPRG4= <mlev>
##$CPDPRG5= <mlev>
##$CPDPRG6= <mlev>
##$CPDPRG7= <mlev>
##$CPDPRG8= <mlev>
##$CPDPRGB= <>
##$CPDPRGT= <>
##$D= (0..31)
0 1 0 0 0 0 0 0 0 0.06 0 0 0 0 0 0 0.0002 0 0 0 0 0 0 0 0 0 0 0 0 0 0 
0 
##$DATE= 1161768701
##$DBL= (0..7)
120 120 120 120 120 120 120 120 
##$DBP= (0..7)
150 150 150 150 150 150 150 150 
##$DBP07= 0
##$DBPNAM0= <>
##$DBPNAM1= <>
##$DBPNAM2= <>
$$ [...]
##$SUBNAM7= <"">
##$SUBNAM8= <"">
##$SUBNAM9= <"">
##$SW= 20.6930455092707
##$SWIBOX= (0..15)
0 0 3 0 0 0 0 0 0 0 0 0 0 0 0 0 
##$SW_h= 5175.983436853
##$TD= 65536
##$TD0= 1
##$TE= 683.16
##$TE2= 300
##$TE3= 300
##$TEG= 300
##$TL= (0..7)
0 120 120 120 120 120 120 120 
##$TP= (0..7)
150 150 150 150 150 150 150 150 
##$TP07= 0
##$TPNAME0= <>
##$TPNAME1= <>
##$TPNAME2= <>
##$TPNAME3= <>
##$TPNAME4= <>
##$TPNAME5= <>
##$TPNAME6= <>
##$TPNAME7= <>
##$TPOAL= (0..7)
0.5 0.5 0.5 0.5 0.5 0.5 0.5 0.5 
##$TPOFFS= (0..7)
0 0 0 0 0 0 0 0 
##$TUNHIN= 0
##$TUNHOUT= 0
##$TUNXOUT= 0
##$USERA1= <user>
##$USERA2= <user>
##$USERA3= <user>
##$USERA4= <user>
##$USERA5= <user>
##$V9= 5
##$VALIST= <valist>
##$VCLIST= <CCCCCCCCCCCCCCC>
##$VD= 0
##$VDLIST= <DDDDDDDDDDDDDDD>
##$VPLIST= <PPPPPPPPPPPPPPP>
##$VTLIST= <TTTTTTTTTTTTTTT>
##$WBST= 1024
##$WBSW= 4
##$XGAIN= (0..3)
0 0 0 0 
##$XL= 0
##$YL= 0
##$YMAX_a= 572743
##$YMIN_a= -578284
##$ZGOPTNS= <>
##$ZL1= 120
##$ZL2= 120
##$ZL3= 120
##$ZL4= 120
##$ABSF1= 16.4543
##$ABSF2= -4.238873
##$ABSG= 5
##$ABSL= 3
##$ALPHA= 0
##$AQORDER= 0
##$ASSFAC= 0
##$ASSFACI= 0
##$ASSFACX= 0
##$ASSWID= 0
##$AUNMP= <proc_1d>
##$AZFE= 0.1
##$AZFW= 0.1
##$BCFW= 0
##$BC_mod= 0
##$BYTORDP= 0
##$COROFFS= 0
##$CY= 12.5
##$DATMOD= 1
##$DC= 0
##$DFILT= <>
##$DTYPP= 0
##$F1P= 14.0000005364418
##$F2P= -0.99999901652339
##$FCOR= 0.5
##$FTSIZE= 32768
##$FT_mod= 6
##$GAMMA= 0
##$GB= 0
##$INTBC= 1
##$INTSCL= 1
##$ISEN= 128
##$LB= 0.3
##$LEV0= 0
##$LPBIN= 0
##$MAXI= 10000
##$MC2= 0
##$MEAN= 0
##$ME_mod= 0
##$MI= 0
##$NCOEF= 0
##$NC_proc= -2
##$NLEV= 6
##$NOISF1= 0
##$NOISF2= 0
##$NSP= 0
##$NTH_PI= 0
##$NZP= 0
##$OFFSET= 16.4543
##$PC= 1
##$PHC0= -51.9665
##$PHC1= 12.00983
##$PH_mod= 1
##$PKNL= yes
##$PPARMOD= 0
##$PSCAL= 4
##$PSIGN= 0
##$REVERSE= no
##$SF= 250.130016932449
##$SI= 32768
##$SIGF1= 0
##$SIGF2= 0
##$SINO= 400
##$SIOLD= 32768
##$SREGLST= <1H.CDCl3>
##$SSB= 0
##$STSI= 32768
##$STSR= 0
##$SW_p= 5175.98343685301
##$SYMM= 0
##$S_DEV= 0
##$TDeff= 65536
##$TDoff= 0
##$TI= <Analysis number 999999
Compound Code 99
Book Reference 9
Project Code 9>
##$TILT= no
##$TM1= 0
##$TM2= 0
##$TOPLEV= 0
##$USERP1= <user>
##$USERP2= <user>
##$USERP3= <user>
##$USERP4= <user>
##$USERP5= <user>
##$WDW= 1
##$XDIM= 32768
##$YMAX_p= 535014679
##$YMIN_p= -47267
$$ End of Bruker specific parameters
$$ ---------------------------------
##NTUPLES= NMR SPECTRUM
##VAR_NAME=  FREQUENCY,     SPECTRUM/REAL,   SPECTRUM/IMAG
##SYMBOL=    X,             R,               I
##VAR_TYPE=  INDEPENDENT,   DEPENDENT,       DEPENDENT
##VAR_FORM=  AFFN,          ASDF,            ASDF
##VAR_DIM=   32768,         32768,           32768
##UNITS=     HZ,            ARBITRARY UNITS, ARBITRARY UNITS
##FACTOR=    0.157963299565203, 1,           1
##FIRST=     4115.71431929153, 0,            0
##LAST=      -1060.26911756148, 0,           0
##MIN=       -1060.26911756148, -47267,      0
##MAX=       4115.71431929153, 535014679,    0
$$ Real data points
##PAGE= N=1
##DATA TABLE= (X++(R..R)), XYDATA
$$ [...]
$$ plain form
15132 -5995 -9500 -15646 -12445 -18449 -14655 -7759 -6323 -6749 -1671 6394 6828 -4642 -2084 -1880 1110
15117 1110 2053 -11104 -16150 -18963 -6450 -2114 -10712 -12934 -3739 -3072 -1365 14521 14060 9584 3433
15102 3433 -1946 -18625 -21893 -4479 5554 3647 11681 10005 11825 8373 5605 2551 8115 13759
15088 13759 933 -6253 -15004 -21798 -22231 -19681 -10274 -12193 -12528 1819 -320 -6893 -11931 -7434
15074 -7434 -6042 -2163 644 1901 6477 6148 -4711 -1752 -7714 -13953 -7109 -659 4568 1386 -3179
15059 -3179 -11241 -9124 -800 4451 2397 1145 -6031 -7690 -8943 -573 1280 13406 20144 17624
15045 17624 19533 16494 12841 8122 -3115 -7068 -2948 -1527 -13979 -19706 -14196 -3084 1484 -466
15031 -466 -10597 -24119 -20316 -12388 -5748 3794 8587 1160 4352 714 -5187 -7574 -14501 -4476
$$ packed form
15132e995l505o146L201o004L794O896J436m26N078Q065M34j1470K558K04K990
15117A110R43j3157n046k813J2513M336q598k222R195O67J707J5886m61m476o151
15102C433n379j6679l268J7414J0033j907Q034j676J820l452k768l054N564N644
15088A3759j2826p186q751o794m33K550R407j919l35J4347k139o573n038M497
15074g434J392L879K807J257M576l29j0859K959n962o239O844O450N227l182m565
15059c179q062K117Q324N251k054j252p176j659j253Q370J853J2126O738k520
15045A7624J909l039l653m719j1237l953M120J421j2452n727N510J1112M568j950
15031d66j0131j3522L803P928O640R542M793p427L192l638n901k387o927J0025
$$ plain form
15017 -4476 -5763 -7502 -6670 -2610 7857 19839 23349 13325 9249 12958 5434 -6789 -8602 -1599
15003 -1599 -11884 -1985 11671 6934 1355 7182 5563 5942 5215 10016 269 1625 -1912 3169 -999
14988 -999 1691 9964 22652 18639 13052 11901 -9613 -14866 -3679 4336 3802 -1074 -2299 7480
14974 7480 14352 9053 -10383 -18119 -130 18564 19631 14709 2628 -5432 -18921 -10377 966
14961 966 4 6449 7416 2764 -10409 -7471 -41 -7761 -747 5045 3914 1396 -8693 -8889 6274
14946 6274 7854 7326 19778 27515 23100 29514 22439 18589 22928 23644 25407 16895 12429 16290 18742
14931 18742 21358 23733 26175 19315 18132 30720 25627 24641 23082 21223 24121 28904 23563 13076
14917 13076 6559 13449 13502 7496 15634 12710 4021 4056 13103 18531 21359 22533 11025 10150 18603
$$ packed form
15017d476j287j739Q32M060J0467J1982L510j0024m076L709p524j2223j813P003
15003a599j0285R899J3656m737n579N827j619L79p27M801r747J356l537N081m168
14988i99K690Q273J2688m013n587j151k1514n253J1187Q015n34m876j225R779
14974G480O872n299j9436p736J7989J8694J067m922j2081q060j3489Q544J1343
14961I66r62O445R67m652j3173K938P430p720P014N792j131k518j0089j96J5163
14946F274J580n28J2452P737m415O414p075l850M339P16J763q512m466L861K452
14931A8742K616K375K442o860j183J2588n093r86j559j859K898M783n341j0487
14917A3076o517O890N3o006Q138k924q689L5R047N428K828J174j1508q75Q453
$$ plain form
14902 18603 20807 14004 8538 857 -3390 -3552 7294 16682 6483 -9269 -8944 -398 7386 14660
14888 14660 14092 661 -5508 -2391 -1789 712 3761 -6273 -6637 -5824 -9728 -14488 -13375 -13991 -4794
14873 -4794 -6387 -11174 -7924 2246 14460 16524 34858 34785 33029 18890 2861 2961 12035 -376
14859 -376 739 3243 4250 16790 7921 -6731 -12509 -22477 -9212 -4545 -11561 -11131 -12762 -4890
14845 -4890 -4890 -10446 3439 2443 3557 -4538 -13469 -937 5736 1101 -2932 -5435 -4108 -9266 -11394
14830 -11394 -16279 -10195 -6245 -5955 832 -816 -7750 -4135 -10232 -16292 -19601 -11416 -967 -4510
14816 -4510 -11750 -12742 -3577 476 -895 -216 -6277 -21213 -23753 -26037 -21227 -18315 -6738 6949
14802 6949 3847 3926 -10601 -22697 -24415 -26929 -28688 -19292 -12618 -8097 -6879 -251 -4268 -14300
$$ packed form
14902A8603K204o803n466p681m247j62J0846R388j0199j5752L25Q546P784P274
14888A4660n68j3431o169L117O02K501L049j0034l64Q13l904m760J113o16R197
14873d794j593m787L250J0170J2214K064J8334p3j756j4139j6029J00R074j2411
14859c76J115K504J007J2540q869j4652n778r968J3265M667p016M30j631P872
14845d890%n556J3885r96J114q095q931J2532O673m635m033k503J327n158k128
14830a1394m885O084L950K90O787j648o934L615o097o060l309Q185J0449l543
14816d510p240r92R165M053j371O79o061j4936k540k284M810K912J1577J3687
14802F949l102P9j4527j2096j718k514j759R396O674M521J218O628m017j0032
$$ plain form
14788 -14300 -9486 -14280 -8572 -8796 -1041 5482 3577 8928 1173 -6496 -11210 -6436 5327 5311 -6760
14773 -6760 -18659 -23524 -11557 -12790 -17624 -17488 -17000 -19001 -21703 -16629 -16354 -18748 -837 3405 10220
14758 10220 8942 7627 403 -10812 -13952 -6416 4561 -281 -12103 -15092 -10113 460 -7096
14745 -7096 -11716 -7480 -5212 -11408 -5303 2925 1267 3400 1135 -3315 -1670 398 -1540 -13494
14731 -13494 -13579 -4920 -10398 -10155 -4270 -5574 -4845 -582 -964 -6032 -6186 -4581 -2018 4007 10476 3269
14715 3269 -13359 -11057 -5567 -12919 -23902 -15921 -9200 -12317 -8408 -3533 5674 3056 16778 35486
14701 35486 29334 8772 -14194 -19638 -3041 -2860 -7653 -12369 -13197 -8675 -14494 -6730 -1028 -1791
14687 -1791 -7992 -7318 180 -11250 -18749 -10897 -13289 -14077 -1579 2088 95 3927 13168 12009 1737
$$ packed form
14788a4300M814m794N708k24P755O523j905N351p755p669m714M774J1763j6j2071
14773f760j1899m865J1967j233m834J36M88k001k702N074K75k394J7911M242O815
14758A0220j278j315p224j1215l140P536J0977m842j1822k989M979J0573p556
14745g096m620M236K268o196O105Q228j658K133k265m450J645K068j938j1954
14731a3494q5Q659n478K43N885j304P29M263l82n068j54J605K563O025O469p207
14715C269j6628K302N490p352j0983P981O721l117L909M875R207k618J3722J8708
14701C5486o152k0562k2966n444J6597J81m793m716q28M522n819P764N702p63
14687a791o201O74P498j1430p499P852k392p88J2498L667j993L832R241j159j0272
$$ plain form
14672 1737 -9266 -5437 5919 5971 4082 5914 6675 1639 -8853 -11480 -10629 -8956 7498 4629 -7212
14657 -7212 -13861 -12043 -9311 -1434 -3286 8462 -91 7817 16058 12604 14826 7967 8842 9680 9898
14642 9898 23154 16509 -348 -15464 -27885 -19325 -7500 -8001 -5701 -11846 -7683 413 -9553 -22716
14628 -22716 -20380 -18866 -11282 -12143 -25573 -16863 -3647 2392 -3068 -2825 5696 4288 8666 16142
14614 16142 17694 17478 10181 388 10629 14399 18819 22442 20108 -2818 -14133 -9204 5085 15779
14600 15779 13693 12518 12058 7852 3077 -3267 -472 4361 6193 5020 -4436 -15371 -14581 -3937
14586 -3937 939 4043 -1041 4531 6726 -421 -1878 -4225 -1208 -14745 -20264 -21598 -9669 1684
14572 1684 -4029 -5659 -16024 -13705 -6394 -4374 -4751 -17524 -20975 -18665 -13950 -1076 243 1866
$$ packed form
14672A737j1003L829J1356N2j889J832P61n036j0492k627Q51J673J6454k869j1841
14657g212o649J818K732P877j852J1748q553P908Q241l454K222o859Q75Q38K18
14642I898J3256o645j6857j5116j2421Q560J1825n01K300o145M163Q096r966j3163
14628b2716K336J514P584q61j3430Q710J3216O039n460K43Q521j408M378P476
14614A6142J552k16p297r793J0241L770M420L623k334k2926j1315M929J4289J0694
14600A5779k086j175m60m206m775o344K795M833J832j173r456j0935P90J0644
14586c937M876L104n084N572K195p147j457k347L017j3537n519j334J1929J1353
14572A684n713j630j0365K319P311K020l77j2773l451K310M715J2874J319J623
$$ plain form
14558 1866 5601 -1374 -4873 -3814 -1054 5356 6184 1364 -7928 -15891 -18526 -14060 -6769 -18707 -17880
14543 -17880 -16361 -19475 -21080 -10040 -11589 -19314 -8980 -207 -1244 -4296 -7222 -11035 -7397 -10135
14529 -10135 -1671 1156 3836 6018 7497 9771 -3306 -18423 -14023 -14463 -5150 3383 5716 -911
14515 -911 -14154 -21539 -18712 -14605 -1377 -14650 -19009 -11286 -4870 138 4595 1167 -3504 -1417
14501 -1417 -9700 -18514 -15825 -4214 -7982 -13146 -18544 -18980 -17120 -4315 6061 14364 12222 5449
14487 5449 6411 11893 9700 6386 3197 4711 3729 -3676 -12143 -22472 -17229 -15487 -14889 -15321 -8732
14472 -8732 3659 10296 4655 -4763 3907 -718 -3192 -12073 -4379 -2959 -3926 1846 -5650 -6695 -4184
14457 -4184 15362 11187 219 -19124 -18858 -11077 -7395 -6843 918 7947 -6915 2089 4964 8442
$$ packed form
14558A866L735o975l499J059K760O410Q28m820r292p963k635M466P291j1938Q27
14543a7880J519l114j605J1040j549p725J0334Q773j037l052k926l813L638k738
14529a0135Q464K827K680K182J479K274j3077j5117M400m40R313Q533K333o627
14515i11j3243p385K827M107J3228j3273m359P723O416N008M457l428m671K087
14501a417q283q814K689J1611l768n164n398m36J860J2805J0376Q303k142o773
14487E449R62N482k193l314l189J514r82p405q467j0329N243J742N98m32O589
14472h732J2391O637n641r418Q670m625k474q881P694J420r67N772p496j045K511
14457d184J9546m175j0968j9343K66P781L682N52P761P029j4862R004K875L478
$$ plain form
14443 8442 7616 9840 15045 6140 459 -8318 -4655 -2382 -4047 -22622 -28789 -14563 -4666 -3625
14429 -3625 -6411 -18722 -21149 -30578 -9267 7464 5949 -1893 -1344 9419 8079 10987 9856 -8784
14415 -8784 -77 7967 10020 19891 8429 -4331 -8710 1016 3356 11844 13156 23574 16962 11450
14401 11450 21761 29421 19736 -1901 -9062 -12437 1082 1559 5283 10605 4710 5821 12955 5370
14387 5370 10158 -8222 -14679 -9059 -4320 -5891 -8609 -14721 -2533 4102 -2550 -12081 -20290 -16896
14373 -16896 -4019 4513 -3103 -7642 -11345 -3418 3887 493 -5827 2020 5342 5060 13200 19588
14359 19588 22776 25882 16419 4038 -563 -7568 -15245 -19226 -7551 424 3456 -5946 4179 277
14345 277 -5897 5247 6560 3414 4239 11623 5508 2183 -2962 -3634 -11268 -15252 -26159 -26292 -7581
$$ packed form
14443H442q26K224N205q905n681q777L663K273j665j8575o167J4226R897J041
14429c625k786j2311k427r429K1311J6731j515p842N49J0763j340K908j131j8640
14415h784Q707Q044K053R871j1462j2760m379R726K340Q488J312J0418o612n512
14401A1450J0311P660r685k1637p161l375J3519M77L724N322n895J111P134p585
14387E370M788j8380o457N620M739j571k718o112J2188O635o652r531q209L394
14373a6896J2877Q532p616m539l703P927P305l394o320P847L322k82Q140O388
14359A9588L188L106r463j2381m601p005p677l981J1675P975L032r402J0125l902
14345B77o174J1144J313l146Q25P384o115l325n145o72p634l984j0907j33J8711
$$ plain form
14330 -7581 -1200 -4074 -3933 409 -895 4798 11837 7113 -1110 -9190 -6399 6502 4067 -11029
14316 -11029 -2046 1948 -357 195 -1887 53 6957 8676 6306 -11563 -12139 -5603 3716 -4372 1383
14301 1383 -6437 -5993 -7682 -3758 -20912 -24274 -14692 40 5379 -42 -3210 -6171 -3131 -10143
14287 -10143 -17878 -12366 -18206 -23576 -11798 1508 3964 1835 -346 -2304 9250 16283 -905
14274 -905 -11957 -23913 -26110 -24729 -22825 -20050 -28712 -24478 -18405 -24364 -16287 -14498 -9440 4936
14260 4936 7005 16348 20481 25145 24233 20159 9916 1678 -2362 -2694 -1881 -2093 2831 8443 10324
14245 10324 12871 12470 599 7253 18763 16567 30983 22149 16010 25056 20363 17221 20757 20965
14231 20965 22294 21094 16042 7713 -4659 -7897 -3093 2020 11225 16925 11479 3498 3696 6496
$$ packed form
14330g581O381k874J41M342j304N693P039m724q223q080K791J2901k435j5096
14316a1029Q983L994k305N52k082J940O904J719k370j7869n76O536R319q088N755
14301A383p820M44j689L924j7154l362R582J4732N339n421l168k961L040p012
14287a0143p735N512n840n370J1778J3306K456k129k181j958J1554P033j7188
14274i05j1052j1956k197J381J904K775q662M234O073n959Q077J789N058J4376
14260D936K069R343M133M664r12m074j0243q238m040l32Q13k12M924N612J881
14245A0324K547m01j1871O654J1510k196J4416q834o139R046m693l142L536K08
14231B0965J329j200n052q329j2372l238M804N113R205N700n446p981J98K800
$$ plain form
14217 6496 -2042 -391 689 4502 16245 18436 8795 -4788 -3346 -7308 -12216 -4698 6005 6303
14203 6303 -7919 -22039 -23906 -5677 -741 9667 8286 6511 5623 5110 4612 -568 1620 8145
14189 8145 8558 -709 -5072 -9453 -6409 -12010 -11192 -3780 -8496 -16623 -16148 -23116 -20954 -10242 1865
14174 1865 12777 13686 9978 17032 9546 -6182 -6013 -10576 -14400 -17335 -16915 11337 14206 3374
14160 3374 182 7458 7878 3941 9515 9072 5337 -1350 52 4579 -6315 -14849 -18778 -17931 -12799
14145 -12799 -7861 -18635 -2524 12292 16195 14856 10245 5933 7979 -1295 -1111 2974 -11701 -14394
14131 -14394 -13760 -18729 -27289 -14853 -11268 -9636 -12797 -15019 -20786 -21912 -26773 -24899 -15395 -17218
14117 -17218 -9753 -10647 -4728 307 1187 378 11548 15639 11486 6347 11331 933 -3154 -649 -3986
$$ packed form
14217F496q538J651J080L813J1743K191r641j3583J442l962m908P518J0703K98
14203F303j4222j4120j867J8229M936J0408j381j775q88n13m98n180K188O525
14189H145M13r267m363m381L044n601Q18P412m716q127M75o968K162J0712J2107
14174A865J0912R09l708P054p486j5728J69m563l824k935M20K8252K869j0832
14160C374l192P276M20l937N574m43l735o687J402M527j0894q534l929Q47N132
14145a2799M938j0774J6111J4816L903j339m611m312K046r274J84M085j4675k693
14131a4394O34m969q560J2436L585J632l161k222n767j126m861J874R504j823
14117a7218P465q94N919N035Q80q09J1170M091m153n139M984j0398m087K505l337
$$ plain form
14102 -3986 -16191 -15204 -5300 -500 2888 -8524 -12356 -19083 -20138 -3982 2550 4181 7033 1313
14088 1313 3177 -4502 -6821 6319 7661 667 -10627 -8450 -6566 -359 -1702 -10070 -1647 1539
14074 1539 1195 4315 2740 -3743 -1117 -5203 -13779 -20598 -16954 -12612 -13045 -11902 -4475 184 -4868
14059 -4868 -3321 -2526 -982 2427 -4655 1364 6173 -7199 -17500 -7041 5980 18599 16205 14603
14045 14603 12477 -1403 -3340 3710 5898 -1475 -2911 -6076 -19975 -27752 -16297 -8910 -3960 -2669
14031 -2669 -6252 -18697 -13759 -11706 -23723 -21252 -14954 -4733 5413 5306 -11217 -11922 -1149 816
14017 816 -6917 -7381 -2631 11443 19662 10739 8913 8586 5804 -1752 -4929 4700 10414 4509 -17330
14002 -17330 -15937 -18669 -25591 -14877 -14682 -15245 -6731 -2580 -9107 470 7304 -4958 -17509 -25434
$$ packed form
14102c986j2205R87R904M800L388j1412l832o727j055J6156O532J631K852n720
14088A313J864p679k319J3140J342o994j1294K177J884O207j343q368Q423L186
14074A539l44L120j575o483K626m086q576o819L644M342m33J143P427M659n052
14059d868J547P95J544L409p082O019M809j3372j0301J0459J3021J2619k394j602
14045A4603k126j3880j937P050K188p373j436l165j3899p777J1455P387M950J291
14031b669l583j2445M938K053j2017K471O298J0221J0146j07j6523p05J0773J965
14017H16p733m64M750J4074Q219q923j826l27k782p556l177R629N714n905k1839
14002a7330J393k732o922J0714J95n63Q514M151o527R577O834j2262j2551p925
$$ plain form
13988 -25434 -25201 -13546 -8362 -762 5134 8899 7832 5542 1661 -9497 -1869 -666 -7736 -10306
13974 -10306 -15787 -18088 -20050 -16499 -16113 -29391 -27376 -13355 -2513 -6415 -3246 -829 3353 5472
13960 5472 -7832 -3409 4682 2216 4853 4879 -3094 -20430 -29655 -31518 -23980 -22622 -15112 -8529 -12617
13945 -12617 -5597 -3548 8827 21153 22024 16170 19527 10244 6106 -1139 -13409 -21014 -6828 -3480
13931 -3480 12900 23117 5070 -5483 5242 9860 -3331 -4374 -3112 4357 8037 12962 9620
13918 9620 972 -8751 -31928 -29900 -25147 -20708 -4660 2375 -409 -2831 -58 -538 4111 9088
13904 9088 18109 14250 7640 364 -19028 -22988 -11332 -526 1537 -324 -4698 -4989 714 9140
13890 9140 16131 21158 14931 3821 -8265 -3185 -12763 -23530 -27494 -15244 -20513 -15509 -17259 -12209
$$ packed form
13988b5434K33J1655N184P600N896L765j067k290l881j1158P628J203p070k570
13974a0306n481k301j962L551L86j3278K015J4021J0842l902L169K417M182K119
13960E472j3304M423Q091k466K637K6p973j7336r225j863P538J358P510O583m088
13945a2617P020K049J2375J2326Q71n854L357r283m138p245j2270p605J4186L348
13931c480J6380J0217j8047j0553J0725M618j3191j043J262P469L680M925l342
13918I620q648r723k3177K028M753M439J6048P035k784k422K773m80M649M977
13904I088R021l859o610p276j9392l960J1656J0806K063j861m374k91N703Q426
13890I140O991N027o227j1110j2086N080r578j0767l964J2250n269N004j750N050
$$ plain form
13876 -12209 -3665 -8794 -3340 -214 -10262 -8654 3875 3943 8279 15215 16547 9997 6677 11029
13862 11029 9773 10318 18051 21869 25210 23444 19234 22448 31062 27847 16322 12566 10843 17239
13848 17239 6009 -8280 -7185 -4695 3110 -2402 -10316 -14612 -5232 -5003 -818 -1787 10611 13189
13834 13189 7949 746 -4996 1660 5603 -3514 -17096 -20003 -9501 -3746 385 2839 -1264 -6204
13820 -6204 -13939 -15933 -13781 -22058 -24429 -21771 -19375 -10191 -2852 -8948 -9070 -3086 -4282 -6661 -4439
13805 -4439 -392 7676 15326 14972 17768 22079 10743 -166 -5028 5276 13381 2901 -4894 -6725
13791 -6725 -13299 -16467 -11048 -18313 -23058 -23661 -23942 -18960 -9754 -5760 -14629 -13493 -17297 -16746 -14160
13776 -14160 -10731 -8502 -13653 -4955 -2785 5245 -1555 -9757 -14353 -10892 1750 9684 4526 -5499
$$ packed form
13876a2209Q544n129N454L126j0048J608J2529O8M336O936J332o550l320M352
13862A1029j256N45P733L818L341j766m210L214Q614l215j1525l756j723O396
13848A7239j1230j4289J095K490P805n512p914m296R380K29M185r69J2398K578
13834A3189n240p203n742O656L943r117j3582k907J0502N755M131K454m103m940
13820f204p735j994K152q277k371K658K396R184P339o096j22N984j196k379K222
13805d439M047Q068P650l54K796M311j1336j0909m862J0304Q105j0480p795j831
13791f725o574l168N419p265m745o03k81M982R206L994q869J136l804N51K586
13776a4160L429K229n151Q698K170Q030o800q202m596L461J2642P934n158j0025
$$ plain form
13762 -5499 -1833 240 -15844 -16276 -12824 -8141 -18237 -19254 -19597 -11803 -3824 -667 836 2347 3613
13747 3613 6219 -953 -9441 -14766 -19864 -25775 -17376 -8959 -2994 1616 4452 -640 -4782 1932 -1154
13732 -1154 -12609 -16261 -10445 -7260 -11342 1612 11619 5830 -4577 -4355 -4999 6667 9341 -9722
13718 -9722 -6022 -6581 -8500 -2714 9338 7725 1459 -8123 -6937 -9419 -15259 -14862 -11731 -5394 1158
13703 1158 -66 7342 12728 11611 23925 34793 24138 15498 8509 4287 4625 3645 -3626 -9261
13689 -9261 -11539 -1755 9651 16980 12924 3469 -11480 -12812 -19912 -28784 -22516 -11241 -9403 -21866
13675 -21866 -20974 -4535 -4062 7971 9465 152 -485 4689 -1621 283 7585 15115 11455 8697 9485
13660 9485 10908 -4582 -10692 -7469 -8360 -17640 -35548 -37882 -32595 -30617 -24823 -14060 -15165 -7328
$$ packed form
13762e499L666K073j6084m32L452M683j0096j017l43P794P979L157J503J511J266
13747C613K606p172q488n325n098n911Q399Q417N965M610K836n092m142O714l086
13732a154j1455l652N816L185m082J2954J0007n789j0407K22o44J1666K674j9063
13718i722L700n59j919N786J2052j613o266r582J186k482n840L97L131O337O552
13703A158j224P408N386j117J2314J0868j0655q640o989m222L38r80p271n635
13689i261k278R784J1406P329m056r455j4949j332p100q872O268J1275J838j2463
13675b1866Q92J6439M73J2033J494r313o37N174o310J904P302P530l660k758P88
13660I485J423j5490o110L223q91r280j7908k334N287J978N794J0763j105P837
$$ plain form
13646 -7328 2602 1980 -33 -10348 -10924 -4631 -13012 -21250 -9436 9762 20221 17584 6435 2307
13632 2307 -4757 -6311 -14686 -19114 -22402 -21181 -23565 -25779 -17464 -7037 5715 -498 -12900 -12306
13618 -12306 -5860 -3447 506 -9032 -12606 -14732 -2753 -7498 2983 12615 16029 8783 -1541 -11565
13604 -11565 -15851 -27225 -32459 -34475 -26267 -9305 6039 16494 11765 4481 1830 8095 12866
13591 12866 8564 -3983 -5380 -1114 4290 -5543 -21838 -23531 -18202 -11045 -5065 -7135 -11464 -9410
13577 -9410 -14459 -6511 3037 -1005 -11948 2422 21933 13739 2050 -5630 -7181 -7451 -1797 -7561
13563 -7561 -7560 3176 8909 15116 12946 -6155 -12244 -15765 -15567 4896 587 -5215 -4117 -3275 -2651
13548 -2651 5902 9530 6149 6825 2400 -4771 -13324 -2025 5701 13411 10299 21269 25992 10979
$$ packed form
13646g328R930o22k013j0315n76O293q381q238J1814J9198J0459k637j1149m128
13632B307p064j554q375m428l288J221k384k214Q315J0427J2752o213j2402N94
13618a2306O446K413L953r538l574k126J1979m745J0481R632L414p246j0324j0024
13604a1565m286j1374n234k016Q208J6962J5344J0455m729p284k651O265M771
13591A2866m302j2547j397M266N404r833j6295j693N329P157N980k070m329K054
13577i410n049P948R548m042j0943J4370J9511q194j1689p680j551k70N654n764
13563g561JJ0736N733O207k170j9101o089l521J98K0463m309n802J098Q42O24
13548b651Q553L628l381O76m425p171q553J1299P726P710l112J0970M723j5013
$$ plain form
13534 10979 18138 14254 3936 1582 3848 13170 14438 5020 7430 320 1442 6315 8177 3069
13520 3069 3390 10562 16849 18614 12407 3973 835 8310 8129 10639 -2039 1393 -32 -563 3234
13505 3234 5268 -7740 -13436 -7457 -3393 -3252 -8241 -10343 -8323 11874 7722 -7846 -370 -5182
13491 -5182 -12115 2263 9190 -3430 1371 8563 15159 15752 33518 24478 4265 1266 -3110 -2933
13477 -2933 -6510 -9385 1950 -1112 2856 -5157 -6442 -8913 -4486 -3088 2224 -11300 -15449 -3741
13463 -3741 1139 -3997 -4243 -4932 1893 53 -6218 -14178 -15597 -23331 -20633 -7398 -5177 -6493 754
13448 754 4319 -416 -3097 -3114 3063 4474 -9635 -23778 -31342 -21136 -12885 -13912 -14616 233 -5008
13433 -5008 -12037 -7805 -6346 -3926 -12715 -22345 -22187 -11732 -9768 -18946 -4033 2870 -2728 -14453
$$ packed form
13534A0979P159l884j0318k354K266R322J268r418K410p110J122M873J862n108
13520C069L21P172O287J765o207q434l138P475j81K510j2678L432j425n31L797
13505C234K034j3008n696N979M064J41m989k102K020K0197m152j5568P476m812
13491e182o933J4378O927j2620M801P192O596N93J7766r040k0213k999m376J77
13477b933l577k875J1335l062L968q013j285k471M427J398N312j3524m149J1708
13463c741M880n136k46o89O825j840o271p960j419p734K698J3235K221j316P247
13448G54L565m735k681j7O177J411j4109j4143p564J0206Q251j027p04J4849n241
13433e008p029M232J459K420q789r630J58J0455J964r178J4913O903n598j1725
$$ plain form
13419 -14453 -22033 -23384 -27246 -15881 -3396 -7760 -14151 -7874 5814 12951 11244 9115 4002 779
13405 779 6672 12127 11654 17436 22643 12751 10655 14644 3307 1852 -2887 -2289 -10156 -16695 -4474
13390 -4474 8230 15660 13698 8887 -6663 -9502 -8058 -15829 -16486 -13893 -3617 6617 -1114 -17381
13376 -17381 -19857 -25323 -22447 -13905 -14830 -7556 -2504 5169 4081 -1721 -11318 -19730 -12060 -7092 -13043
13361 -13043 -17197 -20461 -9313 -6433 -13511 -22779 -24310 -12657 -17685 -15766 -6979 3191 -6496 -14401
13347 -14401 -20460 -15731 -5731 -3764 -5386 -1795 -6770 -2846 6175 1874 -14280 -19203 -11916 -13439
13333 -13439 -14218 -8558 -4888 -4353 7645 -2784 -8491 8250 -1181 -12695 -11064 -21714 -20828 -5588
13319 -5588 -2914 6193 2325 -14688 -22885 -7276 -6003 -8083 1903 13882 -178 -13661 -14561 -737
$$ packed form
13419a4453p580j351l862J1365J2485m364o391O277J3688P137j707k129n113l223
13405G79N893N455m73N782N207r892k096L989j1337j455m739N98p867o539J2221
13390d474J2704P430j962m811j5550k839J444p771o57K593J0276J0234p731j6267
13376a7381k476n466K876Q542r25P274N052P673j088n802r597q412P670M968n951
13361a3043m154l264J1148K880p078r268j531J1653n028J919Q787J0170r687p905
13347a4401o059M729J0000J967j622L591m975L924R021m301j6154m923P287j523
13333a3439p79N660L670N35J1998j0429n707J6741r431j1514J631j0650Q86J5240
13319e588K674R107l868j7013q197J5609J273k080R986J1979j4060j3483r00J3824
$$ plain form
13305 -737 7377 6107 17741 6178 -6501 3892 -1794 -4082 3996 7608 12830 17397 11740 8001
13291 8001 7039 -272 -5455 4669 7463 10501 17586 12265 -101 -11787 -13110 -14191 -16037 -15252
13277 -15252 -3416 9393 12230 -1671 -11225 -9259 -578 4197 5606 4652 -7140 -19016 -13704
13264 -13704 1675 8300 6902 4183 -9746 -11966 -10055 -10405 -18994 -16654 -8400 -9393 -12376 -9932
13250 -9932 -115 -6089 -10836 -4409 -14638 -13012 -1028 9179 5041 -12850 -14983 -9724 -2404 3012
13236 3012 5297 -65 -2524 -10437 -7875 -12647 -3604 -416 5440 9883 14962 2512 -3217 -153
13222 -153 2206 23206 22712 4197 -10051 -23067 -33282 -29205 -16781 -14974 -14986 -8612 -9066 -15946
13208 -15946 -10910 -1958 2677 17293 15917 13372 16536 18209 16881 10975 -3440 -5535 -15579 -10851
$$ packed form
13305g37Q114j270J1634j1563j2679J0393n686k288Q078L612N222M567n657l739
13291H001r62p311n183J0124K794L038P085n321j2366j1686j323j081j846P85
13277a5252J1836J2809K837j3901r554J966Q681M775J409r54j1792j1876N312
13264a3704J5379O625j398k719j3929k220J911l50q589K340Q254r93k983K444
13250i932R817n974m747O427j0229J626J1984J0207m138j7891k133N259P320N416
13236C012K285n362k459p913K562m772R043L188N856M443N079j2450n729L064
13222a53K359K1000m94j8515j4248j3016j0215M077J2424J807j2O374m54o880
13208a5946N036Q952M635J4616j376k545L164J673j328n906j4415k095j0044M728
$$ plain form
13194 -10851 -2956 -7374 -2596 -2491 -1344 6475 14474 13107 349 -8103 -6212 -5953 -19624 -26303
13180 -26303 -18586 -11210 -24003 -30629 -24185 -14774 -7564 -3056 -9465 -7782 -7279 -13089 -21795 -17020
13166 -17020 -3533 6596 6511 19328 26279 12922 -5431 -8355 -6101 -12470 -3865 -4875 -11423 -6028
13152 -6028 -2355 9556 13056 6088 -44 13920 3710 -2874 5362 6730 -4563 -11133 -21839
13139 -21839 -22463 -20731 -10210 -1982 -9163 -9261 -671 1171 -2998 -10490 -15237 -13113 -4775 1908 2532
13124 2532 2757 -5182 -7314 -11869 -10604 -9168 -4002 -5280 -8256 -8090 -10883 -9459 -4935 2782 15707
13109 15707 14438 12782 19245 23448 13214 3923 2992 -4158 -11702 -9958 -9062 -844 -1244 -3970 -233
13094 -233 -4413 -22323 -30287 -25798 -19169 -4886 -6200 -14428 -16539 -18130 -10831 -9728 -21507 -19067
$$ packed form
13194a0851P895m418M778J05J147P819P999j367j2758q452J891K59j3671o679
13180b6303P717P376j2793o626O444R411P210M508o409J683N03n810q706M775
13166a7020J3487J0129q5J2817O951j3357j8353k924K254o369Q605j010o548N395
13152f028L673J1911L500o968o132J3964j0210o584Q236J368j1293o570j0706
13139b1839o24J732J0521Q228p181r8Q590J842m169p492m747K124Q338O683O24
13124B532K25p939k132m555J265J436N166j278k976J66k793J424M524P717J2925
13109A5707j269j656O463M203j0234r291r31p150p544J744Q96Q218m00k726L737
13094b33m180j7910p964M489O629J4283j314q228k111j591P299J103j1779K440
$$ plain form
13080 -19067 -3112 -6670 -4868 -7839 -2813 10898 23286 18694 1671 -6600 -7183 -6074 -7597 -4052
13066 -4052 738 3051 -4604 -2718 4350 4822 -958 -13312 -28529 -19943 -11991 -336 6537 16491
13052 16491 22051 21398 8349 -5276 -7022 -6380 -8250 1156 5898 -13769 -18038 -9707 -14744 -17300
13038 -17300 -17807 -13118 -5195 1525 -4986 -2995 2101 705 7993 6618 -1185 -1920 6993 22900 17363
13023 17363 -361 -3971 -247 -265 4555 8722 14848 17802 5989 -1603 2978 9093 13455 7044
13009 7044 -8584 -4774 2609 3467 -253 -13232 -15028 -21436 -16240 -1778 5045 2456 3316 5288
12995 5288 10311 6633 -5922 -12808 -8981 -14723 -19130 -10127 -7162 -3942 -6708 -4821 -1111 4985
12981 4985 3457 6887 2266 -10705 -12542 -16502 -22012 -13176 -14108 -2367 12433 17482 17384 13878 14159
$$ packed form
13080a9067J5955l558J802k971N026J3711J2388m592j7023q271n83J109j523L545
13066d052M790K313p655J886P068M72n780j2354j5217Q586P952J1655O873R954
13052A6491N560o53j3049j3625j746O42j870R406M742j9667m269Q331n037k556
13038a7300n07M689P923O720o511J991N096j396P288j375p803p35Q913J5907n537
13023A7363j7724l610L724j8M820M167O126K954j1813p592M581O115M362o411
13009G044j5628L810P383Q58l720j2979j796o408N196J4462O823k589Q60J972
12995E288N023l678j2555o886L827n742m407R003K965L220k766J887L710O096
12981D985j528L430m621j2971j837l960n510Q836r32J1741J4800N049r8l506K81
$$ plain form
12966 14159 10861 4016 -6646 -5199 -11829 -12236 -4355 -1063 -1437 -3140 -16585 -20888 -13653 2249
12952 2249 18042 15547 9830 120 -1925 -4062 -3273 861 -20453 -21568 -16597 -6607 -11030 -7820
12938 -7820 4426 -12 5524 150 -6080 -1771 -7751 -10577 -8982 -8537 -3409 2170 1215 -1922 -3742
12923 -3742 -8546 -18005 -7670 -4913 -3911 -19037 -23572 -28494 -28630 -30025 -27016 -18949 -9067 -3091
12909 -3091 3016 695 6317 11341 -2757 -17927 -22555 -18466 -19241 -11337 -4870 5270 3578 -9566
12895 -9566 872 10058 12168 8389 3994 9336 -3957 -5823 4423 10683 5302 -1350 -8535 -654
12881 -654 11144 9034 2597 1133 157 -510 -949 11193 22100 16625 20697 19883 9127 2924 5281
12866 5281 1651 5111 6770 7272 -1902 -11952 -11529 2970 12079 3659 -12925 -5891 -252 -6339
$$ packed form
12966A4159l298o845j0662J447o630m07P881L292l74j703j3445m303P235J5902
12952B249J5793k495n717r710k045k137P89M134k1314j115M971R990m423L210
12938g820J2246m438N536n374o230M309n980k826J595M45N128N579r55l137j820
12923c742m804r459J0335K757J002j5126m535m922j36j395L009Q067R882N976
12909c091O107k321N622N024j4098j5170m628M089p75P904O467J0140j692j3144
12895i566J0438R186K110l779m395N342j3293j866J0246O260n381o652p185P881
12881f54J1798k110o437j464r76o67m39J2142J0907n475M072q14j0756o203K357
12866E281l630L460J659N02r174j0050M23J4499R109q420j6584P034N639o087
$$ plain form
12852 -6339 -12461 -3684 436 -5476 -4458 -3706 -6301 3915 2791 10125 14135 13229 2317 6527 -394
12837 -394 3266 -372 -7466 277 -192 -3071 -8691 -15911 -20044 -11847 -9553 -8349 -18734 -25687 -27619
12822 -27619 -20095 -8549 -11737 -30937 -40071 -32560 -12098 -12693 -22892 -18017 -15579 -21679 -15806 -780
12808 -780 -2180 -1329 -5485 6165 17682 15089 4041 -2887 -4285 753 2153 2190 14281 21464 20696
12793 20696 19153 7188 -14842 -14226 -9647 -10856 -12262 -12670 -8341 -10206 -13147 -4303 -2787 1960
12779 1960 8699 13147 1415 -5603 -173 3009 795 -126 745 -2845 -942 3350 11329 24417 23506
12764 23506 -932 -19407 -15416 -4898 -10465 -17751 -17428 -10705 -8140 -2115 5477 8625 -4245 -3535
12750 -3535 3759 -2130 -11359 -8742 -10613 -9804 -9359 -6830 -12836 -18150 -22648 -23808 -20416 -6702 3644
$$ packed form
12852f339o122Q777M120n912J018P52k595J0216j124P334M010r06j0912M210o921
12837c94L660l638p094P743m69k879n620p220m133Q197K294J204j0385o953j932
12822b7619P524J1546l188j9200r134P511K0462n95j0199M875K438o100N873J5026
12808g80j400Q51m156J1650J1517k593j1048o928j398N038J400L7J2091P183p68
12793B0696j543j1965k2030O16M579j209j406m08M329j865k941Q844J516M747
12779A960O739M448j1732p018N430L182k214r21Q71l590J903M292P979J3088r11
12764B3506k4438j8475L991J0518n567p286L23O723K565O025P592L148j2870P10
12750c535P294n889r229K617j871Q09M45K529o006n314m498j160L392J3714J0346
$$ plain form
12735 3644 -1357 -637 -2092 10177 21797 17518 13610 10931 1938 -5239 -8002 2659 3725 -3750
12721 -3750 2618 -710 -4995 -146 -3043 -809 -5919 -32637 -47267 -42563 -14243 -11179 -8544 -9556
12707 -9556 -8100 -9439 -1132 1351 -5931 4214 9284 -358 -6088 3770 20929 21692 14425 9947
12693 9947 5243 -484 -9032 -23250 -21452 -15264 3555 1789 -1989 2594 1597 3070 13113 18704
12679 18704 15833 9566 3502 4772 10220 8604 9804 12779 4070 -9404 -17 6197 3244 317
12665 317 -3068 -10160 -11681 -373 3427 6745 9376 12276 8948 6428 12503 17410 11628 7639 5505
12650 5505 -11696 -14486 -19488 -12206 1224 -3952 -5549 4719 6571 10415 2647 8288 21561 15820
12636 15820 1374 3048 5249 1794 676 -1508 -6102 -3526 -8798 -4948 -5628 1474 12588 22344
$$ packed form
12735C644n001P20j455J2269J1620m279l908k679q993p177k763J0661J066p475
12721c750O368l328m285M849k897K234n110k6718j4630M704K8320L064K635j012
12707i556J456j339Q307K483p282J0145N070r642n730R858J7159P63p267m478
12693I947m704n727q548j4218J798O188J8819j766l778M583r97J473J0043N591
12679A8704k871o267o064J270N448j616J200K975q709j3474R387O214k953k927
12665C17l385p092j521J1308L800L318K631K900l328k520O075M907n782l989k134
12650E505j7201k790n002P282J3430n176j597J0268J852L844p768N641J3273n741
12636A5820j4446J674K201l455j118k184m594K576n272L850o80P102J1114R756
$$ plain form
12622 22344 17179 6554 6952 -5360 -4064 -2480 -5861 -10253 -3625 13489 18688 15822 7082 5967
12608 5967 8442 13725 3266 -7784 -3588 -4480 -11698 -14465 -10297 -22057 -19038 -13382 -8609 -12168
12594 -12168 -14520 -15777 -16095 -18237 -9218 2272 -11217 -27079 -20369 -10797 -3200 7450 -2104 -3810
12580 -3810 6495 10910 12858 6534 4097 -7968 -14709 -2380 1872 -4103 4527 1413 3269 -3912
12566 -3912 -8181 -247 1964 4957 -15342 -16666 -9919 -1141 4354 6518 6804 2225 -7787 -18914
12552 -18914 -20799 -7386 -1655 -17701 -19141 -16822 -12661 -8265 5028 5255 7814 8192 7032 5119
12538 5119 5257 4823 -3129 -4037 -1841 -1699 -4443 -14904 -12842 -11403 -5464 1759 -412 -5312 -6857
12523 -6857 1733 24485 21012 6831 6808 9112 8149 4660 -5716 -6460 -11089 -11952 -3285 86 -3300
$$ packed form
12622B2344n165j0625L98j2312J296J584l381m392O628J7114N199k866q740j115
12608E967K475N283j0459j1050M196q92p218k767M168j1760L019N656M773l559
12594a2168k352j257l18k142R019J1490j3489j5862O710R572P597J0650r554j706
12580c810J0305M415J948o324k437j2065o741J2329M252n975Q630l114J856p181
12566c912m269P934K211K993k0299j324O747Q778N495K164K86m579j0012j1127
12552a8914j885J3413N731j6046j440K319M161M396J3293K27K559L78j160j913
12538E119J38m34p952r08K196J42k744j0461K062J439N939P223k171m900j545
12523f857Q590K2752l473j4181k3K304r63l489j0376p44m629q63Q667L371l386
$$ plain form
12508 -3300 3874 11543 -7220 -13132 -17535 -8993 7427 8607 8582 7088 2460 -3281 -9303 -4955 1478
12493 1478 -6891 -6338 -1597 -1114 3382 -4786 -5539 998 -7496 -5571 3989 2782 -929 -347 -12858
12478 -12858 -16480 -4403 10741 12191 6963 -5093 -15909 -21343 -18372 -15995 -7187 4455 -1784
12465 -1784 -7853 -10524 -11568 3513 17011 3341 2522 -459 -2989 -9081 -5451 -818 6047 5370
12451 5370 -3468 -14925 -7403 -16874 -9856 -4127 -12673 -16022 1959 17524 10858 4498 -3326 -9487
12437 -9487 -2372 13223 8420 780 850 -7933 -14006 -14885 -17144 -16220 -19971 -9970 -4990 3599 10355
12422 10355 9790 7325 10151 12554 12437 13050 9963 4364 8614 16470 7905 629 -3662 8050 18868
12407 18868 11767 13174 11298 9000 7750 7687 10217 8673 -3444 4576 20527 17645 5103 8075
$$ packed form
12508c300P174P669j8763n912m403Q542J6420J180k5j494m628n741o022M348O433
12493A478q369N53M741M83M496q168p53O537q494J925R560j207l711N82j2511
12478a2858l622J2077J5144J450n228j2056j0816n434K971K377Q808J1642o239
12465a784o069k671j044J5081J3498j3670q19k981k530o092L630M633O865o77
12451E370q838j1457P522r471P018N729q546l349J7981J5565o666o360p824o161
12437i487P115J5595m803p640P0q783o073q79k259R24l751J0001M980Q589O756
12422A0355n65k465K826K403j17O13l087n599M250P856q565p276m291J1712J0818
12407A8868p101J407j876k298j250o3K530j544j2117Q020J5951k882j2542K972
$$ plain form
12393 8075 9530 8420 6361 9821 11949 6342 6743 4786 2585 7977 8624 7923 10932 4385 -1665
12378 -1665 -8026 -6773 2353 10155 4278 -4650 -2464 7089 3904 -2150 7958 5451 -8237 -3990
12364 -3990 3473 2929 10569 9101 6622 -3895 -4655 7944 19412 17131 19573 22499 11228 6191
12350 6191 3285 -7574 -6823 -8130 -15061 -8767 -5390 -13602 -7125 707 -1725 -2309 4107 929 -3097
12335 -3097 -9701 -13199 -12544 -14089 -9267 -8445 -11541 -3714 17214 19951 15614 5666 1038 2637 -10290
12320 -10290 -16508 -24052 -18358 -9113 -12474 -8560 -8587 -9267 -9110 -7215 -2976 -9636 -22976 -22997 -22071 -19223
12304 -19223 -8399 -7336 -12948 -19177 -15264 -2583 1228 -1542 -12667 -24269 -15104 940 16276
12291 16276 32092 33529 36144 27699 14136 7208 -3506 -9604 -16777 -19631 -10909 -16789 -6885 12445
$$ packed form
12393H075J455j110k059L460K128n607M01j957k201N392O47p01L009o547o050
12378a665o361J253R126P802n877q928K186R553l185o054J0108k507j3688M247
12364c990P463n44P640j468k479j0517p60J2599J1468k281K442K926j1271n037
12350F191k906j0859P51j307o931O294L377q212O477P832k432n84O416l178m026
12335c097o604l498O55j545M822Q22l096P827K0928K737m337r948m628J599j2927
12320a0290o218p544N694R245l361L914k7o80J57J895M239o660j3340k1R26K848
12304a9223J0824J063n612o229L913J2681L811k770j1125j1602R165J6044J5336
12291A6276J5816J437K615q445j3563o928j0714o098p173k854Q722n880R904J9330
$$ plain form
12277 12445 7369 -2985 339 3158 5796 12380 11620 10741 12703 5788 6196 7455 4672 6128 1021
12262 1021 1019 -6331 -10191 -11740 -11129 -12891 -13307 -12265 3344 3573 11407 19970 -748 -13942 -4642
12247 -4642 4088 2963 2116 -1192 -6913 -3390 2700 -9065 -11203 -7094 -11246 -25550 -22335 -18774
12233 -18774 -15791 -18814 -12569 -5753 -4212 -2702 8862 13553 3286 -1452 -3 6494 9490 10960
12219 10960 4457 -988 -2372 4073 -820 1723 -552 -12721 -22344 -21744 -16037 -22788 -9020 1999
12205 1999 -5360 -1603 -5010 -13068 -18048 -2570 7610 11042 12451 4464 13959 23422 22548 14937
12191 14937 9828 8729 5612 -5231 -21654 -17570 -9160 -7191 -5708 -4286 -4264 -565 1275 -7124
12177 -7124 -1188 9491 16092 10853 14014 16267 10507 5621 6188 18165 16871 9020 2105 1383 6575
$$ packed form
12277A2445n076j0354L324K819K638O584p60q79J962o915M08J259k783J456n107
12262A021kp350l860j549O11j762m16J042J5609K29P834Q563k0718j3194R300
12247d642Q730j125q47l308n721L523O090j1765k138M109m152j4304L215L561
12233a8774K983l023O245O816J541J510J1564M691j0267m738J449O497K996J470
12219A0960o503n445j384O445m893K543k275j2169r623O00N707o751J3768J1019
12205A999p359L757l407q058m980J5478J0180L432J409p987R495R463q74p611
12191A4937n109j099l117j0843j6423M084Q410J969J483J422K2L699J840q399
12177g124N936J0679O601n239L161K253n760m886N67J1977j294p851o915p22N192
$$ plain form
12162 6575 1947 -3004 -7049 1239 1274 3048 10113 10083 8658 10699 9404 9051 11668 12242 2920 4577
12146 4577 8452 7404 -3034 -9760 -5567 8465 4283 -6599 -560 8341 14020 18316 27693 21413
12132 21413 13820 16928 13663 13470 -251 -3254 -6275 -4888 2107 15248 10174 -3083 -7604 -2603
12118 -2603 5431 -5354 -14827 -13669 8969 14574 5229 8508 23041 28793 12149 190 -10772
12105 -10772 -6921 299 -11580 -10370 7046 3000 388 6304 15620 14031 6666 1299 -1814 1874
12091 1874 -901 -920 -2873 1147 -6195 -22232 -21904 -16350 -3083 -4503 -8143 -17448 -12416 -437 439
12076 439 10519 16269 12881 5196 7441 18331 17892 15836 18761 13253 22652 27634 24621 10509
12062 10509 -4265 -9505 2272 582 -10222 -6091 11326 2543 -4068 -3468 -1055 -13106 -13981 -5189
$$ packed form
12162F575m628m951m045Q288L5J774P065l0j425K041j295l53K617N74r322J657
12146D577L875j048j0438o726M193J4032m182j0882O039Q901N679M296R377o280
12132B1413p593L108l265j93j3721l003l021J387O995J3141n074j3257m521N001
12118b603Q034j0785r473J158K2638N605r345L279J4533N752j6644j1959j0962
12105a0772L851P220j1879J210J7416m046k612N916R316j589p365n367l113L688
12091A874k775j9j953M020p342j6037L28N554J3267j420l640r305N032J1979Q76
12076D39J0080N750l388p685K245J0890m39k056K925n508R399M982l013j4112
12062A0509j4774n240J1777j690j0804M131J7417q783o611O00K413j2051q75Q792
$$ plain form
12048 -5189 -6913 -12572 -15689 -3472 5961 -6 6947 809 3283 2516 -15644 -17776 -3262 4901
12034 4901 13753 7592 4385 7490 10264 2476 -4790 -7023 -6778 -4592 -6831 -4809 -4464 -1895 -1096
12019 -1096 2019 1168 4029 5651 5637 14227 24478 18732 8457 7900 2024 -2949 661 6937 10963
12004 10963 16214 18373 8350 -5141 -10606 -14433 -15110 -5235 2552 -5088 -7244 -5311 3060 18936
11990 18936 20883 17932 10191 10700 8666 12922 25632 27229 21240 21121 19350 9038 2776 -293
11976 -293 -4386 -17124 -20523 -10356 -8987 -8616 -5182 -7502 7228 14500 -4104 -14178 -15138 -9154
11962 -9154 -10252 -1882 -10563 6306 17190 9346 9380 16700 23028 25168 25113 15394 -8300 -9316 -9987
11947 -9987 -10437 -16165 -16560 -13023 -9995 2422 -2046 -9369 -7615 -3057 -3521 -4601 -3025 -3830 -2910 11419
$$ packed form
12048e189j724n659l117J2217R433n967O953o138K474p67j8160k132J4514Q163
12034D901Q852o161l207L105K774p788p266k233K45K186k239K022L45K569P99
12019a096L115q51K861J622j4Q590J0251n746j0275n57n876m973L610O276M026
12004A0963N251K159j0023j3491n465l827o77R875P787p640k156J933Q371J5876
11990A8936J947k951p741N09k034M256J2710J597n989j19j771j0312o262l069
11976b93m093j2738l399J0167J369L71L434k320J4730P272j8604j0074r60N984
11962i154j098Q370q681J6869J0884p844L4P320O328K140n5r719k3694j016o71
11947i987m50n728l95L537L028J2417m468p323J754M558m64j080J576q05R20J4329
$$ plain form
11931 11419 18940 9730 -5866 -4096 -7266 -1018 18595 19365 9557 10596 -1226 5683 9104 1577
11917 1577 -2120 -7953 -2911 7230 4294 -3015 -1128 -4788 -16179 -19309 -6203 -4526 -4084 -3161
11903 -3161 6096 4333 8582 12507 8206 868 5339 11108 5960 8129 1933 7115 1950 -6524 -4322
11888 -4322 6978 16627 12015 16863 15313 4069 3002 -4586 -2192 3930 158 16222 18915 15632
11874 15632 10184 8614 14655 16091 7502 5378 -6129 345 3577 -2629 -985 -7952 -20187 -17547
11860 -17547 -10447 -7725 -9069 -8756 -16984 -18048 443 5018 9849 5093 1667 -6425 -1165 -4276
11846 -4276 -9206 -24509 -10242 -7167 -13606 -14504 -13591 -15399 -14117 -13494 -16862 -12434 -8199 1959 3825
11831 3825 7304 21233 8460 -3997 -8219 -12753 -3842 8114 8513 4656 -2712 -11292 -5989 -4240
$$ packed form
11931A1419P521r210j5596J770l170O248J9613P70r808J039j1822O909L421p527
11917A577l697n833N042J0141k936p309J887l660j1391l130J3106J677M42R23
11903c161R257j763M249L925m301p338M471N769n148K169o196N182n165q474K202
11888d322J1300R649m612M848j550j1244j067p588K394O122l772J6064K693l283
11874A5632n448j570O041J436q589k124j1507O474L232o206J644o967j2235K640
11860a7547P100K722j344L13q228j064J8491M575M831m756l426q092N260l111
11846d276m930j5303J4267L075o439q98R13j808J282O23l368M428M235J0158J866
11831C825L479J3929j2773j2457m222m534Q911J1956L99l857p368q580N303J749
$$ plain form
11817 -4240 -1779 -9736 -8157 -6317 -15796 -19513 -20673 -20095 -21063 -3710 1121 -2255 2629 14337 13296
11802 13296 4691 18956 29995 25097 15477 6118 11098 11763 22204 12695 5387 4912 3399 -5782
11788 -5782 -448 12133 16938 18439 2977 -2767 4748 9856 13741 20943 20864 28722 35431 37591 34276
11773 34276 23681 10839 4959 -1259 -4850 2987 7292 6622 -5003 -3523 -3119 -14326 -11330 3383
11759 3383 15491 9275 5037 20270 16229 347 6334 19940 18531 13425 5823 -3819 8855
11746 8855 6438 -894 1146 405 1876 3131 10469 4536 -8828 -15719 357 2744 2487 8723 6859
11731 6859 -1712 6626 2850 -13384 -25678 -25010 -18970 -15349 -2625 5014 8291 7093 8930 24908
11717 24908 25591 23614 15834 12080 13974 18283 21687 14749 11099 8358 10453 5989 -2369 -13839
$$ packed form
11817d240K461p957J579J840r479l717j160N78r68J7353M831l376M884J1708j041
11802A3296q605J4265J1039m898r620r359M980O65J0441r509p308m75j513r181
11788e782N334J2581M805J501j5462n744P515N108L885P202p9P858O709K160l315
11773C4276j0595j2842n880o218l591P837M305o70j1625J480M04j1207K996J4713
11759C383J2108o216m238J5233m041j5882N987J3606j409n106p602r642J2674
11746H855k417p332K040p41J471J255P338n933j3364o891J6076K387k57O236j864
11731F859q571Q338l776j6234j2294O68O040L621J2724P639L277j198J837J5978
11717B4908O83j977p780l754J894M309L404o938l650k741K095m464q358j1470
$$ plain form
11703 -13839 -11461 18 -269 -6576 -17290 -8730 5364 6393 2077 -689 -6175 -1722 -2872 13452
11689 13452 2146 -20110 -17909 2098 12200 14604 16192 -3665 -10273 3032 6429 6483 3331
11676 3331 -3938 1268 -7734 -8232 4134 1229 759 12574 8251 2424 2824 6674 3091 4089 1949
11661 1949 373 1215 3748 9042 10682 14424 15915 9377 14127 25884 25265 15912 21202 11514 8466
11646 8466 3727 475 1517 1108 13868 6427 9121 11754 6446 1054 1554 -2262 -14958 -10674 -6019
11631 -6019 5130 15423 10366 11647 17252 26227 15658 10223 11064 13344 14918 13834 13613 2972
11617 2972 -3057 -714 12954 18043 11812 6441 2568 -3184 -5524 4610 4907 1384 1384 6118 20560
11602 20560 22785 21627 15453 10031 14229 11720 20085 19903 12889 17572 21740 18921 13402 9631 13362
$$ packed form
11703a3839K378J1479k87o307j0714Q560J4094J029m316k766n486M453j150J6324
11689A3452j1306k2256K201K0007J0102K404J588j9857o608J3305L397N4l152
11676C331p269N206r002m98J2366k905m70J1815m323n827M00L850l583R98k140
11661A949j576Q42K533N294J640L742J491o538M750J1757o19r353N290r688l048
11646H466m739l252J042m09J2760p441K694K633n308n392N00l816j2696M284M655
11631f019J1149J0293n057J281N605Q975j0569n435Q41K280J574j084k21j0641
11617B972o029K343J3668N089o231n371l873n752k340J0134K97l523%M734J4442
11602B0560K225j158o174n422M198k509Q365j82p014M683M168k819n519l771L731
$$ plain form
11587 13362 9861 5589 2281 2756 14230 14089 11124 7010 9643 943 812 5258 6204 8255 4188
11572 4188 3211 10948 17863 23564 26991 24206 17896 2020 -5712 -5750 -3982 -10721 -7701 684 2219
11557 2219 -142 -699 5178 3060 -2943 -5647 -10365 4026 18688 15979 11608 7248 -1860 -1680 5855
11542 5855 10995 13204 7192 -311 3299 17439 24498 13191 -4085 -7049 -1340 8053 5900 -771
11528 -771 -6060 2472 -619 5530 5309 2395 -83 4285 6339 10387 13958 11453 18159 19206 15585
11513 15585 15567 8738 3442 17430 18134 13378 15740 14482 1923 9830 12955 6631 -2556 -9399 -14886
11498 -14886 -2425 13195 11038 923 -5462 -1084 703 8458 1453 -10883 -13443 -2548 15370
11485 15370 16891 17282 3771 -4141 -7887 -10829 6940 20115 8436 11538 24434 32279 19256
$$ packed form
11587A3362l501m272l308M75J1474j41k965m114K633q700j31M446R46K051m067
11572D188r77P737O915N701L427k785o310j5876p732l8J768o739L020Q385J535
11557B219k361n57N877k118o003k704m718J4391J4662k709m371m360r108J80P535
11542E855N140K209o012p503L610J4140P059j1307j7276k964N709R393k153o671
11528g71n289Q532l091O149k21k914k478M368K054M048L571k505O706J047l621
11513A5585j8o829n296J3988P04m756K362j258j2559P907L125o324r187o843n487
11498a4886J2461J5620k157j0115o385M378J787P755p005j2336k560J0895J7918
11485A5370J521L91j3511p912l746k942J7769J3175j1679L102J2896P845j3023
$$ plain form
11472 19256 16715 6630 -8979 -16871 -10643 -2219 -4189 -10696 -6105 2862 -562 6506 11238 11086
11458 11086 -3817 -12007 -3434 -2249 12150 27079 28342 19924 18480 22487 26008 18310 12561 12009
11444 12009 11722 13249 13149 2514 4892 18328 25060 30136 20451 21803 13556 9486 25026 32377
11430 32377 21589 9901 -1070 -4373 -12260 -6000 -1728 -5923 -3928 -4038 -2992 2378 1848 7852
11416 7852 3916 6241 3413 -1949 -3601 5281 19829 22897 18346 22779 27005 12030 18536 18573 14585
11401 14585 20037 16726 21344 30657 27946 23384 22164 25549 21944 12540 4077 -1514 -6401 -1241
11387 -1241 3853 3914 13966 19304 29594 44629 34556 21928 15692 12520 7022 -6825 -8721 -982
11373 -982 3923 9172 8703 4709 45 -1257 11908 17831 29658 36537 30075 16307 15754 10735 5018
$$ packed form
11472A9256k541j0085j5609p892O228Q424j970o507M591Q967l424P068M732j52
11458A1086j4903q190Q573J185J4399J4929J263q418j444M007L521p698n749n52
11444A2009k87J527j00j0635K378J3436O732N076r685J352q247m070J5540P351
11430C2377j0788j1688j0971l303p887O260M272m195J995j10J046N370n30O004
11416G852l936K325k828n362j652Q882J4548L068m551M433M226j4975O506L7l988
11401A4585N452l311M618R313k711m562j220L385l605r404q463n591m887N160
11387a241N094O1J0052N338J0290J5035j0073j2628o236l172n498j3847j896P739
11373i82M905N249m69l994m664j302J3165N923J1827O879o462j3768n53n019n717
$$ plain form
11358 5018 7690 734 10213 19892 15314 21266 28804 26253 18448 23712 23813 22255 16150 12592 15222
11343 15222 12756 10504 17210 32027 30312 22629 19745 27600 37261 18303 12901 25049 28805 14588
11329 14588 5663 11218 4555 -2878 -8055 -16782 -24350 -12128 -10905 -18531 -18044 -10632 -7217 -748
11315 -748 3506 9539 6238 9960 7647 4878 -6231 2881 4705 5349 6974 8130 20880 31588
11301 31588 31535 31682 32507 25599 22511 23615 27901 24505 31751 38255 32815 21231 15251 31277 42771
11286 42771 36671 41124 39855 38613 48843 56764 74131 83332 92727 97687 126236 176143 234959
11273 234959 323718 450319 585860 708544 783524 792565 731257 633970 511244 391222 285228
11262 285228 200255 155395 128476 112766 94884 80007 84961 80595 66654 60331 49825 41461
$$ packed form
11358E018K672o956R479R679m578N952P538k551p805N264J01j558o105l558K630
11343A5222k466k252O706J4817j715p683k884P855R661j8958n402J2148L756j4217
11329A4588q925N555o663p433n177q727p568J2222J223p626M87P412L415O469
11315g48M254O033l301L722k313k769j1109R112J824O44J625J156J2750J0708
11301C1588n3J47Q25o908l088J104M286l396P246O504n440j1584n980J6026J1494
11286D2771o100M453j269j242J0230P921J7367R201R395M960K8549M9907N8816
11273B34959Q8759J26601J35541J22684P4980R041o1308r7287j22726j20022j05994
11262B85228q4973m4860k6919j5710j7882j4877M954m366j3941o323j0506q364
$$ plain form
11250 41461 44948 50461 47935 54299 67410 67736 70184 55992 44919 51152 51188 43456 37990 37470 45026
11235 45026 31423 21680 26377 28521 29594 32409 35255 30129 36395 36488 35162 29856 24400 23722 30249
11220 30249 36523 37845 28402 26198 20256 21183 21299 21351 17375 35174 49156 39541 46264 34426 39523
11205 39523 51398 55148 48934 40910 35896 48792 49601 41187 28216 27894 31215 29611 25182 21891
11191 21891 29080 26811 31265 34262 21591 12001 10462 13602 9655 15941 21518 30783 24956 20076
11177 20076 6804 3091 47 -788 4239 1166 3189 16395 27696 21467 23364 21491 14505 21085
11163 21085 28884 22839 22113 20609 21730 14212 14650 15232 21946 35217 53875 52819 47916 45299 40345
11148 40345 34843 29499 32266 38554 32442 31388 37600 41467 53185 43000 40578 39515 41172 34388
$$ packed form
11250D1461L487N513k526O364J3111L26K448j4192j1073O233L6p732n466n20P556
11235D5026j3603r743M697K144J073K815K846n126O266R3j326n306n456o78O527
11220C0249O274J322r443k204n942R27J16N2l976J7799J3982r615O723j1838N097
11205C9523J1875L750o214q024n014J2896Q09q414j2971l22L321j604m429l291
11191B1891P189k269M454K997j2671r590j539L140l947O286N577R265n827m880
11177B0076j3272l713l044q35N027l073K023J3206J1301o229J897j873o986O580
11163B1085P799o045p26j504J121p518M38N82O714J3271J8658j056m903k617m954
11148D0345n502n344K767O288o112j054O212L867J1718j0185k422j063J657o784
$$ plain form
11134 34388 43111 40891 46877 51259 47841 55836 74897 63641 55216 65579 73725 76188 83682 97519
11120 97519 113946 136390 153638 180527 204740 228229 242127 242819 238445 223799 209627 193531
11108 193531 191712 206814 242811 303275 397706 519564 657345 778752 831950 805991 719497
11097 719497 599789 469045 350379 257810 192769 159856 149216 139616 122200 112136 110410
11086 110410 107985 100910 92273 81991 93917 88917 82218 88246 95118 94265 97544 92932 86208 76032
11072 76032 79723 84198 83977 75235 76164 68004 70658 71267 73889 84220 83803 84699 87100 86318 78456 62966
11056 62966 53173 60900 66471 64053 60995 61331 67310 63173 66430 54419 40099 50504 66281 54360
11042 54360 55900 64186 55835 53495 48588 48264 57048 66282 83156 81875 88572 97523 88533 77119
$$ packed form
11134C4388Q723k220N986M382l418P995J9061j1256q425J0363Q146K463P494J3837
11120I7519J6427K2444J7248K6889K4213K3489J3898O92m374j4646j4172j6096
11108A93531j819J5102L5997O0464R4431J21858J37781J21407N3198k5959q6494
11097G19497j19708j30744j18666r2569o5041l2913j0640r600j7416j0064j726
11086A10410k425p075q637j0282J1926n000o699O028O872q53L279m612o724j0176
11072G6032L691M475k21q742R29q160K654O09K622J0331m17Q96K401p82p862j5490
11056F2966r793P727N571k418l058L36N979m137L257j2011j4320J0405J5777j1921
11042E4360J540Q286q351k340m907l24Q784R234J6874j281O697Q951q990j1414
$$ plain form
11028 77119 70843 75465 78435 76085 77477 66628 70624 84171 86759 92293 107981 114709 119121 100813
11014 100813 80379 64121 57611 62442 50866 27683 30469 43998 58089 77007 82621 105908
11002 105908 119671 128520 124242 108638 101135 107605 109818 105614 107322 113698 137882 175787 205925
10989 205925 226914 248332 249323 250380 261054 255713 238754 211745 176387 152734 144995 143291 153570
10976 153570 143014 136350 136484 151361 159756 152218 151721 155544 147531 142101 139046 146220 153832 163554
10962 163554 173043 178219 187433 195850 204774 220003 234431 260592 294519 322092 359453 382688
10950 382688 378664 363700 344269 318419 297259 269135 247928 237586 234713 235218 229174 226747 240450
10937 240450 251861 258943 265276 266039 271906 281119 294362 288875 295586 304278 317082 328818 343439
$$ packed form
11028G7119o276M622K970k350J392j0849L996J3547K588N534J5688O728M412j8308
11014A00813k0434j6258o510M831j1576k3183K786J3529J4091J8918N614K3287
11002A05908J3763Q849m278j5604p503O470K213m204J708O376K4184L7905L0138
10989B05925K0989K1418R91J057J0674n341j6959k7009l5358k3653p739j704J0279
10976A53570j0556o664J34J4877Q395p538m97L823q013n430l055P174P612R722
10962A63554R489N176R214Q417Q924J5229J4428K6161L3927K7573L7361K3235
10950C82688m024j4964j9431k5850k1160k8124k1207j0342k873N05o044k427J3703
10937B40450J1411P082O333P63N867R213J3243n487O711Q692J2804J1736J4621
$$ plain form
10924 343439 375513 391740 400249 412790 412651 400342 399507 395201 399818 406173 410396 418612 421803 442041
10910 442041 467429 488538 516065 547923 579756 607528 635621 659111 699385 728259 742080
10899 742080 766804 823445 874916 920166 964949 1010192 1062461 1128157 1205507 1296691 1411339
10888 1411339 1539838 1706653 1923880 2176089 2414111 2594959 2721042 2802092 2888826 3027606
10878 3027606 3226588 3501208 3901152 4430653 5103725 5984883 7167644 8770594 11045967
10869 11045967 14383560 19450976 27295742 39349736 57104555 80947785 108071471
10862 108071471 131629255 144535392 143224468 129400250 107718239 83420250 61055357
10855 61055357 43575800 31457720 23639921 18700828 15503778 13266430 11530707 10077769
$$ packed form
10924C43439L2074J6227Q509J2541j39j2309q35m306M617O355M223Q216L191K0238
10910D42041K5388K1109K7527L1858L1833K7772K8093K3490M0274K8874J3821
10899G42080K4724N6641N1471M5250M4783M5243N2269O5696P7350R1184J14648
10888A411339J28499J66815K17227K52209K38022J80848J26083Q1050Q6734J38780
10878C027606J98982K74620L99944N29501O73072Q81158J182761J602950K275373
10869A1045967L337593N067416P844766J2053994J7754819K3843230K7123686
10862A08071471K3557784J2906137j310924j3824218k1682011k4297989k2364893
10855F1055357j7479557j2118080p817799m939093l197050k237348j735723j452938
$$ plain form
10847 10077769 8851081 7800929 6927841 6243394 5746736 5387494 5144683 4962906 4818643
10838 4818643 4684576 4485567 4225599 3925386 3597090 3270657 2970641 2729771 2539369
10829 2539369 2393501 2278026 2186956 2123911 2058050 1981719 1895860 1823525 1781057 1739076 1666298
10818 1666298 1579468 1491234 1425644 1382412 1346375 1316510 1300019 1284490 1277315 1278036 1271339 1269530
10806 1269530 1269603 1270967 1274710 1280216 1283288 1306881 1353576 1393125 1411852 1396197 1346988 1276226 1188142
10793 1188142 1110525 1041906 977992 925707 884524 837700 798190 770077 751731 720418 698283
10782 698283 687905 673428 657982 642628 633422 614141 588669 582762 593615 596608 585609 580470
10770 580470 587983 582685 579944 574501 575468 575376 565848 547897 548896 543851 539919 549413 562170 570307 572746
$$ packed form
10847A0077769j226688j050152q73088o84447m96658l59242k42811j81777j44263
10838D818643j34067j99009k59968l00213l28296l26433l00016k40870j90402
10829B539369j45868j15475r1070o3045o5861p6331q5859p2335m2468m1981p2778
10818A666298q6830q8234o5590m3232l6037k9865j6491j5529p175P21o697j809
10806A269530P3J364L743N506L072K3593M6695L9549J8727j5655m9209p0762q8084
10793A188142p7617o8619o3914n2285m1183m6824l9510k8113j8346l1313k2135
10782F98283j0378j4477j5446j5354r206j9281k5472n907J0853K993j0999n139
10770E80470P513n298k741n443R67r2r528j7951R99n045l932R494J2757Q137K439
$$ plain form
10755 572746 575504 564258 551288 540774 536263 535034 542444 559676 573683 598044 623797 641897
10743 641897 670626 687653 705986 734982 772040 817991 864368 904115 939616 990884 1041489
10732 1041489 1088767 1123782 1145979 1179873 1201042 1236849 1309564 1387878 1500713 1657073 1846579
10721 1846579 2076960 2347892 2610249 2824088 3015060 3201855 3423046 3727811 4153803
10712 4153803 4680405 5311129 6045717 6962361 8175354 9846494 12309591 16123125 22181774
10703 22181774 31825775 46779089 68427756 95857288 123497703 142943016 148208122
10696 148208122 138949902 119012351 94229881 69608809 49254139 34711721 25260048
10689 25260048 19317701 15536555 13024539 11232876 9880980 8788490 7865653 7096620
$$ packed form
10755E72746K758j1246j2970j0514m511j229P410J7232J4007K4361K5753J8100
10743F41897K8729J7027J8333K8996L7058M5951M6377L9747L5501N1268N0605
10732A041489M7278L5015K2197L3894K1169L5807P2715P8314J12835J56360J89506
10721A846579K30381K70932K62357K13839J90972J86795K21191L04765M25992
10712D153803N26602O30724P34588R16644J212993J671140K463097L813534O058649
10703B2181774R644001J4953314K1648667K7429532K7640415J9445313N265106
10696A48208122r258220j9937551k4782470k4621072k0354670j4542418r451673
10689B5260048n942347l781146k512016j791663j351896j092490r22837p69033
$$ plain form
10681 7096620 6465232 5960623 5599158 5358931 5168406 4988307 4757691 4460373 4106115
10672 4106115 3733366 3377548 3064693 2809358 2600365 2434342 2295021 2172695 2068085
10663 2068085 1967441 1876208 1794282 1719601 1656573 1605325 1565861 1532124 1493227 1449995 1407494
10652 1407494 1353730 1323528 1294379 1254361 1224947 1199241 1173857 1154947 1146409 1150829 1151088 1152373
10640 1152373 1150795 1172202 1205762 1248921 1289869 1316397 1310299 1259380 1192787 1115248 1029173 944552
10628 944552 883023 838267 780627 727270 689270 659200 616644 582704 574547 567784 545607 516867
10616 516867 491215 475983 457735 435082 413401 400537 399151 388121 377526 373813 365345 351619
10604 351619 335133 327078 323788 305285 292443 274094 258895 259279 251186 246717 238257 232797 230299
$$ packed form
10681G096620o31388n04609l61465k40227j90525j80099k30616k97318l54258
10672D106115l72749l55818l12855k55335k08993j66023j39321j22326j04610
10663B068085j00644r1233q1926p4681o3028n1248l9464l3737l8897m3232m2501
10652A407494n3764l0202k9149m0018k9414k5706k5384j8910q538M420K59J285
10640A152373j578K1407L3560M3159M0948K6528o098n0919o6593p7539q6075q4621
10628I44552o1529m4756n7640n3357l8000l0070m2556l3940q157o763k2177k8740
10616E16867k5652j5232j8248k2653k1681j2864j386j1030j0595l713q468j3726
10604C51619j6486q055l290j8503j2842j8349j5199L84q093m469q460n460k498
$$ plain form
10591 230299 220374 197569 196073 193000 192572 191578 190356 185420 179488 183964 180642 163969 161963 160993
10577 160993 173818 189554 210839 224575 208421 202695 205656 214440 233831 235346 206002 168743
10565 168743 133773 112193 102155 96489 84683 71791 69195 61129 59508 72573 89480 107807
10553 107807 110716 112017 118711 114915 115355 118039 105347 95775 88301 76742 66141 66691 62191 52026
10539 52026 66207 63622 53869 48615 51298 51322 46457 56501 51514 50093 54646 52762 54969 53859
10525 53859 51204 51771 66617 71785 65927 65104 60522 56690 49755 51948 52632 40480 40396 43712 60048
10510 60048 71245 61294 59525 59721 49724 47624 49915 41185 34058 32254 29304 29594 29477 20880 16829
10495 16829 17797 20826 16137 11200 19355 28760 23498 30221 23399 15869 18446 18109 13820 8239 19708
$$ packed form
10591B30299r925k2805j496l073m28r94j222m936n932M476l322j6673k006r70
10577A60993J2825J5736K1285J3736j6154n726K961Q784J9391J515k9344l7259
10565A68743l4970k1580j0038n666j1806j2892k596q066j621J3065J6907J8327
10553A07807K909J301O694l796M40K684j2692r572p474j1559j0601N50m500j0165
10539E2026J4181k585r753n254K683K4m865J0044m987j421M553j884K207j110
10525E3859k655N67J4846N168n858q23m582l832o935K193O84j2152q4L316J6336
10510F0048J1197r951j769J96r997k100K291q730p127j804k950K90j17q597m051
10495A6829R68L029m689m937Q155R405n262O723o822p530K577l37m289n581J1469
$$ plain form
10480 19708 29306 20157 15691 19705 15682 15191 20429 27237 34437 41490 46770 50036 53762 58464 56118
10465 56118 54822 56565 63351 66094 61711 66397 72648 90005 98508 108599 134641 163419 215760
10452 215760 309913 424959 560361 695569 798952 821101 767823 661428 535317 415096
10442 415096 318358 227375 171925 145115 136894 132722 124492 109887 103441 98159 90516 105326 110088
10429 110088 93023 83560 84222 94181 117253 157936 210447 276616 399426 547048 649175 699180
10417 699180 698551 690618 679917 685490 724098 743176 695110 598472 491116 380527 276511 189828
10405 189828 134972 103013 79830 62936 67343 69966 76505 76511 74470 64244 56680 53003 46418 45865
10391 45865 45756 45564 45328 50178 59889 58952 55996 54971 46797 38444 32771 36659 41762 31835 22902
$$ packed form
10480A9708R598r149m466M014m023m91N238O808P200P053N280L266L726M702k346
10465E6118j296J743O786K743m383M686O251J7357Q503J0091K6042K8778N2341
10452B15760R4153J15046J35402J35208J03383K2149n3278j06395j26111j20221
10442D15096r6738r0983n5450k6810q221m172q230j4605o446n282p643J4810M762
10429A10088j7065r463O62R959K3072M0683N2511O6169J22810J47622J02127N0005
10417F99180o29p933j0701N573L8608J9078m8066r6638j07356j10589j04016q6683
10405A89828n4856l1959k3183j6894M407K623O539Ok041j0226p564l677o585n53
10391D5865j09j92k36M850R711r37k956j025q174q353n673L888N103r927q933
$$ plain form
10376 22902 20880 20971 23622 18993 15488 24633 26761 27083 32447 22503 17341 16540 594 -71 -9226
10361 -9226 -468 6932 5750 7919 12933 503 3896 15729 20997 12328 11614 27230 24832 28449
10347 28449 28923 26945 15630 1231 3976 11011 9999 18089 21679 17731 10586 1788 6782 9390
10333 9390 16463 30153 29240 16532 22261 15688 11245 11888 31040 40084 33182 30220 35249 39551
10319 39551 30863 31008 30333 19617 22561 29388 29547 30904 36399 35763 24545 15539 25237 29167 31248
10304 31248 37027 46560 47349 42886 49524 54815 63660 92987 132104 177351 247331 354624 492005
10291 492005 650141 771359 815604 779744 668922 519321 390475 291581 207890 166693
10281 166693 131904 102599 76435 56379 50546 55979 57127 49159 40926 52174 51930 40743 38961
$$ packed form
10376B2902k022R1K651m629l505R145K128L22N364r944n162q01j5946o65r155
10361i226Q758P400j182K169N014j2430L393J1833N268q669p14J5616k398L617
10347B8449M74j978j1315j4399K745P035j012Q090L590l948p145q798M994K608
10333I390P073J3690r13j2708N729o573m443O43J9152R044o902k962N029M302
10319C9551q688J45o75j0716K944O827J59J357N495o36j1218r006R698L930K081
10304C1248N779R533P89m463O638N291Q845K9327L9117M5247O9980J07293J37381
10291D92005J58136J21218M4245l5860j10822j49601j28846r8894q3691m1197
10281A66693l4789k9305k6164k0056n833N433J148p968q233J1248k44j1187j782
$$ plain form
10268 38961 37401 37358 30020 32273 32233 24227 4302 -8935 1265 1068 -8618 -9912 -3855 -5423 -3551
10253 -3551 12076 40733 52936 47620 31059 32422 31209 35129 35648 31666 23802 15895 20272 20601
10239 20601 18889 15517 23481 16006 11286 14180 25672 30021 37761 30947 37317 25051 8080 -11685
10225 -11685 -13690 -14557 -12472 -4762 8400 7688 2269 7802 12864 15923 4892 -497 -9594 -5640
10211 -5640 3673 12971 13016 5823 -1410 3592 7084 3823 8841 15521 18352 17192 13290 5032 -424
10196 -424 -2738 4925 12106 7149 7921 -4883 -5813 6190 2395 2375 3055 -6314 -9584 -5021 78 -4065
10180 -4065 6001 999 895 -5065 -7879 -15633 -21134 -13716 -10971 -14435 -6883 -10650 -14087 -2423
10166 -2423 -1088 3642 -5918 -1198 1779 7818 4755 -1254 3597 7399 6815 6293 4737 5257 7661
$$ packed form
10268C8961j560m3p338K253m0q006j9925j3237J0200j97r686j294O057j568J872
10253c551J5627K8657J2203n316j6561J363j213L920N19l982p864p907M377L29
10239B0601j712l372P964p475m720K894J1492M349P740o814O370j2266j6971j9765
10225a1685k005q67K085P710J3162p12n419N533N062L059j1031n389r097L954
10211e640R313R298M5p193p233N002L492l261N018O680K831j160l902q258n456
10196d24k314P663P181m957P72j2804r30J2003l795k0O80r369l270M563N099m143
10180d065J0066n002j04n960k814p754n501P418K745l464P552l767l437J1664
10166b423J335M730r560M720K977O039l063o009M851L802n84n22j556N20K404
$$ plain form
10151 7661 19249 20985 23940 11921 -2593 -2229 5174 -1461 1660 26 -7205 -2691 -5225 -9655
10137 -9655 -2398 -5770 -12430 -9174 6452 399 -3055 -657 -6833 -11775 1309 -732 -2194 -8359
10123 -8359 -7197 -6209 -5069 -8488 -13246 -11879 -6484 -5165 -8245 -10324 -785 -4995 -15121 -8415 72
10108 72 5284 10224 15406 8879 3826 13111 8697 9171 -1381 -15589 -12516 -13139 -14084 -15455 -18406
10093 -18406 -8771 -14000 -17496 -5941 8961 4530 5017 759 -4004 -5525 11346 13034 5720 -1761
10079 -1761 12706 13120 12910 4963 -919 -13288 -9568 -8123 -16867 -18198 -8766 -7597 -1416 -2800 3522
10064 3522 3441 4560 3825 393 -6134 -5800 -1736 -1313 -5654 -14213 -13402 -11734 -9761 -8146 -9309 -445
10048 -445 6262 2534 6220 8869 8751 20770 25394 19587 4276 -4267 -8665 -8033 -2823 19632 18221
$$ packed form
10151G661J1588J736K955j2019j4514L64P403o635L121j634p231M514k534m430
10137i655P257l372o660L256J5626o053l454K398o176m942J3084k041j462o165
10123h359J162R88J140l419m758J367N395J319l080k079R539m210j0126O706Q487
10108G2N212M940N182o527n053R285m414M74j0552j4208L073o23r45j371k951
10093a8406R635n229l496J1555J4902m431M87m258m763j521J6871J688p314p481
10079a761J4467M14k10p947n882j2369L720J445q744j331R432J169O181j384O322
10064C522q1J119p35l432o527L34M064M23m341q559Q11J668J973J615j163Q864
10048d45O707l728L686K649j18J2019M624n807j5311q543m398O32N210K2455j411
$$ plain form
10033 18221 5840 -6208 212 1371 -2625 -7974 -5226 2841 -885 7487 14678 19999 10377 7286
10019 7286 5715 -4281 -3001 14212 25734 23365 18063 15607 1431 -2809 -7566 -7076 -9797 -11610
10005 -11610 -6868 7908 8055 16212 13296 3412 -7322 -16070 -13078 -7769 -5470 -3747 -6400 -12632
9991 -12632 -18560 1825 -3359 5176 1523 -4244 -6382 3785 2008 -3291 -4062 -2349 4392 6445
9977 6445 2046 -1642 8757 19044 9943 10098 17563 23212 22976 22274 8756 2418 14694 16573 23685
9962 23685 16060 2533 8512 15724 13220 9570 7875 11606 16720 3929 -313 -5527 -12572 -12975
9948 -12975 -13265 -7234 879 1205 1003 -2133 -5195 5766 7520 4328 12653 25628 25133 16587 10828
9933 10828 -1409 -8732 -4822 -6589 -12824 -8043 -3425 -4490 -6133 -1858 -11119 -18762 -8115 3699
$$ packed form
10033A8221j2381j2048O420J159l996n349K748Q067l726Q372P191N321r622l091
10019G286j571r996J280J7213J1522k369n302k456j4176m240m757M90k721j813
10005a1610M742J4776J47Q157k916r884j0734q748K992N309K299J723k653o232
9991a2632n928K0385n184Q535l653n767k138J0167j777n299p71J713O741K053
9977F445m399l688J0399J0287r101J55P465N649k36p02j3518o338J2276J879P112
9962B3685p625j3527N979P212k504l650j695L731N114j2791m242n214p045m03
9948a2975k90O031Q113L26k02l136l062J0961J754l192Q325J2975m95q546n759
9933A0828j2237p323L910j767o235M781M618j065j643M275r261p643J0647J1814
$$ plain form
9919 3699 3800 -10050 -16495 -14328 -6541 -8766 -13820 -23742 -26619 -27590 -20839 -8411 -4708 -324 -1549
9904 -1549 1877 5250 11657 14155 -774 -5988 404 12520 8085 9606 5338 934 9172 5640
9890 5640 3157 6498 5600 -4499 -6471 2223 3289 153 7297 -1531 -7617 1771 7601 4955 -3731
9875 -3731 -7440 -5222 -22841 -27602 -16568 -7965 -7754 -14105 -4418 4159 6443 13928 14300 8121 3639
9860 3639 4013 9050 -2379 4411 11748 3294 262 813 1217 3572 10894 9986 5620 440 -1349 -542
9844 -542 5693 5596 13979 13350 17935 20754 30062 16971 -8962 -18491 -5359 8141 14828 7330 6129
9829 6129 10666 7611 -2779 -13206 -3016 -1536 7251 13082 7701 9002 11373 10841 4580 3554
9815 3554 1188 3 -1665 -5925 -5692 3384 16240 17472 14997 8529 4573 2946 3813 3159 8565
$$ packed form
9919C699J01j3850o445K167P787k225n054r922k877r71O751J2428L703M384j225
9904a549L426L373O407K498j4929n214O392J2116m435J521m268m404Q238l532
9890E640k483L341q98j0099j972Q694J066l136P144q828o086R388N830k646q686
9875c731l709K218j7619m761J1034Q603K11o351R687Q577K284P485L72o179m482
9860C639L74N037j1429O790P337q454l032N51M04K355P322r08m366n180j789Q07
9844e42O235r7Q383o29M585K819R308j3091k5933r529J3132J3500O687p498j201
9829F129M537l055j0390j0427J0190J480Q787N831n381J301K371n32o261j026
9815C554k366j185j668m260K33R076J2856J232k475o468l956j627Q67o54N406
$$ plain form
9800 8565 18598 24439 23921 17406 3125 -3150 -8990 -1708 8193 9018 7109 7331 13857 19331 20684
9785 20684 8962 8690 29580 28911 32231 45539 38164 28394 21611 12603 8565 18862 13963 11132
9771 11132 2585 -8060 14678 19629 11291 1746 5596 4722 6019 10340 3972 -6375 -7160 585
9757 585 3866 4802 4966 11115 14267 8712 -2768 6774 10903 7651 9843 14036 12513 11890 2426 -3607
9741 -3607 -6001 3690 5549 8556 2429 5411 11810 7176 12794 18639 12240 22375 19634 19440 31437
9726 31437 37051 44188 39564 33998 24788 20286 13618 -3872 -10682 2104 7087 4108 4534 7334
9712 7334 6510 4590 13761 10793 12986 7267 -3577 -8783 -7669 272 3431 -661 -5996 -3705 4726
9697 4726 5863 22557 26029 30431 17972 5943 2415 9227 14954 14449 8479 5031 1354 -3463
$$ packed form
9800H565J0033N841n18o515j4281o275n840P282R901Q25j909K22O526N474J353
9785B0684j1722k72K0890o69L320J3308p375r770o783r008m038J0297m899k831
9771A1132q547j0645K2738M951q338r545L850q74J297M321o368j0347p85P745
9757E85L281R36J64O149L152n555j1480R542M129l252K192M193j523o23r464o033
9741c607k394R691J859L007o127K982O399m634N618N845o399J0135k741j94J1997
9726C1437N614P137m624n566r210m502o668j7490o810J2786M983k979M26K800
9712G334q24j920R171k968K193n719j0844n206J114P941L159m092n335K291Q431
9697D726J137J6694L472M402j2459j2029l528O812N727n05n970l448l677m817
$$ plain form
9683 -3463 -8483 -1920 -8868 -2678 7085 3677 8697 8411 -3070 -8802 -8022 -9013 -6470 1119 16492
9668 16492 15356 28449 18597 19247 19964 22798 11416 4851 7422 2678 16456 32544 32727 33839
9654 33839 12489 4469 5865 4684 2293 4655 12440 26047 34462 25017 18032 19917 22121 15984
9640 15984 14493 19363 28855 30351 28028 31349 31143 32161 16876 8274 11965 11490 5088 -179 -2407
9625 -2407 -1164 -1260 -4217 3308 11089 14012 18422 25668 10072 10949 25444 23640 24766 21509 15539
9610 15539 8256 9844 13596 18517 15809 10882 11563 9972 -8307 -9097 -9632 4066 5471 6343 1299
9595 1299 9331 15376 17299 8167 10548 12528 16460 11724 7931 6800 10293 19602 24942 21906 19603
9580 19603 16186 21205 18281 12533 4722 -3667 -6124 -7012 3480 11302 10607 1359 4716 -231 -8280
$$ packed form
9683c463n020O563o948O190R763l408N020k86j1481n732P80r91K543P589J5373
9668A6492j136J3093r852O50P17K834j1382o565K571m744J3778J6088J83J112
9654C3839k1350q020J396j181k391K362P785J3607Q415r445o985J885K204o137
9640A5984j491M870R492J496k323L321k06J018j5285q602L691m75o402n267k228
9625b407J243r6k957P525P781K923M410P246j5596Q77J4495j804J126l257n970
9610A5539p283J588L752M921k708m927O81j591j8279p90n35J3698J405Q72n044
9595A299Q032O045J923r132K381J980L932m736l793j131L493R309N340l036k303
9580A9603l417N019k924n748p811q389k457q88J0492P822o95r248L357m947q049
$$ plain form
9565 -8280 -2342 13968 18120 23386 27320 24561 24947 18659 14911 17914 21004 22704 14037 2920 -1161
9550 -1161 -2390 -5958 3767 7093 14235 9620 1153 8135 24022 33942 22280 13141 20099 19047
9536 19047 10336 5013 7966 12132 13332 12831 14967 15504 14669 15177 19015 29010 24145 25457 26995 24507
9520 24507 29087 29377 25464 27272 20681 17587 14650 13161 14181 15369 11608 3564 18687 22847 33925
9505 33925 38056 21716 5393 4064 12515 14116 20489 35356 32992 28798 32822 33876 28560 17361
9491 17361 12170 9965 11069 7251 5744 5169 7073 2854 11188 7883 -680 1305 3197 6994 17384
9476 17384 20248 17152 25469 28367 22867 27937 36597 27895 18651 17921 21350 25605 26605 22987 18797
9461 18797 33433 47081 38240 22493 21764 30799 25295 27560 30035 27980 17118 15390 17141 28116
$$ packed form
9565h280N938J6310M152N266L934k759L86o288l748L003L090J700q667j1117m081
9550a161j229l568R725L326P142m615q467O982J5887R920j1662r139O958j052
9536A9047q711n323K953M166J200n01K136N37q35N08L838R995m865J312J538k488
9520B4507M580K90l913J808o591l094k937j489J020J188l761q044J5123M160J1078
9505C3925M131j6340j6323j329Q451J601O373J4867k364m194M024J054n316j1199
9491A7361n191k205J104l818j507n75J904m219Q334l305q563J985J892L797J0390
9476A7384K864l096Q317K898n500N070Q660q702r244p30L429M255J000l618m190
9461A8797J4636J3648q841j5747p29R035n504K265K475k055j0862j728J751J0975
$$ plain form
9447 28116 33590 32059 33394 41848 39123 40021 48438 50025 51729 59913 62847 48792 43823 42111 30832
9432 30832 32224 44986 51024 57000 54607 57237 49068 50878 55256 62619 58113 45065 40779 41810
9418 41810 37669 49834 59599 60629 59827 65809 62457 76491 89394 95634 92140 89209 101018 107690
9404 107690 98385 98795 112987 119377 120170 140808 154470 164222 185179 196580 218868 238388 254570
9391 254570 277952 303963 341594 392528 443776 499944 578108 679729 807523 976281 1196900
9380 1196900 1486417 1881280 2400916 3039036 3770227 4495533 5045803 5279584 5147646 4717317
9370 4717317 4089780 3384571 2731853 2194533 1775959 1449735 1202311 1011664 855577 754019
9360 754019 676806 595548 531839 484224 434991 396501 362821 345962 340349 314711 294262 280656
$$ packed form
9447B8116N474j531J335Q454k725Q98Q417J587J704Q184K934j4055m969j712j1279
9432C0832J392J2762O038N976k393K630q169J810M378P363m506j3048m286J031
9418D1810m141J2165R765J030q02N982l352J4034J2903O240l494k931J1809O672
9404A07690r305M10J4192O390P93K0638J3662R752K0957J1401K2288J9520J6182
9391B54570K3382K6011L7631N0934N1248N6168P8164J01621J27794J68758K20619
9380A196900K89517L94863N19636O38120P31191P25306N50270K33781j31938m30329
9370D717317o27537p05209o52718n37320m18574l26224k47424j90647j56087j01558
9360G54019p7213q1258o3709m7615m9233l8490l3680j6859n613k5638k0449j3606
$$ plain form
9348 280656 266738 246223 229589 224768 214719 201794 186812 173213 161665 143924 134268 129935
9336 129935 129023 143543 141766 119224 112986 103845 96275 93715 106445 109533 99899 77976 78381 88024
9322 88024 82545 77379 74534 81443 93556 89553 80430 82104 78987 78233 73625 65532 64055 72743 69043
9307 69043 66321 66080 60634 58839 67479 64543 63082 67739 67470 55321 55288 60344 38791 18892 21018
9292 21018 30302 25751 35921 43571 36069 30494 21093 13610 7448 -1232 -142 4169 14401 14942
9278 14942 2908 20354 34274 29552 26277 18460 20212 31074 39274 41032 32963 32088 41078 44483
9264 44483 38389 34581 41395 34357 25990 23040 20044 12952 20692 21741 13224 13019 2013 245 7270
9249 7270 15013 31389 51480 47551 28743 29123 25621 18328 26108 34250 33734 23858 20702 12177 5424
$$ packed form
9348B80656j3918k0515j6634m821j0049j2925j4982j3599j1548j7741r656m333
9336A29935r12J4520j777k2542o238r141p570k560J2730L088r634k1923M05R643
9322H8024n479n166k845O909J2113m003r123J674l117p54m608q093j477Q688l700
9307F9043k722k41n446j795Q640k936j461M657k69j2149l3N056k1553j9899K126
9292B1018R284m551J0170P650p502n575r401p483o162q680J090M311J0232N41
9278A4942j2034J7446J3920m722l275p817J752J0862Q200J758q069q75Q990L405
9264D4483o094l808O814p038q367k950k996p092P740J049q517k05j1006j768P025
9249G270P743J6376K0091l929j8808L80l502p293P780Q142n16r876l156q525o753
$$ plain form
9234 5424 7761 12017 19185 22983 23281 19919 26487 37791 49118 39237 37841 31501 23877 22201 18319
9219 18319 21364 36800 44586 40870 40668 32401 30389 34868 34593 50738 67632 67376 66738 66072 58266
9204 58266 52469 38729 34322 27824 25718 23302 26599 33626 34497 21952 19408 21613 18540 26907
9190 26907 24117 11204 11640 -1370 -2561 840 4330 -773 -2013 10169 13020 2193 -1217 -2254
9176 -2254 2501 1178 1373 4293 7149 5512 407 5105 2408 -5771 -17306 -19760 -12922 -5351 3400
9161 3400 19660 8324 8260 12172 28558 34325 32392 19588 10058 16252 16623 17398 19167 6827 5221
9146 5221 19482 22404 26169 36237 40949 43109 42053 41979 39979 41025 54592 70353 72382 74013
9132 74013 73901 67505 60906 57847 52961 60428 69825 74030 77924 84794 89990 93895 99882 107142 111404
$$ packed form
9234E424K337M256P168L798K98l362O568J1304J1327r881j396o340p624j676l882
9219A8319L045J5436P786l716k02q267k012M479k75J6145J6894k56o38o66p806
9204E8266n797j3740m407o498k106k416L297P027Q71j2545k544K205l073Q367
9190B6907k790j2913M36j3010j191L401L490n103j240J2182K851j0827l410j037
9176b254M755j323J95K920K856j637n105M698k697q179j1535k454O838P571Q751
9161C400J6260j1336o4L912J6386N767j933j2804r530O194L71P75J769j2340j606
9146E221J4261K922L765J0068M712K160j056p4k000J046J3567J5761K029J631
9132G4013j12o396o599l059m886P467R397M205L894O870N196L905N987P260M262
$$ plain form
9117 111404 134528 143404 148389 177885 214725 242081 281993 340946 405881 482150 584119 722036
9105 722036 897672 1103837 1337248 1573582 1786534 1960686 2067235 2092479 2034947 1905443
9095 1905443 1719707 1484269 1238920 1011800 842236 701375 577892 485534 428734 376436
9085 376436 337085 299110 269104 251006 233624 211785 200091 187600 171865 154587 134054 112873
9073 112873 113274 112266 97909 84005 82342 78169 74089 74403 84159 73585 79274 79480 83007 85414
9059 85414 70634 74354 88686 96298 84740 80172 86531 80700 70554 68824 63787 57570 52206 60321
9045 60321 58203 58967 66306 74518 75836 69614 72882 82273 82243 67961 69364 68492 68497 59901 62385 58964
9029 58964 51712 39271 36572 34581 36399 38633 31109 39023 34027 31081 35912 46172 48571 47495
$$ packed form
9117A11404K3124Q876M985K9496L6840K7356L9912N8953O4935P6269J01969J37917
9105G22036J75636K06165K33411K36334K12952J74152J06549K5244n7532j29504
9095A905443j85736k35438k45349k27120j69564j40861j23483r2358n6800n2298
9085C76436l9351l7975l0006j8098j7382k1839j1694j2491j5735j7278k0533k1181
9073A12873M01j008j4357j3904j663m173m080L14R756j0574N689K06L527K407
9059H5414j4780L720J4332P612j1558m568O359n831j0146j730n037o217n364Q115
9045F0321k118P64P339Q212J318o222L268R391l0j4282J403q72Nq596K484l421
9029E8964p252j2441k699j991J818K234p524P914m996k946M831J0260K399j076
$$ plain form
9015 47495 31401 23294 5589 -12162 -11165 -447 11137 30381 52567 66876 72967 86629 83114
9002 83114 67292 66601 73024 65672 68920 78177 81747 84909 94753 98995 107885 103377 108132 108038 98282
8987 98282 95000 100426 112079 121260 123284 124439 123746 128359 123387 133263 131232 137423 154428 147392
8973 147392 127761 112649 118005 127419 132577 134639 154482 174292 181867 169354 180376 198624 215912
8960 215912 258349 316593 406537 525217 640186 712042 759757 764970 669969 559574 489527
8949 489527 398901 313593 261701 229894 206104 189973 169338 153707 149972 141299 128513 103939
8937 103939 95803 81623 62718 61940 68530 72663 77798 80390 86697 106487 120736 125986 132183 142269
8923 142269 135453 118876 123523 126239 138627 148915 144964 141117 141517 147198 153073 158421 169255 171164
$$ packed form
9015D7495j6094q107j7705j7751R97J0718J1584J9244K2186J4309O091J3662l515
9002H3114j5822o91O423p352L248R257L570L162R844M242Q890m508M755r4r756
8987I8282l282N426J1653R181K024J155o93M613m972R876k031O191J7005p036
8973A47392j9631j5112N356R414N158K062J9843J9810P575j2513J1022J8248J7288
8960B15912M2437N8244Q9944J18680J14969P1856M7715N213r5001j10395p0047
8949D89527r0626q5308n1892l1807k3790j6131k0635j5631l735q673j2786k4574
8937A03939q136j4180j8905p78O590M133N135K592O307J9790J4249N250O197J0086
8923A42269o816j6577M647K716J2388J0288l951l847M00N681N875N348J0834J909
$$ plain form
8909 171164 171497 174395 176492 172927 176732 179785 190387 196230 191251 170768 150293 141003 128882 105361
8895 105361 85641 75551 76331 72553 75092 75618 70135 67356 81114 106855 136065 137359 125232
8882 125232 111351 95124 94479 108225 116693 129859 147601 150375 146463 150564 163953 168682 172288
8869 172288 170938 175316 199647 221189 229585 242175 255846 265658 279610 290752 293974 289621 283095
8856 283095 285675 273658 263911 250265 232352 207800 180610 164596 160895 150702 168759 207791
8844 207791 240589 268612 287231 304363 311350 327695 335748 346482 365884 382946 400156 422828
8832 422828 467531 552908 661954 774954 833597 797860 754762 775398 822341 827809 761260
8821 761260 629506 525303 470535 441451 427565 438858 456478 482339 489885 480651 465012 459580
$$ packed form
8909A71164L33K898K097l565L805L053J0602N843m979k0483k0475r290j2121k3521
8895A05361j9720j0090P80l778K539N26n483k779J3758K5741K9210J294j2127
8882A25232j3881j6227o45J3746Q468J3166J7742K774l912M101J3389M729L606
8869A72288j350M378K4331K1542Q396J2590J3671R812J3952J1142L222m353o526
8856B83095K580j2017r747j3646j7913k4552k7190j6014l701j0193J8057L9032
8844B07791L2798K8023J8619J7132O987J6345Q053J0734J9402J7062J7210K2672
8832D22828M4703Q5377J09046J13000N8643l5737m3098K0636M6943N468o6549
8821G61260j31754j04203n4768k9084j3886J1293J7620K5861P546r234j5639n432
$$ plain form
8809 459580 449919 442795 440661 441039 447005 464048 484678 498773 508508 524043 529410 524177 543018
8796 543018 567918 580587 591847 605959 613244 629082 672210 700466 709002 729510 745544 728959
8784 728959 716766 724147 737298 747542 758245 792417 842754 890604 929671 966555 1003974 1021441
8772 1021441 1025132 1048804 1083630 1106069 1149952 1201117 1240937 1280983 1325999 1374334 1423561 1463614
8760 1463614 1509813 1533878 1549609 1578452 1606930 1641533 1682164 1736842 1821150 1904182 1997978
8749 1997978 2120158 2242732 2351850 2466491 2571276 2675249 2806858 2966998 3175452 3438813
8739 3438813 3775450 4216171 4766980 5384949 5896846 6195589 6334110 6382947 6377115 6400836
8729 6400836 6524716 6768451 7112973 7543801 8060172 8660235 9380217 10248696 11284365
$$ packed form
8809D59580r661p124k134L78N966J7043K0630J4095R735J5535N367n233J8841
8796E43018K4900J2669J1260J4112P285J5838M3128K8256Q536K0508J6034j6585
8784G28959j2193P381J3151J0244J0703L4172N0337M7850L9067L6884L7419J7467
8772A021441L691K3672L4826K2439M3883N1165L9820M0046M5016M8335M9227M0053
8760A463614M6199K4065J5731K8843K8478L4603M0631N4678Q4308Q3032R3796
8749A997978J22180J22574J09118J14641J04785J03973J31609J60140K08454K63361
8739C438813L36637M40721N50809O17969N11897K98743J38521M8837n832K3721
8729F400836J23880K43735L44522M30828N16371O00063P19982Q68479J035669
$$ plain form
8720 11284365 12579040 14196761 16178732 18626732 21608903 25204911 29370952 34014018
8712 34014018 39226245 45429068 53430403 64568732 80944351 105806247 143609935 199611643
8704 199611643 278148730 377050385 475311990 533949329 535014679 492141148 421370133
8697 421370133 333821505 249583682 183350869 137139599 106482189 86200875 72398119
8690 72398119 62521192 55068035 49220107 44340820 39980622 36059786 32589035 29529763
8682 29529763 26841170 24529702 22561468 20838466 19282861 17873381 16598060 15420668
8674 15420668 14372074 13443409 12607255 11855686 11180286 10571748 10020767 9541999 9114863
8665 9114863 8718016 8355144 8023106 7736941 7494606 7241502 6998371 6762488 6518430 6292921
$$ packed form
8720A1284365J294675J617721J981971K448000K982171L596008M166041M643066
8712C4014018N212227O202823Q001335J1138329J6375619K4861896L7803688N6001708
8704A99611643P8537087R8901655R8261605N8637339J065350m2873531p0771015
8697D21370133q7548628q4237823o6232813m6211270l0657410k0281314j3802756
8690G2398119r876927p453157n847928m879287m360198l920836l470751l059272
8682B9529763k688593k311468j968234j723002j555605j409480j275321j177392
8674A5420668j048594r28665q36154p51569o75400o08538n50981m78768m27136
8665I114863l96847l62872l32038k86165k42335k53104k43131k35883k44058k25509
$$ plain form
8655 6292921 6094301 5927467 5788676 5671896 5570709 5497482 5429306 5369376 5313909 5271363
8645 5271363 5237160 5230323 5244082 5296534 5391280 5507937 5621050 5700860 5659314 5449545 5131671
8634 5131671 4785717 4480874 4228239 3982967 3748160 3542689 3362421 3213949 3060274 2920476
8624 2920476 2814247 2714037 2614992 2540450 2472416 2391710 2306551 2227521 2143003 2077959 2030017
8613 2030017 1988179 1958789 1952130 1938518 1926846 1938500 2005267 2137960 2362614 2704100 3177325
8602 3177325 3705435 4004835 3953573 3660320 3246722 2751900 2301633 1976017 1758063 1617909
8592 1617909 1515363 1433834 1372435 1321979 1285960 1260297 1233894 1213132 1200419 1193760 1198595 1217085
8580 1217085 1240092 1263788 1285704 1279424 1226524 1173051 1174497 1265502 1367226 1422011 1436409 1404653
$$ packed form
8655F292921j98620j66834j38791j16780j01187p3227o8176n9930n5467m2546
8645E271363l4203o837J3759N2452R4746J16657J13113P9810m1546k09769l17874
8634E131671l45954l04843k52635k45272k34807k05471j80268j48472j53675j39798
8624B920476j06229j00210r9045p4542o8034q0706q5159p9030q4518o5044m7942
8613B030017m1838k9390o659j3612j1672J1654O6767J32693K24654L41486M73225
8602C177325N28110K99400n1262k93253m13598m94822m50267l25616k17954j40154
8592A617909j02546q1529o1399n0456l6019k5663k6403k0762j2713o659M835J8490
8580A217085K3007K3696K1916o280n2900n3473J446R1005J01724N4785J4398l1756
$$ plain form
8568 1404653 1327518 1220986 1116673 1015522 904538 838266 801961 783824 770445 790515 838652
8557 838652 895165 969573 1049588 1117798 1157320 1146444 1093241 1014479 936028 853618 788101 747987
8545 747987 717310 689728 684929 668045 648879 639122 633252 607982 571316 543669 521990 488008
8533 488008 471407 460243 451275 435407 408038 398064 376303 375907 394714 406194 413105 423208 423450
8520 423450 420185 406152 389038 377448 383720 391458 376621 372296 376008 379238 372070 368550 357892
8507 357892 356421 351214 334448 313544 288421 262220 242211 226318 209490 194948 182749 179749
8495 179749 175670 176276 183755 189430 188665 189362 178862 165054 165968 176466 176758 176364 164062 160291 166586
8480 166586 161864 166024 180030 178518 169146 167561 164290 146682 149375 165529 178142 178487 191625
$$ packed form
8568A404653p7135j06532j04313j01151j10984o6272l6305j8137j3379K0070M8137
8557H38652N6513P4408Q0015O8210L9522j0876n3203p8762p8451q2410o5517m0114
8545G47987l0677k7582m799j6884j9166r757n870k5270l6666k7647k1679l3982
8533D88008j6601j1164q968j5868k7369r974k1761l96J8807J1480O911J0103K42
8520D23450l265j4033j7114j1590O272P738j4837m325L712L230p168l520j0658
8507C57892j471n207j6766k0904k5123k6201k0009j5893j6828j4542j2199l000
8495A79749m079O06P479N675p65O97j0500j3808R14J0498K92l94j2302l771O295
8480A66586m722M160J4006j512r372j585l271j7608K693J6154J2613L45J3138
$$ plain form
8467 191625 199654 192067 173555 168236 154050 138479 124986 126641 139579 130480 136470 141785 153788
8454 153788 152854 150058 158104 174111 179427 187461 196909 209197 208901 195474 175383 170177 170079 157719
8440 157719 138384 134488 120980 108430 98909 92619 82470 75335 81255 81283 86582 89299 93765 92743
8426 92743 87714 97143 112041 114829 118562 114167 111301 106864 109669 102081 88924 79803 83371 90468
8412 90468 93390 98229 89647 84590 82834 80423 78937 87967 107796 122496 117031 96784 85483 86155
8398 86155 73182 57197 66428 76645 82634 93409 117321 150399 154217 150262 141428 133985 124308
8385 124308 127135 134803 115640 105214 106832 94693 99919 111549 113354 112764 124850 126686 133294
8372 133294 114669 95348 95457 96929 93934 85746 82828 92776 96366 88695 88982 91887 94615 99102
$$ packed form
8467A91625Q029p587j8512n319j4186j5571j3493J655J2938r099N990N315J2003
8454A53788r34k796Q046J6007N316Q034R448J2288k96j3427k0091n206r8j2360
8440A57719j9335l896j3508j2550r521o290j0149p135N920K8N299K717M466j022
8426I2743n029R429J4898K788L733m395k866m437K805p588j3157r121L568P097
8412I0468K922M839q582n057j756k411j486R030J9829J4700n465k0247j1301O72
8398H6155j2973j5985R231J0217N989J0775K3912L3078L818l955q834p443r677
8385A24308K827P668j9163j0426J618j2139N226J1630J805n90J2086J836O608
8372A33294j8625j9321J09J472k995q188k918R948L590p671K87K905K728M487
$$ plain form
8358 99102 100499 96767 87078 78441 69951 60954 69886 88626 84215 77152 68523 76389 83203 88604
8344 88604 97034 105485 105507 101868 88795 81371 74430 82952 86170 87080 90723 111575 113345 109441 112333
8329 112333 112239 105233 103178 108909 119000 118257 114168 101111 88968 93057 108050 119518 125499 119554
8315 119554 134195 137600 151449 186060 219097 263178 295622 345536 419392 504247 603003 746186
8303 746186 935533 1153072 1387489 1625335 1837014 1994016 2084793 2091463 1999452 1841550
8293 1841550 1644623 1418678 1190599 990414 815338 674747 566599 487859 419388 369414
8283 369414 342938 315779 283648 269803 252428 242974 217543 198412 175249 162485 150321 136020
8271 136020 126675 110669 106151 104461 95952 91582 90919 91474 85227 80105 63249 62033 66248 65152
$$ packed form
8358I9102J397l732r689q637q490q997Q932J8740m411p063q629P866O814N401
8344H8604Q430Q451K2l639j3073p424o941Q522L218R10L643K0852J770l904K892
8329A12333r4p006k055N731J0091p43m089j3057j2143M089J4993J1468N981n945
8315A19554J4641L405J3849L4611L3037M4081L2444M9914P3856Q4855R8756J43183
8303G46186J89347K17539K34417K37846K11679J57002R0777O670r2011j57902
8293A841550j96927k25945k28079k00185j75076j40591j08148p8740o8471m9974
8283C69414k6476k7159l2131j3845j7375r454k5431j9131k3163j2764j2164j4301
8271A36020r345j6006m518j690q509m370o63N55o247n122j6856j216M215j096
$$ plain form
8257 65152 80373 89305 95591 111063 115034 94811 83869 78423 71831 66738 82876 80123 78636
8244 78636 75283 78197 80129 96971 109192 121030 140042 135567 124341 138709 155944 152535 153768
8231 153768 138758 134253 126054 117905 101467 96650 91538 86813 87789 68758 56114 60924 70698 80877
8217 80877 84573 86784 74074 53624 51229 47850 48959 53981 63174 85765 93404 83159 79113 85843
8203 85843 77074 70067 73463 60669 57125 63316 69424 64201 53417 56810 74035 79938 66278 50789
8189 50789 52940 56609 48588 41713 37608 59994 58029 55563 51708 51256 58792 53640 41404 50839
8175 50839 55134 44882 29238 30929 36131 48254 45307 55685 69551 66838 55891 51696 45918
8162 45918 44388 31164 35565 30091 31838 30831 40954 40898 44314 44118 43083 49684 51853 53190 44691
$$ packed form
8257F5152J5221Q932O286J5472L971k0223j0942n446o592n093J6138k753j487
8244G8636l353K914J932J6842J2221J1838J9012m475j1226J4368J7235l409J233
8231A53768j5010m505q199q149j6438m817n112m725R76j9031j2644M810R774J0179
8217H0877L696K211j2710k0450k395l379J109N022R193K2591P639j0245m046O730
8203H5843q769p007L396j2794l544O191O108n223j0784L393J7225N903j3660j5489
8189E0789K151L669q021o875m105K2386j965k466l855m52P536n152j2236R435
8175E0839M295j0252j5644J691N202J2123k947J0378J3866k713j0947m195n778
8162D5918j530j3224M401n474J747j007J0123n6L416j96j035O601K169J337q499
$$ plain form
8147 44691 56814 65216 55817 43558 48830 43838 46594 61099 64635 56714 56757 54078 42934 24280
8133 24280 24959 24997 28844 41340 50408 43365 43617 37418 36455 42091 43686 48660 51853 46725 41341 40979
8117 40979 44057 49319 40434 44517 43584 48806 48431 44364 42010 25398 29466 41867 43840 40889 33518
8102 33518 28506 32330 28791 37128 39025 32312 21790 23594 26818 28002 24582 29776 37147 34776
8088 34776 26992 32746 39063 57551 63800 56360 56955 56346 52142 58634 62053 56732 58941 58800 60149
8073 60149 54149 40382 35821 39421 29384 16103 14285 11499 5083 4553 5270 10796 3001 -5263
8059 -5263 -2270 3776 10790 18868 24976 31148 28691 18532 21323 30438 47216 44095 24495 8396
8045 8396 17620 38143 41794 47022 42773 34745 35920 50346 54918 60832 70089 59648 44698 46958
$$ packed form
8147D4691J2123Q402r399j2259N272m992K756J4505L536p921M3k679j1144j8654
8133B4280O79L8L847J2496R068p043K52o199r63N636J595M974L193n128n384l62
8117D0979L078N262q885M083r33N222l75m067k354j6612M068J2401J973k951p371
8102C3518n012L824l539Q337J897o713j0522J804L224J184l420N194P371k371
8088C4776p784N754O317J8488O249p440N95o09m204O492L419n321K209j41J349
8073F0149o000j3767m561L600j0037j3281j818k786o416n30P17N526p795q264
8059e263K993O046P014Q078O108O172k457j0159K791R115J6778l121j9600j6099
8045H396R224K0523L651N228m249q028J175J4426M572N914R257j0441j4950K260
$$ plain form
8031 46958 62700 72700 77550 78244 64530 60699 65164 55416 54442 46544 44219 44370 29000 17363
8017 17363 21904 29878 41786 37831 45661 55649 38179 26932 36479 42503 34980 23166 33562
8004 33562 52872 77242 80828 83751 95115 91754 91356 110578 119771 112569 117580 114796 102032 91020
7990 91020 108709 134383 168961 209091 242868 247417 230461 194761 158275 133765 107057 88964
7978 88964 80525 73036 60135 60260 64122 62870 65232 68331 65903 77601 62344 61936 64066 67327
7964 67327 71682 69553 64362 66592 71285 83290 99192 114958 125095 127958 141831 156033 181191
7951 181191 200268 204958 201379 208500 211049 215978 241158 253832 259587 258580 237109 207962 182966
7938 182966 149583 129609 110754 102339 97287 92332 93468 84977 73548 64429 69469 73491 58478
$$ packed form
8031D6958J5742J0000M850O94j3714l831M465r748r74p898k325J51j5370j1637
8017A7363M541P974J1908l955P830R988j7470j1247R547O024p523j1814J0396
8004C3562J9310K4370L586K923J1364l361l98J9222R193p202N011k784j2764j1012
7990I1020J7689K5674L4578M0130L3777M549j6956l5700l6486k4510k6708j8093
7978H8964q439p489j2901J25L862j252K362L099k428J1698j5257m08K130L261
7964F7327M355k129n191K230M693J2005J5902J5766J0137K863J3873J4202K5158
7951A81191J9077M690l579P121K549M929K5180J2674N755j007k1471k9147k4996
7938A82966l3383j9974j8855q415n052m955J136q491j1429r119N040M022j5013
$$ plain form
7925 58478 58165 58290 43543 30356 35084 32631 24834 37103 50540 63752 76592 101446 111764
7912 111764 110148 111650 109007 106068 96475 87992 80491 81116 79657 87066 91829 87096 78794 66816
7898 66816 65223 50609 31810 22360 29818 32141 38136 54517 63518 48072 48874 40830 34838 24621
7884 24621 20135 26498 31138 31212 30839 31309 36251 34934 26884 23860 25424 28075 19453 14915 18991 20034
7868 20034 24535 26293 29987 24304 22957 19978 9362 9543 26590 33017 32228 23797 6469 5543 23752
7853 23752 31283 22426 22695 28026 19486 15836 22942 18218 20589 14471 -981 -1754 209 3339 12539
7838 12539 16592 18867 13391 11849 8546 8032 17189 13801 9150 3826 4240 15741 19565 12952 6817
7823 6817 4058 10585 18893 10409 4650 -259 9822 12986 16164 25214 17300 10202 4822 10907 13630
$$ packed form
7925E8478l13J25j4747j3187M728k453p797J2269J3437J3212J2840K4854J0318
7912A11764j616J502k643k939r593q483p501O25j459P409M763m733q302j1978
7898F6816j593j4614j8799r450P458K323N995J6381R001j5446Q02q044n992j0217
7884B4621m486O363M640P4l73M70M942j317q050l024J564K651q622m538M076J043
7868B0034M501J758L694n683j347k979j0616J81J7047O427p89q431j7328r26J8209
7853B3752P531q857K69N331q540l650P106m724K371o118j5452p73J963L130R200
7838A2539M053K275n476j542l303n14R157l388m651n324M14J1501L824o613o135
7823F817k759O527Q308q484n759m909J0081L164L178R050p914p098n380O085K723
$$ plain form
7808 13630 13603 17726 12981 9329 -698 4921 16571 23980 29587 22096 28681 39470 43362 27391
7794 27391 17964 12487 7934 5616 14616 20782 18542 10945 10502 20146 22764 21885 27568 31478 34374
7779 34374 32863 28661 28078 21031 18463 8432 3829 9299 13551 18635 22564 17538 18586 10974 15859
7764 15859 16668 19148 25120 20458 22008 21851 14462 17833 28958 20944 13640 12269 10879 7602 9844
7749 9844 17614 17374 14718 21488 14899 2850 1425 -2265 -182 19 -6601 -1247 6726 -2914 10742
7734 10742 27553 22608 10846 8301 10367 19476 15353 19009 17260 28976 25530 10153 669 -276
7720 -276 -7770 -2125 8518 11077 21983 29166 19202 4572 222 -1948 2076 11334 -1368 -8594
7706 -8594 5597 20999 22234 16800 16030 16691 11698 7197 -3129 -8673 -12062 -7013 6799 13053
$$ packed form
7808A3630k7M123m745l652j0027N619J1650P409N607p491O585J0789L892j5971
7794B7391r427n477m553k318R000O166k240p597m43R644K618q79N683L910K896
7779C4374j511m202n83p047k568j0031m603N470M252N084L929n026J048p612M885
7764A5859Q09K480N972m662J550j57p389L371J1125q014p304j371j390l277K242
7749I844P770k40k656O770o589j2049j425l690K083K01o620N354P973r640J3656
7734A0742J6811m945j1762k545K066R109m123L656j749J1716l446j5377r484r45
7720b76p494N645J0643K559J0906P183r964j4630m350k170M024R258j2702p226
7706h594J4191J5402J235n434p70O61m993m501j0326n544l389N049J3812O254
$$ plain form
7692 13053 18861 20387 19381 9684 5577 4007 8074 10079 -4281 -15786 -19420 -5606 5411 8265
7678 8265 12578 17817 17647 17490 16627 17228 24293 16428 4010 9983 -2229 -6191 -6000 -4710 -589 8369
7662 8369 6171 -1339 9156 11045 510 -11136 -12251 5775 10177 14097 7376 8905 12052 15165
7648 15165 13779 934 -5052 -5299 3497 4797 -2326 3187 12864 12537 3963 -7597 -61 24020
7634 24020 19290 12016 8979 10734 13608 19641 25260 39491 42644 41580 38822 20470 7951 8557
7620 8557 4589 1369 -4037 -7104 -13346 -8404 -1951 -6496 -1326 16157 19023 13295 17450 15816 18951
7605 18951 19717 15806 6138 3569 2340 -11051 -14220 -5686 -9112 -14427 -12575 2539 533 5899
7591 5899 5708 -1209 -4544 -1735 -20856 -29075 -3865 9471 -1697 -12608 -5603 7341 10662 2074
$$ packed form
7692A3053N808J526j006r697m107j570M067K005j4360j1505l634J3814J1017K854
7678H265M313N239j70j57q63O01P065p865j2418N973j2212l962J91J290M121Q958
7662H369k198p510J0495J889j0535j1646j115J8026M402L920o721J529L147L113
7648A5165j386j2845n986k47Q796J300p123N513R677l27q574j1560P536K4081
7634B4020m730p274l037J755K874O033N619J4231L153j064k758j8352j2519O06
7620H557l968l220n406l067o242M942O453m545N170J7483K866n728M155j634L135
7605A8951P66l911r668k569j229j3391l169Q534l426n315J852J5114k006N366
7591E899j91o917l335K809j9121q219K5210J3336j1168j0911P005J2944L321q588
$$ plain form
7577 2074 7170 1010 6719 15615 21124 10233 -2833 -3932 -1081 -5628 -7409 -1158 685 3326
7563 3326 7367 7525 3487 8006 16058 22055 21625 14666 6702 -430 -3579 -3496 5816 21426 32587
7548 32587 26691 13649 25949 30669 28495 36314 43249 27532 7105 15392 25972 23696 15081
7535 15081 16646 10425 868 -3838 22478 26946 18167 13487 15496 17727 22793 22053 2213 2550 16250
7520 16250 18245 17981 21646 33230 36378 31977 20224 17066 21694 11610 2557 -1556 -3612 1130
7506 1130 7982 16289 18194 23888 18322 -4152 -12483 -2952 -12258 -6982 -9259 -4486 -3798 4355 -9279
7491 -9279 -21506 -19654 -20478 -12572 -11807 -5141 5850 18616 23018 10341 1161 -1309 -1504 -110 -58
7476 -58 -8973 -8258 3269 14442 8774 -3099 -5992 -8525 -5899 483 1822 16410 18418 2608
$$ packed form
7577B074N096o160N709Q896N509j0891j3066j099K851m547j781O251J843K641
7563C326M041J58m038M519Q052N997m30o959p964p132l149Q3R312J5610J1161
7548C2587n896j3042J2300M720k174P819O935j5717k0427Q287J0580k276q615
7535A5081J565o221r557m706K6316M468q779m680K009K231N066p40j9840L37J3700
7520A6250J995k64L665J1584L148m401j1753l158M628j0084r053m113k056M742
7506A130O852Q307J905N694n566k2474q331R531r306N276k277M773O88Q153j3634
7491i279j2227J852q24P906P65O666J0991J2766M402j2677r180k470j95J394N2
7476e8q915P15J1527J1173n668j1873k893k533K626O382J339J4588K008j5810
$$ plain form
7462 2608 8364 22508 25037 17243 11656 7688 3486 8670 1897 -5269 -10975 -3916 -1593 4612 -3909
7447 -3909 -13631 -14778 -12945 -16960 -14864 -9657 -5898 -1797 -3705 939 8601 13276 -850 708 6777
7432 6777 7102 2436 4135 10319 15425 16138 14911 17815 -2810 551 8730 7984 10145 10536 14534 14988
7416 14988 10031 8893 22174 27374 17341 15333 13225 3859 5571 9493 11814 43 -3499 -6545
7402 -6545 -5510 752 8248 6012 5396 12333 20791 27149 25110 -3028 -4697 -3376 -1896 535 8883
7387 8883 5959 -16337 -30146 -19051 -1211 4839 4426 11054 12564 12977 12615 13374 17973 8668 8917
7372 8917 6791 9544 6800 213 1215 5192 13172 10153 7382 11388 26542 26108 16218 14422 9385
7357 9385 8762 -9819 -11779 -15468 -4992 8104 9919 2318 6159 9663 14626 1760 -4593 3601
$$ packed form
7462B608N756J4144K529p794n587l968m202N184o773p166n706P059K323O205q521
7447c909r722j147J833m015K096N207L759M101j908M644P662M675j4126J558O069
7432F777L25m666J699O184N106P13j227K904k0625L361Q179p46K161L91L998M54
7416A4988m957j138J3281N200j0033k008k108r366J712L922K321j1771l542l046
7402f545J035O262P496k236o16O937Q458O358k039k8138j669J321J480K431Q348
7387H883k924k2296j3809J1095J7840O050m13O628J510M13l62P59M599r305K49
7372H917k126K753k744o587J002L977P980l019k771M006J5154m34r890j796n037
7357I385o23j8581j960l689J0476J3096J815p601L841L504M963j2866o353Q194
$$ plain form
7343 3601 6033 -2641 -9218 -15406 -8783 -12131 -8587 -4443 5746 6764 12167 6042 1867 -7 -1284
7328 -1284 4922 7835 4917 -2312 -713 -890 -6067 590 7456 8163 7928 -7151 -13918 -4953 9967
7313 9967 16453 9308 1360 -8583 -21174 -17136 -15081 -11192 -5628 -4833 4973 10387 9603 25311 26589
7298 26589 2433 -7036 748 18498 17911 23948 21122 1967 -11127 -8602 -12041 -4500 -776 -3927
7284 -3927 -3084 6195 12220 20920 20572 19255 11966 1423 -774 1476 3858 17592 25249 16694 -3122
7269 -3122 -13489 -4195 -3860 -2228 -2973 -14621 -8857 5420 2811 -668 -7353 5694 7389 8755
7255 8755 10450 18310 27092 17458 13624 11603 18904 21608 16321 11241 15847 22187 34441 31422 21245
7240 21245 16946 14602 990 6361 20206 11233 -1232 -17047 -6125 -5566 -2422 -2797 -2297 -4328
$$ packed form
7343C601K432q674o577o188O623l348L544M144J0189J018N403o125m175j874j277
7328a284O206K913k918p229J599j77n177O657O866P07k35j5079o767Q965J4920
7313I967O486p145p948r943j2591M038K055L889N564P95R806N414p84J5708J278
7298B6589k4156r469P784J7750n87O037k826j9155j3094K525l439P541L724l151
7284c927Q43R279O025Q700l48j317p289j0543k197K250K382J3734P657q555j9816
7269c122j0367R294L35J632p45j1648N764J4277k609l479o685J3047J695J366
7255H755J695P860Q782r634l834k021P301K704n287n080M606O340J2254l019j0177
7240B1245m299k344j3612N371J3845q973j2465j5815J0922N59L144l75N00k031
$$ plain form
7226 -4328 -9974 -19473 -19601 -15790 -10733 -8899 2176 -5503 -8011 1808 4899 6907 6993 9413 8548 6975
7210 6975 1070 -9368 -6357 2924 4996 -4117 -8484 -18530 -9568 7529 3540 -9057 3894 18105
7196 18105 29014 21531 18163 26439 28851 19499 10949 8912 21891 19003 -2002 858 3181 -7149
7182 -7149 -3722 3407 12788 7806 -2265 315 -1304 10976 5565 -1482 -5595 -4076 7533 18535
7168 18535 29495 24078 12112 8409 11949 5988 -4584 520 -2038 -4444 3747 16647 17055 16059
7154 16059 21388 17312 13471 10638 9968 4704 -4700 -5701 -8220 -586 8822 11245 11407 11537 -6171
7139 -6171 -20123 -11643 124 2723 -3233 10319 24251 21444 9942 764 -2209 -4457 -3101 5979
7125 5979 215 -2042 -4195 -8600 -6138 5110 2977 5911 9893 -2072 3211 16973 21455 22796
$$ packed form
7226d328n646r499j28L811N057J834J1075p679k508R819L091K008Q6K420q65j573
7210F975n905j0438L011R281K072r113m367j0046Q962J7097l989j2597J2951J4211
7196A8105J0909p483l368Q276K412r352q550k037J2979k888k1005K860K323j0330
7182g149L427P129R381m982j0071K580j619J2280n411p047m113J519J1609J1002
7168A8535J0960n417j1966l703L540n961j0572N104k558k406Q191J2900M08r96
7154A6059N329m076l841k833o70n264r404j001k519P634R408K423J62J30j7708
7139f171j3952Q480J1767K599n956J3552J3932k807j1502r178k973k248J356R080
7125E979n764k257k153m405K462J1248k133K934L982j1965N283J3762M482J341
$$ plain form
7111 22796 13357 3595 6061 5405 5734 7264 7662 4183 2884 3264 5018 7612 13018 9675 13066 9818
7095 9818 5615 19999 17387 16673 6926 8544 8938 3435 4158 -3123 -2340 -7154 1445 2204 -2605 6322
7079 6322 15842 19104 12146 7201 10742 6489 -8628 -10651 -3431 -3008 -8978 -8965 -8949 -4350 -5294 -4177
7063 -4177 3545 3478 -13044 -13432 2942 19749 13921 12939 12044 19000 24939 23102 18986 26426 11249
7048 11249 4123 12079 1362 2057 5913 -3876 7558 3523 65 -8140 -10140 -1179 2500 -2817
7034 -2817 -4023 -8001 -13580 -17826 -9631 -14063 -10548 -71 4754 11060 3798 6923 -1404 -1988 -5050
7019 -5050 -16756 -9292 -859 7932 18811 11093 4246 -8161 -9448 -5737 1295 19185 33931 28299
7005 28299 19071 13592 6027 -754 -4955 -2706 1427 6260 2899 -1520 -8785 -9209 -14361 -1991 6165
$$ packed form
7111B2796r439r762K466o56L29J530L98l479j299L80J754K594N406l343L391l248
7095I818m203J4384k612p14r747J618L94n503P23p281P83m814Q599P59m809Q927
7079F322R520L262o958m945L541m253j5117k023P220M23n970J3J6M599r44J117
7063d177P722o7j6522l88J6374J6807n828r82q95O956N939j837m116P440j5177
7048A1249p126P956j0717O95L856r789J1434m035l458q205k000Q961L679n317
7034b817j206l978n579m246Q195m432L515J0477M825O306p262L125q327n84l062
7019e050j1706P464Q433Q791J0879p718o847j2407j287L711P032J7890J4746n632
7005B8299r228n479p565o781m201K249M133M833l361m419p265m24n152J2370Q156
$$ plain form
6990 6165 3389 8137 10317 16219 16439 12672 12474 17180 12985 8665 -3748 -7311 -2878 6570 6750
6975 6750 503 -1440 4990 9783 2707 -7895 -13619 -19420 -18171 -13994 9429 13667 7575 6073
6961 6073 845 -9387 -4086 -10497 -9278 7236 8186 1679 3248 3442 16126 9590 -418 -4426
6947 -4426 -6688 2684 8585 9128 22857 27893 20280 6049 4577 5831 7335 -3125 -13540 -6692
6933 -6692 8684 12138 -3013 -7136 -2728 3208 7696 5908 13233 16256 14998 15462 19757 21702 16136
6918 16136 16474 11361 -222 4943 2516 -1810 4508 4309 210 -13521 -20629 -29854 -26981 -19495 -6605
6903 -6605 1433 8904 11319 14851 13035 22358 14854 15305 25300 16996 10435 3337 6373 26833 23954
6888 23954 15182 15134 10667 6535 7039 6730 11239 16308 12940 10872 4730 -1754 -494 358 -2003 4170
$$ packed form
6990F165k776M748K180N902K20l767j98M706m195m320j2413l563M433R448J80
6975F750o247j943O430M793p076j0602n724n801J249M177K3423M238o092j502
6961F073n228j0232N301o411J219J6514R50o507J569J94J2684o536j0008m008
6947d426k262R372N901N43J3729N036p613j4231j472J254J504j0460j0415O848
6933f692J5376L454j5151m123M408N936M488j788P325L023j258M64M295J945n566
6918A6136L38n113j1583N165k427m326O318j99m099j3731p108r225K873P486J2890
6903f605Q038P471K415L532j816R323p504M51R995q304o561p098L036K0460k879
6888B3954q772m8m467m132N04l09M509N069l368k068o142o484J260Q52k361O173
$$ plain form
6872 4170 8853 -4880 -12973 4067 10978 14943 11120 3533 2954 -10381 -10733 -10341 -1163 5520 4557
6857 4557 3457 -4747 -3863 -1563 -932 -1218 -2268 -3830 -5809 576 3384 5864 5243 5119 3607 4243
6841 4243 2336 -739 -7234 -24004 -28621 -26696 -4564 13805 7403 -12933 -20547 -9103 4676
6828 4676 13544 2597 1527 -7102 -8611 681 3792 -902 -6401 -12125 -8310 -855 1539 -1071 3424
6813 3424 -1239 -912 -4309 -10492 -3465 1770 9740 15425 8255 1819 3820 10046 15213 11704 9287
6798 9287 -9267 -5317 8786 13903 3711 -4203 -1798 -1138 -79 -643 -7558 820 12841 9574
6784 9574 9091 -217 -2886 -9667 -20587 -12575 -10893 -4315 -7826 -9308 -12006 3675 14611 18335
6770 18335 13605 6000 -3895 -2467 7135 -750 -9923 4780 9601 8025 -6981 2316 4422 4762
$$ packed form
6872D170M683j3733q093J7040O911L965l823p587n79j3335l52L92R178O683r63
6857D557j100q204Q84K300O31k86j050j562j979O385K808K480o21j24j512O36
6841D243j907l075o495j6770m617J925K2132J8369o402k0336p614J1444J3779
6828D676Q868j0947j070q629j509R292L111m694n499n724L815P455K394k610M495
6813C424m663L27l397o183P027N235P970N685p170o436K001O226N167l509k417
6798I287j8554L950J4103N117j0192p914K405O60J059n64o915Q378J2021l267
6784I574m83r308k669o781j0920Q012J682O578l511j482k698J5681J0936L724
6770A8335m730p605r895J428R602p885r173J4703M821j576j5006R297K106L40
$$ plain form
6756 4762 6125 -197 -7295 -16012 -18857 -9467 -3943 1970 -909 2567 10096 12535 12443 7662 9437
6741 9437 12805 16873 30498 25567 20987 29898 27281 21876 17929 8683 5366 8386 10654 11264 4268
6726 4268 13295 24565 24634 24981 32220 36050 23083 28387 46942 48485 60061 78365 96982 118897
6712 118897 123311 102165 79674 66522 46989 36157 37564 34370 38827 40883 34848 22514 469
6699 469 -6443 -9958 4150 11879 22167 19569 16582 21556 15387 9464 4092 5652 3528 9209 3982
6684 3982 7804 5421 11246 18948 10151 2656 -10544 -15898 -14990 -5374 5356 3560 -11089 -10441 -2959
6669 -2959 -2887 -9965 -6764 -6818 737 -2671 -13312 -7108 -6792 -1935 2046 6505 -4148 -3470 3406 669
6653 669 566 1857 -1661 -1923 -4510 3423 5489 487 3342 14155 16313 8333 -1489 -4770 -6105
$$ packed form
6756D762J363o322p098q717k845R390N524N913k879L476P529K439r2m781J775
6741I437L368M068J3625m931m580Q911k617n405l947r246l317L020K268O10o996
6726D268R027J1270O9L47P239L830j2967N304J8555J543J1576J8304J8617K1915
6712A18897M414k1146k2491j3152j9533j0832J407l194M457K056o035j2334k2045
6699D69o912l515J4108P729J0288k598k987M974o169n923n372J560k124N681n227
6684C982L822k383N825P702q797p495j3200n354R08R616J0730j796j4649O48P482
6669b959P2p078L201n4P555l408j0641O204L16M857L981M459j0653O78O876k737
6653F69j03J291l518k62k587P933K066n002K855J0813K158p980r822l281j335
$$ plain form
6638 -6105 -8401 -10223 -7306 424 -2194 -8681 -18428 -11883 1696 8279 11346 20667 17204 -7165
6624 -7165 -4333 4384 14434 14806 6055 1 2050 8417 -4895 -8619 -2883 3002 6123 344 2296
6609 2296 -901 -14101 -9796 -6592 -2182 -12762 -10394 -619 -12859 -18152 -9270 -7196 -3303 -10043
6595 -10043 -14577 -11547 -9138 -11127 -19147 -23917 -37232 -34429 -21727 -21308 -19855 -9745 -12671 -1862
6581 -1862 5823 8472 6657 3387 1524 6304 13963 15296 25546 24906 12383 7127 6099 836 8375
6566 8375 329 -2623 3112 14589 15447 10778 18023 16973 10878 2197 -3325 -11879 -16155 -12147 -18845
6551 -18845 -18178 9596 19578 20700 16923 12758 7044 4249 19899 28433 23596 11436 -3313 -21919
6537 -21919 -33123 -27638 -6924 924 -6550 -12729 -3694 4643 3494 -2270 -4255 -11280 -12955 -12993 -23
$$ packed form
6638f105k296j822K917P730k618o487r747O545J3579O583L067R321l463k4369
6624g165K832Q717J0050L72q751o054K049O367j3312l724N736N885L121n779J952
6609B296l197j3200M305L204M410j0580K368R775j2240n293Q882K074L893o740
6595a0043m534L030K409j989q020m770j3315K803J2702M19J453J0110k926J0809
6581a862P685K649j815l270j863M780P659J333J0250o40j2523n256j028n263P539
6566H375q046k952N735J1477Q58m669P245j050o095q681n522q554m276M008o698
6551a8845O67K7774R982J122l777m165n714k795J5650Q534m837j2160j4749j8606
6537b1919j1204N485K0714P848p474o179R035Q337j149n764j985p025j675l8J2970
$$ plain form
6522 -23 1609 1017 -2699 -16722 -13436 -25605 -23652 -11049 -8106 -7746 -4004 -1090 8932 10494 12945
6507 12945 4253 7446 8384 16619 17355 14450 358 -17842 -15492 -9195 6699 15211 22027 10497
6493 10497 5859 18304 14451 14696 13837 10173 2139 1841 -9045 -8564 -8447 -10317 -17524 -11681 -4889
6478 -4889 -14738 -15801 -25184 -18703 -6509 3484 -6132 -10555 6301 11113 -2768 3669 18433 16330
6464 16330 -1241 -23370 -28756 -21162 -17578 -7691 -5372 -9808 -14647 -1808 18511 13048 -9995
6451 -9995 -7627 -4790 -16507 -22654 -16458 -8134 7069 16034 10960 5379 2125 8647 12158 6070
6437 6070 99 -9425 -5436 2632 8210 9123 10948 4853 5139 10438 11990 15002 14855 9301 7752 6964
6421 6964 -1896 -1566 -693 6315 1170 -8647 -7338 -364 -6771 -11869 -12517 564 17163 29267 20457
$$ packed form
6522b3J632n92l716j4023L286j2169J953J2603K943L60L742K914J0022J562K451
6507A2945q692L193R38Q235P36k905j4092j8200K350O297J5894Q512O816j1530
6493A0497m638J2445l853K45q59l664q034k98j0886M81J17j870p207N843O792
6478d889r849j063r383O481J2194R993r616m423J6856M812j3881O437J4764k103
6464A6330j7571k2129n386P594L584R887K319m436m839J2839K0319n463k3043
6451i995K368K837j1717o147O196Q324J5203Q965n074n581l254O522L511o088
6437F070n971r524L989Q068N578R13J825o095K86N299J552L012j47n554j549p88
6421F964q860L30Q73P008n145r817J309O974o407n098o48J3081J6599J2104q810
$$ plain form
6406 20457 14723 20344 20469 18792 12883 4125 684 -32 5038 4237 -3144 -10425 -22392 -15355 -14553
6391 -14553 -24039 -12877 -5822 4760 -4346 -1221 5670 7159 7735 13252 15645 29658 17908 3792
6377 3792 -3254 -263 -8474 -14642 -20607 -14924 -7113 3096 4613 141 -7967 -5532 6913 13926
6363 13926 15603 11699 15166 13633 8587 6326 9941 17922 18684 14036 529 -3170 488 9681 4623
6348 4623 3488 274 -8660 -6376 982 1198 -3921 -13299 -13048 -6592 -4632 456 -5906 -2526 -4354
6333 -4354 -3380 2052 -5567 -9642 -5668 -9089 834 4303 10470 10656 10207 7028 -4804 1957 20788
6318 20788 23119 15226 6060 -4474 -2933 -6099 -4099 -6501 -244 -18949 -27246 -18431 -8528 4832
6304 4832 9001 -2315 -9920 -10045 6949 20125 24863 22630 21443 14996 17773 12405 2961 -1880
$$ packed form
6406B0457n734N621J25j677n909q758l441p16N070q01p381p281j1967P037Q02
6391a4553r486J1162P055J0582r106L125O891J489N76N517K393J4013j1750j4116
6377C792p046K991q211o168n965N683P811J0209J517m472q108K435J2445P013
6363A3926J677l904L467j533n046k261L615P981P62m648j3507l699L658R193n058
6348D623j135l214q934K284P358K16n119r378K51O456J960N088o362L380j828
6333d354R74N432p619m075L974l421R923L469O167J86m49l179j1832O761J8831
6318B0788K331p893r166j0534J541l166K000k402O257j8705q297Q815R903J3360
6304D832M169j1316p605j25J6994J3176M738k233j187o447K777n368r444m841
$$ plain form
6290 -1880 -5359 894 2841 11572 18986 3540 -7781 -4888 -1303 1415 6947 10156 18890 22652
6276 22652 28065 24710 18527 8517 -11451 -8932 -654 -10065 -12979 -9572 -2131 9732 13585 6477
6262 6477 9915 15602 19460 15510 1267 -11619 -14850 -10703 -14448 -5967 10723 16381 13354 9628
6248 9628 7087 12707 24025 16192 7805 9760 5453 1419 -5422 -9473 -2126 828 -7172 -2191 2483
6233 2483 2254 -6972 -8974 -19459 -20082 -9745 -9441 -3466 4896 9077 3479 3248 17322 14381 8813
6218 8813 6261 2761 -5561 -16719 -21148 -17847 -20299 -22666 -18273 -5805 -1238 -4074 -12613 -6753
6204 -6753 1467 -4022 -364 -6878 -20001 -29632 -20279 -6229 -753 10422 11381 759 -4559 -4865
6190 -4865 -10996 -4507 -971 6276 8246 3868 -5674 -13379 -13922 -13476 -13074 -6231 -6985 -1101 15733 16624
$$ packed form
6290a880l479O253J947Q731P414j5446j1321K893L585K718N532L209Q734L762
6276B2652N413l355o183j0010j9968K519Q278r411k914L407P441J1863L853p108
6262F477L438N687L858l950j4243j2886l231M147l745Q481J6690N658l027l726
6248I628k541N620J1318p833q387J955m307m034o841m051P347K954q000M981M674
6233B483k29r226k002j0485o23J0337L04N975Q362M181n598k31J4074k941n568
6218H813k552l500q322j1158m429L301k452k367M393J2468M567k836q539N860
6204f753Q220n489L658o514j3123r631R353J4050N476J1175R59j0622n318l06
6190d865o131O489L536P247J970m378r542p705n43M46M02O843p54N884J6834Q91
$$ plain form
6174 16624 15280 19849 18365 19478 7352 2185 -6640 -2554 247 -4290 -13667 -6950 4614 -9075
6160 -9075 -19905 -28671 -31388 -15723 -5122 -14593 -10191 -2508 3112 894 4469 7116 982 -2992
6146 -2992 -2136 17274 8966 -15385 -19824 -16106 -9105 -17113 -12754 -5188 3157 5467 5299 4209 785
6131 785 -3463 -7400 -5976 -302 820 -10164 -23034 -29285 -39707 -33006 -19227 -13951 -15892 -12978
6117 -12978 -4040 8055 4570 4679 -816 3878 3651 -8013 -8274 -5257 -11397 -4986 -4013 -1412 11475
6102 11475 11152 -2594 -9179 -17532 -27085 -19710 -14045 -9744 -9429 -6722 736 1480 -3929 -1441 -394
6087 -394 -1477 9201 11597 6092 5811 15782 5065 -7041 -11401 -13312 -11324 -8103 2318 8223
6073 8223 1758 -726 -5395 -5906 -1354 -10202 -15165 -9551 1646 2371 -107 -1937 -8774 -18088 -16735
$$ packed form
6174A6624j344M569j484J113j2126n167q825M086K801m537r377O717J1564j3689
6160i075j0830q766k717J5665J0601r471M402P683N620k218L575K647o134l974
6146b992Q56J9410q308k4351m439L718P001q008M359P566Q345K310j68j090l424
6131G85m248l937J424N674J122j0984j2870o251j0422O701J3779N276j941K914
6117a2978Q938J2095l485J09n495M694k27j1664k61L017o140O411R73K601J2887
6102A1475l23j3746o585q353r553P375N665M301L15K707P458P44n409K488J047
6087c94j083J0678K396n505k81R971j0717j2106m360j911J988L221J0421N905
6073H223o465k484m669n11M552q848m963N614J1197P25k478j830o837r314J353
$$ plain form
6058 -16735 -5013 6907 11347 11495 617 -18073 -17207 -14365 -6775 5543 2069 -1044 1651 6514
6044 6514 12053 5727 -1439 13313 20505 7189 5013 9870 11408 -4932 -12203 -8897 -4638 2203
6030 2203 -5034 -6986 -1129 -6462 7218 2394 -10293 -14538 -13083 -1844 9368 17864 16356 6024
6016 6024 -8465 -11908 -1510 12173 12949 -812 12377 19269 6203 -1951 -12021 -11806 3165
6003 3165 11501 4370 -6152 -3646 5236 -7255 171 8463 14752 9015 -4274 -3209 8022 3961
5989 3961 13165 6941 3609 5392 -5036 -450 7521 13454 14970 6532 8397 15879 18252 -3194
5975 -3194 -12301 -5416 -5982 -7045 -11401 -20065 -26004 -16901 1444 8708 10298 5997 -2222 -5237 -9665
5960 -9665 -10160 -5632 -10786 -18004 -26629 -10825 275 7048 5453 -13099 -15036 -6184 -2539 -9844
$$ packed form
6058a6735J1722J1920M440J48j0878j8690Q66K842P590J2318l474l113K695M863
6044F514N539o326p166J4752P192j3316k176M857J538j6340p271L306M259O841
6030B203p237j952N857n333J3680m824j2687m245J455J1239J1212Q496j508j0332
6016F024j4489l443J0398J3683P76j3761J3189O892j3066q154j0070K15J4971
6003C165Q336p131j0522K506Q882j2491P426Q292O289n737j3289J065J1231m061
5989C961R204o224l332J783j0428M586P971N933J516q438J865P482K373k1446
5975c194r107O885n66j063m356q664n939R103J8345P264J590m301q219l015m428
5960i665m95M528n154p218q625J5804J1100O773j595j8552j937Q852L645p305
$$ plain form
5946 -9844 -13272 21 14480 2452 -1813 -831 -6179 -7401 3133 -1762 -7837 -8182 -5685 5329
5932 5329 8000 15552 9549 -4306 -3538 -112 -4986 -9314 3308 4371 1367 445 3608 453 -691
5917 -691 3319 -2162 -9658 -17792 -18606 -10627 -3646 -20202 -19462 -21009 -24272 -24556 -4550 -635 -15140
5902 -15140 -28371 -9819 6691 8198 750 2538 4510 -1553 490 14860 -312 -12428 -15397
5889 -15397 -12113 -5535 8307 7579 -1799 -10458 -20894 -18748 -13143 -861 413 -14175 -15189 -12312
5875 -12312 -10857 -5335 5362 7440 6089 3588 -5525 -5360 -12423 -15085 -10485 -1395 -472 -4600 -2086
5860 -2086 -8413 -22997 -13013 -17623 -15731 -3376 8659 -656 -10359 -10551 -12979 -14971 -14093 -14623 -24378
5845 -24378 -19293 -5429 -1070 51 -17833 -18879 -7938 6233 8859 8325 15864 17715 7677 -6317
$$ packed form
5946i844l428J3293J4459j2028m265R82n348j222J0534m895o075l45K497J1014
5932E329K671P552o003j3855P68L426m874m328J2622J063l004r22L163l155j144
5917f91M010n481p496q134q14P979O981j6556P40j547l263k84K0006L915j4505
5902a5140j3231J8552J6510J507p448J788J972o063K043J4370j5172j2116k969
5889a5397L284O578J3842p28r378q659j0436K146N605J2282J274j4588j014K877
5875a2312J455N522J0697K078j351k501r113J65p063k662M600R090R23m128K514
5860b086o327j4584R984m610J892J2355J2035r315r703j92k428j992Q78n30r755
5845b4378N085J3864M359J121j7884j046J0941J4171K626n34P539J851j0038j3994
$$ plain form
5831 -6317 -23788 -17716 -14145 -19144 -21723 -16313 -10999 -11706 -2028 15690 8290 184 -40 -4575 -6469
5816 -6469 -7108 -6328 -11047 -11229 -5352 -6538 -6391 -7038 -1326 -8693 -5848 -13568 -18792 -16105 -15996 -16461 -14110
5799 -14110 -13453 -10436 -4558 -4548 -7688 -8228 -2828 -9110 -10176 -11642 -2106 -4260 -3059 3897 3526 -7044
5783 -7044 -6979 4114 5105 9835 23211 19062 5702 -160 2554 10681 484 -8991 -10338 977
5769 977 -2774 686 -4087 -6090 -227 6718 -973 -2282 6394 4795 -6415 -21530 -24101 -10204
5755 -10204 -2716 -5069 -12154 -3103 6849 10907 -2669 -1970 -8741 -18206 -17599 -25968 -17472 -3521 1923
5740 1923 8661 -1026 -327 -5774 -10614 -18700 -23715 -23107 -11691 -5197 -8384 1025 3725 -14262 -16675
5725 -16675 -3882 5138 -2313 -1374 -2434 -3104 -3135 1957 -1037 -8101 -18651 -15152 -4231 -8640 -8562
$$ packed form
5831f317j7471O072L571m999k579N410N314p07R678J7718p400q106k24m535j894
5816f469o39P80m719j82N877j186J47o47N712p367K845p720n224K687J09m65K351
5799a4110O57L017N878J0l140n40N400o282j066j466R536k154J201O956l71j0570
5783g044O5J1093R91M730J3376m149j3360n862K714Q127j0197r475j347J1315
5769I77l751L460m773k003N863O945p691j309Q676j599j1210j5115k571J3897
5755a0204P488k353p085R051R952M058j3576O99o771r465O07q369Q496J3951N444
5740A923O738r687O99n447m840q086n015O08J1416O494l187R409K700j7987k413
5725a6675J2793R020p451R39j060o70l1N092k994p064j0550L499J0921m409P8
$$ plain form
5710 -8562 -4907 -10287 -15412 -13522 -10901 6928 19693 10819 8072 2205 3329 1981 577 3302
5696 3302 4166 7732 7919 21803 23032 24878 25278 19262 -1514 -4257 -5301 2237 16349 22627 9705
5681 9705 1593 -639 -7922 -5027 -468 -1438 3604 6292 -6804 -8898 -12719 -4923 -2196 12461 15062
5666 15062 25442 17493 23728 21350 -2964 -9349 -2800 2007 -427 1220 -7641 -11532 -4061 3671
5652 3671 -411 -4397 -7403 -2190 9671 13174 8665 5242 -6586 -15726 -16982 -20402 -16647 -22212
5638 -22212 -13036 -15334 -21698 -20675 -4347 4762 8253 3972 -424 1260 -7997 -27489 -30377 -17524
5624 -17524 -22361 -20965 -9038 -7274 -15461 -11800 -18563 -24585 -21648 -28487 -31711 -31407 -22161 -8599
5610 -8599 3204 5000 13639 12949 -6211 -5085 4928 4626 -1505 1423 91 -1512 -5352 -5913 1715
$$ packed form
5710h562L655n380n125J890K621J7829J2765q874k747n867J124j348j404K725
5696C302Q64L566J87J3884J229J846M00o016k0776k743j044P538J4112O278j2922
5681I705q112k232p283K895M559r70N042K688j3096k094l821P796K727J4657K601
5666A5062J0380p949O235k378k4314o385O549M807k434J647q861l891P471P732
5652C671m082l986l006N213J1861L503m509l423j1828r140j256l420L755n565
5638b2212R176k298o364J023J6328R109L491m281m396J684r257j9492k888J2853
5624a7524m837J396J1927J764q187L661o763o022K937o839l224L04R246J3562
5610h599J1803J796Q639o90j9160J126J0013l02o131K928j332j603l840n61P628
$$ plain form
5595 1715 -3910 1303 6105 13106 11443 6793 5305 3179 -10240 -4585 1655 -7848 2287 5475
5581 5475 3470 152 5297 2578 -14647 -15485 -8970 2856 1931 -12530 -9147 -2591 -1195 5109 17520
5566 17520 20637 5107 -12311 -17334 -14624 -12090 755 2179 -1389 9825 17049 6209 7528
5553 7528 15727 6787 -3272 -6384 11463 9731 3903 10611 10648 8821 4161 -5901 -1344 5539 5946
5538 5946 3724 5068 204 -5115 1693 3767 -3539 -5572 -5470 6632 4396 -5287 -2103 1630 -7874
5523 -7874 -444 256 -5542 197 9420 9097 14240 18553 8825 6902 -3321 -7835 3178 9324 9243
5508 9243 7851 16420 12646 15819 16074 14512 7969 7117 6062 6578 26100 16274 9206 -3230 -4932
5493 -4932 -3522 -4323 -1150 -9438 -5909 -1757 -8068 -20049 -19446 -16972 -10399 -4404 3562 1404 3364
$$ packed form
5595A715n625N213M802P001j663m650j488k126j3419N655O240r503J0135L188
5581E475k005l318N145k719j7225q38O515J1826r25j4461L383O556J396O304J2411
5566A7520L117j5530j7418n023K710K534J2845J424l568J1214P224j0840J319
5553G528Q199q940j0059l112J7847j732n828O708L7j827m660j0062M557O883M07
5538E946k222J344m864n319O808K074p306k033J02J2102k236r683L184L733r504
5523g874P430P00n798N739R223l23N143M313r728j923j0223m514J1013O146q1
5508I243j392Q569l774L173K55j562o543q52j055N16J9522r826p068j2436j702
5493d932J410q01L173q288L529M152o311j1981O03K474O573N995P966k158J960
$$ plain form
5478 3364 -6141 -235 -2964 -10531 -15041 -4128 -2941 -1423 4487 1105 266 226 2216 1232 6138 2412
5462 2412 -1597 -720 1390 -445 7334 9277 -6668 -18251 -10118 -5119 -5034 -3620 1401 -2416 -5063
5447 -5063 -17008 -23643 -18318 -12516 -8611 -13982 -19918 -18569 -10016 -2996 5312 10338 3625 -6500
5433 -6500 -2964 3576 -5067 -6688 -6704 -1075 8034 9161 9267 4470 -13976 -15431 1020 2453 -3128
5418 -3128 -1292 2215 -6932 -5990 2231 14641 23735 23056 18352 13864 20436 13244 -2927 -4476 7215
5403 7215 11427 5951 2950 2065 -2479 5394 2042 -10522 -11869 -7705 -2550 -316 -714 10545 19643
5388 19643 14731 1712 -5243 -4130 -6763 5467 3077 -11263 -13163 -12798 -12756 -12957 -15198 -14851 -10747
5373 -10747 1005 -3047 -11663 -2779 7392 5449 -10754 -10881 -5644 -11175 -14370 -9910 -14106 -12429
$$ packed form
5478C364r505N906k729p567m510J0913J187J518N910l382q39m0J990r84M906l726
5462B412m009Q77K110j835P779J943j5945j1583Q133M999Q5J414N021l817k647
5447e063j1945o635N325N802L905n371n936J349Q553P020Q308N026o713j0125
5433f500L536O540q643j621j6N629R109J127J06m797j8446j455J6451J433n581
5418c128J836L507r147R42Q221J2410R094o79m704m488O572p192j6171j549J1691
5403G215M212n476l001q85m544P873l352j2564j347M164N155K234l98J1259R098
5388A9643m912j3019o955J113k633J2230k390j4340j900L65M2k01k241L47M104
5373a0747J1752m052q616Q884J0171j943j6203j27N237n531l195M460m196J677
$$ plain form
5359 -12429 -16040 -15232 -4499 5557 -3945 -2268 2500 -8354 -153 3658 5717 10368 10793 5901
5345 5901 176 1642 15847 19492 7990 -11821 -13608 -17885 -4233 5502 -130 4336 8896 -2328
5331 -2328 -358 -28 -5467 -6007 -5418 -12651 -208 13442 -2623 -11861 -14422 -27350 -21551 -11026
5317 -11026 -3290 5400 -8013 -15118 -14360 -11691 -2831 5909 9324 7672 4783 8333 8568 14751 16342
5302 16342 -2204 3632 15501 9948 -3315 -12945 -4008 1015 -8788 -13798 -7321 -25836 -35230 -31379
5288 -31379 -26237 -22828 -10542 -3939 10663 23141 23783 9685 -2901 -9427 -13363 -12667 8264 7556
5274 7556 -2920 1458 10206 7020 7915 1815 3211 6897 -2784 1269 -6330 -13515 -12888 3277 827
5259 827 -16277 -22300 -7044 -11413 -15865 -20972 -23767 -30522 -35540 -29233 -14553 -9575 -2761 -3894
$$ packed form
5359a2429l611Q08J0733J0056r502J677M768j0854Q201L811K059M651M25m892
5345E901n725J466J4205L645j1502j9811j787m277J3652R735n632M466M560j1224
5331b328J970L30n439n40N89p233J2443J3650j6065r238k561j2928N799J0525
5317a1026P736Q690j3413p105P58K669Q860Q740L415j652k889L550K35O183J591
5302A6342j8546N836J1869n553j3263r630Q937N023r803n010O477j8515r394L851
5288c1379N142L409J2286O603J4602J2478O42j4098j2586o526l936O96K0931p08
5274G556j0476M378Q748l186Q95o100J396L686r681M053p599p185O27J6165k450
5259H27j7104o023J5256m369m452n107k795o755n018O307J4680M978O814j133
$$ plain form
5245 -3894 -17749 -11994 -4155 1201 3408 -7364 -2451 991 2947 262 -160 -4030 -3345 -2865 -1758
5230 -1758 -3474 1112 1427 -110 2521 8916 8679 9585 15084 5825 -5712 -3998 -446 17120 12859
5215 12859 2902 -4716 -9360 -13897 -10778 -8461 -12362 -3344 605 -10322 -10237 -3140 -1716 11850 14200
5200 14200 3188 -13418 -13545 -8882 1499 -371 -9072 -8117 -2554 5842 7133 10319 7697 2146
5186 2146 282 -3179 -1453 -5180 -6776 -10298 -18683 -25920 -21795 -14969 -9551 -7385 -4198 -1606 11939
5171 11939 10102 6410 -1807 1091 1157 -891 -5242 -21853 -17030 4146 13274 8176 2969 -11532
5157 -11532 -7003 7001 5615 -1796 997 -13279 -10987 -11985 577 5702 -1194 -10932 -15867 -19734
5143 -19734 -16242 -7328 -16744 -19746 -20898 -9047 -1086 -665 -1535 4969 2855 6516 9681 6091 -6577
$$ packed form
5245c894j3855N755P839N356K207j0772M913L442J956k685m22l870O85M80J107
5230a758j716M586L15j537K631O395k37R06N499r259j1537J714L552J7566m261
5215A2859r957p618m644m537L119K317l901R018L949j0927Q5P097J424J3566K350
5200A4200j1012j6606j27M663J0381j870q701R55N563Q396J291L186k622n551
5186B146j864l461J726l727j596l522q385p237M125O826N418K166L187K592J3545
5171A1939j837l692q217K898O6k048m351j6611M823K1176R128n098n207j4501
5157a1532M529J4004j386p411K793j4276K292r98J2562N125o896r738m935l867
5143a9734L492Q914r416l002j152J1851P961M21q70O504k114L661L165l590j2668
$$ plain form
5128 -6577 -13308 -6277 -1508 2639 6644 4561 -3235 3567 -3779 4002 2538 -1841 -8133 -8948 -7604
5113 -7604 -3630 -5812 -12809 -16220 -8916 -7944 677 5213 11517 11027 8462 9106 9513 -798 1002 -3967
5097 -3967 -3629 -8222 -2443 13812 5747 -967 -5050 7875 9991 2907 320 -271 1703 10909 22784
5082 22784 29114 14864 1826 -6237 -6896 7948 14913 3755 -1351 -526 8191 21627 19669 16492
5068 16492 16171 18203 893 -5773 8336 10881 -4533 -12858 -14780 -6753 -6546 -5188 -8631 -16091
5054 -16091 -22577 -17087 -25191 -24136 -13268 -6733 -4965 -5669 -12930 -12231 -17817 -18937 -15090 -18405 -9527
5039 -9527 -2938 692 -1233 -8348 -10111 -8787 -6151 -16883 -26734 -14634 -6407 -14658 -12865 -1291
5025 -1291 -6551 1860 5927 -1796 -5813 -18619 -14044 2844 9879 9163 7841 24982 30109 17502
$$ packed form
5128f577o731P031M769M147M005k083p796O802p346P781j464m379o292q15J344
5113g604L974k182o997l411P304R72Q621M536O304m90k565O44M07j0311J800m969
5097c967L38m593N779J6255q065o714m083J2925K116p084k587n91J974R206J1875
5082B2784O330j4250j3038q063o59J4844O965j1158n106Q25Q717J3436j958l177
5068A6492l21K032j7310o666J4109K545j5414q325j922Q027K07J358l443p460
5054a6091o486N490q104J055J0868O535J768p04p261O99n586j120L847l315Q878
5039i527O589L630j925p115j763J324K636j0732r851J2100Q227q251J793J1574
5025a291n260Q411M067p723m017j2806M575J6888P035p16j322J7141N127j2607
$$ plain form
5011 17502 16800 19720 7638 8356 -2881 -11104 200 -2890 -10069 -13506 -12929 -10646 -14074 -13789 -13708
4996 -13708 -826 16398 13137 6243 4547 -8281 -12085 -12489 -11897 -12471 -2914 6192 -6129 -23138
4982 -23138 -30590 -12672 1741 -3671 -9961 -11699 -4687 11899 14523 3355 3362 -1741 -11172 -10547 766
4967 766 6871 9784 6647 9417 -1083 -4674 -2204 5476 8545 1171 -27693 -27950 -24045 -11144 -5406
4952 -5406 1897 -767 1472 2102 12682 10120 4484 6773 -5479 -12240 -8545 -10898 -13847 -8987 1235
4937 1235 8176 11041 6927 -6836 -5428 -9353 -18599 -21022 -11931 -16938 -24121 -19491 -27351 -28888 -18183
4922 -18183 1009 10285 19502 15168 8583 -4021 -7280 -8423 -7062 1529 -4111 4729 -1463 5531
4908 5531 2174 -7482 -17292 -23639 -22000 -20412 -24538 -21581 -17282 -8034 4448 5630 6046 -78 3850
$$ packed form
5011A7502p02K920j2082P18j1237q223J1304l090p179l437N77K283l428K85Q1
4996a3708J2882J7224l261o894j696j2828l804m04N92n74R557R106j2321j7009
4982b3138p452J7918J4413n412o290j738P012J6586K624j1168Pn103r431O25J1313
4967G66O105K913l137K770j0500l591K470P680L069p374k8864k57L905J2901N738
4952e406P303k664K239O30J0580k562n636K289j2252o761L695k353k949M860J0222
4937A235O941K865m114j3763J408l925r246k423R091n007p183M630p860j537J0705
4922a8183J9192R276R217m334o585j2604l259j143J361Q591n640Q840o192O994
4908E531l357r656r810o347J639J588m126K957M299R248J2482J182M16o124L928
$$ plain form
4893 3850 -804 -3829 4047 5524 11466 6610 -4572 -1477 1101 6708 5203 -156 -7241 -4491 -4209
4878 -4209 5169 6429 4048 -1654 11332 17686 6427 -7815 -12417 -11214 -7850 -3189 -8663 -13699
4864 -13699 -13772 -16441 -4761 6503 19882 24255 26371 13631 12939 -944 -13391 -18983 -17375 -16285
4850 -16285 -12364 -24861 -21505 -16423 -8303 -6874 -5707 -2248 3534 -7025 -16642 -7149 -2052 4885
4836 4885 -3707 -11841 -8551 -5751 -4474 8206 16382 4289 -15259 -10212 -5685 -14279 -25304 -31409
4822 -31409 -19023 -12232 -25459 -29391 -17321 -14571 -6280 3916 -3230 -14370 -9102 -16637 -20576
4809 -20576 -339 11102 790 -10419 -3691 2982 -1228 -7372 -1423 9326 -1558 -11615 -18556
4796 -18556 -21697 -17111 -15907 -19843 -9154 697 4181 7864 5444 2951 1035 -4903 -9292 -6634
$$ packed form
4893C850m654l025P876J477N942m856j1182L095K578N607j505n359p085K750K82
4878d209R378J260k381n702J2986O354j1259j4242m602J203L364M661n474n036
4864a3699p3k669J1680J1264J3379M373K116j2740o92j3883j2447n592J608J090
4850a6285L921j2497L356N082Q120J429J167L459N782j0559r617R493N097O937
4836D885q592q134L290K800J277J2680Q176j2093j9548N047M527q594j1025o105
4822c1409J2386O791j3227l932J2070K750Q291J0196p146j1140N268p535l939
4809b0576K0237J1441j0312j1209O728O673m210o144N949J0749j0884j0057o941
4796a8556l141M586J204l936J0689R851L484L683k420k493j916n938m389K658
$$ plain form
4782 -6634 -10750 -9992 -8764 -3147 227 -1480 -14497 -5657 5514 6028 11445 -64 649 -7174 -6279
4767 -6279 6064 3903 -69 -4971 -18071 -13572 -4486 8584 20807 21971 14779 19999 8033 7403
4753 7403 10232 -3212 -7812 -10719 -9962 -3252 -8949 -3580 4643 -4749 -5310 -12948 -4058 5186 17143
4738 17143 14645 3958 -3015 -7729 -2703 1529 3371 9022 8183 301 15144 19514 3716 -11666
4724 -11666 -16878 -25378 -21089 -14713 -2442 1854 -6241 -26694 -22249 -7324 -7116 5496 1921 10589
4710 10589 12259 12044 8855 -252 -10322 -5197 -1883 6839 6344 9093 13039 15223 16080 -1965 -13273
4695 -13273 -5732 -9096 -12864 -2043 -3492 -3474 -6628 -6804 -8723 -488 5461 5818 5927 -15473 -21051
4680 -21051 -12429 -17895 2639 5174 -8281 -1708 -807 2440 12101 6054 9013 9442 11854 -768
$$ packed form
4782f634m116P58J228N617L374j707j3017Q840J1171N14N417j1509P13p823Q95
4767f279J2343k161l972m902j3100M499R086J3070J2223J164p192N220j1966o30
4753G403K829j3444m600k907P57O710n697N369Q223r392n61p638Q890R244J1957
4738A7143k498j0687o973m714N026M232J842N651q39p882J4843M370j5798j5382
4724a1666n212q500M289O376J2271M296q095k0453M445J4925K08J2612l575Q668
4710A0589J670k15l189r107j0070N125L314Q722m95K749L946K184Q57j8045j1308
4695a3273P541l364l768J0821j449J8l154j76j919Q235N949L57J09k1400n578
4680b1051Q622n466K0534K535j3455O573R01L247R661o047K959M29K412j2622
$$ plain form
4666 -768 5401 12820 5908 8420 10140 4252 4736 15671 3827 -4074 -11213 -8227 9171 12283 11310
4651 11310 6902 10407 13592 1901 -5790 -16918 -14299 -8653 1879 7074 -3873 -16098 -16015 -8981
4637 -8981 4399 1145 -4800 -5850 -6020 -8838 -4968 -4072 -2865 -13374 -17035 -16411 -9366 3014 9275
4622 9275 2364 -14444 -23706 -15564 -15728 -21024 -20670 -15277 -3014 4385 1131 -9591 -5373 -1905 -8436
4607 -8436 -10590 -10091 -7994 -1493 7564 8369 5685 4464 10406 16653 15325 16544 19315 8200 737
4592 737 759 -3510 4237 18197 28308 25867 19892 7894 -3223 7903 -1444 -19073 -20915 -11819
4578 -11819 -12411 -4215 -813 -4309 -3793 -139 2010 6358 6143 2980 -7767 -16859 -9015 3671 2672
4563 2672 -3396 2094 11382 13611 -1992 -3474 5801 12927 11693 1782 -4741 -4248 4785 1971 -149
$$ packed form
4666g68O169P419o912K512J720n888M84J0935j1844p901p139K986J7398L112r73
4651A1310m408L505L185j1691p691j1128K619N646J0532N195j0947j2225Q3P034
4637h981J3380l254n945j050j70k818L870Q96J207j0509l661O24P045J2380O261
4622I275o911j6808r262Q142j64n296L54N393J2263P399l254j0722M218L468o531
4607h436k154M99K097O501R057Q05k684j221N942O247j328J219K771j1115p463
4592G37K2m269P747J3960J0111k441n975j1998j1117J1126r347j7629j842R096
4578a1819n92Q196L402l496N16L654K149M348k15l163j0747r092P844J2686r99
4563B672o068N490R288K229j5603j482R275P126j234r911o523M93R033k814k120
$$ plain form
4548 -149 -7327 -5019 -8530 -8120 -9210 -9319 -1804 8672 6453 5748 -70 -105 3214 8565 8259 2336
4532 2336 -5565 -13694 -6291 -7784 -9176 -11515 -15463 -13935 -13391 -11844 -4953 -6023 -17293 -18129 -25364
4517 -25364 -16772 -7937 -13562 -8811 -5604 -3318 7250 -1493 -15249 -20083 -6785 -7181 5016 -2507
4503 -2507 -11143 -11304 -16433 -18805 -16781 -17995 -5449 -2547 -3025 890 -6353 118 6502 -5652 -5199
4488 -5199 3171 -222 -9881 -7043 1732 -1996 -7149 -5704 -370 -1765 -6460 -13541 -6458 6573 12168
4473 12168 7371 3113 8246 1430 -785 -2751 -6118 -2026 11523 4095 -12355 -13309 -14856 -9723
4459 -9723 2887 -2200 -3026 -1332 438 8024 -9928 -20947 -28156 -23797 -20017 -10006 -10445 967
4445 967 2617 -1127 -6544 -16334 -18890 -25515 -21702 -7607 -5328 -7068 2930 7127 -1091 2171 1952
$$ packed form
4548a49p178K308l511M10j090j09P515J0476k219p05n818l5L319N351l06n923
4532B336p901q129P403j493j392k339l948J528N44J547O891j070j1270q36p235
4517b5364Q592Q835n625M751L207K286J0568q743j3756m834J3298l96J2197p523
4503b507q636j61n129k372K024j214J2546K902m78L915p243O471O384j2154M53
4488e199Q370l393r659K838Q775l728n153J445N334j395m695p081P083J3031N595
4473A2168m797m258N133o816k215j966l367M092J3549p428j6450r54j547N133
4459i723J2610n087q26J694J770P586j7952j1019p209M359L780J0011m39J1412
4445I67J650l744n417r790k556o625L813J4095K279j740R998M197q218L262k19
$$ plain form
4430 1952 -2762 -5566 -6569 2544 89 -16300 -12441 -991 -1156 -7771 -16832 4858 8601 5014
4416 5014 7421 2941 6153 6659 7311 12647 16082 10642 15030 19464 8754 -3988 -3983 -4026 -2542 -5619
4400 -5619 6563 4223 -731 -3091 1826 -4157 -3542 -271 -828 -967 -7364 -12207 -19829 -10725 -11255 -9012
4384 -9012 -8344 -12590 -13435 -8638 -12615 -1856 -2420 -8883 -11154 -10591 -16535 -18488 -16070 -18393 -15124 -14531
4368 -14531 -23079 -32945 -14854 -3417 335 -649 615 16245 9522 7075 4072 8418 -1172 -5965
4354 -5965 -112 -3223 -10024 -4218 -3540 -1413 -1275 -3207 -529 4482 -2275 1863 -5690 -4829 -13318 -23744
4338 -23744 -22879 -13864 -17881 -18419 -22031 -4914 538 701 -7998 -17223 -8759 6248 7501 1124 5067
4323 5067 8344 13180 11645 412 -12499 -9334 -8985 4443 12667 2047 -6125 -6361 -12164 -16762
$$ packed form
4430A952m714k804j003R113k455j6389L859J1450j65o615r061K1690L743l587
4416E014K407m480L212N06O52N336L435n440M388M434j0710j2742Nm3J484l077
4400e619J2182k340m954k360M917n983O15L271n57j39o397m843p622R104n30K243
4384i012O68m246q45M797l977J0759n64o463k271N63n944j953K418k323L269N93
4368a4531q548r866J8091J1437L752r84J264J5630o723k447l003M346r590m793
4354e965N853l111o801N806O78K127J38j932K678N011o757M138p553Q61q489j0426
4338b3744Q65R015m017n38l612J7117N452J63q699r225Q464J5007J253o377L943
4323E067L277M836j535j1233j2911L165L49J3428Q224j0620q172k36n803m598
$$ plain form
4309 -16762 -21861 -19571 -3802 2549 5579 15473 17272 10826 -2164 2604 -6125 -16775 -17720 -7939
4295 -7939 -506 -2437 -9455 -25365 -15820 -6210 12795 26316 15169 3659 -1402 8365 9099 4498
4281 4498 76 7479 8222 5884 7317 2143 -1698 5416 8693 13692 13030 12632 9902 5146 -6848
4266 -6848 -9269 -17339 -19599 -15944 -8165 -8371 3621 8250 12723 12326 8291 4198 -12034 -18518 -27841
4251 -27841 -32445 -23224 -18143 -11523 -12198 -7132 -2865 6669 3542 -8199 -18857 -15719 -9016 -859
4237 -859 3597 13911 6161 -2641 -5387 -2018 6721 3764 -4996 -4873 -100 5788 7256 5160 2827
4222 2827 -704 6228 5344 5958 -6691 -10901 -10511 -966 -6546 -7766 -3114 12807 22393 20084 13614
4207 13614 14660 2345 -6800 -6717 -3821 -8954 -4526 -5903 -5656 -656 -6954 -9968 -9475 -11036 -6803
$$ packed form
4309a6762n099K290J5769O351L030R894J799o446j2990M768q729j0650r45R781
4295g939P433j931p018j5910R545R610J9005J3521j1147j1510n061R767P34m601
4281D498m422P403P43k338J433n174l841P114L277M999o62l98k730m756j1994
4266f848k421q070k260L655P779k06J1992M629M473l97m035m093j6232o484r323
4251b7841m604R221N081O620o75N066M267R534l127j1741j0658L138O703Q157
4237h59M456J0314p750q802k746L369Q739k957q760J23M773N888J468k096k333
4222B827l531O932q84O14j2649m210L90R545n580j220M652J5921R586k309o470
4207A3614J046j2315r145Q3K896n133M428j377K47N000o298l014M93j561M233
$$ plain form
4192 -6803 -1959 -5781 -11094 -15694 -12911 -6561 -2300 5574 4666 2401 -4390 -7856 3567 3742 -13136
4177 -13136 -31528 -35794 -25574 -15385 -18735 -16759 -24662 -36777 -22775 -14425 -13569 -13815 -11671 -7350
4163 -7350 1628 -765 2521 429 -7809 -6670 -6197 -10709 -6396 -473 3601 1037 2241 6908 17093
4148 17093 15822 14845 14962 16058 14355 12678 4739 -3168 -4913 -1362 5605 9578 166 -5445 -10111
4133 -10111 -9448 -9715 -12748 -18522 -9271 -7011 -7848 -7700 -7793 -4069 -11815 -24148 -25299 -23401 -13558 -8892
4117 -8892 -6948 -3192 -3130 -3395 -7050 -4062 -5563 -4844 -2635 -4371 -4356 187 -5016 -7529 -12998 -17205
4101 -17205 -14175 -12416 -13182 -1880 -5320 -12759 -14558 -6382 -8886 297 -509 2475 4352 -748 -8072
4086 -8072 -6688 -5029 153 10532 9153 -10997 -17977 -16963 7235 23512 21270 22494 25222 24605
$$ packed form
4192f803M844l822n313m600K783O350M261P874r08k265o791l466J1423J75j6878
4177a3136j8392m266J0220J0189l350J976p903j2115J4002Q350Q56k46K144M321
4163g350Q978k393L286k092q238J139M73m512M313N923M074k564J204M667J0185
4148A7093j271r77J17J096j703j677p939p907j745L551O967L973r412n611m666
4133a0111O63k67l033n774R251K260q37J48r3L724p746j2333j151J898R843M666
4117h892J944L756O2k65l655K988j501P19K209j736J5M543n203k513n469m207
4101a7205L030J759p66J1302l440p439j799Q176k504R183q06K984J877n100p324
4086h072J384J659N182J0379j379k0150o980J014K4198J6277k242J224K728o17
$$ plain form
4072 24605 16740 9156 2979 4300 -142 -12136 -7417 -7373 -12510 -11267 817 -1575 596 706 -7358
4057 -7358 -2935 -12148 -13822 -5317 -11167 -13838 -2257 1540 15965 26324 23230 21517 12950 11567
4043 11567 14537 17325 15934 10831 5020 20168 25275 23953 2147 -8413 -5588 -7463 3586 10184
4029 10184 12478 3179 19305 22031 16228 14599 17625 19206 5400 -4962 -2434 2696 735 -3835
4015 -3835 7095 2381 -16622 -13574 -5764 340 1889 3704 -2900 -5114 532 -405 -4159 3486 4916
4000 4916 5766 3139 661 3835 -1687 -4161 -1515 4142 5835 2834 12883 13676 4508 -3648 1232
3985 1232 -675 8450 11410 -2413 -8309 -5066 -4480 -5222 -2702 -5047 7385 7430 -8672 -25866 -24876
3970 -24876 -19403 -23690 -7293 4626 9920 4866 -11438 -8877 -15112 -19622 -7542 -3977 -9380 -6913
$$ packed form
4072B4605p865p584o177J321m442j1994M719M4n137J243J2084k392K171J10q064
4057g358M423r213j674Q505n850k671J1581L797J4425J0359l094j713q567j383
4043A1567K970K788j391n103n811J5148N107j322k1806j0560K825j875J1049O598
4029A0184K294r299J6126K726n803j629L026J581j3806j0362K528N130j961m570
4015c835J0930m714j9003L048P810O104J549J815o604k214N646r37l754P645J430
4000D916Q50k627k478L174n522k474K646N657J693l001J0049P93r168q156M880
3985A232j907R125K960j3823n896L243N86p42K520k345J2432M5j6102j7194R90
3970b4876N473m287J6397J1919N294n054j6304K561o235m510J2080L565n403K467
$$ plain form
3956 -6913 -3070 2849 -9159 -9887 -7965 1773 -624 -9300 -10710 -15073 -22435 -21207 -28486 -35604 -36422
3941 -36422 -25164 -11911 -9660 -1583 -7667 -23015 -14154 -4378 -4158 -1301 3749 13905 13347 4918
3927 4918 -11162 -12958 -18398 -15156 -9079 -15780 -22331 -20044 -16193 3399 1408 -7452 -1536 4258
3913 4258 -249 -214 -8135 -8677 -8035 919 3250 471 4865 19478 22107 12609 5588 7676 4184 7320
3897 7320 20760 11744 1344 -4977 -4603 4446 8788 267 -6687 510 -7653 -33 2112 3648 17782
3882 17782 11986 3137 7135 698 -6614 -15067 -11758 -1387 -4766 -11779 -11023 -13026 1519 -1423
3868 -1423 -16433 -27680 -21080 -4179 6791 9543 3407 848 5106 -558 -13637 2627 7166
3855 7166 7241 5982 11881 18634 11941 12134 7991 -8 -9887 -5954 5291 17223 12907 2425 -4428
$$ packed form
3956f913L843N919j2008p28J922R738k397q676j410m363p362J228p279p118q18
3941c6422J1258J3253K251Q077o084j5348Q861R776K20K857N050J0156n58q429
3927D918j6080j796n440L242O077o701o551K287L851J9592j991q860N916N794
3913D258m507L5p921n42O42Q954K331k779M394J4613K629r498p021K088l492L136
3897G320J3440r016j0400o321L74R049M342q521o954P197q163P620K145J536J4134
3882A7782n796q849L998o437p312q453L309J0371l379p013P56k003J4545k942
3868a423j5010j1247O600J6901J0970K752o136k559M258n664j3079J6264M539
3855G166P5j259N899O753o693J93m143p999r879L933J1245J1932m316j0482o853
$$ plain form
3840 -4428 -10259 -12600 -14022 -6166 -8179 -8546 2403 1729 -7068 -15778 -9398 -3178 -2581 -5726 -4278
3825 -4278 -18513 -33321 -35467 -28949 -25270 -7870 4456 6259 8797 2773 6323 12440 9752 -4519
3811 -4519 -5150 -3541 -1088 -8084 -3483 1558 346 8998 9362 6275 3438 11166 15080 11799 19500
3796 19500 17822 12048 11376 23258 34037 25482 14114 9115 7776 9074 13281 11803 5210 1100
3782 1100 -13950 -10732 -11475 -16601 -11546 -10818 -23701 -27267 -20407 -12038 -3154 -4371 4817 -2627 -8799
3767 -8799 1871 12436 5047 1047 14571 12476 7118 1382 -5034 -815 5825 7338 7371 2451 948
3752 948 200 -834 -1124 -7849 -1403 -125 4023 3343 10393 21274 17696 9407 2188 -15279 -11971
3737 -11971 -69 14141 16347 5493 1843 7739 3220 3906 8928 5700 1255 -5369 -7358 -7544
$$ packed form
3840d428n831k341j422P856k013l67J0949o74q797q710O380O220N97l145J448
3825d278j4235j4808k146O518L679J7400J2326J803K538o024L550O117k688j4271
3811d519o31J609K453o996M601N041j212Q652L64l087k837P728L914l281P701
3796A9500j678n774o72J1882J0779q555j1368m999j339J298M207j478o593m110
3782A100j5050L218p43n126N055P28j2883l566O860Q369Q884j217R188p444o172
3767h799J0670J0565p389m000J3524k095n358n736o416M219O640J513L3m920j503
3752I48p48j034k90o725O446J278M148o80P050J0881l578q289p219j7467L308
3737a1971J1902J4210K206j0854l650N896m519O86N022l228m445o624j989j86
$$ plain form
3723 -7544 -5347 -6628 -11809 -8540 -1471 -1707 446 1658 12269 22525 17814 -6901 -8807 -5530
3709 -5530 -15010 -11337 -773 -1453 -8134 -5387 6497 15640 10701 11484 9197 1376 -9246 -12629 -8460
3694 -8460 -3689 -9244 -17497 -20486 -25288 -21962 -12892 -14323 -15114 -5191 5929 12717 -6731 -13614 -17084
3679 -17084 -13113 -2427 -1679 7760 654 1196 -2400 -5553 -304 -7890 -18637 -20629 -3818 9902
3665 9902 18301 13583 3195 3827 -7638 -3802 1541 9238 5161 5801 -3792 -16488 -12527 -1903
3651 -1903 7217 10607 19157 10249 8248 21597 18270 7932 1712 7075 9163 11440 6682 -10707
3637 -10707 -17830 -13748 -9848 -4430 -336 3726 261 -15224 -22409 -13121 -3804 6051 8437 14904
3623 14904 10541 4437 1518 9254 10408 7023 2851 1743 10925 5385 1817 145 -2708 -6711 -316
$$ packed form
3723g544K197j281n181L269P069k36K153J212J0611J0256m711k4715j906L277
3709e530r480L673J0564o80o681K747J1884R143m939P83k287p821j0622l383M169
3694h460M771n555q253k989m802L326R070j431p91R923J1120O788j9448o883l470
3679a7084L971J0686P48R439p106N42l596l153N249p586j0747j992J6811J3720
3665I902Q399m718j0388O32j1465L836N343P697m077O40r593j2696L961J0624
3651a903R120L390Q550q908k001J3349l327j0338o220N363K088K277m758j7389
3637a0707p123M082L900N418M094M062l465j5485p185R288R317R855K386O467
3623A4904m363o104k919P736J154l385m172j108R182n540l568j672k853m003O395
$$ plain form
3608 -316 3879 -13278 -10280 -9724 -10172 972 2394 1128 4131 7324 7920 14023 10713 2809 -3482
3593 -3482 -1675 6737 12525 5867 10968 9057 1612 -365 -10110 -18959 -13739 -4874 -16472 -21178 -27879
3578 -27879 -24047 -16848 -7304 -834 -1799 -7101 -6218 -17131 -31377 -32586 -32435 -14484 -315 6643
3564 6643 3755 2427 -1040 -4043 -10036 -12357 -22828 -27473 -21941 -13163 -15421 -17464 -11483 1627
3550 1627 2585 -5270 1096 -3588 -18155 -20215 -9534 1297 -5353 -4165 -9712 -16897 -20879 -14352
3536 -14352 -10558 -14359 -5071 -856 -13214 -20223 -14091 -11446 2955 6679 14966 14861 17704 16463
3522 16463 10105 4538 9666 11748 7816 6543 7997 4632 -5890 -3506 5822 9478 9926 11440 8423
3507 8423 1108 559 -325 2547 6746 10267 -168 -17385 -15686 -17677 -21485 -24550 -17532 -4249 -2840
$$ packed form
3608c16M195j7157K998N56m48J1144J422j266L003L193N96O103l310p904o291
3593c482J807Q412N788o658N101j911p445j977r745q849N220Q865j1598m706o701
3578b7879L832P199R544O470r65n302Q83j0913j4246j209J51J7951J4169O958
3564F643k888j328l467l003n993k321j0471m645N532Q778k258k043N981J3110
3550A627R58p855O366m684j4567k060J0681J0831o650J188n547p185l982O527
3536a4352L794l801R288M215j2358p009O132K645J4401L724Q287j05K843j241
3522A6463o358n567N128K082l932j273J454l365j0522K384R328L656M48J514l017
3507H423p315n49q84K872M199L521j0435j7217J699j991l808l065P018J3283J409
$$ plain form
3492 -2840 -5470 -12781 -14111 -11416 -1890 3839 594 8885 18252 13884 12001 16590 17817 12752 14613
3477 14613 16312 7226 491 -967 866 -1232 -321 -5355 -10947 -17676 -16616 -28724 -16439 5806
3463 5806 4580 5852 -1093 -8026 6330 4561 -4370 -4308 4691 4001 -267 890 -11149 -4323 -4353 -8430
3447 -8430 -13177 -9785 -16256 -23965 -18836 -7652 4010 5795 -5100 -8720 -20587 -30265 -21815 -20568
3433 -20568 -17611 -19674 -17142 -8572 2108 2353 3413 2402 -11504 -2267 900 -9342 -2106 -5248
3419 -5248 -8876 -8924 -2471 -5392 -7308 -8564 -20322 -32740 -21996 -11402 -11499 -8617 -5403 -8826 -17472
3404 -17472 -11179 -1047 12460 12564 11875 14415 5670 -13331 -8905 -15539 -13547 -1744 -1989 1225
3390 1225 -1811 -4516 -5320 -5399 -7101 -3840 7614 4610 -3396 -5550 -2146 -12708 -18789 -22544 -21132
$$ packed form
3492b840k630p311j330K695R526N729l245Q291R367m368j883M589J227n065J861
3477A4613J699r086o735j458J833k098R11n034n592o729J060j2108J2285K2245
3463E806j226J272o945o933J4356j769q931O2Q999o90m268J157j2039O826l0m077
3447h430m747L392o471p709N129J1184J1662J785j0895l620j1867r678Q450J247
3433b0568K957k063K532Q570J0680K45J060j011j3906R237L167j0242P236l142
3419e248l628m8O453k921j916j256j1758j2418J0744J0594r7K882L214l423q646
3404a7472O293J0132J3507J04o89K540q745j9001M426o634J992J1803k45L214
3390A225l036k705q04p9j702L261J1454l004q006k154L404j0562o081l755J412
$$ plain form
3375 -21132 -20719 -14905 -18832 -16423 -15343 -9225 -5193 3461 4882 8317 11889 11352 13601 4765 5963
3360 5963 11295 18353 19283 6857 9111 11347 14751 13234 10212 218 -5825 -17937 -22081 -24052 -33160
3345 -33160 -34908 -25216 -7011 -1397 -7165 -6067 327 5451 8483 4692 11681 21305 21203 16004 -312
3330 -312 -1107 368 5200 12275 14623 18573 21018 20271 15489 7402 11103 12584 14014 17864 660
3315 660 8690 7507 -995 -2421 9102 693 -7786 -6327 -815 2710 -910 1638 -1822 3744 5151
3300 5151 10049 10494 6752 -3798 -5264 17551 27326 19675 13529 13709 4997 3662 3932 -5689 -7443
3285 -7443 -14934 -5431 -5701 -2429 1315 -6841 -16688 -12035 -9507 -10802 -10517 -14019 -1630 866 -1882
3270 -1882 -6823 -11284 -1741 5489 -11957 -24627 -20956 -11995 -13743 -13271 -8848 5710 -14923 -31614
$$ packed form
3375b1132M13N814l927K409J080O118M032Q654J421L435L572n37K249q836J198
3360E963N332P058R30j2426K254K236L404j517l022r994o043j2112m144j971r108
3345c3160j748R692J8205N614n768J098O394N124L032l791O989R624j02n199j6316
3330c12p95J475M832P075K348L950K445p47m782q087L701J481J430L850j7204
3315F60Q030j183q502j426J1523q409q479J459N512L525l620K548l460N566J407
3300E151M898M45l742j0550j466K2815R775p651o146J80q712j335K70r621j754
3285g443p491R503k70L272L744q156r847M653K528j295K85l502J2389K496k748
3270a882m941m461R543P230j7446j2670L671Q961j748M72M423J4558k0633j6691
$$ plain form
3256 -31614 -26440 -19766 -18573 -28106 -23321 -10029 -3068 7741 1865 152 867 -5201 -13887 -6871
3242 -6871 3514 1853 -7630 -12340 -4317 -3117 10426 9945 -800 -2618 -58 -3816 -6068 -9560
3228 -9560 -18576 -19678 -20971 -30613 -31255 -29561 -24597 -12414 -11037 -5930 -4958 -8077 -19853 -8261 6765
3213 6765 8233 8557 -2967 -7267 7218 11465 -2306 -11923 -15846 -18222 -17195 -25843 -23420 -10059
3199 -10059 -9539 -6445 -4540 -248 993 2967 -5368 -3793 1481 799 2334 2665 -8044 -7444 121
3184 121 -117 -3331 -2462 -8779 -123 10393 795 -4560 3417 9427 16704 12322 4599 -2005 -13043
3169 -13043 -3475 9639 -2722 -15235 -4054 -3813 312 -2278 -4738 -3857 -3051 858 634 -3115 -2625
3154 -2625 -5970 -10418 -6743 6325 9891 5008 -7937 -4872 7823 10321 2943 10551 22475 25032
$$ packed form
3256c1614N174O674J193r533M785J3292O961J0809n876j713P15o068q686P016
3242f871J0385j661r483m710Q023J200J3543m81j0745j818K560l758k252l492
3228i560r016j102j293r642o42J694M964J2183J377N107R72l119j1776J1592J5026
3213F765J468L24j1524m300J4485M247j3771r617l923k376J027q648K423J3361
3199a0059N20L094J905M292J241J974q335J575N274o82J535L31j0709O00P565
3184A21k38l214Q69o317Q656J0516r598n355P977O010P277m382p723o604j1038
3169a3043R568J3114j2361j2513J1181K41M125k590k460Q81Q06L909k24l749M90
3154b625l345m448L675J3068L566m883j2945L065J2695K498p378P608J1924K557
$$ plain form
3140 25032 17436 310 -23452 -17950 -12902 -10703 4307 8280 3309 -5596 -6268 -843 10056 9543
3126 9543 8641 -2088 -8029 -9637 -11807 -6753 -569 -3477 -17968 -20035 -1141 1753 -12674 -26049
3112 -26049 -25893 -16291 -9302 2685 7664 8052 4475 -8603 -6409 -85 -7485 -452 1458 4505 1483
3097 1483 -2319 4038 -3451 2686 4343 5041 -7700 -16200 -13342 -13 7416 6813 -11942 -25590
3083 -25590 -26672 -18976 -17326 -14532 -8351 -10079 -1482 -321 4417 -1531 -6228 -5977 -17350 -17950 -16914
3068 -16914 -16515 -11235 -17038 -20931 -7777 -6449 -8427 -9757 -9687 1091 2153 6071 2052 -5685 -16548
3053 -16548 -20754 -10186 1317 -1058 -10168 -15912 -7755 7556 4570 -10624 -20129 -22870 -25844 -15597
3039 -15597 -20034 -6736 4419 8366 11813 12641 14238 14297 14667 16704 12827 7099 3359 1068 -2412
$$ packed form
3140B5032p596j7126k3762N502N048K199J5010L973m971q905o72N425J0899n13
3126I543r02j0729n941j608k170N054O184k908j4491k067J8894K894j4427j3375
3112b6049J56R602O989J1987M979L88l577j3078K194O324p400P033J910L047l022
3097A483l802O357p489O137J657O98j2741q500K858J3329P429o03j8755j3648
3083b5590j082P696J650K794O181j728Q597J161M738n948m697K51j1373o00J036
3068a6914L99N280n803l893J3154J328j978j330P0J0778J062L918m019p737j0863
3053a6548m206J0568J1503k375r110n744Q157J5311k986j5194r505k741k974J0247
3039a5597m437J3298J1155L947L447Q28J597N9L70K037l877n728l740k291l480
$$ plain form
3024 -2412 8980 12817 12316 4832 -5756 -14591 -11784 -5247 -4474 -5276 -15240 -21728 -21854 -16981 -14166
3009 -14166 -10310 -4534 -6732 -5966 6504 15046 10833 4953 -8304 -4622 -3305 7932 15468 18794
2995 18794 10456 12146 4503 -2245 8923 10843 6421 -10681 -8652 -5434 3308 3528 -6298 -10027
2981 -10027 -4671 5310 12406 20163 10165 7376 7828 5589 12057 19708 23052 18601 6302 3533 4026
2966 4026 -7471 -10883 -10224 4864 15113 -238 -16514 -18579 -14053 -6808 -3655 -5039 1152 4756
2952 4756 -2061 -279 -934 -14822 -18778 -14986 -14461 -12970 -3333 3430 -1798 -1042 -2529 -16433 -23766
2937 -23766 -16908 -13513 -6608 -9191 -8541 -7209 1010 -1617 3832 -1999 -15078 -25039 -22449 -28908 -39163
2922 -39163 -37146 -27487 -12174 8751 12389 3058 11458 23314 24254 21726 15141 12905 13877 24121
$$ packed form
3024b412J1392L837n01p484j0588q835K807O537P73q02r964o488j26M873K815
3009a4166L856N776k198P66J2470Q542m213n880j3257L682J317J1237P536L326
2995A8794q338J690p643o748J1168J920m422j7102K029L218Q742K20r826l729
2981a0027N356R981P096P757r998k789M52k239O468P651L344m451j2299k769M93
2966D026j1497l412O59J5088J0249j5351j6276k065M526P245L153j384O191L604
2952D756o817J782o55j3888l956L792N25J491R637O763n228P56j487j3904p333
2937b3766O858L395O905k583O50J332Q219k627N449n831j3079r961K590o459j0255
2922c9163K017R659J5313K0925L638r331Q400J1856R40k528o585k236R72J0244
$$ plain form
2908 24121 31330 19395 16198 13140 721 -10120 -3191 2092 16210 20677 9817 3103 -2166
2895 -2166 -33 4450 1073 619 -826 854 14324 23055 7420 -3158 -9823 -5365 6779 -917
2881 -917 -404 14547 19471 10337 5323 8378 9646 5870 5191 6948 5021 -5641 -15069 -14034 -18512
2866 -18512 -14508 -13209 -6781 8932 8513 635 -6526 -31 3229 4130 -3159 -1954 -1761 3731 13970
2851 13970 20212 10591 16639 19785 23593 11596 15407 3931 -17377 -29483 -33194 -26392 -19812 -12746
2837 -12746 -10988 -16465 -24696 -19932 -19473 -29738 -28552 -20947 -16164 -16154 -9742 -12307 -17180 -6205 4162
2822 4162 4628 12812 15206 8415 10516 5572 -9760 -16897 -17293 -7034 5841 4417 -112 841 1473
2807 1473 -3880 -19800 -18970 -6315 -8476 -3757 -4865 -9172 -1915 11576 19823 18180 3689 659
$$ packed form
2908B4121P209j1935l197l058j2419j0841O929N283J4118M467j0860o714n269
2895b166K133M483l377m54j445J680J3470Q731j5635j0578o665M458J2144p696
2881i17N13J4951M924r134n014L055J268l776o79J757j927j0662r428J035m478
2866a8512M004J299O428J5713m19p878p161O495L260R01p289J205J93N492J0239
2851A3970O242r621O048L146L808j1997L811j1476k1308j2106l711O802O580P066
2837a2746J758n477q231M764M59j0265J186P605M783J0O412k565m873J0975J0367
2822D162M66Q184K394o791K101m944j5332p137l96J0259J2875j424m529R53O32
2807A473n353j5920Q30J2655k161M719j108m307P257J3491Q247j643j4491l030
$$ plain form
2793 659 2185 5874 3195 -13922 -13281 4319 3632 -5516 309 6602 690 -3887 179 -279 5706
2778 5706 11615 5603 -2929 836 4682 6487 5955 2047 -6843 -10674 -4748 -216 1784 3083 -2300
2763 -2300 3748 10232 14334 7004 -1472 2101 7901 17452 23668 25517 18937 13038 15160 10570 -6238
2748 -6238 -9119 -3896 3637 -10747 -5837 -2232 693 3965 -11223 -24505 -21378 -13564 -3787 -3914
2734 -3914 -13000 -13277 -11267 -15587 -13198 -17849 -25070 -21279 -16604 -10589 -3525 -8281 146 6826 4711
2719 4711 -15582 -10122 -10340 -21149 -22969 -12959 -5850 -19951 -14113 -12258 -29303 -28913 -27662 -27496
2705 -27496 -16446 -15702 -6863 -3359 -2026 -8528 -5713 -10415 -5727 -2625 6119 14818 17712 15936 19134
2690 19134 6765 -7877 -10972 3378 3505 -7015 -15410 -4074 4846 2894 -8183 -5223 4494
$$ packed form
2793F59J526L689k679j7117O41J7600o87r148N825O293n912m577M066m58N985
2778E706N909o012q532L765L846J805n32l908q890l831N926M532K000J299n383
2763b300O048O484M102p330q476L573N800R551O216J849o580n899K122m590j6808
2748f238k881N223P533j4384M910L605K925L272j5188j3282L127P814R777j27
2734c914r086k77K010m320K389m651p221L791M675O015P064m756Q427O680k115
2719D711k0293N460k18j0809j820J0010P109j4101N838J855j7045L90J251J66
2705b7496J1050P44Q839L504J333o502K815m702M688L102Q744Q699K894j776L198
2690A9134j2369j4642l095J4350J27j0520q395J1336Q920j952j1077K960R717
$$ plain form
2677 4494 11096 7568 7803 9286 7497 -3035 -6153 -1794 -6363 -8286 -9471 -8826 -7764 1648 9112
2662 9112 11712 11052 13327 11963 6423 3628 -5401 -22173 -15362 -5025 -579 11917 9229 1286
2648 1286 -4522 -822 6493 12045 10517 3937 -8355 -14642 -17766 -24632 -21850 -23520 -15951 -15451 -6087
2633 -6087 -4867 -8297 -12961 -9399 3272 3537 -2465 -2562 -18833 -32737 -30247 -6300 12457 15583
2619 15583 11811 11151 31 413 -2321 -3403 2658 -3194 -5151 -18 376 7132 -2938 -1776 5776
2604 5776 6181 5363 -7002 -16277 -4400 574 -9659 -6616 4390 19806 29059 22832 13512 18162
2590 18162 16590 14656 8136 7305 6430 3592 770 -5043 -711 12826 20032 10978 1556 11198 -4772
2575 -4772 -8536 -1786 3079 8743 15507 13378 8028 9294 -509 -17639 -13874 -18783 -20822 -8645
$$ packed form
2677D494O602l528K35J483j789j0532l118M359m569j923j185O45J062R412P464
2662I112K600o60K275j364n540k795r029j6772O811J0337M446J2496k688p943
2648A286n808L700P315N552j528o580j2292o287l124o866K782j670P569N00R364
2633f087J220l430m664L562J2671K65o002r7j6271j3904K490K3947J8757L126
2619A5583l772o60j1120L82k734j082O061n852j957N133L94O756j0070J162P552
2604E776M05q18j2365r275J1877M974j0233L043J1006J5416R253o227r320M650
2590A8162j572j934o520q31q75k838k822n813M332J3537P206r054r422R642j5970
2575d772l764O750M865N664O764k129n350J266r803j7130L765m909k039J2177
$$ plain form
2561 -8645 6903 -351 7410 8961 11028 25674 12583 3845 10520 15845 10569 2049 887 12166
2547 12166 14300 5217 833 2113 3165 15718 20937 18826 11178 1696 -2138 -5009 -11454 -14104
2533 -14104 -13667 2013 4524 -2708 -878 -549 6415 2229 68 6882 6343 -3858 2690 1007 676
2518 676 -889 -4575 -3881 -1517 -1190 7874 15163 20086 17755 8920 8647 18167 8812 2632 -1388 -4936
2502 -4936 5066 11049 16082 14961 10291 10073 12142 15244 3406 2134 11576 7065 -3830 -7508
2488 -7508 -1853 1557 5144 -1264 -2844 -6938 -17574 -4386 11149 24988 14049 -3452 -3023 9328
2474 9328 8416 2400 -435 6920 16547 25884 13277 -2659 -8990 -4532 -6023 -6469 -9933 -14251 -11559
2459 -11559 8270 7646 1866 -10226 -13523 -11490 -8989 -11089 -21182 -20311 -9807 3345 3553 7962
$$ packed form
2561h645J5548p254P761J551K067J4646j3091q738O675N325n276q520j162J1279
2547A2166K134r083m384J280J052J2553N219k111p648r482l834k871o445k650
2533a4104M37J5680K511p232J830L29O964m186k161O814n39j0201O548j683l31
2518F76j565l686O94K364L27R064P289M923k331q835k73R520r355o180m020l548
2502d936J0002N983N033j121m670k18K069L102j1838j272R442m511j0895l678
2488g508N655L410L587o408j580m094j0636J3188J5535J3839j0939j7501M29J2351
2474I328r12o016k835P355R627R337j2607j5936o331M458j491m46l464m318K692
2459a1559J9829o24n780j2092l297K033K501k100j0093Q71J0504J3152K08M409
$$ plain form
2445 7962 13333 14131 10780 10786 8895 9376 3109 1381 -7758 -16698 -15498 -10645 -7247 -1619 -6268 -14637
2429 -14637 -12453 -11757 -15121 -10486 2291 11495 3773 2063 3431 6762 13711 1519 -4008 10875
2415 10875 12974 6864 -6306 -4233 1820 1897 5625 2857 8358 4925 -2149 -4803 -1752 -5811 -6618
2400 -6618 -16106 -20750 -11790 -7145 -12842 -20474 -11206 -9152 -10645 -17684 -3016 19612 18447 15472
2386 15472 5602 -3827 2393 13013 11976 3917 -2426 -9814 1421 17967 19146 18243 15467 3623
2372 3623 -320 1413 4633 3380 15177 12735 -7185 -17318 -17842 -18084 -17419 -9998 -2467 -6475 -3756
2357 -3756 -6402 -19442 -10193 2405 2990 -11829 -14096 -5762 -9672 -1045 2678 -3234 -8561 -2200
2343 -2200 5434 7885 11169 8717 4244 11045 15307 16501 9859 -776 2558 -852 -13258 -9845
$$ packed form
2445G962N371P98l351Oj891M81o267j728r139q940J200M853L398N628m649q369
2429a4637K184O96l364M635J2777R204p722j710J368L331O949j2192n527J4883
2415A0875K099o110j3170K073O053P7L728k768N501l433p074k654L051m059q07
2400f618r488m644Q960M645n697p632R268K054j493p039J4668K2628j165k975
2386A5472r870r429O220J0620j037q059o343p388J1235J6546J179r03k776j1844
2372C623l943J733L220j253J1797k442j9920j0133n24k42O65P421P531m008K719
2357c756k646j3040R249J2598N85j4819k267Q334l910Q627L723n912n327O361
2343b200P634K451L284k452m473O801M262J194o642j0635L334l410j2406L413
$$ plain form
2329 -9845 1038 -2077 -4586 528 5131 407 9019 7227 2766 7895 1215 -11347 -7570 -154
2315 -154 -2695 -5010 -12426 -4205 815 8211 2976 2 -10532 -12436 -8794 -3790 -1666 -6443 -10918
2300 -10918 -10109 -7180 -1475 12838 5757 8852 10096 2991 1267 6931 4923 4466 10220 4469 -5161
2285 -5161 -9323 -138 940 -1988 6415 5574 18452 14864 -4523 -265 -3581 -10770 -15068 -5794 -551
2270 -551 2726 -2774 -3386 -5627 -14051 -5886 6275 2477 3965 19286 23063 29071 22461 2592 -2766
2255 -2766 6162 13959 21336 9239 -937 2183 7501 8275 3163 3072 6027 15288 21794 17687 19252
2240 19252 6330 -13475 -19097 -15820 -5100 -9190 -3131 1827 8274 11690 19227 17571 8625 5635
2226 5635 13083 6895 2670 9589 12050 17660 11121 1529 -5907 -5233 6656 7891 11067 14056 10843
$$ packed form
2329i845J0883l115k509N114M603m724Q612j792m461N129o680j2562L777P416
2315a54k541k315p416Q221N020P396n235k974j0534j904L642N004K124m777m475
2300a0918Q09K929N705J4313p081L095J244p105j724N664k008m57N754n751r630
2285e161m162R185J078k928Q403q41J2878l588j9387M258l316p189m298R274N243
2270e51L277n500o12k241q424Q165J2161l798J488J5321L777O008o610j9869n358
2255b766Q928P797P377j2097j0176L120N318P74n112r1K955R261O506m107J565
2240A9252j2922j9805n622L277J0720m090O059M958O447L416P537j656q946k990
2226E635P448o188m225O919K461N610o539r592p436O74J1889J235L176K989l213
$$ plain form
2211 10843 6356 6507 8447 3165 -5134 -58 -7064 -5731 -1746 -7328 -17861 -13528 -17063 -14422 -11208
2196 -11208 -8322 -12131 -8026 1578 3479 7928 11899 7822 12274 -479 -8221 -17481 -16591 -8860 -10541
2181 -10541 -10314 -2880 215 -6919 -505 14757 12349 7423 4129 5318 3931 -4416 -13875 -7131 6272
2166 6272 8555 5472 8688 11193 9592 6477 -45 -1118 8165 23951 24438 3788 -747 -4250 -8967
2151 -8967 2509 3959 -6419 -6028 -7017 -2531 -614 -2700 -9220 -19155 -26436 -21316 -11891 -3626 -166
2136 -166 12502 10893 -1774 319 16499 23045 22106 14555 7325 2881 964 57 10619 12599 13406
2121 13406 17399 5075 -4987 -11775 -15723 -16448 -11599 -13531 -5537 9662 9816 5869 15784 17494
2107 17494 2777 7059 12443 11108 -1970 3671 12791 16797 13392 4101 -1811 523 -11409 -4658
$$ packed form
2211A0843m487J51J940n282q299N076p006J333L985n582j0533M333l535K641L214
2196a1208K886l809M105R604J901M449L971m077M452j2753p742r260Q90P731j681
2181a0541K27P434L095p134O414J5262k408m926l294J189j387q347r459O744J3403
2166F272K283l083L216K505j601l115o522j073R283J5786M87k0650m535l503m717
2151h967J1476J450j0378L91r89M486J917k086o520r935p281N120R425Q265L460
2136a66J2668j609j2667K093J6180O546r39p551p230m444j917r07J0562J980Q07
2121A3406L993j2324j0062o788l948p25M849j932P994J5199J54l947R915J710
2107A7494j4717M282N384j335j3078N641R120M006l405r291n912K334j1932O751
$$ plain form
2093 -4658 -823 2749 7122 2688 -4252 -18668 -16283 -6295 -6638 -6482 2201 4882 1660 -2463 -479
2078 -479 6932 14770 10105 -8390 -15011 -9133 -4768 -1557 -1825 -2340 -8935 -10223 -5226 -8096 453
2063 453 9843 14470 2778 3544 4290 755 -2255 9284 5145 1015 -97 2336 -633 6258 7403
2048 7403 -160 -4096 -13823 -11029 1041 -5320 -7810 -4776 2285 771 90 -1074 10902 11418 15010
2033 15010 17577 3955 -544 -3225 -3860 593 3851 15447 11133 -1933 -11576 -15572 -11186 -1876
2019 -1876 -1823 657 7449 9995 6831 7672 7107 10889 10620 1815 -3328 6433 15548 -1961 -10016 -18701
2003 -18701 -16126 -13804 -20724 -25637 -20258 -12272 -7361 5707 -2454 -8597 2884 9413 14520 24261
1989 24261 25029 26145 25390 22245 23354 9216 -1233 -748 -3814 -6843 -4710 -511 5466 12882 12374
$$ packed form
2093d658L835L572M373m434o940j4416K385R988l43J56Q683K681l222m123J984
2078d79P411P838m665j8495o621N878M365L211k68n15o595j288M997k870Q549
2063D53R390M627j1692P66P46l535l010J1539m139m130j112K433k969O891J145
2048G403p563l936r727K794J2070o361k490L034P061j514o81j164J1976N16L592
2033A5010K567j3622m499k681o35M453L258J1596m314j3066r643l996M386R310
2019a876N3K480O792K546l164Q41n65L782k69q805n143R761R115j7509q055q685
2003a8701K575K322o920m913N379P986M911J3068q161o143J1481O529N107R741
1989B4261P68J116p55l145J109j4138j0449M85l066l029K133M199N977P416n08
$$ [...]
##END NTUPLES=NMR SPECTRUM
##END=
