##TITLE=Analysis number 323174
Compound Code cc 06602
Project Code adrs
Chemist Name molekula
##JCAMPDX= 6.0         $$ Bruker NMR JCAMP-DX V2.0
##DATA TYPE= NMR SPECTRUM
##DATA CLASS= NTUPLES
##ORIGIN= Bruker BioSpin GmbH
##OWNER= nmr
$$ XWIN-NMR		Version 3.5
$$ Tue Oct 17 20:22:44 2006 GMT Daylight Time (UT+1h)  MAYBRIDGE\nmr@NMR_250MHZ
##.OBSERVE FREQUENCY= 250.131544655141
##.OBSERVE NUCLEUS= ^1H
##.ACQUISITION MODE= SIMULTANEOUS (DQD)
##.ACQUISITION SCHEME= undefined
##.AVERAGES= 16
##.DIGITISER RES= 18
##SPECTROMETER/DATA SYSTEM= dpx250
##.PULSE SEQUENCE= zg30
##.SOLVENT NAME= CDCl3
##.SHIFT REFERENCE= (INTERNAL, CDCl3, 0, 16.522)
##AUDIT TRAIL= $$ (NUMBER, WHEN, WHO, WHERE, WHAT)
$$ ##TITLE= Audit trail, XWIN-NMR		Version 3.5
$$ ##JCAMPDX= 5.01
$$ ##ORIGIN= Bruker BioSpin GmbH
$$ ##OWNER= nmr
$$ C:\u/data/dgb/nmr/ADRS/860/pdata/1/auditp.txt
$$ ##AUDIT TRAIL=  $$ (NUMBER, WHEN, WHO, WHERE, WHAT)
(   1,<2006-10-17 20:22:21.19 +100>,<MAYBRIDGE\nmr>,<NMR_250MHZ>,
      <created by zg, POWCHK disabled, PULCHK disabled
       configuration hash MD5:
       49 4B E0 1D 92 C2 6B 37 9F E6 65 BC 52 41 86 1D
       data hash MD5: 64K
       49 0E 35 E4 5D 57 4A 08 00 17 09 A5 28 08 7F 5B>)
(   2,<2006-10-17 20:22:35.21 +100>,<MAYBRIDGE\nmr>,<NMR_250MHZ>,
      <Start of raw data processing
       ef LB = 0.3 FT_mod = 6 PKNL = 1 SI = 32K 
       data hash MD5: 32K
       51 2D 07 C9 0A ED 88 8F E2 18 4B 4B 57 3A 94 65>)
(   3,<2006-10-17 20:22:37.19 +100>,<MAYBRIDGE\nmr>,<NMR_250MHZ>,
      <apk 
       data hash MD5: 32K
       74 88 70 F2 44 DA 15 51 CF B3 FA 2F F4 B6 9F 30>)
(   4,<2006-10-17 20:22:38.07 +100>,<MAYBRIDGE\nmr>,<NMR_250MHZ>,
      <abs ABSG = 5 
       data hash MD5: 32K
       D2 3C 33 4A 0E DD A3 4D 20 0F 1C 18 DC 46 2B 5A>)
$$ ##END=
$$ 
$$ hash MD5
$$ FF 41 BD 28 C0 F2 8E 7F 47 D0 97 15 99 69 D4 09
##$RELAX= 
##$RELAX= 
##$RELAX= 
##$RELAX= 
##$RELAX= 
##$RELAX= 
##$RELAX= 
$$ Bruker specific parameters
$$ --------------------------
##$DU= <C:\u>
##$EXPNO= 860
##$NAME= <ADRS>
##$PROCNO= 1
##$TYPE= <nmr>
##$USER= <dgb>
##$AMP= (0..31)
100 100 100 100 100 100 100 100 100 100 100 100 100 100 100 100 100 100 
100 100 100 100 100 100 100 100 100 100 100 100 100 100 
##$AQSEQ= 0
##$AQ_mod= 3
##$AUNM= <au_zg>
##$AUTOPOS= <34 >
##$BF1= 250.13
##$BF2= 250.13
##$BF3= 250.13
##$BF4= 250.13
##$BF5= 500.13
##$BF6= 500.13
##$BF7= 500.13
##$BF8= 500.13
##$BYTORDA= 1
##$CFDGTYP= 0
##$CFRGTYP= 5
##$CHEMSTR= <none>
##$CNST= (0..31)
1 1 145 1 1 1 1 1 1 1 1 1 1 1 1 1 1 1 1 1 1 1 1 1 1 1 1 1 1 1 1 1 
##$CPDPRG= <>
##$CPDPRG1= <>
##$CPDPRG2= <>
##$CPDPRG3= <>
##$CPDPRG4= <mlev>
##$CPDPRG5= <mlev>
##$CPDPRG6= <mlev>
##$CPDPRG7= <mlev>
##$CPDPRG8= <mlev>
##$CPDPRGB= <>
##$CPDPRGT= <>
##$D= (0..31)
0 1 0 0 0 0 0 0 0 0.06 0 0 0 0 0 0 0.0002 0 0 0 0 0 0 0 0 0 0 0 0 0 0 
0 
##$DATE= 1161112940
##$DBL= (0..7)
120 120 120 120 120 120 120 120 
##$DBP= (0..7)
150 150 150 150 150 150 150 150 
##$DBP07= 0
##$DBPNAM0= <>
##$DBPNAM1= <>
##$DBPNAM2= <>
$$ [...]
##$SUBNAM7= <"">
##$SUBNAM8= <"">
##$SUBNAM9= <"">
##$SW= 20.6930455092707
##$SWIBOX= (0..15)
0 0 3 0 0 0 0 0 0 0 0 0 0 0 0 0 
##$SW_h= 5175.983436853
##$TD= 65536
##$TD0= 1
##$TE= 683.16
##$TE2= 300
##$TE3= 300
##$TEG= 300
##$TL= (0..7)
0 120 120 120 120 120 120 120 
##$TP= (0..7)
150 150 150 150 150 150 150 150 
##$TP07= 0
##$TPNAME0= <>
##$TPNAME1= <>
##$TPNAME2= <>
##$TPNAME3= <>
##$TPNAME4= <>
##$TPNAME5= <>
##$TPNAME6= <>
##$TPNAME7= <>
##$TPOAL= (0..7)
0.5 0.5 0.5 0.5 0.5 0.5 0.5 0.5 
##$TPOFFS= (0..7)
0 0 0 0 0 0 0 0 
##$TUNHIN= 0
##$TUNHOUT= 0
##$TUNXOUT= 0
##$USERA1= <user>
##$USERA2= <user>
##$USERA3= <user>
##$USERA4= <user>
##$USERA5= <user>
##$V9= 5
##$VALIST= <valist>
##$VCLIST= <CCCCCCCCCCCCCCC>
##$VD= 0
##$VDLIST= <DDDDDDDDDDDDDDD>
##$VPLIST= <PPPPPPPPPPPPPPP>
##$VTLIST= <TTTTTTTTTTTTTTT>
##$WBST= 1024
##$WBSW= 4
##$XGAIN= (0..3)
0 0 0 0 
##$XL= 0
##$YL= 0
##$YMAX_a= 593356
##$YMIN_a= -503673
##$ZGOPTNS= <>
##$ZL1= 120
##$ZL2= 120
##$ZL3= 120
##$ZL4= 120
##$ABSF1= 16.522
##$ABSF2= -4.171173
##$ABSG= 5
##$ABSL= 3
##$ALPHA= 0
##$AQORDER= 0
##$ASSFAC= 0
##$ASSFACI= 0
##$ASSFACX= 0
##$ASSWID= 0
##$AUNMP= <proc_1d>
##$AZFE= 0.1
##$AZFW= 0.1
##$BCFW= 0
##$BC_mod= 0
##$BYTORDP= 0
##$COROFFS= 0
##$CY= 12.5
##$DATMOD= 1
##$DC= 0
##$DFILT= <>
##$DTYPP= 0
##$F1P= 14.0000005364418
##$F2P= -0.99999901652339
##$FCOR= 0.5
##$FTSIZE= 32768
##$FT_mod= 6
##$GAMMA= 0
##$GB= 0
##$INTBC= 1
##$INTSCL= 1
##$ISEN= 128
##$LB= 0.3
##$LEV0= 0
##$LPBIN= 0
##$MAXI= 10000
##$MC2= 0
##$MEAN= 0
##$ME_mod= 0
##$MI= 0
##$NCOEF= 0
##$NC_proc= -4
##$NLEV= 6
##$NOISF1= 0
##$NOISF2= 0
##$NSP= 0
##$NTH_PI= 0
##$NZP= 0
##$OFFSET= 16.522
##$PC= 1
##$PHC0= -43.13685
##$PHC1= -5.345492
##$PH_mod= 1
##$PKNL= yes
##$PPARMOD= 0
##$PSCAL= 4
##$PSIGN= 0
##$REVERSE= no
##$SF= 250.13
##$SI= 32768
##$SIGF1= 0
##$SIGF2= 0
##$SINO= 400
##$SIOLD= 32768
##$SREGLST= <1H.CDCl3>
##$SSB= 0
##$STSI= 32768
##$STSR= 0
##$SW_p= 5175.98343685301
##$SYMM= 0
##$S_DEV= 0
##$TDeff= 65536
##$TDoff= 0
##$TI= <Analysis number 999999
Compound Code 99
Book Reference 9
Project Code 9>
##$TILT= no
##$TM1= 0
##$TM2= 0
##$TOPLEV= 0
##$USERP1= <user>
##$USERP2= <user>
##$USERP3= <user>
##$USERP4= <user>
##$USERP5= <user>
##$WDW= 1
##$XDIM= 32768
##$YMAX_p= 435433581
##$YMIN_p= -397982
$$ End of Bruker specific parameters
$$ ---------------------------------
##NTUPLES= NMR SPECTRUM
##VAR_NAME=  FREQUENCY,     SPECTRUM/REAL,   SPECTRUM/IMAG
##SYMBOL=    X,             R,               I
##VAR_TYPE=  INDEPENDENT,   DEPENDENT,       DEPENDENT
##VAR_FORM=  AFFN,          ASDF,            ASDF
##VAR_DIM=   32768,         32768,           32768
##UNITS=     HZ,            ARBITRARY UNITS, ARBITRARY UNITS
##FACTOR=    0.157963299565203, 1,           1
##FIRST=     4132.6476996994, 0,             0
##LAST=      -1043.33573715361, 0,           0
##MIN=       -1043.33573715361, -397982,     0
##MAX=       4132.6476996994, 435433581,     0
$$ Real data points
##PAGE= N=1
##DATA TABLE= (X++(R..R)), XYDATA
$$ [...]
28993 40410 74924 148481 289141 228304 212828 161341 136666 94145 43326 46926 38966 -37740
28981 -37740 -83399 -23490 32449 42242 61379 126923 82811 -4245 66025 169424 133161 38911
28969 38911 26986 -44466 22456 84628 90943 59808 76598 84593 67184 32033 42577 113627
28957 113627 151672 192846 176462 123842 122420 39774 59388 5743 -48306 -781 55763 85914
28945 85914 71873 -18169 -13392 72473 119403 154112 133076 29617 -52168 -63191 -94838 -93829
28933 -93829 -66430 -79277 -99062 -153646 -116517 32982 80116 91131 78140 35055 4413
28922 4413 24088 -27527 -73752 -146835 -124552 -47880 7365 -12804 22629 79236 67700 33740
28910 33740 -26029 -29300 58802 44540 92878 62311 9728 15128 95039 96023 -10920 -57848
28898 -57848 -101874 -157033 -152947 -26171 56208 21085 28917 3081 63759 140830 115912 16224
28886 16224 -33584 -63883 8040 -45967 -122255 -96373 -41610 -62397 -102763 -17367 -12042 -29049
28874 -29049 -6272 21429 -28284 12244 -4288 -78209 -46687 -35309 74562 98229 98849 103016
28862 103016 133273 128288 63829 -43880 -20152 -10072 -88134 -120720 -58066 -68626 -81991
28851 -81991 -77412 -108035 -61826 -55440 -86664 -11576 59216 99733 92061 63938 35073 95771
28839 95771 48089 55046 -16258 -47673 -23513 -19715 24722 -1792 -71657 -124214 -83242 14189
28827 14189 20003 117223 115232 74481 19701 46620 -11962 -11130 34505 22032 -104267 -135753
28815 -135753 -59736 -49268 -84218 -145587 -161343 -115629 -60549 -24486 81862 66426 91631
28804 91631 88908 49251 22762 84647 71614 -32820 -31597 -48473 23693 31571 68020 63144
28792 63144 141700 189358 121140 93831 26425 4369 42967 29114 -6074 9440 88903 139227
28780 139227 202819 193318 110273 79005 45712 31730 81220 87591 89851 128213 147358 99798
28768 99798 -1056 18469 60877 37375 -11661 23265 11743 -1890 -73222 -61597 -4900
28757 -4900 32076 27271 48774 99258 149030 40240 22439 45848 8954 -52692 -117671 -87880
28745 -87880 -86443 -97048 -90603 -91493 -17948 -19040 -37554 -584 25593 6520 13217 59600 1572
28732 1572 -8644 28815 22748 -11393 -31754 -27397 20812 37051 41461 99152 142895 37244
28720 37244 39804 97108 136072 47162 4543 -34416 -25287 24569 70824 141860 62021 7698
28708 7698 85049 112093 63541 68649 95055 -20934 -52132 -36479 -145480 -126781 -153472 -172971
28696 -172971 -105118 -194605 -113967 -77390 -71861 -32229 -39240 -33840 -41022 24111 313 -37821
28684 -37821 -32597 -33908 -77099 -91602 -31497 -2102 -60640 -68449 3718 32538 7225 37958
28672 37958 -8284 -17771 -56438 -22077 18262 40230 58657 -664 -64545 41369 165550
28661 165550 203371 79293 38501 80726 65662 2111 36782 114986 97784 56249 10177
28650 10177 8418 30432 68205 128734 132876 118106 108073 139143 134544 122564 89897 18119
28638 18119 29839 58193 -41821 -106700 -124584 -164187 -183358 -135299 -123374 -35525 20024
28627 20024 41593 32408 -2238 -78435 -48046 -22295 -23984 -5623 -29561 -25173 39949 78757
28615 78757 10727 -13041 28614 37634 78899 41464 32384 1512 -57075 -19739 62256 107063
28603 107063 125055 137232 77140 153620 162258 151766 114760 112743 133547 112165 13242 -33513
28591 -33513 31149 59120 26358 -1350 30107 69341 93833 94790 49030 47066 23946 18629
28579 18629 -2884 -13054 11554 -6276 -41274 -60092 -5338 -59813 -70079 87123 149777
28568 149777 83736 -17825 -129261 -109041 -132824 -148624 -87382 -3567 73832 31274 676
28557 676 22450 13645 -15782 -48112 -46127 -12855 20967 36474 -50047 -111968 -69676 -14131
28545 -14131 38412 75359 3583 -16862 -5547 -64770 -52537 43859 63533 119534 170945 166985
28533 166985 104465 2705 -53194 -116298 -92833 -57914 -77167 26776 108662 199513 181409
28522 181409 141161 157751 124812 86316 134519 159717 79729 20924 62586 119976 145354
28511 145354 88270 -10200 -27642 -29772 25479 7258 53784 40516 33552 13101 30182 79927
28499 79927 76873 55110 65835 54982 -2512 -117739 -182749 -133481 -1374 48770 157584
28488 157584 171554 61644 21967 -39140 -56468 -83523 -45103 -30795 -58096 -19447 -57618
28477 -57618 -77627 -68667 -27481 -11693 -45428 504 52063 -62832 -44881 -10330 -44564 -99197
28465 -99197 -165560 -121945 -71343 54133 112415 125631 48541 -2183 -49291 -21756 30456
28454 30456 4505 -89215 -54472 -19763 18974 -14506 -7404 44652 126943 145301 65546 -16234
28442 -16234 -97789 -128048 -85984 -61558 -24746 -42622 -11682 -26374 -93840 -173297 -180720 -157436
28430 -157436 -138269 -88536 -41897 -40663 -60735 -47529 -80994 -24972 -46132 -18404 -20181 -3905
28418 -3905 -45381 -127225 -74979 -17137 -59470 -89463 -148324 -45644 10070 -30805 -52066 -61684
28406 -61684 -29996 -60850 -82327 -38632 -8138 -25345 -134768 -152637 -155251 -153382 -57883 -35366
28394 -35366 -54687 -54163 -63914 15585 32365 45151 35223 19610 60519 141975 147414 99635 63213
28381 63213 72424 57047 39501 -39097 -128520 -90971 -38413 -13504 101377 173275 145531 58410
28369 58410 29499 -24852 -4237 14468 -44111 -69130 -35946 -64966 -64205 -48014 -55545 -99072
28357 -99072 -195336 -161725 -61619 -106206 -101519 -4467 68800 60686 -50362 -104695 -118727 -46642
28345 -46642 -30088 -13207 -19831 -21404 -9779 17918 62891 3849 -45896 -4338 11067 -28491
28333 -28491 -92310 -104397 -109052 -4512 76435 16860 37743 43408 60884 63220 95152 91712
28321 91712 117377 177363 144037 148653 98476 48956 119348 131493 62824 7362 22550 88402
28309 88402 48987 92407 141449 204495 159681 51826 14933 -110078 -88100 -9702 -74772
28298 -74772 13316 147554 162278 141135 128200 92644 90902 95941 93745 84008 102428 -12845
28286 -12845 -70289 58272 83051 39460 2641 -19607 -20589 -26646 -66881 -85833 -140423 -164415
28274 -164415 -135909 -40924 7466 -27246 -101396 -120526 -153554 -196730 -169564 -75081 -25052
28263 -25052 -9969 51221 96546 94678 59472 66122 125809 26327 -61913 -82987 -53749 -28271
28251 -28271 5203 -1088 15313 -4088 -72453 -122997 -85856 -71718 -31190 77886 123511 120631
28239 120631 91481 52511 9819 -69598 -81622 -59347 -29250 61605 110485 125668 154528
28228 154528 173498 197428 157405 141942 128049 117784 78909 -10314 -55580 -89569 -106429
28217 -106429 -12064 20360 16768 61216 101453 69742 -20643 32652 28664 -18770 -78934 -79319
28205 -79319 -89684 -32405 33018 47976 42343 36298 97352 115425 96390 121194 103604 71319
28193 71319 -23972 -100896 -56595 -3626 -23387 -98184 -132921 -112652 -93193 -117300 -74926 -53713
28181 -53713 -48213 -25692 -15986 -15553 -2692 -1965 50524 112335 91761 89644 70196 107466 223220
28168 223220 173860 80221 78928 18887 6564 66048 1901 -97365 18806 93370 -1617
28157 -1617 7853 72415 58900 78918 20442 -6262 -82824 -90913 -85796 -569 40500 104557
28145 104557 113436 100530 98005 102627 42854 -445 -2628 -72539 -25056 14990 9727 -66569
28133 -66569 -137270 -162513 -27088 56431 -515 -99183 -114419 -77038 839 23739 61286
28122 61286 105977 64665 8710 30807 98758 150419 143907 84585 -17234 -60541 16956 30811
28110 30811 -4600 -41481 -46833 3803 8302 90865 87961 38795 84310 62122 118834 110189
28098 110189 53312 80566 83612 20983 -52125 2758 5559 6201 39648 66144 41386 10360
28086 10360 23729 14763 86507 120827 68637 72068 72092 17150 3359 39467 47752 -17403 -58653
28073 -58653 -21966 34408 53087 80390 82087 71609 29980 38954 -28027 -108305 -118015 -56005
28061 -56005 22293 -28274 -26444 75233 112558 105234 108624 147016 116662 98652 56499 -3861
28049 -3861 -24498 12142 -39477 -74329 -3669 24770 -13604 -47666 -112055 -161488 -139660 -9514
28037 -9514 76755 57796 -18975 603 43203 24435 21846 29337 -36422 9893 31498 -48027
28025 -48027 -38753 -55109 -72737 -77664 -37906 15627 -16335 -90512 -61611 -8096 25769 -23158
28013 -23158 -28647 -27287 -96574 -216129 -208485 -122780 7077 -17032 -74673 -1836 68022 24464
28001 24464 2116 -55664 -116175 -98548 -58624 -28301 -27404 -69600 -131465 -84476 -137494 -112553
27989 -112553 -40604 -41794 2891 -17160 -30767 -9031 -37723 -27085 -24098 6597 92162 15280
27977 15280 -72535 -93449 -86736 -65300 -131634 -113522 -92232 -13256 22111 -45607 -35895 -17619
27965 -17619 -22105 29078 24393 38184 6707 -11725 -83394 -153240 -123009 -105749 -19960 4291
27953 4291 16595 30466 139318 147292 107509 61123 52956 122685 204535 158603 5546 -41597
27941 -41597 -25787 -62052 -83509 -125883 -35527 -60111 -98467 -9450 -188 2565 18716 18543
27929 18543 30336 11032 20003 80291 49579 41814 33774 -14303 -74964 -73130 -110936 -156023
27917 -156023 -120503 -17829 -2540 80928 77295 90022 74360 100390 149749 140908 106279 90549
27905 90549 -2652 -37786 -77623 -54023 -49793 51797 96674 77357 111629 69974 -68 -20273
27893 -20273 53315 16633 -27710 -30521 -13815 33420 59162 25101 90761 157156 192900 185192
27881 185192 156499 70920 45480 -48936 -125620 -24559 15543 74427 119264 104613 -31870
27870 -31870 -28743 33083 63688 44341 51239 76661 46083 -4866 -3830 7986 -14664 47186
27858 47186 95649 99957 64426 -29672 -58146 -73078 -50865 -3810 4346 -45568 -25979 -81422
27846 -81422 -122605 -129149 -116773 -207831 -167911 5296 147503 92767 33489 -13331 -68806
27835 -68806 -18760 -2419 -1285 -11188 -49412 -64171 -93176 -103618 -29865 52863 24048 -10251
27823 -10251 -23576 -41946 -39458 -138114 -113661 -75212 2284 14059 53839 62080 24048 -37500
27811 -37500 21187 72502 32238 20833 20229 64156 106675 60627 48592 48793 42138 38604 81472
27798 81472 125013 95432 37822 40288 107293 96871 93496 92052 92340 88551 151969 165935 125863
27785 125863 111287 93596 9187 -38487 117912 198002 94756 71334 81872 125267 110084
27774 110084 110587 83111 48135 73440 65116 49899 67898 108618 91860 64547 -27480 66875
27762 66875 66923 63606 48832 38861 10390 -7223 24352 71706 83732 92337 89636 80254 63699
27749 63699 6282 -69719 -68596 -80581 -44767 -77222 -79446 5428 48143 36244 16309 -38164
27737 -38164 -106361 -23799 89767 80760 50165 80356 57818 5168 14416 75585 59539 6429
27725 6429 -1999 48641 33640 39052 37138 80365 72529 43680 -32064 -9001 -56822 -104681 -36364
27712 -36364 19394 -6670 -71633 68538 160167 13775 -41606 -107637 -33684 -15253 97471
27701 97471 83501 -21693 43483 62191 31194 -17123 -33393 12041 39481 20704 -276
27690 -276 -55112 -76047 -63377 -63664 -58776 -118700 -161751 -106884 -30425 -52798 -63093 -124740 -88207
27677 -88207 -29473 21868 21254 8348 10185 25060 -24930 -81652 -22241 -36041 -56326 -48316
27665 -48316 -107045 -127351 -153002 -145723 -83363 -36877 -24144 -82454 -69286 -78094 -89727 6041
27653 6041 80990 110306 64595 -28618 -45949 8945 97702 74989 34402 34712 57242 30467
27641 30467 -108326 -143488 -71907 -47291 -86679 -1955 55628 -3524 -71620 -107182 -138068
27630 -138068 -92885 -102017 -17278 -12054 13628 4227 49157 116966 43183 87838 128110 111226
27618 111226 36735 -36947 -32110 -56921 -62978 -47053 -62330 -15717 66550 93275 73439 92027
27606 92027 49401 -20221 27669 -12609 -22352 -20314 -40900 -86909 -83724 -69427 -65950 -53106
27594 -53106 -21995 -26296 -49846 -84504 -62120 -29118 -88123 -87379 -41346 -37575 -35266 17371 84744
27581 84744 115656 150930 106728 76457 91450 -23181 -85712 -129258 -103250 4222 6220
27570 6220 -83302 -78877 66229 137447 101097 93240 60147 -35829 -114638 -27442 67834 122227
27558 122227 61641 46683 41043 25670 24944 44450 -16335 -48519 -16661 15554 18694 34892
27546 34892 76895 16979 -7478 46943 89647 43044 -95564 -159263 -164486 -78364 87876
27535 87876 147368 176631 131362 93570 114682 163997 156588 5220 -102757 -98518 -24644 -7961
27523 -7961 -9869 -75217 -64460 -453 25081 21594 22543 43257 27132 21157 -42167 -110278 -103655
27510 -103655 -54452 -20274 -67856 -53809 53116 133321 110393 108058 62702 47530 47977 -15306
27498 -15306 -40479 -21493 -31108 -127697 -40136 42201 59750 -42112 -41843 25294 -34974 -123814
27486 -123814 -111614 -97378 -36981 17127 -33778 -66950 -120506 -138373 -46604 49287 16275
27475 16275 29444 -24408 -37358 -1723 24018 27538 74868 50378 22694 -67805 -10515 57360
27463 57360 -35283 -102326 -65256 13155 116786 -3400 -15806 -7043 -39034 -41768 40329 45335
27451 45335 46414 36220 -2674 -27155 23168 72611 43923 -26117 23608 65164 41726 19370
27439 19370 91646 126088 121238 105257 46655 35592 88500 100351 94377 102122 88030 60999
27427 60999 52303 55830 65251 35067 105562 61068 38778 32057 -44834 -103349 -90176 -39468
27415 -39468 -49283 -70208 -32855 -33107 -8868 65459 113455 131117 33000 13152 33486 71296
27403 71296 64537 72743 36513 88939 65920 106840 152970 118341 62699 72177 55997 12528
27391 12528 6971 -57345 -48788 71109 82035 -4574 -86514 -85774 -61087 5356 56216 81501
27379 81501 12316 -84704 -35743 42397 23062 69576 62243 -17689 -61782 -101809 -100937 -136492
27367 -136492 -64534 -17442 -82710 -120812 -48095 -46037 -80225 -32025 -19972 -8995 46295 36764
27355 36764 -20735 -53782 -76204 -76054 -28127 14372 -33313 -34631 22118 32044 20316 -1747
27343 -1747 -14367 -44080 -22777 13070 -14005 -56566 -46265 -24765 39629 -25392 -434 -9845
27331 -9845 -74393 -144022 -65544 -9500 -37063 -27920 89568 156772 78253 2874 -10980 45189
27319 45189 70459 10731 19959 103062 85223 47742 -44491 -63122 -58324 -73255 -78704 -45319
27307 -45319 18522 54255 87648 99466 -266 -52054 -85585 -122486 -114809 -118120 -103126 -71339
27295 -71339 -56161 -46320 -46448 -26250 -1198 60407 22184 -20844 11819 22899 100504 36547
27283 36547 -20958 -59335 -29835 -94686 -103757 -80336 -117051 -58904 18293 17968 72591 153114
27271 153114 109216 -40125 -56085 -32491 12163 67894 87843 18984 -16155 83582 97383
27260 97383 38370 46180 109386 156138 150349 71963 58181 13504 -51034 -89159 -64893 34426
27248 34426 99407 129332 105572 37017 -5588 23516 37995 9033 31635 61671 39568 16866
27236 16866 -22356 -30890 45118 48384 -55406 -112401 -79711 -59963 -76290 -105888 -73929 3967
27224 3967 -16031 -25667 29283 8564 -42758 -9305 17574 -25344 -44573 -47973 -67831 -77202
27212 -77202 -43676 -41301 69707 56455 5132 -87770 -117541 -135900 -70210 -111066 -112348 -105019
27200 -105019 -113665 -159370 -205124 -125511 -92200 -42289 -24265 -52687 -98120 -117152 -101526 -58886
27188 -58886 -42525 40015 1385 9463 -41622 -21191 38279 48535 105429 154716 110827 72505
27176 72505 28005 -20311 -16241 -45924 -22873 28174 3014 43472 68902 86175 72328 34
27164 34 -34582 -9356 55880 87252 2120 -94435 -51072 -58814 -37785 -7794 25231 16355 -37081
27151 -37081 -139546 -37967 29086 29919 32597 -2793 -31211 19528 127296 129488 136875 142803
27139 142803 52026 -2985 -1879 19088 -24856 -6983 21801 3720 -27063 42377 42621 26124
27127 26124 26216 27413 62647 104230 81038 40618 14767 149117 192817 66542 17420 -29523
27115 -29523 -18650 22614 -21150 16740 47591 -78950 -72970 -37750 -16121 -10542 45893 18389
27103 18389 4423 -4309 64698 123678 41583 -8214 53783 179077 204827 180642 55364
27092 55364 64979 78745 -7621 -14273 6301 -79454 9821 74731 24861 -20860 -20780 18902 -7053
27079 -7053 -1884 -15758 -45734 -27586 49157 84292 31786 40023 29390 41425 -1425 10263
27067 10263 6775 -94036 -37553 -18522 -42705 -96582 -105796 -40581 -59509 -237045 -262481 -102031
27055 -102031 4913 -526 -14521 -56345 -108871 -55671 5130 112160 117063 9062 18543
27044 18543 61169 7066 48194 21735 -2600 -10954 88236 102185 49729 -25449 16310 -15962
27032 -15962 -95472 -114629 -37123 -823 20898 103866 72606 -6682 -93735 -158405 -214143 -128227
27020 -128227 -102473 -107736 -61688 -75934 -77211 -75640 -145011 -106639 1796 20597 -57496 -67405
27008 -67405 -55912 -17663 -24192 -27086 -69348 -73151 -115699 -110204 -77844 33826 32291 -13219
26996 -13219 -61175 -140135 -122468 -102361 -95704 -116304 -107828 -73026 -7322 35530 101906 70067
26984 70067 59748 37299 70618 44337 -71170 -67930 15284 10191 -325 -4440 -20162 -55671
26972 -55671 -17881 18349 57288 148251 160766 148886 171344 104 -74811 -43793 7141
26961 7141 43266 7063 -5242 57859 122187 114023 103543 81165 14184 39120 74062 9351
26949 9351 -24607 -27102 -67371 -51097 29820 18288 29224 -21790 -38705 3377 9200 -50054
26937 -50054 -113001 -163932 -140336 -70820 -27414 -49072 -16424 -41285 -52459 -50752 -76594 -107988
26925 -107988 -54162 7731 -20312 -47998 -74346 -115863 -70847 -9029 -25055 -132331 -230766
26914 -230766 -206077 -109514 -16043 -21348 13450 48381 61359 61853 112527 120660 -5249 -47493
26902 -47493 -35193 -111702 -131086 -156055 -132061 -63109 -33803 58445 170448 92145 24307
26891 24307 -9915 71686 129169 158381 130101 61812 64864 77152 112867 147649 129866 75200
26879 75200 110572 131339 143279 158391 209764 203275 139764 37161 -53059 -56458 -58837 -106062
26867 -106062 -88988 -69985 -60201 1295 90974 102248 108249 104105 701 -53919 23894 79003
26855 79003 74713 -16859 -79697 -12019 69337 102235 12099 -82851 -103763 -101413 -65248 -16873
26843 -16873 26426 69092 143137 82776 -44727 -7535 20804 -42221 -27189 625 -10899
26832 -10899 -111891 -118227 -43350 -28362 -69604 8871 54955 2678 -18542 1774 -7416 40726
26820 40726 15284 40609 13195 -5657 33568 20077 -73874 -168645 -162039 -55033 26222 28752
26808 28752 -18342 -16466 -3810 -4287 57820 38052 -50441 -37166 14113 8920 -76928 -83439 -22703
26795 -22703 17415 79103 76749 109811 117146 61723 66471 118765 140036 49957 22444 10249
26783 10249 9087 27997 -6467 -29605 -26628 -78210 -142631 -110461 -105638 -94683 -58418 -24097
26771 -24097 -64745 -64072 26616 64810 96644 85544 9739 -25094 -73949 -81556 -20427 19343
26759 19343 23647 34348 1587 13421 -42756 -57788 -57034 -13764 10958 -2663 -137186 -156098
26747 -156098 -86027 -80172 -40118 -115154 -72049 -2539 -33809 -130409 -106740 -53294 -1447 33208
26735 33208 19710 16280 14261 2711 -15979 731 -53022 -42798 58777 38839 -68477 -711
26723 -711 17171 14120 20573 -34041 -81182 62323 131513 115089 96962 -4881 17271 -1310
26711 -1310 -27643 -22355 -12328 -70886 -150921 -143926 -107768 -115456 -63311 -78228 -125151 -144546
26699 -144546 -64509 17822 53624 108358 87020 76109 95592 27926 -37537 -80159 53251
26688 53251 62353 80865 81603 -6242 -145706 -131408 -112440 -163059 -79674 -44415 -54298 -120197
26676 -120197 -49582 26747 -58788 -122388 -93722 -50663 -31704 3774 39942 34773 56302 36986
26664 36986 -36111 -135414 -168326 -166248 -124769 -69370 26391 26077 13875 64765 -45408 -21815
26652 -21815 100081 92757 99799 117154 81757 -120167 -127001 34251 -36066 -72668 -5307 -21691
26640 -21691 -45851 -19121 28599 20648 19119 -3749 -49377 -58324 20466 125820 159120 111750
26628 111750 83704 144232 164448 112326 77193 11337 -33381 -61114 -91514 -121956 -141376
26617 -141376 -186633 -76132 32338 48288 16432 -2929 -19440 -20259 -68904 -31527 -65212
26606 -65212 25956 73023 113710 -26550 -48743 -6406 -25135 47105 39935 -29183 -125048 -82335
26594 -82335 -26498 -56270 -88307 -72172 32251 37829 -17259 8646 79494 164575 65091 1496
26582 1496 81114 106776 88758 23164 -35204 -26086 47173 141477 99509 -1490 57039 162105
26570 162105 185042 141342 42131 -30675 -90923 -193866 -199099 -73720 -13947 -21690 -29044 9507
26558 9507 -6721 -127397 -134370 -139710 -156764 -168317 -204633 -190042 -77582 -40636 53284 110970
26546 110970 210117 95214 12241 -2911 -23204 3806 24587 43907 25913 -14815 -37722
26535 -37722 51486 38707 -371 -9252 -23429 -40471 65619 147645 84552 118330 103865 37888
26523 37888 3672 -89056 -194843 -116950 -68553 -43384 33193 58182 68407 56091 -17912
26512 -17912 -56956 -140571 -102359 -15239 -11086 22648 51080 49851 -118 -65431 -39560 39195
26500 39195 44055 5003 64422 60605 44201 35884 32969 13061 -25812 30450 8935 24992
26488 24992 -8002 -80258 -37538 86651 158780 152057 128077 103098 104984 66291 -34557 -71482
26476 -71482 -84234 58392 144010 70508 -29464 -47201 -23165 45487 118593 104078 40317
26465 40317 86767 68200 39221 63696 48313 -1566 39633 67211 92820 82530 132086 24076
26453 24076 -28013 -25209 -122948 -120898 -31002 54161 -12963 -10431 16991 23619 45189 -29043
26441 -29043 -84569 -10617 55676 18443 -118658 -183197 -112350 -87107 -83306 -76455 -67205 -37920
26429 -37920 38505 127465 214552 161510 113950 28643 -54294 -25989 -39347 38836 15594 -45323
26417 -45323 -100643 -98342 -68204 -33226 -35515 -67120 -28248 -6638 20880 115882 129365 98252
26405 98252 75226 65519 13 5491 14250 322 -62911 -71668 -69264 -8906 117659 134617
26393 134617 98943 70905 34954 59753 104100 11073 -39941 -62006 -71468 -60281 14247 19171
26381 19171 27457 114932 93268 75220 97872 155841 85279 13673 -33276 -68416 -109712 -43218
26369 -43218 -65619 -99824 -123659 -129604 -83229 -47400 18388 -29912 48539 11863 -63148 -32635
26357 -32635 15088 7721 -25133 51021 56964 20982 -2025 -15331 37575 -27303 -31271 -71529
26345 -71529 -69379 -47491 -94279 -80007 -6787 51909 18002 -40763 -113762 -97812 -28444 -23987
26333 -23987 -26928 57354 25553 -60340 -150879 -171788 -194454 -167921 -60431 18838 38440 28527
26321 28527 -23780 -47862 -17826 -3319 -36618 8893 131273 138739 10072 -91326 -92317 -56565
26309 -56565 -10847 40311 72441 -24049 -4395 23140 105413 100701 31646 24022 25198 18095
26297 18095 18061 10378 32526 13289 -37698 -33450 -5047 -30371 -127573 -142302 -175672 -190026 -118211
26284 -118211 -62879 -42116 34333 52463 -50500 -138450 -114762 -20597 -1958 28671 14274
26273 14274 -12011 4720 46315 -26947 -142545 -111792 -98288 -161859 -160294 -153572 -144555 -49406
26261 -49406 -58985 -12240 -47126 -107639 -77245 -57403 -43594 18482 30578 27317 9409 67958
26249 67958 9432 94208 70082 2555 372 133524 131065 53972 -71628 -206533 -247949
26238 -247949 -197218 -82711 66244 19632 -5209 40297 80402 118640 96870 -387 -94932
26227 -94932 -101918 -72776 -25802 14960 -10499 15535 51425 71522 22096 -79085 -157385 -142079
26215 -142079 -77244 -1840 -25840 -84404 -121042 -194732 -118236 -72747 -30322 90 -4126 -26436
26203 -26436 -21334 -12597 -3690 67178 51855 88013 86526 111908 73218 46124 -26116 -74137
26191 -74137 -106139 -69865 -23569 31857 102150 61400 35051 6262 -101762 -118017 -70745
26180 -70745 29876 71942 61904 -25337 -41632 -61190 -4033 22976 15771 42520 7316 16744
26168 16744 24818 3313 -12205 -8618 -33659 -101411 -72698 -15618 51947 56173 -2344 20244
26156 20244 46639 68485 58333 -29065 -69361 -13191 68546 95872 38696 33498 11159 -66935
26144 -66935 -140520 -142381 -68177 -1520 -24937 -89483 -46684 62414 107992 195080 212167 60219
26132 60219 -80654 -92632 -73812 13713 7478 -42298 -57107 -64215 -26629 10234 7567 86414
26120 86414 90419 17411 39364 41934 -1724 -92024 -73095 16922 73158 123187 63808 69601
26108 69601 118108 96380 54163 -24078 -88768 -92105 -108344 4477 57283 93850 -7108
26097 -7108 -1356 25941 -93226 -242760 -292681 -196566 -91225 -6650 -25588 -119486 -84761
26086 -84761 -20465 68416 29586 -39413 -81575 -15374 4652 12141 91717 90896 -19925 -156698
26074 -156698 -234245 -162755 -55416 20077 39584 3860 -7944 21799 -53623 -82230 -65782
26063 -65782 -30826 1705 69423 125724 75881 55917 15429 -1711 -24683 -1073 104934
26052 104934 81665 -1115 -19556 -32420 -8088 23395 2778 7080 88128 8840 -39153 -12563
26040 -12563 81774 122716 61203 84984 38280 7683 333 -29845 19835 -76545 -152529 -198041
26028 -198041 -268692 -219661 -202038 -142786 -54880 -92841 -153323 -55039 79623 108036 83325
26017 83325 76393 24286 -11944 -120310 -82370 57496 110863 21823 26767 16047 81162 91856
26005 91856 122082 80780 36294 13604 -29106 -37645 55523 80698 11572 -15382 -28517 34798
25993 34798 63878 -14588 -61607 -657 19347 -22663 4800 13860 -70439 -30319 -9294 -38398
25981 -38398 -25663 10252 43582 99269 169983 110203 55778 26104 38129 77892 63379 47455
25969 47455 -100640 -136285 -105548 -95241 -73322 -91094 -80981 -132317 -240672 -236412 -159713
25958 -159713 -106712 -75820 -14786 -8371 -112910 -143989 -133705 -112272 -169957 -148425 -71142
25947 -71142 -83502 -19496 -29000 -20482 28519 24576 -6600 -22149 -7980 20651 57943 -18020
25935 -18020 -42036 -27288 -10969 -32588 -64456 -12166 -96575 -175264 -217625 -157482 -45400
25924 -45400 38890 58156 77071 -31354 -68986 -119299 -122552 -45576 20397 -44246 -63489 -117397
25912 -117397 -141892 -75278 -6596 -23647 -56933 -71693 -100521 -147757 -137437 -4190 -24505
25901 -24505 -57030 -104378 -102331 -6578 -4499 13538 -12921 71461 68357 33066 -54661 -46380
25889 -46380 -37137 -63566 10466 11645 -29026 -41358 42301 80969 91379 19142 -60032 -85582
25877 -85582 -31271 23027 -37238 -53369 -19146 -33759 -97631 -134148 -92203 -37620 10867 14268
25865 14268 74537 91258 117151 129079 95217 91494 56521 31188 39664 48804 39120 -25020
25853 -25020 68644 77147 -6415 -28699 63377 79153 21243 10261 -2134 54973 95739 73693
25841 73693 -13459 -64041 -24978 -20173 26889 -9886 -73031 -92049 -75281 18308 -14848 -48629
25829 -48629 69121 78436 82364 59884 73878 26566 6672 52886 75203 53207 48578 37641
25817 37641 94047 194127 198120 137225 36002 34931 13979 32181 9844 -13601 32627 85366
25805 85366 58725 -38912 -85256 -3109 64208 49387 -38872 -71935 -58795 -56588 -65218 -103847
25793 -103847 -129349 -108247 -19168 95360 139461 160806 181459 119722 40343 29283 139270
25782 139270 80795 6202 -27083 -8947 -8744 -71155 -158555 -128731 -86104 -21353 15902 -47888
25770 -47888 -78648 -161571 -141304 -141716 -113959 -154235 -110051 -72714 -19508 30260 68874 113701
25758 113701 106087 21080 -4454 11577 73370 37840 -11361 -38621 -19366 -19153 20668 14844
25746 14844 -30717 33565 73803 1575 -27448 -21543 13351 6202 12243 -47347 -63613 -104165
25734 -104165 -89710 6930 55943 2450 -7026 -54967 -76068 -81117 -44937 -16857 -31589 -11424
25722 -11424 10010 -25497 9900 -12059 19242 22911 27624 71009 45062 10692 -433 45543
25710 45543 58466 85084 101140 -367 16353 12711 -50081 -135918 -121760 -88194 -80733 31386
25698 31386 108595 62585 -4867 -41517 -77021 216 24695 -86377 -24389 -20602 -56328 -37367
25686 -37367 -6665 4020 3970 47053 67585 15673 68753 71061 -23358 -59346 -40346 -52625
25674 -52625 -85240 -11377 -16710 -111617 -88498 14685 109683 143987 43864 -7957 -28945
25663 -28945 87977 75232 41996 -10002 -25237 34538 90083 124055 49669 29422 -36978
25652 -36978 -41505 78914 65561 29440 52856 16994 34465 35696 46707 27697 18666 35477
25640 35477 32267 8938 2800 -110836 -123107 -69813 19203 45992 70055 74100 63905 82246
25628 82246 -9191 -64723 -81214 -83174 -45682 -86645 -92948 -44970 -5358 94318 120669 103621
25616 103621 81301 69996 78318 32427 58230 15527 18267 36785 -10530 -32087 45648 86006
25604 86006 42687 -28515 -18759 35643 93439 121928 84725 23086 70510 123012 135065 82116
25592 82116 31947 6642 -37069 23278 68137 100181 494 -11178 -78967 -32892 49471 78331
25580 78331 88460 120392 91169 7792 -16665 -35172 -130900 -58673 -58635 -93919 -19560 67668
25568 67668 46373 35654 4573 14356 -19397 -21296 38017 7542 -34677 -32955 -99553 -117768
25556 -117768 -99972 -119926 -103925 -1600 47730 -2860 66137 1756 14874 68731 68900 41544
25544 41544 39507 12559 -37259 -31619 17798 73745 58125 31592 -4779 57579 100868 60983
25532 60983 -49244 -20471 -35676 11132 14145 39239 26880 -21693 47764 75681 102905 41220
25520 41220 26517 77096 56273 40762 -33685 -44919 -30543 -77271 -159442 -121083 -58383 -39158
25508 -39158 -67488 -55560 -15371 -57424 -128812 -169142 -59976 -22615 42592 109246 95293
25497 95293 110558 107510 -14144 -142482 -138411 10355 153699 110853 -59217 -41331 62503
25486 62503 62659 241 36095 15087 -14324 -28330 30029 21722 78977 69505 11846 22466
25474 22466 104129 158151 77526 20848 36703 32784 65914 106340 107248 59771 -265 16032
25462 16032 127770 159485 140541 -2972 9522 36223 23296 9202 31008 -159 -38909
25451 -38909 -61555 -43104 52112 121651 144193 134974 131797 146551 50903 -48549 -74203 -83971
25439 -83971 -72167 -28268 -23991 -108557 -169420 -212405 -201435 -32334 132114 69896 45088
25428 45088 -16873 -53136 -86740 -49533 61554 -53476 -118197 -167565 -189764 -156982 -171348
25417 -171348 -217829 -117301 22239 5669 -66275 -84109 -71325 7000 -17976 9157 16013
25406 16013 -28511 16424 31111 34827 86321 115477 149866 95401 104676 26284 36810 -43662
25394 -43662 -52907 -7610 39621 11935 -30880 -6342 60800 53729 59244 72132 121222 102994
25382 102994 25169 4180 -77984 -86903 -52461 -119591 -185163 -177364 -92058 -42351 -87075 -126452
25370 -126452 -86695 -113865 -109905 -24311 57973 21294 -42343 20945 14272 9872 -19115 4621
25358 4621 -3713 -39578 -106113 -104367 -62372 40507 35249 35502 62040 54974 -78512 -117256 -82040
25345 -82040 -130842 -88119 -193840 -278346 -189268 -90261 -70333 -52149 -28076 -160070 -273817
25334 -273817 -250320 -174429 -92706 -73035 -75798 -45889 -88668 -135999 -143975 -134795 -71339 -40984
25322 -40984 -15007 -9899 -18499 36521 -143809 -149013 -65806 -27980 -1893 -1441 47334 -15858
25310 -15858 75032 184563 249982 266324 181604 83724 45078 23335 47016 -72375 -101341
25299 -101341 -21636 -13442 -30304 -74336 -207708 -231602 -142888 -146107 -133382 -135901 -184481 -219852
25287 -219852 -239622 -224721 -183760 -153798 -63288 41930 49596 -5356 -33031 7636 -65800
25276 -65800 -63991 -17101 15348 -92845 -24765 31052 1439 -34586 -41794 29772 24722 54049
25264 54049 5893 12860 57581 -2445 -29233 87543 100727 58247 20224 -6573 -43697 -76480
25252 -76480 -82566 -29486 -42387 -72048 -53948 4778 -7517 -74030 -95690 -71983 -22211 -47596
25240 -47596 -13470 35596 61760 119760 81786 44689 -197 -61198 -97310 -5601 9494 -11728
25228 -11728 -21202 -63779 -66540 -39859 -16451 26845 24981 -32408 -60213 12418 79557 50873
25216 50873 68090 96391 67981 22082 66296 -2697 -91453 -100801 -151121 -165796 -89945 -34269
25204 -34269 -61911 -56472 -97648 -94053 -43168 -56273 -123011 -231716 -199601 -125299 -73260 -37041
25192 -37041 -86179 -113551 -100369 -68901 -157774 -199359 -115545 -69461 -89254 -78086 -123842 -175459
25180 -175459 -94910 3965 16274 27697 64365 62255 52217 69436 91756 -45774 -41838 47868
25168 47868 79820 99847 153752 234920 167940 136141 123145 91611 -26091 -61789 -134333
25157 -134333 -116561 -188397 -169256 -93189 -90803 -32401 26805 44631 68429 178955 200298
25146 200298 220923 157956 49457 -8276 -56580 -45421 -30641 12922 9249 87756 53831
25135 53831 15243 82053 127760 112275 60138 33268 -33166 928 39644 50955 130935 85991
25123 85991 46957 30505 -45066 -72794 10579 -57822 -5355 -15888 -2348 28480 90574 131947
25111 131947 134554 74075 84806 53843 118628 100694 73628 71676 12896 -12428 60711 42057
25099 42057 7220 -29455 -28064 -28388 -28433 -82796 -56320 -6668 50339 113799 75051 -61786 -42577
25086 -42577 -16948 -108043 -203067 -188878 -153473 -92110 -41747 -49104 -74102 16625 74884 110118
25074 110118 135144 43841 1413 -73940 -56203 -25058 10152 3473 9778 3491 46638 133406
25062 133406 127773 87686 37664 -45761 -3562 20475 55822 13807 -3417 99461 91603 54495
25050 54495 73784 97493 73047 53796 -21840 -24057 9647 19286 37812 49977 15530 -3142
25038 -3142 40995 131301 34622 9991 71410 43829 -63042 -151169 -97395 14553 33928
25027 33928 -60899 -89154 -26443 30613 -56372 -126170 -181674 -113736 -94631 9776 136746
25016 136746 126149 30372 7192 23064 14699 92994 81180 82396 63296 99238 101724 16011
25004 16011 -38704 -29954 -37513 -9864 4421 -83038 -153593 -34797 75517 35153 46092 27727
24992 27727 37047 67366 79300 105617 79162 41496 30376 73243 35992 79122 60613 -5599
24980 -5599 -34083 -72101 -82177 -30617 95699 123185 90825 3473 -68387 -117765 -34818 -896
24968 -896 95590 47744 -5762 -781 49364 15174 13708 50006 31106 -57339 -121299 -118688 -104432
24955 -104432 -128161 -125345 -37577 11409 3814 -25800 -26331 95186 153165 111949 83433 26697
24943 26697 32880 37484 24966 60315 24859 -43775 -50457 -11370 3101 33940 95800 54392
24931 54392 34740 16207 23384 84014 127752 161987 98214 44608 38095 11397 -9085 727
24919 727 13855 -9596 4875 -19440 -41903 4482 50709 83984 107839 162079 134401 126063
24907 126063 148412 70878 17035 -62728 -85156 -96143 -104947 -78409 22579 17100 -33634 -69677
24895 -69677 -45474 -69551 -67847 27789 84766 109874 86626 108802 20847 -49108 -77220 -33728
24883 -33728 5519 -57697 -23885 49953 52685 -46916 -51082 23786 15448 -4847 40470 33520
24871 33520 40036 7439 -27490 -58485 -18951 -35825 -50437 9594 42196 63457 85440 78332
24859 78332 86536 106993 166289 70403 -119113 -127361 -89824 20468 60559 94906 85513 -45936
24847 -45936 -141021 -80467 -34464 -46872 1552 20119 6458 -130960 -206307 -153773 -12520
24836 -12520 64590 65612 17088 32779 82395 124787 92401 24447 -39092 1778 -7069 -87143
24824 -87143 -22730 4659 -100139 -131825 -134622 -192897 -90851 -381 117142 68665 -9043
24813 -9043 -88054 -100333 -104989 -71674 -62982 -45947 -24648 -43651 -109858 -186300 -128977 -105698
24801 -105698 -42837 -15100 -57386 -24898 23121 15994 26497 -32496 -63011 -39995 -38935 -47646
24789 -47646 -141911 -126978 -88548 -2168 -76088 -66077 110167 133396 118019 77534 105987
24778 105987 42242 -21862 -104450 -100887 -66011 55683 112660 67663 4180 -42827 -6094
24767 -6094 10617 -51774 -137326 -133944 -13857 118362 131996 56709 33173 -102785 -138948
24756 -138948 -85935 -38105 -26474 -75596 -59128 27670 -42718 -86693 -32364 -68341 -76578 -77805
24744 -77805 -48339 -7027 9012 -29032 -62152 -63859 -59993 -8078 47536 -45855 -74827 -69718
24732 -69718 -45469 5274 26472 67439 81493 69945 -16562 36703 57884 66370 54473 -23413
24720 -23413 -82515 -19596 77056 51562 -99190 -131109 -130206 -63972 -96631 -101415 21907 69508
24708 69508 23999 65543 161387 141676 87563 615 37769 80262 -29774 -97164 -22838
24697 -22838 -29494 -25025 42971 89899 43936 -2851 -50048 -81075 -1770 118916 73059 16081
24685 16081 28615 -49852 -81450 -137570 -124641 -51837 24544 169803 131188 43203 -21935
24674 -21935 -69346 -35437 30081 -35438 -54329 -44099 57143 63129 13832 -29725 -22151 34930
24662 34930 -21661 -17097 1288 -95614 -109599 -93606 5482 -55920 -65340 -23866 97029 137232
24650 137232 122643 29695 -31050 35756 107371 36267 -97307 -120023 -74294 -57308 -94019
24639 -94019 -159291 -174649 -114089 -21260 58498 -4598 -17363 -126430 -193362 -124858 -73196
24628 -73196 -46983 -1664 -36185 -49141 -3423 12348 12069 24315 17252 -19172 -9944 -7950 -9365
24615 -9365 -27024 -7569 -18238 -88600 -49080 -32147 8910 78905 131958 122479 31559 29612
24603 29612 47421 20660 13782 -49808 -103483 -31621 -11319 7412 20558 19445 -97699 -74895
24591 -74895 -31239 -59820 -41532 24480 1771 -53291 -119003 -96761 41129 107331 37969
24580 37969 -6678 33824 81923 43677 -51745 -135495 -139062 -20058 -45298 -58806 -48824 8748
24568 8748 80744 39855 48340 50515 34466 23093 -10204 -19809 -78608 -114434 -111707 -46107 -83442
24555 -83442 -69154 20436 -23544 -133861 -174090 -134295 -95842 -23516 -30394 -28521 31953 54841
24543 54841 45714 61669 15843 72112 33269 8195 -15733 -59363 -58407 -35838 -70497 -73125
24531 -73125 -75744 -39979 32516 85305 12737 -52089 -92502 -12560 86843 88112 1240 -97474
24519 -97474 -102346 -64826 -29167 48468 -14928 -59838 -100589 -97831 -47126 34548 89402 11544
24507 11544 -71889 -23729 -5233 -21638 -13254 28324 90274 47810 5508 7131 46954 26166
24495 26166 2251 335 38214 16044 -33202 -76220 -15173 73417 137835 107405 60318 135515
24483 135515 136061 90377 78022 100447 130360 121890 21286 -58918 -35525 6009 17051 -23047
24471 -23047 949 120804 97037 -22042 -15722 35471 14853 -79785 -93956 -81047 30347
24460 30347 75442 25188 15394 -68359 -115079 -93670 -93276 -100347 -88200 -30605 127211 159081
24448 159081 134940 107703 102527 72534 59317 26367 -52664 -24463 26066 88781 108630 112364
24436 112364 109094 38402 -71165 -146292 -155109 -66521 -57669 -70741 -91268 -38725 -51703 -53687
24424 -53687 -66436 -90640 -98824 -97092 -57080 -7334 19974 -78603 -142750 -103333 -8054 -21993
24412 -21993 -85823 -176172 -134029 -48974 -81549 -46978 -72431 -82428 -5525 -19579 31095 29099
24400 29099 -46842 -47214 52783 125510 108161 33929 -20027 -57285 -65838 8203 15856 1374
24388 1374 22944 65676 116832 24963 -21760 -29504 -56426 -92901 -140215 -89561 -59745 -99509
24376 -99509 -72490 -85091 -91617 -131438 -86261 -129111 -72980 -98202 -59424 -46075 -51949 -41936
24364 -41936 -56835 -33411 -5141 -32402 -66210 -23995 -14314 44224 58810 -19075 11888 33236
24352 33236 53201 74072 42951 5827 -45970 -47928 -23428 31409 52955 33462 -29764 -59522
24340 -59522 -29602 -10434 -47593 -3757 -8782 -53289 -56326 -11311 -62964 -55457 19886 -29105
24328 -29105 -81994 -72580 -27073 51831 77627 62496 42831 -14248 42231 123565 134838 86475
24316 86475 17024 -57946 -10967 45286 114239 73863 57428 112623 98904 112217 96380 70234
24304 70234 26579 30455 62148 20380 25045 2690 -17433 -63655 -45558 -38644 -48961 -13960
24292 -13960 -19859 -35773 -46247 -26894 39077 15103 990 20904 60767 -48855 -72615 -71031
24280 -71031 -104566 -111387 1770 32231 47180 50536 56419 10992 -33260 -80647 -136844 -110669
24268 -110669 -70388 -52519 -9406 23168 26844 -22092 -51957 -86866 -41063 -22440 -10182 -69827
24256 -69827 -32355 -65677 -76668 -51075 -29452 1834 -581 -17452 -16569 20914 138423 191044
24244 191044 95449 18667 45444 24465 -42474 108977 149201 61100 -25748 -60469 -17508
24233 -17508 -95667 -119194 -108982 -110595 -122794 -118349 -61280 1775 -11164 -38736 -11138 -69546
24221 -69546 -84907 24801 123650 124382 73668 38529 41228 -30832 -4957 3326 -34089 -86513
24209 -86513 -115305 -110985 -52476 -23507 -75672 -30947 13980 -16467 -41825 -62547 -104465 -83623
24197 -83623 -113597 -135686 -103036 -43283 -82979 -69112 -53812 -23930 -36271 -79163 -50187 -8389
24185 -8389 65680 44488 -515 -29718 -79437 -100331 -90254 -66116 -107515 -31892 58526 73244
24173 73244 137799 146919 29015 -15753 -57636 -3588 5050 -940 -45636 -79035 -115483 -20708
24161 -20708 8949 69293 38885 -17450 -91524 -128572 -88594 -87799 -198482 -304209 -296254 -228326
24149 -228326 -180174 -163199 -216387 -182946 -88908 -73454 -71497 4219 -55019 -79629 -68338 -106671
24137 -106671 -56101 -52211 -73097 -38445 -94986 -122576 -93856 3013 62100 81986 76690 73253
24125 73253 12106 2263 -31553 -124329 -170866 -112481 -48203 -65615 13343 24285 26660 -704
24113 -704 1223 48723 35890 -1907 -74842 -621 52684 91771 92920 35118 -89516 -47494
24101 -47494 78285 126223 96176 12923 -75971 -45933 -54663 -19331 -18532 -71246 -111202 -28348
24089 -28348 -27250 -87725 -109104 -77599 4109 -13437 -77239 -110778 -146412 -43815 139840
24078 139840 179701 108852 80324 32703 29948 68184 99436 8176 -20315 -37856 -43346 2818
24066 2818 219 -15602 -33961 -10918 -50829 -62058 -47103 -66552 -71084 -58597 95 -10558
24054 -10558 -26721 -79695 -121344 -134600 -122489 -94022 -38252 -25999 -63645 -123639 -132822 -154447
24042 -154447 -39324 -44831 -43578 -75198 -54002 -37280 -160465 -119936 -132624 -173277 -166727 -58375
24030 -58375 62132 80415 94787 116368 138350 104300 100254 52003 -42271 -48839 -143021 -278398
24018 -278398 -218681 -111683 -26211 -37597 -81546 10618 -13926 -34158 45713 58013 58348 -15316
24006 -15316 9211 -23394 -92347 -130411 -68378 21736 57280 10920 -110383 -151212 -90820
23995 -90820 -45170 -3884 -15417 39176 44608 1000 32385 53223 -33749 -112579 -23450 44969
23983 44969 71114 60260 39536 50887 79992 105887 147644 126805 57613 -7447 -36838 -57283
23971 -57283 -88313 -73930 -94035 -38231 -41547 25518 33488 -20152 -110351 -66232 -55797 -11506
23959 -11506 -50477 -113484 -198336 -146898 -69623 -76311 -41769 -22776 17803 41975 17302 78163
23947 78163 133709 109127 108193 75526 68184 68643 97229 93858 114987 87886 21359 -5384 -57038
23934 -57038 -152808 -137619 -92886 -17096 12885 3875 -84059 -145167 -169128 -56526 -56846 -111759
23922 -111759 -78794 -75462 -70618 25133 -15078 -85154 -82651 11384 91090 45813 -60029 -67415
23910 -67415 -18336 10875 -18040 -130594 -85346 -154345 -109799 -21010 49567 44742 34060 73470
23898 73470 75792 702 43594 87389 95928 85775 102969 53464 56987 61381 15077 61275
23886 61275 90415 32509 10291 3210 23197 29753 -432 8199 30165 -26668 -18013 64379
23874 64379 74120 312 -14795 -18136 -71010 -63860 -7638 55121 -6830 -59859 -60008 -111415 -28382
23861 -28382 66649 50169 10455 -50910 -40455 -22128 58926 13115 -23585 -14638 -51149 -100422
23849 -100422 -76304 -49334 -3488 -70784 -137437 -99981 -39567 -33816 -89488 -140344 -184426 -75437
23837 -75437 -97193 -166857 -147535 -53333 101275 151149 89265 86100 64761 47915 -14888 -28592
23825 -28592 65748 20270 -64982 -74733 -38852 36951 -15347 -176100 -162115 -128131 -78554 -82431
23813 -82431 -119084 -41092 -8063 12777 15058 65012 12640 6364 8641 16628 36735 64632
23801 64632 17222 45647 44845 40867 -6362 -33046 38157 -32006 -128799 -159705 -156465 -113884
23789 -113884 -84483 -86749 -76066 -1931 -20843 -85011 -52626 38141 106556 112227 73705 82305
23777 82305 75530 96428 70100 86494 49279 -28719 -57336 -154038 -124751 -1407 50039 99548
23765 99548 112088 51492 63945 72876 112222 74491 20090 35595 -28034 -16868 15797 18813
23753 18813 11315 23444 3200 31990 21103 -52263 -124008 -77340 -44035 -71901 -43450 -17849
23741 -17849 -9985 18729 47551 18455 -33021 -118514 -135355 -106341 -47486 -11778 -27934 -50790
23729 -50790 -22782 9974 11302 5603 92450 102497 10378 13788 59999 102143 67387 -39846
23717 -39846 -33323 -34685 -131944 -110315 -45074 314 97928 156277 209941 155536 49809 17438
23705 17438 -41018 -105071 -132582 -75866 -9274 -3020 5686 43706 -19594 1344 40917 -33340
23693 -33340 -31105 -39084 -33120 -89667 -80780 -23845 -23508 -100703 -169301 -95138 -28294 -3995 -44951
23680 -44951 -9633 81567 81343 57685 7865 -108234 -91453 -58981 -14338 -32058 -46602 19452
23668 19452 57798 381 -87328 -111233 -112056 -113823 -66690 -45540 16299 32448 -54609 882
23656 882 13860 -32730 -52031 -120197 -53853 -7693 -60389 -34877 17690 68934 57996 12759
23644 12759 69393 105188 153117 157675 109391 57051 99004 85424 58347 135390 40836 10505
23632 10505 48522 34254 106318 128965 112445 34760 54145 113894 120094 153723 80218 -36849
23620 -36849 -137612 -140295 -114924 -114036 -51488 -60621 -48670 -35325 -42810 -31931 -64161 -85409
23608 -85409 -92489 -45532 -35912 -121340 -139873 -117986 -88750 -27175 25470 49840 29338 13086
23596 13086 1933 -80989 -82663 -6915 -39590 30151 93843 110578 101032 71127 25367 54554
23584 54554 50983 80028 27793 -559 23607 24747 25138 -24424 33782 43495 47211 102926 133243
23571 133243 81234 73740 53476 47308 53217 61370 12434 -12724 18106 33809 58147 32122
23559 32122 -5082 32703 52838 90589 87450 82627 -4589 -37069 -28697 -72816 -62087 73729
23547 73729 41518 514 19479 171200 160259 3778 32984 73305 51839 93889 78339
23536 78339 23938 -61529 -24725 -32901 -59133 -44565 -632 26669 22989 -19998 -176196 -268050
23524 -268050 -224431 -114179 -97832 -131558 -140992 -90109 -79874 -83156 -19741 29399 110691 82938
23512 82938 -1392 12119 -9436 -74915 -139102 -131356 -107232 -140121 -154094 -116868 -38696 16741
23500 16741 -6193 -67156 -87908 -45270 -53683 -82287 -97483 -104199 -79221 -9169 -21750 -41135
23488 -41135 -2321 -50231 -47999 21898 110621 52101 -6931 8216 8959 -27821 -28352 14925 20212
23475 20212 27661 25449 70610 107550 49631 9048 -71142 -103209 -185519 -218742 -122621 -8019
23463 -8019 22787 45899 79171 44200 -47436 -122070 -86888 -121816 -153047 -124801 -138352 -107268
23451 -107268 -122888 -103981 -78293 -119324 -43821 -25358 -97406 -64173 -46047 -28563 -825
23440 -825 47783 48721 82077 69942 90845 121998 63517 81659 57270 -32740 -63599 -75525
23428 -75525 -65036 -97907 -163676 -131387 -109724 -94129 -78439 -59858 -109455 -145583 -161706 -95580
23416 -95580 -72012 -46244 -100482 -42175 16203 14668 -14872 -43637 -85385 -26935 28807 15789
23404 15789 -132065 -153970 -115204 -14014 7489 -16954 -26807 14804 37005 60538 117307
23393 117307 151046 93598 62814 -35762 -67497 -2422 120069 256782 161735 59058 79411
23382 79411 30651 -44376 -1746 -70451 -181452 -188061 -130249 -106194 -97014 19819 5000 -83619
23370 -83619 -180404 -118863 -70091 -97045 -71773 -7786 120587 109779 115618 92935 66238 27918
23358 27918 -15532 -14453 -16908 -29855 -117244 -135452 -134979 -111005 -52034 -53731 -156968 -175142
23346 -175142 -122070 -97678 -77256 10205 19010 26871 -33657 -19955 58530 14838 1089 53164
23334 53164 131100 90394 18150 21748 54218 50757 -362 12770 -19729 -41496 -144927 -233130
23322 -233130 -216774 -105845 98338 101951 32404 -92656 -87041 -72823 11735 34301 -20323
23311 -20323 -48110 -2057 64337 60953 -7797 -137741 -76158 39363 76143 82163 16905 -28519
23299 -28519 -23116 -4779 -14961 -22032 31589 48778 2122 36921 2816 -42820 -119867 -156672
23287 -156672 -79507 -68710 -65476 -62926 -141311 -99754 -73734 -6582 60292 21729 -53688 -59514
23275 -59514 -116351 -119533 -136417 -63122 43022 107842 31983 -50736 -16418 -8068 10314 -43800
23263 -43800 -65150 -27417 -29636 34372 68890 10483 -49774 -36331 -53539 -109242 -115756 -34644
23251 -34644 -76390 -156524 -154122 -64762 -30380 -63346 -189337 -206684 -186115 -142536 -63617 9106
23239 9106 82157 115807 86995 12701 -26366 7030 58505 85044 19793 -61802 -63941 -54036
23227 -54036 -72278 -110523 -117669 -29168 -32928 -16937 -24968 -11928 1956 -73324 -133057 -137002
23215 -137002 -27739 83387 19921 39256 -21951 -60300 -177792 -156428 -29508 -64956 -39736
23204 -39736 -432 62001 55742 23605 119482 192076 104336 114265 37777 27579 41939 109703
23192 109703 60754 -51494 -39826 -103510 -99561 -114734 35944 86756 -1605 19419 -17890
23181 -17890 -92928 -92494 -71954 -14883 57550 102660 33951 -6233 -28852 -57843 -22335 -21566
23169 -21566 -25543 -51660 -871 -1883 62372 100482 109033 47964 72377 119132 46325 -68407
23157 -68407 -79083 -64679 -15839 22491 -32189 -127811 -134318 -5705 65470 73195 41686 758
23145 758 -53201 11424 -13697 -71312 -25492 78709 75629 88949 112796 46933 -68016 -74896
23133 -74896 -47922 -16948 -27612 -26503 -76550 -62842 94388 84889 50619 20231 -39850 -71889
23121 -71889 -24716 -5158 -22475 -53953 -28342 20808 -47401 -117163 -59235 16797 -4154 -81430
23109 -81430 -83313 2398 -72164 -121753 -107892 -59601 -10983 -32944 -10269 85538 51116 -26285
23097 -26285 -84655 -84562 -37262 47077 109184 109766 58888 -54267 -72774 -29878 -144 -28028
23085 -28028 9530 5439 -42189 -131540 -202094 -253515 -186467 -130443 -66114 -25247 -49491 -48889
23073 -48889 -84581 -54412 2159 -29648 -99690 -122948 -77367 -27635 -41224 -39728 9097 -7353
23061 -7353 -113260 -64880 -28496 -73636 -92685 -74668 -27747 -31850 -10792 4654 37310 88924
23049 88924 89259 147932 146351 32532 -50458 -40615 -10707 -42203 -35565 9539 -31973 -73728
23037 -73728 -3734 -31583 -79812 -83428 13080 27329 20404 -7413 -76922 -76815 -62024 -47965
23025 -47965 -13810 -47894 -104836 -185975 -226584 -220536 -110559 -43375 -81534 -67177 -8013 56329
23013 56329 55011 89199 109778 54276 -7255 -42277 -13786 -37105 -41156 51703 81351 78772
23001 78772 -7958 33793 31455 -85714 -74288 -64985 -107899 -68030 18607 30478 2856 -72226
22989 -72226 -123295 -147561 -139960 -76912 -72239 -93152 -69268 -39895 -27949 -22672 -24106 -41741
22977 -41741 -61643 -9481 11183 10812 7959 -65090 -132944 -137856 -16385 -16280 -180536 -176181 -155388
22964 -155388 -111098 -87485 -80956 -27442 47328 42634 22507 -39146 43285 5866 -64742 -48541
22952 -48541 -64442 -90415 -34874 -24326 -47948 -8807 -58516 -86116 -17507 48412 53068 15531
22940 15531 -32136 -51920 -27276 42256 15251 -11375 20558 55792 62518 38889 -11457 -44
22928 -44 16889 57903 35146 24856 46414 13539 -33136 -11785 -17697 69091 109707 77605
22916 77605 32937 98141 113877 62840 23031 14910 24774 46023 36074 37505 1222 60184
22904 60184 43918 12691 3879 -145635 -183141 -185247 -167261 -76167 -96143 -108302 -62605 -100187
22892 -100187 -132316 -129334 -98861 -103402 -120628 -85512 -12982 -13040 -7221 47184 -43709 -117046 -107156
22879 -107156 -127007 -112228 -63154 49040 7181 -33686 -29654 11109 -13802 -35396 10899
22868 10899 30979 2447 -159070 -281299 -311862 -175349 -22940 19308 -4240 -28455 -28664
22857 -28664 16654 41639 -18011 -105770 -18795 8614 -45958 -63036 -103214 -131656 -52013 20641
22845 20641 2479 -16907 39786 45404 -29588 -69321 -85167 -37730 -47074 -56492 -76711 -99657
22833 -99657 -56492 -53243 -56529 -21850 47051 129519 192098 142279 111799 15248 -61273 -59873
22821 -59873 -59326 20377 -10087 -61834 -24751 19774 5251 -44369 -35889 -64647 -13052 -66866
22809 -66866 -120190 -53204 -84192 -130002 -100406 -65088 -88991 -82598 31846 66614 97531 75035
22797 75035 39720 37080 80721 154411 85200 -53178 24893 -26590 -103785 -156029 -53606
22786 -53606 -39991 25132 58495 24346 13234 6082 -49177 -151571 -158163 -98659 -55473 -95511
22774 -95511 -36626 44510 84185 56784 -38261 -89142 -69893 -82605 -112062 -126123 -129083 -155961
22762 -155961 -107790 -41730 -36690 -121209 -117526 -117609 -88033 1169 52432 8528 -54304 -80532
22750 -80532 -45272 95600 99183 101786 69480 32254 7683 10533 -10935 36066 96786 54988
22738 54988 -40748 -27355 56884 15917 -55073 -66717 -27877 35717 111189 89649 12967 -40589
22726 -40589 -9158 -10913 -23438 -89214 -116331 -55707 -44817 -42476 -26665 25530 79743 90974
22714 90974 84586 38074 50008 2843 -24770 -28876 -98279 -173497 -174072 -103271 -72204 -61169
22702 -61169 -79492 5028 -14278 -48710 -37157 -104740 -129478 -126263 -62288 -32361 -34836 -39063
22690 -39063 -12237 44903 22994 10307 -22304 -54811 -85273 -38549 24318 57930 85053 -6091
22678 -6091 10826 4233 -26065 -37043 -13606 -23012 39665 -45644 -101249 -63822 -89039 -41175
22666 -41175 -29104 -60204 -53294 -23299 -10122 6301 18583 -36838 -22476 51553 87648 9485
22654 9485 20667 42502 9514 -17894 -21200 58668 93197 16058 -37359 -36371 385 21907
22642 21907 55207 23662 -70970 -185920 -179170 -120988 -89516 -128699 -65402 61614 -2217
22631 -2217 -23982 -43676 -62721 -25366 -96707 -110645 -69925 -15657 64639 98586 11823 -76519
22619 -76519 -45692 22968 118915 153675 174391 148854 21322 -19941 -46312 -31799 -7892
22608 -7892 41212 17501 -723 32914 31058 14642 -25817 -36258 -90629 -108909 -98636 -71729
22596 -71729 -12239 66588 94920 43427 36469 49596 18349 19295 -106449 -188262 -230605 -239503
22584 -239503 -212964 -191258 -116366 -97720 -102666 -6373 59393 80267 163552 202726 125016 131633
22572 131633 67998 -54540 -148940 -100345 -83262 -109730 -141733 -159161 -57135 -74335 -147167
22561 -147167 -156128 -74844 -104862 -83047 -57659 -72517 3846 56719 65277 63168 122905 138549
22549 138549 138404 56629 26127 24632 -17421 -64530 -82922 -142132 -188734 -221108 -174930 -25807
22537 -25807 16992 77530 -23391 -115575 -95653 -68944 6725 -61007 -179173 -237727 -246206
22526 -246206 -94665 -2411 -3611 45004 98333 60866 34771 -32682 15044 79342 94031
22515 94031 64902 51100 -62893 -89340 -97162 -72845 -83009 -13267 17107 -13855 -33792 -99715
22503 -99715 -148063 -199973 -178032 -70666 5836 -31602 -97707 -28423 6349 -22572 33016
22492 33016 61956 48349 40277 -32342 -20876 -26838 -19079 55974 130549 217343 175901 100034
22480 100034 -32157 -30296 -47438 74313 64630 -36682 -55944 -9564 27243 -87925 -176531
22469 -176531 -191072 -154410 -100487 -15864 39581 90772 124296 140728 72240 11516 -35904
22458 -35904 -60458 -29451 -35599 -17011 -12909 -21128 4932 59954 44840 23374 -15415 -58556
22446 -58556 -61131 6465 68608 78560 108826 65824 24049 45395 -9587 -81040 -79254 10034
22434 10034 -22392 -43053 12570 -25814 -113649 -178136 -119985 -117162 -98994 -185479 -212566 -151885
22422 -151885 -15000 77708 79782 11529 46633 67932 27695 -7964 -47224 -38530 -27630 2843
22410 2843 -11831 -53293 -54292 -27261 7139 20897 -7184 -13564 54742 71468 68559 -18649 -85930
22397 -85930 -83959 -36043 -34225 -18372 41260 128496 175922 91929 72891 40093 40662 31678 -13401
22384 -13401 -69560 -132386 -119427 -153623 -79303 -1059 -35659 -65201 -41154 -191782 -158625
22373 -158625 -123417 -79811 -72740 -28435 -38040 -32382 26375 3681 -33328 -4997 -34803 -41495
22361 -41495 58060 63598 73123 101890 144218 6451 -13685 -1208 36660 156179 181268 177417
22349 177417 110568 -5085 -86763 -200606 -219424 -52006 28796 5259 -35867 -16403 16362
22338 16362 -41988 -29638 -40231 -21435 -49819 -50454 -5596 -91394 -91631 -4463 -35258 22646
22326 22646 42255 -1710 -90545 -131412 -79680 -9105 21122 67076 70095 163548 101559 -32690
22314 -32690 -6412 33822 -16319 -34208 -9177 -7272 -27760 -4680 -1306 14419 -44828 -31584
22302 -31584 24794 73759 23149 -61292 -91132 -30779 -104266 -110474 -99510 -50926 -17656 27804
22290 27804 -45762 -75621 -31676 -627 -17509 -30880 32762 75391 109879 125638 117426 36489
22278 36489 20686 52906 58660 4953 -34296 -81859 -7104 3208 -19658 51522 68951 82038
22266 82038 115425 161952 145092 72519 6526 -46432 -30358 35532 38929 35233 38770 -224
22254 -224 41800 5354 -19878 -17119 -51615 -14103 37430 66824 77076 69398 71793 73451 22033
22241 22033 -11036 -47796 44744 57689 81000 57914 -11042 37767 75549 31097 39955 88818
22229 88818 72924 84042 15501 -67644 -58956 30059 22583 2040 5222 38300 87342 92618
22217 92618 113564 55101 40893 37177 68260 35611 58552 51065 22946 -34574 -19203 81258
22205 81258 67872 23145 26498 -22472 -22456 -24199 -57213 -89138 -71308 -52960 -118479 -178499 -116299
22192 -116299 11988 95153 -8055 -55067 -8039 102346 155849 110200 31659 -31915 -74568
22181 -74568 8926 70315 53893 -44485 -72209 -47212 22410 14925 -48791 -94746 -119768 -52628
22169 -52628 -40963 12026 58882 57008 14916 -3610 -53785 -34896 -117829 -126020 -61219 1476
22157 1476 -29798 -1901 48630 69780 26617 48767 1320 19647 -15581 16807 84044 87478
22145 87478 -51114 -59842 33864 59094 20449 -42819 321 32199 16668 6117 37348 -4332
22133 -4332 -53389 -79702 -51871 59965 11709 6347 -53587 -67407 -33415 -58518 -40014 -31342
22121 -31342 17492 10514 18856 -5703 7077 57476 147012 95414 7504 -30865 159 51175
22109 51175 57384 70578 44229 -13006 54079 89190 -20766 -24788 61471 45380 800 19531
22097 19531 -24191 -88172 -98756 -106838 -32062 -28038 -45266 -82659 -31328 -29501 -62269 -46745
22085 -46745 -18901 -20985 67903 63775 53379 -80366 -45803 10092 -19420 -22224 -19109 -51519
22073 -51519 -13285 21471 16292 -91866 -124015 -43596 -33746 -94741 -122009 -53157 41782 60339
22061 60339 24753 31867 32013 -23693 -74685 -114148 -31075 -46676 -23337 -71511 -18832 46641
22049 46641 42398 -849 -59200 -136168 -109915 -61004 -35589 -31841 -7772 36021 10325 -23332
22037 -23332 -9135 -15205 -62059 -47204 4199 -85251 -99539 -168347 -115942 5728 -17877 -69931
22025 -69931 -99163 -136676 -162620 -85357 -107380 -96410 -144357 -119667 -11743 70836 120322
22014 120322 82864 -22193 -87778 -182153 -178098 -83013 -57020 -55613 -26200 -76121 -140582 -147645
22002 -147645 -100662 -69385 -28413 72529 140573 77455 51367 57470 -61612 -111156 -141246
21991 -141246 -72185 -96823 -138804 -65783 -12989 12196 19133 -24321 -59485 -85380 -72350 -7948
21979 -7948 -89503 -38733 18251 8716 -26420 -114328 -127911 -33109 -31631 -28178 -23577 -19878 -28526
21966 -28526 -25936 -36486 -20473 1216 89315 51564 -11717 -20017 -51799 1209 112856 102331
21954 102331 79627 20573 -76138 -133592 -50363 -75516 -79042 -110925 -120482 -70465 -47705 -35234
21942 -35234 20120 56716 -50938 -111019 -16608 32166 -2176 8017 -3256 -32269 -7759
21931 -7759 -84097 -133054 -44927 -57446 -154376 -159544 -35920 43664 33641 113972 128012 74188
21919 74188 82597 112720 22783 10009 -9045 15706 38813 63749 -30286 -105803 -71653 -31058
21907 -31058 -32868 -33587 -48348 -38042 -29857 22804 -23605 29330 58802 82404 56587 398
21895 398 -42305 -9392 -95050 -139131 -6629 34105 11486 -41263 -12221 -39906 3831 27182
21883 27182 74653 63878 4404 -61972 -28261 38707 46779 109699 77643 43633 66685 166273
21871 166273 151481 52545 -45916 -3012 37066 129304 93882 96074 81585 8453 -55020 -38883
21859 -38883 30750 -5211 -130307 -91959 23965 103369 61771 66922 68837 124273 30580 25539
21847 25539 6253 1793 -24049 -4361 -9272 41123 64292 2399 -97849 -219164 -269572 -202235
21835 -202235 -92001 -36746 18408 14701 -74659 -81844 -61031 -67058 -29731 -77163 6326 130752
21823 130752 127655 39384 -77246 -114413 -56312 -36254 -25949 -23249 1899 62630 71650 97803
21811 97803 24332 -3224 -18259 -17273 -30426 -43512 -44571 -67838 -6681 76009 15626 -55137
21799 -55137 -115274 -138657 -79792 -27064 -5963 -21763 -44618 -110363 -115212 -93216 -89707 -28915
21787 -28915 -41823 -112837 -144073 -130447 -68681 -76015 -145044 -171468 -109033 -12707 60870 54866
21775 54866 47605 115425 91599 -23905 -29552 -104771 -167715 -124161 -38833 -8785 53159 -1713
21763 -1713 16112 59682 37704 46437 95585 44366 20594 9682 -16151 14956 -743 -77313
21751 -77313 -85545 24036 81462 96798 116889 49935 36904 83925 47991 -55876 -97104
21740 -97104 -42250 24664 96549 56117 53889 87963 48677 53925 -12791 -112053 -93968 -122441
21728 -122441 -139323 -126679 -139823 -67272 -138867 -179748 -121878 -85898 -5454 -50025 -40008
21717 -40008 14839 44171 18209 -87275 -140312 -123628 -37304 -47735 -100516 -96969 -46715 -33332
21705 -33332 16172 24412 29290 89045 38734 -29490 -30886 12595 -45372 -88552 -32397 -17056
21693 -17056 -44743 -62335 -99572 -137452 -101087 23921 77042 92221 96224 41519 -10373 -16031
21681 -16031 21664 46718 10597 -30177 -6926 78730 128190 122351 27138 -13051 20185 -24669
21669 -24669 -25941 -26900 1252 71027 41754 -29383 13517 -640 -77263 -80400 -39253 -14375
21657 -14375 -137470 -177079 -64715 -75203 -153454 -175914 -133724 -161860 -146090 -111667 -78414
21646 -78414 -93124 -2833 67696 7985 -64449 -65985 -79743 -135889 -200402 -151912 -96796 -178485
21634 -178485 -138090 -118995 -756 4746 -28652 -122936 -163597 -11320 -25526 -45774 -40680
21623 -40680 -96433 -180538 -260776 -211986 -72269 73923 29329 16951 10627 -40490 -68563
21612 -68563 -34244 29225 -256 -82418 -83144 -116552 -14854 91682 73740 -41173 -54973
21601 -54973 3733 -12199 -113724 -128963 -107920 -10597 89744 102185 31951 18685 18524 49266
21589 49266 24898 10889 -43990 -76735 -152506 -178153 -100202 794 17442 -21701 22720
21578 22720 61297 34800 91338 82283 110749 37906 66485 89039 15616 -27245 -60056 -64658
21566 -64658 -81332 -58529 -53559 -122966 -94185 -141019 -190237 -201805 -133569 -59926 -16155 -20079
21554 -20079 -77166 -18055 10677 -62588 -50859 -6909 90415 43271 -140 5481 29721 25752
21542 25752 2384 -59929 -105241 -77920 -50942 -23205 -22276 -39659 -56938 -141506 -184590 -85421
21530 -85421 -92686 -66676 -28867 51097 36714 -69506 -93630 -152627 -173984 -144316 -130856 -99789
21518 -99789 -69481 -71575 -63892 -95390 -92349 -70545 -36627 -13031 -41025 -30763 -16102 33348
21506 33348 2375 -15877 40839 68249 59624 82332 124298 18965 -10070 4451 90707 103461
21494 103461 114671 85235 -15166 -70140 -116796 -101107 -92458 -142224 -139374 -93947 14753
21483 14753 45356 59567 -20794 -52291 -65830 -74038 -69486 -998 -35980 -83976 -119775 -81920
21471 -81920 -88410 -37913 -33370 -16844 -28197 2718 33992 18124 53974 19544 -34982 -24382
21459 -24382 26560 -13687 -48753 9709 62896 79416 128425 142848 120743 134226 138901 46328
21447 46328 69589 136112 192713 168996 127346 37905 -29768 -89736 -56422 -14337 -18530 -73649
21435 -73649 -84525 -107947 -98630 800 37397 27432 9829 58430 111822 55600 10818 35322
21423 35322 -29856 -88348 -120545 -134931 -79183 -28153 27022 25500 1565 -77371 -143867 -125284
21411 -125284 -39873 -20821 22760 41578 -48252 -11346 94488 66972 24565 46277 124089
21400 124089 107618 50817 43316 18615 -52500 -81506 -119541 -71162 -154340 -132961 -52586 -53883
21388 -53883 -190805 -206655 -102462 -52252 2544 -12658 -37018 -167202 -161120 -137737 -131510
21377 -131510 -133744 -127168 -31246 -55006 -122373 -209967 -193836 -175667 -176687 -155545 10626 31443
21365 31443 57236 -32494 -104793 -124440 -127471 -87809 -45428 -41805 -14885 -4723 -48855 -29577
21353 -29577 -72476 -82092 -12749 38588 110924 86456 7742 42813 -51043 -90929 -26314 12756
21341 12756 1736 48100 76568 65001 56056 -34123 -23020 85977 59389 -9418 -56881 -58829
21329 -58829 -18922 -31239 -3117 83829 123971 57851 44976 7561 1865 -55714 -28377 23462
21317 23462 -73137 -176150 -154221 -39055 57138 91858 113290 119641 150817 91488 37521
21306 37521 63004 81669 60720 -28718 -33747 -2671 -88153 -124753 -70699 -83078 -111251 -143515
21294 -143515 -97467 -1160 35205 91692 81774 -32991 -44844 -59828 -73290 -126718 -134680 -122819
21282 -122819 -45761 34262 59779 33688 -31943 -7693 -6953 -33862 -85822 -59098 -58841 -60437
21270 -60437 -14144 -5318 -63557 -69598 -166416 -175792 -79578 -62348 -39898 -46720 -115511 -162859
21258 -162859 -9003 74242 95763 121226 42078 -57638 -41208 -50594 22539 35971 31348 5322
21246 5322 -80179 -112673 -191603 -170230 -79984 43970 67164 44260 35608 58688 16081 -14992
21234 -14992 10478 16804 -12634 60293 101070 30631 -63061 -22887 39411 -8860 -31633 34687
21222 34687 21349 68041 78873 77979 100697 107653 96342 33656 9394 -42247 -20249 -13946
21210 -13946 1274 45449 14887 74523 49789 2121 12781 61516 13466 -140752 -149134 -56503
21198 -56503 -5183 22702 -66123 -126464 -197329 -217742 -163435 -104908 -61804 -30954 -27674 -122957
21186 -122957 -85613 -153630 -63928 -6489 9011 49358 29177 -68251 -99725 -29326 58317
21175 58317 108135 67561 52469 60703 3627 -47174 -113026 -109827 -79993 376 32822 43333
21163 43333 27331 73992 120491 72456 31005 29257 -42605 -61831 -46571 -50557 -80218 -155433
21151 -155433 -143367 -93798 -79276 -68795 7381 -4200 -90987 -131921 -85621 -8414 16011
21140 16011 31945 21901 35793 88122 75556 136738 155748 131709 43040 -6106 56210 46781
21128 46781 -30041 -67099 -99026 -78993 -141767 -195083 -148263 -92416 -52864 -52590 -63471 -80150
21116 -80150 -46257 2458 -16114 -1378 25860 -20742 -96840 -75231 -18879 -29284 -46024 -51588
21104 -51588 5650 70821 36432 31412 97007 72809 10633 63107 22786 -42336 -25408 86607
21092 86607 92335 41381 13487 -124185 -166391 -199489 -207399 -210982 -224509 -150826 -68175 -27492
21080 -27492 -6863 -63836 -58750 -35207 97959 117612 91296 125762 115700 81980 -13719 4138
21068 4138 60557 -28657 -91197 -125265 -98393 -45937 -101693 -126281 -14237 90981 65244
21057 65244 139779 220918 192335 148981 99806 126028 120530 65159 -24525 23473 36469 21135
21045 21135 48798 31253 6765 -40641 -73532 -19354 -17747 -31886 -197 -37951 -15800 64203
21033 64203 136893 110901 124236 31019 -2912 34059 71930 87874 121324 103959 97393 42861
21021 42861 -40168 -33848 30868 -11418 49310 44390 20887 -12756 -41311 5466 -10383 -566
21009 -566 -108115 -121706 -63501 13245 43807 121089 34600 -49345 3862 35589 -32192 16757
20997 16757 46882 33509 54873 116991 112042 30267 -22613 -15660 248 15687 3193 -44049
20985 -44049 -24417 9181 -19412 29136 -37597 -29335 -14553 -41312 -48878 2547 -12049 -44745
20973 -44745 -58920 -52871 -22234 5994 -9853 44273 42275 -4738 -6033 18805 29511 16177
20961 16177 -26257 -87835 -98599 -3891 14623 -9019 51987 50099 78181 134692 111679 29210
20949 29210 124435 168563 154166 166469 170793 164013 146951 73548 17014 26646 33302 -2267
20937 -2267 -3639 -48443 -77034 -146318 -111883 -26337 7299 15558 -11914 -45480 -16564 1050
20925 1050 -15843 -59031 -89079 -130702 -155731 -166342 -190320 -115982 -57116 -24966 17712 44663
20913 44663 132407 96751 -2545 -23306 -24715 -57947 -24280 4443 -7359 -16881 35792 2645
20901 2645 -10436 103492 153773 136521 125928 73559 32434 62016 129625 105853 8105 -35063
20889 -35063 12022 -43199 -3113 17467 62865 52852 50621 103733 113209 145537 124937 158407
20877 158407 118178 26035 850 8414 37192 -24409 -155238 -209833 -216922 -211763 -99771 4832
20865 4832 -30894 -19165 -43171 29674 54041 -37763 -36656 -65864 -40457 4134 72292 62721
20853 62721 60696 56425 38674 50482 90535 23792 32342 101551 90748 85753 59200 57350 -28642
20840 -28642 -38638 -51113 -108194 -105087 -118248 -127650 -41056 34458 85856 110077 45268 95798
20828 95798 229560 207175 83626 -32928 -69572 -122992 -48336 -23086 -14371 10678 29562
20817 29562 13108 -36879 -120785 -184416 -118195 -28235 -2896 -5189 6624 -19660 9973 40240
20805 40240 -43508 -43543 -29302 -86966 -131347 -38214 -246 31777 60753 47204 6908 -59042
20793 -59042 -87299 -86080 -48497 -25631 -53152 -65199 -80696 -112440 -77943 -49367 5858 35624
20781 35624 10068 -19573 1910 49956 81795 58373 7414 -53414 -110314 -117422 -51020 2799
20769 2799 -55993 -76557 -15099 87871 28510 -26840 62803 62890 -43063 -19189 29313 -37928
20757 -37928 -109931 -135279 -104196 -79719 -41662 -30596 -31554 -89333 -174718 -92696 -33889 -24269
20745 -24269 -41200 -16298 37913 101343 99410 59496 37844 20655 41427 40406 -14201 -23632
20733 -23632 -28824 -44983 4173 52730 74681 34515 16283 14135 58105 102194 141103 92501
20721 92501 86130 113476 83516 105363 55646 32962 66268 93085 35875 88365 1868 43739
20709 43739 111128 126090 55118 -72895 -92757 -60492 -49298 3910 2545 -14746 -5924 41198
20697 41198 10886 -42937 -101176 -87292 -88653 -111004 -40879 -43574 -105212 -140094 -93155 -115962
20685 -115962 -94190 -41712 -58082 -145521 -117091 -67204 4284 -7328 -25869 -66780 -54835
20674 -54835 -67083 -63491 -61630 -56086 -18764 -64689 -98625 -139293 -178895 -146284 -32356 -64957
20662 -64957 -155986 -109009 -105719 -89756 -90359 -80013 -64065 -68180 -9845 62514 75560 73627 -5794
20649 -5794 -131400 -61448 -36027 -55769 -71411 -114095 -52282 -40585 -140100 -186426 -87279 -8971
20637 -8971 -52125 -115609 -147470 -117781 8423 10423 26489 46784 35204 8701 74781 91782
20625 91782 74785 78700 32728 56278 9487 10594 -46756 -44395 3837 9301 51728 43718 2552
20612 2552 -6297 30918 95993 54673 4284 -55367 -185642 -211215 -148191 -100296 -72115 -81924
20600 -81924 18782 118082 98327 37546 -7639 -95136 -73013 -52290 -44737 17501 52127 69198
20588 69198 40250 -41407 -36381 -34810 -594 -46407 -37471 -53647 20536 70768 51172 31574
20576 31574 -39436 -30003 106876 209976 126771 24076 -3950 -87788 -138614 -130482 -112487
20565 -112487 -86241 -55853 -1594 19519 50983 75125 73635 56285 67784 127357 112824 86102
20553 86102 72929 46619 32197 96763 100055 141643 137216 79816 39342 112607 106208 102125
20541 102125 84191 -16901 89871 100076 45961 -14532 2173 -61971 -108681 -57130 -33025
20530 -33025 32126 18834 -419 15846 -43573 -68964 -53812 -44774 22907 61948 -646 -31728
20518 -31728 -12070 -53820 -56756 -2343 16097 -14667 72128 32278 71627 94567 105953 88978
20506 88978 -11150 -14543 30267 11554 10391 -47745 -53525 -7006 -41595 -13323 -45738 -79749
20494 -79749 -43640 12136 79787 145688 166243 104046 82893 74879 3112 -88956 15 91406
20482 91406 98619 76840 82315 47879 12142 -78507 -76558 -15398 -56345 -66482 -116794 -86352
20470 -86352 -44199 -96393 -208377 -231917 -131252 -43348 50040 76954 48404 3763 26886
20459 26886 65731 43351 -12238 -84578 -73668 25473 -17458 -29993 50690 87209 22419 17337
20447 17337 -21883 -40217 -50172 -34872 -31648 -13186 -32348 -14064 -91044 -76814 -10072 -80836
20435 -80836 -107104 -10831 35332 18088 54786 116297 125790 98524 51792 27348 -60227 -88619
20423 -88619 -44122 12744 89555 152574 94905 6548 -17596 -55501 -57202 -56472 -39730 -13017
20411 -13017 -16356 -3219 82309 94651 138870 122919 183284 166763 37252 62553 38969 53675
20399 53675 76605 81269 59663 130822 221617 204716 119644 89041 130282 75203 75029 69382
20387 69382 -19868 -56047 -78526 34332 107561 105721 107045 6715 -13679 179 -25088 -135003
20375 -135003 -193628 -224061 -215004 -91547 5239 82725 49317 93859 121168 122881 73143 1762
20363 1762 7088 -11969 -21140 -35714 -90944 -4088 30755 119377 108932 -1588 -47696 -28596
20351 -28596 -65765 -2771 62495 30678 -18855 25770 -36056 15331 12944 26581 8475 -16465
20339 -16465 -20934 -55619 -67964 -55535 37365 66258 67944 90151 71512 33580 78636 93242
20327 93242 23413 -22549 -23266 -7341 21551 105047 100387 111203 110320 73310 15374 -36629 -48671
20314 -48671 -15066 34121 52770 73225 73357 83652 107336 72402 23715 -8220 49393 34283
20302 34283 77468 133891 169535 95857 60985 60027 86837 46160 39274 83233 108228 151602
20290 151602 59003 15087 53998 54597 63278 95124 68689 71915 46978 50741 133057 116899
20278 116899 77550 50079 -9111 5738 7310 -13489 10737 -8463 -28253 -72388 -99782 -80096
20266 -80096 -1585 19670 -19724 -75775 -34889 25058 6773 -8994 -53509 -15547 -614 36520
20254 36520 -45977 -72765 -61967 35919 22812 -80492 -99777 -85651 -104593 -66224 8985
20243 8985 48477 -40505 -119009 -163559 -130904 -73370 -20988 -531 135331 131116 131057 185964
20231 185964 202751 90161 -57871 -116704 -115859 -138431 -108706 -77207 79232 93119 49753
20220 49753 17581 51165 59209 50360 53405 61329 84920 85431 81464 176369 242817 151292 61002
20207 61002 69242 51478 22532 22705 104012 133560 116299 35805 -75667 -127131 -173282 -101147
20195 -101147 30339 97476 115423 71321 108335 73722 -3534 17603 -17500 -35097 756
20184 756 8918 -42156 -29337 -53386 -79087 10844 119437 129465 84327 81343 41061 57751
20172 57751 107560 23280 86222 82621 -5604 -71054 -117450 -51572 -67732 -25536 116574 24373
20160 24373 -18679 -9725 -76710 -31801 16908 16369 62354 46943 52374 21116 -44178 3446
20148 3446 2639 89438 41096 -2292 45982 65861 74331 43116 -19935 -58769 -61586 -100688 -6735
20135 -6735 72552 108543 122775 72887 42432 88856 124528 98198 9703 -7108 51413 72141
20123 72141 -12903 -34505 29509 60333 31331 110470 138599 94261 61815 87624 106593 51178
20111 51178 62545 91573 14278 -38775 11896 -14052 -8327 8046 44878 123540 181174 230360
20099 230360 203972 136407 149824 121483 12714 -29066 -67172 -86495 -86586 -8042 40805 3246
20087 3246 45188 73558 40028 77642 125462 183731 119289 79962 30288 532 -17816 -106246
20075 -106246 -80743 -17167 30801 121446 129557 117343 81099 114805 100148 87348 42877 9028
20063 9028 56565 29211 -5719 -43751 -2492 830 -11231 55110 50028 29549 78484 136994
20051 136994 125332 117941 45496 15427 -16109 -36315 -33312 -113975 -30056 107228 208001
20040 208001 178994 123038 78295 75731 71690 146649 170058 70798 8115 49552 58914 -1953
20028 -1953 3401 76394 65553 88989 110228 23338 -8238 7241 -6497 21095 47801 80199
20016 80199 -7512 -139605 -146466 -107291 -53092 87196 99712 5375 -19616 51371 101021
20005 101021 123490 105685 104257 120833 90797 -21463 -22796 33268 96398 75760 19630 19731
19993 19731 3501 -26124 43724 61032 18122 17549 55958 8898 18190 67779 93286 37619
19981 37619 32172 81827 135190 68813 15660 4314 47986 46849 75857 120374 72609 70009
19969 70009 72180 46051 14989 51175 16064 -16856 -20970 36604 -4532 41370 157622 210596
19957 210596 196004 158481 190046 83847 -27264 -68350 -15906 39948 15917 -41099 7880
19946 7880 -12437 -14393 -20634 10432 74357 117308 89699 53972 98553 84054 89592 106800
19934 106800 123422 16421 -30277 35628 61502 123465 84331 41121 53643 109632 108597
19923 108597 62338 11404 30410 48988 53988 59912 73764 71913 33078 80044 72338 607
19911 607 -78005 -119655 -99184 -64048 -15292 33754 104549 109212 124936 116951 71982 31231
19899 31231 -1967 6391 -35614 -74799 -6929 52447 60579 82913 33508 -13070 2480 12040
19887 12040 73910 109012 74431 86320 45997 35822 29500 22302 -11212 -14483 -1358 73101
19875 73101 52316 -88683 -49919 -4085 49629 70500 -7250 -37245 -1803 -4121 -31370 16965
19863 16965 42021 32794 -77062 -166575 -155687 -17366 135255 163952 74208 6166 54692
19852 54692 106464 53185 84445 63804 2012 56421 94926 -9458 -86893 -66005 8407
19841 8407 159896 150318 132819 108830 90900 116387 65965 65556 61380 142894 127306 60409
19829 60409 71256 126512 178766 204984 168061 109412 93073 159756 177865 216201 214818 133314
19817 133314 1853 -113446 -51088 30532 27231 22588 39260 42158 69044 117055 88037 137950
19805 137950 104707 35470 -5431 87197 117551 54335 -12951 51166 -11563 -794 18785
19794 18785 -19623 -59639 60665 165561 168319 114287 103225 82996 2915 -15767 -32273
19783 -32273 8876 60848 65170 125775 155024 131507 116529 104863 125398 132913 50609 -11905
19771 -11905 1804 7503 -12618 44623 123544 89519 47081 53272 41467 55094 29170 29740
19759 29740 -23807 -23191 7943 86952 226682 291743 269229 51619 -83034 -63291 5299
19748 5299 21141 -18359 27610 35844 -42172 11888 116372 134509 34669 76249 89308 25927
19736 25927 7076 -6419 -45744 -88446 -94830 60415 85351 -35450 29958 100734 81639
19725 81639 101505 140472 -247 -5843 4612 55798 81387 111358 122082 64831 81134 4905
19713 4905 34581 27195 58729 61449 34604 16518 62273 72084 33709 110169 91676 25822
19701 25822 2088 9983 72184 115328 93880 17440 -19581 -36335 48051 105818 147172 184237
19689 184237 220252 209488 83246 -69346 41166 142776 81811 -42848 -10230 17114
19679 17114 -12873 26570 32049 -6012 -115101 -69434 -20459 -31903 -16938 -70594 18070 88762
19667 88762 57935 40607 15228 -38173 -51370 62847 150589 129444 149781 134878 57127
19656 57127 85403 129026 153886 159610 109166 107121 164219 132455 35173 22665 116844 199080
19644 199080 148449 61754 101992 193155 192572 185108 215950 157707 213679 168378 143557 134905
19632 134905 186704 344205 478245 539188 615004 745563 954769 1345230 1846192 2237849
19622 2237849 2302809 2252633 2206878 2288549 2453424 2422639 2108808 1593812 1126528 750240
19612 750240 516531 415785 439553 476853 453708 278665 277475 295339 216224 276382 267029
19601 267029 309379 335267 321152 348946 268323 169394 111230 178832 339175 484060 420029
19590 420029 384525 342504 257915 262355 259068 302022 256377 169511 96182 51193 62915 56517
19578 56517 103013 137940 106454 174716 235501 268945 243802 234141 265346 213530 188657 293200
19566 293200 346022 253067 202005 143985 124728 182238 100708 73699 24646 53596 121926
19555 121926 176631 243164 208424 128754 49861 69160 150709 162734 132832 194694 163594
19544 163594 154310 204484 150450 86459 68046 71819 60368 30778 57175 189797 217512 153005
19532 153005 46032 -24798 13619 51053 35569 -1032 -499 43044 76065 23548 19255 99271
19520 99271 128428 40384 32629 19942 34869 11873 87296 108685 103918 101817 79392 103336
19508 103336 226781 177363 129346 199988 212134 232892 176793 131052 145979 68453 25279
19497 25279 -30946 -17479 107767 191148 124619 47396 -105 16960 -38308 -49 145767
19486 145767 293941 348511 300621 194316 256355 332309 364146 279538 140096 134504 129151
19475 129151 92364 79207 62190 57841 110056 183221 182392 202680 193487 210549 207540 180176
19463 180176 239962 249352 224724 241256 288397 309635 327932 312420 334602 378499 457732 545598
19451 545598 583495 678847 714085 677297 674201 735731 918807 1035408 1229491 1271711 1157408
19440 1157408 905651 780306 707449 705216 719911 708381 573139 471552 361426 333556
19430 333556 378377 352926 325925 287936 198315 134376 89943 108813 20010 45457 183181
19419 183181 180234 61303 36646 113977 218117 224160 256199 244918 206893 196702 186911 239122
19407 239122 269675 283059 401439 510104 550999 564937 577130 705210 826720 845733 821160
19396 821160 835640 872601 978338 1083428 1065618 982055 1005261 1033358 966592 954524 992499
19385 992499 932283 746834 534083 395122 308767 316872 224066 218473 234684 310837 279940
19374 279940 248862 200542 140633 161580 149083 195234 265016 265918 240919 214322 169605 131341
19362 131341 150228 169058 297046 524390 677359 706888 692901 877291 1103421 1174813
19352 1174813 1031605 816980 668699 647637 590612 433831 337978 377111 509394 479373
19342 479373 393878 372087 410116 480003 495637 468795 467805 483587 524510 501607 419265 443584
19330 443584 425362 357072 312420 337432 343333 320033 312681 358288 428686 486719 446820 387966
19318 387966 369325 318631 294068 302635 308735 282891 348224 350457 362783 421019 554483 638416
19306 638416 619581 723984 714979 712978 775444 821497 841126 847924 769610 645733 514445
19295 514445 419134 447232 408007 351237 342066 239923 217621 249804 339581 432985 461961
19284 461961 437471 477363 430387 412179 385046 340337 287884 266164 241294 205557 224900
19273 224900 287355 187037 122362 166722 161514 195960 323539 407253 410224 405341 403381 396345
19261 396345 392626 333037 276074 294942 288876 361740 410613 407088 427089 432502 448354 481491
19249 481491 513703 484221 437612 382478 402696 365842 347346 467301 459557 461908 549243 612686
19237 612686 690243 767984 868487 933436 869478 804161 746363 712624 773405 869944 938980
19226 938980 942102 881880 902753 787685 766596 805771 841752 789123 817076 908232 959940
19215 959940 1040018 1064603 1028176 1168844 1305630 1488801 1500082 1397614 1394007 1409564 1316943
19204 1316943 1233239 1152670 1109476 1110888 1077431 1073451 1071689 982925 1005018 937204 817285 866718
19192 866718 921211 987751 1006438 1054460 1141460 1146312 1158419 1051467 1100264 1135734 1148613
19181 1148613 1254027 1399319 1546236 1632275 1554814 1492529 1490776 1444349 1400486 1391619 1321939
19170 1321939 1309915 1296162 1243669 1300044 1394506 1371533 1401072 1415851 1519674 1798074 1950590
19159 1950590 2138087 2295029 2386496 2383712 2331504 2261505 2334081 2492196 2556134 2508109 2321434
19148 2321434 2154524 2045701 1974511 1866580 1715541 1600395 1567072 1606760 1586785 1569214
19138 1569214 1546195 1472823 1489110 1570542 1617943 1648771 1639662 1609734 1686746 1803317 1735874
19127 1735874 1707840 1691663 1753818 1849344 1950107 1946495 2020124 2094851 2102231 2163436 2163526 2264439
19115 2264439 2449605 2691090 2874931 2846621 2743586 2764857 2858135 2985090 3174703 3394464
19105 3394464 3636200 3711041 3600193 3452761 3470821 3596045 3732824 3902758 4053709 4076343
19095 4076343 4102083 4181348 4226837 4313401 4406972 4550724 4785571 5000892 5177949 5313522
19085 5313522 5607742 5940317 6308195 6647115 7101839 7543230 8080504 8746848 9655100
19076 9655100 10934030 12392854 13726427 14718761 15617735 16547220 17645494 18761377 19568149
19067 19568149 20141024 20907614 22171152 24216508 27102520 30545127 34494309 39157544
19059 39157544 45017476 53213639 64993693 81860197 106998461 148066976 217167564
19052 217167564 314727857 400517051 435433581 419891803 389211756 397569078 430689996
19045 430689996 431388697 376648209 281392674 191202444 133929964 101343563 81232478
19038 81232478 67435177 57593402 50313384 44802547 40489101 36963606 33912437 31377400
19030 31377400 29486368 28075482 26748565 25496031 24344631 23519998 22898372 22195082
19022 22195082 21106491 19854125 18731029 17622634 16456643 15169511 13989463 12993098
19014 12993098 12233037 11623492 11203153 10789708 10469984 10122373 9709345 9499629 9262502
19005 9262502 9008887 8834661 8680968 8528182 8282597 8024482 7774832 7596087 7527401 7451038
18995 7451038 7236092 7003644 6797177 6583864 6446698 6410248 6341692 6241565 6127670 6070165
18985 6070165 6080986 6066351 5942549 5909727 5812623 5700449 5524431 5478291 5495713 5541890 5515370
18974 5515370 5440421 5355235 5330688 5253604 5202220 5221318 5345352 5357649 5409267 5551603 5723320
18963 5723320 5862199 6130700 6502902 6826610 6989054 7175712 7386993 7740030 8083567
18954 8083567 8639177 9206511 9500215 9599293 9799614 10255608 10844236 11504915 12323719 13228591
18944 13228591 14201195 15461426 17059397 19235504 22032274 25916713 31513759 39928840
18936 39928840 53522940 73432719 94430320 107283646 109582278 106249443 109766755
18929 109766755 128091383 152345687 170141008 172717461 157603310 135893665 117811677
18922 117811677 111559384 116667266 119812797 111872460 92327064 68679669 51042929
18915 51042929 40322907 33606333 29252388 26288435 24156239 22701845 21642151 20807820
18907 20807820 19997464 19461043 19226863 19186843 19177866 19164434 18983012 18904681 18931244 19148860
18897 19148860 19531096 20027080 20670602 21415861 22517733 23962849 25920494 28602500 32480132
18888 32480132 38126682 46691828 60281302 81283724 106554641 125585771 132854884
18881 132854884 131698087 134200001 150244431 170843758 185891717 190900031 182450748
18874 182450748 166834203 149370034 137696716 138742277 142338704 135123849 114306721
18867 114306721 86006762 62646315 48101926 39240680 33330637 29052223 25924281
18860 25924281 23511159 21688578 20289434 19051002 17931880 16970381 16105420 15410510
18852 15410510 14822382 14255651 13847895 13440364 12976580 12360845 11644324 11036334 10620587
18843 10620587 10230062 9705273 9196031 8695663 8273804 8026028 7868303 7558700 7197229
18834 7197229 6809199 6535656 6357554 6179212 5982196 5753138 5509583 5289604 5157222
18825 5157222 5146274 5044424 4916163 4827897 4748139 4647645 4564017 4480464 4436430 4434812 4456748
18814 4456748 4455710 4469163 4529892 4613176 4693541 4821099 4855968 4828589 4727518 4615969 4452850
18803 4452850 4291861 4201714 4196706 4282296 4440102 4497354 4398005 4231084 3850882 3526886
18793 3526886 3255253 3082141 3033554 2946965 2886743 2970593 2965938 2885762 2828183 2684686 2629813
18782 2629813 2667277 2672062 2605721 2578380 2601789 2608752 2513494 2460657 2475378 2492997 2517596 2564329
18770 2564329 2619444 2795148 2966942 2998666 2977722 2944032 2801689 2619003 2601171 2549093
18760 2549093 2562724 2558390 2580110 2605303 2670604 2661284 2612019 2616510 2600328 2565084 2565932 2704895
18748 2704895 2781344 2781314 2688810 2375406 2047290 1936381 1921072 1965724 2081497 2140021 2208415
18737 2208415 2305904 2449562 2613123 2715819 2843367 2942351 2944485 2979995 3134164 3258562
18727 3258562 3325974 3396536 3638570 3882091 4213269 4540080 4973956 5362867 5608159 5658677
18717 5658677 5659838 5874053 6472299 7098707 7431875 7576511 7471071 7626195 8057092 8847267
18707 8847267 10066431 11973000 14868256 18464956 21096944 22437046 23223986 25343495
18699 25343495 29301187 32509932 33483442 32839022 33187871 37284893 42841514 45561601
18691 45561601 44982539 42562120 43534999 49093215 53384359 52575091 46872333 39651525
18683 39651525 36436195 36057033 34724294 31455139 26196419 21452357 18404407 16698952
18675 16698952 15838841 15361336 14971787 14718138 14769575 14976256 15253875 15588116 15970771
18666 15970771 16534841 17317757 18246575 19304498 20430739 21760888 23376745 25368803
18658 25368803 27983967 31277897 35450296 40759258 47785448 57852218 73476251 96381826
18650 96381826 121439220 138923742 149463406 158313486 178773559 207943341 226686198
18643 226686198 227807570 217749067 217458317 242164302 276965992 306388403 328949111
18636 328949111 336880501 339463581 338007366 318640520 292601766 268638297 260058693
18629 260058693 276808741 288797683 272376123 226296208 166408245 121788886 94683500
18622 94683500 78030523 67289793 59944772 54668785 50392652 46742359 43701602 41083308
18614 41083308 38984395 37353658 36087713 35105725 34381920 33831663 33579701 33827599 34651471
18605 34651471 35778371 37391735 39798146 43495741 49296226 58570055 73721257 98832029
18597 98832029 136852044 175407487 190949394 180364106 148125984 118868592 108433981
18590 108433981 116318452 140613896 168576235 177520592 162834110 128016392 93610786
18583 93610786 73090382 61145569 52678922 45480866 39247764 35257073 33449864 33740239
18575 33740239 35138239 35165590 33081815 28933082 24383406 21225488 19236743 17935208
18567 17935208 16933762 16283534 15928903 15631292 15429456 15089661 14624067 14128598 13667989
18558 13667989 13315116 13102404 13043142 13169713 13277746 13408337 13674582 14002950 14623396
18549 14623396 15438448 16614952 18365567 21260716 26131122 34376710 46833098 58320206
18541 58320206 61745354 57009796 45872328 37208928 34683081 37727763 46036371 54857995
18533 54857995 56792546 51202078 38971776 27524843 20624383 16626596 14294033 12618173
18525 12618173 11368710 10597248 9992406 9496212 9017392 8475588 7950252 7552738 7198796
18516 7198796 6949128 6793637 6566792 6401768 6174446 5949027 5858579 5827744 5620347 5390287
18506 5390287 5112173 4870196 4714314 4525660 4487684 4416377 4233244 4122627 3936395 3714422
18496 3714422 3610808 3547506 3443374 3254400 3219890 3235833 3234686 3103517 3020124 3004014 2979994
18485 2979994 2961247 2920031 2943116 3022201 3058683 3132518 3299994 3390737 3449176 3517128 3654191
18474 3654191 4077984 4636389 5015973 5116193 5067605 4943412 4901515 4799597 4472772 4004905
18464 4004905 3532574 3095681 2845233 2649299 2546093 2394320 2188582 2029357 1945470 1857084
18454 1857084 1816316 1727275 1736827 1693672 1668269 1628655 1493371 1490772 1576304 1633961 1625268 1560350
18442 1560350 1532843 1519303 1544486 1522790 1610904 1643251 1653054 1673766 1672948 1612590 1660170 1710198
18430 1710198 1636135 1559599 1668299 1781412 1837985 1810354 1810004 1784200 1805880 1800671 1810979
18419 1810979 1961362 2204283 2520054 2597778 2428874 2250448 2124005 2097718 1999811 1906185
18409 1906185 1865231 1869120 1952333 2038303 2112180 2196910 2341127 2467096 2630122 2946461 3448285
18398 3448285 4118127 4515076 4502581 4358491 4291417 4565616 4916539 4985602 4536155 3782894
18388 3782894 3284283 2913076 2693873 2715458 2618588 2513220 2500627 2564031 2598393 2643711
18378 2643711 2734161 2813899 2913915 2999190 3202965 3451447 3670885 3965822 4357925 4779724
18368 4779724 5243516 5536763 5755060 5889421 5919145 6077858 6386304 6731951 7029962 7275382
18358 7275382 7550245 7776790 8052886 8485212 9102680 9886014 11006086 12570506 14444493
18349 14444493 16389908 18766691 21990460 26834235 34362315 46029334 64882202 92137176
18341 92137176 116099936 121656442 108864021 81942496 59581978 47742476 42663144
18334 42663144 42558493 47681106 59732002 79911881 101498508 112618794 106067282 85116641
18326 85116641 60702291 43096295 33043953 27256943 23825752 21664826 20192445 19271918
18318 19271918 18671603 18294321 18066451 17918481 17868586 17905955 18259023 18937005 19848035 20697158
18308 20697158 21742946 23383591 26135434 30515994 37595002 49503667 67733899 87838993
18300 87838993 98459089 95908516 82021632 66745424 59398551 59625408 66809255 82789397
18292 82789397 110645548 146329324 174283392 181317625 160625245 126333470 93410136
18285 93410136 72547094 62830852 61461697 68428705 83680501 100052591 106573606 98071957
18277 98071957 78103166 56638500 41982354 33500082 28285579 24997151 22830579 21320654
18269 21320654 20084208 18988409 18074624 17392494 17031864 16730869 16494328 16390082 16389876
18260 16389876 16617465 16962370 17495596 18386232 19861376 22313922 26409333 33258600 44834121
18251 44834121 61560011 76539882 80421333 72867143 56742006 42970115 35667194
18244 35667194 33059640 33980335 38488060 48080712 63560552 77199779 79353802 70081164
18236 70081164 51704257 36138080 27008078 21683204 18094726 15553272 13667787 12304985
18228 12304985 11330704 10583107 9911618 9252985 8739629 8276908 7904234 7613587 7269540
18219 7269540 6866771 6428295 6144219 5883522 5620296 5404102 5185712 4945360 4831507
18210 4831507 4735771 4609885 4425743 4047340 3738574 3665518 3742149 3580776 3371468 3243379
18200 3243379 3178230 3055085 2994774 2894948 2847041 2888568 2785006 2640936 2640822 2594103 2584520
18189 2584520 2485477 2557035 2703374 2932599 3164967 3260842 3155556 3115469 3179786 3151632
18179 3151632 3026510 2795270 2679760 2585855 2523454 2380185 2176686 2039961 2051956 1988266
18169 1988266 1956466 1938875 1982973 2006109 2055436 2024525 1881665 1879430 1982142 1984970 2077990
18158 2077990 2100584 2064556 2035278 2110037 2283471 2381061 2502188 2558092 2535925 2462451 2486966
18147 2486966 2595384 2587128 2496503 2289538 2143928 2085286 2107908 2113319 2223401 2240058 2121082
18136 2121082 2043207 2174525 2332968 2442652 2553200 2859303 3125714 3330734 3468294 3628230
18126 3628230 3812156 3928797 4226924 4725253 5242209 5891157 6621811 7343537 8132311
18117 8132311 9353277 11247148 14049192 18377172 25571142 38311940 61255001 91514952
18109 91514952 107450304 102736203 78568921 48549695 30939082 21834216 16622685
18102 16622685 13362520 11181545 9717164 8624213 7722260 6901286 6234919 5701215 5352794
18093 5352794 5078636 4764841 4459608 4084770 3787842 3550098 3410563 3410561 3385538 3249479
18083 3249479 3061979 2765458 2527938 2375958 2308063 2359893 2469531 2508695 2558013 2474308
18073 2474308 2259890 2102819 1917115 1912307 1959223 1959679 1892220 1755313 1598196 1478914 1377143
18062 1377143 1272568 1097450 1033834 960455 955415 923058 859563 837086 784428 774098 790147
18051 790147 767558 729379 676751 663872 677065 733980 709294 695815 641099 608728 529335
18040 529335 510105 483309 496223 512899 498412 523886 516923 445132 473925 613753 720832
18029 720832 707847 624086 523904 529915 487112 509016 571873 702008 696040 525415 501015
18018 501015 462951 483810 516931 505657 508757 470136 401470 352496 442444 523925 467140 457611
18006 457611 419978 350247 369316 388257 362239 289381 270402 232257 222814 231598 116501 169346
17994 169346 205257 103611 74183 142272 103636 70639 133332 147072 108795 97276 88735
17983 88735 56502 25935 61562 117982 169584 256754 256955 166722 83721 54018 89422 60790
17971 60790 20085 107334 144603 87161 101186 168033 221919 211356 121556 75316 118169 110786
17959 110786 25564 2551 74904 164579 218205 186181 189804 89791 111056 145289 66024
17948 66024 -101582 -149767 -65036 6525 -3807 15183 13992 -6008 52461 125278 84685 -22261
17936 -22261 -53614 17927 36118 80311 108853 30173 73239 120495 135318 181546 48874
17925 48874 -34685 25228 80660 95276 83414 179995 269543 230827 153157 137782 132794 152078
17913 152078 181983 164959 156106 92821 33956 86276 67776 17026 92391 140000 39500
17902 39500 15172 38151 74306 50285 30138 59090 27147 -14107 -11459 21332 72907 97750
17890 97750 107932 138591 92514 33468 -25135 -12665 -19249 -42476 -50151 -27579 -29268 25342
17878 25342 52226 39585 19594 90963 192822 188703 106488 81922 72785 58345 25414 40193
17866 40193 143972 178293 145613 168587 205134 49765 -130396 -159812 -54002 70491 124771
17855 124771 92384 41024 47840 103125 118251 -6196 -32249 41393 -8638 16044 61663
17844 61663 54759 94562 64783 63373 48979 23927 16728 51025 20852 86516 160528 252788
17832 252788 353061 338313 288536 374990 515538 513067 425292 374323 304306 283605 270291
17821 270291 326567 342476 350706 281571 222175 229624 366030 452847 519353 470946 448549 422326
17809 422326 274279 163521 106700 52580 12497 -12464 -69626 -117665 -163756 -121734 -135889
17798 -135889 -16394 76121 119276 241821 294974 336800 417250 439607 410229 340762 312456
17787 312456 323941 361421 368545 366415 381667 428509 550750 641553 779646 955490 1037741
17776 1037741 1069888 1024857 861088 598062 423870 316063 227866 234378 265518 275908 362049
17765 362049 461622 451198 490834 374895 258856 258020 227746 200136 74979 64359 91160
17754 91160 62080 141686 126394 58441 57793 102501 158388 240374 267601 227325 211724 283762
17742 283762 289124 305630 402382 429245 368904 290946 259369 231233 186460 159077 75898 55042
17730 55042 52481 62202 164977 391073 503270 477266 329387 302449 255918 104866 57773
17719 57773 122694 104721 98655 150496 121614 -28881 -27868 65393 87093 133398 57236 -77120
17707 -77120 -11560 76096 132528 71104 107691 91235 -28922 -99269 -34510 64020 134134
17696 134134 146637 88899 52254 81833 24815 -9978 -30771 -106210 -117290 -25681 95253
17685 95253 59668 40478 26189 -8855 36377 141903 115278 67613 -19235 -72768 -99366
17674 -99366 -140767 -42343 31227 28010 26785 -10876 -33130 -18803 -3130 52720 -180 -63859
17662 -63859 -78358 7347 46845 54724 18361 -45810 14603 63117 -26331 -35000 36250 2374
17650 2374 22498 -836 13305 74729 76629 -4568 -40710 -45498 -67993 -100777 -89791 -99698
17638 -99698 -56582 -2592 -32966 -112887 -78541 -25584 26320 -33586 -38184 17512 55943 -48094
17626 -48094 -216252 -219700 -152922 -81292 -72895 -40652 -43971 -68530 -72675 -142753 -126990 -168300
17614 -168300 -118685 -29009 129902 160948 136575 127226 72657 -59171 -72528 3268 -58204
17603 -58204 -96993 46696 27902 -16918 -15947 -55103 -134175 -147541 -79894 27408 1110 36333
17591 36333 82138 91243 -853 -101519 -163824 -98164 -12008 -46840 3203 17650 -105377
17580 -105377 -200542 -152453 -35003 -47332 28104 94007 65342 -31774 -35827 -30219 45855 95197
17568 95197 -15953 -11047 -43184 -40061 7197 28829 20614 -109112 -128371 -109863 -109294 -84425
17556 -84425 -51613 -117806 -36388 24479 23803 -40929 -70005 57072 128669 105744 149237 106203
17544 106203 95191 65279 1891 -72319 -110673 -81980 7705 41858 89817 106613 115415 102004
17532 102004 68066 41866 65152 69190 35548 61948 82057 70789 106110 113636 80777 43723
17520 43723 16877 -15470 -1833 22308 7607 -72189 -102611 -115112 -167550 -113146 -75871 -164069
17508 -164069 -214460 -185085 -107839 -31365 -85434 -45440 -30224 -43569 -59328 -13972 -57280
17497 -57280 -62042 6420 -19120 -52640 6925 56799 61598 47788 27910 41680 63102 67148
17485 67148 48476 -57772 -104295 -121353 -55420 30926 9510 -101128 -121880 -107650 -72507
17474 -72507 -14084 -14196 -77051 -165230 -74368 -40288 -22421 -3268 -55604 -27761 18874 2160
17462 2160 -8241 12196 52589 -10879 -77929 -69429 -80890 -132388 -110308 24965 98589 141862
17450 141862 171118 235016 290571 273754 262663 367208 559846 627697 612821 557621 355004
17439 355004 241259 218567 176223 152845 104658 165769 106033 65167 98148 120791 112874
17428 112874 1025 -74217 -94572 -51161 -12436 38668 60358 114425 100670 105022 82244
17417 82244 60500 89324 102211 105087 92326 78168 93147 93407 105117 120011 131985 146070
17405 146070 87361 46838 67739 113108 121044 118403 123748 115176 178470 124168 103728 20456
17393 20456 98263 112032 86983 88122 111221 70415 62410 21579 -103912 -129331 -121127 -75532
17381 -75532 -48542 33011 66324 134831 110243 92136 79976 33202 14537 26163 41202 61259
17369 61259 68432 46869 14176 67327 56893 -25055 -86818 10298 106563 133715 142638 179654
17357 179654 167759 15874 -14683 -11050 18956 18169 73419 141487 133140 79351 5129 -11923
17345 -11923 61386 61104 129835 121839 216665 176416 181874 146788 61415 41818 42416 -92687 -142195
17332 -142195 -26238 16810 42992 60076 -8523 -71905 -21377 25220 33316 13190 46886
17321 46886 38182 -38686 -21160 18502 134637 79175 -20566 -56166 -18172 15162 76489 73319
17309 73319 32881 47619 58145 105058 109970 35764 -12291 58394 94527 19834 -78407 -59464
17297 -59464 15136 38523 67683 18631 -69477 -61251 -41191 38342 88745 26366 3395 -18959
17285 -18959 -4266 16971 61211 68714 -2783 -107434 -24811 3547 -30674 -143622 -141179 -118482
17273 -118482 -64705 -80960 -128718 -39298 58913 60726 75118 36816 9864 -66348 -7438 49203
17261 49203 16782 5166 18446 24366 -101948 -159934 -34685 -15952 -44900 -68092 -28728
17250 -28728 -90720 -2653 29896 -25774 -33487 20931 26550 -13840 -16039 -10021 -88840 -132670
17238 -132670 -68115 4440 -37687 -49496 -56103 -33672 -36449 -41149 -5874 2621 50948 101449
17226 101449 138067 77717 -4490 -30197 -27964 -62957 -32711 11017 113438 30731 52621
17215 52621 25593 -1274 -64637 -63835 437 29661 54458 -16538 51733 51008 46543 -59270
17203 -59270 -71672 -97215 -67482 -45381 -26523 -30231 -54628 -2641 -53745 -70328 -65527 -53112
17191 -53112 -146168 -173145 -107373 -77683 -68912 -20034 -48938 -16249 -29183 -17281 -34689 -51059
17179 -51059 -174116 -165958 -165952 -209307 -96424 -61759 -6161 27831 47171 16101 -3167 -23160
17167 -23160 4406 55152 119412 14565 -125861 -33012 55187 28765 -45378 -77783 -41084
17156 -41084 26038 54031 16752 -27133 -14124 -24917 -24752 41761 74459 57501 48638 -52712
17144 -52712 -94039 -75752 -121799 -99629 -16376 -48285 -47098 -56740 -28911 13051 31896 12062
17132 12062 -80322 -171435 -157011 -64332 -57027 5852 39658 101055 151104 95329 -24643 -80863
17120 -80863 -171169 -141180 -112632 -136955 -141530 -47947 -30823 -42639 7493 -39467 -41116 -12113
17108 -12113 -22956 39611 72310 28186 38044 -632 -8564 -35215 -31113 -30842 -109859 -158267 -115286
17095 -115286 -149345 -106225 -95253 -107502 6273 30045 37237 35808 71436 35629 -63112 -3001
17083 -3001 64380 38129 -94210 -128354 -93019 -126676 -49953 -6294 14512 -24637 -73518 -96195
17071 -96195 -81192 -31219 45684 105189 59145 4318 25494 -25999 -87297 -136034 -149054 -148235
17059 -148235 -69711 -41259 -80629 -98065 -42808 -39811 6585 72528 98129 116426 141587 147184
17047 147184 91095 90571 34309 4222 70934 11246 19836 29304 38002 58394 -5572 28038
17035 28038 -8815 -16867 57205 43248 80500 117680 -3108 -44913 -64661 -49167 2624 58697
17023 58697 72291 -10309 -27578 32846 103362 111043 80408 74577 24401 -201 705 2507 80898
17010 80898 160632 140812 155200 137105 131749 73981 -5929 21723 44059 -556 -27982 -51540
16998 -51540 -89486 -66418 -23619 -60839 -76929 -4602 21808 54480 76887 53576 53716 44803
16986 44803 91263 150825 158783 120584 147304 118910 22741 -20287 -74203 -15175 23120 53081
16974 53081 35290 -32597 -137567 -105213 -8896 -22826 -135821 -70681 -32176 -62768 -15837
16963 -15837 2685 -22320 -10404 -19748 12998 66204 64650 59718 -19907 -1750 75328 64473
16951 64473 -12871 -49565 -52494 -72317 -18626 33683 112211 177124 172411 102443 9883 93534
16939 93534 102318 68917 124255 53166 -36787 5681 73450 146607 230638 201021 109987 50780
16927 50780 -21201 -42673 27767 113162 73099 -16344 -49246 36688 48558 78129 12157 13045
16915 13045 75477 79550 -29648 -109807 -81253 3325 25340 -23365 -59542 -8200 14031 48181
16903 48181 92167 75627 65273 9408 5002 -2058 -53196 -113607 -97669 -100000 -78797 37779
16891 37779 81770 -85649 -199163 -115524 -74959 -119127 -84738 -75671 -102430 -150296 -139676
16880 -139676 -87902 -30328 -475 9423 46568 26687 -27876 -61163 -20610 -43424 -39244 -18230
16868 -18230 17320 -13296 -56127 -126202 -128477 -101694 -101127 -79376 -109785 -113069 -121743 -57204 39099
16855 39099 65059 11716 -81487 -111315 -89604 -3281 28978 80789 23021 -19192 -29133 -47457
16843 -47457 -68864 -31296 43809 30949 -115744 -146638 -160064 -147682 -92621 -38606 -34235 -91474
16831 -91474 -23018 33890 41279 189312 242635 103350 -21577 -6658 43888 54970 26579
16820 26579 -46326 -13640 1626 -21738 17030 -9715 -46972 -19116 -42442 -138818 -149124 -78865
16808 -78865 -13806 63582 62301 -41279 -84247 -40999 65138 45923 77433 41178 -4466
16797 -4466 -54345 -2200 51497 65887 67511 26781 36415 38215 90020 122466 93211 74714
16785 74714 81414 84389 105454 7345 -11260 -40535 -64569 -78982 -69522 23628 60568 91115
16773 91115 69641 123746 131618 81706 73532 71405 75152 124124 73650 2473 14290 -49269
16761 -49269 -26931 13702 57026 28737 29725 -42402 -167056 -154648 -107092 -138988 -242990 -214122
16749 -214122 -215578 -171193 -126138 -136554 -108501 -117965 -194012 -125688 -43788 10484 5465 -46739
16737 -46739 -86171 -90982 17362 72749 51182 26253 4267 -7360 84758 121441 87139 85602
16725 85602 159036 167975 163764 143538 25191 43697 173298 171520 118461 107585 44273 66074
16713 66074 46152 -16227 -27092 57763 33609 -5452 9008 44470 98781 -12648 -11905 -9155
16701 -9155 -76499 -45721 -53515 -48140 -5801 140103 161941 166659 76803 5828 -20570 10299
16689 10299 5655 110709 80474 -27348 -53074 -42738 -97113 -103679 -43017 -1273 18847 -32787
16677 -32787 -81676 -92582 -11310 42556 32042 19800 46810 111142 107219 101789 109220 76098
16665 76098 -50850 -15941 33057 42506 96176 81026 61357 -29555 -72240 -129916 -189805 -111526
16653 -111526 -76069 -69093 -56291 -66096 -34488 -81142 -70236 -96724 -32332 -68577 -67067 1489
16641 1489 78491 40763 -1513 32512 13438 -38877 -20443 -4577 27943 21742 -41837 -44357
16629 -44357 31773 75637 80219 35738 -79042 -38555 35563 16294 471 67032 95778 82290
16617 82290 35201 25467 42270 17382 5706 1989 21365 -18460 -35716 -28910 74188 55902
16605 55902 -3146 -13844 -20447 -24963 -24578 60868 70183 -20072 5694 67616 43680 4511 -8557
16592 -8557 34867 4278 -10957 5576 50311 88670 74488 69451 122165 106985 25218 75762
16580 75762 7571 -59728 -107688 -115542 -149601 -86700 -59830 -34257 29938 55115 679 -43438
16568 -43438 -4881 31883 100209 159894 61122 -43403 -16580 -41186 -80648 -37192 -21310
16557 -21310 36949 -21235 -8790 -30619 -90077 10887 42299 88860 91484 54238 14096 29734
16545 29734 45635 -53060 -67082 -34091 -19462 -64207 -81741 -18487 41802 1433 -21459 13362
16533 13362 9477 7288 14662 3584 48855 86195 104132 146812 65155 -6270 -44461 -46181
16521 -46181 -29793 -17635 -13550 -49665 -6673 16333 -16399 2308 -6314 27258 8838 -25724
16509 -25724 -53369 -18368 -8199 28456 2518 -33879 -117529 -104360 -62992 -58235 -54099 16181
16497 16181 4373 19278 47358 42870 -41085 -28844 66510 110985 45794 57329 41424 -26057
16485 -26057 8125 96068 59262 12810 84444 35271 -5377 53746 55654 47537 29088 30039
16473 30039 39098 26366 44370 -18976 -63187 -7214 33222 32675 -1196 -22179 -96764 -165841
16461 -165841 -109646 -59441 -99493 -89150 -105526 -58655 -96098 -218744 -156502 -174925 -259147
16450 -259147 -302042 -286837 -188752 -179244 -106055 -64956 3067 -18512 -36328 -19780 -26779 -62859
16438 -62859 -70909 -25487 38393 24453 59008 44307 -2347 -35366 287 52704 -22881 -94720
16426 -94720 -89674 -134069 -117722 -67910 -62513 -31462 -64317 -123267 -60878 -161717 -185312 -150666
16414 -150666 -47511 -48375 -58314 -30766 -34508 -5099 -36830 -67364 -93905 -48761 -49143 -92714
16402 -92714 -113458 -106531 -104203 -114492 -16767 6721 52137 81922 43867 -13297 -18366 -55243
16390 -55243 -37917 9451 45041 30122 17969 -13243 -14236 -8991 -132960 -192860 -39086 39817
16378 39817 1584 13767 -35980 -59880 48820 29667 22008 51422 55295 10333 -46011 -55850
16366 -55850 -61194 -36671 23016 21126 9397 -31946 26401 101631 81204 95832 115318 161786
16354 161786 96101 69773 120785 181609 128525 16067 -74833 -62710 -83040 -129496 -72426
16343 -72426 39121 -3818 -23885 -29236 58208 81755 9512 10052 62895 34884 64444 108304
16331 108304 71463 23950 5129 11625 -9785 24933 -14353 -20608 -81551 -89726 -39081 -75719
16319 -75719 -30131 -50240 -118453 -137645 -74591 -28647 -22957 73823 77355 -37884 -31182 -43928
16307 -43928 36003 58745 30464 -13031 22964 20254 -1252 -18407 -17980 -5048 12719 62112
16295 62112 62950 63078 -12248 -65040 -76734 -38518 54904 25600 57090 82681 11651 -62011
16283 -62011 -11158 11675 31015 24341 -26109 10864 -18116 -28391 -41974 -52174 -78779 -98323
16271 -98323 -68682 4658 22899 80334 96753 -22837 -103362 -76477 -50052 -54733 -41195 -33594
16259 -33594 14038 7956 -34922 -67221 4570 44956 107351 35435 -25536 -82707 -155219 -135107
16247 -135107 -80942 -77138 -47287 -35446 -41784 -118453 -96377 30849 40212 2636 -81496 -81801
16235 -81801 -39262 112436 168945 121667 17219 11616 55499 -13057 -49722 -135978 -149782
16224 -149782 -37779 1120 -20547 -21737 53987 115049 82554 175883 186340 153287 92480
16213 92480 27506 -5854 -48518 -64715 -81024 -66237 -74018 -96904 -31325 -21317 -41480 -43780
16201 -43780 -14451 -121676 -119681 -146097 -18044 40788 51823 77856 88719 69504 -23556
16190 -23556 12983 26741 -29443 -445 10759 19571 -809 -19989 -9416 83312 102523 12645
16178 12645 -4735 -1449 -27863 -43181 -106430 -152706 -107595 -75105 -15237 -26405 102853 184066
16166 184066 128882 71178 1437 -36415 -27822 -27420 3736 17612 20340 80729 166366 194089
16154 194089 140323 22183 14993 79792 69974 -6925 -31943 -76092 -40909 42016 91917 126499
16142 126499 168913 157081 114460 19005 7892 -26624 -46295 29730 45310 54260 18931 9843
16130 9843 -73 -40833 -47133 -61345 -3741 2650 3474 -794 15867 78140 -19315 11677 32589
16117 32589 23124 57882 31278 -28765 -19277 -8527 34873 99936 27563 -5918 -12236 53518
16105 53518 76245 21487 -21517 -4054 -104052 -134143 -104480 -102179 -39256 -71303 -104648 -21459
16093 -21459 39429 6589 -92575 -97673 -78606 -40865 -51871 -36594 -37489 -3259 -21526 -72599
16081 -72599 -41810 -37447 20024 29701 -21353 -17557 61236 36429 38095 56554 -7550 -130945
16069 -130945 -160493 -142642 -65487 34978 55729 57606 79697 72266 -14327 -78840 -188212
16058 -188212 -201313 -175421 -59900 33308 33498 -27101 -7719 -70883 -88278 -65763 -51966 71789
16046 71789 87229 71219 40423 11031 -54416 -91649 -77085 -53581 -29011 -105510 -74456 7408
16034 7408 -16739 -49861 -118843 -103681 -25447 -23586 19109 -8477 -13588 -13203 -17850 -55411 3350
16021 3350 40830 7577 29373 34253 -75547 -134413 -127797 -80406 -80313 -58927 -34509 -4260 102161
16008 102161 74767 -21460 -104835 -143261 -61912 -82307 -46189 21237 -10732 68333 92697
15997 92697 53932 23063 7794 41115 -8357 -34478 5998 -49765 -115743 -77782 -53420 -100668
15985 -100668 -65133 15140 6947 -44804 -45061 -18810 5745 49393 83219 124117 96217 111634
15973 111634 -26317 -62965 -6437 -13321 -14523 1788 67612 19368 -19337 -25259 42616 -15690
15961 -15690 -108989 -154517 -104306 -25951 -55353 -110006 -108453 -98984 -96553 -120706 -133384 -114536
15949 -114536 -63136 -26144 20024 71464 34808 22843 -4901 -14475 -10990 -633 -24508 -27967
15937 -27967 -55043 19600 101422 171734 160146 111315 -16960 -68527 -72128 4577 14249 -30390
15925 -30390 9397 33910 28053 82321 91756 55425 65475 59176 24761 40684 14952 -28456
15913 -28456 -86017 -54587 -36037 -39352 -16117 -6089 43394 91715 86284 109638 52129 -15044
15901 -15044 -71509 -100701 -64444 -22946 -35949 -58833 -19173 23327 -22768 -62516 -93596 -114418
15889 -114418 -100928 -33282 -25704 20304 19778 63488 30440 18897 -27042 -3614 9708 -43004
15877 -43004 -71281 -50270 -74464 -62632 -57735 -45321 -86456 -30854 77208 -462 -80020 -63510
15865 -63510 -66919 -14049 40432 32598 -18482 -14198 -41595 -68182 9904 60171 65625 92726
15853 92726 4089 -85600 -133814 -100280 -80332 -70384 -37494 -62683 -49806 -94391 -100228 -1302
15841 -1302 -14715 -79626 -131090 -126485 -99178 -99703 43781 113518 77825 29473 86785 71358
15829 71358 36026 3326 50740 19523 -59151 -58315 -9424 -13316 -59565 -144294 -127037 -51799
15817 -51799 -3681 -64022 -50635 1220 -6383 -49383 -75469 -101399 -42233 -5990 -4147 15191
15805 15191 50558 61937 -33891 -32963 -15993 675 -72017 -74600 -39378 13356 83694 63961
15793 63961 78779 158629 188940 118304 43095 22291 68230 72234 42349 -3737 -20131 72519
15781 72519 42284 -23544 -29770 -100525 -151777 -31191 42645 20277 -46257 -114418 -99375 -47589
15769 -47589 -78264 -90303 -28172 33102 24532 53571 31950 40071 38170 78099 109947 139554
15757 139554 65850 48121 92465 71765 22191 3141 -32695 11694 62096 18785 -70742
15746 -70742 -86666 -104699 -158385 -128092 -68061 -72684 -114658 -33161 -20884 -17145 -71994 -47430
15734 -47430 -16550 25731 38679 93650 67535 -82588 -118076 -43269 -51042 -83351 -68477 -68326
15722 -68326 -65465 -86725 -109879 -74869 -31922 -595 23550 56446 -13931 14164 47179 -10781
15710 -10781 -63720 -99746 -80948 -117029 -90443 -45904 -55640 -21924 15549 56652 96299 14860
15698 14860 -24782 7248 -20477 -29022 11698 38837 7148 76013 101597 97374 73861 24543
15686 24543 66530 93965 99849 57842 -30345 -24375 14174 22789 2240 22790 64906 86241
15674 86241 130689 155691 110578 36689 -8378 -81769 -25376 12853 -18211 8068 86429 33899
15662 33899 64616 -26300 -73141 -68024 -91009 -66811 -86358 -73256 -70843 -45656 114319 84180
15650 84180 66785 123492 168994 200566 180933 150450 118035 97472 83589 89602 100151 39634
15638 39634 34559 142938 121786 51688 -4061 -54489 -90315 -58675 23083 65526 27461 2936
15626 2936 -16842 -36940 -65960 -61486 -2842 97825 106301 116859 131929 5567 -22635 4911
15614 4911 8878 -60545 -44789 29246 -3994 -34467 -60416 -40583 -24424 114057 136972 98727
15602 98727 100989 7534 21372 -10734 -41268 -62575 -60618 -89613 -10299 22801 14687 67178
15590 67178 57969 39036 100665 81090 37538 55344 66139 -13150 -102795 -29151 5218 -19432
15578 -19432 -86470 -147320 -136784 -79689 -41413 -28858 -71478 -602 14192 -77322 -88296 -86372
15566 -86372 -38642 11659 4139 18181 35182 -1265 3580 59245 124183 183690 247480 236097
15554 236097 134881 31911 13402 3 -72909 -132539 -125172 -76594 -27738 -54568 -5590
15543 -5590 21288 25391 4301 21464 70428 88380 58385 36820 -57312 -49060 -54744 -24342
15531 -24342 -952 21743 67185 62309 -1885 -80872 -100639 -44595 76017 69886 106499 98984
15519 98984 84909 -839 -49967 -25792 2444 -21283 40307 91631 25509 -83422 -173907
15508 -173907 -77766 66677 87386 -51758 -148791 -168736 -108125 -43182 -12936 -43812 -20486
15497 -20486 -15939 -30886 -47669 -80458 -90671 -152834 -186362 -93003 -95477 -99601 -93811 -84696 -36708
15484 -36708 -9479 -4113 -30536 -13010 9822 7393 -72910 -153334 -129743 -39573 -8746 -58165
15472 -58165 -2 21632 13030 49624 75036 60544 4673 -46483 -36164 -39093 -44554 27706
15460 27706 79925 86095 72058 47285 60809 68124 35426 4795 -18792 -19986 -10068 -13627 7343
15447 7343 -73091 -63711 -14272 -156 -11868 -82977 -109802 -122698 -119726 -92242 -40304 -10184
15435 -10184 55064 71811 64653 55227 43856 57698 -48633 -48109 -96121 -94540 -98244 -95414 -31297
15422 -31297 42749 95218 31939 -78508 -107529 -68346 -61751 -3755 10108 6647 -40339 -43923
15410 -43923 -25851 -39064 -46604 -53824 97431 124054 35361 -1013 44771 61458 39818 19917
15398 19917 74611 135591 130549 152780 63270 -7168 -39975 -28216 11266 -33130 -113711 -196672
15386 -196672 -171745 -74467 -42145 15604 -62528 -68001 -54685 -73911 -86244 -106779 -104833 2714
15374 2714 36408 14777 4252 5574 -3542 -85446 -118456 -143356 -128589 -66995 -62706 -73258
15362 -73258 -39774 81027 47903 39723 28364 -74146 -111709 -77111 -96290 -119781 -98145
15351 -98145 -109619 -111991 -114666 -87520 23889 9382 -93020 -57369 20765 5350 28132 -10327
15339 -10327 14945 78414 121946 215134 152232 -4234 -21906 -32608 -79643 -72682 -82609 -33098
15327 -33098 38369 9 -30487 -15028 -6513 8001 10427 -34092 -11662 -9380 -81793 -54296
15315 -54296 25394 63639 73818 20520 -64307 -114949 -103361 -23072 -29796 -130786 -34562 40930
15303 40930 -5301 -84620 -48529 -64814 -88566 -93940 -26442 24272 29161 13119 640 248
15291 248 89174 120033 142480 115562 1129 -25974 -58491 -20452 12809 -5185 58221 51263
15279 51263 -29757 -148018 -122606 -73994 767 33383 -55397 -125619 -200931 -234837 -140006
15268 -140006 -5120 26590 48897 9945 69262 85756 -9123 49420 110339 96487 132603
15257 132603 71674 17767 33435 15139 -77588 -41716 -15361 94903 102734 -62643 -105556
15246 -105556 -185203 -183782 -131197 -79215 -76887 -101703 23924 55540 27194 32872 -23187 -31670
15234 -31670 -110727 -86702 -113520 -107639 -157458 -91871 48982 81207 -3729 30662 54434 60082
15222 60082 3342 -19723 65976 117523 137974 87415 42751 -767 -74465 -54145 -4511 17249
15210 17249 5016 26884 28535 -21079 -10920 -36338 -32668 46690 114902 -6710 16018 -49615
15198 -49615 -75240 -56274 -75707 -79901 -16852 -68662 2297 81843 128405 133679 33133 -79741
15186 -79741 -124498 -92504 -113964 -99454 -53842 15278 43768 13635 -49285 -51484 -21729 -20674
15174 -20674 19728 4914 -12525 -20611 -25851 -59126 -72742 -78779 -75431 -113375 -149296 -120064
15162 -120064 -5240 58849 -22531 -67125 -20155 48046 59208 75775 142674 157866 220713
15151 220713 161132 139893 90647 63693 11893 28222 26432 74435 50580 -9970 -28919 -12980
15139 -12980 13385 -74754 -52716 -89914 -54402 -2180 12152 -8557 -60888 -188015 -206986
15128 -206986 -186155 -145033 -120345 -109498 -121438 -58514 -46793 -59115 -105164 -85577 -5464
15117 -5464 48836 53245 108963 49292 19335 -74709 -10904 23120 51297 40108 2023 -8110
15105 -8110 43553 105087 97830 15066 -6373 -70912 -80839 -54496 -93324 -86333 -56363 -572
15093 -572 33126 25970 2673 -4448 -29885 -46675 -65558 -111576 -32000 32035 29878 -39689 -11423
15080 -11423 17534 95388 123747 132625 161409 25169 -75406 -26701 -48140 -43641 30830 42822
15068 42822 25935 -35398 -27525 -26834 8569 60168 32401 -11602 37661 55796 77672 31286
15056 31286 -2915 -16940 22104 79412 98857 -9185 -93935 -91254 -82120 -45820 -19828 257
15044 257 -25685 -42136 -67302 -527 -15428 -41668 -50436 -214 -2967 -29056 -45817 -54837 32813
15031 32813 -28039 -3607 1571 -30850 -21142 -13722 -110683 -127212 -111656 -105363 -37071 -1084
15019 -1084 -15003 -16262 -52303 -101278 -152658 -77958 27707 -87194 -113576 -67626 -73212 -39618
15007 -39618 -61776 -210610 -258217 -315578 -224419 -165760 -106557 -3231 93728 138426 69313
14996 69313 6373 15193 -17764 -31998 -87520 -102577 -30976 -18531 -67556 -68244 9047 50066
14984 50066 24476 -53528 -130617 -104758 -84212 -79719 -103719 -126963 -72539 53641 99495 77726
14972 77726 51577 -12433 -82481 -66637 -83546 -10802 -77514 -202757 -213369 -88847 -41510
14961 -41510 25864 1013 24551 112614 147290 113522 192787 184820 138577 129184 31265 -2546
14949 -2546 101 78193 105874 48876 96800 113104 99820 170622 163924 137623 105550 53066
14937 53066 -18923 -28319 -41684 -23454 -22653 -51834 -188196 -191625 -106157 -21378 -22538 -49351
14925 -49351 601 -3819 10362 -13293 -35395 -51700 -74946 10398 -26706 6929 64557 45473
14913 45473 34440 -4829 8256 -33359 -109362 -81847 57166 99244 10726 29371 -13926
14902 -13926 -40580 -97020 -111999 -65350 -12435 42046 51168 -1057 8901 -37370 -150071 -144934
14890 -144934 -94480 -127450 -99623 -59189 -42313 -21200 50094 42647 -89985 -178323 -133333
14879 -133333 -10135 23107 53434 105868 91409 49063 85088 91791 151517 201427 171101
14868 171101 149107 154874 65476 -25151 -27706 -30004 -54564 -9260 -5155 -8535 71660 107455
14856 107455 86159 -2741 -39285 -48302 -18919 45278 55063 59570 16142 5976 38282 -1774
14844 -1774 30070 73747 90895 83502 108543 40359 96353 35156 639 -53097 -65752 -51503
14832 -51503 46756 115672 131036 89362 92458 21500 39563 1012 -17790 18179 2645 -3462
14820 -3462 -20016 -28128 -114482 -78472 -40542 -7067 63534 -5911 -55507 -133999 -104486 -56235
14808 -56235 -34814 -65832 -30231 9234 92081 100210 54041 -4905 43538 153484 129957 107307
14796 107307 67473 16868 -75085 -74497 -51188 -3741 5912 -17107 -62249 -43587 -46947 -71490
14784 -71490 -106891 -39361 -78962 -139295 -42602 -6621 46221 77188 31969 95049 63768 49650
14772 49650 60718 29488 -113237 -117261 -111764 -142605 -118943 -90473 -92751 -83376 2831 -39258
14760 -39258 2318 61456 -15187 42059 18271 14744 7361 -41097 -81347 -144632 -170031 -144502
14748 -144502 -48989 -24747 25607 69355 54387 33299 -47008 -106117 -25425 17203 -72818
14737 -72818 -112224 -59049 -15195 -92417 -122673 -123488 -109398 -82902 -81426 -89045 -84095 -9082 13678
14724 13678 56426 30081 19052 -33681 -15068 -17443 -25253 -56147 -91367 -99745 -26411 76497
14712 76497 82538 6971 70531 33442 -9609 -25264 -76118 -130403 -141787 -136492 -48843 -74425
14700 -74425 -125312 -68790 -5163 104178 105883 120922 124191 42217 13594 27188 155611 206389
14688 206389 78513 55515 70670 61962 60477 129690 175810 145085 94316 94041 33365 -30609
14676 -30609 -88673 -71167 -9926 -20481 -30098 -31577 -17550 -5032 -25886 9722 27659 -7042
14664 -7042 20169 -15425 -47237 -46508 -66332 -37727 -49596 -108540 -103906 -36358 -17109 -80607
14652 -80607 -17261 34635 111800 118042 3824 -40739 -45921 -5110 9729 -49794 -152978 -145847
14640 -145847 -138611 -82691 -68716 5482 -29076 -16538 9045 -4211 -29384 -17919 -86340 -150013
14628 -150013 -99136 -32182 -35823 -57850 -34201 -62882 -129209 -100010 -92021 -35991 -47246 -38196
14616 -38196 80718 148653 156923 142802 3853 -40919 -17562 -64638 -104898 -78670 231
14605 231 1120 -12646 37024 111639 158470 95057 -6082 36849 101886 90087 28700 28722 7778
14592 7778 -19141 41175 90927 58250 35591 -38296 -147757 -91435 5933 47442 67026 52411
14580 52411 12720 -66286 -71067 -25640 -24380 -11538 -39417 -32611 37781 12729 13600 2530 -71560
14567 -71560 -52319 -3949 -55149 -167861 -181604 -120090 -70643 -150504 -78030 -99971 -54744
14556 -54744 -10275 15446 25914 18928 19140 8696 13994 -17320 -89595 -67060 -6931 -36913
14544 -36913 -46685 -39479 6146 21216 -34992 -66205 -56875 12971 -14173 -6252 2827 44304 12263
14531 12263 -38224 -54805 263 13804 -35198 23224 56370 76480 166927 175692 181411 134177
14519 134177 59824 20695 8962 -45504 -41096 -6650 29823 36827 -15965 53197 74008 27745
14507 27745 -30126 -48593 -81531 -11973 19877 -27406 15894 12220 72969 23756 -30769 -61437
14495 -61437 -94006 -4265 -7380 -65197 -43943 -46504 8266 42368 15461 -68688 -82347 -43053
14483 -43053 -32443 46697 98074 98486 90970 61294 32087 -15553 27113 -12877 -29017 -31721
14471 -31721 -19828 141 20031 68870 104615 465 2139 44693 61562 1746 -115742
14460 -115742 -18378 -12490 -47165 -4860 -62938 -51960 -13198 99910 131333 -11085 -104044
14449 -104044 -147710 -112435 -65930 -77201 -60369 5727 25542 11651 -35330 -92151 -85222 -107101
14437 -107101 -153979 -51853 25957 92754 167048 101437 8972 13000 26800 -21682 7119
14426 7119 34401 70176 85723 66124 81239 147977 256769 213535 185941 163714 103275 33040
14414 33040 3130 -19257 -40382 -20170 37395 22622 -15624 46517 -8332 -55084 -40479 -17952
14402 -17952 26579 23918 33803 48590 79224 115253 150984 107230 15435 -71328 -48838 -56889
14390 -56889 -172565 -116591 -130365 -122620 -107101 -72786 79529 43554 -40749 -105525 -33506
14379 -33506 52539 32495 -24946 -77625 -83648 23162 -32537 -97759 -49210 -41340 53396 133018
14367 133018 131034 47320 -51459 -95648 -126795 -169865 -149720 4669 7950 -29774 -70585 -91800
14355 -91800 -53777 39863 57034 32859 26310 1489 22641 -15899 -51319 -1845 12324 -56531
14343 -56531 -134410 -114825 -64915 -62207 -16911 124038 133418 131277 93801 -6512 -67297 -130060
14331 -130060 -101383 -108263 -132002 -181355 -194218 -68008 20265 -31355 -70520 41481 62126
14320 62126 59509 33609 -77747 -68642 -30633 -18020 -8176 -24077 -73423 13346 92066 131967
14308 131967 96214 47162 -36434 -130981 -78812 -104851 -29288 25262 38120 108032 118442
14297 118442 124816 114211 85297 58276 -69432 -115586 -21676 -21058 -62724 -28846 23474 -10078
14285 -10078 13609 47058 66020 36238 -7484 -84060 -127884 -71522 -66137 -8781 74803 83358
14273 83358 71119 86688 32472 19767 10489 -54797 -29778 41162 95453 46971 59060 105635
14261 105635 56008 39029 75616 15296 -30359 -37581 -70800 -106352 -184709 -194193 -150175 -180249
14249 -180249 -154207 -102903 -66753 -34353 -80192 -89483 -28540 35746 102579 112795 69429 -37700
14237 -37700 -69754 -34647 -29219 -20753 -32926 24757 30700 -48454 -22350 -740 -35545 -68645
14225 -68645 -22171 -57046 -104071 -86797 -62095 -46742 20439 -1291 -10172 -64979 -102426 -45826
14213 -45826 5671 32144 -44388 -128031 -88277 -64121 -79808 -100895 -77809 -68091 -14846 -48154
14201 -48154 -134652 -118713 -135011 -168251 -225653 -162398 -81462 -130 9843 -41684 -26810 -2349
14189 -2349 35513 45015 -54750 -107345 -131165 -119678 -66130 -54044 -11530 -4163 34394 -29601
14177 -29601 -41925 -70062 -147498 -110752 -43964 71292 107848 82200 87088 62205 -94215
14166 -94215 -174823 -162392 -150434 -67312 43892 125358 148799 110086 106048 92441 48239 19466
14154 19466 34079 19710 3396 -74330 -134874 -139563 -148873 -40638 38786 103373 37906 -42090
14142 -42090 -81784 -150575 -150423 -101061 -80424 -54730 -83101 -98598 -52521 -43352 -66988 -40131
14130 -40131 -105366 -59620 23281 72656 -12585 -45028 13399 -6296 18924 30553 64893 102034
14118 102034 111913 33486 -56352 -42624 4220 15075 -6519 37825 61228 63708 19717 -36722
14106 -36722 -44787 -21090 1484 16990 92592 101849 37833 -45962 -144408 -157158 -166363 -99194
14094 -99194 -3473 -24337 -99734 -83901 8969 12700 31770 72068 148564 128539 110212 24796
14082 24796 30385 43517 38838 26528 47943 24997 47614 98161 54678 -18783 -31409 -27262
14070 -27262 1290 57528 83205 124650 154804 -3051 -137254 -151857 -38757 17184 24689
14059 24689 57471 52272 14969 75161 115526 23442 -85281 -91459 -27740 -15328 -60015 -65908
14047 -65908 -33571 -40756 -121677 -75033 -127245 -117040 -40177 11900 21415 9651 13468 27532
14035 27532 53268 89830 79817 42472 39734 56405 -29536 -32552 21472 32241 57289 14373
14023 14373 25481 143661 64890 82862 76451 -23771 -51298 -100498 -81482 -69123 -88558
14012 -88558 -60125 -82772 -29113 -20245 3501 104202 104884 -24044 -115952 -48923 22574 -68933
14000 -68933 -70568 -93965 -130976 -145737 -124895 -156118 -109373 -61366 -92875 -134583 -122272 -33489
13988 -33489 2863 -60537 -90382 -22642 -20232 -73102 -92720 -78243 -28958 44002 97276 138589
13976 138589 125212 104247 111253 159761 124544 8269 -59610 -50980 -155298 -173089 -55677
13965 -55677 25249 -7957 -21082 -7288 65290 67598 26723 -18782 -73890 -184430 -163955 -76137
13953 -76137 -106448 -85004 -9864 49696 96128 171547 155452 61251 89734 34753 -2068 46905
13941 46905 97848 149326 140697 59101 -105663 -165454 -135150 -121566 -80847 -5620 -15025 18341
13929 18341 23643 5160 36815 108323 64436 32002 -35939 -28405 61747 117159 127053 101886
13917 101886 81176 46009 104692 115902 39538 12112 4976 -67844 -102500 -53765 -13562 29393
13905 29393 42039 45830 53522 53059 33418 89810 76367 49675 13730 -43559 -45908 -59667 -112994
13892 -112994 -104745 -41105 -571 17241 51109 135013 114249 134117 150708 183260 151559 40606
13880 40606 -80737 -168651 -100014 -88031 -49639 -33836 -108656 -137312 -116684 -77299 -76943 -108190
13868 -108190 -144426 -107559 -87581 -54604 -75035 -35108 18185 27916 11248 55894 113963 66166
13856 66166 -42283 -61944 -98290 -74695 -58295 -85903 -116708 -83029 -4849 109652 55248
13845 55248 10201 -24161 15788 83728 101106 1939 -58685 -33176 -32576 -83034 -26093 18368
13833 18368 4025 74593 101790 98019 129751 45125 -14124 -24689 -4498 -37430 -33976 -18363
13821 -18363 17160 56766 26244 -32791 -51925 -46543 -52474 -68331 -83756 4467 40230 46046
13809 46046 111599 80866 30973 38074 50442 36299 54225 118646 108665 75057 32111 10731
13797 10731 -11492 -71507 -22909 2155 34539 103133 93388 44666 -33740 -11160 81107 101259
13785 101259 -5387 -114924 -120849 -33221 52122 10364 -200 35700 117425 102632 59423
13774 59423 -36197 -125122 -100234 -67070 -118328 -125627 -73625 -147803 -183383 -138772 -73908 -19353
13762 -19353 42912 127415 117714 3015 -12555 53274 52232 -45693 -79382 -49373 -61320 -87274
13750 -87274 -26296 28623 31902 -30830 -33664 -24325 30384 18907 21410 -68779 -97567 -100198 -96184
13737 -96184 -124337 -90506 26752 19575 -57715 -118035 -175829 -174690 -89518 -21941 -65804 -135439
13725 -135439 -116386 -72748 -99907 -135291 -88185 -41586 -7750 -13317 43590 -24130 -43313 -12827
13713 -12827 -60118 -124757 -157431 -57170 -49405 -103334 -183953 -229295 -192067 -146995 -51360 41854
13701 41854 42902 -17076 -99910 -75144 -32118 -59872 -96935 -82896 19796 33737 31791 60603
13689 60603 82080 122154 149962 107127 148108 217189 286553 188852 36782 -18404 21413
13678 21413 27866 -79515 -47437 -14862 21559 16308 -48906 -57962 -53423 -23497 1889 -106104
13666 -106104 -144383 -86310 -49089 -62991 33302 72172 16624 -26167 -25001 39666 105497 34934
13654 34934 -101673 -134723 -142128 -146642 -126894 -82334 -35992 7062 -18118 -5716 12191 -19632
13642 -19632 -110254 -30973 -40483 -160531 -117334 -57622 -6909 7117 -46354 -62341 -75019 -102869
13630 -102869 -11449 45786 30058 47284 63233 45602 -7684 -66131 -23582 2164 22266
13619 22266 -19131 -96535 -171026 -103929 -32622 -34712 -41261 -11303 -44283 -70962 -3391 -51725
13607 -51725 -53655 -61139 -93277 -83330 14317 20424 16826 47183 -15997 -8384 89083 202328 320426
13594 320426 185936 36413 -22269 -34303 -57845 16896 32128 60019 68993 92861 98055
13583 98055 79176 68428 20606 10397 12984 31673 82127 103154 22362 2357 20012 87888
13571 87888 46243 -91411 -151180 -193125 -110127 -5822 24527 88270 99190 67569 -1638
13560 -1638 -84016 -126917 -49539 20162 -42369 -57359 -2278 -19461 -59459 -56695 -38218 5943
13548 5943 -18288 -106950 -120055 -14640 -9968 -36569 61421 79839 6459 -64367 -52129 -75615
13536 -75615 -53795 22773 42813 -68038 -84783 -114655 -91261 -72421 -73176 -54905 -25658 -57114
13524 -57114 3047 13085 -23361 -8005 83513 77489 27614 16563 54610 69960 -3052 -3418
13512 -3418 8811 -41909 26611 58171 3469 32455 144771 62353 29864 -5974 -123667
13501 -123667 -90016 -55149 -3201 105983 179790 146537 39662 -25433 -13096 89924 94387
13490 94387 21599 -28457 -69734 1391 8585 40605 76288 36075 45225 -3941 72991 121338
13478 121338 97128 133813 121916 118449 114442 59028 23697 -7107 -22894 -59493 -198 9057
13466 9057 18702 92605 77459 -42191 -17349 19728 -44496 -109781 -54226 611 61875 62032
13454 62032 69206 38688 -3978 -39032 -61008 4684 -30358 -64405 -14315 98819 67963 -16053
13442 -16053 -66399 -40865 -104489 -160387 -82063 -59968 56487 29135 24667 110661 179723 186007
13430 186007 129009 99066 128831 57482 37502 61255 -44900 -82332 -137199 -124281 -121518
13419 -121518 -109055 -115472 -94278 -78518 -4656 67066 114389 78120 -30624 -26723 -19365 -39139
13407 -39139 -66192 -41751 -58239 -48323 -19660 -30291 -69850 -66021 -105315 -96599 -78208 34639
13395 34639 118709 84444 52334 45902 48061 51877 12367 30853 651 -61557 31989 129685
13383 129685 16631 9581 30213 50271 81454 82935 27754 -10213 33388 -35659 32911 91996
13371 91996 45782 -34669 -60938 -27139 -59734 -29159 29737 -50944 15864 67471 106290 67327
13359 67327 -38774 -63400 -63213 -69146 -62623 -40556 -79073 -88075 -84647 -59493 25672 77967 -14490
13346 -14490 -73005 -89224 -167219 -103499 -56327 -70701 585 -31404 -21516 -105132 -179505 -124410
13334 -124410 21716 74485 54919 14935 -39593 -65282 -107297 -56912 -89 -19151 -152906
13323 -152906 -177435 -156816 -61937 -5316 -15493 -66161 -72150 -25702 -87129 -135261 -112696 -118446
13311 -118446 -102292 -55601 -4081 -20953 -73732 -43604 -18909 51544 91144 37356 9198
13300 9198 55564 125234 36282 12044 -37266 -55913 -55772 -100796 -129601 -178874 -147004 -104434
13288 -104434 -63555 -32299 -8166 -17287 2985 62988 163306 144235 84409 56683 42267
13277 42267 92746 46484 18557 35876 51963 11157 -11093 -62843 -124462 -132314 -69034 14440
13265 14440 -27777 -52796 15252 65459 34528 39394 33869 81550 95783 -81553 -142291 -161348
13253 -161348 -102899 10677 9703 -43945 -80959 -32988 15757 -14503 -101823 -67360 77901
13242 77901 86424 30903 17901 -95302 -148800 -142768 -14417 65968 91813 47525 9838 -59657
13230 -59657 -86868 -46587 786 13253 -31445 -90451 -84702 -112495 -64813 -39028 -78684 -34198
13218 -34198 54213 -14833 -96567 -87643 -60850 -44963 19850 -32589 -76672 -91908 -89902 -89769
13206 -89769 -127787 -120237 -20763 26729 33775 20016 69689 193585 186539 97861 37996 96429
13194 96429 137173 90506 47845 -103285 -58005 25112 55287 -12365 -3728 -27886 -59280 -80583
13182 -80583 15904 67430 -19103 -69430 -47497 10093 96862 81137 104541 39158 -79570
13171 -79570 -156196 -142018 -71535 -16404 -13447 -96023 -125662 -141364 -64465 19346 38863 13374
13159 13374 -12625 -96162 -60289 -92018 -128307 -64109 -61390 -27584 -80808 -68704 -57052 -145336
13147 -145336 -174190 -86479 -35837 -56975 -62105 53617 75339 59395 42084 18316 10649 -58295
13135 -58295 -109194 -102830 -94013 -73514 -28556 -52242 -119287 -109166 13330 108945 109287 93624
13123 93624 86311 43031 44282 14091 -45849 -54574 -132006 -105233 -57330 -131921 -151413 -145499
13111 -145499 -62947 -25408 -11233 -62811 -58854 -118216 -166117 -162134 -153897 -138335 -91143 -95417
13099 -95417 -78841 -35976 -40418 -78855 -142482 -154948 -134359 -173619 -121240 -47415 -11085 -138570
13087 -138570 -160554 -123552 -136324 -149603 -201430 -175459 -158456 -97844 -55927 -64424 -128074 -86879
13075 -86879 -34348 -107686 -170920 -98487 -28420 56625 70608 131772 103401 51538 19581 -19334
13063 -19334 34643 68949 60437 99920 110483 22809 -89280 -87858 -67240 -48966 -57435 -6224
13051 -6224 17505 5299 -16180 -102007 -40056 -1952 29991 -3675 -14730 25608 -10524 9172
13039 9172 19917 70095 24329 18933 38774 -90 -93603 -5249 93763 178793 183809 170863
13027 170863 150471 74354 71334 -58335 -24016 25827 17128 31430 42640 67936 -9116 12188
13015 12188 -34001 -68045 -34179 3520 30235 14984 -29907 -15021 -41638 -31466 -25101 -353
13003 -353 -28598 -83157 -125001 -101695 -117997 -97159 -42579 -19426 57294 141289 181122 139917
12991 139917 154458 143626 82772 13229 17812 -6943 8272 -5215 6603 11249 51324 40564
12979 40564 -59784 -106526 -85169 -40695 -25177 -70061 -21881 -81722 -107124 -51458 -109464
12968 -109464 -127549 -191942 -122336 -58314 -52351 -69881 -7792 -31740 -68554 -75003 -25047 -46102
12956 -46102 -35328 -19143 -38997 -18975 2541 7269 41622 -1898 -33964 -38738 -69181 3377
12944 3377 10274 46936 7375 -20834 -10192 3532 605 24663 -4294 -73566 -82037 -61797
12932 -61797 -51397 19056 93911 143541 136021 106743 133531 178811 193839 67752 25334 67099
12920 67099 64124 53926 -4774 -10363 -25710 33159 126264 93736 26350 -20371 -24708 -75598
12908 -75598 -10223 113091 227682 194422 168061 87279 110299 165357 110346 -80612 -166425
12897 -166425 -120284 -68636 -38766 -61683 -92203 57555 99357 77696 83541 14737 2265
12886 2265 30200 13468 16917 -9118 -52443 -7522 -18429 -163217 -238616 -195586 -95895 -24737
12874 -24737 26264 6999 -34015 -76294 -25290 -33226 -71392 -87382 -79613 -19834 2849 -65815
12862 -65815 -96115 -22595 -12154 -53919 -49652 -10729 12625 102850 76338 -44063 -62469 -32153
12850 -32153 27763 -14520 14975 -15956 6226 -30749 -89693 -60533 -33752 -18520 660 -38249
12838 -38249 -57809 25593 50885 122232 62013 -14015 -16740 -15303 17279 28578 10127 -1699
12826 -1699 -192 -10159 55493 60371 -18519 15222 34848 -1922 -11478 21945 68784 120693 184674
12813 184674 199727 138295 141432 130726 51475 4728 52551 68901 90278 146027 55085 5630
12801 5630 39522 31704 63715 159549 141922 95268 58598 14836 -67244 -15279 -33277 -72150
12789 -72150 -101799 -104418 -75949 -50053 -70313 -62216 -15448 59637 60414 37517 16770 -131756
12777 -131756 -181650 -112016 -94679 -89633 -94175 -45687 -74190 -60129 129844 162316 102490 93924
12765 93924 23986 -6442 30222 30738 29764 44628 4251 -42229 -7585 10102 27973 14120
12753 14120 -73875 -67927 -87986 -115097 -107047 5297 69987 60935 78983 108544 64981 -2994
12741 -2994 12413 105439 44625 -62817 -86027 -125396 -107914 -155994 -183793 -115180 -25138 48418
12729 48418 18874 -24496 15750 -518 63967 77012 87777 179621 226592 191644 123641 117293
12717 117293 99840 63911 48005 101190 70259 31209 48145 62878 27454 -62062 -82696
12706 -82696 -98063 -105340 -143894 -111171 -41194 -3276 81211 172579 178802 166838 71841 42872
12694 42872 74627 60572 32843 -17576 -75275 -126196 -54854 15355 2716 -20672 -111075 -178098
12682 -178098 -87551 -82891 -44851 24724 76333 53587 75840 40587 -46046 -41228 6622 32498
12670 32498 76784 36857 -15276 -105861 -223213 -190724 -131006 -63324 8157 12459 -21719 -20870
12658 -20870 -18058 -23203 -39818 -85433 -93116 -90162 -129454 -50512 14129 47173 9202 27795
12646 27795 -13842 -15414 -40476 18370 -31629 -42675 -65061 -170797 -241005 -73206 89505
12635 89505 103919 74729 -11223 -66286 -71193 -103012 -81264 -21702 -66202 -3984 45117 -18831
12623 -18831 -45540 -88189 -51101 6910 8253 36162 24064 -30038 -76688 -108085 -111146 -161277
12611 -161277 -108094 -61808 -26585 12004 -31907 14554 84445 43973 -34365 -66605 17530
12600 17530 44659 -6542 -21506 -12420 -269 93542 69439 -7523 5645 -12509 35077 -2271
12588 -2271 -46128 -88913 -78367 -64679 -85356 -107664 -83096 -75480 -96798 -103585 -146582 -148332
12576 -148332 -122554 -105108 -81231 49259 92328 83104 21968 -7432 -85612 -42715 20953
12565 20953 39760 10329 34697 -10874 2554 62167 32684 3832 35977 8761 18933 66523
12553 66523 71324 89680 71950 7110 -52978 -29389 -12053 -75979 -143333 -17991 85112
12542 85112 115043 121333 154809 122765 81696 26424 69809 88575 122073 -4057 12459 27041
12530 27041 -12836 -70030 -2611 32973 42859 58707 44019 52245 135671 92897 84469 40578
12518 40578 78106 53747 146188 102514 -8057 -56522 -40368 31598 108199 72936 80047 92798
12506 92798 -14936 -7899 -37276 -12580 -37776 -8110 36492 42416 96623 40189 -64186 -93940
12494 -93940 -91491 -116469 -129168 -81783 26280 68154 22175 -24013 -39081 -24986 -44270 -99151
12482 -99151 -36900 20594 70784 67691 71407 49525 -32741 9241 34456 18638 -3113 -108906
12470 -108906 -231419 -214689 -118316 -54696 -23963 48507 80928 4140 -62442 21094 21734 -48763
12458 -48763 17342 78964 45716 -5361 -27349 -54523 -6884 7487 77141 135601 69695 82590
12446 82590 65037 -67702 -66200 -132589 -87825 -45304 -69171 73256 71539 -4405 -30193 -38335
12434 -38335 27143 31990 63869 72746 13657 4434 51143 68227 -8705 -63562 -81032 -38244
12422 -38244 -12099 -150546 -210690 -102252 1343 -7088 -16788 73211 57561 75944 66706 4231
12410 4231 -53304 -69073 -101211 -99423 -77548 -132977 -69695 -67227 -21860 12723 11666 -82266
12398 -82266 -151245 -158913 -117243 -32537 30334 7479 -45480 -70644 -49624 -34401 -45363 59461
12386 59461 71471 -2304 -28364 -63064 -56583 -97165 -40007 -52477 39151 58980 16992 28564
12374 28564 76808 12195 -74811 -57283 -79579 -152194 -136087 -13658 82621 7855 -38195
12363 -38195 -141170 -149880 -92074 -155852 -162006 -184949 -163440 -81296 11780 86838 133684 117227
12351 117227 105273 65302 -37541 -31637 -11081 -24359 -39998 -16808 42693 88510 191654
12340 191654 174610 118749 54193 10626 -19899 3182 36791 39233 -26827 -373 45001 71826
12328 71826 79944 118667 89140 29481 -26089 -60901 -67872 -44370 -39693 -26390 -31650 -41317 -24928
12315 -24928 28902 57076 -1188 6124 -2178 -4311 50640 28618 -26206 -60254 -116590 -57737
12303 -57737 -20604 -145758 -85700 35166 -35606 -52229 -35340 24469 35929 -3281 -62069
12292 -62069 -155173 -162319 -220068 -210818 -183592 -190826 -108469 21484 5297 26929 37317 2690
12280 2690 -49664 -52152 -90495 -123516 -119922 -38586 16894 8093 -64960 -56812 -23254 -134961
12268 -134961 -157756 -3246 27261 7423 19538 -3072 -59793 -18078 52792 -36879 -35358
12257 -35358 -27486 -49268 -143685 -110933 -38722 -23385 -14716 -13189 -42962 21858 104463 208960
12245 208960 185942 117824 56110 40937 44437 18804 32832 50921 67750 -12775 -23028 -15201
12233 -15201 -71457 -91743 -109776 -123651 -100857 -58773 -45298 -21251 4764 7651 13867 14620
12221 14620 -17762 -52911 1823 -95016 -176800 -158901 -116268 -160957 -127459 -132248 -60350 -54123
12209 -54123 -103228 -110543 -90303 -119473 -40481 -103492 -148036 -46034 20286 40149 -936 -72597
12197 -72597 -58848 58877 32578 35734 42111 41801 41987 71618 133368 70982 14735 -86827
12185 -86827 -105432 -121152 -42664 -65990 -39856 -12385 -32520 -51297 -75413 -139200 -143221 -112780
12173 -112780 -122415 -118845 -90291 -145277 -168394 -140901 -27301 -17763 -110603 -67431 -54423 -18938
12161 -18938 117443 175684 131344 100147 78919 60975 47501 -13566 -26972 -38819 -16863
12150 -16863 -44513 -135441 -119820 -68046 -76667 -11595 52167 33964 13773 -22385 -24519 12086
12138 12086 -46825 -79809 -113 67419 37613 -19900 9447 -10806 -131775 -150410 -58283
12127 -58283 -17286 4594 15717 33371 10939 16788 -50009 -39368 -36126 -18089 -13830 -31088
12115 -31088 11218 -22577 14241 35750 28770 -45475 -66111 -88044 -5351 42870 73755 47502
12103 47502 -1243 -63891 -20724 -50874 -29332 31367 4254 8980 1680 56275 99797 132712
12091 132712 145816 75534 57513 25564 -842 62475 167430 219812 131671 105238 131343
12080 131343 134685 101057 58854 36185 55351 57432 31727 48697 57113 48577 -6672 -74403
12068 -74403 -73613 -39123 -6480 84896 59941 107679 128119 157942 88775 -52139 -133112 -70167
12056 -70167 -88114 -41317 -38987 -15919 -69809 -62827 -6766 14255 14884 -11894 -51465 -7555
12044 -7555 29109 -16228 25410 16011 52344 23396 64396 66043 26338 -2226 24572 71054
12032 71054 177095 256319 212728 170122 110508 82723 -58313 -108779 -83747 -16234 -30268
12021 -30268 -100620 -76762 -75150 12516 20456 -2261 -14902 -10842 4413 -34337 -21278 46499
12009 46499 55516 -23629 -14976 37591 -40772 -63124 -19207 4474 -4334 -87432 -142750 -137869
11997 -137869 -100745 -99313 -122419 -77993 -12325 -49475 -89979 -40411 30888 89760 72465 84082
11985 84082 120119 137023 219965 181031 123786 53681 -32756 87005 92702 -3682 -50102 -38998
11973 -38998 19342 13261 48667 82659 44625 30508 118200 123919 93778 97993 155879 100358
11961 100358 123072 109243 111785 89771 -2974 -64693 -33179 -12872 -12500 -119297 -106554 -75635
11949 -75635 -113360 -142699 -50270 -20328 -22265 -11302 45753 -44413 -37287 16724 36604 52184
11937 52184 113683 47479 -11586 -1528 -6815 55636 72238 84245 90028 69255 78328 124381
11925 124381 94909 109650 77402 37448 44320 64688 135155 112484 107723 66469 90783 100894
11913 100894 107444 68949 81530 88566 45128 42570 36872 13963 -7346 44034 8880 -98718
11901 -98718 -58140 40943 105173 33689 -21466 -65935 4522 58327 86303 90505 -1217 -116424
11889 -116424 -45883 81747 74888 -55305 -81660 -180805 -241689 -199677 -48557 52672 25112
11878 25112 19676 34149 14892 -61925 -36432 -6138 42681 -9450 -83403 -79203 -28416 16107
11866 16107 -1624 30230 50614 -5562 -16248 45334 -18817 -43520 -7738 -57079 -30401 -520
11854 -520 -686 -81111 -146078 -166044 -154697 -49747 217 -36282 -97182 -151992 -35312 -81451
11842 -81451 -69596 -132569 -57995 17348 -54366 -26243 72961 60046 11363 9763 11078 -45940
11830 -45940 -77400 -94729 -78135 1556 -929 26913 -27094 -77754 -50240 84889 134977 152292
11818 152292 102182 104032 115833 149352 187242 118152 23772 -36076 -24691 43529 30680 63301
11806 63301 67133 -5731 -70342 -54633 -96750 -158024 -156613 -49709 45228 73891 64022 48382
11794 48382 -55215 -176069 -146096 -89382 24313 -6503 -46937 -58762 27756 83668 18994
11783 18994 -35476 -8671 56103 99835 -31227 -59350 -25336 -67250 -24993 13078 -5644
11772 -5644 18867 109345 122448 91254 54242 67955 84584 107450 102760 37158 -10750 27146
11760 27146 49815 34702 75414 31768 85269 86441 753 74 56092 55658 68607 127631 117355
11747 117355 55003 51348 -27779 -128629 -121499 -19749 25406 -66861 -21049 36128 21517
11736 21517 -11189 -38330 -22266 -42246 -41523 -46851 -19172 92582 124037 54199 71042 108202
11724 108202 -21854 -39668 -18283 -2001 22023 101333 8783 -5937 39674 -12985 -87294
11713 -87294 -133937 -105953 -78049 -107293 -63850 -39121 -7919 -26050 -42963 -75496 -102954 9171
11701 9171 102558 67964 46876 28173 463 24994 45326 -2759 -59438 -90927 -100891 -21291
11689 -21291 43807 -12359 -3910 21185 27266 -12225 -68208 -49912 7780 -430 -49739 -119295
11677 -119295 -92772 -5470 60642 53174 40149 -53118 -123761 -84250 12438 93077 11924 -106660
11665 -106660 -183824 -126551 -42711 -53619 -21940 -28006 23999 40033 60753 76061 3693 -23873
11653 -23873 -63533 -19095 5577 -82832 -146570 -151998 -111851 -55983 -84691 -112288 -99719 -13125
11641 -13125 -79 -66536 -12360 53936 -34037 -48489 -39313 13443 32506 -67608 -170867
11630 -170867 -123020 22073 36198 -47811 -18204 -25331 39578 7188 -30526 -11513 54236
11619 54236 63700 62347 88795 33208 -17010 -61043 -15596 46316 73351 121193 116059 73749
11607 73749 62043 -56637 -124729 -62329 65207 66876 -33233 -136649 -164892 -65738 9853
11596 9853 41350 71212 88902 59506 49624 46147 -9382 -12149 35841 -63504 -75660 23612
11584 23612 9034 -53333 -44881 -55777 -39418 -38697 6157 81472 57447 60313 10931 15524 50630
11571 50630 69205 37117 116 1483 25507 -107498 -129933 -65398 -38274 -49918 -94288 -26503
11559 -26503 11034 37387 79439 33965 -104087 -136193 -43513 -24641 -118220 -161910 -56180
11548 -56180 -15538 -68405 -154828 -139172 -172546 -93133 7199 112392 164421 188646 92598
11537 92598 55134 58419 6362 -5017 25744 48113 10038 -87946 -76226 -252 41458 7380
11525 7380 -12899 -50143 -78047 -100304 -126521 -70470 27992 39027 34008 45192 10066 -60593
11513 -60593 -42772 -72102 -52258 -109410 -117563 -103899 -146699 -65605 19705 -1939 39360 8437
11501 8437 -100751 -55417 17932 35616 -7307 2745 76956 130808 111078 60394 77779 19135
11489 19135 -133636 -158374 -179672 -115491 -20256 10401 15908 -71378 -28093 25991 -87356
11478 -87356 -116282 32265 -16545 -54185 -31481 12730 89426 152515 181130 179801 177125 147957
11466 147957 50852 47414 51851 39554 4221 9209 1026 -47320 -28328 -26322 -74449 -70003 -56653
11453 -56653 -58350 -36603 21463 91491 139404 83780 39965 7487 -20425 -17081 -51662 -69829
11441 -69829 -134968 -129112 -78885 -39304 2582 33820 17505 -14724 -30640 13656 70646 75777
11429 75777 -5362 -52677 27767 107743 78873 35827 -23541 -57987 -157492 -151689 -47079 -23672
11417 -23672 34175 16426 -68231 17944 60644 123103 124046 163780 108262 36356 84743 113632
11405 113632 6312 -72145 -124593 -49634 90279 35783 -25309 -10195 13158 31644 -8407
11394 -8407 -142755 -113088 -13433 6355 84683 71970 -10796 -45134 -79892 -132083 -61675 54910
11382 54910 175085 115026 55004 -20168 -57336 -62169 -59599 -29446 -29271 -83628 -118575 -72046
11370 -72046 89620 171119 67699 -89558 -117758 26509 70172 68639 116057 151888 167604
11359 167604 212373 213252 114171 29120 56120 -63887 -132949 -124930 -54386 -46299 -118714 -197253
11347 -197253 -181653 -115748 -55912 -136091 -167982 -121248 -30400 52822 53929 -3253 -101599 -80607
11335 -80607 -108083 -31839 124557 167636 122948 82194 78263 15481 -62380 -51055 -64407 -73159
11323 -73159 122 -49578 -69144 -92888 -77600 42253 16246 -109906 -138793 -64091 -89424
11312 -89424 -134747 -110240 -82544 -72980 -121918 -151074 -114771 -32126 -38683 -83385 -76856 -17580
11300 -17580 33406 7865 -1738 -43459 -65568 -48499 -78294 -61057 -57398 -144936 -116784 -98319
11288 -98319 -71573 326 83277 120991 120949 60160 11280 -35888 -56 36607 -59269 -92187
11276 -92187 -199069 -185307 -85287 -57841 -29782 -1835 -19712 -91143 -155538 -197791 -170549
11265 -170549 -85841 23092 683 23051 18063 52585 131983 136984 89314 62938 21982 -75653
11253 -75653 -140174 -166907 -133996 -12583 -67582 -59566 618 92582 108345 84666 42454 12369
11241 12369 -49654 -85096 12956 69230 144669 104904 72869 -62311 -151900 -114474 -123418 -104070
11229 -104070 -66401 -71200 -103128 -31677 20076 5422 31012 23790 29970 38328 -30662 -25165
11217 -25165 -42313 1812 99391 97646 162917 131101 24300 575 -61169 -162257 -160432 -54953
11205 -54953 2148 -47157 -59004 -104781 -73786 -87981 -54185 -56947 -39985 11284 30699 5269
11193 5269 -77188 -81006 -7233 52785 80316 72777 3431 -16574 -58629 -50707 -35164 -127604
11181 -127604 -98848 -77261 -89121 -51768 6127 43912 -36307 -84306 -48714 -97921 -93651 -53797
11169 -53797 -2634 49287 73487 82205 51202 32580 -25964 -53405 -19190 32397 32926 30890
11157 30890 -16288 20156 -820 27657 184972 160482 163066 174807 187819 213894 112661
11146 112661 4378 70 -2154 -40762 -42477 -46499 21484 14559 18020 -7302 -8401 17464 1184
11133 1184 43550 82175 63973 41904 49909 56540 34852 -69201 -87564 -23837 -44132 -32758
11121 -32758 -29376 -19173 -74057 -158638 -159609 -139977 -57689 34339 75905 36204 -40013 11922
11109 11922 89523 118937 38383 19589 34264 22353 42258 -1556 -60086 -96499 -25216 53613
11097 53613 -31278 -41918 -40593 -2179 -29437 -86527 -48904 -40963 -55315 -30924 -6839 20268
11085 20268 80185 102021 65097 10706 -25543 62838 78789 37182 -46334 -15066 -9111 -16826
11073 -16826 8963 33310 -25515 -115865 -47000 -18456 -50915 -66430 -41078 -51930 -47808 -52652
11061 -52652 -12852 3375 -20580 -57573 -40533 -40029 -16997 -38582 -74151 -72976 -14463 -148
11049 -148 -4743 8653 -44077 -14115 73681 53102 -27883 -45588 -85754 -109417 -46715 -2906
11037 -2906 -25753 -24770 -55098 -74789 -47914 -50216 -73321 -113000 -114604 -117181 -127792 -82631 -13175
11024 -13175 -48273 -41944 -101096 -160465 -148237 -4266 65311 22799 -16551 -38079 -125789 -129891
11012 -129891 -121651 -105426 -28849 -34513 -58169 -35490 15734 46334 -8539 -38941 -33796 -57102
11000 -57102 -57934 3767 44981 -13388 -132184 -92577 -171076 -213633 -163491 -72607 -33274 -19891
10988 -19891 45241 -70593 -166511 -136580 -27916 109931 164703 104436 35204 41684 80025
10977 80025 2605 60372 -8308 -91109 -80424 -11093 39089 118588 48154 -46387 -30886 -57317
10965 -57317 -2409 50519 67957 59271 7811 -32524 21768 130850 25767 -24276 17406
10954 17406 -32524 -26348 -40481 -31949 3827 41989 110109 177316 191587 154787 123254 87489
10942 87489 65586 102474 68991 18359 16170 4847 -12852 3470 9544 73552 65668 68504
10930 68504 63066 -23823 -27255 -16562 -102786 -94455 -136729 -168511 -145103 -113965 -84793 13342
10918 13342 102583 44812 -122315 -148732 -94425 -33836 -113725 -119479 -79945 -61592 -67792 -38525
10906 -38525 -5737 -40828 12932 47017 113256 130826 50871 74126 111505 51180 -78729
10895 -78729 -55187 -28048 -49129 -81722 -104835 -74307 -30034 -123248 -109937 -9597 50388
10884 50388 107004 124379 153071 116765 179756 156939 62372 46010 140783 142346 30540 -5621
10872 -5621 27596 -9926 -35161 -20007 -6819 -115173 -189701 -120263 -41643 -72992 -84820 -8918
10860 -8918 23549 72040 82772 110000 160488 147645 96978 116968 124911 122864 136863 139030
10848 139030 135124 89711 58567 62200 -24797 -57539 54848 100620 42013 56181 55627 105436
10836 105436 158030 98556 51227 60145 44690 84637 150738 167644 145234 38586 -23715
10825 -23715 -37340 -13823 -49568 -99152 -34341 -81868 -127857 -144577 -97337 20875 57647
10814 57647 13128 73365 133329 193432 178751 124627 174999 178535 111750 57744 -21537 -58905
10802 -58905 -44001 9623 24770 -57350 -94466 -74320 19366 120466 60216 -16392 14505
10791 14505 28952 6514 6603 -27974 -73052 -67875 -64561 -79244 -35930 -23477 -22877 14997 33264
10778 33264 71657 89929 80013 79751 97441 94469 104837 115099 175551 218533 149830 70459
10766 70459 63063 8033 -44712 -17538 -64672 -9598 72149 -21754 -23648 -2994 41877 24640
10754 24640 -11530 -35870 -31978 19929 9684 -53682 -52383 -41267 24380 55713 66815 -5052
10742 -5052 -48151 14361 25585 4341 74274 133354 61410 70438 31969 -59411 -68972 15596
10730 15596 -40339 -19477 36242 73565 96620 133131 53001 10615 30940 -37234 -27598 -76079
10718 -76079 -32215 -29548 14015 29462 -8307 -57854 -35273 -1054 40267 56471 136572 133684
10706 133684 131868 162205 159504 144513 94023 3700 -58937 -115925 -134494 -95287 -30108 37333
10694 37333 12003 -90538 -26023 -24805 2181 -36936 -48682 21422 134036 120250 119706 117095
10682 117095 68188 87803 154487 129575 63570 17424 8902 -23847 -31255 -26805 6436 55176
10670 55176 57722 34370 -6655 43655 83277 9786 -37024 -42155 -115662 -118767 -155937 -102120
10658 -102120 -51018 -61758 -83965 -155983 -129119 -2870 122575 164308 123906 112544 53859
10647 53859 30060 -32495 -74240 -101920 -156203 -92746 30303 106159 158927 127967 82474
10636 82474 -24836 -71904 -60109 -149701 -142880 -15487 21656 -5343 -8844 -47452 -80340 -195891
10624 -195891 -122423 -86175 -66189 -21379 -4610 3883 -13712 -3156 25419 32386 130820 102211
10612 102211 140739 100334 58605 54601 17241 130314 190903 169937 68079 -19304 12108
10601 12108 43269 36581 22906 -24181 -100513 -99096 -11692 35694 -39373 -134950 -115580 -22131
10589 -22131 -3571 -63975 -155229 -74351 -82034 -110881 -55111 43008 131361 121590 92350 157984
10577 157984 180133 179545 73460 -45490 -118599 -60782 -2285 15059 1529 22851 -3054
10566 -3054 -27948 -5974 -7608 -2231 18297 74476 83289 105528 111722 26292 37097 67900 33498
10553 33498 147003 155899 136570 145051 145588 59438 35839 -13565 -52170 -133577 -79041 -38975
10541 -38975 -19215 15416 94580 90350 68524 107946 68223 30741 30132 71806 51041 48190
10529 48190 14476 -40900 -15922 -50815 -18383 -60263 -31863 -25592 -24827 -9826 72854 100437
10517 100437 59456 42552 105390 22383 -29029 -47857 -78289 -60023 -52402 -76444 -113923 -150997
10505 -150997 -94378 -63782 -50996 47092 88106 82480 131028 132784 -2146 11829 71830 82441
10493 82441 68661 66243 89012 43237 5638 6273 -28039 8682 -27655 141 36266 106472
10481 106472 121164 137673 46017 -57323 -36596 28886 63397 -1826 22764 109560 67663
10470 67663 19061 -57740 -76579 -26577 22712 67674 78174 162244 128162 17985 7810
10459 7810 22440 89245 84833 21640 1636 27712 76509 89793 116303 146249 8751 -16759
10447 -16759 -4235 2366 32843 28406 35574 64759 126485 128627 90033 -15126 -49717 -41258
10435 -41258 -34406 -66306 -49804 -13448 29267 39755 25949 51891 39729 125117 173391 162696
10423 162696 125940 143498 112690 73250 66987 49435 35744 19703 1145 9968 54046 85334
10411 85334 151072 93957 37500 11335 -12511 -22637 -4647 70710 -24946 -97690 -61878 -22418
10399 -22418 17679 67103 108172 67475 108693 142788 116369 77330 39508 59354 56082 -3423
10387 -3423 33585 29662 -13460 52195 80041 62544 155386 156615 4746 -35289 -34184 -7706
10375 -7706 -59318 -47971 -83169 -96962 -48549 37206 67755 20804 -39020 -723 119760 153154
10363 153154 118711 83676 99330 147709 118651 123129 38142 -6934 33058 56823 -40251 -37381
10351 -37381 -43375 -13537 11325 43379 7160 24026 -11237 13630 44129 29242 -7062 -26660
10339 -26660 -1 -11592 51420 70652 47912 115237 170676 160702 153525 128508 183990 197933
10327 197933 163548 72998 38519 29192 36261 31676 8862 -19301 -8831 97966 97716 19990
10315 19990 -24225 37866 -18019 -10601 165095 279932 169068 110797 154708 214043 232556
10304 232556 82037 -38337 -25685 74210 56632 3124 -6029 -9390 61345 42238 87864
10293 87864 73317 68711 45020 35091 39496 133660 158274 78858 13022 55 77456 70476
10281 70476 -3489 -33359 121152 119086 14821 -12754 -38031 -76754 -77129 14160 91333 157743
10269 157743 243127 294785 259303 193471 179736 92758 30838 14090 38425 44155 75950 118748
10257 118748 75504 31888 71810 58656 73559 81034 57097 144921 147536 139200 133849 6604
10245 6604 -49113 -58734 -20974 6427 -60694 -88100 -64162 -64894 18832 39213 87160 51509
10233 51509 -5279 28065 48777 30614 84658 57483 43682 71563 132444 178704 218238 284115
10221 284115 291937 172080 133124 104681 139326 148526 96612 42803 53842 41154 21020 20482
10209 20482 79348 120178 74645 101656 150592 250247 251502 146244 97624 76888 150818 213431
10197 213431 184670 154894 120502 123543 53882 19621 -8091 -47751 87936 164530 231703
10186 231703 243332 263505 194637 100528 13895 -63834 -60935 -37912 -65874 -30865 15353 77617
10174 77617 -5412 12166 6098 31460 27695 -10272 5103 36007 39791 25052 16604 -35052
10162 -35052 -43225 29597 55229 28477 21529 20144 85120 145424 94068 48828 68608 2634
10150 2634 18316 53559 67957 42654 40265 14119 379 9763 942 2193 -53856 -78062 -156690
10137 -156690 -55883 -3419 26301 -42061 -18842 43746 69578 69213 20920 34116 64232 41030
10125 41030 12882 48126 12279 -9950 -4900 34817 46603 -53832 -54629 -4236 -10167 37041
10113 37041 59526 4613 7201 67586 103051 48847 -12488 -25283 -42871 -7490 27755 -7468
10101 -7468 -32308 -102464 -141633 -30429 63075 106636 124481 140429 97220 110825 184681 170936
10089 170936 96319 89840 119567 117163 209269 258188 283829 272556 181729 86692 135052 206135
10077 206135 131108 81019 1020 55318 128506 47612 -3143 -29558 -6808 63519 109771
10066 109771 70699 22482 99944 151884 114628 47973 5479 86738 236265 186064 160488
10055 160488 136630 104658 107415 63568 -788 39894 77757 80188 71300 86658 40427 -53092
10043 -53092 -19780 -31650 -22976 -8944 32744 66398 87582 168164 106407 90919 59526 17714
10031 17714 7279 69660 78870 53345 65922 31558 93332 188310 202368 205790 204813 53469
10019 53469 50436 116234 123345 99187 83934 82474 44900 13030 -16824 -88045 -94005 -37034
10007 -37034 84323 134387 74014 45489 81611 119776 155442 196549 191963 178357 219793 160361
9995 160361 197127 63688 92402 139119 52941 95586 106349 14091 -38032 37589 74098
9984 74098 103022 57256 38955 -5207 34205 37538 123345 106595 129845 185572 115315 106270
9972 106270 163419 164920 48124 17038 49846 69995 -16985 5535 65102 102039 143376 110719
9960 110719 110587 127248 84579 1625 -28367 46545 92165 62051 -4594 35485 85391 145658
9948 145658 172591 194869 116917 84099 82066 105283 177305 198794 116702 97103 123025 109213
9936 109213 132137 86093 -29325 -3359 140939 145364 96747 94248 164491 203507 196906 167486
9924 167486 90600 91263 168035 180821 115826 122035 114593 175397 271536 302433 172770 152365
9912 152365 130589 141118 175577 215419 184567 153465 198921 224532 265764 290285 249109 216736
9900 216736 215216 187903 207957 192545 183638 193196 169594 210313 139541 145629 180810 171845 112705
9887 112705 99886 177961 146565 127314 178916 157526 243062 245102 205495 198977 266895 220655
9875 220655 207836 275272 173797 83847 104844 187067 206886 197137 182219 233346 225574 187439
9863 187439 181945 195252 227159 176238 209527 272702 182482 146210 148994 89523 79244 85165
9851 85165 44345 34364 104585 120728 139349 103799 45291 147889 141716 108518 140382 226014
9839 226014 135044 63812 116000 193597 185456 121693 83180 139883 107989 65059 63874 79228
9827 79228 112343 78243 121 44477 61517 75862 61580 105386 55066 87059 87999 106728
9815 106728 136156 140484 139348 211794 237104 178533 130257 74153 14989 39023 89639 140440
9803 140440 173986 130817 79315 13314 11404 74880 148418 152211 197144 150319 115925 227686
9791 227686 221058 72276 1705 85729 206111 235325 176051 155142 177202 216496 162131
9780 162131 165147 240188 219592 187246 223355 289277 285987 199554 120132 175934 230712 323717
9768 323717 343745 282405 253546 182139 148321 84571 61491 -5225 13385 154172 214170
9757 214170 193688 262618 310472 249378 191589 134910 152042 223821 263865 264122 310475 197137
9745 197137 95432 47034 167360 239800 236605 238942 209202 158586 161355 222968 287910 223312
9733 223312 245079 222576 217738 196729 208661 237146 200837 188048 198690 296922 328321 296683
9721 296683 263586 231797 187033 121142 92700 72082 122428 151045 140765 166987 176411 195716
9709 195716 176462 229158 205854 160511 129472 181183 134507 135317 157924 98265 88876 185527
9697 185527 223280 196218 144753 131512 97918 155893 283769 279276 280044 316172 289992 184326
9685 184326 80236 117678 161101 169282 276037 285581 378477 365923 342716 327243 313261 330077
9673 330077 318595 249965 190547 255299 294290 247060 201779 141702 59088 157032 195067 225291
9661 225291 192938 208673 274087 201918 145704 194191 202364 206035 152328 140071 104886 138408
9649 138408 299213 378380 375363 308666 337542 375522 406294 427940 484404 462216 399258 286534
9637 286534 237328 167219 92609 67177 75037 90715 111651 105634 77469 161480 209558 197584
9625 197584 256729 230749 143796 165469 224625 260666 347566 391944 322267 232674 147755 146857
9613 146857 216600 250320 230427 342763 344012 309732 246559 300941 332124 357868 377313 304351
9601 304351 269020 281854 293219 227413 215521 287924 327125 349740 350368 293850 224748 231086
9589 231086 282141 366879 398279 352296 258188 271668 329905 335662 322798 380041 425607 379080
9577 379080 312243 315728 349493 380530 413948 391219 352528 328405 260405 210362 136823 259523
9565 259523 365986 435866 433133 495924 468719 431991 346763 302273 272678 279002 350339 428213
9553 428213 388775 364911 344596 335394 371886 411444 396394 338472 319439 422847 544391
9542 544391 513125 386371 383522 464829 461047 467668 547088 551963 394898 352558 345480 411949
9530 411949 486282 457688 422462 422132 309952 300031 366638 469055 482593 394604 346949 290783
9518 290783 312942 281243 366082 402268 338183 385780 411372 446716 471679 443957 440986 379542
9506 379542 447871 503712 419785 339783 413620 449071 494697 553249 588991 553829 405411
9495 405411 273199 321675 326132 368613 370537 418787 429696 449293 506176 442590 463385 496657
9483 496657 498858 528459 562719 559862 532141 523368 501448 559877 630889 651350 625080 655971
9471 655971 648502 583252 592354 602504 639594 604782 587074 577984 526526 514138 573663 572342
9459 572342 526925 531408 537780 636343 643597 671687 672028 556829 482050 483700 528862 611573 593070
9446 593070 604256 642943 587655 539237 588190 634129 614565 610814 589832 612494 608020 585965
9434 585965 701814 813747 826170 764825 648335 587635 615683 600450 674044 718960 747611
9423 747611 737329 698406 668219 623995 640104 689167 678496 758930 766738 719444 790227 774143
9411 774143 772204 724372 605703 562107 626374 728664 832804 867195 869999 931472 875608
9400 875608 866174 812494 764943 779327 754367 805477 852777 785590 718919 763028 818401 843547
9388 843547 866662 940192 945617 879109 841661 812861 872633 874681 786691 765665 749384 778790
9376 778790 763764 729592 763281 887724 843639 846492 845584 877404 934170 955140 923652 893911
9364 893911 905975 1034055 1060742 1061441 1045039 1042159 1123158 1158008 1104236 976946 939777 907585
$$ [...]
##END NTUPLES=NMR SPECTRUM
##END=
