##TITLE=Analysis number 323317
Compound Code cc 16410
Project Code adrs
Chemist Name melford
##JCAMPDX= 6.0         $$ Bruker NMR JCAMP-DX V2.0
##DATA TYPE= NMR SPECTRUM
##DATA CLASS= NTUPLES
##ORIGIN= Bruker BioSpin GmbH
##OWNER= nmr
$$ XWIN-NMR		Version 3.5
$$ Mon Oct 23 14:18:58 2006 GMT Daylight Time (UT+1h)  MAYBRIDGE\nmr@NMR_250MHZ
##.OBSERVE FREQUENCY= 250.131544655141
##.OBSERVE NUCLEUS= ^1H
##.ACQUISITION MODE= SIMULTANEOUS (DQD)
##.ACQUISITION SCHEME= undefined
##.AVERAGES= 16
##.DIGITISER RES= 18
##SPECTROMETER/DATA SYSTEM= dpx250
##.PULSE SEQUENCE= zg30
##.SOLVENT NAME= CDCl3
##.SHIFT REFERENCE= (INTERNAL, CDCl3, 0, 16.522)
##AUDIT TRAIL= $$ (NUMBER, WHEN, WHO, WHERE, WHAT)
$$ ##TITLE= Audit trail, XWIN-NMR		Version 3.5
$$ ##JCAMPDX= 5.01
$$ ##ORIGIN= Bruker BioSpin GmbH
$$ ##OWNER= nmr
$$ C:\u/data/dgb/nmr/ADRS/1110/pdata/1/auditp.txt
$$ ##AUDIT TRAIL=  $$ (NUMBER, WHEN, WHO, WHERE, WHAT)
(   1,<2006-10-23 14:18:34.28 +100>,<MAYBRIDGE\nmr>,<NMR_250MHZ>,
      <created by zg, POWCHK disabled, PULCHK disabled
       configuration hash MD5:
       49 4B E0 1D 92 C2 6B 37 9F E6 65 BC 52 41 86 1D
       data hash MD5: 64K
       DE 54 D2 9D F7 5A B1 33 A1 67 9D 07 C5 AD 5B 93>)
(   2,<2006-10-23 14:18:48.79 +100>,<MAYBRIDGE\nmr>,<NMR_250MHZ>,
      <Start of raw data processing
       ef LB = 0.3 FT_mod = 6 PKNL = 1 SI = 32K 
       data hash MD5: 32K
       80 08 20 74 0D 22 F5 4B 9F 52 5B 0C 91 C5 DE 4C>)
(   3,<2006-10-23 14:18:50.78 +100>,<MAYBRIDGE\nmr>,<NMR_250MHZ>,
      <apk 
       data hash MD5: 32K
       B5 78 C6 C3 54 A8 D5 01 27 13 96 B9 36 3E 45 E3>)
(   4,<2006-10-23 14:18:51.65 +100>,<MAYBRIDGE\nmr>,<NMR_250MHZ>,
      <abs ABSG = 5 
       data hash MD5: 32K
       AA BB 04 6E E5 31 32 66 91 CF 67 01 78 CD FA A4>)
$$ ##END=
$$ 
$$ hash MD5
$$ B0 6F 97 44 19 A7 66 F0 F1 64 7A 2A CC E6 5B 95
##$RELAX= 
##$RELAX= 
##$RELAX= 
##$RELAX= 
##$RELAX= 
##$RELAX= 
##$RELAX= 
$$ Bruker specific parameters
$$ --------------------------
##$DU= <C:\u>
##$EXPNO= 1110
##$NAME= <ADRS>
##$PROCNO= 1
##$TYPE= <nmr>
##$USER= <dgb>
##$AMP= (0..31)
100 100 100 100 100 100 100 100 100 100 100 100 100 100 100 100 100 100 
100 100 100 100 100 100 100 100 100 100 100 100 100 100 
##$AQSEQ= 0
##$AQ_mod= 3
##$AUNM= <au_zg>
##$AUTOPOS= <49 >
##$BF1= 250.13
##$BF2= 250.13
##$BF3= 250.13
##$BF4= 250.13
##$BF5= 500.13
##$BF6= 500.13
##$BF7= 500.13
##$BF8= 500.13
##$BYTORDA= 1
##$CFDGTYP= 0
##$CFRGTYP= 5
##$CHEMSTR= <none>
##$CNST= (0..31)
1 1 145 1 1 1 1 1 1 1 1 1 1 1 1 1 1 1 1 1 1 1 1 1 1 1 1 1 1 1 1 1 
##$CPDPRG= <>
##$CPDPRG1= <>
##$CPDPRG2= <>
##$CPDPRG3= <>
##$CPDPRG4= <mlev>
##$CPDPRG5= <mlev>
##$CPDPRG6= <mlev>
##$CPDPRG7= <mlev>
##$CPDPRG8= <mlev>
##$CPDPRGB= <>
##$CPDPRGT= <>
##$D= (0..31)
0 1 0 0 0 0 0 0 0 0.06 0 0 0 0 0 0 0.0002 0 0 0 0 0 0 0 0 0 0 0 0 0 0 
0 
##$DATE= 1161609513
##$DBL= (0..7)
120 120 120 120 120 120 120 120 
##$DBP= (0..7)
150 150 150 150 150 150 150 150 
##$DBP07= 0
##$DBPNAM0= <>
##$DBPNAM1= <>
##$DBPNAM2= <>
$$ [...]
##$SUBNAM7= <"">
##$SUBNAM8= <"">
##$SUBNAM9= <"">
##$SW= 20.6930455092707
##$SWIBOX= (0..15)
0 0 3 0 0 0 0 0 0 0 0 0 0 0 0 0 
##$SW_h= 5175.983436853
##$TD= 65536
##$TD0= 1
##$TE= 683.16
##$TE2= 300
##$TE3= 300
##$TEG= 300
##$TL= (0..7)
0 120 120 120 120 120 120 120 
##$TP= (0..7)
150 150 150 150 150 150 150 150 
##$TP07= 0
##$TPNAME0= <>
##$TPNAME1= <>
##$TPNAME2= <>
##$TPNAME3= <>
##$TPNAME4= <>
##$TPNAME5= <>
##$TPNAME6= <>
##$TPNAME7= <>
##$TPOAL= (0..7)
0.5 0.5 0.5 0.5 0.5 0.5 0.5 0.5 
##$TPOFFS= (0..7)
0 0 0 0 0 0 0 0 
##$TUNHIN= 0
##$TUNHOUT= 0
##$TUNXOUT= 0
##$USERA1= <user>
##$USERA2= <user>
##$USERA3= <user>
##$USERA4= <user>
##$USERA5= <user>
##$V9= 5
##$VALIST= <valist>
##$VCLIST= <CCCCCCCCCCCCCCC>
##$VD= 0
##$VDLIST= <DDDDDDDDDDDDDDD>
##$VPLIST= <PPPPPPPPPPPPPPP>
##$VTLIST= <TTTTTTTTTTTTTTT>
##$WBST= 1024
##$WBSW= 4
##$XGAIN= (0..3)
0 0 0 0 
##$XL= 0
##$YL= 0
##$YMAX_a= 520288
##$YMIN_a= -381393
##$ZGOPTNS= <>
##$ZL1= 120
##$ZL2= 120
##$ZL3= 120
##$ZL4= 120
##$ABSF1= 16.522
##$ABSF2= -4.171173
##$ABSG= 5
##$ABSL= 3
##$ALPHA= 0
##$AQORDER= 0
##$ASSFAC= 0
##$ASSFACI= 0
##$ASSFACX= 0
##$ASSWID= 0
##$AUNMP= <proc_1d>
##$AZFE= 0.1
##$AZFW= 0.1
##$BCFW= 0
##$BC_mod= 0
##$BYTORDP= 0
##$COROFFS= 0
##$CY= 12.5
##$DATMOD= 1
##$DC= 0
##$DFILT= <>
##$DTYPP= 0
##$F1P= 14.0000005364418
##$F2P= -0.99999901652339
##$FCOR= 0.5
##$FTSIZE= 32768
##$FT_mod= 6
##$GAMMA= 0
##$GB= 0
##$INTBC= 1
##$INTSCL= 1
##$ISEN= 128
##$LB= 0.3
##$LEV0= 0
##$LPBIN= 0
##$MAXI= 10000
##$MC2= 0
##$MEAN= 0
##$ME_mod= 0
##$MI= 0
##$NCOEF= 0
##$NC_proc= -4
##$NLEV= 6
##$NOISF1= 0
##$NOISF2= 0
##$NSP= 0
##$NTH_PI= 0
##$NZP= 0
##$OFFSET= 16.522
##$PC= 1
##$PHC0= -42.67125
##$PHC1= 9.626981
##$PH_mod= 1
##$PKNL= yes
##$PPARMOD= 0
##$PSCAL= 4
##$PSIGN= 0
##$REVERSE= no
##$SF= 250.13
##$SI= 32768
##$SIGF1= 0
##$SIGF2= 0
##$SINO= 400
##$SIOLD= 32768
##$SREGLST= <1H.CDCl3>
##$SSB= 0
##$STSI= 32768
##$STSR= 0
##$SW_p= 5175.98343685301
##$SYMM= 0
##$S_DEV= 0
##$TDeff= 65536
##$TDoff= 0
##$TI= <Analysis number 999999
Compound Code 99
Book Reference 9
Project Code 9>
##$TILT= no
##$TM1= 0
##$TM2= 0
##$TOPLEV= 0
##$USERP1= <user>
##$USERP2= <user>
##$USERP3= <user>
##$USERP4= <user>
##$USERP5= <user>
##$WDW= 1
##$XDIM= 32768
##$YMAX_p= 499441720
##$YMIN_p= -551076
$$ End of Bruker specific parameters
$$ ---------------------------------
##NTUPLES= NMR SPECTRUM
##VAR_NAME=  FREQUENCY,     SPECTRUM/REAL,   SPECTRUM/IMAG
##SYMBOL=    X,             R,               I
##VAR_TYPE=  INDEPENDENT,   DEPENDENT,       DEPENDENT
##VAR_FORM=  AFFN,          ASDF,            ASDF
##VAR_DIM=   32768,         32768,           32768
##UNITS=     HZ,            ARBITRARY UNITS, ARBITRARY UNITS
##FACTOR=    0.157963299565203, 1,           1
##FIRST=     4132.6476996994, 0,             0
##LAST=      -1043.33573715361, 0,           0
##MIN=       -1043.33573715361, -551076,     0
##MAX=       4132.6476996994, 499441720,     0
$$ Real data points
##PAGE= N=1
##DATA TABLE= (X++(R..R)), XYDATA
$$ [...]
25707b04790J00493K5491j6588P2256N7766K085k11053n9295L5255J28154M5064
$$ -204790 -104297 -78806 -95394 -23138 34628 36713 -174340 -233635 -198380 -70226 -25162
25696b5162r6359j35819Q43O0688P4143J49739J1681L9528K9314p8989l4177J35877
$$ -25162 -121521 -257340 -256497 -195809 -121666 28073 39754 79282 108596 29607 -4570 131307
25684A31307J0230j35134j28569j6736j12432m589J93358O8911P1347K2186k3929
$$ 131307 141537 6403 -122166 -138902 -251334 -255923 -62565 6346 77693 99879 75950
25673G5950p0018L8378p9339n80r9210L2368J09116J19371k2641j64041P690J54920
$$ 75950 5932 44310 -35029 -35609 -134819 -102451 6665 126036 103395 -60646 -52956 101964
25661A01964J35246l9950p3292O7537p6572m3557n5544K2815M6825J2996p3162
$$ 101964 237210 197260 123968 191505 114933 71376 15832 38647 85472 98468 25306
25650B5306j14646o1132l9382J37637K06828K0031O818p7786n1928o1234n2330
$$ 25306 -89340 -150472 -189854 -52217 154611 174642 181460 103674 51746 -9488 -61818
25639f1818J09213O0824l58M1051L978j28046j86217r0978J13277o446K717J7330
$$ -61818 47395 108219 107861 148912 152890 24844 -161373 -252351 -139074 -145520 -142803 -125473
25627a25473l0281N642M5742Q6721p0012K8560J4861k6969l172j9583k2488L2863
$$ -125473 -155754 -150112 -104370 -17649 -87661 -59101 -44240 -71209 -74381 -93964 -116452 -83589
25615h3589L9114Q49Q7942N4086Q0118o2830q8428r891j5523m8676R7964K8489
$$ -83589 -44475 -43626 44316 98402 178520 115690 27262 17371 1848 -46828 51136 79625
25603G9625j8721n6497j65318K668N0256N444P998J54702K3525l717L320o5636
$$ 79625 60904 4407 -160911 -158243 -107987 -102543 -94545 60157 83682 79965 83285 17649
25591A7649O5418K5848r1241m3549o4076j15928P5578N8769P1894k3376k7172
$$ 17649 83067 108915 17674 -25875 -89951 -205879 -130301 -71532 362 -23014 -50186
25580e0186Q1577N482Q191r9689r3636m7997M8856J93093Q5229j1193n2317j08776
$$ -50186 31391 36873 45064 -54625 -148261 -196258 -147402 45691 130920 119727 67410 -41366
25568d1366r8243O845n769K5407L8164O5969j88557j4668J43670j7922q4949O8635
$$ -41366 -139609 -132764 -138533 -113126 -74962 -8993 -197550 -212218 -68548 -86470 -171419 -102784
25556a02784J91730O3754m3335R536p4085J2150M2212q6164n1479l0469J3533
$$ -102784 88946 152700 109365 118901 44816 56966 99178 13014 -38465 -68934 -55401
25545e5401j1400j26317K9251J48403R2399o9391o2600J7130J9154m9668o8381
$$ -55401 -66801 -193118 -163867 -15464 76935 7544 -55056 -37926 -18772 -68440 -136821
25534a36821m0421N4128k4485o8054R3284O6436P3163j4778j8976J01346q2798
$$ -136821 -177242 -123114 -147599 -215653 -122369 -55933 17230 2452 -16524 84822 2024
25523B024M3954Q8821m1324j2665r1968K3975N5568o844o4099j8233O2320J3381
$$ 2024 45978 134799 93475 80810 -11158 12817 68385 61541 -2558 -20791 41529 54910
25511E4910j1044R1333j21293o6728l7370J85808J11229L9115r6086l8033J6597
$$ 54910 43866 135199 13906 -52822 -90192 95616 206845 245960 149874 111841 128438
25500A28438r4262j93645L782J34335R0309J73403p1240j15753n0438L5200j4185
$$ 128438 34176 -159469 -155687 -21352 68957 242360 171120 55367 4929 40129 25944
25489B5944L8052q7921j46550K8966P2187L0125m9806j3334j8830j8397J07982
$$ 25944 63996 -23925 -170475 -141509 -69322 -39197 -89003 -102337 -121167 -139564 -31582
25478c1582j00847j03220l5705O3183J70359M5916j02392j15095j2952N6387j1251
$$ -31582 -132429 -235649 -271354 -208171 -37812 8104 -94288 -209383 -222335 -165948 -177199
25467a77199J09157l2277q4978N0279L8874l0077P9274l3810m1889O1433Q6582
$$ -177199 -68042 -100319 -185297 -135018 -96144 -126221 -46947 -80757 -122646 -61213 25369
25456B5369J04107K3520O2903Q576j51819K0111J16930q9652j48827j32138J10463
$$ 25369 129476 152996 215899 224475 72656 92767 209697 120045 -28782 -160920 -50457
25445e0457K26613k0206j5393M6277j13622k13574k4993M1033R4984q7798o7257
$$ -50457 176156 155950 140557 186834 73212 -140362 -165355 -124322 -29338 -117136 -184393
25434a84393N0475N6000Q1412K1008N7020L9006q9504o0774J6654K6549N8080
$$ -184393 -133918 -77918 3494 24502 81522 120528 31024 -29750 -13096 13453 71533
25423G1533j69057p6757N6981O4385P4878p3602R775N4655N0769j4124L6441M708
$$ 71533 -97524 -174281 -117300 -52915 21963 -51639 -41864 12791 63560 49436 85877 90585
25411I0585n2106n8800k6525P0888K71541j24647j41956O9411M9067r3022P2725
$$ 90585 38479 -20321 -46846 24042 295583 170936 28980 98391 147458 54436 127161
25400A27161P3925J9767N1900l0893j64061j90796j38156K3915J27714N9437K1999
$$ 127161 201086 220853 272753 241860 77799 -112997 -251153 -227238 -99524 -40087 -18088
25389a8088L8930j02600j22738R1308J59279n6043r2144J64968R6705p2152n5858
$$ -18088 20842 -81758 -204496 -113188 46091 -9952 -102096 62872 159577 87425 31567
25378C1567j6853p7559n5993L9995N956R0592n542P6293R3016P5462k2779l7964
$$ 31567 14714 -62845 -118838 -78843 -72887 17705 12163 88456 181472 256934 234155 196191
25366A96191N5522J99493j0594j50349j73509J22118k052j25338O1417o879k17732
$$ 196191 251713 451206 440612 290263 116754 238872 236820 111482 172899 166020 -51712
25355e1712r7822P3272J01972q435j31786n0884J02695K00171P9337k7323p8466
$$ -51712 -149534 -76262 25710 17275 -114511 -165395 -62700 137471 216808 189485 111019
25344A11019q1914l3789m350l003N54k1507J863J8408O2522Q0697q2756P1194
$$ 111019 29105 -4684 -9034 -12037 -11483 -32990 -31127 -12719 49803 130500 47744 118938
25332A18938L7015o968L7451l1270m5710r7116j35704M5689K4693R8487r216j15011
$$ 118938 155953 148985 186436 155166 109456 12340 -123364 -77675 -52982 45505 36289 -78722
25320g8722J8408R2292J20603K01771m3184o6514m3080j93575m8570J71508K5098
$$ -78722 -60314 31978 152581 354352 311168 244654 201574 7999 -40571 130937 156035
25309A56035P655L6066o3689r3293K8361n7864M7178N1397p9524m3888j6710J08463
$$ 156035 163690 199756 136067 42774 71135 13271 60449 111846 32322 -11566 -28276 80187
25297H0187P0986k9088j40667q8944Q5282J8917o440P3949o1528n8803R4599m8199
$$ 80187 151173 122085 -18582 -107526 -22244 -3327 -9767 64182 2654 -56149 38450 -9749
25285i749N6165L5565m641o642K4422j10019p7803j0737o7016m083n8237k6194
$$ -9749 46416 81981 77340 70698 95120 -14899 -92702 -103439 -170455 -174538 -232775 -258969
25273b58969L6577l0241J53768P5931N5971P1754j30449n6217M0256L1419J23426
$$ -258969 -222392 -252633 -98865 -22934 33037 104791 -25658 -81875 -41619 -10200 113226
25262A13226M160j10191j42901p0082j35429J40805K22796R3886J48851J7342
$$ 113226 117386 7195 -135706 -205788 -341217 -200412 22384 116270 265121 282463
25252B82463K7344M9213j04026r3538o0404K1821J489j49889l6186Q9839k4069
$$ 282463 309807 359020 254994 161456 101052 122873 124362 -25527 -61713 28126 4057
25241D057O2612m4175O148k5416j98846n4634R7693J02689n5160l5743P9325K6296
$$ 4057 66669 22494 28642 3226 -195620 -250254 -152561 -49872 -105032 -140775 -61450 -35154
25229c5154j65982o288J64489P0117j2709K4983L7099o8265j52031p176J40825
$$ -35154 -201136 -207424 -42935 27182 14473 39456 76555 8290 -143741 -150917 -10092
25218a0092N8291L0571p466r0497o1635j7216p7336j3432n7630J7773R6844j8531
$$ -10092 48199 78770 71304 -19193 -80828 -98044 -175380 -188812 -246442 -228669 -131825 -150356
25206a50356m2524Q7458J81592L8233l5321j3817J00612l5284k8393k4628n0595
$$ -150356 -192880 -105422 76170 114403 79082 65265 165877 130593 102200 77572 26977
25195B6977m8346j01680j29485K2265L0178o787N4801J55039m6038j24554k9940
$$ 26977 -21369 -123049 -252534 -230269 -200091 -206878 -152077 2962 -43076 -167630 -197570
25184a97570n1285O1122K4734J47895Q3361l0178j70280m019J97223K9306j3643
$$ -197570 -248855 -187733 -162999 -15104 68257 38079 -132201 -136220 61003 90309 76666
25173G6666Q320K8520j37159l3804L8257l5256M2279r9268j03139M365P2565O3031
$$ 76666 84986 113506 -23653 -57457 -19200 -54456 -12177 -111445 -214584 -210219 -137654 -74623
25161g4623p6136J1469M8167j33474j66648J64761M9669P9824P8070J5977m7167
$$ -74623 -150759 -139290 -91123 -224597 -391245 -226484 -176815 -96991 -18921 -2944 -50111
25150e0111J03357R8751m4978J0721P8795j47774q3950k5889P886n5926J79086
$$ -50111 53246 151997 107019 117740 196535 48761 -35189 -61078 -53192 -109118 69968
25139F9968J53249k2470j02366j15002j9263k5603j21055m5356q2085q6594Q3358
$$ 69968 223217 200747 98381 -16621 -35884 -61487 -182542 -227898 -309983 -396577 -313219
25128c13219R0308m4866n0236K71039J63898p2353N7637r6380j3902k8560P3762
$$ -313219 -222911 -267777 -318013 -46974 116924 44571 102208 5828 -8074 -36634 37128
25117C7128Q0604j64648K4422Q7081J08801q98J3026M9548r8010j46216J13482
$$ 37128 117732 -46916 -22494 64587 173388 172490 185516 235064 137054 -9162 104320
25106A04320o5493J8748o3733q1883l2287j46959m331N0189J7711N6821J2894
$$ 104320 38827 57575 -6158 -88041 -120328 -267287 -271618 -221429 -203718 -146897 -134003
25095a34003n8582M3566R1725M0168J10472r7891L1310M5953k00890o1466P5866
$$ -134003 -192585 -149019 -57294 -17126 93346 -4545 26765 72718 -128172 -189638 -113772
25084a13772O5528J76929o4333p2827p914J9344j92696m0231N5594o2799M7059
$$ -113772 -48244 128685 64352 -8475 -16389 2955 -189741 -229972 -174378 -237177 -190118
25073a90118O7588J75253J18299N0358o0406j55075j00910p2086L8348J8331o603
$$ -190118 -122530 52723 171022 221380 160974 5899 -95011 -167097 -128749 -110418 -117021
25062a17021O3780M8146j8275m0710o3324J17692M3810o3912j37673J2454J47682
$$ -117021 -53241 -5095 -23370 -64080 -127404 -9712 34098 -29814 -167487 -155033 -7351
25051g351L3396P431o0950j26460O801m3273R1272P3197j19200J78098O0238j6288
$$ -7351 26045 33476 -27474 -153934 -147133 -190406 -99134 -25937 -145137 32961 93199 76911
25039G6911j854n7600m5824R3587K5719j14580j53156p4751P4572J96877N7315
$$ 76911 75057 17457 -28367 65220 90939 -23641 -176797 -251548 -176976 19901 77216
25028G7216n5366j9532R2074R456P6694o3555j05446j197J71421J1264k19107
$$ 77216 21850 2318 94392 103848 180542 116987 11541 10344 181765 193029 -26078
25017b6078j70568L7495O9206J5511j38534r2312J2810k9946k1519M4489J69877
$$ -26078 -196646 -159151 -89945 -74434 -212968 -305280 -292470 -322416 -343935 -299446 -129569
25006a29569J37303k7676m179J097j0637o9688q5128O3449M4522m1392p7447J04939
$$ -129569 7734 -19942 -24121 -23024 -33661 -103349 -188477 -125028 -80506 -121898 -199345 -94406
24994i4406J42071j28185N6694L2347j5848o5691M9272Q0408q359Q29n2328k6731
$$ -94406 47665 -80520 -23826 8521 -7327 -73018 -23746 56662 48303 49132 -3196 -29927
24982b9927L1608m9959j0550m9236j82620Q4040J50900P2026m8127R4765J8831
$$ -29927 1681 -48278 -58828 -108064 -290684 -206644 -55744 16282 -31845 62920 81751
24971H1751J553k2880o1013Q333K548o8434J5103K22417K1445k01269r6517J47888
$$ 81751 83304 60424 -589 7744 10292 -58142 -43039 179378 200823 -446 -96963 50925
24959E0925R6122m8881M0614m0644k1876k9433N4485M4016J7955J28644K3195
$$ 50925 147047 98166 138780 98136 76260 46827 101312 145328 163283 291927 315122
24948C15122q4374q5371j7185M2524m899l0760o4863j27303P7235n9055j0990
$$ 315122 230748 145377 128192 170716 165817 135057 70194 -57109 20126 -38929 -49919
24937d9919J72937n224m9337j45217J4961J62361P153p0881K9284o311r9381j8850
$$ -49919 123018 117794 68457 -76760 -61799 100562 107715 36834 66118 59807 -39574 -58424
24925e8424J07107K0753m5133r1117M0202O6951l0383r2513q651n5576n1876J47637
$$ -58424 48683 69436 24303 -66814 -26612 40339 9956 -82557 -91208 -146784 -198660 -51023
24913e1023J90180J12376j00316j44583M2300j07639o3835j02968L6019J36903
$$ -51023 139157 251533 151217 6634 48934 -58705 -122540 -225508 -189489 -52586
24903e2586o6310J0986J01193K5582J00892P5583m85j22902J9356N1199R6266
$$ -52586 -118896 -107910 -6717 18865 119757 195340 194855 71953 91309 142508 238774
24892B38774o5366K0154L3306J37791Q760p5370j0677l5173j49957r9357j9545
$$ 238774 173408 193562 226868 364659 373419 298049 287372 252199 102242 2885 -16660
24881a6660Q1651J9506K0724K0484o7864K7217N221K6220M9921m376o9765k2160
$$ -16660 64991 84497 105221 125705 57841 85058 90279 116499 166420 162044 92279 70119
24869G0119n5196k6713K0002O1495l2551k2494n1602J21481Q0350n603p8840m8827
$$ 70119 14923 -11790 8212 69707 37156 14662 -36940 84541 164891 159288 80448 31621
24857C1621m3582o9209J7592N8591J707P623K2837l1872j31720l7580J03670p0711
$$ 31621 -11961 -81170 -63578 -4987 -3280 4343 27180 -4692 -136412 -173992 -70322 -141033
24845a41033n5423O7794L6398N3600Q7056M3562k5803k4916N563m4083O976Q9787
$$ -141033 -196456 -128662 -92264 -38664 48392 91954 66151 41235 46798 2715 9691 99478
24833I9478j3488j06666l890K4332j3339R919M8257J02318l1228J6720K1266L5796
$$ 99478 85990 -20676 -24566 -234 -13573 -3654 44603 146921 115693 132413 153679 189475
24821A89475r8494j21358Q206J962M7891J27210J8539o1271j08886n1440K6785
$$ 189475 90981 -30377 -22171 -20209 27682 154892 173431 112160 3274 -48166 -21381
24810b1381L6582K4454n5351m1533j4660j1823J11736N2827j03686K9210J10175
$$ -21381 15201 39655 -15696 -57229 -71889 -83712 28024 80851 -22835 6375 116550
24799A16550o3996R6859L1196P898n2605K7577L8163j06815M3249r909N043n7328
$$ 116550 52554 149413 180609 188507 135902 163479 201642 94827 138076 128167 133210 75882
24787G5882k4604n6971K4062q51j3682N1766o2994n2639K5890P3513m4147K954
$$ 75882 51278 -5693 18369 17518 3836 55602 -7392 -60031 -34141 39372 -4775 -1821
24775a821J2156K849O1689R8357P902k2320r6637L7114p6964O8461M6965J0579
$$ -1821 10335 13184 74873 173230 181132 158812 62175 99289 22325 90786 137751 148330
24763A48330O0827L4848j32280r5396M3149q4611k02543J21648J36073O7799K8985
$$ 148330 209157 244005 111725 16329 59478 -25133 -227676 -106028 30045 97844 126829
24752A26829P0172M1536p7602L7433j86387n9934J5111j23481j6204J7813K7455
$$ 126829 197001 238537 160935 198368 11981 -47953 -32842 -156323 -172527 -154714 -127259
24741a27259k0495Q1093J3702N0285k5463J2267k6570K7127k2395j24856Q9891
$$ -127259 -147754 -66661 -52959 -2674 -28137 -15870 -42440 -15313 -37708 -162564 -72673
24730g2673m4185k1113P886p3525l2027J32989J73114M4955Q8893r152K1915j4709
$$ -72673 -116858 -137971 -130085 -203610 -235637 -102648 70466 115421 204314 195162 217077 202368
24718B02368J09976m1544j19656n2489R6761k86L8024m2700j52931o2271J16318
$$ 202368 312344 270800 151144 98655 195416 195130 233154 190454 37523 -24748 91570
24707I1570K3427p751j16529j81736m2682O9351K186P3047L9490N8564K05827
$$ 91570 114997 107246 -9283 -191019 -233701 -164350 -162164 -89117 -49627 8937 214764
24696B14764p3844j3492m7414r8303j65096k5641L5163R9676J2367l8095M6822
$$ 214764 140920 127428 80014 -18289 -183385 -209026 -173863 -74187 -61820 -99915 -53093
24685e3093j19167j12893N4553P3962J36259J85852p1318j04803j5571R1692J51670
$$ -53093 -172260 -285153 -230600 -156638 -20379 165473 94155 -10648 -26219 65473 217143
24674B17143J3359l383j10512p4175q3783P1118J05944P7698j25306j90119o7217
$$ 217143 230502 227119 116607 42432 -41351 29767 135711 213409 88103 -102016 -169233
24663a69233O073l9509M7216N9739K4066k4039k6786Q577P3244m3415M7617j17977
$$ -169233 -163160 -202669 -155453 -95714 -71648 -95687 -122473 -113896 -40652 -84067 -36450 -154427
24651a54427o8070J30600r830k7470O6039R9694J02590J4321M0687K3446m1877
$$ -154427 -222497 -91897 -101727 -129197 -63158 36536 139126 153447 194134 217580 175703
24640A75703k1173m1508j09344R3055j0354K8027M9061n1713o3323j25162k2270
$$ 175703 154530 113022 3678 96733 86379 114406 163467 111754 48431 -76731 -99001
24629i9001J5956m9711J35145J59301k2843j25067K8611J48509o2950r2935l452
$$ -99001 -83045 -132756 2389 161690 138847 13780 42391 190900 127950 35015 31563
24618C1563k868K7010j28320n2159J7499J8290K06296m647k3305l3337j08764
$$ 31563 28695 55705 -72615 -124774 -107275 -88985 117311 112664 89359 56022 -52742
24607e2742j51767K9894J82926N8398j967r1237P8544Q6148j15223r5863j29586
$$ -52742 -204509 -174615 8311 66709 64742 -26495 52049 138197 22974 -72889 -202475
24596b02475O1093P3755p1115P737j356j609R7720J02330p4820J2899k9307K0961
$$ -202475 -141382 -67627 -138742 -131005 -132361 -133970 -36250 66080 -8740 4159 -25148 -4187
24584d187P2761L2240k8746L7819j43259j17193R5487L0536Q7703J71073r6301
$$ -4187 68574 100814 72068 109887 -33372 -150565 -55078 -24542 63161 234234 137933
24573A37933l3532m0191j23663k5476j1385n8111k3004j6597J09850j9896P8554
$$ 137933 104401 64210 -59453 -84929 -96314 -154425 -177429 -194026 -84176 -104072 -25518
24562b5518J11614O9205n5423j12220K9580J15056p5077p1136n2445Q2715L9903
$$ -25518 86096 155301 99878 -12342 17238 132294 57217 -13919 -66364 16351 56254
24551E6254N2840J44528m6149n2933J44191J1895j86589j54455q3035O383L9626
$$ 56254 109094 253622 207473 154540 298731 310626 124037 -30418 -113453 -107070 -67444
24540f7444J17101J72152q2923r5789n1467o5653M5722R5258N126O4160j32647
$$ -67444 49657 221809 138886 43097 -8370 -74023 -28301 66957 72083 136243 3596
24529C596L3155l3086P5242R3250n2290N5377p1301j34368o8477K75474Q8546
$$ 3596 36751 3665 78907 172157 119867 175244 103943 -30425 -98902 176572 265118
24518B65118p3855J5685j13985j05776o5680R7466Q0347p2402m5916j12365q7613
$$ 265118 191263 206948 92963 -12813 -78493 18973 99320 26918 -18998 -131363 -218976
24507b18976J73122O8182n1485n4184Q9789J66224K3081o8343j80338K7584J5727
$$ -218976 -45854 22328 -29157 -83341 6448 172672 195753 127410 -52928 -25344 -9617
24496i617p4196J85N5394Q1850K3134O7543p1360j64532j21499M5642J30319L8805
$$ -9617 -83813 -83628 -28234 53616 76750 144293 72933 -91599 -213098 -167456 -37137 1668
24484A668n9601J36815L9903j22750n0941j54130Q0924J05885m4278L1554O4118
$$ 1668 -57933 78882 118785 -3965 -54906 -209036 -128112 -22227 -66505 -34951 29167
24473B9167J6243l0682M4228M968j30359J6760r0946m4292L1607J93463J21441
$$ 29167 45410 14728 58956 63924 -66435 -49675 -140621 -184913 -153306 40157 161598
24462A61598n8405O4188n8738k5127Q4273m2062l5142j7736K5862K3267m3866
$$ 161598 103193 167381 108643 83516 167789 125727 90585 72849 98711 121978 78112
24451G8112m2098L9833N3319m7703N0689o0538j78152N8028N7906O7392j87836
$$ 78112 36014 75847 129166 81463 132152 71614 -106538 -48510 9396 76788 -111048
24440a11048q203K03291j49767l8193J42473Q1282o8415r4778j19338J9860m0029
$$ -111048 -119251 84040 -65727 -103920 38553 119835 51420 -43358 -162696 -142836 -182865
24429a82865p3776k190j2266O1327N2084o3394J4127R3183N3022j4578N7806k15595
$$ -182865 -256641 -258831 -271097 -209770 -157686 -221080 -206953 -113770 -60748 -75326 -17520 -233115
24417b33115q516R9729J89417M8856j12651j4308p5263Q145Q4917R0847k6154
$$ -233115 -241631 -141902 47515 96371 -16280 -30588 -105851 -97706 -12789 78058 51904
24406E1904j28400J0830k7900K084J56594P3498k6666l4906M383K5867j01509
$$ 51904 -76496 -65666 -93566 -91482 65112 138610 111944 77038 81421 107288 5779
24395E779p4310K7132J06974M3588K8118p7167q7170k0990m1686P9917n9897r2108
$$ 5779 -68531 -41399 65575 109163 137281 60114 -27056 -48046 -89732 -9815 -69712 -161820
24383a61820O2808L473j59483L3290Q4573J55343n8822m568L8329p1018p647J05330
$$ -161820 -99012 -95539 -255022 -221732 -137159 18184 -40638 -45206 -6877 -77895 -85542 19788
24371A9788N5879o2470j5453J46048r1758R1319M7534q2241j09509J69327J22578
$$ 19788 75667 13197 -2256 143792 52034 143353 190887 108646 -863 168464 291042
24360B91042q9592j31837k0122j9706p8475K6203Q8260o5372k9761M9962j19267
$$ 291042 201450 69613 49491 29785 -48690 -22487 65773 401 -29360 20602 -98665
24349i8665r9574J66373P9030M7894P3032K4537o2640k2372n810m3211j28084
$$ -98665 -198239 -31866 47164 95058 168090 192627 129987 107615 101805 58594 -69490
24338f9490k9430J81250o6989j94457p539K8892M156N2514J44464r813r1814J1048
$$ -69490 -98920 82330 15341 -179116 -186655 -157763 -153607 -101093 43371 33558 -58256 -47208
24326d7208j49956K9503J38810n252N1381K4612j84098j01499M9131N5818q2540
$$ -47208 -197164 -167661 -28851 -34103 17278 41890 -142208 -243707 -194576 -138758 -221298
24315b21298M7327Q6756J51852J54927n9639l093J3898n9301j28825o4801P3188
$$ -221298 -173971 -87215 64637 219564 159925 156832 170730 111429 -17396 -82197 -9009
24304i009j32942n4160N0257J69381O3250r2807k9398l0579j0746K4999J8543
$$ -9009 -141951 -196111 -145854 23527 86777 -6030 -35428 -66007 -76753 -51754 -33211
24293c3211n8133J0546M2106J5458J0434L7576m4366l5087L3312o1432p446Q1027
$$ -33211 -91344 -80798 -38692 -23234 -12800 24776 -19590 -54677 -21365 -82797 -90243 -9216
24281i216R408k818L1950P9734N5342M6970k0788m9835o3409o3352j360j37679
$$ -9216 192 -2626 29324 109058 164400 211370 190582 140747 77338 13986 12626 -125053
24269a25053j12894j1509N1904J00555K57686j10476n5277R5415K081L4247J42240
$$ -125053 -237947 -249456 -197552 -96997 160689 50213 -5064 90351 92432 126679 268919
24258B68919O9088o6479j24294j06776k5369j57616n2020O5869J24052J23225
$$ 268919 338007 271528 147234 40458 15089 -142527 -194547 -128678 -4626 118599
24248A18599q8822k13M8m0537k4652k069n2232M9501O8404j6079p2157J0514K5355
$$ 118599 29777 29564 29612 -10925 -35577 -37646 -89878 -40377 28027 11948 -60209 -49695 -24340
24235b4340J8172J19282J09104n2521J0483N8357k9692L2654j81907m3120Q9477
$$ -24340 -6168 113114 222218 169697 180180 238537 208845 241499 59592 16472 105949
24224A05949J03977n3443R80j53044m0860m172q4729K4368n0165n2474J40255
$$ 105949 209926 156483 157463 4419 -36441 -40613 -125342 -100974 -151139 -203613 -63358
24213f3358P6540j9518j68187k4814J40895O4543j2714O6618J44576j40452k8650
$$ -63358 13182 -6336 -174523 -199337 -58442 6101 -6613 60005 204581 64129 35479
24202C5479j5052J08536n3481l9049J6134M6289O8082p3j38214q4764k2760p7342
$$ 35479 20427 128963 75482 36433 52567 98856 166938 166865 28651 -56113 -78873 -156215
24190a56215J1974J608O7254J13146j3238K0402J5256p3506M5553l2459r9947
$$ -156215 -144241 -142633 -75379 37767 24529 44931 60187 -13319 32234 -225 -100172
24179a00172r3056j6565J15210J93461n18m8071k7473r2658j29008M344P144N8073
$$ -100172 -193228 -209793 -94583 98878 98360 50289 22816 -69842 -198850 -194506 -187362 -129289
24167a29289J38936O1430j48487K376P9375N7066o1938j87831j19246J07543J80620
$$ -129289 9647 71077 -77410 -75034 4341 61407 -531 -188362 -307608 -200065 -19445
24156a9445R3000j42287K711n3198p8231J42880J03015P0844n5459K241L1801
$$ -19445 73555 -68732 -66021 -119219 -197450 -54570 48445 119289 63830 66071 97872
24145I7872N9123n3891j09834j13482M5546K9851j01792r1624K3073J00859l3684
$$ 97872 156995 103104 -6730 -120212 -74666 -44815 -146607 -238231 -215158 -114299 -147983
24134a47983M6529P3316j14697j11595n7538j9767M4860P0411J01323J33163l0555
$$ -147983 -101454 -28138 -142835 -254430 -311968 -331735 -286875 -216464 -115141 18022 -12533
24123a2533p0528K6649M6039p1477j79060Q5383J55174N9348J9424j6007l187
$$ -12533 -83061 -56412 -10373 -81850 -260910 -175527 -20353 38995 58419 42412 39225
24112C9225q7273r4278P4383R482j27943j26754k8594N5375P5374J3603N2987
$$ 39225 -48048 -142326 -67943 -58461 -186404 -313158 -341752 -286377 -211003 -197400 -144413
24101a44413P7292o860j45164n965K0691J8121Q8684N8463P4904O9924K9245m5878
$$ -144413 -67121 -73981 -219145 -225110 -204419 -186298 -97614 -39151 35753 105677 134922 89044
24089H9044q3997K3451O1639k3705q0452P4155o9635n0492J74497J7471j19283
$$ 89044 5047 28498 90137 66432 -14020 60135 -9500 -59992 114505 131976 12693
24078A2693J36868p5389q5252p138r3930L4242j0442O6679j47482J6437L0347
$$ 12693 149561 74172 -11080 -18218 -112148 -77906 -88348 -21669 -169151 -152714 -122367
24067a22367L7801K4828J48657O1193k22848j18376K21084M7315q9592q0728Q2542
$$ -122367 -84566 -59738 88919 150112 -72736 -191112 29972 77287 -12305 -93033 -10491
24056a0491K4693j7965l4465r3084p4973K5112J13605R2582k7344m9350N9539
$$ -10491 14202 -3763 -38228 -131312 -206285 -181173 -67568 25014 -2330 -51680 7859
24045G859J7393j24454p0448R5206J49285Q9514j47756j10336q1222l7061Q0206
$$ 7859 25252 -99202 -169650 -74444 74841 164355 16599 -93737 -174959 -212020 -131814
24034a31814J11937N7881j5458P6629J53496Q114j10786J1114L8400p6904o3692
$$ -131814 -19877 38004 22546 99175 252671 260785 149999 161113 199513 122609 58917
24023E8917j40570O4969O6020q9853J2093J344n4075o0012P3936P4508l419J5636
$$ 58917 -81653 -16684 49336 -40517 -28424 -27080 -81155 -141167 -67231 7277 3858 19494
24011A9494Q6692Q4670J6119j59470o4167L8760J50969Q9182K3214r3329m5996
$$ 19494 106186 190856 206975 47505 -16662 22098 173067 262249 285463 192134 146138
24000A46138j4880j2305M7485j43787n1935m6467L2351K27676K0482r0401l7592
$$ 146138 131258 118953 166438 22651 -29284 -75751 -43400 184276 204758 114357 76765
23989G6765J13092k09533j85858m0948Q4696j8224r540J18001Q8992R8223l7492
$$ 76765 189857 -19676 -205534 -246482 -161786 -180010 -189550 -71549 17443 115666 78174
23978G8174M8305j8302j18021J2219J95542J38293j38953q9301q5424l2075R0597
$$ 78174 126479 108177 -9844 2375 197917 336210 197257 107956 22532 -9543 81054
23967H1054r423k08312j52465P3185J08661J78711m4437j06500l7924J25199p2417
$$ 81054 71631 -136681 -289146 -215961 -107300 71411 26974 -79526 -117450 7749 -64668
23956f4668q4496L6978J50597K7375J3513P6664k041r9735j83526j56579O4776
$$ -64668 -149164 -112186 38411 65786 79299 155963 153922 54187 -129339 -285918 -221142
23945b21142O3337o3412J45723K56857k20842P6144J21752R3307o4555L7181j10677
$$ -221142 -157805 -221217 -75494 181363 -39479 36665 158417 251724 187169 224350 113673
23934A13673M8078j6559m5461K2317k3399Q9690K6223j12148o4083k6195n1457
$$ 113673 161751 145192 99731 122048 98649 188339 214562 102414 38331 12136 -39321
23923c9321k563J56241J81312j23512p2297J45642n5929J8377o4623L854L7265
$$ -39321 -41884 114357 295669 172157 99860 245502 189573 207950 143327 147181 184446
23912A84446j66250j29656J34588j25632p0465k2293k3170N8691M521k8979l7004
$$ 184446 18196 -111460 23128 -102504 -172969 -195262 -218432 -159741 -155220 -184199 -221203
23901b21203L9843Q5803j436M4309j03619J2599J29920Q3969j33456p1381J35671
$$ -221203 -181360 -95557 -96993 -52684 -156303 -143704 -13784 70185 -63271 -134652 1019
23890A019R6516q487p3221M544J1978q2713p1388k05159P262J70710P1168R0982
$$ 1019 97535 89048 15827 20371 32349 -50364 -121752 -326911 -319649 -148939 -77771 13211
23878A3211J31105O903p3054M30J37145o9825j49959j6037K3687j1150J29359
$$ 13211 144316 151219 78165 78595 215740 145915 -4044 -20081 3606 -7544 121815
23867A21815k15004j9301M2006J0806Q3925P7781q4472j00996N9331J21738p5644
$$ 121815 -93189 -112490 -70484 -59678 24247 102028 17556 -83440 -24109 97629 21985
23856B1985r1315m7560n7297j9558j17369k5241J7266Q3732J97030r14L1989O0283
$$ 21985 -69330 -116890 -174187 -193745 -311114 -336355 -319089 -235357 -38327 -39241 -7252 53031
23844E3031P4832l4129m0143Q9680L5119m6910j6882n610m3995k2689N5437q8243
$$ 53031 127863 93734 53591 143271 178390 131480 114598 108988 64993 42304 97741 9498
23832I498j05663J1857P7390K414Q0861O030J07586k4112l1288l9252P8727k636
$$ 9498 -96165 -84308 -6918 -4504 76357 82387 189973 165861 134573 95321 174048 171412
23820A71412l9021q6987j07200o8991M1240J3524J08022m3871j1645N1297j06664
$$ 171412 132391 45404 -61796 -130787 -89547 -76023 31999 -11872 -23517 27780 -78884
23809g8884j3903j2960L3160K8268l1370j02223q1943k720R3428K226J17340P2510
$$ -78884 -92787 -105747 -72587 -44319 -75689 -177912 -259855 -262575 -169147 -166921 -49581 22929
23797B2929J18092j2384j15233n7571J18748p3116p2345L1627j7653J12095Q283
$$ 22929 141021 128637 13404 -44167 74581 1465 -70880 -39253 -56906 55189 63472
23786F3472k19636j88180R0129R8626J3487j01788o5903P7213n4437N6936J48733
$$ 63472 -156164 -344344 -254215 -155589 -142102 -243890 -309793 -232580 -287017 -230081 -81348
23775h1348K27045m232n0628p9685m1650j01946J54919J87218M6933K5416j70128
$$ -81348 145697 141465 90837 11152 -30498 -132444 22475 209693 256626 282042 111914
23764A11914n1638J00083m1740j50594q8893J0545M2192O1291N6833j59366j00332
$$ 111914 60276 160359 118619 -31975 -120868 -110323 -68131 -6840 49993 -109373 -209705
23753b09705j396J41649j47340P4368J15192J78369o217q5031j01141j24509P095
$$ -209705 -211101 -69452 -216792 -142424 -27232 151137 144920 59889 -41252 -165761 -158666
23742a58666J11076J26809j17548j81996J9614O6840L456m4846M6834j4248J48053
$$ -158666 -47590 79219 -38329 -220325 -200711 -133871 -130415 -175261 -128427 -142675 5378
23731E378k5560L4627J18286J1202L5287L536m6477L1507P1150p0711l9276L0352
$$ 5378 -20182 14445 132731 143933 179220 182756 136279 167786 238936 168225 128949 159301
23719A59301j52437j54138J602m2943j2276k6341o271q963M8331l6814N9520M4065
$$ 159301 6864 -147274 -145672 -188615 -200891 -227232 -233503 -242466 -194135 -230949 -171429 -127364
23707a27364p6702j3550N5080R3575L257M0091O9002M0130j03239k9790J34496
$$ -127364 -204066 -217616 -162536 -68961 -65704 -25613 43389 83519 -19720 -49510 84986
23696H4986o6801j34520j1096N2941R8861M9873K4764q7158O3394j27835j4863
$$ 84986 18185 -116335 -127431 -74490 24371 74244 99008 11850 75244 -52591 -67454
23685f7454J9901J02919m437L1171J4938j12004o9295J2458R2895J09898p8529
$$ -67454 -47553 55366 50929 82100 97038 -14966 -84261 -71803 21092 130990 52461
23674E2461k48264N600Q1913j01143k16J6407j22385P1031K52109J2561j24659
$$ 52461 -195803 -190203 -108290 -209433 -209649 -193242 -315627 -244596 7513 20074 -104585
23663a04585j40134J0749o8884p3551R4153K47197P6825n410p776O6828J9844
$$ -104585 -244719 -233970 -302854 -376405 -282252 -35055 41770 36360 28584 95412 115256
23652A15256R787p052j5152k05426n9222j7252R2894M9747J16870J46899N164
$$ 115256 125043 117991 102839 -102587 -161809 -179061 -86167 -36420 80450 227349 232513
23641B32513j16358j14126O7933P2119m1803J59590P3652M5869j41917k4691l0164
$$ 232513 116155 2029 69962 142081 100278 259868 333520 379389 237472 212781 182617
23630A82617j95845k8928K597K6863O1807J22852J30559j8286j61919k15350p1388
$$ 182617 -13228 -42156 -39559 -12696 49111 171963 302522 284236 122317 -93033 -164421
23619a64421P2939k8509p4372K9081M1465Q286q6986n6264R7652J91M1659p9822
$$ -164421 -91482 -119991 -194363 -165282 -123817 -115531 -202517 -258781 -161129 -160938 -119279 -199101
23607a99101k0814K8615J06634J33879l9524R0041N3662p2513n1986N4559l2558
$$ -199101 -219915 -191300 -84666 49213 9689 99730 153392 80879 28893 83452 50894
23596E0894m6848J09474j07828l9737K1287M3773J3442j30414j14643K4202P1135
$$ 50894 4046 113520 5692 -34045 -12758 31015 44457 -85957 -200600 -176398 -105263
23585a05263P7525J24468l9676r7627J20721J3704l9769n4612p0696j52114L7424
$$ -105263 -27738 96730 57054 -40573 80148 93852 54083 -529 -71225 -223339 -185915
23574a85915N3209M7305M339l3052K5993L232j1691Q7498n7268p3285R6751J69191
$$ -185915 -132706 -85401 -81062 -114114 -88121 -84889 -96580 -9082 -66350 -139635 -42884 126307
23562A26307K1371j3991o5320q1954J12556m1436L0614O9224J77606j65789q5561
$$ 126307 147678 133687 68367 -13587 98969 57533 88147 157371 334977 169188 83627
23551H3627n6955J9359M504P6885o3179J3217K0170l9704j23208J3687K2428m1809
$$ 83627 26672 46031 50535 127420 64241 77458 97628 57924 -65284 -51597 -29169 -70978
23539g0978j1667L6258j5446m4491k1110m2679P8296M0266j15184J178J48236
$$ -70978 -82645 -46387 -61833 -106324 -127434 -170113 -91817 -51551 -166735 -165557 -17321
23528a7321K16569l0087k99164m8493J19054J25232O5268q3014j94968o3334J17648
$$ -17321 199248 169161 -130003 -178496 -59442 65790 131058 48044 -146924 -210258 -92610
23517i2610J02644l3298l0845n3356K1470J2673Q8154L3171M5748L6951P9365
$$ -92610 10034 -23264 -54109 -107465 -85995 -73322 14832 48003 93751 130702 210067
23506B10067j51552k00671L6556M3761J26819Q2182K2543J8763k8187K8895k0014
$$ 210067 58515 -142156 -105600 -61839 64980 147162 169705 188468 160281 189176 169162
23495A69162k0739j1546j136k05399o0107O2638K4522j0875p911n4764M6701J43432
$$ 169162 148423 136877 135741 -69658 -129765 -67127 -42605 -53480 -61391 -116155 -69454 73978
23483G3978K8165j00746r0355L0417n216M2029q1028m2386O2328R5231q3470j17220
$$ 73978 102143 1397 -88958 -58541 -63757 -21728 -102756 -145142 -82814 12417 -71053 -188273
23471a88273l0744K6822l4541n6026R580K1247J02112L5387j14653K6359Q3430
$$ -188273 -219017 -192195 -226736 -282762 -273182 -251935 -149823 -114436 -229089 -202730 -119300
23460a19300J1422Q4211n0740J621J18771m9012j80815o9382p3682L3689J53775
$$ -119300 -107878 -23667 -74407 -72786 45985 -3027 -183842 -253224 -326906 -293217 -139442
23449a39442J2011Q0871r2985j91800k729J89674J1767M6265l2329k1062l5892
$$ -139442 -127431 -46560 -139545 -331345 -334074 -144400 -132633 -86368 -118697 -139759 -175651
23438a75651L8113Q6874p2488J60505j1617J16376l5081j22341j05562O1820m460
$$ -175651 -137538 -50664 -123152 37353 25736 142112 107031 -15310 -120872 -59052 -63512
23427f3512J27758N9356m2488o5750k3554L3750R5121K8961j32698q7780K1048
$$ -63512 64246 123602 81114 15364 -8190 25560 120681 149642 16944 -70836 -49788
23416d9788J50943n6225n3746J2513N1352J0576j76714j03761N8515J49291k3003
$$ -49788 101155 44930 -8816 3697 55049 65625 -111089 -214850 -156335 -7044 -30047
23405c0047n9794R466J45017l9284n17m1523p0207p9293P404J31989J54622n7337
$$ -30047 -89841 -80375 64642 25358 24841 -16682 -86889 -166182 -158778 -26789 127833 70496
23393G0496p2685k0554L9089L7957j0779L5347M3081j9901j00121o5370n1516
$$ 70496 -2189 -22743 16346 54303 43524 78871 121952 102051 1930 -63440 -114956
23382a14956j00207K3016O8580R0575p5081j83561J28958M8642l0145R2119J85662
$$ -114956 -215163 -192147 -123567 -32992 -108073 -291634 -162676 -114034 -144179 -52060 133602
23371A33602J0844L317j69528n9930J53692O0994r1584O1343n3187j47180N3080
$$ 133602 144446 147763 -21765 -81695 71997 132991 41407 102750 49563 -97617 -44537
23360d4537P3382M436J7180l7350L336r3583l3366p3799k1741M2076K0705N9205
$$ -44537 28845 33281 50461 13111 16447 -77136 -110502 -184301 -206042 -163966 -143261 -84056
23348h4056J2858Q5817N5396M228K7540M8380K8626j45031j40085k6853N9740
$$ -84056 -71198 14619 70015 74243 101783 150163 178789 33758 -106327 -133180 -73440
23337g3440K5824j9672p0572m0418j30117m9348J17822R0868o3229N9403Q3784
$$ -73440 -47616 -67288 -137860 -178278 -308395 -357743 -239921 -149053 -212282 -152879 -69095
23326f9095n6372j7965N7123L8350L8993k0169j15204j92456m385R0796J28026
$$ -69095 -125467 -143432 -86309 -47959 -8966 -29135 -144339 -336795 -341180 -250384 -122358
23315a22358J57988m0126o0904J01858J76994N7142q6790M0262N1298j69381j48937
$$ -122358 35630 -4496 -65400 36458 213452 270594 183804 224066 275364 105983 -42954
23304d2954N4434O0278L8269j3630O6575J0200j11699j22020J3338M8016r5616
$$ -42954 11480 71758 110027 96397 162972 173172 61473 -60547 -47209 807 -94809
23293i4809j283J29971m0555j525n413o6474M4289J16550k9129k5551l2072J4972
$$ -94809 -96092 33879 -6676 -8201 -13614 -80088 -35799 80751 51622 26071 -6001 8971
23281H971J01028m615J6065L0460q6558j30727J07832J08355o1954J45183K8678
$$ 8971 109999 105384 121449 151909 65351 -65376 42456 150811 88857 234040 262718
23270B62718L4572k09122l5004r4703l0554N5827J16713n7446q2149j11827o9256
$$ 262718 297290 88168 53164 -41539 -72093 -16266 100447 43001 -39148 -150975 -220231
23259b20231k454J6426r2612o0500J24833K69364J59612n8444p6369R0085l5342
$$ -220231 -222685 -206259 -298871 -359371 -234538 34826 194438 135994 59625 149710 114368
23248A14368o0969n4031P1712R4175l2312q9891j30478j17591j00934P7801J14945
$$ 114368 53399 -632 71080 165255 132943 43052 -87426 -205017 -305951 -228150 -113205
23237a13205N8147Q4540N9181K3466N490j07890K142J2464k4641m0629Q5679o7538
$$ -113205 -55058 29482 88663 112129 117619 9729 11871 24335 -306 -40935 44744 -22794
23225b2794p0100J1393k3126p5699P0803O0892J9324J09540Q3726j28824n4972
$$ -22794 -92894 -81501 -104627 -180326 -109523 -48631 -29307 80233 163959 35135 -19837
23214a9837P8003n7405J03753K20703J23j09677j10314p8405n7927q0894r1533
$$ -19837 58166 761 104514 325217 325340 215663 105349 26944 -30983 -111877 -203410
23203b03410J76907M7341n2813R5166J67657n8152j32448o119j3125o5120j13151
$$ -203410 -26503 20838 -31975 63191 230848 172696 40248 34129 21004 -44116 -157267
23192a57267o00J09580L5259j07503N4355O1389j85940j58008O345J19279Q6186
$$ -157267 -157867 -48287 -13028 -120531 -66176 -4787 -190727 -348735 -342390 -223111 -136925
23181a36925J67245k8275q9531q0019J82103J45258P508j95969n2311R1057J61699
$$ -136925 30320 2045 -87486 -167505 14598 159856 167364 -28605 -80916 10141 171840
23170A71840M909o4270L1193O892j10316j97954j17872P6552M3424n3812j12370
$$ 171840 176749 112479 143672 150564 40248 -157706 -275578 -199026 -155602 -209414 -321784
23159c21784J76352R2042j21961K120M3637P2023j0843j233O3078m6105m6886
$$ -321784 -145432 -53390 -175351 -173231 -129594 -57571 -68414 -69647 -6569 -52674 -99560
23148i9560j1731j46250j1429J06711j9463q1075l3040L0396J01739o2990N5727
$$ -99560 -111291 -257541 -268970 -162259 -181722 -262797 -295837 -265441 -163702 -226692 -170965
23137a70965Q1944L5560p8139j02623m268J37998R9246M7713o0479p5914N4147
$$ -170965 -89021 -53461 -131600 -234223 -238491 -100493 -1247 46466 -14013 -89927 -35780
23126c5780N7240q2391j5220K9996P5807m760L1162j13768j18688j4503m3649
$$ -35780 21460 -60931 -76151 -46155 29652 24892 56054 -57714 -176402 -190905 -234554
23115b34554K8354M6914r113J4216K4827M8914M3364M8781l3940P542L2951K9189
$$ -234554 -206200 -159286 -168399 -154183 -129356 -80442 -37078 11703 -22237 -14695 18256 47445
23103D7445p3407j0678P501j08889J28106R9647j21828j56861r613J32264J40148
$$ 47445 -25962 -36640 -29139 -138028 -9922 89725 -32103 -188964 -198577 -66313 73835
23092G3835O4366K5231j44206k125R7271k9317J1222J8267M1686q0495k0332O2492
$$ 73835 138201 163432 19226 17101 114372 85055 96277 114544 156230 75735 55403 117895
23080A17895J77010R4594j18209j58278p3293j2409O5859j10562j03604j07576
$$ 117895 294905 389499 271290 113012 39719 27310 93169 -17393 -120997 -228573
23070b28573L7707R2400J06674J49536j04753j74399m3844K3458P1372O1572K7714
$$ -228573 -190866 -98466 8208 157744 52991 -121408 -165252 -141794 -70422 -8850 18864
23059A8864L2491j18296J0244Q5889J067l1885j63810M3421P3585O2174K03026
$$ 18864 51355 -66941 -56697 29192 30259 -1626 -165436 -122015 -48430 13744 216770
23048B16770p9144j01379m6990l7950J5034L6055P3836k5777Q9040r2026j11459
$$ 216770 137626 36247 -10743 -48693 -33659 2396 76232 50455 139495 47469 -63990
23037f3990L7265K9483j14230j4398N8357Q28M437P3981R6730n7456j9858o7618
$$ -63990 -26725 2758 -111472 -125870 -67513 -66685 -62248 11733 108463 51007 31149 -36469
23025c6469R514J05416J20099j29575p423j66552l2225J95274J12965M3248j05166
$$ -36469 -26955 78461 198560 68985 61562 -104990 -137215 58059 171024 214272 109106
23014A09106K3762l6895p8926j18323j18286K6279J509R2065J24442J42204j24087
$$ 109106 132868 95973 17047 -101276 -219562 -193283 -191774 -99709 24733 166937 42850
23003D2850j17629l2481J37459J8789l9370k2219p9869q3914L1710J58386Q2027
$$ 42850 -74779 -107260 30199 48988 9618 -12601 -92470 -176384 -144674 13712 95739
22992I5739L0554L8774K8662k9474n1965k35745K9554R1526P5343q881j31090
$$ 95739 126293 165067 193729 164255 112290 -123455 -93901 -2375 72968 64087 -67003
22981f7003j39604o3740l648J29204R7260N4141l1114q2322k0750Q837J27091
$$ -67003 -206607 -270347 -273995 -144791 -47531 6610 -24504 -106826 -127576 -118739 8352
22970H352J4360M0296L0855o211M7982k23097n2662K050K30186J55047j12115
$$ 8352 22712 63008 93863 87652 135634 -87463 -140125 -138075 92111 247158 135043
22959A35043j36656R3557j90431K5141n8337M8321M5558n3814n40P410L6782K6441
$$ 135043 -1613 91944 -98487 -73346 -131683 -83362 -37804 -91618 -92158 -84748 -47966 -21525
22947b1525n9790O368N0286Q881n8424M7575J11426o6400o1508M9811L5990R1972
$$ -21525 -81315 -74947 -24661 -15780 -74204 -26629 84797 18397 -43111 6700 42690 134662
22935A34662p6443k7270k6711k0254r813J393O0340l404j4381N5373K32677Q5835
$$ 134662 58219 30949 4238 -16016 -25829 -24436 35904 32500 18119 73492 306169 392004
22923C92004o7866j13516j43432n0336R096L4570o2430M7177O2891j39263m0039
$$ 392004 324138 210622 67190 16854 25950 60520 -1910 45267 108158 -31105 -71144
22912g1144j1704n6655J07450J14569j5219m3052n2537R1470J3798j07999P1246
$$ -71144 -82848 -139503 -32053 82516 67297 24245 -28292 63178 76976 -31023 40223
22901D0223p8522o3176J6296k8831Q9211q1535p5630K34475O4821l7087q5380
$$ 40223 -38299 -101475 -85179 -114010 -24799 -106334 -181964 52511 117332 80245 -5135
22890e135j21732j08283q4916L3511J14999m9899K9339J59107N9839n5484l565
$$ -5135 -126867 -235150 -320066 -286555 -171556 -221455 -192116 -33009 26830 -28654 -32219
22879c2219l6166J06656N2137j14904j59981O5332k8438k6452j3650R4255q131
$$ -32219 -68385 38271 90408 -24496 -184477 -119145 -147583 -174035 -187685 -93430 -101561
22868a01561j03580j4987k9095J11132J38947n6739N0582N6580p0846k9339m2893
$$ -101561 -205141 -220128 -249223 -138091 856 -55883 -5301 51279 -19567 -48906 -91799
22857i1799j4921J23699P2411j00657p9543M8557J74723q7128j20081j7727k1001
$$ -91799 -106720 16979 89390 -11267 -90810 -42253 132470 45342 -74739 -92466 -113467
22846a13467k6103M3819J21194J08553k9053m0640l1010m3439j55888j1452k3499
$$ -113467 -139570 -95751 25443 133996 104943 64303 33293 -10146 -166034 -177486 -200985
22835b00985J38703J20105j02739j07891O8941R2468J4350k0461q4064k7594J6511
$$ -200985 -62282 57823 -44916 -152807 -83866 8602 22952 2491 -81573 -109167 -92656
22824i2656J19959K0265L0762M821r3324J9776P7793r5754j03133n7197M8861
$$ -92656 27303 47568 78330 83151 -10173 9603 87396 -8358 -111491 -168688 -119827
22813a19827J32987q304R5665Q9999N0676n4100j71746j34418J4854N4217M7134
$$ -119827 13160 4856 100521 190520 241196 187096 15350 -119068 -104214 -49997 -2863
22802b863n9375j27922J32346K02098r8907Q3146j9725j90087j41726q845K9492
$$ -2863 -62238 -190160 -57814 144284 45377 128523 108798 -81289 -223015 -231860 -202368
22791b02368J34033m7663L2467n8551K5781P3520J8362K6916k6486K1834p3064
$$ -202368 -68335 -115998 -83531 -142082 -116301 -42781 -24419 2497 -23989 -2155 -75219
22780g5219n3281L0464Q4060Q8199M4741J29453j29664j65374p2623k697m5860
$$ -75219 -128500 -98036 -13976 74223 118964 248417 118753 -46621 -119244 -121941 -167801
22769a67801J8067R9630P0456J8744j51756r7294j19616j814J932O5648J14866
$$ -167801 -149734 -50104 20352 39096 -112660 -209954 -329570 -331384 -329452 -263804 -148938
22758a48938K0985j6665p5041k671J8207K2800N5560l3766k6876Q3642P1731Q5711
$$ -148938 -127953 -144618 -219659 -222330 -204123 -181323 -125763 -159529 -186405 -102763 -31032 54679
22746E4679j25419n3197m0506k65929m0292J84812J19005P0817N5445l972k7400
$$ 54679 -70740 -123937 -164443 -430372 -470664 -285852 -166847 -96030 -40585 -44557 -71957
22735g1957M1325R1136L7037l9729j02707j85654r0844L3980J41574J45263p7352
$$ -71957 -30632 60504 97541 57812 -44895 -230549 -321393 -287413 -145839 -576 -77928
22724g7928j45055R6210R7409L8872j3680o9794k3501Q5439l7843J1525o3243
$$ -77928 -222983 -126773 -29364 9508 -4172 -73966 -97467 -12028 -49871 -38346 -101589
22713a01589j8455L5438m9601J08571K2691K1872l7429J12605k3586r8077L764
$$ -101589 -120044 -84606 -134207 -25636 -2945 18927 -18502 94103 70517 -27560 -23796
22702b3796j30288j03531k0678K14968J45538j32729j39309Q6412K00923j6352
$$ -23796 -154084 -257615 -278293 -63325 82213 -50516 -189825 -103413 97510 81158
22692H1158k25732J8471J75834Q355L818j13500O6123K3552l1954l0103K0446
$$ 81158 -144574 -126103 49731 58086 61904 -51596 14527 38079 6125 -23978 -3532
22681c532K4648n8790J14838j4732K1364q1843q3950n5563J45618p186j9491r6948
$$ -3532 21116 -37674 77164 62432 83796 1953 -81997 -137560 8058 872 -18619 -115567
22669a15567P2707R6494q282K795j16105j28277k928Q0228J17096M3572q5076
$$ -115567 -42860 53634 45352 48147 -67958 -196235 -199163 -118935 -1839 41733 -43343
22658d3343r2632K7072Q669n3574P1816q3356J0102J51027l5022j2930o1437R3512
$$ -43343 -135975 -108903 -100234 -153808 -81992 -165348 -155246 -4219 -39241 -52171 -113608 -20096
22646b0096J27331j33729r0036q37J4759N7485J00863N1996O9113R013q3137J15636
$$ -20096 107235 -26494 -116530 -117367 -102608 -45123 55740 107736 176849 185862 102725 218361
22634B18361J1021k2870m5575j04014J0228j1587Q0974K8384j28828n8233P4328
$$ 218361 229382 206512 160937 56923 67151 55564 136538 164922 36094 -22139 52189
22623E2189j4958n8628k4959l4591L4520l4857n7345J03019R6845R0553m2244
$$ 52189 37231 -21397 -46356 -80947 -46427 -81284 -138629 -35610 61235 151788 109544
22612A09544o4480n8195L4710l9680r5223m4799p614j6924J58148L8231m6370
$$ 109544 45064 -13131 21579 -18101 -113324 -158123 -165737 -182661 -24513 13718 -32652
22601c2652J00414m7090N9891M6535n9987l6679K8625j34822k0399N4195j40403
$$ -32652 67762 20672 80563 127098 67111 30432 59057 -75765 -96164 -41969 -182372
22590a82372p4733J29916N0581r8810L5392N1233L8349p5078J8656J51775J19449
$$ -182372 -257105 -127189 -76608 -175418 -140026 -88793 -50444 -125522 -106866 44909 164358
22579A64358q4221j80301q8872N2450o4428r6135J07339J04264J08466o9020j30158
$$ 164358 80137 -100164 -189036 -136586 -201014 -297149 -189810 -85546 22920 -46100 -176258
22568a76258Q8585L0200k2621r5511M0704R2202J48958O6588m4714q9424m1802
$$ -176258 -87673 -57473 -80094 -175605 -134901 -42699 106259 172847 128133 38709 -3093
22557c093j90904l1803L1919N4742J36701K9825o2871K6929N1089o8866N1213
$$ -3093 -193997 -225800 -193881 -139139 -2438 27387 -35484 -8555 42534 -26332 24881
22546B4881r0244k6273R016R6253O3585J3071j39487l3406J00944J18139n3634
$$ 24881 -65363 -91636 -82620 13633 77218 90289 -49198 -82604 18340 136479 82845
22535H2845r7590k167J48783j20601k0552R5770J48778N6195j41695P066J65846
$$ 82845 -14745 -16912 131871 11270 -9282 86488 235266 291461 149766 156832 322678
22524C22678q4998k02776q5718K0007m7384j23279K3185R0733O7161R4204k0662
$$ 322678 237680 34904 -50814 -30807 -78191 -201470 -178285 -87552 -20391 73813 53151
22513E3151r8739p5125L2868J83676J36440M6186j89208j75477R001K0235K4154
$$ 53151 -45588 -120713 -87845 95831 232271 278457 89249 -86228 -77227 -56992 -32838
22502c2838m6457o0172j1233O4912L8717l2985l674n018j02938N2162j3853L7439
$$ -32838 -79295 -139467 -150700 -85788 -47071 -80056 -83730 -88748 -191686 -139524 -153377 -115938
22490a15938P8936p381J10506J49953m7586j96359j9140n546j43142K7197K17742
$$ -115938 -37002 -44383 66123 216076 168490 -27869 -47009 -52555 -195697 -168500 49242
22479D9242J72936q6248j59921l2608J07096k50991k03253J06603J9385J14668
$$ 49242 222178 135930 -23991 -56599 50497 -200494 -403747 -297144 -277759 -163091
22469a63091J63713O1988k4323K9910r8531o9732l0818j6491o6326K64R1009p224
$$ -163091 622 62610 38287 68197 -30334 -100066 -130884 -147375 -213701 -213437 -122428 -129652
22457a29652K7299k1646n0851O0750J82548N3681j5235k4293l0044k6030l2972
$$ -129652 -102353 -123999 -174850 -114100 68448 122129 106894 82601 52557 26527 -6445
22446f445l9853N5737P4139l0693m2879r3235L0536j69451j7098J55236M594M9113
$$ -6445 -46298 9439 83578 52885 10006 -83229 -52693 -222144 -239242 -84006 -79412 -30299
22434c0299j2618k9822J04971J09477J14043j4955J063L724j67580n1600O1032
$$ -30299 -42917 -72739 32232 141709 255752 240797 241860 245584 78004 26404 87436
22423H7436N6303m3827n0372j19204q4013J686J14441J14730m1306L4452m818
$$ 87436 143739 99912 49540 -69664 -153677 -151991 -37550 77180 35874 70326 65508
22412F5508q0711O511K18910M371o2446m4321j55961q2929O6669o5149J16840
$$ 65508 -15203 -8692 210218 214589 152143 107822 -48139 -131068 -64399 -129548 -12708
22401a2708R9948N6738n5805j7555P0257l8004q8584j28063Q91J67741K47887
$$ -12708 87240 143978 88173 70618 140875 102871 14287 -113776 -112885 54856 302743
22390C02743L0347j68911q8084j5279m8329O062Q713p430j39567k2245Q448n732
$$ 302743 333090 164179 76095 60816 12487 18549 27262 19832 -119735 -141980 -133532 -139264
22378a39264M8083o9697K0811J9673j17532L3011J79648K4928q6969j9069R3391
$$ -139264 -91181 -160878 -140067 -120394 -237926 -204915 -25267 -339 -87308 -106377 -12986
22367a2986j6731o7497o3368M8252J48924R7856O876j14225J17602j8937p7897
$$ -12986 -29717 -97214 -160582 -112330 36594 134450 141326 27101 144703 125766 47869
22356D7869L9790Q6281K7588n2468j57695o695m7066q1083Q9584r2405n0576N338
$$ 47869 87659 173940 201528 149060 -8635 -15330 -62396 -143479 -53895 -146300 -196876 -191538
22344a91538L076O7013K8347J07184j4291n1417N2783o4000p4635Q6570m375O4954
$$ -191538 -188462 -121449 -93102 14082 -209 -51626 1157 -62843 -137478 -50908 -55283 9671
22332I671m3462j00562Q9701J23824R2187l6640m1648q326j1652j349M4115K8784
$$ 9671 -33791 -134353 -44652 79172 171359 134719 93071 84745 73093 71744 115859 144643
22320A44643r4391l5093M9647l5646l0426J1525j2637J1531p4539J04623J12937
$$ 144643 50252 15159 64806 29160 -1266 10259 -2378 9153 -65386 39237 152174
22309A52174O9338m4128j31165m3556n9208j1233l3802p3070j46763J26611M4914
$$ 152174 221512 177384 46219 2663 -56545 -67778 -101580 -174650 -321413 -194802 -149888
22298a49888p7918Q168L2049Q4342m9974p0805J05626J5016r681J33443J89178
$$ -149888 -227806 -219638 -187589 -103247 -153221 -224026 -118400 -103384 -113065 20378 209556
22287B09556l917j21372q4471o1445l5544k6065N3542j993j7083Q4633K5820j5019
$$ 209556 205639 84267 -204 -61649 -97193 -123258 -69716 -71709 -88792 -4159 21661 6642
22275F642j04219O2076j0874J68515m0715k2302n1404j5381j3324L8309k459j21184
$$ 6642 -97577 -35501 -46375 122140 81425 59123 7719 -7662 -20986 17323 14864 -106320
22263a06320P5489K5077n4454m475K7718J07754J79086k6098j76476n955N4932
$$ -106320 -30831 -5754 -60208 -64683 -36965 70789 249875 223777 47301 41346 96278
22252I6278r3945q2586k5435O177J07678L0722J1981j16797j2062N3875J20137
$$ 96278 2333 -80253 -105688 -99511 8167 38889 50870 -65927 -77989 -24114 96023
22241I6023M4642k525r5905p3171R968K139Q2636m7450m2781j0463J360l5596
$$ 96023 140665 138140 42235 -30936 -20968 -18829 63807 16357 -26424 -36887 -35527 -71123
22229g1123O9893r1880n6757m1908J18405K04663j9430j33575l5841J40846J06593
$$ -71123 -1230 -93110 -149867 -191775 -73370 131293 111863 -21712 -57553 83293 189886
22218A89886J569j66372j93840N430R3526K8570k9717L831N2001N1840l0545j05319
$$ 189886 191455 25083 -168757 -163327 -69801 -41231 -70948 -67117 -15116 36724 6179 -99140
22206i9140n304M2827j03194q2549Q701J03372J04702n63K3556O4365n6361N2190
$$ -99140 -104444 -61617 -164811 -247360 -238659 -135287 -30585 -31148 -7592 56773 412 52602
22194E2602L7862m6350j07791N7002K1658j70890n5403j03896J18956P2301m0542
$$ 52602 90464 44114 -63677 -6675 14983 -155907 -211310 -315206 -196250 -123949 -164491
22183a64491J73708Q9100N6748j32218l1205J2275l6343l8772m6803o4612J04426
$$ -164491 9217 98317 155065 22847 -8358 3917 -32426 -71198 -118001 -182613 -78187
22172g8187m0865m1053m9021k759O0588L8949N3883J04546m9910n5808K3333J23534
$$ -78187 -119052 -160105 -209126 -211885 -151297 -112348 -58465 46081 -3829 -59637 -36304 87230
22160H7230Q3979M8393j9662k07181q1144J40286N7346r1727N813R2853m6699
$$ 87230 171209 219602 199940 -7241 -88385 51901 109247 17520 23333 116186 69487
22149F9487r0724k1392Q0260J6478j57373L7064j7687J8515J0049P7843N3306
$$ 69487 -21237 -42629 37631 54109 -103264 -66200 -83887 -65372 -55323 22520 75826
22138G5826R8265j22575j30964K085L1147O4268K6088m9937J19703R0403j36285
$$ 75826 174091 51516 -79448 -77363 -46216 18052 44140 -5797 113906 204309 68024
22127F8024q4232k0593P298k7468M3416O611j08269N0537K35029M3015N4815q7786
$$ 68024 -16208 -36801 -29503 -56971 -13555 -6944 -115213 -64676 170353 213368 268183 180397
22115A80397q0037M3564J6640j1519j1554k0531O7783N6712j33377j73706M996
$$ 180397 100360 143924 160564 149045 137491 116960 184743 241455 108078 -65628 -60632
22104f0632Q3322J723O4997J39807o5929j8146j25545j42118L3486J49861J04199
$$ -60632 22690 24413 89410 229217 163288 145142 19597 -122521 -89035 60826 165025
22093A65025j8974k24991j22322K15848J03315n6158r6201j67960m1518J31455
$$ 165025 146051 -78940 -201262 14586 117901 61743 -34458 -202418 -243936 -112481
22083a12481L1263n2717L308M7987j7232N945L7428J26057k6602j72405p9922
$$ -112481 -81218 -133935 -130627 -82640 -99872 -93927 -56499 69558 42956 -129449 -209371
22072b09371l8828P8264N5131K8229J8914R8325p6166j09525L7657R1337O0833
$$ -209371 -248199 -169935 -114804 -86575 -67661 30664 -45502 -155027 -117370 -26033 34800
22061C4800k4803q4427J56203L4334n0437j928j4404n9845k8025L9888R4452K7159
$$ 34800 9997 -74430 81773 116107 65670 63742 49338 -10507 -38532 1356 95808 122967
22049A22967j23736j23296P3348J46573J84240k0227j50354j30881L4446R1227
$$ 122967 -769 -124065 -50717 95856 280096 259869 109515 -21366 13080 104307
22039A04307N6401M975m2950m5845K6097N433k61021k04441J28408J29829Q3500
$$ 104307 160708 165683 122733 76888 102985 108418 -152603 -357044 -228636 -98807 -15307
22028a5307O1164M3043j43663J9339J53408j0026j38342j1931O0352j944J8709
$$ -15307 45857 88900 -54763 -35424 117984 107958 -30384 -42315 18037 16093 34802
22017C4802J17514J06441M1330Q592r2500q3510k345j70330o8276J21176P3825
$$ 34802 152316 258757 300087 308679 216179 132669 130324 -40006 -108282 12894 86719
22006H6719M7564O5732R8129j18800n6165m7239n5993M807O7371Q1154J3769j52428
$$ 86719 134283 200015 298144 179344 123179 75940 19947 24754 92125 173279 187048 34620
21994C4620n1157J14885J32359q7312k33983m5738L4455J2974j7029j49405q9684
$$ 34620 -16537 98348 230707 143395 -90588 -136326 -101871 -88897 -105926 -255331 -345015
21983c45015K25220J76859k7541P1056m381j02561q6129J77333M3948j5961m8860
$$ -345015 -119795 57064 29523 100579 96198 -6363 -92492 84841 128789 112828 63968
21972F3968k0509q6879O4272J83114O1518q7695j51238k3271O9077m309j27069
$$ 63968 43459 -43420 20852 203966 265484 177789 26551 3280 72357 68048 -59021
21961e9021r6403m9829K388N6506J28885R2170M9957J039m4568j7873p222n6371
$$ -59021 -155424 -205253 -202865 -146359 -17474 74696 124653 125692 81124 63251 56029 -342
21949c42l0413k9511K9984j8030k5955M4350M6765m828j054n4132m247P8488j1309
$$ -342 -30755 -60266 -30282 -48312 -74267 -29917 16848 12020 10966 -43166 -47413 31075 19766
21936A9766j26635m0414PL9879k0941J18498m3291l1766R985n7063J47510Q4804
$$ 19766 -106869 -147283 -147276 -107397 -128338 -9840 -53131 -84897 -74912 -131975 15535 100339
21924A00339j01957k681N1738j15953M6333m557j72306j9504K10572K6917k8979
$$ 100339 -1618 -4299 47439 -68514 -22181 -26738 -199044 -218548 -7976 18941 -10038
21913a0038R5908j03367j61447r2322J25897Q1280Q2049Q5616l4093m3458p5443
$$ -10038 85870 -17497 -178944 -271266 -145369 -64089 17960 103576 69483 26025 -49418
21902d9418Q6122J4187J74309l3725j28837M3620K63j05343J4671J51236J20195
$$ -49418 36704 50891 225200 191475 62638 106258 106521 1178 15849 167085 287280
21891B87280j779j25551j50458q2614J4362K2061j0427R6500J46164l8601p3864
$$ 287280 285501 159950 9492 -73122 -58760 -36699 -47126 49374 195538 156937 83073
21880H3073J6370j27965o7737J44405K8268r1960m5856k3129R8123N7550j22152
$$ 83073 99443 -28522 -96259 48146 76414 -15546 -61402 -84531 13592 71142 -51010
21869e1010R24P2925m3354m7604l2354k0360J31555N1390J9230j52217m8762P1536
$$ -51010 -50086 22839 -20515 -68119 -100473 -120833 10722 62112 81342 -70875 -119637 -48101
21857d8101J28849j5077q8152L2514p552p7611Q288L967n7872Q820J13012k04204
$$ -48101 80748 65671 -22481 10033 2481 -75130 -66842 -62875 -120747 -111927 1085 -203119
21845b03119k7043M9770j2489o5161j0248R349k3178J48887P4706j10566J4878
$$ -203119 -230162 -180392 -192881 -258042 -268290 -258941 -282119 -133232 -58526 -169092 -154214
21834a54214O2365J9392O1742p2658k2910J07561L1665j40650j30666n0134K8343
$$ -154214 -91849 -72457 -10715 -83373 -106283 1278 32943 -107707 -238373 -288507 -260164
21823b60164k1001k9765J37972J66413L0801l9638k3421j79141j71249q7491K36791
$$ -260164 -281165 -310930 -172958 -6545 24256 -15382 -38803 -217944 -389193 -476684 -239893
21812b39893J90444J03084k9221q5801n7042K380J27958R3741M7046k9371j01578
$$ -239893 -49449 53635 24414 -61387 -118429 -116049 11909 105650 152696 123325 21747
21801B1747p884P7199L7155j50500j42253J905Q1718N6777O5224M8887n7250Q471
$$ 21747 13863 91062 128217 -22283 -164536 -162631 -80913 -24136 41088 89975 32725 41196
21789D1196p0576N0098J32937J1089M4559P9807k06581k85556J1595J19309l531
$$ 41196 -29380 20718 153655 164744 209303 289110 82529 -203027 -191432 -72123 -75654
21778g5654o2211N2011l6532r8325J74311Q6955j17570J5804J1172o47m4954r4197
$$ -75654 -137865 -85854 -122386 -220711 -46400 40555 -77015 -61211 -50039 -50686 -95640 -189837
21766a89837N4012J14274N5645J34573r72k19692j66742J07084J8723l1032N6399
$$ -189837 -135825 -21551 34094 168667 167695 -51997 -218739 -111655 -92932 -123964 -67565
21755f7565L0242j02945L5216J24092J1452o5469J02938J1054k17821j40622N0505
$$ -67565 -37323 -140268 -105052 19040 30492 -34977 67961 79015 -138806 -279428 -228923
21744b28923J00841J06162l4507j03868n0200L6618J62168Q0680K9100K9056l8426
$$ -228923 -128082 -21920 -56427 -160295 -210495 -173877 -11709 68971 98071 127127 88701
21733H8701m9208j01583l4472N1393j9117O6620J49650K2492k11807k7471J34895
$$ 88701 39493 -62090 -96562 -45169 -64286 2334 151984 174476 -37331 -64802 70093
21722G0093j6171l402J3483j451K4750r825j49895n8754P8929R137J9127K2169
$$ 70093 53922 50520 64003 62552 87302 77477 -72418 -131172 -52243 -43106 -23979 -1810
21710a810r015j91802K1542J24100r2237j19370J54122Q3940r008M7575J04755
$$ -1810 -10825 -202627 -181085 -56985 -149222 -268592 -114470 -30530 -39538 8037 112792
21699A12792N8247j60237j13834j85438K9592K19439Q8024M4220m6287k00601
$$ 112792 171039 10802 -103032 -288470 -258878 -39439 48585 92805 46518 -154083
21689a54083j67270L4702J00268L5958P2568N7551Q2554m947o2447L1439j62620
$$ -154083 -321353 -286651 -186383 -150425 -77857 -20306 62248 57301 -5146 26293 -136327
21678a36327l060J98395R6248K8117o4889r581k0756n4080j02635n7919M9213
$$ -136327 -139387 59008 155256 183373 118484 108903 88147 34067 -68568 -126487 -77274
21667g7274J29862R2912n53l8458P8869p6630k0922k9498k00366m3585L9819K4210
$$ -77274 52588 145500 144947 106489 185358 108728 87806 58308 -142058 -185643 -145824 -121614
21655a21614j4563O0094J9084P0788L993q9975r6528Q1639J06488N2782k6021
$$ -121614 -136177 -76083 -56999 13789 17782 -72193 -168721 -87082 19406 72188 46167
21644D6167p8837J0458l0560O0183N2299l5417j4272j34363l9553J09841P4957
$$ 46167 -32670 -22212 -52772 7411 59710 24293 10021 -124342 -163895 -54054 20903
21633B0903j73800o995P814n7671N4274J49994k3862j06792k6640P6606Q9422
$$ 20903 -152897 -159892 -152078 -209749 -155475 -5481 -29343 -136135 -162775 -86169 3253
21622C253P770l6065L2771K8189R4873j12077j01770K7159p1647R3165J0048q8726
$$ 3253 11023 -25042 7729 35918 130791 18714 -83056 -55897 -127544 -34379 -24331 -113057
21610a13057Q7403M6314R72m737j26946o0527O8627J31442Q6221N0206m4403l6505
$$ -113057 -25654 20660 21632 16895 -110051 -170578 -101951 29491 115712 165918 121515 85010
21598H5010j34350k1518Q9208J8377j81548K0339P2693O5563o9063n2346j8572
$$ 85010 -49340 -70858 18350 36727 -144821 -124482 -51789 13774 -55289 -107635 -126207
21587a26207k1166j4391P2029J52832K1832j93678l6541L2751J00778P420J01746
$$ -126207 -147373 -161764 -89735 63097 84929 -108749 -145290 -112539 -11761 -4341 97405
21576I7405L6750l2468o8458j42645M7535J06794j3897k5429o7701K1747O9563
$$ 97405 134155 101687 33229 -109416 -61881 44913 31016 5587 -62114 -40367 29196
21565B9196l1331k0342M5536N1956p9001q0599J07217J6820N1810n1929k6378
$$ 29196 -2135 -22477 23059 75015 -3986 -84585 22632 39452 91262 39333 12955
21554A2955M149n9684j54638N1437O7696P7785L2140j05328p146J18242J4715
$$ 12955 17104 -42580 -197218 -145781 -78085 -300 31840 -73488 -80634 37608 52323
21543E2323r761m5990K9272Q621r500M431m4997j12642K26796K0663p4046l0778
$$ 52323 42562 -3428 25844 34465 24965 29396 -15601 -128243 98553 119216 45170 14392
21531A4392r3738l8317L0971N3972o3463o7492P010J58208J26777k2267L951n5621
$$ 14392 -79346 -117663 -86692 -32720 -96183 -163675 -156665 1543 128320 106053 110004 54383
21519E4383J0079K4350j395q1198k6264j5427L0121P2188l3768K4609K6825M9057
$$ 54383 64462 88812 87417 6219 -20045 -35472 -5351 66837 33069 57678 84503 133560
21507A33560j1441n5616j22808j15841j7072R2391J05516j1676q2316j9622q598
$$ 133560 122119 66503 -56305 -172146 -189218 -96827 8689 -2987 -85303 -104925 -113523
21496a13523j6364L8303J31319N4060q1663r0557j91293n1647J7226L9072m510
$$ -113523 -129887 -91584 39735 93795 12132 -78425 -269718 -321365 -304139 -265067 -269577
21485b69577L6971P1218L7986j839n4377J04975N4998n7272O2235J5448N6186
$$ -269577 -232606 -161388 -123402 -125241 -179618 -74643 -19645 -76917 -14682 766 56952
21474E6952j2928q1898Q8987M3535j0390l4044p9246r7977Q8118J65194q387m9261
$$ 56952 44024 -37874 51113 94648 84258 50214 -29032 -127009 -38891 126303 117916 68655
21462F8655K0889m2278j08741o8154N2793p7841N77j14678o9325J25368K95192
$$ 68655 89544 47266 -61475 -129629 -76836 -154677 -154100 -268778 -338103 -212735 82457
21451H2457J15026l838j03475j05103m9536Q0530K6493j0638p0621l8129M4421
$$ 82457 197483 193645 90170 -14933 -64469 16061 42554 31916 -38705 -76834 -32413
21440c2413m9419o2620n1665R8948j27124p6008Q5694J75070Q1387l416J3106
$$ -32413 -81832 -144452 -196117 -97169 -224293 -300301 -214607 -39537 41850 38434 51540
21429E1540m4713j6429M2505J6917K9459q9831r4789R3118J20983j46048r5276
$$ 51540 6827 -9602 32903 49820 79279 -10552 -105341 -12223 108760 -37288 -132564
21418a32564j7011L1529J3789L0125J03612p943l5269r0857j31499j26222N0824
$$ -132564 -149575 -118046 -104257 -74132 29480 21537 -13732 -104589 -236088 -362310 -311486
21407c11486J47649J3663J4567K04306l2307j53271j08585N3706K9592P569M5215
$$ -311486 -163837 -150174 -135607 68699 36392 -116879 -225464 -171758 -142166 -134597 -89382
21396h9382J0790O372j8476k2548L5144k4243m2838j14820n0285Q5958R5610m3643
$$ -89382 -78592 -72220 -90696 -113244 -78100 -102343 -145181 -260001 -310286 -224328 -128718 -172361
21384a72361J2674K14803J78064N9121j05602j43698n6155J8205m491j88364j5785
$$ -172361 -159687 55116 233180 292301 186699 43001 -13154 5051 560 -187804 -203589
21373b03589K9054J0037J42131J4345K0433r2772J08463J8541l0728K9284n4774
$$ -203589 -174535 -164498 -22367 -8022 12411 -80361 28102 46643 15915 45199 -9575
21362i575R27o5776n0345p8628J46735J7690Q4987R3136j27039q9681J26248p5138
$$ -9575 -8648 -74424 -124769 -203397 -56662 -38972 46015 139151 12112 -77569 48679 -26459
21350b6459j76155J2085O293j30312l406O0324J37086k1963K597M7795K03443
$$ -26459 -202614 -190529 -184236 -314548 -317954 -257630 -120544 -142507 -139910 -92115 111328
21339A11328j6930j70859k4749R1988N3331r3594N9387N7207j61361m9823P3299
$$ 111328 94398 -76461 -101210 -9222 44109 -49485 9902 67109 -94252 -144075 -70776
21328g0776J22791R7809r4868q3563j07156n1072J60475j8868o1201j06039l7367
$$ -70776 52015 149824 54956 -28607 -135763 -186835 -26360 -45228 -106429 -212468 -249835
21317b49835J45183J17200M0772k7283k0179L7534L9741r8736N4000q1244j4348
$$ -249835 -104652 12548 53320 26037 5858 43392 83133 -15603 38397 -42847 -57195
21306e7195l747O4981p6618m5759n1972p2863M5391Q7501J26294R5086J06160
$$ -57195 -60942 4039 -72579 -118338 -170310 -243173 -197782 -110281 16013 111099 217259
21295B17259j25598j69981m3653L2000j0933P0239R3665P2507j1731q3402k0289
$$ 217259 91661 -78320 -121973 -89973 -100906 -30667 62998 135505 123774 40372 20083
21284B0083R2866K5438k4527j49552o7988k967K1226L7745K2726l4664j08785
$$ 20083 112949 138387 113860 -35692 -103680 -106647 -85421 -47676 -24950 -59614 -168399
21273a68399N4349J46223M7115j906q4923K572O433j383O2955Q8965l6990j03654
$$ -168399 -114050 32173 79288 77382 -7541 -4969 1464 81 63036 152001 115011 11357
21261A1357L3653p5054q750N7291K2824J0148r0126M5910P4806N709r4349K4119
$$ 11357 45010 -30044 -38794 18497 41321 51469 -38657 7253 82059 87768 -6581 17538
21249A7538j7394q3195J6194M2544R0491P0319J3896l8809M6955j0691j30891
$$ 17538 144 -83051 -66857 -24313 66178 136497 150393 111584 158539 147848 16957
21238A6957M7540L215O512o334j54695j53967J9438N3049j7188o6054R8857P4716
$$ 16957 64497 67712 74224 67890 -86805 -240772 -221334 -168285 -185473 -251527 -152670 -77954
21226g7954K6782J41842Q8230q4547l8059m48l4194o5472K4602J43905L3973n0073
$$ -77954 -51172 90670 178900 94353 56294 55846 21652 -43820 -19218 124687 158660 108587
21214A08587r6241l6662R6707J21271J891k5697J5843j256P4365o9250n0278j08928
$$ 108587 12346 -24316 72391 193662 195553 169856 185699 184443 258808 189558 139280 30352
21202C0352m6325O0335L4693k906l2055k7056M431l6005O688l276o5962j11760
$$ 30352 -15973 44362 79055 76149 44094 17038 21469 -14536 -7848 -11124 -77086 -188846
21190a88846J6734Q4215k6357j05438R783K17749J75757q5627p5332n629j32933
$$ -188846 -172112 -87897 -114254 -219692 -209909 7840 183597 97970 22638 17009 -115924
21179a15924r7430M2673O3405P0436P2103j25231p6368K3015L6595n6898J21890
$$ -115924 -213354 -170681 -107276 -36840 35263 -89968 -166336 -143321 -106726 -163624 -41734
21168d1734J05092M8983L2788L4025P2354Q800Q7962j77078k11967j0327Q9226
$$ -41734 63358 112341 145129 179154 251508 260308 348270 171192 -40775 -51102 38124
21157C8124l279j07268j32438R0521J2293l9010R1873P4015j11937j07814J53943
$$ 38124 34845 -72423 -204861 -114340 -102047 -141057 -49184 24831 -87106 -194920 -40977
21146d0977N0514l7300p8513l7209M7686o8069o426J10892K4475j83487k0883
$$ -40977 9537 -27763 -106276 -143485 -95799 -163868 -170294 -59402 -34927 -218414 -239297
21135b39297J31862l4626N7040P9235j8972M5949k2735l9498j4361m8126J10568
$$ -239297 -107435 -142061 -85021 -5786 -24758 21191 -1544 -41042 -55403 -103529 7039
21124G039K1014j26228n1543R7794R1735P776j5713q4004J00336q2135R517J35943
$$ 7039 28053 -98175 -149718 -51924 39811 47587 31874 -52130 48206 -33929 -24412 111531
21112A11531K1303Q9429l6736j07627j05247J2637j11370N275J8522k860J53835
$$ 111531 132834 222263 185527 77900 -27347 -14710 -126080 -120805 -102283 -105143 48692
21101D8692M5867L0192j0567j08323j6236j00005j66875m118j4439L9223R7978
$$ 48692 94559 124751 114184 5861 -10375 -110380 -277255 -281373 -295812 -256589 -158611
21090a58611J06435O19o003R6373j21172k3127j6637J7618J28698R0281j6828
$$ -158611 -52176 -51557 -57560 38813 -82359 -105486 -122123 -104505 24193 114474 97646
21079I7646n9632j2943r6707J17496J22505m5717p5210m9107k21698m9574J80239
$$ 97646 38014 25071 -71636 45860 168365 122648 47438 -1669 -223367 -272941 -92702
21068i2702J09995j3494J3497N8528N4414l3817N5301J28268l7237j41518j05854
$$ -92702 17293 3799 17296 75824 130238 96421 151722 279990 242753 101235 -4619
21057d619l8179j0881L1230o0059l7899J6257l8341Q6437R2805L4267n0454p8666
$$ -4619 -42798 -53679 -22449 -82508 -120407 -104150 -142491 -56054 36751 71018 20564 -58102
21045e8102O1409J48435M2281l9236o3532K4231O6332n459k3661m8167j79321
$$ -58102 3307 151742 194023 154787 91255 115486 181818 176359 152698 104531 -74790
21034g4790R278l2417K6649K2787K9287Q1650J46576L2941n7257q2008o7236o3671
$$ -74790 -65512 -97929 -71280 -48493 -19206 62444 209020 241961 184704 102696 35460 -28211
21022b8211J05354M8122q6683m1537J07764J31451R7901J681j20277o7539r9035
$$ -28211 77143 125265 38582 -2955 104809 236260 334161 335842 215565 148026 48991
21011D8991k8634J6434L2860o7632r3743P8168Q7614K06169O973k48230j28006
$$ 48991 20357 36791 69651 2019 -91724 -13556 74058 280227 287200 38970 -89036
21000h9036L2809l3399P6146J68025J08938j18917j18763R5282N5584n5022l2373
$$ -89036 -56227 -89626 -13480 154545 263483 144566 25803 121085 176669 121647 89274
20989H9274k7073o0094q8468j4507k1487Q9284R3846L7143N0922k40775k33986
$$ 89274 62201 2107 -86361 -100868 -122355 -33071 60775 97918 148840 -91935 -325921
20978c25921j2655R6275J44446l1970j12037p6161Q689J5567J64700Q9572J31032
$$ -325921 -338576 -242301 -97855 -129825 -241862 -318023 -309334 -293767 -129067 -39495 91537
20967I1537P256j13935o9212j6802O3678o4583k6348q0956N6045J37608N3390
$$ 91537 98793 -15142 -84354 -101156 -37478 -102061 -128409 -209365 -153320 -15712 37678
20956C7678L8523j743k261M0126n6840n8103J01332K9517J1451o4805J454j10999
$$ 37678 76201 74458 72197 112323 55483 -2620 98712 128229 139680 74875 76329 -34670
20944c4670J20766J34299P4092l5832M026j40097l058j3780O0364L7776o5393
$$ -34670 86096 220395 294487 258655 262681 122584 119526 105746 166110 203886 138493
20933A38493O1061p7353J18974J59691j2431j11626j64913K4116R7846K10341
$$ 138493 199554 122201 241175 400866 388435 276809 111896 136012 233858 444199
20923D44199K01005J87560K14452L32171L12326M23329L67016J65871J647k32338
$$ 444199 645204 832764 1047216 1379387 1691713 2115042 2482058 2647929 2649576 2417238
20913B417238n01489n75931l79914j46687j91462k78516m3240r2179l8424M4207
$$ 2417238 1915749 1339818 959904 813217 621755 343239 299999 207820 169396 213603
20903B13603q2148N0030L4132P157L8314J0396j1691k8263M609J8901r7996q0929
$$ 213603 131455 181485 215617 222774 261088 271484 259793 231530 236139 255040 157044 76115
20891G6115p3277N1263J56329j26601j73247L6381J31519J73200q598j98717O093
$$ 76115 2838 54101 210430 83829 -89418 -53037 78482 251682 243084 44367 50460
20880E0460J0291m4293R9580J1694M0262Q2197N4277p6401q1758J19556k203k11848
$$ 50460 60751 16458 116038 127732 167994 250191 304468 228067 146309 265865 263662 51814
20868E1814n0254k459L9291m6019l7310J23874k1580j26829L002M4353M7146l9048
$$ 51814 1560 -899 38392 -7627 -44937 78937 57357 -69472 -66470 -22117 25029 -14019
20856a4019q0738j19791P4154J57857Q8027p4596r236L6522j29943j03512J19676
$$ -14019 -94757 -214548 -140394 17463 105490 30894 21658 58180 -71763 -175275 -55599
20845e5599P2784o8566J4902J21112j01564j41880j65025L7307K53992J47368
$$ -55599 17185 -51381 -36479 84633 -16931 -158811 -323836 -286529 -32537 114831
20835A14831j36613o4248R13J16418N4735J6038J9293m0454n3565q0485L9864
$$ 114831 -21782 -86030 -85117 31301 86036 102074 121367 80913 27348 -53137 -13273
20824a3273Q5874J62280p1269Q7772R0940l2809k1192n6122j03657J24989O0776
$$ -13273 72601 234881 163612 251384 342324 309515 288323 232201 128544 253533 314309
20813C14309q1507j61988p3346Q9827O737n1360J6585o821J03536k3143j19772
$$ 314309 232802 70814 -2532 87295 94032 42672 59257 52436 155972 132829 13057
20802A3057k181q5618j60806N0413J65077J84866m5985j50779m1170O2976J18931
$$ 13057 10876 -74742 -235548 -185135 -20058 164808 118823 -31956 -73126 -10150 108781
20791A08781m9075n9m9001p0215N7698l274Q4352l9246M2463n0221M3140J93774
$$ 108781 59706 59647 10646 -59569 -1871 -5145 79207 39961 82424 32203 75343 269117
20779B69117j16894q6986P328Q3366l0863n4652m8279K6120o0354J2557q1342
$$ 269117 152223 65237 72565 155931 125068 70416 22137 48257 -12097 460 -80882
20768h0882L0196k8571Q0910K6420J16454J8002K2103j8643q9192q0641j3637
$$ -80882 -50686 -79257 1653 28073 144527 162529 184632 165989 76797 -3844 -17481
20757a7481L1371J45261M4936N9416j97674q4208K82743J24998j02985r8630j2706
$$ -17481 13890 159151 204087 263503 65829 -18379 264364 389362 286377 187747 175041
20746A75041p2203O511j6379n6864k9653K2233J00072L1070j50532N0554Q4820
$$ 175041 102838 109349 92970 36106 6453 28686 128758 159828 9296 59850 144670
20735A44670q930M2196L397n6981l3438J28874M0979M4411n1724o7192r5929m2626
$$ 144670 135740 177936 181333 124352 90914 219788 260767 305178 253454 186262 90333 47707
20723D7707j53596P3341J52703Q4400n5107J0750M3705N9966q3019m8215J6913
$$ 47707 -105889 -32548 120155 204555 149448 160198 203903 263869 180850 132635 149548
20712A49548P4001k0490j32680p0379K7403K13206J39075p1296j45617j22652
$$ 149548 223549 203059 70379 0 27403 240609 379684 308388 162771 40119
20702D0119J26596M9830j17064K2260O9060p9574l7279p0910Q822k6332J55530
$$ 40119 166715 216545 99481 121741 190801 111227 73948 3038 11860 -14472 141058
20691A41058J54972J4915J8420L4250p6093j90738Q5681j31496j65613N3267L3964
$$ 141058 296030 310945 329365 363615 287522 96784 182465 50969 -114644 -61377 -27413
20680b7413J64442j5710m0017P0138L1903N1703q5900p2940J60686m3125l776
$$ -27413 137029 121319 81302 151440 183343 235046 149146 76206 236892 193767 189991
20669A89991j06504o9448p410j05794j8693J93490J01123O7172j209j22970P6403
$$ 189991 83487 14039 6629 -99165 -117858 75632 176755 243927 242718 119748 196151
20658A96151N7101k47624o5236Q4567M544j57998J5535Q4102J41097J45655O7730
$$ 196151 253252 5628 -59608 24959 29503 -128495 -112960 -28858 112239 257894 325624
20647C25624l7577p8561j25692R4876j27213l907P326l5943j713J7291J50954
$$ 325624 288047 209486 83794 178670 51457 47550 54876 18933 17220 34511 185465
20636A85465L9581O0442j3721j30188m1013N2848L8827o454P8756j13276q9247
$$ 185465 225046 285488 271767 141579 100566 153414 192241 185787 264543 151267 62020
20625F2020j20244P830M6287M9930k8881R4603K7695R9712L3495J0095n4816m853
$$ 62020 -58224 -50394 -4107 45823 16942 111545 139240 238952 272447 282542 227726 222873
20613B22873n6802j22308R3550K3357j9664P26r1661K4816K4760j28354j8435
$$ 222873 166071 43763 137313 160670 141006 141732 50071 74887 99647 -28707 -47142
20602d7142L1815J35668K6585r9536o1756l5992n3403L7142O1517j1721R8965
$$ -47142 -15327 120341 146926 47390 -14366 -50358 -103761 -66619 -5102 -16823 82142
20591H2142k4921n9155k8054l527J08871R733j063K08810J00812N7431N3455R6414
$$ 82142 57221 -1934 -29988 -33515 75356 85089 84026 292836 393648 451079 504534 600948
20579F00948j9665l314r1813n5365J06578O7139o5074N9633j03079j10709q2000
$$ 600948 581283 577969 486156 430791 537369 604508 539434 599067 495988 385279 303279
20568C03279o2744P1650O0025p2806r5088m2837j9405J1881k1695Q2965L6502
$$ 303279 240535 312185 372210 299404 204316 161479 142074 153955 132260 215225 251727
20557B51727n8644j39368l4453K9485j37553l7898J65772K25768N1939R8397L6255
$$ 251727 193083 53715 19262 48747 -88806 -126704 39068 264836 316775 415172 451427
20546D51427j54294k14133O5684o8959k1963m3106j0118l8141N3182L5570J12330
$$ 451427 297133 83000 148684 79725 57762 14656 4538 -33603 19579 55149 167479
20535A67479M0696k9714p2444p0296N6692L4124l3514M9248L3615p4688J633L4562
$$ 167479 208175 178461 106017 35721 92413 126537 93023 142271 175886 101198 102831 137393
20523A37393J4605R5135j26803j06454j4669J17977J72106K4707J7096M5920k4858
$$ 137393 151998 247133 120330 13876 -793 117184 289290 313997 331093 377013 352155
20512C52155l3892r7191p965m2103J12820o802j8618j19735r7280N7135M8394
$$ 352155 318263 221072 213107 171004 283824 277022 258404 138669 41389 98524 146918
20501A46918J05563J00658J23120j26075j81996p0436J11333O0473K07068N4148
$$ 146918 252481 353139 476259 350184 168188 97752 209085 269558 476626 530774
20491E30774j66658j4008j01492o0208o9224P9594j0249m1548O2058p460o2884
$$ 530774 364116 350108 248616 188408 119184 198778 188529 146981 209039 201579 138695
20480A38695Q2143J72082O3388l0965m5423n0305l1815n8114l9217k047J75290
$$ 138695 220838 392920 456308 425343 379920 329615 297800 239686 200469 198422 373712
20469C73712J29396P7914n0132r1285j79301p1795j2358L7589J60335K14142J29155
$$ 373712 503108 581022 530890 439605 260304 188509 176151 213740 374075 588217 717372
20458G17372r5327j7074n3613p812l5775L3957P2440L695N4949L5563N4954o8635
$$ 717372 622045 604971 551358 543546 507771 541728 614168 617863 672812 708375 763329 694694
20446F94694j37844P9582L24983J59732N5197L0688p3442k34428j36638J21836
$$ 694694 556850 636432 961415 1121147 1176344 1207032 1133590 899162 762524 884360
20436H84360o946p2524m221o8998j20928J43444J20127j54820j20266L3055J36096
$$ 884360 877414 804890 800669 731671 610743 754187 874314 719494 599228 632283 768379
20425G68379J53100L5590L5082J1022R8498J90297K56485R5449j49390j32483
$$ 768379 921479 957069 992151 1003173 1101671 1291968 1548453 1643902 1494512 1362029
20415A362029q3894q0742M3338M1731p7863j6649j04894P6864j23955O8540J05983
$$ 1362029 1278135 1197393 1240731 1282462 1204599 1187950 1083056 1159920 1035965 1104505 1210488
20404A210488j24690q8495m3206O3703N4802K3972N4084M5211j51035n8481O077
$$ 1210488 1085798 997303 954097 1017800 1072602 1096574 1150658 1195869 1044834 986353 992430
20393I92430N3920R5350n280P5880L9454J61965J61517q6745l0363O7050n0190
$$ 992430 1046350 1141700 1136420 1212300 1251754 1413719 1575236 1488491 1458128 1525178 1474988
20382A474988N2481R6840K170J07033J43848J53682J14830N8835R0978O6431O8138
$$ 1474988 1527469 1624309 1626479 1733512 1877360 2031042 2145872 2204707 2295685 2362116 2430254
20371B430254O874R2627M8940K5057R6115P8591K65694K64196J51162J03602K07945
$$ 2430254 2437128 2529755 2578695 2603752 2699867 2778458 3044152 3308348 3459510 3563112 3771057
20360C771057K22072J73305K32229L44392K03864J95393J84498K03121K20915
$$ 3771057 3993129 4166434 4398663 4743055 4946919 5142312 5326810 5529931 5750846
20351E750846M79948N87243O43313Q21887R11508J056946R00496J179167J323156
$$ 5750846 6230794 6818037 7461350 8283237 9194745 10251691 11152187 12331354 13654510
20342A3654510J234375J224071J253994J359712J727709K295897K854809L750531
$$ 13654510 14888885 16112956 17366950 18726662 20454371 22750268 25605077 29355608
20334B9355608M647450N915193P749887J0404809J3950342J9063761K5885424
$$ 29355608 34003058 39918251 47668138 58072947 72023289 91087050 116972474
20327A16972474L4316531M3914106N5607986O9056855P8146859O4810439L2162484
$$ 116972474 151289005 195203111 250811097 319867952 398014811 462825250 494987734
20320D94987734M453986m8461763j03707008r9569497p0213067m6517495l1204464
$$ 494987734 499441720 450979957 347272949 247703452 177490385 130972890 99768426
20313I9768426k1339777j5059230j0902736q157243o444345n077578m157215l418290
$$ 99768426 78428649 63369419 52466683 44309440 37865095 32787517 28630302 25212012
20305B5212012k720944k110138j874126j395043j180676p20662o20840q56325
$$ 25212012 22491068 20380930 18506804 17111761 15931085 15210423 14589583 13733258
20297A3733258p96553r54990j173270j171596q65392p50302n52766m15934m10817
$$ 13733258 12936705 11981715 10808445 9636849 8771457 8021155 7468389 7052455 6641638
20288F641638l47579l26236l30741n02223n53310k90225j90157j28863k06124
$$ 6641638 6294059 5967823 5637082 5134859 4581549 4291324 4101167 3972304 3766180
20279C766180q82J98267j29927j93582k16217j65138k44909j80867j38931j21173
$$ 3766180 3765298 3963565 3833638 3640056 3423839 3258701 3013792 2832925 2693994 2572821
20269B572821j59257n3902k3139j66883K7856j9757p3836N33J5013l8375j90171
$$ 2572821 2413564 2359662 2336523 2169640 2197496 2177739 2103903 2104436 2119449 2081074 1890903
20258A890903j97901j43068n2337R090n4513K1352l2190j16899n1524L7075N8589
$$ 1890903 1693002 1549934 1497597 1506687 1452174 1473526 1441336 1324437 1272913 1309988 1368577
20247A368577n9243j3819j27468j91150L8207Q2346p2601k6679j9718O248J6957
$$ 1368577 1309334 1295515 1168047 976897 1015104 1097450 1024849 998170 978452 984700 1001657
20236A001657n7040n2639Q0584J62066j72161j44328P2279k3585j76984J16051
$$ 1001657 944617 891978 972562 1134628 962467 818139 890418 866833 689849 805900
20226H05900J66235O5098k1309k6154O3294J27646j02859p0872M4753j4658k57007
$$ 805900 972135 1037233 1015924 989770 1053064 1180710 1077851 1006979 1051732 1037074 780067
20215G80067r5687j12853j13368p5313J60721n8500j04046J14182O9613q0133
$$ 780067 684380 571527 458159 382846 543567 485067 381021 495203 564816 484683
20205D84683p5176k393R5316O055P9241K1666Q9042J48984O5528n7340k39287
$$ 484683 409507 407114 502430 508485 587726 609392 698434 847418 912946 855606 616319
20194F16319j1277J96724N0909j30251k1149j02244j21232j06776l4996O4866
$$ 616319 605042 801766 852675 722424 701275 599031 477799 371023 336027 400893
20184D00893N3968j57880n0699P6694P9959L0716l9963o2704j46126k8768L8985
$$ 400893 454861 296981 246282 322976 402935 433651 393688 330984 184858 156090 195075
20173A95075J12326L9685j5105k56843j40136J5624J80507K6365K4552k6046k619
$$ 195075 307401 347086 331981 75138 -64998 -49374 131133 157498 182050 156004 153385
20162A53385M6141k6742k9463j27572O9969J5539n8638q121J00545N3337o7511
$$ 153385 199526 172784 143321 15749 85718 101257 42619 34498 135043 188380 120869
20151A20869r278Q8816J37204k37047k2810m8631m8402l9069M7376q9829K24525
$$ 120869 111591 200407 337611 100564 77754 29123 -19279 -58348 -10972 -100801 123724
20140A23724J13112o6860k7288j1460P9855P5893o2765J5285k7687R351j22890
$$ 123724 236836 169976 142688 131228 211083 286976 224211 239496 211809 221160 98270
20129I8270j34431M9822K9296J9873p089q6417J63079N7075N8109Q4726O876j05717
$$ 98270 -36161 13661 42957 62830 55741 -30676 132403 189478 247587 332313 339189 233472
20117B33472O4627J0691J7212Q6764j67103l3565R7935K9746o7904j04505j6607
$$ 233472 298099 308790 326002 412766 245663 212098 310033 339779 271875 167370 150763
20106A50763J11080j1362j44880j90561J65111Q8979l2755K219M3444Q0333M3460
$$ 150763 261843 250481 105601 -84960 80151 169130 136375 138594 182038 262371 305831
20095C05831q9085j29963j20794L4708k1366n5176q1963j9017o9302J58578J1059
$$ 305831 216746 86783 -34011 697 -20669 -75845 -157808 -176825 -246127 -87549 -76490
20084g6490J69695J64224L3367j02815j95865n0637N1813J52856k7493q4078J4704
$$ -76490 93205 257429 290796 187981 -7884 -58521 -6708 146148 118655 34577 49281
20073D9281J27059n196r5561l143Q8148m5593j3944p0131O3258Q6116j62004J1602
$$ 49281 176340 171144 75583 72440 160588 114995 101051 30920 94178 180294 18290 29892
20061B9892j4694M1901K0267l3266J722M5320N46j00374J06928o158j29570L8704
$$ 29892 15198 57099 77366 44100 45822 91142 91688 -8686 98242 92084 -37486 1218
20049A218O7803R4112j40958j13194k8449O3743J16862k2121n8025M5569j4339
$$ 1218 69021 163133 22175 -91019 -119468 -55725 61137 39016 -19009 26560 12221
20038A2221N1355l5956j75932j04592R0117J20204J09280P2620O7457j30446J6405
$$ 12221 63576 27620 -148312 -252904 -162787 -42583 66697 139317 206774 76328 92733
20027I2733J30964k4173p9556p2554R791L6751N2145j80r1998J14636j1978j09512
$$ 92733 223697 199524 119968 47414 57205 93956 146101 145921 53923 168559 156581 47069
20015D7069j1092j01325J05010Q0780Q624q6035l516K9395j780k0168J93669L7716
$$ 47069 35977 -65348 39662 120442 129066 43031 39515 68910 67130 46962 240631 278347
20003B78347m3691q7126r5901Q8196R2536n7874q092o9166Q0597J16908l1861
$$ 278347 234656 147530 51629 139825 232361 174487 166395 97229 177826 294734 262873
19992B62873q5933k7703J08938j6848j32597q7361N508K1829J389J9302p6155
$$ 262873 176940 149237 258175 241327 108730 21369 26877 48706 50095 69397 -6758
19981f758Q0407J27248J47856l5384j52624r9815m8304n8046M730J32594j05927
$$ -6758 73649 200897 348753 313369 160745 60930 12626 -45420 -40690 91904 -14023
19970a4023r4978n8902m3648Q5055J66741N3589L2796j92386j44997K2171J8360
$$ -14023 -109001 -167903 -211551 -126496 40245 93834 126630 -65756 -210753 -188582 -170222
19959a70222j3637K12696O1919q4064N9461N1777l2912l9379j3666q2937j24144
$$ -170222 -183859 28837 90756 6692 66153 117930 85018 45639 31973 -50964 -175108
19948a75108M5353o0722r943M1204l3432P3020O7353J94575P5243P0402r5771
$$ -175108 -129755 -190477 -200420 -159216 -192648 -119628 -52275 142300 217543 287945 192174
19937A92174r8713Q7318L2562j8843Q080J6254q3903m9693q6583k7423Q4918J47342
$$ 192174 93461 180779 213341 194498 202578 218832 134929 85236 -1347 -28770 56148 203490
19925B03490k3520r6133j54055R538J39327J01735L4926K4337j12269j41917k0607
$$ 203490 179970 83837 -70218 -60680 78647 180382 215308 239645 127376 -14541 -35148
19914c5148O4500K36j4076j8720j36873k11221P5545K73441O4873O1626P3399
$$ -35148 29352 29588 15512 -3208 -140081 -351302 -275757 -2316 62557 124183 197582
19903A97582K8222o2716O34m378j0998M2919j6865M606J6458j18369j20121j16274
$$ 197582 225804 163088 163722 159344 148346 191265 174400 179006 195464 77095 -43026 -159300
19891a59300R9652J97444J19513K497Q968k3892n3136k6977j20431l4527M5951
$$ -159300 -59648 137796 257309 259806 268774 244882 191746 164769 44338 9811 55762
19880E5762L4327M7977O7547r9669l7840O6293J1073J633J38038r1165j50375
$$ 55762 90089 138066 205613 105944 68104 134397 145470 147103 285141 193976 43601
19869D3601Q814j5667P1801P3262j52666q6226J57928J23534j88490j00766j2086
$$ 43601 52415 36748 108549 181811 29145 -57081 100847 224381 35891 -64875 -76961
19858g6961p683n6741j09864n0197K03358J41560M9442K9947N165L3400n7359
$$ -76961 -84644 -141385 -251249 -301446 -98088 43472 92914 122861 128026 161426 104067
19847A04067P2969n6902P67j0616n560j19537J7347M2900p786j5731l7269l8198
$$ 104067 177036 120134 120901 110285 104725 -14812 2535 45435 37649 21918 -15351 -53549
19835e3549o7576J19193M5072L1616O6761J672J083M7289N7702j27303q8860L1605
$$ -53549 -121125 -1932 43140 74756 141517 143189 144272 191561 249263 121960 33100 64705
19823F4705J34388L8186j74332n5670J81943J53289n6815k9770j34119O6470J7428
$$ 64705 199093 237279 62947 7277 189220 342509 285694 255924 121805 188275 205703
19812B05703J3259L3366k8062k6656L0196j72659O5291N1275J43460J00220M0028
$$ 205703 218962 252328 224266 197610 227806 55147 120438 171713 315173 415393 455421
19801D55421j70082j76741j3693m1990m1337n4052J05758l6626L3553J61484j05260
$$ 455421 285339 108598 94905 52915 11578 -42474 63284 26658 60211 221695 116435
19790A16435r7790m1132O5590r874K4426M4500R1207K1359j8206J95590o667q3997
$$ 116435 18645 -22487 43103 33229 57655 102155 193362 214721 196515 392105 385438 301441
19778C01441n0291L5580n8982j04899l4800P7787K4454P220Q8494k9255k2581
$$ 301441 251150 286730 227748 122849 88049 165836 190290 197510 286004 256749 234168
19767B34168J7982l2461j5994N6319j39515q5684J2678J26785J9875N3635Q520
$$ 234168 252150 219689 203695 260014 120499 34815 47493 174278 194153 247788 256308
19756B56308r3736o5405L3110k8166k995p4861j5300R7479M8408p8481K3464l2200
$$ 256308 162572 97167 130277 102111 99116 24255 8955 106434 154842 76361 99825 67625
19744F7625K5506j8962m8923P3636n5910k1463K5796P7457j1368M1967J53265
$$ 67625 93131 74169 25246 98882 42972 21509 47305 124762 113394 155361 308626
19733C08626M6883P5263P4425p8587K0382J50929J01037J39161J52213K84329
$$ 308626 355509 430772 505197 426610 446992 597921 698958 838119 990332 1274661
19723A274661K59050L26756M44045O03604M41848J63986J8829l19215n92975m36360
$$ 1274661 1533711 1860467 2304512 2908116 3349964 3513950 3532779 3213564 2620589 2184229
19713B184229l06726l73786k72557k34011j15565P7786M0888l4774M8302O7017
$$ 2184229 1877503 1503717 1231160 997149 881584 959370 1000258 965484 1013786 1080803
19703A080803J94548P6059M2011j51922k53983j6260k3668K8590M7021J32374
$$ 1080803 1275351 1351410 1393421 1241499 987516 971256 947588 976178 1023199 1155573
19693A155573j65099k60512j94196l7117n2189R0524j29006r1443j34075n5649
$$ 1155573 990474 729962 535766 498649 446460 536984 407978 316535 182460 126811
19683A26811P2371O9333M7770j36544J20904O9429o5942J62462P2004m6877O5226
$$ 126811 199182 268515 316285 179741 300645 370074 304132 466594 538598 491721 556947
19672E56947O8608k4472j94945o6862Q0334N7084P5766R8822J1333J43806K9460
$$ 556947 625555 601083 406138 339276 419610 476694 552460 651282 662615 806421 835881
19661H35881J10879J02058K01351J63043N6471j72345j79964Q2353p951j03082
$$ 835881 946760 1048818 1250169 1413212 1469683 1297338 1117374 1199727 1191776 1088694
19651A088694M2319q258j10599j08253P8679J01489l4021K3334o0848k49227k13558
$$ 1088694 1131013 1122755 1012156 903903 982582 1084071 1050050 1073384 1012536 763309 549751
19640E49751K1054J27429n2292J3254j07284k03194r9823l3081P0J1956q610J8601
$$ 549751 570805 698234 645942 659196 551912 348718 248895 215814 215884 227840 219230 237831
19628B37831j75439n663j7027m1196J7630r78Q7297O7763m4626m4228Q0552q2910
$$ 237831 62392 56729 39702 -1494 16136 15158 102455 170218 125592 81364 161916 79006
19616G9006j0908K1352J8073K3441P0044N5658K7648r8052L2750J2096k0720j87463
$$ 79006 68098 89450 107523 130964 201008 256666 284314 186262 219012 231108 210388 22925
19604B2925K3541m0753P999J53152J96313j06739M0916J95629m0281j68399j52096
$$ 22925 46466 5713 13712 166864 363177 256438 297354 492983 452702 284303 132207
19593A32207n4168K6039J33970O7302k6750P7029N8765K3485J7771k546J45832
$$ 132207 78039 104078 238048 305350 278600 355629 414394 437879 455650 453104 598936
19582E98936O9578o5721j74051j08274J867m7082J1637P2826o2104Q4421J5338
$$ 598936 668514 602793 428742 320468 322335 275253 286890 359716 297612 382033 397371
19571C97371L3120p8266K1671p2776j23730o3425k5421Q6218J10611R9938O976
$$ 397371 430491 352225 373896 301120 177390 113965 88544 174762 285373 385311 392287
19560C92287j831L345j07195j9701j3417m1355J241j4469M9014J6133j75629N7423
$$ 392287 390456 393801 286606 266905 253488 212133 213374 198905 247919 264052 88423 145846
19548A45846q101M679J15423j11726L1876M1822J73178n6030j74756K4594J13885
$$ 145846 137745 142424 257847 146121 177997 219819 392997 336967 162211 186805 300690
19537C00690J63070R5763m4950N1494R5521Q7055J0792o1075O599M4106k7901
$$ 300690 463760 559523 514573 566067 661588 748643 759435 698360 704959 749065 721164
19526G21164j31543k35071Q519J55955k5945j51794k7122J8313L1922O9787P5741
$$ 721164 589621 354550 363069 519024 493079 341285 314163 332476 364398 434185 509926
19515E09926j57329j68387M7447Q9511J6406p3996p4647K5059j15669j01208o190
$$ 509926 352597 184210 231657 321168 337574 263578 188931 213990 98321 -2887 -9077
19504i077J17863J06697R434n3329J645N931K5020j372P9812O2153n4871r0849
$$ -9077 108786 215483 224917 171588 173233 179164 204184 202812 282624 344777 289906 199057
19492A99057q79Q4093j16315k27971M1279N5202O3659J72278J36917q4235j44273
$$ 199057 198178 282271 165956 -62015 -20736 34466 98125 270403 407320 323085 178812
19481A78812o2883n473k8469M9172J25230P1447P262q3321r9331J15776N9125
$$ 178812 115929 110456 81987 131159 256389 327836 335098 251777 152446 268222 327347
19470C27347j963N5422M4153N3868j5478L7165K0271j4386k04587k3663j00370
$$ 327347 325384 380806 424959 478827 463349 500514 520785 506399 301812 278149 177779
19459A77779J17198J39998K541k8503o7476k9357Q8001J43998M6405L3383O1124
$$ 177779 294977 434975 437516 409013 341537 312180 400181 544179 590584 623967 685091
19448F85091j17819j23230p5876k1564P1325Q1473K5108m1385J06387M6159k5739
$$ 685091 567272 444042 368166 346602 417927 499400 524508 483123 589510 635669 609930
19437F09930O6605o509o3570o5799k00535j43357N4691R8125J84650o4001p4M5043
$$ 609930 676535 670026 606456 540657 340122 196765 251456 349581 534231 470230 470156 515199
19425E15199n6542j20508l6876k9752J34548k7009k58500m7374L9465J48590P4787
$$ 515199 458657 338149 301273 271521 406069 379060 120560 73186 112651 261241 336028
19414C36028J6034Q3750P6735j33561j97316n2377J1949J08105o2432j49030J30827
$$ 336028 352062 435812 512547 378986 181670 129293 141242 249347 186915 37885 168712
19403A68712J42165K994k0888J06331O9578J54338J42790m2127k10151Q5381O5832
$$ 168712 310877 313871 292983 399314 468892 623230 766020 723893 513742 599123 664955
19392F64955j6100j34122l7681j4337j13813m5266q810M2523J11986q7320k6271
$$ 664955 648855 514733 477052 462715 348902 303636 294826 337349 449335 362015 335744
19381C35744J5306k86459k8001J80968K09460O6566j6748p3271M7417J83594k7312
$$ 335744 351050 64591 36590 217558 427018 493584 476836 403565 450982 634576 607264
19370F07264k529K659N3035j43679k8723p0962j54644J9345J49799M9269k26016
$$ 607264 604735 607394 660429 516750 488027 417065 262421 281766 431565 480834 254818
19359B54818k37050J37644m46N6019K18362J07447l4489m6550M1727n3254j34803
$$ 254818 17768 155412 154966 210985 429347 536794 502305 455755 497482 444228 309425
19348C09425K1708j6585j38361J68700J42272J03855M7110M2992N8952n3677l9271
$$ 309425 331133 314548 176187 344887 487159 591014 638124 681116 740068 686391 647120
19337F47120K8731L3773n2763k6021J3918J977J4595j07148N7929J99164L0561
$$ 647120 675851 709624 656861 630840 644758 646735 661330 554182 612111 811275 841836
19326H41836j13874Q4191J28039P6710O8562R9518Q142q2713n8439j41575q363
$$ 841836 727962 812153 940192 1016902 1085464 1184982 1193124 1110411 1051972 910397 902034
19315I02034O0014L4814M6407r2521O5571O8204K8470O8705j59075j09695J37327
$$ 902034 962048 996862 1043269 950748 1016319 1084523 1112993 1181698 1022623 912928 1050255
19304A050255k5025l4336L7672K3087Q565J5J19070J44078j02685q7756O3907
$$ 1050255 1025230 990894 1028566 1051653 1060218 1060233 1179303 1323381 1220696 1132940 1196847
19293A196847L758K523J72265J63181m1005p0998j0523O0505Q3275J02838L6536
$$ 1196847 1200605 1203128 1375393 1538574 1497569 1426571 1416048 1476553 1559828 1662666 1699202
19282A699202J83506K30492J09443k1604k21726j10761N948N555J62682r9781
$$ 1699202 1882708 2113200 2222643 2201039 1979313 1868552 1874500 1880055 2042737 1942956
19272A942956k71939N1672M2514O8274P1969J05858K5023k9653j4848M8772K0887
$$ 1942956 1671017 1722689 1765203 1833477 1905446 2011304 2036327 2006674 1991826 2040598 2061485
19261B061485N8871J48304k970J1068Q4010M5145o7P6394N8593j2248p6038J96295
$$ 2061485 2120356 2268660 2265690 2276758 2360768 2405913 2405846 2482240 2540833 2528585 2452547 2648842
19249B648842K62261J99484K40074J41984K22841K02842R4219K17094L17254K82114
$$ 2648842 2911103 3110587 3350661 3492645 3715486 3918328 4012547 4229641 4546895 4829009
19239D829009L98228L55424L44612N86553O63192O49388L56127L12778Q9144L3992
$$ 4829009 5227237 5582661 5927273 6513826 7177018 7826406 8182533 8495311 8584455 8618447
19229H618447J62358L22330K58318L83268P00395J011277J058507J313746J513831
$$ 8618447 8780805 9103135 9361453 9744721 10445116 11456393 12514900 13828646 15342477
19220A5342477J767596K199895K741943L308981M465432N500444N040200L634023
$$ 15342477 17110073 19309968 22051911 25360892 29826324 35326768 40366968 44000991
19212D4000991K604481K43371k050287j038578J585851M518227Q041313J2146594
$$ 44000991 46605472 46848843 44798556 43759978 45345829 49864056 57905369 70051963
19204G0051963J7074251K3211637L0558740L9283634M7293047M4897550L2113254
$$ 70051963 87126214 110337851 140896591 180180225 227473272 272370822 304484076
19197C04484076K3717088n556551m1261682m3374563m0550207l9033251k9092270
$$ 304484076 328201164 322644613 281382931 238008368 197458161 158424910 129332640
19190A29332640j7089235p291227j37411M399967M529437J156195k529051j0137022
$$ 129332640 112243405 104952178 104814767 109214734 113744171 114900366 112371315 102234293
19182A02234293j8234881j7489286j2791723q687457o057881m423626l247054
$$ 102234293 83999412 66510126 53718403 45030946 38973065 34549439 31302385
19175C1302385k363605j637095j078962n75303j28205n5131J54573O72797J101886
$$ 31302385 28938780 27301685 26222723 25647420 25519215 25464084 25618657 26291454 27393340
19166B7393340J908146K670330L608578N131086O999042Q862837J0989910J3896020
$$ 27393340 29301486 31971816 35580394 40711480 47710522 56573359 67563269 81459289
19158H1459289J6380944J6445069J2588068Q289359K549189o113957o225065K161408
$$ 81459289 97840233 114285302 126873370 135162729 137711918 131597961 125372896 127534304
19150A27534304J2639378K3285797L4163943M4316423N0183236N1048105M7030099
$$ 127534304 140173682 163459479 197623422 241939845 292123081 343171186 390201285
19143C90201285K1063779j3914387l1627714o2982708q0524730o1935982m0285576
$$ 390201285 411265064 397350677 365722963 302740255 222215525 160279543 119993967
19136A19993967k5458034j6030624j0084518o070413l088097n92157J361995J968133
$$ 119993967 94535933 78505309 68420791 62350378 59262281 58670124 60032119 62000252
19128F2000252L96210j729321m231679q778591r961224p595994n444692l696120
$$ 62000252 62396462 60667141 56435462 47656871 37695647 30099653 24654961 20958841
19120B0958841k632004k019893j561382j325256q68851m57433l56994l11852l74068
$$ 20958841 18326837 16306944 14745562 13420306 12551455 12094022 11737028 11425176 11051108
19111A1051108m00667l76328l22680n98994p22062p69995o65980o43499o53752
$$ 11051108 10650441 10274113 9951433 9352439 8630377 7860382 7194402 6550903 5897151
19102E897151l46227j53201j71953r9567r7784j55219k78710k78730j91184k32464
$$ 5897151 5550924 5397723 5225770 5126203 5028419 4873200 4594490 4315760 4124576 3892112
19092C892112j45188q8749j83130j98025j23571j99851N1113j41867j42875j78478
$$ 3892112 3746924 3658175 3475045 3277020 3153449 2953598 3004711 2862844 2719969 2541491
19082B541491o312k0825m2139q3457K439j0601j08085j1478K9055J2765m6352
$$ 2541491 2535179 2514354 2472215 2388758 2391197 2380596 2272511 2261033 2290088 2302853 2256501
19071B256501j17444j47445l5561K2074o9346j04334j88829j1599N8435j01761
$$ 2256501 2139057 1991612 1956051 1978125 1908779 1804445 1615616 1604017 1662452 1560691
19061A560691j01610q9520J2214j13433o9216L1582O6811o248j3588k8654L9913
$$ 1560691 1459081 1369561 1381775 1268342 1199126 1230708 1297519 1291271 1277683 1249029 1288942
19050A288942N2223n8915l4663m8992o7863k2394N0595k8879K8648L5226j150
$$ 1288942 1341165 1282250 1247587 1198595 1130732 1108338 1158933 1130054 1158702 1193928 1192778
19039A192778j07443J5207m8026K2428K17320Q4790J7381n2089l0461Q8182J17411
$$ 1192778 1085335 1100542 1052516 1074944 1292264 1377054 1394435 1342346 1311885 1400067 1517478
19028A517478O096j70279O7282J7338O2151J00995L2045J5118j63829j2488m5089
$$ 1517478 1523574 1353295 1420577 1437915 1500066 1601061 1633106 1648224 1484395 1471907 1426818
19017A426818K3074p1450n5257L543o5039K7251m0372q2754q4454r1493r2421
$$ 1426818 1449892 1378442 1323185 1326728 1261689 1288940 1248568 1165814 1081360 989867 897446
19006H97446r9131J95L2425O2744L2384k55N1015j02785p0035j155n5757J26406
$$ 897446 798315 798510 830935 893679 926063 925808 976823 874038 804003 802848 747091 873497
18994H73497n2049j49571N7R2574L6325N8032L532m0937o858J5998q8870Q4972
$$ 873497 821448 671877 671934 764508 800833 858865 862397 821460 814602 830600 741730 826702
18982H26702J38555J0846p690m2779r9869r0499R5763K6747O49M1857j2466K8077
$$ 826702 965257 976103 968413 925634 825765 735266 831029 857776 858425 900282 887816 915893
18970I15893p4091j0024J22386P5877j52033j30821n8148p5802l7943R2267L2077
$$ 915893 841802 831778 954164 1030041 878008 747187 689039 613237 575294 667561 699638
18959F99638J3433Q9816P706j5672m1883j30372O4739N1662K8301l2321r6706
$$ 699638 713071 802887 810593 794921 753038 622666 687405 739067 767368 735047 638341
18948F38341o6808P5134Q4152P6546J3710q266k1553j0233L4874O9553l0092l2554
$$ 638341 571533 646667 730819 807365 821075 812809 791256 781023 815897 885450 855358 822804
18936H22804q415K1630K3119j05515j96964L8620J72778k42l5840l0132J5200
$$ 822804 814389 836019 859138 753623 556659 595279 768057 767815 731975 701843 717043
18925G17043q7546L5700j1358K816O206K9582j7233j25860O3543L8326p6658j34267
$$ 717043 629497 665197 653839 656655 662861 692443 675210 549350 612893 651219 574561 440294
18913D40294l5504j09610j33997j364J78185Q7664J25271n3174P072J19931P3662
$$ 440294 404790 295180 161183 159819 338004 425668 550939 497765 504837 624768 698430
18902F98430m7974j72584N2039m1765M9152K1230K7867l7853J12763j2223J39062
$$ 698430 650456 477872 529911 488146 537298 558528 586395 548542 661305 649082 788144
18891G88144J48738k4497k187N7711K9864j12669J5239J83337o858j55563k500
$$ 788144 936882 912385 910198 967909 997773 885104 900343 1083680 1076822 921259 918759
18880I18759P8765K6081J9193o8730P800J40627L0605j6253O0885j25290l1801
$$ 918759 997524 1023605 1042798 974068 981868 1122495 1153100 1136847 1197732 1072442 1040641
18869A040641R3801N1062l7734r0430Q751p4321k0100Q897j2152L3845m286j16900
$$ 1040641 1134442 1185504 1147770 1057340 1066091 991770 971670 980567 968415 1002260 997974 881074
18857H81074K8382m0057P4046O8833n1868N6385o3376L2543j28151l0670K1928
$$ 881074 909456 869399 943445 1012278 960410 1016795 953419 985962 857811 827141 849069
18846H49069M5987J70534J70519J2054q8810j49790k570K6789J7814K1988J36604
$$ 849069 895056 1065590 1236109 1248163 1159353 1009563 1006993 1033782 1051596 1073584 1210188
18835A210188J05935r30J46906J52126K8795L0771q3025k5417M2981J65876K1424
$$ 1210188 1316123 1315193 1462099 1614225 1643020 1673791 1590766 1565349 1608330 1774206 1795630
18824A795630Q852o4889J74520J97559P9085n3345n3350L0419P5123m829j40656
$$ 1795630 1804482 1739593 1914113 2111672 2190757 2137412 2084062 2114481 2189604 2184775 2044119
18813B044119m1787q8081M1999k3765J76631Q9767p8628r493J31838J27292m1704
$$ 2044119 2002332 1914251 1956250 1932485 2109116 2198883 2120255 2110762 2242600 2369892 2328188
18802B328188J51081J59447J77621N7218P9704R2678J8870L6097L11477K71021
$$ 2328188 2479269 2638716 2816337 2873555 2953259 3045937 3064807 3100904 3412381 3683402
18792C683402J59168R5949J51268L33379M97279K55312m2046Q3550J81907L36948
$$ 3683402 3842570 3938519 4089787 4423166 4920445 5175757 5133711 5217261 5399168 5736116
18782E736116K94141M91066O66654O42914P36856J022919J298064J424943J285762
$$ 5736116 6030257 6521323 7187977 7830891 8567747 9590666 10888730 12313673 13599435
18773A3599435J373186J794875J896725J903028K639678L626896M670445N959815
$$ 13599435 14972621 16767496 18664221 20567249 23206927 26833823 31504268 37464083
18765C7464083P153912P501680N811615M425954K321819k233580k424510J114918
$$ 37464083 44617995 52119675 57931290 62357244 64679063 62445483 60020973 61135891
18757F1135891N375425R888329J5281517K1573562K8843925L7686235M8812007
$$ 61135891 66511316 76399645 91681162 113254724 142098649 179784884 228596891
18750B28596891N9646517N7648183M0889698K8840412q180178n5106167o0103617
$$ 228596891 288243408 345891591 386781289 415621701 407441523 352335356 292231739
18743B92231739n7126597n1775155l5883844k0452304r198409j283838M066225
$$ 292231739 235105142 183329987 147446143 126993839 117795430 116511592 120577817
18736A20577817N530928J930944k747403q750253j8714557k1090406j6456793
$$ 120577817 126108745 128039689 125292286 116542033 97827476 76737070 60280277
18729F0280277j1253556p619557n203218l338367k260679j455053r72903n45201
$$ 60280277 49026721 41407164 36203946 32865579 30604900 29149847 28176944 27631743
18721B7631743n02371m18166r8297K22919O22187J179308J521554K186018L485974
$$ 27631743 27129372 26711206 26612909 26835828 27458015 28637323 30158877 32344895 35830869
18712C5830869N035946O757786Q698960J1015366J3440042J4932553J2535506
$$ 35830869 40866815 47624601 56323561 67338927 80778969 95711522 108247028
18705A08247028Q654145N291747k068059n850487j15569Q573896J7571955K6870232
$$ 108247028 116901173 122192920 120124861 114274374 114158805 122732701 140304656 167174888
18697A67174888L4330042L6766130L6716181L4071610J1307572j4410930k2260825
$$ 167174888 201504930 238271060 274987241 309058851 320366423 305955493 283694668
18690B83694668m6798683o3673091m9061860l1708304k0063161j2647262p849255
$$ 283694668 236895985 173222894 124161034 92452730 72389569 59742307 51893052
18683E1893052m555448k150529q21110M73089J318127N47603r77178k540245n244708
$$ 51893052 47337604 45187075 44365965 44839054 46157181 46704784 45727606 43187361 37942653
18674C7942653o979087n755432m131323k580068j631746j193230j022408r38178
$$ 37942653 30963566 25208134 21076811 18496743 16864997 15671767 14649359 13711181
18666A3711181q97847r03161r22097r39154r44185r21111o42828m53187k31262
$$ 13711181 12813334 11910173 10988076 10048922 9104737 8183626 7540798 7087611 6856349
18657F856349l05956n44444l84693k36589j37561k18977l28333k40306j24826
$$ 6856349 6550393 6005949 5621256 5384667 5247106 5028129 4699796 4459490 4334664
18648D334664j61138k26994j64773j16702m1122l7802k39140j90110O6270l4765
$$ 4334664 4173526 3946532 3781759 3665057 3623935 3586133 3346993 3156883 3223153 3188388
18638C188388k85515k08137j66083m6066J44300K204k3378j34061j13237n8400
$$ 3188388 2902873 2694736 2528653 2482587 2626887 2629091 2605713 2471652 2358415 2300015
18628B300015p8915l3154r0272l0855J26976L1401r5034J09448J36845L712k49445
$$ 2300015 2221100 2187946 2097674 2066819 2193795 2225196 2130162 2239610 2376455 2380167 2130722
18617B130722k16553m3790K6939J68284p4361l73578j01399J70383K2567l9404
$$ 2130722 1914169 1870379 1897318 2065602 1991241 1617663 1516264 1686647 1709214 1669810
18607A669810J25051r7413k35097j67833J0798L5371p2696k0424j12882k39522
$$ 1669810 1794861 1697448 1462351 1294518 1305316 1340687 1267991 1247567 1134685 895163
18597H95163J1748O3017O7872r928j11170Q7146O1623m484K277m3796l3582j3996
$$ 895163 906911 969928 1037800 1027872 916702 1003848 1065471 1060987 1063264 1019468 985886 971890
18585I71890r6145r2332j34120J17514J33093q4625j72899K2548M7824L1979M9294
$$ 971890 875745 783413 649293 766807 899900 815275 642376 664924 712748 744727 794021
18574G94021M3928q3768j30481r8501J78091K14871N4816r3326L7855R3355j21423
$$ 794021 837949 754181 623700 525199 703290 918161 972977 879651 917506 1010861 889438
18563H89438k4718q0733j25882q4956J05472O0536j14625j64200O1080M9251M6853
$$ 889438 864720 783987 658105 573149 678621 739157 624532 460332 521412 570663 617516
18552F17516m1037r2615L7312N2229J9784k1490L0924j5794P197n2628R9741N6649
$$ 617516 576479 483864 521176 573405 593189 571699 602623 586829 594026 541398 641139 697788
18540F97788l7586k05030k5271q4160m3167K06992J19870n8004n8844l4128j8973
$$ 697788 660202 455172 429901 345741 302574 509566 629436 571432 512588 478460 459487
18529D59487M4189J36113k8326j16798R8367O0042P224j8771m3167O0978N1400
$$ 459487 503676 639789 611463 494665 593032 653074 660298 641527 598360 659338 710738
18518G10738q5356J8458j24631k09055K5335L3138p3455j1505l9948M6661J79610
$$ 710738 625382 643840 519209 310154 335489 368627 295172 283667 243719 290380 469990
18507D69990J82716m275m9074M8361m8590n113k8146J656K019r326q532n941r5915
$$ 469990 652706 648431 599357 647718 599128 594015 565869 567525 569544 560218 551686 545745 449830
18494D49830r7659j486m9244L9805J92452O2895N8689R95m6330p9299o1352J6299
$$ 449830 352171 350685 301441 341246 533698 596593 655282 656277 609947 530648 469296 485595
18482D85595m4781O6391O2300O892j64880m9162N7582J4606j04943l2323J11902
$$ 485595 440814 507205 569505 576397 411517 362355 419937 434543 329600 297277 409179
18471D09179l4172n8577r179j25120M7850Q9745r6617j7592n0406J2511q0342
$$ 409179 375007 316430 307251 182131 229981 319726 223109 205517 155111 167622 87280
18460H7280J2732K16742Q7957m0842q3193j68287O9353N0841L9957L5750K3441
$$ 87280 100012 316754 404711 363869 280676 112389 181742 232583 272540 308290 331731
18449C31731J34371L6254j11579l2025K9520M6371J2418q5637q9401J1137J30005
$$ 331731 466102 502356 390777 358752 388272 434643 447061 361424 272023 283160 413165
18438D13165J63639m1842k27404j41200J08153R9681R5619J6083j22961L919J41645
$$ 413165 576804 534962 307558 166358 274511 374192 469811 485894 362933 366852 508497
18427E08497L5893j13465o6554N2579j4734m648o5728k8059k8240O5945N531R4161
$$ 508497 544390 430925 364371 416950 402216 397568 331840 303781 275541 341486 347017 441178
18415D41178r1876j72943j1002K7486j18127N3684O8674o9459j0860L240o0462
$$ 441178 349302 176359 165357 192843 74716 128400 197074 127615 116755 119995 59533
18404E9533J64176P0632j04505l1796J5964K9622n158N9710j5579P7126j24935
$$ 59533 223709 294341 189836 158040 174004 203626 198468 258178 242599 319725 194790
18393A94790K0307K2360J64451K7921k67299j69871k0353q1853M6641J87248J46836
$$ 194790 215097 237457 401908 429829 162530 -7341 -27694 -109547 -62906 124342 271178
18382B71178q088o8945K0605j2127J0536p3659J055L0137Q0133N7699J25758l9273
$$ 271178 263090 194145 214750 202623 213159 139500 140555 170692 250825 308524 434282 395009
18370C95009j8644j9465m6557N7137k0685J65838P7575n8979k4509o8889m9932
$$ 395009 376365 356900 310343 367480 346795 512633 590208 531229 506720 437831 387899
18359C87899o7830j29081L4158J39761R4698n4770j56585q9328Q369m2872l3109
$$ 387899 320069 190988 225146 364907 459605 404835 248250 158922 167291 124419 91310
18348I1310K9413j3935n9959J09678R9647r5370j59797j08350P117J12494N8649
$$ 91310 120723 106788 46829 156507 256154 160784 987 -107363 -100246 12248 70897
18337G0897Q9439R7611J20282L3637j26419k25970O9761N2295J65949J12966k9032
$$ 70897 160336 257947 378229 411866 285447 59477 129238 181533 347482 460448 431416
18326D31416p4461L2193p9591p1202j3305m8404J26957k8320j58365N594l8446
$$ 431416 356955 389148 309557 238355 225050 176646 303603 275283 116918 122512 84066
18315H4066J07066M3285l9855j45648j14686j10996Q741R4097P0611J9934J45757
$$ 84066 191132 234417 194562 48914 -65772 -176768 -168027 -73930 -3319 16615 162372
18304A62372J02747k6921p8976Q8518n7200j50797K04467P4767q1733j20652m229
$$ 162372 265119 238198 159222 247740 190540 39743 244210 318977 237244 116592 112363
18293A12363m4580J095Q8306q0525O8379n9698j2175J26995r8224J3653r4673
$$ 112363 67783 68878 157184 76659 145038 85340 73165 200160 101936 115589 20916
18282B0916j02001K9177L0449J14323j7160n4738m8701J3622L3103j33141k0223
$$ 20916 -81085 -51908 -21459 92864 75704 20966 -27735 -14113 18990 -114151 -134374
18271a34374Q5474K7344J13890J72140M2007r0259N252O6392R5712m0378m6519
$$ -134374 -48900 -21556 92334 264474 306481 216222 221474 287866 383578 343200 296681
18260B96681l031J09295L0035n7845p231K0516o6065j70776j1848L69M7010J3918
$$ 296681 293650 402945 432980 375135 367904 388420 322355 151579 139731 140100 187110 201028
18248B01028L2607J9435P6782P9250m520P4465O3771j6741j50971l4504l3457
$$ 201028 233635 253070 329852 409102 404582 479047 542818 526077 375106 340602 307145
18237C07145M7243P8450J75955N7846o304n282l0222P9689K12346K12387J27580
$$ 307145 354388 432838 608793 666639 660335 655053 624831 704520 916866 1129253 1256833
18226A256833N6517J65849K04188J35921O8122o6283j33218l0456M4522j81814
$$ 1256833 1313350 1479199 1683387 1819308 1887430 1821147 1687929 1657473 1701995 1520181
18216A520181p7013m3596j27903j31652K616K77556M9206o8579j29620j68999
$$ 1520181 1443168 1399572 1271669 1140017 1142633 1420189 1469395 1400816 1271196 1102197
18206A102197j51617o2944r1706J3149j2293M9419k2009j02141N3689j2423P5489
$$ 1102197 950580 887636 795930 809079 796786 846205 824196 722055 775744 763321 838810
18195H38810J5056L0179N5372R405m5977l7972P526j10325q5358j82644k703J37490
$$ 838810 853866 884045 939417 948822 902845 864873 872399 762074 676716 494072 491369 628859
18183F28859l1663O8718L6416J44006J37547J39591J10146P4680Q9709K55860
$$ 628859 597196 665914 702330 846336 983883 1123474 1233620 1308300 1398009 1653869
18173A653869P581K15032P0752P0981j61042P2360R9445p3870k46629j68880j54175
$$ 1653869 1661450 1876482 1947234 2018215 1857173 1929533 2028978 1955108 1708479 1539599 1385424
18162A385424k1382N3576L792Q932N4271Q2112Q7189J12195O6137K6488R7733
$$ 1385424 1364042 1417618 1421410 1430342 1484613 1566725 1653914 1766109 1832246 1858734 1956467
18151A956467J08578M0958k10966j42050j12954q0786j11428M6316N7983O1911
$$ 1956467 2065045 2106003 1895037 1752987 1640033 1559247 1447819 1494135 1552118 1614029
18141A614029R3223L6295n4730J07997K51274J18141J71578L13868J84655J52394
$$ 1614029 1707252 1743547 1688817 1796814 2048088 2166229 2337807 2651675 2836330 2988724
18131B988724K26244K59726J95067M84922M95007N79828N95888Q10799J110653
$$ 2988724 3214968 3474694 3669761 4154683 4649690 5229518 5825406 6636205 7746858
18122G746858J399271J637944J898036K785946L967358N544060P921862J0771815
$$ 7746858 9146129 10784073 12682109 15468055 19435413 24979473 32901335 43673150
18114D3673150J4076043J8199429K4049491L0118077K5413087R686222N711710
$$ 43673150 57749193 75948622 99998113 130116190 155529277 165215499 170927209
18107A70927209j7281135m5697470l6257345k2135081j3544170q713948n846508
$$ 170927209 153646074 107948604 71691259 49556178 36012008 27298060 21451552
18100B1451552m024330k793053k200624j778425j352702j016831r15322r39280
$$ 21451552 17427222 14634169 12433545 10655120 9302418 8285587 7370265 6430985
18092F430985p28165n89753n51079m96329k58857k12051k62363k80898m55651
$$ 6430985 5702820 5113067 4561988 4065659 3806802 3594751 3332388 3051490 2595839
18083B595839l40249Q9395R4536r4270j55264K7632j7066r2016j71912j40515
$$ 2595839 2255590 2344985 2439521 2345251 2189987 2217619 2200553 2108537 1936625 1796110
18073A796110r9353l5893j55653n3825q5689j34729J8914K10442K4518o2970N4630
$$ 1796110 1696757 1660864 1505211 1451386 1365697 1230968 1249882 1460324 1484842 1421872 1476502
18062A476502J51885M8653K6984J03163J40130Q3465j98874k73432m8675l5464
$$ 1476502 1628387 1677040 1704024 1807187 1947317 2030782 1831908 1558476 1509801 1474337
18052A474337n1189O45j43967q5643k1451j06978j52088j79522j41860l8391o7450
$$ 1474337 1423148 1423793 1279826 1194183 1172732 1065754 913666 734144 592284 553893 486443
18041D86443J64284M7454o4262K8280r305m8478r8346j07217j2617l8051q2362
$$ 486443 650727 698181 633919 662199 652894 604416 506070 398853 386236 348185 265823
18030B65823N2642p637r8356r193J1312M07K08390L2009j25221N8125J17048O7456
$$ 265823 318465 310828 212472 203279 214591 214998 423388 455397 330176 388301 505349 572805
18018E72805q6346j30582p7232q39R2502Q3427J39701J6519L1259l0682q6692
$$ 572805 486459 355877 278645 277806 370308 453735 593436 609955 641214 610532 523840
18007E23840q1678o7953J64374J52617L2417R8979P7849N2711m3225J94455K80870
$$ 523840 442162 374209 538583 691200 723617 822596 900445 953156 909931 1104386 1385256
17996A385256Q4151J22974j7956P4992Q9067l5783J3213L2404N8092L995p5825
$$ 1385256 1469407 1592381 1574425 1649417 1738484 1702701 1715914 1748318 1806410 1810405 1734580
17985A734580j08665p7647j86568j55589q5613j36805j58596j3961l8158o5092
$$ 1734580 1625915 1548268 1361700 1206111 1120498 983693 825097 811136 772978 707886
17975G07886q8699j76466k6490K7145P5504J8270n2657q9067k5767p4252p9258
$$ 707886 619187 442721 416231 443376 518880 537150 484493 395426 369659 295407 216149
17964B16149N9915L9555O1730p4286n2620Q8656J25337L1350J7564o6696J1743
$$ 216149 276064 315619 377349 303063 250443 339099 464436 495786 513350 446654 458397
17953D58397M9544J12514L9096j1079l3687R7063j1246J08403J28489n1861p5711
$$ 458397 507941 620455 659551 648472 614785 711848 700602 809005 937494 885633 809922
17942H09922j02393R4782J01448k9324l2394R4648l1745j063j73313j28032m5202
$$ 809922 707529 802311 903759 874435 842041 936689 904944 903881 730568 602536 557334
17931E57334n565p4805j33177j92860q3741R9562J44808k9q0895J38331J1626
$$ 557334 551769 476964 343787 150927 67186 166748 311556 311527 230632 368963 380589
17920C80589j62697j18182k272O6564j8626Q931M6684J43417r020L7476j4452
$$ 380589 217892 99710 97438 164002 145376 154307 200991 344408 335388 372864 358412
17909C58412j16765M4992n571j37752j32402k7162L7856J28143J34052k7975j48832
$$ 358412 241647 286639 281068 143316 10914 -16248 21608 149751 283803 255828 106996
17898A06996l7499n4447L9137N6334J40582P2302j54621K3616R5188Q5300p4705
$$ 106996 69497 15050 54187 110521 251103 323405 168784 192400 287588 372888 298183
17887B98183o8886j8668j9602n20R843p3169J01490J00854j12920l9044k3261
$$ 298183 229297 210629 191027 190507 200350 127181 228671 329525 216605 177561 154300
17876A54300p8066Q3001R3961j5919J6304j01541j43968j03616J13562J00457
$$ 154300 76234 159235 253196 237277 253581 152040 8072 -95544 18018 118475
17866A18475J6866l2187j07158M2458O6387p0686Q3909L2698Q0073j41980j16513
$$ 118475 135341 103154 -4004 38454 104841 34155 118064 150762 230835 88855 -27658
17855b7658o4687O7355J71862p61r0744r5443j25033q0806J01600J00352Q128
$$ -27658 -92345 -24990 146872 146111 55367 -40076 -165109 -245915 -144315 -43963 -35835
17844c5835o8220J0346J36782J10692O5003l6050m0255n4533j03680j5934Q2543
$$ -35835 -104055 -93709 43073 153765 218768 182718 142463 87930 -15750 -31684 50859
17833E0859J84660q5445j61952m5400J41478J29541J5788l4152p4598N4245P6237
$$ 50859 235519 150074 -11878 -57278 84200 213741 229529 195377 120779 175024 251261
17822B51261J4104L4234P1895n9606o9063Q336q5302o0708K5205j14204m2590
$$ 251261 265365 299599 371494 311888 242825 251161 165859 105151 130356 16152 -26438
17811b6438L8308K2016l7487j3556J0266M0504o7856j70276J202J26977J48330
$$ -26438 11870 33886 -3601 -17157 -6891 33613 -34243 -204519 -203317 -76340 71990
17800G1990J03407q6178K4544J4758j9243N416m4700J3039k2612n7309P460J9673
$$ 71990 175397 89219 113763 128521 109278 114694 69994 83033 60421 3112 10572 30245
17788C0245j68180l2944Q3650J2434N3387J28146r1301j43562J2009R0318P6853
$$ 30245 -137935 -170879 -87229 -74795 -21408 106738 15437 -128125 -116116 -25798 51055
17777E1055k2091J14610K1142j15670K8689K7515J5588j7928j89300j28104l57
$$ 51055 28964 143574 164716 49046 77735 105250 120838 102910 -86390 -214494 -214851
17766b14851J03428N3950l1160L7501K5485Q9711J7590M4842p938n9925m5911
$$ -214851 -111423 -57473 -88633 -51132 -25647 64064 81654 126496 118558 58633 12722
17755A2722M2882P7826L9237l3564j1538j2139O53q9590O6485j13221k4923j9374
$$ 12722 55604 133430 172667 139103 127565 115426 116079 26489 92974 -20247 -45170 -64544
17743f4544J46374K8045j11474K8262Q4192J08959l874j41631q3889q929J55929
$$ -64544 81830 109875 -1599 26663 110855 219814 215940 74309 -9580 -18509 137420
17732A37420J6496N9319K6661J5315j8829O6973J3449j40805p7599m3465q7964
$$ 137420 153916 213235 239896 255211 236382 303355 316804 175999 98400 54935 -33029
17721c3029p7219N7012R3612M6688o3679r9253Q7995P6187j39769m6861J24242
$$ -33029 -110248 -53236 40376 87064 23385 -75868 12127 88314 -51455 -98316 25926
17710B5926J67p6941n340k8234R7149m3504o1067J9668j9581k5789j8702J8432
$$ 25926 26093 -50848 -56188 -84422 12727 -30777 -91844 -72176 -91757 -117546 -136248 -117816
17698a17816l676N6192J43127M803r0876j43670M6738R8896P270p2976j20014
$$ -117816 -121492 -65300 77827 82630 -8246 -151916 -105178 -6282 988 -71988 -192002
17687a92002J29731N7262p8880r7775J32738P1452j02413n3223M937O7144p5847
$$ -192002 -62271 -5009 -83889 -181664 -48926 22526 -79887 -133110 -128173 -61029 -136876
17676a36876m3341M5650M1214K545O7185r6799J3674P6547L6175p0758p5978o3988
$$ -136876 -180217 -134567 -93353 -90808 -23623 -120422 -106748 -30201 5974 -64784 -140762 -204750
17664b04750k31860J81788J61911J29035Q5657N5L6171Q0382O396k3939J3855
$$ -204750 -436610 -254822 -92911 36124 121781 121836 158007 238389 244785 220846 234701
17653B34701j15666Q636N1085J36258p0259j80972J2318N9015J5251o3763l6518
$$ 234701 119035 127671 178756 315014 244755 63783 76101 135116 150367 86604 50086
17642E0086M9748l522K6926M988O4160n583r2299j2896j5792m92l9926J10752
$$ 50086 99834 96312 123238 128226 192386 186803 94504 81608 65816 65324 25398 136150
17630A36150k8126j31658J21032l7105j66865j7129P5766j7890K7676P0703L934
$$ 136150 108024 -23634 97398 60293 -106572 -123701 -47935 -65825 -38149 32554 36488
17619C6488l1552J17082R631O695N1873j5807j51377j0840O7611o8081j59573
$$ 36488 4936 122018 131649 138344 190217 174410 23033 12193 79804 11723 -147850
17608a47850P8349J85383N666q0928M4360n0886j39463m138l1650k6266J18841
$$ -147850 -69501 115882 121548 40620 84980 34094 -105369 -109507 -141157 -167423 -48582
17597d8582L0545J870p6443k404J01973O4914M3025o4948j64608J6075k058j3122
$$ -48582 -18037 -16167 -92610 -95014 6959 71873 114898 49950 -114658 -98583 -100641 -113763
17585a13763Q4760Q4469J17098O5125k7357j27649K1860j17619J54306J12553
$$ -113763 -29003 55466 172564 237689 210332 82683 104543 -13076 141230 253783
17575B53783j6150p8828j58484O9731L4796O4466O8901N3913m9844q8812K6660
$$ 253783 237633 158805 321 70052 104848 169314 238215 292128 242284 153472 180132
17564A80132J06017J15428q4838j36856o1574j3907J97972j12220o2900j9891
$$ 180132 286149 401577 316739 179883 118309 104402 302374 190154 127254 107363
17554A07363J9493N216j2319q6246r8466N110L4557L4073o2084j075M2123r208
$$ 107363 126856 132072 119753 33507 -64959 -59849 -25292 8781 -53303 -54378 -12255 -21463
17542b1463r9172m3644K1754J0603O015l8880O397J09776J4592K8021N0608K1783
$$ -21463 -120635 -164279 -142525 -131922 -125907 -164787 -158390 -48614 -34022 -6001 44607 66390
17530F6390P9069l1314j39638P4566K7295j03504j07839R0800o405J13212j07873
$$ 66390 145459 114145 -25493 49073 76368 -27136 -134975 -44175 -50580 62632 -45241
17519d5241j71927N1396J08950q751L7041p0961r9690N5441J79207p1134o4182
$$ -45241 -217168 -165772 -56822 -65573 -28532 -99493 -199183 -143742 35465 -35669 -99851
17508i9851n320p9807J0608J15610P8527L570q4795l7721l7573j28467N2455R1136
$$ -99851 -105171 -184978 -174370 -58760 19767 23337 -61458 -99179 -136752 -265219 -212764 -121628
17496a21628M1957o570j12439R988K2647r1183J42185J21839Q0831j70558K2579
$$ -121628 -79671 -86241 -198680 -188692 -166045 -257228 -115043 6796 87627 -82931 -60352
17485f0352l4084j09106Q9968M5259k5968J24083J71096q3724j13865j7741L8679
$$ -60352 -94436 -203542 -113574 -68315 -94283 29800 200896 117172 3307 -14434 24245
17474B4245J87697Q2651r3968j55636L3059J2595j37789j44737L958L8771L9110
$$ 24245 211942 294593 200625 44989 78048 90643 -47146 -191883 -187925 -149154 -110044
17463a10044K2448Q4202q3016j99018m4509K06310R3533R9798o2104K9925L4573
$$ -110044 -87596 -3394 -86410 -285428 -329937 -123627 -30094 69704 7600 37525 72098
17452G2098J8545J03683l7933o398J06912J49519K01951J70834J46861K2784L4034
$$ 72098 90643 194326 156393 149995 256907 406426 608377 779211 926072 948856 982890
17441I82890l0095k90281j85001j69009j59907M5588r9594j4983J8772M3270o2528
$$ 982890 952795 662514 477513 308504 148597 194185 94591 79608 98380 141650 79122
17430G9122q1547K2230K8343n1446n6906j4264n8244j06708k2231O2907P2773
$$ 79122 -2425 19805 48148 -3298 -60204 -74468 -132712 -239420 -261651 -198744 -125971
17419a25971q0095l9338k6050m5052R290Q9397k7759O5446N0586m3371M2145J35864
$$ -125971 -206066 -245404 -271454 -316506 -307216 -217819 -245578 -180132 -129546 -172917 -130772 5092
17407E092O0349p1637p2499O4558p534q1495k1081n300O082J34582P6946p7139
$$ 5092 65441 -6196 -78695 -14137 -21671 -103166 -124247 -129547 -123465 11117 88063 10924
17395A0924j9484K6008r4002o166p739J03380k5507o5580N9636O8065M461j03122
$$ 10924 -8560 17448 -76554 -82720 -90459 12921 -12586 -78166 -18530 49535 53996 -49126
17383d9126o6599n5147j2977J52258K19302J61455q3640q3273j84520r435K2327
$$ -49126 -115725 -170872 -183849 -31591 187711 349166 265526 182253 -2267 -11702 10625
17372A0625j02090k9648l6080N4902M3327O2295J63875J45463q4631j52713m2687
$$ 10625 -91465 -121113 -157193 -102291 -58964 3331 167206 312669 228038 75325 32638
17361C2638j01453o7109m9068N63O0426k5271r7075R3616J22450J1286m6658O7099
$$ 32638 -68815 -135924 -184992 -184429 -124003 -149274 -246349 -152733 -30283 -18997 -65655 1444
17349A444N0430k0292j0482M7345M3166p8387Q4791R3337P2992k3326m2972j56040
$$ 1444 51874 31582 21100 68445 111611 33224 118015 211352 284344 261018 218046 62006
17337F2006J14800O2688k1949r0912l1935J12161J9240r6176k5796M3308K01167
$$ 62006 176806 239494 217545 126633 94698 206859 226099 129923 104127 147435 348602
17326C48602o7805o0500N6042P1324j79565K328N7864j11969m2502j17629j03401
$$ 348602 280797 220297 276339 347663 168098 170426 228290 116321 73819 -43810 -147211
17315a47211R2165J35333j40299j22781J80412J78442J6315p0774P0967j02877
$$ -147211 -55046 80287 -60012 -182793 -2381 176061 192376 121602 192569 89692
17305H9692k12193m6139J92728J35682J39143j0173j427q8388l8087P573o2071
$$ 89692 -122501 -168640 24088 159770 298913 288740 287313 198925 160838 168411 106340
17294A06340o3281j36693o8927O2475J24631j8035L757L3983K8581L7189Q2965
$$ 106340 43059 -93634 -162561 -100086 24545 6510 10267 44250 72831 110020 192985
17283A92985P2396J15740k127j12762j09656K8811k26562O7689K0059K0759J6173
$$ 192985 265381 381121 378994 266232 156576 185387 -41175 26514 46573 67332 83505
17272H3505N5481J15361n5344j2047L4695L6116j52695o8580o0368l0104o666
$$ 83505 138986 254347 199003 186956 221651 257767 105072 36492 -23876 -53980 -60646
17261f0646M0499P5418n4655k0568l3108L9590J6675o9649N4411N7496l6097P9296
$$ -60646 -20147 55271 616 -19952 -53060 -13470 3205 -66444 -12033 45463 9366 88662
17249H8662R7401L7682o3612o0378m4971N2876l0941r4915j32993o7667Q7525
$$ 88662 186063 223745 160133 99755 54784 107660 76719 -18196 -151189 -218856 -131331
17238a31331J10550Q0707J4573N2789m6619j23191o5813P8373K0358o7467J05245
$$ -131331 -20781 59926 74499 127288 80669 -42522 -108335 -29962 -9604 -77071 28174
17227B8174j7029l6453R676j4119q3415M2696P5662r0737m5086J825J8307J96099
$$ 28174 11145 -25308 -15632 -29751 -113166 -70470 5192 -85545 -130631 -128806 -110499 85600
17215H5600r6636p2062n0762J36674J9777p3914K8709l1016k4155N8039k7654
$$ 85600 -11036 -83098 -133860 2814 22591 -51323 -22614 -53630 -77785 -19746 -47400
17204d7400L1417P9921N8137j2758J9180k4012K1431J26944J1922r3343k42842
$$ -47400 -15983 63938 122075 109317 128497 104485 125916 252860 264782 171439 -71403
17193g1403l6573p799M8179N978o35K1691J3387P6928k8451n9713p5789J18473
$$ -71403 -107976 -115775 -67596 -61618 -62253 -40562 -27175 49753 21302 -38411 -114200 4273
17181D273J04250q5271j79135Q2580N7309R0109K548j31507m0902l7576J17546
$$ 4273 108523 23252 -155883 -73303 -15994 74115 76663 -54844 -95746 -133322 -15776
17170a5776L0691K3708N6252O7269k7329o6021k0431r9439j5740J05936J04914
$$ -15776 14915 38623 94875 162144 134815 68794 48363 -51076 -66816 39120 144034
17159A44034N586o4258o0671M5609Q2425m5665j54895k6522J12872R5138r9222
$$ 144034 149620 85362 24691 70300 152725 107060 -47835 -74357 38515 133653 34431
17148C4431j1060J0010p8474P4185N1181n4005k3648J17266r703k7246p3198M5997
$$ 34431 23371 33381 -45093 29092 80273 26268 2620 119886 110183 82937 9739 55736
17136E5736Q5057P1635n2850r7226r622j74092k8066M1773J18374N3175J1074
$$ 55736 140793 212428 159578 62352 52730 -121362 -149428 -107655 10719 63894 74968
17125G4968K6635J9385r4476m5709q5678m1650o2324n7147o5775K3923Q1214J39431
$$ 74968 101603 120988 26512 -19197 -104875 -146525 -208849 -265996 -331771 -307848 -226634 -87203
17113h7203k7958O8466N7518N0393l0764j9520o781m4707l0549Q7435J83492k8502
$$ -87203 -115161 -46695 10823 61216 30452 10932 4151 -40556 -71105 16330 199822 171320
17101A71320q6192M3158L9985r5208j43156O1826J30171l3951r9398j28795n196
$$ 171320 85128 128286 168271 73063 -70093 -8267 121904 87953 -11445 -140240 -145436
17090a45436J05653J43196P9796m9775j08223k9023J34830Q1905O0196j21012
$$ -145436 -39783 103413 183209 133434 25211 -3812 131018 212923 273119 152107
17080A52107n0250j52444J111J3859j07940J935K8579m4861O6233N0743K949M1740
$$ 152107 101857 -50587 -49476 -35617 -143557 -141622 -113043 -157904 -91671 -40928 -37979 3761
17068C761K8340L7571L2557j01711j2376O116o0940J5568L07L811p152O8948m8153
$$ 3761 32101 69672 102229 518 -11858 -5742 -66682 -51114 -50807 -46996 -54148 14800 -33353
17055c3353M7475m4989J1396k43478R4984Q8312J2484M090J00327K4311j71954
$$ -33353 14122 -30867 -19471 -262949 -167965 -79653 -67169 -63079 37248 61559 -110395
17044a10395l9932j2155m2081j02749J04207J12645J16127p199M3950J06489l1149
$$ -110395 -150327 -162482 -204563 -307312 -203105 -90460 25667 18468 62418 168907 137758
17033A37758r3829p750k9586k8237O1723j1425l2720j15585l9813J7320O6690
$$ 137758 43929 36179 6593 -21644 40079 28654 -4066 -119651 -159464 -142144 -75454
17022g5454O7660j0617Q6642R6476n8330j4453j4471O0141p5512k0623j0693r093
$$ -75454 -7794 -18411 68231 164707 106377 91924 77453 137594 62082 41459 30766 21673
17010B1673j3231n8088M3859N6666M861O5267n6902N664o4184j73921k41632n2928
$$ 21673 8442 -49646 -5787 50879 55740 121007 64105 69769 5585 -168336 -409968 -462896
16998d62896O2971J26923J47209N9570m1836j02488q1392J14216N7084M6714J50873
$$ -462896 -399925 -273002 -125793 -66223 -108059 -210547 -291939 -177723 -120639 -73925 76948
16987G6948L7853l7139k6571O455J20782j01533N7554J1390j23461J8471j52334
$$ 76948 114801 77662 51091 57546 178328 76795 134349 145739 22278 40749 -111585
16976a11585o0620K12075M8777r7234j20009j25896J8773R2036J19633M8014J16153
$$ -111585 -172205 39870 88647 -8587 -128596 -254492 -235719 -143683 -24050 23964 140117
16965A40117l0071q5862o1748L1366O7994j09319j07290K23877J3643O5600M372
$$ 140117 110046 24184 -37564 -6198 61796 -47523 -154813 69064 82707 148307 152679
16954A52679o1408p5303k5785j7301j34338n6266L9199K28670J43157m7938p2279
$$ 152679 91271 15968 -9817 -27118 -161456 -217722 -178523 50147 193304 145366 73087
16943G3087o9596J15325J13669j4199L3563m8159p4857j78943m3681o2247O9663
$$ 73087 3491 118816 232485 218286 251849 203690 128833 -50110 -93791 -156038 -86375
16932h6375J73756m6697j25460m0700J46856K7167j07494q5839P603K6782J2099
$$ -86375 87381 40684 -84776 -125476 21380 48547 -58947 -144786 -137183 -110401 -98302
16921i8302n7457j01869m689J13462J51595j00820n0446p1264O8147N3702J14247
$$ -98302 -155759 -257628 -262317 -148855 2740 -98080 -148526 -219790 -151643 -97941 16306
16910A6306K05753k2411j11980m8103m71j5736j23516o4364m7735q2164L4592
$$ 16306 222059 199648 87668 39565 39094 23358 -100158 -164522 -212257 -294421 -259829
16899b59829P8556J69673J33196J3835o884m8926j16703l870o6696K0061J14073
$$ -259829 -181273 -11600 121596 135431 128547 79621 -37082 -40952 -107648 -87587 26486
16888B6486R482j4660O939n5278m3690J028Q0255j504o947j41102j45046P3436
$$ 26486 35968 21308 28247 -27031 -70721 -69693 10562 9058 2111 -138991 -284037 -210601
16876b10601J37962N7489Q807o4556k3017J5068l2260j31679J03677J05899o4261
$$ -210601 -72639 -15150 -6343 -70899 -93916 -78848 -111108 -242787 -139110 -33211 -97472
16865i7472N1251P1601j68508l7407R7556J62166P5645p9122o1832j33072k2913
$$ -97472 -46221 25380 -143128 -180535 -82979 79187 154832 75710 13878 -119194 -142107
16854a42107J05540P7195o4522p6677M0515P770M6194N5699L2502K450l7702O7327
$$ -142107 -36567 40628 -23894 -100571 -60056 -52286 -6092 49607 82109 84559 46857 114184
16842A14184j31701j40159j0564J98408J275M2899m3085p1235l94q5593l325N0295
$$ 114184 -17517 -157676 -168240 30168 31443 74342 31257 -39978 -40372 -125965 -129290 -78995
16830g8995n0074j22876l5524j46171J43334N6936N7190M7627r4707j9842J59265
$$ -78995 -129069 -251945 -287469 -433640 -290306 -233370 -176180 -128553 -223260 -243102 -83837
16819h3837P2552J9874K4306M6698J02307r5181r4548k35931o5586J78695J58054
$$ -83837 -11285 8589 32895 79593 181900 86719 -7829 -243760 -309346 -130651 27403
16808B7403J9171m2191j3742L3186M9773j40520j8413k9842o3213J53672P0714
$$ 27403 46574 4383 -9359 23827 73600 -66920 -85333 -115175 -178388 -24716 45998
16797D5998P2738p8432o9065r0590o3820J32406m8471N9671J11680k7743p7003
$$ 45998 118736 40304 -28761 -119351 -183171 -50765 -99236 -39565 72115 44372 -32631
16786c2631q1984Q3001K8091o1401l0682K3628J450M224m6903J35039m6224k4305
$$ -32631 -114615 -31614 -3523 -64924 -95606 -71978 -70528 -66304 -113207 21832 -24392 -48697
16774d8697q61J8982L0095R1592J28603J04423r8347j15051L5226j20822k15311
$$ -48697 -49558 -30576 -481 91111 219714 324137 225790 110739 145965 25143 -190168
16763a90168M774K7511j6409J06481Q2007j09193J2163J61345m2463q0511l0222
$$ -190168 -185394 -157883 -174292 -67811 14196 -94997 -82834 78511 36048 -44463 -74685
16752g4685o098J22206n2171J26697P9682r8541r3919j19732j13861O3931L897
$$ -74685 -80783 41423 -10748 115949 195631 97090 3171 -116561 -230422 -166491 -162594
16741a62594L0809J04354k0439n3072L8735J3282O9130o6235m3410O594j45392
$$ -162594 -131785 -27431 -47870 -100942 -62207 -48925 20205 -46030 -89440 -82846 -228238
16730b28238L6525K04078P2187m0926j63507o4440J3862J90993J16056m160o2707
$$ -228238 -191713 12365 84552 43626 -119881 -184321 -170459 20534 136590 132430 69723
16719F9723o6601L4703n0611P592K7985l701J949n2885q2094o0500N1572K0140
$$ 69723 3122 37825 -12786 -5194 22791 19090 21039 -31846 -113940 -174440 -122868 -102728
16707a02728K7311M4837J32232k0008q0436M1060O0946O9658j3550j75495r7914
$$ -102728 -75417 -30580 101652 81644 1208 42268 103214 172872 159322 -16173 -114087
16696a14087O6553J13377K08338J02369J6709j85104j22055j33986q4984j3347
$$ -114087 -47534 65843 274181 376550 393259 208155 86100 -47886 -132870 -146217
16686a46217P786J03312N8003o4652l7705J516r6781m3720J56297j5293o0890
$$ -146217 -138431 -35119 22884 -41768 -79473 -77957 -174738 -218458 -62161 -77454 -138344
16675a38344J15672l7388M5205J8121K3740o5010j36317m0040K24477J71204j55669
$$ -138344 -22672 -60060 -14855 3266 27006 -38004 -174321 -214361 10116 181320 25651
16664B5651r5611P8563j7947M6833P370J49059N0640J4653O3414p8698j38330
$$ 25651 -69960 8603 -9344 37489 44859 193918 244558 259211 322625 243927 105597
16653A05597j49862L6759K30930j33730k63577p1338p6611J22208j48719k8141
$$ 105597 -44265 -7506 223424 89694 -173883 -245221 -321832 -199624 -348343 -376484
16643c76484M0087N9338N7152K2993J18370R4926j5039m8025j57344o2819J35955
$$ -376484 -336397 -277059 -219907 -196914 -78544 16382 1343 -46682 -204026 -266845 -130890
16632a30890k3845j31273l8203J16117r6530J4008P7306J64334O243J05367K3321
$$ -130890 -154735 -286008 -324211 -208094 -304624 -290616 -213310 -48976 -42733 62634 85955
16621H5955j51698j5048M9864N46j16117J60975L7320j2717R715j71467p2644
$$ 85955 -65743 -80791 -30927 -30381 -146498 14477 51797 39080 48795 -122672 -195316
16610a95316P243J2083J41085L8450K0168j55466K4362J27112J39408K8844m9382
$$ -195316 -188073 -175990 -34905 3545 23713 -131753 -107391 19721 159129 187973 138591
16599A38591o6589K183r3900J2560M101J08511l3670j35938j45991L8945N6161
$$ 138591 72002 74185 -19715 -7155 -3054 105457 71787 -64151 -210142 -171197 -115036
16588a15036N3278O2445n5023r0105j9688R3995L3206L0650P6331q5683j60434
$$ -115036 -61758 687 -54336 -144441 -164129 -70134 -36928 -6278 70053 -15630 -176064
16577a76064J71917J55716j01196n6285K0435O9998k2018q8333p7628M0231L5624
$$ -176064 -4147 151569 50373 -5912 14523 84521 62503 -25830 -103458 -63227 -27603
16566b7603j9829j62919p1952J1168J91031J68539Q5611r4078j05892N3444j8447
$$ -27603 -47432 -210351 -282303 -271135 -80104 88435 174046 79968 -25924 27520 9073
16555I073q9911q7760J23735j2073K6095l5304j39950j3573K19864J29203m7428
$$ 9073 -80838 -168598 -44863 -56936 -30841 -66145 -206095 -219668 196 129399 81971
16544H1971j95854k8210J00504J03620J49687P6383R4780j53163j41558N4298
$$ 81971 -113883 -142093 -41589 62031 211718 288101 382881 229718 88160 142458
16534A42458p9131m7423n2317K1466J7700J2800J1244K1612J11476r3064q1143
$$ 142458 63327 15904 -36413 -14947 2753 15553 26797 48409 159885 66821 -14322
16523a4322P6936q7721n2935K7510O9735J80103q9976j19863j8235J2454J03457
$$ -14322 62614 -25107 -78042 -50532 19203 199306 109330 -10533 -28768 -16314 87143
16512H7143J7143j28365m8324q4431p8249m1203J22243L9724k2305J61004O7993
$$ 87143 104286 -24079 -72403 -156834 -235083 -276286 -154043 -114319 -136624 24380 92373
16501I2373K7969j37784K9473k9142J50767j5539M2918j80535j26584O5314q9732
$$ 92373 120342 -17442 12031 -17111 133656 118117 161035 -19500 -146084 -80770 -170502
16490a70502r2031m4705J26855J08626K05419J09922j06894j03137m7639k684
$$ -170502 -262533 -307238 -180383 -71757 133662 243584 136690 33553 -14086 -16770
16480a6770j06635P7154J20993M5715j26085r494k1823Q6963J7304o430j24720
$$ -16770 -123405 -46251 74742 120457 -5628 -15122 -36945 50018 67322 60892 -63828
16469f3828k17727N5604J20812k0176n8525Q3612J17257k0848j14661M5673J16201
$$ -63828 -281555 -225951 -105139 -125315 -183840 -100228 17029 -3819 -118480 -72807 43394
16458D3394J3821n4001L678Q7110M5776o6046r8664l0719l3850J02587J31511
$$ 43394 57215 3214 6892 94002 139778 73732 -24932 -55651 -89501 13086 144597
16447A44597L3976j15649j30852j77220r9591K055J11753J15273J59160k747p1787
$$ 144597 178573 62924 -67928 -245148 -344739 -342684 -230931 -115658 43502 40755 -31032
16436c1032q753O6030m8374o5989k9655J27965j2454m2257o8582o55J4425J38505
$$ -31032 -39785 26245 -22129 -88118 -117773 10192 -2262 -44519 -113101 -113756 -99331 39174
16424C9174r6483j2863J1062N302M2478o1000P7060P7510K5175j4921q3349p4058
$$ 39174 -57309 -70172 -59110 -53808 -11330 -72330 4730 82240 107415 92494 9145 -64913
16412f4913r3609m5637J63592J54665k25563N4294J66807p5319k8875p9613Q4799
$$ -64913 -158522 -204159 -40567 114098 -111465 -57171 109636 34317 5442 -74171 10628
16401A0628J50398k6809r3035n2248J6511k8928m8153n4392j6693J6874k0324
$$ 10628 161026 134217 41182 -11066 5445 -23483 -71636 -126028 -142721 -125847 -146171
16390a46171J6019J85256L9098p6397q6317k0364J1482K2869P2985n314J04928
$$ -146171 -130152 55104 94202 17805 -68512 -88876 -77394 -54525 18460 13146 118074
16379A18074q312J37960m6918j16503l989m8106r1807R4338L1915j36649K9667
$$ 118074 109762 247722 200804 84301 80312 32206 -59601 34737 66652 -69997 -40330
16368d0330q030l523P2359k5487j54810J9213Q1083L6334k4198N0948J28128M1783
$$ -40330 -48360 -51883 20476 -5011 -159821 -140608 -59525 -23191 -47389 3559 131687 173470
16356A73470j07864r7774o1584Q4119J118j11272k4431J3804M577K4611P1457
$$ 173470 65606 -32168 -93752 -9633 -8515 -119787 -144218 -130414 -125837 -101226 -29769
16345b9769R9878R7581j3366o5833J3578m5312j43695J1236L0330J65426r5355
$$ -29769 70109 167690 154324 88491 102069 56757 -86938 -75702 -45372 120054 24699
16334B4699r1125j22611J6189P4661K8278q9214P5720j4521P0361m4930M1254
$$ 24699 -66426 -189037 -172848 -98187 -69909 -159123 -83403 -97924 -27563 -72493 -31239
16323c1239P6582j56041n1863N2702m7153j5399J72639l7768j2459k4440Q0396
$$ -31239 45343 -110698 -162561 -109859 -157012 -172411 228 -37540 -49999 -74439 5957
16312E957J9717k4231l9615J6553K7416J6772K1105m0759K8623l0731m5877J04483
$$ 5957 25674 1443 -38172 -21619 5797 22569 43674 2915 31538 807 -45070 59413
16300E9413P5590j02596l0187K3595O0938M7790O8382l5683Q4009q6920j2374
$$ 59413 135003 32407 2220 25815 86753 134543 202925 167242 251251 164331 151957
16289A51957n9174j58934J0529R2388J18476k7864j20874k6170k8803Q1129N1433
$$ 151957 92783 -66151 -55622 36766 155242 127378 6504 -19666 -48469 32660 84093
16278H4093l085p930j16914k0892J67382j6854j36277k3780k9840O4755J2099
$$ 84093 81008 73078 -43836 -64728 102654 85800 -50477 -74257 -104097 -39342 -27243
16267b7243j22183r7605J37358J1069K7722J5580O167Q1944k488J9223K5619N4798
$$ -27243 -149426 -247031 -109673 -98604 -70882 -55302 -49135 32809 30321 49544 75163 129961
16255A29961j0894j07708N4277K6576j06039r7236n3444M9312J02329J05224j01261
$$ 129961 119067 11359 65636 92212 -13827 -111063 -164507 -115195 -12866 92358 -8903
16244h903j65056K9734K7052K5630j17210o0594J5650r4882P1291J88246n759
$$ -8903 -173959 -144225 -117173 -91543 -208753 -269347 -253697 -348579 -277288 -89042 -94801
16233i4801o822P5598k0730n8725L4043P0720J34050l2932q2017m2130Q0174l2728
$$ -94801 -101623 -26025 -46755 -105480 -71437 -717 133333 100401 18384 -23746 56428 23700
16221B3700j9295P4593J5875j03213j32769N8553J1354l5951K7919Q1340Q1595
$$ 23700 4405 78998 94873 -8340 -141109 -82556 -71202 -107153 -79234 2106 83701
16210H3701K2441k4586k10068o4883J4390L8441K45038J08436r9235j33924J8744
$$ 83701 106142 81556 -128512 -193395 -179005 -140564 104474 212910 113675 -20249 -1505
16199a505r18q5381M357P9838M1392l4630q6617n083M3543J45563N7705o1276
$$ -1505 -2423 -87804 -83447 -3609 37783 3153 -83464 -88547 -45004 100559 158264 96988
16187I6988J0338M3711m4668j42018j36119J35915J7496p2088N5224o6692l8314
$$ 96988 107326 151037 106369 -35649 -171768 -35853 -18357 -90445 -35221 -101913 -140227
16176a40227P923K4485M151j1622M4820J510q3359O6667J35226J55541N285o4816
$$ -140227 -132304 -107819 -103668 -115290 -70470 -68960 -152319 -85652 49574 205115 210400 145584
16164A45584j07185j54271j95931j17424Q7093J32600J70579O4188k7344Q796
$$ 145584 38399 -115872 -311803 -429227 -342134 -209534 -38955 25233 -2111 6685
16154F685L8179j2739k9412J35758N7314j29303R9543o1940N4681J59174m6788
$$ 6685 44864 32125 2713 138471 195785 66482 166025 104085 158766 317940 271152
16143B71152l10596p9802K30704J78074N8543l3544j04992j14073Q2506J40178
$$ 271152 -39444 -119246 111458 289532 348075 314531 209539 95466 177972 318150
16133C18150q5797o2988k1564j11360K2926k8696k2368j26558k0439J8461J12188
$$ 318150 232353 169365 147801 36441 59367 30671 8303 -118255 -138694 -120233 -8045
16122h045L06l2488j14379o6920J16577L0753j1889K9213J60876P0857l9880o4731
$$ -8045 -7739 -40227 -154606 -221526 -104949 -74196 -86085 -56872 104004 174861 134981 70250
16110G0250l9456j18064M2140Q1556N2191j04438j45077O6277K5117M6054m2203
$$ 70250 30794 -87270 -45130 36426 88617 -15821 -160898 -94621 -69504 -23450 -65653
16099f5653r345k2108o9101j6985P0905L8216J73M6078l3651M5505p462k1494
$$ -65653 -74998 -97106 -166207 -183192 -112287 -74071 -73898 -27820 -61471 -15966 -23428 -44922
16087d4922L1754M9839o181J11618m4655j19455l7474p8675r6703Q3453J74559
$$ -44922 -13168 36671 30490 142108 97453 -22002 -59476 -138151 -234854 -151401 23158
16076B3158j4010r6819K6556p135M1870P8595L1054M039R5772m5487j9317j32321
$$ 23158 9148 -87671 -61115 -68250 -26380 52215 83269 87308 183080 137593 118276 -14045
16064a4045j6065L5656n3206l6904m0491O4085P0692O5590Q7539J0452K4279j61423
$$ -14045 -30110 5546 -47660 -84564 -125055 -60970 9722 75312 162851 173303 197582 36159
16052C6159p2224j2326L3201J3280K4503J22544J01332J32549N9728k04593j05966
$$ 36159 -36065 -48391 -15190 -1910 22593 145137 246469 379018 438746 234153 128187
16041A28187K414J07233k02844m7328L2648j16134o6210L2727Q358J0291M4407
$$ 128187 130601 237834 34990 -12338 20310 -95824 -162034 -129307 -120949 -110658 -66251
16030f6251L4714r073k0478J36167k6280n61K2501j30728m9137j5766K5362J12324
$$ -66251 -31537 -40610 -61088 75079 48799 48238 70739 -59989 -109126 -124892 -99530 12794
16018A2794k9638K5135j17090N6350m2053n8886k6235O3156j633J9567l8641M4026
$$ 12794 -16844 8291 -108799 -52449 -94502 -153388 -179623 -116467 -118100 -98533 -137174 -93148
16006i3148J23092O4057q2731j05396L0991R3604J16441j5339l8547J238p5948
$$ -93148 29944 94001 11270 -94126 -63135 30469 146910 131571 93024 94262 18314
15995A8314j76886L1582O2205l571k7843j8759P4069O5673m394j4948N7301J54145
$$ 18314 -158572 -126990 -64785 -68356 -96199 -114958 -40889 24784 20390 5442 62743 216888
15983B16888l9981j51077q558l8744J1135j7533j934n7513K613O4624l6604r7892
$$ 216888 176907 25830 17272 -21472 -10337 -27870 -29804 -87317 -84704 -20080 -56684 -154576
15971a54576J2079J2800j26587O4825J45307J3749k1998M6124N5306o5371J16417
$$ -154576 -142497 -129697 -256284 -191459 -46152 -32403 -54401 -8277 47029 -18342 98075
15960I8075K7193O2558R6947j51618j35283L3904J4410L3906j871k139J5232q5502
$$ 98075 125268 187826 284773 133155 -2128 31776 46186 80092 78221 76082 91314 5812
15948E812J67363J08493n5795m9434n7012K252L7597R281j66778q3597N1008k8124
$$ 5812 173175 281668 225873 176439 119427 121679 159276 168557 1779 -81818 -30810 -58934
15936e8934q9869O1817l1416n1996O6540M2208q0890l774M082R4333r5071J4176
$$ -58934 -148803 -86986 -118402 -170398 -103858 -61650 -142540 -146314 -142232 -47899 -142970 -128794
15924a28794J22577O1391n0750p5312J24163L1101j1785j78355n1234K25496J6786
$$ -128794 -6217 55174 4424 -70888 53275 84376 72591 -105764 -156998 68498 85284
15913H5284m4829J2544Q1638l5051l7659J8018p110k6853Q9923k026k3708j36547
$$ 85284 40455 52999 134637 99586 61927 79945 72835 45982 135905 133879 110171 -26376
15901b6376J8221M1604J60142J27681q3874j7472L6730r1795j599p7962p9216
$$ -26376 -8155 33449 193591 321272 237398 219926 256656 164861 163262 85300 6084
15890F084p6577J1929r1193k2068L4335J28876P4921o239l1052l0584L7343l5734
$$ 6084 -70493 -58564 -149757 -171825 -137490 -8614 66307 60068 29016 -1568 35775 41
15878D1n9163r6476k9063R8797O6862n9519q6388m5971J4475j1248n5J36659R6397
$$ 41 -59122 -155598 -184661 -85864 -19002 -78521 -164909 -210880 -196405 -207653 -207708 -71049 25348
15865B5348L4472K0358l0223L9386J24480j03086j82094l9949J14614J03578j19582
$$ 25348 59820 80178 49955 89341 213821 110735 -71359 -111308 3306 106884 -12698
15854a2698k15000N4935M504m482l3710J8922J6809L0760j8065k0145m0249J12231
$$ -12698 -227698 -172763 -168259 -172741 -206451 -187529 -170720 -139960 -158025 -178170 -218419 -106188
15842a06188O2084M8723J0078o8779p3375j8554N5176m3708j9744l1677K11408
$$ -106188 -44104 4619 14697 -54082 -127457 -146011 -90835 -134543 -154287 -185964 25444
15831B5444M8813M8327j0331j12034q5015M2277N7135j8495m9016N4108j3402
$$ 25444 74257 122584 112253 219 -84796 -42519 14616 -3879 -52895 1213 -12189
15820a2189q063q2520q9021L002J11002Q7604q9436l7873m4404L884n0825K7109
$$ -12189 -20252 -102772 -191793 -188791 -77789 9815 -79621 -117494 -161898 -158014 -208839 -181730
15808a81730N4235N5082r5114o4932K3612J34938J13562L7124O9960r4695K8733
$$ -181730 -127495 -72413 -167527 -232459 -208847 -73909 39653 76777 146737 52042 80775
15797H0775l2826j74882J7525P8872Q0867j640M4391P9016l3576m5324o1601N2333
$$ 80775 47949 -126933 -109408 -30536 50331 48691 93082 172098 138522 93198 31597 83930
15785H3930j28990q648N3894l4794p8667J8605P32l0867J08999K2643M7873P574
$$ 83930 -45060 -53708 186 -34608 -113275 -94670 -93938 -124805 -15806 6837 54710 62284
15773F2284q6988l538L1634j7260R1530j36017j18681p4521J00852L7019R6263
$$ 62284 -24704 -28242 3392 -13868 77662 -58355 -177036 -251557 -150705 -113686 -17423
15762a7423M9295j01073j50947N8830K7818O0784M398K6508j3561J3313N0057
$$ -17423 31872 -69201 -220148 -161318 -133500 -72716 -68318 -41810 -55371 -42058 7999
15751G999M2435O8422K7545M659n4742O948M729j26090m7985O6988K6623Q917
$$ 7999 50434 118856 146401 151060 96318 103266 107995 -18095 -66080 908 27531 36448
15739C6448R4393o9131k03785r7576P556J24571M9936q4884j5365j5318r485M6786
$$ 36448 130841 61710 -142075 -239651 -232095 -107524 -57588 -142472 -157837 -173155 -182640 -135854
15727a35854M2131k3670M5764J0896m368k269J17195J0400J5704p4464p8912Q9628
$$ -135854 -93723 -117393 -71629 -60733 -65101 -67370 49825 60225 75929 1465 -77447 12181
15715A2181J22248j26035o746j41700p7205L9129j168J11327m6911Q939P8901
$$ 12181 134429 8394 1648 -140052 -217257 -178128 -179296 -67969 -114880 -105941 -27040
15704b7040J3563m7405l9059q8921Q3822Q4087l2806M691n0621K2523l3728m6029
$$ -27040 -13477 -60882 -99941 -188862 -105040 -20953 -53759 -49068 -99689 -77166 -110894 -156923
15692a56923M4046J08358p2660j7649M912L7855J19562L8687q4149k27543M3693
$$ -156923 -112877 -4519 -77179 -94828 -89916 -52061 67501 106188 22039 -205504 -161811
15681a61811J58647M9105j05036N6652O806k477n0621Q7820j7669n4972L9450
$$ -161811 -3164 45941 -59095 -2443 4363 1886 -48735 39085 21416 -33556 5894
15670E894O983j9406r7015j7258o1354q1831J12242N7930Q4502K0623j5290N0004
$$ 5894 12877 -6529 -103544 -120802 -182156 -263987 -151745 -93815 -9313 11310 -3980 46024
15658D6024J40639P0438J6765j14349k28586L612J07822O988j1912L5857m5146
$$ 46024 186663 257101 273866 159517 -69069 -65457 42365 49353 37441 73298 28152
15647B8152J11736j6362o8584l2055M0532L9468j86231L219O2375l0771n9563
$$ 28152 139888 123526 54942 22887 63419 102887 -83344 -80125 -17750 -48521 -108084
15636a08084k9358M223l8739M1114p1097R6648P4476N8941K6773q9764R4395l7268
$$ -108084 -137442 -133219 -171958 -130844 -201941 -105293 -30817 28124 54897 -34867 59528 22260
15624B2260P1443k8841r0570Q8781K9438k6911j29235K506P1507J32308J19915
$$ 22260 93703 64862 -25708 63073 92511 65600 -63635 -61129 10378 142686 262601
15613B62601q1316j84973J3474J49816q8276j08467J3892m6928Q4225n0140k9739
$$ 262601 181285 -3688 9786 159602 71326 -37141 -23249 -70177 14048 -36092 -65831
15602f5831k7997j0091l2383o1788K8850k453m4768j7460q1205J21621K6512J09620
$$ -65831 -93828 -103919 -136302 -198090 -169240 -171693 -216461 -233921 -315126 -193505 -166993 -57373
15590e7373J09639K2264j47975n6073J59445J1028l6027p6526j67432l6308N4075
$$ -57373 52266 74530 -73445 -129518 29927 40955 4928 -71598 -239030 -275338 -221263
15579b21263O5667P826J6495j5256Q3115p9718q9192J14787K5685k3961k6455
$$ -221263 -155596 -147770 -131275 -146531 -63416 -143134 -232326 -117539 -91854 -115815 -142270
15568a42270R493k8960J58427R0787r7236j32774L0925K23011O5526k2618q9863
$$ -142270 -132777 -161737 -3310 87477 -9759 -142533 -111608 111403 176929 154311 64448
15557F4448j7539l6414J4720l4877m5649p7071k7184J68542N9987l6187n3010
$$ 64448 46909 10495 25215 -9662 -55311 -132382 -159566 8976 68963 32776 -20234
15546b0234o5411J8295J38282j36491k9515Q0200P1959K9004Q122j94523j76269
$$ -20234 -85645 -67350 70932 -65559 -95074 -14874 57085 86089 94211 -100312 -276581
15535b76581N1525J75473O4893m0827J48647N3229L6243L9012l0169j91855j9221
$$ -276581 -225056 -49583 15310 -25517 123130 176359 212602 251614 221445 29590 10369
15524A0369m8668j27292k2591J24407j348k0548n5137M6957J177j09100j24921
$$ 10369 -38299 -165591 -188182 -63775 -65123 -85671 -140808 -93851 -92674 -201774 -326695
15513c26695P7577J98504O621m7543j3862O3989K1729q9982k2430J6683J69184
$$ -326695 -249118 -50614 -43993 -91536 -105398 -41409 -19680 -109662 -132092 -115409 53775
15502E3775L7586J03795K9650j34917k4678N0536j34234j17410R444J50952P5712
$$ 53775 91361 195156 224806 89889 65211 115747 -18487 -135897 -126453 24499 100211
15491A00211L958j12358m3671J7092N8905N5888M5456m3200J1354R963k00708
$$ 100211 104169 -8189 -51860 -34768 24137 80025 125481 82281 93635 103598 -97110
15480i7110N7267J6182J4035O7964l8554l2232P9865p9342n0988K7720N4388R7853
$$ -97110 -39843 -23661 -9626 58338 19784 -12448 67417 -11925 -62913 -35193 19195 117048
15468A17048o1450O0803N4039K2794l8348j03865r8975K6157Q7982J36663l7988
$$ 117048 55598 116401 170440 193234 154886 51021 -47954 -21797 66185 202848 164860
15457A64860j47322q3676O8527K6949o5393L2725r1236O4519O8194j49230j01231
$$ 164860 17538 -66138 2389 29338 -36055 -3330 -94566 -30047 38147 -111083 -212314
15446b12314J02250R2361M360n3509J65662J45305Q1721o9711j27059j42903k0772
$$ -212314 -110064 -17703 -13343 -66852 98810 244115 325836 256125 129066 -13837 -34609
15435c4609N4497m4344j79764p7968O7533m4720J64924P8951M8677P9990o9652
$$ -34609 19888 -24456 -204220 -282188 -214655 -259375 -94451 -15500 33177 113167 43515
15424D3515M3410j19562j28725l4924p4731J5943J16338k2519l2055L562R636
$$ 43515 86925 -32637 -161362 -196286 -271017 -255074 -138736 -161255 -193310 -189748 -180112
15413a80112J3702j32969r3276J17030J09257J12448J03729N3021O6661k704q3202
$$ -180112 -166410 -299379 -392655 -275625 -166368 -53920 49809 102830 169491 166787 83585
15402H3585m8961p0983k6523l1279n99N48r8328J1677J1893J94832J32562j03761
$$ 83585 34624 -36359 -62882 -94161 -94760 -94212 -192540 -180863 -168970 25862 158424 54663
15390E4663j00825l1979Q2492K42243R186n6773l4821j01284J9525M862j949m7451
$$ 54663 -46162 -78141 4351 246594 255780 199007 164186 62902 82427 87289 85340 37889
15378C7889q6461o2880k196O0548L1767J58801L0093j25852L2358l4460L2524
$$ 37889 -48572 -111452 -113648 -53100 -21333 137468 167561 41709 74067 39607 72131
15367G2131m6195m2769M9274K8521Q6417j147j25951N1606k0557k3169N1226j2192
$$ 72131 25936 -16833 32441 60962 147379 146232 20281 71887 51330 28161 79387 67195
15355F7195r0055j3405k38J42611R443O006J8819l9985l3828j65190k8140O685
$$ 67195 -22860 -36265 -36503 106108 115551 121557 140376 100391 66563 -98627 -126767 -120082
15343a20082p8082R0580q566j19755L6144M584j3662J96770r3634q3384m3322
$$ -120082 -198164 -107584 -116150 -235905 -199761 -195177 -208839 -12069 -105703 -189087 -232409
15332b32409O8150O5272l1910R7943J01850m4912j33097J8660K5019k1356r3573
$$ -232409 -164259 -98987 -130897 -32954 68896 23984 -109113 -90453 -65434 -86790 -180363
15321a80363k3969K3298J8771L5983q0484j4773J38758J83818P3155j8826K8195
$$ -180363 -204332 -181034 -162263 -126280 -206764 -221537 -82779 101039 174194 155368 183563
15310A83563j01725j7262L1675l9912n3170P8717o3293k5387j15095r8859R1461
$$ 183563 81838 64576 96251 56339 3169 81886 18593 -6794 -121889 -220748 -129287
15299a29287K3130p7900n7595P9682J4517L4860N5639n7504k7011k1906O7187
$$ -129287 -106157 -184057 -241652 -161970 -147453 -112593 -56954 -114458 -141469 -163375 -96188
15288i6188P7898R3666k825j72166q9672J31113M2855j36583j77989N896J20633
$$ -96188 -18290 75376 72551 -99615 -189287 -58174 -15319 -151902 -329891 -323995 -203362
15277b03362R6665J9434J67900n686p4134j7319j15218k4056R2881N6438j57339
$$ -203362 -106697 -87263 80637 74951 817 -16502 -131720 -155776 -62895 -6457 -163796
15266a63796m689K03923P5365J8928m4415o3451K2892q637n429J0586K2120q1436
$$ -163796 -168485 35438 110803 129731 85316 21865 44757 36120 30691 41277 63397 -18039
15254a8039r6414j6640o0437o2376J7131K01595J75703J28160R1425j19332o8253
$$ -18039 -114453 -131093 -191530 -253906 -236775 -35180 140523 268683 360108 240776 172523
15243A72523l8501j12232L657r8030L982P7830o8276l4236k3733N0539P3368j62174
$$ 172523 134022 21790 25447 -72583 -68601 9229 -59047 -93283 -117016 -66477 6891 -155283
15231a55283J08456L1307r0753L1060J21265J7007J09476K3239j87219k84690
$$ -155283 -46827 -15520 -106273 -75213 46052 63059 172535 195774 8555 -276135
15221b76135o7191L1224r354M6037J5049l8104K3938K25673J56042n5524n3929
$$ -276135 -343326 -312102 -321456 -275419 -260370 -298474 -274536 -48863 107179 51655 -2274
15210b274k1236Q6328o172l056J00803k1279p2199J7322q1242o9371L9493L0776
$$ -2274 -23510 62818 56646 53590 154393 133114 60915 78237 -3005 -72376 -32883 -2107
15198b107O4545Q2368j4962J4543o8355o5540j32077N8866J44284l0206j31569
$$ -2107 62438 144806 129844 144387 76032 10492 -121585 -62719 81565 51359 -80210
15187h0210j64543M721L3297Q5797Q1311K14010K6428j30135J44708M8031L7751
$$ -80210 -244753 -240032 -206735 -120938 -39627 174383 200811 70676 215384 263415 301166
15176C01166q463n9798l4577j5310k2549j45612j8489J06955J00325J01101j13880
$$ 301166 292703 232905 198328 183018 160469 14857 -3632 103323 203648 304749 190869
15165A90869j90188J25666K7178r5212M1483Q5202k18320j20930o5337P979J24689
$$ 190869 681 126347 153525 58313 99796 184998 -33322 -154252 -219589 -211610 -86921
15154h6921O5698J50938l0436o9152j06261N9765K01078K084J1334O7099k4986
$$ -86921 -21223 129715 99279 30127 -76134 -16369 184709 186793 198127 265226 240240
15143B40240J8155j6368r8568n3120j8670q2033p1247n3837p0329J84500R5398
$$ 240240 258395 242027 143459 90339 71669 -10364 -81611 -135448 -205777 -21277 74121
15132G4121k3651l3675K7354N4545R0690P3085k34417j41556j7605P6859O9567
$$ 74121 50470 16795 44149 98694 189384 262469 28052 -113504 -131109 -54250 15317
15121A5317J20306N5453p4646L6121N9097j47935o4980K1533N2678q6344j06787
$$ 15317 135623 191076 116430 152551 211648 63713 -1267 20266 72944 -13400 -120187
15110a20187R788N9549J55128j53157m7765k651J59780J67773k13404k02096Q3901
$$ -120187 -110399 -50850 104278 -48879 -96644 -99295 60485 228258 14854 -187242 -103341
15099a03341R7815Q7900J01972j16483P476j0275N140k3619j6774j4404O479o5595
$$ -103341 -5526 82374 184346 67863 75339 65064 70204 46585 29811 15407 21886 -43709
15087d3709r1389j09422L4943J9748M9957J01683J8857R6304Q3931k44660m3894
$$ -43709 -135098 -244520 -209577 -189829 -139872 -38189 -19332 76972 160903 -83757 -127651
$$ [...]
##END NTUPLES=NMR SPECTRUM
##END=
