##TITLE=Analysis number 323292
Compound Code cc 17401
Project Code adrs
Chemist Name cardiff
##JCAMPDX= 6.0         $$ Bruker NMR JCAMP-DX V2.0
##DATA TYPE= NMR SPECTRUM
##DATA CLASS= NTUPLES
##ORIGIN= Bruker BioSpin GmbH
##OWNER= nmr
$$ XWIN-NMR		Version 3.5
$$ Mon Oct 23 09:37:43 2006 GMT Daylight Time (UT+1h)  MAYBRIDGE\nmr@NMR_250MHZ
##.OBSERVE FREQUENCY= 250.131544655141
##.OBSERVE NUCLEUS= ^1H
##.ACQUISITION MODE= SIMULTANEOUS (DQD)
##.ACQUISITION SCHEME= undefined
##.AVERAGES= 16
##.DIGITISER RES= 18
##SPECTROMETER/DATA SYSTEM= dpx250
##.PULSE SEQUENCE= zg30
##.SOLVENT NAME= DMSO
##.SHIFT REFERENCE= (INTERNAL, DMSO, 0, 16.522)
##AUDIT TRAIL= $$ (NUMBER, WHEN, WHO, WHERE, WHAT)
$$ ##TITLE= Audit trail, XWIN-NMR		Version 3.5
$$ ##JCAMPDX= 5.01
$$ ##ORIGIN= Bruker BioSpin GmbH
$$ ##OWNER= nmr
$$ C:\u/data/dgb/nmr/ADRS/1080/pdata/1/auditp.txt
$$ ##AUDIT TRAIL=  $$ (NUMBER, WHEN, WHO, WHERE, WHAT)
(   1,<2006-10-23 09:37:24.06 +100>,<MAYBRIDGE\nmr>,<NMR_250MHZ>,
      <created by zg, POWCHK disabled, PULCHK disabled
       configuration hash MD5:
       49 4B E0 1D 92 C2 6B 37 9F E6 65 BC 52 41 86 1D
       data hash MD5: 64K
       64 C1 40 76 2C 07 83 52 E3 3D AA 96 0F 82 EE 9F>)
(   2,<2006-10-23 09:37:35.34 +100>,<MAYBRIDGE\nmr>,<NMR_250MHZ>,
      <Start of raw data processing
       ef LB = 0.3 FT_mod = 6 PKNL = 1 SI = 32K 
       data hash MD5: 32K
       4B 3C 27 F2 06 2F 69 0B 5A 88 03 8C 46 DE 00 7E>)
(   3,<2006-10-23 09:37:37.01 +100>,<MAYBRIDGE\nmr>,<NMR_250MHZ>,
      <apk 
       data hash MD5: 32K
       99 65 49 02 EE FA D4 DA D5 E0 48 02 A8 3E 90 2F>)
(   4,<2006-10-23 09:37:37.75 +100>,<MAYBRIDGE\nmr>,<NMR_250MHZ>,
      <abs ABSG = 5 
       data hash MD5: 32K
       BA 63 F8 2F 73 73 B7 A2 D8 A6 17 B2 52 3A A5 EB>)
$$ ##END=
$$ 
$$ hash MD5
$$ C1 8E 88 18 05 07 32 BF 09 A4 0D B0 92 A6 F2 A2
##$RELAX= 
##$RELAX= 
##$RELAX= 
##$RELAX= 
##$RELAX= 
##$RELAX= 
##$RELAX= 
$$ Bruker specific parameters
$$ --------------------------
##$DU= <C:\u>
##$EXPNO= 1080
##$NAME= <ADRS>
##$PROCNO= 1
##$TYPE= <nmr>
##$USER= <dgb>
##$AMP= (0..31)
100 100 100 100 100 100 100 100 100 100 100 100 100 100 100 100 100 100 
100 100 100 100 100 100 100 100 100 100 100 100 100 100 
##$AQSEQ= 0
##$AQ_mod= 3
##$AUNM= <au_zg>
##$AUTOPOS= <3 >
##$BF1= 250.13
##$BF2= 250.13
##$BF3= 250.13
##$BF4= 250.13
##$BF5= 500.13
##$BF6= 500.13
##$BF7= 500.13
##$BF8= 500.13
##$BYTORDA= 1
##$CFDGTYP= 0
##$CFRGTYP= 5
##$CHEMSTR= <none>
##$CNST= (0..31)
1 1 145 1 1 1 1 1 1 1 1 1 1 1 1 1 1 1 1 1 1 1 1 1 1 1 1 1 1 1 1 1 
##$CPDPRG= <>
##$CPDPRG1= <>
##$CPDPRG2= <>
##$CPDPRG3= <>
##$CPDPRG4= <mlev>
##$CPDPRG5= <mlev>
##$CPDPRG6= <mlev>
##$CPDPRG7= <mlev>
##$CPDPRG8= <mlev>
##$CPDPRGB= <>
##$CPDPRGT= <>
##$D= (0..31)
0 1 0 0 0 0 0 0 0 0.06 0 0 0 0 0 0 0.0002 0 0 0 0 0 0 0 0 0 0 0 0 0 0 
0 
##$DATE= 1161592643
##$DBL= (0..7)
120 120 120 120 120 120 120 120 
##$DBP= (0..7)
150 150 150 150 150 150 150 150 
##$DBP07= 0
##$DBPNAM0= <>
##$DBPNAM1= <>
##$DBPNAM2= <>
##$DBPNAM3= <>
$$ [...]
##$SUBNAM7= <"">
##$SUBNAM8= <"">
##$SUBNAM9= <"">
##$SW= 20.6930455092707
##$SWIBOX= (0..15)
0 0 3 0 0 0 0 0 0 0 0 0 0 0 0 0 
##$SW_h= 5175.983436853
##$TD= 65536
##$TD0= 1
##$TE= 683.16
##$TE2= 300
##$TE3= 300
##$TEG= 300
##$TL= (0..7)
0 120 120 120 120 120 120 120 
##$TP= (0..7)
150 150 150 150 150 150 150 150 
##$TP07= 0
##$TPNAME0= <>
##$TPNAME1= <>
##$TPNAME2= <>
##$TPNAME3= <>
##$TPNAME4= <>
##$TPNAME5= <>
##$TPNAME6= <>
##$TPNAME7= <>
##$TPOAL= (0..7)
0.5 0.5 0.5 0.5 0.5 0.5 0.5 0.5 
##$TPOFFS= (0..7)
0 0 0 0 0 0 0 0 
##$TUNHIN= 0
##$TUNHOUT= 0
##$TUNXOUT= 0
##$USERA1= <user>
##$USERA2= <user>
##$USERA3= <user>
##$USERA4= <user>
##$USERA5= <user>
##$V9= 5
##$VALIST= <valist>
##$VCLIST= <CCCCCCCCCCCCCCC>
##$VD= 0
##$VDLIST= <DDDDDDDDDDDDDDD>
##$VPLIST= <PPPPPPPPPPPPPPP>
##$VTLIST= <TTTTTTTTTTTTTTT>
##$WBST= 1024
##$WBSW= 4
##$XGAIN= (0..3)
0 0 0 0 
##$XL= 0
##$YL= 0
##$YMAX_a= 437143
##$YMIN_a= -347353
##$ZGOPTNS= <>
##$ZL1= 120
##$ZL2= 120
##$ZL3= 120
##$ZL4= 120
##$ABSF1= 16.522
##$ABSF2= -4.171173
##$ABSG= 5
##$ABSL= 3
##$ALPHA= 0
##$AQORDER= 0
##$ASSFAC= 0
##$ASSFACI= 0
##$ASSFACX= 0
##$ASSWID= 0
##$AUNMP= <proc_1d>
##$AZFE= 0.1
##$AZFW= 0.1
##$BCFW= 0
##$BC_mod= 0
##$BYTORDP= 0
##$COROFFS= 0
##$CY= 12.5
##$DATMOD= 1
##$DC= 0
##$DFILT= <>
##$DTYPP= 0
##$F1P= 14.0000005364418
##$F2P= -0.99999901652339
##$FCOR= 0.5
##$FTSIZE= 32768
##$FT_mod= 6
##$GAMMA= 0
##$GB= 0
##$INTBC= 1
##$INTSCL= 1
##$ISEN= 128
##$LB= 0.3
##$LEV0= 0
##$LPBIN= 0
##$MAXI= 10000
##$MC2= 0
##$MEAN= 0
##$ME_mod= 0
##$MI= 0
##$NCOEF= 0
##$NC_proc= -5
##$NLEV= 6
##$NOISF1= 0
##$NOISF2= 0
##$NSP= 0
##$NTH_PI= 0
##$NZP= 0
##$OFFSET= 16.522
##$PC= 1
##$PHC0= -57.31799
##$PHC1= 10.03901
##$PH_mod= 1
##$PKNL= yes
##$PPARMOD= 0
##$PSCAL= 4
##$PSIGN= 0
##$REVERSE= no
##$SF= 250.13
##$SI= 32768
##$SIGF1= 0
##$SIGF2= 0
##$SINO= 400
##$SIOLD= 32768
##$SREGLST= <1H.DMSO>
##$SSB= 0
##$STSI= 32768
##$STSR= 0
##$SW_p= 5175.98343685301
##$SYMM= 0
##$S_DEV= 0
##$TDeff= 65536
##$TDoff= 0
##$TI= <Analysis number 999999
Compound Code 99
Book Reference 9
Project Code 9>
##$TILT= no
##$TM1= 0
##$TM2= 0
##$TOPLEV= 0
##$USERP1= <user>
##$USERP2= <user>
##$USERP3= <user>
##$USERP4= <user>
##$USERP5= <user>
##$WDW= 1
##$XDIM= 32768
##$YMAX_p= 296945567
##$YMIN_p= -549343
$$ End of Bruker specific parameters
$$ ---------------------------------
##NTUPLES= NMR SPECTRUM
##VAR_NAME=  FREQUENCY,     SPECTRUM/REAL,   SPECTRUM/IMAG
##SYMBOL=    X,             R,               I
##VAR_TYPE=  INDEPENDENT,   DEPENDENT,       DEPENDENT
##VAR_FORM=  AFFN,          ASDF,            ASDF
##VAR_DIM=   32768,         32768,           32768
##UNITS=     HZ,            ARBITRARY UNITS, ARBITRARY UNITS
##FACTOR=    0.157963299565203, 1,           1
##FIRST=     4132.6476996994, 0,             0
##LAST=      -1043.33573715361, 0,           0
##MIN=       -1043.33573715361, -549343,     0
##MAX=       4132.6476996994, 296945567,     0
$$ Real data points
##PAGE= N=1
##DATA TABLE= (X++(R..R)), XYDATA
$$ [...]
$$ plain form
17757 2320565 2444760 2567845 2595723 2659595 2697996 2767469 2752254 2731298 2879933 3103452
17747 3103452 3350793 3508967 3566825 3544356 3759302 4017390 4283287 4562048 4770344 4961116
17737 4961116 5143621 5504018 5800272 6155612 6525801 6974854 7515301 7962156 8413587
17728 8413587 9119672 9899495 10842180 11833225 12935411 14337554 16144159 18084859 20275974
17719 20275974 22559818 25012801 27593235 30088745 32622646 34919435 37122499 39316652
17711 39316652 41466133 43851085 46946164 51107425 56548553 63571881 72496900 83621845
17703 83621845 97415068 113930285 132571385 151934304 170642937 187285186 199826683
17696 199826683 206171097 204842796 196231047 182406174 166278218 149936755 134922028
$$ packed form
17757B320565J24195J23085K7878O3872L8401O9473j5215k0956J48635K23519
17747C103452K47341J58174N7858k2469K14946K58088K65897K78761K08296J90772
17737D961116J82505L60397K96254L55340L70189M49053N40447M46855M51431
17728H413587P06085P79823R42685R91045J102186J402143J806605J940700K191115
17719B0275974K283844K452983K580434K495510K533901K296789K203064K194153
17711C9316652K149481K384952L095079M161261N441128P023328Q925019J1124945
17703H3621845J3793223J6515217J8641100J9362919J8708633J6642249J2541497
17696A99826683O344414j328301q611749j3824873j6127956j6341463j5014727
$$ plain form
17689 134922028 121740647 110813780 102129489 95272267 89512893 84318671 79516728 74561746
17681 74561746 69126025 63260226 57335885 51781230 46520447 42009979 38279053 35105660
17673 35105660 32580471 30606743 29260630 28309019 27638984 27264629 27148517 27584807 28332613
17664 28332613 29360137 30787571 32738344 35300377 38517686 42297271 46597111 51530115
17656 51530115 56781348 62291276 67879728 73459359 78730236 83778955 88710267 93747167
17648 93747167 99676083 107069502 116310529 127549671 140387505 154070458 167419951
17641 167419951 178431010 185910242 188472139 185094548 175459691 159972887 140634549
17634 140634549 120493483 101889947 85819407 72620201 62096168 53955110 47514087
$$ packed form
17689A34922028j3181381j0926867q684291o857222n759374n194222m801943m954982
17681G4561746n435721n865799n924341n554655n260783m510468l730926l173393
17673C5105660k525189j973728j346113r51611o70035l74355j16112M36290P47806
17664B8332613J027524J427434J950773K562033L217309L779585M299840M933004
17656E1530115N251233N509928N588452N579631N270877N048719M931312N036900
17648I3747167N928916P393419R241027J1239142J2837834J3682953J3349493
17641A67419951J1011059P479232K561897l377591r634857j5486804j9338338
17634A40634549k0141066j8603536j6070540j3199206j0524033q141058o441023
$$ plain form
17627 47514087 42552449 39057043 36362799 34256644 32512618 30898840 29404037 27831357
17619 27831357 25947291 23789483 21648364 19435015 17357307 15471582 13891950 12477835
17611 12477835 11346892 10471898 9555138 8665049 7880038 7249638 6780999 6440467 6147560
17602 6147560 5716784 5346498 5159868 5065872 4773753 4537823 4425123 4276862 3911935 3627826
17592 3627826 3546467 3419826 3150753 2846168 2709968 2518804 2486416 2510242 2397539 2467706
17582 2467706 2368652 2217395 2173859 2144405 2038472 1903989 1807323 1698966 1643397 1621426
17572 1621426 1557271 1431016 1438936 1484097 1444259 1392076 1498278 1579316 1506946 1479671 1406775
17561 1406775 1343687 1246182 1150653 1206085 1204684 1159297 1020750 836380 704516 723123 804879
$$ packed form
17627D7514087m961638l495406k694244k106155j744026j613778j494803j572680
17619B7831357j884066k157808k141119k213349k077708j885725j579632j414115
17611A2477835j130943q74994r16760q90089p85011o30400m68639l40532k92907
17602F147560m30776l70286j86630r3996k92119k35930j12700j48261l64927k84109
17592C627826q1359j26641k69073l04585j36200j91164l2388K3826j12703P0167
17582B467706r9054j51257m3536k9454j05933j34483r6666j08357n5569k1971
17572A621426o4155j26255P920M5161l9838n2183J06202Q1038p2370k7275p2896
17561A406775o3088r7505r5529N5432j401m5387j38547j84370j31864J8607Q1756
$$ plain form
17550 804879 850310 890349 830610 633422 588924 664757 769795 815942 824918 730599 666844
17539 666844 648857 440045 356038 419674 490329 584918 586950 316971 220360 146646 198657
17528 198657 338492 438766 540282 509608 357240 361389 408659 479028 432355 338098 470373
17517 470373 381967 357798 250155 336857 447631 450822 342263 385074 500966 541272 380626
17506 380626 333267 424366 533806 480590 454584 361524 401923 361635 331459 294965 292831
17495 292831 258164 119334 95454 553 27386 76054 230200 286605 373975 427768 391328
17484 391328 341263 265218 252605 94912 32443 -39574 -56046 46898 61244 42034 16812
17473 16812 -19731 -32241 -54849 -12396 34578 151222 100242 -33585 -96252 -129760 -159672
$$ packed form
17550H04879M5431M0039n9739j97188m4498P5833J05038M6147Q976r4319o3755
17539F66844j7987k08812q4007O3636P0655R4589K032k69979r6611p3714N2011
17528A98657J39835J00274J01516l0674j52368M149M7270P0369m6673r4257J32275
17517D70373q8406k4169j07643Q6702J10774L191j08559M2811J15892M0306j60646
17506C80626m7359R1099J09440n3216k6006r3060M0399m0288l0176l6494k134
17495B92831l4667j38830k3880r4901K6833M8668J54146N6405Q7370N3793l6440
17484C91328n0065p6045j2613j57693o2469p2017j6472J02944J4346j9210k5222
17473A6812l6543j2510k2608M2453M6974J16644n0980j33827o2667l3508k9912
$$ plain form
17462 -159672 -144234 -38737 -58611 85565 138962 93259 53849 -88875 -49768 58384 148021
17451 148021 119244 98635 52915 -14319 32335 68478 47145 88639 100801 178175 194187
17440 194187 38108 -12910 126539 58130 30429 -92632 -179661 -289824 -282463 -146892 -89872
17429 -89872 67311 128810 133197 82564 178447 230598 178103 18655 22618 78067 64620 43382
17417 43382 -66916 -176008 -117830 14305 33237 -18164 -80479 -167657 -119797 -40265 -187474
17406 -187474 -275676 -168298 -240675 -284076 -200211 -170925 -276064 -332778 -377906 -373149 -393953
17395 -393953 -288117 -156618 -110984 -67553 -71069 -56953 -23446 -61779 -55562 -118860 -122854 -30511
17383 -30511 -88573 -122766 -183054 -407210 -405401 -213399 -82611 -56187 -118335 762 -2320
$$ packed form
17462a59672J5438J05497j9874J44176N3397m5703l9410j42724L9107J08152Q9637
17451A48021k8777k0609m5720o7234M6654L6143k1333M1494J2162P7374J6012
17440A94187j56079n1018J39449o8409k7701j23061q7029j10163P361J35571N7020
17429h9872J57183O1499M387n0633R5883N2151n2495j59448L963N5449j3447k1238
17417D3382j10298j09092N8178J32135J8932n1401o2315q7178M7860P9532j47209
17406a87474q8202J07378p2377m3401Q3865K9286j05139n6714m5128M757k0804
17395c93953J05836J31499M5634M3431l516J4116L3507l8333O217o3298l994R2343
17383c0511n8062l4193o0288k24156J809J92002J30788K6424o2148J19097l082
$$ plain form
17372 -2320 -16830 -64808 -171290 -275649 -319412 -328796 -352911 -281277 -92705 -15017 30005
17361 30005 -75195 -51900 -34197 -32430 -56151 -50518 -75802 20073 -70748 -175942 -181489 -143585
17349 -143585 10604 11573 -63036 -123819 -93630 -88403 -71371 -138761 -137723 2642 89264 91422
17337 91422 -3573 -62963 -193495 -191594 -164521 -163176 -180737 -147627 23720 -127733 -275397
17326 -275397 -231974 -118805 -145810 -221748 -196025 -164329 -136248 -192184 -17724 46687 -56718
17315 -56718 92460 109123 54587 98171 84681 40974 -14756 -4429 35948 -61072 -275421
17304 -275421 -389918 -347918 -292418 -342532 -272265 -163353 -4312 -67825 -29877 77486 -31102
17293 -31102 -71205 -51018 44785 88796 -4827 -85290 -269468 -291741 -265613 -149431 -132185
$$ packed form
17372b320j4510m7978j06482j04359m3763r384k4115P1634J88572P7688M5022
17361C0005j05200K3295J7703J767k3721N633k5284R5875r0821j05194n547L7904
17349a43585J54189R69p4609o0783L0189N227J7032o7390J038J40365Q6622K158
17337I1422r4995n9390j30532J901K7073J345j7561L3110J71347j51453j47664
17326b75397M3423J13169k7005p5938K5723L1696K8081n5936J74460O4411j03405
17315e6718J49178J6663n4536M3584j3490m3707n5730J0327M0377r7020k14349
17304b75421j14497M2000N5500n0114P0267J08912J59041o3513L7948J07363j08588
17293c1102m0103K0187R5803M4011r3623q0463j84178k2273K6128J16182J7246
$$ plain form
17282 -132185 -53869 -85770 -122089 -142612 -172511 -188519 -33629 105236 45933 -101774 -233955
17271 -233955 -236549 -127623 -9439 -2847 -42966 -39176 4344 2221 -112016 -172608 -292630
17260 -292630 -233707 26863 158533 164007 123839 147375 161686 186389 105455 -50800 -62903
17249 -62903 -5935 -129073 -147285 -6702 32400 -1272 164 45438 -99584 -247112 -131459
17238 -131459 -93896 -89351 -69706 -41930 -51485 -180658 -329919 -374082 -393704 -243495 -254760
17227 -254760 -267957 -18273 53674 -103317 -108348 -161613 -177143 -167776 -191055 -137838 -104785
17216 -104785 -58592 -59265 -72999 -69996 -80352 63802 137681 169010 112912 44635 114759 170346
17204 170346 200802 287385 502794 645950 493706 464269 540062 515720 388066 395713 511846
$$ packed form
17282a32185P8316l1901l6319k0523k9899j6008J54890J38865n9303j47707j32181
17271b33955k594J08926J18184O592m0119L790M3520k123j14237o0592j20022
17260b92630N8923K60570J31670N474m0168K3536J4311K4703q0934j56255j2103
17249f2903N6968j23138j8212J40583L9102l3672J436M5274j45022j47528J15653
17238a31459L7563M545J9645K7776r555j29173j49261m4163j9622J50209j1265
17227b54760j3197K49684P1947j56991n031n3265j5530R367k3279N3217L3053
17216a04785M6193o73j3734L003j0356J44154P3879L1329n6098o8277P0124N5587
17204A70346L0456Q6583K15409J43156j52244k9437P5793k4342j27654P647J16133
$$ plain form
17193 511846 572754 572486 627429 660206 727606 689650 517347 406471 615426 670054 691218
17182 691218 637057 514282 420415 405524 422638 367205 206046 89008 -31380 -178704
17172 -178704 -73496 4687 196179 139854 -29784 167656 187016 231743 296617 348513 276588
17161 276588 276045 300613 202852 169002 226373 142485 118136 271189 458858 374236 319056
17150 319056 373092 381838 393760 496542 553271 357372 403480 380497 409788 468022 438358
17139 438358 510815 459741 426682 447553 393151 326266 326234 241790 202744 285697 437396 522687
17127 522687 631672 522146 415218 406339 524467 442136 304076 182407 15253 -7975
17117 -7975 64457 -13800 55929 -17139 -146518 -126745 -54058 -46316 -76912 -62485 -73929 -134469
$$ packed form
17193E11846O0908k68N4943L2777O7400l7956j72303j10876K08955N4628K1164
17182F91218n4161j22775r3867j4891J7114n5433j61159j17038j20388j47324
17172a78704J05208P8183J91492n6325j69638J97440J9360M4727O4874N1896p1925
17161B76588n43K4568r7761l3850N7371q3888k4349J53053J87669q4622n5180
17150C19056N4036Q746J1922J02782N6729j95899M6108k2983K9291N8234k9664
17139D38358P2457n1074l3059K0871n4402o6885l2q4444l9046Q2953J51699Q5291
17127E22687J08985j09526j06928q879J18128q2331j38060j21669j67154k3228
17117g975P2432p8257O9729p3068j29379J9773P2687P742l0596J4427j1444o0540
$$ plain form
17105 -134469 -113486 -76694 31938 13552 16037 97579 -44257 -67845 20005 164761 97811
17094 97811 35113 27889 -83436 -229875 -233168 -76277 33849 103122 42079 -125255 -206597
17083 -206597 -43428 45222 259 109342 151516 53865 -160982 -272897 -293194 -146063
17073 -146063 62129 169866 212166 114552 3761 -13881 46118 2023 32684 -47702 -33456
17062 -33456 7100 -11731 -50560 58331 157787 25843 -53941 -119277 -128856 -72614 -78444 -149961
17050 -149961 -92256 -14533 -15668 -36328 -203677 -157278 -9049 -16259 -43316 -87802 -112984
17039 -112984 -91819 -91563 -98200 -99736 -105975 -26883 43612 2435 26943 117066 47534 -67766
17027 -67766 -141992 -229567 -140382 -131669 -117413 -43169 -81976 -59357 -82925 -112195 -106898 -58780
$$ packed form
17105a34469K0983L6792J08632j8386K485Q1542j41836k3588Q7850J44756o6950
17094I7811o2698p224j11325j46439l293J56891J10126O9273o1043j67334q1342
17083b06597J63169Q8650m4963J09083M2174r7651k14847j11915k0297J47131
17073a46063K08192J07737M2300r7614j10791j7642N9999m4095L0661q0386J4246
17062c3456M0556j8831l8829J08891R9456j31944p9784o5336r579N6242n830p1517
17050a49961N7705P7723j135k0660j67349M6399J48229p210k7057m4486k5182
17039a12984K1165K56o637j536o239P9092P0495m1177K4508R0123o9532j15300
17027f7766p4226q7575Q9185Q713J4256P4244l8807K2619k3568k9270N297M8118
$$ plain form
17015 -58780 -241742 -382760 -276346 -248189 -196501 -56708 -121385 -186364 -197630 -164596 -186133
17004 -186133 -212890 -128231 -150787 -229876 -139383 -141310 -146177 -146912 -92313 -99174 -119809 -97299
16992 -97299 -34055 -78912 -130561 -150773 -159540 -103488 -13495 126485 304547 316257 128402
16981 128402 84216 171586 128613 -28983 -160871 -312377 -234099 -73825 -101950 -87009 -9559
16970 -9559 -118802 -90705 26016 113437 -47473 -136906 -159071 -164472 -199559 -163154 -249640
16959 -249640 -316767 -250236 -233064 -273557 -262597 -172496 -86962 -141687 -168524 -243911 -384802
16948 -384802 -360159 -240889 -93974 -50658 -171722 -201689 -120314 84330 117058 130580 9370
16937 9370 -78261 -155770 -310669 -396819 -288354 -193095 -11929 114551 29457 34555 -53784
$$ packed form
17015e8780j82962j41018J06414K8157N1688J39793o4677o4979j1266L3034k1537
17004a86133k6757Q4659k2556p9089R0493j927m867p35N4599o861k0635K2510
16992i7299O3244m4857n1649k0212q767N6052Q9993J39980J78062J1710j87855
16981A28402m4186Q7370m2973j57596j31888j51506P8278J60274k8125J4941P7450
16970i559j09243K8097J16721Q7421j60910q9433k2165n401l5087L6405q6486
16959b49640o7127O6531J7172m0493J0960R0101Q5534n4725k6837p5387j40891
16948c84802K4643J19270J46915M3316j21064k9967Q1375K04644L2728J3522j21210
16937I370q7631p7509j54899q6150J08465R5259J81166J26480q5094N098q8339
$$ plain form
16926 -53784 -205803 -302970 -240803 -220806 -146540 -173363 -190839 -166486 -92228 -79860 -92527
16915 -92527 -37256 -3003 -172764 -341698 -338646 -249100 -253708 -215133 -85260 -41039 -106487
16904 -106487 -17824 58439 90744 -44783 -60776 -162621 -154737 -118335 -115320 -308049 -358577
16893 -358577 -243164 -185836 -90967 11794 -1682 -7177 -94154 -24513 150826 239800 46009
16882 46009 -11444 115890 72807 109879 -11064 -82569 -135737 3369 -44000 -157367 -206240
16871 -206240 -111964 -1317 116307 -14014 -69375 29266 118811 114585 107558 3357 -109670
16860 -109670 -100724 -140257 -177786 -198595 -92428 -162547 -204145 -291688 -270905 -232817 -247796
16849 -247796 -188612 -168714 -95052 -136063 -174658 2091 111558 82286 -7844 -16484 30980
$$ packed form
16926e3784j52019r7167O2167J9997P4266k6823j7476K4353P4258J2368j2667
16915i2527N5271L4253j69761j68934L052Q9546m608L8575J29873M4221o5448
16904a06487Q8663P6263L2305j35527j5993j01845P884L6402L015j92729n0528
16893c58577J15413N7328R4869J02761j3476n495q6977O9641J75339Q8974j93791
16882D6009n7453J27334m3083L7072j20943p1505n3168J39106m7369j13367m8873
16871b06240R4276J10647J17624j30321n5361R8641Q9545m226p027j04201j13027
16860a09670Q946l9533l7529k0809J06167p0119m1598q7543K0783L8088j4979
16849b47796N9184J9898P3662m1011l8595J76749J09467k9272r0130q640M7464
$$ plain form
16838 30980 58249 54024 -33931 -167703 -159004 -175134 -157164 89826 240963 215845 25154
16827 25154 -126448 -160149 -150255 -259479 -314948 -204657 42781 93289 61997 -51485 14960
16816 14960 26650 28160 27731 63203 42647 104721 114019 -5223 -191693 -277802 -127186 -36826
16804 -36826 83375 -8097 -72 10800 -60018 47563 81781 48289 -18726 -121082 -120086 -46951
16792 -46951 -24638 -131496 -181116 -179695 -180804 -217727 -200539 -156960 -128215 -109300 -32567 -9102
16780 -9102 40768 -56147 -143969 -256124 -298960 -204900 -98117 -30045 9337 -27814 -152862
16769 -152862 -191584 -218446 -74590 -25943 -141431 -212150 -223081 -244460 -176794 -58729 35177
16758 35177 22323 -12289 -24155 -120565 -162792 -164471 -107233 -135777 -263927 -363095 -269436 -153265
$$ packed form
16838C0980K7269m225q7955j33772Q699j6130J7970K46990J51137k5118j90691
16827B5154j51602l3701R894j09224n5469J10291K47438N0508l1292j13482O6445
16816A4960J1690J510m29L5472k0556O2074R298j19242j86470q6109J50616R0360
16804c6826J20201r1472Q025J0872p0818J07581L4218l3492o7015j02356R96P3135
16792d6951K2313j06858m9620J421j109l6923J7188M3579K8745J8915P6733K3465
16780i102M9870r6915q7822j12155m2836R4060J06783O8072L9382l7151j25048
16769a52862l8722k6862J43856M8647j15488p0719j0931k1379O7666J18065R3906
16758C5177j2854l4612j1866r6410m2227j679N7238k8544j28150r9168R3659J16171
$$ plain form
16746 -153265 -229162 -231047 -107419 -61038 -111396 -196853 -270343 -343954 -297771 -171000 -128563
16735 -128563 -123243 -39307 -41214 -142377 -110453 -19645 -18957 22458 -72105 -177450 -215209 -150974
16723 -150974 -101953 -184783 -150361 -146205 -120218 -7621 54616 -3394 -54679 -53379 -109227 -188380
16711 -188380 -206798 -157640 -131293 -131952 -73646 -167066 -103255 -196818 -169984 -66626 63403
16700 63403 97868 -41325 -187255 -110588 -60894 47574 162730 209623 137325 107746 3073
16689 3073 -103721 -131401 -184788 -144318 -105692 -102406 -187203 -81841 -45933 -82350 -24862 -51996
16677 -51996 35631 68998 18722 49888 25630 -94577 -91915 -68742 6314 -18379 -80261 -159177
16665 -159177 -252549 -245024 -162847 -84069 -67705 56502 44478 -22712 -115533 -144079 -222299
$$ packed form
16746a53265p5897j885J23628M6381n0358q5457p3490p3611M6183J26771M2437
16735a28563N320Q3936j907j01163L1924R0808O88M1415r4563j05345l7759O4235
16723a50974M9021q2830L4422M156K5987J12597O2237n8010n1285J300n5848p9153
16711a88380j8418M9158K6347o59N8306r3420O3811r3563K6834J03358J30029
16700F3403L4465j39193j45930P6667M9694J08468J15156M6893p2298k9579j04673
16689C073j06794k7680n3387M0470L8626L286q4797J05362L5908l6417N7488k7134
16677e1996Q7627L3367n0276L1166k4258j20207K662K3173P5056k4693o1882p8916
16665a59177r3372P525Q2177P8778J6364J24207j2024o7190r2821k8546p8220
$$ plain form
16654 -222299 -89329 17535 2363 -84339 -118239 -54996 -89343 -160241 -152943 -139152 -116371
16643 -116371 26181 137932 61300 -77226 -76068 -29782 -12315 132940 206060 205698 60286
16632 60286 -33074 -81314 -27832 -19582 -50077 -63617 -66559 31266 34220 11735 17686 55628
16620 55628 150858 68382 -91676 -126861 -189129 -155009 -90759 -174315 -290147 -309760 -300078
16609 -300078 -212765 -238137 -187701 -170449 -178495 -140433 20410 137148 -54662 -142408 -81225
16598 -81225 -106613 -216616 -241095 -224445 -198394 -119217 -66961 -191607 -225403 -295749 -244833
16587 -244833 -295077 -360805 -355049 -254607 -166010 -124525 -154785 -169493 -162861 -126133 47334
16576 47334 127049 93002 49626 -87732 -126626 74745 162848 51370 -105210 -193296 -359064
$$ packed form
16654b22299J32970J06864j5172q6702l3900O3243l4347p0898P298J3791K2781
16643a16371J42552J11751p6632j38526J158M6286J7467J45255P3120l62j45412
16632F0286r3360m8240N3482Q250l0495j3540k942R7825K954k2485N951L7942
16620E5628R5230q2476j60058l5185o2268L4120O4250q3556j15832j9613R682
16609c00078Q7313k5372N0436J7252q046L8062J60843J16738j91810q7746O1183
16598h1225k5388j10003k4479J6650K6051P9177N2256j24646l3796p0346N0916
16587b44833n0244o5728N756J00442Q8597M1485l0260j4708O632L6728J73467
16576D7334P9715l4047m3376j37358l8894K01371Q8103j11478j56580q8086j65768
$$ plain form
16565 -359064 -296475 -167354 -114933 -47228 -141149 -314745 -239034 -90530 -31490 -130882 -203760
16554 -203760 -197624 -123763 -40625 110502 200903 84217 -11281 -274925 -357469 -262946 -172890
16543 -172890 -39566 -101323 -111795 -122773 -101997 -71432 -81993 76103 89135 82343 -7214
16532 -7214 -18449 -53581 -98415 -144405 -157791 -225298 -150731 -94477 -53457 -41080 52374 -74361
16520 -74361 -140792 -146026 -103351 72500 39772 -43287 -120509 -231616 -211542 -20489 -21591
16509 -21591 -132213 -175658 -221150 -194061 -148131 -52614 -56394 -51603 -61018 -95250 -248598 -310940
16497 -310940 -199006 -190750 -263336 -241633 -159569 -169273 -104107 -50346 -3996 -51342 -118127 -207949
16485 -207949 -121499 -61258 -222100 -283739 -247260 -124938 30586 18895 -118851 -91904 -51482
$$ packed form
16565c59064O2589J29121N2421O7705r3921j73596P5711J48504N9040r9392p2878
16554b03760O136P3861Q3138J51127R0401j16686r5498k63644q2544R4523R0056
16543a72890J33324o1757j0472j0978K0776L0565j0561J58096J3032o792q9557
16532g214j1235l5132m4834m5990j3386o7507P4567N6254M1020J2377R3454j26735
16520g4361o6431n234M2675J75851l2728q3059p7222j11107K0074J91053j102
16509b1591j10622m3445m5492K7089M5930R5517l780M791r415l4232j53348o2342
16497c10940J11934Q256p2586K1703Q2064r704O5166N3761M6350m7346o6785q9822
16485b07949Q6450O0241j60842o1639L6479J22322J55524j1691j37746K6947M0422
$$ plain form
16474 -51482 -159460 -207049 -90470 -143465 -211377 -243800 -177575 -141606 -67907 -68095 -170570
16463 -170570 -88783 62325 29127 -14036 106338 -38825 -79233 -79086 -83397 -111128 -70916
16452 -70916 -93478 -41331 -21787 -146226 -158154 -241008 -212711 -221613 -139542 -313182 -312538 -272632
16440 -272632 -307243 -196934 -86627 -104057 -312656 -313852 -218792 -158835 -165648 -67041 53603
16429 53603 -22193 -48731 80841 151825 178447 -20286 -27803 6712 -58419 -7385 108026
16418 108026 260828 203181 203652 51216 -100781 -88479 -36369 -18350 -61534 12720 63296
16407 63296 21092 97909 92359 -65106 -184300 -195716 -142533 -82461 -29848 8819 -50965
16396 -50965 -86514 -65911 -99701 -41561 -65087 -124735 7620 59632 -49541 99496 147381
$$ packed form
16474e1482j07978m7589J16579n2995o7912l2423O6225L5969P3699j88j02475
16463a70570Q1787J51108l3198m3163J20374j45163m0408J47m311k7731M0212
16452g0916k2562N2147J9544j24439j1928q2854K8297q902Q2071j73640O44L9906
16440b72632l4611J10309J10307j7430k08599j196R5060N9957o813R8607J20644
16429E3603p5796k6538J29572P0984K6622j98733p517L4515o5131N1034J15411
16418A08026J52802n7647M71j52436j51997J2302N2110J8019m3184P4254N0576
16407F3296m2204P6817n550j57465j19194j1416N3183O0072N2613L8667n9784
16396e0965l5549K0603l3790N8140k3526n9648J32355N2012j09173J49037M7885
$$ plain form
16385 147381 182887 53237 -103310 -12450 -32128 -246754 -250636 -300799 -62317 165183 230227
16374 230227 226084 102959 113613 139818 31763 -106261 -186711 -132635 -111912 -85541 -45289
16363 -45289 -169742 -161204 -61123 -112653 -62628 2605 -110116 -154629 -172635 -212530 -140250
16352 -140250 -224577 -359496 -455045 -408277 -395169 -262350 -100920 -227230 -279617 -94843
16342 -94843 83549 -49921 -158258 -74799 -96173 -215857 -249103 -152868 27586 149405
16332 149405 38123 132622 227240 186486 77621 -73531 -214582 -216556 -86380 -139636 -170882
16321 -170882 -96990 -215265 -217012 -97210 -17191 63279 -21557 -73037 -62814 14614 -38880
16310 -38880 -165675 -90539 -64479 -21729 -88907 -96386 -33536 -93147 -68513 -181423 -166862
$$ packed form
16385A47381L5506j29650j56547R0860j9678k14626l882n0163K38482K27500O5044
16374B30227m143j23125J0654K6205j08055j38024q0450N4076K0723K6371M0252
16363d5289j24453Q538J00081n1530N0025O5233j12721m4513j8006l9895P2280
16352a40250q4327j34919r5549M6768J3108J32819J61430j26310n2387J84774
16342i4843J78392j33470j08337Q3459k1374j19684l3246R6235J80454J21819
16332A49405j11282R4499R4618m0754j08865j51152j41051j974J30176n3256l1246
16321a70882P3892j18275j747J19802Q0019Q0470q4836n1480J0223P7428n3494
16310c8880j26795P5136K6060M2750o7178p479O2850n9611K4634j12910J4561
$$ plain form
16299 -166862 -204157 -225574 -138033 -177152 -343074 -342512 -207177 -76848 -95735 -182755 -122913
16288 -122913 -166239 -66094 -89560 -153281 -289821 -336132 -253204 -106877 -61226 -116351 -188387
16277 -188387 -161113 -174037 -66276 -3709 59399 93599 50237 59102 72562 44091 52419 3833
16265 3833 15240 -50591 -227269 -235610 -187735 -19230 -2796 -19004 -80420 -110602 -43909 -107123
16253 -107123 -104537 -88892 -97464 -113669 -85931 -229399 -242304 -236960 -190674 -127044 -82412 -50879
16241 -50879 -120690 -207564 -190685 -46794 -71745 -68421 -37987 -106694 -117000 -189627 -269531 -261396
16229 -261396 -149438 -123647 -133213 -129354 -32311 133119 108577 -68407 -145877 -234309 -155288
16218 -155288 -10719 -93009 -157254 -51004 -48562 -102336 -93797 -49735 27804 -21230 -58029
$$ packed form
16299a66862l7295k1417Q7541l9119j65922N62J35335J30329j8887q7020N9842
16288a22913m3326J00145k3466o3721j36540m6311Q2928J46327M5651n5125p2036
16277a88387K7274j2924J07761O2567O3108L4200m3362Q865J3460k8471Q328m8586
16265C833J1407o5831j76678q341M7875J68505J6434j6208o1416l0182O6693o3214
16253a07123K586J5645q572j6205K7738j43468j2905N344M6286O3630M4632L1533
16241e0879o9811q6874J6879J43891k4951L324L0434o8707j0306p2627p9904Q135
16229b61396J11958K5791r566L859R7043J65430k4542j76984p7470q8432P9021
16218a55288J44569q2290o4245J06250K442n3774Q539M4062P7539m9034l6799
$$ plain form
16207 -58029 -81876 24977 -5381 -142643 -122709 -61734 -42837 -141647 -112022 -75971 -66421
16196 -66421 20414 5172 -26792 -25073 -91089 -140950 -35662 -92097 -84723 -52434 -27838 -9533
16184 -9533 45539 262086 249646 105379 39842 8798 -36412 103771 111089 -2547 -160174
16173 -160174 -92172 -17394 -52529 -180547 -164124 -103340 -131282 -143808 -243765 -270628 -163480
16162 -163480 -175708 -243252 -243329 -196970 -84590 -76528 -157576 -19416 -26248 -124209 -272980 -266228
16150 -266228 -11072 -41959 45013 127770 -64337 -83605 -50241 91863 141866 -45232 -153191
16139 -153191 -2730 57896 43704 -56096 7934 89936 122542 69985 52831 -247 -96031
16128 -96031 -152419 -185864 -162865 -51029 -27336 -101103 -151734 -132371 -69281 -16853 -55851
$$ packed form
16207e8029k3847J06853l0358j37262J9934O0975J8897r8810K9625L6051R550
16196f6421Q6835j5242l1964J719o6016m9861J05288n6435P374L2289K4596J8305
16184i533N5072K16547j2440j44267o5537l1044m5210J40183P318j13636j57627
16173a60174O8002P4778l5135j28018J6423O0784k7942j2526r9957k6863J07148
16162a63480j2228o7544p7M6359J12380Q062q1048J38160o832r7961j48771O752
16150b66228K55156l0887Q6972Q2757j92107j9268L3364J42104N0003j87098j07959
16139a53191J50461O0626j4192r9800O4030Q2002L2606n2557j7154n3078r5784
16128i6031n6388l3445K2999J11836K3693p3767n0631J9363O3090N2428l8998
$$ plain form
16117 -55851 -162628 -155541 -76576 -142081 -128631 -56043 12088 1289 10335 -4630 24529 -18759
16105 -18759 -44466 -183487 -169150 -90163 11791 -92030 -181833 -54922 -15912 -132797 -49026
16094 -49026 16468 5010 -83118 -70697 -144892 -106954 36799 -41783 -205513 -172313 -151388
16083 -151388 -108144 -119422 50680 -61366 -220078 -224311 -49883 31431 98164 172612 75514
16072 75514 -105293 -106318 -86228 6952 103741 -277 -61366 -57442 -76368 -36036 -15960 -27729
16060 -27729 -86517 30279 -7123 -87114 -180932 -109931 -58209 -75371 -98750 -64619 -14767
16049 -14767 94582 73413 43790 99176 68310 -128190 -245337 -282873 -180658 -35992 51839
16038 51839 134912 191715 80513 76390 146706 128306 42323 -59593 10235 98117 31565
$$ packed form
16117e5851j06777P087P8965o5505J3450P2588O8131j0799R046j4965K9159m3288
16105a8759k5707j39021J4337P8987J01954j03821q9803J26911L9010j16885Q3771
16094d9026O5494j1458q8128J2421p4195L7938J43753p8582j63730L3200K0925
16083a51388M3244j1278J70102j12046j58712m233J74428Q1314O6733P4448r7098
16072G5514j80807j025K0090R3180R6789j04018o1089L924j8926M0332K0076j1769
16060b7729n8788J16796l7402p9991r3818P1001N1722j7162k3379L4131M9852
16049a4767J09349k1169k9623N5386l0866j96500j17147l7536J02215J44666Q7831
16038E1839Q3073N6803j11202m123P0316j8400q5983j01916O9828Q7882o6552
$$ plain form
16027 31565 -90358 -88243 -86053 -23999 -93568 -10799 -27849 -24461 63893 176073 116413 9977
16015 9977 52999 47082 137041 91437 34963 -45027 -135564 -152623 -137967 -186666 -201705 -206722
16003 -206722 -204320 -227434 -93234 4500 -45467 -75659 -34252 13744 12246 53997 69217 80433
15991 80433 146951 104624 186575 141781 98127 -6576 -110844 -42739 104467 81083 53661
15980 53661 36506 19045 -8979 -66167 -9288 19215 52264 162368 97853 48465 -12052
15969 -12052 -98287 -158341 -109577 73895 64923 10203 32310 -58081 -92113 -161093 -208855 -222364
15957 -222364 -326128 -260659 -156139 -117592 -10486 46566 -9965 -14660 72306 -21670 -191234
15946 -191234 -172510 -171628 -177794 -67058 -145675 -132160 12046 130470 94247 -44316 38012
$$ packed form
16027C1565j21923K115K190O2054o9569Q2769j7050L388Q8354J12180n9660j06436
16015I977M3022n917Q9959m5604n6474p9990r0537j7059J4656m8699j5039n017
16003b06722K402k3114J34200R7734m9967l0192M1407M7996j498M1751J5220J1216
15991H0433O6518m2327Q1951m4794m3654j04703j04268O8105J47206k3384k7422
15980E3661j7155j7461k8024n7188N6879K8503L3049J10104o4515m9388o0517
15969a2052q6235o0054M8764J83472q972n4720K2107r0391l4032o8980m7762j3509
15957b22364j03764O5469J04520L8547J07106N7052n6531m695Q6966r3976j69564
15946a91234J8724Q82o166J10736p8617J3515J44206J18424l6223j38563Q2328
$$ plain form
15935 38012 -132815 -225584 -146174 -101611 -217596 -421829 -475396 -306224 -176169 84898
15925 84898 99102 70839 79881 61786 17555 7209 -21478 -93404 -117110 -281969 -379261 -329400
15913 -329400 -327151 -238023 -100462 -8653 7519 -101405 -80989 -5804 -86251 -91590 -99811 -4198
15901 -4198 87315 79271 121923 3736 -115914 3292 112838 122672 149822 59880 30614
15890 30614 -30020 -22205 -56485 52007 41346 -2325 94378 26865 -14998 87082 61051
15879 61051 38478 -15441 23184 69610 49215 42711 -23432 -52560 -68646 -105598 -120017 -128543
15867 -128543 -25096 -32327 -41112 -23832 -32773 -207829 -236820 -117659 -161134 -142866 81561
15856 81561 243596 166513 64142 11732 -122900 -122205 -209760 -173470 -4522 -77616 -180197
$$ packed form
15935C8012j70827r2769P9410M4563j15985k04233n3567J69172J30055K61067
15925H4898J4204k8263R042j8095m4231j0346k8687p1926k3706j64859r7292M9861
15913c29400K249Q9128J37561R1809J6172j08924K0416P5185q0447n339q221R5613
15901d198R1513q044M2652j18187j19650J19206J09546R834K7150q9942k9266
15890C0614o0634P815l4280J08492j0661m3671R6703o7513m1863J02080k6031
15879F1051k2573n3919L8625M6426k0395o504o6143k9128j6086l6952j4419q526
15867a28543J03447p231q785J7280q941j75056k8991J19161m3475J8268K24427
15856H1561J62035p7083j02371n2410j34632O95q7555L6290J68948p3094j02581
$$ plain form
15845 -180197 -164399 -114801 -210803 -217570 -252039 -187533 -54380 -57420 15933 94754 -5480
15834 -5480 -15970 -27860 75765 -17641 -33687 -48353 -44199 -101717 -57778 90906 110212 84009
15822 84009 177690 166801 139342 153947 -36441 -125863 -167752 -180473 -165110 -177505 -228967
15811 -228967 -130110 -34741 -98378 -207259 -80504 -34986 31698 79542 145262 88444 -26441
15800 -26441 26647 176182 322877 143232 -6823 -108707 -105689 -35716 -51688 46805 27737
15789 27737 -56374 -118804 -48474 9851 59421 -1823 -2790 -74385 87949 206147 167884 12419
15777 12419 85970 65211 -6039 -138776 -149751 -38170 -37784 -72 61509 60360 -19810 11221
15765 11221 64975 102347 159642 236770 52579 -23127 5240 -191670 -233030 -100398 32099
$$ packed form
15845a80197J5798M9598r6002o767l4469O4506J33153l040P3353P8821j00234
15834e480j0490j1890J03625r3406j6046j4666M154n7518M3939J48684J9306k6203
15822H4009R3681j0889k7459J4605j90388q9422m1889j2721J5363j2395n1462
15811b28967R8857R5369o3637j08881J26755M5518O6684M7844O5720n6818j14885
15800b6441N3088J49535J46695j79645j50055j01884L018O9973j5972R8493j9068
15789B7737q4111o2430P0330N8325M9570o1244r67p1595J62334J18198l8263j55465
15777A2419P3551k0759p1250j32737j0975J11581L86L7712O1581j149q0170L1031
15765A1221N3754L7372N7295P7128j84191p5706K8367j96910m1360J32632J32497
$$ plain form
15754 32099 41132 -3616 -31836 -45045 27700 -57535 -33679 -81607 65246 168543 97899
15743 97899 -15089 -96681 11500 55507 125068 21680 -115211 -170450 -127939 -124444 -57896
15732 -57896 -158813 -76526 -38756 -165555 -106909 -89339 -111970 -113185 -123951 -218221 -171590
15721 -171590 -107192 -79979 -50371 19521 56261 9875 3663 -14941 -47377 -108124 -55179 -31142
15709 -31142 -35933 -155602 -215891 -152576 -13559 78525 7045 -186338 -335965 -324409 -356296
15698 -356296 -180281 45708 78164 26623 -68472 -110479 20706 7527 -60847 -123798 -79599
15687 -79599 -246252 -291118 -299495 -117476 99915 173595 17997 -68137 69166 72016 -17414
15676 -17414 -16039 -38926 -9755 2711 97198 247544 360528 304708 119873 34215 -5264
$$ packed form
15754C2099R033m4748k8220j3209P2745q5235K3856m7928J46853J03297p0644
15743I7899j12988q1592J08181M4007O9561j03388j36891n5239M2511L495O6548
15732e7896j00917Q2287L7770j26799N8646J7570k2631j215j0766r4270M6631
15721a71590O4398K7213K9608O9892L6740m6386o212j8604l2436o0747N2945K4037
15709c1142m791j19669o0289O3315J39017R2084p1480j93383j49627J1556l1887
15698c56296J76015K25989L2456n1541r5095m2007J31185j3179o8374o2951M4199
15687g9599j66653m4866q377J82019K17391P3680j55598q6134J37303K850q9430
15676a7414J375k2887K9171J2466R4487J50346J12984n5820j84835q5658l9479
$$ plain form
15665 -5264 -35336 -47946 -90582 -98018 -41380 -40891 -235998 -295288 -226290 -237270 -107144 -50804
15653 -50804 -147711 -168942 -84024 -95113 -135165 -74811 -49566 -176380 -84914 -10296 878
15642 878 -11891 73088 133710 127947 11772 124402 41141 -61976 82100 98714 50844
15631 50844 63850 123660 152939 179600 205652 212121 118814 2012 -87237 16876 106228
15620 106228 69147 37361 14708 -119054 -156787 -59129 29183 -30858 4902 -26081 -49191
15609 -49191 -109560 -11134 134489 85040 11785 -113046 -68318 63013 -5335 -70725 -41529
15598 -41529 4898 16913 113572 132894 234190 128011 40513 -144052 -149213 -35780 62431
15587 62431 33018 -58422 -132842 -253202 -235172 -181905 -151112 -104627 -52143 -50273 -57293 -5674
$$ packed form
15665e264l0072j2610m2636p436N6638M89j95107n9290O8998j0980J30126N6340
15653e0804r6907k1231Q4918j1089m0052O0354K5245j26814R1466P4618J1174
15642H78j2769Q4979O0622n763j16175J12630q3261j03117J44076J6614m7870
15631E0844J3006N9810K9279K6661K6052O469r3307j16802q9249J04113Q9352
15620A06228l7081l1786k2653j33762l7733R7658Q8312o0041L5760l0983k3110
15609d9191o0369R8426J45623m9449p3255j24831M4728J31331o8348o5390K9196
15598d1529M6427J2015R6659J9322J01296j06179q7498j84565n161J13433R8211
15587F2431k9413r1440p4420j20360J8030N3267L0793M6485N2484J870p020N1619
$$ plain form
15575 -5674 -17932 16763 -61402 -123982 -243282 -189720 -162100 -102933 -78758 -214087 -284969
15564 -284969 -275079 -241192 -133502 -101258 1010 -23005 3403 -111323 -32194 51667 94753
15553 94753 72009 -90980 -55880 43840 175623 78607 -42656 -78507 -135723 -148717 -151531
15542 -151531 -256069 -190790 -41785 -12176 -55583 -12237 179843 210092 137584 112918 59747
15531 59747 26929 14790 -65558 -62785 107490 182030 89103 -25694 -20159 -90244 -153440 -158870
15519 -158870 -45210 83984 169843 150681 167309 136054 221803 138191 -8606 -92555 6562
15508 6562 82738 -47995 -203254 -21315 67560 -3336 -106560 -36623 127927 196069 37194
15497 37194 46594 136121 218102 340918 252654 106897 -72104 -51705 -53846 -63083 -108680 -86801
$$ packed form
15575e674j2258L4695p8165o2580j19300N3562K7620N9167K4175j35329p0882
15564b84969R890L3887J07690L2244J02268k4015K6408j14726P9129Q3861M3086
15553I4753k2744j62989L5100R9720J31783r7016j21263l5851n7216j2994k814
15542a51531j04538O5279J49005K9609m3407M3346J92080L0249p2508k4666n3171
15531E9747l2818j2139q0348K773J70275P4540r2927j14797N535p0085o3196n430
15519a58870J13660J29194Q5859j9162J6628l1255Q5749q3612j46797q3949R9117
15508F562P6176j30733j55259J81939Q8875p0896j03224O9937J64550O8142j58875
15497C7194R400Q9527Q1981J22816q8264j45757j79001K0399k141r237m5597K1879
$$ plain form
15485 -86801 -2104 59637 5097 -69172 31508 69338 98515 -18081 -143769 -74566 -56737
15474 -56737 -86743 -103760 -85075 -79106 -172173 -191451 -103557 -56959 33617 -71171 -143617 14324
15462 14324 -22304 46117 103620 96615 48597 -29643 -34849 -2366 -50555 -60443 -126739 -98460
15450 -98460 66874 305917 309270 205245 68292 -8438 9875 60875 -3861 -70592 -236799
15439 -236799 -324104 -322419 -232947 -94745 29004 66670 89635 64114 29440 -35919 -55532
15428 -55532 -41014 122901 190107 114574 104589 107347 10811 79175 91833 122116 104941 104005
15416 104005 151355 145635 45354 148274 142315 6018 -45390 -10263 8555 -125316 -175760
15405 -175760 -92874 -78334 11713 89179 15304 -2320 -857 -126085 -94236 -142332 -153074
$$ packed form
15485h6801Q4697O1741n4540p4269J00680L7830K9177j16596j25688O9203J7829
15474e6737l0006j7017J8685N969r3067j9278Q7894M6598R0576j04788p2446J57941
15462A4324l6628O8421N7503p005m8018p8240n206L2483m8189r888o6296K8279
15450i8460J65334K39043L353j04025j36953p6730J8313N1000o4736o6731j66207
15439b36799q7305J685Q9472J38202J23749L7666K2965k5521l4674o5359j9613
15428e5532J4518J63915O7206p5533r985K758r6536O8364J2658L0283j7175r36
15416A04005M7350n720j00281J02920n959j36297n1408L5127J8818j33871n0444
15405a75760Q2886J4540R0047P7466p3875j7624J463j25228L1849m8096j0742
$$ plain form
15394 -153074 -149857 -196304 18749 228045 161859 140630 205476 93715 -5669 -68279 -64296
15383 -64296 -83916 -107729 -112854 -25750 162889 174732 92053 59414 9259 64951 145288 151236
15371 151236 171603 103243 17682 -21752 -51076 -143768 -1407 124178 -11567 -177519 -16700
15360 -16700 26907 29386 126900 139017 192627 161434 174864 143847 42046 19311 -57402 14398
15348 14398 232243 204742 150647 112328 123203 82857 83928 101514 77753 37791 196754
15337 196754 221567 49110 -128367 -171050 -138989 78997 276325 126642 37257 55944
15327 55944 -47978 10307 147966 186961 131108 133683 93121 -74117 -72728 43936 80248
15316 80248 49736 -50785 -50313 -45823 -89324 -16347 -33892 -32692 -77019 -81230 -88139 -473 170873
$$ packed form
15394a53074L217m6447K15053K09296o6186k1229O4846j11761r9384o2610L983
15383f4296j9620k3813n125Q7104J88639J1843q2679l2639n0155N5692Q0337N948
15371A51236K0367o8360q5561l9434k9324r2692J42361J25585j35745j65952J60819
15360a6700M3607K479R7514J2117N3610l1193J3430l1017j01801k2735p6713P1800
15348A4398K17845k7501n4095l8319J0875m0346J071J7586k3761l9962J58963
15337A96754K4813j72457j77477m2683L2061K17986J97328j49683q9385J8687
15327E5944j03922N8285J37659L8995n5853K575m0562j67238J389J16664L6312
15316H0248l0512j00521M72M490m3501P2977j7545J200m4327m211o909Q7666J71346
$$ plain form
15303 170873 161009 197594 203582 232380 187690 7752 -185406 -175956 -139747 -257713 -307635
15292 -307635 -207361 -87383 -51020 418 76079 113774 104553 15033 198847 164949 52144
15281 52144 136674 93853 -5460 72068 160425 243031 257112 229064 216804 154397 209159 133407
15269 133407 41204 -63548 -62331 -38982 -221967 -181636 -155844 -164375 -24014 101440 221102
15258 221102 279892 225754 131695 102032 31420 46201 -51543 -76159 -224117 -194859 -190066
15247 -190066 -72133 -108751 -176238 -266113 -215620 -310082 -316972 -317606 -314060 -255970 -230348 -241317
15235 -241317 -217682 -21001 34451 51841 156326 239894 306790 354939 243393 108850 161395
15224 161395 199947 143317 -30740 29744 269674 232204 -8086 -76065 48222 -35078 31647
$$ packed form
15303A70873r864L6585N988K8798m4690j79938j93158R450L6209j17966m9922
15292c07635J00274J19978L6363N1438P5661L7695r221q9520J83814l3898j12805
15281E2144Q4530m2821r9313P7528Q8357Q2606J4081k8048j2260o2407N4762p5752
15269A33407r2203j04752J217K3349j82985M0331K5792q531J40361J25454J19662
15258B21102N8790n4138r4059k9663p0612J4781r7744k4616j47958K9258M793
15247a90066J17933l6618o7487q9875N0493r4462o890o34L546N8090K5622j0969
15235b41317K3635J96681N5452J7390J04485Q3568O6896M8149j11546j34543N2545
15224A61395L8552n6630j74057O0484K39930l7470k40290o7979J24287q3300O6725
$$ plain form
15213 31647 15625 97448 99216 66912 115372 152029 24156 -156561 -173646 -136562 29586
15202 29586 63502 67382 153164 228165 286159 245204 152134 154313 247913 283013 267677 165028
15190 165028 31039 100500 79966 54824 -42502 -128539 -184587 -64648 -83190 -214591 -222919
15179 -222919 -246655 -130137 5858 5334 110893 51930 -36926 -52709 -46400 -194321 -209602
15168 -209602 -43630 -93177 -124967 -50234 -163245 -320494 -321007 -238272 -194512 -207347 -97977
15157 -97977 43637 136037 152275 172877 216033 193933 107774 -52243 -14884 -6241 -7129 86794
15145 86794 217082 253744 223227 164451 102717 122291 99446 67533 89811 107937 -26828
15134 -26828 -151735 -176816 -23157 -34303 12991 77377 69509 -83802 -210804 -144690 -233169
$$ packed form
15213C1647j6022Q1823J768l2304M8460L6657j27873j80717j7085L7084J66148
15202B9586L3916L880Q5782P5001N7994m0955r3070K179R3600L5100j5336j02649
15190A65028j33989O9461k0534k5142r7326q6037n6048J19939j8542j31401q328
15179b22919k3736J16518J35995n24J05559n8963q8856j5783O309j47921j5281
15168b09602J65972m9547l1790P4733j13011j57249n13Q2735M3760j2835J09370
15157i7977J41614R2400J6238K0602M3156k2100q6159j60017L7359Q643q88R3923
15145H6794J30288L6662l0517n8776o1734J9574k2845l1913K2278J8126j34765
15134b6828j24907k5081J53659j1146M7294O4386p868j53311j27002O6114q8479
$$ plain form
15123 -233169 -225211 26517 256432 298574 106838 -40559 -56075 -34720 46571 113138 131790
15112 131790 72427 83163 1967 38367 77948 51356 28561 36051 149736 84127 97999
15101 97999 44922 18242 11276 41873 136637 212813 179973 169864 193672 235068 193738 135202
15089 135202 103721 -92718 -108994 -112966 -64885 -71097 11963 68656 71477 103239 112591 49922
15077 49922 -41439 -94398 -81059 -138552 -24384 44774 24465 -29136 99030 224851 88522
15066 88522 33340 84021 165080 146522 132245 105417 144378 188850 130111 84861 65222 -20617
15054 -20617 -48618 40131 114229 82529 -44541 -126314 -100643 51322 160994 218399 278761
15043 278761 397339 337863 102014 44612 52692 -44627 -67074 -41972 -47332 -54064 6501 -18792
$$ packed form
15123b33169P958K51728K29915M2142j91736j47397j5516K1355Q1291O6567J8652
15112A31790n9363J0736q1196L6400L9581k6592k2795P490J13685o5609J3872
15101I7999n3077k6680o966L0597R4764P6176l2840j0109K3808M1396m1330n8536
15089A35202l1481j96439j6276l972M8081o212Q3060N6693K821L1762R352o2669
15077D9922r1361n2959J3339n7493J14168O9158k0309n3601J28166J25821j36329
15066H8522n5182N0681Q1059j8558j4277k6828L8961M4472n8739m5250j9639q5839
15054b0617k8001Q8749P4098l1700j27070q1773K5671J51965J09672N7405O0362
15043B78761J18578n9476k35849n7402Q080r7319k2447K5102n360o732O0565k5293
$$ plain form
15031 -18792 -55259 63982 118665 116932 76796 76252 -51897 -173077 -220843 -151695 -181658 -106307
15019 -106307 54447 176761 179229 38168 132469 67439 -7928 12376 -119865 -104120 -27577
15008 -27577 -46639 -154382 -109636 -71220 -16744 -70961 -16697 206031 231189 135047 204507
14997 204507 149807 156399 59749 -33616 22310 170970 230716 38362 -41116 -62110 -58642
14986 -58642 3431 58677 97584 -7244 -159876 28744 122406 167693 130999 102657 36736
14975 36736 62711 117773 115134 141784 197635 165040 36940 16815 -29632 -36240 34070 64444
14963 64444 70888 87358 23467 -59500 13330 13695 -60483 -170312 -98189 106547 144232 108236
14951 108236 144460 107142 186202 96999 222477 332965 241025 134925 -30937 -168040
$$ packed form
15031a8792l6467J19241N4683j733m0136n44j28149j21180m7766O9148k9963P5351
15019a06307J60754J22314K468j41061R4301o5030p5367K0304j32241J5745P6543
15008b7577j9062j07743M4746L8416N4476n4217N4264K22728K5158r6142O9460
14997B04507n4700O592r6650r3365N5926J48660N9746j92354p9478k0994L468
14986e8642O2073N5246L8907j04828j52632J88620R3662M5287l6694k8342o5921
14975C6736K5975N5062k639K6650N5851l2595j28100k0125m6447o608P0310L0374
14963F4444O444J6470o3891q2967P2830L65p4178j09829P2123K04736L7685l5996
14951A08236L6224l7318P9060q9203J25478J10488r1940j06100j65862j37103
$$ plain form
14941 -168040 -162251 -75575 480 101022 87773 58517 68362 -34356 4226 93174 394
14930 394 -138353 -206578 -269135 -121724 36592 -59629 -53599 100520 214962 171248 55478
14919 55478 4637 41771 116152 159237 317925 428908 232143 34982 65518 185962 101834
14908 101834 32753 -31981 -195252 -253882 -266512 -102222 42380 -15077 -89652 59891 22388
14897 22388 -62088 -56977 8245 31801 118863 96801 28980 93146 228896 227063 338765 257912
14885 257912 59806 -2835 -7833 52942 136083 156063 167921 168053 5791 -55474 95690
14874 95690 219020 233948 223137 96738 -34995 -18454 58192 111145 104309 16191 -38669
14863 -38669 51196 134313 286923 251827 175658 54784 182712 151894 72350 53529 142079
$$ packed form
14941a68040N789Q6676P6055J00542j3249k9256R845j02718L8582Q8948r2780
14930C94j38747o8225o2557J47411J58316r6221O030J54119J14442m3714j15770
14919E5478n0841L7134P4381M3085J58688J10983j96765j97161L0536J20444q4128
14908A01834o9081o4734j63271n8630j2630J64290J44602n7457p4575J49543l7503
14897B2388q4476N111O5222K3556Q7062k2062o7821O4166J35750j833J11702q0853
14885B57912j98106o2641m998O0775Q3141J9980J1858J32j62262o1265J51164
14874I5690J23330J4928j0811j26399j31733J6541P6646N2953o836q8118n4860
14863c8669Q9865Q3117J52610l5096p6169j20874J27928l0818p9544j8821Q8550
$$ plain form
14852 142079 75152 40466 17205 -1272 8664 -70437 -119408 -97762 -35285 -49276 -21216 -9414
14840 -9414 28297 119526 131039 66626 42465 -59159 109986 247668 145162 116673 165726
14829 165726 70943 119985 89279 -384 -72908 -115947 -161782 -96386 -79135 -91057 42507
14818 42507 209196 228313 105182 89065 13860 -46163 58717 146590 209575 196330 120799
14807 120799 58446 -114033 -147634 -113388 66910 83887 57306 -49504 -200429 -315239
14797 -315239 -401718 -160798 -45943 60374 120671 47180 26383 -5556 51634 171790 256984
14786 256984 316898 359203 300231 168048 -65685 -59969 -105780 -83246 -81668 -8559 -57802
14775 -57802 -33224 55395 117576 82430 83033 106481 255595 269756 263124 186353 232844 263994
$$ packed form
14852A42079o6927l4686k3261j8477R936p9101m8971K1646O2477j3991K8060J1802
14840i414L7711R1229J1513o4413k4161j01624J69145J37682j02506k8489M9053
14829A65726r4783M9042l0706q9663p2524m3039m5835O5396J7251j1922J33564
14818D2507J66689J9117j23131j6117p5205o0023J04880Q7873O2985j3245p5531
14807A20799o2353j72479l3601L4246J80298J6977k6581j06810j50925j14810
14797c15239q6479K40920J14855J06317O0297p3491k0797l1939N7190J20156Q5194
14786B56984N9914M2305n8972j32183k33733N716m5811K2534J578P3109m9243
14775e7802K4578Q8619O2181l5146O03K3448J49114J4161o632p6771M6491L1150
$$ plain form
14763 263994 198633 215495 133946 -5475 65636 72051 -46097 16164 -44775 -94064 570
14752 570 49539 -51376 -50997 69878 198490 234435 161553 147853 252328 125156 14370
14741 14370 -43327 -85606 -139351 -95723 22742 125179 115733 128632 138543 238660 178609
14730 178609 115854 -26434 -44568 -51967 97322 142298 96606 119361 270820 62878 132250
14719 132250 116936 48443 -121223 42630 66981 50995 65035 159897 49273 5277 27739
14708 27739 85326 28582 8779 38951 706 -79193 -52613 57135 -786 36464 -27903
14697 -27903 -86456 -49084 -26820 43345 172576 266166 296290 265848 201268 179587 208764
14686 208764 61206 -23856 -36424 -94444 -179860 -153429 -100855 -145299 -13566 49192 26652
$$ packed form
14763B63994o5361J6862q1549j39421P1111O415j18148O2261o0939m9289R4634
14752E70M8969j00915L79J20875J28612L5945p2882j3700J04475j27172j10786
14741A4370n7697m2279n3745M3628J18465J02437r446J2899R911J00117o0051
14730A78609o2755j42288j8134p399J49289M4976m5692K2755J51459k07942O9372
14719A32250j5314o8493j69666J63853K4351j5986J4040R4862j10624m3996K2462
14708B7739N7587n6744j9803L0172l8245p9899K6580J09748n7921L7250o4367
14697b7903n8553L7372K2264P0165J29231R3590L0124l0442o4580k1681K9177
14686B08764j47558q5062j2568n8020q5416K6431N2574m4444J31733O2758k2540
$$ plain form
14675 26652 -76277 -154337 -90295 -65625 51997 52837 156149 208385 223708 258379 247841
14664 247841 20090 -70724 58989 80488 55460 -10077 28133 13316 51272 -45608 -60442
14653 -60442 -8291 35995 39008 -39302 -45146 -63081 -74598 43511 156848 209382 138922 70257
14641 70257 63365 125689 172385 160982 258106 346428 334252 230268 265668 239820 89234
14630 89234 103131 104860 100972 116344 133719 341541 450615 357918 333677 259227 93060
14619 93060 79274 107989 231196 199538 125186 74052 32754 -21072 -104305 -28046 98707
14608 98707 128192 158180 211094 210176 53606 -17661 -81346 -193610 -116466 -125246 -83412 -559
14596 -559 24481 121886 149759 104835 78043 122596 79068 127762 202672 90565 69603 131907
$$ packed form
14675B6652j02929p8060O4042K4670J17622Q40J03312N2236J5323L4671j0538
14664B47841k27751r0814J29713K1499k5028o5537L8210j4817L7956r6880j4834
14653f0442N2151M4286L013p8310n844j7935j1517J18109J13337N2534p0460o8665
14641G0257o892O2324M6696j1403R7124Q8322j2176j03984L5400k5848j50586
14630H9234J3897J729l888J5372J7375K07822J09074r2697k4241p4450j66167
14619I3060j3786K8715J23207l1658p4352n1134m1298n3826q3233P6259J26753
14608I8707K9485K9988N2914r18j56570p1267o3685j12264P7144q780M1834Q2853
14596e59K5040R7405K7873m4924k6792M4553m3528M8694P4910j12107k0962O2304
$$ plain form
14584 131907 248370 162784 131814 164592 110083 131194 22207 -64740 -49586 60065 20592
14573 20592 -31044 -146081 -119647 22240 -31849 -133984 -134634 -29388 170707 293837 219227
14562 219227 83324 -112966 -144551 1235 78898 120080 65905 257667 304289 140009
14552 140009 99616 88986 14126 66027 53827 40636 20204 106648 103374 141676 219732 72010
14540 72010 -171175 -127707 146205 102551 -181333 -202715 40154 170684 143770 246498
14530 246498 151580 -115483 -90904 -3546 82151 42418 51759 35109 11393 128812 163312
14519 163312 149867 202659 190852 92180 -105153 -175258 -136973 -41207 61484 89392 56165
14508 56165 -35058 -16769 14208 -19865 63983 111183 89468 131426 209644 63867 72768 65551
$$ packed form
14584A31907J16463q5586l0970L2778n4509K1111j08987q6947J5154J09651l9473
14573B0592n1636j15037K6434J41887n4089j02135o50J05246K00095J23130p4610
14562B19227j35903j96290l1585J45786P7663M1182n4175J91762M6622j64280
14552A40009m0393j0630p4860N1901j2200j3191k0432Q6444l274L8302P8056j47722
14540G2010k43185M3468K73912m3654k83884k1382K42869J30530k6914J02728
14530B46498r4918k67063K4579Q7358Q5697l9733R341j6650k3716J17419L4500
14519A63312j3445N2792j1807r8672j97333p0105L8285R5766J02691K7908l3227
14508E6165r1223J8289L0977l4073Q3848M7200k1715M1958P8218j45777Q901p217
$$ plain form
14496 65551 70788 97270 94202 -11302 38198 44028 19069 273330 352924 419818 413248 344485
14484 344485 143560 81523 39118 86505 84535 158050 305388 381290 320924 165503 118167
14473 118167 174398 229326 168502 123294 143351 161082 191384 252018 201417 201204 313186 327057
14461 327057 309629 294304 322093 339805 364051 355011 241024 -387 -77920 88981 277680
14450 277680 290477 179501 163948 275187 313953 273088 172694 80062 93473 156327 159182
14439 159182 154950 63443 172657 201334 213065 255114 232946 87086 130684 221889 282367
14428 282367 261744 278337 249346 230040 93912 -4812 -72373 -48509 -9015 -85496 30201
14417 30201 156375 272702 305875 207865 102726 69003 74494 197214 195405 280544 226636
$$ packed form
14496F5551N237K6482l068j05504M9500N830k4959K54261P9594O6894o570o8763
14484C44485k00925o2037m2405M7387j970P3515J47338P5902o0366j55421m7336
14473A18167N6231N4928o0824m5208K0057J7731L0302O0634n0601k13J11982J3871
14461C27057j7428j5325K7789J7712K4246r040j13987k41411p7533J66901J88699
14450B77680J2797j10976j5553J11239L8766m0865j00394r2632J3411O2854K855
14439A59182m232r1507J09214K8677J1731M2049k2168j45860M3598R1205O0478
14428B82367k0623J6593k8991j9306j36128r8724o7561K3864L9494p6481J15697
14417C0201J26174J16327L3173r8010j05139l3723N491J22720j809Q5139n3908
$$ plain form
14406 226636 156063 174907 310228 378343 393076 236797 144127 206451 187691 43465 142521
14395 142521 354079 303051 202373 107158 -26842 64477 84586 107044 141321 133600 191080
14384 191080 339286 396411 343716 307921 328932 332855 324289 201262 98112 147605 86190
14373 86190 -35689 -86314 -23002 1077 165473 95994 -103513 -112080 -3450 52529 -98511
14362 -98511 -107562 282 30456 1642 197190 279045 263346 214609 173265 159674 222944
14351 222944 205485 62213 111305 108180 104123 198162 96064 114494 259363 155120 86290
14340 86290 67274 -55470 -49819 -136424 -78397 142715 200308 293126 110159 -127254 45512
14329 45512 294548 396404 247378 170645 288270 322255 178566 89261 67 124532
$$ packed form
14406B26636p0573J8844J35321O8115J4733j56279r2670O2324j8760j44226R9056
14395A42521K11558n1028j00678r5215j34000R1319K0109K2458L4277p721N7480
14384A91080J48206N7125n2695l5795K1011L923q566j23027j03150M9493o1415
14373H6190j21879n0625O3312K4079J64396o9479j99507q567J08630N5979j51040
14362i8511r051J07844L0174k8814J95548Q1855j5699m8737m1344j3591O3270
14351B22944j7459j43272M9092l125m057R4039j02098J8430J44869j04243o8830
14340H6290j9016j22744N651q6605N8027K21112N7593R2818j82967k37413J72766
14329D5512K49036J01856j49026p6733J17625L3985j43689q9305q9194J24465
$$ plain form
14319 124532 250917 140322 93498 146181 250624 377740 322674 173341 188409 185625 231682
14308 231682 216086 71034 -51993 -37691 163965 335369 343881 297813 257435 219960 202725
14297 202725 207229 409993 386309 353172 473479 460984 354656 212277 35492 -57175 -16729
14286 -16729 12286 54315 79724 67727 76615 158477 231746 262490 253240 234974 160947 87977
14274 87977 143648 152084 3364 -37225 25660 106064 169269 129413 144393 163543 141908 247079
14262 247079 207697 150588 70977 30803 99965 170798 290757 348419 166626 3754 -20172
14251 -20172 -33587 42025 268489 354267 259883 330867 456268 457397 393375 357438 242589
14240 242589 234099 276185 190036 132461 193163 241598 263708 292405 290666 312859 296605 324133
$$ packed form
14319A24532J26385j10595m6824N2683J04443J27116n5066j49333J5068k784M6057
14308B31682j5596j45052j23027J4302K01656J71404Q512m6068m0378l7475j7235
14297B02725M504K02764k3684l3137J20307j2495j06328j42379j76785r2667M0446
14286a6729K9015M2029K5409j1997Q888Q1862P3269L0744r250j8266p4027p2970
14274H7977N5671Q436j48720m0589O2885Q0404O3205l9856J4980J9150k1635J05171
14262B47079l9382n7109p9611m0174O9162P0833J19959N7662j81793j62872k3926
14251b0172j3415P5612K26464Q5778r4384P0984J25401J129o4022l5937j14849
14240B42589q490M2086q6149n7575O0702M8435K2110K8697j739K2193j6254K7528
$$ plain form
14228 324133 321040 226515 243692 91139 -58881 16717 166950 77261 149386 244426 202363
14217 202363 23036 94609 257262 290727 163953 70583 81213 139333 144572 51702 33804
14206 33804 34798 106485 142554 83412 179303 250134 222020 255439 282762 337589 299620 351808
14194 351808 308538 202604 163447 250320 337802 418860 382988 371077 378064 266182 192518
14183 192518 164979 142262 208898 163663 119943 157589 296371 223623 213121 176581 284657
14172 284657 377082 244857 134390 125340 107488 109349 306086 494915 538324 418972 306002
14161 306002 157339 78172 -30208 38332 95288 34916 19048 126831 284317 364538 364357
14150 364357 374984 337874 354254 370555 308354 343906 402607 292835 257720 228344 281537
$$ packed form
14228C24133l093r4525J7177j52553j50020P5598J50233q9689P2125R5040m2063
14217B02363j79327P1573J62653L3465j26774r3370J0630N8120N239r2870j7898
14206C3804R94P1687L6069n9142R5891P0831k8114L3419K7323N4827l7969N2188
14194C51808m3270j05934l9157Q6873Q7482Q1058l5872j1911O987j11882p3664
14183A92518k7539k2717O6636m5235m3720L7646J38782p2748j0502l6540J08076
14172B84657R2425j32225j10467r050j7852J861J96737J88829M3409j19352j12970
14161C06002j48663p9167j08380O8540N6956o0372j5868J07783J57486Q0221j81
14150C64357J0627l7110J6380J6301o2201L5552N8701j09772l5115k9376N3193
$$ plain form
14139 281537 370447 234848 127396 217419 332389 341694 343261 302852 41814 212712 351748
14128 351748 419368 427225 351469 294723 163455 216254 292469 214549 264352 234091 291573
14117 291573 458909 373756 204900 107313 99711 10480 102272 163365 135715 251687 283865
14106 283865 287874 204362 189646 181500 257826 206423 139087 -25610 60018 98357 135274 152234
14094 152234 129283 221969 104250 103650 285071 356545 172841 57503 -29083 -115652 8778
14083 8778 172 119064 284979 188807 202017 211468 352993 341942 286595 366578 349236 317310
14071 317310 293436 384902 365203 437639 352240 382304 381918 291281 264749 235552 145441 51185
14059 51185 176287 252369 295324 293992 216032 42878 176096 331026 369534 279624 200130
$$ packed form
14139B81537Q8910j35599j07452R0023J14970R305J567m0409k61038J70898J39036
14128C51748O7620P857p5756n6746j31268N2799P6215p7920M9803l0261N7482
14117B91573J67336q5153j68856r7587p602q9231R1792O1093k7650J15972L2178
14106B83865M009q3512j4716q146P6326n1403o7336j64697Q5628L8339L6917J6960
14094A52234k2951R2686j17719o00J81421P1474j83704j15338q6586q6569J24430
14083H778q606J18892J65915r6172J3210R451J41525j1051n5347P9983j7342l1926
14071C17310k3874R1466j9699P2436q5399L0064l86r0637k6532k9197r0111r4256
14059E1185J25102P6082M2955j332p7960j73154J33218J54930L8508q9910p9494
$$ plain form
14048 200130 276378 306214 260371 282701 319437 280706 186348 136376 123574 95268 179209
14037 179209 119385 68024 -12658 -70589 45910 188046 98011 -13522 150059 283858
14027 283858 240524 176759 264271 387778 323053 298273 259669 354674 274312 182706 194774
14016 194774 161626 245939 275892 118485 98621 228822 278749 354523 521904 555931 385746
14005 385746 233418 98454 204649 266050 246259 316570 280687 198686 246326 262772 288291
13994 288291 356962 438590 475993 520938 615048 511406 318242 253728 349551 361885 252355
13983 252355 295670 277648 226170 209553 225474 214064 262270 299859 312744 327670 485339
13972 485339 471157 520560 563021 482384 427269 180949 141539 279941 335734 260651 251814
$$ packed form
14048B00130P6248K9836m5843K2330L6736l8731r4358m9972j2802k8306Q3941
14037A79209n9824n1361q0682n7931J16499J42136r0035j11533J63581J33799
14027B83858m3334o3765Q7512J23507o4725k4780l8604R5005q0362r1606J2068
14016A94774l3148Q4313K9953j57407j9864J30201M9927P5774J67381L4027j70185
14005C85746j52328j34964J06195O1401j9791P0311l5883q2001M7640J6446K5519
13994B88291O8671Q1628L7403M4945R4110j03642j93164o4514R5823J2334j09530
13983B52355M3315j8022n1478j6617J5921j1410M8206L7589J2885J4926J57669
13972D85339j4182M9403M2461q0637n5115k46320l9410J38402N5793p5083q837
$$ plain form
13961 251814 333513 432356 592590 601786 558683 454483 480363 532887 561506 446744 359963
13950 359963 397929 417101 391031 392690 427355 384534 296565 337500 446409 218745 160466
13939 160466 245657 146632 141560 315865 336357 296509 349149 382160 307064 218590 275882
13928 275882 388200 351512 432400 456266 513520 574057 497213 443962 493577 657594 596515
13917 596515 455141 388181 402048 434215 424800 527461 446530 383798 329368 234954 248701
13906 248701 182527 36437 86937 317550 444557 460762 403878 380841 465548 505754 511747
13895 511747 318513 93316 179189 300857 475064 471934 469904 424857 368824 244803 163773
13884 163773 198839 266767 272471 269074 344948 419883 364838 413965 415196 436898 422349 359191
$$ packed form
13961B51814Q1699R8843J60234R196m3103j04200K5880N2524K8619j14762q6781
13950C59963L7966J9172k6070J659L4665m2821q7969M0935J08909k27664n8279
13939A60466Q5191r9025n072J74305K0492l9848N2640L3011p5096q8474N7292
13928B75882J12318l6688Q0888K3866N7254O0537p6844n3251M9615J64017o1079
13917E96515j41374o6960J3867L2167r415J02661q0931o2732n4430r4414J3747
13906B48701o6174j46090N0500K30613J27007J6205n6884k3037Q4707M0206N993
13895E11747j93234k25197Q5873J21668J74207l130k030m5047n6033j24021q1030
13884A63773L5066O7928N704l397P5874P4935n5045M9127J231K1702j4549o3158
$$ plain form
13872 359191 246686 339517 524914 421038 375210 452099 453093 410977 438054 412524 402917
13861 402917 351426 368498 566262 468270 469594 524897 438303 300061 299370 362249 268168 277802
13849 277802 188014 143816 225179 290848 283749 319516 242265 225935 329350 299366 346653
13838 346653 404648 464431 544402 528937 407629 409774 410658 352787 314490 236710 246690 237149
13826 237149 339914 439510 360649 323123 461947 490194 430691 370903 393978 326283 282384
13815 282384 354305 446413 410973 459601 431495 255897 173446 272320 316523 380901 275208
13804 275208 232949 271642 278747 230522 221733 234976 251154 216418 290518 292318 373623 482087
13792 482087 461441 441256 536958 571456 493568 393945 422258 352702 395691 556690 496899
$$ packed form
13872C59191j12505R2831J85397j03876m5828P6889R94m2116K7077k5530r607
13861D02917n1491J7072J97764r7992J324N5303q6594j38242o91O2879r4081R634
13849B77802q9788m4198Q1363O5669p099L5767p7251j6330J03415k9984M7287
13838C46653N7995N9783P9971j5465j21308K145Q84n7871l8297p7780R980r541
13826B37149J02765R9596p8861l7526J38824K8247n9503n9788K3075o7695m3899
13815B82384P1921R2108l5440M8628k8106j75598q2451R8874M4203O4378j05693
13804B75208m2259L8693P105m8225q789J3243J6178l4736P4100J800Q1305J08464
13792D82087k0646k0185R5702L4498p7888r9623K8313o9556M2989J60999n9791
$$ plain form
13781 496899 473103 472948 503059 484575 455493 343303 159693 47507 243143 533276 594620
13770 594620 584651 453781 445672 432343 410009 326519 349936 481440 480237 529267 569181 511511
13758 511511 557993 580970 598971 574191 504930 555238 552167 563514 495225 475721 391084 450726
13746 450726 501839 340102 369746 452298 323846 192473 271926 361904 468186 507301 460300
13735 460300 463772 501206 434523 454835 532278 537624 503744 431741 410129 445160 455182 533940
13723 533940 534901 508657 464509 448316 451969 484297 372998 380771 506892 506597 525415 479514
13711 479514 408348 441252 546154 514684 444982 294742 320791 458555 497090 367297 427942
13700 427942 440260 504208 413860 390321 466578 512991 419772 542452 635965 497731 375980
$$ packed form
13781D96899k3796j55L0111j8484k9082j12190j83610j12186J95636K90133O1344
13770E94620r969j30870q109j3329k2334q3490K3417J31504j203M9030L9914n7670
13758E11511M6482K2977J8001k4780o9261N0308l071J1347o8289j9504q4637N9642
13746D50726N1113j61737K9644Q2552j28452j31373P9453Q9978J06282L9115m7001
13735D60300L472L7434o6683K0312P7443N346l3880p2003k1612L5031J0022P8758
13723E33940R61k6244m4148j6193L653L2328j11299P773J26121k95J8818m5901
13711D79514p1166L2904J04902l1470o9702j50240K6049J37764L8535j29793O0645
13700D27942J2318O3948r0348k3539P6257M6413r3219J22680R3513j38234j21751
$$ plain form
13689 375980 345008 443889 473901 482172 495583 414712 409967 431208 348967 349569 326624 368385
13677 368385 449742 445917 500376 465012 446964 383767 284785 299136 246023 278804 374063 392871
13665 392871 263328 290532 358737 428188 297155 314263 388004 514299 442202 340088 260897
13654 260897 283782 359328 553067 633850 658526 703752 778619 637597 478109 406801 456961
13643 456961 533205 463932 401849 380082 411589 431101 391103 298603 344299 335418 335837 341048
13631 341048 382734 357026 286343 225285 262354 261835 261214 398312 391902 355262 443164 492784
13619 492784 538763 413919 322995 359323 458057 486262 444571 428824 424781 526142 561140
13608 561140 482048 446049 484905 590893 583338 516750 475566 555220 618792 595828 541643
$$ packed form
13689C75980l0972R8881L0012Q271J3411q0871m745K1241q2241O02k2945M1761
13677C68385Q1357l825N4459l5364j8048o3197r8982J4351n3113L2781R5259J8808
13665C92871j29543K7204O8205O9451j31033J7108P3741J26295p2097j02114p9191
13654B60897K2885P5546J93739Q0783K4676M5226P4867j41022j59488p1308N0160
13643D56961P6244o9273o2083k1767L1507J9512l9998r2500M5696q881M19N211
13631C41048M1686k5708p0683o1058L7069n19o21J37098o410l6640Q7902M9620
13619D92784M5979j24844r0924L6328R8734K8205m1691j5747m043J01361L4998
13608E61140p9092l5999L8856J05988p555o6588m1184P9654O3572k2964n4185
$$ plain form
13597 541643 531553 427826 387196 390451 533235 656306 660363 816806 795716 655826 539283
13586 539283 496786 458559 498086 602622 534830 437042 394098 332756 336768 265559 367037
13575 367037 356079 351302 326004 344609 454275 544693 542679 554087 472915 538210 534460 523104
13563 523104 658757 736339 804189 800107 621342 501790 492416 552801 521369 408315 381989
13552 381989 442348 436020 363393 503820 577230 723040 826957 759988 711843 558283 539284
13541 539284 534518 459697 502077 547293 484360 522271 485761 378420 378042 373816 386093 446813
13529 446813 449871 590180 669098 576532 401763 374857 501267 553099 567772 512091 456885
13518 456885 445333 406892 328491 274738 344859 392385 439825 489953 498421 488393 469109 390201
$$ packed form
13597E41643j0090j03727m0630L255J42784J23071M057J56443k1090j39890j16543
13586E39283m2497l8227L9527J04536o7792r7788m2944o1342M012p1209J01478
13575C67037j0958m777k5298J8605J09666R0418k014J1408q1172O5295l750j1356
13563E23104J35653P7582O7850m082j78765j19552r374O0385l1432j13054k6326
13552C81989O0359o328p2627J40427P3410J45810J03917o6969m8145j53560j8999
13541E39284m766p4821M2380M5216o2933L7911l6510j07341l78m226J2277O0720
13529D46813L058J40309P8918r2566j74769k6906J26410N1832J4673n5681n5206
13518D56885j1552l8441p8401n3753P0121M7526M7440N0128Q468j0028j9284p8908
$$ plain form
13506 390201 391149 487944 515628 465347 478204 612438 665896 526220 420113 321907 327634
13495 327634 302635 434107 597039 636902 701470 619825 454393 567818 757786 720617
13485 720617 601919 585266 579865 441056 452410 545986 645565 703055 786685 738713 682085
13474 682085 572991 657233 669748 711840 633120 697371 658950 567729 480889 594959 737858
13463 737858 652987 542502 490019 541221 531810 499763 482907 520274 670531 799939 675149
13452 675149 535266 487832 418736 567369 684889 621899 590720 661865 701657 729845 667339
13441 667339 670179 732614 603795 597522 579756 527951 554185 644128 526195 500983 570603
13430 570603 622304 547073 563204 620356 658230 787263 744560 667001 585505 597643 585512
$$ packed form
13506C90201R48R6795K7684n0281J2857J34234N3458j39676j06107r8206N727
13495C27634k4999J31472J62932L9863O4568q1645j65432J13425J89968l7169
13485G20617j18698j6653n401j38809J1354R3576R9579N7490Q3630m7972n6628
13474F82085j09094Q4242J2515M2092p8720O4251l8421r1221q6840J14070J42899
13463G37858q4871j10485n2483N1202r411l2047j6856L7367J50257J29408j24790
13452F75149j39883m7434o9096J48633J17520o2990l1179P1145L9792K8188o2506
13441F67339K840O2435j28819o273j7766n1805K6234Q9943j17933k5212O9620
13430E70603N1701p5231J6131N7152L7874J29033m2703p7559q1496J2138j2131
$$ plain form
13419 585512 634637 679053 545392 601002 785497 789187 745811 613808 567011 535156 512540
13408 512540 547558 619563 618976 605848 589993 617405 753030 712839 543662 372062 420869
13397 420869 447957 511061 720627 838866 613661 483981 598762 631750 596584 643420
13387 643420 706647 762297 802859 739778 615871 713162 756300 820350 917417 864457 760561
13376 760561 714271 812339 795595 710961 633673 670282 713903 754511 647056 646790 697850 813847
13364 813847 763645 703501 725176 784644 764127 704836 740433 739534 723741 599828 543095 595123
13352 595123 482131 447479 572106 586548 513281 576294 692482 735229 646132 534823 595236
13341 595236 661339 687260 824612 853497 838262 728870 790374 895529 886886 775531 787050
$$ packed form
13419E85512M9125M4416j33661N5610J84495L690m3376j32003m6797l1855k2616
13408E12540L5018P2005n87j3128j5855K7412J35625m0191j69177j71600M8807
13397D20869K7088O3104K09566J18239k25205j29680J14781L2988l5166M6836
13387F43420O3227N5650M0562o3081j23907R7291M3138O4050R7067n2960j03896
13376G60561m6290R8068j6744q4634p7288L6609M3621M0608j07455k66N1060J15997
13364H13847n0202o0144K1675N9468k0517n9291L5597q99j5793j23913n6733N2028
13352E95123j12992l4652J24627J4442p3267O3013J16188M2747q9097j11309O0413
13341E95236O6103K5921J37352K8885j5235j09392O1504J05155q643j11355J1519
$$ plain form
13330 787050 914873 852877 752139 751985 792566 841866 866676 829578 806674 713239 643416
13319 643416 680694 831976 935974 870604 837369 783821 729801 707015 687739 757489 809424
13308 809424 739425 705717 672975 821542 804340 750299 778042 857474 796500 807474 810820
13297 810820 720803 673183 650052 623070 655611 654211 714123 872261 989953 947013 879563
13286 879563 807138 691206 639720 525411 485960 693873 846470 879824 806979 782652 697834
13275 697834 758703 804818 702383 523881 606826 847171 841034 806879 756423 685250 716112
13264 716112 742957 672670 637283 568119 630740 763507 803599 769241 708079 738042 680541
13253 680541 730753 706216 695997 695861 625982 614508 782946 822491 924405 1027837 990062
$$ packed form
13330G87050J27823o1996j00738j54M0581M9300K4810l7098k2904r3435o9823
13319F43416L7278J51282J03998o5370l3235n3548n4020k2786j9276O9750N1935
13308H09424o9999l3708l2742J48567j7202n4041K7743P9432o0974J0974L346
13297H10820r0017m7620k3131k6982L2541j400N9912J58138J17692m2940o7450
13286H79563p2425j15932n1486j14309l9451K07913J52597L3354p2845k4327q4818
13275F97834O0869M6115j02435j78502Q2945K40345o137l4155n0456p1173L0862
13264G16112K6845p0287l5387o9164O2621J32767M0092l4358o1162K9963n7501
13253F80541N0212k4537j0219j36o9879j1474J68438L9545J01914J03432l7775
$$ plain form
13242 990062 881052 960828 949276 928190 946848 1043189 1039875 1001069 1043078 1068178 1016539
13231 1016539 983423 1072702 1028869 874628 730355 883467 952383 969093 877731 735456
13221 735456 722585 852812 924553 914784 878806 903965 877738 780102 754923 832182 868766
13210 868766 788838 793231 850836 736705 728600 653976 743442 786256 865426 786565 776589 855951
13198 855951 933605 833115 808219 817849 897049 851469 932175 933153 932851 956006 929848 876299
13186 876299 829745 741283 753533 724615 723795 820898 818540 740721 689141 837423 1043879 1059785
13174 1059785 839949 837702 1061461 1163967 1065593 1043846 1018226 1040361 936669 781618
13164 781618 903943 1027944 893346 808567 1040908 1136967 1090111 1123029 1157881 1061651 1012198
$$ packed form
13242I90062j09010P9776j1552k1086J8658R6341l314l8806M2009K5100n1639
13231A016539l3116Q9279m3833j54241j44273J53112O8916J6710r1362j42275
13221G35456j2871J30227P1741r769l5978K5159k6227r7636k5179P7259L6584
13210H68766p9928M393N7605j14131q105p4624Q9466M2814P9170p8861r976P9362
13198H55951P7654j00490k4896R630P9200m5580Q0706R78l02K3155k6158n3549
13186H76299m6554q8462J2250k8918q20R7103k358p7819n1580J48282K06456J5906
13174A059785k19836k247K23759J02506r8374k1747k5620K2135j03692j55051
13164G81618J22325J24001j34598q4779K32341R6059m6856L2918L4852r6230m9453
$$ plain form
13153 1012198 1138940 1195347 1132967 1154587 1101889 1120797 1155435 1120157 1000794 898266 798318
13142 798318 918211 1005250 1243841 1411784 1348485 1225075 1197385 1155927 1203477 1190056 1029712
13131 1029712 1024532 1099261 1084635 1077191 997216 925995 975849 932116 883720 840657 1017435
13120 1017435 1267909 1277919 1206748 1108896 1165225 1123996 984449 885466 1060396 1078321 1070456
13109 1070456 1090948 1029198 1037330 1152073 1089380 1097394 1104910 1149383 1096777 944448 830761
13098 830761 945412 1061833 1103293 1125828 1283460 1240428 1153529 1165977 1293907 1296132 1223988
13087 1223988 1237257 1204392 1101727 1096074 1311184 1309950 1188192 1122120 1209211 1211312 1188556
13076 1188556 1309398 1243710 1068811 1146125 1346736 1465338 1411932 1360877 1264516 1099078
$$ packed form
13153A012198J26742N6407o2380K1620n2698J8908L4638l5278j19363j02528r9948
13142G98318J19893Q7039K38591J67943o3299j23410k7690m1458M7550j3421j60344
13131A029712n180P4729j4626p444p9975p1221M9854m3733m8396m3063J76778
13120A017435K50474J0010p1171r7852N6329m1229j39547r8983J74930J7925p865
13109A070456K0492o1750Q132J14743o2693Q014P516M4473n2606j52329j13687
13098H30761J14651J16421M1460K2535J57632m3032q6899J2448J27930K225p2144
13087A223988J3269l2865j02665n653K15110j234j21758o6072Q7091K101k2756
13076A188556J20842o5688j74899P7314K00611J18602n3406n1055r6361j65438
$$ plain form
13066 1099078 1204338 1249733 1191451 1245278 1302220 1345502 1269298 1228508 1277540 1250448 1240419
13055 1240419 1270218 1322960 1257849 1223558 1218417 1328416 1420329 1298862 1257871 1250256 1319083
13044 1319083 1169586 1129655 1208945 1159085 978966 1029590 1035202 1094384 1345689 1443401 1432395
13033 1432395 1554075 1567101 1640342 1661436 1686800 1594232 1622725 1800070 1853701 1821573 1717476
13022 1717476 1895339 2060199 2136559 2230045 2272474 2306049 2372584 2449150 2572911 2635334 2610369
13011 2610369 2407545 2323665 2219152 2066644 2070774 2159263 2218253 2193437 2257677 2291988 2243526
13000 2243526 2291080 2423700 2351707 2243429 2314201 2384680 2366348 2387544 2444310 2443673 2515714
12989 2515714 2653894 2708154 2695493 2748558 2744209 2766125 2742596 2688642 2676137 2746819 2635190
$$ packed form
13066A099078J05260M5395n8282N3827N6942M3282p6204m0790M9032k7092j0029
13055A240419K9799N2742o5111l4291n141J09999R1913j21467m0991p615O8827
13044A319083j49497l9931P9290m9860j80119N0624N612N9182K51305R7712j1006
13033A432395J21680J3026P3241K1094K5364r2568K8493J77345N3631l2128j04097
13022A717476J77863J64860P6360R3486M2429L3575O6535P6566J23761O2423k4965
13011B610369k02824q3880j04513j52508M130Q8489N8990k4816O4240L4311m8462
13000B243526M7554J32620p1993j08278P0772P0479j8332K1196N6766o37P2041
12989B515714J38180N4260j2661N3065m349K1916k3529n3954j2505P0682j11629
$$ plain form
12978 2635190 2668780 2745817 2655887 2502884 2443694 2322592 2381925 2433622 2267488 2319679 2352012
12967 2352012 2324090 2417828 2381157 2227130 2183751 2219562 2334984 2511469 2422703 2392460 2359636
12956 2359636 2464920 2488962 2448909 2449302 2501120 2516475 2522749 2400357 2379235 2327557 2340700
12945 2340700 2310883 2206698 2075858 2063578 2013015 1873402 1778556 1736694 1735102 1674282 1636056
12934 1636056 1649734 1647416 1621912 1534658 1489875 1546075 1582805 1589660 1667667 1776833 1816553
12923 1816553 1760285 1780633 1895002 1964420 1930091 1843120 1754547 1650508 1566886 1667558 1644259
12912 1644259 1554509 1484173 1534357 1475490 1419391 1606570 1759456 1749236 1891519 1894603 1736090
12901 1736090 1627921 1650286 1639508 1750077 1836091 1868238 1734505 1618424 1659900 1751487
$$ packed form
12978B635190L3590P7037q9930j53003n9190j21102N9333N1697j66134N2191L2333
12967B352012k7922R3738l6671j54027m3379L5811J15422J76485q8766l0243l2824
12956B359636J05284K4042m0053L93N1818J5355O274j22392k1122n1678J3143
12945B340700k9817j04185j30840j2280n0563j39613r4846m1862j592o0820l8226
12934A636056J3678k318k5504q7254m4783N6200L6730O855P8007J09166L9720
12923A816553n6268K0348J14369O9418l4329q6971q8573j04039q3622J00672k3299
12912A644259q9750p0336N0184n8867n6099J87179J52886j0220J42283L084j58513
12901A736090j08169K2365j0778J10569Q6014L2147j33733j16081M1476R1587
$$ plain form
12891 1751487 1791990 1807774 1792946 1875077 1809044 1802884 1813186 1829798 1764324 1816177 1831997
12880 1831997 1788734 1743470 1749691 1886178 1955671 1947914 1893792 1932600 1850617 1808196 1910011
12869 1910011 1967398 1978233 1963016 2004217 1928832 2001280 1975125 1795586 1677491 1757328 1918690
12858 1918690 1857649 1838624 1787158 1724854 1635168 1675571 1626351 1600492 1661569 1762412 1853954
12847 1853954 1942470 2001658 1916035 2013185 2017306 1922528 1924612 1933334 2083575 2205532 2273270
12836 2273270 2309317 2141459 2173477 2259998 2242983 2131891 2147948 2202149 2280112 2369231 2549059
12825 2549059 2518940 2415594 2447570 2434480 2432948 2456662 2517693 2667969 2629009 2493766 2397294
12814 2397294 2236873 2073761 2081888 2005899 2083942 2345715 2416075 2367005 2318388 2286701 2418018
$$ packed form
12891A751487M0503J5784j4828Q2131o6033o160J0302J6612o5474N1853J5820
12880A831997m3263m5264O221J36487O9493p757n4122L8808q1983m2421J01815
12869A910011N7387J0835j5217M1201p5385P2448k6155j79539j18095P9837J61362
12858A918690o1041j9025n1466o2304q9686M0403m9220k5859O1077J00843R1542
12847A853954Q8516N9188q5623R7150M121r4778K084Q722J50241J21957O7738
12836B273270L6047j67858L2018Q6521j7015j11092J6057N4201P7963Q9119J79828
12825B549059l0119j03346L1976j3090j532K3714O1031J50276l8960j35243r6472
12814B397294j60421j63112Q127p5989P8043K61773P0360m9070m8617l1687J31317
$$ plain form
12803 2418018 2510230 2521235 2531414 2555653 2470401 2442136 2591133 2615795 2537400 2549634 2644286
12792 2644286 2786577 2782834 2629192 2468438 2412147 2434449 2476271 2541342 2686330 2643114 2756327
12781 2756327 2962547 2973343 2765928 2817456 2810022 2829743 2798533 2728196 2653351 2508768 2412526
12770 2412526 2425060 2524092 2627426 2659360 2697635 2689663 2727698 2769406 2727792 2717134 2662729
12759 2662729 2612190 2655031 2762028 2870266 2928598 2892726 2878259 2952530 3036939 3045555 2949445
12748 2949445 2832902 2751114 2675822 2711307 2777257 2709874 2657495 2580942 2728283 2851363 2895348
12737 2895348 2912456 2789743 2579133 2735470 2801076 2835575 2982765 2893376 2910277 2983095
12727 2983095 2984247 2881432 2935294 3042683 2897131 2833767 2980947 3122973 2975225 2863807
$$ packed form
12803B418018R2212J1005J0179K4239q5252k8265J48997K4662p8395J2234R4652
12792B644286J42291l743j53642j60754n6291K2302M1822O5071J44988m3216J13213
12781B756327K06220J0796k07415N1528p434J9721l1210p0337p4845j44583r6242
12770B412526J2534R9032J03334L1934L8275p972L8035M1708m1614j0658n4405
12759B662729n0539M2841J06997J08238N8332l5872j4467P4271Q4409Q616r6110
12748B949445j16543q1788p5292L5485O5950o7383n2379p6553J47341J23080M3985
12737B895348J7108j22713k10610J56337O5606L4499J47190q9389J6901P2818
12727B983095J152j02815N3862J07389j45552o3364J47180J42026j47748j11418
$$ plain form
12717 2863807 2814434 2838908 3035529 3029820 3170646 3334099 3290184 3242544 3206526 3284869 3291316
12706 3291316 3371972 3392418 3305037 3320430 3199837 3270328 3331244 3336603 3378635 3506108 3596196
12695 3596196 3434943 3491407 3697165 3815515 3886383 3920303 3863969 3977844 4074236 4140880
12685 4140880 4232822 4219874 4219503 4216064 4163332 4280182 4292158 4201173 4046165 4041112 4021452 4143227
12673 4143227 4270964 4322245 4166377 4080493 4231792 4446025 4414583 4538584 4515027 4428842
12663 4428842 4375700 4486180 4693228 4770497 4881636 4933102 4907671 4753699 4609057 4725778
12653 4725778 4847604 4755005 4520438 4642840 4774018 4815097 4931416 4970024 5064423 5052667
12643 5052667 4965406 4971918 5051940 5217651 5229131 5394243 5270859 5282153 5279761 5209089 5472793
$$ packed form
12717B863807m9373K4474J96621n709J40826J63453m3915m7640l6018P8343O447
12706C291316Q0656K0446q7381J5393j20593P0491O0916N359M2032J27473R0088
12695C596196j61253N6464K05758J18350P0868L3920n6334J13875R6392O6644
12685D140880R1942j2948l71l439n2732J16850J1976r0985j55008n053j9660J21775
12673D143227J27737N1281j55868q5884J51299K14233l1442J24001k3557q6185
12663D428842n3142J10480K07048P7269J11139N1466k5431j53972j44642J16721
12653D725778J21826r2599k34567J22402J31178M1079J16319L8608R4399j1756
12643E052667q7261O512Q0022J65711J1480J65112j23384J1294k392p0672K63704
$$ plain form
12632 5472793 5520319 5642502 5704983 5742975 6063214 6325294 6412396 6467791 6536133 6539547 6562534
12621 6562534 6710755 6772580 6867060 7046890 7039038 7066657 7264089 7498073 7716798 7877520
12611 7877520 7975054 8228977 8487671 8500075 8673943 8989725 9234976 9430476 9644910 9867028
12601 9867028 10234078 10734601 11082675 11567623 11961629 12388613 12843904 13468292 14308116
12592 14308116 15058004 15890814 16877828 18040186 19221925 20604413 22266376 24102334
12584 24102334 26237774 28555880 31258837 34550259 38266219 42455570 47266798 52738820
12576 52738820 59154711 66812452 75933628 86791054 99233289 113474280 129575060
12569 129575060 146953212 164791532 181828971 196572963 207712099 214286538 215510165
$$ packed form
12632E472793M7526J22183O2481L7992L20239K62080Q7102N5395O8342L414K2987
12621F562534J48221O1825R4480J79830p852K7619J97432K33984K18725J60722
12611G877520R7534K53923K58694J2404J73868L15782K45251J95500K14434K22118
12601I867028L67050N00523L48074M84948L94006M26984M55291O24388Q39824
12592A4308116P49888Q32810R87014J162358J181739J382488J661963J835958
12584B4102334K135440K318106K702957L291422L715960M189351M811228N472022
12576E2738820O415891P657741R121176J0857426J2442235J4240991J6100780
12569A29575060J7378152J7838320J7037439J4743992J1139136O574439J223627
$$ plain form
12562 215510165 211227416 202629455 191662211 179822135 168567584 158927661 151241145
12555 151241145 145725524 142668391 142133080 143971772 147903379 153641640 161068533 170076656
12547 170076656 180130422 191065986 202643452 214514146 226533878 238586713 250291461
12540 250291461 261618779 271832541 280529779 287662999 293193442 296420477 296945567 294605145
12532 294605145 289408677 282241823 273754829 264758363 256195082 248313398 241163961 234636032
12524 234636032 228226358 221662599 214701985 207208182 199289331 191499301 184116245 177461836
12516 177461836 171737528 166999172 163683976 162350229 163594308 167355018 173814583 182968706
12508 182968706 194330178 207352681 221052845 233874080 244338115 250806717 251991189
$$ packed form
12562B15510165m282749q597961j0967244j1840076j1254551r639923p686516
12555A51241145n515621l057133n35311J838692L931607N738261P426893R008123
12547A70076656J0053766J0935564J1577466J1870694J2019732J2052835J1704748
12540B50291461J1327318J0213762Q697238P133220N530443L227035N25090k340422
12532B94605145n196468p166854q486994q996466q563281p881684p149437o527929
12524B34636032o409674o563759o960614p493803p918851p790030p383056o654409
12516A77461836n724308m738356l315196j333747J244079L760710O459565R154123
12508A82968706J1361472J3022503J3700164J2821235J0464035O468602J184472
$$ plain form
12501 251991189 246741908 235249806 218149376 197362655 175269257 153785067 133968437
12494 133968437 116440030 101350462 88491597 77688722 68507454 60812157 54361652
12487 54361652 48968623 44284609 40314526 37133330 34182089 31467979 29166475 27166726
12479 27166726 25597639 24159895 22790662 21631520 20542438 19462765 18442443 17577680
12471 17577680 16969544 16469183 16041825 15551511 14886361 14412339 14132481 13685150 13235768
12462 13235768 12900449 12419802 11961042 11559499 11252186 11050186 10815909 10504955 10499417 10385992
12452 10385992 10128924 9879236 9793445 9605190 9588074 9653281 9565639 9203087 9036491 8965932
12442 8965932 8838026 8758236 8644267 8474496 8499154 8494687 8405126 8414533 8258916 8097119 8049957
$$ packed form
12501B51991189n249281j1492102j7100430k0786721k2093398k1484190j9816630
12494A33968437j7528407j5089568j2858865j0802875r181268p695297o450505
12487E4361652n393029m684014l970083l181196k951241k714110k301504j999749
12479B7166726j569087j437744j369233j159142j089082j079673j020322q64763
12471A7577680o08136n00361m27358m90314o65150m74022k79858m47331m49382
12462A3235768l35319m80647m58760m01543l07313k02000k34277l10954n538j13425
12452A0385992k57068k49688q5791j88255j7116O5207q7642l62552j66596p0559
12442H965932j27906p9790j13969j69771K4658m467q9561R407j55617j61797m7162
$$ plain form
12431 8049957 7988149 8031954 7988890 7976922 7921123 7821921 7746266 7726018 7715713 7696596 7580451
12420 7580451 7456350 7358852 7301705 7213931 7141475 7248470 7298698 7329679 7384562 7402388 7458258
12409 7458258 7449877 7422343 7430189 7408547 7417062 7404846 7372766 7307979 7305382 7244899 7135927 7211136
12397 7211136 7257219 7152996 7096379 7193237 7144102 7088353 7061684 7111940 7082396 7133654 7284154
12386 7284154 7439340 7456772 7422376 7420864 7430547 7345755 7352542 7443710 7399128 7434167 7422953 7387934
12374 7387934 7261395 7228397 7130692 7035157 7105234 7269837 7061924 6888899 6800130 6675009
12364 6675009 6684719 6678343 6659185 6695277 6604026 6604244 6699988 6780526 6687098 6593375 6577821 6516925
12352 6516925 6455639 6414893 6556709 6604695 6613534 6682954 6697222 6586659 6547979 6547021 6603494
$$ packed form
12431H049957o1808M3805m3064j1968n5799r9202p5655k0248j0305j9117j16145
12420G580451j24101r7498n7147q7774p2456J06995N0228L0981N4883J7826N5870
12409G458258q381k7534P846k1642Q515j2216l2080o4787k597o0483j08972P5209
12397G211136M6083j04223n6617R6858m9135n5749k6669N0256k9544N1258J50500
12386G284154J55186J7432l4396j512R683q4792O787R1168m4582L5039j1214l5019
12374G387934j26539l2998r7705r5535P0077J64603k07913j73025q8769j25121
12364F675009R710o376j9158L6092r1251K18R5744Q0538r3428r3723j5554o0896
12352F516925o1286m0746J41816M7986Q839O9420J4268j10563l8680r58N6473
$$ plain form
12341 6603494 6684082 6648434 6530244 6536007 6455123 6413158 6554652 6574242 6600906 6613247 6673487
12330 6673487 6674492 6484864 6362764 6367412 6574977 6612378 6596205 6623019 6595674 6580167 6624113
12319 6624113 6640154 6582747 6540644 6668058 6855057 6789749 6576009 6578305 6599917 6704128 6944210
12308 6944210 7047460 6967008 6831802 6809964 6945819 6981016 6989071 7217358 7181681 7193081 7077260
12297 7077260 6974132 6938603 7049811 7040671 7038823 7113564 7089833 7117862 7168813 7115683 6970243
12286 6970243 6969868 7082381 7162871 7216615 7226958 7232171 7254493 7341459 7349962 7347665 7248071 7188572
12274 7188572 7256381 7256079 7229421 7165748 7079312 7132910 7157957 7098981 7159376 7393642 7473673
12263 7473673 7451304 7397050 7302592 7221213 7241057 7209632 7205370 7163754 7196504 7354607 7435480
$$ packed form
12341F603494Q0588l5648j18190N763q0884m1965J41494J9590K6664J2341O0240
12330F673487J005j89628j22100M648K07565L7401j6173K6814k7345j5507M3946
12319F624113J6041n7407m2103J27414J86999o5308k13740K296K1612J04211K40082
12308F944210J03250q0452j35206k1838J35855L5197Q055K28287l5677J1400j15821
12297G077260j03128l5529J11208r140j848P4741k3731K8029N0951n3130j45440
12286F970243l75J12513Q0490N3744J0343N213K2322Q6966Q503k297r9594n9499
12274G188572O7809l02k6658o3673q6436N3598K5047n8976O0395K34266Q0031
12263G473673k2369n4254r4458q1379J9844l1425m262m1616L2750J58103Q0873
$$ plain form
12252 7435480 7512203 7505975 7594179 7613331 7573220 7633421 7744632 7715762 7517701 7444589 7617874
12241 7617874 7925648 7992866 7980960 8057031 8124563 8169166 8238082 8338696 8430474 8500856 8572726
12230 8572726 8647124 8841684 8896685 8855970 8817073 8774407 8863418 8894482 8862776 8727623 8604072
12219 8604072 8706320 8689181 8693004 8661035 8606969 8511247 8551339 8506148 8570524 8758198 8725054
12208 8725054 8717803 8844364 8874246 8925248 8965283 9028587 9040144 9106798 8957525 8868151 8992611
12197 8992611 9078197 9126588 9214718 9243756 9291903 9420106 9579253 9588480 9408044 9198273 9060190
12186 9060190 8889050 8785797 8889038 9022115 9109045 9064888 8916056 8937519 8873349 8774171
12176 8774171 8644388 8659531 8546996 8471128 8618762 8760960 8825303 8838418 8900777 8859984
$$ packed form
12252G435480P6723o228Q8204J9152m0111O0201J11211k8870j98061p3112J73285
12241G617874L07774O7218j1906P6071O7532M4603O8916J00614R1778P0382P1870
12230H572726P4398J94560N5001m0715l8897m2666Q9011L1064l1706j35153j23551
12219H604072J02248j7139L823l1969n4066r5722M0092m5191O4376J87674l3144
12208H725054p251J26561K9882N1002M0035O3304J1557O6654j49273q9374J24460
12197H992611Q5586M8391Q8130K9038M8147J28203J59147R227j80436k09771j38083
12186I060190j71140j03253J03241J33077Q6930m4157j48832K1463o4170r9178
12176H774171j29783J5143j12535p5868J47634J42198O4343J3115O2359m0793
$$ plain form
12166 8859984 8731050 8631480 8760361 8792043 8634592 8687267 8758021 8645059 8509445 8469901
12156 8469901 8559744 8460744 8381993 8266145 8151138 8204816 8183566 8197022 8345980 8433461 8514139
12145 8514139 8440136 8445630 8377205 8308552 8252867 8333825 8311139 8258070 8192440 8063773 8055078
12134 8055078 8130186 8087095 8233789 8382875 8364696 8494239 8367942 8457786 8559846 8516388
12124 8516388 8383009 8323219 8456005 8532733 8519104 8437765 8500229 8582178 8645468 8757627 8795642
12113 8795642 8818504 8794545 8782503 8807487 8864324 8836277 8935459 9003231 8903541 8742118 8764632
12102 8764632 8805131 8791488 8814701 8837146 8864316 8854808 8814283 8786383 8727209 8671821 8708899
12091 8708899 8893137 9006173 9124589 9188556 9257863 9159701 9149794 9236770 9383140 9498295
$$ packed form
12166H859984j28934r9570J28881L1682j57451N2675P0754j12962j35614l9544
12156H469901Q9843r9000p8751j15848j15007N3678k1250J3456J48958Q7481Q0678
12145H514139p4003N494o8425o8653n5685Q0958k2686n3069o5630j28667q695
12134H055078P5108m3091J46694J49086j8179J29543j26297Q9844J02060m3458
12124H516388j33379n9790J32786P6728j3629q1339O2464Q1949O3290J12159L8015
12113H795642K2862k3959j2042K4984N6837k8047R9182O7772r9690j61423K2514
12102H764632M0499j3643K3213K2445K7170r508m0525k7900n9174n5388L7078
12091H708899J84238J13036J18416O3967O9307r8162r907Q6976J46370J15155
$$ plain form
12081 9498295 9388725 9435103 9352936 9421480 9425099 9284364 9219205 9268101 9366571 9449806 9335542
12070 9335542 9232255 9306056 9301153 9125922 9115485 9078775 9057421 8898790 8809039 8873633 9012868
12059 9012868 9080008 9096875 9017750 8974463 9020279 9031813 9077182 9246571 9327188 9295299 9277997
12048 9277997 9378629 9553519 9662663 9532916 9434589 9270417 9178136 9112107 9128813 9008544
12038 9008544 8874323 8835339 8702056 8451615 8392736 8381601 8454137 8519170 8554619 8489529 8521821
12027 8521821 8412852 8293785 8283415 8191433 7988264 8029337 7981174 7996720 8017788 7967081 7803969
12016 7803969 7813004 7773697 7630609 7486847 7569822 7533444 7420349 7555876 7655931 7620443
12006 7620443 7624340 7722015 7601023 7501269 7487442 7366880 7320904 7322814 7398318 7442665 7324096
$$ packed form
12081I498295j09570M6378q2167O8544L619j40735o5159M8896R8470Q3235j14264
12070I335542j03287P3801m903j75231j0437l6710k1354j58631q9751O4594J39235
12059I012868O7140J6867p9125m3287M5816J1534M5369J69389Q0617l1889j7302
12048I277997J00632J74890J09144j29747r8327j64172r2281o6029J6706j20269
12038I008544j34221l8984j33283k50441n8879j1135P2536O5033L5449o5090L2292
12027H521821j08969j19067j0370r1982k03169M1073m8163J5546K1068n0707j63112
12016G803969R035l9307j43088j43762Q2975l6378j13095J35527J00055l5488
12006G620443L897R7675j20992r9754j3827j20562m5976J910P5504M4347j18569
$$ plain form
11995 7324096 7455092 7514581 7502630 7481730 7549805 7619012 7659585 7677995 7713895 7635886 7459169
11984 7459169 7473794 7515935 7558661 7561427 7646953 7538636 7348229 7235550 7156928 7300007 7257033
11973 7257033 7279625 7325744 7333870 7297981 7307408 7176454 7156455 7202653 7117110 7161914 7192336
11962 7192336 7116115 6921173 6902436 7067456 7219086 7229906 7213014 7320861 7195424 7066932
11952 7066932 7144326 7120049 7108769 7049008 7020626 7096890 6913349 6942823 7082573 7064589 7045565
11941 7045565 7151774 7274590 7307961 7362405 7537995 7495102 7398949 7358709 7253326 7224824
11931 7224824 7293934 7425297 7625093 7661192 7726953 7826235 8033415 8194294 8373877 8269983
11921 8269983 8219757 8177443 8202847 8248751 8064273 7895747 7829675 7825486 7836262 7865781 7818844
$$ packed form
11995G324096J30996N9489j1951k0900O8075O9207M0573J8410L5900p8009j76717
11984G459169J4625M2141M2726K766Q5526j08317j90407j12679p8622J43079m2974
11973G257033K2592M6119Q126l5889R427j30954j9999M6198q5543M4804L0422
11962G192336p6221j94942j8737J65020J51630J0820j6892J07847j25437j28492
11952G066932P7394k4277j1280n9761k8382P6264j83541K9474J39750j7984j9024
11941G045565J06209J22816L3371N4444J75590m2893r6153m0240j05383k8502
11931G224824O9110J31363J99796L6099O5761R9282K07180J60879J79583j03894
11921H269983n0226m2314K5404M5904j84478j68526o6072m189J0776K9519m6937
$$ plain form
11910 7818844 7764436 7672163 7686013 7613629 7539110 7624858 7655685 7561433 7553877 7474357 7485275
11899 7485275 7676892 7774470 7655138 7676275 7670114 7636561 7844410 7914113 7699455 7585129
11889 7585129 7546480 7609960 7635528 7739719 7878575 7937082 7998391 8121137 8078242 7928731
11879 7928731 7922904 7931259 7879832 7761766 7800240 7865532 7956891 8076306 8174199 8404857 8470694
11868 8470694 8350399 8413249 8497192 8558013 8474773 8658999 8887922 8958577 9070484 9106289
11858 9106289 9207333 9346113 9424069 9469977 9444088 9592743 9834311 9863075 9978116 10109324
11848 10109324 10207502 10284861 10632562 10885780 11071396 11242601 11484239 11824154 12209245 12576922
11838 12576922 13019050 13158274 13412133 13972143 14426794 15003881 15486912 15951765 16794680
$$ packed form
11910G818844n4408r2273J3850p2384p4519Q5748L0827r4252p556p9520J0918
11899G485275J91617R7578j19332K1137o161l3553K07849O9703k14658j14326
11889G585129l8649O3480K5568J04191J38856N8507O1309J22746m2895j49511
11879G928731n827Q355n1427j18066L8474O5292R1359J19415R7893K30658O5837
11868H470694j20295O2850Q3943O0821q3240J84226K28923P0655J11907L5805
11858I106289J01044J38780P7956M5908k5889J48655K41568K8764J15041J31208
11848A0109324R8178P7359L47701K53218J85616J71205K41638L39915L85091L67677
11838A2576922M42128J39224K53859N60010M54651N77087M83031M64853Q42915
$$ plain form
11829 16794680 17664036 18387805 19300850 20297582 21501674 22955507 24527806 26146264 28113466
11820 28113466 30490511 33176418 36204253 39627672 43625714 48237245 53536701 59717740
11812 59717740 66945112 75400533 84911266 96148146 109263143 124380262 141360009
11805 141360009 159888449 179168546 198381532 215874698 230237270 240325996 245026402
11798 245026402 243803772 237023747 226171602 212866096 199051501 186076023 175147945
11791 175147945 166846653 161325705 158373655 158054108 159985028 163816400 168860016 174998736
11783 174998736 181904734 189141336 196529931 203882192 211327496 218720456 225902340 233361426
11775 233361426 240966194 248921859 257376578 266200612 275047076 283233608 289689991 293559809
$$ packed form
11829A6794680Q69356P23769R13045R96732J204092J453833J572299J618458J967202
11820B8113466K377045K685907L027835L423419L998042M611531N299456O181039
11812E9717740P227372Q455421R510733J1236880J3114997J5117119J6979747
11805A41360009J8528440J9280097J9212986J7493166J4362572J0088726M700406
11798B45026402j222630o780025j0852145j3305506j3814595j2975478j0928078
11791A75147945q301292n520948k952050l19547J930920L831372N043616O138720
11783A74998736O905998P236602P388595P352261P445304P392960P181884P459086
11775B33361426P604768P955665Q454719Q824034Q846464Q186532O456383L869818
$$ plain form
11767 293559809 294452971 292124048 286715649 278811737 269268327 258870343 248115802 237271347
11759 237271347 226325063 215350432 204486737 193834700 183806237 174456699 165808349
11752 165808349 158124840 151421047 145957484 142523608 140905188 141338000 144123560 149196209
11744 149196209 156317667 164982469 174920459 185390542 195203502 203204860 208149340 209197581
11736 209197581 205586227 197325066 184721477 168996975 151836803 134688865 118543192
11729 118543192 104043824 91196131 80126742 70781542 63034898 56412957 50634903
11722 50634903 45683022 41454579 37784189 34705614 32077332 29884527 27890527 25987068
11714 25987068 24490681 23081716 21862912 20795533 19843739 18924769 18250038 17486593 16858035
$$ packed form
11767B93559809Q93162k328923n408399p903912r543410j0397984j0754541j0844455
11759B37271347j0946284j0974631j0863695j0652037j0028463r349538q648350
11752A65808349p683509o703793n463563l433876j618420M32812K785560N072649
11744A49196209P121458Q664802R937990J0470083R812960Q001358M944480J048241
11736B09197581l611354q261161j2603589j5724502j7160172j7147938j6145673
11729A18543192j4499368j2847693j1069389r345200p746644o621941n778054
11722E0634903m951881m228443l670390l078575k628282k192805j994000j903459
11714B5987068j496387j408965j218804j067379r51794r18970o74731p63445o28558
$$ plain form
11705 16858035 16306070 15668489 15187332 14766064 14394821 14034006 13512090 13123045 12817178
11696 12817178 12523078 12236976 11892585 11440145 11197008 11056943 10913235 10658808 10366403
11687 10366403 10198345 9981815 9699844 9443819 9195168 9107109 8842372 8704246 8562379
11678 8562379 8385578 8275237 8207416 8278609 8214091 7915177 7883440 7844804 7787702 7665544
11668 7665544 7602078 7611265 7650602 7462388 7215815 7067214 6947987 6776581 6560563 6436992
11658 6436992 6389670 6390275 6158424 6062611 6035795 5850892 5635164 5555936 5581944 5702507 5961183
11647 5961183 5966375 5776936 5811353 5800393 5621303 5496842 5425989 5357966 5263512 5220609 5141803
11636 5141803 5023251 4931554 4789670 4684432 4777739 4885020 4661111 4522605 4506136 4623664
$$ packed form
11705A6858035n51965o37581m81157m21268l71243l60815n21916l89045l05867
11696A2817178k94100k86102l44391m52440k43137j40065j43708k54427k92405
11687A0366403j68058k16530k81971k56025k48651q8059k64737j38126j41867
11678H562379j76801j10341o7821P1193o4518k98914l1737l8636n7102j22158
11668G665544o3466R187L9337j88214k46573j48601j19227j71406k16018j23571
11658F436992m7322O05k31851r5813k6816j84903k15728p9228K6008J20563K58676
11647E961183N192j89439L4417j0960j79090j24461p0853o8023r4454m2903p8806
11636E141803j18552r1697j41884j05238R3307J07281k23909j38506j6469J17528
$$ plain form
11626 4623664 4630148 4619760 4435077 4421659 4444093 4276201 4304097 4292781 4206151 4390970 4449286
11615 4449286 4356261 4264135 4201890 4256433 4317215 4277325 4098397 4069004 3979107 3978460 3984839 3834366
11603 3834366 3747501 3788416 3844033 3812001 3674448 3600864 3565722 3658069 3558194 3523133 3473579
11592 3473579 3484346 3514615 3450040 3405764 3382259 3443191 3345421 3216130 3206808 3160947 3083394
11581 3083394 3116046 3130953 3179353 3019565 2957308 2982245 3014097 2964253 2904767 2793078 2763891
11570 2763891 3000539 3041550 2963543 2884640 2850195 2919821 3027720 3065770 3069727 3053813 2960536
11559 2960536 2731246 2634271 2594171 2749135 2733309 2622318 2668586 2823465 2793269 2830887
11549 2830887 2869645 2762119 2740641 2688697 2717219 2777633 2779420 2777173 2817064 2678994 2696243
$$ packed form
11626D623664O484j0388j84683j3418K2434j67892K7896j1316q6630J84819N8316
11615D449286r3025r2126o2245N4543O0782l9890j78928k9393q9897o47O379j50473
11603C834366q6865M0915N5617l2032j37553p3584l5142R2347r9875l5061m9554
11592C473579J0767L0269o4575m4276k3505O0932r7770j29291r322m5861p7553
11581C083394L2652J4907M8400j59788o2257K4937L1852m9844n9486j11689k9187
11570B763891K36648M1011p8007p8903l4445O9626J07899L8050L957j5914r3277
11559B960536k29290r6975m0100J54964j5826j10991M6268J54879l0196L7618
11549B830887L8758j07526k1478n1944K8522O0414J787k247L9891j38070J7249
$$ plain form
11538 2696243 2689581 2598827 2596791 2576523 2551994 2592997 2685175 2812606 2719307 2533026 2472866
11527 2472866 2526831 2448198 2420774 2422639 2476412 2304028 2243687 2368034 2352360 2305931 2339274
11516 2339274 2319331 2199672 2205005 2377250 2279648 2208615 2271767 2407336 2448865 2323183 2250723
11505 2250723 2305182 2206840 2246588 2339001 2370801 2345811 2307076 2288101 2289533 2266892 2245676
11494 2245676 2318200 2252681 2246527 2274685 2200528 2154506 2183796 2162582 2152287 2196731 2175093
11483 2175093 2178555 2157066 2030538 2021843 1972134 2073797 2220803 2184971 2058166 2000907 1896691
11472 1896691 1904259 2036635 2068363 2023791 2039812 2062091 1982860 2050279 2054804 1986631 1877391
11461 1877391 1857587 1819950 1806051 1747354 1814236 1832993 1878649 1834132 1843661 1832010 1705084
$$ packed form
11538B696243o662r0754k036k0268k4529M1003R2178J27431r3299j86281o0160
11527B472866N3965p8633k7424J865N3773j72384o0341J24347j5674m6429L3343
11516B339274j9943j19659N333J72245r7602p1033O3152J35569M1529j25682p2460
11505B250723N4459r8342L9748R2413L1800k4990l8735j8975J432k2641k1216
11494B245676P2524o5519o154K8158p4157m6022K9290k1214j0295M4444k1638
11483B175093L462k1489j26528q695m9709J01663J47006l5832j26805n7259j04216
11472A896691P568J32376L1728m4572J6021K2279p9231O7419M525o8173j09240
11461A877391j9804l7637j3899n8697O6882J8757M5656m4517R529j1651j26926
$$ plain form
11450 1705084 1626573 1590664 1629823 1725482 1668686 1756584 1905674 1893035 2000404 1997814 1899731
11439 1899731 1918198 1908820 1828577 1746680 1665287 1792302 1909103 1887773 1889970 1831581 1835829
11428 1835829 1910299 2014375 2022719 2044685 2152768 2041175 2015095 1877976 1774195 1628917
11418 1628917 1609310 1511453 1482828 1386624 1331800 1314547 1358589 1438161 1343172 1454437 1570719
11407 1570719 1574327 1614624 1690717 1765122 1774874 1730459 1745595 1831996 1675139 1760963 1815581
11396 1815581 1611370 1418096 1532219 1689626 1577321 1503450 1490917 1550036 1552249 1557235 1562514
11385 1562514 1530268 1528918 1578601 1627957 1722112 1761575 1695199 1664173 1808123 1914768 1929586
11374 1929586 1895918 2073650 2207743 2374778 2496415 2553116 2672943 2666663 2641104 2557917
$$ packed form
11450A705084p8511l5909L9159R5659n6796Q7898J49090j2639J07369k590r8083
11439A899731J8467r378q0243q1897q1393J27015J16801k1330K197n8389M248
11428A835829P4470J04076Q344K1966J08083j11593k6080j37119j03781j45278
11418A628917j9607r7857k8625r6204n4824j7253M4042P9572r4989J11265J16282
11407A570719L608M0297P6093P4405R752m4415J5136Q6401j56857Q5824N4618
11396A815581k04211j93274J14123J57407j12305p3871j2533N9119K213M986N279
11385A562514l2246j350M9683M9356R4155L9463o6376l1026J43950J06645J4818
11374A929586l3668J77732J34093J67035J21637N6701J19827o280k5559q3187
$$ plain form
11364 2557917 2498596 2572348 2482708 2487914 2518099 2329720 2256860 2205286 2143175 2101727 2142210
11353 2142210 2239032 2286206 2301318 2364242 2429435 2348738 2244725 2166005 2229297 2446501 2566260
11342 2566260 2662587 2668254 2657077 2606880 2585265 2606600 2597731 2607141 2775441 2885540 2948185
11331 2948185 2837311 2723867 2756561 2674812 2615588 2573757 2593414 2470790 2264208 2196792
11321 2196792 2191366 2169717 2146552 2127152 2250968 2210321 2010649 1864093 1957736 2186810 1991089
11310 1991089 1903960 1945846 2040465 2175738 2164346 2171317 2276279 2250433 2390975 2395424 2283036
11299 2283036 2102020 1993873 1942611 1950910 1929849 1879181 1839046 1791756 1817022 1540702 1399013
11288 1399013 1357546 1321506 1324814 1252598 1197300 1334766 1302017 1141532 1159085 1282867 1395596
$$ packed form
11364B557917n9321P3752q9640N206L0185j88379p2860n1574o2111m1448M0483
11353B142210R6822M7174J5112O2924O5193q0697j04013p8720O3292K17204J19759
11342B566260R6327N667j1177n0197k1615K1335q869R410J68300J10099O2645
11331B948185j10874j13444L2694q1749n9224m1831J9657j22624k06582o7416
11321B196792n426k1649k3165j9400J23816m0647j99672j46556R3643K29074j95721
11310A991089q7129M1886R4619J35273j1392O971J04962k5846J40542M449j12388
11299B283036j81016j08147n1262Q299k1061n0668m0135m7290K5266k76320j41689
11288A399013m1467l6040L308p2216n5298J37466l2749j60485J7553J23782J12729
$$ plain form
11277 1395596 1478774 1334553 1297114 1312620 1367400 1283634 1222991 1234133 1262687 1214868 1074845
11266 1074845 1023306 1171122 1161786 1130680 1126813 1132600 1219579 1309632 1368717 1246132 1185053
11255 1185053 1188361 1271914 1376514 1368857 1171897 1015144 919748 951705 984072 1030451 1110745
11244 1110745 1128357 1119080 1177424 1284279 1338472 1307150 1314610 1194421 1185262 1189083 1072410
11233 1072410 1077571 1180266 1188182 1044523 902910 913952 1074087 1180157 1161477 1235143 1368423
11222 1368423 1342074 1193314 1004607 938633 983097 1074080 1132272 1149479 1088686 1088535 1132895
11211 1132895 1051682 904171 878794 843854 807329 896627 917505 965833 1030441 930854 960179
11200 960179 853611 772079 757285 633163 810622 951998 896301 902244 1058188 1228557
$$ packed form
11277A395596Q3178j44221l7439J5506N4780q3766o0643J1142K8554m7819j40023
11266A074845n1539J47816r336l1106l867N787Q6979R0053N9085j22585o1079
11255A185053L308Q3553J04600p657j96960j56753r5396L1957L2367M6379Q0294
11244A110745J7612r277N8344J06855N4193l1322P460j20189r159L821j16673
11233A072410N161J02695P916j43659j41613J1042J60135J06070j8680P3666J33280
11222A368423k6349j48760j88707o5974M4464R0983N8192J7207o0793j51M4360
11211A132895q1213j47511k5377l4940l6525Q9298K0878M8328O4608r9587K9325
11200I60179j06568q1532j4794j24122J77459J41376n5697N943J55944J70369
$$ plain form
11190 1228557 1224262 1098369 982872 969837 973351 781469 658282 748837 831166 872851 819693
11179 819693 804882 820240 754092 817739 734802 611006 603200 716950 864515 902260 839494
11168 839494 825383 832901 867956 1091524 1120232 955701 841847 948196 1101481 1044934 948477
11157 948477 884620 862792 845843 785610 700669 671850 637870 783955 954750 1011289 972950
11146 972950 838927 765981 817599 916630 925096 939251 903934 836930 719617 767446 829642
11135 829642 876488 1021811 1094343 1051324 1047642 1092104 1116872 1159167 1205797 1162656 1023455
11124 1023455 907067 837195 795654 745227 742544 640492 660787 676367 584917 620383 631332
11113 631332 631108 654036 804559 855366 806395 693206 649765 679921 839521 1025053 1016849
$$ packed form
11190A228557m295j25893j15497j3035L514j91882j23187R0555Q2329M1685n3158
11179H19693j4811J5358o6148O3647q2937j23796p806J13750J47565L7745o2766
11168H39494j4111P518L5055K23568K8708j64531j13854J06349J53285n6547r6457
11157I48477o3857k1828j6949o0233q4941k8819l3980J46085J70795N6539l8339
11146I72950j34023p2946N1618R9031Q466J4155l5317o7004j17313M7829O2196
11135H29642M6846J45323P2532m3019l682M4462K4768M2295M6630m3141j39201
11124A023455j16388o9872m1541n0427k683j02052K0295J5580r1450L5466J0949
11113F31332k24K2928J50523N0807m8971j13189m3441L0156J59600J85532q204
$$ plain form
11102 1016849 970525 1007193 928574 840951 852801 766043 761400 933610 966267 747782 643371
11091 643371 637696 669112 660909 696326 862945 957430 1011000 970361 872064 779189 900061
11080 900061 860638 642259 617893 736077 664342 629151 607206 632788 633531 694045 696645 675144
11068 675144 609686 642818 684950 649792 630706 723305 810193 750107 806151 883118 753346
11057 753346 780031 858906 765204 795892 845110 868754 899606 861166 893467 992132 1036087
11046 1036087 946949 988011 1040851 1012862 1084292 1060054 1155489 1257090 1342255 1502174 1482525
11035 1482525 1300481 1286489 1351515 1424844 1428394 1335486 1294698 1248985 1269590 1257563 1433010
11024 1433010 1540416 1584068 1624083 1595869 1500576 1489620 1459831 1308170 1224581 1265387 1388746
$$ packed form
11102A016849m6324L6668p8619q7623J1850q6758m643J72210L2657k18485j04411
11091F43371n675L1416q203L5417J66619R4485N3570m0639r8297r2875J20872
11080I00061l9423k18379k4366J18184p1735l5191k1945K5582P43O0514K600k1501
11068F75144o5458L3132M2132l5158j9086R2599Q6888o0086N6044P6967j29772
11057G53346K6685P8875r3702L0688M9218K3644L0852l8440L2301R8665M3955
11046A036087q9138M1062N2840k7989P1430k4238R5435J01601Q5165J59919j9649
11035A482525j82044j3992O5026P3329L550r2908m0788m5713K0605j2027J75447
11024A433010J07406M3652M0015k8214r5293j0956k9789j51661q3589M0806J23359
$$ plain form
11013 1388746 1461813 1385300 1326397 1156703 1092148 996934 881836 915553 1096369 1009342 972080
11002 972080 939163 888964 907892 936744 1045436 1080191 1050159 877179 773807 783517 807841
10991 807841 661521 510312 473257 675792 747947 717414 578039 609670 556630 568159 640498
10980 640498 599987 535812 634249 607171 579386 604081 711828 653225 630458 685712 746631
10969 746631 634698 597206 751177 770213 551236 462904 549557 616174 602273 633337 635310
10958 635310 677225 561267 523128 615929 632924 566495 629642 701815 734247 710480 636235
10947 636235 509299 448124 490701 549526 728146 617638 518360 541401 480177 399549 378221
10936 378221 384958 420693 454657 484432 604052 607795 553296 654039 671739 602715 558420
$$ packed form
11013A388746P3067p6513n8903j69694o4555r5214j15098L3717J80816q7027l7262
11002I72080l2917n0199J8928K8852J08692L4755l0032j72980j03372R710K4324
10991H07841j46320j51209l7055K02535P2155l0533j39375L1631n3040J1529P2339
10980F40498m0511o4175R8437k7078k7785K4695J07747n8603k2767N5254O0919
10969G46631j11933l7492J53971J9036k18977q8332Q6653O6617j3901L1064J973
10958F35310M1915j15958l8139R2801J6995o6429O3147P2173L2432k3767p4245
10947F36235j26936o1175M2577N8825J78620j10508r9278K3041o1224q0628k1328
10936C78221O737L5735L3964K9775J19620L743n4499J00743J7700o9024m4295
$$ plain form
10925 558420 479305 534909 548001 604998 512397 429364 567639 658649 661215 578894 550332
10914 550332 490862 472252 571299 598550 651539 625279 671398 491474 441920 463989 526395
10903 526395 597598 640495 547336 463405 476531 466415 429478 510342 702722 711931 592258
10892 592258 491837 437178 500466 519688 525169 481004 503290 524723 536767 429590 512268
10881 512268 483301 473260 513848 552833 523280 497547 441827 426268 268902 383157 523178
10870 523178 615492 711899 795070 713978 595672 468371 623690 652583 513302 686260
10860 686260 746517 602223 538510 527879 408887 433286 533351 628597 700128 622298 616880
10849 616880 675354 567261 516383 503926 580271 680313 648081 601248 578895 578058 586473 587888
$$ packed form
10925E58420p9115N5604J3092N6997r2601q3033J38275R1010K566q2321k8562
10914E50332n9470j8610R9047K7251N2989k6260M6119j79924m9554K2069O2406
10903E26395P1203M2897r3159q3931J3126j0116l6937Q0864J92380R209j19673
10892E92258j00421n4659O3288J9222N481m4165K2286K1433J2044j07177Q2678
10881E12268k8967j0041M0588L8985k9553k5733n5720j5559j57366J14255J40021
10870E23178R2314R6407Q3171q1092j18306j27301J55319K8893j39281J72958
10860F86260O0257j44294o3713j0631j18992K4399J00065R5246P1531p7830n418
10849F16880N8474j08093n0878j2457P6345J00042l2232m6833k2353q37Q415J415
$$ plain form
10837 587888 607925 555135 551721 423485 542427 612565 522336 398343 379237 394336 412531
10826 412531 452856 627508 708456 613315 686534 745548 708820 635099 521517 467633 517523
10815 517523 628681 584153 578965 562106 600773 550286 424894 318267 334838 405627 467080
10804 467080 477069 449296 465852 532261 526738 456398 500318 587850 498520 676364 792936
10793 792936 703790 614214 544022 405458 309299 261699 370465 506979 484268 517467 472173
10782 472173 465888 475677 480296 481393 613628 773813 764122 735438 634525 452160 583471
10771 583471 577096 413883 427061 477252 550978 601298 550336 613473 595121 569121 621578
10760 621578 681289 749021 767464 578526 457301 374981 315499 396769 412509 436037 402378
$$ packed form
10837E87888K0037n2790l414j28236J18942P0138r0229j23993j9106J5099J8195
10826D12531M0325J74652Q0948r5141P3219N9014l6728p3721j13582n3884M9890
10815E17523J11158m4528n188j6859L8667n0487j25392j06627J6571P0789O1453
10804D67080R989k7773J6556O6409n523p0340M3920Q7532q9330J77844J16572
10793G92936q9146q9576p0192j38564r6159m7600J08766J36514k2711L3199m5294
10782D72173o285R789M619J097J32235J60185r691k8684j00913j82365J31311
10771E83471o375j63213J3178N0191P3726N0320n0962O3137j8352k6000N2457
10760F21578N9711O7732J8443j88938j21225q2320n9482Q1270J5740K3528l3659
$$ plain form
10749 402378 291206 322037 438451 469603 437372 431964 434033 405544 430152 639495 746429
10738 746429 667876 617915 749278 776052 693474 614038 659102 657244 699285 748477 803285
10727 803285 900340 814461 720093 601388 519500 653492 822287 982603 947858 893514 892518
10716 892518 915631 936325 918023 936262 999625 902225 841232 773334 786524 953406 983543
10705 983543 894930 819493 824144 952050 1000988 902633 934133 909296 803700 721314 745839
10694 745839 674237 671755 733236 687204 695260 766627 822702 799803 716781 797410 782365 777458
10682 777458 864826 860778 618886 526483 605481 753297 849354 902460 871620 917437 784289
10671 784289 811237 909368 961864 966629 1013152 953812 939683 791207 917475 1038518 1053364
$$ packed form
10749D02378j11172L0831J16414L1152l2231n408K069k8489K4608K09343J06934
10738G46429p8553m9961J31363K6774q2578p9436M5064j858M2041M9192N4808
10727H03285R7055q5879r4368j18705q1888J33992J68795J60316l4745n4344r96
10716H92518K3113K0694j8302J8239O3363r7400o0993o7898J3190J66882L0137
10705I83543q8613p5437M651J27906M8938r8355L1500k4837j05596q2386K4525
10694G45839p1602k482O1481m6032Q056P1367N6075k2899q3022Q0629j5045m907
10682G77458Q7368m048k41892r2403P8998J47816R6057N3106l0840M5817j33148
10671G84289K6948R8131N2496M765M6523n9340j4129j48476J26268J21043J4846
$$ plain form
10660 1053364 1152689 1212859 1218601 1224219 1312042 1463631 1565517 1657151 1697433 1766976 1877114
10649 1877114 2012954 2173856 2217774 2047525 2079886 2267502 2466504 2613988 2625168 2669158
10639 2669158 2940613 3409549 3750275 4143488 4665724 5211949 5730892 6315510 7065005
10630 7065005 7914329 8878759 10082227 11592584 13310970 15386460 18123163 21855182
10622 21855182 26336653 31509233 36926952 42659705 48373799 53387317 57743338 60978810
10614 60978810 62924916 64343747 66375437 70070028 75695439 82870118 91402244 100448208
10606 100448208 109006857 116264971 121354600 123267318 121997055 119288697 117363229 118204371
10598 118204371 122231213 128909893 137486167 146341931 153966647 159275943 160898344 157245730
$$ packed form
10660A053364R9325O0170N742N618Q7823J51589J01886R1634M0282O9543J10138
10649A877114J35840J60902M3918j70249L2361J87616J99002J47484J1180M3990
10639B669158K71455M68936L40726L93213N22236N46225N18943N84618P49495
10630G065005Q49324R64430J203468J510357J718386K075490K736703L732019
10622B1855182M481471N172580N417719N732753N714094N013518M356021L235472
10614F0978810J946106J418831K031690L694591N625411P174679Q532126R045964
10606A00448208Q558649P258114N089629J912718j270263k708358j925468Q41142
10598A18204371M026842O678680Q576274Q855764P624716N309296J622401l652614
$$ plain form
10590 157245730 148770266 137750125 127502127 120347230 116516186 115491684 116500838 118158328
10582 118158328 119170020 118767958 115891214 109689329 100438963 89954714 80338135 72803792
10574 72803792 67593264 64170038 61919387 60170233 58515574 56224036 52765013 48177041
10566 48177041 42492761 36192057 30244810 25279145 21192226 17925508 15369299 13220552
10558 13220552 11508223 10178853 9084268 8336739 7673053 6963044 6324220 5752565 5256919
10549 5256919 4962353 4788573 4494342 4077519 3792117 3420975 3278144 3288444 3215716 3117675
10539 3117675 3079603 3025133 2904105 2696946 2420552 2511825 2543797 2507478 2387767 2255513
10529 2255513 2126784 2008881 1911843 1808967 1654199 1770922 1786290 1707562 1751861 1804156
$$ packed form
10590A57245730q475464j1020141j0247998p154897l831044j024502J009154J657490
10582A18158328J011692m02062k876744o201885r250366j0484249r616579p534343
10574G2803792n210528l423226k250651j749154j654659k291538l459023m587972
10566D8177041n684280o300704n947247m965665m086919l266718k556209k148747
10558A3220552j712329j329370j094585p47529o63686p10009o38824n71655m95646
10549E256919k94566j73780k94231m16823k85402l71142j42831J0300p2728r8041
10539C117675l8072n4470j21028k07159k76394R1273L1972l6319j19711j32254
10529B255513j28729j17903r7038j02876j54768J16723J5368p8728M4299N2295
$$ plain form
10519 1804156 1688697 1581066 1478520 1432726 1388880 1407997 1395342 1304279 1264725 1168958 1106718
10508 1106718 1272654 1465751 1386044 1176571 1043698 1043537 1126508 1208701 1244509 1207370 1078443
10497 1078443 979952 1041992 1159093 1014547 915052 873298 864088 1026277 869195 818289 832733
10486 832733 886805 814509 858432 861536 777019 936979 1007704 1049250 1064670 1062287 1116779 1062158
10474 1062158 1062230 1041461 943424 996663 1032303 1007878 931397 828464 839210 753004 772898 778306
10462 778306 790868 797719 731222 708207 711627 860368 991259 915663 803788 823480 812466
10451 812466 770324 820857 883261 866864 849060 695053 597693 572546 630182 524932 308504
10440 308504 376611 383128 327457 344695 359661 382250 554092 719397 693595 593622 460625
$$ packed form
10519A804156j15459j07631j02546m5794m3846J9117j2655r1063l9554r5767o2240
10508A106718J65936J93097p9707k09473j32873j61Q2971Q2193L5808l7139j28927
10497A078443r8491O2040J17101j44546r9495m1754r210J62189j57082n0906J4444
10486H32733N4072p2296M3923L104q4517J59960P0725M1546J5420k383N4492n4621
10474A062158P2k0769r8037N3239L5640k4425p6481j02933J0746q6206J9894N408
10462G78306J2562O851o6497k3015L420J48741J30891p5596j11875J9692j1014
10451H12466m2142N0533O2404j6397j7804j54007r7360k5147N7636j05250k16428
10440C08504O8107O517n5671J7238J4966K2589J71842J65305k5802r9973j32997
$$ plain form
10429 460625 377883 395409 325983 178854 177420 373755 431343 402647 356107 265073 223763
10418 223763 163285 97142 201135 220698 175206 307959 417954 551054 528625 434789 398644
10407 398644 372097 359693 316689 496119 607788 613278 620598 661492 612902 579327 502890
10396 502890 450089 560635 537754 469847 392545 311951 287425 336849 299912 262863 187970
10385 187970 258341 314929 442748 388827 382820 388071 379105 366270 425277 478292 517133 484323
10373 484323 593782 504475 300800 318627 261819 188326 161201 175273 270220 390887 423563
10362 423563 360981 352348 438779 397585 429017 417440 410059 332013 195326 181912 177477 122026
10350 122026 137212 151287 238057 252586 365280 365575 302388 282559 303470 313619 286075 247846
$$ packed form
10429D60625q2742J7526o9426j47129j434J96335N7588k8696m6540r1034m1310
10418B23763o0478o6143J03993J9563m5492J32753J09995J33100k2429r3836l6145
10407C98644k6547j2404m3004J79430J11669N490P320M0894m8590l3575p6437
10396E02890n2801J10546k2881o7907p7302q0594k4526M9424l6937l7049p4893
10385A87970P0371N6588J27819n3921o007N251q966j2835N9007N3015L8841l2810
10373D84323J09459q9307k03675J7827n6808p3493k7125J4072R4947J20667L2676
10362D23563o2582q633Q6431m1194L1432j1577p381p8046j36687j3414m435n5451
10350A22026J5186J4075Q6770J4529J12694K95o3187j9829K0911J0149k7544l8229
$$ plain form
10338 247846 220892 207855 31565 92027 38489 -16075 102453 64026 30372 42730 77662
10327 77662 78663 193723 289678 145950 206539 365304 390059 248413 284592 308777 268579
10316 268579 376076 569472 549560 458723 526015 563698 464774 414383 309556 150448 216408
10305 216408 260177 282329 361370 417160 372611 351024 323802 288286 222530 247481 237241
10294 237241 243740 203089 85260 120796 158490 259208 342802 284816 255699 353602 374197
10283 374197 113006 19478 201436 188616 155978 277144 273641 269175 190879 182036 196590
10272 196590 253564 282012 320577 197507 228445 378636 373294 268882 108040 211975 213570
10261 213570 215062 334091 348773 316091 258066 247191 154680 222404 241197 173617 164087 231124
$$ packed form
10338B47846k6954j3037j76290O0462n3538n4564J18528l8427l3654J2358L4932
10327G7662J001J15060R5955j43728O0589J58765K4755j41646L6179K4185m0198
10316B68579J07497J93396j9912r0837O7292L7683r8924n0391j04827j59108O5960
10305B16408M3769K2152P9041N5790m4549k1587k7222l5516o5756K4951j0240
10294B37241O499m0651j17829L5536L7694J00718Q3594n7986k9117R7903K0595
10283C74197k61191r3528J81958j2820l2638J21166l503m466p8296q843J4554
10272A96590N6974K8448L8565j23070L0938J50191n342j04412j60842J03935J595
10261B13570J492J19029J4682l2682n8025j0875r2511O7724J8793o7580r530O7037
$$ plain form
10249 231124 142790 245778 263366 272704 274229 373560 420256 485625 377295 312718 228044
10238 228044 193854 218391 112725 89213 124141 175546 134749 146380 173483 246449 208601
10227 208601 132836 -14141 87824 135882 317486 324640 281844 259310 198740 185177 76486
10216 76486 64181 227948 122357 33401 72024 176628 210172 244335 276416 341612 258056
10205 258056 335669 386460 252081 192993 132549 167735 153783 94447 38026 17896 67391
10194 67391 47607 151579 112728 86681 212912 240056 327856 482838 578369 521517 444279
10183 444279 481822 540043 590404 613644 644868 666753 658244 553273 502003 574555 617055
10172 617055 679384 790183 697998 795642 980667 1004222 864108 847584 739897 778263 679778
$$ packed form
10249B31124q8334J02988J7588R338J525R9331M6696O5369j08330o4577q4674
10238B28044l4190K4537j05666k3512L4928N1405m0797J1631K7103P2966l7848
10227B08601p5765j46977J01965M8058J81604P154m2796k2534o0570j3563j08691
10216G6486j2305J63767j05591q8956L8623J04604L3544L4163L2081O5196q3556
10205B58056P7613N0791j34379n9088o0444L5186j3952n9336n6421k0130M9495
10194F7391j9784J03972l8851k6047J26231K7144Q7800J54982R5531n6852p7238
10183D44279L7543N8221N0361K3240L1224K1885q509j04971n1270P2552M2500
10172F17055O2329J10799r2185R7644J85025K3555j40114j6524j07687L8366r8485
$$ plain form
10161 679778 673674 709124 793536 955771 1038563 1061636 1080329 1184082 1151127 1002029 908832
10150 908832 874117 764732 646898 509070 537437 471150 555030 663250 649180 575353 536406
10139 536406 508496 597948 666653 538946 426967 329486 198413 142480 341889 446055
10129 446055 309606 284788 299038 243273 308121 259847 276039 301677 245620 180358 214174
10118 214174 143675 125643 124834 208604 239353 106011 72839 31725 107825 150998 234569 403842
10106 403842 331144 167928 127454 278379 262779 235557 257717 276351 135763 74883 42115
10095 42115 64280 53210 60361 115918 216231 221137 178351 142202 99823 214045 231515 90521
10083 90521 132931 234465 346978 419311 371649 228077 222461 218095 235656 170706 233600
$$ packed form
10161F79778o104L5450Q4412J62235Q2792K3073J8693J03753l2955j49098r3197
10150I08832l4715j09385j17834j37828K8367o6287Q3880J08220j4070p3827l8947
10139E36406k7910Q9452O8705j27707j11979r7481j31073n5933J99409J04166
10129D46055j36449k4818J4250n5765O4848m8274J6192K5638n6057o5262L3816
10118B14174p0499j8032q09Q3770L0749j33342l3172m1114P6100M3173Q3571J69273
10106D03842p2698j63216m0474J50925j5600k7222K2160J8634j40588o0880l2768
10095D2115K2165j1070P151N5557J00313M906m2786l6149m2379J14222J7470j40994
10083I0521M2410J01534J12513P2333m7662j43572n616m366J7561o4950O2894
$$ plain form
10072 233600 376298 263535 235955 155937 177742 239014 206922 135737 154369 170586 133142
10061 133142 161539 201865 231043 223062 222348 237913 143545 114564 202362 250037 119504 56629
10049 56629 161401 165045 130235 124023 -54406 -173739 -62374 45145 81282 214707 292937
10038 292937 150456 -93971 -45724 -33050 39757 104148 86876 186763 171135 21993 29341
10027 29341 16482 17606 59857 115086 64105 166441 269151 278580 264956 192334 122565 27675
10015 27675 -37434 -78703 60960 155387 101208 107487 166290 245865 240585 106663 104403 195786
10003 195786 73056 165486 240185 215785 35993 -81378 -3332 162978 103858 79992 6705
9992 6705 8438 86116 271168 285816 38143 -180155 -60872 205366 36122 -66799 -45617
$$ packed form
10072B33600J42698j12763k7580q0018K1805O1272l2092p1185J8632J6217l7444
10061A33142K8397M0326K9178p981p14J5565r4368k8981Q7798M7675j30533o2875
10049E6629J04772L644l4810o212j78429j19333J11365J07519L6137J33425P8230
10038B92937j42481k44427M8247J2674P2807O4391j7272R9887j5628j49142P348
10027B9341j2859J124M2251N5229n0981J02336J02710R429j3624p2622o9769r4890
10015B7675o5109m1269J39663R4427n4179O279N8803P9575n280j33922k260R1383
10003A95786j22730R2430P4699k4400j79792j17371P8046J66310n9120k3866p3287
9992F705J733P7678J85052J4648k47673k18298J19283K66238j69244j02921K1182
$$ plain form
9981 -45617 -98905 -34067 128553 162866 271719 260212 218515 260948 226388 116847 -40132
9970 -40132 84455 141490 204037 204867 75893 -40331 74164 166870 139919 191979 121425
9959 121425 -47367 24893 237158 242133 228512 120006 95408 162302 19987 -49750 42704
9948 42704 91824 120591 137303 83583 146939 275531 424568 456441 329462 197587 24118
9937 24118 24854 184788 229803 224379 243527 195480 243406 314008 241053 57173 -50339 -5112
9925 -5112 -88432 -31102 -7536 -4714 135440 192981 292177 250951 306691 285603 225772 240059
9913 240059 153608 -91665 -304017 -178427 -59319 158131 148635 195756 266007 170207 8785
9902 8785 55638 130607 70150 133675 195416 129676 219363 241124 222604 126593 43333 76757
$$ packed form
9981d5617n3288O4838J62620L4313J08853j1507m1697M2433l4560j09541j56979
9970d0132J24587N7035O2547Q30j28974j16224J14495R2706k6951N2060p0554
9959A21425j68792P2260K12265M975j3621j08506k4598O6894j42315o9737R2454
9948D2704M9120K8767J6712n3720O3356J28592J49037L1873j26979j31875j73469
9937B4118P36J59934M5015n424J9148m8047M7926P0602p2955j83880j07512M5227
9925e112q3320N7330K3566K822J40154N7541R9196m1226N5740k1088n9831J4287
9913B40059q6451k45273k12352J25590J19108K17450r496M7121P0251r5800j61422
9902H785M6853P4969o0457O3525O1741o5740Q9687K1761j8520r6011q3260L3424
$$ plain form
9890 76757 86859 24119 -38653 -116955 -46683 26890 63930 212517 279741 282255 331210 337806
9878 337806 240285 199195 53698 238777 276325 128657 45656 -25157 29136 -40510 49645
9867 49645 225550 200139 72593 37740 98987 185217 201990 159603 70809 67759 171713
9856 171713 201178 164115 156644 147882 187320 156450 110945 -37279 -90094 -31757 -201035 -285254
9844 -285254 -102270 46730 160947 123552 233651 65995 -37250 -10600 8197 204365
9834 204365 227928 144090 83645 79702 92816 53424 137675 27971 106112 86774 75987 240091
9822 240091 267083 239664 279711 226752 231128 219311 221714 169793 13267 -94886 -98549 61879
9810 61879 162004 240911 157513 113740 116308 140296 134669 9998 16533 62618 96642 178855
$$ packed form
9890G6757J0102o2740o2772p8302P0272P3573L7040J48587O7224K514M8955O596
9878C37806r7521m1090j45497J85079L7548j47668q3001p0813N4293o9646R0155
9867D9645J75905k5411j27546l4853O1247Q6230J6773m2387q8794l050J03954
9856A71713K9465l7063p471q762L9438l0870m5505j48224n2815N8337j69278q4219
9844b85254J82984J49000J14217l7395J10099j67656j03245K6650J8797J96168
9834B04365K3563q3838o0445l943J3114l9392Q4251j09704P8141j9338j0787J64104
9822B40091K6992k7419M0047n2959M376j1817K403n1921j56526j08153l663J60428
9810F1879J00125P8907q3398m3773K568K3988n627j24671O535M6085L4024Q2213
$$ plain form
9798 178855 218027 275084 181664 -13985 -15889 -14760 65030 60598 33385 -45559 24051 63500
9786 63500 75745 56669 -2836 -103447 -65043 -2751 54249 119827 34254 -82027 -53856
9775 -53856 -23507 107346 155424 120962 65262 -57271 2393 -30459 -22674 60107 152484 84935
9763 84935 -71224 -87436 -19207 2867 98577 196519 260914 268640 183184 70648 145423 87351
9751 87351 24068 183011 205415 106038 150601 145633 178499 255198 334885 343406 248391 355550
9739 355550 371666 374238 336490 416650 356865 339068 314403 171386 187339 108128 150213 182562
9727 182562 108036 32731 38511 42193 47760 33309 33038 84752 63867 -75203 -79617 16975 25813
9714 25813 22158 111914 131379 146921 271188 271316 205976 203310 196056 190392 89588 126184 125527
$$ packed form
9798A78855L9172N7057r3420j95649j904J129P9790m432k7213p8944O9610L9449
9786F3500J2245j9076n9505j00611L8404O2292N7000O5578q5573j16281K8171
9775e3856L0349J30853M8078l4462n5700j22533N9664l2852P785Q2781R2377o7549
9763H4935j56159j6212O8229K2074R5710R7942O4395P726q5456j12536P4775n8072
9751H7351o3283J58943K2404r9377M4563m968L2866P6699P9687Q521r5015J07159
9739C55550J6116K572l7748Q0160n9785j7797k4665j43017J5953p9211M2085L2349
9727A82562p4526p5305N780L682N567j4451k71N1714k0885j39070m414R6592Q838
9714B5813l655Q9756J9465J5542J24267J28o5340k666p254n664j00804L6596o57
$$ plain form
9701 125527 98390 45966 -34048 -185211 -226647 -203586 -187293 -33703 -13151 -179015 -149388
9690 -149388 85321 98333 129500 161779 17441 -38782 -116512 4418 34789 11491 132376
9679 132376 121309 94839 123461 209982 237220 74557 -102771 -168743 -101498 -35028 -98060
9668 -98060 -81241 -10321 97806 69226 11543 13913 26014 35358 18208 65218 140187 146288
9656 146288 166366 275161 370260 379807 326198 280760 154537 23586 -43833 -132990 -207899
9645 -207899 -180067 -152249 -90722 20744 7938 -179857 -170366 -110271 -67636 -153808 -67939
9634 -67939 104011 202214 200744 77605 -12503 54811 108082 56559 41951 101587 197991 286423
9622 286423 149973 102860 184429 219326 157953 71378 44191 117197 130125 144358 94888
$$ packed form
9701A25527k7137n2424q0014j51163m1436K3061J6293J53590K0552j65864K9627
9690a49388K34709J3012L1167L2279j44338n6223p7730J20930L0371k3298J20885
9679A32376j1067k6470K8622Q6521K7238j62663j77328o5972O7245O6470o3032
9668i8060J6819P0920J08127k8580n7683K370J2101R344j7150M7010P4969O101
9656A46288K0078J08795R5099R547n3609m5438j26223j30951o7419q9157p4909
9645b07899K7832K7818O1527J11466j2806j87795R491O0095M2635q6172Q5869
9634f7939J71950R8203j470j23139r0108O7314N3271n1523j4608N9636R6404Q8432
9622B86423j36450m7113Q1569L4897o1373q6575k7187P3006J2928J4233m9470
$$ plain form
9611 94888 7788 75989 127961 122941 109457 137727 90598 134039 239293 209443 88433 43510
9599 43510 200335 118540 -71578 -301287 -306282 -150519 -92922 -35680 118568 152912 110938
9588 110938 61439 147452 171484 78461 -26488 -33690 -89670 -102966 -70717 -10117 9537 72781
9576 72781 183883 261106 220961 85062 -10459 -143741 -216893 -270263 -68213 -54788 -12274
9565 -12274 -37031 -92536 -77395 -10151 45469 138962 139377 -17895 21618 59599 77243 111567
9553 111567 99877 148279 254001 276822 195162 48624 67483 152641 59853 -45791 27002
9542 27002 41720 -39222 -29990 4766 48862 125246 156175 238013 203994 182957 150617 113954
9530 113954 102526 -11582 -147082 -173881 -216366 -180260 -128973 -23008 8846 6839 -43852
$$ packed form
9611I4888q7100O8201N1972n020j3484K8270m7129M3441J05254k9850j21010m4923
9599D3510J56825q1795j90118k29709m995J55763N7597N7242J54248L4344m1974
9588A10938m9499Q6013K4032r3023j04949p202n5980j3296L2249O0600J9654O3244
9576G2781J11102P7223m0145j35899r5521j33282p3152n3370K02050J3425M2514
9565a2274k4757n5505J5141O7244N5620R3493M15j57272L9513L7981J7644L4324
9553A11567j1690M8402J05722K2821q1660j46538J8859Q5158r2788j05644P2793
9542B7002J4718q0942R232L4756M4096P6384L0929Q1838l4019k1037l2340l6663
9530A13954j1428j14108j35500k6799m2485L6106N1287J05965L1854k007n0691
$$ plain form
9519 -43852 -104521 21347 103611 110752 79354 114062 22952 -78147 -121431 -121871 -51141 14567
9507 14567 51172 96280 184594 212762 140451 162529 187965 100196 39660 -42546 -103575 -166565
9495 -166565 -65003 -9426 -131951 -133840 -115531 -50788 58676 127743 98605 72495 -102172
9484 -102172 -59233 61418 51560 88623 93697 171311 140119 -41912 -124475 -121677 -95661 -80228
9472 -80228 -223277 -128687 -5609 122687 183042 170215 139742 184223 168316 148313 49354
9461 49354 843 -45733 34303 -103662 -311655 -319181 -67509 80422 50717 59161 90026
9450 90026 -78237 -72285 -135761 -49992 71675 85057 62300 183078 223196 162455 103200
9439 103200 -20528 -26457 171734 166598 196921 153714 -58126 -66172 -56801 -155370 -174716 -44931
$$ packed form
9519d3852o0669J25868Q2264P141l1398L4708r1110j01099m3284m40P0730O5708
9507A4567L6605M5108Q8314K8168p2311K2078K5436q7769o0536q2206o1029o2990
9495a66565J01562N5577j22525j889J8309O4743J09464O9067k9138k6110j74667
9484a02172M2939J20651r858L7063N074P7614l1192j82031q2563K798K6016J5433
9472h0228j43049R4590J23078J28296O0355j2827l0473M4481j5907k0003r8959
9461D9354m8511m6576Q0036j37965k07993p526K51672J47931k9705Q444L0865
9450I0026j68263N952o3476Q5769J21667J3382k2757J20778M0118o0741n9255
9439A03200j23728n929J98191n136L0323m3207k11840q046R371r8569j9346J29785
$$ plain form
9427 -44931 70420 324 3348 82595 79838 50026 523 51641 97266 147962 170266 118032
9415 118032 159691 96809 -33675 -110048 -125677 20578 -13395 28890 194857 271167 294365
9404 294365 280359 153433 66200 -17202 19067 50592 9015 152574 165529 114987 268648
9393 268648 174286 -7353 16003 68360 93879 90926 98648 32844 -64766 -134269 -267170 -268475
9381 -268475 -3901 55628 98738 37778 110874 163020 248605 118684 8266 31658 92088
9370 92088 57415 114739 217031 143598 191791 320454 349822 198986 120605 101144 -28921
9359 -28921 -114753 -96727 -38667 -50067 -22121 -38789 -182810 -119175 -98790 -144471 -114932 -185669
9347 -185669 -150555 -79212 21128 24018 67442 18210 131502 226976 49696 -164354 -176754
$$ packed form
9427d4931J15351p0096L024P9247k757k9812m9503N1118M5625N0696K2304n2234
9415A18032M1659o2882j30484p6373j5629J46255l3973M2285J65967P6310K3198
9404B94365j4006j26926q7233q3402L6269L1525m1577J43559J2955n0542J53661
9393B68648r4362j81639K3356N2357K5519k953P722o5804r7610o9503j32901j305
9381b68475K64574N9529M3110o0960P3096N2146Q5585j29921j10418K3392O0430
9370I2088l4673N7324J02292p3433M8193J28663K9368j50836p8381j9461j30065
9359b8921q5832J8026N8060j1400K7946j6668j44021O3635K0385m5681K9539p0737
9347a85669L5114P1343J00340K890M3424m9232J13292R5474j77280k14050j2400
$$ plain form
9336 -176754 -139737 -219297 -74003 -25607 -14723 -4175 -159932 -200360 -161642 52605 140215
9325 140215 162368 91291 46951 122742 240024 170276 250882 266811 228105 246730 201967
9314 201967 52770 -16613 -102095 -107144 3313 63775 -67963 -95564 2611 126303 209792
9303 209792 48958 48533 -23698 -4878 48221 -1124 -101314 -126327 22365 -98224 -63725
9292 -63725 -39978 -44861 -37168 -40679 -22297 15785 89522 154389 33063 -147571 -144802 -116933
9280 -116933 -59418 -9852 28333 -49095 16737 182742 172445 -7469 -8778 -23216 -28522 26223
9268 26223 224542 78363 -152317 -129136 5765 51492 158172 164501 272115 345322 266208
9257 266208 166599 -59578 -245873 -192836 -89169 -175490 -162320 -80730 4167 -41450 -64163
$$ packed form
9336a76754L7017p9560J45294M8396J0884J0548j55757m0428L8718K14247Q7610
9325A40215K2153p1077m4340P5791J17282o9748Q0606J5929l8706J8625m4763
9314B01967j49197o9383q5482n049J10457O0462j31738k7601R8175J23692Q3489
9303B09792j60834m25p2231J8820N3099m9345j00190k5013J48692j20589L4499
9292f3725K3747m883P693l511J8382L8082P3737O4867j21326j80634K769K7869
9280a16933N7515M9566L8185p7428O5832J66005j0297j79914j309j4438n306N4745
9268B6223J98319j46179k30680K3181J34901M5727J06680O329J07614P3207p9114
9257B66208r9609k26177j86295N3037J03667q6321J3170Q1590Q4897m5617k2713
$$ plain form
9246 -64163 13316 91380 58486 27298 38665 -18434 172618 164987 108562 146402 72549 -68733
9234 -68733 -154159 -105418 6057 72144 -24990 -28075 32091 -13784 101077 156117 171149 160546
9222 160546 184419 195872 189470 49942 100296 149370 101770 155659 59335 -214462 -337915
9211 -337915 -267080 -218476 -255282 13632 183791 108602 74393 199952 270542 265024 81181
9200 81181 -161752 -125367 66014 83522 20341 94957 102525 94779 78522 77693 39069 -44936
9188 -44936 -65721 15524 -39137 -32741 -51426 -100817 -115993 -439 36967 -65575 -26476 -11420
9176 -11420 9233 94421 -24855 29441 123196 200134 115506 60584 172293 107396 39272
9165 39272 33875 -117 -44171 -50949 42853 93029 65228 67222 20669 131224 243343 219632
$$ packed form
9246f4163P7479P8064l2894l1188J1367n7099J91052p631n6425L7840p3853j41282
9234f8733q5426M8741J11475O6087r7134l085O0166m5875J14861N5040J5032j0603
9222A60546K3873J1453o402j39528N0354M9074m7600N3889r6324k73797j23453
9211c37915P0835M8604l6806K68914J70159p5189l4209J25559P0590n518j83843
9200H1181k42933L6385J91381J7508o3181P4616P568p746j6257q29l8624q4005
9188d4936k0785Q1245n4661O396j8685m9391j5176J15554L7406j02542L9099J5056
9176a1420K0653Q5188j19276N4296R3755P6938q4628n4922J11709o4897o8124
9165C9272n397l3992m4054o778R3802N0176k7801J994m6553J10555J12119k3711
$$ plain form
9153 219632 141778 161044 189615 77277 -65231 1540 11415 24144 -66187 -92225 -109695
9142 -109695 -169949 -95903 -133903 -116517 -90084 -73061 -104917 -166134 -159689 -692 93538 50725
9130 50725 -102549 340 -40973 -3511 169708 135124 78775 9623 -4633 -31293 34422
9119 34422 50645 115552 55756 -1282 86931 143932 141742 73310 66351 106975 102995 112058 121164
9106 121164 -23272 -197305 -120005 22901 -5915 27062 4492 -81487 -150959 -180467 -87659
9095 -87659 -24421 68986 135848 41991 102402 241681 314893 310757 324187 299971 195222 158850
9083 158850 65663 -42936 -44501 -96874 119255 157579 57796 26349 5640 -34409 35209
9072 35209 -7878 -85385 -108449 -54347 9780 55679 137850 147198 160150 112985 182852 124268
$$ packed form
9153B19632p7854J9266K8571j12338j42508O6771R875J2729r0331k6038j7470
9142a09695o0254P4046l8000J7386K6433J7023l1856o1217O445J58997R4230m2813
9130E0725j53274J02889m1313L7462J73219l4584n6349o9152j4256k6660O5715
9119C4422J6223O4907n9796n7038Q8213N7001k190o8432o959M0624l980R063R106
9106A21164j44436j74033P7300J42906k8816L2977k2570q5979o9472k9508R2808
9095h7659O3238R3407O6862r3857O0411J39279P3212m136J3430k4216j04749l6372
9083A58850r3187j08599j565n2373K16129L8324r9783l1447k0709m0049O9618
9072C5209m3087p7507k3064N4102O4127M5899Q2171R348J2952m7165O9867n8584
$$ plain form
9060 124268 -64104 -136638 10534 225588 381180 312004 245278 161263 10385 -92171
9050 -92171 4600 81746 98676 111909 178237 101979 35931 -11872 -30143 22108 89610 32054
9038 32054 -10554 -100036 37540 187608 187282 125020 -2524 -26765 -55634 49935 86648
9027 86648 -98486 -158853 -186041 -115406 -97893 -55731 -35350 -86991 -69965 -17531 31822 4909
9015 4909 97175 88536 -8933 -66814 -191831 -202192 -119658 11397 112074 71981 -161093
9004 -161093 -76560 82884 6921 -11602 11529 65727 112153 5415 166639 300489 320518
8993 320518 293353 306816 247775 175251 90034 7242 64455 10298 -40398 -27463 -157794
8982 -157794 -181319 -18146 87097 -131735 -207592 -27413 -9547 -96221 38112 148776
$$ packed form
9060A24268j88372p2534J47172K15054J55592o9176o6726q4015j50878j02556
9050i2171R6771P7146J6930J3233O6328p6258o6048m7803j8271N2251O7502n7556
9038C2054m2608q9482J37576J50068l26o2262j27544k4241k8869J05569L6713
9027H6648j85134o0367k7188P0635J7513M2162K0381n1641J7026N2434M9353k6913
9015D909R2266q639r7469n7881j25017j0361Q2534J31055J00677m0093k33074
9004a61093Q4533J59444p5963j8523K3131N4198M6426j06738J61224J33850K0029
8993C20518k7165J3463n9041p2524q5217q2792N7213n4157n0696J2935j30331
8982a57794k3525J63173J05243k18832p5857J80179J7866q6674J34333J10664
$$ plain form
8972 148776 177279 165837 30241 -69180 -12717 117006 78434 -23399 -51111 -31400 -119158
8961 -119158 -177839 -214129 -169315 -46206 118630 36933 -32032 -48761 55174 169555 179939
8950 179939 216733 218338 64738 61725 45823 -40320 -118674 -64055 8858 186409 294132
8939 294132 262524 205393 96558 161522 218381 53612 -66032 12361 99453 154243 121401
8928 121401 118611 126791 204261 186392 83451 -43742 -47036 -90328 -144329 -122982 -161022 -176772
8916 -176772 -136823 -73570 -72792 -25722 21250 157774 82675 36402 71030 88747 111718 226863
8904 226863 208223 204124 174258 215120 131611 47666 184609 249212 137999 129859 105729 38210
8892 38210 -31036 19243 60957 -86149 -93502 25026 -84004 -21197 26429 -1325 -3829 50124
$$ packed form
8972A48776K8503j1442j35596r9421N6463J29723l8572j01833k7712J9711q7758
8961a19158n8681l6290M4814J23109J64836q1697o8965j6729J03935J14381J0384
8950A79939L6794J605j53600l013j5902q6143p8354N4619P2913J77551J07723
8939B94132l1608n7131j08835O4964N6859j64769j19644P8393Q7092N4790l2842
8928A21401k790Q180P7470j7869j02941j27193l294m3292n4001K1347l8040j5750
8916a76772L9949O3253P78M7070M6972J36524p5099m6273L4628J7717K2971J15145
8904B26863j8640m099k9866M0862q3509q3945J36943O4603j11213q140k4130o7519
8892C8210o9246N0279M1714j47106p353J18528j09030O2807M7626k7754k504N3953
$$ plain form
8880 50124 30888 8323 55479 72667 -29698 -165122 -29149 56687 -72318 -227732 -198561
8869 -198561 -84353 -112634 -204698 -185549 -184990 -95696 -8119 63254 149727 110147 132724 29341
8857 29341 62594 116139 68823 5723 9800 122576 191638 181129 126333 140522 146974 61227
8845 61227 54942 37755 120270 157047 33164 -49028 -102081 -67742 -50943 -39183 35277 146799
8833 146799 186664 128656 90071 225064 261825 53798 -4715 74426 186023 -60221 -210601
8822 -210601 -199262 -196131 -74003 -22818 -93162 -169050 -189598 -311484 -263861 -225764 -251818
8811 -251818 -127136 -63949 -128162 -59490 -101482 -185726 -78794 44217 97000 180465 260281
8800 260281 350086 169234 -8505 40010 195017 102158 152574 80606 -109417 -77945 578
$$ packed form
8880E0124j9236k2565M7156J7188j02365j35424J35973Q5836j29005j55414K9171
8869a98561J14208k8281r2064J9149N59Q9294Q7577P1373Q6473l9580K2577j03383
8857B9341L3253N3545m7316o3100M077J12776O9062j0509n4796J4189O452q5747
8845F1227o285j7187Q2515L6777j23883q2192n3053L4339J6799J1760P4460J11522
8833A46799L9865n8008l8585J34993L6761k08027n8513P9141J11597k46244j50380
8822b10601J1339L131J22128N1185p0344p5888k0548j21886M7623L8097k6054
8811b51818J24682O3187o4213O8672m1992q4244J06932J23011N2783Q3465P9816
8800B60281Q9805j80852j77739M8515J55007r2859N0416p1968j90023L1472P8523
$$ plain form
8789 578 15897 40455 59431 12236 23101 107604 122511 73248 -63809 -145875 -92676 14272
8777 14272 58701 6136 -85730 55165 142557 98060 222177 179862 151264 106543 109231 22089
8765 22089 31537 195100 250457 190874 165848 140802 -2830 -86930 2160 47288 76144 76257
8753 76257 -16393 -78677 -213962 -273075 -209379 -183334 -85268 60372 77760 -124547 -171206
8742 -171206 -84441 -18648 208949 180627 43858 59885 35826 124880 225288 178014 202453
8731 202453 85328 -85368 62760 184186 83213 198803 203940 67106 7435 -5429
8721 -5429 -51806 27265 104214 125763 84463 -27834 -60337 -72535 -85141 12426 96072 190860
8709 190860 207384 221031 142608 150604 137206 74663 189181 165213 202559 233963 227405 198215
$$ packed form
8789E78J5319K4558J8976m7195J0865Q4503J4907m9263j37057q2066N3199J06948
8777A4272M4429n2565r1866J40895Q7392m4497J24117m2315k8598m4721K688q7142
8765B2089R448J63563N5357n9583k5026k5046j43632q4100Q9090M5128K8856J13
8753G6257r2650o2284j35285n9113O3696K6045R8066J45640J7388k02307m6659
8742a71206Q6765O5793K27597k8322j36769J6027k4059Q9054J00408m7274K4439
8731B02453j17125j70696J48128J21426j00973J15590N137j36834n9671j2864
8721e429m6377P9071P6949K1549m1300j12297l2503j2198j2606R7567Q3646R4788
8709A90860J6524J3647p8423P996j3398o2543J14518k3968L7346L1404o558k9190
$$ plain form
8697 198215 256731 132979 99160 141644 92812 61240 56728 -34909 25606 159386 120212
8686 120212 -5012 27652 20476 -48903 -97983 -122979 -48192 -56481 -56385 -88333 -2023 106814
8674 106814 132410 174752 121838 162282 80120 -55707 -36563 -9717 33965 76806 118837
8663 118837 130295 191391 213207 139883 57912 139905 227647 123829 106410 93494 203235
8652 203235 180057 22903 -15442 -557 96219 254740 193836 6436 -137841 -183563 -59634
8641 -59634 -48042 -35335 -81094 -116197 14342 67263 44589 10118 13293 101097 88541 161485
8629 161485 130473 -35048 -117237 -258551 -165538 -120116 -69394 -42316 -73961 -96 100286
8618 100286 186457 59725 -33930 43719 74048 131009 -4724 -24106 -22387 5112 73526
$$ packed form
8697A98215N8516j23752l3819M2484m8832l1572m512r1637O0515J33780l9174
8686A20212j25224L2664p176o9379m9080k4996P4787q289R6l1948Q6310J08837
8674A06814K5596M2342n2914M0444q2162j35827J9144K6846M3682M2841M2031
8663A18837J1458O1096K1816p3324q1971Q1993Q7742j03818j7419j2916J09741
8652B03235k3178j57154l8345J4885R6776J58521o0904j87400j44277m5722J23929
8641e9634J1592J2707m5759l5103J30539N2921k2674l4471L175Q7804j2556P2944
8629A61485l1012j65521q2189j41314R3013M5422N0722K7078l1645P3865J00382
8618A00286Q6171j26732r3655P7649L0329N6961j35733j9382J719K7499O8414
$$ plain form
8607 73526 198162 109358 77261 118292 140790 198241 120739 -11288 36367 9612 108945
8596 108945 130314 75729 131329 262357 194258 158466 132095 91180 215396 110887 34562
8585 34562 46615 -36215 -82105 -55053 -99602 -29516 138424 16063 -35469 -102806 -80819
8574 -80819 -140270 -109489 24171 47478 156959 100818 23133 -24297 -64139 -48934 -51825 465
8562 465 -74464 70815 163009 136722 99782 42306 5632 46229 93409 -36737 -119945 -196804
8550 -196804 -204501 -201342 -121423 13194 65929 48186 50253 -103562 -134279 22550 177602
8539 177602 153682 112728 77387 -27987 -49380 -42068 15470 89889 128263 1456 22840
8528 22840 13651 -22281 -140319 -97421 -1362 -40252 -82634 -91779 -153337 -183898 -245740 -209110
$$ packed form
8607G3526J24636q8804l2097M1031K2498N7451p7502j32027M7655k6755R9333
8596A08945K1369n4585N5600J31028o8099l5792k6371m0915J24216j04509p6325
8585C4562J2053q2830m5890K7052m4549P0086J67940j22361n1532o7337K1987
8574h0819n9451L0781J33660K3307J09481n6141p7685m7430l9842J5205k891N2290
8562D65p4929J45279R2194k6287l6940n7476l6674M0597M7180j30146q3208p6859
8550a96804p697L159P9919J34617N2735j7743K067j53815l0717J56829J55052
8539A77602k3920m0954l5341j05374k1393P312N7538P4419L8374j26807K1384
8528B2840r189l5932j18038M2898R6059l8890m2382r145o1558l0561o1842L6630
$$ plain form
8516 -209110 -79158 -123153 -170573 -256822 -494284 -432725 -122341 -22028 -83544 -154537 -127418
8505 -127418 -151508 -82445 66992 72321 -20976 -206589 -243302 -228677 -203750 -249600 -236085
8494 -236085 -125504 105079 122995 61446 121569 97339 143307 201161 204372 270708 244611
8483 244611 310374 273822 235102 291697 322623 181477 61636 78466 85177 78071 31487 55729
8471 55729 95044 142335 33699 -42441 23161 35164 -10509 90175 161858 310995 217948
8460 217948 126978 138151 198004 123647 51757 36043 91491 134652 190036 194679 124741 118083
8448 118083 66330 -44493 -78658 -19466 108452 219314 279177 223016 189215 133378 103630
8437 103630 91297 -26360 92949 33965 -76362 -86254 2724 112352 14418 -105161 -91690
$$ packed form
8516b09110J29952m3995m7420q6249k37462O1559L10384J00313o1516p0993K7119
8505a27418k4090O9063J49437N329r3297j85613l6713J4625K4927m5850J3515
8494b36085J10581K30583J7916o1549O0123k4230M5968N7854L211O6336k6097
8483B44611O5763l6552l8720N6595L0926j41146j19841J6830O711p106m6584K4242
8471E5729L9315M7291j08636p6140O5602J2003m5673J00684P1683J49137r3047
8460B17948r0970J1173N9853p4357p1890j5714N5448M3161N5384M643o9938o658
8448A18083n1753j10823l4165N9192J27918J10862N9863n6161l3801n5837k9748
8437A03630j2333j17657J19309n8984j10327r892Q8978J09628r7934j19579J3471
$$ plain form
8426 -91690 -32016 -3594 -30302 -58765 -198967 -115357 12110 72445 -27254 17915 81873
8415 81873 118628 133548 81493 159112 151696 86939 84261 153349 25144 16716 225298 117468
8403 117468 -79736 -104097 -62658 -38659 -143404 -27077 20866 -8366 55800 781 -33117
8392 -33117 -75599 -106134 -81488 -171547 -196740 -35513 149978 92094 -46670 -55636 -142184
8381 -142184 -243044 -103347 -115860 -155784 -161317 -140307 33770 166908 106402 38332 4231
8370 4231 58887 158953 160202 124924 99958 43128 -19782 31804 91823 56344 66071 72338
8358 72338 73973 71040 88069 76894 116933 115344 98471 109359 59419 -31656 -35229 25511 36591
8345 36591 -9460 49925 43422 -9853 -33890 -118085 -7374 -3576 -14500 -23799 -18501 29080
$$ packed form
8426i1690N9674K8422k6708k8463j40202Q3610J27467O0335r9699M5169O3958
8415H1873L6755J4920n2055P7619p416o4757k678O9088j28205q428K08582j07830
8403A17468j97204k4361M1439K3999j04745J16327M7943k9232O4166n5019l3898
8392c3117m2482l0535K4646r0059k5193J61227J85491n7884j38764q966q6548
8381a42184j00860J39697j2513l9924n533K1010J74077J33138o0506o8070l4101
8370D231N4656J00066J249l5278k4966n6830o2910N1586O0019l5479R727O267
8358G2338J635k933J7029j1175M0039j589j6873J0888m9940r1075l573O0740J1080
8345C6591m6051N9385o503n3275k4037q4195J10711L798j0924r299N298M7581
$$ plain form
8333 29080 92653 120312 53887 -35987 88932 126932 39977 -24831 27187 76905 -343 -88075
8321 -88075 -59665 -17188 -41948 -67055 -136551 -120947 -66594 -127619 -105257 -169418 -81894 -61828
8309 -61828 -34591 -98622 -243541 -305288 -186173 -107468 -1194 -84763 -43193 41593 10447
8298 10447 -44841 -98558 -63149 -30129 -3622 16852 39463 56437 57292 90041 96297 -103383
8286 -103383 -217826 -286625 -185737 -24159 22701 -2098 -65379 -209648 -194207 -146066 13727
8275 13727 -51534 -60188 5903 60265 -93141 -414 14175 110730 53854 -39164 21017 50046
8263 50046 -52700 -31012 -48538 -55034 -128000 -216425 -70703 12450 20794 41055 3067 -42456
8251 -42456 -56178 -145567 24140 198622 88337 -26145 -81231 -61311 55089 -2771 -54584
$$ packed form
8333B9080O3573K7659o6425q9874J24919L8000q6955o4808N2018M9718p7248q7732
8321h8075K8410M2477k4760k5107o9496J5604N4353o1025K2362o4161Q7524K0066
8309f1828K7237o4031j44919o1747J19115P8705J06274q3569M1570Q4786l1146
8298A0447n5288n3717L5409L3020K6507K0474K2611J6974Q55L2749O256j99680
8286a03383j14443o8799J00888J61578M6860k4799o3281j44269J5441M8141J59793
8275A3727o5261q654O6091N4362j53406R2727J4589R6555n6876r3018O0181K9029
8263E0046j02746K1688j7526o496p2966q8425J45722Q3153Q344K0261l7988m5523
8251d2456j3722q9389J69707J74482j10285j14482n5086J9920J16400n7860n1813
$$ plain form
8240 -54584 50252 109896 66216 -80318 -247758 -211914 -89557 19248 83259 -47341 -175762
8229 -175762 -155613 -86704 -134424 -155598 -59066 1480 -15838 -51217 -99656 -141705 -168545 -137998
8217 -137998 -122575 -74181 -92408 -67111 -108950 -109952 -173265 -76415 43081 136035 152353 160858
8205 160858 21263 -24687 9779 62457 73221 181985 156070 180844 131347 38091 -123856
8194 -123856 -65363 77902 33016 224782 204005 105721 180530 75236 -7644 -72885 -63407
8183 -63407 -111595 -127155 -140464 -103584 -90631 -51896 -58416 -163486 -210342 -139736 -43619 -19269
8171 -19269 -66748 -55420 9893 63681 3006 -56696 -107067 -154836 -146783 -180509 -159347 -78354
8159 -78354 -170206 -248598 21628 66169 61652 130472 26525 -12580 44392 38118 105541 -31355
$$ packed form
8240e4584J04836N9644m3680j46534j67440L5844J22357J08805O4011j30600j28421
8229a75762K0149O8909m7720k1174R6532O0546j7318l5379m8439m2049k6840L0547
8217a37998J5423M8394j8227K5297m1839j002o3313R6850J19496R2954J6318Q505
8205A60858j39595m5950L4466N2678J0764J08764k5915K4774m9497r3256j61947
8194a23856N8493J43265m4886J91766k0777r8284P4809j05294q2880o5241R478
8183f3407m8188j5560j3309L6880J2953L8735o520j05070m6856P0606R6117K4350
8171a9269m7479J1328O5313N3788o0675n9702n0371m7769Q053l3726K1162Q0993
8159g8354r1852p8392K70226M4541m517O8820j03947l9105N6972o274O7423j36896
$$ plain form
8147 -31355 -92557 -68318 -163580 -157252 -88878 -3667 164487 252448 236865 252056 176934 265159
8135 265159 331451 206860 153610 80973 68658 143554 239362 269899 181402 146564 104216
8124 104216 -15795 -91748 -95855 -92494 -128183 -110053 -14153 -93388 -221652 -296402 -281271 -196334
8112 -196334 -37763 -71671 -125685 -36720 -72518 -98802 -48998 -70866 27937 72974 109402
8101 109402 -30333 -113682 -128040 -89470 -117715 -77687 -9521 46094 64524 16242 102368
8090 102368 99151 103324 46244 24737 23121 -69758 -170873 -144819 -58648 -100905 -79202 -20111
8078 -20111 -10877 -83962 -74302 -89322 -76985 -54508 59105 82105 98073 40973 61859 -39261
8066 -39261 -145079 -156052 -48875 -30576 -41997 56424 56257 -64474 -159667 -281990 -321138
$$ packed form
8147c1355o1202K4239r5262O328O8374Q5211J68154Q7961j5583J5191p5122Q8225
8135B65159O6292j24591n3250p2637j2315P4896R5808L0537q8497l4838m2348
8124A04216j20011p5953m107L361l5689J8130R5900p9235j28264p4750J5131Q4937
8112a96334J58571l3908n4014Q8965l5798k6284M9804k1868R8803M5037L6428
8101A09402j39735q3349j4358L8570k8245M0028O8166N5615J8430m8282Q6126
8090A02368l217M173n7080k1507j616r2879j01115K6054Q6171m2257K1703N9091
8078b0111R234p3085R660j5020J2337K2477J13613K3000J5968n7100K0886j01120
8066c9261j05818j0973J07177J8299j1421R8421j67j20731r5193j22323l9148
$$ plain form
8055 -321138 -117505 24512 -11062 86349 154113 55814 -23929 64840 47075 -33397 -129682
8044 -129682 -163995 -99359 -10008 -44852 -19506 -4353 -135916 -139492 -108853 -56131 1443 62869
8032 62869 126019 13811 72417 138197 85360 -49717 -53126 111133 168457 225594 132820
8021 132820 117052 103648 107187 107201 23874 -117989 14565 304907 401895 254545 97908
8010 97908 63485 -45565 -57216 -83479 -195818 -161532 -156542 -209522 -179175 -32082 -25613 7440
7998 7440 29405 154164 281446 155340 70339 167932 207258 151974 67457 -41034 -84233
7987 -84233 9489 100050 176381 139215 127711 187130 132833 55170 5893 -43536 -82005 -232019
7975 -232019 -165509 -40745 76454 106135 -68074 -71690 -109316 -65411 37137 5442 -12826
$$ packed form
8055c21138K03633J42017l5574R7411O7764r8299p9743Q8769j7765q0472r6285
8044a29682l4313O4636Q9351l4844K5346J5153j31563l576L0639N2722N7574O1426
8032F2869O3150j12208N8606O5780n2837j35077l409J64259N7324N7137r2774
8021A32820j5768j3404L539J4q3327j41863J32554K90342R6988j47350j56637
8010I7908l4423j09050j1651k6263j12339L4286M990n2980L0347J47093O469L3053
7998G440K1965J24759J27282j26106q5001R7593L9326n5284q4517j08491m3199
7987h4233R3722R0561P6331l7166j1504N9419n4297p7663m9277m9429l8469j50014
7975b32019O6510J24764J17199K9681j74209l616l7626M3905J02548l1695j8268
$$ plain form
7964 -12826 7289 43047 -52168 18253 36062 -75402 -218696 -178566 -1606 125509 5239
7953 5239 -64803 28013 -124404 -235010 -256282 -354344 -259063 -59817 -63137 -36731 50217 31892
7941 31892 -38763 -82733 -105138 -123113 50178 103906 69338 -73080 -236812 -241335 -164454
7930 -164454 -79919 -41224 -108074 -141228 -106373 45018 121859 32509 -80804 -165068 -95420
7919 -95420 -175566 -126971 3044 9318 -30515 -61545 -72426 -78400 31940 -53816 -131676 -209789
7907 -209789 -181281 -214934 -268516 -211750 -79091 -109965 -118294 -38224 77746 69196 -88816
7896 -88816 -47605 25908 -82053 -191992 -116703 -7541 -101149 -113811 -136782 -136000 -107835 -195209
7884 -195209 -212126 -271129 -340434 -259651 -85530 48116 -30453 -211968 -7243 145705 199727
$$ packed form
7964a2826K0115L5758r5215P0421J7809j11464j43294M0130J76960J27115j20270
7953E239p0042R2816j52417j10606k1272r8062R5281J99246l320K6406Q6948j8325
7941C1892p0655m3970k2405j7975J73291N3728l4568j42418j63732m523P6881
7930a64454Q4535L8695o6850l3154L4855J51391P6841q9350j13313q4264O9648
7919i5420q0146M8595J30015O274l9833l1030j0881n974J10340q5756p7860p8113
7907b09789K8508l3653n3582N6766J32659l0874q329Q0070J15970q550j58012
7896h8816M1211P3513j07961j09939P5289J09162r3608j2662k2971P82K8165q7374
7884a95209j6917n9003o9305Q0783J74121J33646p8569j81515K04725J52948N4022
$$ plain form
7873 199727 72437 35406 -93169 -140425 -77987 4184 75536 63650 -25508 -38807 -54095
7862 -54095 -90792 -97729 -44512 97122 19351 -120910 -96012 -6886 10812 45042 132320 94527
7850 94527 68544 101148 113682 87651 112955 40899 5213 67980 33916 -73358 -63167 -17501
7838 -17501 -19763 -100069 -152149 -261084 -315331 -303295 -190167 -323989 -308405 -112718 -52286
7827 -52286 107541 61850 13 -48588 -197437 -271499 -241237 -128277 -37473 18824 9535
7816 9535 -128444 -70929 40836 168659 141260 37527 69159 6597 47044 8067 -11276
7805 -11276 52518 52028 24223 203 55301 34136 -55137 33909 27343 13767 13789 -57247 -10551
7792 -10551 -42971 -240273 -215035 -164233 -78583 28458 -111267 -161687 -36874 -88254 -93608
$$ packed form
7873A99727j27290l7031j28575m7256O2438Q2171P1352j1886q9158j3299j5288
7862e4095l6697o937N3217J41634p7771j40261K4898Q9126J7698L4230Q7278l7793
7850I4527k5983L2604J2534k6031K5304p2056l5686O2767l4064j07274J0191M5666
7838a7501k262q0306n2080j08935n4247J2036J13128j33822J5584J95687O0432
7827e2286J59827m5691o1837m8601j48849p4062L0262J12960R0804N6297r289
7816I535j37979N7515J11765J27823k7399j03733L1632o2562M0447l8977j9343
7805a1276O3794m90k7805k4020N5098k1165q9273Q9046o566j3576K2p1036M6696
7792a0551l2420j97302K5238N0802Q5650J07041j39725n0420J24813n1380n354
$$ plain form
7781 -93608 27505 159308 95877 108821 54341 73366 41194 -61607 -56287 -193420 -298875
7770 -298875 -222144 -80388 -111385 -65561 -24136 -59083 -37097 -43103 -7672 170855 333502
7759 333502 303972 321304 198970 73436 63559 47799 -87486 -197276 -193091 -43578 -6484
7748 -6484 18588 17526 62551 67616 -6697 16030 22904 -67947 -5651 -60502 39935 139795
7736 139795 153769 75707 113935 -18803 -81986 -107460 -130291 -91717 -178661 -137774 -51296
7725 -51296 -23472 -8052 -67061 -39988 101662 247691 286681 176742 74798 -82689 -175054
7714 -175054 -214309 -85775 -94925 -79038 33545 63943 23239 39472 77984 113762 -34338
7703 -34338 -47410 74502 83899 164150 122748 188511 191106 150631 120479 81714 143431 213087
$$ packed form
7781i3608J21113J31803o3431J2944n4480J9025l2172j02801N320j37133j05455
7770b98875P6731J41756l0997M5824M1425l4947K1986o006L5431J78527J62647
7759C33502k9530J7332j22334j25534r877j5760j35285j09790M185J49513L7094
7748f484K5072j062M5025N065p4313K2727O874r0851O2296n4851J00437R9860
7736A39795J3974p8062L8228j32738o3183k5474k2831L8574q6944M0887Q6478
7725e1296K7824J5420n9009K7073J41650J46029L8990j09939j01944j57487r2365
7714a75054l9255J28534r150J5887J12583L0398m0704J6233L8512L5778j48100
7703c4338j3072J21912R397Q0251m1402O5763K595m0475l0152l8765O1717O9656
$$ plain form
7691 213087 147929 90814 4858 -6950 112620 163301 127883 -305 -114726 -73335 -147561
7680 -147561 -178998 -46103 96780 84935 -2709 -57495 -123640 -137364 -93182 62917 100064
7669 100064 184000 53990 135511 62785 -12575 -93045 -138053 -213768 -250560 -162156 -151788
7658 -151788 -100201 -52580 -38452 -174640 -206200 -162467 -89350 -31095 -31391 -58114 -136625 -310765
7646 -310765 -242817 -222659 -315563 -244545 -86825 -3195 11270 16891 -81223 -129112 -65239 -3371
7634 -3371 22114 72671 99946 116638 66868 -85648 -106282 43162 58027 -109576 -203533
7623 -203533 -155259 40201 88316 148447 61166 68912 -78724 -130515 58181 132895 90248
7612 90248 -24239 -105606 -21002 59705 158493 169908 130804 176934 141254 62883 76081 100959
$$ packed form
7691B13087o5158n7115q5956j1808J19570N0681l5418j28188j14421M1391p4226
7680a47561l1437J32895J42883j1845q7644n4786o6145j3724M4182J56099L7147
7669A00064Q3936j30010Q1521p2726p5360q0470m5008p5715l6792Q8404J0368
7658a51788N1587M7621J4128j36188l1560M3733P3117N8255k96k6723p8511j74140
7646c10765O7948K0158r2904P1018J57720Q3630J4465N621r8114m7889O3873O1868
7634c371K5485N0557K7275J6692m9770j52516k0634J49444J4865j67603r3957
7623b03533M8274J95460M8115O0131q7281P746j47636n1791J88696P4714m2647
7612I0248j14487q1367Q4604Q0707R8788J1415l9104M6130l5680p8371J3198K4878
$$ plain form
7600 100959 115293 -149 -64602 -166792 -355793 -289668 -124986 -17463 124931 45468
7590 45468 103681 41642 20014 46058 -43675 -93057 -246313 -230247 -172428 -75636 -6933 35830
7578 35830 115028 158596 181140 32166 30861 -91821 -196853 -76806 -56198 -14255 -30204
7567 -30204 -90725 -188185 -336952 -342566 -232107 -154374 -76808 -49399 -138479 -189145 -211903 -234167
7555 -234167 -168861 -114727 -111475 -29572 25919 9642 8887 115331 143053 162972 187380 100267
7543 100267 93791 50479 87316 104920 236947 219475 257803 215212 156626 -5390 -231874
7532 -231874 -125705 -35289 -176570 -334533 -435454 -387403 -209833 -104356 -47700 -146130
7522 -146130 -45142 44616 -29500 -24576 170388 215299 100465 74509 90828 6563 86183
$$ packed form
7600A00959J4334j15442o4453j02190j89001O6125J64682J07523J42394p9463
7590D5468N8213o2039k1628K6044q9733m9382j53256J6066N7819R6792O8703M2763
7578C5830P9198M3568K2544j48974j305j22682j05032J20047K0608M1943j5949
7567c0204o0521r7460j48767n614J10459P7733P7566K7409q9080n0666k2758k2264
7555b34167O5306N4134L252Q1903N5491j6277p55J06444K7722J9919K4408q7113
7543A00267o476m3312L6837J7604J32027j7472L8328m2591n8586j62016k26484
7532b31874J06169R0416j41281j57963j00921M8051J77570J05477N6656r8430
7522a46130J00988Q9758p4116M924J94964M4911j14834k5956J6319q4265P9620
$$ plain form
7511 86183 178161 212839 176097 171351 65594 12266 -9121 -92482 -240656 -263385 -316147 -206959
7499 -206959 -102997 -95428 -37068 -103609 -116296 -136327 -295353 -260403 -66543 -33471 -19008
7488 -19008 -86601 -170186 -243499 -277519 -220504 -175708 -4890 63554 -147 -15729 -32928 -57007
7476 -57007 -116073 -185198 -150026 -58388 -66046 -86397 41833 34892 -26041 -109820 -29748 63744
7464 63744 133718 176829 137917 104221 61321 -32890 -159429 -92781 -19236 5938 58258 153652
7452 153652 22022 -58634 -103957 -158326 -111995 -128107 -156874 -156923 -102724 -144375 -48892 -246142
7440 -246142 -365559 -349252 -238500 -237491 -291141 -243862 -183704 -146816 -81316 4399 32448
7429 32448 3600 2577 8446 -109308 -74276 72418 163577 126103 -31234 -57213 42454 91378
$$ packed form
7511H6183R1978L4678l6742m746j05757n3328k1387q3361j48174k2729n2762J09188
7499b06959J03962P569N8360o6541j2687k0031j59026L4950J93860L3072J4463
7488a9008o7593q3585p3313l4020N7015M4796J70818O8444o3701j5582j7199k4079
7476e7007n9066o9125L5172R1638p658k0351J28230o941o0933q3779Q0072R3492
7464F3744O9974M3111l8912l3696m2900r4211j26539O6648P3545K5174N2320R5394
7452A53652j31630q0656m5323n4369M6331j6112k8767m9N4199m1651R5483j97250
7440b46142j19417J6307J10752J009n3650M7279O0158L6888O5500Q5715K8049
7429C2448k8848j023N869j17754L5032J46694R1159l7474j57337k5979R9667M8924
$$ plain form
7417 91378 -50738 -125109 -85058 107610 251074 84060 -76626 -157843 -125909 -73304 -60116
7406 -60116 -49972 -80804 -49749 -165213 -153521 -81472 -74972 -117694 -117294 4690 55179 88880
7394 88880 129745 218134 133912 140574 125204 62600 -74418 -123947 -73474 -141366 -159263 -118488
7382 -118488 -196050 -323156 -255961 -209453 -234374 -238871 -207237 -193443 -155970 -70647 -87308 -44416
7370 -44416 -58799 -113672 -21118 -27247 -21 151859 95174 20971 45842 -43809 -124266 21389
7358 21389 -13767 -42253 -131032 -229981 -215358 -144319 -69793 -24988 93339 224038 176063
7347 176063 23714 58953 84913 82159 9707 -123921 -138914 -183104 -77811 84666 54966
7336 54966 -52097 -37225 -62380 25943 71726 36869 -6959 -1935 25408 60612 -36515 -77482
$$ packed form
7417I1378j42116p4371M0051J92668J43464j67014j60686q1217L1934N2605J3188
7406f0116J0144l0832L1055j15464J1692P2049O500m2722M00J21984N0489L3701
7394H8880M0865Q8389q4222O662j5370o2604j37018m9529N0473o7892j7897M0775
7382a18488p7562j27106O7195M6508k4921m497L1634J3794L7473Q5323j6661M2892
7370d4416j4383n4873R2554o129K7226J51880n6685p4203K4871q9651q0457J45655
7358B1389l5156k8486q8779r8949J4623P1039P4526M4805J18327J30699m7975
7347A76063j52349L5239K5960k754p2452j33628j4993m4190J05293J62477k9700
7336E4966j07063J4872k5155Q8323M5783l4857m3828N024K7343L5204r7127m0967
$$ plain form
7324 -77482 -110851 -78443 -206290 -202408 -14910 39950 -27777 84636 82546 2772 70725 -36658
7312 -36658 -141572 -34778 -116423 -228468 -232421 -227228 -288887 -73762 88356 77293 -29905
$$ packed form
7324g7482l3369L2408j27847L882J87498N4860o7727J12413k090p9774O7953j07383
7312c6658j04914J06794q1645j12045l953N193o1659K15125J62118j1063j07198
$$ [...]
##END NTUPLES=NMR SPECTRUM
##END=
