##TITLE=Analysis number 323233
Compound Code cc 21102
Book Reference 483/72/2
Project Code adrs
Chemist Name mattw
##JCAMPDX= 6.0         $$ Bruker NMR JCAMP-DX V2.0
##DATA TYPE= NMR SPECTRUM
##DATA CLASS= NTUPLES
##ORIGIN= Bruker BioSpin GmbH
##OWNER= nmr
$$ XWIN-NMR		Version 3.5
$$ Thu Oct 19 08:35:49 2006 GMT Daylight Time (UT+1h)  MAYBRIDGE\nmr@NMR_250MHZ
##.OBSERVE FREQUENCY= 250.131544655141
##.OBSERVE NUCLEUS= ^1H
##.ACQUISITION MODE= SIMULTANEOUS (DQD)
##.ACQUISITION SCHEME= undefined
##.AVERAGES= 16
##.DIGITISER RES= 18
##SPECTROMETER/DATA SYSTEM= dpx250
##.PULSE SEQUENCE= zg30
##.SOLVENT NAME= CDCl3
##.SHIFT REFERENCE= (INTERNAL, CDCl3, 0, 16.522)
##AUDIT TRAIL= $$ (NUMBER, WHEN, WHO, WHERE, WHAT)
$$ ##TITLE= Audit trail, XWIN-NMR		Version 3.5
$$ ##JCAMPDX= 5.01
$$ ##ORIGIN= Bruker BioSpin GmbH
$$ ##OWNER= nmr
$$ C:\u/data/dgb/nmr/ADRS/930/pdata/1/auditp.txt
$$ ##AUDIT TRAIL=  $$ (NUMBER, WHEN, WHO, WHERE, WHAT)
(   1,<2006-10-19 08:35:25.95 +100>,<MAYBRIDGE\nmr>,<NMR_250MHZ>,
      <created by zg, POWCHK disabled, PULCHK disabled
       configuration hash MD5:
       49 4B E0 1D 92 C2 6B 37 9F E6 65 BC 52 41 86 1D
       data hash MD5: 64K
       6C 4A 74 62 57 C6 9F FB 91 6B 2C 06 D0 1D 0A E6>)
(   2,<2006-10-19 08:35:39.56 +100>,<MAYBRIDGE\nmr>,<NMR_250MHZ>,
      <Start of raw data processing
       ef LB = 0.3 FT_mod = 6 PKNL = 1 SI = 32K 
       data hash MD5: 32K
       B9 08 AE F4 B5 B3 C4 BB 2D 59 FF 4E 3F BA 39 D6>)
(   3,<2006-10-19 08:35:41.20 +100>,<MAYBRIDGE\nmr>,<NMR_250MHZ>,
      <apk 
       data hash MD5: 32K
       05 F0 01 15 AA 53 77 B3 9D 20 6C AF 95 00 E8 B6>)
(   4,<2006-10-19 08:35:42.08 +100>,<MAYBRIDGE\nmr>,<NMR_250MHZ>,
      <abs ABSG = 5 
       data hash MD5: 32K
       57 41 F6 D5 89 94 70 ED EB 28 27 18 AD A4 4A 7F>)
$$ ##END=
$$ 
$$ hash MD5
$$ 35 10 27 4D 6F 72 26 23 6D 89 CE 25 2F 0F 25 02
##$RELAX= 
##$RELAX= 
##$RELAX= 
##$RELAX= 
##$RELAX= 
##$RELAX= 
##$RELAX= 
$$ Bruker specific parameters
$$ --------------------------
##$DU= <C:\u>
##$EXPNO= 930
##$NAME= <ADRS>
##$PROCNO= 1
##$TYPE= <nmr>
##$USER= <dgb>
##$AMP= (0..31)
100 100 100 100 100 100 100 100 100 100 100 100 100 100 100 100 100 100 
100 100 100 100 100 100 100 100 100 100 100 100 100 100 
##$AQSEQ= 0
##$AQ_mod= 3
##$AUNM= <au_zg>
##$AUTOPOS= <1 >
##$BF1= 250.13
##$BF2= 250.13
##$BF3= 250.13
##$BF4= 250.13
##$BF5= 500.13
##$BF6= 500.13
##$BF7= 500.13
##$BF8= 500.13
##$BYTORDA= 1
##$CFDGTYP= 0
##$CFRGTYP= 5
##$CHEMSTR= <none>
##$CNST= (0..31)
1 1 145 1 1 1 1 1 1 1 1 1 1 1 1 1 1 1 1 1 1 1 1 1 1 1 1 1 1 1 1 1 
##$CPDPRG= <>
##$CPDPRG1= <>
##$CPDPRG2= <>
##$CPDPRG3= <>
##$CPDPRG4= <mlev>
##$CPDPRG5= <mlev>
##$CPDPRG6= <mlev>
##$CPDPRG7= <mlev>
##$CPDPRG8= <mlev>
##$CPDPRGB= <>
##$CPDPRGT= <>
##$D= (0..31)
0 1 0 0 0 0 0 0 0 0.06 0 0 0 0 0 0 0.0002 0 0 0 0 0 0 0 0 0 0 0 0 0 0 
0 
##$DATE= 1161243325
##$DBL= (0..7)
120 120 120 120 120 120 120 120 
##$DBP= (0..7)
150 150 150 150 150 150 150 150 
##$DBP07= 0
##$DBPNAM0= <>
##$DBPNAM1= <>
$$ [...]
##$SUBNAM7= <"">
##$SUBNAM8= <"">
##$SUBNAM9= <"">
##$SW= 20.6930455092707
##$SWIBOX= (0..15)
0 0 3 0 0 0 0 0 0 0 0 0 0 0 0 0 
##$SW_h= 5175.983436853
##$TD= 65536
##$TD0= 1
##$TE= 683.16
##$TE2= 300
##$TE3= 300
##$TEG= 300
##$TL= (0..7)
0 120 120 120 120 120 120 120 
##$TP= (0..7)
150 150 150 150 150 150 150 150 
##$TP07= 0
##$TPNAME0= <>
##$TPNAME1= <>
##$TPNAME2= <>
##$TPNAME3= <>
##$TPNAME4= <>
##$TPNAME5= <>
##$TPNAME6= <>
##$TPNAME7= <>
##$TPOAL= (0..7)
0.5 0.5 0.5 0.5 0.5 0.5 0.5 0.5 
##$TPOFFS= (0..7)
0 0 0 0 0 0 0 0 
##$TUNHIN= 0
##$TUNHOUT= 0
##$TUNXOUT= 0
##$USERA1= <user>
##$USERA2= <user>
##$USERA3= <user>
##$USERA4= <user>
##$USERA5= <user>
##$V9= 5
##$VALIST= <valist>
##$VCLIST= <CCCCCCCCCCCCCCC>
##$VD= 0
##$VDLIST= <DDDDDDDDDDDDDDD>
##$VPLIST= <PPPPPPPPPPPPPPP>
##$VTLIST= <TTTTTTTTTTTTTTT>
##$WBST= 1024
##$WBSW= 4
##$XGAIN= (0..3)
0 0 0 0 
##$XL= 0
##$YL= 0
##$YMAX_a= 469444
##$YMIN_a= -341080
##$ZGOPTNS= <>
##$ZL1= 120
##$ZL2= 120
##$ZL3= 120
##$ZL4= 120
##$ABSF1= 16.522
##$ABSF2= -4.171173
##$ABSG= 5
##$ABSL= 3
##$ALPHA= 0
##$AQORDER= 0
##$ASSFAC= 0
##$ASSFACI= 0
##$ASSFACX= 0
##$ASSWID= 0
##$AUNMP= <proc_1d>
##$AZFE= 0.1
##$AZFW= 0.1
##$BCFW= 0
##$BC_mod= 0
##$BYTORDP= 0
##$COROFFS= 0
##$CY= 12.5
##$DATMOD= 1
##$DC= 0
##$DFILT= <>
##$DTYPP= 0
##$F1P= 14.0000005364418
##$F2P= -0.99999901652339
##$FCOR= 0.5
##$FTSIZE= 32768
##$FT_mod= 6
##$GAMMA= 0
##$GB= 0
##$INTBC= 1
##$INTSCL= 1
##$ISEN= 128
##$LB= 0.3
##$LEV0= 0
##$LPBIN= 0
##$MAXI= 10000
##$MC2= 0
##$MEAN= 0
##$ME_mod= 0
##$MI= 0
##$NCOEF= 0
##$NC_proc= -5
##$NLEV= 6
##$NOISF1= 0
##$NOISF2= 0
##$NSP= 0
##$NTH_PI= 0
##$NZP= 0
##$OFFSET= 16.522
##$PC= 1
##$PHC0= -49.82005
##$PHC1= 19.69432
##$PH_mod= 1
##$PKNL= yes
##$PPARMOD= 0
##$PSCAL= 4
##$PSIGN= 0
##$REVERSE= no
##$SF= 250.13
##$SI= 32768
##$SIGF1= 0
##$SIGF2= 0
##$SINO= 400
##$SIOLD= 32768
##$SREGLST= <1H.CDCl3>
##$SSB= 0
##$STSI= 32768
##$STSR= 0
##$SW_p= 5175.98343685301
##$SYMM= 0
##$S_DEV= 0
##$TDeff= 65536
##$TDoff= 0
##$TI= <Analysis number 999999
Compound Code 99
Book Reference 9
Project Code 9>
##$TILT= no
##$TM1= 0
##$TM2= 0
##$TOPLEV= 0
##$USERP1= <user>
##$USERP2= <user>
##$USERP3= <user>
##$USERP4= <user>
##$USERP5= <user>
##$WDW= 1
##$XDIM= 32768
##$YMAX_p= 480260136
##$YMIN_p= -871032
$$ End of Bruker specific parameters
$$ ---------------------------------
##NTUPLES= NMR SPECTRUM
##VAR_NAME=  FREQUENCY,     SPECTRUM/REAL,   SPECTRUM/IMAG
##SYMBOL=    X,             R,               I
##VAR_TYPE=  INDEPENDENT,   DEPENDENT,       DEPENDENT
##VAR_FORM=  AFFN,          ASDF,            ASDF
##VAR_DIM=   32768,         32768,           32768
##UNITS=     HZ,            ARBITRARY UNITS, ARBITRARY UNITS
##FACTOR=    0.157963299565203, 1,           1
##FIRST=     4132.6476996994, 0,             0
##LAST=      -1043.33573715361, 0,           0
##MIN=       -1043.33573715361, -871032,     0
##MAX=       4132.6476996994, 480260136,     0
$$ Real data points
##PAGE= N=1
##DATA TABLE= (X++(R..R)), XYDATA
$$ [...]
23441A9124j32943K12208J55284r0295j40047M7486N4066N2128J02734k53371
23431B6374J93O4275q6341j66971n6874J17895J20950L48616j8905j84110m1444
23420A23658J2057l7971k96714k63484R4376J0856k42707L5366M5374K18125K75832
23409b5232n0955q8519j92266R722K45369P0595r6561R451k6305L7699L2062m3461
23397a18401r1401J31563O9258O2723j76541o2299Q972K47046P8669n4060r7905
23386b376k90555R8850N6816R4404K90099k39370k97516J3473O4077J09919K04310
23375A02131J54223J5251J5103K9706j17091r6000l5652O8132P1741m5737j23480
23364C8327O6323N1244q5780M2990J57927r9931j26489o2184R0792q9803j53383
$$ y = [19124, -113819, 98389, 253673, 163378, 23331, 70817, 124883, 177011, 279745, 26374, 26567, 90842, 4501, -162470, -219344, -101449, 19501, 368117, 349212, 165102, 123658, 135715, 97744, -198970, -462454, -368078, -357222, -599929, -564563, -519189, -301064, -25232, -76187, -164706, -356972, -347250, -101881, -31286, -127847, -118396, -144701, -107002, -74940, -118401, -209802, -78239, -8981, 53742, -122799, -185098, -176126, 70920, 149589, 95529, -2376, -292931, -194081, -137265, -42861, 247238, 7868, -289648, -276175, -212098, -102179, 102131, 256354, 271605, 286708, 316414, 199323, 103323, 67671, 135803, 207544, 161807, 38327, 104650, 155894, 70114, 113104, 271031, 171100, 44611, -17573, 73219, -16584, -169967]
23353a69967K3447m8126J39007L6688l1953J0118j17296O9058l1177q4427J15790
23342h8838r208R1204K03864r1731j18716q2503K21725P507p591K3836n6826o52
23330I2071j41053Q4486k16842J75025J72229m0229J14166J07189j36339j59123
23320E1580o0533M7506k6352j97264j6614J30515K26274q2841j46772K9864P934
23309c6703Q7337l9498j63066j72968J42187J49374L1062j01729Q1272J39909
23299A17177n4334j89557p3701k4886n761o3599J3038P9078L7262K70576J4443
23288A19736K6278j00847O5183m5033J9366p0225j40847k8199J06761L1773l14881
23277c30935o0531K46586J25635m137o8063j59606J51150K44314J16716J28772
$$ y = [-169967, -146520, -194646, -55639, -18951, -50904, -40786, -158082, -89024, -120201, -204628, -88838, -98046, -6842, 197022, 105291, -13425, -95928, 125797, 133304, 125713, 149549, 92723, 92071, -48982, 35504, -181338, -6313, 165916, 125687, 239853, 347042, 210703, 51580, -8953, 38553, 12201, -185063, -201677, -71162, 155112, 72271, -74501, -44637, -36703, 50634, 11136, -151930, -324898, -182711, -33337, -2275, -104004, -22732, 117177, 62843, -126714, -200415, -225301, -231062, -294661, -281623, -202545, -165283, 105293, 119736, 146014, 45167, 110350, 65317, 84683, 14458, -126389, -154588, -47827, -16054, -330935, -391466, -144880, -19245, -23382, -91445, -251051, -99901, 144413, 261129, 389901]
23267C89901j16020R6788l02431O6279L5184r9949j93703O1155j90131k57082
23257e10009N6990k50291K8669K90262N0570l20056J04753J95500J70447Q9605
23247i3560k543r9097p3587J24524K1654k71984m7674L8466j52210K14973L34051
23236f987j9804N278M140r9397o2678L0227J23889m2693J83540R5639j27915k42854
23224a59615J7586M1734q2899k48729J33498K26986j40339Q7345j06006n845K13417
23213b2867L06245J27607J22715j02670l06080j23049o3295l33663j90077R5936
23203d89198K51187J87535J75183J020N4425k37105j62439r1852O4287J01752
23193a45205K56185O6715j67628K6266j60590j06033j35629r3940K78148J85885
$$ y = [389901, 273881, 370669, 68238, 134517, 169701, 69752, -123951, -62796, -252927, -510009, -453019, -703310, -674641, -384379, -333809, -653865, -549112, -353612, -183165, -93560, -96103, -195200, -268787, -144263, -122609, -394593, -442267, -403801, -556011, -341038, -6987, -26791, -21513, -17373, -116770, -179448, -149221, -25332, -68025, 115515, 211154, 83239, -159615, -142029, -100295, -183194, -431923, -298425, -71439, -211778, -124433, -230439, -236284, -22867, 283378, 410985, 533700, 431030, 124950, 1901, -61394, -395057, -585134, -489198, -238011, -50476, 124707, 125727, 180152, -56953, -219392, -311244, -246957, -145205, 110980, 177695, 10067, 36333, -124257, -230290, -365919, -459859, -181711, 4174]
23183D174o1214l7531J86599o6379j19216k3382J6241M9165j4241N3369K26381
23172B13966k97959j83002K13750L9704k18369p4295M2407O1922r544Q7719J09754
23161a3947N3140J07193k38689r8445O158K19250M2880l4051l8855J21089k75377
23150a49654k74730J39208R9179J10273R5574K03017J95138K8348J44928M428
23140E95709k83889J19057J7921k90758j00795k9672j26343J3225L0516K48344
23130A93315J5030p8979o4911k6783j44553J23872J57052K999R7712J73282j78253
23119B69783j28712K4984m0619k92708k79349J391K59386J87438P9868K4949J891
23108A08302k24302j75771j81560K277J84718j34585J07957J42453L1364l7690
$$ y = [4174, -57040, -94571, 92028, 25649, -93567, -116949, -100708, -51543, -65784, -12415, 213966, -83993, -266995, -53245, -13541, -231910, -306205, -263798, -201876, -211420, -123701, -13947, 39193, 146386, -92303, -190748, -184590, 34660, 77540, 43489, 4634, 125723, -149654, -424384, -285176, -185997, -75724, 19850, 222867, 418005, 446353, 591281, 595709, 311820, 430877, 448798, 158040, 57245, 27573, -98770, -85545, -55029, 193315, 208345, 129366, 64455, 37672, -106881, 16991, 174043, 177042, 274754, 448036, 269783, 141071, 166055, 125436, -167272, -446621, -445230, -185844, 1594, 81462, 106411, 108302, -116000, -291771, -473331, -471054, -286336, -420921, -312964, -170511, -139147, -176837]
23098a76837K66341K35561o1952k7523j63658k25573J60626L9652j67930n231
23088a26524P4320M3980P2400M2172o4080p415j25993J97029J07227k877p2460
23077A37779j04719J51242O7056m9403K8591q0672k22516k98295k68786P1918
23067e67805J95597j21857l9670k7610J1764J02952K24187J02211J02636j31630
23057a49225j22580J77694K9376j82117J24280N1102M0756l6119O4697J75139
23047A73003K9044J29872p2467j08132k11432j77368J0587K92913O1130J5277
23037A42427m7848j75219N1589J3246r5044Q9600O4024K670j84534j02872J04806
23026a37155K46595J7536j52826J29773P1846O7681P5559j52666j06959l5196
$$ y = [-176837, 89504, 325065, 263113, 235590, 71932, -153641, 6985, 46637, -121293, -126524, -52204, -8224, 64176, 106348, 42268, 34853, -91140, 105889, 213116, 210239, 137779, 33060, 184302, 251358, 201955, 230546, 149874, -72642, -370937, -639723, -567805, -372208, -494065, -533735, -561345, -549581, -446629, -222442, -120231, -17595, -149225, -271805, -94111, -64735, -246852, -122572, -71470, -30714, -66833, -2136, 173003, 202047, 331919, 259452, 151320, -60112, -237480, -226893, 66020, 127150, 142427, 94579, -80640, -29051, -15805, -110849, -21249, 42775, 45445, -139089, -241961, -137155, 109440, 126976, -25850, 103923, 175769, 243450, 319009, 166343, 59384, 24188]
23016B4188n9210l2712J10797q7921n5691n372M1105j54464j17013k68402K52800
23005c51895J15070Q1334R0018l483r9939R9616q080M0472K09532R6746k43540
22994B5851k08187j20653j09661J33491L8213j13418j97807J28220J78602j03940
22984c49289k7900J78339K99353p5644m1273p6570P0903j25354Q2306J71613j11424
22973d940j08433J28123J92856j5441N5449J561o3678l52138k9915L80833J42574
22962C26851k33273j99729J32594l1090M3388L2586k81870k211K33643J16894
22952A37783k7376p5728M8805J13338J46j1648j8266j49819L6961j93272K09526
22941G0450J7501j22167K62392L9036k756j44605k37908q293j09113j04658r0244
$$ y = [24188, -35022, -67734, 43063, -44858, -100549, -105921, -64816, -219280, -336293, -604695, -351895, -236825, -155491, -65473, -68956, -168895, -69279, -77359, -36887, 172645, 269391, 25851, -182336, -302989, -412650, -279159, -240946, -354364, -552171, -423951, -245349, -349289, -377189, -198850, 100503, 24859, -16414, -92984, -22081, -147435, -65129, 106484, -4940, -113373, 14750, 207606, 192165, 247614, 249175, 185497, -166641, -196556, 184277, 326851, 93578, -106151, 26443, -4647, 38741, 71327, -210543, -212754, 20889, 137783, 110407, 34679, 83484, 196822, 196968, 185320, 167054, 17235, 54196, -139076, 70450, 87951, -34216, 228176, 267212, 264456, 119851, -118057, -126350, -235463, -340121, -430365]
22930d30365K15147o1351N059M4750K9721L47834J3802k47574p0058N7060p8980
22919a74955J63109M5284j49075k38905P5712K41977Q9225j40911p1589J59887
22909b41L0784j27826k332j01576j82863q3148J69060K91583K8463K09178P7719
22898C08801k69116p2817j53215j47124R4826o556J58689J08234l3778J71437
22888A59381k10481k29127Q5957J23826J27372k2225J5189J41547P8952j48670
22878A21721l05218J23420J20473O2059J1703j29461j63815j2818O2347K10236
22868A00647o9397l2517K47031J91048J97493l9283l458r4546k19654j33179Q8620
22857B32805M0131k4962j67511k0877J09619R6718O5101P9676M9819j51326k53533
$$ y = [-430365, -215218, -276569, -271510, -226760, -197039, 150795, 164597, -82977, -153035, -95975, -174955, -11846, 33438, -115637, -354542, -278830, -36853, 52372, -88539, -160128, -241, 30543, -97283, -99615, -201191, -384054, -467202, -298142, -6559, 21904, 231082, 308801, 39685, -33132, -186347, -333471, -238645, -245201, -86512, 21722, -12056, 159381, -51100, -280227, -194270, -70444, 56928, 34703, 49892, 191439, 270391, 121721, -183497, -60077, 60396, 122455, 134158, 4697, -159118, -171936, -109589, 100647, 31250, -1267, 245764, 436812, 634305, 595022, 591564, 497018, 277364, 144185, 232805, 272936, 247974, 80463, 59586, 169205, 265923, 331024, 410700, 460519, 309193, 55660]
22846E5660p7037j06879q1260J4849L8268J22013n1217l4205J25333j48788p8094
22835b21357K3073J34969j88499P0781J63638j0967j92791q2403l225J41447L09432
22824A44098O7317P2896j32493k77542n3229q110J15339K6000r523J54123L82673
22813D81549J38188k01977j95771J8903l5540J12528K9742k75673j47619Q4126
22803H456k16N3178P3542J3090j54438k68937P2798K59549P5661k43151k41232
22792c51700K36912K87410l5935k82186q1122k6864j0436K29171o8335j39583
22782b42668k1793M1604K87399j33538o2182l3613k9280k335K79310P228Q8890
22771A79022R6972q1872j81434k10231L448j18660L59175L69271k43988l82469
$$ y = [55660, -21377, -128256, -209516, -194667, -156399, -34386, -85603, -119808, 5525, -143263, -221357, -198284, -63315, -251814, -181033, -17395, -28362, -221153, -303556, -306781, -165334, 144098, 211415, 284311, 151818, -125724, -178953, -187063, -71724, -45724, -55247, 98876, 481549, 619737, 417760, 221989, 240892, 205352, 317880, 347622, 71949, -75670, 8456, 8240, 61418, 134960, 148050, -6388, -275325, -202527, 57022, 132683, -110468, -351700, -114788, 172622, 136687, -145499, -226621, -253485, -263921, -34750, -103085, -242668, -264461, -222857, 64542, -68996, -131178, -164791, -194071, -196406, 82904, 90132, 179022, 275994, 194122, 12688, -197543, -194095, -312755, 46420, 415691, 171703, -210766]
22761b10766j08819J88457L6492r0374P0312K18913J44783j46451k9791K40588
22751C13344K91569j79019m11187j09511J25748M1159L8579O2014j23212L7752
22741H7236K04560k01286k5985J85460M3121k01381l96391j53462K68747q5192
22731b74573q3307K53420K19831J54599j90250L9258K00401j48406o3272j1537
22721I6164j21831m3460J29389j57266j66161P005m620L38664J9070j77645J0577
22710g0114M5168j0189J16056J4775q4868n6308O8240R9987m572O0848k95124
22699a16101k75406P5719k8712L47645m0614k09496m3012J79464L01752K7813
22689B19052k9468j57199m35656j01352J64041K03908J69391O2243o1680o0770
$$ y = [-210766, -319585, -131128, -94636, -185010, -114698, 104215, 248998, 102547, 72756, 313344, 604913, 425894, 14707, -94804, 30944, 72103, 110682, 172696, 49484, 87236, 291796, 90510, 64525, 249985, 293106, 91725, -304666, -458128, -189381, -274573, -357880, -104460, 115371, 269970, 79720, 118978, 319379, 170973, 107701, 96164, -25667, -69127, 60262, -97004, -263165, -256160, -260780, 77884, 96954, -80691, -70114, -24946, -35135, 80921, 95696, 10828, -45480, 22760, 122747, 118175, 179023, -116101, -391507, -315788, -344500, 3145, -37469, -246965, -289977, -110513, 191239, 219052, 189584, 32385, -403271, -504623, -340582, -136674, 32717, 94960, 33280, -27490]
22679b7490k5400k20059o4874j8729m0088J21297L34067P6435k40011j68981J63884
22668a09949J7016j01065O4523m613P7375J71756J41135m8405j5844K33077j28447
22657B96559o5424r3576N2137J03739j52904l13244k04040o8669M31534N3740
22647C9852j16400K30228Q9827j06251M5772j86753L3367q4195j91898R794P429
22636b29228q7370J83306K74099M9231n8642k07514K4957L2436j11241J25600
22626d366p5242j6908J53782J26665J00468j82038N356Q0143o1163m4476O8675
22615A50896J5415J4898l9438r694k6111K7600o3195k78719q1240L31920J58040
22604B00372m0845K4004j55266R2908Q7081K1968k390O386j92286k30323J2546
$$ y = [-27490, -52890, -272949, -337823, -356552, -396640, -275343, 58724, 135159, -104852, -273833, -109949, -92933, -193998, -129475, -134088, -56713, 115043, 256178, 207773, 191929, 425006, 296559, 231135, 137559, 189696, 293435, 140531, -172713, -376753, -445422, -13888, 39852, -76548, 153680, 243507, 137256, 183028, -3725, 29642, -54553, -246451, -236657, -229228, -316598, -133292, 140807, 190038, 131396, -76118, -51161, -18725, -129966, -4366, -79608, -96516, 57266, 183931, 284399, 102361, 107717, 187860, 126697, 82221, 150896, 166311, 181209, 141771, 132077, 105966, 133566, 70371, -208348, -289588, 42332, 200372, 159527, 183531, 28265, 121173, 208254, 230222, 227832, 234218, 41932, -188391, -175845]
22593a75845l3082J34067j76143k910q798j24582J57549J87340P0023n9194j13928
22582a45503j50763K71702K96380j95422l00298K0315n3116j97487Q2690J46861
22572b24641o0614N100k7645N9485K39567N0176J1295n4956j10394M3280J18905
22561D9558R80k65982J22003r8798j10830J61057K11684J74693j70608q5339J07089
22550I5507J687J08958k45965l90606J7936J8224J97191K38498N5757J1849l0060
22539G8976r891M9296o8568J21818N2309k31933m3891l6424O0125l369m9286l5992
22527a16830K01017J30737j02701q2428M3045K7629N4128K3493k72288p8137L0312
22516a42023Q8682m2603j39228M810Q4866K6569j36380Q2983P2171J5086J26376
$$ y = [-175845, -208927, -74860, -251003, -253913, -262711, -387293, -229744, -42404, 27619, -31575, -145503, -296266, -24564, 271816, 76394, -223904, -203589, -256705, -454192, -371502, -224641, -285255, -280155, -307800, -248315, -8748, 41428, 52723, -2233, -112627, -69347, 49558, 50538, -215444, -93441, -192239, -303069, -142012, 69672, 244365, 73757, -11582, 95507, 97194, 206152, -39813, -430419, -412483, -394259, -197068, 41430, 97187, 109036, 78976, 69085, 118381, 49813, 171631, 223940, -7993, -51884, -88308, -28183, -31552, -80838, -116830, 84187, 214924, 112223, 29795, 72840, 100469, 154597, 178090, -94198, -172335, -142023, -53341, -95944, -235172, -230362, -145496, -118927, -255307, -172324, -100153, -85067, 41309]
22505D1309j44212o7522K04295P0303j41173r7666m5236m6673m9784Q6860Q1944
22494a07555R20j23059J2133J74470j31381n7605j45913k50048K53055L84963
22484I980l914N6250l79284r6053m5674J0068M283L63139O8978O7165O517L6628
22472I8083n8079j42535q5640K15026K93838p5184q3699r0401o8014R0815N4796
22461A49006K758k19552Q544L7736K67122R2790p0513J0057K2063K3915J1943
22450C35869n3937J14697k3604k39949o9648o1304l2175j6775Q6590J17895r8980
22439E8679k51108j86020l1047K61705k7646r2865m520K8859l234R3796M24616
22428B71215J30773l42555n1775J88378n778l07168l10802N8488L14084K13229
$$ y = [41309, -102903, -170425, 33870, 104173, -37000, -134666, -179902, -226575, -276359, -189499, -107555, -106635, -229694, -217561, -43091, -174472, -232077, -377990, -628038, -374983, 9980, 6066, 62316, -316968, -413021, -458695, -448627, -444344, -81205, -12227, 54938, 61455, 98083, 40004, -102531, -188171, 26855, 320693, 245509, 161810, 71409, 3395, 94210, 149006, 151764, -67788, -59244, -21508, 245614, 338404, 267891, 277948, 300011, 323926, 335869, 281932, 396629, 373025, 133076, 63428, 2124, -30051, -46826, 39764, 157659, 58679, -192429, -378449, -409496, -147791, -175437, -268302, -272822, -243963, -247197, -153401, 271215, 401988, 59433, 7658, 196036, 190258, -116910, -427712, -369224, -55140, 158089]
22418A58089K26743q0068j15940j87624J14254L5959j35729r1346O9440r300k45085
22407b60607j54586j8285n1272p1861K42249K46373J26981P4307K5237J64744
22397C23280n0916q4247k56179j00238J67738J31677j06599l99864K3656P4080
22387b77612N5396l5773l0479q3700j59909M9424K91236J20061J9636j88115j37654
22376c77489j14029q3548O4774K66207J30413l0663j30171j627J56039j07337
22366b27431R2650n6961Q0734J31098J3890m4941L21198J33301j55586j32484
22356A55468N154k8468j28145p2239j77002M495J61958j4432j74088j05573J8569
22345c54303K15122j04467k2362K22859Q9924n6352Q9936M9189K65155Q6962m09058
$$ y = [158089, 384832, 304764, 188824, 1200, 115454, 151413, 15684, -75662, -6222, -15522, -260607, -415193, -433478, -484750, -556611, -314362, -67989, 58992, 133299, 158536, 323280, 272364, 188117, -68062, -168300, -562, 131115, 24516, -375348, -351692, -277612, -222216, -257989, -288468, -372168, -532077, -482653, -191417, -71356, -51720, -239835, -377489, -491518, -575066, -510292, -244085, -113672, -144335, -274506, -276133, -120094, -227431, -134781, -191742, -111008, 20090, 33980, -10961, 310237, 443538, 287952, 155468, 160622, 132154, 4009, -68230, -245232, -240737, -78779, -93211, -267299, -372872, -354303, -139181, -243648, -266010, -43151, 46773, -9579, 80357, 129546, 394701, 481663, 72605]
22334G2605k68468L2347r344J22111M1344Q279O7624J75805j04170J6038N0864
22323B05035o1856k2436m1040J32448j84439k25715R9086L665j7191R7887J40331
22312A25775L17625L45604k5234k68699j78926l0432J38853j37105k78160q5300
22302g5999J10762L59080j89021m86611m05174K08136N54193P0565k49181j70420
22292b73670m0654L3791o7742O0798R8442j85043M7270L14967k4852j64570p0919
22281b72182J52193o7355K989J7578J20871k3846j43834Q531J05754o986j2917
22270a19204j3980P5937L5727Q7722k0964j72643j90648O0272J12057j09252j19090
22259c74066J68319J78415R6626J68872q6597j08145p2553j77291N8446M1331
$$ y = [72605, -195863, -163516, -172860, -50749, -9405, -1126, 66498, 242303, 138133, 154171, 205035, 143179, 120743, 79703, 212151, 27712, -198003, -98917, -95252, -112443, -14556, 125775, 443400, 789004, 763770, 495071, 316145, 285713, 424566, 287461, 9301, -75999, 34763, 393843, 204822, -281789, -686963, -478827, 75366, 145931, -103250, -273670, -314324, -280533, -348275, -287477, -189035, -374078, -326808, -11841, -36693, -201263, -272182, -119989, -187344, -184355, -166777, -45906, -69752, -213586, -205055, -99301, -106287, -119204, -133184, -57247, -21520, 66202, 45238, -127405, -318053, -257781, -145724, -254976, -374066, -205747, -27332, 69294, 238166, 151569, 43424, -29129, -206420, -147974, -106643]
22249a06643J20307p9812j26269j55383J72672J85304J08926j89155q4675J20565
22239c4163n50j29471o306O9135Q4917j14792j8500j75476j02779K91504R1765
22228d4716j79219l9081J14093R2641p3277r6270M3512K37783J3511L9173K31988
22217C40138K8584q4088q5488j8219P7911k47242k0633j23696o8292Q3970P5057
22206d1998L4339K3188J25718J41013M3484n5735l2043J27797q4764K17890M784
22195E03673n2019r1148k00496k10106j45479K19837J75830K8885J93781k16724
22185B06034j34654K545j29865l21516R1299P8508M6897L583k02092J4288L2459
22174c12514J92481J17404j55274J3511K85516j10022Q662J63216J0027M981O764
$$ y = [-106643, 13664, -66148, -192417, -347800, -175128, 10176, 119102, -70053, -154728, -34163, -34713, -164184, -170490, -101355, -16438, -131230, -149730, -325206, -427985, -136481, -44716, -223935, -263016, -148923, -56282, -129559, -225829, -182317, 55466, 68977, 108150, 340138, 368722, 284634, 199146, 180927, 258838, 11596, -9037, -132733, -201025, -117055, -41998, -7659, 15529, 141247, 282260, 325744, 270009, 237966, 365763, 280999, 498889, 503673, 451654, 360506, 160010, -50096, -195575, 24262, 200092, 228977, 422758, 206034, 71380, 73925, -55940, -377456, -286157, -207649, -160752, -157169, -359261, -344973, -312514, -120033, -2629, -157903, -144392, 141124, 31102, 39764, 202980, 213007, 217988, 224752]
22163B24752m3869k71205o7911J94537j22440j0778J3654n5325j3573j7315K6388
22152a43085N223O3293j60928k6719K51077J37096j45328J01362o347q1316N8853
22141E3181r480L3988m8206p6249q4894M1396M837J76287J35549P6624k44338
22130E8695n2751r914J39340J12363M7409l24779j83091q8602L41786j866k11696
22119a73106p5613P0913Q1354J06820J3431n3891r3968N4824J44251m5894r3498
22108f4377j48515J6863J07389L7423l3542J5730K0799l8495j92921L9230l935
22097b44351J13863j18225J11915J58864L0025j05749P1472J01872k5249J98324
22087B92761p0935m04082j16102M72327R6645k3437l03485j43602k52310K55360
$$ y = [224752, 180883, -90322, -158233, 36304, -86136, -96914, -83260, -138585, -152158, -169473, -143085, -137862, -74569, -235497, -262216, -11139, 125957, -19371, 81991, 75644, -5672, 53181, 43701, 77689, 29483, -46766, -131660, -90264, -85427, 90860, 226409, 303033, 58695, 5944, -3970, 135370, 247733, 295142, -29637, -212728, -301330, 40456, 38590, -173106, -248719, -177806, -96452, 10368, 23799, -30092, -124060, -69236, 75015, 29121, -64377, -212892, -196029, -88640, -51217, -84759, -69029, -48230, -86725, -279646, -240416, -244351, -130488, -248713, -136798, 22066, 52091, -53658, 17814, 119686, 94437, 292761, 221826, -182256, -298358, 173969, 270614, 247177, -56308, -199910, -452220, -196860]
22077a96860J98443o7051l1152k300J05636P2437O9446r1405l09663J03674l4192
22066a82987k1153J26377J24187J7579j7500Q9050J13987k11277J00479J81767
22056C20509j89531j00814K121Q0448k9641J58642j96001j71569o4679Q9100j60917
22045b62332l8973J75140J88087k56655Q6490j6188P0583J91836K29215j47733
22035B19470k35909J171R7450j29946J48153k7787m8112k18459l8943K9521O3618
22024a39773J61899J67833P810J56546K18225l2406K02675L25162J86451q6530
22014A167892Q0401j58942j50125j65191k5673R7418R2966L6574O3007P4008j85685
22003I26650L1013R0355n2899N1747J53079J17941p9798k7218l69584k49796l27024
$$ y = [-196860, 1583, -65468, -96620, -98920, 6716, 79153, 148599, 57194, -252469, -148795, -182987, -204140, -77763, 46424, 64003, 46503, 135553, 249540, 38263, 138742, 320509, 130978, 30164, 32285, 112733, 83092, 241734, 45733, -125836, -190515, -101415, -262332, -301305, -126165, 61922, -194733, -108243, -124431, -53848, 137988, 367203, 219470, -16439, -15268, 82182, -47764, 100389, 72602, 24490, -193969, -232912, -203391, -139773, 22126, 189959, 197769, 354315, 572540, 540134, 742809, 1067971, 1254422, 1167892, 1248293, 1089351, 939226, 774035, 748362, 845780, 938746, 975320, 1038327, 1112335, 926650, 957663, 1048018, 995119, 1046866, 1199945, 1317886, 1238088, 1210870, 841286, 591490, 264466]
21992B64466p8111J07762j24603j57782q2974m4228m8807n4540N7404r435J90815
21981A9967L04473n2580k91089j19576j18116N7853L2710M0985K2636q8221j26520
21970c17478J17970L44021O6046q8726j52850o0130j95961K7942j38604J5172
21960c82598K07256M8570J20778j36909j77409J9904k11979r7867J23993K59646
21950b26615O8981J46598J01446q9459l0786p9057j34655K1107J30279q7637J35264
21939d4534p3509M4222J19841R7909L9335p0038M7529L5340j0041M771l7910q8545
21927F4370p5181l9507J24124J2943p8808j62958J1444R3611J99801j31123J58429
21916A77145J83635q3100K27705q5434j57104o9543M5051j25247n9402k08844
$$ y = [264466, 186355, 294117, 169514, 11732, -71242, -115470, -164277, -218817, -161413, -170848, 19967, 324440, 271860, -19229, -138805, -256921, -199068, -166358, -125373, -102737, -190958, -317478, -199508, 144513, 210559, 121833, -31017, -91147, -287108, -259166, -397770, -382598, -175342, -126772, -5994, -142903, -320312, -300408, -512387, -610254, -486261, -226615, -157634, -11036, 90410, 951, -29835, -108892, -243547, -222440, -92161, -179798, -44534, -118043, -73821, 46020, 143929, 183264, 113226, 160755, 196095, 186054, 190825, 152915, 64370, -10811, -50318, 73806, 86749, 7941, -155017, -143573, -49962, 149839, 18716, 177145, 360780, 277680, 505385, 419951, 262847, 193304, 238355, 113108, 53706, -155138]
21906a55138O5446K84223P2674j29546j55516k86732L6932N6525m18Q2159J37858
21895H467J29985l0668r398O9669k85414j71824k8232r7586L8313o8393J35960
21884c09121Q1907r2011K05990J14967Q1495p3290J12504J80831O7749l7777k5396
21873C07848l7265q5065j90985K18994j4055j44562j23755p9013j52826k32153
21863e32837Q9040J84665J00369L3859k23171O3628L00028J88533J21683r446
21853C16351K4126J6209k27917p4893j88230R734j40190j40763K29018K76556
21843A00001J39968N1057k9865R1983r9590J18899l8741q3732r5165P1776J29647
21832C56238J5855m6061j7862l4268k02224k55023J50500J18027j28019j98594
$$ y = [-155138, -89692, 194531, 267205, 137659, -17857, -304589, -267657, -211132, -211550, -129391, 8467, 138452, 107784, 98386, 168055, -117359, -289183, -317415, -415001, -376688, -445081, -309121, -227214, -319225, -113235, 1732, 83227, 9937, 122441, 303272, 371021, 333244, 307848, 270583, 185518, -5467, 213527, 199472, 54910, -68845, -147858, -300684, -532837, -443797, -259132, -158763, -124904, -348075, -284447, 15581, 204114, 325797, 316351, 340477, 356686, 128769, 53876, -134354, -124620, -264810, -405573, -176555, 100001, 239969, 291026, 261161, 353144, 253554, 372453, 333712, 249980, 154815, 226591, 356238, 372093, 326032, 308170, 273902, 71678, -183345, -32845, 85182, -42837, -241431]
21822b41431J8210O5234L4374K97923O2440l38257K5722J90021r540j49569k69963
21811c14836k06705J67284J80871p3682M2525K5954j3940J84387L8827L63848
21801C94533j11619l10888J0187L4921K582J03407o7965J08203L547k02910o2055
21790i8057J46773n334K9741R1555Q3780q24l17905J15016L7961j38047J2752
21779d2589n4984K8138O6021j11865o8090K11128J98621M1459j31857l45017j40584
21768c49619o0268J02066q1526J3150K19703n0466J96786J83318l8579N2462p8432
21757A08595n0918j37130l42954j9634J12539L04599J88446R832K2050O3947M1227
21746C00599K5147j94134j35581p5812j55979Q5880N6231j55363l6256p4319R3697
$$ y = [-241431, -223221, -157987, -123613, 174310, 236750, -101507, -75785, 114236, 104696, -44873, -314836, -521541, -354257, -173386, -247068, -204543, -178589, -192529, -8142, 30685, 394533, 282914, -27974, -17787, 17134, 19716, 123123, 55158, 163361, 166908, -36002, -98057, 48716, 43382, 73123, 164678, 248458, 247634, -70271, 44745, 82706, -55341, -42589, -97573, -69435, -3414, -115279, -183369, 27759, 226380, 267839, 135982, -209035, -349619, -409887, -307821, -389347, -376197, -156494, -206960, -10174, 173144, 134565, 187027, 108595, 57677, -79453, -422407, -442041, -329502, -24903, 163543, 173375, 195425, 259372, 300599, 325746, 131612, -3969, -79781, -235760, -149880, -93649, -249012, -285268, -359587, -265890]
21735b65890K86859R6259j33556J39935n0612L7148P4850J10394j13460P643J41969
21724C31539N8478l7130p6546q7967k44635J92592J16799k61326l2516R6967J52116
21713B08371n722k18214k36864q873J98590j2227P7247n3431R0141K13404j47047
21702A05375k48141k6600p559Q4326q4802J82290j00394M1792J81309M8756K3122
21691A99474j65006k5076Q8718o0075J04850J45174L04582m1658m2379k97025
21681B11579j25032J67729N9103O8458J10733N7672r9860j27884K1526K5591L3403
21670D03018o7519P044K2600j29089j50258n4053L6779O7641j28287L6880J54973
21659A99729J27729j75297k0013P7369K25596r0524j39625K2877O7534K7633m1519
$$ y = [-265890, 20969, 117228, -16328, 123607, 72995, 110143, 184993, 295387, 181927, 189570, 331539, 390017, 352887, 276341, 188374, -56261, 136331, 253130, -8196, -40712, 56255, 208371, 202649, -15565, -252429, -261302, -62712, -74939, 2308, -51123, 39018, 252422, 105375, -142766, -169366, -176925, -92599, -177401, 4889, -95505, -53713, 127596, 176352, 199474, 34468, 9392, 98110, 38035, 142885, 288059, 592641, 550983, 508604, 211579, 86547, 254276, 313379, 381837, 492570, 550242, 450382, 322498, 344024, 369615, 403018, 335499, 342543, 365143, 236054, 85796, 31743, 68522, 136163, 7876, 44756, 199729, 327458, 152161, 132148, 209517, 435113, 344589, 204964, 227841, 295375, 323008, 281489]
21648B81489j48164l2610R7625k05787k67969j72945K80735K40197K00247k06505
21638F6313j60862P6712k6960n9318L9606J59333k70219j98921l2300P0482L5605
21627c00529q3466j0105K31192J5163O3973J88965n0128j25837o8859j43420j00470
21616c83521L9391J65372l6906P6191J70579j7200J84689k26169n3546L1708j01057
21605a50469O473j9933K75501J84159p7120l1942j19330n7634Q9898K00307K5238
21594C25148k2042j99496k2043J78436m8395k55304o8770K72526P7885j90542
21584D7403R9957J83663O7782j0889L06022l5461k25306k27512J19497J12137
21574D37293K20647J07422k24071j62986J12076j19182j78149J52916K4298j16714
$$ y = [281489, 133325, 100715, 198340, -7447, -275416, -448361, -167626, 72571, 272818, 66313, -94549, -17837, -44797, -104115, -64509, 94824, -175395, -374316, -406616, -336134, -300529, -383995, -394100, -162908, -147745, -83772, 105193, 55065, -70772, -139631, -283051, -383521, -344130, -178758, -215664, -139473, 31106, 13906, 198595, -27574, -81120, -49412, -150469, -143996, -163929, 111572, 295731, 218611, 186669, 67339, 9705, 99603, 299910, 325148, 303106, 103610, 81567, 260003, 211608, -43696, -112466, 160060, 237945, 47403, 147360, 331023, 398805, 387916, 693938, 658477, 433171, 205659, 325156, 437293, 657940, 765362, 541291, 378305, 490381, 371199, 193050, 345966, 370264, 253550]
21564B53550m5005J95295J61524m3429m1242j98539r9937o9711J39785R5163P9002
21553D26456J52295Q7114J8106j43135J75885k04777m54063q878K17907R3483
21543C60393K07903K45798Q8375p3854j74136j16514m3M6381J87515M1573p0206
21532G43185p6010r0782o8953k0326J81341k0472l36633k0070j89968j71004K05325
21521A35633Q9147J38310K33265O5596j20876k20243J05750K09510N0282m8004
21511F38370k7567j42021l0232R1905J77939N8391p2319Q765J59078K3325K6262
21500I11896J685J76481J18132J62483j55193j6592j12881O2420k82463j00670
21490G65298R7712l5797j21345J6262J35075L34484j19156J32913K49611J54832
$$ y = [253550, 208545, 403840, 565364, 521935, 480693, 282154, 182217, 112506, 252291, 347454, 426456, 578751, 665865, 683971, 540836, 716721, 511944, 57881, 49003, 266910, 360393, 568296, 814094, 902469, 828615, 654479, 537965, 537922, 584303, 771818, 813391, 743185, 667175, 576393, 507440, 487114, 668455, 647983, 311350, 291280, 101312, -69692, 135633, 224780, 363090, 596355, 661951, 541075, 320832, 426582, 636092, 686374, 638370, 610803, 468782, 438550, 530455, 708394, 766785, 694466, 703231, 862309, 885634, 911896, 913581, 1090062, 1208194, 1370677, 1215484, 1198892, 1086011, 1148431, 865968, 765298, 863010, 827213, 705868, 722130, 857205, 1191689, 1072533, 1205446, 1455057, 1609889]
21480A609889J02421J05502p2423K5219J94937N9274L69213M12122K97471J51990
21470C255615r9964L05101L42467K43996K06933J52268K94683J49669K05695k32238
21460D824225j63296M38867K38721P73296O09655O58200P00193N60599M93586
21451I134046O80355P43657Q24169P79916J034396J291729J829452K568006L172151
21442B2057877M900170P545703J2181310J9560631K6617828K9073076K3979989
21435A45916584J8255194J9545221J8729471O043535n172939q718320p075957
21428A87522789o926477j7352138k3774211j3342182K478629J6282899K2593200
21421A67482509J9413776J4185511J5335216J5103216K377010j0359481j4062973
$$ y = [1609889, 1712310, 1817812, 1745389, 1770608, 1965545, 2024819, 2394032, 2806154, 3103625, 3255615, 3155651, 3460752, 3803219, 4047215, 4254148, 4406416, 4701099, 4850768, 5056463, 4824225, 4660929, 5099796, 5338517, 6111813, 6721468, 7379668, 8079861, 8640460, 9134046, 9814401, 10558058, 11382227, 12162143, 13196539, 14488268, 16317720, 18885726, 22057877, 26958047, 34503750, 46685060, 66245691, 92863519, 121936595, 145916584, 164171778, 183716999, 202446470, 208490005, 203317066, 194598746, 187522789, 180596312, 163244174, 139469963, 126127781, 128606410, 144889309, 167482509, 186896285, 201081796, 216417012, 231520228, 233897238, 223537757, 209474784]
21414B09474784j2434255j2453670k3293604l3323139k8480363j9056176j2703654
21407F7729923q800200o421353m791314m007079l137969l115169k736102k250436
21399C2470301k175126k137022k353790k395885k096432j896457j867732j842662
21391A5705195j827845j593085j060838q17064o62395m64735p76322n54961m70063
21382G477887j68235o0494m72317n09972j42230l36201m23199j95635o5218m22859
21372D681527n27375k78233q9782j85757j58673l6725j48105k77305K0784j91746
21362B808610n3085r0809J307J65473o3218k78223l16428L1163R9475O2318l09977
21351B056606k10208j76611k46549k5210J77326J51630N3872o5300k01887k87902
$$ y = [209474784, 197040529, 184586859, 161293255, 127970116, 99489753, 80433577, 67729923, 58929723, 52508370, 47717056, 43709977, 40572008, 37456839, 34720737, 32470301, 30295175, 28158153, 25804363, 23408478, 21312046, 19415589, 17547857, 15705195, 13877350, 12284265, 11223427, 10406363, 9743968, 9279233, 8502911, 7947950, 7477887, 7309652, 7249158, 6776841, 6266869, 6124639, 5788438, 5365239, 5169604, 5104386, 4681527, 4154152, 3875919, 3786137, 3600380, 3441707, 3404982, 3256877, 2979572, 3000356, 2808610, 2755525, 2664716, 2666023, 2831496, 2768278, 2490055, 2173627, 2204790, 2304265, 2366583, 2056606, 1846398, 1669787, 1423238, 1398028, 1575354, 1726984, 1780856, 1715556, 1513669, 1225767]
21341A225767j66337P4645j88531r8711j37999K92782L73743R1104l72403o2642
21331A031418R539j51048R4044K5168J42565R212l30061j28490J40279l9152j89641
21320F13833K1326l4009j63297J31050r6820j75323n9864J68702L41320j20210
21310F26708j92805M9809k20534j83810q3193P198O0331J38330M2285q8988K35041
21299C90372J75587n6117k13966m8812j4706j71129j08793K8362J07330J89094
21289B77222L1092J14990m8165k09013R8941J50191N6096l5187q1355J90040M9018
21278E93870j09025k2349J75043j26685j87906p617K30428l8065m9122k04095
21268B54477l232L39444k68323l61389j88642m5619P6625j71856L4882J08159
$$ y = [1225767, 1059430, 1134075, 945544, 846833, 708834, 1001616, 1375359, 1466463, 1094060, 1031418, 1040957, 889909, 983953, 1009121, 1151686, 1160898, 830837, 702347, 842626, 803474, 613833, 635159, 601150, 437853, 568903, 472083, 296760, 236896, 405598, 746918, 626708, 433903, 483712, 263178, 79368, -3825, 3373, 63704, 202034, 244319, 155331, 390372, 565959, 509842, 295876, 247064, 232358, 61229, -47564, -19202, 88128, 277222, 308314, 423304, 375139, 166126, 265067, 415258, 471354, 436167, 354812, 544852, 593870, 484845, 462496, 637539, 510854, 322948, 315331, 545759, 507694, 458572, 254477, 251245, 590689, 322366, -39023, -227665, -273284, -196659, -368515, -333633, -225474]
21258b25474J88529P4053J5983P6183J17231l3950m01756j73646K05273N9020
21248i8554j8101J34035p872j42109o9125l8830J17082J57941K30693J10015K076
21237C77251j11463r3173o0690l2156k0816n9007K4472j86176J18245J72667K2364
21226A51518j23238j13037r2994p7252M5693J26135J26777j23041k22497m815
21216c06751k4457M0190M4403j5231j24601P2958K84951j26815k51046O5758j12671
21205d53312Q3399o7931m0062J28998q906K3931J49513P2905J19059M9636K9597
21194H6827j77416k4880l7608K3945j44118j37409l3742J43829Q8460J99876P374
21183d862n1647j2474r0105k27143l2996J37078J25344k5148J9469n4905k9284
$$ y = [-225474, -36945, 37108, 53091, 129274, 246505, 212555, -189201, -362847, -157574, -98554, -116655, 17380, 9508, -132601, -201726, -240556, -123474, 34467, 265160, 375175, 377251, 265788, 172615, 111925, 79769, 58953, -54, 24418, -161758, -43513, 129154, 151518, 28280, -84757, -177751, -255003, -209310, -83175, 43602, -79439, -301936, -306751, -331208, -291018, -246615, -261846, -386447, -313489, -28538, -155353, -406399, -340641, -453312, -369913, -437844, -477906, -348908, -357814, -333883, -184370, -111465, 7594, 57230, 86827, -90589, -115469, -153077, -129132, -273250, -410659, -444401, -300572, -212112, -12236, -4862, -56509, -68983, -159088, -386231, -419227, -282149, -156805, -181953, -162484, -217389, -246673]
21172b46673K9284N4093j39953K31543j34080k91644J62930J63563K33717n7483
21162E297k6938Q1608L0878n8740R8084K8852J1178q3893M5442M7060j31128l0048
21150A7652j42089q6211L6135J05697j67960k7757J15890o3744j19897k37388
21140e69672j53915j47445L26787L12623R7828M5919j04405J77861J54992j54949
21130a4376l65636K7908J1660J33632j42634k1019J81735k3523r7788p6081j42295
21119e28417J93190j15074j18691J66480m3841J34001J42508J06668J08767j2814
21109C2777j21774p8677j65743J513l1751P8983J7673J8147J5524j665k274J20946
21097a16321j3014k76533l0259J64753O9139J76853J17082J40727k21587J66452
$$ y = [-246673, -217389, -163296, -303249, -71706, -205786, -497430, -334500, -170937, 62780, 5297, -21641, 59967, 90845, 32105, 130189, 159041, 170219, 86326, 131768, 178828, 47700, 17652, -124437, -210648, -174513, -68816, -236776, -264533, -148643, -212387, -332284, -569672, -723587, -871032, -544245, -231622, -133794, -87875, -192280, -14419, 140573, -14376, -380012, -352104, -340444, -206812, -349446, -370465, -188730, -212253, -310041, -386122, -528417, -335227, -450301, -568992, -402512, -446353, -312352, -169844, -63176, 45591, 32777, -88997, -167674, -333417, -331904, -363655, -284672, -266999, -248852, -233328, -234993, -237267, -116321, -129335, -405868, -436127, -271374, -202235, -25382, 91700, 232427, 10840, 177292]
21087A77292J96861o2969k03947j03363p6199j98887q3889L4751J01647K08356
21077a0347L5936O7035p0023k63583J06482J00174q7574k22626l6639J76357J32394
21066g2414J20157J05162j59596k55013K95492r9958k39931n9189O8933P7118
21056b19239P116j40906j80608q4922J37949K34519J37260K01870J19488p7866
21046A34661j42851m1327Q1422J80774j56081Q0347K09432M4084j37222j32876
21036A20363l71753k7427K46544m8396J46009K5194J2946q6888P526j33225J52531
21025D3424J175j95175j74066L2646L41579O581j46988J53467k3948o0941j07827
21014a30073n8924L0975K05492n185j24723N0924J16566L6999J8502k72021j87672
$$ y = [177292, 374153, 311184, 107237, 3874, -72325, -271212, -355101, -320350, -218703, -10347, 25589, 92624, 22601, -240982, -134500, -34326, -121900, -344526, -381165, -204808, -72414, 47743, 152905, -6691, -261704, 33788, -66170, -306101, -365290, -296357, -219239, -212123, -353029, -533637, -618559, -480610, -246091, -108831, 93039, 212527, 134661, -8190, -49517, 31905, 212679, 56598, 136945, 346377, 390461, 253239, 120363, -251390, -278817, -32273, -80669, 65340, 90534, 103480, 16592, 24118, -109107, 43424, 44599, -150576, -324642, -291996, 49583, 56164, -90824, 62643, 38695, -22246, -130073, -188997, -158022, 47470, 42285, -82438, -31514, 85052, 122051, 140553, -131468, -319140]
21003c19140j73533J77280K16314k06472J5069J12967R5513j08017n3676j13275
20993c56970J20847J8244O2395K36128O3476J10550o6777k4715p8262j19320j00640
20982a35044N8977k13018l88533k5632L03141L49845K13632J91347j04981l78777
20972a29043q9286l9863L0693J24558J36885o9838n4484K510j33250J02399n415
20961a24134j58117j08967K86132k49243J9894J8163j12824K04664K8234Q938
20951a87260j45612j17792M9717J59377o8200M0214J17355K37215L09200r8332
20941B95882l45262K13666O5804j09783k70783j68188J557q2185J48697J74619
20931g5976R8411M6960q8134j61067l27639J33773K40091R8150J14575p6879j77270
$$ y = [-319140, -492673, -315393, -99079, -305551, -290482, -177515, -82002, -190019, -243695, -356970, -236123, -217879, -155484, 80644, 144120, 254670, 187893, 163178, 84916, -34404, -135044, -76067, -289085, -677618, -703250, -400109, -50264, 163368, 354715, 249734, -129043, -218329, -258192, -227499, -102941, 33944, -35894, -90378, -87868, -221118, -118719, -124134, -282251, -391218, -105086, -354329, -334435, -316272, -429096, -224432, -196198, -187260, -332872, -450664, -400947, -241570, -309770, -269556, -152201, 85014, 394214, 295882, -49380, 164286, 230090, 120307, -150476, -318664, -317107, -399292, -250595, -75976, 22435, 69395, -18739, -179806, -507445, -373672, -133581, -35431, 79144, 2265, -175005]
20920a75005j31476J78643Q9974j26051q0565N8810J30002O6820K3700k59819
20910b24967q2176P0241P4858J06206m7824k24456J94593q489l07262n9750J92193
20899c16833K31378J80340K76148J79924l04134J9374J86953j10638q4120R9039
20889C57431M4419q949j69500j16088P6967k66644o1746L6803J39938M2128J7843
20878I2602j07149n5432J7770j31052j90741r2761L9066N1840J59785r8752Q6522
20867b28302K94006N9590p1861o2578j08666q9333k40257l1406M3185R929L4107
20856c91586M9564J67295L28080M7864M9687K5965K49885J01596J11973o5477
20846F74846Q3046O5252N6978J23394J68958m5354J25155j66055n5059J67843
$$ y = [-175005, -306481, -127838, -37864, -163915, -244480, -185670, -55668, 11152, 34852, -224967, -307143, -236902, -162044, -55838, -103662, -328118, -133525, -142014, -449276, -509026, -316833, -85455, 94885, 371033, 550957, 246823, 266197, 453150, 342512, 258392, 357431, 401850, 392901, 223401, 107313, 184280, -82364, -144110, -107307, 32631, 74759, 92602, -14547, -69979, -52209, -183261, -374002, -466763, -427697, -375857, -216072, -314824, -228302, 65704, 125294, 53433, -9145, -117811, -207144, -447401, -478807, -435622, -425693, -391586, -342022, -174727, 153353, 201217, 250904, 276869, 526754, 628350, 740323, 674846, 757892, 823144, 880122, 1003516, 1172474, 1127120, 1252275, 1086220, 1031161, 1199004]
20836A199004j27791k59969j57408K44107m9601L8059M5661K74488K30034j24445
20826A312139k11319j77949j93288j28720j66289j42066m6128O1201j634M6313
20816C52260o5055k73977L3921K31777N9851R88j248j12480k29085k95961j12241
20805d11250L94100J60204k54869j79111l4271q5404j49989k26683J00246K71783
20795d15244K25126L3713J14885K27598R8203L8920n8780r5300K34306j04976
20785B98451j71689R325j8582k04575k62506l9041R2230n0116j67659j60175J24920
20774e49417J82842j89933r4933K62170J50760N8666m2971O6576L9308N7508n5711
20763a15135o4968M1306O6654q4484l01126K4155K34931l4358N4056n6484k73132
$$ y = [1199004, 1071213, 811244, 653836, 897943, 848342, 886401, 932062, 1206550, 1436584, 1312139, 1100820, 922871, 729583, 600863, 434574, 292508, 246380, 307581, 305947, 352260, 287205, 13228, 47149, 278926, 338777, 339765, 338517, 226037, -3048, -299009, -411250, -17150, 143054, -111815, -290926, -325197, -410601, -560590, -787273, -687027, -415244, -190118, -156405, -41520, 186078, 284281, 323201, 264421, 169121, 403427, 298451, 126762, 136087, 117505, -87070, -349576, -388617, -296387, -346503, -514162, -674337, -549417, -366575, -556508, -651441, -389271, -238511, -179845, -222816, -156240, -116932, -59424, -115135, -180103, -138797, -72143, -156627, -457753, -433598, -198667, -233025, -178969, -235453, -508585]
20752e08585J52868K64157n3658M4836j77695m4465j20454L21852J34383L9208
20742E2447o0892o5246N9084M6352K18739q0880j28639O0568J12079K44233q9976
20731C67869k80137k19155o4584J43450J86754o1027k62163k08090K86054J38017
20721B6988J02302m5942K8060o1972k34606P1643J27819k05383j85198n8437P6842
20710c57884J30289J02016K01590K67217j95072l07122j32452Q6438m8918L3692
20700b20206L19033J22322r8861j97128J51182J38318k04980q7477M9715L8922
20690A0840k25873j2068M4404j18256M6936L4758L05564j3279k37130j49255K0608
20679b92751J44118J37378K9481k48629j7181J38077J04814J97004P2034l4573
$$ y = [-508585, -355717, -91560, -145218, -100382, -278077, -322542, -442996, -121144, 13239, 52447, -8445, -73691, -14607, 31745, 250484, 169604, 40965, 101533, 213612, 457845, 367869, 87732, -131423, -196007, -52557, 134197, 73170, -188993, -397083, -111029, 26988, 129290, 83348, 111408, 49436, -185170, -113527, 14292, -191091, -376289, -434726, -357884, -227595, -125579, 76011, 343228, 148156, -158966, -291418, -204980, -253898, -220206, 98827, 221149, 122288, -74840, 76342, 214660, 9680, -77797, -28082, 10840, -215033, -227101, -182697, -300953, -254017, -219259, 86305, 73026, -164104, -313359, -292751, -148633, -11255, 18226, -230403, -247584, -109507, -4693, 192311, 264345, 229772]
20669B29772L9135n0689j84159o9403o0812J931k8941K32223J43732l30580j81270
20658b59061k05217J13206j14899l5045Q6013J360J1125q7329p8728L35812M07478
20647A74715l26016j65814K10549j05652j43282k67613Q0837K26538J15184J05701
20637i4853J09895J7590j43185k79665r1253P3304R639l2977O440j7098J91962
20626b50201L13258J06457p6055M3763j61430m5376j79322Q0437L2141J8656q7352
20615b05024P8583J83398J953k68196j1856J52948K07496J41166J5354j37778
20605A58044j00072j18136L34K5162j53062k4469L9930N7690J5823K1817J25563
20594D8624L21813j1795j29339j94036l89937r4743k22482J0221M9629P8847P4928
$$ y = [229772, 268907, 218218, 34059, -35344, -96156, -94225, -123166, 109057, 252789, -77791, -259061, -464278, -351072, -465971, -501016, -415003, -413643, -402518, -489847, -568575, -232763, 174715, -151301, -317115, -106566, -212218, -355500, -623113, -542276, -315738, -200554, -94853, 15042, 32632, -110553, -390218, -481471, -408167, -398528, -431505, -425065, -442163, -250201, 63057, 169514, 93459, 137222, -24208, -69584, -248906, -168469, -136328, -117672, -205024, -126441, 56957, 58910, -209286, -221142, -68194, 139302, 280468, 295822, 158044, 57972, -60164, -59830, -34668, -187730, -212199, -172269, -114579, -98756, -76939, 48624, 370437, 358642, 229303, 35267, -354670, -449413, -671895, -661674, -612045, -533198, -458270]
20583d58270l0500J2970M1080n1831p1973n6030J52193N3526J15984J52086J34051
20572f714J90108M4345J70081J83039l06144l53738m50572m1234M21305L25765
20562A76241O1808j26767k34141O086J35155L7263Q5696n7397j38626k99662M9321
20551c05023L37574L510k54294j21478J31934J5400L31421j26492j80374O702
20541a61120m0582P8074j42439J43480J42906j20824m0110p9797o1879J62478
20531a19813J96372n0956p3533Q4272l8710j74345k11425N0389P3553J67371L34547
20520B37722j04182l56681N241m8172J06828J41266N8529o4806q0381l8214k058
20509a44908N5269N4460q16l3156P1844L0731K65410R0628J57326O3357l4388
$$ y = [-458270, -488770, -475800, -434720, -486551, -558524, -614554, -462361, -408835, -292851, -140765, -6714, 183394, 227739, 397820, 580859, 274715, -79023, -529595, -570829, -149524, 176241, 238049, 111282, -122859, -116773, 18382, 55645, 141341, 83944, -54682, -354344, -305023, 32551, 36061, -218233, -339711, -207777, -192377, 139044, 12552, -167822, -161120, -201702, -123628, -266067, -122587, 20319, -100505, -140615, -220412, -282291, -119813, 76559, 25603, -47930, 36342, -2368, -176713, -388138, -337749, -264196, -96825, 237722, 133540, -223141, -217900, -266072, -159244, -17978, 40551, -24255, -104636, -142850, -144908, -89639, -35179, -35995, -69151, 2693, 33424, 298834, 389462, 546788, 610145, 575757]
20498E75757k38164j41780j61359N1678J84625j5605l8179J37091L10588J37402
20488H02054K2361k30397L0114L6971j05869j81179k45736q3664J01810m5707
20478A00758k0086M2292J5098p7464j42373K1731j0747K4535J51185P0705L1461
20467B07095m4799J38870J02080q7945k33358k65143k58090p6368J69002J09669
20457b38987p800L04087K71433R1294J47264r7144J03070L19193p1123j64168
20447F57119J06999j74725o8583k70084n44945j74202K884L61006P6342J35196
20437A07007J96175R2768j03853k960k0571J06676J53584Q6028k37589r1612l0456
20426B55197k20158l4054j22367R994n6642k5246J43141J5206m4174m134J14556
$$ y = [575757, 337593, 195813, 34454, 86132, 270757, 255152, 216973, 354064, 664652, 802054, 824415, 594018, 624132, 661103, 555234, 374055, 128319, 44655, 146465, 100758, 80672, 122964, 138062, 60598, -81775, -60044, -70791, -46256, 104929, 175634, 207095, 162296, 301166, 403246, 315301, 81943, -183200, -441290, -517658, -348656, -238987, -246787, 57300, 328733, 420027, 567291, 470147, 573217, 892410, 821287, 657119, 764118, 589393, 520810, 250726, -294219, -468421, -465537, -104531, -28189, 107007, 303182, 395950, 292097, 289137, 268566, 375242, 528826, 614854, 377265, 285653, 255197, 35039, 985, -121382, -111388, -168030, -193276, -50135, -34929, -79103, -83237, 31319]
20415C1319n5145k18202K48272J25159L6211n2588J37948j57253j08083l50794
20405c63156j07305K85990J08883R1261j97402k27359K09946J95465R8718j78678
20395h3637j01156L7667R4078r0170M2969P9421R8736m1390j46498r1545N6135
20384a45390K08113J24089J09526K24529k19642l59387L8513m0647N095n0177
20374a05378J47776J8931J52856k3246j83822j16484J23732j50870k12259J768
20364c46996j60652N026l0274n3918o6331j21461M2463J57660J06140O2325J05639
20353c00379k0967J5535J71743j30132q9356j44590P1794R6389R3008j87570N5394
20342c69131L6941J33139j9838n9664K0993K9414j5023L6237J13267O8635J27446
$$ y = [31319, -23826, -242028, 6244, 131403, 167614, 115026, 252974, 95721, -12362, -363156, -470461, -184471, -75588, 15673, -181729, -409088, -199142, -3677, 95041, -83637, -184793, -147126, -53048, -143218, -100249, -20828, 77908, 36518, -109980, -201525, -145390, 62723, 186812, 296338, 520867, 301225, -58162, -19649, -60296, -55201, -105378, 42398, 61329, 214185, 190939, 7117, -109367, 14365, -136505, -348764, -346996, -507648, -502622, -532896, -586814, -653145, -774606, -732143, -574483, -468343, -406018, -300379, -321346, -305811, -134068, -264200, -353556, -498146, -426352, -329963, -236955, -424525, -369131, -332190, -199051, -218889, -278553, -257560, -228146, -243169, -206932, -93665, -25030, 102416]
20331A02416J31954Q6307o4553k65299j07289J05992k89452n7158J57373j77680
20321c77389Q939K17398K68323J43881k01255j50416k9017j56551r9693q4633
20311d60413J02805J27101N1962n3260j82856k32670L1686R4258J24048L39075
20301e8264R6999J35085J74608j96293l30900o2387l8844P1629J99790Q1287J38609
20290B11319K0255j8672J36683P0727R462k74053r2219k74973K12107L04285J24571
20279D29492J128k74148k01099l8942M2845M5173j00782j76311l2943O864L4596
20268b64127k5548N2401m2311Q0068Q0350K57333M3026j37850q8762k63317r6385
20257d05122K73690m4465k67256J53908L20699O328j51208k15196M3275J79581
$$ y = [102416, 234370, 320677, 256124, -9175, -116464, -10472, -299924, -357082, -199709, -377389, -368450, -151052, 117271, 261152, 59897, -90519, -119536, -276087, -375780, -460413, -357608, -230507, -178545, -231805, -414661, -647331, -615645, -521387, -397339, -58264, 38735, 173820, 348428, 152135, -178765, -241152, -279996, -208367, -8577, 72710, 211319, 231574, 212902, 349585, 420312, 429774, 155721, 63502, -211471, 636, 304921, 429492, 430620, 156472, -44627, -83569, -40724, 4449, -96333, -272644, -305587, -298723, -264127, -289675, -237274, -279585, -199517, -119167, 138166, 181192, 43342, -45420, -308737, -405122, -131432, -175897, -443153, -289245, 31454, 37782, -113426, -328622, -285347, -105766]
20247a05766j495j2246Q6041L1595K6194j35921k2544q3436o7298O1063L84623
20236A60810r7844L00298K88852j42514j25660k54415k38782K46292K18791r9300
20226B56528l1425j56949P8542j46702j69462l5363P5819J70225K24275M8190
20216C13678k7763o9052N5759J29518j00004r1537m10796j50359l5798R2784k30738
20205e24308M4365M6339m1718j2574K4205J18839O4021J19376j2306J50937j29818
20194a52642l92751M3526N3214P1882L8197P4660j12777J21009Q6924O8758k92036
20183c92036J2826K8646k00308J5081R4982J8008K79232K95615l15544P335J59285
20172C122J36873l77798j28735J36351K46164P3129k23023j95608l4607K01011
$$ y = [-105766, -107261, -119507, -33466, -1871, 24323, -111598, -134142, -217578, -284876, -223813, 160810, 62966, 363264, 652116, 509602, 383942, 129527, -109255, 137037, 355828, 256528, 225103, 68154, 146696, -6, -169468, -204831, -129012, 41213, 265488, 313678, 285915, 216863, 272622, 402140, 302136, 210599, -200197, -350556, -386354, -293570, -524308, -479943, -433604, -475322, -487896, -463691, -344852, -280831, -161455, -173761, -22824, -152642, -545393, -501867, -448653, -376771, -338574, -263914, -376691, -255682, -168758, -100000, -392036, -379210, -350564, -550872, -535791, -440809, -422801, -143569, 152046, -163498, -156163, 3122, 139995, -237803, -366538, -230187, 15977, 89106, -133917, -329525, -364132, -163121]
20162a63121K3729k07518j34454K72949K93645K13675j06477k92101k02993J57354
20152a45312K17303J0981j4292K3339j05880j61229j00111m8519K30909J99069
20142A06258M9379j130o5265K0082j22978q9820j73841q9560R2669M03717L40280
20131D69791J40323j85138k08980k75162R4803J57101J18726M0500m9611j75658
20121A26695l17053l0311O9127l4801j0251J57789J05662J12776K50140L05875
20111G35648l03209l67822m1760J19820k5378J1668R6762J09193M6581J37936
20101E19439l8585j33220R2354J03267p7227j45541K07397K7575q7004j29878
20091C38577K1900L33453K51758r5233k06693l04152k11513j4181J20013J39412
$$ y = [-163121, -139392, -346910, -481364, -208415, 85230, 298905, 192428, -99673, -302666, -145312, 71991, 82972, 68680, 92019, -13861, -175090, -275201, -323720, -92811, 106258, 155637, 154507, 89242, 109324, -13654, -103474, -277315, -366875, -274206, 129511, 469791, 610114, 424976, 215996, -59166, 35637, 192738, 311464, 351964, 302353, 126695, -190358, -220669, -151542, -186343, -196594, -38805, 66857, 179633, 429773, 735648, 432439, 64617, 22857, 142677, 117299, 128967, 225729, 334922, 381503, 519439, 480854, 347634, 439988, 543255, 466028, 320487, 527884, 555459, 468455, 338577, 360477, 693930, 945688, 850455, 643762, 339610, 128097, 113916, 233929, 373341]
20081C73341l8291r4688J4973k05829j75455p4064J41088n2013J67337J66155
20071B22554J01843k0580k51030n6903K5117M0813m73n0056J38232R2643R4292
20060C36452k29977j46772J51167o2079J3445M2753n5422j43723J06587K67812
20050B80243K29474O0383l1775l0596J85824J54843j6130k20026j14013J82707
20040F80934M0012R2357j0059j3626j14830k9581J03198L70239o2173l25060j77661
20029E53750J9717O2385j50896k30174j75817P495j9205J87677K98178J27765
20019F80875j0942l1979j33061L5900J1666P4808N6338j93272J77088J79013j9939
20008H26495J92878J12448O4970L04637J97780J14934m4508J92083K02354J19848
$$ y = [373341, 335050, 240362, 255335, 49506, -125949, -200013, -58925, -110938, 56399, 222554, 324397, 303817, 52787, -4116, 21001, 61814, 61341, 11285, 149517, 242160, 336452, 106475, -40297, 110870, 48791, 62236, 104989, 49567, -94156, 12431, 280243, 509717, 570100, 538325, 507729, 693553, 848396, 832266, 612240, 498227, 680934, 720946, 813303, 803244, 789618, 674788, 645207, 748405, 1118644, 1056471, 731411, 553750, 573467, 635852, 484956, 254782, 78965, 86460, 67255, 254932, 553110, 680875, 669933, 637954, 504893, 540793, 552459, 627267, 683605, 490333, 667421, 846434, 826495, 1019373, 1131821, 1196791, 1501428, 1699208, 1814142, 1769634, 1961717, 2164071, 2283919]
19998B283919M06952M74563L32248K75705R4041N03643O05875L61985L17669M51387
19988F107987P38858R21736J487653K159148L551152N616681R679588J6833641
19980D7096444K6704814L1953635K2995630Q475212M529999J641241k2392861
19973A21004114l5918971k3880406j2302860o210967j683437J896655O663763
19966D9567891J4056483K3540924K9049718K2049349P771648L225206J229362
19959A50490581k0709298l6596329k6453472j5276605r459670o119315m139473
19952C1736419l105652k544598j868974j055221q96845q93021p92252n10114m05683
19943A9664059n46483q42161q89871j195556j208617q35992r52016o83285j65941
$$ y = [2283919, 2690871, 3165434, 3497682, 3773387, 3867428, 4371071, 4976946, 5338931, 5656600, 6107987, 6846845, 7768581, 9256234, 11415382, 14966534, 20583215, 30262803, 47096444, 73801258, 105754893, 128750523, 137225735, 141755734, 143396975, 121004114, 85085143, 61204737, 48901877, 42690910, 41007473, 42904128, 49567891, 63624374, 87165298, 116215016, 138264365, 146036013, 149261219, 150490581, 129781283, 93184954, 66731482, 51454877, 41995207, 35875892, 31736419, 28630767, 26086169, 24217195, 23161974, 22265129, 21372108, 20579856, 20069742, 19664059, 19117576, 18275415, 17385544, 16189988, 14981371, 14145379, 13193363, 12510078, 12344137]
19934A2344137M09656J050175J574699K718298M445400P509377J3046369K1978868
19926F5076979L2341584L4387291K0806295O596751N044576l830506l2910650
19919A27512320l8170732k2740970j1489839n301107j028836L444262R447319
19912F1672417J8679036K9402879L2667823K0114343N217644L085081l358375
19905A67480848l1866697m0662398k6333405j5134622r410803o125785m155538
19898C3791600l173209k473068k291200k150805j657302j237403j218558j155708
19890A8434347j265680j399949j265562j676883j255932r51479p39853j047176
19882H831833r91396j086782o95140n82054l09150l06368m51155m31230l07167
$$ y = [12344137, 12753793, 13803968, 15378667, 18096965, 22542365, 30051742, 43098111, 65076979, 97418563, 131805854, 152612149, 159208900, 164253476, 160422970, 127512320, 89341588, 66600618, 55110779, 49809672, 48780836, 52225098, 61672417, 80351453, 109754332, 142422155, 162536498, 167754142, 170839223, 167480848, 135614151, 94951753, 68618348, 53483726, 44072923, 37947138, 33791600, 30618391, 28145323, 25854123, 23703318, 22046016, 20808613, 19590055, 18434347, 17168667, 15768718, 14503156, 12826273, 11570341, 10618862, 9879009, 8831833, 7840437, 6753655, 6058515, 5476461, 5167311, 4860943, 4409788, 3978558, 3671391]
19873C671391k44914j13082j31622M4144l4979N4877l47643k95475j8834n9411
19863B524452k72256k6967j49081p7704J41909K89667r2526j33741R2499j26645
19853B169607k14708j15605k04499j26364K68405K5212l94486k7643J90152j99872
19843A370199l31925K5608j08146N6663k4380N7224r6226l9060R9972k2373P0340
19832A057896k21761J02544L0239j93848l49716M0533N9616J27509N7500l35620
19822C74892K1384j36793R0859j19903j05185K61614j53568L9243J50444J98250
19812F21237J1941L6088j62735j76616k16133k1577J62529K00473J8207L1693
19802E05107r3032M6999j35934k49893k9585R3539j24855j16878J96788R7781
$$ y = [3671391, 3426477, 3313395, 3181773, 3225917, 3190938, 3245815, 2898172, 2602697, 2583863, 2524452, 2252196, 2225229, 2076148, 1998444, 2140353, 2430020, 2337494, 2203753, 2296252, 2169607, 1954899, 1839294, 1634795, 1508431, 1776836, 1802048, 1407562, 1379919, 1570071, 1370199, 1038274, 1063882, 955736, 1012399, 988019, 1045243, 949017, 909957, 1009929, 987556, 1057896, 836135, 938679, 968918, 775070, 425354, 465887, 525503, 653012, 710512, 374892, 396276, 259483, 350342, 230439, 125254, 386868, 233300, 272543, 422987, 621237, 633178, 669266, 506531, 329915, 113782, 92205, 254734, 455207, 473414, 505107, 412075, 459074, 323140, 73247, 43662, 137201, 12346, -104532, 92256, 190037]
19792A90037q9581j10431K41375K00057J13522l6053O8860l4325k13423k21452
19782A08586N5821J86484o8491j21350n843j8633L32398J38274p2629j96806j54151
19771A83660m4154Q29j26183J74662Q0919j01435j77555L3212P163m9110O1878
19760D3886J38044M735O5051j38495j65287L122J07954j70558k17952J78167J11321
19749d0012J12667J06576L15441J077q6359r1811k08007L377O1575j43038J78437
19738B09923K08695J5378N2386j77540k12590J01634J2379k85510l9745J66873
19728E1883J88043m6210l08074p5173K47347J21456J13336r7406L742J00878n7101
19717B42721j30748M0231q9555j36296m9710j14747O9354R6860j31174Q0816N1964
$$ y = [190037, 100456, -9975, 231400, 431457, 544979, 508926, 577786, 543461, 330038, 108586, 164407, 350891, 282400, 161050, 155207, 136574, 468972, 607246, 534617, 337811, 183660, 139506, 140335, 14152, 188814, 269733, 168298, -9257, 23955, 31118, -17992, 43886, 181930, 186665, 251716, 113221, -52066, -48944, 59010, -111548, -329500, -151333, -40012, 72655, 179231, 494672, 495749, 409390, 317579, 109572, 112949, 174524, 31486, 209923, 418618, 433996, 486382, 308842, 96252, 197886, 210265, -75245, -114990, 51883, 239926, 193716, -114358, -189531, 57816, 179272, 292608, 195202, 198944, 299822, 242721, 111973, 152204, 62649, -73647, -123357, -238104, -168750, -71890, -203064, -122248, -70284]
19706g0284J18942J00952O2579r5207j08029k72975j9670L51057K66303R7611
19696D31279j2371J7959j5621j53072j67749m350m6081n0619j22920o6017o9364
19685b58926M0359N9580P6831J19666r2423J41167P3889j04860l9603K4735J14455
19674A54870j5671l8758J22265K5728j1725K15525L11400J71351J01908N8187
19664A095080K58953K2758j12672l18136M0495N6055K5430j08612j44853j56349
19654F58149l65242o2884J46066j3008k292k10806q2586J96317J70428j37955
19644B96187l59864k85055L72286L39698l0586k42174l2517m8540o6823r3111
19634a50499K03558J76178o0508L7469m0871k10414q2767J32067m0456J08139
$$ y = [-70284, 48658, 149610, 212189, 116982, 8953, -264022, -283692, 67365, 333668, 431279, 418908, 436867, 421246, 268174, 100425, 96075, 49994, -625, -123545, -189562, -258926, -218567, -158987, -82156, 37510, -54913, 86254, 160143, 55283, 15680, 40415, 154870, 139199, 100441, 222706, 248434, 236709, 452234, 763634, 934985, 1036893, 1095080, 1354033, 1376791, 1264119, 945983, 986478, 1042533, 1067963, 959351, 814498, 658149, 292907, 230023, 376089, 363081, 360789, 149983, 67397, 263714, 434142, 296187, -63677, -348732, 23554, 363252, 332666, 90492, 57975, 9435, -57388, -150499, 53059, 229237, 168729, 206198, 165327, -45087, -127854, 4213, -36243, 71896]
19624G1896J63692j14909j05908o7210J04203J18397K5012K06485Q5486J879J75676
19613F64699J42320j42664j7617Q6238M9841o1564j08162l48730j30324r4667
19603C9370K13947K4486j20080K94625N2267k31823J8538k4300J81232k64308
19593A83954k72285m4669J76443M5915l2306N2558l4107J90171j60396k08721
19583a03443J27789j37098M9648J42842K3587J31621J3650j78129k1756j06611
19573e7900J2831L04593L47035N4146j37668l30468j97305j01089Q1289Q852R3029
19562G7345j22617L7609R5240n179j15332j31831j41432P2155p0846J59756L15402
19551A70270l1651L9409P274J00868O7464J38594k18644N1478L1825P3982L8669
$$ y = [71896, 235588, 120679, 14771, -52439, 51764, 170161, 195173, 401658, 487144, 489023, 664699, 807019, 664355, 646738, 732976, 782817, 721253, 613091, 264361, 134037, 39370, 253317, 277803, 157723, 452348, 504615, 272792, 291330, 267030, 448262, 183954, -88331, -133000, 43443, 89358, 57052, 109610, 75503, 265674, 105278, -103443, 24346, -112752, -63104, 79738, 103325, 234946, 248596, 70467, 48711, -57900, -45069, 259524, 606559, 660705, 523037, 192569, -4736, -105825, -24536, -15684, 77345, -45272, -7663, 87577, 82398, -32934, -164765, -306197, -234042, -304888, -145132, 170270, 138619, 178028, 185302, 286170, 353634, 492228, 273584, 325062, 356887, 430869, 469538]
19540D69538J97671J69547J0026j09545j14823M6504J06883K97464J00406J2087
19530A185758K46887J5445L606K42287M59445M80771O01050M87140R2138K37316
19520D051843J47715n4337O241K95163M96145P07542J136471J548209J819031
19511A0154023J543407Q97344M65217l69384j121717j065707o74059K52197Q48118
19502A0929439J356019J769001J337677Q63305P63739J95328o63110l12031J047568
19493A7286935K428951M230407N786322P316559Q229469R373722R174756P897087
19485G1724208R448100J6142812K2526849K1717494J3327927O689073O901592
19478A68478055J109940j4979445j7036429q721684m530628k674295j989077m030054
$$ y = [469538, 667209, 836756, 846782, 737237, 622414, 668918, 775801, 1073265, 1173671, 1185758, 1432645, 1448090, 1451696, 1693983, 2153428, 2634199, 3235249, 3722389, 3814527, 4051843, 4199558, 4145221, 4151462, 4446625, 4942770, 5650312, 6786783, 8334992, 10154023, 11697430, 12594774, 13059991, 12690607, 11568890, 10503183, 9829124, 10081321, 10929439, 12285458, 14054459, 15392136, 16255441, 17019180, 17214508, 16551398, 16239367, 17286935, 19715886, 23946293, 29732615, 37049174, 45278643, 54652365, 63827121, 71724208, 81172308, 97315120, 119841969, 141559463, 154887390, 161576463, 168478055, 169587995, 154608550, 137572121, 128850437, 124319809, 121645514, 119656437, 115626383]
19470A15626383n840576j836590K937337L771582K588669K445000J166639j144375
19462A19714069K424447J2013040K0198650K1199049J7879358J5112698R808302
19455B18349613j873768j1238171j0295325k914663k841843q229593q544549q171204
19447A64240497j3350139j8631318j7601855j1005714n703417l286816j512871
19440I3148367J327804L054374O137830J5520063K6877921L2112187K4866926
19433B03045472J4948547J3098877Q286877j3237494k8883438k5272536j5353973
19426A56632332j2673737j6845017j1861646J895848J7344900K9949984L2137040
19419A96579704K1221565J0208187M625787j0818999l5628055m0488377l1152555
$$ y = [115626383, 109785807, 107949217, 110886554, 114658136, 117246805, 119691805, 120858444, 119714069, 122138516, 134151556, 154350206, 175549255, 193428613, 208541311, 218349613, 216475845, 205237674, 194942349, 192027686, 189185843, 180956250, 172411701, 164240497, 150890358, 132259040, 114657185, 103651471, 97948054, 94661238, 93148367, 94476171, 97530545, 103668375, 119188438, 146066359, 178178546, 203045472, 217994019, 231092896, 239379773, 226142279, 197258841, 171986305, 156632332, 143958595, 127113578, 115251932, 117147780, 134492680, 164442664, 196579704, 217801269, 228009456, 232635243, 221816244, 186188189, 145699812, 114547257]
19412A14547257k2218222j4773097q757781n166018l537197l134383k894455l009879
19404E1056225l697812m089091l093933j660355J7595J224096J362266J252883
19396D2371874Q63645k87042k049743l209843l990349m556275l662225k753251
19388B2726791k110678j513064r61206m83050m41531l18186J39836M1647q39649
19379A6240910j311717j207763j092698j058934j037227j157522p81750l28066
19371H265233o62767o13251m29181n04913l22135j08174k28621k62562l29046
19362D804583j80848k85196j21185o8573j64185j59597q5448l0851n1374k96036
19352C361290J20239K0466k19229k02967j1529p6419l435m1388l7715p7161m74469
$$ y = [114547257, 92329035, 77555938, 68798157, 63632139, 60094942, 56960559, 54066104, 51056225, 47358413, 43269322, 40175389, 38515034, 38532629, 39756725, 41118991, 42371874, 43235519, 42948477, 40898734, 37688891, 33698542, 29142267, 25480042, 22726791, 20616113, 19103049, 18141843, 17658793, 17217262, 16899076, 17038912, 17080559, 16240910, 14929193, 13721430, 12628732, 11569798, 10532571, 9375049, 8593299, 8265233, 7602466, 6989215, 6560034, 6055121, 5732986, 5624812, 5396191, 5133629, 4804583, 4623735, 4338539, 4217354, 4148781, 3984596, 3824999, 3739551, 3708700, 3657326, 3361290, 3481529, 3501995, 3282766, 3079799, 3068270, 2991851, 2988416, 2947028, 2909313, 2832152, 2357683]
19341B357683p2520J45414K2290j05915q4335k26935j36339O2007J7189k45887
19331A732652P4319q4262K9809K0028k6481L00889J79538j58448k76481o3526
19321A728037J4606R7234j39592k92518Q5580l7752j5045o0932j6670K94807P871
19310A665626O0023k84228l33965l0017n3223p6756k6785j20955j60899J67821
19300H06642J14781j27219J08843O421j61824j21217K89772J18087j59586q6839
19290G87861J06819p9824L0341K8185K5427k61742n6218P7138j26856j20360O1148
19279D71919J55407k36299r6048M08593j75627j44675j9010K816N0917j04205
19269C13788r7707k37794j28879J56052K87219K6137k3436j54432Q1522K660J75906
$$ y = [2357683, 2285163, 2430577, 2452867, 2346952, 2262617, 2035682, 1899343, 1961350, 1978539, 1732652, 1806971, 1722709, 1752518, 1772546, 1746065, 2046954, 2226492, 2068044, 1791563, 1728037, 1742643, 1839877, 1700285, 1407767, 1493347, 1455595, 1440550, 1379618, 1362948, 1657755, 1665626, 1725649, 1441421, 1107456, 1077439, 1024216, 947460, 920675, 799720, 638821, 806642, 921423, 794204, 903047, 909468, 747644, 626427, 916199, 1034286, 874700, 787861, 894680, 814856, 845197, 873382, 898809, 637067, 580849, 657987, 531131, 410771, 471919, 627326, 391027, 294979, 703572, 527945, 383270, 364260, 367076, 417993, 313788, 216081, -21713, -150592, 5460, 292679, 318816, 295380, 140948, 222470, 225130, 401036]
19258D01036m4817n4090J08766m0261K6026L56105K46480J07872j21699l9059
19248I46359j22048k07187k02510p3179J7663K05442Q0370j8694n3639K5014j13304
19237D84287j04400k16213q2710K089k6380r8435n7549J58679L44006M2632j8199
19226D27807N212j03978k63311R940j145J25705r4973K51726n7137L4578J45814
19215D80238J60024J61912j41544L3680R4865l878m734k2895k7776j9240j61266
19204E49386l7392k32083n972L2641K2882j2115q3915j56441K78937j7489J50559
19193D88998K5463p179J06564Q6107J23205k61141j14845J7347J04670K79078
19183H48267J4602J83181J38617N6477J55547L3066k42045j49544K11408J01812
$$ y = [401036, 356219, 302129, 410895, 370634, 396660, 752765, 999245, 1107117, 985418, 946359, 824311, 617124, 414614, 341435, 359098, 564540, 644910, 626216, 572577, 597591, 484287, 379887, 163674, 80964, 83053, 56673, -41762, -99311, 59368, 403374, 446006, 427807, 433019, 329041, 65730, 75670, 74525, 200230, 105257, 356983, 299846, 334424, 480238, 640262, 802174, 660630, 694310, 789175, 785297, 780563, 757668, 729892, 710652, 549386, 511994, 279911, 273939, 306580, 329462, 317347, 233432, 76991, 355928, 338439, 488998, 514461, 507282, 613846, 699953, 823158, 562017, 447172, 464519, 569189, 848267, 862869, 1046050, 1184667, 1241144, 1396691, 1429757, 1187712, 1038168, 1249576, 1351388]
19173A351388J35016N11635K23228J80349N22227N60641K50428L57497K41017
19164D333426R9154L17906N90238N16701P65192Q49678J364454K117118K795454
19155A3749321L882636N331925Q463373J4504264K4459568L4480841L6931665
19148A41803593K7004747J9255136K4246971K2647671K507679j1731012j4188821
19141B11545964r325838r923027k9968241m1562361l0558232j8018009j1393546
19134F0796710p802555n440965m153063l538891k845605k708322k632180k273380
19126B9401749k123756j815247j920996j663509j940375j951219j805481j414211
19118A4766955j404056j250608r19652o82664m21758m86476k84598O0712N8090
$$ y = [1351388, 1486404, 1998039, 2221267, 2401616, 2923843, 3484484, 3734912, 4092409, 4333426, 4432580, 4750486, 5340724, 5857425, 6622617, 7472295, 8836749, 10953867, 13749321, 17631957, 22963882, 31427255, 45931519, 70391087, 104871928, 141803593, 168808340, 188063476, 212310447, 234958118, 237465797, 225734785, 211545964, 202220126, 192297099, 162328858, 120766497, 90208265, 72190256, 60796710, 52994155, 47553190, 43400127, 39861236, 37015631, 34307309, 31675129, 29401749, 27277993, 25462746, 23541750, 21878241, 19937866, 17986647, 16181166, 14766955, 13362899, 12112291, 11192639, 10509975, 10088217, 9601741, 9317143, 9377855, 9435945]
19109I435945q3069J23708L44783L43593N85762J358518K077223K422926L432124
19100B0041513N315981Q561427J4610493K3568932L1709840L1211433K1344995
19093A56364614J7316248K2361351J6514983k509131j2087595j2257973p295711
19086A78406786j1629815l1173051l6226626k4103026j4383425r073367n849883
19079D5967593m317165l412541k783562k616798k708610k263452k107220j618359
19071B4139886j275334j633299j938946j833551j672693j518915j448146j453598
19063A1365404j353781o40247n62435p25913n90298m81026l31169m49264o09559
19054E621712n09800m66549R8649K14238J34735j64922m9927l3499j9220j26074
$$ y = [9435945, 9352876, 9476584, 9821367, 10164960, 10750722, 12109240, 14186463, 16609389, 20041513, 25357494, 33918921, 48529414, 72098346, 103808186, 135019619, 156364614, 173680862, 196042213, 212557196, 210048065, 197960470, 185702497, 178406786, 166776971, 135603920, 99377294, 75274268, 60890843, 51817476, 45967593, 41650428, 38237887, 35454325, 32837527, 30128917, 27865465, 25758245, 24139886, 22864552, 21231253, 19292307, 17458756, 15786063, 14267148, 12819002, 11365404, 10011623, 9371376, 8808941, 8083028, 7492730, 7011704, 6680535, 6231271, 5621712, 5111912, 4645363, 4744012, 4958250, 5092985, 4928063, 4878136, 4844637, 4825417, 4699343]
19044D699343l18235m8391J1206k09659l05724l04612q7647j5915J1937J50044
19034C582347P597k38526K04370J8088j54818j11108j61837M1337k04647l67848
19024B614955j41771j53743k06435j43549J83366R2738j92263l2159j24124m5587
19014A851428q0586j12027K58455J61326M6860J19922o2110K5493l6767k18817
19004A953177o0265j8268M8855j66714p7826K2039R8921m8673M7209P964r1436
18993A714983L4584J24393n9868m9467k67043j65396j6737L02215J66242o8625
18983A715281j28250J08652J07551j33865n7788J15646k06986k84052j98762K16308
18973A253735K45430o1027m1871R8465o4474r0816j7617j48428j71486J81801
$$ y = [4699343, 4381108, 4332717, 4343923, 4134264, 3828540, 3523928, 3436281, 3420366, 3432303, 3582347, 3589944, 3351418, 3555788, 3573876, 3419058, 3307950, 3146113, 3187450, 2982803, 2614955, 2473184, 2319441, 2113006, 1969457, 2152823, 2245561, 2053298, 2021139, 1897015, 1851428, 1770842, 1658815, 1917270, 2078596, 2125456, 2245378, 2183268, 2208761, 2171994, 1953177, 1892912, 1874644, 1923499, 1756785, 1678959, 1700998, 1799919, 1751246, 1798455, 1806419, 1714983, 1749567, 1873960, 1814092, 1764625, 1497582, 1332186, 1315449, 1617664, 1783906, 1715281, 1587031, 1695683, 1803234, 1669369, 1611581, 1727227, 1520241, 1236189, 1037427, 1253735, 1499165, 1438138, 1396267, 1494732, 1430258, 1339442, 1321825, 1173397, 1001911, 1183712]
18963A183712K84461K71033o9383k12339k17968O297P048O0497j69053p7006P503
18952A074802O4748J11037j1310o1563j2883J14179N5527m3615K37692J40340
18942A668954J06532j56098l34108q1968L3637j48953Q7802j19135J32330J48601
18932A337594o885M4473j83754j42335j91616j54057R7791K6503N8081R2139O95
18921I78629M9567O5411j55368N2222L27946Q4204q632k8334l16688j99322j81088
18910F68547j88913j54188K20970R5917K64478n5634L0483l0710l73001k60713
18900B17236j1459J8648J01251J50382j15785j08741O3292N1121O2874P8561M2868
18889E50248k0777j40349N2568j79398j86002J52675J84820R9764Q1755k22383
$$ y = [1183712, 1468173, 1739206, 1669823, 1457484, 1239516, 1245813, 1252861, 1313358, 1144305, 1067299, 1074802, 1139550, 1250587, 1239277, 1177714, 1164831, 1279010, 1334537, 1290922, 1528614, 1668954, 1775486, 1619388, 1285280, 1203312, 1236949, 1087996, 1175798, 1056663, 1188993, 1337594, 1330709, 1375182, 1191428, 1049093, 857477, 703420, 801211, 827714, 885795, 977934, 978629, 1028196, 1093607, 938239, 990461, 1318407, 1402611, 1393979, 1365645, 1048957, 849635, 668547, 479634, 325446, 546416, 642333, 906811, 851177, 881660, 850950, 477949, 217236, 205777, 224425, 325676, 476058, 360273, 251532, 314824, 365945, 428819, 507380, 550248, 529471, 389122, 441690, 262292, 76290, 228965, 413785, 513549, 595304, 372921]
18879C72921r3132j63454l769J56220j03572j61546N7124J57298q7194j97121
18869f6225q0792l5108L8K00220K75131R3554n1739j91876N6138J00257L17279
18858F16877J68787k83320l24151j84010n3473K9809q582J28185j8495q4182L3707
18847B1152J52523J1389j42134M2162r865p4617M8212J46669j57602m9020J99321
18836A88190L80887q1454k18856M9266L3642p3931p8236m1775L0796P8081r1443
18825A75167o2781L4407J67463Q1020R2073J16822k39345q4705j0355j49002j1559
18814A09205J03686R3973J39789J79044K9686Q1125o7343j37785l343j00815j46933
18803B80289j66219Q5451Q6973Q23m9419j03129K05900o9756J27207P5339J44540
$$ y = [372921, 279789, 116335, 112566, 268786, 165214, 3668, 60792, 218090, 130896, -66225, -147017, -182125, -182087, 18133, 293264, 386818, 335079, 143203, 199341, 299598, 616877, 785664, 502344, 178193, -5817, -59290, -29481, -38063, 90122, 71627, -12555, 21152, 173675, 185064, 42930, 85092, 75227, 610, 48822, 195491, 37889, -11131, 188190, 569077, 487623, 268767, 318033, 351675, 277744, 199508, 157733, 188529, 266610, 175167, 112386, 146793, 314256, 395276, 487349, 604171, 364826, 280121, 269766, 120764, 109205, 212891, 306864, 446653, 625697, 655383, 736508, 669165, 531380, 528037, 427222, 280289, 114070, 199521, 286494, 287317, 237898, 134769, 340669, 270913, 398120, 473459, 617999]
18792F17999j67715P8437j59436K6427J98523r2090k97013q119k7897k40412j9611
18781i0907J45470K08281O0258r7957o4729m6359j79762J03147J32048J94732
18771C64222K79976M40707L77963M9147J7761J78819o1540o23577k82017j02238
18761F39223m21488j43479j4150J13349j38228J01800L4085l57770r8498m8648
18751c33804J22910J93009L0231p3947k63824q5622J11027K95426K52355k10203
18741C7558l0303j08980j50169n1774Q0062N8804J52623J77060J31708o6700j53577
18730G6312k19564k27560n9124K15196Q23j23428j00094j8409L43430J68543j9578
18719C6547j32446j35732j29302j48751L68811O1191J04759J88005P3507K95o5998
$$ y = [617999, 450284, 528721, 369285, 395712, 594235, 502145, 205132, 197013, 169116, -71296, -90907, 54563, 262844, 323102, 225145, 160416, 114057, -65705, 37442, 169490, 364222, 644198, 1084905, 1462868, 1512015, 1529776, 1708595, 1647055, 1023478, 741461, 639223, 217735, 74256, 60106, 173455, 35227, 137027, 171112, -186658, -285156, -333804, -210894, -17885, 12346, -61601, -325425, -411047, -300020, -4594, 247761, 37558, 7255, -101725, -251894, -303668, -223606, -164802, -12179, 164881, 296589, 229889, 76312, -143252, -370812, -429936, -214740, -213917, -337345, -437439, -455848, -112418, 56125, 36547, -95899, -231631, -360933, -509684, -140873, -79682, 25077, 213082, 286589, 286884, 220886]
18708B20886j86281O0333m5016J02718j09778j03951J14771j3406j44775N8646
18698d5853K2905M6194J14354n3979P7200l93085j92089q8753P6491L03353L39659
18687B06397K9458l7130L19226J56564j65042l29542P1496l0565l03455j87613
18677b70206n6210K55198L14514j06432L3966m8119k78290j51578J67386K66786
18667A27015J23373j80495k6394k03057j58041j1068N3075J5285K35981n0485
18657g4811k17489m2168J82976J29937j29723L9115J09382J20418M86507M1532
18647F45676r0906J38817P8437L5147J02876m87015k07522J58089O9760j42293
18637C01066J38852Q7726K90544J36937K56846k6139j21478k4899J84954L95207
$$ y = [220886, 34605, 94938, 49922, 152640, 42862, -61089, 53682, 40276, -104499, -45853, -22948, 23246, 137600, 83621, 160821, -232264, -424353, -513106, -436615, -133262, 206397, 235855, 198725, 517951, 674515, 509473, 179931, 251427, 220862, -82593, -270206, -326416, -71218, 243296, 136864, 170830, 122711, -155579, -307157, -139771, 127015, 250388, 69893, 43499, -159558, -317599, -328667, -275592, -260307, -24326, -74811, -292300, -334468, -151492, -21555, -151278, -112163, -2781, 117637, 604144, 645676, 554770, 693587, 772024, 807171, 910047, 423032, 215510, 373599, 443359, 301066, 439918, 527644, 818188, 955125, 1211971, 1185832, 1064354, 1039455, 1224409, 1619616]
18627A619616M60413O08701O75177Q25705J222205J472303J673525J404474Q26341
18618A0788460K27565M75478J4573o84491m33597k66891O7366L48665P32493N29705
18608A1799326n44440r02952p30262l32517m77324j113580j175873o63484l91586
18599E467308j5930M3580K26284K29898J58286M47944M61691P18775J508749K316208
18589A1562793L375012M349214M572117L703263K996730L665191L720468L786360
18581D1731148O075812P743620N391777K406972K138418j17830n150082l896494
18573E6323341K004080M759164L919078K406768J949170L92603k281310q97772
18565F8575122L942499Q520367J4490399K4225947L4029868L6855440L4327040
$$ y = [1619616, 2080029, 2688730, 3363907, 4189612, 5411817, 6884120, 8557645, 9962119, 10788460, 11016025, 11491503, 11506076, 10821585, 10387988, 10121097, 10188463, 10537128, 11269621, 11799326, 11254886, 10351934, 9621672, 9289155, 8811831, 7698251, 6522378, 5858894, 5467308, 5451378, 5494958, 5721242, 5951140, 6109426, 6557370, 7019061, 7737836, 9246585, 11562793, 14937805, 19287019, 23859136, 27562399, 30559129, 34224320, 37944788, 41731148, 47806960, 55550580, 60942357, 63349329, 65487747, 65369917, 60219835, 56323341, 58327421, 63086585, 67005663, 69412431, 71361601, 71754204, 69472894, 68575122, 72517621, 81037988, 95528387, 119754334, 153784202, 190639642, 224966682]
18558B24966682L0747473K2054629O019055n919376p398027p002572r67694J696116
18550B64196286o39186K014089N48138j3936593j9174988j0844677n270035l468715
18542B13424319m418844j0209247j5357192j5702962r081587K477593J4813230
18535A75945310K6997881M0510450M9927161N1719361M7159666L5186012J3230414
18528D40676255j0294089k3268626l2910422m5595826m4447778l1104226k4119058
18521B28936230k2851417j1629610P912980L3022656O1723487Q0104854O4627914
18514D41847094K7444876J0145498Q22668m9326630r3642334p7496096m7626438
18507B12168638k7497458j7337820j5107322j2573585r418104q939714q315663
$$ y = [224966682, 255714155, 277768784, 283787839, 277868463, 270470436, 263467864, 262500170, 264196286, 263557100, 265571189, 266119327, 252182734, 233007746, 222163069, 216893034, 213424319, 209005475, 198796228, 183439036, 167736074, 158654487, 161132080, 175945310, 202943191, 243453641, 293380802, 345100163, 392259829, 427445841, 440676255, 430382166, 407113540, 374203118, 328607292, 284159514, 253055288, 228936230, 206084813, 194455203, 202368183, 235390839, 297114326, 377219180, 441847094, 469291970, 479437468, 480260136, 430933506, 337291172, 259795076, 212168638, 184671180, 167333360, 152226038, 139652453, 130234349, 121294635, 112978972]
18500A12978972p314131r247050j0514940q048722n462373l595048j959623k8403
18492F6808682K178719K205433L56471j521673k498611n156794q414490q880064
18484D5077673o825409m688096l223932k583344j908921j527845j415627j424513
18476B1479986j298895j180895p90148m13790n6790O831n8772k32273k12794n13484
18466A6728976j303134j431336j255418j042454p81309n67082m23082l10721l03016
18457I311424m24488l28039k38237l51452k67211o4962k60091l44762k53913j03807
18447F674462k57505j67782k25107l99614l51154k23001j03325r3078k98145j92407
18437D363344l2204L14686M12518j96149m28016m13795q4625K07881J13147q3754
$$ y = [112978972, 105664841, 96417791, 85902851, 77854129, 72391756, 68796708, 66837085, 66808682, 68987401, 71192834, 71549305, 70027632, 67529021, 62372227, 53957737, 45077673, 38252264, 33564168, 30340236, 27756892, 25847971, 24320126, 22904499, 21479986, 20181091, 19000196, 18210048, 17796258, 17739468, 17746299, 17687527, 17455254, 17242460, 16728976, 15425842, 13994506, 12739088, 11696634, 10915325, 10348243, 9925161, 9614440, 9311424, 8886936, 8558897, 8320660, 7969208, 7701997, 7637035, 7376944, 7032182, 6778269, 6674462, 6416957, 6249175, 6024068, 5624454, 5273300, 5050299, 4946974, 4853896, 4555751, 4363344, 4331140, 4645826, 5058344, 4862195, 4434179, 4020384, 3935759, 4143640, 4256787, 4173033]
18427D173033k43458j44152O2633l1043l36034Q016K606r3469j52235n1682o6470
18416C127745l7788k37483j30254m3467J61608J87916j59931J50468K28074j86312
18406C060576k62361j41891l77196j49484J5698j46546l3750J12264M518j02823
18396A979005k51270J10995J14696J5621n0363k69688q1720j3664P6152J77398
18386A807162K51790K80500r6332l92279k33272K73203J2180q2323M1861j45645
18376A716845k06968j65290J61246K37669Q6321m0272j53694N4838N4500r6486
18366A648709j37635K60081j65103j51063J03552K29181K33150l28197k74954
18357A417721j78031j89133l4649J25053J41213j02300J5114l0366J83439q240
$$ y = [4173033, 3929575, 3785423, 3848056, 3817013, 3480979, 3488995, 3491601, 3398132, 3245897, 3194215, 3127745, 3089957, 2852474, 2722220, 2678753, 2840361, 3028277, 2868346, 3018814, 3246888, 3060576, 2798215, 2656324, 2279128, 2129644, 2145342, 1998796, 1965046, 2077310, 2081828, 1979005, 1727735, 1838730, 1953426, 1969047, 1918684, 1648996, 1567276, 1553612, 1629764, 1807162, 2058952, 2339452, 2243120, 1850841, 1617569, 1890772, 1902952, 1820629, 1862490, 1716845, 1509877, 1344587, 1505833, 1743502, 1829823, 1789551, 1635857, 1690695, 1745195, 1648709, 1511074, 1771155, 1606052, 1454989, 1558541, 1787722, 2020872, 1692675, 1417721, 1239690, 1050557, 1015908, 1140961, 1282174, 1179874, 1194988, 1164622, 1348061, 1339821]
18347A339821j49122j21039j6038J15334k1635r4238p7401q0181q8322R6934K1639
18336I25752P3155R022p3587j70656j56747k7588P1138J45472P0729O7918J95465
18325A130073j60076o2684K33755K9050j65764N0178J70314O7376J04475k17197
18315A179500j79941j21828J6091M8630j6043k17605l08506J38553L12734J62704
18305A014289j17523j25698j86247K0600j17757q4744j41671Q2262K7646L61411
18295G32568p19j61322k7502J0514q9172k85016j24984L27304L09459p7n3103
18284F37950L1465J11392j56168q84J12148j15597J21778J41583p1254n2007q5498
18273F74908J39911Q2427l06795P9106K68853l4695q9767J12264K50838K37348
$$ y = [1339821, 1190699, 1069660, 1053622, 1168956, 1147321, 1053083, 975682, 895501, 807179, 904113, 925752, 998907, 1007929, 934342, 763686, 606939, 579351, 650489, 795961, 866690, 934608, 1130073, 969997, 907313, 1141068, 1170118, 1004354, 1054532, 1224846, 1292222, 1396697, 1179500, 999559, 877731, 893822, 942452, 926409, 708804, 400298, 538851, 851585, 1014289, 896766, 771068, 584821, 605421, 487664, 402920, 261249, 343511, 371157, 732568, 731849, 570527, 543025, 553539, 464367, 179351, 54367, 381671, 691130, 691053, 637950, 669415, 780807, 624639, 623755, 735903, 620306, 742084, 883667, 812413, 760406, 674908, 814819, 897246, 590451, 669557, 938410, 903715, 813948, 926212, 1177050, 1414398]
18263A414398j04029k66386j11086j00229m8707j84274l6071K66310N5948j85516
18253G00358J08916k19611m8497o7790m12708r2490L12431K79048n5518O006o129
18242E04016P0243J32626k0791k1276l8374q998l612J20821O2451K7822n8909
18231G66019j24103k79582j34338J95269O5379k37233P6201Q5079J27027L4047
18221E73765k09904j94539n3239J97565J63669j09161j26037o4311r4546J24281
18211B07543J51853K32879R9365m1110j8214k38847l44503K09367j60396r5135
18201B802J11092J99748N3943j4477j80254m4251K5898J75808J05991r8885j50242
18190A87173J14086L46922J74186J62600j25673k80626K43904M9679l17192k43722
$$ y = [1414398, 1310369, 1043983, 932897, 832668, 783961, 599687, 563616, 829926, 885874, 700358, 809274, 589663, 541166, 473376, 60668, -31822, 280609, 559657, 504139, 510145, 504016, 574259, 706885, 686094, 664818, 626444, 617446, 613834, 734655, 797106, 824928, 766019, 641916, 362334, 227996, 423265, 488644, 251411, 327612, 412691, 539718, 573765, 363861, 169322, 116083, 313648, 477317, 368156, 242119, 177808, 83262, 207543, 359396, 592275, 691640, 650530, 632316, 393469, 48966, 258333, 97937, 2802, 113894, 313642, 367585, 353108, 172854, 128603, 154501, 330309, 436300, 337415, 187173, 301259, 648181, 822367, 984967, 859294, 578668, 822572, 872251, 555059, 311337]
18180C11337L8655J42691j68440j04837k56850J8626J39624K81506Q1632N6309
18170E40253r7786O950P6344J12302L6704r6837o1962j51954K12636J28293k81812
18159D23131J0701l5846J62906J94467K22139N6708R0274J73505j82335m7099
18149A068551O5419q1234j76579J20858L29136j4645k26852m3194K52808J90456
18139A484724j23226j21069j16579L252Q4811o5964J24200L55780Q8593J96401
18129A910923K29810j43605K42211M47354J81235N54667R69009J047327J236761
18120F675692J343159K140099L221651N305143Q604708J5274964K8955712N0468097
18112A21989225O5683588M9058555J4707206P173285R543821l9866260p8173084
$$ y = [311337, 349992, 492683, 324243, 219406, -37444, -18818, 120806, 402312, 483944, 540253, 442467, 449417, 525761, 638063, 674767, 577930, 515968, 364014, 576650, 704943, 423131, 433832, 397986, 560892, 755359, 977498, 1034206, 1124480, 1297985, 1115650, 1068551, 1133970, 1052736, 876157, 997015, 1326151, 1311506, 1084654, 1041460, 1294268, 1484724, 1361498, 1240429, 1123850, 1127102, 1211913, 1145949, 1270149, 1625929, 1714522, 1910923, 2140733, 1997128, 2239339, 2686693, 2867928, 3422595, 4391604, 5438931, 6675692, 8018851, 10158950, 13380601, 18685744, 27290452, 42565416, 71521128, 121989225, 187672813, 236731368, 251438574, 258611859, 268155680, 228289420, 150116336]
18105A50116336n2064158k6398170j4451380q352988n504057l857364k658406
18098C6829813k303523k480333k424645k062191j695422j534876j423984j536665
18090B1368174j821800j836487j881018k083791k011994j609751j321702p54747
18082H046884m63497n43053m46299n46145m01249r4010l30073n00452j86565j65878
18072D369663j38650J57502k10096l05189j94607j25253L73117P22716J55876
18063D805079K8379n9521j12458M2065J56626J53181k65906j74727j56629k51388
18053D164701m34753k23255r4801k30997o3126j44241l12977j11568J36104k18330
18043B466757j58799j11680J22670k9976j71543o9462Q6235L06823j04416j42482
$$ y = [150116336, 98052178, 71654008, 57202628, 48849640, 43345583, 39488219, 36829813, 34526290, 32045957, 29621312, 27559121, 25863699, 24328823, 22904839, 21368174, 19546374, 17709887, 15828869, 13745078, 11733084, 10123333, 8801631, 8046884, 7583387, 7040334, 6594035, 6047890, 5646641, 5552631, 5222558, 4722106, 4535541, 4369663, 4231013, 4388515, 4178419, 3873230, 3678623, 3553370, 3926487, 4649203, 4805079, 4833458, 4773937, 4661479, 4703544, 4860170, 5013351, 4747445, 4572718, 4416089, 4164701, 3729948, 3506693, 3411892, 3180895, 3117769, 2973528, 2660551, 2548983, 2685087, 2466757, 2307958, 2196278, 2318948, 2288972, 2117429, 2047967, 2134202, 2441025, 2336609, 2194127]
18033B194127j00011o6883M6623K03622M4100j90870l26605J00705L26472P5813
18023B307093k58432J2273r6833j92257j9208q1221J51711M8083p5756K9277R1812
18012A916542J87361M2033L54234J84016J49825Q2757k7509q3061m2716K28279
18002B991761n4757Q5694J15189O3247l6463J93116K56991K64407j4904k20977
17992C643304k03259o9417k31600k70476K0005j11636m62107n36192r6948o04
17982A681070o3003l18688k24347J90341K50965J58774j72042k5953J90398M9562
17972A717077K73397M5079l22754P9015N320P212j60807N1202K2317k2495j91635
17961A502928l97091J77241K38868J86343K12480r6462j11674J023M4889l41087
$$ y = [2194127, 2094116, 2027233, 2073856, 2277478, 2321578, 2130708, 1804103, 1904808, 2231280, 2307093, 2048661, 2060934, 1964101, 1771844, 1752636, 1671415, 1823126, 1871209, 1795453, 1824730, 1916542, 2103903, 2145936, 2500170, 2684186, 2834011, 2916768, 2889259, 2806198, 2763482, 2991761, 2937004, 3022698, 3137887, 3201134, 3164671, 3357787, 3614778, 3879185, 3864281, 3643304, 3440045, 3370628, 3139028, 2868552, 2888557, 2776921, 2314814, 1778622, 1681674, 1681070, 1618067, 1299379, 1075032, 1265373, 1516338, 1675112, 1503070, 1477117, 1667515, 1717077, 1990474, 2035553, 1712799, 1791814, 1797134, 1804346, 1643539, 1694741, 1717058, 1694563, 1502928, 1105837, 1283078, 1521946, 1708289, 1920769, 1824307, 1712633, 1713656, 1758545, 1417458]
17951A417458j07107L68209K82204j03004k02430N5975K46740N1958j23038j15519
17941A771446J4427k3461o138l04066j93470J06283J84022J5109k43950j73284
17931A146918o0793j13845k52508q7174P4909M7482J2959L2809J13948N9070l1696
17920I42079o982J77304J50354j41144l76414l21684p2626L6302K863J47346l7554
17909D99844p883L0668J14106R8257J26954J68371k85069j99266j32647K03463
17899F16798J40590N0133k55236j87654P0259J05194j69064L0631J69069J90114
17889G60834r0452j9006m911m5433j5980m3239o2985j6636r5739K8345m7732r5316
17877B51750N8460K70157R2224j55967j13492k5288k2402q9395J75959m25j97969
$$ y = [1417458, 1310351, 1678560, 1960764, 1857760, 1655330, 1711305, 1958045, 2010003, 1886965, 1771446, 1785873, 1762412, 1756274, 1452208, 1258738, 1365021, 1549043, 1564152, 1320202, 1146918, 1086125, 972280, 719772, 632598, 707507, 754989, 767948, 800757, 914705, 973775, 942079, 935097, 1112401, 1262755, 1121611, 745197, 423513, 350887, 387189, 390052, 537398, 499844, 491961, 522629, 636735, 734992, 861946, 1030317, 745248, 545982, 413335, 616798, 757388, 807521, 552285, 364631, 434890, 540084, 371020, 401651, 570720, 760834, 670382, 651376, 646465, 601032, 585052, 541813, 478828, 462192, 366453, 394798, 347066, 251750, 310210, 580367, 672591, 516624, 403132, 377844, 355442, 266047, 442006, 441581, 243612]
17866B43612q0985J08051q2248M7315J20490J12308K37996l5142j1223j49690
17856E10484j19552j21426N84o412j89154J9554K80448k8800L9939K04205o6261
17845E23609l26977J25372J14905q9940q9629j26770m7153k464k12856n421L01505
17834A64181J73061j39361j98096J55699j75717j30854N2703M404J39313K50439
17824B95772O9116j36526K1802K02413J90285k11882k98383j3230K32011N9277
17814D10655J51633j03908l55390k09374K25772J94913j17070l327j32307j1526
17804E0071J11285J25560q0296J08109Q9730j82596j79588l177J20103J84620
17794C43821k7235J22238j6157j84529k48596N1445K40929l3027J15723K44923
$$ y = [243612, 162627, 270678, 188430, 235745, 356235, 468543, 706539, 671397, 660174, 510484, 390932, 269506, 270090, 263678, 74524, 94078, 374526, 345726, 385665, 589870, 523609, 196632, 322004, 436909, 346969, 257340, 130570, 83417, 80953, -131903, -137324, 164181, 337242, 197881, -215, 155484, -20233, -151087, -98384, -93980, 45333, 295772, 364888, 228362, 250164, 452577, 642862, 430980, 132597, 119367, 351378, 410655, 562288, 458380, 102990, -106384, 119388, 314301, 197231, 193904, 61597, 50071, 161356, 286916, 206620, 314729, 404459, 221863, 42275, 39098, 159201, 343821, 316586, 438824, 422667, 238138, -10458, 40987, 281916, 248889, 364612, 609535]
17784F09535l4587J53510m5331K2941k15078j82235P0873j24531j33714J98976
17774C20359J90477p0191j78747L0343P0205m3036J06964m8634M8788k3898j25310
17763B77320j0801J43741J9496j31797J22030n2851K14595L21777k19552m0326
17753F43632L6008k05158l10859j52270J12933K24309L40321m5595q0470n3444
17743E09407k81523p5217J62924n1359j21414n7090o2129L7567j19301j32337
17733a90472J19853n2097J31360L3990q0361J74488L971n3455J04663R9318J59773
17722D51031Q836M3678m5483j44732k00447K54252M0624k06786m8489J08006m4465
17711B16025j44378O9052J06747L9323J71563o042j5095J02983O4775j1989j36269
$$ y = [609535, 574948, 728458, 683127, 706068, 490990, 308755, 379628, 255097, 121383, 320359, 510836, 440645, 261898, 292241, 362446, 319410, 426374, 377740, 426528, 402630, 277320, 266519, 410260, 429756, 297959, 419989, 367138, 581733, 903510, 683958, 643632, 679640, 474482, 163623, 11353, 124286, 348595, 688916, 643321, 562851, 509407, 227884, 152667, 315591, 264232, 142818, 85728, 23599, 61166, -58135, -190472, -70619, -122716, 8644, 42634, -37727, 136761, 140732, 87277, 191940, 291258, 451031, 459867, 503545, 458062, 313330, 112883, 367135, 407759, 200973, 152484, 260490, 216025, 71647, 140699, 247446, 286769, 458332, 452290, 437195, 540178, 604953, 592964, 456695]
17700D56695l01149r0282j8438J25326L02809N6349j11491L4704R1622J8713l08085
17689B56773k81228j3486J637J65430L29026J22288L5729j17178q7295j94119
17679B17577r5078p6878l7087J89490q5670l90894K6970K01908K88736l0985j96746
17668A1343Q448Q2773J16156R501J82935L5462k42873n3785P2531m5920n4986
17657A21585j58312O6041j7048j2421j66176j20813J94255K77787J42954N4594
17647C82446K0120r7337r0546R7151o7824j36911n0038J34587K69591o5320j94918
17636B01001R3279L02211K0372J43594k5798l46597k33922j22122J98817k1432
17626B09403J2570p8720J2953Q4872o5354j31106j28068J09554J19199K08715
$$ y = [456695, 155546, 65264, 46826, 172152, 474961, 531310, 419819, 454523, 546145, 564858, 256773, -24455, -37941, -36304, 129126, 458152, 580440, 616169, 498991, 411696, 217577, 122499, 45621, 8534, 198024, 112354, -278540, -251570, -49662, 239074, 208089, 11343, 19791, 102564, 218720, 228221, 411156, 446618, 203745, 149960, 222491, 176571, 121585, -36727, 29314, 12266, -155, -166331, -287144, -92889, 184898, 327852, 382446, 402566, 305229, 214683, 311834, 244010, 107099, 57061, 191648, 461239, 395919, 201001, 294280, 596491, 616863, 760457, 734659, 388062, 154140, 32018, 230835, 209403, 221973, 143253, 156206, 241078, 175724, 44618, -83450, 26104, 145303, 354018]
17616C54018P4617Q2026q6447l2378o8644J82549L9663J51322r1251l91742k81765
17605f8032N0018J41450k7514j00427j4978P8754K51509L8280M022J67440k75958
17594B44564q5052J00712J60566p9093j91027j44323J69237l9544j14318R3142
17584A14864J83309r9473k17272o8698j19265K7154J31927K07408j4935N4063
17574A99082R2822r4123J59231J14533N1959l41112l12500j17187K6268J73563
17564d7464o4922o863J1220L134L27857K1251j05013M2397O3670k99983k62394
17553c17110J73430J73000J64659J27583J2579q127n141j30342j5745j7008O958
17542A64736j00915N9413L05705P0077p6715j8652P7307j53483j37412o7071p4995
$$ y = [354018, 428635, 510661, 424214, 391836, 323192, 505741, 545404, 696726, 605475, 213733, -68032, -18014, 123436, 95922, -4505, -19483, 59271, 310780, 349060, 353082, 520522, 244564, 159512, 260224, 420790, 341697, 150670, 6347, 175584, 136040, 21722, 114864, 298173, 198700, -18572, -87270, -206535, -179381, -47454, 159954, 145019, 199082, 291904, 197781, 357012, 471545, 523504, 182392, -130108, -247295, -221027, -47464, -112386, -119249, -108029, -104895, 222962, 244213, 139200, 181597, 245267, -54716, -317110, -143680, 29320, 193979, 321562, 334141, 326014, 320873, 190531, 174786, 157778, 164736, 63821, 123234, 428939, 499016, 422301, 403649, 480956, 327473, 190061, 122990, 47995]
17531D7995J23365J82006r9400n3147Q4981o8812j68972r8827l0902J10553J23259
17520A52099J07381Q4920j67607l60704j5824q285p7336K29704J49097m9082K0953
17509F5316o6303J24850M4403k36975J65863J11309p1602K15275P7462K9248j52380
17498C06466j12380o8033k50841L26323J30792J02018J06425j26179l06150k08156
17488i9715J83800J53419j80316q2182l9286M9017j58481j58442q818J46621K27377
17477C2994J54244J3948M4732r3855j94580J73383J00937o6106j3532M3646J52020
17466C47831k27360j69924q6277J82241j04169J6807P3611j0968J49625P088m3106
17455A35399K40562J22335n8062k0978K2985p7446j28402O8525L72794K07226
$$ y = [47995, 171360, 353366, 253966, 200819, 285800, 216988, 48016, -50811, -81713, 28840, 152099, 259480, 344400, 176793, -183911, -199735, -208020, -285356, -55652, 93445, 44363, 65316, -987, 123863, 168266, -68709, 97154, 208463, 136861, 352136, 429598, 458846, 306466, 194086, 126053, -124788, 201535, 332327, 434345, 540770, 414591, 108441, -99715, 84085, 237504, 57188, -24994, -64280, -15263, -173744, -332186, -341004, -194383, 32994, 187238, 201186, 245918, 152063, -42517, 130866, 231803, 165697, 152165, 195811, 347831, 120471, -49453, -135730, 46511, -57658, -40851, 32760, 21792, 171417, 178505, 135399, 375961, 498296, 440234, 419256, 442241, 364795, 236393, 304918, 677712, 884938]
17445H84938K13261K71424K72915K45933j73900m59211n15782k34293l87214j61207
17435d3136l14488J80597L02344n5371j30893K08695K62460J42675K6865J20490
17425G00238R5617j34144n4545l13106N9940J76797j73957Q1115m1585k40724
17415A55646K70860J90285j72929k96920j21080k9047M13856L3292j04335r4127
17405B45501j73011K54974j67415k48631j1196J39546L9655J81825j56618L5596
17395A40226J36102M0362N8687J5885K39441l194k23435k15874r2804J65320j0790
17384B49926j9213N0558Q6785n5461J3434N6669k04701j30811J36874P2972K5430
17373B82462k10022p8789k22878Q6170K31049k2136J6351J82365n6984j91966
$$ y = [884938, 1098199, 1369623, 1642538, 1888471, 1714571, 1255360, 739578, 505285, 118071, -43136, -357624, -177027, 125317, 69946, -60947, 147748, 410208, 552883, 579748, 700238, 795855, 661711, 607166, 294060, 354000, 530797, 356840, 437955, 396370, 155646, 426506, 616791, 443862, 146942, 25862, -3185, 410671, 443963, 339628, 245501, 72490, 327464, 160049, -88582, -99778, 39768, 79423, 261248, 104630, 140226, 276328, 316690, 375377, 391262, 630703, 627509, 404074, 188200, 95396, 260716, 249926, 230713, 281271, 368056, 312595, 326029, 382698, 177997, 47186, 184060, 257032, 282462, 72440, -6349, -229227, -143057, 87992, 65856, 82207, 264572, 207588, 15622]
17363A5622j19148J67929K15084j65840k2000J37582O955L9268j8206J8024J1237
17352B86507j11766k45061k76833J62652J92447L1384r4295j43740R2230o97j49717
17341b56889k6437J0651J06503K7128J53528K6053J50590L5932J71874K6291l60791
17330F4433j92895O94K15613n0487o4586j08027J24919R701K47896n761k60985
17319a9485n210J50389J1787R2512J23685M1105l5258l657l9980k61150j55314
17308a00576K79521J93621J6693k68304j56218J20482K06369J45508L08q3222
17298C54182j06690j35504j31929J0375N218M38042K05933o258k95390j32157
17288B05822r194k0517j12060r7291k2615K4939O5991J11103J8369O1605J4840
$$ y = [15622, -103526, 64403, 279487, 113647, 91647, 229229, 236184, 275452, 257246, 275270, 286507, 174741, -70320, -347153, -184501, 7946, 39330, -54965, -198705, -106475, -107172, -256889, -283326, -272675, -166172, -139044, 14484, 40537, 191127, 227059, 398933, 425224, 64433, -128462, -127768, 87845, 37358, -27228, -135255, -10336, -635, 247261, 241500, -19485, -24695, 125694, 137481, 229993, 353678, 394783, 359525, 355868, 315888, 54738, -100576, 178945, 372566, 389259, 120955, -35263, 85219, 291588, 437096, 437404, 354182, 247492, 111988, -19941, -9566, -4348, 433694, 639627, 633369, 337979, 205822, 196628, 176111, 64051, -33240, -55855, -30916, 35075, 146178, 164547, 226152, 240992]
17277B40992j00431J67994K3137k20588n9888K55239J40072M5951k03028j90268
17267I9182k15529p3126J93838M6790J18886J11167j6931m0961P1735j56602j12310
17256B6139q949M9246N4507P7141k3269p0787p5700Q001L1560J72802R90j0613
17244B31068j38991r2187J6696j09148J13944j05703q9848K08185J64743j66975
17234C1784q2180K4177K02947J4014k01059j1736J75287L6418j11693k78235j50335
17223c50611m2750J19556K89804N7987o6326p3048K64106Q9752o6273j51247k52300
17212a81350J5654Q3072J32797J79024N1136L058m8987J31143o9853L1913J5019
17201C42626j82994m3109m30k03948r0070J24008L6709J53431J30315p0165k08668
$$ y = [240992, 140561, 308555, 331692, 111104, 51216, 306455, 446527, 492478, 289450, 99182, -116347, -189473, 4365, 51155, 170041, 281208, 264277, 223316, 295051, 138449, 26139, 17190, 66436, 120943, 198084, 174815, 104028, 28328, 36329, 67889, 240691, 241681, 231068, 92077, -110, 16586, -92562, 21382, -84321, -174169, 34016, 198759, 31784, -50396, -26219, 176728, 190742, -10317, -22053, 153234, 189652, 77959, -200276, -350611, -393361, -273805, 15999, 73986, 7660, -65388, 198718, 288470, 222197, 70950, -181350, -165696, -82624, 50173, 229197, 280333, 283391, 234404, 365547, 295694, 327607, 342626, 159632, 116523, 116093, -87855, -177925, -53917, -17208, 136223, 266538, 196373, -12295]
17190a2295o2525J57682O2395P1299K06006K5855k18654j59549Q8698J85315J92391
17179E36618j66331j9166J5913J25296l03044k75594J13118L52883J55734j93363
17169C42064j21527M155l4409r1547k9553M5726K26232R1205k13328k6015j42086
17158E0917R344J06435j43055J03255O8845K2677m5326J35200J61386M3106p0957
17147D41827j14958P8987p231k23984j86126j05423J63514P967q2779P7857N9989
17136A09640j32633k28470J01624J77607j3683o0788K12200R8877J9550L0151
17126C14075L9925j38861j19537j48417O3807J65035r9950p34L8356k5789k54471
17115a66561N7497N7721q9474L1745K43882R9864j44448L6383m9314l0812k0155
$$ y = [-12295, -74820, 82862, 145257, 216556, 422562, 448417, 229763, 70214, 158912, 344227, 536618, 370287, 351121, 367034, 492330, 189286, -86308, 26810, 379693, 535427, 342064, 220537, 224692, 190283, 98736, 69183, 114909, 341141, 432346, 219018, 193003, 50917, 60261, 166696, 23641, 126896, 195741, 218418, 173092, 308292, 469678, 512784, 441827, 326869, 405856, 398625, 174641, -11485, -116908, 46606, 54573, -28206, 49651, 109640, -22993, -251463, -149839, 27768, 14085, -46703, 165497, 264374, 283924, 314075, 354000, 215139, 95602, -52815, 10992, 176027, 76077, 75343, 113699, 87910, -166561, -109064, -51343, -140817, -109072, 134810, 234674, 90226, 126609, 77295, 46483, 26328]
17104B6328J36309q3793j04846J8117K943K34873J23585q9190j58422k6662P7841
17093A57083J68056O4960r3407j25778k28083k39045J52444J61881J79012p2946
17083A24177K02544J29569r2195m4358Q09M7948J95133j32007l7517n6360k14607
17072A23136L8782j5586J9611J73325L100P4206N7499j77928j33818k1565R5727
17061B36489J6309j07439q3459k56018k15488j5755J56245L65426J61054J47915
17051D05279O3858o5502k8446k12343J99105Q4860k43400K4916K5421j38084p0084
17040D5580j11615j79321P0758R4503K76018J87165j09019j14271j23280R842
17030D6360J69723m3524Q7671j00859O7060k5090r6489j24540P3103J16325O4407
$$ y = [26328, 162637, 78844, -26002, -7885, -4942, 229931, 353516, 264326, 105904, 79242, 157083, 325139, 390099, 296692, 170914, -57169, -296214, -143770, 18111, 197123, 124177, 326721, 456290, 364095, 319737, 320546, 368494, 563627, 431620, 394103, 337743, 123136, 161918, 146332, 165943, 339268, 342368, 416574, 474073, 296145, 162327, 140762, 236489, 252798, 145359, 61900, -194118, -409606, -425361, -269116, 96310, 257364, 405279, 469137, 403635, 375189, 162846, 361951, 446811, 203411, 228327, 253748, 115664, 45580, -66035, -245356, -174598, -80095, 195923, 383088, 274069, 159798, 36518, 46360, 216083, 172559, 260230, 159371, 226431, 201341, 104852, -19688, 53415, 169740, 234147]
17019B34147m7820r4970q3163J62484P3998l12702j5578P1738L5879J40095j44548
17008A9560J5683K0363P1772P074P6362K27710j90155r8292k27001Q7378J41541
16997A51995M3264J5649J4754j46915R2702J22110J6640j47119J12403P3003j627
16986C46859k26015j19538j16627K2360J03660q5312n28N610l1954j99542k30445
16975e31472L75007L54139J06668R9244q6099P6592j91767r3848o5360j84273
16965a41169J23141J64039J12215K51961K5447q6914p0313m8365j87115n9929
16955H2998K2041q5218o8784k05749L6364K03450L47034Q0181j68212j5153J20203
16944C49155q3624P634l6242k17486J13022q3869j13013j23378j23775j42960
$$ y = [234147, 186327, 91357, 8194, 170678, 244676, -68026, -83604, -11866, 24013, 164108, 19560, 35243, 55606, 127378, 134452, 210814, 438524, 248369, 150077, -76924, 10454, 151995, 195259, 210908, 225662, 78747, 171449, 293559, 310199, 163080, 275483, 348486, 346859, 120844, 1306, -115321, -92961, 10699, -74613, -75141, -69531, -101485, -301027, -531472, -156465, 197674, 304342, 403586, 317487, 394079, 202312, 108464, 43104, -141169, -18028, 146011, 258226, 510187, 535634, 448720, 378407, 330042, 142927, 82998, 105039, 19821, -48963, -254712, -218348, -14898, 332136, 412317, 244105, 228952, 349155, 265531, 273165, 236923, 19437, 132459, 48590, -64423, -187801, -311576, -454536]
16934d54536P2134K07574J87377K52270n901k25028o9356M9985K51320j9293j82346
16923F4200J22522k3299M8043j64568j72746K04772J69035J26441J3236j13650
16913B73986J51366L3768k05539j63081K14602K77922l02423k56759Q6326l9589
16903G0579j30685J72765n8877k41094k7947J18214K76472j97294j64988O4189
16893a18666M07858J40005m55858j56541M8644j16968q1833J0154K88332J03019
16883F8146J14050j80469j88784J50085R5542j15570M3985J17288l530j74908
16873g4165j28755J24531m2123L3879N3950m3909N1569R1442N1044o5175N3726
16862A06014n5988q4739k40070p7548L0238J9306p5887j269r9733k2624K58830
$$ y = [-454536, -382402, -174828, 12549, 264819, 258918, 33890, -35466, 14519, 265839, 246546, 64200, 186722, 163423, 211466, 46898, -125848, 78924, 247959, 374400, 387636, 273986, 425352, 459120, 253581, 90500, 305102, 583024, 280601, 23842, 110168, 70579, -60106, 112659, 53782, -187312, -215259, -97045, 179427, -17867, -182855, -118666, 289192, 429197, -26661, -183202, -134558, -251526, -333359, -323205, -34873, 68146, 182196, 1727, -187057, -36972, 58570, -57000, -13015, 104273, 100743, -74165, -202920, -78389, -120512, -86633, -32683, -76592, -25023, 66419, 117463, 52288, 106014, 50026, -34713, -274783, -352331, -322093, -302787, -378674, -379943, -479676, -502300, -243470]
16851b43470N5432M2667P9910n595k42819o4490r8022J6949Q7873j85188K13649
16840c43104L41799n5807j27253N5715K4756J41514R5256j70304j83800O3563
16830a57665K1598M3464J64038P0550R4669N1464j20850L0389J07836R6711J18395
16819E20599n3569j57909p8759l7755j98407r0391L20835P8704j17814N5660j63636
16808G7558j96409J63122M601j52573K83361R0068J2556j46389j59774J8715J18647
16797A13483j82780j95991m4643J52404P8638J02427r314o1226j77918N1068J699
16786a72153n6067K43556K44791o4659l18718O1663M4667k53240O4251n6732N3807
16775b08834n295J07193n3291R070J66043J17544J10765j0782k446J2961Q4679
$$ y = [-243470, -188038, -145371, -65461, -71056, -313875, -378365, -476387, -459438, -371565, -556753, -343104, -1305, -57112, -184365, -128650, -103894, 37620, 132876, -37428, -221228, -157665, -136067, -92603, 71435, 141985, 236654, 288118, 167268, 197657, 305493, 402204, 520599, 467030, 309121, 230362, 192607, -5800, -96191, 224644, 303348, 185534, 241194, 77558, -118851, 44271, 48872, -103701, 179660, 269728, 282284, 135895, -23879, -5164, 113483, -69297, -265288, -309931, -157527, -78889, 23538, 14224, -47002, -224920, -173852, -172153, -228220, 15336, 260127, 195468, -123250, -61587, -16920, -270160, -205909, -262641, -208834, -214129, -106936, -160227, -151157, 14886, 132430, 243195, 232413, 229967, 242928, 327607]
16764C27607k6892J3448k1111j2139n0127j60689k666K60957k6572j47076j02951
16753E1789j4571J73954K40383j18566j75885p2051l8883p7330J58054j28443
16743a549j86930P7411J32116K17214P5584l1078j70444K0733m9642r3536Q1087
16732G0966Q3426k0604n1400k78149J4994n5427N2234O7071k902j24160n6685
16721c00636j6826Q6938R3668P046K92493R2879j86943r2789j66580M2085J28836
16710a9829j2070j80230K5572K2179J02055J28155P3479q1217j84584k66023K26621
16699a65892L00371J77353N2766k46823j02598j5629J52220O92k0029P1076K83955
16688D87462n8392j73025j00360k04873j66543Q9018n9269R3051l8606l8301K81219
$$ y = [327607, 300715, 314163, 293052, 280913, 230786, 70097, 67431, 328388, 301816, 154740, 51789, 37218, 211172, 451555, 332989, 157104, 85053, 46170, -31160, 126894, -1549, -188479, -111068, 21048, 238262, 313846, 282768, 112324, 133057, 83415, -10121, 70966, 154392, 133788, 82388, -195761, -180767, -236194, -183960, -116889, -119791, -243951, -300636, -317462, -230524, -136856, -129810, 162683, 255562, 68619, -24170, -190750, -148665, -19829, -31899, -212129, -186557, -164378, -62323, 65832, 139311, 58094, -126490, -392513, -165892, 134479, 311832, 364598, 117775, 15177, -452, 151768, 152460, 132431, 203507, 487462, 429070, 256045, 155685, -49188, -215731, -126713, -185982, -92931, -131537, -169838, 111381]
16677A11381K78399p3113o7773l23043j68755M262Q3270N7716K38613J33514n7069
16666B17402k1302m5466N0793O6334J13401J01913j52875k47307q5204J66299
16656A63988K23620j92765k28612P3855q5132J31943m5034J895l6248J42331J16277
16645B66118J9262m9560N708K256k0011k89409m521J17563r9027K5953J41424
16634A15756J95648J32437l79258k87234J02413J06372J37098L2777J62107l8189
16624B79927j24242j3448l40046J18874j45429q7266P4887J24290J50633Q7831
16614A26011k041M9357J49457r0194k01r0874m3938j73732p4789R3612r6229K772
16602a50789k7741Q5954J60212K2692o330j46348k33250J41112J00252q8033l11614
$$ y = [111381, 389780, 316667, 248894, -74149, -242904, -238642, -155372, -97656, 140957, 274471, 217402, 196100, 150634, 201427, 267761, 381162, 483075, 330200, 82893, -2311, 163988, 387608, 194843, -33769, 40086, -45046, 86897, 41863, 43758, 7510, 149841, 266118, 285380, 235820, 241528, 243784, 223773, -65636, -70157, 47406, -51621, -25668, 115756, 311404, 443841, 64583, -222651, -120238, -13866, 123232, 156009, 318116, 279927, 155685, 142237, -197809, -78935, -224364, -311630, -236743, -112453, 38180, 126011, 123970, 173327, 322784, 232590, 232389, 141515, 97577, -76155, -150944, -57332, -153561, -150789, -178530, -92576, 67636, 90328, 83998, -62350, -295600, -154488, -54236, -142269, -453883]
16591d53883R3112L49778L10871J15513o2521J8035k28017j74368k7191J13224
16581E4553j12535j04680j7478j32108j37307K8873J28643K55007J10936j59647
16571h5743L2531q4390j83086L3343Q5933k4306J09799O5464j28744P3275j0212
16560a16136j63810k00165L7296J30086K25869J503J9511K62763J89657j44347
16550B42227j57104J89556N6606n1784k43457j50908k07251l68394P1892J85819
16540d32798J85549L6576N303L3199R3680N9312J19217p2224M1446J9820j24709
16529c5629N8641j74067q9426L12219J0299k40762j43839J68459J30993J00694
16519I7582o8401r506J09239j16661O2553j3477O111J62130k11056j82975J32215
$$ y = [-453883, -360771, -10993, 299878, 415391, 352870, 370905, 142888, -31480, -58671, 54553, -57982, -162662, -180140, -312248, -449555, -420682, -292039, -37032, 73904, -85743, -53212, -137602, -320688, -287345, -201412, -225718, -115919, -50455, -179199, -105924, -116136, -279946, -480111, -442815, -312729, -86860, -85357, -65846, 196917, 386574, 242227, 85123, 274679, 331285, 279501, 36044, -114864, -322115, -690509, -618617, -432798, -247249, -210673, -205370, -172171, -78491, -19179, 100038, 27814, 69260, 89080, -35629, 23012, -151055, -240481, 71738, 82037, -158725, -302564, -134105, -3112, 97582, 29181, 19675, 128914, 12253, 74806, 61329, 67440, 229570, 18514, -164461, -32246]
16508c2246Q273o0286j2412K10475J03985k63699n4360J59316J30560k82321j13674
16497b06389J57858J21974O8283j47952J05062q9547l7604K88151L5086j25433
16487A69489k16372J1416O0781j11888J15637q3084j1201j53198l0232Q9804j14202
16476b73050J1258Q8068J93238K23873R5387N8962m3024j33896k21233P4419K58062
16465C32064p6093p6068J68089q6928L1768k67233k24397J29407n4749J0361J8826
16454i4953K5551j32962K0992j38572k06863K52656K50654m6122R9828j39054
16444a08845l0781K05407o5714j36774J58709R8220n6622K22812l3332j29425
16434A23655j56234j19412J42710J37459o8891k47955O7439L1765K14980J48518
$$ y = [-32246, -23973, -84259, -96671, 113804, 217789, -45910, -100270, 59046, 189606, -92715, -206389, -48531, 73443, 141726, -6226, 98836, 9289, -28315, 259836, 294922, 169489, -46883, -35467, 25314, -86574, 29063, -54021, -65222, -218420, -248652, -158848, -273050, -261792, -173724, 19514, 243387, 338774, 397736, 354712, 220816, -417, 74002, 332064, 255971, 179903, 347992, 261064, 292832, 25599, -198798, -69391, -124140, -113779, -94953, -69402, -202364, -181372, -319944, -526807, -274151, -23497, -69619, 30209, -108845, -139626, 65781, 67, -136707, 22002, 120222, 63600, 286412, 253080, 123655, -32579, -151991, -9281, 128178, 59287, -188668, -121229, -89464, 125516, 274034]
16424B74034k30212k29373J78126r0084p7043J15478Q2764J9465j59043j50617
16414b66505j54136N6513K7189J81094K84315L1348m65211j04441K32916P4114
16404a02804K1573J91474J12175j21817p3061j9603k60901o5451l6711p6815k8144
16393d60085J3338J20457J30632J58361N7416p2176O662J7908J11031q6052M9978
16382D7470J10578O8576j13838j75727Q3343J64728j90895N266j52209M2283K01128
16371I0703n3310l42596P2134K73379p0169k48096j62607K3173J62250J78056
16361g7083K40376l3852k23234J55572J46349Q3804j56670j40446P3766q5763
16351a7181J9948J68125N989o6861j17445r6621m9272L0622M631J41562Q0523
$$ y = [274034, 43822, -185551, -7425, -97509, -174552, -59074, 23690, 43155, -115888, -266505, -420641, -364128, -336939, -155845, 128470, 159818, -305393, -409834, -176918, -102804, -81231, 110243, 222418, 100601, 27540, 7937, -252964, -318415, -355126, -431941, -460085, -446747, -326290, -195658, -37297, 20119, -52057, -45395, -27487, 83544, -2508, 47470, 158048, 226624, 112786, -62941, 20402, 185130, -5765, -499, -152708, -110425, 90703, 37393, -305203, -233069, 40310, -29859, -277955, -440562, -417389, -255139, -77083, 163293, 129441, -93793, 61779, 208128, 291932, 135262, -5184, 68582, -17181, 2767, 170892, 176881, 110020, -7425, -104046, -153318, -122696, -118065, 23497, 104020]
16340A04020j35035j51338J55600K5695n8129K27564n4800K46917L486m79p3830
16329B89671R2529n7394j44661j89221j32414q0279O901N4468Q6381J52751j20109
16318d1377m558j26444R1705K4775K41181k5895m2358J49364j18672j84653m3830
16307h0762J24832J68339M7117l3319O1919j79444m34521M2216j05925m3285K18631
16296b14202O7862j35060Q9622K22872J51872J51183L0215p1687j02867J69731
16286C59541j9624j92331k59851k15074k5119J25262L4979J81600k7406J0526
16276b7497K31041K74335j81344j83165j16777J1257J46814J51145j0680q5336
16266B09793j17495k45666j06552P5387J39334J58840P4316N8132k0660J4705
$$ y = [104020, -31015, -182353, -26753, -1058, -59187, 168377, 113577, 360494, 363980, 363501, 289671, 382200, 324806, 180145, -9076, -141490, -221769, -214868, -160400, -74019, 78732, -41377, -45935, -172379, -80674, -55899, 185282, 159387, 117029, 266393, 147721, -36932, -80762, 44070, 212409, 259526, 226207, 288126, 108682, -325839, -283623, -389548, -432833, -214202, -146340, -281400, -191778, 31094, 182966, 334149, 364364, 292677, 189810, 359541, 339917, 147586, -112265, -327339, -352458, -227196, -192217, -10617, -38023, -27497, 203544, 477879, 296535, 113370, -3407, 7850, 154664, 305809, 295129, 209793, 92298, -153368, -259920, -184533, -45199, 113641, 187957, 246089, 225429, 240134]
16256B40134J48128J9011q1907k21870k62479j69326K09873J80487J088j17274
16246e4135N4368P6783l070j00118m7028R5048k30288k38654N5474J83661K58005
16235E0046j33665j16925J44695J38604K42427O7074n1921m19933j70498l3546
16225b83642P850j30701J14943L2403J9138k33184K6944M05718R9435j4102J27746
16214A72548j48639k48157J48457k644M9673L3519k49094k4856j01371q128n0902
16203d29594J99828J13614O5967r5148p3301O3186R0075P6919J1421r410j24591
16192a11034j63750J51417P1787o2898K30504K7266k08770N950j44680j38651
16182c42859M6643J50367q1911p4764j8353L9928J90183M3021k1463l639o9912
$$ y = [240134, 388262, 407273, 325366, 103496, -158983, -328309, -118436, 62051, 63139, -54135, 233, 77016, 73946, -26172, -73200, 21848, -208440, -447094, -391620, -207959, 50046, -83619, -200544, -55849, 82755, 325182, 392256, 340335, -79598, -250096, -283642, -275792, -406493, -291550, -259147, -240009, -473193, -446249, -40531, 58904, 44802, 172548, 23909, -224248, -75791, -78435, -28762, 4757, -244337, -269193, -370564, -378692, -429594, -229766, -116152, -50185, -145333, -218634, -155448, -65373, 11546, 22967, 13557, -111034, -274784, -123367, -51580, -114478, 116026, 143292, -65478, -59528, -204208, -342859, -296216, -145849, -227760, -302524, -320877, -280949, -90766, -47745, -69208, -72847, -142759]
16171a42759J28809J78905j83608j29417j34994p9637N8395R8771o6448j7256
16161b89239R2638j222m5856R6836p7181k33698r9262O0909J5917J38711J10759
16150b30688m5878J24555J81135q8074j58131o8139J8693r6179L3779K09466J92393
16139G2932p8122J20274n1870j42864n5704P9549l5026r8625K63493L40319p282
16128D07074k94155m41523o098J91961P4280N705l0809J16964k7568j49043R7208
16117e6004J77307n8364l06027K0136K25951R7971k17240j28728J54503R4093
16107C598J19066r0052l51091K66464m679j27124l7089J41694J38405J65644m1428
16096A83408n422K08408N9385M9147r387j32407j64364M8211n8862j78258J2606
$$ y = [-142759, -13950, 164955, -18653, -148070, -283064, -362701, -304306, -205535, -271983, -289239, -196601, -197823, -243679, -146843, -224024, -457722, -556984, -496075, -480158, -341447, -230688, -276566, -152011, 29124, -58950, -217081, -285220, -266527, -362706, -328927, -119461, 72932, -5190, 115084, 63214, -79650, -135354, -55805, -90831, -189456, 74037, 414356, 407074, 112919, -328604, -334702, -142741, -68461, -62756, -93565, 23399, -4169, -153212, -56004, 121303, 62939, -243088, -222952, 2999, 100970, -116270, -244998, -90495, 3598, 122664, 32612, -318479, -52015, -56694, -183818, -220907, -79213, 59192, 224836, 183408, 177986, 386394, 445779, 494926, 485539, 353132, 188768, 236979, 178117, -141, 12465]
16085A2465K0508j54527j1558O7518R823p9886K46820o674n0748J1078j03659
16074c8840j09076j15639L8796J97913O6480J0433N5259j49278j85856j20561
16064c50369N9714L56115j08713j47871K53085J15480k20468R3437L1562o6842
16054A5130m3051o5014J94064j9699j43996N4613r1093k33042M9800L15671K94101
16043C27484j7508r8568J3612j71979j12184j07454o9004K36700R2596m1758k83305
16032b31368j75369R378L9729L01806n1287j70414k06343K9216K52672K4892K93992
16021A16904J09218k74479j69019L31711k1767p1993j612o1319P8037R3425J3875
16010A42981k72058O765J71926j04574q8197j65341p5152M0061L1564K20622J04331
$$ y = [12465, 32973, -121554, -133112, -65594, -55771, -135657, 111163, 104489, 53741, 64819, -38840, -147916, -263555, -224759, -26846, 39634, 50067, 105326, -43952, -229808, -350369, -290655, 65460, -43253, -191124, 61961, 177441, -43027, 50410, 81972, 15130, -27921, -92935, 101129, 81430, -62566, -7953, -99046, -332088, -282288, 33383, 327484, 309976, 211408, 225020, 53041, -59143, -166597, -235601, 1099, 93695, 51937, -231368, -406737, -397359, -357630, -55824, -107111, -277525, -483868, -454652, -201980, -177088, 116904, 226122, -48357, -217376, 114335, 92568, 20575, 18963, -42356, 35681, 129106, 142981, -129077, -122312, 49614, -54960, -143157, -308498, -383650, -343589, -312025, -91403, 12928]
15999A2928K3945J9061j56010l9659p4771k6455J22864j11846Q2118K01286l2227
15988B1234j91221j20964j4469j67954m4191J83002L52378M01287n011j15388
15978B98703J9731K14173j12157k11397p7024R0656j10782k7686q1192q5566k07361
15967b89902J93255J07193J01230J6533L4140j0689k2836q2311K4950n6080J25909
15956A41392J32104k23573n8885l8462O0145p6187P0845J21292o5325k11433R3221
15945e4866m9935K5465m2663Q378j18822j11267j13996j3242l1644J93465J31944
15934a77183J17887J46853j90026K6188j5289J64706j73108J6955Q638J66192
15924I1813j37414k98701L33382K47423j03365Q793j09621j36354K15933K5281
$$ y = [12928, 36873, 55934, -100076, -139735, -214506, -240961, -118097, -229943, -147825, 53461, 21234, -169987, -290951, -305420, -473374, -517565, -334563, 17815, 419102, 414091, 298703, 318434, 532607, 420450, 209053, 132029, 222685, 111903, 84217, 3025, -82541, -289902, -96647, 10546, 111776, 128309, 162449, 151760, 128924, 46613, 71563, 15483, 141392, 273496, 49923, -8962, -47424, 12721, -63466, 7379, 128671, 63346, -148087, -54866, -104801, -79336, -121999, -113621, -232443, -343710, -457706, -470948, -502592, -309127, -177183, -59296, 87557, -102469, -76281, -91570, 73136, -99972, -83017, -74379, 91813, -45601, -344302, -10920, 236503, 133138, 141931, 32310, -104044, 111889, 137170]
15914A37170k60191r8726J54092J72829j56173J3676J77161j55169j39547m0132
15904a95010j52797L0221J59067L15873k35186j08746J18740r1123j05672o8732
15894c33365J10551J53963O5744p265L630j39053J03055j31098q8351K8677O0510
15883a73002M5606K25925J56802L412L3102N748m7688n2355k0613o4377K3287
15872A35847j63539J56309J03186n5723j40727l45861l1567J44347j64140j06765
15862d68633k6714J89191J11482N6236J77307m7164j48810k18915M1010Q9614
15852b45396L2388R9834M15934J28273M1651j19107p2885q1551Q7188q8683n2626
15841A45020l8020J11036j8562P606J46094J3018j3248q3957q9403j7741M6539
$$ y = [137170, -123021, -221747, -67655, 105174, -50999, -37323, 139838, -15331, -154878, -195010, -347807, -317586, -158519, 157354, -77832, -186578, -67838, -158961, -264633, -333365, -222814, -68851, -3107, -10372, -6742, -145795, -42740, -173838, -262189, -233512, -173002, -127396, 98529, 255331, 258743, 291845, 297593, 249905, 197550, 176937, 112560, 135847, -27692, 128617, 231803, 176080, 35353, -310508, -342075, -197728, -361868, -468633, -495347, -306156, -194674, -138438, 38869, -8295, -157105, -376020, -335010, -245396, -213008, -113174, 302760, 431033, 472684, 353577, 280692, 199141, 286329, 197646, 145020, 107000, 218036, 199474, 207080, 353174, 366192, 352944, 268987, 179584, 161843, 208382]
15830B08382q2093n0568j52171j33469N1146Q815O8547r3437j21945J54685J24714
15819a7394M1733Q1868o7290o5665P3017J57977p2520l52290k77534J8422L80298
15808i9378K90110k6802n9273Q1331J70695l03147j96295O3683Q9664R4759m8624
15797E6723J44225n4981q8259l2283o3222J68873J83845r4319j5335j12893J63454
15786B55828Q3845j1873k73171l44810K77576K34845p8327q4268r177N0936K05918
15775C07322N9637k22775j11560j97421r6280J2787N9348k944K0947L4301Q9445
15764d7193K1192j47507J56213k1488K6295p6362o9165K02070J95753m6968l51375
15753a58535k47060J72348J14183j00751L1323n1734J71653L1076m0048j77331
$$ y = [208382, 126289, 75721, -76450, -209919, -158773, -149958, -81411, -174848, -296793, -142108, -17394, 24339, 106207, 38917, -26748, 46269, 204246, 131726, -220564, -498098, -479676, -99378, 190732, 163930, 104657, 185988, 356683, 53536, -142759, -79076, 10588, 105347, 56723, 200948, 145967, 57708, 25425, -37797, 131076, 314921, 220602, 205267, 92374, 255828, 339673, 327800, 54629, -290181, -12605, 222240, 143913, 59645, 50468, 101404, 307322, 366959, 144184, 32624, -164797, -261077, -248290, -188942, -191886, -170939, -136638, -47193, -26001, -173508, -17295, -38783, -12488, -88850, -158015, 44055, 239808, 192840, -158535, -405595, -233247, -119064, -219815, -188492, -240226, -68573, -37497, -77545, -254876]
15743b54876k0389R440l3983j85603J03184K01387O8492O1970j0919r1807J35209
15732a7895J35167K24447K53684k08333o3709j58389r8641P8773N6298j17398
15722H4004j10447J60418k95135o1307J36238O6663j07829K38308J50563n4260
15712B07216l6121j90669J57988j9832Q0911J39067q3307R6507p2332k36327K9278
15701G2379J81439j06092K8398r5992j81981J7832J4570q1868J1697J8699K82667
15690A61748J16492M680k015M9463q7689l4646l1830n513O1842p5907j29870n721
15678B1034j08547j32140k34243J53607K3624N6179o718O445J37772q9377N68
15667a71796M5529J21086r5485l083O7128j8322R5728Q5793K49071R2154j62642
$$ y = [-254876, -275265, -265825, -299808, -485411, -382227, -180840, -112348, -50378, -61297, -153104, -17895, 117272, 341719, 595403, 387070, 323361, 164972, 66331, 145104, 201402, 84004, -26443, 133975, -161160, -222467, -86229, -19566, -127395, 110913, 261476, 207216, 171095, -19574, 138414, 118582, 199493, 338560, 255253, 351760, 279428, 43101, 72379, 253818, 147726, 176124, 80132, -101849, -84017, -69447, -151315, -139618, -120919, 161748, 278240, 282920, 280905, 330368, 242679, 208033, 176203, 170690, 232532, 156625, 26755, 21034, -87513, -219653, -453896, -300289, -276665, -220486, -227204, -220759, -82987, -172364, -171796, -126267, -5181, -100666, -103749, -36621, -54943, 40785, 126578, 375649, 467803, 305161]
15656C05161j38862P536k7942j13482j31261J33737R5396n5263j53235k54413
15646c32628J02075K18650j1379k92955k5046k04107L7107L67451O1865L2972
15636d5995m6477Q5493J08901Q8835k27498k83819k1128K32142j23166m6229P8654
15625b00287k0661j39521P0609M30060J81897p6166P4782N0358j77555P3411P7087
15614C44014k20575l4126P9731n3719j5178O0921p8244K4245k48717j17662k9784
15603b89094q6849J50084J79550J7417K03813R8056j11276J2980k4972j55926
15593f217J91168N6779j88709M4420n1964l6374m813r0006L5669j92836R0284
15582a52599R8586J31533K33127J23443k706q4995j44046o2375p3558r2193j00193
$$ y = [305161, 166299, 173835, 145893, 32411, -98850, 34887, 130283, 75020, -78215, -332628, -230553, -11903, -23282, -316237, -341283, -545390, -508283, -140832, -78967, -45995, -92472, -6979, 101922, 190757, -36741, -320560, -341688, -109546, -232712, -278941, -200287, -220948, -360469, -289860, 140200, 322097, 245931, 320713, 371071, 193516, 266927, 344014, 123439, 89313, 169044, 115325, 100147, 161068, 82824, 107069, -141648, -259310, -289094, -375943, -225859, -46309, -28892, 174921, 272977, 161701, 174681, 149709, -6217, 184951, 241730, 53021, 97441, 45477, 9103, 4290, -85716, -50047, -242883, -152599, -54013, 77520, 310647, 434090, 431384, 346389, 202343, 139968, 66410, -25783, -125976]
15571a25976Q1473K73130j12048l5342j97499N3663l5227j69882J18605J73666
15561B4563K05020J30902j63163J4839J67283o3983k24731m4518j44898n4341
15551a53027K04713K00284J28224J0533k10148k81628Q6953M04680m8057j49138
15541A93389P8932P4978J04136Q3699l9433k40516r0343o7933k05462r3261J71043
15530c0771J33721k18875j94615l0054p1128P2681J64107J21692q9914J30676
15520a2480K20377R412q9286r4377J19094K10424Q5521o3931r6362k89227l31984
15509c32819N6135J1557P8868K0932L1024r0759l1622J0875K59480J50736m8983
15498A15424K5655q5694m0335m0639k9061j01051k14986M0707M0485K29935K46812
$$ y = [-125976, -44503, 228627, 116579, 81237, -116262, -62599, -97826, -267708, -149103, 24563, 229583, 360485, 197322, 212161, 379444, 315461, 90730, 46212, -98686, -153027, 51686, 251970, 380194, 390727, 180579, -101049, -14096, 390584, 342527, 193389, 272321, 347299, 451435, 535134, 495701, 255185, 164842, 96909, -108553, -201814, -30771, 102950, -115925, -310540, -340594, -411722, -339041, -174934, -53242, -143156, -12480, 207897, 217309, 128023, 33646, 152740, 363164, 448685, 384754, 288392, -835, -332819, -276684, -265127, -186259, -165327, -134303, -225062, -256684, -245809, 13671, 164407, 115424, 141079, 55385, 15050, -25589, -54650, -155701, -370687, -329980, -289495, -59560, 187252]
15487A87252q9071j48896j91796R1126J36042O2445n9635k05732j77915J01281
15477b94899J2924K0378J16244r3100O7645q5197r4449j02152R6340Q387o7117
15466d14996K16796L734j02957K42738L07207k56712k06095L27095J21716N8455
15456B96981n4830k46411j41194Q3539j62932j12198J82721j06218j82721K52623
15446a90640K48058K50536J01042j83440M0372L9759j17255k07761m5118M0146
15436b4301m9627r0500M4658Q2054m9836l07288o6595J83869o7573J82568L34687
15425A72116Q6291j16308k05316J14062J7294O8943J02244j38984k522j16139
15415a8319l4541m5192J4640J29101j04421n283k6450k21548J9694J69141M1388
$$ y = [187252, 98181, -50715, -242511, -151385, -15343, 47102, -12533, -218265, -396180, -294899, -281975, -261597, -145353, -238453, -170808, -256005, -350454, -452606, -356266, -347879, -414996, -198200, -194466, -297423, -54685, 252522, -4190, -210285, 116810, 238526, 296981, 242151, -4260, -145454, -61915, -224847, -337045, -154324, -260542, -443263, -190640, 57418, 307954, 408996, 225556, 265928, 305687, 188432, -19329, -64447, -24301, -73928, -164428, -119770, -37716, -87552, -394840, -461435, -277566, -345139, -162571, 172116, 258407, 142099, -63217, 50845, 68139, 137082, 239326, 100342, 97820, -18319, -52860, -98052, -83412, 45689, -58732, -64015, -90465, -312013, -292319, -123178, -81790]
15404h1790Q1893J47284n3395K0124O328p1821P0021M8138p6588K9427j50130
15393c0509q2642l0904K11039J22035n524J49661K683j20273p5458j22361q6107
15382f8360N5833k9354L7540J16456q7773L874l4154K30744K60756k62301j93961
15371B9300j30715J5335J3256k084J22093j34816K3292J64714l3898j4063K04672
15360B57086n1935J08004M2080k02109j87880j71290m8098j34093P6119J29422
15350a82694K86196J94600j04011j92681k1363j45058M2452j110J17945r037k55032
15339b69793p5000J14555P3866P55k8711k39252J80908M02407J46771k4305n7846
15328B24355k73958k42853m2506J55012J59358j45139k3428J13072M7142N6847
$$ y = [-81790, 103, 147387, 93992, 114116, 120444, 48623, 118644, 166782, 90194, 119621, -30509, -113151, -144055, 66984, 189019, 183495, 333156, 335839, 215566, 140108, 17747, -68360, -12527, -41881, -4341, 112115, 24342, 28216, -5938, 224806, 485562, 223261, 29300, -101415, -86080, -72824, -74908, 47185, -87631, -64339, 100375, 66477, 52414, 257086, 205151, 313155, 355235, 153126, -34754, -206044, -254142, -388235, -312116, -182694, 103502, 298102, 194091, 1410, -19953, -165011, -122559, -123669, -5724, -14761, -269793, -344793, -230238, -156372, -155617, -184328, -423580, -242672, 159735, 306506, 282201, 224355, -49603, -292456, -334962, -179950, -20592, -165731, -189159, -76087, -28945, 27902]
15318B7902J43335l2016l12091L9971J10002k541m5794K34709j9805l57358q9447
15307c03133L3139K79496K08181o9648j50221j3866m7770q3557K7833r9587j4597
15296b33730r0966J43854K7353O5523R1936j95893k6218M2616R0386m3337M578
15285a23898p3728o4752j41942m6981K94018J74357J13554o9533J63034j0143
15275B13986k41696m0129o5114l0071P980J15527J40251p708N0967O3784J27556
15264C35333m3030j03612j78552L0478l2558m7688J28902Q854r722J29035j78733
15253C8707N0385j80598k61105J48256J27143K35593K5730j96308O1146j93659
15243a44710L0187J7981R6376J8187R7088q3239K1242J21978O7097J01450n6853
$$ y = [27902, 171237, 139221, -172870, -132899, -22897, -25438, -71232, 163477, 143672, -213686, -303133, -269994, 9502, 217683, 148035, -2186, -16052, -63822, -147379, -119546, -219133, -233730, -324696, -180842, -153489, -87966, 3970, -191923, -218141, -175525, -85139, -128476, -123898, -197626, -262378, -404320, -451301, -157283, 17074, 130628, 61095, 224129, 213986, -27710, -67839, -132953, -163024, -155044, -39517, 100734, 93026, 143993, 207777, 335333, 292303, 188691, 10139, 40617, 8059, -39629, 89273, 98127, 88405, 217440, 38707, 89092, -91506, -352611, -204355, -77212, 158381, 184111, -12197, 48949, -144710, -114523, -96542, -166, 18021, 115109, 31870, 53112, 175090, 242187, 343637, 286784]
15232B86784n49005k16953K38488K93988J32534n9256j53320j8936j49687R9263
15222i6100K4744j96655j56786J26121J15239J76603m5584Q3689J76810R502j75504
15211D2079j05208m5925J39227L13104N855j57637J30182J50006K51073j21939
15201F00817m42169j54620R103K02319j52060P3106j3117j18900J34581J76804
15191C15864q7064j56342j41089Q2045J52425o2723o8142k79329j79997P0316
15181c54036L92803K46741j36790k433q4845J8015J54293J90672L8378l83740
15171G9058j5471R5608n9773j25978j32793j87668m4840J98262O5193K60176R8449
15160B30223p817m0638J97866J66342j61607l28246p44K06547j64229l7795J11218
$$ y = [286784, -262221, -479174, -240686, 53302, 185836, 126580, -26740, -45676, -195363, -96100, -71356, -268011, -424797, -298676, -183437, -6834, -52418, 31271, 208081, 217583, 42079, -63129, -109054, 30173, 343277, 349132, 191495, 321677, 471683, 722756, 600817, 158648, 4028, 13131, 215450, 63390, 136496, 123379, 4479, 139060, 315864, 228800, 72458, -68631, 13414, 165839, 103116, 34974, -244355, -424352, -354036, 38767, 285508, 148718, 146285, 61440, 79455, 233748, 424420, 462798, 79058, 63587, 159195, 99422, -26556, -159349, -347017, -391857, -193595, -128402, 131774, 230223, 222406, 181768, 379634, 545976, 384369, 56123, 55379, 261926, 97697, 59902, 171120]
15149A71120k20047J32120P3083M1186k35655n4928K11791J96252n0839j14152
15139A49931j22938P4759k04641J4605J29882j38204j19730N9199L386J03452
15129e0299R2078p1875n950J78619l8652j99270j82760j28015K69326K27214q1371
15118I045q6594j5369L2137Q5286J6700J07847L4866k90014r8569J1835r1794
15107b84624p95J31188K24091K84330L8308j38558P9914l1516j6193J5044M2376
15096C43565j33758j67738q9825j51601j04010n5160M584O5947J05839k9923k22574
15085d34654m4707k8956M8790J5369k1205K07302J51995P278o6249n5074k74090
15074d94201j42755N2294r6752J10135L8861L10207J36400J83899M9611j75038
$$ y = [171120, -48927, 83193, 156276, 197462, -38193, -93121, 118670, 314922, 264083, 149931, 26993, 101752, -102889, -88284, 41598, -96606, -216336, -157137, -153751, -50299, 41779, -30096, -36046, 142573, 103921, -95349, -278109, -406124, -136798, 90416, 9045, -77549, -92918, -60781, 24505, 41205, 149052, 183918, -106096, -204665, -192830, -284624, -285419, -154231, 69860, 354190, 392498, 253940, 333854, 302338, 286145, 301189, 343565, 209807, 42069, -47756, -199357, -303367, -358527, -353943, -287996, -182157, -212080, -434654, -479361, -508317, -459527, -444158, -465363, -258061, -106066, -98788, -165037, -220111, -494201, -636956, -584662, -681414, -571279, -532418, -222211, -85811, 98088, 147699, -27339]
15064b7339Q147J4733K12836J04488J5805r8447J63688M7859j40595j69313j17357
15053A4505N1109J71548k0255r8519l9844N2961N1567J25456J58867P050j22072
15042C52373k47881p2809j3030j33518J62592K96650K39188j50676R6289m6667
15032D82511j53714l78601m2765K5662m9480q9141Q7082J10100J75918O4307J73729
15021D05608j69598l69466J30461P8457k03471O4650j6077R2033Q5558O5728K5450
15010A89333n6411j9590J95493K67185L3900k6882r5214l2513k70780k83569m1667
14999a40715j11879L2027J5446Q7028J26639k54392O5188k7436j89507O4664J45732
14988a87205P3605O5698K170j10405j43649j94200l0783J46248J77266m4346j3720
$$ y = [-27339, -19192, -4459, 208377, 312865, 328670, 230223, 393911, 441770, 301175, 131862, 14505, 65614, 237162, 216907, 118388, 78544, 131505, 183072, 308528, 467395, 474445, 352373, 104492, 31683, 18653, -114865, 47727, 344377, 583565, 432889, 529178, 482511, 328797, -49804, -92569, -66907, -116387, -205528, -118446, -8346, 167572, 231879, 405608, 236010, -133456, -2995, 75462, -128009, -63359, -79436, 12597, 98155, 163883, 189333, 132922, 113332, 308825, 576010, 609910, 583028, 487814, 455301, 184521, -99048, -140715, -252594, -220567, -205121, -118093, 8546, -245846, -180658, -208094, -397601, -332937, -187205, -113600, -47902, -45732, -156137, -299786, -493986, -524769, -378521, -201255, -245601, -259321]
14977b59321K3207K25083K56306K20774N1860l48306k46587J51168r1696M1706
14967B4194J72377k30997j19714R5412J79675J80404R4165j1789J20522L7470
14957E41719k00176j16047K3420r9139Q8974J19166q6203j63443O8191L7927j76719
14946C7670j34066K7873K19141J19898k80335k65104R7737J668J60703M15201
14936D00386J621m53394j3600N0337j65944p5835R4298m2377k2772J09641J05602
14925a2037q0446k12599j22949m1618K54761J44490j67430J31071J83292J18687
14915A95222K28906j48206j87025j77793n1582j30971J93865J25589j1392j05970
14905f9357N0670J50771n9453M8275P3783o7690J20098k53684o2422p6400r5116
$$ y = [-259321, -236114, -11031, 245275, 466049, 517909, 169603, -76984, 74184, -17512, 24194, 196571, -34426, -154140, -58728, 120947, 301351, 395516, 383727, 504249, 541719, 341543, 225496, 248916, 149777, 238751, 357917, 271714, 108271, 176462, 214389, 37670, -96396, -68523, 150618, 270516, -9819, -274923, -177186, -175518, -14815, 400386, 402007, -51387, -64987, -14650, -180594, -256429, -162131, -204508, -227280, -117639, -12037, -92483, -305082, -428031, -469649, -214888, -70398, -237828, -106757, 76535, 195222, 424128, 275922, 88897, -88896, -140478, -271449, -77584, 48005, 36613, -69357, -18687, 132084, 72631, 120906, 194689, 126999, 247097, -6587, -69009, -145409, -240525]
14894b40525J38999L4026N8627J70175N5720P439k94586j17260j08616p5975r3065
14883d65041J28632R6998L1028q6496k18902K33894L04997R441q1934k28646K4963
14872b51066k00735O9259N5296R5165J55293k5971J51821k79304k07339l7280
14862d74861J16004J69867J11652k0092J23543q4203K9964N5264k7046P1543p0517
14851A118k98771j97646j8583L1467K58305J46000k28593J5712J41817O0869O5935
14840b2370P043p1677O0737Q246N0528J08751k8140m296o677J06136r1061Q2982
14828B00202K01617j57587j40621j32318j18391J20881M5904O5259j92123n6294
14818a63471O7500J78206J39851O3081R8459j8517p233k96880j12070j40755Q389
$$ y = [-240525, -101526, -67500, -8873, 161302, 217022, 224461, -70125, -187385, -296001, -371976, -465041, -336409, -239411, -208383, -294879, -513781, -279887, 25110, 34551, -47383, -276029, -251066, -451801, -382542, -327246, -232081, -76788, -102759, 49062, -230242, -437581, -474861, -358857, -188990, -77338, -97430, 26113, -58090, -28126, 27138, 92, 71635, 1118, -297653, -495299, -513882, -482415, -224110, -78110, -306703, -290991, -149174, -88305, -22370, -15327, -87004, -26267, -18021, 32507, 141258, 113118, 108822, 102145, 208281, 117220, 200202, 401819, 244232, 103611, -28707, -147098, -26217, 19687, 84946, -107177, -163471, -95971, 82235, 222086, 285167, 383626, 365109, 357876, 60996, -51074, -191829, -183440]
14807a83440K29996O6221r2663k88292k61823k7476L6426R4465j02624j35840
14797f65050J17155K74298J31252n5446l1582k1283M4234L00338R8703q9292L1439
14786A34766j41166o9827Q8802k0767R2453n1656j39369l039J16433L79668Q8919
14775D75217j46954o4576J0185l6798l88855l2009m4121j33669l9288J50882J97887
14764e2099k42142L463J53214l7314j61568O3794J84867j35177Q7391p5567k1236
14753b32374J18038J50993L9145k7677q2670j31106k9678K65559j71553J31913
14743C0590L39420j06429l2067M9255j03460k6826r4872n8042l0912Q9977N5520
14732A12154K9930j22223J10090j66696o6209Q753J48507l6744j18649k23185
$$ y = [-183440, 46556, 112777, 20114, -268178, -530001, -557477, -521051, -426586, -529210, -665050, -547895, -273597, -142345, -197791, -229373, -250656, -206422, 93916, 192619, 103327, 134766, -6400, -76227, 12575, -8192, 84261, 32605, -106764, -109803, 6630, 386298, 475217, 328263, 263687, 273872, 237074, -151781, -183790, -227911, -361580, -400868, -249986, -52099, -294241, -290778, -137564, -174878, -336446, -272652, -87785, -222962, -135571, -211138, -232374, -114336, 36657, 75802, 48125, -34545, -165651, -195329, 70230, -101323, 30590, 370010, 263581, 231514, 280769, 177309, 150483, 55611, -2431, -33343, 56634, 112154, 142084, 19861, 129951, -36745, -102954, -94201, 54306, 17562, -101087, -324272]
14722c24272N2412M7156J25062Q3789M8786j78912O331j34539k02217P0262O4229
14711c41913R9960N5241j2272O1443j62536L40298K07780m4168J64632k86306
14701H2159R682J86638P9605j52344j91908p2224j08961J17556N9755Q7673j1357
14690H6274q7059j73789l12436O3793M14498Q4475R9048k45516j22143K7731q6045
14679b51169K8269K09727J28012p99n3699j87487k36706j65921K13178K74434
14669d2161Q8597o4332n9942q7569j50800J44952J56314R587j1564r8283R2022
14658b3179j28393L8864r5473J1136J29111J08025j28626o7998K3599J91583R2586
14647A51235J88259m2945Q6215j920j15714l85100j36556l5156k9360R0193j5468
$$ y = [-324272, -271860, -224704, -99642, -15853, 32933, -145979, -139648, -274187, -476404, -406142, -341913, -241953, -186712, -198984, -137541, -300077, 40221, 248001, 203833, 368465, 82159, 91841, 278479, 358084, 205740, 13832, -58392, -167353, -49797, 9958, 97631, 86274, -785, -174574, -487010, -423217, -8719, 75756, 174804, -70712, -192855, -165124, -251169, -222900, -13173, 114839, 114040, 60341, -127146, -363852, -529773, -316595, -42161, 46436, -17896, -77838, -165407, -316207, -171255, -14941, -5354, -16918, -115201, -23179, -151572, -112708, -208181, -197045, -67934, 40091, -88535, -156533, -132934, 58649, 151235, 339494, 296549, 382764, 380844, 265130, -119970, -256526, -291682, -321042, -230849, -246317]
14636b46317k2647K45817J29413j58349k89895j7855K86738j1273N7908K8957
14626B497k63919n4325K50023p6852j11142N6710L0323J03765p3147j81953p9996
14615c98016j2007J59270L56842K49284m55490k88230j87128M657L74227R2689
14605a03902j16846p4202j19337m4389p3786J46108K08619j37602m1553L70412
14595A3522K49849k62247p1963Q4228Q8027K35197J07789K8631o212j34630n2299
14584B79892Q013k29626j02688J59120K7266r7546O4333q53j81750J42926J05561
14573A74648j18094j8224q438j88940j91157J86196j13043R3129o2462J22140
14563a24245O9141Q8846M5099O8349J08396O8197k9741j49247J9689K52208O1841
$$ y = [-246317, -268964, -23147, 106266, -52083, -341978, -359833, -73095, -84368, -26460, 2497, -261422, -315747, -65724, -142576, -253718, -197008, -166685, -62920, -136067, -318020, -398016, -410023, -250753, 106089, 355373, -100117, -388347, -575475, -570818, -196591, -103902, -220748, -294950, -414287, -458676, -532462, -386354, -177735, -315337, -356890, 13522, 263371, 1124, -70839, 13389, 101416, 336613, 444402, 473033, 466821, 332191, 279892, 287905, 58279, -44409, 114711, 141977, 44431, 108764, 107911, -73839, 69087, 174648, 56554, 38330, 29892, -159048, -350205, -164009, -277052, -183923, -246385, -124245, -55104, 33742, 78841, 147190, 255586, 323783, 294042, 144795, 164484, 416692, 478533]
14552D78533j82989m163J98795r5341r5714k53505k51348J33525R5131J31821
14542A54745j28565K46054k13007j29593J94815N4220o0097r7882M9867k9737
14532D0820M3181n1833k21699k39726J91416R2238r6878j24118j1523J12770K45518
14521a9834K85542m987l9672j59466k55569l4378J01402M31607K1518l90114J1649
14510e2302J00527o0323k44074J4010L10917J35313o6404o9072R2108l39374j54197
14499c32871j51906q2299K37776K0092m809k792k01946L7487K87462O6876j12934
14488b39864Q3943N7819Q7365k0878j97646O3354J68072l5125k06305m7744K32604
14477e4405L68508J03633m3103k22291j12732J03314N0850j09632j8536j15659
$$ y = [478533, 295544, 291381, 490176, 394835, 299121, 45616, -205732, -72207, 22924, 154745, 26180, 272234, 59227, -70366, 124449, 178669, 118572, 20690, 70557, 40820, 84001, 32168, -189531, -429257, -237841, -145603, -242481, -366599, -378122, -265352, -19834, 265708, 260721, 221049, 61583, -193986, -228364, -126962, 304645, 326163, -63951, -52302, 48225, -12098, -256172, -242162, 68755, 204068, 137664, 68592, 160700, -178674, -332871, -484777, -567076, -329300, -309208, -314017, -316809, -518755, -481268, -193806, -126930, -239864, -155921, -98102, -10737, -31615, -229261, -165907, 2165, -32960, -239265, -287009, -54405, 314103, 417736, 374633, 152342, 39610, 142924, 193774, 84142, 65606, -50053]
14467e0053j23351j9373K1685q8105J03664k4138j3195J68297r2441k79667r3946
14456d90623J45237J06366J80605K51030J39871j18322N8807R1282q4572j68838
14446A10843J26785N8313p5568J3782j9888N9517j24119l67106j34227J63853
14436a87815j90126j40807J32758L92490N0929j70968j6924K41490m8316k53614
14426a90903j93360j94326J33305K45826O3386L3421J37772J8197r6249R018J37470
14415A03557l69J11844j31181l37987O5069k3117R9358K80500J13429P1328j08271
14404B44160j39882j27826O9561N8297k97293k7025J40904K53240O5611j58435
14394H1312k25355k488K14629J47233J9503R639j20925q8217k38032k54043J61530
$$ y = [-50053, -173404, -192777, -171092, -259197, -155533, -179671, -192866, -24569, -117010, -396677, -490623, -345386, -239020, -58415, 192615, 332486, 214164, 272971, 364253, 279681, 110843, 237628, 295941, 220373, 234155, 214267, 273784, 149665, -217441, -351668, -187815, -377941, -518748, -385990, 6500, 57429, -113539, -130463, 111027, 62711, -190903, -384263, -578589, -445284, -199458, -136072, -102651, 35121, 53318, -42931, -33913, 103557, 103188, 215032, 83851, -254136, -189067, -212184, -112826, 167674, 281103, 352431, 244160, 104278, -23548, 46013, 104310, -192983, -220008, -79104, 174136, 239747, 81312, -144043, -146531, 68098, 215331, 234834, 244473, 123548, 35331, -202701, -456744, -295214]
14383b95214J94679J16788j2956j20071J73233m055k37270j36100l3666Q2661
14373b71971K07255k5276q9302O9283l4687Q1086q2769k11817L5581J78410M5987
14362i8220J27258K02866K48196k14336j13941R3083q7497j26967J5066J35438
14352A80946M956k77923j53269J17622M09342O918j79230k21478J50326K18455
14342B56665J68343K28236K9073j20899l6692l9579M5098l56308l32962J00873
14332e8152J35846j09112k19681r1901O1140m9783R7569J61970N6043P700O2761
14321E4400k3974q4195k4040p4057J9483j18292n376P7949m5811p2563M3041R130
14309b44305L85090L13561j16560j07992j43440q3675q5887j70438J0762K4305
$$ y = [-295214, -100535, 16253, 3297, -116774, 56459, 52404, -184866, -320966, -354632, -271971, -64716, -89992, -179294, -110011, -144698, -63612, -146381, -358198, -322617, -144207, -98220, 29038, 231904, 480100, 265764, 151823, 244906, 157409, 30442, 45508, 180946, 185902, -92021, -245290, -127668, 281674, 288592, 109362, -112116, 38210, 256665, 425008, 653244, 682317, 561418, 524726, 485147, 530245, 173937, -159025, -58152, 77694, -31418, -251099, -343000, -281860, -331643, -234074, -72104, -16061, -8361, 54400, 30426, -53769, -77809, -151866, -132383, -250675, -256051, -178102, -223913, -296476, -253435, -244305, 140785, 454346, 337786, 229794, 86354, 2679, -83208, -253646, -242884, -218579]
14299b18579J28073J90987J047o086n2383P7666j10911j14786K8110K7575m8663
14288i7950J41060J24579l4407j22031j1790J59790q3278j65366J6259k15993
14278b89127M0813J69249k515k69j81402J14464J72701j7127k01101J5770K08008
14267B9464l1197O1829J56550j34168j50709J30831J5698K0954m7898l6420j87305
14256a72371N4876J68375n122J65052o2097K7227J11597m625j66920j8168Q1249
14245A79073P1459n1353k31989k06601j77394K03509J98052O9710n2623J25830
14235A27673J38246o1823j15802j89564m76991q8718J60937M08022N0057K33739
14225A85776L1697k5947m1381k71751k85705J07010K40197p5898R7408J67523
$$ y = [-218579, -90506, 100481, 101528, 95442, 43059, 120725, 9814, -104972, -76862, -49287, -97950, 43110, 167689, 133282, 11251, -539, 159251, 75973, -89393, -73134, -289127, -248314, -79065, -81580, -81849, -263251, -148787, 23914, 6787, -194314, -178544, 29464, -1733, 60096, 216646, 82478, -68231, 62600, 78298, 99252, 51354, 14934, -172371, -117495, 50880, 45758, 210810, 148713, 175940, 287537, 282912, 115992, 97824, 179073, 250532, 199179, -32810, -239411, -416805, -213296, -15244, 54466, 1843, 127673, 265919, 204096, 88294, -101270, -578261, -666979, -506042, -98020, -47963, 185776, 217473, 191526, 150145, -121606, -407311, -300301, -60104, -136002, -38594, 128929]
14215A28929j47126j46905J38771Q5578p9998J96887o5286r4672Q3341J07677
14205B07196j52139j58428j03595Q2327j30250N5808Q5201Q3921O692j41061K19980
14194E5652n0716j45836j17238q3828j54684O6549J78164r8520O5477K32601J32013
14183G9634n0946k95525j84056M170K843J81113K01113j8277j8068L5111K54492
14172A91604p3057l34346o4899q3242K26136K43826j09686r6212J96840j16223
14162a9259K7598J1845k61504R5983J92183J10245j8265J81095J2600m798j21360
14151B06363q726n5028J7367k14464k77073J79884J74220J34545n0915J2435Q6321
14140B04929p2342J7752K2553l3185K19817n7694j5878j65553j40300k89190q8908
$$ y = [128929, -18197, -165102, -26331, 59247, -20751, 176136, 110850, 16178, 99519, 207196, 55057, -103371, -206966, -124639, -254889, -199081, -113880, -29959, -23267, -164328, 55652, 4936, -140900, -258138, -341966, -496650, -430101, -251937, -350457, -284980, -52379, 79634, 28688, -266837, -450893, -446723, -443880, -262767, -61654, -79931, -97999, -62888, 191604, 118547, -215799, -280698, -363940, -137804, 106022, -3664, -99876, 96964, -19259, 8339, 20184, -241320, -145337, 46846, 157091, 138826, 319921, 332521, 327723, 206363, 197637, 142609, 159976, -54488, -331561, -151677, 22543, 157088, 106173, 118608, 204929, 132587, 150339, 172892, 139707, 359524, 301830, 285952, 120399, -19901, -309091, -397999]
14129c97999K38979J53919J6612N7793j34028R3529J02934j18466k33040M3018
14119a76749R6888J5184p1151J4467L00211M7343j73141J3900J45059J3045l07518
14108h2462J30613P5981L1264j46622j8251r1427P9508J85386K2255l42547j54276
14097c10578K58556j710J11551j03042j48059J46023o4986R408j44223O0969J49572
14086c6519P3799m8148J2120O8216k9825p8960P1481O9130K5694M1929j49025
14075A9892p3271J72139j16690j02000j7680j23044K2127R3987M2320J53951l9329
14064C2402k23779J05566k67m6693m55178r3902N36383R4381q9006j2505p0744
14053b23342o6702J03984M5028j78544j10880R7034J35912N2817j24409j32410
$$ y = [-397999, -159020, -5101, 11511, 69304, -64724, 28805, 131739, 13273, -219767, -176749, -79861, -64677, -135828, -121361, 178850, 226193, 53052, 66952, 212011, 225056, -82462, 48151, 124132, 155396, 8774, -9477, -100904, -21396, 163990, 186245, -156302, -310578, -52022, -53732, 57819, -45223, -193282, -47259, -112245, -102837, -247060, -186091, -36519, 37280, -10868, 1252, 69468, 39643, -39317, 32164, 101294, 126988, 168917, 19892, -53379, 118760, 2070, -99930, -117610, -240654, -218527, -124540, -82220, 71731, 32402, -191377, -85811, -86078, -132771, -587949, -681851, -145468, -51087, -140093, -152598, -223342, -290044, -186060, -141032, -319576, -430456, -333422, -197510, -144693, -269102, -401512]
14043d01512N3256Q4063R196j12396j32263K33781K16814m7891o8759K08055j08662
14032f6318k52034L0930m7393R6905r7633j41354P7944J19929l7120j80381j56446
14021f52971L23481J77536J70353K24378L4009j90225r8839K5188O5424k88792
14011b10458j20829J40955R5603P6447L1486k86708L4061K25687k4176l2102J5583
14000e4451l967j78412r2443r415o2531K14668J21584J12865O1168j80445k9661
13989a01040N7702J84542J68468o1820l4426j71179j27417m3651j03001j35104
13979c66926P9621r2190J49469K59849k70740k16343M4753k4274J21675J87089
13969a28017K22056Q6876k25755l23600P1261M36016j6972j38218j61224O6798
$$ y = [-401512, -348256, -264193, -254997, -367393, -499656, -265875, -49061, -96952, -165711, 42344, -66318, -318352, -287422, -334815, -237910, -335543, -476897, -398953, -279024, -316144, -496525, -652971, -329490, -151954, 18399, 242777, 276786, 86561, -12278, 12910, 78334, -210458, -331287, -190332, -94729, -18282, 13204, -273504, -239443, -13756, -37932, -70034, -54451, -58418, -236830, -329273, -338688, -401219, -186551, -64967, 47898, 109066, -71379, -101040, -43338, 141204, 309672, 247852, 213426, 42247, -85170, -128821, -231822, -366926, -287305, -379495, -230026, 29823, -240917, -457260, -412507, -436781, -315106, -128017, 94039, 180915, -44840, -368440, -297179, 138837, 121865, -16353, -177577, -110779]
13959a10779q2017M9696L01823J35365o8068j57831m12760l5644J57449J73446
13949d9320j23102r089P5645j18856O7046L9121P3954R6093P0485q8230j16361
13938h2614M4374J23136Q332J22175m5766l23701k96336Q8493J74516p2745J13672
13927a46464J27114n3416J10536q161p0960m204k83656j54179R6372N34459K82290
13916D29731r326r2426J00384m5753l08992j12846J74916K43073j35956O824o6637
13905A82992j67022p3167q5654m512m6421j22800K9953J39620J32957P1844j87476
13894a29686j78586J29416J51780Q1757L8847k22263o174J3824k7855j85772k15903
13883e50615l05929L60604L18350Q929n2020J12936n9840Q8036L23865l5572J2976
$$ y = [-110779, -192796, -143100, 158723, 294088, 226020, 68189, -344571, -380215, -222766, -49320, -172422, -181511, -105866, -224722, -157676, -118555, -44601, 51492, 121977, 33747, -82614, -38240, 84896, 93228, 215403, 169637, -154064, -450400, -361907, -187391, -260136, -146464, -19350, -72766, 37770, 29609, -41351, -45555, -329211, -483390, -387018, 147441, 429731, 420405, 327979, 428363, 382610, 73618, -39228, 135688, 378761, 242805, 249629, 182992, 15970, -57197, -142851, -147363, -193784, -316584, -286631, -147011, -14054, 57790, -129686, -308272, -178856, -27076, 54681, 93528, -128735, -134909, -121085, -148940, -334712, -550615, -856544, -495940, -177590, -168661, -220681, -107745, -167585, -79549, 244316, 208744, 221720]
13872B21720j84610j12445L10364R2384l84719l9855L28642M5807R8650J9123
13862C95061j05966p5121j84606j27706J41026J13840j0858p5555Q8345l3059
13852A25401l05751L2349k22119q174K97256L9112j83197J77491k72487j25685
13842d45804L36506j85170k23820K68284j00490O8500K24029N7459j39380m0530
13832a80416P7687J98107J45779l3396o5179l7158O055l7111j91583m2780J21334
13821c8661K59698Q7583k39987j46117J9613o1358p2295J71319L24720J26557
13811D31072J03275m6189k34810J7591k17111n6069J48418l14574n6505J53103
13801g1799J27648n383m6944m20j23090l7460K85399J47024j38860l1430j45777
$$ y = [221720, 37110, -75335, 235029, 327413, -57306, -97161, 231481, 277288, 375938, 395061, 289095, 213974, 29368, -98338, 42688, 156528, 145670, 70115, 158460, 125401, -180350, -148001, -370120, -378294, -81038, -41926, -225123, -47632, -320119, -445804, -109298, -294468, -518288, -250004, -350494, -281994, -57965, -506, -139886, -180416, -102729, 95378, 241157, 207761, 142582, 105424, 111479, 74368, -117215, -159995, -38661, 221037, 308620, 68633, -77484, -57871, -119229, -191524, -20205, 304515, 431072, 534347, 488158, 253348, 270939, 53828, -2241, 146177, -168397, -224902, -71799, 55849, 50466, 3522, 3102, -119988, -157448, 127951, 274975, 136115, 104685, -41092]
13790d1092j46558j46908O7477Q6173j11538k15316M4949K46547L32389O1363
13780A77486j91412k8947r2423N6564k09503q5571K29394O2091L0436q9824O0675
13769h1034j21068p458J21460K05603M4444j26562l6993L5788J17103j4003k10966
13758g3686q0280n2026O6689J36111m6493j61667j3503j28614j25696K67276L96687
13747A84798K06416j89114k18545O9685N4887j71131K9754r6750J32675N2301
13737E4976N6026J54205j85223M6462j19749k04570K48660M9473k28130j27279
13727b55149J49388J67621L0037K00052K10011q1863j26262L0154R4300P8279
13717D96568j14835j45496l3807R2907j8658p9264l14162m8581J23113l522o240
$$ y = [-41092, -187650, -334558, -267081, -180908, -292446, -507762, -462813, -216266, 116123, 177486, -13926, -42873, -135296, -78732, -288235, -373806, -144412, -82321, -51885, -141709, -81034, -202102, -209560, -88100, 117503, 161947, 35385, -1608, 34180, 151283, 137280, -73686, -153966, -205992, -139303, -3192, -49685, -211352, -224855, -353469, -479165, -211889, 184798, 391214, 202100, -16445, 53240, 108127, -63004, -33250, -130000, 2675, 54976, 111002, 265207, 79984, 126446, 6697, -197873, 50787, 100260, -127870, -255149, -105761, 61860, 91897, 291949, 501960, 420097, 293835, 323989, 418289, 496568, 381733, 236237, 202430, 295337, 276679, 197415, -116747, -165328, -42215, -45737, -51977]
13706e1977k26473J29085K04317Q7053r0901j34349q8145q9135J24271K10974
13696G4720r2887j05096O0470J17026L0368o5701J35742j46600r1401M6172J43541
13685A06354r5850k66444K3582K19191j01165J2941q3658m1735K7640j74672l34305
13674g08121l7533J26568J70693L39149J21594M4070J14000r9617k84840J7961
13664a96076j6302k15142O073O8880j8871j69149P0795L46193J4599R6606p3100
13653h5494j15595r6891J7091Q1874Q9304J6672r1534n0152J47302P3913j26014
13642a39524J37798J19528j61712P4169k6407R2596j8470j97534j4029L400M6074
13631h4111q9964J50376J20694P6364J30920j37018k51717k97809m0340j8297
$$ y = [-51977, -278450, -149365, 54952, 142005, 51104, -83245, -171390, -260525, -136254, 74720, -18167, -123263, -62793, 54233, 84601, 18900, 154642, 8042, -83359, -37187, 106354, 10504, -255940, -232358, -13167, -114332, -101391, -185049, -226784, -199144, -373816, -708121, -745654, -619086, -448393, -109244, 12350, 56420, 170420, 70803, -214037, -196076, -212378, -427520, -421447, -352567, -371438, -540587, -469792, -123599, -109000, -12394, -85494, -201089, -297980, -280889, -199015, -109711, -93039, -184573, -234725, -87423, -13510, -139524, -1726, 117802, -43910, 30259, 3852, 96448, 77978, -119556, -133585, -130185, -84111, -174075, -23699, 96995, 173359, 304279, 167261, -84456, -382265, -422605, -440902]
13621d40902J84371K17898J70209k3066k29060j0551J24083N8901q8819k40617
13611b77553J64006J86243m042n1887l7070N5929l9090j63406r1981j00558J37055
13600b22354J97745J02615J87070L7794m1322q1077l31841N5327J40625k69879
13590b25297q2424K11040K78435j38653o2030R2173K24248J02360J8933j74989
13580B43796j03157n9528j00262l536r2362K9692K93917J42124l01820m18162
13570c69298m2085k5134K39384K5050J50309R9024K5046j31157J8669J32428J23721
13559B45957J1355j13270j7589k7184n305O4488L7814j5769j27015j61827k35983
13548c44328K61162N3749j50732j00113O6815j17565K85572L1855n6743j30001
$$ y = [-440902, -256531, -38633, 131576, 108510, -120550, -131101, -7018, 51883, -36936, -277553, -113547, 72696, 68654, 16767, -20303, 35626, -3464, -166870, -258851, -359409, -222354, -24609, 78006, 265076, 302870, 261548, 180471, -151370, -96043, 44582, -225297, -307721, -96681, 181754, 43101, -18929, 73244, 297492, 399852, 418785, 243796, 140639, 81111, -19151, -22687, -115049, -85357, 208560, 350684, 48864, -369298, -411383, -436517, -197133, -172083, -21774, 77250, 102296, -28861, -10192, 122236, 245957, 257312, 144042, 126453, 99269, 93964, 158452, 196266, 180497, 53482, -108345, -344328, -83166, -29417, -180149, -280262, -213447, -331012, -45440, -13585, -70328, -200329]
13538b00329l4880L461J58839N0616J43919K03497k51879m8763Q9266P7103J05673
13527B96523P4434j01219L6739l2861o4752K60648J03623k93774j6999k8250r4139
13516A39973r1459j33018k57436M7148m8574N8479j24878n6374J23690K12164
13506a30285j08829M3640l3997K4104Q2294J18792K819M6113K17176m7958l46495
13495a32626j01227j2912j17085L19503p7664j52105K02763O2077J1155j11193
13485a09314k45925J38115M6943l04732r3666Q7274J72451M9847J63354q7114
13475a82767K2960J7067j40069l8905J44892k9262R3407L9861k6030j11855j74677
13464c85378m9567J55787J60101K7439n3021k34216J02410K87388J08981j00745
$$ y = [-200329, -235209, -231748, -72909, -22293, 121626, 325123, 73244, 24481, 113747, 190850, 296523, 370957, 269738, 306477, 273616, 208864, 469512, 573135, 279361, 262362, 234112, 139973, 48514, -84504, -341940, -294792, -343366, -284887, -409765, -466139, -342449, -130285, -239114, -195474, -229471, -205367, -123073, -4281, -1462, 44651, 261827, 213869, -132626, -233853, -246765, -363850, -44347, -122011, -274116, -71353, -9276, 1879, -109314, -355239, -217124, -170181, -474913, -568579, -481305, -308854, -259007, -95653, -182767, -159807, -142740, -282809, -321714, -176822, -206084, -112677, -72816, -98846, -210701, -385378, -434945, -279158, -119057, -91618, -144639, -378855, -276445, 10943, 119924, 19179]
13454A9179k41109k29861K73072K38703q8173Q1714l0170J39559K4564k76247
13444h8769k22546K49481L23831j34314k0123j11036K2714M5355j08833K04327
13434A60087r612Q2285J8698j65887k61305q5289J20081J36195k2685J95674o1657
13423A06585q485r5943p9388k12592J33972K21452j61141j11427K94789Q0121
13413A67943k89708j20097j6211J2005K7388J59215J6744J75732K08194l0789
$$ y = [19179, -221930, -451791, -178719, 59984, -28189, 53525, 23355, 162914, 187478, -88769, -311315, -61834, 261997, 127683, 107560, -3476, 19238, 64593, -44240, 160087, 150475, 232760, 251458, 85571, -175734, -261023, -140942, -4747, -27432, 168242, 106585, 98100, 2157, -77231, -289823, -155851, 65601, -95540, -206967, 87822, 167943, -121765, -241862, -258073, -246068, -218680, -59465, -42721, 133011, 341205, 310416]
$$ [...]
##END NTUPLES=NMR SPECTRUM
##END=
