##TITLE=Analysis number 322882
Compound Code cc 24839
Project Code adrs
Chemist Name af chempharm
##JCAMPDX= 6.0         $$ Bruker NMR JCAMP-DX V2.0
##DATA TYPE= NMR SPECTRUM
##DATA CLASS= NTUPLES
##ORIGIN= Bruker BioSpin GmbH
##OWNER= nmr
$$ XWIN-NMR		Version 3.5
$$ Mon Oct 16 10:30:56 2006 GMT Daylight Time (UT+1h)  MAYBRIDGE\nmr@NMR_250MHZ
##.OBSERVE FREQUENCY= 250.131544655141
##.OBSERVE NUCLEUS= ^1H
##.ACQUISITION MODE= SIMULTANEOUS (DQD)
##.ACQUISITION SCHEME= undefined
##.AVERAGES= 16
##.DIGITISER RES= 18
##SPECTROMETER/DATA SYSTEM= dpx250
##.PULSE SEQUENCE= zg30
##.SOLVENT NAME= CDCl3
##.SHIFT REFERENCE= (INTERNAL, CDCl3, 0, 16.522)
##AUDIT TRAIL= $$ (NUMBER, WHEN, WHO, WHERE, WHAT)
$$ ##TITLE= Audit trail, XWIN-NMR		Version 3.5
$$ ##JCAMPDX= 5.01
$$ ##ORIGIN= Bruker BioSpin GmbH
$$ ##OWNER= nmr
$$ C:\u/data/dgb/nmr/ADRS/500/pdata/1/auditp.txt
$$ ##AUDIT TRAIL=  $$ (NUMBER, WHEN, WHO, WHERE, WHAT)
(   1,<2006-10-16 10:30:28.02 +100>,<MAYBRIDGE\nmr>,<NMR_250MHZ>,
      <created by zg, POWCHK disabled, PULCHK disabled
       configuration hash MD5:
       49 4B E0 1D 92 C2 6B 37 9F E6 65 BC 52 41 86 1D
       data hash MD5: 64K
       87 AA AB 91 40 73 BC 09 DB 81 5C 4A 5E 89 AD 31>)
(   2,<2006-10-16 10:30:42.38 +100>,<MAYBRIDGE\nmr>,<NMR_250MHZ>,
      <Start of raw data processing
       ef LB = 0.3 FT_mod = 6 PKNL = 1 SI = 32K 
       data hash MD5: 32K
       03 E2 9F BE 32 4B 63 4D F4 67 AC 5C 8F BC B4 A8>)
(   3,<2006-10-16 10:30:44.08 +100>,<MAYBRIDGE\nmr>,<NMR_250MHZ>,
      <apk 
       data hash MD5: 32K
       67 F4 62 C7 AD 57 65 DD 33 E4 E7 AC 40 CE A3 B9>)
(   4,<2006-10-16 10:30:45.11 +100>,<MAYBRIDGE\nmr>,<NMR_250MHZ>,
      <abs ABSG = 5 
       data hash MD5: 32K
       E6 A1 2D 2B B1 E5 DD 06 97 B3 D0 16 21 97 7D 73>)
$$ ##END=
$$ 
$$ hash MD5
$$ 2F EF A8 73 AD 41 3C CF 3F 5E 18 2F 63 0A DB 77
##$RELAX= 
##$RELAX= 
##$RELAX= 
##$RELAX= 
##$RELAX= 
##$RELAX= 
##$RELAX= 
$$ Bruker specific parameters
$$ --------------------------
##$DU= <C:\u>
##$EXPNO= 500
##$NAME= <ADRS>
##$PROCNO= 1
##$TYPE= <nmr>
##$USER= <dgb>
##$AMP= (0..31)
100 100 100 100 100 100 100 100 100 100 100 100 100 100 100 100 100 100 
100 100 100 100 100 100 100 100 100 100 100 100 100 100 
##$AQSEQ= 0
##$AQ_mod= 3
##$AUNM= <au_zg>
##$AUTOPOS= <36 >
##$BF1= 250.13
##$BF2= 250.13
##$BF3= 250.13
##$BF4= 250.13
##$BF5= 500.13
##$BF6= 500.13
##$BF7= 500.13
##$BF8= 500.13
##$BYTORDA= 1
##$CFDGTYP= 0
##$CFRGTYP= 5
##$CHEMSTR= <none>
##$CNST= (0..31)
1 1 145 1 1 1 1 1 1 1 1 1 1 1 1 1 1 1 1 1 1 1 1 1 1 1 1 1 1 1 1 1 
##$CPDPRG= <>
##$CPDPRG1= <>
##$CPDPRG2= <>
##$CPDPRG3= <>
##$CPDPRG4= <mlev>
##$CPDPRG5= <mlev>
##$CPDPRG6= <mlev>
##$CPDPRG7= <mlev>
##$CPDPRG8= <mlev>
##$CPDPRGB= <>
##$CPDPRGT= <>
##$D= (0..31)
0 1 0 0 0 0 0 0 0 0.06 0 0 0 0 0 0 0.0002 0 0 0 0 0 0 0 0 0 0 0 0 0 0 
0 
##$DATE= 1160991027
##$DBL= (0..7)
120 120 120 120 120 120 120 120 
##$DBP= (0..7)
150 150 150 150 150 150 150 150 
##$DBP07= 0
##$DBPNAM0= <>
##$DBPNAM1= <>
##$DBPNAM2= <>
$$ [...]
##$SUBNAM7= <"">
##$SUBNAM8= <"">
##$SUBNAM9= <"">
##$SW= 20.6930455092707
##$SWIBOX= (0..15)
0 0 3 0 0 0 0 0 0 0 0 0 0 0 0 0 
##$SW_h= 5175.983436853
##$TD= 65536
##$TD0= 1
##$TE= 683.16
##$TE2= 300
##$TE3= 300
##$TEG= 300
##$TL= (0..7)
0 120 120 120 120 120 120 120 
##$TP= (0..7)
150 150 150 150 150 150 150 150 
##$TP07= 0
##$TPNAME0= <>
##$TPNAME1= <>
##$TPNAME2= <>
##$TPNAME3= <>
##$TPNAME4= <>
##$TPNAME5= <>
##$TPNAME6= <>
##$TPNAME7= <>
##$TPOAL= (0..7)
0.5 0.5 0.5 0.5 0.5 0.5 0.5 0.5 
##$TPOFFS= (0..7)
0 0 0 0 0 0 0 0 
##$TUNHIN= 0
##$TUNHOUT= 0
##$TUNXOUT= 0
##$USERA1= <user>
##$USERA2= <user>
##$USERA3= <user>
##$USERA4= <user>
##$USERA5= <user>
##$V9= 5
##$VALIST= <valist>
##$VCLIST= <CCCCCCCCCCCCCCC>
##$VD= 0
##$VDLIST= <DDDDDDDDDDDDDDD>
##$VPLIST= <PPPPPPPPPPPPPPP>
##$VTLIST= <TTTTTTTTTTTTTTT>
##$WBST= 1024
##$WBSW= 4
##$XGAIN= (0..3)
0 0 0 0 
##$XL= 0
##$YL= 0
##$YMAX_a= 482276
##$YMIN_a= -415658
##$ZGOPTNS= <>
##$ZL1= 120
##$ZL2= 120
##$ZL3= 120
##$ZL4= 120
##$ABSF1= 16.522
##$ABSF2= -4.171173
##$ABSG= 5
##$ABSL= 3
##$ALPHA= 0
##$AQORDER= 0
##$ASSFAC= 0
##$ASSFACI= 0
##$ASSFACX= 0
##$ASSWID= 0
##$AUNMP= <proc_1d>
##$AZFE= 0.1
##$AZFW= 0.1
##$BCFW= 0
##$BC_mod= 0
##$BYTORDP= 0
##$COROFFS= 0
##$CY= 12.5
##$DATMOD= 1
##$DC= 0
##$DFILT= <>
##$DTYPP= 0
##$F1P= 14.0000005364418
##$F2P= -0.99999901652339
##$FCOR= 0.5
##$FTSIZE= 32768
##$FT_mod= 6
##$GAMMA= 0
##$GB= 0
##$INTBC= 1
##$INTSCL= 1
##$ISEN= 128
##$LB= 0.3
##$LEV0= 0
##$LPBIN= 0
##$MAXI= 10000
##$MC2= 0
##$MEAN= 0
##$ME_mod= 0
##$MI= 0
##$NCOEF= 0
##$NC_proc= -2
##$NLEV= 6
##$NOISF1= 0
##$NOISF2= 0
##$NSP= 0
##$NTH_PI= 0
##$NZP= 0
##$OFFSET= 16.522
##$PC= 1
##$PHC0= -47.8802
##$PHC1= 4.642495
##$PH_mod= 1
##$PKNL= yes
##$PPARMOD= 0
##$PSCAL= 4
##$PSIGN= 0
##$REVERSE= no
##$SF= 250.13
##$SI= 32768
##$SIGF1= 0
##$SIGF2= 0
##$SINO= 400
##$SIOLD= 32768
##$SREGLST= <1H.CDCl3>
##$SSB= 0
##$STSI= 32768
##$STSR= 0
##$SW_p= 5175.98343685301
##$SYMM= 0
##$S_DEV= 0
##$TDeff= 65536
##$TDoff= 0
##$TI= <Analysis number 999999
Compound Code 99
Book Reference 9
Project Code 9>
##$TILT= no
##$TM1= 0
##$TM2= 0
##$TOPLEV= 0
##$USERP1= <user>
##$USERP2= <user>
##$USERP3= <user>
##$USERP4= <user>
##$USERP5= <user>
##$WDW= 1
##$XDIM= 32768
##$YMAX_p= 470046441
##$YMIN_p= -116284
$$ End of Bruker specific parameters
$$ ---------------------------------
##NTUPLES= NMR SPECTRUM
##VAR_NAME=  FREQUENCY,     SPECTRUM/REAL,   SPECTRUM/IMAG
##SYMBOL=    X,             R,               I
##VAR_TYPE=  INDEPENDENT,   DEPENDENT,       DEPENDENT
##VAR_FORM=  AFFN,          ASDF,            ASDF
##VAR_DIM=   32768,         32768,           32768
##UNITS=     HZ,            ARBITRARY UNITS, ARBITRARY UNITS
##FACTOR=    0.157963299565203, 1,           1
##FIRST=     4132.6476996994, 0,             0
##LAST=      -1043.33573715361, 0,           0
##MIN=       -1043.33573715361, -116284,     0
##MAX=       4132.6476996994, 470046441,     0
$$ Real data points
##PAGE= N=1
##DATA TABLE= (X++(R..R)), XYDATA
$$ [...]
15779b750J004l09k315J0777P919j950n088q804K301O628l746m815N22k561m282
$$ -2750 -1746 -2055 -4370 6407 14326 12376 7288 -1516 785 7413 3667 -1148 -626 -3187 -7469
15764g469m637k276J076Q844P939n624o295k2j903j603l286J978Q713M395K580
$$ -7469 -12106 -14382 -13306 -4462 3477 -2147 -8442 -8464 -10367 -11970 -15256 -13278 -4565 -170 2410
15749B410k542L569N20l065j125J185N24P27p51R52l015k603L119L375J691l656
$$ 2410 -132 3437 3957 892 -233 952 1476 2203 1452 2404 -611 -3214 -95 3280 4971 1315
15733A315o129R06J622r5J678P845k169j339J454m16L350k765K89L191k198o305
$$ 1315 -4814 -3908 -2286 -2381 -703 7142 4973 3634 5088 4672 8022 5257 5546 8737 6539 234
15717B34J109K0N635J399n184n67J226O2l945k84L197N507r39j574o074l012P895
$$ 234 1343 1363 6998 8397 3213 2646 3872 3934 -11 -295 2902 8409 7470 5896 -178 -3190 4705
15700D705M759P27o508n44o10k76l789q984J980j307l135K50J319L691Q087Q757
$$ 4705 9464 10191 3683 3139 2529 2253 -1536 -10520 -8540 -9847 -12982 -12732 -11413 -7722 365 9122
15684I122K538m266o167j559J246L556J694p743m350k202J844J2209N870p635
$$ 9122 11660 7394 1227 -332 914 4470 6164 -1579 -5929 -8131 -6287 5922 11792 4157
15670D157m008M216N053O96j917J869M882j028J564m288n895Q3q594L796L859
$$ 4157 149 4365 9418 10114 8197 10066 14948 13920 15484 11196 5301 5384 -3210 586 4445
15655D445o567o076m219L386L405M657O194Q801m426m213l92l585n583o361M923
$$ 4445 -2122 -8198 -12417 -9031 -5626 -969 5225 14026 9600 5387 4995 1410 -4173 -10534 -5611
15640e611L311l408k743M06N529J61l885p411N016J733o52L101n995j514k572
$$ -5611 -2300 -5708 -8451 -8045 -2516 -2355 -6240 -13651 -8635 -6902 -7554 -4453 -10448 -11962 -14534
15625a4534M360M971k360J775m609j864j948L080K998R789L282q27n871o769K864
$$ -14534 -10174 -5203 -7563 -5788 -10397 -12261 -14209 -11129 -8131 1658 4940 4113 -1758 -8527 -5663
15610e663N124p80R23M679n854o479O17j874Q142m148m961L923M545N705L553
$$ -5663 -539 -1319 -396 4283 -1571 -8050 -7433 -9307 -1165 -5313 -10274 -6351 -1806 3899 7452
15595G452j031n836l880o49k60N679m336m724J370L982o600J194L918N859M153
$$ 7452 6421 585 -3295 -3944 -4204 1475 -2861 -7585 -6215 -2233 -8833 -7639 -3721 2138 6291
15580F291j583l776K880N096L871j706l807n100j301N299L239J994l798j790r662
$$ 6291 4708 932 3812 8908 12779 11073 7266 2166 865 6164 9403 11397 7599 5809 -3853
15565c853p936J054O627N386j436L761o585n644L391L818o008l421J9M459M071
$$ -3853 -11789 -10735 -4108 1278 -158 3603 -2982 -8626 -5235 -1417 -7425 -10846 -10827 -6368 -2297
15550b297k463k321K637O169M732M65m5k319N46K097l675Q03J339m199n24k189
$$ -2297 -4760 -7081 -4444 1725 6457 6922 6877 4558 5104 7201 3526 4329 5668 1469 945 -1244
15534a244l439m264k874J445J185k556L571R283R47K110k919k621J696L204K160
$$ -1244 -4683 -8947 -11821 -10376 -9191 -11747 -8176 1107 2054 4164 1245 -1376 320 3524 5684
15519E684j430m716j877N521L775p14k656J042l117j263K942l44j222K073K506
$$ 5684 4254 -462 -2339 3182 6957 6243 3587 4629 1512 249 3191 2847 1625 3698 6204
15504F204l191n55k778n496k423R669O57l534L684N413k446r756N4N942O13q931
$$ 6204 3013 2458 -320 -5816 -8239 1430 2087 -1447 2237 7650 5204 -4552 -4498 1444 2057 -6874
15488f874k048J0033L042J704L873k253k962L528O88k331n3n573j979p4j83N5
$$ -6874 -8922 1111 4153 5857 9730 7477 4515 8043 8731 6400 6347 774 -1205 -1279 -1462 -1407
15472a407m456j49j315k619J874J6Q135L136l234o367k584L764M271K065l113
$$ -1407 -5863 -6012 -7327 -9946 -8072 -8056 79 3215 -19 -6386 -8970 -5206 -935 1130 -1983
15457a983n705k475Q841J316j680k87q386L103P909L583j510m869k773J920n143
$$ -1983 -7688 -10163 -1322 -6 -1686 -1973 -10359 -7256 653 4236 2726 -2143 -4916 -2996 -8139
15442h139q37l217Q40P693N660j130m34J548k59J225Q418L162p498n576j965k594
$$ -8139 -8976 -12193 -11353 -3660 2000 870 436 1984 1725 2950 11368 14530 7032 1456 -509 -3103
15426c103k492l323L931O721J973M8M51j847P046N093q032l249m120q69N903l060
$$ -3103 -5595 -8918 -4987 1734 3707 3755 4206 2359 9405 14498 6466 3217 -903 -1772 4131 1071
15410A071J6j017O37J530l274L155J0061K461m496r944k198L250J360k16p45p221
$$ 1071 1087 70 707 2237 -1037 2118 12179 14640 10144 200 -1998 1252 2612 2396 1651 -5570
15394e570N4k765M313L005L234m206r19Q87m402m496L805J857l847J651j847j735
$$ -5570 -5516 -8281 -3968 -963 2271 -1935 -2854 -1967 -6369 -10865 -7060 -5203 -9050 -7399 -9246 -10981
15378a0981n678L528P936K862m368K425o38P309Q018k408M780j700n924L239M125
$$ -10981 -16659 -13131 -5195 -2333 -6701 -4276 -4914 2395 10413 8005 12785 11085 5161 8400 12525
15363A2525k725j3879m723m945J83M585K287M482M61l823J00p97J138j364L998
$$ 12525 9800 -4079 -8802 -13747 -13564 -8979 -6692 -2210 -1749 -5572 -5472 -6269 -5131 -6495 -2497
15348b497m424K38O692JL51L807K647N759p292j816n485m751j311J417J767J383
$$ -2497 -6921 -6683 9 10 361 4168 6815 12574 5282 3466 -2019 -6770 -8081 -6664 -4897 -3514
15332c514k115K190O249O70J433p856o214K26n71N561o97K937K14m676O023L552
$$ -3514 -5629 -3439 2810 3480 4913 -2943 -9157 -8931 -9502 -3941 -4638 -1701 -1487 -6163 -140 3412
15316C412l262q244m908r25Q064L244k59L19K252n47q07q24n234N452K043m915
$$ 3412 150 -8094 -13002 -13927 -5863 -2619 -2878 -2559 -307 -854 -1661 -2485 -7719 -2267 -224 -5139
15300e139l036j670q584l218O895J35K267Q559J220K448m112J370l144j281J148
$$ -5139 -8175 -9845 -18429 -21647 -14752 -14617 -12350 -3791 -2571 -123 -4235 -2865 -6009 -7290 -6142
15285f142L209O167K893n539P007l774j2760j562K325J366Q011m58r8n967k554
$$ -6142 -2933 3234 6127 588 7595 3821 -8939 -10501 -8176 -6810 1201 743 645 -5322 -7876
15270g876J82O249M516j509l727l172J386O035o99j3724p440J3206L469l363K731
$$ -7876 -7694 -1445 3071 1562 -2165 -5337 -3951 2084 1385 -12339 -19779 -6573 -3104 -6467 -3736
15255c736m72l755n945o020L787k808K278L43K570K675M047k053k246L019R49
$$ -3736 -4208 -7963 -13908 -19928 -16141 -18949 -16671 -16328 -13758 -11083 -7036 -9089 -11335 -8316 -7367
15240g367j370n539j890P528o10r27K937M23n093L304M459l29l353J857N134m866
$$ -7367 -8737 -14276 -16166 -8638 -9248 -10175 -7238 -6815 -11908 -8604 -4145 -4474 -7827 -5970 -836 -5702
15224e702l535m305QO016R945N932K996j318n448r46l82p10K843j920N68j381
$$ -5702 -9237 -13542 -13534 -7518 2427 8359 11355 10037 4589 3643 3261 2551 5394 3474 4042 2661
15208B661k417J68N300p603m774j395J515M65P79j070q76P426O481o362n91l513
$$ 2661 244 412 5712 -1891 -6665 -8060 -6545 -6080 -5301 -6371 -7247 179 6660 298 -293 -3806
15192c806J185N456K673m958k161k179P474R37L182k391l387J931O458m100q862
$$ -3806 -2621 2835 5508 550 -1611 -3790 3684 4621 7803 5412 2025 3956 10414 6314 -2548
15177b548l062O017l009m056J41k385N07J046J75L291K908K403k576N43L704n237
$$ -2548 -5610 407 -2602 -6658 -6517 -8902 -8395 -7349 -7174 -3883 -975 1428 -1148 -605 3099 -2138
15161b138K836k321M218j06j386j386J336J966L8j865R652j387r617j0380n059
$$ -2138 698 -1623 2595 2489 1103 -283 1053 3019 3057 1192 10844 9457 -160 -10540 -15599
15146a5599L832N100k557k472M384Q195p02J474J160O101M95j0564L95K166O58
$$ -15599 -11767 -6667 -9224 -11696 -7312 883 181 1655 2815 8916 9411 -1153 -758 1408 2066
15131B066o401r121q96K080k016m804K273r16l383N628O23O187M494K190M382
$$ 2066 -4335 -13456 -14352 -12272 -14288 -19092 -16819 -17735 -21118 -15490 -14867 -8680 -4186 -1996 2386
15116B386m38k236o597l583J3236P322q592n924O943L396l945k986K331k189L17
$$ 2386 1948 -288 -6885 -10468 2768 10090 1498 -4426 2517 5913 1968 -1018 1313 -876 -559
15101e59R693k081j993p16J946l218J634N675l317p099m585L54J650L165j809
$$ -559 9134 7053 5060 4344 6290 3072 4706 10381 7064 -35 -4620 -4266 -2616 549 -1260
15086a260J890K861L403K804r37k61k292J989l316p318j959J157O427R342j289
$$ -1260 630 3491 6894 9698 8761 8500 6208 8197 4881 -2437 -4396 -3239 3188 12530 11241
15071A1241n067R95l702m75J686K58Q89R12k795M173l585p160k033L235L106m55
$$ 11241 6174 7169 3467 2992 4678 4936 5825 6737 3942 8115 4530 -2630 -4663 -1428 1678 1223
15055A223m136l882j297L398K037j578K050l646j310O713P68m068J258O96L600
$$ 1223 -2913 -6795 -8092 -4694 -2657 -4235 -2185 -5831 -7141 -428 340 -3728 -2470 -1774 1826
15040A826O2j533m938m496M815K081K592j706j0448l70K815J329J330q21K357
$$ 1826 1888 355 -4583 -9079 -4264 -2183 409 -1297 -11745 -12115 -9300 -7971 -6641 -7462 -5105
15025e105O410P759q927k464L46J634J932m88J173q145o070j650l750K131J1434
$$ -5105 1305 9064 137 -2327 -1981 -347 1585 1097 2270 -5875 -11945 -13595 -17345 -15214 -3780
15010c780J0296n766p877M665L929q951J797J716k199L439j780M164N896M448
$$ -3780 6516 750 -7127 -2462 1467 -7484 -5687 -3971 -6170 -2731 -4511 -347 5549 9997
14996I997q355J513J530j116k140r876j0377k28K590P393J601j836P655L738O329
$$ 9997 1642 3155 4685 3569 1429 -8447 -18824 -19052 -16462 -9069 -7468 -9304 -1649 2089 8418
14981H418K893k050J233n32j693k267q97m446j0116P07M528m59l897o09K700J332
$$ 8418 11311 9261 10494 9962 8269 6002 5105 659 -9457 -8750 -4222 -4681 -8578 -9187 -6487 -5155
14965e155J387J544M620K464O37J057J384n657m960k292K283J077N070K355n237
$$ -5155 -3768 -2224 2396 4860 5497 6554 7938 2281 -2679 -4971 -2688 -1611 3459 5814 577
14950E77l663J466L195n654q091M491N162L32n859k346l734R94P150j314N00k850
$$ 577 -3086 -1620 1575 -4079 -12170 -7679 -2517 -2185 -8044 -10390 -14124 -13130 -5980 -7294 -6794 -9644
14934i644K167m635J997P276O973J60m410k667m82Q07k75k547N1O68j79l91J779
$$ -9644 -7477 -12112 -10115 -2839 4134 4294 -116 -2783 -3265 -2458 -2733 -5280 -5229 -4561 -4740 -5131 -3352
14917c352l910l382K761m000l427J554N094j338O301L498n509o68N355l56m790
$$ -3352 -7262 -10644 -7883 -11883 -15310 -13756 -8662 -10000 -3699 -201 -5710 -6378 -1023 -1379 -6169
14902f169m088N80J0015M425k737R0k385j936k96p97M32q51n300L619J082n566
$$ -6169 -10257 -9677 338 4763 2026 2116 -269 -2205 -2501 -3298 -2866 -3717 -9017 -5398 -4316 -9882
14886i882K01L00j551O645N899N1l86Q45q44O51J157K427j863L308J781O112n252
$$ -9882 -9681 -9381 -10932 -4287 1612 1663 1277 2122 1278 1929 3086 5513 3650 6958 8739 14851 9599
14869I599q289K081k269m677m118R49K710j393p71R3O4K212k328O30L759m906
$$ 9599 1310 3391 1122 -3555 -7673 -6724 -4014 -5407 -6178 -6085 -6021 -3809 -6137 -5507 -1748 -6654
14853f654n860l988J1509K320L058L885M485n576o863k492j6K126L0j277Q699
$$ -6654 -12514 -16502 -4993 -2673 385 4270 8755 3179 -3684 -6176 -6192 -4066 -4036 -5313 3386
14838C386Q073l412n622k787K60L285L332n98m635m176J455m892k743L201o277
$$ 3386 11459 8047 2425 -362 -102 3183 6515 5917 1282 -2894 -1439 -6331 -9074 -5873 -12150
14823a2150k972m117O577J3631N844o587k774m978j637P035n631k75R72L507j224
$$ -12150 -15122 -19239 -12662 969 6813 226 -2548 -7526 -9163 -2128 -7759 -8034 -7062 -3555 -4779
14808d779q295k603l091J1460L813M087J612j100l00q741n654M796J256j324l18
$$ -4779 -13074 -15677 -18768 -7308 -3495 592 2204 1104 804 -7937 -13591 -8795 -7539 -8863 -9181
14793i181k56n622k273M661P114J858l374Q919M838k050n253p20J792K369l998
$$ -9181 -9437 -15059 -17332 -12671 -5557 -3699 -7073 1846 6684 4634 -619 -1339 453 2822 -1176
14778a176m971L772O14M34L603j35k311K10J248k348l837K189o311j970P680K930
$$ -1176 -6147 -2375 -1761 -1327 2276 2141 -170 40 1288 -1060 -4897 -2708 -9019 -10989 -3309 -379
14762c79L582j93o838k27J134j574O707k177m430M598r41p49K884J650l621n015
$$ -379 3203 3010 -3828 -4055 -2921 -4495 2212 35 -4395 203 -738 -1487 1397 3047 -574 -5589
14746e589o83n64M631o395l764P3n331l455N567Q932O37J641o744J345M535j97
$$ -5589 -6272 -6836 -2205 -8600 -12364 -12291 -17622 -21077 -15510 -6578 -5941 -4300 -11044 -9699 -5164 -5361
14730e361M788q53p25l562L639m062K137N674n568k728N743o84m476J10R254J037
$$ -5361 -573 -1426 -2151 -5713 -2074 -6136 -3999 1675 -3893 -6621 -878 -1562 -6038 -5928 3326 4363
14714D363l196K777J289j005o675j239P266l204j253K718l321m043O88k320l891
$$ 4363 1167 3944 5233 4228 -2447 -3686 3580 376 -877 1841 -1480 -5523 -4835 -7155 -11046
14699a1046k746l19J0624M71j138L844K871j058k69L999k234O111L184m230n457
$$ -11046 -13792 -14111 -3487 -3016 -4154 -310 2561 1503 1234 5233 2999 9110 12294 8064 2607
14684B607L047r6l516K995k901m399K426n233m628j063L174Q155N107j163j502
$$ 2607 5654 5558 2042 5037 2136 -2263 163 -5070 -9698 -10761 -7587 568 5675 4512 3010
14669C010k128p932k450J628J702K421K381L780q00k418o5j43L143j861j84M272
$$ 3010 882 -7050 -9500 -7872 -6170 -3749 -1368 2412 1612 -806 -871 -1014 2129 268 84 4356
14653D356m611l404l291Q46M328m534L24J0884L934p135r066k286R000N313L16
$$ 4356 -255 -3659 -6950 -6104 -1776 -6310 -5986 4898 8832 1697 -7369 -9655 -655 4658 4974
14638D974L063j500j97n640m087O78k312L419m50Q21K497j571M983j94k44k140
$$ 4974 8037 6537 6340 700 -3387 -2709 -5021 -1602 -2052 -1231 1266 -305 4678 4484 4240 2100
14622B100K318q128l629j67j926j627L725r312j53J767j516L447L675n070k56
$$ 2100 4418 -3710 -7339 -7506 -9432 -11059 -7334 -16646 -16799 -15032 -16548 -13101 -9426 -14496 -14752
14607a4752R538Q256n787n669N584l492K161k085K574M969j470k642K202M328
$$ -14752 -5214 3042 -2745 -8414 -2830 -6322 -4161 -6246 -3672 1297 -173 -2815 -613 3715
14593C715l096n592j109J160K924k952J571j356o214M141J645L176K728K354n155
$$ 3715 619 -4973 -6082 -4922 -1998 -4950 -3379 -4735 -10949 -6808 -5163 -1987 741 3095 -2060
14578b060K723J51l571n79L628j949j051k672m311m819L987L619J832Q451K511
$$ -2060 663 814 -2757 -3336 292 -1657 -2708 -5380 -9691 -14510 -10523 -6904 -5072 3379 5890
14563E890k222J414k419k94k707n98J982n817M852n16k209J380j590p648K726
$$ 5890 3668 5082 2663 2369 -338 -936 1046 -4771 81 -435 -2644 -1264 -2854 -10502 -7776
14548g776P834L397k689k826l64p20J893m820n823J634O411r80P526j096p236
$$ -7776 58 3455 766 -2060 -2424 -3144 -1251 -6071 -11894 -10260 -3849 -4829 2697 1601 -5635
14533e635M84N794M719j788r531k853j07M684k81m60N62L737p83q73n14Q133M319
$$ -5635 -5151 643 5362 3574 -5957 -8810 -8917 -4233 -4514 -4974 -4412 -675 -1458 -2331 -2845 5288 9607
14516I607j0757j238N287Q04k964j253l306o47j1M650J857j055n567o842L044
$$ 9607 -1150 -2388 2899 3703 739 -514 -3820 -4467 -4478 172 2029 974 -4593 -11435 -8391
14501h391N701k97N669K174n791n022L689K559p119J011N936L665j148k071n90
$$ -8391 -2690 -2987 2682 4856 -935 -5957 -2268 291 -6828 -5817 119 3784 2636 565 -25
14486b5l027n117l357j948L588K257m126n607m054K716Q189M682N259K05l385
$$ -25 -3052 -8169 -11526 -13474 -9886 -7629 -11755 -17362 -21416 -18700 -10511 -5829 -570 -365 -3750
14471c750m408O59O294j996r405M988O111j128o986j995R915M793j328M332m22
$$ -3750 -8158 -7499 -1205 -3201 -12606 -7618 -1507 -2635 -9621 -11616 -1701 3092 1764 6096 5674
14456E674J53j655K626l759q50q695o933K391Q292J655n147l0j247K429r55P78
$$ 5674 5827 4172 6798 3039 2189 -6506 -13439 -11048 -2756 -1101 -6248 -6278 -7525 -5096 -6051 -5273
14440e273K801J881J511o208K349P76J605K219R09p380k802k600n949N014Q636
$$ -5273 -2472 -591 920 -5288 -2939 -2163 -558 1661 2570 -4810 -7612 -10212 -16161 -11147 -2511
14425b511K849M190K629L438n579j982P53o078j924M074J387r74k934n628k818
$$ -2511 338 4528 7157 10595 5016 3034 3787 -2291 -4215 -141 1246 272 -2662 -8290 -11108
14410a1108r79m870N41O864L201J796k550l51N342R292K630o480j091l686k764
$$ -11108 -12087 -16957 -16416 -9552 -6351 -4555 -7105 -7456 -2114 7178 9808 3328 2237 -1449 -4213
14395d213o195j572L272J050j01l731m42m940L375J874M784j03l86j107J785J620
$$ -4213 -10408 -11980 -8708 -7658 -7759 -11490 -11932 -16872 -13497 -11623 -6839 -6942 -7328 -8435 -6650 -5030
14379e030r68p70O460M77j683Q807J075n310J48m385L563l807N19j314n22l481
$$ -5030 -5998 -6768 -308 169 -1514 7293 8368 3058 3206 -1179 2384 -1423 -904 -2218 -2740 -6221
14363f221m79P42P157P196J701n546j0956k560P750M367l639J404n762l274Q096
$$ -6221 -6700 -5958 1199 8395 10096 4550 -6406 -8966 -1216 3151 -488 916 -4846 -8120 -24
14348b4l567N062L138l278M71j040n40m057p562O869O068l287O27Q075j800o934
$$ -24 -3591 1471 4609 1331 1802 762 222 -3835 -11397 -4528 1540 -1747 -1120 6955 5155 -1779
14332a779m59j95J527k907p71l874M688K373l78k034k932j228K135K288o39k338
$$ -1779 -2238 -2433 -906 -3813 -4584 -8458 -3770 -1397 -1775 -3809 -6741 -7969 -5834 -3546 -4185 -6523
14316f523J606P402o024j696M325L596m220k75O297K696r90j952M526p838m34
$$ -6523 -4917 2485 -3539 -5235 -910 2686 -1534 -1809 4488 7184 6194 4242 8768 930 496
14301D96J310J445j565l467K643J993l252k980o601L47J0586N733l448J441O45
$$ 496 1806 3251 1686 -1781 862 2855 -397 -3377 -9978 -9631 955 6688 3240 4681 5326
14286E326L40N481j2867n401R70M50k885N958L365j989L59l943P67M96j31L788
$$ 5326 5666 11147 -1720 -7121 -6151 -5701 -8586 -2628 737 -1252 -893 -4836 -4069 -3573 -3704 84
14270H4L580j438j470j140j149m749L13k921J043q56k112J213J0647Q540j142
$$ 84 3664 2226 756 -384 -1533 -6282 -5969 -8890 -7847 -8703 -10815 -9602 1045 9585 8443
14255H443n838o110q286k805K107J493M464L000j441L691K494k076K973k032n734
$$ 8443 2605 -3505 -11791 -14596 -12489 -10996 -6532 -3532 -4973 -1282 1212 -864 2109 77 -5657
14240e657l441P932M69p281P750K007j713J0530M82r995K07M311J125k438M281
$$ -5657 -9098 -1166 -697 -7978 -228 1779 66 10596 11078 1083 1290 5601 6726 4288 8569
14225H569R241N092r43m3J247o275j3544o362L04N138J173l640m32J140R20O457
$$ 8569 17810 22902 21959 21916 23163 16888 3344 -3018 -2714 2424 3597 -43 -475 665 1585 8042
14209H042J748L538k257q979j250k434q51M870k427L38o097K78k838L670K300
$$ 8042 9790 13328 11071 2092 842 -1592 -2443 2427 0 338 -5759 -5481 -8319 -4649 -2349
14194b349J770M513R01o462n268K568N385J599O2K261k472m54p425J063J253j404
$$ -2349 -579 3934 4835 -1627 -6895 -4327 1058 2657 2719 4980 2508 2054 -5371 -4308 -3055 -4459
14178d459k720P558O711k730m134K103j486m601k360M989J957n544J132K69p380
$$ -4459 -7179 379 7090 4360 226 2329 843 -3758 -6118 -1129 828 -4716 -3584 -3315 -10695
14163a0695J326K069J0201J912j587m470o324l831N721j599R39N837M926k107
$$ -10695 -9369 -7300 2901 4813 3226 -1244 -7568 -11399 -5678 -7277 -6338 -501 4425 2318
14149B318l944R1j016j254J086n224k375M330J692M031L656M335l838o412o289
$$ 2318 -1626 -1535 -2551 -3805 -2719 -7943 -10318 -5988 -4296 -265 3391 7726 3888 -2524 -8813
14134h813j686l347P415Q71l634o609J0552L530j336n81j164J172K809Q55J84
$$ -8813 -10499 -13846 -6431 -5560 -9194 -15803 -5251 -1721 -3057 -3638 -4802 -3630 -821 34 218
14119B18l604j734J554M324L499Q31N16m324q96k323Q24q0L357l816m638m726
$$ 218 -3386 -5120 -3566 758 4257 5088 5604 1280 384 -1939 -1115 -1195 2162 -1654 -6292 -11018
14103a1018j96N453K533M518k243p916l359J261J800M81j479o163k138M144O988
$$ -11018 -11214 -5761 -3228 1290 -953 -8869 -12228 -10967 -9167 -8686 -10165 -16328 -18466 -14322 -7334
14088g334L349L622K19K859K994J627m191l202l509n000M148J575J723m97M533
$$ -7334 -3985 -363 -144 2715 5709 7336 3145 -57 -3566 -8566 -4418 -2843 -1120 -1617 2916
14073B916O88j140M151K770r48j1841q31J274m22M545o334n694P24l584L777J0997
$$ 2916 3604 2464 6615 9385 8437 -3404 -4235 -2961 -3383 1162 -5172 -10866 -10142 -13726 -9949 1048
14057A048M939K552O67O97n550m422o405m371Q841P422J450N20p797p370K927
$$ 1048 5987 8539 9206 9903 4353 -69 -6474 -10845 -2004 5418 6868 7388 -409 -7779 -4852
14042d852L486l608j114L194m617K881M0O66J841n671j883o27K692r82k966o229
$$ -4852 -1366 -4974 -6088 -2894 -7511 -4630 -4590 -3924 -2083 -7754 -9637 -10264 -7572 -8554 -11520 -17749
14026a7749K035O356M183L501J253m65o678q609K421M250J630m920K69P080N239
$$ -17749 -15714 -9358 -5175 -1674 -421 -886 -7564 -16173 -13752 -9502 -7872 -12792 -12523 -5443 -204
14011b04o18l306l81L26o38K410J82l799J188l33O326M423K998j14o460q78J621
$$ -204 -822 -4128 -4509 -4183 -4821 -2411 -2229 -6028 -4840 -5173 1153 5576 8574 8460 2000 1122 2743
13994B743O4p074K605J115p473l336l951j879K176O522P519N202L134k360k214
$$ 2743 2807 -4267 -1662 -547 -8020 -11356 -15307 -17186 -15010 -8488 -969 4233 7367 5007 2793
13979B793n61o279L05M609K195k609K71j502J931j57K011K10R58O145P364j2394
$$ 2793 2232 -4047 -3742 867 3062 453 724 -778 1153 996 3007 3217 4175 10320 17684 5290
13963E290p495N471l830n618J373R648j231k191L000K379l232j543J536o385l480
$$ 5290 -2205 3266 -564 -6182 -4809 4839 3608 1417 4417 6796 3564 2021 3557 -2828 -6308
13948f308o057M004N472k628j380K607k072m781N463L480k645O848L713j117j969
$$ -6308 -12365 -8361 -2889 -5517 -6897 -4290 -6362 -11143 -5680 -2200 -4845 2003 5716 4599 2630
13933B630k312k771M848J143J411N07k488n773N37L463L474L077n066l144k583
$$ 2630 318 -2453 2395 3538 4949 5456 2968 -2805 -2268 1195 4669 7746 2680 -464 -3047
13918c047K716J019j090j616L04K982m499p244K791J634n953k366L624Q312O692
$$ -3047 -331 688 -402 -2018 -1714 1268 -3231 -10475 -7684 -6050 -12003 -14369 -10745 -2433 4259
13903D259J195j853k485m593j306O372l198P521k814N855P5m168j070O384K12
$$ 4259 5454 3601 1116 -3477 -4783 1589 -1609 5912 3098 8953 9028 4860 3790 10174 10386
13888A0386O40o375l030j0728L526R401m160q456N668O247J331l542l33j185L06
$$ 10386 11026 4651 1621 -9107 -5581 3820 -340 -8796 -3128 3119 4450 908 575 -610 -304
13873c04k155J711R702N523m862j6256m492M091L813k997m724N408n71l301k431
$$ -304 -2459 -748 8954 14477 9615 -6641 -11133 -7042 -3229 -6226 -10950 -5542 -6113 -9414 -11845
13858a1845R104K77k364K143O784L618k302l860j049j68m08j980N235j81m837
$$ -11845 -2741 -2464 -4828 -2685 4099 7717 5415 1555 506 338 -70 -2050 3185 3004 -1833
13843a833N55K060N526L341Q93j078m562P55R25k733J026j965o517M115K45l884
$$ -1833 -1278 782 6308 9649 10542 9464 4902 5657 6582 3849 4875 2910 -3607 508 753 -3131
13827c131L74p54K364K575R834O528k89o345k091l021m381k905j822k1L402l834
$$ -3131 -2757 -3511 -1147 1428 11262 17790 17501 11156 9065 6044 1663 -1242 -3064 -3085 317 -3517
13811c517m776m464Q47Q108L191J242L038m650o868K812k547J232M021m63l218
$$ -3517 -8293 -12757 -11910 -3802 -611 631 3669 -981 -7849 -5037 -7584 -6352 -2331 -2794 -6012
13796f012K002K685k131L42R684N424j0487j1444j482j195L377K595J997L922
$$ -6012 -4010 -1325 -3456 -3114 6570 11994 1507 -9937 -11419 -12614 -9237 -6642 -4645 -723
13782g23m990p337l251O748M071m515l182M644P014j541M258J227o153o36n863
$$ -723 -5713 -13050 -16301 -9553 -5482 -9997 -13179 -8535 -1521 -3062 1196 2423 -3730 -4366 -10229
13767a0229K485N286K600k730K303j397N183J852j303m262m432l968L257k752
$$ -10229 -7744 -2458 142 -2588 -285 -1682 3501 5353 4050 -212 -4644 -8612 -5355 -8107
13753h107N063L138J019r36n854n163K024Q91J413R21K303k370J200L094P992
$$ -8107 -3044 94 1113 177 -5677 -10840 -8816 -7925 -6512 -5591 -3288 -5658 -4458 -1364 6628
13738F628j249K479J360q311l024j5K079K528L596K34o28J686o585k614j284p63
$$ 6628 5379 7858 9218 907 -2117 -2132 -53 2475 6071 6305 5677 7363 778 -1836 -3120 -3883
13722c883J724K994k355o94M552N210j765k659R03m870o823M986L728r92P72k469
$$ -3883 -2159 835 -1520 -2214 2338 7548 5783 3124 4027 -843 -7666 -2680 1048 56 828 -1641
13706a641o29n436l122L245J359j771P969j681l793J294R93nj418K483o32n613
$$ -1641 -2270 -7706 -10828 -7583 -6224 -7995 -26 -1707 -5500 -4206 -3213 -3218 -4636 -2153 -2785 -8398
13690h398K830M453L118J408O565o794p954j039l262j239M931O162l52n973J211
$$ -8398 -5568 -1115 2003 3411 9976 3182 -4772 -5811 -9073 -10312 -5381 781 429 -5544 -4333
13675d333l4q036K866P195O42k61q4J503K495q814J266P451M599m818r486l674
$$ -4333 -4367 -12403 -9537 -2342 -1700 -1961 -2045 -542 1953 -6861 -5595 1856 6455 1637 -7849 -11523
13659a1523k454J610N798N289N108N02o509M719M330O466n133p891k342L088l618
$$ -11523 -13977 -12367 -6569 -1280 3828 4330 -2179 2540 6870 13336 8203 312 -2030 1058 -2560
13644b560K420J464l57l911j677J092j178J824J837L27J28l230n094M546J009
$$ -2560 -140 1324 967 -2944 -4621 -3529 -4707 -2883 -1046 -719 -591 -3821 -8915 -4369 -3360
13629c360P10j413j448K222l027K022r45l254O664J542j711J165J980N191J160
$$ -3360 -2650 -4063 -5511 -3289 -6316 -4294 -5239 -8493 -1829 -287 -1998 -833 1147 6338 7498
13614G498j55m190l560j452p157n004L159M055J425j682J370K863L586K11m528
$$ 7498 7343 3153 -407 -1859 -9016 -14020 -10861 -6806 -5381 -7063 -5693 -2830 756 967 -3561
13599c561k672j606O072N534q523q58L824j221l313J109M566m94k253N35k926
$$ -3561 -6233 -7839 -1767 3767 -4756 -5614 -1790 -3011 -6324 -5215 -649 -1143 -3396 -2861 -5787
13584e787k776LL280n626l739N308L202M090p19J587j00o079M144j303j068l027
$$ -5787 -8563 -8560 -5280 -10906 -14645 -9337 -6135 -2045 -2764 -1177 -1277 -7356 -3212 -4515 -5583 -8610
13568h610k069r49j558k752K241Q36J755N64K24J895K214M677J612n757k453k603
$$ -8610 -10679 -11628 -13186 -15938 -13697 -12861 -11106 -10542 -10318 -8423 -6209 -1532 80 -5677 -8130 -10733
13552a0733J647M415L211P32l816j857R39Q331l063q880J907L864J172K167r043
$$ -10733 -9086 -4671 -1460 -728 -4544 -6401 -5462 2869 -194 -9074 -7167 -3303 -2131 36 -9007
13537i007L146M760Kr468k72R018J694l064j667N12K472o384l389L743R1o009
$$ -9007 -5861 -1101 -1099 -10567 -10839 -1821 -127 -3191 -4858 -4346 -1874 -8258 -11647 -7904 -7813 -13822
13521a3822L007K684n28K116N834k003K342p7r48L172K030O15n68M903j500j040
$$ -13822 -10815 -8131 -8659 -6543 -709 -2712 -370 -447 -1395 1777 3807 4422 3854 8757 7257 6217
13505F217M79J772k713o745j0958q499j039O872N428q5L759M509k385l682m478
$$ 6217 6696 8468 5755 -990 -11948 -20447 -21486 -14614 -9186 -9271 -5512 -1003 -3388 -7070 -11548
13490a1548n095O195Q123M793k554j691k691K83J2087Q214q573j0255j173P11
$$ -11548 -16643 -10448 -2325 2468 -86 -1777 -4468 -4185 7902 16116 7543 -2712 -3885 -3174
13476c174j979m27l753L833m73o485k67J266M090Q360p30k009L060j561j377R82
$$ -3174 -5153 -5580 -9333 -5500 -5973 -12458 -12725 -11459 -7369 991 261 -1748 1312 -249 -1626 -644
13460f44m083o437K416P067Q688M035K74m303J330n117n895j23J072j707L774
$$ -644 -4727 -11164 -8748 -1681 7007 11042 11316 7013 8343 3226 -2669 -2792 -1720 -3427 347
13445C47n62J617O60P874o116p260l695l019J549O120Q145M169j1065n217R422
$$ 347 -215 1402 2062 9936 3820 -3440 -7135 -10154 -8605 -2485 5660 9829 -1236 -6453 2969
13430B969l052k118l159n57j049m06K745N63n532l387r10k070j596m379Q855N532
$$ 2969 -83 -2201 -5360 -5917 -6966 -7372 -4627 -4064 -9596 -12983 -13893 -15963 -17559 -21938 -13083 -7551
13414g551Q18K268K980p737N00K132L424N877N62q658q861L476J519M375J0157
$$ -7551 -6733 -4465 -1485 -9222 -8722 -6590 -3166 2711 3273 -5385 -14246 -10770 -9251 -4876 5281
13399E281m178m617m03L129k558M2j142l704j541o40p80Q609O385j697J865k270
$$ 5281 1103 -3514 -3917 -788 -3346 -3304 -4446 -8150 -9691 -10331 -11111 -2502 3883 2186 4051 1781
13383A781J59K145K112k010Q36m577l469n400l86J729M464k841j569J954K223
$$ 1781 1940 4085 6197 4187 5023 446 -3023 -8423 -8809 -7080 -2616 -5457 -7026 -5072 -2849
13368b849J069l963n638L536J081m77J28J258o35n01j55J919p70j624L920m62
$$ -2849 -1780 -5743 -11381 -7845 -6764 -7241 -7113 -5855 -6490 -6991 -7146 -5227 -5997 -7621 -3701 -4163
13352d163l639k214L175L295N801P08o047j299q64J373M037k909k087M253k239
$$ -4163 -7802 -10016 -6841 -3546 2255 2963 -3084 -4383 -5247 -3874 163 -2746 -4833 -580 -2819
13337b819n876m174M9N111O669o28n126l679N102J809n357J935N553K939K68q04
$$ -2819 -8695 -12869 -12820 -7709 -1040 -1668 -6794 -10473 -5371 -3562 -8919 -6984 -1431 1508 1776 972
13321I72j236l650o715m67J699k561L419O861J245r79k23O57K980q200m839J132
$$ 972 -264 -3914 -10629 -11096 -9397 -11958 -8539 -1678 -433 -1412 -1635 -978 2002 -6198 -11037 -9905
13305i905L917O387J536J523r32K042j497o122j568M511K122q77j42J548k68K817
$$ -9905 -5988 399 1935 3458 2526 4568 3071 -3051 -4619 -108 2014 1137 995 2543 2275 5092
13289E092l627n314n217K577M923l696M310L571k559N163o058l276k909L649j21
$$ 5092 1465 -3849 -9066 -6489 -1566 -5262 -952 2619 60 5223 -835 -4111 -7020 -3371 -3492
13274c492j302Q39M029k956k410K988J359K170J200R5n79p486k179J834N56j333
$$ -3492 -4794 -3955 74 -2882 -5292 -2304 -945 1225 2425 2520 1941 -5545 -7724 -5890 -5334 -6667
13258f667k62L722l055N00M76j65l521L93L845P051K795m316m259k098n055N160
$$ -6667 -6929 -3207 -6262 -5762 -5286 -5451 -8972 -8579 -4734 2317 5112 796 -3463 -5561 -10616 -5456
13242e456N324J007o728j505M900N339K888L314R42q496m168j677m956k0K764
$$ -5456 -132 875 -5853 -7358 -2458 2881 5769 9083 10025 1529 -2639 -4316 -9272 -9292 -6528
13227f528J539L779K608l313o621L823J939M289N094n258q392k51m176j536O330
$$ -6528 -4989 -1210 1398 -1915 -8536 -4713 -2774 1515 6609 1351 -7041 -7292 -11468 -13004 -6674
13212f674K204j280o436K433Q108k213p015j393P846K302n58j241j716L579n80
$$ -6674 -4470 -5750 -12186 -9753 -1645 -3858 -10873 -12266 -4420 -2118 -2676 -3917 -5633 -2054 -2634
13197b634j654n306L607O77J341N441J911q362o985l219L70N580Q163K566J557
$$ -2634 -4288 -9594 -5987 -5310 -3969 1472 3383 -4979 -11964 -15183 -14813 -9233 -1070 1496 3053
13182C053L553l8L02L049J447m034l290l198J233K625o613q783N53M144m905N30
$$ 3053 6606 6568 6870 9919 11366 7332 4042 844 2077 4702 -1911 -10694 -10141 -5997 -10902 -10372
13166a0372L839m268k655P423R619M741o01k164k772k190k47o436m773m675P01
$$ -10372 -6533 -10801 -13456 -6033 3586 8327 7726 5562 2790 600 353 -6083 -10856 -15531 -14830
13151a4830O143O715J784j659J541l531n435j909N240J476M013O606k971r610
$$ -14830 -8687 -1972 -188 -1847 -306 -3837 -9272 -11181 -5941 -4465 -452 6154 3183 -6427
13137f427n089K618J229o16q0M929k45k440l085L037R129R696r61L21o11n888
$$ -6427 -11516 -8898 -7669 -8285 -8365 -3436 -3681 -6121 -9206 -6169 2960 12656 11695 12016 11405 5517
13121E517n856L854j465K548k990l356J238K567j015N532l554p792J84K123m966
$$ 5517 -339 3515 2050 4598 1608 -1748 -510 2057 1042 6574 3020 -4772 -4588 -2465 -7431
13106g431J762N53M145m246p02l137J0970J654M25o158l22L001J087L162L986
$$ -7431 -5669 -5116 -971 -5217 -5919 -9056 1914 3568 3993 -2165 -2487 514 1601 4763 8749
13091H749m776q170K987k89j852J0537l902J269O97k448n45O888Q18j283r102
$$ 8749 3973 -4197 -1210 -1499 -3351 7186 3284 4553 5250 2802 2257 9145 9963 8680 -422
13076d22K260m25N993L979l89k802n231j651l22l469J07j027j471K220m304k912
$$ -422 1838 1413 7406 11385 10996 8194 2963 1312 990 -2479 -2372 -3399 -4870 -2650 -6954 -9866
13060i866n00L186j877M832K870k124k952K464J004k871p03q561L298M503L821
$$ -9866 -10366 -7180 -9057 -4225 -1355 -3479 -6431 -3967 -2963 -5834 -6537 -15098 -11800 -7297 -3476
13045c476J089L383J359K325J510J807p670o783m82P88M437m055M002L727q27
$$ -3476 -2387 996 2355 4680 6190 7997 327 -6456 -6938 -6150 -1713 -5768 -1766 1961 1134
13030A134m587j741j25J526m394k320R87l742O446N694K068l099m74M535J688
$$ 1134 -3453 -5194 -5319 -3793 -8187 -10507 -9520 -13262 -6816 -1122 946 -2153 -2627 1908 3596
13015C596K982K220n676n935l53O8J18j226l457J753J268Q33k367J784K206J928
$$ 3596 6578 8798 3122 -2813 -3166 -3098 -2980 -4206 -7663 -5910 -4642 -3809 -6176 -4392 -2186 -258
12999b58j809m578L413O016K27M438J732n561K442p137j869p103o931N984Q191
$$ -258 -2067 -6645 -3232 2784 3011 7449 9181 3620 6062 -1075 -2944 -10047 -16978 -10994 -2803
12984b803J0643K218j1688p554O138K540k728L71M330m629l123P13j403l26L479
$$ -2803 7840 10058 -1630 -9184 -3046 -506 -3234 -2863 1467 -3162 -6285 -5572 -6975 -7301 -3822
12969c822r15n37M744M235L838j768n123N417k004n553k900j781n579o74J487
$$ -3822 -4737 -5274 -530 3705 7543 5775 652 6069 4065 -1488 -4388 -6169 -11748 -12422 -10935
12954a0935K937Q695Q888l360m113l454j563j580m601m113l998N718L158M402
$$ -10935 -7998 697 9585 6225 2112 -1342 -2905 -4485 -9086 -13199 -17197 -11479 -8321 -3919
12940c919P162O288k024j543n57Q44J259N04k163m698m867K872K882L086Q61K939
$$ -3919 3243 9531 7507 5964 5407 6251 7510 8014 5851 1153 -3714 -842 2040 5126 5987 8926
12924H926L102p723m422J012J201k753M30O433l361l221L922n71m062j212n975
$$ 8926 12028 4305 -117 895 2096 -657 -227 6206 2845 -376 3546 2975 -1087 -2299 -8274
12909h274L80N648L901L207k870k157k266L120K735k261K824m059o993M704M135
$$ -8274 -7894 -2246 1655 4862 1992 -165 -2431 689 3424 1163 3987 -72 -7065 -2361 1774
12894A774j846k333k215j984J0146M617n770o311k56o604L895P810N842l723j753
$$ 1774 -72 -2405 -4620 -6604 3542 8159 2389 -3922 -4178 -10782 -6887 923 6765 3042 1289
12879A289j929n657m07K947m910J640q80j845N001N649M99L97j179N74l419J601
$$ 1289 -640 -6297 -6704 -3757 -8667 -7027 -7907 -9752 -4751 898 1397 1794 615 1189 -2230 -629
12863f29k111k094M74n499Q083k164n701L575N320K445M030r514m233O328M4k118
$$ -629 -2740 -4834 -4360 -9859 -1776 -3940 -9641 -6066 -746 1699 5729 -3785 -8018 -1690 -1646 -3764
12847c764m537m228L619Q933m110j525l16K91j718N265J367K317J237N511Q49
$$ -3764 -8301 -12529 -8910 23 -4087 -5612 -5928 -5637 -7355 -2090 -723 1594 2831 8342 9191
12832I191o105l942o289O261J271j0077n182L460J0746J301o322J746M585n374
$$ 9191 3086 -856 -7145 -884 387 -9690 -14872 -11412 -666 635 -5687 -3941 644 -4730
12818d730l01M295l677M727j791M482k36M057L033k565m973m237L066L036O985
$$ -4730 -5031 -736 -4413 314 -1477 3005 2769 6826 9859 7294 2321 -1916 1150 4186 11171
12803A1171k915p194m329j131N66K174J327N93J053L423j288L401q936k416P05
$$ 11171 8256 1062 -3267 -4398 -3832 -1658 -331 262 1315 4738 3450 6851 -2085 -4501 -3796
12788c796k413l336J421n003L365L455P485P916J266j621l539L096L437l052n240
$$ -3796 -6209 -9545 -8124 -13127 -9762 -6307 1178 9094 10360 8739 5200 8296 11733 8681 3441
12773C441n466j49p898N51O185L685n40j515J55M136L428j1894l397J0352m45
$$ 3441 -2025 -2174 -10072 -9521 -3336 349 -191 -1706 -1551 2585 6013 -5881 -9278 1074 629
12758F29o97K351k899o352j2677J540P929L473P463M643k657m423J070j98m211
$$ 629 -68 2283 -616 -6968 -19645 -18105 -10176 -6703 760 5403 2746 -1677 -607 -805 -5016
12743e016J655J447j695J299M067R45k319j3731N362K079o77J455M074N94P08
$$ -5016 -3361 -1914 -3609 -2310 1757 2702 383 -13348 -7986 -5907 -6584 -5129 -1055 -461 247
12728B47j943m168L08M848N233m153k557R069M532M04n457K991j384k347q23q
$$ 247 -1696 -5864 -5556 -708 4525 372 -2185 6884 11416 11820 6363 9354 7970 5623 4800 4792
12712D792m982l019k700K781Q875n936j395K500O8L667K509n326j111k029m828
$$ 4792 -190 -3209 -5909 -3128 5747 -189 -1584 916 984 4651 7160 1834 723 -1306 -6134
12697f134j394o3m327M035R165n723m599l511O222J0101j096p190O17N573J27
$$ -6134 -7528 -7591 -11918 -7883 1282 -4441 -9040 -12551 -6329 3772 2676 -4514 -3897 1676 1803
12682A803j0414J89l090l116Q323N603L564k757j1589N833R940N840n918k644
$$ 1803 -8611 -8422 -11512 -14628 -6305 -702 2862 105 -11484 -5651 4289 10129 4211 1567
12668A567k688k609J575j493j464M838k815n460L773Q811o508j450O43k299L355
$$ 1567 -1121 -3730 -2155 -3648 -5112 -274 -3089 -8549 -4776 4035 -2473 -3923 -3280 -5579 -2224
12653b224n86J020J094k266L84L047K939L270K581J888m859q92j866J428K996
$$ -2224 -2810 -1790 -696 -2962 -2578 469 3408 6678 9259 11147 6288 5396 3530 4958 7954
12638G954K404r54n685O039J340L299p689o280M79o51K407k170k039j632m341
$$ 7954 10358 9404 3719 9758 11098 14397 6708 428 907 256 2663 493 -1546 -3178 -7519
12623g519q92J73N436M186O944J906k965j173m04m326j754L596K337J946o288
$$ -7519 -8411 -8238 -2802 1384 8328 10234 7269 6096 5692 1366 -388 3208 5545 7491 1203
12608A203M698N34q626n078N41j563L649R886J62J094K291N757K586K770N583
$$ 1203 5901 6435 -2191 -7269 -6728 -8291 -4642 5244 5406 6500 8791 14548 17134 19904 25487
12593B5487J0544R035j18j2080j2281j2332p338j44J433L877J697K346K780L256
$$ 25487 36031 45066 44948 32868 20587 8255 917 773 2206 6083 7780 10126 12906 16162
12579A6162q068J186K201O870o641l797L199r31k179K324r04K212M638K563r788
$$ 16162 8094 9280 11481 18351 11710 7913 11112 10181 8002 10326 9422 11634 16272 18835 9047
12564I047p505L643J0548J1495J4407J2906m96o787p258l337Q21j564M711J5611
$$ 9047 1542 5185 15733 27228 41635 54541 54045 47258 40000 36663 37484 35920 40631 56242
12550E6242J9949K2172J5959J2156L768k5048k8689j7447j1782o966n571o385
$$ 56242 76191 98363 114322 126478 130246 105198 76509 59062 47280 40314 34743 28358
12538B8358j5984j3238L832N003N227m1M497M306j946J523L756l313j45Q67Q4
$$ 28358 12374 -864 2968 7971 13198 13157 17654 21960 20014 21537 25293 21980 21835 22702 22786
12523B2786O86K364L782M795k828P762K8537K6674K7592J4391Q96p229k3260j5031
$$ 22786 23472 25836 29618 34413 31585 39347 67884 94558 122150 136541 137437 130208 106948 91917
12509I1917j5718r767R160Q743K2495K2562J7002N624j4767l0336k7130k6376
$$ 91917 76199 66432 75592 84335 106830 129392 146394 152018 137251 106915 79785 53409
12497E3409j1830q172n460q061m762P440K270O31p81l988k88J582n33k549q959
$$ 53409 41579 33407 27947 19886 15124 22564 24834 25465 24684 20696 20408 21990 21457 18908 9949
12482I949J41K715L093K069l273l7R044J0941J4020J6746J4519L1377K1661N985
$$ 9949 10090 12805 15898 17967 14694 14657 23701 34642 48662 65408 79927 111304 132965 138950
12468A38950j1249k9556k8461k2667j3087k843O345J0658J1929L904p053o743
$$ 138950 127701 98145 69684 47017 33930 31087 37432 48090 60019 63923 56870 50127
12456E0127r951j0130l558q744p354o883m055J568L882k975j531O65q2L814o33
$$ 50127 40176 30046 26488 17744 10390 3507 -548 1020 4902 1927 396 1061 979 4793 4160
12441D160m016O14J802k494M5L482M297N41K553M80P548k077J015R433O975J387
$$ 4160 144 758 2560 66 111 3593 7890 8431 10984 11464 19012 16935 17950 27383 34358 35745
12425C5745M673M146K934j3614j5468q357k43P15j792m576k043j901j308J067
$$ 35745 40418 44564 47498 33884 18416 10059 9816 10531 8739 4163 2120 219 -1089 -22
12411b2K007N107p281l847O999N008K919l638l696L216K015n200n570J380m930
$$ -22 1985 7092 -189 -4036 2963 7971 10890 7252 3556 6772 8787 3587 -1983 -603 -5533
12396e533j860O730L139M362q266n131M902J018M18J185N168J304r514q811m21
$$ -5533 -7393 -663 2476 6838 -1428 -6559 -1657 -639 -221 964 6132 7436 -2078 -10889 -11310
12381a1310K714j74K614J087K306r12M21P188J603j430j264K779K550k768m765
$$ -11310 -8596 -8770 -6156 -5069 -2763 -3675 -3254 3934 5537 4107 2843 5622 8172 5404 639
12366F39L549L033k083M40k001m00o154N161J979k128k18P03o38M313J595n071
$$ 639 4188 7221 5138 5578 3577 3177 -2977 2184 4163 2035 1817 2520 1882 6195 7790 2719
12350B719m279l979P053L830m684q807j582O42R6K978L18K607L090j932K309L674
$$ 2719 -1560 -5539 1514 5344 660 -8147 -9729 -9087 -8991 -6013 -5695 -3088 2 -1930 379 4053
12334D053K78m326o422M24K442M386J0226M459r72J081K712k396o802q919n085
$$ 4053 4331 5 -6417 -5993 -3551 835 11061 15520 14548 15629 18341 15945 9143 224 -4861
12319d861l95k244P78k214M188L36N058O291N88p496L243P140o997k771L964J35
$$ -4861 -5256 -7500 -6722 -8936 -4748 -4412 646 6937 7525 29 3272 10412 3415 644 4608 4743
12303D743k853K904m830M58k936j129O201l412l044K593J148o9r27m252n614L428
$$ 4743 1890 4794 -36 422 -2514 -3643 2558 -854 -3898 -1305 -157 -226 -1153 -5405 -11019 -7591
12287g591Q919M020j840r726L130k365n414m272P87J2674P69m266j443K195M345
$$ -7591 1328 5348 3508 -6218 -3088 -5453 -10867 -15139 -14352 -1678 -909 -5175 -6618 -4423 -78
12272g8j244J017J69N870K761O257n091j1239p523r90P900P054j861o543j079
$$ -78 -1322 -305 -136 5734 8495 14752 9661 -1578 -9101 -10091 -2191 4863 3002 -3541 -4620
12257d620Q23m794o489K555K913N713O55q70l823k216K721n078l441l461L553
$$ -4620 -3797 -8591 -15080 -12525 -9612 -3899 -3244 -4114 -7937 -10153 -7432 -12510 -15951 -19412 -15859
12242a5859M792L008M019K055J828O380Q701M106q781m374l784J205l903l107
$$ -15859 -11067 -8059 -4040 -1985 -157 6223 14924 19030 10249 5875 2091 3296 -607 -3714
12228c714O910L700l375k947J658j20j961K748n651k285M162L491J606J465J369
$$ -3714 3196 6896 3521 574 2232 2112 151 2899 -2752 -5037 -875 2616 4222 5687 7056
12213G056K459j1920l591R428M781K859j269M25k853o115j1363n492O057m556
$$ 7056 9515 -2405 -5996 3432 8213 11072 9803 10228 7375 1260 -10103 -15595 -9538 -14094
12199a4094l618L066M230l772L199Q726O16n68l342j0398K597M277k244L752N305
$$ -14094 -17712 -14646 -10416 -14188 -10989 -2263 -1647 -2215 -5557 -15955 -13358 -9081 -11325 -7573 -2268
12184b268j616r84N714k379l097M499P017O003j443m691j936r4R1l320m977k092
$$ -2268 -3884 -4868 846 -1533 -4630 -131 6886 12889 11446 6755 4819 4725 4816 1496 -3481 -5573
12168e573Q597m71l526J054k728K059K207n668j393J312m030J0680J657j329N164
$$ -5573 3024 2553 -973 81 -2647 -588 1619 -4049 -5442 -4130 -8160 2520 4177 2848 8012
12153H012L557j984l621j748p503N472J533k189K057M367k339M32k846o42j247
$$ 8012 11569 9585 5964 4216 -3287 2185 3718 1529 3586 7953 5614 6046 3200 2558 1311
12138A311J885m893n470N952R246K16j907o452J552J692j995k556m550J180O323
$$ 1311 3196 -1697 -7167 -1215 8031 8247 6340 -112 1440 3132 1137 -1419 -5969 -4789 1534
12123A534O93O82L301j147l421o731q97m270q202k51R319L194K577j105L268r79
$$ 1534 2227 2909 6210 5063 1642 -5089 -5986 -10256 -18458 -18709 -9390 -6196 -3619 -4724 -1456 -2435
12107b435O950N361L09m529p580O94L392O293K365q003p21Q376j958l063j974
$$ -2435 4515 9876 10185 5656 -1924 -1230 2162 8455 10820 2817 2096 10472 8514 5451 3477
12092C477l429r83J252m254j820M04m170M42J861n23J36K129n17n20j583n692
$$ 3477 48 -935 317 -3937 -5757 -5353 -9523 -9081 -7220 -7743 -7607 -5478 -5995 -6515 -8098 -13790
12076a3790N936N446L221k682l147L58O378L916r023o713J956Q400K361p33j919
$$ -13790 -7854 -2408 813 -1869 -5016 -4658 1720 5636 -3387 -10100 -8144 256 2617 1884 -35
12061c5l939M154M059k902m20J259j805m580O66J346l979K258K423j941M854M075
$$ -35 -3974 180 4239 1337 917 2176 371 -4209 -3543 -2197 -6176 -3918 -1495 -3436 1418 5493
12045E493r01j910M41K381j789J594n658J368J465o108L687j90p062j681J291
$$ 5493 4592 2682 3123 5504 3715 5309 -349 1019 2484 -3624 63 -127 -7189 -8870 -7579
12030g579J546P16m542l448j693J463l80L504P270K051K205J213j064R61j045
$$ -7579 -6033 -5317 -9859 -13307 -15000 -13537 -13917 -10413 -3143 -1092 1113 2326 1262 2223 1178
12015A178m958q405J065N841P56l4R44M492O574l234q348R522j868M917L804m800
$$ 1178 -3780 -12185 -11120 -5279 -4523 -4557 -3613 879 7453 4219 -4129 5393 3525 8442 12246 7446
11999G446l544n417n443l559P89M889M268q19n7L852L999l453o709J354N417k047
$$ 7446 3902 -1515 -6958 -10517 -9728 -4839 -571 -1390 -1447 2405 6404 2951 -3758 -2404 3013 966
11983I66m59l924j037M404j99K521K044M716P89k324J932O078N870m861j5799
$$ 966 507 -3417 -4454 -50 -249 2272 4316 9032 9821 7497 9429 15507 21377 16516 717
11968G17p430M052J451j154n258j65l042q78L824m13N95O42j641m186N24J1355
$$ 717 -6713 -2661 -1210 -2364 -7622 -7787 -10829 -11707 -7883 -8296 -7701 -7059 -8700 -12886 -12362 -1007
11952a007N753K650m858k795q876L252O608m215m196R385L057n412p263J688K486
$$ -1007 4746 7396 2538 -257 -9133 -5881 727 -3488 -7684 1701 4758 -654 -7917 -6229 -3743
11937c743O81N814J951l323m027o036j484L631J0705n871J397k162m287N86M249
$$ -3743 -3062 2752 4703 1380 -2647 -8683 -10167 -6536 4169 -1702 -305 -2467 -6754 -6168 -1919
11922a919m242P09k059j432Q84J2117L181l673M72J89k791m712q611N98Q231Q686
$$ -1919 -6161 -5452 -7511 -8943 -8059 4058 7239 3566 4038 4227 1436 -3276 -11887 -11289 -3058 5628
11906E628o759l303L447Q73L98l723o307N1K871M988M058L809N991l534l901n123
$$ 5628 -1131 -4434 -987 -114 284 -3439 -9746 -9695 -6824 -1836 2222 6031 12022 8488 4587 -536
11890e36j493K072L808K742l092l796k391m621o66Q04k152K752P047L332j0089
$$ -536 -2029 43 3851 6593 3501 -295 -2686 -7307 -7973 -7169 -9321 -6569 478 3810 -6279
11875f279o4l995J960m59m79J692l722J561P884q12n09k982J07N738j717o608
$$ -6279 -6343 -10338 -8378 -8837 -9316 -7624 -11346 -9785 -1901 -2713 -3222 -6204 -6097 -359 -2076 -8684
11859h684l48l92K980O710J833k488l093N70K94L769K06m860L522R454M23o099
$$ -8684 -9032 -9424 -6444 266 2099 -389 -3482 -2912 -2618 1151 1357 -3503 19 9473 9896 3797
11843C797o233j208j894n904O735N513j1503j934M102O84L45K040k903L273N536
$$ 3797 -2436 -3644 -5538 -11442 -4707 806 -10697 -12631 -8529 -7845 -7500 -5460 -8363 -5090 446
11828D46J665n197k023J128N829L493k591j708o595m394k717L606Q917K020k211
$$ 446 2111 -3086 -5109 -3981 1848 5341 2750 1042 -5553 -9947 -12664 -9058 -141 1879 -332
11813c32m204p319L251M639k342O75j657n095k407O233N32M980L946k720k990
$$ -332 -4536 -11855 -8604 -3965 -6307 -5632 -7289 -12384 -14791 -8558 -8026 -3046 900 -1820 -4810
11798d810j244J688K245m683M119K258l199K312M398K915K865M23j27m256o81
$$ -4810 -6054 -4366 -2121 -6804 -2685 -427 -3626 -1314 3084 5999 8864 9287 9160 4904 4223
11783D223q69O18l894m743j4395l576J720M936P201k399j061K438l667m602J805
$$ 4223 3354 3972 78 -4665 -19060 -22636 -20916 -15980 -8779 -11178 -12239 -9801 -13468 -18070 -16265
11768a6265R841M474k370J98o09k877k683j622R85K520r598K034Q443k654q96
$$ -16265 -6424 -1950 -4320 -4122 -4731 -7608 -10291 -11913 -10928 -8408 -18006 -15972 -7529 -10183 -11079
11753a1079K791M367N698K957l715o928n35N185K078k089q794o733J37J540N452
$$ -11079 -8288 -3921 1777 4734 1019 -5909 -6444 -1259 819 -1270 -10064 -16797 -16660 -15120 -9668
11738i668J614N860j282o14j023m254k496j821L891J409N90P458p362n599M994
$$ -9668 -8054 -2194 -3476 -4090 -5113 -9367 -11863 -13684 -9793 -8384 -7794 -336 -7698 -13297 -8303
11723h303K450Q031O57K78n204m643M089O772L359J151K277p232n818j923R241
$$ -8303 -5853 2178 2835 3113 -2091 -6734 -2645 4127 7486 8637 10914 3682 -2136 -4059 5182
11708E182K624o735j95M55j606o345N296K668l957M698K917k082r253n146N661
$$ 5182 7806 1071 876 1331 -275 -6620 -1324 1344 -2613 2085 5002 2920 -6333 -11479 -5818
11693e818p22k435j049K867L425N65J352n086K961K79J936K796K461L07p613j064
$$ -5818 -6540 -8975 -10024 -7157 -3732 -3167 -1815 -6901 -3940 -3661 -1725 1071 3532 3839 -3774 -4838
11677d838J570O85K588n718n86m012N384N392m234P96J096K324R88J598k598j391
$$ -4838 -3268 -2583 5 -5713 -6299 -10311 -4927 465 -3769 -2973 -1877 447 1435 3033 435 -956
11661i56L008K473m595k236M861L975L613n804n988l777o418j600N566O40p31
$$ -956 2052 4525 -70 -2306 2555 6530 10143 4339 -1649 -5426 -11844 -13444 -7878 -7238 -7969
11646g969L353K374M47J3n467M053P655K902n782K639q885o169R88M729L950K548
$$ -7969 -4616 -2242 -1795 -1782 -7249 -3196 4459 7361 1579 4218 -4667 -10836 -9848 -5119 -1169 1379
11630A379j575l691n288L573K006L106J883M49o10J019L066k225m023j441l392
$$ 1379 -196 -3887 -9175 -5602 -3596 -490 1393 1842 1232 2251 5317 3092 -931 -2372 -5764
11615e764K083J934J799o449M857l77p999j715J1202R40M824m845k148N89J019
$$ -5764 -3681 -1747 52 -6397 -1540 -1917 -9916 -11631 -429 511 5335 490 -1658 -1069 -50
11600e0J877M96J256q079K868O25N088J478m64K828Q542j06o120p038K592M323
$$ -50 1827 2323 3579 -4500 -1632 -1007 4081 5559 5095 7923 16465 16359 10239 3201 5793 10116
11584A0116m488p645L86j039k256j133R95J142J737k185Q14L909M361R58l707
$$ 10116 5628 -2017 -1631 -2670 -4926 -6059 -5064 -3922 -2185 -4370 -3556 353 4714 5672 1965
11569A965k027j773J965K1m232P348L556m000m705K036N50N09k925k144M136r40
$$ 1965 -62 -1835 130 151 -4081 3267 6823 2823 -1882 154 704 1213 -1712 -3856 280 -660
11553f60l474L336L262L910J027J118j616j741q34n14j173p212l630O302J1089
$$ -660 -4134 -798 2464 6374 7401 8519 6903 5162 4328 3814 2641 -4571 -8201 -1899 9190
11538I190j684o865o058J077J2264K862l963l963N835P56J33n108j277P51q36
$$ 9190 7506 641 -5417 -4340 7924 10786 6823 2860 8695 9451 9584 4476 3199 3950 3114
11523C114j117m816K725J0943L45l438o734o185k669M211m059K243r79k557K068
$$ 3114 1997 -2819 -94 10849 11194 7756 1022 -5163 -7832 -3621 -7680 -5437 -6416 -8973 -6905
11508f905M607L470l177k894J556L94O719k71l814L451L825j045J012r16J709
$$ -6905 -2298 1172 -2005 -4899 -3343 -2949 3770 3499 -315 3136 6961 5916 6928 6012 7721
11493G721l097k12q57J4j927k821J598P206j40n863j627o334Q68K258R36Q48Q05
$$ 7721 4624 4412 3555 3569 1642 -1179 419 7625 7485 1622 -5 -6339 -5471 -3213 -2277 -1429 -624
11476f24k182Q42m332o223j780M919M084M989M268m07K351N02L301j109r783k650
$$ -624 -2806 -1964 -6296 -12519 -14299 -9380 -5296 -307 3961 3554 5905 6407 9708 8599 -1184 -3834
11460c834K012K563q066j855N340j688j561j447L378O71M940L529O44n452o748
$$ -3834 -1822 741 -7325 -9180 -3840 -5528 -7089 -8536 -5158 -4487 453 3982 4626 -826 -7574
11445g574J330O398J287m348M419J93q077Q20K185o52l320K503J761M699J882
$$ -7574 -6244 154 1441 -2907 1512 1705 -6372 -5552 -3367 -4019 -7339 -4836 -3075 1624 3506
11430C506j062n578q358k653K341J105M105L75K000K634M139O446k780k942q720
$$ 3506 2444 -3134 -11492 -14145 -11804 -10699 -6594 -6219 -4219 -1585 2554 9000 6220 3278 -5442
11415e442m130m733N812J0317N057o741j0077m854J431J0331P078k845j596K308
$$ -5442 -9572 -14305 -8493 1824 6881 140 -9937 -14791 -13360 -3029 4049 1204 -392 1916
11401A916K905L998n084m239R81l272K360l146l017N125Q141O784o81m632L11
$$ 1916 4821 8819 3735 -504 477 -2795 -435 -3581 -6598 -1473 6668 13452 12771 8139 8450
11386H450j376l656k18J343L055k599j970Q72L348j725q45L245K493p19n835r73
$$ 8450 7074 3418 3200 4543 7598 4999 3029 3901 7249 5524 4679 7924 10417 9698 3863 2890
11370B890P08J841m260m998o144q73R684R536j400l329m283j482L15L983j816
$$ 2890 3598 5439 1179 -3819 -9963 -10836 -1152 8384 6984 3655 -628 -2110 -1795 2188 372
11355C72j995O085J410o847q138R33k937Q861j128n589k224L058L659L29K279
$$ 372 -1623 4462 5872 -975 -9113 -8180 -11117 -2256 -3384 -8973 -11197 -8139 -4480 -4151 -1872
11340a872n2r05j989o671P050Q145J354p342l090K715j989N215k977p684j585
$$ -1872 -1924 -2829 -4818 -11489 -4439 3706 5060 -2282 -5372 -2657 -4646 569 -2408 -10092 -11677
11325a1677J100N268l88R95J442M436J594l272m264R5N313M884L77o371j024K873
$$ -11677 -10577 -5309 -5697 -4702 -3260 1176 2770 -502 -4766 -4671 642 5526 5903 -468 -1492 1381
11309A381l252j383L031k088l944m538O586L578L110L416l269J895l148o495J396
$$ 1381 -1871 -3254 -223 -2311 -6255 -10793 -4207 -629 2481 5897 2628 4523 1375 -5120 -3724
11294c724j278K578K349l128n31O199J836p542M267Q247l081k203K427l470k428
$$ -3724 -5002 -2424 -75 -3203 -3734 2465 4301 -3241 1026 9273 6192 3989 6416 2946 518
11279E18K272k196o007K301L590J60m720j713L493K807n881l16k818O66M73J706
$$ 518 2790 594 -5413 -3112 478 638 -4082 -5795 -2302 505 -5376 -5692 -8510 -7844 -7371 -5665
11263e665l429J943n824m727K797N291P408K294j197N214N632n786R43M093m868
$$ -5665 -9094 -7151 -12975 -17702 -14905 -9614 -2206 88 -1109 4105 9737 3951 4894 8987 4119
11248D119n320K784j574N210k12J206l688j0328q7O432M619j526J09O248j036
$$ 4119 -1201 1583 9 5219 5007 6213 2525 -7803 -7890 -1458 3161 1635 1744 7992 6956
11233F956P179p215N64k623k033j475l38n606J035n558N555p70K44m47K289M775
$$ 6956 14135 6920 7484 4861 2828 1353 1015 -4591 -3556 -9114 -3559 -4329 -4085 -4532 -2243 2532
11217B532O180l463l450l882K056K185r769n239N257P156k40q976L649k425l837
$$ 2532 8712 5249 1799 -2083 -27 2158 -7611 -12850 -7593 -437 -677 -9653 -6004 -8429 -12266
11202a2266M120J331K647L272M787J959m797k814L42L122N030k451l74j337J10
$$ -12266 -8146 -6815 -4168 -896 3891 5850 1053 -1761 -1419 1703 6733 4282 3908 2571 2681
11187B681l526J34L820M77k966n938N042L38K239J32m809O53N392K748j274p001
$$ 2681 -845 -711 3109 3586 620 -5318 -276 62 2301 2433 -2376 -1723 3669 6417 5143 -1858
11171a858r82P694j427M84m993l054P16O49J724l747o399o266P021R374N499m206
$$ -1858 -2840 4854 3427 3911 -1082 -4136 -3420 -2771 -1047 -4794 -11193 -17459 -10438 -1064 4435 229
11155B29m997K174J691J675N75K411M395M137M327m415r369l782j112L67J648
$$ 229 -4768 -2594 -903 772 1347 3758 8153 12290 16617 12202 2833 -949 -2061 -1694 -46
11140d6K572J151j849q90J460J6L267q41q77q361m486N287R280l51p644N012K020
$$ -46 2526 3677 1828 938 2398 2414 5681 4840 3963 -4398 -8884 -3597 5683 5332 -2312 2700 4720
11123D720k260n682J493k133J479k339K841K068o757k969k632j680o8N339Q010
$$ 4720 2460 -3222 -1729 -3862 -2383 -4722 -1881 187 -6570 -9539 -12171 -13851 -13919 -8580 -570
11108e70O412L055l981Q03m82K404k190m272l144L515M086m542j084M275N005
$$ -570 5842 8897 4916 5719 5237 7641 5451 1179 -1965 1550 5636 1094 10 4285 9290
11093I290J857n832J638L148k38J659O479o044p789j373N271K299K30j132j683
$$ 9290 11147 5315 6953 10101 9863 11522 18001 11957 4168 2795 8066 10365 10595 9463 7780
11078G780m168J902p86J170K681n549n279K872P108L145m681q277r81n064l709
$$ 7780 3612 5514 4728 5898 8579 3030 -2249 623 7731 10876 6195 -2082 -3063 -8127 -11836
11063a1836M765J0739J519m779o327J080R522N261n116o666L8j447l076o62k477
$$ -11836 -7071 3668 5187 408 -5919 -4839 4683 9944 4828 -1838 -1800 -3247 -6323 -6985 -9462
11048i462P63J435M392j616K385P604J75l234m414p39n073O5L3M60K704J874p5
$$ -9462 -8699 -7264 -2872 -4488 -2103 5501 5676 2442 -1972 -2711 -7784 -7719 -7686 -7226 -4522 -2648 -2723
11031b723J990m684l118o07O810O175m984n291L79j064m757M065M822J165m002
$$ -2723 -733 -5417 -8535 -9142 -2332 3843 -1141 -6432 -6053 -7117 -11874 -7809 -2987 -1822 -5824
11016e824m584K234k540o652O50Q287j02r17J91m598N152L463l385k459k983q109
$$ -5824 -10408 -8174 -10714 -17366 -16716 -8429 -8531 -9448 -9257 -13855 -8703 -5240 -8625 -11084 -14067 -22176
11000b2176K577R004M602k839L2k437O390M768M349J987k354l184l299j185m097
$$ -22176 -19599 -10595 -5993 -8832 -8800 -11237 -4847 -79 4270 6257 3903 719 -2580 -3765 -7862
10985g862r30J507N960L831m743k095N328M710k723n595J076N227l383k037L333
$$ -7862 -8792 -7285 -1325 2506 -2237 -4332 996 5706 2983 -2612 -1536 3691 308 -1729 1604
10970A604J236L933J312l285q444j710l997N049O045j743k287J797Q49N872k26
$$ 1604 2840 6773 8085 4800 -3644 -5354 -9351 -4302 1743 0 -2287 -490 359 6231 6005
10955F005M4O723K482o082o823o842l014K683L063M444M9L599K383j777j210J236
$$ 6005 6049 12772 15254 9172 2349 -4493 -7507 -4824 -1761 2683 2732 6331 8714 6937 5727 6963
10939F963l391m957q293K594N786l826k214Q56l766L42J1758L67p145r77K152
$$ 6963 3572 -1385 -9678 -7084 -1298 -5124 -7338 -6482 -10248 -9906 1852 2219 -4926 -5903 -3751
10924c751r66j14L898J213J239K675K487l009o465M31M395K603K267m93o094J387
$$ -3751 -4717 -4831 -933 280 1519 4194 6681 3672 -2793 -2362 2033 4636 6903 6410 316 1703
10908A703O486k308l728L02K639o634l71J733o959J012J626M535L107J82J84k001
$$ 1703 8189 5881 2153 2455 5094 -1540 -1911 -178 -7137 -6125 -4499 36 3143 3325 3509 1508
10892A508k702O7k281K768J868k284P58K977J19N79m731o276J102M118J174l607
$$ 1508 -1194 -1127 -3408 -640 1228 -1056 -298 2679 2798 3377 -1354 -7630 -6528 -2410 -1236 -4843
10876d843j066M336m582o315N836O481L583m398k622j740p261k610N781Q742N35
$$ -4843 -5909 -1573 -6155 -12470 -6634 -153 3430 -968 -3590 -5330 -12591 -15201 -9420 -678 -143
10861a43p389l307O83L848M87j372J619L553J493N005k837J2J310P292K331k196
$$ -143 -7532 -10839 -10156 -6308 -5821 -7193 -5574 -2021 -528 4477 1640 1652 2962 10254 12585 10389
10845A0389m973O800M999n464O75p11n629j576m887m265J956j26j662L771J055
$$ 10389 5416 12216 17215 11751 12426 11715 6086 4510 -377 -4642 -2686 -2812 -4474 -703 352
10830C52l665P71L016k918r289N382M346J848m556L0R77L804L664o70k233r78
$$ 352 -3313 -2542 474 -2444 -11733 -6351 -2005 -157 -4713 -4683 -3706 98 3762 3092 859 -119
10814a19O637M832j445p696K338k111m109q190m379J309O085J759J580l075j799
$$ -119 6518 11350 9905 2209 4547 2436 -1673 -9863 -14242 -12933 -6848 -5089 -3509 -6584 -8383
10799h383l297J204N256J0257P854l001p34j504o275P68K026N118k972o175m916
$$ -8383 -11680 -10476 -5220 5037 12891 9890 9156 7652 1377 2145 4171 9289 6317 142 -4774
10784d774K97m005K551Q542K787m095r627K525L800j363L165M885j114j701Q90
$$ -4774 -4477 -8482 -5931 2611 5398 1303 -8324 -5799 -1999 -3362 -197 4688 3574 1873 2763
10769B763K827m491J545k457k237O574N696k600p588p555O394l870n657L028P915
$$ 2763 5590 1099 2644 187 -2050 4524 10220 7620 32 -7523 -1129 -4999 -10656 -7628 287
10754B87L787l819n128J096L047M840m08n249L997J626k117N092O376j385o463
$$ 287 4074 255 -4873 -3777 -730 4110 3702 -1547 2450 4076 1959 7051 13427 12042 5579
10739E579l649r2m602p635N90L460K43J819o805j628Q949O976m28m884n560K100
$$ 5579 1930 1838 -2764 -10399 -9809 -6349 -6106 -4287 -11092 -12720 -3771 3205 2777 -2107 -7667 -5567
10723e567l458j052K793N261K33l974J466m80N97j037J56Q388L87K404L05k616
$$ -5567 -9025 -10077 -7284 -2023 -1790 -5764 -4298 -4778 -4181 -5218 -5062 3326 3713 6117 6422 3806
10707C806n55k427j855K923M267k512J015l217k923o55K662k392k318P050N578
$$ 3806 3251 824 -1031 1892 6159 3647 4662 1445 -1478 -2133 529 -1863 -4181 2869 8447
10692H447k100o947l15L515N867Q92J373R06p208m691N916K661O465M035l192
$$ 8447 6347 -600 -915 2600 8467 9359 10732 11638 4430 -261 5655 8316 14781 18816 15624
10677A5624n022j080l554k142j2k605K490K526k9m26R94j501j248o455j796l41
$$ 15624 10602 9522 5968 3826 3814 1209 3699 6225 6196 5770 6764 5263 4015 -2440 -4236 -4577
10661d577L31P24K781M944n355P838M145q415J448P720k333l165R9K220l586j0532
$$ -4577 -4246 -3522 -741 4203 -1152 6686 10831 2416 3864 11584 9251 6086 6185 8405 4819 -5713
10645e713k06M152o58J746m338J46N311j912M803J692m238O034K737j825o918
$$ -5713 -5919 -1767 -2425 -679 -5017 -4871 440 -1472 3331 5023 785 6819 9556 7731 813
10630H13L813m01j855K912j897l8P23J233Q22N70k062N60J248M756j451n404m076
$$ 813 4626 4225 2370 5282 3385 3347 4070 5303 6125 6695 4633 5193 6441 11197 9746 4342 266
10613B66j900J231K42l746l752j413P043j096j96M059m261n408R465J891k962
$$ 266 -1634 -403 -161 -3907 -7659 -9072 -2029 -3125 -3321 738 -3523 -8931 534 2425 -537
10598e37n359k914J015j143l124l905j621J2958O060m405J605J1779M599j579
$$ -537 -5896 -8810 -7795 -8938 -12062 -15967 -17588 -4630 1430 -2975 -1370 10409 15008 13429
10584A3429j998k385J275K596o579j799j354J295L453J658r67K7q065l067R24
$$ 13429 11431 9046 10321 12917 6338 4539 3185 4480 7933 9591 8624 8651 586 -2481 -1557
10569a557K126M808m145m116O533M367m499j853O960Q72k978K259o068q41N749
$$ -1557 569 5377 1232 -2884 3649 8016 3517 1664 8624 9496 6518 8777 2709 1868 7617
10554G617N760o201l404m418N99p03O062k021l968j176k00K058k7K784L058j906
$$ 7617 13377 7176 3772 -646 -47 -750 5312 3291 -677 -1853 -2053 5 -22 2762 5820 3914
10538C914J203n148j830R911l62J253p826n201K055j161L64M542K821O23l465
$$ 3914 5117 -31 -1861 8050 7688 8941 1115 -4086 -2031 -3192 -2828 1714 4535 5158 1693
10523A693l546L793K481k690J376o32j185l317J99M523N284l384J538k650n605
$$ 1693 -1853 1940 4421 1731 3107 2475 1290 -2027 -1828 2695 7979 4595 6133 3483 -2122
10508b122N380P323K409q12p32o188m633K667P255J266m501k637j498J168k100
$$ -2122 3258 10581 12990 12178 11446 5258 625 3292 10547 11813 7312 4675 3177 4345 2245
10493B245q37j436q65J834P489k386p318k529L242J371k504K986P588J0587m76
$$ 2245 1408 -28 -893 941 8430 6044 -1274 -3803 -561 810 -1694 1292 8880 19467 18991
10478A8991j764m203J763j020q014m880P169J163N90j805l983J124M343q971m047
$$ 18991 17227 13024 14787 13767 5753 873 8042 9205 9795 7990 4007 5131 9474 503 -3544
10463c544K567K685L817K658J030q178n7L931l687k700j480P660L386O718K220
$$ -3544 -977 1708 5525 8183 9213 1035 978 4909 1222 -1478 -2958 4702 8088 14806 17026
10448A7026q656j3858K724J672P468L277J37k933m561l454o486M814j701j572
$$ 17026 8370 -5488 -2764 -1092 6376 9653 9790 6857 2296 -1158 -7644 -2830 -4531 -6103
10434f103j569P301K54M963L692j383j455M614K566l690L50R34l354L801M566
$$ -6103 -7672 -371 -117 4846 8538 7155 5700 10314 12880 9190 9540 10474 7120 10921 15487
10419A5487L495m334j0327M948m464k919N740m290j1631K698J4580j410M56n970
$$ 15487 18982 14648 4321 9269 4805 1886 7626 3336 -8295 -5597 8983 7573 8029 2059
10405B059l705J382M55o783K559M606l00o101k371M23l108K414J534N625O95l283
$$ 2059 -1646 -264 191 -6592 -4033 573 273 -5828 -8199 -7776 -10884 -8470 -6936 -1311 -616 -3899
10389c899N198k580k313P753p96K081M120J184n730p577j108k574O343N310J948
$$ -3899 1299 -1281 -3594 4159 3363 5444 9564 10748 5018 -2559 -3667 -6241 102 5412 7360
10374G360k923M673o870q417k164Q392O032n216j350m527O90K809k255j670K069
$$ 7360 4437 9110 2240 -6177 -8341 51 6083 867 -483 -5010 -4320 -1511 -3766 -5436 -3367
10359c367P650L212r52n292L856L274o26k963k622L579J156m996P100M900o597
$$ -3367 4283 7495 6543 1251 5107 8381 7755 4792 2170 5749 6905 1909 9009 13909 7312
10344G312j3934j553K775J828L889K263o059l740J055N237P743L824k616l424
$$ 7312 -6622 -8175 -5400 -3572 317 2580 -3479 -7219 -6164 -927 6816 10640 8024 4600
10330D600l561J861R04M618J687j600k861L699N985p343p315N927K58J240j110
$$ 4600 1039 2900 3804 8422 10109 8509 5648 9347 15332 7989 674 6601 6859 8099 6989
10315F989J56p53j816m167N270M481k113m709k636q1L171M055P7O47N688J409
$$ 6989 7145 6392 4576 409 5679 10160 8047 3338 702 621 3792 7847 7924 8571 14259 15668
10299A5668j689m556l581l843L185k613k756J432J249M154j234k897N3L132m041
$$ 15668 13979 9423 5842 1999 5184 2571 -185 1247 2496 6650 5416 2519 2572 5704 1663
10284A663l083P243M891m249J015L373M17J77l888j141J276k989n663m193j23
$$ 1663 -1420 5823 10714 6465 7480 10853 11270 11447 7559 6418 7694 4705 -958 -5151 -5274
10269e274k038K421o753J676N457K777l666M52M621J622M614o944o836p267l033
$$ -5274 -7312 -4891 -11644 -9968 -4511 -1734 -5400 -4948 -327 1295 5909 -1035 -7871 -15138 -18171
10254a8171J0203O788J368J710j306K723K077l174K391n06j305M659k765k369
$$ -18171 -7968 -1180 188 1898 592 3315 5392 2218 4609 4103 2798 7457 4692 2323
10240B323O159M059q58K825p85o784o168k889J176M385k746K048K854j47K086
$$ 2323 8482 12541 11683 14508 13723 6939 771 -2118 -942 3443 697 2745 5599 5452 7538
10225G538J146k347m272J851J874l996L006k624L126M309m804m094J820j60l415
$$ 7538 8684 6337 2065 3916 5790 1794 4800 2176 5302 9611 4807 713 2533 2373 -1042
10210a042o23K16L870L509L886K548j192k714J990jj029k596j708M20K16k795
$$ -1042 -1665 -1449 2421 5930 9816 12364 11172 8458 10448 10447 9418 6822 5114 5534 5750 2955
10194B955o179J977J209L494M937j201m452J569k173k971P35J952O227L06k215
$$ 2955 -3224 -1247 -38 3456 8393 7192 2740 4309 2136 -835 -100 1852 8079 8385 6170
10179F170m230l281q14N844M220n987j692J808j986n867N815M019q29R41L734
$$ 6170 1940 -1341 -2155 3689 7909 1922 230 2038 52 -5815 0 4019 3190 4131 7865
10164G865l711l765j645m625n598j507R469l76n64M765M753M627P34M2J683P46
$$ 7865 4154 389 -1256 -5881 -11479 -12986 -3517 -3893 -4457 308 5061 9688 10422 10464 12147 12893
10148A2893m774k06k89P057L736j126J569N560J245p527q825j841m91M798O801
$$ 12893 8119 7913 7624 14681 18417 17291 18860 24420 25665 18138 9313 7472 6981 11779 18580
10133A8580n223j998n26m291m757J359j986l669N272J1839M933n30o506l391M214
$$ 18580 13357 11359 10833 6542 1785 3144 1158 -2511 2761 14600 19533 19003 12497 9106 13320
10118A3320J051l874k696Q200j130l053k494n941m979m902j100P264M411L489
$$ 13320 14371 10497 7801 16001 14871 11818 9324 3383 -1596 -6498 -7598 -334 4077 7566
10104G566k584k471n325p714L414R488L792P65K290M409K816N227N009r42o251
$$ 7566 4982 2511 -2814 -10528 -7114 2374 6166 6931 9221 13630 16446 21673 26682 25740 19489
10089A9489q520k854r520k917J0595O745R80Q905m83q880j168j316j32n938m999
$$ 19489 10969 8115 -1405 -4322 6273 13018 13998 22903 22420 13540 12372 11056 10924 4986 -13
10074a3j016P254L47k49M871K135l388j320l654q325M227R763J43k921l602L305
$$ -13 -1029 6225 6572 6323 11194 13329 9941 8621 4967 -3358 869 10632 10775 7854 4252 7557
10058G557M322M503K120J2284M763N252J586j151l388j1957l384m078n122o495
$$ 7557 11879 16382 18502 30786 35549 40801 42387 41236 37848 25891 22507 18429 13307 6812
10044F812J239m497M106j902J654n70J228j992m463o980K9K47Q030P183M80m48
$$ 6812 8051 3554 7660 5758 7412 6842 8070 6078 1615 -5365 -5336 -5089 2941 10124 10604 10156
10028A0156n32L951N977K956O35l165j1914m817k05M757J818n569l017q59J948
$$ 10156 9624 13575 19552 22508 23143 19978 8064 3247 3042 7799 9617 4048 1031 172 2120
10013B120O604l174j58j51O217k526j0500L716L137J431P431L056m808k706k75
$$ 2120 8724 5550 5392 5241 11458 8932 -1568 2148 5285 6716 14147 17203 12395 9689 9414
9998I414p19j663J354j026r98l545L468J258K12K046k346o67L945K713m261L104
$$ 9414 8695 7032 8386 7360 6362 2817 6285 7543 7755 9801 7455 6788 10733 13446 9185 12289
9982A2289Q75J607m135k180L744j161m239J571J013k116L38L26L671l7j096q68
$$ 12289 13164 14771 10636 8456 12200 11039 6800 8371 9384 7268 7606 7932 11603 11566 10470 9602
9966I602k002o579K649M450o52P111O497m955q60j376j61l539k611J223L995J154
$$ 9602 7600 1021 3670 8120 7468 14579 21076 16121 15261 13885 13724 10185 7574 8797 12792 13946
9950A3946l88k739m26n479j057q17N131k858k376J58N608j761K411K322l132m413
$$ 13946 13558 10819 10393 4914 3857 3040 8171 5313 2937 3095 8703 6942 9353 11675 8543 4130
9934D130K457p49n819N368M553J39j716k772j66L073R126K791J121k498l006J23
$$ 4130 6587 5838 19 5387 9940 10079 8363 5591 5425 8498 17624 20415 21536 19038 16032 16155
9918A6155o473j268J9M778q20l558o332r56R55k576Q745P604L122l174n247m025
$$ 16155 9682 8414 8433 13211 12391 8833 2501 1545 2500 -76 8669 16273 19395 16221 10974 6949
9902F949l755l152M692L536j446J037j235P10M532Q739k931q80o103o157K107
$$ 6949 3194 42 4734 8270 6824 7861 6626 7336 11868 20607 17676 16796 10693 4536 6643
9887F643J628l47l64n453l119p56L408Q405l22p935n621R60R046Q681N284J89
$$ 6643 8271 7924 7560 2107 -1012 -1768 1640 10045 9723 1788 -3833 -2873 6173 14854 20138 20327
9871B0327k694o065n243J159l396n417L01N306J0371n07j652K070J731n822j618
$$ 20327 17633 11568 6325 7484 4088 -1329 -1028 4278 14649 14142 12490 14560 16291 10469 8851
9856H851k260o269K102O579L236r108J684N001O26K288L596J065p439m990N39
$$ 8851 6591 322 2424 9003 12239 3131 4815 9816 10442 12730 16326 17391 9952 4962 5501
9841E501P20K600J0369Q0m586n380J148K307L381L56J289l219J608o211l371J477
$$ 5501 6221 8821 19190 19270 14684 9304 10452 12759 16140 16496 17785 14566 16174 9963 6592 8069
9825H069P13O769M450k407K967M214m992N030k179m005m00n074l386M592j841
$$ 8069 8782 15551 20001 17594 20561 24775 19783 24813 22634 18629 18229 13155 9769 14361 12520
9810A2520j860p268K514J0461M466J965J588M65o018o103o170o823J765P636r941
$$ 12520 10660 3392 5906 16367 20833 22798 24386 24851 18833 12730 6560 -263 1502 9138 -803
9795h03k038m001L645K731K137L290K687k356n663L671m43n222k091M924P174
$$ -803 -2841 -6842 -3197 -466 1671 4961 7648 5292 -371 3300 2857 -2365 -4456 468 7642
9780G642L349k658P850J722j499j721j947m12q65r88j818o217J940K09J4851R025
$$ 7642 10991 8333 16183 17905 16406 14685 12738 12326 11461 10473 8655 2438 4378 4587 19438 28463
9764B8463J456q974j2721Q14O633L211O98q305n643K704M094L151J254J581O79
$$ 28463 29919 20945 8224 9038 15671 18882 19580 11275 5632 8336 12430 15581 16835 18416 19095
9749A9095n36L85m220l896o2L302j16L217M270r5k985o163o327j065Q401k16L678
$$ 19095 18559 18944 14724 10828 10766 14068 13952 17169 21439 21344 18359 12196 5869 4804 13205 12989 16667
9732A6667j663k103J034N550L785J820r508j801J0544K32o773J637Q86K653p53
$$ 16667 15004 12901 13935 19485 23270 25090 15582 13781 24325 24557 17784 19421 20307 22960 22207
9717B2207M292L898J524j201k763o673l92K700k240k716M0O923N690L822m691
$$ 22207 26499 30397 31921 30720 27957 21284 20892 23592 21352 18636 18676 25599 31289 35111 30420
9702C0420o718p031L338M575K642n517j1498n90m062N407M376j396L88M541L215
$$ 30420 23702 16671 20009 24584 27226 21709 10211 9621 5559 10966 15342 13946 14334 18875 22090
9687B2090m910j257m31R25J11m788k941l169J520Q526J1130J016l654o018M39
$$ 22090 17180 15923 15492 16417 16528 11740 8799 5630 7150 15676 26806 27822 24168 18150 18589
9672A8589J459j266O466m5n392j2556N507M865m40N018k936n266n50L86L75J370
$$ 18589 20048 18782 25248 25203 19811 7255 12762 17627 17187 22205 19269 14003 13453 13839 14214 15584
9656A5584J578O610k773m834L533P901N45n048j81L110K670J861Q82p865l259
$$ 15584 17162 23772 20999 16165 19698 27599 28144 23096 22915 26025 28695 30556 31438 23573 20314
9641B0314j365n318l58L23j184M252N825R85m048J278K433K590n43m230k383M217
$$ 20314 18949 13631 13273 13596 12412 16664 22489 23474 19426 20704 23137 25727 25184 20954 18571 22788
9625B2788m257j188j009J021l631k344m313m59R015J749p36K507P61J499p532
$$ 22788 18531 17343 16334 17355 13724 11380 7067 6608 15623 17372 16636 19143 19904 21403 13871
9610A3871J647O264Q178p49j839n681n540m33j501N775L093k243K144k159N618
$$ 13871 15518 21782 29960 29211 27372 21691 16151 15718 14217 19992 23085 20842 22986 20827 26445
9595B6445r02k067o361k158K46j355j416K159J609P141M475p7n126J722M877L38
$$ 26445 25543 23476 17115 14957 15203 13848 12432 14591 16200 23341 27816 27739 22613 24335 29212 29550
9579B9550m737K777Q218J754p085m297j363N096j894j591j499K497M453N77p41
$$ 29550 24813 27590 35808 37562 30477 26180 24817 29913 28019 26428 24929 27426 31879 32456 31715
9564C1715n029m928R78K325j668L217l173q055m117K264P522N105N52k417p224
$$ 31715 26686 21758 22736 25061 23393 26610 23437 15382 11265 13529 21051 26156 26708 24291 17067
9549A7067J994M177O75L289L811j208J637m00j278R34Q57j723N058r85j180k557
$$ 17067 19061 23238 23913 27202 31013 29805 31442 31042 29764 30698 31555 29832 34890 33905 32725 30168
9533C0168k751m85n444J524J945M221j301k645J096K817K598N177r38M97m494
$$ 30168 27417 26932 21488 23012 24957 29178 27877 25232 26328 29145 31743 36920 35982 36479 31985
9518C1985q30P165q05k124n706n950k280L547N699O25P19l563L859L192L638n658
$$ 31985 31155 38320 37515 35391 29685 23735 21455 25002 30701 31326 32045 28482 32341 35533 39171 33513
9502C3513l252m856J609N213P563p48r894K290N116J318j138n642M7K218l243
$$ 33513 30261 25405 27014 32227 39790 39042 29148 31438 36554 37872 36734 31092 31139 33357 30114
9487C0114p747k107m699m64J174O363J786K184K302P204O068o056r793m148K209
$$ 30114 22367 20260 15561 15097 16271 22634 24420 26604 28906 36110 42178 36122 26329 22181 24390
9472B4390K776l676J579L405J668n801L373L347J405p399J932l626m57M206L497
$$ 24390 27166 23490 25069 28474 30142 24341 27714 31061 32466 25067 26999 23373 22916 27122 30619
9457C0619l969K221Q861k484J01m492n875M065N416N499o17j144j866K85k975
$$ 30619 26650 28871 37732 35248 35349 30857 24982 29047 34463 39962 39345 38201 36335 36620 33645
9442C3645q101n371N503J285J0895N532J756m850J130j19j50j791q51J3126j111
$$ 33645 25544 20173 25676 26961 37856 43388 45144 40294 41424 41305 41155 39364 38513 51639 50528
9427E0528k987K677O694J563k476l320p314l587n384M166J2449M005l640o926
$$ 50528 47541 50218 56912 58475 55999 52679 45365 41778 36394 40560 53009 57014 53374 46448
9413D6448o135k447j926j095J077K007R817L185j645m921j0386L079M300m822
$$ 46448 40313 37866 35940 34845 35922 37929 47746 50931 49286 44365 33979 37058 41358 36536
9399C6536J383J1313O832q35K984k982k681j280M97r075n942K55o55M339K68K266
$$ 36536 37919 49232 56064 55229 58213 55231 52550 51270 51767 42692 36750 37005 36350 40689 40957 43223
9383D3223K34m00O974k112k548P237k943J754L420L22k924K160o11n487j337P734
$$ 43223 43457 43057 50031 47919 45371 52608 49665 51419 54839 55161 52237 54397 53786 48299 46962 54696
9367E4696L278m087P4O804O008k113j5173o405m254L594N01l254N812K272J095
$$ 54696 57974 53887 53961 60765 66773 64660 49487 43082 38828 42422 42923 39669 45481 47753 48848
9352D8848j704M86j044j446l449J953j91k145J104K053L202k997L476M049M653
$$ 48848 47144 47630 46586 45140 41691 43644 43453 41308 42412 44465 47667 44670 48146 52195 56848
9337E6848K826j211J117k200l435K130O493P781l833o592j679J773O636p719p773
$$ 56848 59674 58463 59580 57380 53945 56075 62568 70349 66516 59924 58245 60018 66654 58935 51162
9322E1162O625M717l1p810j480J066L160k208p4L96m67L263j357Q31n01K962P960
$$ 51162 57787 62504 62473 54663 53183 54249 57409 55201 55127 55523 55056 58319 56962 57793 57292 60254 68214
9305F8214K154L695M490N363P254n739m186n513n809L986k650j547M519j392n783
$$ 68214 70368 74063 78553 83916 91170 85431 81245 75732 69923 73909 71259 69712 74231 72839 67056
9290F7056l691K858O326L926K308m571R86K817J0288m113m899O967K002l663N413
$$ 67056 63365 66223 72549 76475 78783 74212 75198 78015 88303 84190 79291 86258 88260 84597 90010
9275I0010K872J611M337L19N48K955j411l076K906P251N581K768Q19l17J2940
$$ 90010 92882 94493 98830 99149 99697 102652 101241 98165 101071 108322 113903 116671 117490 117173 130113
9260A30113K946p284p012j1537p447j135k401l824o494p743J07j285K836M695
$$ 130113 133059 125775 118763 107226 99779 98644 96243 92419 85925 78182 78289 77004 79840 84535
9246H4535k10L283Q49K724O439J0702N001l268L707N311O545Q258J1094J1586
$$ 84535 84325 87608 88457 91181 97620 108322 113323 110055 113762 119073 125618 133876 144970 156556
9232A56556N125J437L696L425M953J52K238m018j280J0365J0532K821J4548N499
$$ 156556 161681 163118 166814 170239 175192 175344 177582 173564 172284 182649 193181 196002 210550 216049
9218B16049J0095J6241J9187J8858K4078K3120K2775K6797L5747M7078M6062O0867
$$ 216049 226144 242385 261572 280430 304508 327628 350403 377200 412947 460025 506087 566954
9206E66954Q3936J16449J39264J66651J95855K19229K13275J82373J37508P1811
$$ 566954 650890 767339 906603 1073254 1269109 1488338 1701613 1883986 2021494 2093305
9196B093305j697o2792j12246j47869j53302j39092j07555p0396k9366K2613O2997
$$ 2093305 2091608 2028816 1916570 1768701 1615399 1476307 1368752 1298356 1268990 1291603 1354600
9185A354600R5158J60785K42748L50003N30895Q42871J410468K458273M061676
$$ 1354600 1449758 1610543 1853291 2203294 2734189 3577060 4987528 7445801 11507477
9176A1507477N185933M375555J976636k011501o501764n382486k958694j645973
$$ 11507477 16693410 21068965 23045601 21034100 14532336 9149850 6191156 4545183
9168D545183j027600o97867m90548l61506k70182k06543j63895j27618j00731
$$ 4545183 3517583 2819716 2329168 1967662 1697480 1490937 1327042 1199424 1098693
9159A098693r4767q5228p3801n8977m7107m0919k8947k2034k4514k4182j4102
$$ 1098693 1003926 918698 844897 785920 738813 697894 668947 646913 622399 598217 584115
9148E84115j4118j4146k0108k4142k2613k0542k2565j4297j1082j2759p964p759
$$ 584115 569997 555851 535743 511601 488988 468446 445881 431584 420502 407743 399779 392020
9136C92020o560q079o093j1627p042K108p825r492p217q782j3889j0393n879o210
$$ 392020 385460 377381 371288 359661 352619 354727 346902 337410 330193 321411 307522 297129 291250 285040
9122B85040p879r282j737M108k866M208j001k979j4575j5832j4100m956o90j054
$$ 285040 277161 267879 266142 270250 267384 271592 270591 267612 253037 237205 223105 218149 217459 216405
9108B16405J45M585j59J353p46L474n766m474k756m063j395n024l497M154L903
$$ 216405 216550 221135 220976 222329 221583 225057 219291 214817 212061 207998 206603 201579 198082 202236 206139
9093B06139O68j016q659m831N52l348k743l26N436j998n60Q527M131R647J502
$$ 206139 206807 205791 197132 192301 192853 189505 186762 186436 191872 189874 189314 197841 201972 211619 213121
9078B13121k209l342k604q23j470p125q923J585J916J922P152J2130Q845J4889
$$ 213121 210912 207570 204966 204143 202673 195548 186625 188210 190126 192048 199200 211330 220175 235064
9064B35064J8019J7635K2989K4818L1432L4320L0995J9760K0920K9887N4692N0421
$$ 235064 253083 270718 293707 318525 349957 384277 415272 435032 455952 485839 540531 590952
9052E90952Q317k8957k7301l0163n8647o3584n9187m9854k8889j0985j2550j1978
$$ 590952 599269 570312 543011 512848 454201 390617 331430 281576 252687 241702 229152 217174
9040B17174p782p35l730L484O596J487j049k209n403r742j3176n617P0J2952Q216
$$ 217174 209392 208657 204927 208411 215007 216494 215445 213236 207833 198091 184915 179298 179368 192320 200536
9025B00536p42R778J1016P300M630j539n300l328p542k111J448L664O63k838j979
$$ 200536 199794 209572 220588 227888 232518 230979 225679 222351 214809 212698 214146 217810 218473 215635 213656
9010B13656R054J4519J4102Q688N452J0038M758j507O568K842P996K28J0302J4278
$$ 213656 222710 237229 251331 260019 265471 275509 280267 278760 285328 288170 296166 296394 306696 320974
8996C20974Q057J7346Q494J6735K7101L0196K5634K330k8191n3364p3734p5461
$$ 320974 329031 346377 354871 371606 398707 428903 454537 456867 428676 375312 301578 226117
8984B26117n3879j9472l644k195M935J4786K9010L0169K1815Q269R212P472M838
$$ 226117 172238 152766 149122 146927 151862 166648 195658 225827 247642 255911 265123 272595 277433
8971B77433L393l93L461J5096O615k98k959q867q117m431K713O440J2777K418
$$ 277433 280826 280433 283894 298990 305605 305307 302348 293481 285364 280933 283646 290086 302863 305281
8957C05281q484j541M340Q11m243j685J1807K0678J3770R148J2730Q315L087P476
$$ 305281 296797 295256 299596 300407 296164 294479 306286 326964 340734 349882 362612 370927 374014 381490
8943C81490R71J637k121J1353N557J4486K2617J5369J2319J7522J6788J7329K3452
$$ 381490 382461 384098 381977 393330 398887 413373 435990 451359 463678 481200 497988 515317 538769
8930E38769L2400M5575N2029M7626K2912J2470n430l1820m0440k4730j9423j8225
$$ 538769 571169 616744 668773 716399 739311 751781 746351 714531 674091 649361 629938 611713
8918F11713j1803r188q918l131p429O55j678Q5P63K75J0459K1819K0904J5550
$$ 611713 599910 590722 581804 578673 571244 571899 570221 570306 571069 571344 581803 603622 624526 640076
8904F40076K1380K4101J7541J0180P101P596R248R070J6776J8333Q653Q227J1323
$$ 640076 661456 685557 703098 713278 720379 727975 737223 746293 763069 781402 790055 798282 809605
8891H09605J0727J6373J6793J6589K0335K0102J4719J2229J0805J4934J7215J6607
$$ 809605 820332 836705 853498 870087 890422 910524 925243 937472 948277 963211 980426 997033
8879I97033K0549K3867K7182L7463K4950K6154L4020L4630L3542M1708O7376P8075
$$ 997033 1017582 1041449 1068631 1106094 1131044 1157198 1191218 1225848 1259390 1301098 1368474 1446549
8867A446549Q0194Q7018Q0334P8119P3123O1645N7875O0018P4950P5352Q1747
$$ 1446549 1526743 1613761 1694095 1772214 1845337 1906982 1964857 2024875 2099825 2175177 2256924
8856B256924P4350O7669O9957N4581M6119M9434N7205P0664Q3432J08078J34412
$$ 2256924 2331274 2398943 2468900 2523481 2569600 2619034 2676239 2746903 2830335 2938413 3072825
8845C072825J57405J71442J93403J89016J64819J55830J51440J65857J86416K20696
$$ 3072825 3230230 3401672 3595075 3784091 3948910 4104740 4256180 4422037 4608453 4829149
8835D829149K62859K95507L23631L44026L66656L96078M37872M94437N69335O54379
$$ 4829149 5092008 5387515 5711146 6055172 6421828 6817906 7255778 7750215 8319550 8973929
8825H973929P33068Q20460R27118J024315J140656J300955J491837J723405K029443
$$ 8973929 9706997 10527457 11454575 12478890 13619546 14920501 16412338 18135743 20165186
8816B0165186K424124K920120L509842M142221M745048N314956N966022P063535
$$ 20165186 22589310 25509430 29019272 33161493 37906541 43221497 49187519 56251054
8808E6251054R088732J2565907J8132415K6688929L9500929N7067978P5304547
$$ 56251054 65339786 77905693 96038108 122727037 162227966 219295944 294600491
8801B94600491Q1717729O5452650K8275571k4845792p6917009q9884518p0894815
$$ 294600491 376318220 441770870 470046441 445200649 368283640 278399122 207504307
8794B07504307m9021756l3593229k3562883j6842605j2290650r187191p085117
$$ 207504307 158482551 124889322 101326439 84483834 72193184 63005993 55920876
8787E5920876n723155m838743m210719l813876l587107l305235k882766k430457
$$ 55920876 50197721 45358978 41148259 37334383 33747276 30442041 27559275 25128818
8779B5128818k055003j756996j516580j304505j127428r83465q72285p83876p25034
$$ 25128818 23073815 21316819 19800239 18495734 17368306 16384841 15512556 14728680 14003646
8770A4003646o78410o33144o08203n71886n23774m77825m33763m00063l77306
$$ 14003646 13325236 12692092 12083889 11512003 10988229 10510404 10076641 9676578 9299272
8761I299272l67414l37807l01972k34430j34745l9046j1322p3507k02142l77943
$$ 9299272 8931858 8594051 8292079 8057649 7922904 7883858 7872536 7799029 7596887 7218944
8751G218944m55994m02752l34285k93903k63748k38187k17402k00208j77326j52919
$$ 7218944 6762950 6360198 6025913 5732010 5468262 5230075 5012673 4812465 4635139 4482220
8741D482220j26190j21990j13670j06422j03913j00638j00120r0600p9911o3890
$$ 4482220 4356030 4234040 4120370 4013948 3910035 3809397 3709277 3618677 3538766 3474876
8731C474876o0649n3545m8827n8349p1962q5546q9863q7763p4458o0109o3998
$$ 3474876 3414227 3360682 3311855 3253506 3181544 3095998 3006135 2918372 2843914 2783805 2719807
8720B719807o2830n6549o1829o1553o8388p1303o5817n7818n5800n5717m6437
$$ 2719807 2656977 2600428 2538599 2477046 2408658 2337355 2271538 2213720 2157920 2102203 2055766
8709B055766n6460n7547n0235m4188l6559m3333n0402m5939l9276l9698l6174
$$ 2055766 1999306 1941759 1891524 1847336 1810777 1767444 1717042 1671103 1631827 1592129 1555955
8698A555955m0176k9743k2352k3168k1822j6668j3879j4857j8865j3767k4212
$$ 1555955 1515779 1486036 1463684 1440516 1418694 1402026 1388147 1373290 1354425 1340658 1316446
8687A316446k9739k7721k9095l5058k1675j8590j4881r246k289J2595L3321L9112
$$ 1316446 1286707 1258986 1229891 1194833 1173158 1154568 1139687 1130441 1128152 1140747 1174068 1213180
8675A213180M6978K1495k5020m9090l8178n1843p0774o0725m9698m3002l4887
$$ 1213180 1260158 1281653 1256633 1207543 1169365 1117522 1046748 986023 936325 893323 858436
8664H58436k3159j5380j8721j2956p788m039n578q476q225k3514l6943l0844k1965
$$ 858436 835277 819897 801176 788220 780432 776393 770815 762339 754114 730600 693657 662813 640848
8651F40848j6020q658n865l267j1997j3347r463p164k1905j5380j733N038J506
$$ 640848 624828 616170 610305 607038 595041 581694 572231 565067 543162 527782 526049 531087 532593
8638E32593n212l118L674K58N251J6361L3283O7915P9215N3727Q063n0296o4584
$$ 532593 527381 524263 527937 528195 533446 549807 583090 651005 730220 783947 792010 741714 677130
8625F77130k5815m153q812k1868k7088j8932j1082j3992k2108k1768l6474m4319
$$ 677130 651315 647162 638350 616482 589394 570462 559380 545388 523280 501512 465038 420719
8613D20719n5099p8674q2538n7521k1755k574J7731L1030J8942J090J915M67r983
$$ 420719 365620 286946 204408 146887 125132 122558 140289 171319 190261 191351 193266 193733 183750
8600A83750J735J2464L694n929M360J4690J6497K5919L2439L3896M6876N2416
$$ 183750 185485 197949 201643 195714 200074 214764 231261 257180 289619 323515 370391 422807
8588D22807N9910J06678J27167J04891N2134p1029j76260j42895r3597o8840m6395
$$ 422807 482717 589395 716562 821453 873587 802558 626298 483403 389806 320966 274571
8577B74571l0051j9459p439m025m829n47o479o551p254k756r946j3165o070L112
$$ 274571 244520 225061 217622 213597 208768 208221 201742 195191 187937 185181 175235 162070 156000 159112
8563A59112N50K071J0387L573q739O539P141M65N651K836Q022q13j0084Q49K255
$$ 159112 159662 161733 172120 175693 166954 173493 180634 181099 186750 189586 197608 196795 186711 187560 189815
8548A89815m778l778J835J2175J3016K8254N5726N4776M0738m891o6644q0419
$$ 189815 185037 181259 183094 195269 208285 236539 292265 347041 387779 382888 316244 235825
8536B35825n1386k1538j1593m33j381m275R86j2054j3560l943Q354J006r352j4706
$$ 235825 184439 162901 151308 150875 149494 145219 146205 134151 120591 116648 125002 126008 116656 101950
8522A01950l566n494n967n504k273P26O411M962N053p081l147P103O3q251j961
$$ 101950 98384 92890 86923 81419 79146 79872 86283 91245 96298 89217 86070 93173 93236 84985 83024
8507H3024n77n015l297L457k073R32k065r680k531K480K143j695m185o56k135
$$ 83024 82447 77432 74135 77592 75519 76451 74386 64706 62175 64655 66798 65103 60918 60262 58127
8492E8127k310L839j146P48j627m815p983j0949j910l770n216O448N416N938l507
$$ 58127 55817 59656 58510 59258 57631 52816 44833 33884 31974 28204 22988 29436 34852 40790 37283
8477C7283j367K283l840O4m183r764j410L778k718k406M085M192n23O346J2716
$$ 37283 35916 38199 34359 34423 30240 20476 19066 22844 20126 17720 21805 25997 25474 31820 44536
8462D4536K134J986N015K797j1413m184m66M195N126K518q480k728l872m640J452
$$ 44536 46670 48656 53671 56468 45055 40871 40405 44600 49726 52244 43764 41036 37164 32524 33976
8447C3976R975R337L305R893K838n392K24K233l629L83M473M313O78n938m439
$$ 33976 43951 53288 56593 66486 69324 63932 64156 66389 62760 63143 67616 71929 72607 66669 62230
8432F2230J603p94k0m349l17M478M854P585O93J124J532O856J076j259Q447J3709
$$ 62230 63833 63039 63019 58670 58353 62831 67685 75270 75963 77087 78619 85475 86551 85292 93739 107448
8416A07448J2526K103J3328K6830K3856J8710K0747L1148M0382L9526N8858P8075
$$ 107448 119974 122077 135405 162235 186091 204801 225548 256696 297078 336604 395462 473537
8404D73537R8286J27086J46493J76152J89204J96402J80771J37283O2465j7518
$$ 473537 571823 698909 845402 1021554 1210758 1407160 1587931 1725214 1787679 1770161
8394A770161q0034j35145j71764j96012j95177j67950j41452j24559q3048o2099
$$ 1770161 1690127 1554982 1383218 1187206 992029 824079 682627 558068 475020 412921
8384D12921n5822m4387l5885l0809k1904j7040j6873j8227j3688j0409r073j4343
$$ 412921 357099 312712 276827 246018 224114 207074 190201 171974 158286 147877 138804 124461
8372A24461j1928o875l174o293o564J803N325n218k623l880q300k43k01N976l188
$$ 124461 112533 105658 102484 96191 89627 91430 96755 91537 88914 85034 76734 76491 76290 82266 79078
8357G9078J914J882K381m925j0136k667l837J10l044o511o461j473n000n917p168
$$ 79078 80992 82874 85255 80330 70194 67527 63690 63800 60756 54245 47784 46311 41311 35394 28226
8342B8226k765R9l044l183j1041o585j968L593M049k727l924J473P936N297O214
$$ 28226 25461 25560 22516 19333 8292 1707 -261 3332 7381 4654 730 2203 10139 15436 21650
8327B1650m562n620m681j675L287N350l536L115oJ134q3l590j588M568N174O41
$$ 21650 17088 11468 6787 5112 8399 13749 10213 13328 13322 14456 14373 10783 9195 13763 18937 19578
8311A9578j67Q96o83k680R461L338n921l960R27M836m956K831o543k450K368q518
$$ 19578 19411 20307 19624 16944 26405 29743 23822 19862 20789 25625 20669 23500 16957 14507 16875 8357
8295H357m89M034O979j322j971q21j422N708M511L70l408J716m796l817k835Q54
$$ 8357 7868 11902 18881 17559 15588 14767 13345 19053 23564 23934 20526 22242 17446 13629 10794 11648
8279A1648K98j480Q93j818M080j118o396L79J0646M041K030K946p97o924l832
$$ 11648 11946 10466 11359 9541 13621 12503 6107 6486 17132 21173 23203 26149 25352 18428 14596
8264A4596k602K265l031L664O449n635m911K54j953k362p904J620O563M485l231
$$ 14596 11994 14259 11228 14892 21341 15706 10795 11049 9096 6734 -1170 450 7013 11498 8267
8249H267p291j863P977r45j98O390m046L495Q809j631o734l501M635n699J268
$$ 8267 976 -887 7090 6145 5947 12337 8291 11786 20595 18964 12230 8729 13364 7665 8933
8234H933K612k592j774J1832L643j200j1888j286J0201K066o009o439j900Q122
$$ 8933 11545 8953 7179 19011 22654 21454 9566 8280 18481 20547 14538 8099 6199 14321
8220A4321k22p43Q82j328j014m665m265O002K81n359O036L223Q60j260n969k315
$$ 14321 14099 13356 14238 12910 11896 7231 2966 8968 9249 3890 9926 13149 14009 12749 6780 4465
8204D465l941M547J961m433J793j106R754p897j460P454J918k55j513l249k731
$$ 4465 524 5071 7032 2599 4392 3286 13040 5143 3683 11137 13055 12800 11287 8038 5307
8189E307O972K037n70j435k718o699p54j470l322M664Q461K99p28j579k345L987
$$ 5307 12279 14316 13746 12311 9593 2894 2140 670 -2652 2012 10473 10772 10044 8465 6120 10107
8173A0107j338n187j496O71N441R62M953J57k553O205K327M464m595j0198o8k503
$$ 10107 8769 3582 2086 2757 8198 9160 14113 14270 11717 17922 20249 24713 20118 9920 9852 7349
8157G349j976k630L795K744Q73m317r38K043P59J336n734J57K489k752L863P721
$$ 7349 5373 2743 6538 9282 10155 5838 4900 6943 7702 9038 3304 3461 5950 3198 7061 14782
8141A4782K811j6262m554L55k398K631l70L784Q973M689N940M331J7997r53j6630
$$ 14782 17593 1331 -3223 -2868 -5266 -2635 -3005 779 9752 14441 20381 24712 42709 41756 25126
8126B5126r898m60J092j130l854l91J707j946j565j302N810j182l27p871k882
$$ 25126 15228 14768 15860 14730 10876 10485 12192 10246 8681 7379 13189 12007 11680 3809 927
8111I27M207K301N988l629p41o05k105L017L386l004j019J009M324K333K833k285
$$ 927 5134 7435 13423 9794 9053 8448 6343 9360 12746 9742 8723 9732 14056 16389 19222 16937
8095A6937L093l432N729K270k752l932j688j789N124J0310L360N363l095q321
$$ 16937 20030 16598 22327 24597 21845 17913 16225 14436 19560 29870 33230 38593 35498 27177
8081B7177r191r590k775n0l785l115o011O848k964o626k839Q553R239J0713O951
$$ 27177 17986 8396 5621 5571 1786 -1329 -7340 -492 -3456 -10082 -12921 -4368 4871 15584 22535
8066B2535l393n394j25k351l72J866J612j935L977M656N40m312K828j88R54l534
$$ 22535 19142 13748 13623 11272 10900 12766 14378 12443 16420 21076 21616 17304 20132 19944 20898 17364
8050A7364r307k476O940J794k563j093k29K662o563q27O806J278n113j0412l923
$$ 17364 8057 5581 12521 14315 11752 10659 10430 13092 6529 5702 12508 13786 8673 -1739 -5662
8035e662N699R248J525n221L285P727K659j199k836l063N170L578J157O3n535
$$ -5662 37 9285 10810 5589 8874 16601 19260 18061 15225 12162 17332 20910 22067 22130 16595
8020A6595n806k925K864O023J581N182M04J818Q257o73k944l421r91l377j027
$$ 16595 10789 7864 10728 16751 18332 23514 23918 25736 33993 33320 30376 26955 25964 22587 21560
8005B1560J92q277K111L188J356k830k518J065k879L788j269l529K933L245n32
$$ 21560 21752 13475 15586 18774 20130 17300 14782 15847 12968 16756 15487 11958 14891 18136 17604
7990A7604J439l701j71K068N594O638l518J207P81m254M729O729O981L331K647
$$ 17604 19043 15342 15171 17239 22833 29471 25953 27160 27941 23687 28416 35145 42126 45457 48104
7975D8104J268n74p849o37N505L917o273M67m109p232n665m25n342m255K062K653
$$ 48104 49372 48798 40949 40312 45817 49734 43461 43928 39819 32587 26922 26497 21155 16900 18962 21615
7959B1615j170l853o08m182j367n522M3L431K518L06K351l032J131L374J865l603
$$ 21615 20445 16592 15984 11802 10435 4913 4956 8387 10905 11211 13562 10530 11661 15035 16900 13297
7943A3297J082L216n58j90K206L21m599j797P416M604n444l666K099J3447J239
$$ 13297 14379 17595 17037 16847 19053 19374 14775 12978 20394 24998 19554 15888 17987 31434 32673
7928C2673o841j716L626J800l5k929n899l088k554k637o70M438j302p781j56k88
$$ 32673 25832 24116 27742 29542 29507 26578 20679 17591 15037 12400 11730 16168 14866 7085 6929 6641
7912F641L462L544j088p06Q01r489K641M929l434m934n091n396L218O351L184
$$ 6641 10103 13647 12559 11853 12654 3165 5806 10735 7301 2367 -2724 -8120 -4902 1449 4633
7897D633k536l594J862J091J522r98p174K829L962L156K591K448P64J412n811
$$ 4633 2097 -1497 365 1456 2978 1980 -5194 -2365 1597 4753 7344 9792 10556 11968 6157
7882F157l778K658M180L79m311J389N90Q01l021N764P475k415m172p485r573n308
$$ 6157 2379 5037 9217 9596 5285 6674 7264 8065 5044 10808 18283 15868 11696 4211 -5362 -10670
7866a0670m704Q041J3895l584j83L359J444l949l432k251L506L818Q31k352J432
$$ -10670 -15374 -7333 6562 2978 2795 6154 7598 3649 217 -2034 1472 5290 6121 3769 5201
7851E201M647j883o045l261j451o683J543J537J736K599P8k875M019K505m789
$$ 5201 9848 7965 1920 -1341 -2792 -9475 -7932 -6395 -4659 -2060 -1982 -4857 -838 1667 -3122
7836c122P0P87k871j964N916R954J130O666M520k803p676k197j392M892M692m685
$$ -3122 -3052 -2265 -5136 -7100 -1184 8770 9900 16566 21086 18283 10607 8410 7018 11910 16602 11917
7820A1917k626q02J147L149J526n530n303m88J367O144k095k299M08L028Q25n79
$$ 11917 9291 8489 9636 12785 14311 8781 3478 2990 4357 10501 8406 6107 6515 9543 10368 9789
7804I789k052L411m64N322J330j0456n004R06m719O896N201K628K301K261k310
$$ 9789 7737 11148 10684 16006 17336 6880 1876 2782 -1937 4959 10160 12788 15089 17350 15040
7789A5040o970M131k812n859O99j386k209j182l164Q72L633j454J608J897n486
$$ 15040 8070 12201 9389 3530 4229 2843 634 -548 -3712 -2840 793 -661 947 2844 -2642
7774b642O405M013l444k600r199L08M641K934N04K137L876j683k188p95K916r78
$$ -2642 3763 7776 4332 1732 -7467 -7159 -2518 416 920 3057 6933 5250 3062 2267 5183 4205
7758D205q413n07P227N668L992J451N349j280k830l739k034l647m732o134P894
$$ 4205 -4208 -4715 2512 8180 12172 13623 18972 17692 14862 11123 9089 5442 710 -5424 2470
7743B470M886p84n116mj096m104J973m906q63L475O062L377k86n262p507L25K662
$$ 2470 7356 6572 1456 1452 356 -3748 -1775 -6681 -7544 -4069 1993 5370 5084 -178 -7685 -7360 -4698
7726d698K867O412N913j026j778n520j933N776o07l892R37j358k247N299j034
$$ -4698 -1831 4581 10494 9468 7690 2170 237 6013 5406 1514 2451 1093 -1154 4145 3111
7711C111L179j09q379j587p4L552j378k804N927l840k766l162J132J443P37M914
$$ 3111 6290 6181 -2198 -3785 -3859 -307 -1685 -4489 1438 -2402 -5168 -8330 -7198 -5755 -5018 -104
7695a04k500j886L420R91R0j315K284N982L64P30J325J389m7m970r043j049P524
$$ -104 -2604 -4490 -1070 -79 11 -1304 980 6962 7326 8056 9381 10770 10723 5753 -3290 -4339 3185
7678C185K861J135m516O532K948k734o067p9K203M52k314J446j682r21L566P222
$$ 3185 6046 7181 2665 9197 12145 9411 3344 3265 5468 5920 3606 5052 3370 2449 6015 13237
7662A3237J962o382n983k030n419l303K312K661k565p434q03M841l145K70L631
$$ 13237 15199 8817 2834 804 -4615 -7918 -5606 -2945 -5510 -12944 -13747 -8906 -12051 -11781 -8150
7647h150N097j126J766j798N870L811l90J598K332P77r170j1143q97q91O40J951
$$ -8150 -3053 -4179 -2413 -4211 1659 5470 5080 6678 9010 9787 617 -10526 -11423 -12314 -11674 -9723
7631i723l19K694J2237O743o005j352j299n694q575j897O282P586Q131M970j2
$$ -9723 -10042 -7348 4889 11632 5627 4275 2976 -2718 -11293 -13190 -6908 678 8809 13779 13767
7616A3767o585k463j988j1484q350L951Q052L452l922J726K28o998K541J2042
$$ 13767 7182 4719 2731 -8753 -17103 -13152 -5100 -1648 -5570 -3844 -3616 -10614 -8073 3969
7602C969K596n113m802j819l54J63N330o5K20p101o116k781O40J839N230N276
$$ 3969 6565 1452 -3350 -5169 -5523 -5360 -30 -95 125 -6976 -13092 -15873 -15233 -13394 -8164 -2888
7586b888p641l175R895J0139Q25j695M942L926r12k200q8j6J737k328m986k251
$$ -2888 -10529 -13704 -3809 6330 7155 5460 10402 14328 13416 11216 11128 11112 12849 10521 5535 3284
7570C284k763m21M665r28n029p492M243K208k533R691K21k703R34k427r352o749
$$ 3284 521 100 4765 3837 -1192 -8684 -4441 -2233 -4766 4925 5146 2443 3377 950 -8402 -15151
7554a5151K590O690J5081M569k002P61k077L86L728j408j0168j112M064m74n234
$$ -15151 -12561 -5871 9210 13779 11777 12538 10461 10847 14575 13167 2999 1887 5951 5477 243
7539B43k029N15K446P553K282m337k888j743K7n136k233n188J990L144j781l160
$$ 243 -1786 -1271 1175 8728 11010 6673 3785 2042 2069 -3067 -5300 -10488 -8498 -5354 -7135 -10295
7523a0295L952K910l995l266L429Q085J1517R10o864o137J132k435k998l183j860
$$ -10295 -6343 -3433 -7428 -10694 -7265 820 12337 13247 6383 246 1378 -1057 -4055 -7238 -9098
7508i098M730N825j799l528J246O908K288n396j831k251m052J985M795Q45m413
$$ -9098 -4368 1457 -342 -3870 -2624 4284 6572 1176 -655 -2906 -6958 -4973 -178 667 -3746
7493c746L952O517k132j139j926k505O64n97m993O26k472K782J208J872L574j333
$$ -3746 206 6723 4591 3452 1526 -979 -315 -912 -5905 -5279 -7751 -4969 -3761 -1889 1685 352
7477C52k570M688j649m732l768j772J926J0242N979l159p542r61o54n736n78O83
$$ 352 -2218 2470 821 -3911 -7679 -9451 -7525 2717 8696 5537 -2005 -2966 -3620 -9356 -9934 -9251
7461i251k225p31m843M546L560N163K018n299K986J496o312j419K165l256P410
$$ -9251 -11476 -12207 -17050 -12504 -8944 -3781 -1763 -7062 -4076 -2580 -8892 -10311 -8146 -11402 -3992
7446c992K721j151j989j132l976l816l043R056K323l570L80O077O552L182j723
$$ -3992 -1271 -2422 -4411 -5543 -9519 -13335 -16378 -7322 -4999 -8569 -8189 -2112 4440 7622 5899
7431E899L80k524n135J080N704N604J286m853p22J435l827Q36n609p910k49J113
$$ 5899 6279 3755 -1380 -300 5404 11008 12294 7441 6719 8154 4327 5163 -446 -8356 -8605 -7492
7415g492O102K108L205O87l76n361n63p137j965M922J507K361n63M488k0k272
$$ -7492 -1390 718 3923 4610 4234 -1127 -1690 -8827 -10792 -5870 -4363 -2002 -2565 1923 1903 -369
7399c69n603n613K198L082J569R634j085l269M638Q339J53k239O42k077j702P45
$$ -369 -5972 -11585 -9387 -6305 -4736 4898 3813 544 5182 13521 13674 11435 12077 10000 8298 9043
7383I043j363L141m795J54n96j313L842m906l515k572L338K360L657j097M676
$$ 9043 7680 10821 6026 6180 5584 4271 8113 3207 -308 -2880 458 2818 6475 5378 10054
7368A0054L525L69K452M475k42n488o716k413n48L164n99p217m962L508J0954
$$ 10054 13579 13948 16400 20875 20633 15145 8429 6016 5468 8632 8033 816 -4146 -638 10316
7353A0316K125m758l876J603m049J281K916m040k857J498m199L76K886P699P466
$$ 10316 12441 7683 3807 5410 1361 2642 5558 1518 -1339 159 -4040 -3664 -778 6921 14387
7338A4387q277o904q01J525N305K391j878k749j490K945K99j759o70n254K68N541
$$ 14387 6110 -794 -1595 -70 5235 7626 5748 2999 1509 4454 4753 2994 2324 -2930 -2662 2879
7322B879N63r406k026O401q96L755J385O105K66k043l833o207k398l068l827M244
$$ 2879 3442 -5964 -7990 -1589 -2485 1270 2655 8760 9026 6983 3150 -3057 -5455 -8523 -12350 -8106
7306h106Nn35O325m116p375J634M067J631O916k138k379j541j933J051N122m884
$$ -8106 -8101 -8636 -2311 -6427 -13802 -12168 -8101 -6470 446 -1692 -4071 -5612 -7545 -6494 -1372 -6256
7290f256l669Q106L57J463J667J983j930L471l483p833Q73O661j813J142o442
$$ -6256 -9925 -1819 -1462 1 1668 3651 1721 5192 1709 -6124 -5251 1410 -403 739 -5703
7275e703K398O696k327k785n02k113n846Q78J0324J722p21K411J970k187p29N90
$$ -5703 -3305 3391 1064 -1721 -2223 -4336 -10182 -9304 1020 2742 2021 4432 6402 4215 3486 4076
7259D076q57n505P167Q449l888o793M231K714q151m403p823K596O918Q184P63
$$ 4076 3219 -2286 4881 13330 9442 2649 6880 9594 1443 -2960 -10783 -8187 -1269 6915 7678
7244G678k468p76j918l80l302j959N085l099n677q356K605P047L138m036j345
$$ 7678 5210 4434 2516 2136 -1166 -3125 1960 -1139 -6816 -15172 -12567 -5520 -2382 -6418 -7763
7229g763L256N551N475j052o009K53P75P77K429L006o229o301L631l27R76l96
$$ -7763 -4507 1044 6519 5467 -542 -289 486 1263 3692 6698 469 -5832 -2201 -2528 -1552 -1948
7213a948r47J0605L611k273j952k440o721J54K859l24j947N530N297Q23N89k289
$$ -1948 -2895 7710 11321 9048 7096 4656 -2065 -1911 948 624 -1323 4207 9504 10327 10916 8627
7197H627q80k573m881J709k072J251K55l815m516L622l685L07M196K007N223M80
$$ 8627 7747 5174 293 2002 -70 1181 1436 -2379 -6895 -3273 -6958 -6651 -2455 -448 4775 5255
7181E255L50l611r564n347J930M095O619q49j965j299j358q1J997q86M797K095
$$ 5255 5605 1994 -7570 -12917 -10987 -6892 -273 -1122 -3087 -4386 -5744 -5825 -3828 -4714 83 2178
7165B178j1664k808L256N292m902k941N239L442N042J026j738J824l076q931L020
$$ 2178 -9486 -12294 -9038 -3746 -8648 -11589 -6350 -2908 2134 3160 1422 3246 170 -8761 -5741
7150e741l040k786P752o19n162N566N021q58n79L762K552q261m315k014M734J283
$$ -5741 -8781 -11567 -3815 -4434 -9596 -4030 991 133 -446 3316 5868 -2393 -6708 -8722 -3988 -2705
7134b705N553q70p171j973J1455L705r538q499o15O699J766J772j888n547J904
$$ -2705 2848 1978 -5193 -7166 4289 7994 -1544 -10043 -10658 -3959 -2193 -421 -2309 -7856 -5952
7119e952r27M108j208m628O521J911k474l485L16p37q59M99J657L684N706j675
$$ -5952 -6879 -2771 -3979 -8607 -2086 -175 -2649 -6134 -5818 -6555 -7414 -6915 -5258 -1574 4132 2457
7103B457K470k692o148L233L825k39J580m496j1272n597Q687J0492K667l162L167
$$ 2457 4927 2235 -3913 -680 3145 2906 4486 -10 -11282 -16879 -8192 2300 4967 1805 4972
7088D972J03q88L257L411k467o595l157m057j547P975K18r521o422M34P319Q733
$$ 4972 5075 4187 7444 10855 8388 1793 -1364 -5421 -6968 1007 1225 -8296 -14718 -14284 -6965 1768
7072A768j072r266r885M569O356o961J69J0531l946K00M644O77Q01q345p59L550
$$ 1768 696 -8570 -18455 -13886 -7530 -14491 -14322 -3791 -7737 -7537 -2893 -2216 -1415 -9760 -10519 -6969
7056f969M910N623K467k193k850o126l872L862P265L806j505K200l966J77J32
$$ -6969 -2059 3564 6031 3838 988 -5138 -9010 -5148 2117 5923 4418 6618 2652 2829 2961
7041B961k370m265J796K372q89j550j03K155k743k399J368k039k354J46J495R061
$$ 2961 591 -3674 -1878 494 -395 -1945 -2048 107 -2636 -5035 -3667 -5706 -8060 -7914 -6419 2642
7025B642R85m984j417L40p38N04L348L203O075M045k791j2930o055M782N32L684
$$ 2642 3627 -1357 -2774 -2434 -3172 -2668 680 3883 9958 14003 11212 -1718 -7773 -2991 -2459 1225
7009A225j568k78K781P45J546K952r586l916l840J727j528j100j09L634J777J40
$$ 1225 -343 -621 2160 2905 4451 7403 -2183 -6099 -9939 -8212 -9740 -10840 -10949 -7315 -5538 -5398
6993e398j426J872J161P55j117m221j53J197L612Lk571l585L246J2324J07K47
$$ -5398 -6824 -4952 -3791 -3036 -4153 -8374 -8527 -7330 -3718 -3715 -6286 -9871 -6625 5699 5806 6053
6977F053M059K207q867N88k633Q06R46j993j857Q488J552j1283m932Q283m928
$$ 6053 10112 12319 3452 4040 1407 2213 3159 1166 -691 7797 9349 -1934 -6866 1417 -3511
6962c511l529J627J771P11Q70k84k548N39L578M469L771K237r80q843j438L75
$$ -3511 -7040 -5413 -3642 -2931 -2061 -2345 -4893 -4354 -776 3693 7464 9701 8721 -122 -1560 -1185
6946a185P35L137p639l507n71M55j537K877L513k348l683L71O86L562J854m016
$$ -1185 -450 2687 -4952 -8459 -9030 -8575 -10112 -7235 -3722 -6070 -9753 -9382 -8696 -5134 -3280 -7296
6930g296l474R462L305l554q996K672P015J37L352r93m900N304j093R035J479
$$ -7296 -10770 -1308 1997 -1557 -10553 -7881 -866 -729 2623 1630 -3270 2034 941 9976 11455
6915A1455o098n622K809j577m553j623P274n919m473J722R683N428K049m320o956
$$ 11455 5357 -265 2544 967 -3586 -5209 2065 -3854 -8327 -6605 3078 8506 10555 6235 -721
6900g21k101L81m917j1118p813j874P389J12M340K718j0699j0716Q899J0774J142
$$ -721 -2822 -2441 -7358 -18476 -26289 -28163 -20774 -20662 -16322 -13604 -24303 -35019 -26120 -15346 -14204
6885a4204J875P025N089k820l007k611l3M864N662M022L200q170o532o011n695
$$ -14204 -12329 -5304 -215 -3035 -6042 -8653 -8686 -3822 1840 5862 9062 892 -5640 -11651 -17346
6870a7346L591K453O052K800n473m82O708M781N432N385q738l074r808p257k48
$$ -17346 -13755 -11302 -5250 -2450 -7923 -8405 -1697 3084 8516 13901 5163 2089 -7719 -14976 -15224
6855a5224K839O580P839K753j384L427k048j0286r196j776L499O466O95J0847
$$ -15224 -12385 -5805 2034 4787 3403 6830 4782 -5504 -14700 -16476 -12977 -6511 -5816 5031
6841E031M82m105L385m833J596P792k009M8M090j163l449P08m89K4m736l79p81
$$ 5031 5513 1408 4793 -40 1556 9348 7339 7387 11477 10314 6865 7573 7084 7108 2372 1993 1212
6824A212l094l31j525K477N067J420n601K044j317l347m963K06L180Q259j117
$$ 1212 -1882 -2213 -3738 -1261 3806 5226 -375 1669 352 -2995 -7958 -7752 -4572 3687 2570
6809B570p996k860P151R830j934o272J352o270r227L680P18j559M147K15K813
$$ 2570 -5426 -8286 -1135 8695 6761 489 1841 -4429 -13656 -9976 -9258 -10817 -6670 -6455 -3642
6794c642k603l014Q01l220K422L171N14N361l942p82j000J973O508K998M91m100
$$ -3642 -6245 -9259 -8458 -11678 -9256 -6085 -5571 -210 -4152 -4934 -5934 -3961 2547 5545 6036 1936
6778A936M781m131p21l116K631K771k495l570L847P025O5l732O33k120j449k722
$$ 1936 6717 2586 1865 -1251 1380 4151 1656 -1914 1933 8958 9023 5291 5924 3804 2355 -367
6762c67Q71M000j980l855K103K173M427N482p248N53O58L461O906R22L335K140
$$ -367 504 4504 2524 -1331 772 2945 7372 12854 5606 6159 6817 10278 17184 18106 21441 23581
6746B3581N069Q512J0722J90j0995j1405q875l578k79o381K342J133K846n369
$$ 23581 28650 37162 47884 48074 37079 25674 16799 13221 12942 6561 8903 10036 12882 7513
6732G513p425J880N204j165k771j721p404r919M674Q171M354N80K495m334K624
$$ 7513 88 1968 7172 6007 3236 1515 -5889 -15808 -11134 -2963 1391 1971 4466 132 2756
6717B756M550n514j50N67M142o17l203k32p05p235r545l914J0101P850p28j937
$$ 2756 7306 1792 1642 2209 6351 5734 2531 2299 1594 -5641 -15186 -19100 -8999 -1149 -1877 -3814
6701c814N37K119J786K054j12l340K877p665P33O819R77p137p678k484K609N960
$$ -3814 -3277 -1158 628 2682 2570 -770 2107 -5558 -4825 1994 2971 -4166 -11844 -14328 -11719 -5759
6685e759M592K806n140l89K799n02K40n913J257J759J490M614r73J651L671J718
$$ -5759 -1167 1639 -3501 -3890 -1091 -1593 -1353 -7266 -6009 -4250 -2760 1854 881 2532 6203 7921
6669G921o058l244P422M283K151K485J518m833k928n212L847M610q31k693k131
$$ 7921 1863 -1381 6041 10324 12475 14960 16478 11645 8717 3505 7352 11962 11131 8438 6307
6654F307l146p8m762n849K383k18m67K229N167l72j459Q758J210P15l100m297
$$ 6307 3161 3083 -1679 -7528 -5145 -5363 -5830 -3601 1566 1194 -265 8493 9703 10418 7318 3021
6638C021N113j621n136m301o384J55L026L020P479j891l679k270p61k895L473
$$ 3021 8134 6513 1377 -2924 -9308 -9153 -6127 -3107 4372 2481 -1198 -3468 -4229 -7124 -3651
6623c651L289J120j764n90L393J682o996n104N125K940m332j88L305n98q17j835
$$ -3651 -362 758 -1006 -1596 1797 3479 -3517 -8621 -3496 -556 -4888 -5076 -1771 -2369 -3186 -5021
6607e021L753K483M044m732j192J902M389j550k885k263J911L2k25l113L540l67
$$ -5021 -1268 1215 5259 527 -665 1237 5626 4076 1191 -1072 839 871 646 -2467 1073 706
6591G06P573K522p863K31q45O056L249m600l296j561o018m64K392L088O049l291
$$ 706 8279 10801 2938 3169 2324 8380 11629 7029 3733 2172 -3846 -4310 -1918 1170 7219 3928
6575C928k029M115M677k473J413l264n55k810q20n413r226J780K615J457R4j026
$$ 3928 1899 6014 10691 8218 9631 6367 5812 3002 2182 -3231 -12457 -10677 -8062 -6605 -6511 -7537
6559g537j569L096l558K649P118J65k852r49k786K351M520j110J487L847Q10o383
$$ -7537 -9106 -6010 -9568 -6919 199 364 -2488 -3437 -6223 -3872 648 -462 1025 4872 5682 -701
6543g01j979N5k52K818K437j466j886m540M123P311P012k524l124o711j139L784
$$ -701 -2680 -2625 -2877 -59 2378 912 -974 -5514 -1391 5920 12932 10408 7284 573 -566 3218
6527C218J913K348J547K217l440j2742q422O43L381J591N278M809L382P4o936
$$ 3218 5131 7479 9026 11243 7803 -4939 -13361 -12718 -9337 -7746 -2468 2341 5723 5797 -1139
6512a139K529j234k488k852O774K009K129N612n348p153q995l614Q831k130K325
$$ -1139 1390 156 -2332 -5184 1590 3599 5728 11340 5992 -1161 -10156 -13770 -4939 -7069 -4744
6497d744m48L357J817l270J807p791p039P193M736q470M090N742N617p65k229
$$ -4744 -5192 -1835 -18 -3288 -1481 -9272 -16311 -9118 -4382 -12852 -8762 -3020 2597 1832 -397
6482c97j868j364L47l249k208k679J592J259M696k464m443m283O028R39J66L589
$$ -397 -2265 -3629 -3282 -6531 -8739 -11418 -9826 -8567 -3871 -6335 -10778 -15061 -9033 -8094 -7928 -4339
6466d339M5k353n51n92L434N923K8j0187o2O985l865l836L147K798J045o163p902
$$ -4339 -4294 -6647 -7198 -7790 -4356 1567 1595 -8592 -8654 -1669 -5534 -9370 -6223 -3425 -2380 -8543 -16445
6449a6445L665O181P071N434j430n569N79k602q50K421p07K43K296o1j757m50
$$ -16445 -12780 -6599 472 5906 4476 -1093 -514 -3116 -3966 -1545 -2252 -2009 287 226 -1531 -1981
6433a981j183L143K163l52n140k965J347R41K737L11O51L022R93l747j658J793
$$ -1981 -3164 -21 2142 1790 -3350 -6315 -4968 -4027 -1290 -979 -328 2694 3687 -60 -1718 75
6417G5j132J914N362R609l872p677K218j396l3o726m279k320n63J667J927N906
$$ 75 -1057 857 6219 15828 11956 4279 6497 5101 5068 -1658 -5937 -8257 -8820 -7153 -5226 680
6401F80O782N10K925K055n419k428J689J747n25p247n807k642m651L93J231L688
$$ 680 7462 7972 10897 12952 7533 5105 6794 8541 8016 769 -5038 -7680 -12331 -11938 -10707 -7019
6385g019L915k053n934N386R43K517O582k798j175M811j751J194K313K715L608
$$ -7019 -3104 -5157 -11091 -5705 -4762 -2245 4337 1539 364 5175 3424 4618 6931 9646 13254
6370A3254r18j324o640k579n909L531j377n768J777k116O484m82p275K921K377
$$ 13254 12336 11012 4372 1793 -4116 -585 -1962 -7730 -5953 -8069 -1585 -2067 -9342 -6421 -4044
6355d044K958L293l425j244l825j018O532L461j0802k386L319J029Q49j482q524
$$ -4044 -1086 2207 -1218 -2462 -6287 -7305 -773 2688 -8114 -10500 -7181 -6152 -5303 -6785 -15309
6340a5309L56Q456k915J15K215P471m557L011K973K695L456K463J685n557k456
$$ -15309 -14953 -6497 -9412 -9297 -7082 389 -4168 -1157 1816 4511 7967 10430 12115 6558 4102
6325D102o754q148M552M740p765k014P106M934K646K192q389n823k469J776O905
$$ 4102 -2652 -10800 -6248 -1508 -9273 -11287 -4181 753 3399 5591 -2798 -8621 -11090 -9314 -2409
6310b409Q978M147p608K17N404q3l842l486j579j402L165k370K882L667K951k791
$$ -2409 6569 10716 3108 3325 8729 8646 4804 1318 -261 -1663 1502 -868 2014 5681 8632 5841
6294E841J773k527J922k44m171j430p790j5635k117Q311L879O434j987L96L005
$$ 5841 7614 5087 7009 6765 2594 1164 -6626 -22261 -24378 -16067 -12188 -5754 -7741 -7345 -4340
6279d340N709k740J264Q681k009p227k120o70j337k17Q133o60l112k422k179J605
$$ -4340 1369 -1371 -107 8574 6565 -662 -2782 -3452 -4789 -5006 3127 2467 -645 -3067 -5246 -3641
6263c641L696L345o088k239l008j256q10q655j071j27M094K227L967J1169Q857
$$ -3641 55 3400 -2688 -4927 -7935 -9191 -10001 -18656 -19727 -19854 -15760 -13533 -9566 1603 10460
6248A0460O65o493l455q222K858P103O634j610j0574m787N799Q746J23O05R156
$$ 10460 11125 4632 1177 -7045 -4187 2916 9550 7940 -2634 -7421 -1622 7124 7247 7852 17008
6233A7008r258n259K567M932l482m024J278k586J863k718J681k038n616k197j933
$$ 17008 7750 2491 5058 9990 6508 2484 3762 1176 3039 321 2002 -36 -5652 -7849 -9782
6218i782J259M033O579P468k457n735q580J553L584R108l61n137j892j5j551J452
$$ -9782 -8523 -4490 2089 9557 7100 1365 -7215 -5662 -2078 7030 6669 1532 -360 -375 -1926 -474
6202d74l761R295O421m734n654k751n993j867j822J694p28j226L938j932J625
$$ -474 -4235 5060 11481 6747 1093 -1658 -7651 -9518 -11340 -9646 -10374 -11600 -7662 -9594 -7969
6187g969O467J125n897n12L433L847K77R448k482n626n87j089j894l40J539O164
$$ -7969 -1502 -377 -6274 -6786 -3353 494 771 10219 7737 2111 1524 435 -1459 -1799 -260 5904
6171E904L030l266J78l820o589l225J131m812O154J5421J81l788k933Q18P28p313
$$ 5904 8934 5668 5846 2026 -4563 -7788 -6657 -11469 -5315 10106 10287 6499 3566 4384 5112 -2201
6155b201L887L90l385J94M835N044o407M69P50l53l005l685O19L177O270N762
$$ -2201 1686 2076 -1309 -1115 3720 8764 2357 2826 3576 3223 218 -3467 -2848 329 6599 12361
6139A2361J91j323n770k649N43m204j63m339J210N238m141k126M147j43L22L474
$$ 12361 12552 11229 5459 2810 3353 -851 -1014 -5353 -4143 1095 -3046 -5172 -1025 -1168 -846 2628
6123B628k809n683j767N29O247J083k489j21j781J0031j150m462M20O05n766o181
$$ 2628 -181 -5864 -7631 -7102 -855 228 -2261 -2382 -4163 5868 4718 256 676 1281 -4485 -10666
6107a0666Q249O411J808k4m095L217K674m220k773J3M525l260m961L575J328l100
$$ -10666 -2417 3994 5802 5778 1683 4900 7574 3354 581 594 5119 1859 -3102 473 1801 -1299
6091a299j096k427j960o73L527J237m212M95M404n27p37J601n217k686O123N756
$$ -1299 -2395 -4822 -6782 -7455 -3928 -2691 -6903 -6408 -2004 -2531 -3268 -1667 -6884 -9570 -3447 2309
6075B309k457o484J005L729n969L477O795n429O44r89j15k33J871r249k58Q512
$$ 2309 -148 -6632 -5627 -1898 -7867 -4390 2405 -3024 -2380 -3369 -3484 -3717 -1846 -11095 -11353 -2841
6059b841L663o28J315l114Q87o89O89J576k609N699k857J201L37J047L132N630
$$ -2841 822 194 1509 -1605 -718 -1407 -718 858 -1751 3948 1091 2292 2629 3676 6808 12438
6043A2438m688n181j076k843m058K387m543m637J06K589K259L740M16J883J686
$$ 12438 7750 2569 1493 -1350 -5408 -3021 -7564 -12201 -12095 -9506 -7247 -3507 -3091 -1208 478
6028D78j757K033l295j136M62j031L172k964M290O380J178q749l928m145K788
$$ 478 -1279 754 -2541 -3677 -3215 -4246 -1074 -4038 252 6632 7810 -939 -4867 -9012 -6224
6013f224O968Q9k908j878L371l250j978J297P219L368l534q543n239P00O753r5
$$ -6224 744 833 -2075 -3953 -582 -3832 -5810 -4513 2706 6074 2540 -6003 -11242 -10542 -3789 -3884
5997c884L974L08M578p40l8j175k983l466o582N505N000n223M129M910n388N102
$$ -3884 90 398 4976 4236 4198 3023 40 -3426 -10008 -4503 497 -4726 -597 4313 -1075 4027
5981D027L947M8k895j2531n69O916K331K781N817k562r030n778o629N172J0070
$$ 4027 7974 8022 5127 -7404 -7973 -1057 1274 4055 9872 7310 -1720 -7498 -14127 -8955 1115
5966A115m333l01M850o737q113M787J2267N283m514p853J04L627l388p44l070
$$ 1115 -3218 -3519 1331 -5406 -13519 -8732 3535 8818 4304 -3549 -3445 182 -3206 -3950 -7020
5951g020J045M080R40j043K718q09n715o98N628q404L266O044j562m515J35J497
$$ -7020 -5975 -1895 -955 -1998 720 -89 -5804 -6502 -874 -9278 -6012 32 -1530 -6045 -5910 -4413
5935d413n22l82K797p453m780K394P280P266J335K544j797k497l507N540l761
$$ -4413 -4935 -5317 -2520 -9973 -14753 -12359 -5079 2187 3522 6066 4269 1772 -1735 3805 44
5920D4l696L30L130j199k717J679J035J860j207l997J097M099m17p382L43M083
$$ 44 -3652 -3322 -192 -1391 -4108 -2429 -1394 466 -741 -4738 -3641 458 41 -7341 -6998 -2915
5904b915J0129N213r70m965o181o790l913J116o8J72K007J323m035J599M134J032
$$ -2915 7214 12427 11457 6492 311 -6479 -10392 -9276 -9344 -9172 -7165 -5842 -9877 -8278 -4144 -3112
5888c112N774m67p723l531K610O644j386M763m95q531K08M54p08l23O555O320
$$ -3112 2662 2195 -5528 -9059 -6449 195 -1191 3572 3077 -5454 -5246 -4792 -5500 -5823 732 7052
5872G052l66j144p063K929L216p436j033N02K397m800j817O111J5j45l158j639
$$ 7052 6686 5542 -1521 1408 4624 -2812 -3845 -3343 -946 -5746 -7563 -1452 -1437 -1582 -4740 -6379
5856f379R55k790n463j00N894j856L304P885j037m082m026L130O092j108M710
$$ -6379 -5424 -8214 -13677 -13777 -7883 -9739 -6435 1450 413 -3669 -7695 -4565 1527 419 5129
5841E129j906j826J0613L661l279J636K549k196o460l084K960K080m597o772K902
$$ 5129 3223 1397 12010 15671 12392 14028 16577 14381 7921 4837 7797 9877 5280 -1492 1410
5826A410N031L115n560q218k116L049J122m802L988M511j361l922R05J1839O012
$$ 1410 6441 9556 3996 -4222 -6338 -3289 -2167 -6969 -2981 1530 169 -3753 -2848 8991 15003
5811A5003l841o122n955q429j473R419L853P84l348K185p87M622q404j430k696
$$ 15003 11162 5040 -915 -9344 -10817 -1398 2455 3239 -109 2076 1289 5911 -2493 -3923 -6619
5796f619j87K610N05j0608k52N817K189r89O90R638M980m038l864P73M420N43
$$ -6619 -6806 -4196 -3691 -14299 -14551 -8734 -6545 -7534 -6844 2794 7774 3736 -128 645 5065 5608
5780E608n367n996k238k602r68o98Q547J4374k72j1170m621J602m889L715q740
$$ 5608 241 -5755 -7993 -10595 -11563 -12261 -3714 10660 10388 -782 -5403 -3801 -8690 -4975 -13715
5765a3715j349Q232Q823K943L346j349m358p901p396K866R622m243k523M763Q265
$$ -13715 -15064 -6832 1991 4934 8280 6931 2573 -5328 -12724 -9858 -236 -4479 -7002 -2239 6026
5750F026m007j0821J912P540j119j640l423l443m446M133O874Q584r70P7l887
$$ 6026 2019 -8802 -6890 650 -469 -2109 -5532 -8975 -13421 -9288 -2414 6170 5200 5277 1390
5735A390l807l479J921j985n858K273Q401p65l575k768L459L875O133N250j854
$$ 1390 -2417 -5896 -3975 -5960 -11818 -9545 -1144 -1909 -5484 -8252 -4793 -918 5215 10465 8611
5720H611q758l719l961M063N815K964q180l678R63J677n781n836M466Q055K585
$$ 8611 -147 -3866 -7827 -3764 2051 5015 -3165 -6843 -5880 -4203 -9984 -15820 -11354 -3299 -714
5705g14l240k796J888J556L861j950J494Q499L750l770k45l470K694K893p499
$$ -714 -3954 -6750 -4862 -3306 555 -1395 99 8598 12348 8578 8333 4863 7557 10450 2951
5690B951l069L742j312j815k337L622l56j351r55K936K219N547N953l875j0273
$$ 2951 -118 3624 2312 497 -1840 1782 1426 75 -880 2056 4275 9822 15775 11900 1627
5675A627M624K601p145r839j468k012P687O102k794K502L526Q63Q86n018q02Q19
$$ 1627 6251 8852 1707 -8132 -9600 -11612 -3925 2177 -617 1885 5411 6274 7160 2142 1340 2159
5659B159p715q444p03J412K148n10L47j388K63J0972P329O485K20m9M889K281
$$ 2159 -5556 -14000 -14703 -13291 -11143 -11653 -11306 -12694 -12431 -1459 5870 12355 12575 12526 17415 19696
5643A9696o177p700l561l769l547n970j442J892k928K744Q511J617m85l348m956
$$ 19696 13519 5819 2258 -1511 -5058 -11028 -12470 -10578 -13506 -10762 -2251 -634 -1119 -4467 -9423
5628i423P187M706r220n056j973K628J314L594L843M231N545r838k121m445N564
$$ -9423 -2236 2470 -6750 -11806 -13779 -11151 -9837 -6243 -2400 1831 7376 -2462 -4583 -9028 -3464
5613c464J2956M735n869L18k225PJ9L67n797j189n954j546j299L953Q232j875
$$ -3464 9492 14227 8358 8676 6451 6458 6477 6844 1047 -142 -6096 -7642 -8941 -4988 3244 1369
5597A369j957j896R65j629k864J777j568m127l918k677M068J1573J0166j775r133
$$ 1369 -588 -2484 -1519 -3148 -6012 -4235 -5803 -9930 -13848 -16525 -12457 -884 9282 7507 -1626
5582a626p24L456l436P846J155k286m986m165l683j906M107J141o23k3O595M545
$$ -1626 -2350 1106 -2330 5516 6671 4385 -601 -4766 -8449 -10355 -6248 -5107 -5730 -5753 842 5387
5566E387K730l298j0285l669K616Q531J0802j767m719J13q738l217m23o76l526
$$ 5387 8117 4819 -5466 -9135 -6519 2012 12814 11047 6328 6441 -2297 -5514 -5937 -6613 -10139
5551a0139J297J770J547J262r19k494k951M816R622J690l056m555K076N112j949
$$ -10139 -8842 -7072 -5525 -4263 -5182 -7676 -10627 -5811 3811 5501 2445 -2110 -34 5078 3129
5536C129p684k114Q03K210j419N032K867j002p88n25j927P316k123p483J26j46
$$ 3129 -4555 -6669 -5866 -3656 -5075 -43 2824 1822 1034 509 -1418 5898 3775 -3708 -3582 -3728
5520c728P881K295o362n003M780l417k52O06N974N533M52l094o439J353J86l861
$$ -3728 4153 6448 86 -4917 -137 -3554 -3806 -3200 2774 8307 8759 5665 -774 579 765 -3096
5504c096l25m71l105N180N194k463m926j054m843O511L908%J275M885q308p867
$$ -3096 -3421 -3892 -6997 -1817 3377 914 -4012 -5066 -9909 -3398 510 510 1785 6670 -1638 -9505
5488i505k364L830J169K693m08k065K236r5n795l772K996J993O31l305M395J120
$$ -9505 -11869 -8039 -6870 -4177 -4585 -6650 -4414 -4509 -10304 -14076 -11080 -9087 -8456 -11761 -7366 -6246
5472f246N877k207j040p315K459K62J855K561n348l119Q11J4496O199K071o713
$$ -6246 -369 -2576 -3616 -10931 -8472 -8210 -6355 -3794 -9142 -12261 -11450 3046 9245 11316 4603
5457D603m909j900r0k548m632l049L379o70K485L122M825L474K208J494J200n433
$$ 4603 -306 -2206 -2296 -4844 -9476 -12525 -9146 -9816 -7331 -4209 616 4090 6298 7792 8992 3559
5441C559o699r87J909O646L383R03o422k594l340o477K546P992K587j019N238
$$ 3559 -3140 -4127 -2218 4428 7811 8714 2292 -302 -3642 -10119 -7573 419 3006 1987 7225
5426G225j065p097n169p01O82K404L736J710K531l334m153l45J903k68K220L892
$$ 7225 6160 -937 -6106 -6807 -6125 -3721 15 1725 4256 922 -3231 -3576 -1673 -1941 279 4171
5410D171P13M64j130j610O404r23o207q069l42O243k917j020o50j769p8m458n70
$$ 4171 4884 5348 4218 2608 9012 8089 1882 -6187 -6529 -286 -3203 -4223 -4873 -6642 -6720 -11178 -11748
5393a1748M282P081N570l225n875M319n979j229K347r70m160K277Q33M135P177
$$ -11748 -7466 -385 5185 1960 -3915 404 -5575 -6804 -4457 -5427 -9587 -7310 -6477 -2342 4835
5378D835k296j460K892K0n152n160L038j658j25q01K983J546r73k206P42l958
$$ 4835 2539 1079 3971 3991 -1161 -6321 -3283 -4941 -5066 -5867 -2884 -1338 -2311 -4517 -3775 -7733
5362g733J861K491j742K739L361p03j753j401L658O015l852n698L260L500l828
$$ -7733 -5872 -3381 -5123 -2384 977 274 -1479 -2880 778 6793 2941 -2757 503 4003 175
5347A75J028k210K280n462k128K49M833J874K00Q760J731k028j1226J31L768p132
$$ 175 1203 -1007 1273 -4189 -6317 -6068 -1235 639 839 9599 11330 9302 -1924 -1793 1975 -5157
5331e157K455J50l310N854p87k601L730L756l443J478K772J277k281p080n212
$$ -5157 -2702 -2552 -5862 -8 -795 -3396 334 4090 647 2125 4897 6174 3893 -3187 -8399
5316h399P419O977J10l611m078K405Q315m01p081m605j676q05L87J524Q25K399
$$ -8399 -980 5997 6107 2496 -1582 823 9138 8737 1656 -2949 -4625 -5430 -5043 -3519 -2694 -295
5300b95m01m303l979J500R763j799n878l755K506L000P079k335l428n463K988
$$ -295 -696 -4999 -8978 -7478 2285 486 -5392 -9147 -6641 -3641 3438 1103 -2325 -7788 -4800
5285d800N6j105K645N923J534J205o575p681l538O805k453J990L56R983K652q790
$$ -4800 -4744 -5849 -3204 2719 4253 5458 -1117 -8798 -12336 -5531 -7984 -5994 -5638 4345 6997 -1793
5269a793K62L279p67M21O28k425K904K843R60R99k986o866P36N302J545k731k74
$$ -1793 -1531 1748 981 1402 2030 -395 2509 5352 6312 7311 4325 -2541 -1805 3497 5042 2311 2037
5252B037J970o205l073L708J969L288o177l637k133M858L691N383j486k684k894
$$ 2037 4007 -2198 -5271 -1563 406 3694 -2483 -6120 -8253 -3395 296 5679 4193 1509 -1385
5237a385n175o033P376J823L756K179l023k461o60K38o702l590m516J232J3036
$$ -1385 -6560 -12593 -5217 -3394 362 2541 -482 -2943 -3603 -3365 -10067 -13657 -18173 -16941 -3905
5222c905M940m618M788j841k375K632j624k785j861L449K817p823n250L820N739
$$ -3905 1035 -3583 1205 -636 -3011 -379 -2003 -4788 -6649 -3200 -383 -8206 -13456 -9636 -3897
5207c897j376m380l390L140J691m249L638J928O69o02J152K946M389j218j981
$$ -3897 -5273 -9653 -13043 -9903 -8212 -12461 -8823 -6895 -6226 -6828 -5676 -2730 1659 441 -1540
5192a540J655k0k545K677l384j4778J220J1398O302J516m779J644K696j750J98
$$ -1540 115 95 -2450 227 -3157 -17935 -16715 -5317 985 2501 -2278 -634 2062 312 510
5177E10o139p35K247J193M368J688m990L30K59K787j273J881J044j717k700n559
$$ 510 -5629 -6364 -4117 -2924 1444 3132 -1858 -1528 -1269 1518 245 2126 3170 1453 -1247 -6806
5161f806L16M511M363p36J255n095K906O858K71M499j149l99P96m04j0071n071
$$ -6806 -6490 -1979 2384 1648 2903 -2192 714 7572 7843 12342 11193 10794 11590 11186 1115 -3956
5145c956Q76J359J159k299m0K206j775J918m426j662K834L64n667n507L188K356
$$ -3956 -3080 -1721 -562 -2861 -2901 -695 -2470 -552 -4978 -6640 -3806 -3442 -9109 -14616 -11428 -9072
5129i072n229j407J180N737M669K657j616M392j665q4k586J281j011L137J223
$$ -9072 -14301 -15708 -14528 -8791 -4122 -1465 -3081 1311 -354 -438 -3024 -1743 -2754 383 1606
5114A606l144p352p055j203M542N255P035j672p83l039K970L415K891L472m946
$$ 1606 -1538 -8890 -15945 -17148 -12606 -7351 -316 -1988 -2771 -5810 -2840 575 3466 6938 1992
5099A992r357j58L440N744j875n472m2j613K78J990K432J524j059R05M679j559
$$ 1992 -7365 -7523 -4083 1661 -214 -5686 -5728 -7341 -7063 -5073 -2641 -1117 -2176 -1271 3408 1849
5083A849m068k191l391R428P115l039n867n214q973j090J0934L311q50l377O210
$$ 1849 -2219 -4410 -7801 1627 8742 5703 -164 -5378 -14351 -15441 -4507 -1196 -2046 -5423 787
5068G87J308n373r480n379J1600J2041M585k682p753o93K113r312L081N796L150
$$ 787 2095 -3278 -12758 -18137 -6537 5504 10089 7407 -346 -1039 1074 -8238 -5157 639 3789
5053C789M343k139O82m098p59M353l866q867j980L930P99k271O046k254m839l309
$$ 3789 8132 5993 6675 2577 1818 6171 2305 -6562 -8542 -4612 -3813 -6084 -38 -2292 -7131 -10440
5037a0440n69j746L822N610K83j624n499R50q96p97P326O675R13L172j722p055
$$ -10440 -11009 -12755 -8933 -3323 -3040 -4664 -10163 -9213 -10109 -10906 -3580 3095 4008 7180 5458 -1597
5021a597m225M729L040r30p967J804K359J720p69J329N82M417K438o808q97L212
$$ -1597 -5822 -1093 1947 1017 -6950 -5146 -2787 -1067 -1836 -507 75 4492 6930 122 -775 2437
5005B437K010l636p96j924L052r139k382J362o72M616L449m271j230O404L172
$$ 2437 4447 811 15 -1909 1143 -7996 -10378 -9016 -9688 -5072 -1623 -5894 -7124 -720 2452
4990B452n805L79O408L988n728q456K01K879l292L257r65J594J269q46J715L124
$$ 2452 -3353 -2974 3434 7422 1694 -6762 -6561 -3682 -6974 -3717 -4682 -3088 -1819 -2665 -950 2174
4974B174l639k772K988K200j078p607k075J1204R120p223k932m101K683Pl020
$$ 2174 -1465 -4237 -1249 951 -127 -7734 -9809 1395 10515 3292 360 -3741 -1058 -1051 -4071
4959d071P003K667m20j298k746r86L734L720j382p69n658q31l641l681l777N713
$$ -4071 2932 5599 5179 3881 1135 149 3883 7603 6221 5452 -206 -1037 -4678 -8359 -12136 -6423
4943f423P465J461O986n706q045j412J330N769J623Q68k8l87L273l231l958j245
$$ -6423 1042 2503 9489 3783 -4262 -5674 -4344 1425 3048 3916 3888 3501 6774 3543 -415 -1660
4927a660o621k467N545M797j007l449k178R03P16O392M003m827K912j148k250
$$ -1660 -8281 -10748 -5203 -406 -1413 -4862 -7040 -6137 -5421 971 4974 147 3059 1911 -339
4912c39M056o8k713p540r72L192J901P29k658l28k28J79MR77R01q240l43P095
$$ -339 3717 3649 936 -6604 -7576 -4384 -2483 -1754 -4412 -4740 -4968 -4789 -4785 -3808 -2907 -11147 -11490 -4395
4894d395P676l248l445%L421R90K32L39K037k641m219l693J892J561j960K09m39
$$ -4395 3281 33 -3412 -3412 9 999 1231 1570 3607 966 -3253 -6946 -5054 -3493 -5453 -5244 -5683
4877e683n468j332K427L096J217m666k838K521M644N44j712R30M32l844J293J645
$$ -5683 -11151 -12483 -10056 -6960 -5743 -10409 -13247 -10726 -6082 -5538 -7250 -6320 -5888 -9732 -8439 -6794
4861f794k192J558R832K701n112k36n049M962M422j097m363l399R486K333l353
$$ -6794 -8986 -7428 2404 5105 -7 -243 -5292 -330 4092 2995 -1368 -4767 4719 7052 3699
4846C699M104M773j276J174Q97J019P56m787m564j896k821o274K488n37M931k385
$$ 3699 7803 12576 11300 12474 13371 14390 15146 10359 5795 3899 1078 -5196 -2708 -3245 1686 -699
4830f99n225K555J97M075L914K233k525o546k889m974n914N40L783M082O534k7
$$ -699 -5924 -3369 -3172 903 4817 7050 4525 -2021 -4910 -9884 -15798 -15258 -11475 -7393 -859 -886
4814h86N145R94m919l580k434J561j844K977Q69j056j2136n965O254O535Q257
$$ -886 4259 5253 334 -3246 -5680 -4119 -5963 -2986 -2117 -3173 -15309 -21274 -15020 -8485 -228
4799b28r95k397K756m105o272O416M121o641J742K421K177K695l575J324J1369
$$ -228 -1223 -3620 -864 -4969 -11241 -4825 -704 -7345 -5603 -3182 -1005 1690 -1885 -561 10808
4784A0808k450m876l906q312N997O689k003j336j910M18l682M454P703k062J114
$$ 10808 8358 3482 -424 -8736 -2739 3950 1947 611 -1299 -881 -4563 -109 7594 5532 6646
4769F646M651M525j701j4284k118k518l406J285K254p139M893R644J917j752K987
$$ 6646 11297 15822 14121 -163 -2281 -4799 -8205 -6920 -4666 -11805 -6912 2732 4649 2897 5884
4754E884k268J237j109j542k744m074k536M199n48L519M406k353p780m694l272
$$ 5884 3616 4853 3744 2202 -542 -4616 -7152 -2953 -3501 18 4424 2071 -5709 -10403 -13675
4739a3675K249L442Pm948Q42R726M557R27k015M112K027j0546m415m903n848L068
$$ -13675 -11426 -7984 -7977 -12925 -12083 -2357 2200 3127 1112 5224 7251 -3295 -7710 -12613 -18461 -15393
4723a5393L221M899j060M178M27j882L979k787N921J269n168m126j262N142N192
$$ -15393 -12172 -7273 -8333 -4155 -3728 -5610 -1631 -4418 1503 2772 -2396 -6522 -7784 -2642 2550
4708B550m360k711O024Q50j752m127n310l976O974O361l27l52O030k403p225K66
$$ 2550 -1810 -4521 1503 2353 601 -3526 -8836 -12812 -5838 523 196 -156 5874 3471 -3754 -3488
4692c488O04L336J055J018p669J506J684j064K257j71q30q236m69M448R10N6N050
$$ -3488 -2884 452 1507 2525 -5144 -3638 -1954 -3018 -761 -932 -1762 -9998 -10467 -6019 -5109 -5053 -3
4675cj460j322J067M882O391p385J522m87L39j07M168L344m018n984L430m58K717
$$ -3 -1463 -2785 -1718 3164 9555 2170 3692 3205 3544 3437 7605 10949 6931 947 4377 3919 6636
4658F636K220k497K236K999N443J337o596M60L365k947m818o337r01j808m897
$$ 6636 8856 6359 8595 11594 17037 18374 11778 12238 15603 12656 7838 1501 600 -1208 -6105
4643f105m698N99N223n55n066L313N653J700m009M054K744j459N829k364q138
$$ -6105 -10803 -10204 -4981 -5536 -10602 -7289 -1636 64 -3945 109 2853 1394 7223 4859 -3279
4628c279m535l686n713J226Q410L378L321q218M550L339J920j072P85R77R65K340
$$ -3279 -7814 -11500 -17213 -15987 -7577 -4199 -878 -9096 -4546 -1207 713 -359 426 1403 2368 4708
4612D708L923j241o052p116l258Q800k346p116l350L244k802M364N978L643K634
$$ 4708 8631 7390 1338 -5778 -9036 -236 -2582 -9698 -13048 -9804 -12606 -8242 -2264 1379 4013
4597D013M387l23K115p875j757m149n175K161L259L211J950r57j276N349J715
$$ 4013 8400 8077 10192 2317 560 -3589 -8764 -6603 -3344 -133 1817 860 -416 4933 6648
4582F648j498r07M57k0K018k465K02m25P423J041m276k166j422l595q992k141
$$ 6648 5150 4243 4700 4680 6698 4233 4435 4010 11433 12474 8198 6032 4610 1015 -7977 -10118
4566a0118k73O648K998m544J488O241O674R72j2247m84M044N449M65l031K6L432
$$ -10118 -10391 -3743 -745 -5289 -3801 2440 9114 10086 -2161 -2645 1399 6848 7313 4282 4308 7740
4550G740n134m364O65P913P14K628o44n572m689r845L347L466k129M729J370k668
$$ 7740 2606 -1758 -1093 6820 7534 10162 9518 3946 -743 -10588 -7241 -3775 -5904 -1175 195 -2473
4534b473n97O067O751r464j0953K964P861R720K706l111J866q363k440j588j1174
$$ -2473 -3070 2997 9748 284 -10669 -7705 156 9876 12582 9471 11337 2974 534 -1054 -12228
4519a2228n134q86L425L27M394J914k037Q484p5o701j229J2180O978m387n205
$$ -12228 -17362 -18248 -14823 -14496 -10102 -8188 -10225 -1741 -1816 -8517 -9746 2434 9412 5025 -180
4504a80L46M813M049k935n824p290n77o718j035j718Q405J988m960j105J396N549
$$ -180 166 4979 9028 6093 269 -7021 -7598 -14316 -15351 -17069 -8664 -6676 -11636 -12741 -11345 -5796
4488e796K577L290M566m53K47L179o670p873L319M192m532j342N330j4L55j832
$$ -5796 -3219 71 4637 4184 4431 7610 940 -6933 -3614 578 -3954 -5296 34 20 375 -1457
4472a457K12N039K412m98j052P77K90m655m175k793M744R67r462J900J0195J106
$$ -1457 -1245 3794 6206 5708 4656 5433 5723 1068 -3107 -5900 -1156 -189 -9651 -7751 2444 3550
4456C550q24m210o992l698K025j139M722M207q0m543j001N357O091l634k748O10
$$ 3550 2726 -1484 -8476 -12174 -10149 -11288 -6566 -2359 -2439 -6982 -7983 -2626 3465 -169 -2917 -2307
4440b307K839L089j666m569m068K597O752k055L42M638M376k213p462m099k315
$$ -2307 532 3621 1955 -2614 -6682 -4085 2667 612 954 5592 9968 7755 293 -3806 -6121
4425f121k030k904K87K306J168k250L74n88l954o617J240Q973O052L380j725o040
$$ -6121 -8151 -11055 -10768 -8462 -7294 -9544 -9170 -9758 -13712 -20329 -19089 -10116 -4064 -684 -2409 -8449
4409h449j319k678r33m27Q063N452K70m005O17L544l493M41N854N922J576o842
$$ -8449 -9768 -12446 -13379 -13806 -5743 -291 -21 -4026 -3409 135 -3358 -2917 2937 8859 10435 3593
4393C593l970j417m811K56l527J048J083J190Q5m31P427M662j389j660j82n360
$$ 3593 -377 -1794 -6605 -6349 -9876 -8828 -7745 -6555 -6470 -6901 526 5188 3799 2139 1957 -3403
4377c403m489J199L097M455K473r60O790j112l987q116J350j951j78n65Q057O28
$$ -3403 -7892 -6693 -3596 859 3332 2372 9162 8050 4063 -4053 -2703 -4654 -4832 -5397 2660 3288
4361C288Q246J676N36R69r858n209l302M197P962P755j087j1258n634j822N33
$$ 3288 11534 13210 13746 14715 4857 -352 -3654 543 8505 16260 15173 3915 -1719 -3541 -3008
4346c008J82m502P4M421P869J689L316l580r369L993j248j535M97O954K338k918
$$ -3008 -2826 -7328 -7254 -2833 5036 6725 10041 6461 -2908 1085 -163 -1698 -1201 5753 8091 5173
4330E173k884l384l0K236J270R71n504j930O66N670m000m704J308j965j942M395
$$ 5173 2289 -1095 -1125 1111 2381 3352 -2152 -4082 -3416 2254 -1746 -6450 -5142 -7107 -9049 -4654
4314d654J714k273N83M698J656j341m573p876J509O362n441m362L512l143J2896
$$ -4654 -2940 -5213 -4630 68 1724 383 -4190 -12066 -10557 -4195 -9636 -13998 -10486 -13629 -733
4299g33J4223q38m951k497k035J70J075j947k045J46m599M457J542m553O98J968
$$ -733 13490 12652 7701 5204 3169 3339 4414 2467 422 568 -4031 426 1968 -2585 -1887 81
4283H1j227J345p28o844m191K124K979K602j137J869K275k544k284k404o111L390
$$ 81 -1146 199 -529 -7373 -11564 -9440 -6461 -3859 -4996 -3127 -852 -3396 -5680 -8084 -14195 -10805
4267a0805L403q04j027M797j608O624Q55k02L94q13n582o341M637J337m931L144
$$ -10805 -7402 -8206 -9233 -4436 -6044 580 1435 1233 1627 814 -4768 -11109 -6472 -5135 -10066 -6922
4251f922N708L040l270k120M939L23j629M246J423J83p444l107O076Q683o881
$$ -6922 -1214 1826 -1444 -3564 1375 1698 69 4315 5738 5921 -1523 -4630 1446 10129 3248
4236C248j4823m513M85L973O540P00p245n585L230J1245J3862m42p685m410j320
$$ 3248 -11575 -16088 -15603 -11630 -5090 -4390 -11635 -17220 -13990 -2745 11117 10675 2990 -1420 -2740
4221b740k802k538Q875R341K398n574l42M623J508L14m450o192m978K173O45J128
$$ -2740 -5542 -8080 795 10136 12534 6960 6618 11241 12749 13063 8613 2421 -2557 -384 261 1389
4205A389M774L739k986P02j002l396Q7Q48m077j914p21N20M974J525l933j188
$$ 1389 6163 9902 6916 7618 6616 3220 3307 4155 78 -1836 -2557 -2037 2937 4462 529 -659
4189f59k679n641J815O977J804K156J071o68M473p027p122J817K916J704l72L795
$$ -659 -3338 -8979 -7164 -187 1617 3773 4844 4176 8649 1622 -5500 -3683 -767 937 565 4360
4173D360J56M111q83J318M512M336n801n374o751J383O561j520r90m90o522K413
$$ 4360 4516 8627 7744 9062 13574 17910 12109 6735 -16 1367 7928 6408 5418 4928 -1594 819
4157H19N181J891m177p464k937q30R128o24K67L136N598m794j640j031j627j648
$$ 819 6000 7891 3714 -3750 -6687 -7517 1611 987 1254 4390 9988 5194 3554 2523 896 -752
4141g52K888j043K468M142l963k006m407m749N709L877j589k587m453K665r129
$$ -752 2136 1093 3561 7703 3740 1734 -2673 -7422 -1713 2164 575 -2012 -6465 -3800 -12929
4126a2929J186J457k122P60L361J2834J578m15j480k016m997l37k485M704K269
$$ -12929 -11743 -10286 -12408 -11648 -8287 4547 6125 5710 4230 2214 -2783 -3120 -5605 -901 1368
4111A368r681L892R116k956p586k802q64K767R65L523j225M260K49j631P5j040
$$ 1368 -8313 -4421 4695 1739 -5847 -8649 -9513 -6746 -5781 -2258 -3483 777 1026 -605 -530 -1570
4095a570M08l527k068M325Q400K180k460k270k460L622k715l784J615P575l733
$$ -1570 -1162 -4689 -6757 -2432 5968 8148 5688 3418 958 4580 1865 -1919 -304 7271 3538
4080C538p412P45m56n634O53K781n360O233P120J552o628q605j521k406L55N012
$$ 3538 -3874 -3129 -3585 -9219 -8566 -5785 -11145 -4912 2208 3760 -2868 -11473 -12994 -15400 -15045 -10033
4064a0033J1769O767j992K720L106l335p926o100k334M503M239p39o495J676L450
$$ -10033 1736 8503 6511 9231 12337 9002 1076 -5024 -7358 -2855 1384 645 -5850 -4174 -724
4049g24k83K057j148M3P188m073n917l355n014Q319J3132n599k732n392j261l084
$$ -724 -1007 1050 -98 -55 7133 3060 -2857 -6212 -11226 -2907 10225 4626 1894 -3498 -4759 -7843
4033g843O01P47j706K883J503k129k010K138P280J526J627K546k708l314m248
$$ -7843 -7242 -6495 -8201 -5318 -3815 -5944 -7954 -5816 1464 2990 4617 7163 4455 1141 -3107
4018c107l912j238l676K54J975M854o77j97R48J079l554L759L341K516J196l789
$$ -3107 -7019 -8257 -11933 -11679 -9704 -4850 -5527 -5724 -4776 -3697 -7251 -3492 -151 2365 3561 -228
4002b28k291m801Q504l332k150J555o40l917k898k623L039Q621k554J02K100O4
$$ -228 -2519 -7320 1184 -2148 -4298 -2743 -3383 -7300 -10198 -12821 -9782 -1161 -3715 -3613 -1513 -1449
3986a449J116N54R00j864k10M917J516j1292l716K906m86Q631L001q171j418L819
$$ -1449 -333 221 1121 -743 -953 3964 5480 -5812 -9528 -6622 -7108 1523 4524 -3647 -5065 -1246
3970a246q559o070N585J0311k60j864N296N328m897o565L013L549M039m044p08
$$ -1246 -9805 -15875 -10290 21 -239 -2103 3193 8521 3624 -2941 72 3621 7660 3616 2908
3955B908n828L095N187P02K18o477o119Q57j853j793k01P984J018K78J548m09
$$ 2908 -2920 175 5362 6064 6282 -195 -6314 -5457 -7310 -9103 -9304 -1320 -302 -24 1524 1115
3939A115L30R20K326m377j100N6L78N043q42r975j233R78l720k033Q461M366k588
$$ 1115 1445 2365 4691 314 -786 -730 -352 4691 3849 -6126 -7359 -6381 -10101 -12134 -3673 693 -1895
3922a895J152j88K074N228N6o08q27o260r32K017J364k080m444J222L475J272
$$ -1895 -743 -931 1143 6371 6427 5819 4992 -1268 -2200 -183 1181 -899 -5343 -4121 -646 626
3906F26j247K707K756n459K994l823M336k00k815J883n206l806J022L220q9M606
$$ 626 -621 2086 4842 -617 2377 -1446 2890 2690 -125 1758 -3448 -7254 -6232 -3012 -3101 1505
3890A505K191p395l929M937O503L96o161j085J570l963l164M229N577J660m746
$$ 1505 3696 -3699 -7628 -2691 3812 4208 -1953 -3038 -1468 -5431 -8595 -4366 1211 2871 -1875
3875a875m396K151M170J279l774K915J046l086r318p41R216K904m879n901l914
$$ -1875 -6271 -4120 50 1329 -2445 470 1516 -1570 -10888 -11629 -2413 491 -4388 -10289 -14203
3860a4203J8363O647M49j882k620J538p758q246k572p814r7N397R169L710J874
$$ -14203 4160 10807 11256 9374 6754 8292 534 -7712 -10284 -18098 -18195 -12798 -3629 81 1955
3845A955L631j883l375J244N32O868K624N42j400l77P73J921P63l489r770j3673
$$ 1955 5586 3703 328 1572 2104 8972 11596 12138 10738 10361 11134 13055 13818 10329 559 -13114
3829a3114n97L445N484K331k345L472J483j06l413k904k433J700M79L626m503
$$ -13114 -13711 -10266 -4782 -2451 -4796 -1324 159 53 -3360 -6264 -8697 -6997 -6518 -2892 -7395
3814g395J268N525L740p443j177M077j643J440j792m577P1l95J793M661K110k062
$$ -7395 -6127 -602 3138 -4305 -5482 -1405 -3048 -1608 -3400 -7977 -7906 -8301 -6508 -1847 263 -1799
3798a799l90J1158J492m800j396n492L02M600r38p28Q09J282j770R87n921n153
$$ -1799 -2189 8969 10461 5661 4265 -1227 -925 3675 2737 2009 2818 4100 2330 3317 -2604 -7757
3782g757J470j131m627O498P777L846O11m566r634n113M375L769P411M893k680
$$ -7757 -6287 -7418 -12045 -5547 2230 6076 6687 2121 -7513 -12626 -8251 -4482 2929 7822 5142
3767E142k496K976N126k70J352L790m070o557k385J443J303l919k168l896P263
$$ 5142 2646 5622 10748 10478 11830 15620 11550 4993 2608 4051 5354 1435 -733 -4629 2634
3752B634L533r77n396O260j058l475j515l3N194j222Q201l256o137l590j3111
$$ 2634 6167 5190 -206 6054 4996 1521 6 -27 5167 3945 12146 8890 2753 -837 -13948
3737a3948j889J3179J1303k238q000N41L02p58n56K906o262j323k873j849L886
$$ -13948 -15837 -2658 8645 6407 -1593 -1052 -750 -1508 -2064 842 -5420 -6743 -9616 -11465 -7579
3722g579P476J0920n230n420k381L188N594O44k72j820m737R59M576J601J825
$$ -7579 -103 10817 5587 167 -2214 974 6568 7212 6940 5120 383 1342 5918 7519 9344
3707I344l027N541L134l116q4m739o452l656L412q44K361l053m300N702J154m40
$$ 9344 6317 11858 14992 11876 11792 7053 601 -3055 357 -487 1874 -1179 -5479 223 1377 937
3691I37k157M866m533o523m676O020R461N542r46j011n079P56O218l730j3215
$$ 937 -1220 3646 -887 -7410 -12086 -6066 3395 8937 7991 6980 1901 2657 8875 5145 -8070
3676h070j682O550L90l589J08M159N104K40J573L192m685j230K455k059k154o51
$$ -8070 -9752 -3202 -2812 -6401 -6293 -2134 2970 3210 4783 7975 3290 2060 4515 2456 302 -349
3660c49J146j921N199n201L18P356K280l726n70l917j980J710J705m757m965M149
$$ -349 797 -1124 4075 -1126 -808 6548 8828 5102 4532 615 -1365 345 2050 -2707 -7672 -3523
3644c523N636K596Q57m885L762M64m612j137k912N04J437m63M17L450M255n99
$$ -3523 2113 4709 5566 681 4443 4907 295 -842 -3754 -3250 -1813 -2276 -1859 1591 5846 5247
3628E247o377k413l155j566L583R26p346j533p719j356M098O264Q067N50J628
$$ 5247 -1130 -3543 -6698 -8264 -4681 -3755 -11101 -12634 -20353 -21709 -17611 -11347 -3280 -2730 -1102
3613a102L732j934l32l47Q77N38m050K109k074j154K220J813l614K020J855j437
$$ -1102 2630 696 364 17 894 1432 -2618 -509 -2583 -3737 -1517 296 -3318 -1298 557 -880
3597h80K441q123Q00L800N187N046m930m594J90K542O334l347l338J351m80k698
$$ -880 1561 -6562 -5762 -1962 3225 8271 3341 -1253 -1063 1479 7813 4466 1128 2479 1999 -699
3581f99N506k265m062l891r16P418J939n661n248L399J045Q245l419m108J27J342
$$ -699 4807 2542 -1520 -5411 -6327 1091 3030 -2631 -7879 -4480 -3435 4810 1391 -2717 -2590 -1248
3565a248k754n383P109J939K545M65r36p10l11N207q48j542J637n459l400j775
$$ -1248 -4002 -9385 -2276 -337 2208 2673 1737 1027 716 5923 5075 3533 5170 -289 -3689 -5464
3549e464l545L842r87M15O097l795m768l987p52N008J70K142l643J708M8L255
$$ -5464 -9009 -5167 -6154 -5739 358 -3437 -8205 -12192 -12944 -7936 -7766 -5624 -9267 -7559 -7511 -4256
3533d256P16j055K825K217n692n300Q230o41M221P412k476n735k960O708N026
$$ -4256 -3540 -4595 -1770 447 -5245 -10545 -2315 -2956 1265 8677 6201 466 -2494 4214 9240
3518I240K059l779m68p535j599j390L003r73M137M533P223p95j1024j231p64k578
$$ 9240 11299 7520 7052 -483 -2082 -3472 -469 -1442 2695 7228 14451 13656 2632 1401 637 -1941
3502a941n41l245K222L25J3722K673r146r918K966K477K853M602m942k470K535
$$ -1941 -2482 -5727 -3505 -3180 10542 13215 4069 -5849 -2883 -406 2447 7049 2107 -363 2172
3487B172M44K976l217p00N780L388Q87k923N80k036j348l425k312K573R49M396
$$ 2172 2616 5592 2375 1675 7455 10843 11730 8807 9387 7351 6003 2578 266 2839 3788 8184
3471H184j1160k978M010J944Q19n857k893o528O87J289k649j930O106O019L046
$$ 8184 -2976 -5954 -1944 0 819 -5038 -7931 -14459 -13772 -12483 -15132 -17062 -10956 -4937 -1891
3456a891r91O60M587L660j104j519l229k486m821K747M265j489K579k174k163
$$ -1891 -2882 -2222 2365 6025 4921 3402 173 -2313 -7134 -4387 -122 -1611 968 -1206 -3369
3441c369R658K432k708m719K777m656o402j908K095l48L101r336j60J224M177
$$ -3369 6289 8721 6013 1294 4071 -585 -6987 -8895 -6800 -7148 -4047 -13383 -13543 -12319 -8142
3426h142Q014O648N383l126l163j059N25k764n623N987O341k667j0227J736K79
$$ -8142 -128 6520 11903 8777 5614 4555 5080 2316 -3307 2680 9021 6354 -3873 -2137 -1858
3411a858j089J7r72k506N206N256J18Q806N376q189j1966o07m838L185K21J139
$$ -1858 -2947 -2930 -3902 -6408 -1202 4054 4172 12978 18354 10165 -1801 -2408 -7246 -4061 -3840 -2701
3395b701r32J789l304o986m422n430P247L592j557J888L848Q002l031n179M421
$$ -2701 -3633 -1844 -5148 -12134 -16556 -21986 -14739 -11147 -12704 -10816 -6968 1034 -1997 -7176 -2755
3380b755M255O382O65j604p20q407q119M701K48q516q87O104NO385M514J458J39
$$ -2755 1500 7882 8547 6943 6223 -2184 -10303 -5602 -5354 -13870 -14757 -8653 -8648 -2263 2251 3709 3848
3363C848j976j748L690j691m455J204N485K808O705k956k259J196n786j270L715
$$ 3848 1872 124 3814 2123 -2332 -1128 4357 7165 13870 10914 8655 9851 4065 2795 6510
3348F510Q32j530M156p833r14K6L556l487J134k95j0760l188Q244J420J235K241
$$ 6510 7342 5812 9968 2135 1221 1247 4803 1316 2450 2155 -8605 -11793 -3549 -2129 -894 1347
3332A347j493O19J580j176K433j22k350l395l630J801N689k390k576L380j424
$$ 1347 -146 473 2053 877 3310 3188 838 -2557 -6187 -4386 1303 -1087 -3663 -283 -1707
3317a707L491M42k441R40L053k682K323l289M81k341K159Q715J069j715j42K46
$$ -1707 1784 2226 -215 725 3778 1096 3419 130 611 -1730 429 9144 10213 8498 8356 8602
3301H602j681o811J185l456L30M122Q61L256L631N10K714m283q095l195J567K981
$$ 8602 6921 110 1295 -2161 -1831 2291 3152 6408 10039 10549 13263 8980 885 -2310 -743 2238
3285B238N478o460o242k392j216M555M001j628J58L578J844o504j488l415L010
$$ 2238 7716 1256 -4986 -7378 -8594 -4039 -38 -1666 -1508 2070 3914 -2590 -4078 -7493 -4483
3270d483R256O179k951m303l201J452R19p47L125l862k343k383k474k222J107
$$ -4483 4773 10952 8001 3698 497 1949 2868 2121 5246 1384 -959 -3342 -5816 -8038 -6931
3255f931K311o56N327M311k442j848m913j972J816M251K376O007K329r43O89m195
$$ -6931 -4620 -5276 51 4362 1920 72 -4841 -6813 -4997 -746 1630 7637 9966 9023 9712 5517
3239E517J849j79J731j416M61l876L031l19j617m434j792Q989m030l486k202L947
$$ 5517 7366 7187 8918 7502 7963 4087 7118 6799 5182 748 -1044 7945 3915 429 -1773 2174
3223B174O497o309j638l043j538L846K147R23j01N1l580o145P910O292p678J049
$$ 2174 8671 2362 724 -2319 -3857 -11 2136 3059 2958 3009 -571 -6716 1194 7486 -192 857
3207H57O242k911l552q193J575J1664J096j93r991j0922J003N304M937J12L533
$$ 857 7099 4188 636 -7557 -5982 5682 6778 6585 -3406 -14328 -13325 -8021 -3084 -2972 561
3192E61M731P36l960m429o287M182Q852j274K69m593j219K158K881k376j382n566
$$ 561 5292 6028 2068 -2361 -8648 -4466 4386 3112 3381 -1212 -2431 -273 2608 232 -1150 -6716
3176f716J319m91n728R286J2436Q71q343o077K216j433o836L155L801L853P721
$$ -6716 -5397 -5888 -11616 -2330 10106 10977 2634 -3443 -1227 -2660 -9496 -6341 -2540 1313 9034
3161I034n499k271L263J198O33j139L393J527p86l845l962m354K96M5K613n61
$$ 9034 3535 1264 4527 5725 6358 5219 8612 10139 9353 5508 1546 -2808 -2512 -2467 146 -415
3145d15L43J216l483k401m988k57j501K148K595K800O275O103p184j938%q57k63
$$ -415 -72 1144 -2339 -4740 -9728 -9985 -11486 -9338 -6743 -3943 2332 8435 1251 -687 -687 -1544 -1807
3128a807k196k174k121K81Q7K656j403l446N31P293r10k739J674j750j791m459
$$ -1807 -4003 -6177 -8298 -8017 -7930 -5274 -6677 -10123 -9592 -2299 -3209 -5948 -4274 -6024 -7815 -12274
3112a2274O76k029k323J2097R45M625M472m414j101j789M12J355P10M94m015K732
$$ -12274 -11598 -13627 -15950 -3853 -2908 1717 6189 1775 674 -1115 -703 652 1362 1856 -2159 573
3096E73k386l95N467M502m468k60m00K664j092m027k157J015L388j014o71o765
$$ 573 -1813 -2208 3259 7761 3293 3033 2633 5297 4205 178 -1979 -964 2424 1410 739 -6026
3080f026L669N514p082k993j752M34M400l89o223J355M989J440R60N204K523o973
$$ -6026 -2357 3157 -3925 -6918 -8670 -8236 -3836 -4225 -10448 -9093 -4104 -2664 -1704 3500 6023 -950
3064i50n636j118J416K555M497J248K566N470j656j231j847m470q60m027K044
$$ -950 -6586 -7704 -6288 -3733 764 2012 4578 10048 8392 7161 5314 844 -16 -4043 -1999
3049a999M95N232J396l720j4338m83R319R049m236J70O766R626J688R40o997k516
$$ -1999 -1504 3728 5124 1404 -12934 -13417 -4098 4951 715 885 7651 17277 18965 19905 12908 10392
3033A0392K220p764q94j643l403m980k187N438j848k529J797N270P302l74m856
$$ 10392 12612 4848 3954 2311 -1092 -6072 -8259 -2821 -4669 -7198 -5401 -131 7171 6797 1941
3018A941m742k435m091J213O692o896j107L947M763Q916M48p66J462J131r173
$$ 1941 -2801 -5236 -9327 -8114 -1422 -8318 -9425 -5478 -715 8201 8649 7883 9345 10476 1303
3003A303o933M583N354M882P38k880J423J486n550m392P307J296p790J773j651
$$ 1303 -5630 -1047 4307 9189 9927 7047 8470 9956 4406 14 7321 8617 827 2600 949
2988I49J226K796K475p70j829l932K667l047j549l642p027o207M505J192j21L345
$$ 949 2175 4971 7446 6676 4847 915 3582 535 -1014 -4656 -11683 -17890 -13385 -12193 -12314 -8969
2972h969L018n743k177O024P290M445m073n56M118l719l483K620n35p680k968
$$ -8969 -5951 -11694 -13871 -7847 -557 3888 -185 -741 3377 -342 -3825 -1205 -1740 -9420 -12388
2957a2388L109J443N848l378l475R90M515k500j083L348O668J11o986n119m565
$$ -12388 -9279 -7836 -1988 -5366 -8841 -7851 -3336 -5836 -6919 -3571 3097 3208 -3778 -8897 -13462
2942a3462O767N719R061J831o004p177l017j720M78P35L467q666q22J0277L401
$$ -13462 -6695 -976 8085 9916 3912 -3265 -6282 -8002 -7524 -6789 -3322 -11988 -12810 -2533 868
2927H68l02j993l514K527j25L993J184k622J48J879k107n161K946M384J255Q29
$$ 868 566 -1427 -4941 -2414 -2539 1454 2638 16 164 2043 -64 -5225 -2279 2105 3360 4189
2911D189K017k62k896j138j672m344j714J912L054K346l942q42m284Q461O850
$$ 4189 6206 5944 3048 1910 238 -4106 -5820 -3908 -854 1492 -2450 -3292 -7576 885 7735
2896G735K735n94q63k647r217K596J856k196o157N383M485o347K1K669m549k170
$$ 7735 10470 9876 9013 6366 -2851 -255 1601 -595 -6752 -1369 3116 -3231 -3210 -541 -5090 -7260
2880g260j051p429M46K067O227O022o33j635Q348j381o30L066p438J967j483K579
$$ -7260 -8311 -15740 -15294 -13227 -7000 -978 -1611 -3246 5102 3721 3091 6157 -1281 686 -797 1782
2864A782L678j250l076N078O761p088p662m099M344N703j925n395O104M838R68
$$ 1782 5460 4210 1134 6212 12973 5885 -1777 -5876 -1532 4171 2246 -3149 2955 7793 8761
2849H761k617n098l786l205M078m044k265L859N379O365k404n977K361L609P679
$$ 8761 6144 1046 -2740 -5945 -1867 -5911 -8176 -4317 1062 7427 5023 -954 1407 5016 12695
2834A2695O90j0573r261m214N255K892L749P485R99n255m6k323k862m434p53k429
$$ 12695 13385 2812 -6449 -10663 -5408 -2516 1233 8718 9717 4462 4416 2093 -769 -5203 -5956 -8385
2818h385L70J1286j902o983J512J686N803M818k72M903J211l843p464r000k402
$$ -8385 -8015 3271 1369 -5614 -4102 -2416 3387 8205 7933 12836 14047 10204 2740 -6260 -8662
2803h662L442N793K201j739n204O50J606l713k340k236P065j653r015L640L206
$$ -8662 -5220 573 2774 1035 -4169 -3519 -1913 -5626 -7966 -10202 -3137 -4790 -13805 -10165 -6959
2788f959J21O677J777q368j15L033j52n096n31p69J298M563R429R16n800r223
$$ -6959 -6838 -161 1616 -6752 -6867 -3834 -3986 -9082 -9613 -10382 -9084 -4521 4908 5824 24 -9199
2772i199m19Q473L911J687M318j0532j336N735j966n90k402l238p492L68M629
$$ -9199 -9618 -1145 2766 4453 8771 -1761 -3097 2638 672 82 -2320 -5558 -13050 -12682 -8053
2757h053K697Q408M605q80K403L932k419o667Q88l696l062l539l232N041L563
$$ -8053 -5356 3052 7657 6777 9180 13112 10693 4026 4914 1218 -1844 -5383 -8615 -3574 -11
2742a1L219m370k398L209j627k764J221K317k66L796n45K182J030n104m815K403
$$ -11 3208 -1162 -3560 -351 -1978 -4742 -3521 -1204 -1470 2326 1781 3963 4993 -111 -4926 -2523
2726b523J849R710j635k634o54n95l148J1K187K43n729j2461L891M951N657p461
$$ -2523 -674 9036 7401 4767 4113 3518 370 381 2568 2811 -2918 -15379 -11488 -6537 -880 -8341
2710h341N699J0551L250l035m770Q34o015n833J082J460J1027P023j1034o866
$$ -8341 -2642 7909 11159 8124 3354 4188 -1827 -7660 -6578 -5118 5909 12932 1898 -4968
2696d968j63J338Q090j737n502K032L506p79l4j561k814j294l138m199j083P274
$$ -4968 -5131 -3793 4297 2560 -2942 -910 2596 1817 1783 222 -2592 -3886 -7024 -11223 -12306 -5032
2680e032J770K511k34K058L312J226M440J489J000p850j645pk962n35K322M255
$$ -5032 -3262 -751 -985 1073 4385 5611 10051 11540 12540 4690 3045 3038 76 -459 1863 6118
2664F118j760r99j228m911M453N186l878O23p03q20k565J820k02l146J606Q096
$$ 6118 4358 3359 2131 -2780 1673 6859 2981 3604 2901 2081 -484 1336 1134 -2012 -406 7690
2648G690J217k108L403J754n135p174n501k469K52k299n73J971R625L073L701
$$ 7690 8907 6799 10202 11956 6821 -353 -5854 -8323 -8071 -10370 -10943 -8972 653 3726 7427
2633G427k312J778N803M23m114k099m90n377r812n28Q527k459p575L643L739N7
$$ 7427 5115 6893 12696 13119 9005 6906 6416 1039 -8773 -9301 -774 -3233 -10808 -7165 -3426 -3369
2617c369R703J509N988o344j0747k224L636P784P046N27j1296o835O666J859k326
$$ -3369 6334 7843 13831 7487 -3260 -5484 -1848 5936 12982 13509 2213 -4622 2044 3903 1577
2602A577M328L41r65j911P312m487m481n250O572J1922K587p627p972k983K35
$$ 1577 5905 6246 5281 3370 10682 6195 1714 -3536 3036 14958 17545 9918 1946 -1037 -802
2587h02L643K984l55k551r821M04J095K169J592k115m231L250M98K607j098N311
$$ -802 2841 5825 5470 2919 -6902 -6498 -5403 -3234 -1642 -3757 -7988 -4738 -4240 -1633 -2731 2580
2571B580M912j038o567m632M12K513j756n466K985L743J397N615m79o072j478
$$ 2580 7492 6454 -113 -4745 -4333 -1820 -3576 -9042 -6057 -2314 -917 4698 4219 -1853 -3331
2556c331k857N450L908M96o64j694n426N636k092K659J217J2304M381j803j0392
$$ -3331 -6188 -738 3170 3666 3002 1308 -4118 1518 -574 2085 3302 15606 19987 18184 7792
2541G792p630k749k087N792K920L68Q804p442j0562j332J489L770l567l065Q532
$$ 7792 162 -2587 -4674 1118 4038 4406 13210 5768 -4794 -6126 -4637 -867 -4434 -7499 1033
2526A033J316k165l03k996j3M309m119N94J577N319l51k024q069n100J327k468
$$ 1033 2349 184 -119 -3115 -3128 1181 -2938 -2344 -767 4552 4201 2177 -5892 -10992 -9665 -12133
2510a2133J588N969M052J25l658M331N461K032P62l688o281n078J981P77J556
$$ -12133 -10545 -4576 -524 -399 -4057 274 5735 7767 8529 4841 -1440 -6518 -4537 -3760 -2204
2495b204j491j714O736L631o269j236N7O222n652q394m950N746M017J473K105
$$ -2204 -3695 -5409 1327 4958 -1311 -2547 -2490 3732 -1920 -10314 -15264 -9518 -5501 -4028 -1923
2480a923L309J444K577j097N84m933r049r87M578J059n47l502M556O987J0225
$$ -1923 1386 2830 5407 4310 4894 -39 -9088 -10075 -5497 -4438 -4985 -8487 -3931 3056 13281
2465A3281k415o636k111l420L467N455o62K364k86q623j053O612O701l882j159
$$ 13281 10866 4230 2119 -1301 2166 7621 6959 9323 9037 414 -639 5973 12674 8792 7633
2450G633J506j82k599l828J675N037K477r07n646j580p340J854P050j462L229
$$ 7633 9139 8957 6358 2530 4205 9242 11719 10812 5166 3586 -3754 -1900 5150 3688 6917
2435F917k141j172m442L65J935J505n45q082l937M740M912L449j0288l01K201
$$ 6917 4776 3604 -838 -473 1462 2967 2422 -5660 -9597 -4857 55 3504 -6784 -7085 -4884
2420d884M561m39q152L346M540M037P5l087J64m723K443l62k788m16k355k257
$$ -4884 -323 -762 -8914 -5568 -1028 3009 3084 -3 161 -4562 -2119 -2481 -5269 -5685 -8040 -10297
2404a0297N968R950M091L151l992j042j627J931K071J9p990m510K555k299K903
$$ -10297 -4329 5621 9712 12863 8871 7829 6202 8133 10204 10223 2233 -2277 278 -2021 882
2389H82J144N424L506n745k833K584J736J52M62k121k465n886n85M772M152M698
$$ 882 2026 7450 10956 5211 2378 4962 6698 6850 7312 5191 2726 -3160 -3745 1027 5179 9877
2373I877M905L638l472j798P783R46l427j3892O34R28j210n976m742K665O701
$$ 9877 14782 18420 14948 13150 20933 21879 18452 4560 5194 6122 4912 -1064 -5806 -3141 3560
2358C560j921q289j992L294J601L095j78P090l676o439M453M095l543M77L71J920
$$ 3560 1639 -6650 -8642 -5348 -3747 -652 -830 6260 2584 -3855 598 4693 1150 1627 1998 3918
2342C918M139P663n08q053j794j020P428j741l464k309J290P52K703o540n972
$$ 3918 8057 15720 15212 7159 5365 4345 11773 10032 6568 4259 5549 6301 9004 2464 -3508
2327c508J2635K633k227J652K493m296k143l014k252j2113m303R733J642K731
$$ -3508 9127 11760 9533 11185 13678 9382 7239 4225 1973 -10140 -14443 -4710 -3068 -337
2313c37L406K484j959L497j552l104k341m573N957L874q564n643K039K515p06
$$ -337 3069 5553 3594 7091 5539 2435 94 -4479 1478 5352 -3212 -8855 -6816 -4301 -5007
2298e007J651m728m026N914N602j718j719n749r4K951K907l18N71N875k170o0
$$ -5007 -3356 -8084 -12110 -6196 -594 -2312 -4031 -9780 -9874 -6923 -4016 -4334 -3763 2112 -58 -118
2282a18j307K758N232O70O88L951p833K373j071k284j744o0J416J06N423L279
$$ -118 -1425 1333 6565 7235 7923 11874 4041 6414 5343 3059 1315 1255 2671 2777 8200 11479
2266A1479j367l560l863k025m017j045j429K775L803l339l502l588J88N417j264
$$ 11479 10112 6552 2689 664 -3353 -4398 -5827 -3052 751 -2588 -6090 -9678 -9490 -4073 -5337
2251e337j02k502K074M80L919Q702N096Q5j338n705j65O322J33j164n584k456
$$ -5337 -5439 -7941 -5867 -5387 -1468 7234 12330 12415 11077 5372 5207 11529 11662 10498 4914 2458
2235B458j932R59r14j796n531J685O320l98J686j5J271p97j666P36j282n759o373
$$ 2458 526 1485 571 -1225 -6756 -5071 1249 851 2537 2522 3793 2996 1330 2066 784 -4975 -11348
2218a1348M840L612q764j840N056K094l757r37Q965O943M136m797n844m667N18
$$ -11348 -6508 -2896 -11660 -13500 -8444 -6350 -10107 -11044 -2079 4864 9000 4203 -1641 -6308 -5790
2203e790K212j709K872o620P966O207j32k839K958r163N363K532m13q257j501
$$ -5790 -3578 -5287 -2415 -9035 -1069 5138 5006 2167 5125 -4038 1325 3857 3444 -4813 -6314
2188f314m91k925P432N633N706O4K777k176l537j437K880M73p616m319M228l081
$$ -6314 -6805 -9730 -2298 3335 9041 9105 11882 9706 6169 4732 7612 8085 469 -3850 378 -2703
2172b703J01J033m189l705K184K305O017J962J851m857p012o160M087Q866p19
$$ -2703 -2602 -1569 -5758 -9463 -7279 -4974 1043 3005 4856 -1 -7013 -13173 -9086 -220 -939
2157i39L77J695k206n38j563K06l263l346L164O774j465j499K46j990L126j843
$$ -939 -562 1133 -1073 -1611 -3174 -2968 -6231 -9577 -6413 361 -1104 -2603 -2357 -4347 -1221 -3064
2141c064j877O293k476j388N28J258L054K743K242j834k305o513k95K460k43k776
$$ -3064 -4941 1352 -1124 -2512 -1984 -726 2328 5071 7313 5479 3174 -3339 -3634 -1174 -1417 -4193
2125d193l846k144o10M016j70P118M579j183j65m21m562j702R90q82j119p359
$$ -4193 -8039 -10183 -10793 -6777 -6947 171 4750 3567 3402 2981 -1581 -3283 -2293 -3175 -4294 -11653
2109a1653m377L331K209J882K87M011L560l271O38j893K033L481j512p054J844
$$ -11653 -16030 -12699 -10490 -8608 -8321 -4310 -750 -4021 -3383 -5276 -3243 238 -1274 -8328 -6484
2094f484K602Q27m064j363m095Q94M338L171J902j598O45m018k336l461J638L323
$$ -6484 -3882 -3055 -7119 -8482 -12577 -11683 -7345 -4174 -2272 -3870 -3225 -7243 -9579 -13040 -11402 -8079
2078h079K990l31j742J145n486k134O461Q090j146j78K008k151k935J221N918
$$ -8079 -5089 -5420 -7162 -6017 -11503 -13637 -7176 914 -232 -410 1598 -553 -3488 -2267 3651
2063C651j061k108J032N05N770O054n139n684j04o193K44j645o855J420P460O621
$$ 3651 2590 482 1514 2019 7789 13843 8704 3020 2916 -3277 -3033 -4678 -11533 -10113 -2653 3968
2047C968q864r005l329P109M190n752K182j693j890r28J643K751K153n175J136
$$ 3968 -4896 -13901 -17230 -10121 -5931 -11683 -9501 -11194 -13084 -14012 -12369 -9618 -7465 -12640 -11504
2032a1504m781M624l97j572L0Q83R76O688L746o811k031k375K824J741L792l89
$$ -11504 -16285 -11661 -12058 -13630 -13600 -12717 -11741 -5053 -1307 -8118 -10149 -12524 -9700 -7959 -4167 -4556
2016d556l368m141L33K286K815K883l249O80L605j186K115M524k734K583k066
$$ -4556 -7924 -12065 -11732 -9446 -6631 -3748 -6997 -6317 -2712 -3898 -1783 2741 7 2590 524
2001E24K751j188k379k262M62l793L121K241K237K700k12m387N084J395l4j433
$$ 524 3275 2087 -292 -2554 -2092 -5885 -2764 -523 1714 4414 4202 -185 4899 6294 6260 4827
1985D827m93k721l671K151O475M873m903K719O246m069q78q064r043J892L214
$$ 4827 4334 1613 -2058 93 6568 11441 6538 9257 15503 11434 10556 2492 -6551 -4659 -1445
1970a445j709n618M552k002k259j814O011P693N029K301q386n424L089N816K425
$$ -1445 -3154 -8772 -4220 -6222 -8481 -10295 -4284 3409 8438 10739 2353 -3071 18 5834 8259
1955H259N135l175l249k046Q347J028l202l798K951L669r706n738k130N005N316
$$ 8259 13394 10219 6970 4924 13271 14299 11097 7299 10250 13919 4213 -1525 -3655 1350 6666
1940F666o391k014K16l340Q2M362M150j40N222P63q797q842J937L729m168l242
$$ 6666 275 -1739 -1523 -4863 -4781 -419 3731 3591 8813 9576 779 -8063 -6126 -2397 -6565 -9807
1924i807J444J824j555K43p18j965Q356J687p795m978K969L148J1818L14l895
$$ -9807 -8363 -6539 -8094 -7851 -8569 -10534 -2178 -491 -8286 -13264 -10295 -7147 4671 4985 1090
1909A090m404m023N635K404n108Q62j581M155J750p586P570J2283j089q86n31
$$ 1090 -3314 -7337 -1702 702 -4406 -3544 -5125 -970 780 -6806 764 13047 11958 11072 10541
1894A0541p545J22L21Q85P45m116M481L508M05k426m550k638o69n885o201N242
$$ 10541 2996 3118 3439 4324 5069 953 5434 8942 9347 6921 2371 -267 -936 -6821 -13022 -7780
1878g780K40L697l105l089m59P164J1790p607l350j185L941o86l31oN773K000
$$ -7780 -7540 -3843 -6948 -10037 -10496 -3332 8458 851 -2499 -3684 257 -429 -760 -766 5007 7007
1862G007q060P05N377j390k891j186l990K813N145k814n14P463l748m094m197
$$ 7007 -1053 -348 5029 3639 748 -438 -4428 -1615 3530 716 202 7665 3917 -177 -4374
1847d374N069k402l032j233j757M365L594K868q4l229l281M47L738L28J221j562
$$ -4374 695 -1707 -4739 -5972 -7729 -3364 230 3098 3014 -215 -3496 -3049 689 1017 2238 676
1831F76K057o5o787L734J636p421K881L461n340r52J1004M043j841p135r167N146
$$ 676 2733 2668 -4119 -385 1251 -6170 -3289 172 -5168 -6120 4884 8927 7086 -49 -9216 -4070
1815d070L64M610N06J564n851L6j951k283L822J410J297j201l715o178P88M313
$$ -4070 -3706 904 1410 2974 -2877 -2841 -4792 -7075 -3253 -1843 -546 -1747 -5462 -11640 -10852 -6539
1799f539j723n17M857P165O387m871M747K478n207p653J824L096j880m235P817
$$ -6539 -8262 -8779 -3922 3243 9630 4759 9506 11984 6777 -876 948 4044 2164 -2071 5746
1784E746M960n157r364L050N152J270K438k414k407n423m007j542R540M101m097
$$ 5746 10706 5549 -3815 -765 4387 5657 8095 5681 3274 -2149 -6156 -7698 1842 5943 1846
1769A846M70l029K920L167M775k024o159L94m283j998o00M12K264l908L423J814
$$ 1846 2316 -713 2207 5374 10149 8125 1966 2360 -1923 -3921 -4521 -4109 -1845 -5753 -2330 -516
1753e16j565J001l191j534L528J321M79j318k68L941O28n178J316r78L140J0658
$$ -516 -2081 -1080 -4271 -5805 -2277 -956 -477 -1795 -2063 1878 2506 -2672 -1356 -2334 806 11464
1737A1464K272p132k302m334o923l669K535J69l257m576K765P854N675J899N09
$$ 11464 13736 6604 4302 -32 -6955 -10624 -8089 -7920 -11177 -15753 -12988 -5134 541 2440 2949
1722B949K819Q71p448p002K329O23j866j664L626J725l425J893J410J30J904M804
$$ 2949 5768 6639 -809 -7811 -5482 -4859 -6725 -8389 -4763 -3038 -6463 -4570 -3160 -3030 -1126 3678
1706C678n753j1598J681J0405Q460J06K14k197l918n404n154p841k605Q547Q896
$$ 3678 -2075 -13673 -11992 -1587 6873 6979 7193 4996 1078 -4326 -9480 -17321 -19926 -11379 -2483
$$ [...]
##END NTUPLES=NMR SPECTRUM
##END=
