##TITLE=Analysis number 322729
Compound Code cc 27110
Project Code adrs
Chemist Name ugmt
##JCAMPDX= 6.0         $$ Bruker NMR JCAMP-DX V2.0
##DATA TYPE= NMR SPECTRUM
##DATA CLASS= NTUPLES
##ORIGIN= Bruker BioSpin GmbH
##OWNER= nmr
$$ XWIN-NMR		Version 3.5
$$ Sat Oct 14 11:39:58 2006 GMT Daylight Time (UT+1h)  MAYBRIDGE\nmr@NMR_250MHZ
##.OBSERVE FREQUENCY= 250.131544655141
##.OBSERVE NUCLEUS= ^1H
##.ACQUISITION MODE= SIMULTANEOUS (DQD)
##.ACQUISITION SCHEME= undefined
##.AVERAGES= 16
##.DIGITISER RES= 18
##SPECTROMETER/DATA SYSTEM= dpx250
##.PULSE SEQUENCE= zg30
##.SOLVENT NAME= CDCl3
##.SHIFT REFERENCE= (INTERNAL, CDCl3, 0, 16.522)
##AUDIT TRAIL= $$ (NUMBER, WHEN, WHO, WHERE, WHAT)
$$ ##TITLE= Audit trail, XWIN-NMR		Version 3.5
$$ ##JCAMPDX= 5.01
$$ ##ORIGIN= Bruker BioSpin GmbH
$$ ##OWNER= nmr
$$ C:\u/data/dgb/nmr/ADRS/310/pdata/1/auditp.txt
$$ ##AUDIT TRAIL=  $$ (NUMBER, WHEN, WHO, WHERE, WHAT)
(   1,<2006-10-14 11:39:25.67 +100>,<MAYBRIDGE\nmr>,<NMR_250MHZ>,
      <created by zg, POWCHK disabled, PULCHK disabled
       configuration hash MD5:
       49 4B E0 1D 92 C2 6B 37 9F E6 65 BC 52 41 86 1D
       data hash MD5: 64K
       16 EB 9D ED 3B 7D 7D 34 44 F6 9B 27 F3 E6 25 7D>)
(   2,<2006-10-14 11:39:42.71 +100>,<MAYBRIDGE\nmr>,<NMR_250MHZ>,
      <Start of raw data processing
       ef LB = 0.3 FT_mod = 6 PKNL = 1 SI = 32K 
       data hash MD5: 32K
       39 54 3B 20 B9 D5 3D 55 F1 90 F2 47 29 EC D2 D3>)
(   3,<2006-10-14 11:39:47.40 +100>,<MAYBRIDGE\nmr>,<NMR_250MHZ>,
      <apk 
       data hash MD5: 32K
       94 E5 3A AC 60 69 7D FD 43 E2 23 DD C9 5C 93 03>)
(   4,<2006-10-14 11:39:48.87 +100>,<MAYBRIDGE\nmr>,<NMR_250MHZ>,
      <abs ABSG = 5 
       data hash MD5: 32K
       DC 30 84 7E 5D 46 73 31 E2 CB 48 C6 C3 CD A1 FC>)
$$ ##END=
$$ 
$$ hash MD5
$$ 91 0C 1D F9 B9 1B E4 B6 00 2A 66 31 ED 08 A2 B2
##$RELAX= 
##$RELAX= 
##$RELAX= 
##$RELAX= 
##$RELAX= 
##$RELAX= 
##$RELAX= 
$$ Bruker specific parameters
$$ --------------------------
##$DU= <C:\u>
##$EXPNO= 310
##$NAME= <ADRS>
##$PROCNO= 1
##$TYPE= <nmr>
##$USER= <dgb>
##$AMP= (0..31)
100 100 100 100 100 100 100 100 100 100 100 100 100 100 100 100 100 100 
100 100 100 100 100 100 100 100 100 100 100 100 100 100 
##$AQSEQ= 0
##$AQ_mod= 3
##$AUNM= <au_zg>
##$AUTOPOS= <8 >
##$BF1= 250.13
##$BF2= 250.13
##$BF3= 250.13
##$BF4= 250.13
##$BF5= 500.13
##$BF6= 500.13
##$BF7= 500.13
##$BF8= 500.13
##$BYTORDA= 1
##$CFDGTYP= 0
##$CFRGTYP= 5
##$CHEMSTR= <none>
##$CNST= (0..31)
1 1 145 1 1 1 1 1 1 1 1 1 1 1 1 1 1 1 1 1 1 1 1 1 1 1 1 1 1 1 1 1 
##$CPDPRG= <>
##$CPDPRG1= <>
##$CPDPRG2= <>
##$CPDPRG3= <>
##$CPDPRG4= <mlev>
##$CPDPRG5= <mlev>
##$CPDPRG6= <mlev>
##$CPDPRG7= <mlev>
##$CPDPRG8= <mlev>
##$CPDPRGB= <>
##$CPDPRGT= <>
##$D= (0..31)
0 1 0 0 0 0 0 0 0 0.06 0 0 0 0 0 0 0.0002 0 0 0 0 0 0 0 0 0 0 0 0 0 0 
0 
##$DATE= 1160822363
##$DBL= (0..7)
120 120 120 120 120 120 120 120 
##$DBP= (0..7)
150 150 150 150 150 150 150 150 
##$DBP07= 0
##$DBPNAM0= <>
##$DBPNAM1= <>
##$DBPNAM2= <>
##$DBPNAM3= <>
$$ [...]
##$SUBNAM7= <"">
##$SUBNAM8= <"">
##$SUBNAM9= <"">
##$SW= 20.6930455092707
##$SWIBOX= (0..15)
0 0 3 0 0 0 0 0 0 0 0 0 0 0 0 0 
##$SW_h= 5175.983436853
##$TD= 65536
##$TD0= 1
##$TE= 683.16
##$TE2= 300
##$TE3= 300
##$TEG= 300
##$TL= (0..7)
0 120 120 120 120 120 120 120 
##$TP= (0..7)
150 150 150 150 150 150 150 150 
##$TP07= 0
##$TPNAME0= <>
##$TPNAME1= <>
##$TPNAME2= <>
##$TPNAME3= <>
##$TPNAME4= <>
##$TPNAME5= <>
##$TPNAME6= <>
##$TPNAME7= <>
##$TPOAL= (0..7)
0.5 0.5 0.5 0.5 0.5 0.5 0.5 0.5 
##$TPOFFS= (0..7)
0 0 0 0 0 0 0 0 
##$TUNHIN= 0
##$TUNHOUT= 0
##$TUNXOUT= 0
##$USERA1= <user>
##$USERA2= <user>
##$USERA3= <user>
##$USERA4= <user>
##$USERA5= <user>
##$V9= 5
##$VALIST= <valist>
##$VCLIST= <CCCCCCCCCCCCCCC>
##$VD= 0
##$VDLIST= <DDDDDDDDDDDDDDD>
##$VPLIST= <PPPPPPPPPPPPPPP>
##$VTLIST= <TTTTTTTTTTTTTTT>
##$WBST= 1024
##$WBSW= 4
##$XGAIN= (0..3)
0 0 0 0 
##$XL= 0
##$YL= 0
##$YMAX_a= 584476
##$YMIN_a= -541577
##$ZGOPTNS= <>
##$ZL1= 120
##$ZL2= 120
##$ZL3= 120
##$ZL4= 120
##$ABSF1= 16.522
##$ABSF2= -4.171173
##$ABSG= 5
##$ABSL= 3
##$ALPHA= 0
##$AQORDER= 0
##$ASSFAC= 0
##$ASSFACI= 0
##$ASSFACX= 0
##$ASSWID= 0
##$AUNMP= <proc_1d>
##$AZFE= 0.1
##$AZFW= 0.1
##$BCFW= 0
##$BC_mod= 0
##$BYTORDP= 0
##$COROFFS= 0
##$CY= 12.5
##$DATMOD= 1
##$DC= 0
##$DFILT= <>
##$DTYPP= 0
##$F1P= 14.0000005364418
##$F2P= -0.99999901652339
##$FCOR= 0.5
##$FTSIZE= 32768
##$FT_mod= 6
##$GAMMA= 0
##$GB= 0
##$INTBC= 1
##$INTSCL= 1
##$ISEN= 128
##$LB= 0.3
##$LEV0= 0
##$LPBIN= 0
##$MAXI= 10000
##$MC2= 0
##$MEAN= 0
##$ME_mod= 0
##$MI= 0
##$NCOEF= 0
##$NC_proc= -2
##$NLEV= 6
##$NOISF1= 0
##$NOISF2= 0
##$NSP= 0
##$NTH_PI= 0
##$NZP= 0
##$OFFSET= 16.522
##$PC= 1
##$PHC0= -46.18732
##$PHC1= 4.532743
##$PH_mod= 1
##$PKNL= yes
##$PPARMOD= 0
##$PSCAL= 4
##$PSIGN= 0
##$REVERSE= no
##$SF= 250.13
##$SI= 32768
##$SIGF1= 0
##$SIGF2= 0
##$SINO= 400
##$SIOLD= 32768
##$SREGLST= <1H.CDCl3>
##$SSB= 0
##$STSI= 32768
##$STSR= 0
##$SW_p= 5175.98343685301
##$SYMM= 0
##$S_DEV= 0
##$TDeff= 65536
##$TDoff= 0
##$TI= <Analysis number 999999
Compound Code 99
Book Reference 9
Project Code 9>
##$TILT= no
##$TM1= 0
##$TM2= 0
##$TOPLEV= 0
##$USERP1= <user>
##$USERP2= <user>
##$USERP3= <user>
##$USERP4= <user>
##$USERP5= <user>
##$WDW= 1
##$XDIM= 32768
##$YMAX_p= 290747634
##$YMIN_p= -65560
$$ End of Bruker specific parameters
$$ ---------------------------------
##NTUPLES= NMR SPECTRUM
##VAR_NAME=  FREQUENCY,     SPECTRUM/REAL,   SPECTRUM/IMAG
##SYMBOL=    X,             R,               I
##VAR_TYPE=  INDEPENDENT,   DEPENDENT,       DEPENDENT
##VAR_FORM=  AFFN,          ASDF,            ASDF
##VAR_DIM=   32768,         32768,           32768
##UNITS=     HZ,            ARBITRARY UNITS, ARBITRARY UNITS
##FACTOR=    0.157963299565203, 1,           1
##FIRST=     4132.6476996994, 0,             0
##LAST=      -1043.33573715361, 0,           0
##MIN=       -1043.33573715361, -65560,      0
##MAX=       4132.6476996994, 290747634,     0
$$ Real data points
##PAGE= N=1
##DATA TABLE= (X++(R..R)), XYDATA
$$ [...]
$$ plain form
14916 4271 -6506 -7868 1775 15881 11316 17332 28287 32813 23905 14212 -6891 -20384 -26408
14903 -26408 -7470 11686 2643 6722 11567 12810 3846 -2870 -15503 -20426 -15529 -10087 -16526 -24153
14889 -24153 -16563 -15629 -18030 -6773 -9186 -9854 -11057 -20086 -19782 -7806 -1016 10733 11240 4836 11450
14874 11450 1052 -22514 -29712 -34060 -31574 -24303 -12730 -3104 1993 -5986 -4575 -2068 -8518 -3855
14860 -3855 3775 1723 7046 19873 27773 21866 19419 13796 8956 16668 24930 28359 24669 9938
14846 9938 -15780 -27282 -19249 -32124 -31844 -21310 588 10734 4042 -5749 -11282 2811 -5427
14833 -5427 -7199 -11531 -11731 -8109 -14406 -17240 -24990 -29394 -19633 -1108 3661 -4984 8780 10329
14819 10329 -5068 -12033 -10579 8329 14826 5387 3267 1842 103 2526 3230 4161 -2671 -12633
$$ packed form
14916D271j0777j362R643J4106m565O016J0955M526q908r693k1103j3493o024
14903b6408J8938J9156r043M079M845J243q964o716j2633m923M897N442o439p627
14889b4153P590R34k401J1257k413o68j203r029L04J1976O790J1749N07o404O614
14874A1450j0398k3566p198m348K486P271J1573R626N097p979J411K507o450M663
14860c855P630k052N323J2827P900n907k447n623m840P712Q262L429l690j4731
14846I938k5718j1502Q033j2875K80J0534K1898J0146o692r791n533J4093q238
14833e427j772m332k00L622o297k834p750m404R761J8525M769q645J3764J549
14819A0329j5397o965J454J8908O497r439k120j425j739K423P04R31o832r962
$$ plain form
14805 -12633 -14581 -10758 -5226 2345 -1350 245 9072 806 1038 11272 5805 4667 10630 8743
14791 8743 7887 -3430 -9674 -4345 1681 18402 24380 1363 -4457 -5144 -6517 -4261 11734 13489
14777 13489 11391 16538 26525 20881 -1727 4577 3591 -13318 -11556 -22569 -20749 -28599 -34469 -13997
14763 -13997 947 -8354 -723 3106 -18241 -21554 -16406 -25300 -49469 -62398 -52454 -32215 -19826
14750 -19826 -957 5698 -1550 -18112 -5494 -4070 -17489 -22389 -17663 -12238 -14625 -20192 -17247
14737 -17247 -9408 -443 8675 15023 12800 13314 7544 -3164 -21309 -20095 -9767 -2770 16575 18999
14723 18999 16361 9018 -3109 -12243 4781 9098 3362 7993 -6995 -4085 3285 1057 -6031 -3103
14709 -3103 5817 -4359 -6134 6730 -788 5234 7944 -2432 -3379 6008 12541 10026 10503 12110
$$ packed form
14805a2633j948L823N532P571l695J595Q827q266K32J0234n467j138N963j887
14791H743q56j1317o244N329O026J6721N978k3017n820o87j373K256J5995J755
14777A3489k098N147R987n644k2608O304r86j6909J762j1013J820p850n870K0472
14763a3997J4944r301P631L829k1347l313N148q894k4169j2929R944K0239J2389
14750a9826J8869O655p248j6562J2618J424j3419m900M726N425k387n567K945
14737a7247P839Q965R118O348k223N14n770j0708j8145J214J0328O997J9345K424
14723A8999k638p343j2127r134J7024M317n736M631j4988K910P370k228p088K928
14709c103Q920j0176j775J2864p518O022K710j0376r47R387O533k515M77J607
$$ plain form
14695 12110 5451 23762 35338 14666 -5535 -21857 -18926 -16864 -8551 7816 1650 8771 20531
14682 20531 19507 2889 -11835 -5737 6477 6022 6595 19617 32165 40390 17890 -7149 -4053
14669 -4053 3128 3435 12954 17942 14980 3502 8282 12073 4290 -2321 -29 1527 3685 215 3659
14654 3659 6788 -6382 -25358 -24587 -14158 -7941 -4659 -5904 -9152 -4695 -19165 -14857 -4939 -18598
14640 -18598 -14235 -11428 -5846 1975 10477 2006 3009 -7599 4029 -4267 -13141 -12165 -10251 -14407
14626 -14407 -10475 -8741 -14748 -7389 -3339 -6117 -10853 -10572 -19138 -8557 -411 -1578 -15407 -11884
14612 -11884 4059 5606 13823 29432 28199 22078 17975 20987 12836 -10882 -10549 -385 -9055 -11659
14598 -11659 7049 4904 -107 -2009 1921 250 -17620 -6265 1783 4141 -2749 -924 12997
$$ packed form
14695A2110o659J8311J1576k0672k0201j6322K931K062Q313J6367o166P121J1760
14682B0531j024j6618j4724O098J2214m55N73J3022J2548Q225k2500k5039L096
14669d053P181L07R519M988k962j1478M780L791p783o611K292J556K158l470L444
14654C659L129j3170j8976P71J0429O217L282j245l248M457j4470M308R918j3659
14640a8598M363K807N582P821Q502q471J003j0608J1628q296q874R76J914m156
14626a4407L932J734o007P359M050k778m736K81q566J0581Q146j167j3829L523
14612a1884J5943J547Q217J5609j233o121m103L012q151k3718L33J0164q670k604
14598a1659J8708k145n011j902L930j671j7870J1355Q048K358o890J825J3921
$$ plain form
14585 12997 20746 12597 5293 1914 3058 -3039 -3409 9362 8536 5221 10510 8631 12803 23802
14571 23802 14057 6729 13093 16579 6345 1228 14143 17970 4010 -5142 -4976 4262 10108 12377
14557 12377 11806 6569 -2760 5811 7077 6208 -1645 -19121 -13457 3274 13283 5965 -11034 -11207
14543 -11207 8473 10454 16847 10684 7875 6078 11727 15418 11077 17013 142 -1588 -9148 -12853
14529 -12853 -1769 -4854 -898 -256 7878 11437 2454 1378 -4778 -19308 -20698 -1579 22354 25557
14515 25557 19278 10924 10407 2219 -15333 -16057 -14138 -22573 92 -708 4455 3929 -10453 -9791 504
14500 504 5439 14349 13137 -6618 -8810 -5164 397 9043 5497 -1722 8597 119 -12330 -7356
14486 -7356 -11625 -8009 -1825 -8164 -6067 -10783 -7401 -7026 -1612 4860 751 2069 5915 16526 21722
$$ packed form
14585A2997P749q149p304l379J144o097l70J2771q26l315N289j879M172J0999
14571B3802r745p328O364L486j0234n117J2915L827j3960r152J66R238N846K269
14557A2377n71n237r329Q571J266q69p853j7476N664J6731J0009p318j6999j73
14543a1207J9680J981O393o163k809j797N649L691m341N936j6871j730p560l705
14529a2853J1084l085L956O42Q134L559q983j076o156j4530j390J9119K3933L203
14515B5557o279q354n17q188j7552p24J919q435K2665q00N163n26j4382O62J0295
14500E04M935Q910j212j9755k192L646N561Q646l546p219J0319q478j2449M974
14486g356m269L616O184o339K097m716L382L75N414O472m109J318L846J0611N196
$$ plain form
14471 21722 4253 -15227 -20236 -15270 544 -379 2314 -7091 -8961 -9670 -3475 11870 -3374 -15169
14457 -15169 -15044 -23077 -28069 -18601 -15047 -7014 -11512 -17852 -534 9716 21766 21583 22567 12653
14443 12653 2540 7569 13649 -3896 -4858 3359 -5621 -12135 -16387 -22230 -18614 -30506 -28980 -14579
14429 -14579 7314 22649 37850 45597 32230 21928 17460 30267 21383 15396 4701 5900 16810
14416 16810 11431 17304 26814 11319 10434 10384 4714 112 6706 21534 24193 14792 15494 20217 12738
14401 12738 5991 4504 12974 19267 27613 15777 17107 24907 19170 19209 16253 15860 2200 -6158 8544
14386 8544 4863 -933 -24499 -31334 -17226 -16998 -13302 -22914 -28230 -12726 -11142 -5767 -4854 -8618
14372 -8618 4118 8592 3087 -2348 -15188 -33121 -26409 -17769 -5608 20953 20334 5586 -3184
$$ packed form
14471B1722j7469j9480n009M966J5814r23K693r405j870p09O195J5345j5244j1795
14457a5169J25q033m992R468L554Q033m498o340J7318J0250J2050j83R84r914
14443A2653j0113N029O080j7545r62Q217q980o514m252n843L616j1892J526J4401
14429a4579K1893J5335J5201P747j3367j0302m468J2807q884n987j0695J199J0910
14416A6810n379N873R510j5495q85n0n670m602O594J4828K659r401P02M723p479
14401A2738o747j487Q470O293Q346j1836J330P800n737L9k956l93j3660q358J4702
14386H544l681n796k3566o835J4108K28L696r612n316J5504J584N375R13l764
14372h618J2736M474n505n435j2840j7933O712Q640J2161K6561o19j4748q770
$$ plain form
14359 -3184 5650 -2490 600 10864 20207 19190 15020 7892 -728 -4819 -10988 -8424 -11947 -11121 -19548
14344 -19548 -26380 -22684 -20663 -18047 -20059 -25503 -19887 -13540 7520 4070 -13725 -24376 -18617 3259
14330 3259 2975 -1300 -5819 1099 -7955 -9417 -8188 -11953 -26236 -14642 7356 3019 -1252 3480
14316 3480 7590 7434 14581 14319 4254 -14024 -29581 -36568 -37478 -27294 -18609 -6014 -389 -1542
14302 -1542 -14424 -30326 -41141 -23145 -10659 3584 -1067 -8577 -18642 -23118 -29583 -37178 -36592
14289 -36592 -21643 -19158 -30724 -23806 -4685 7902 6386 1961 2694 -9086 -18393 -22723 -8894
14276 -8894 -6430 -18499 -18135 -18761 -16482 -3727 -146 18622 21580 18386 16064 14459 13674 2105
14262 2105 4695 10300 -2069 -16436 -22065 -18055 -9456 -3566 723 -2396 -17681 -14742 -17747 -18125
$$ packed form
14359c184Q834q140L090J0264R343j017m170p128q620m091o169K564l523Q26q427
14344a9548o832L696K021K616k012n444N616O347K1060l450j7795j0651N759K1876
14330C259k84m275m519O918r054j462J229l765j4283J1594K1998m337m271M732
14316C480M110j56P147k62j0065j8278j5557o987r10J0184Q685J2595N625j153
14302a542j2882j5902j0815J7996J2486J4243m651p510j0065m476o465p595N86
14289c6592J4949K485j1566O918J9121J2587j516m425P33j1780r307m330J3829
14276h894K464j2069L64o26K279J2755L581J8768K958l194k322j605p85j1569
14262B105K590N605j2369j4367n629M010Q599N890M289l119j5285K939l005l78
$$ plain form
14248 -18125 -14132 -18496 -31484 -26561 -9882 34 -5090 -11815 -8540 -6994 1906 3232 6797 18012
14234 18012 22488 8901 1480 -2053 7601 5208 10496 8384 -1210 741 13149 18399 21166 2994
14220 2994 12057 13661 5309 -4647 -2849 -4134 -9866 -3260 19498 19902 31445 23803 22392 34290
14206 34290 36662 46654 39853 24447 17824 11295 7222 18278 23702 21890 7653 5867 -383 -3872
14192 -3872 -2086 1894 -8113 -20204 -16377 -15662 -21790 -23538 -22498 -18203 -27358 -23844 -7851 -4150
14178 -4150 -2876 8495 24189 19891 5207 -2981 -14154 -1322 -536 145 -542 -6803 -15664 -23932
14164 -23932 -20130 -1031 893 -932 -8819 -6984 2567 3118 9979 19978 15936 16697 12915 14478 13092
14149 13092 4964 -249 939 -7510 -7868 1986 2700 -7425 -11623 -7741 -9772 -13228 -2637 562
$$ packed form
14248a8125L993m364j2988M923J6679R916n124o725L275J546Q900J326L565J1215
14234A8012M476j3587p421l533R654k393N288k112r594J951J2408N250K767j8172
14220B994R063J604q352r956J798j285n732O606K2758M04J1543p642j411J1898
14206C4290K372R992o801j5406o623o529m073J1056N424j812j4237j786o250l489
14192c872J786L980j0007j2091L827P15o128j748J040M295r155L514J5993L701
14178d150J274J1371J5694m298j4684q188j1173J2832P86O81o87o261q861q268
14164b3932L802J9099J924j825p887J835R551N51O861R999m042P61l782J563j386
14149A3092q128n213J188q449l58R854P14j0125m198L882k031l456J0591L199
$$ plain form
14135 562 6323 -236 -2728 -10642 -5508 21227 22017 260 -6391 -9704 -8989 -6231 -16050 -23520 -28943
14120 -28943 -15740 -16224 -14245 4734 2883 6083 262 -14713 -19953 -3414 -166 9627 3461 -14689
14106 -14689 -7858 -7061 -4547 -3127 -3371 3584 23319 28540 8503 -1428 8858 12956 -1064 -16875
14092 -16875 -12732 -15727 -20441 -24403 -16843 -20155 -16505 -19735 -22465 -7098 3983 9812 9328 17052
14078 17052 9209 -2817 5250 11656 10542 -1793 11192 7762 15257 21666 3595 -6681 8389
14065 8389 18810 30406 23553 17530 -3244 -18120 -17581 -3648 1614 316 3215 3830 5910 2788
14051 2788 -4753 -8186 -3791 6013 18280 14287 -7500 -22478 -26031 -27349 -21076 -2675 6123 -8707
14037 -8707 -24361 -27404 -25107 -28017 -16612 943 6276 1596 -11596 -15490 -11438 -26106 -34833
$$ packed form
14135E62N761o559k492p914N134K6735P90k1757o651l313P15K758r819p470n423
14120b8943J3203m84J979J8979j851L200n821j4975n240J6539L248R793o166j8150
14106a4689O831P97K514J420k44O955J9735N221k0037r931J0286M098j4020j5811
14092a6875M143k995m714l962P560l312L650l230k730J5367J1081N829m84P724
14078A7052p843j2026Q067O406j114j2335J2985l430P495O409j8071j0276J5070
14065H389J0421J1596o853o023k0774j4876N39J3933N262j298K899O15K080l122
14051B788p541l433M395R804J2267l993k1787j4978l553j318O273J8401Q798j4830
14037h707j5654l043K297k910J1405J7555N333m680j3192l894M052j4668q727
$$ plain form
14024 -34833 -19060 1594 6908 -3745 -15742 -19897 -7329 -2036 -1944 -1721 -13174 -13193 -17658 -19976
14010 -19976 -4205 -630 -10205 -23240 -19036 -10602 3073 10303 11379 4872 7239 8149 11203 8085
13996 8085 20293 6741 -22089 -33301 -28364 -15872 -7526 -18100 -14512 -16668 -7690 4705 2097
13983 2097 9032 9505 3486 -4342 800 945 -4430 -12612 -1788 1629 -6043 -13777 -17852 -12047 -2660
13968 -2660 764 -2479 -8556 -13745 -11517 -3969 -536 -9402 -11596 -20179 -10505 -6862 -10402 -3897 -9344
13953 -9344 -8899 -8206 -15529 -9884 -15472 -12603 -8210 -6554 -13335 -6601 -1191 -3813 5985 14238 29721
13938 29721 41281 19287 3086 991 -4484 -18159 -25656 -21337 -866 15609 21138 9488 -4596
13925 -4596 -10138 -7466 -6901 -2497 -2702 -1406 -8839 -17102 -7611 1345 -10151 -9149 -15008 -25232 -19749
$$ packed form
14024c4833J5773K0654N314j0653j1997m155J2568N293R2K23j1453j9m465k318
14010a9976J5771L575r575j3035M204Q434J3675P230J076o507K367R10L054l118
13996H085J2208j3552k8830j1212M937J2492Q346j0574L588k156Q978J2395k608
13983B097O935M73o019p828N142J45n375q182J0824L417p672p734m075N805R387
13968b660L424l243o077n189K228P548L433q866k194q583R674L643l540O505n447
13953i344M45O93p323N645n588K869M393J656o781O734N410k622R798Q253J5483
13938B9721J1560k1994j6201k095n475j3675p497M319K0471J6475N529j1650j4084
13925d596n542K672N65M404k05J296p433q263R491Q956j1496J002n859j0224N483
$$ plain form
13910 -19749 -13359 -1412 9104 -848 -13539 -15801 -24284 988 9292 27608 32969 16840 16534
13897 16534 8801 12928 7075 -7992 -15901 -14236 -4253 -9121 -33254 -42847 -10863 -9785 -21632
13884 -21632 -16286 -355 -2123 -16168 -15526 -15317 -28727 -16670 -14611 -8706 -6880 -10154 -7584 -10195
13870 -10195 -12889 -14054 -16502 -27964 -17904 -5960 -981 -2358 -4919 -10366 -11099 -8707 -16384 -27423
13856 -27423 -25639 -33076 -53458 -52546 -43130 -32899 -31412 -21018 -30019 -32121 -23157 -19617 -17378 -18957
13842 -18957 -19513 -14022 -12316 -10510 -1137 -12393 -7152 15524 10484 9015 -3825 -20935 -19766 -16493
13828 -16493 -7259 -7396 -1866 1521 -7444 -24107 -12393 -19930 -13795 -14405 -18567 -21365 -28262 -12357
13814 -12357 -8295 -11770 3914 4686 -1036 6972 180 -13381 -16619 -3438 4265 -3663 -22103 -22603
$$ packed form
13910a9749O390J1947J0516r952j2691k262q483K5272Q304J8316N361j6129l06
13897A6534p733M127n853j5067p909J665R983m868k4133r593L1984J078j1847
13884b1632N346J5931j768j4045O42K09j3410J2057K059N905J826l274K570k611
13870a0195k694j165k448j1462J0060J1944M979j377k561n447p33K392p677j1039
13856b7423J784p437k0382R12R416J0231J487J0394r001k102Q964L540K239j579
13842a8957n56N491J706J806R373j1256N241K2676n040j469j2840j7110J169L273
13828a6493R234j37N530L387q965j6663J1714p537O135o10m162k798o897J5905
13814a2357M062l475J5684P72n722Q008o792j3561l238J3181P703p928j8440n00
$$ plain form
13800 -22603 -19370 -19534 -20115 -34977 -42142 -32398 -27747 -22258 -13522 -13286 -12210 -11244 -15786 -28409 -36202
13785 -36202 -20093 -9887 -28859 -14252 -7794 -14197 -868 10245 14875 16759 14454 4667 6682
13772 6682 14495 18882 9060 2755 5811 3161 -1402 -15602 -28183 -23226 -7365 1668 14673 9384
13758 9384 212 -4399 -2600 8878 11108 3298 -5660 -13868 2019 9447 1961 -4795 -3853 2790
13744 2790 1635 -9907 -5886 -4426 -8817 -1527 18804 15780 -4476 -10590 -5695 -1290 159 -2419
13730 -2419 2198 3847 81 15041 27721 19540 13594 8965 3434 -19877 -25391 -14897 2195
13717 2195 7972 680 -10394 -11477 -6806 5807 11068 6937 16325 15586 23286 29280 16980 8991
13703 8991 11871 10105 10783 20582 20580 28124 24583 15873 8282 6878 -880 -1309 14587 29201 10107
$$ packed form
13800b2603L233j64n81j4862p165R744M651N489Q736K36J076R66m542j2623p793
13785c6202J6109J0206j8972J4607O458o403J3329J1113M630J884k305r787K015
13772F682P813M387r822o305L056k650m563j4200j2581M957J5861R033J3005n289
13758I384r172m611J799J1478K230p810q958q208J5887P428p486o756R42O643
13744B790j155j1542M021J460m391P290K0331l024k0256o114M895M405J449k578
13730b419M617J649l766J4960J2680q181n946m629n531k3311n514J0494J7092
13717B195N777p292j1074j083M671J2613N261m131R388p39P700N994j2300p989
13703H991K880j766O78R799kP544l541q710p591j404p758m29J5896J4614j9094
$$ plain form
13688 10107 -4546 -21027 -14284 -5444 -13222 -12142 -15326 -21192 -29404 -33469 -19725 -14058 -14498 -7824
13674 -7824 -32215 -22484 -1318 -5306 -3639 -4713 -24621 -31956 -32148 -17894 -1199 4389 -10841
13661 -10841 -23391 -34213 -20324 -14638 -24498 -15919 -18695 -18009 -5466 -1161 12460 15106 8095
13648 8095 11362 14637 490 1004 16184 20176 19781 7128 -8527 -12432 -9424 -13412 -8652 -15890
13634 -15890 -10526 -10649 -12212 -7953 -3598 5060 -4335 -8678 -2039 -2219 -11063 -20419 -16653 -9634 -2965
13619 -2965 12432 9672 -6918 -24110 -21239 -20491 -1465 17672 16128 1360 2622 -12675 -14728
13606 -14728 -3082 -881 -19465 -36537 -41970 -35515 -38036 -26920 -20388 -20131 -15203 -27135 -41768
13593 -41768 -39917 -20889 -15980 -10069 3878 14728 8958 8593 9305 13572 -404 -14514 -27249
$$ packed form
13688A0107j4653j6481O743Q840p778J080l184n866q212m065J3744N667m40O674
13674g824k4391R731K1166l988J667j074j9908p335j92J4254J6695N588j5230
13661a0841j2550j0822J3889N686r860Q579k776O86J2543M305J3621K646p011
13648H095L267L275j4147N14J5180L992l95j2653j5655l905L008l988M760p238
13634a5890N364j23j563M259M355Q658r395m343O639j80q844r356L766P019O669
13619b965J5397k760j6590j7192K871P48J9026J9137j544j4768J262j5297k053
13606a4728J1646K201j8584j7072n433O455k521J1116O532K57M928j1932j4633
13593d1768J851J9028M909N911J3947J0850n770l65P12M267j3976j4110j2735
$$ plain form
13580 -27249 -8040 -3445 -9725 -10140 -15185 -15568 -7759 -6625 295 -4128 5818 22716 17680 5983
13566 5983 148 -5522 -15965 -6241 11558 6905 -7806 -17373 -11638 -19170 -7014 9612 11534
13553 11534 20327 957 -8187 1316 -8702 -8844 -8760 -15509 -12322 -20456 -18573 -10732 -12401 -14676 -4773
13538 -4773 -252 2854 3664 -11638 -11061 -2824 3079 6340 -5031 -6091 -4645 12111 19386 -5360
13524 -5360 -11633 -15021 -8814 -5843 -9977 -9825 -11548 -17212 -3293 10686 34808 31720 23900 16091
13510 16091 -3894 -15641 -15374 -15884 -24705 -7305 -3879 -9143 -21537 -21913 -13060 -22652 -18075 -2846
13496 -2846 5317 -7555 -17902 -14892 1522 -3884 802 9476 18634 11660 -2418 -8035 979 1906
13482 1906 -7565 -11814 -13194 -12834 -69 9074 -2335 -13119 -22370 -8144 -10155 -4877 2088 -7872
$$ packed form
13580b7249J9209M595o280m15n045l83P809J134O920m423R946J6898n036j1697
13566E983n835n670j0443R724J7799m653j4711r567N735p532J2156J6626J922
13553A1534Q793j9370r144R503j0018j42Q4o749L187q134J883P841j669k275R903
13538d773M521L106Q10j5302N77Q237N903L261j1371j060J446J6756P275k4746
13524e360o273l388O207K971m134J52j723n664J3919J3979K4122l088p820p809
13510A6091j9985j1747K67n10q821J7400L426n264j2394l76Q853r592M577J5229
13496b846Q163j2872j0347L010J6414n406M686Q674R158o974j4078n617R014R27
13482A906r471m249j380L60J2765R143j1409j0784r251J4226k011N278O965r960
$$ plain form
13468 -7872 820 -3704 -2177 -17071 -18819 -16400 -21242 -17848 -15253 -13921 -10756 -15067 -21520 -20449
13454 -20449 -17816 -21697 -25043 -25634 -35274 -17962 -1189 -1314 -4196 -14431 -6305 3902 399 -13251
13440 -13251 -22140 -20739 -26958 -24493 -14224 -22927 -12798 -6607 -9523 -16743 -28213 -31618 -33742 -31851
13426 -31851 -31674 -27850 -25226 -26377 -27011 -13466 -6041 -9805 -8803 -13135 -7403 -377 12940 5670
13412 5670 -4854 -10855 -12265 -21562 -13168 -10789 -1711 -14135 -24434 -22477 -23473 -6887 5837 5803
13398 5803 -5078 3038 -4391 -15693 -20234 -17641 -9959 -8199 -6861 -19069 -20727 -10664 -6730 6927
13384 6927 3043 -10769 -1362 9271 19475 9422 8400 1886 3212 -8649 -31200 -27473 -7132
13371 -7132 -13504 -20528 -19340 -12498 -13505 -6596 -1805 5802 812 -15549 -27904 -26227 -23555 -28349
$$ packed form
13468g872Q692m524J527j4894j748K419m842L394K595J332L165m311o453J071
13454b0449K633l881l346n91r640J7312J6773j25k882j0235Q126J0207l503j3650
13440a3251q889J401o219K465J0269q703J0129O191k916p220j1470l405k124J891
13426c1851J77L824K624j151o34J3545P425l764J002m332N732P026J3317p270
13412E670j0524o001j410r297Q394K379R078j2424j0299J957r96J6586J2724l4
13398E803j0881Q116p429j1302m541K593P682J760J338j2208j658J0063L934J3657
13384F927l884j3812R407J0633J0204j0053j022o514J326j1861k2551L727K0341
13371g132o372p024J188O842j007O909M791P607m990j6361j2355J677K672m794
$$ plain form
13357 -28349 -7981 15912 9265 -12801 -20230 -18080 -12439 -9732 -4295 -11211 -3572 -8184 -5879 3478
13343 3478 -9756 -31677 -43364 -29210 -9567 -8739 -8168 -8127 -10733 -3396 -11503 -9723 -7841 -18854
13329 -18854 -13122 -12276 -16718 -13773 -8082 -11332 -14937 -5798 -7102 -4473 2932 -2309 -8188 -4232 -6101
13314 -6101 -17994 -13828 -5412 5241 -2598 -5713 -611 -2027 -14985 -444 10352 -993 -12798
13301 -12798 -18869 -5531 20977 26424 23891 2760 -9645 3156 4445 6326 17495 16292 8071
13288 8071 6027 -3748 -8263 -6877 208 -11333 -16667 -2735 1831 -5001 3278 -4111 -23282 -23461
13274 -23461 -8611 -22072 -24204 -35079 -32636 -26475 -31682 -19467 -19224 -6517 507 -271 -10158 -22983
13260 -22983 -24099 -23714 -15063 -19125 -26922 -35745 -29631 -21429 -14913 -13239 -14109 364 -5704 -20275
$$ packed form
13357b8349K0368K3893o647k2066p429K150N641K707N437o916P639m612K305R357
13343C478j3234k1921j1687J4154J9643Q28N71M1k606P337q107J780J882j1013
13329a8854N732Q46m442K945N691l250l605R139j304K629P405n241n879L956j869
13314f101j1893M166Q416J0653p839l115N102j416j2958J4541J0796j1345j1805
13301a2798o071J3338K6508N447k533k1131j2405J2801J289J881J1169j203q221
13288H071k044r775m515J386P085j1541n334J3932M566o832Q279p389j9171j79
13274b3461J4850j3461k132j0875K443O161n207J2215K43J2707P024p78r887j2825
13260b2983j116L85Q651m062p797q823O114Q202O516J674q70J4473o068j4571
$$ plain form
13246 -20275 -12808 -6236 -8089 -3130 3524 3395 -5644 4451 1573 -3651 -2256 -2944 -5441 -2900 -6394
13231 -6394 -11191 -16157 -26067 -19936 -11454 353 272 -15560 -20186 -5845 -2926 -13672 -20788 -19336
13217 -19336 -8779 -15375 -2582 -3996 -6257 2148 677 -9712 -14708 -17835 -22549 -20661 -12460 -15966
13203 -15966 -26755 -24546 -27127 -24177 -19338 -16989 -18742 8138 29141 29375 23409 21425 7777 -8528
13189 -8528 -17374 -19365 -10516 75 13247 22250 15395 9602 -4783 2071 1751 -10387 -11326 -7812
13175 -7812 12466 -8727 -10156 577 5133 -6999 -13319 -11950 -17812 -16517 569 3509 11346
13162 11346 15364 19745 15965 527 1911 11261 7088 3904 1938 10724 18639 40679 58377 73701
13148 73701 84817 97239 94955 92337 96030 78953 77356 79343 81018 89885 87027 62167 54858
$$ packed form
13246b0275P467O572j853M959O654j29r039J0095k878n224J395o88k497K541l494
13231f394m797m966r910O131Q482J1807q1j5832m626J4341K919j0746p116J452
13217a9336J0557o596J2793j414k261Q405j471j0389m996l127m714J888Q201l506
13203a5966j0789K209k581K950M839K349j753K6880K1003K34n966j984j3648j6305
13189h528q846j991Q849J0591J3172R003o855n793j4385O854l20j2138r39L514
13175g812K0278k1193j429J0733M556j2132o320J369n862J295J7086K940P837
13162A1346M018M381l780j5438J384R350m173l184j966Q786P915K2040J7698J5324
13148G3701J1116J2422k284k618L693j7077j597J987J675Q867k858k4860p309
$$ plain form
13135 54858 42691 34654 37423 45859 33615 16886 13283 21612 20349 24833 22177 9128 -3669
13122 -3669 -1269 -7529 -9595 -10246 -12669 -23675 -13586 3641 9246 -8553 -10447 -13570 -23025 -13743
13108 -13743 4447 19539 20538 21129 1993 9676 -3512 -19406 -15212 -191 8169 2436 -14702
13095 -14702 -8021 -1565 -1059 -11978 -15764 7797 11471 -5644 -21227 -21462 -13341 -12779 -23178 -18228
13081 -18228 2048 1178 1315 -1054 -13879 -26867 -35392 -19316 -26515 -32801 -16667 4977 463
13068 463 -10486 -12549 -2847 4422 1967 -19085 -19974 -18572 -12387 -10081 3420 13493 6531 17854
13054 17854 25292 14392 10174 23314 35831 37852 18639 4016 3417 -359 -6715 -11952 -16551
13041 -16551 -21378 -18211 -11339 -28190 -31114 -12520 2820 2828 -2878 -2582 -7226 -14209 -15804 4204
$$ packed form
13135E4858j2167q037K769Q436j2244j6729l603Q329j263M484k656j3049j2797
13122c669K400o260k066o51k423j1006J0089J7227N605j7799j894l123r455R282
13108a3743J8190J5092R99N91j9136P683j3188j5894M194J5021Q360n733j7138
13095a4702O681O456N06j0919l786K3561L674j7115j5583k35Q121N62j0399M950
13081a8228K0276q70J37k369j2825j2988q525J6076p199o286J6134K1644m514
13068D63j0949k063R702P269k455k1052q89J402O185K306J3501J0073o962J1323
13054A7854P438j0900m218J3140J2517K021j9213j4623n99l776o356n237m599
13041a6551m827L167O872j6851k924J8594J5340Qn706K96m644o983j595K0008
$$ plain form
13027 4204 -2693 -13306 -7325 -4119 -588 -2109 -3522 -1865 -6892 -11804 -11964 -13861 44 639 -5337
13012 -5337 -10706 -4093 -16079 1308 15630 6070 -8253 -7336 -7722 6395 22416 21487 -3178 -14114
12998 -14114 -24470 -11506 -22371 -21215 -7259 -2722 -9154 -2359 -3298 -4597 1045 6053 984 -9213
12984 -9213 -20595 -14792 -9444 -13983 -10541 -18875 -23918 -8931 2326 6735 -5041 -8484 12630
12971 12630 12660 -1969 -10168 -18093 -23186 -15850 -10012 -17546 -26537 -17217 -22836 -25655 -8182 4638
12957 4638 -10030 -21708 -20997 1313 10733 16466 7553 11601 3531 -3844 -9680 -10806 -35 -764
12943 -764 -5977 -1301 19948 29226 23023 10956 7598 17661 27829 37147 35870 33670 42141 59793
12929 59793 68349 62568 55601 54632 32655 7730 1499 -663 193 12009 14256 10405 2006 -2967
$$ packed form
13027D204o897j0613N981L206L531j521j413J657n027m912j60j897J3905N95n976
13012e337n369O613j1986J7387J4322r560j4323R17l86J4117J6021r29k4665j0936
12998a4114j0356J2964j0865J156J3956M537o432O795r39j299N642N008n069j0197
12984i213j1382N803N348m539L442q334n043J4987J1257M409j1776l443K1114
12971A2630L0j4629q199p925n093P336N838p534q991R320n619k819J7473J2820
12957D638j4668j1678P11K2310R420N733q913M048q070p375n836j126J0771p29
12943g64n213M676K1249R278o203j2067l358J0063J0168R318j277k200Q471J7652
12929E9793Q556n781o967r69k1977k4925o231k162Q56J1816K247l851q399m973
$$ plain form
12915 -2967 -5438 -5009 -14042 -20185 -20139 -13346 -11214 -1068 -67 3144 10344 5090 148 12412 8249
12900 8249 11118 -961 -683 16082 23037 20146 6143 10977 8901 3356 -3965 8567 18716 22778
12886 22778 13759 657 -9358 -14034 -10616 -7379 -30544 -47230 -34974 -23005 -12280 690
12874 690 8924 -2201 9479 6988 638 8232 14298 12841 17327 10014 4460 10565 5949 7448
12860 7448 12087 6170 6116 12353 18488 6767 -246 6204 25073 25362 30279 26834 42959 78216
12846 78216 99945 120739 137216 155749 163829 179337 179172 176179 169709 167366 166136 145522 110005
12833 110005 91391 75189 70307 47956 29184 24659 14218 16028 23425 27982 33736 24659 23304
12820 23304 39758 34633 15062 -15707 -13428 -5494 -3388 5101 13190 23457 19696 9072 -1871
$$ packed form
12915b967k471M29r033o143M6O793K132J0146J001L211P200n254m942J2264m163
12900H249K869j2079K78J6765O955k891j4003M834k076n545p321J2532J0149M062
12886B2778r019j3102j0015m676L418L237k3165j6686J2256J1969J0725J2970
12874F90Q234j1125J1680k491o350P594O066j457M486p313n554O105m616J499
12860G448M639n917n4O237O135j1721p013O450J8869K89M917l445J6125L5257
12846G8216K1729K0794J6477J8533Q080J5508j65k993o470k343j230k0614l5517
12833A10005j8614j6202m882k2351j8772m525j0441J810P397M557N754r077j355
12820B3304J6454n125j9571l0769K279P934K106Q489Q089J0267l761j0624j0943
$$ plain form
12807 -1871 -3266 -12606 -7507 -7627 -5986 1502 7007 12248 14207 2251 -649 8395 -187 -7485 -10949
12792 -10949 -9526 -5793 -7511 -5430 1619 6624 -11 -8531 -1813 2042 4270 16810 15107 -361
12778 -361 4369 1673 -11332 -10483 -4390 -6068 -11494 -20320 -16597 -7540 -580 -2061 -10948 -16128 -14735
12763 -14735 -10820 -14333 -14294 -31888 -51410 -46558 -33173 -32784 -38109 -26914 -2893 1738 -2590 -10608
12749 -10608 -7478 -3471 -9973 -30413 -27954 -34026 -27647 -12671 -9402 -517 12584 2809 8334 1585
12735 1585 7939 16428 11291 -2241 -8949 -277 -3728 -7517 1890 7675 15903 -8812 -19124 -16434
12721 -16434 3125 2172 -3603 -534 -2703 -11792 -14949 -8215 -2947 -12185 -17421 -12482 -2260 13527
12707 13527 6587 5692 -3959 -4778 46 2133 -6202 -21667 -29833 -32284 -23356 -6553 5118 -2522
$$ packed form
12807a871j395r340N099j20J641P488N505N241J959j1956k900R044q582p298l464
12792a0949J423L733j718K081P049N005o635q520O718L855K228J2540j703j5468
12778c61M730k696j3005Q49O093j678n426q826L723R057O960j481q887n180J393
12763a4735L915l513L9j7594j9522M852J3385L89n325J1195K4021M631m328q018
12749a0608L130M007o502k0440K459o072O379J4976L269Q885J3101r775N525o749
12735A585O354Q489n137j3532o708Q672l451l789R407N785Q228k4715j0312K690
12721a6434J9559r53n775L069k169r089l157O734N268r238n236M939J0222J5787
12707A3527o940q95r651q19M824K087q335j5465q166k451Q928J6803J1671p640
$$ plain form
12693 -2522 -6465 -2594 -3319 17187 5331 -7229 -17328 -8617 2195 11982 11009 17679 17660 119
12679 119 -2236 4068 1433 4352 3179 9521 14073 -2870 -20411 -7032 -314 7190 152 -7495
12665 -7495 -1150 1585 6134 7426 19736 12545 12490 2413 -10846 -22494 -9663 13561 6268 -1206
12651 -1206 -6701 -27678 -36261 -37682 -38873 -34387 -25784 -10950 -10381 -12625 -9217 -12987 -20461 -38058
12637 -38058 -37696 -31414 -10585 -2410 1935 3025 1882 8390 2189 -12387 -18022 -7080 -852 -5842
12623 -5842 -19874 -9986 -12773 -14413 -8156 -4321 -4184 -3465 -4876 -14921 -24384 -14194 -8849 -11811
12609 -11811 -20542 -4463 6718 -9396 -3606 2725 7370 571 -9467 -8473 -14364 -9453 -1081 -9423
12595 -9423 -13269 -27691 -24777 -23323 -22280 -12723 -8993 -18923 -24760 -26287 -24308 -4436 -7219 -784
$$ packed form
12693b522l943L871p25K0506j1856j2560j0099Q711J0812R787r73O670j9j7541
12679A19k355O304k635K919j173O342M552j6943j7541J3379O718P504p038p647
12665g495O345K735M549J292J2310p191n5j0077j3259j1648J2831K3224p293p474
12651a206n495k0977q583j421j191M486Q603J4834N69k244L408l770p474j7597
12637c8058L62O282K0829Q175M345J090j143O508o201j4576n635J0942O228m990
12623e842j4032R888k787j640O257L835J37P19j411j0045r463J0190N345k962
12609a1811q731J6079J1181j6114N790O331M645o799j0038R94n891M911Q372q342
12595i423l846j4422K914J454J043R557L730r930n837j527J979J9872k783O435
$$ plain form
12581 -784 -6515 -12960 -11628 -10373 26 13795 14711 13819 11528 9107 6812 5225 -15952 -9288 10325
12566 10325 7945 -6743 -10412 2887 -13840 -26713 -34608 -36976 -25664 2559 6792 -8647 -11045
12553 -11045 -12858 -6250 -4712 -3898 -4277 5383 6071 -7590 -16099 -17522 -25306 -27092 -8230 -17910 -6061
12538 -6061 2401 12289 -1141 -16248 -10790 -4955 7782 9291 -2809 -9521 -791 -9055 -14340 -11443
12524 -11443 3439 -11327 -22858 -9155 -4643 -10091 -19356 -28048 -23906 -13897 -9623 -3649 7964
12511 7964 1983 1273 18218 10565 5904 2575 -7220 -6631 6781 7856 5718 -3388 115 -4574 -15959
12496 -15959 -19869 -17367 -17457 -17112 -4081 -20132 -20073 -3482 -3727 -7902 -7710 -20520 -15393 -10116 -14452
12481 -14452 -8180 -11733 -12240 -7916 -12347 -21685 -17468 -4393 2266 6683 6843 12970 13017 -3243 -12271
$$ packed form
12581g84n731o445J332J255J0399J3769R16q92k291k421k295j587k1177O664J9613
12566A0325k380j4688l669J3299j6727j2873p895k368J1312K8223M233j5439k398
12553a1045j813O608J538Q14l79R660O88j3661q509j423p784j786J8862r680J1849
12538f061Q462R888j3430j5107N458N835J2737J509j2100o712Q730q264n285K897
12524a1443J4882j4766j1531J3703M512n448r265q692M142J0009M274N974J1613
12511G964n981p10J6945p653m661l329r795N89J3412J075k138r106L503m689j1385
12496a5959l910K502r0L45J3031j6051N9J6591k45m175J92j2810N127N277m336
12481a4452O272l553n07M324m431r338M217J3075O659M417J60O127M7j6260r028
$$ plain form
12466 -12271 -24866 1331 11600 -8259 -21107 -16009 -967 4973 -5978 -9468 -7179 -60 -8350
12453 -8350 -18430 -29830 -32641 -25820 -8633 -1446 -6375 -17707 -28817 -29208 -33326 -29035 -23270 -17807
12439 -17807 -9315 3639 5535 -5403 -13032 -24920 -29592 -22324 -17146 -19652 -4173 7404 9607
12426 9607 8738 4559 5515 7509 7966 -277 -8373 -3297 2615 -7661 -14132 -9079 -11734 -5087 -12439
12411 -12439 -14759 -14159 -280 9921 -2838 -4520 -5571 -5354 -4604 5220 -1907 -620 13233 13008
12397 13008 16150 4701 201 4546 -12901 -12024 1539 17782 10156 2148 1619 -728 -675 -5939
12383 -5939 -15172 -10272 -13977 -9312 8874 12612 10692 20918 16770 29126 30757 20060 12414 19571
12369 19571 28034 9583 -3007 -7081 -2432 -8192 -16155 -12940 332 -3925 -15632 -17294 -4990
$$ packed form
12466a2271j2595K6197J0269j9859j2848N098J5042N940j0951l490K289P119q290
12453h350j0080j1400k811O821J7187P187m929j1332j1110l91m118M291N765N463
12439a7807Q492J2954J896j0938p629j1888m672P268N178k506J5479J1577K203
12426I607q69m179R56J994M57q243q096N076N912j0276o471N053k655O647p352
12411a2439k320O00J3879J0201j2759j682j051K17P50R824p127J287J3853k25
12397A3008L142j1449m500M345j7447Q77J3563J6243p626q008n29k347N3n264
12383e939r233M900l705M665J8186L738j920J0226m148J2356J631j0697p646P157
12369A9571Q463j8451j2590m074M649n760p963L215J3272m257j1707j662J2304
$$ plain form
12356 -4990 5758 -2591 -11542 -22705 -21826 -19635 -10904 5341 4193 -7570 -2583 3686 -335 -8082
12342 -8082 -23952 -18670 -24022 -29157 -21455 -9290 -7159 -11785 -9826 -10773 -857 3928 49 1926
12328 1926 10012 12781 -1070 -9223 -7512 -2803 -12860 -16618 -14210 -10130 -4079 3917 -6453 -5276
12314 -5276 -9754 -9964 -26236 -27307 -23970 -10889 -19526 -19433 -11870 -12906 -9310 -14793 -10451 -7523 -4389
12299 -4389 -11869 -18285 -14923 -15966 -10126 -6611 -15125 -13578 -5504 1151 4597 12066 27629 18614
12285 18614 17802 18647 3086 4514 15851 27086 25092 30758 31365 5993 -5242 4631 27641 29351
12271 29351 10392 3131 6987 8482 -4727 -2065 527 -8653 -8209 -4990 8155 2740 1043 -9735
12257 -9735 -994 -1312 6272 14895 3948 -1834 -8650 -24090 -32750 -30740 -24993 -26812 -27280 -12397
$$ packed form
12356d990J0748q349q951j1163Q79K191Q731J6245j148j1763M987O269m021p747
12342h082j5870N282n352n135P702J2165K131m626J959r47R916M785l879J877
12328A926Q086K769j3851q153J711M709j0057l758K408M080O051P996j0370J177
12314e276m478k10j6272j071L337J3081q637R3P563j036L596n483M342K928L134
12299d389p480o416L362j043N840L515q514J547Q074O655L446P469J5563r015
12285A8614q12Q45j5561J428J1337J1235j994N666O07k5372j1235R873K3010J710
12271B9351j8959p261L856J495j3209K662K592r180M44L219J3145n415j697j0778
12257i735Q741l18P584Q623j0947n782o816j5440q660K010N747j819m68J4883
$$ plain form
12243 -12397 5033 4326 26 4008 2179 -5912 -9669 -9572 -11674 -10369 -9141 -10011 -30473 -28923 -25556
12228 -25556 -33930 -15610 -885 -11694 -27045 -27429 -34132 -39860 -22445 -5819 -498 -4874 548
12215 548 8805 406 7058 -1694 87 -9074 -6700 -2020 8541 2039 -8537 -16027 -11558 -2086
12201 -2086 -2043 -3478 -1909 5814 2054 1332 -7880 838 -5460 -2862 -5738 -12985 -23482 -35849 -35439
12186 -35439 -27728 -26575 -25597 -24671 -12169 -743 -2036 -7782 3974 16918 23043 20652 16291 8196
12172 8196 -4790 -9983 -14853 -9551 3137 15910 9874 7311 8639 -2286 -5850 -9364 -11492 -5071
12158 -5071 3012 3414 -4211 -17860 -20709 -3171 21085 19871 15747 8522 5129 -561 -13228 -16648
12144 -16648 -14538 -18684 -24372 -14298 483 822 -7081 -21657 -10557 -3567 -20539 -25366 -13102
$$ packed form
12243a2397J7430p07m300L982j829q091l757R7k102J305J228q70k0462J550L367
12228b5556q374J8320J4725j0809j5351l84o703n728J7415J6626N321m376N422
12215E48Q257q399O652q752J781r161K374M680J0561o502j0576p490M469R472
12201b086M3j435J569P723l760p22r212Q718o298K598k876p247j0497j2367M10
12186c5439P711J153R78R26J2502J1426j293n746J1756J2944O125k391m361q095
12172H196j2986n193m870N302J2688J2773o036k563J328j0925l564l514k128O421
12158e071Q083M02p625j3649k849J7538K4256j214m124p225l393n690j2667l420
12144a6648K110m146n688J0074J4781L39p903j4576J1100O990j6972m827J2264
$$ plain form
12131 -13102 -26205 -27185 -24986 -18096 -6420 -18330 -28039 -22215 -35065 -27587 -18455 -19176 -7155 3918
12117 3918 8263 -3734 -13716 -20569 -24505 -22679 -8524 -5901 2702 -1527 -6393 -26010 -44478 -38120
12103 -38120 -28433 -9292 -13389 -19262 -28192 -28764 -18695 -12609 -1546 6491 803 -1444 3224 10370
12089 10370 -5172 -14192 -15433 268 -1706 -12703 -13784 -5243 199 1642 754 -9455 -18183 -4008
12075 -4008 11331 10244 26044 7984 -2242 14517 13683 16034 15841 9765 10373 7463 987 -2695
12061 -2695 -8187 -11135 -7463 2444 6449 16985 4877 -1798 -3278 -329 4108 6713 3832 4703
12047 4703 3618 13712 10835 -6501 1323 3493 3573 7773 16725 22104 3328 -2034 -4510 -6500
12033 -6500 -5902 -3640 3128 1365 9955 10260 16289 10491 7814 -3925 -14648 -21368 -16547 -6852 -15193
$$ packed form
12131a3102j3103r80K199O890J1676j1910r709N824j2850P478R132p21J2021J1073
12117C918M345j1997r982o853l936J826J4155K623Q603m229m866j9617j8468O358
12103c8120R687J9141m097n873q930n72J0069O086J1063Q037n688k247M668P146
12089A0370j5542r020j241J5701j974j0997j081Q541N442J443q88j0209q728J4175
12075d008J5339j087J5800j8060j0226J6759q34K351j93o076O08k910o476l682
12061b695n492k948L672R907M005J0536j2108o675j480K949M437K605k881Q71
12047D703j085J0094k877j7336P824K170Q0M200Q952N379j8776n362k476j990
12033f500N98K262O768j763Q590L05O029n798k677j1739j0723o720M821R695q341
$$ plain form
12018 -15193 -4622 10619 22898 5208 -12085 -10449 -15734 -18638 -20018 -21655 -23783 -22834 -21273
12005 -21273 -17737 -17672 -20183 -16414 -11221 -15227 -9676 -3799 -1127 3612 4991 -354 -6938 7079 4583
11990 4583 10642 16552 9899 -2472 -1056 4530 -2032 -4232 -3137 1983 1311 4601 14268 15199 362
11975 362 -5432 3959 -9228 -8090 -27173 -35607 -29625 -29534 -25295 -4654 -7626 855 -4824 -6498 4731
11960 4731 20638 16338 14248 15110 4963 -7242 -4755 4986 16428 23138 9712 7055 1539 8392
11946 8392 7809 -6016 1291 815 -11381 -20737 -15669 -7272 -16775 -13846 -36404 -44615 -45768 -34353
11932 -34353 -24939 -20908 -26788 -38538 -21524 -28262 -19700 1826 -3043 -3138 -12378 -14571 -4359 7868
11918 7868 5735 -8986 -13911 -9790 -5147 16858 13056 12815 17964 5588 -9444 -9919 -1975 2302
$$ packed form
12018a5193J0571J5241J2279j7690j7293J636n285k904j380j637k128R49J561
12005b1273L536O5k511L769N193m006N551N877K672M739J379n345o584J4017k496
11990D583O059N910o653j2371J416N586o562k200J095N120o72L290R667R31j4837
11975C62n794R391j3187J138j9083q434N982R1M239K0641k972Q481n679j674J1229
11960D731J5907m300k090Q62j0147j2205K487R741J1442O710j3426k657n516O853
11946H392n83j3825P307m76j2196r356N068Q397r503K929k2558q211j153J1415
11932c4353R414M031n880j1750J7014o738Q562K1526m869r5r240k193J0212J2227
11918G868k133j4721m925M121M643K2005l802k41N149j2376j5032m75P944M277
$$ plain form
11904 2302 4455 2843 741 -4018 -2260 -414 2178 -3816 -4428 -9954 -15653 -14971 -8606 -6949 -4042
11889 -4042 -14706 -31011 -33909 -21980 -23543 -21027 -15527 -3041 5123 2877 619 2652 -8333
11876 -8333 -7962 -2317 -3427 7347 5460 6887 1455 -959 -11295 -16504 -8556 -9616 -4299 -16316
11862 -16316 -15646 -11361 -11516 -19787 -29914 -29888 -16047 -14443 -14956 -17656 -9041 -754 -10336 -7402 5951
11847 5951 -3 -7814 -26954 -34522 -20307 -7095 4648 14705 13285 9339 8404 1643 11318 13926
11833 13926 22283 13530 -132 -1622 -9524 -13871 -11988 -11271 -9855 -12533 -13862 -9658 -16384 -21687
11819 -21687 -26712 -19470 -9978 -4475 -3636 -16153 -31575 -37721 -35055 -40359 -43007 -30356 -28505 -32239
11805 -32239 -33466 -37263 -20555 -1351 5852 1908 12677 19253 8547 -4813 4734 1605 -14516
$$ packed form
11904B302K153j612k102m759J758J846K592n994o12n526n699O82O365J657K907
11889d042j0664j6305k898J1929j563K516N500J2486Q164k246k258K033j0985
11876h333L71N645j110J0774j887J427n432k414j0336n209P948j060N317j2017
11862a6316O70M285j55q271j0127K6J3841J604n13k700Q615Q287r582K934J3353
11847E951n954p811j9140p568J4215J3212J1743J0057j420l946r35o761R675K608
11833A3926Q357q753j3662j490p902m347J883P17J416k678j329M204o726n303
11819b1687n025P242R492N503Q39j2517j5422o146K666n304k648J2651J851l734
11805c2239j227l797J6708J9204P203l944J0769O576j0706j3360R547l129j6121
$$ plain form
11792 -14516 -10694 -4786 -5460 -1107 -9243 -13846 4706 5230 -3437 -6283 16568 25854 13348 -5977
11778 -5977 -27646 -38076 -34613 -12324 -21937 -25649 -26325 -27684 -15382 -14348 -10241 -5632 -10529 -6499
11764 -6499 -9430 -25344 -18211 -9302 -25747 -32577 -20425 -20018 -11310 -8550 -6505 -7464 -6775 -7221 3153
11749 3153 5262 -10112 -27233 -18289 5810 939 -9644 -25632 -17816 928 12226 4713 6078
11736 6078 -1844 -11010 -16532 1180 14280 3809 3977 -4563 -13110 -13788 -7741 -18966 -37957 -27780
11722 -27780 -25417 -36118 -29922 -12106 -5252 -13022 -11731 5151 15190 12024 5786 -8530 -10248
11709 -10248 -3489 -9014 -14250 -18893 -17394 -27002 -32749 -29600 -25340 -21231 6617 25062 17489 15356
11695 15356 21594 11416 1478 -11750 884 17817 27379 19613 14660 -464 -7013 -12759 -17182
$$ packed form
11792a4516L822N908o74M353q136m603J8552N24q667k846K2851R286j2506j9325
11778e977k1669j0430L463K2289r613l712o76j359J2302J034M107M609m897M030
11764f499k931j5914P133Q909j6445o830J2152M07Q708K760K045r59O89m46J0374
11749C153K109j5374j7121Q944K4099m871j0583j5988P816J8744J1298p513J365
11736F078p922r166n522J7712J3100j0471J68q540q547o78O047j1225j8991J0177
11722b7780K363j0701O196J7816O854p770J291J6882J0039l166o238j4316j718
11709a0248O759n525n236m643J499r608n747L149M260M109K7848J8445p573k133
11695A5356O238j0178r938j3228J2634J6933R562p766m953j5124o549n746m423
$$ plain form
11682 -17182 -18511 -15372 -13502 -12607 -6153 -60 435 9113 6538 8906 12464 5541 -9986 -17807 -24249
11667 -24249 -18824 -14589 -5409 -765 3147 13620 15848 6740 -7827 168 8135 15738 9517 2522
11653 2522 -4425 5583 4317 -7859 -4762 -14160 -8452 873 -4236 -19040 -12517 3132 -6971
11640 -6971 -16828 -1433 -3816 9664 17852 11387 -3346 -5096 -1941 10421 17957 19439 13234 7399
11626 7399 1700 15367 18204 5351 -3842 -19368 -24005 -15382 -10051 1829 4236 1431 4615 -5634
11612 -5634 -24576 -16287 1710 8895 -9770 -8541 -11336 -17172 -22491 -14412 -13845 -10862 -4439 7414
11598 7414 11593 6230 14238 -3080 -20840 -32531 -26166 -33320 -19876 -5841 -2684 -10170 -22643
11585 -22643 -22030 -22208 -29310 -37718 -30272 -30878 -27018 -19332 -9803 -13212 -4399 -2496 -4333 -6160 -6239 1169
$$ packed form
11682a7182j329L139J870Q95O454O093M95Q678k575K368L558o923j5527p821o442
11667b4249N425M235R180M644L912J0473K228r108j4567P995P967P603o221o995
11653B522o947J0008j266j2176L097r398N708R325n109j4804O523J5649j0103
11640f971r857J5395k383J3480Q188o465j4733j750L155J2362P536J482o205n835
11626G399n699J3667K837j2853r193j5526m637Q623N331J1880K407k805L184j0249
11612e634j8942Q289J7997P185j8665J229k795n836n319Q079N67K983O423J1853
11598G414M179n363Q008j7318j7760j1691O365p154J3444J4035L157p486j2473
11585b2643O13j78p102q408P446o06L860P686R529l409Q813J903j837j827p9P408
$$ plain form
11569 1169 -2887 -10063 -6961 6317 10629 2573 5257 -20033 -30341 -14114 4623 14032 7093
11556 7093 -13594 -18133 -22751 -28203 -26854 -4198 20189 27666 11172 180 956 12057 8899
11543 8899 1755 5613 -5645 -4141 -13165 -25997 -26075 -16541 -22020 -16497 -7969 -9052 -16373 -16216 -9638
11528 -9638 -4610 -1077 8099 6048 4433 10760 12708 9850 5696 -17469 -16031 3884 10627 1925
11514 1925 -1788 -3230 -1604 -3515 -5693 -12631 -14164 -10741 -16799 -14164 -14572 -17025 -25320 -34096 -15006
11499 -15006 6308 -4225 -8448 -8584 -9826 -5613 4083 17668 14663 4965 -5023 -24364 -23743 -9728
11485 -9728 -11256 -13820 -17054 -42816 -38427 -25853 -19744 -28650 -16879 -13922 -24477 -17959 -2101
11472 -2101 7134 -1256 -564 1012 970 13727 16003 3032 596 11183 23393 23176 -456 -13483
$$ packed form
11569A169m056p176L102J3278M312q056K684k5290j0308J6227J8737R409o939
11556G093k0687m539m618n452J349K2656K4387P477j6494j0992P76J1101l158
11543H899p144L858j1258J504r024j2832p8R534n479N523Q528j083p321J57O578
11528i638N028L533R176k051j615O327J948k858m154k3165J438J9915O743q702
11514A925l713j442J626j911k178o938j533L423o058K635m08k453q295q776J9090
11499a5006K1314j0533m223j36j242M213R696J3585l005r698r988j9341O21J4015
11485i728j528k564l234k5762M389J2574O109q906J1771K957j0555O518J5858
11472b101R235q390O92J576m2J2757K276j2971k436J0587J2210k17k3632j3027
$$ plain form
11458 -13483 -22361 -21432 -13621 -13947 -14913 -20716 -11433 17488 32107 26688 16997 11441 5848 -1039 -2033
11443 -2033 -1220 -8162 -6227 -11514 -12182 -14973 -17891 -8631 3773 -3221 -4812 5426 5589 3306 6768
11428 6768 9398 8620 5101 4758 1959 -4180 -3087 -6273 -20930 -20205 -15238 -21225 -24666 -22992 -4334
11413 -4334 5723 -3887 -430 -2399 716 751 -7716 -12169 -16295 -8586 -4802 -4644 -9248 -19728 -32761
11398 -32761 -27515 -15979 -1496 5657 19559 13785 -9217 -21491 -28482 -35963 -36964 -36550 -38803
11385 -38803 -36233 -24462 -26067 -15167 -19621 -17050 -27355 -26353 -18994 3944 9855 369 -2220
11372 -2220 4245 11384 -1103 1752 -7087 -14972 -25094 -30591 -20637 -2927 -5124 -8417 -297 5698
11358 5698 -11175 -24881 -22789 -7200 4217 -3698 -20532 -22481 -20872 -23649 -15392 -6058 -3634
$$ packed form
11458a3483q878R29P811l26r66n803R283K8921J4619n419r691n556n593o887r94
11443b033Q13o942J935n287o68k791k918R260J2404o994j591J0238J63k283L462
11428F768K630p78l519l43k799o139J093l186j4657P25M967n987l441J674J8658
11413d334J0057r610L457j969L115L5q467m453m126P709L784J58m604j0480j3033
11398c2761N246J1536J4483P153J3902n774k3002j2274o991p481j001M14k253
11385c8803K570J1771j605J0900m454K571j0305J002P359K2938N911r486k589
11372b220O465P139j2487K855q839p885j0122n497R954J7710k197l293Q120N995
11358E698j6873j3706K092J5589J1417p915j6834j949J609k777Q257R334K424
$$ plain form
11345 -3634 -24794 -34615 -29080 -15499 -4519 -7320 -15206 -14353 -13303 -7221 -7515 -7584 -11829 -12870 -15841
11330 -15841 -18635 -6645 5685 -16606 -11281 -10374 -16547 -26985 -23570 -17311 -25218 -25694 -20151 -18494
11316 -18494 -14580 -17080 -3114 -4136 -6315 460 -23637 -37193 -21844 -2481 7021 1324 -3309
11303 -3309 -4132 -6456 -7001 -19928 -2492 4109 6028 1899 -2814 -15542 -15457 -15173 -25672 -38128 -24396
11288 -24396 -7672 -5318 7105 8489 892 -6643 1416 8831 12557 14749 3145 -3537 -4852 1368
11274 1368 1480 -1193 2481 5761 3310 12044 16155 26442 23876 13978 5310 -3623 -3642 -4291 -3396 3668
11258 3668 10621 9363 -10654 -25448 -25752 -28332 -20059 -11107 -6601 4063 -3870 -11504 -13731 -8419
11244 -8419 -7908 -2073 -942 -14975 -24197 -28762 -35959 -22640 -14809 -22837 -24122 -20574 -16274 -9445
$$ packed form
11345c634k1160r821N535J3581J0980k801p886Q53J050O082k94o9m245j041k971
11330a5841k794J1990J2330k2291N325R07o173j0438L415O259p907m76N543J657
11316a8494L914k500J3966j022k179O775k4097j3556J5349J9363R502n697m633
11303c309q23k324n45j2927J7436O601J919m129m713j2728Q5K84j0499j2456J3732
11288b4396J6724K354J2423J384p597p535Q059P415L726K192j1604o682j315O220
11274A368J12k673L674L280k451Q734M111J0287k566r898q668q933j9o49Q95P064
11258C668O953j258k0017j4794l04k580Q273Q952M506J0664p933p634k227N312
11244h419N11N835J131j4033r222m565p197J3319P831q028j285L548M300O829
$$ plain form
11230 -9445 8322 -8123 -18693 -8847 1209 3092 -1555 -2892 -4892 -10697 -10282 -17485 -36738 -42248
11216 -42248 -37949 -31234 -35629 -26376 -6882 -3650 -14361 -2257 9731 21996 17551 6335 7046
11203 7046 -5497 -8726 -7541 -6526 -19613 -23216 -27775 -18549 1894 5062 4075 -5133 -6075 1176
11189 1176 810 -3175 -5816 -6925 -8378 13824 20339 12466 9398 -133 4562 -1269 -9943 -12960 -2266
11174 -2266 -7117 -30737 -32416 -18146 -11777 -19842 -16024 -11943 -9191 7013 1695 -11789 -17537 -13332
11160 -13332 -3443 -3724 667 -4882 -7242 -7371 -16802 -10828 -15873 -18706 -11248 -8317 -3113 10067 -4931
11145 -4931 -25127 -18163 -13327 -24308 -5212 -612 -4188 -13068 -6746 -13531 -26645 -18591 -141
11132 -141 8540 11580 9088 3612 3032 -20917 -28777 -28905 -45020 -46838 -43332 -48076 -65560 -65388 -38293
$$ packed form
11230i445J7767j6445j0570R846J0056J883m647j337k000n805M15p203j9253n510
11216d2248M299O715m395R253J9494L232j0711J2104J1988J2265m445j1216P11
11203G046j2543l229J185J015j3087l603m559R226K0443L168r87r208r42P251
11189A176l66l985k641j109j453K2202O515p873l068r531M695n831q674l017J0694
11174b266m851k3620j679J4270O369q065L818M081K752J6204n318j3484n748M205
11160a3332R889k81M391n549k360j29r431N974n045k833P458K931N204J3180j4998
11145d931k0196O964M836j0981J9096M600l576q880O322o785j3114Q054J8450
11132a41Q681L040k492n476n80k3949p860j28j6115j818L506m744j7484J72K7095
$$ plain form
11117 -38293 -28271 -25448 -19813 -15803 -7513 -11127 -22442 -11483 -4229 -10418 -22963 -20803 -24130
11104 -24130 -30689 -25750 -24184 -25344 -44204 -38664 -15113 4624 7959 -1504 -9094 -14867 179
11091 179 11734 6486 -12151 -12161 -8514 -6267 24108 30912 32408 17814 -12824 -30209 -32838 -29522
11077 -29522 -23801 -15330 -18902 -14812 -5263 3948 11788 -3720 -5821 -8069 -11179 -10377 -8119 515
11063 515 1247 -8403 -13440 -15938 -9567 -12905 -29698 -24237 -12770 -3075 -17549 -28272 -35581 -22367
11049 -22367 -11021 -11278 -7961 -3262 -392 7157 11834 9653 2295 2965 6190 6965 -3406 372 949
11034 949 9687 9850 6602 10422 10074 7245 -10082 -13418 -25576 -20325 -17964 -11258 -14973 -26203 -22609
11019 -22609 -25860 -12502 7670 16612 6578 -1231 -8844 -19307 -16744 -16787 -9143 -2808 -12185 -32821
$$ packed form
11117c8293J0022K823N635M010Q290l614j1315J0959P254o189j2545K160l327
11104b4130o559M939J566j160j8860N540K3551J9737L335r463p590n773J5046
11091A79J1555n248j8637j0L647K247L0375O804J496j4594l0638j7385k629L316
11077b9522N721Q471l572M090R549R211P840j5508k101k248l110Q02K258Q634
11063E15P32r650n037k498O371l338j6793N461J1467R695j4474j0723p309J3214
11049b2367J1346k57L317M699K870P549M677k181p358O70L225P75j0371L778N77
11034I49Q738J63l248L820l48k829j7327l336j2158N251K361O706l715j1230L594
11019b2609l251J3358K0172Q942j0034p809p613j0463K563m3P644O335r377k0636
$$ plain form
11005 -32821 -28859 -20437 1646 -338 -3380 -7212 -23978 -21935 -11402 -1867 10922 20318 10540
10992 10540 5795 -1855 -841 258 -2367 4811 9660 11643 17441 19505 15756 11278 4458 293
10978 293 -61 6296 20524 16638 1390 1088 12449 22809 24288 11442 -2570 -3211 -21933 -19929
10964 -19929 7333 23649 13827 1449 7634 18785 11595 2799 7951 -4866 -1904 4757 3732
10951 3732 -5341 9441 2553 2547 -4751 1462 -3978 -7685 -9674 -6399 237 10012 5376 -8727 -1501
10936 -1501 13318 19528 13685 1866 -1439 3310 13561 19798 1353 -3511 1998 17725 29422
10923 29422 35234 37672 29299 23453 23700 18027 23973 29525 24766 23193 30348 26702 15422 2471
10909 2471 7994 8231 29867 36053 39404 35787 34421 24796 32544 47039 57010 42754 28444 29906
$$ packed form
11005c2821L962Q422K2083j984l042l832j6766K043J0533R535J2789R396r778
10992A0540m745p650J014J099k625P178M849J983N798K064l749m478o820m165
10978B93l54O357J4228l886j5248l02J1361J0360J479j2846j4012o41j8722K004
10964a9929K7262J6316r822j2378O185J1151p190q796N152j2817K962O661j025
10951C732r073J4782o888op298O213n440l707j989L275O636R775m636j4103P226
10936a501J4819O210n843j1819l305M749J0251O237j8445m864N509J5727J1697
10923B9422N812K438q373n846K47n673N946N552m759j573P155l646j1280j2951
10909B471N523K37K1636O186L351l617j366r625P748J4495R971j4256j4310J462
$$ plain form
10895 29906 38115 30121 25260 21147 16602 18020 26682 17133 5245 -6712 -5955 9736 23577 20776
10881 20776 25562 33978 32391 15321 2797 -818 5466 8914 -1373 -2359 -829 -839 522 6140
10867 6140 9851 3585 20135 11466 4879 -1229 2583 -3681 4995 19036 38585 44564 43623 44549
10853 44549 36777 14766 2270 23 27381 33342 14930 7621 -3475 -6647 -8573 -25226 -24831
10840 -24831 -2965 2157 3653 -14008 -19159 -10787 530 4348 11285 12678 8682 4355 10405 10452
10826 10452 10279 4393 4824 6093 8962 -591 -2256 5149 10696 21360 23973 36766 49305 39244
10812 39244 14648 -896 11326 8746 4220 15998 41379 51626 39902 22105 18762 25474
10800 25474 26323 26300 41477 50113 49809 46550 63085 79828 91476 91031 86849 87043 68697 70223 67271
$$ packed form
10895B9906Q209p994m861m113m545J418Q662r549j1888j1957P57J5691J3841k801
10881B0776M786Q416j587j7070j2524l615O284L448j0287r86J530j0J361N618
10867F140L711o266J6550q669o587o108L812o264Q676J4041J9549N979r41R26
10853D4549p772k2011j2496k247K7358N961j8412p309j1096l172j926j6653L95
10840b4831K1866N122J496j7661n151Q372J1317L818O937J393l996m327O050M7
10826A0452j73n886M31J269K869r553j665P405N547J0664K613J2793J2539j0061
10812C9244k4596j5544J2222k580m526J1778K5381J0247j1724j7797l343O712
10800B5474Q49k3J5177Q636l04l259J6535J6743J1648m45m182J94j8346J526k952
$$ plain form
10785 67271 61671 59942 56649 56074 36565 39783 47145 37485 49340 51505 43972 29069 28614 28089
10771 28089 25540 6803 2650 2387 3256 16945 19124 9104 24998 20584 17048 17496 19076 22302
10757 22302 26940 19031 24916 20454 7752 20406 32566 36113 39718 47267 29151 13104 1368
10744 1368 -9680 -10997 -2764 -69 3578 2737 13646 14138 7231 -5572 842 327 -1950 7 7017
10729 7017 17948 9323 -999 -2985 942 3183 -388 -11540 3883 5154 220 -9 831 -7162
10715 -7162 -18685 -20663 -6694 13308 4087 2927 13437 24541 27704 19058 18347 12825 24371
10702 24371 24048 26891 31093 43728 58941 62463 60612 48841 28977 12822 4467 17711 15942
10689 15942 9206 10819 2480 14718 23165 22182 13625 20870 24426 21337 26857 17359 577 2673
$$ packed form
10785F7271n600j729l293n75j9509L218P362r660J1855K165p533j4903m55n25
10771B8089k549j8737m153k63Q69J3689K179j0020J5894m414l536M48J580L226
10757B2302M638p909N885m462j2702J2654J2160L547L605P549j8116j6047j1736
10744A368j1048j317Q233K695L647q41J0909M92o907j2803O414n15k277J957P010
10729G017J0931q625j0322j986L927K241l571j1152J5423J271m934k29Q40p993
10715g162j1523j978J3969K0002r221j160J0510J1104L163q646p11n522J1546
10702B4371l23K843M202J2635J5213L522j851j1771j9864j6155q355J3244j769
10689A5942o736J613q339J2238Q447r83q557P245L556l089N520r498j6782K096
$$ plain form
10675 2673 6799 59 -627 14903 9371 5638 4661 17801 23490 8397 4412 3450 -2590 -1168 6345
10660 6345 2783 1829 4323 4237 1612 6756 1057 2945 9246 16405 29114 27370 9699 18558 17318
10645 17318 10458 22645 31801 30799 28577 28764 52888 60208 54725 49198 44563 37555 26052 15117
10631 15117 13497 5906 5142 18421 28065 28601 13531 25969 26508 15295 24927 41308 33426 12012
10617 12012 6404 -3613 -10125 -16226 -14062 -10142 -21754 -21270 -21132 -6845 2976 9603 14704 21156
10603 21156 35905 40435 40434 36885 30680 27196 39850 48664 52878 58020 47401 49032 49026 28301 11417
10588 11417 -519 482 3763 3433 -7253 -13367 -8666 699 14988 7136 -2990 -527 -4788 -5194
10574 -5194 683 8037 17547 31525 31788 33423 36568 47496 42209 38638 21664 15436 23641 18272
$$ packed form
10675B673M126o740o86J5530n532l733r77J3140N689j5093l985r62o040J422P513
10660F345l562r54K494q6k625N144n699J888O301P159J2709j744j7671Q859j240
10645A7318o860J2187R156j002k222J87K4124P320n483n527m635p008j1503j0935
10631A5117j620p591p64J3279R644N36j5070J2438N39j1213R632J6381p882k1414
10617A2012n608j0017o512o101K164L920j1612M84J38J4287R821O627N101O452
10603B1156J4749M530jl549o205l484J2654Q814M214N142j0619J631ok0725j6884
10588A1417j1936J001L281l30j0686o114M701R365J4289p852j0126K463m261m06
10574e194N877P354R510J3978K63J635L145J0928n287l571j6974o228Q205n369
$$ plain form
10560 18272 8701 13410 13438 25081 23722 28932 26943 24453 33421 41587 44841 46936 40778 27751
10546 27751 28006 11726 14301 8417 5442 6048 12585 16606 32168 49273 44728 19353 16201 20145
10532 20145 18432 24937 32936 27524 15267 3420 -1020 3149 -1918 1743 9703 21231 28561 42488
10518 42488 51456 57659 68883 71235 81455 82030 76007 72578 63830 55255 57872 57634 46805 51013
10504 51013 56042 60320 42694 40462 46461 25511 17156 6902 10847 13444 21647 19209 17867 8307
10490 8307 11372 14390 27457 29982 7961 11040 38628 59610 60945 65105 64798 67731 61894 47132
10476 47132 40827 39988 35510 30224 20035 11263 -1984 -6682 4315 15565 31578 35704 24276
10463 24276 2816 -8334 4485 7042 7071 10889 3729 896 -2137 -9758 -16963 -12629 -10435 -305
$$ packed form
10560A8272r571M709K8J1643j359N210j989k490Q968Q166L254K095o158j3027
10546B7751K55j6280K575n884k975O06O537M021J5562J7105m545k5375l152L944
10532B0145j713O505P999n412j2257j1847m440M169n067L661P960J1528P330J3927
10518D2488Q968O203J1224K352J0220N75o023l429q748q575K617k38j0829M208
10504E1013N029M278j7626k232N999k0950q355j0254L945K597Q203k438j342r560
10490H307L065L018J3067K525k2021L079K7588K0982J335M160l07K933n837j4762
10476D7132o305q39m478n286j0189q772j3247m698J0997J1250J6013M126j1428
10463B4276k1460j1150J2819K557K9L818p160k833l033p621p205M334K194J0130
$$ plain form
10449 -305 6620 -6593 -12307 -16210 -9973 -8939 -13945 -16477 -20897 -27995 -12711 -13550 -19562 -12379 -3993
10434 -3993 2870 1694 12138 21347 26818 25836 32474 33217 18355 16843 40263 62429 61910 70631
10420 70631 61933 59400 53102 51446 47486 39022 29887 11080 16604 23198 22594 20514 17972 14602
10406 14602 4375 2113 22442 21019 4605 -575 -787 -13718 -5384 4456 9755 19844 10878
10393 10878 -12890 -8982 2946 2519 6110 5062 12751 32917 18651 1251 -11260 -16309 -23756
10380 -23756 -17403 -3100 -11296 -15444 -11240 -14652 -10593 -19227 -12796 -182 8474 12100 16171 24387
10366 24387 25948 19476 -8 -3495 8659 16684 26608 37343 32897 27184 17961 28440 43053
10353 43053 40436 38976 47514 38791 35285 22950 8030 2163 3220 7663 13967 13824 22313 8490
$$ packed form
10449c05O925j3213n714l903O237J034n006k532m420p098J5284q39o012P183Q386
10434c993O863j176J0444R209N471r82O638P43j4862j512K3420K2166n19Q721
10420G0631q698k533o298j656l960q464r135j8807N524O594o04k080k542l370
10406A4602j0227k262K0329j423j6414n180k12j2931Q334R840N299J0089q966
10393A0878k3768L908J1928m27L591j048P689K0166j4266j7400j2511n049p447
10380b3756O353J4303q196m148M204l412M059q634O431J2614Q656L626M071Q216
10366B4387J561o472j9484l487J2154Q025R924J0735m446n713r223J0479J4613
10353D3053k617j460Q538q723l506j2335j4920n867J057M443O304j43Q489j3823
$$ plain form
10339 8490 2067 3314 2036 -5925 9957 24494 26259 24236 1932 -624 2765 2504 4294 14672
10325 14672 16659 10446 7404 -9965 3957 12035 -3566 -8702 -5273 9616 27427 21868 8762
10312 8762 -4019 -9938 5037 22249 28876 31928 33276 19976 17677 18452 24038 28033 36489 29916
10298 29916 11450 10517 13821 26731 20226 10331 -11906 -14258 -793 10543 9410 1150 -784
10285 -784 -15656 -22945 -20134 -25952 -21815 -25517 -34684 -27699 -10207 6814 13163 9332 9823 3251
10271 3251 -43 770 -4236 -18683 -9271 6971 12679 14247 18060 12543 14782 25771 23140 20533
10257 20533 14899 8996 -8483 -23453 -26651 -2928 2570 -10072 -11016 6758 18817 18152 6797
10244 6797 -7510 -5129 -4817 8631 12080 18892 23843 17365 -5002 -211 3434 3958 16376 31187
$$ packed form
10339H490o423J247j278p961J5882J4537J765k023k2304k556L389k61J790J0378
10325A4672J987o213l042j7369J3922Q078j5601n136L429J4889J7811n559j3106
10312H762j2781n919J4975J7212O627L052J348j3300k299P75N586L995Q456o573
10298B9916j8466r33L304J2910o505r895k2237k352J3465J1336j133q260j934
10285g84j4872p289K811n818M137l702r167O985J7492J7021O349l831M91o572
10271C251l294Q13n006j4447R412J6242N708J568L813n517K239J0989k631k607
10257B0533n634n903j7479j4970l198K3723N498j2642r44J7774J2059o65j1355
10244F797j4307K381L12J3448L449O812M951o478k2367M791L645N24J2418J4811
$$ plain form
10230 31187 26904 17898 3299 -4469 -17903 -29373 -18896 -8321 -10265 -14849 -3285 4848 -12
10217 -12 -5701 8741 17182 -2 -4299 -12755 -22130 -21481 -11428 1920 11649 8962 -3918 -14279
10203 -14279 -16555 -21758 -16778 3253 7844 2982 -1600 8635 5270 1786 929 -1625 -12287 -13954
10189 -13954 -24888 -25510 -24266 -18215 -11211 -15384 -16680 -3232 10823 -967 3149 -623 -5139 5671
10175 5671 16054 25037 15424 -3338 -5078 -4765 4187 -6451 -7415 4776 -1694 2017 -4942 -18306
10161 -18306 -27597 -16951 1505 -7279 -3130 11212 24517 35277 21745 -2139 -11850 -21884
10149 -21884 -18440 -11275 -15257 -13121 272 7871 6656 7889 15815 13054 1600 -2395 3678 2559
10135 2559 -2875 696 -13529 -24910 -16170 -7835 -2777 -8295 -3399 -56 -3710 182 8840 -3417
$$ packed form
10230C1187m283r006j4599p768j3434j1470J0477J0575j944m584J1564Q133m860
10217a2n689J4442Q441j7184m297q456r375O49J0053J3348R729k687j2880j0361
10203a4279k276n203M980K0031M591m862m582J0235l365l484q57k554j0662j667
10189a3954j0934o22J244O051P004m173j296J3448J4055j1790M116l772m516J0810
10175E671J0383Q983r613j8762j740L13Q952j0638r64J2191o470L711o959j3364
10161a8306r291J0646J8456q784M149J4342J3305J0760j3532k3884r711j0034
10149b1884L444P165l982K136J3393P599j215J233P926k761j1454l995O073j119
10135B559n434L571j4225j1381Q740Q335N058n518M896L343l654L892Q658j2257
$$ plain form
10121 -3417 7978 27447 20010 5808 4958 6731 4501 10521 -1770 -15013 -13747 -11686 -19924 -33903
10107 -33903 -45982 -34881 -18692 -12737 -21867 -31804 -36227 -43018 -34818 -19786 -13212 -24928 -16057
10094 -16057 -4223 10368 9671 -16435 -37276 -27592 -22367 -4345 6824 2480 -6608 -9818 -2367
10081 -2367 -4348 -11706 -34229 -41661 -33344 -11763 -11091 -21307 -9807 -2269 1346 1973 4600 6944
10067 6944 19270 15041 142 -2527 -682 -5339 -9364 -14620 -27105 -19468 -22052 -14304 -16313 -14138
10053 -14138 8181 -6393 -20221 -23920 -21210 -29226 -33251 -37416 -37858 -15414 -13699 -15052 -10769 -16474
10039 -16474 -15654 -17130 -1223 8947 9439 7213 10092 9728 6967 593 11849 15551 20289 24810
10025 24810 29800 19396 15857 7340 -12076 -11037 8409 24124 19356 22979 33400 37047 37287
$$ packed form
10121c417J1395J9469p437j4202q50J773k230O020j2291j3243J266K061q238j3979
10107c3903j2079J1101J6189N955r130r937m423o791Q200J5032O574j1716Q871
10094a6057J1834J4591o97k6106k0841R684N225J8022J1169m344r088l210P451
10081b367j981p358k2523p432Q317K1581O72j0216J1500P538L615O27K627K344
10067F944J2326m229j4899k669J845m657m025n256j2485P637k584P748k009K175
10053a4138K2319j4574j3828l699K710q016m025m165m42K2444J715j353M283n705
10039a6474Q20j476J5907J0170M92k226K879l64k761o374J1256L702M738M521
10025B4810M990j0404l539q517j9416J039J9446J5715m768L623J0421L647K40
$$ plain form
10012 37287 19589 9849 2860 -5234 85 5459 8094 9491 1979 6740 8452 -9000 -15887 -10975
9998 -10975 -8033 -4088 3587 4708 3609 8486 15127 14463 8768 10757 8917 6974 -3304 -936 4272
9983 4272 11430 -467 -4627 -14987 -21296 -8828 -5693 -5022 -11581 -3736 370 -9441 2981 21321
9969 21321 9189 -7375 -1705 5001 7266 11619 818 2635 1226 8978 21636 20303 14162 16961
9955 16961 9846 6968 3604 4516 -1232 15356 20324 18697 6130 7794 -5519 -4905 -12053 -13653
9941 -13653 -5317 -188 -4997 -14516 -5158 3904 -5589 -5244 -8003 -4653 -10057 -23951 -40883 -27599
9927 -27599 -22329 -15171 -1668 -8134 -27456 -28888 -32433 -29784 -28924 -25220 -21506 -17619 -15687 -21397
9913 -21397 -25139 -15101 -4755 -6732 -6396 -2916 16896 33390 38451 20707 18913 14820 16284 16998
$$ packed form
10012C7287j7698r740o989q094N319N374K635J397p512M761J712j7452o887M912
9998a0975K942L945P675J121j099M877O641o64n695J989j840j943j0278K368N208
9983D272P158j1897m160j0360o309J2468L135O71o559P845M106r811J2422J8340
9969B1321j2132j6564N670O706K265M353j0801J817j409P752J2658j333o141K799
9955A6961p115k878l364R12n748J6588M968j627j2567J664j3313O14p148j600
9941a3653Q336N129m809r519R358R062r493L45k759L350n404j3894j6932J3284
9927b7599N270P158J3503o466j9322j432l545K649Q60L704L714L887J932n710
9913b1397l742J0038J0346j977L36L480J9812J6494N061j7744j794m093J464P14
$$ plain form
9899 16998 7410 -3237 905 18298 29809 37350 31114 23509 24920 4515 3514 3035 8720 13978
9885 13978 11696 10542 7619 3279 10256 6570 4891 7973 5049 4917 200 -13710 -13302 -5955 -9618
9870 -9618 -17998 -15272 -12568 -14444 -10828 -7494 -4092 -16219 -16913 -9310 13676 15144 24583 10452
9856 10452 2680 10894 21388 27040 16611 15501 22379 25789 15279 12192 5947 6517 -957 2241
9842 2241 2603 -1358 65 -295 -1661 5769 9905 9955 17078 15372 18035 9463 -1032 8500 12448 14544
9826 14544 6848 10968 28786 49219 45252 31882 28218 40111 43680 56077 45218 29981 44214
9813 44214 49285 50006 48962 43497 22401 19545 19325 28145 23523 24620 10340 1300 -13568 -11224
9799 -11224 -1612 10528 21452 15319 9514 7926 3654 8321 940 -17252 -16327 -17452 -24603 -11622
$$ packed form
9899A6998r588j0647M142J7393J1511P541o236p605J411k0405j001m79N685N258
9885A3978k282j154k923m340O977l686j679L082k924j32m717j3910M08P347l663
9870i618q380K726K704j876L616L334L402j2127o94P603K2986J468R439j4131
9856A0452p772Q214J0494N652j0429j110O878L410j0510l087o245N70p474L198
9842B241L62l961J423l60j366P430M136N0P123j706K663q572j0495R532L948K096
9826A4544p696M120J7818K0433l967j3370l664J1893L569J2397j0859j5237J4233
9813D4214N071P21j044n465k1096k856k20Q820m622J097j4280r040j4868K344
9799a1224R612J2140J0924o133n805j588m272M667p381j8192R25j125p151J2981
$$ plain form
9785 -11622 780 12886 26896 11157 1235 1325 -12510 -23169 -20702 -6928 -12770 -6087 -8813
9772 -8813 -4644 25360 37490 46473 40373 33215 41775 34138 27406 26115 24177 5149 12334 12268 1626
9757 1626 -1718 6495 996 -10509 -2532 11261 7052 11962 15666 9152 9982 15528 14411 14529 18575
9742 18575 6862 9646 7544 -1299 -18406 -10854 9893 30908 41519 49928 53748 52842 30262
9729 30262 32796 31496 23599 22975 16759 31852 34656 24907 13637 -3731 -7210 -23930 -28369 -9010
9715 -9010 29725 43951 30759 28282 32798 31171 15023 4755 14246 27341 26639 35466 38912 42713
9701 42713 32421 30117 19558 36995 62426 61485 79166 116814 127165 126266 133316 133204 127967 124367
9687 124367 113760 93647 73686 52746 51639 55277 61594 63014 59139 63900 70041 64019 74028
$$ packed form
9785a1622J2402J2106J4010j5739r922R0j3835j0659K467J3774n842O683k726
9772h813M169L0004J2130Q983o100p158Q560p637o732j291j938j9028P185o6j0642
9757A626l344Q213n499j1505P977J3793m209M910L704o514Q30N546j117J18M046
9742A8575j1713K784k102q843j7107P552K0747K1015J0611Q409L820r06k2580
9729C0262K534j300p897o24o216J5093K804r749j1270j7368l479j6720m439J9359
9715i010L8735J4226j3192k477M516j627j6148j0268R491J3095p02Q827L446L801
9701D2713j0292k304j0559J7437K5431r41J7681L7648J0351q99P050j12n237l600
9687A24367j0607k0113j9961k0940j107L638O317J420l875M761O141o022J0009
$$ plain form
9674 74028 78491 77033 86375 89287 91927 87381 88638 82879 68718 61592 62206 76194 87966 106900
9660 106900 127507 120264 115673 115689 128491 141883 149476 155578 158259 153985 141737 122650 109153
9647 109153 119186 107122 92115 77040 72447 72894 90993 93010 89496 87007 86434 117651 135855
9634 135855 136302 142261 135111 144740 143105 141325 133330 112589 94716 90551 89471 89332 89764 93895 109599
9619 109599 126094 149231 181037 206446 234346 245545 230842 198321 180361 144919 104841 82420
9607 82420 70312 59102 48409 49226 48976 59058 61587 47550 51622 42008 34654 39918 52633 58183
9593 58183 41601 19605 12547 17020 34717 48185 49127 55321 49064 43477 45724 50776 66202 69538
9579 69538 63209 47193 29556 27822 29856 26537 26507 27277 22354 16269 23610 18314 29464 29991 31032
$$ packed form
9674G4028M463j458R342K912K640m546J257n759j4161p126O14J3988J1772J8934
9660A06900K0607p243m591J6J2802J3392P593O102K681m274j2248j9087j3497
9647A09153J0033j2064j5007j5075m593M47J8099K017l514k489n73L1217J8204
9634A35855M47N959p150R629j635j780p995k0741j7873m165j080j39M32M131J5704
9619A09599J6495K3137L1806K5409K7900J1199j4703l2521j7960l5442m0078k2421
9607H2420j2108j1210j0693Q17k50J0082K529j4037M072r614p354N264J2715N550
9593E8183j6582k1996p058M473J7697J3468R42O194o257n587K247N052J5426L336
9579F9538o329j6016j7637j734K034l319l0P70m923o085P341n296J1150N27J041
$$ plain form
9564 31032 20475 22698 28568 28884 43603 60286 44962 35702 43508 49899 40225 36879 19261 24897
9550 24897 51482 64354 70101 61010 66530 78250 77693 75579 72379 61957 63874 59905 47747 56434
9536 56434 60153 52376 54010 52801 57883 64645 78235 84816 76090 70349 59981 58124 49198 26726
9522 26726 31642 39726 42890 55797 72385 85253 93770 113743 116674 116712 138844 162449 185356
9509 185356 216635 244001 255356 278286 284708 260690 225718 194831 156263 116597 110927 106777
9497 106777 98137 88053 71285 75107 90159 96669 82895 77540 83446 81834 85734 72958 68746
9484 68746 70852 76130 84044 85272 89825 97371 90609 78934 71692 68691 83664 94527 97392 84959
9470 84959 74133 81666 92818 100671 101240 97488 102769 115359 120271 115407 121123 125068 114796 120865
$$ packed form
9564C1032j0557K223N870L16J4719J6683j5324r260P806O391r674l346j7618N636
9550B4897K6585J2872N747r091N520J1720n57k114l200j0422J917l969j2158Q687
9536E6434L719p777J634j209N082O762J3590O581q726n741j0368j857q926k2472
9522B6726M916Q084L164J2907J6588J2868Q517J9973K931L8K2132K3605K2907
9509A85356L1279K7366J1355K2930O422k4018l4972l0887l8568l9666n670m150
9497A06777q640j0084j6768L822J5052O510j3774n355N906j612L900j2776m212
9484F8746K106N278P914J228M553P546o762j1675p242l001J4973J0863K865j2433
9470H4959j0826P533J1152P853N69l752N281J2590M912m864N716L945j0272O069
$$ plain form
9456 120865 122070 116001 110574 109942 101056 92965 88448 95041 92566 109481 122232 135121 149478 168824
9442 168824 198738 223484 245124 240034 208769 172061 154446 142406 142980 144800 140105 114974 105980
9429 105980 104339 102014 93356 108739 117296 103354 102428 105946 119223 125328 129638 132387 117380 124814
9415 124814 130392 118766 124611 143602 154613 156156 137562 127991 141558 149061 150855 169035 186771
9402 186771 196345 189504 182731 168889 169076 163647 155863 146011 150968 165829 173476 180536 172735 174199
9388 174199 194541 210480 210307 232900 247712 277092 307612 342155 386801 413537 406044 368282
9376 368282 311292 268163 237455 219245 212399 203501 216478 217326 213746 191956 198100 208929 220491
9363 220491 217635 224381 249920 255496 243887 233549 238300 251622 256189 259922 273846 272286 247466
$$ packed form
9456A20865J205o069n427o32q886q091m517O593k475J6915J2751J2889J4357J9346
9442A68824K9914K4746K1640n090l1265l6708j7615j2040N74J820m695k5131q994
9429A05980j641k325q658J5383Q557j3942r26L518J3277O105M310K749j5007P434
9415A24814N578j1626N845J8991J1011J543j8594r571J3567P503J794J8180J7736
9402A86771R574o841o773j3842J87n429p784r852M957J4861P647P060p801J464
9388A74199K0342J5939j73K2593J4812K9380L0520L4543M4646K6736p493l7762
9376C68282n6990m3129l0708j8210o846q898J2977Q48l580k1790O144J0829J1562
9363B20491k856O746K5539N576j1609j0338M751J3322M567L733J3924j560k4820
$$ plain form
9350 247466 236986 237136 236471 252202 267027 281686 292352 302735 304149 307295 316104 320432 325996
9337 325996 325090 318477 317434 319780 321157 349673 386741 405476 419231 427747 439601 450855 476114
9324 476114 481089 485999 493652 518346 539102 563557 604116 641915 656722 662244 661787 678834 698466
9311 698466 718058 731047 743927 777749 840142 899252 951925 1005904 1044837 1078037 1095253 1129098
9299 1129098 1152352 1182636 1232180 1283573 1335265 1395975 1476230 1575277 1717091 1900476 2105595
9288 2105595 2291542 2415318 2419737 2379810 2395655 2451747 2505953 2588775 2697568 2842553 3044897
9277 3044897 3276637 3537999 3867223 4233056 4607200 5008423 5462148 6007264 6685927 7525385
9267 7525385 8546139 9758939 11222782 13043720 15433343 18625468 22949529 28755923
$$ packed form
9350B47466j0480J50o65J5731J4825J4659J0666J0383J414L146Q809M328N564
9337C25996r06o613j043K346J377K8516L7068J8735J3755Q516J1854J1254K5259
9324D76114M975M910P653K4694K0756K4455M0559L7799J4807N522m57J7047J9632
9311F98466J9592J2989J2880L3822O2393N9110N2673N3979L8933L3200J7216L3845
9299A129098K3254L0284M9544N1393N1692O0710Q0255R9047J41814J83385K05119
9288B105595J85947J23776M419l9927J5845N6092N4206Q2822J08793J44985K02344
9277C044897K31740K61362L29224L65833L74144M01223M53725N45116O78663Q39458
9267G525385J020754J212800J463843J820938K389623L192125M324061N806394
$$ plain form
9259 28755923 36602602 47646033 63952828 88230870 120839086 155432804 180475370
9252 180475370 180732434 151263248 112134631 82065728 62634887 49969173 40966316
9245 40966316 33975706 28431418 24107364 20822340 18428916 16780040 15797286 15338655
9237 15338655 15099454 14663247 13666640 12163473 10706591 9579269 8726535 8081102 7577498
9228 7577498 7160308 6790108 6433471 6082571 5698054 5316872 4965351 4663622 4438967 4230682
9218 4230682 4050759 3878031 3701746 3527298 3377387 3224939 3075393 2959042 2863263 2772741
9208 2772741 2676451 2575100 2474343 2395239 2331868 2277056 2238621 2198627 2166556 2134220 2089882
9197 2089882 2024057 1933453 1845543 1779690 1722744 1656964 1601756 1547734 1500171 1452457 1412468
$$ packed form
9259B8755923P846679J1043431J6306795K4278042L2608216L4593718K5042566
9252A80475370K57064k9469186l9128617l0068903j9430841j2665714r002857
9245D0966316o990610n544288m324054l285024k393424j648876r82754m58631
9237A5338655k39201m36207r96607j503167j456882j127322q52734o45433n03604
9228G577498m17190l70200l56637l50900l84517l81182l51521l01729k24655k08285
9218D230682j79923j72728j76285j74448j49911j52448j49546j16351r5779r0522
9208B772741r6290j01351j00757p9104o3371n4812l8435l9994l2071l2336m4338
9197B089882o5825r0604q7910o5853n6946o5780n5208n4022m7563m7714l9989
$$ plain form
9186 1412468 1372298 1348677 1321191 1296274 1277160 1253248 1234871 1204304 1169096 1133317 1109971
9175 1109971 1085418 1060868 1043688 1026612 1002716 991155 965415 934955 911174 885168 863876
9164 863876 863757 834553 803190 800172 802895 793319 770526 750864 740420 713762 698316 683231 668864
9151 668864 669841 646802 625167 624313 618911 615627 604511 593059 592395 587505 585145 574685 577959 564648
9137 564648 538444 525254 529295 523823 522233 520418 519310 528226 540942 565602 594397 591746 595345
9124 595345 554861 518607 494071 474446 456686 445371 425728 417385 413187 411083 420360 429293 425322
9111 425322 420261 421608 408681 399990 399243 396012 399414 425458 452892 460289 448152 460240 483746
9098 483746 491913 505541 526716 541001 553970 573917 596212 630585 666963 685158 725363 787751
$$ packed form
9186A412468m0170k3621k7486k4917j9114k3912j8377l0567l5208l5779k3346
9175A109971k4553k4550j7180j7076k3896j1561k5740l0460k3781k6006k1292
9164H63876j19k9204l1363l018K723r576k2793j9662j0444k6658j5446j5085j4367
9151F68864R77k3039k1635q54n402l284j1116j1452o64m890k360j0460L274j3311
9137E64648k6204j3190M041n472j590j815j108Q916J2716K4660K8795k651L599
9124E95345m0484l6254k4536j9625j7760j1315j9643q343m198k104R277Q933l971
9111D25322n061J347j2927q691p47l231L402K6044K7434P397j2137J2088K3506
9098D83746Q167J3628K1175J4285J2969J9947K2295L4373L6378J8195M0205O2388
$$ plain form
9086 787751 864150 941000 1036327 1149317 1279593 1438572 1674117 2002972 2454310 3109166
9076 3109166 4181979 6029221 9326208 14782216 21305064 27036086 28697852 22245280
9068 22245280 13917547 9051594 6418586 4889937 3941261 3276418 2773354 2394313 2081748
9059 2081748 1823274 1633171 1477614 1377816 1283630 1182310 1107755 1057168 1010208 964814 918625
9048 918625 869457 829343 797448 770253 730563 699399 680829 661397 633619 622226 606978 586421
9036 586421 572254 555787 538633 531363 536402 541448 545385 550501 558511 559534 556639 556819 583974 617888
9022 617888 655670 717584 813900 931488 1078629 1239929 1373105 1458685 1473804 1414658 1307391
9011 1307391 1158243 997326 872610 778291 714043 668569 652406 629761 625557 627602 662875
$$ packed form
9086G87751P6399P6850R5327J12990J30276J58979K35545L28855M51338O54856
9076C109166J072813J847242L296987N456008O522848N731022J661766o452572
9068B2245280q327733m865953k633008j528649r48676o64843n03064l79041l12565
9059B081748k58474j90103j55557r9798r4186j01320p4555n0587m6960m5394m6189
9048I18625m9168m0114l1895k7195l9690l1164j8570j9432k7778j1393j5248k0557
9036E86421j4167j6467j7154p270N039N046L937N116Q010J023k895J80K7155L3914
9022F17888L7782O1914R6316J17588J47141J61300J33176Q5580J5119n9146j07267
9011A307391j49148j60917j24716r4319o4248m5474j6163k2645m204K045L5273
$$ plain form
9000 662875 734006 813323 923760 1070026 1225507 1357288 1429013 1409643 1317366 1186790 1028240
8989 1028240 868448 731903 633132 564295 500459 454523 422509 392096 378014 357945 330667
8978 330667 312368 306286 308586 283847 256448 242959 237141 234031 233952 230623 221124 219698 227430 233012
8964 233012 234496 234549 241788 253039 250280 256068 252153 234351 234270 234111 227198 219316 212519 214936 217402
8949 217402 225673 207825 189991 159970 158714 180809 192732 186687 176724 167295 164236 175411 189443
8936 189443 177503 173991 177160 174917 164086 149848 149758 142413 138826 132330 126534 120305 122157 128379
8922 128379 147991 154238 144129 151637 161637 166984 189059 189179 197434 188852 177084 167376 162097
8909 162097 169039 188279 190753 179019 164643 171250 171307 175793 180797 172739 163326 155429 155773 169260
$$ packed form
9000F62875P1131P9317J10437J46266J55481J31781P1725j9370r2277j30576j58550
8989A028240j59792j36545r8771o8837o3836m5936l2014l0413j4082k0069k7278
8978C30667j8299o082K300k4739k7399j3489n818l110p9l329r499j426P732N582
8964B33012J484N3P239J1251k759N788l915j7802q1j59o913p882o797K417K466
8949B17402Q271j7848j7834l0021j256K2095J1923o045r963r429l059J1175J4032
8936A89443j1940l512L169k243j0831j4238r0p345l587o496n796o229J852O222
8922A28379J9612O247j0109P508J0000N347K2075J20Q255q582j1768r708n279
8909A62097O942J9240K474j1734j4376O607N7M486N004q058r413p897L44J3487
$$ plain form
8895 169260 180261 205079 218467 227759 241303 287672 352080 383576 404083 407297 390301 355061
8883 355061 338788 344772 347740 345032 343871 341130 353603 386984 445261 511956 567953 594170 596829
8870 596829 563443 507663 444196 400138 385401 368741 349671 331580 312055 305404 293672 302280
8858 302280 319139 339311 356439 410685 481940 541686 593376 636916 625951 568198 517879 450727
8846 450727 400905 354778 325620 324971 311989 303801 305020 282436 249196 244049 248890 249959 254685
8833 254685 266055 272398 280628 296210 319044 329992 318698 286282 267198 246119 250567 245579
8821 245579 229024 218593 226276 241239 232557 232860 257936 292619 332120 365311 389812 426210
8809 426210 474652 520433 546260 547440 525979 458336 399963 361719 342941 314695 283075 249654
$$ packed form
8895A69260J1001K4818J3388R292J3544M6369O4408L1496K0507L214j6996l5240
8883C55061j6273N984K968k708j161k741J2473L3381N8277O6695N5997K6217K659
8870E96829l3386n5780o3467m4058j4737j6660j9070j8091j9525o651j1732Q608
8858C02280J6859K0172J7128N4246P1255N9746N1690M3540j0965n7753n0319o7152
8846D50727m9822m6127k9158o49j2982q188J219k2584l3240n147M841J069M726
8833B54685J1370O343Q230J5582K2834J0948j1294l2416j9084k1079M448m988
8821B45579j6555j0431P683J4963q682L03K5076L4683L9501L3191K4501L6398
8809D26210M8442M5781K5827J180k1461o7643n8373l8244j8778k8246l1620l3421
$$ plain form
8797 249654 227355 223801 247438 268886 298999 290370 297129 319064 342202 392351 441044 490426
8785 490426 487969 458620 406673 367525 347062 317410 300468 297840 288484 279090 283731 286807 279230
8772 279230 278958 279676 293546 303241 307139 310195 309601 326414 364817 379042 363455 379112 385194 391522
8758 391522 409573 413826 412659 419655 430620 434834 455703 481138 501787 553112 581484 633236
8746 633236 713290 773089 787597 764764 713199 660907 615517 591250 587230 586594 590717 597263 616799
8733 616799 643684 670545 703138 735357 772139 806245 856343 930272 983140 1007699 989287 956070
8721 956070 900369 864268 836419 812678 810456 801809 815408 841344 875583 914664 920806 918821
8709 918821 925975 934438 978243 1023648 1033020 1028351 1017359 1018118 1003961 987499 1002618 1011158 1033083
$$ packed form
8797B49654k2299l554K3637K1448L0113q629O759K1935K3138N0149M8693M9382
8785D90426k457k9349n1947l9148k0463k9652j6942k628r356r394M641L076p577
8772B79230k72P18J3870R695L898L056n94J6813L8403J4225j5587J5657O082O328
8758C91522J8051M253j167O996J0965M214K0869K5435K0649N1325K8372N1752
8746F33236Q0054N9799J4508k2833n1565n2292m5390k4267m020o36M123O546J9536
8733F16799K6885K6861L2593L2219L6782L4106N0098P3929N2868K4559j8412l3217
8721I56070n5701l6101k7849k3741k222q647J3599K5936L4239L9081O142j985
8709I18821P154Q463M3805M5405R372m669j0992P59j4157j6462J5119Q540K1925
$$ plain form
8696 1033083 1052883 1079044 1110070 1130451 1181927 1253406 1331493 1418315 1506796 1596897 1723422
8685 1723422 1865569 2026964 2153172 2153064 2001613 1854909 1800311 1785732 1812905 1845376 1876051
8674 1876051 1923154 1991762 2079576 2193037 2281792 2378406 2486454 2577248 2654863 2732734 2801826
8663 2801826 2879624 2966550 3069729 3207175 3357567 3541938 3768158 4033497 4333383 4668069
8653 4668069 5057169 5520505 6051533 6651072 7211275 7629570 7727871 7526619 7351045 7372674
8643 7372674 7565213 7908151 8421295 9129988 9972077 10978745 12152146 13530526 15162760
8634 15162760 17058160 19164705 21408991 23739086 26198382 28885830 32192984 36886232
8626 36886232 43839329 54256846 70120749 94516366 130853037 179265555 231309284
$$ packed form
8696A033083J9800K6161L1026K0381N1476P1479P8087Q6822Q8481R0101J26525
8685A723422J42147J61395J26208j08j51451j46704n4598j4579K7173L2471L0675
8674A876051M7103O8608Q7814J13461Q8755R6614J08048R0794P7615P7871O9092
8663B801826P7798Q6926J03179J37446J50392J84371K26220K65339K99886L34686
8653D668069L89100M63336N31028N99539N60203M18295R8301k01252j75574K1629
8643G372674J92539L42938N13144P08693Q42089J006668J173401J378380J632234
8634A5162760J895400K106545K244286K330095K459296K687448L307154M693248
8626C6886232O953097J0417517J5863903K4395617L6336671M8412518N2043729
$$ plain form
8619 231309284 270921903 277590259 241756381 186029566 139006823 107693824 88041882
8612 88041882 75625814 67586149 62435304 59481888 58452109 59569942 63234153 70002130
8604 70002130 81345313 100075706 129890335 172945589 224249390 270023947 290747634
8597 290747634 269086497 216523105 164536609 126279686 99102825 79549893 65517516
8590 65517516 55391543 48025162 42609969 38570204 35417170 32655550 29971925 27389605
8582 27389605 24982827 22793695 20876755 19237613 17833373 16671908 15695052 14881931
8574 14881931 14143880 13442777 12763708 12106439 11478391 10904829 10403723 9954560 9559187
8565 9559187 9208170 8878317 8559179 8235741 7917953 7633669 7380412 7126904 6896273 6695934
$$ packed form
8619B31309284L9612619O668356l5833878n5726815m7022743l1312999j9651942
8612H8041882j2416068q039665n150845k953416j029779J117833L664211O767977
8604G0002130J1343183J8730393K9814629M3055254N1303801M5774557K0723687
8597B90747634k1661137n2563392n1986496l8256923k7176861j9552932j4032377
8590F5517516j0125973p366381n415193m039765l153034k761620k683625k582320
8582B7389605k406778k189132j916940j639142j404240j161465r76856q13121
8574A4881931p38051p01103o79069o57269o28048n73562n01106m49163l95373
8565I559187l51017l29853l19138l23438l17788k84284k53257k53508k30631k00339
$$ plain form
8555 6695934 6524858 6354913 6165573 5968990 5764273 5541826 5340801 5187925 5072422 4975322
8545 4975322 4897675 4822433 4730492 4606622 4465210 4302621 4150619 4009742 3869554 3738143
8535 3738143 3627416 3528522 3449657 3380716 3314846 3253258 3185459 3126252 3060416 2992029 2937679
8524 2937679 2868824 2779431 2713665 2660314 2600246 2536181 2489284 2436155 2367691 2315151 2272860
8513 2272860 2224200 2198010 2186240 2176569 2158012 2113006 2044352 1988386 1937354 1877667 1827566 1761691
8501 1761691 1704162 1670068 1653342 1634608 1605388 1588801 1580398 1587756 1599465 1585669 1546088 1483758
8489 1483758 1420467 1365970 1299646 1263035 1225106 1211813 1191640 1155873 1116330 1104996 1093011
8478 1093011 1086371 1076083 1075491 1081713 1097107 1121446 1143693 1119938 1068272 1017880 979018 940863
$$ packed form
8555F695934j71076j69945j89340j96583k04717k22447k01025j52876j15503r7100
8545D975322p7647p5242r1941j23870j41412j62589j52002j40877j40188j31411
8535C738143j10727r8894p8865o8941o5870o1588o7799n9207o5836o8387n4350
8524B937679o8855q9393o5766n3351o0068o4065m6897n3129o8464n2540m2291
8513B272860m8660k6190j1770r671j8557m5006o8654n5966n1032n9687n0101o5875
8501A761691n7529l4094j6726j8734k9220j6587q403P358J1709j3796l9581o2330
8489A483758o3291n4497o6324l6611l7929j3293k0173l5767l9543j1334j1985
8478A093011o640j0288n92O222J5394K4339K2247k3755n1666n0392l8862l8155
$$ plain form
8466 940863 909454 871276 845857 821960 790926 778803 777728 772101 751714 757572 751428 723500
8454 723500 704084 700500 697441 686126 690805 688898 694248 684980 687314 683105 676239 665939 643009
8441 643009 640886 624209 591086 564162 529919 506950 463600 412298 362558 316004 314312 354780
8429 354780 411507 454357 471506 471904 474131 473192 478962 470285 464569 443808 433785 414087 385792
8416 385792 354290 324981 278975 226998 172080 126975 144417 185343 216890 253788 289468 313425
8404 313425 312245 304050 301455 326450 313982 306440 301869 293992 279543 266718 281930 309772 315090
8391 315090 310945 304476 290141 287070 280450 267798 283289 293372 306530 304129 306132 297365 292413
8378 292413 272684 270270 271195 265564 255624 257757 266674 279173 289844 278570 251939 238292 241564
$$ packed form
8466I40863l1409l8178k5419k3897l1034j2123j075n627k0387N858o144k7928
8454G23500j9416l584l059j1315M679j907N350r268K334m209o866j0300k2930
8441F43009k123j6677l3123k6924l4243k2969m3350n1302m9740m6554j692M0468
8429C54780N6727M2850J7149L98K227r39N770q677n716k0761j0023j9698k8295
8416C85792l1502k9309m6006n1977n4918m5105J7442M0926L1547L6898L5680K3957
8404C13425j180q195k595K4995j2468p542m571p877j4449j2825J5212K7842N318
8391C15090m145o469j4335l071o620j2652J5491J0083J3158k401K003q767m952
8378B92413j9729k414R25n631r940K133Q917J2499J0671j1274k6631j3647L272
$$ plain form
8365 241564 240464 235371 236726 240152 236627 215629 201955 207197 212563 209043 202247 191027 187973 195180
8351 195180 190239 189897 196315 205484 194754 203476 216972 227523 229233 230044 243356 253552 265664
8338 265664 279440 291153 285099 275805 268948 263338 233163 197793 189244 196441 200526 195009 199881
8325 199881 203455 212077 212685 217677 223562 223746 222000 219095 211142 207416 203578 185617 188332 198359
8311 198359 213459 231851 245265 255976 253755 245227 231770 232769 245895 264188 256852 258705 274010
8298 274010 294803 307272 327682 337521 345430 316687 301344 301383 317837 338417 328418 311877 289991
8285 289991 278403 283291 264984 236308 239022 248517 242553 241907 245722 261316 250408 249797 269645
8272 269645 288914 289998 297714 313192 312505 296074 285192 296440 304770 310061 312962 314512 303812
$$ packed form
8365B41564j100n093J355L426l525k0998j3674N242N366l520o796j1220l054P207
8351A95180m941l42O418R169j0730Q722J3496J0551J710Q11J3312J0196J2112
8338B65664J3776J1713o054r294o857n610l0175l5370q549P197M085n517M872
8325A99881L574Q622O08M992N885J84j746k905p953l726l838j7961K715J0027
8311A98359J5100J8392J3414J0711k221q528j3457R99J3126J8293p336J853J5305
8298B74010K0793J2469K0410R839P909k8743j5343L9J6454K0580r999j6541k1886
8285B89991j1588M888j8307k8676K714R495n964o46L815J5594j0908o11J9848
8272B69645J9269J084P716J5478o87j6431j0882J1248Q330N291K901J550j0700
$$ plain form
8259 303812 297462 304573 307785 304336 293729 292543 272446 265043 267277 254914 248540 272315 289378
8246 289378 299708 315271 330127 346305 348478 349767 331567 305311 292240 305305 326708 320133
8234 320133 328224 348777 370791 388130 393197 407871 428412 456598 499085 566631 642421 709960
8222 709960 803953 940022 1092156 1239985 1376693 1470727 1458453 1378772 1248195 1091443
8212 1091443 951207 847004 761484 706487 690210 690939 670344 644732 676995 736278 824140
8201 824140 943027 1082870 1233716 1370163 1426043 1390786 1270191 1099441 941532 813076
8191 813076 688354 597598 522976 470627 436621 409857 388465 370173 350017 337810 331056 315262
8179 315262 304769 304182 312517 319392 334199 329884 325172 343177 349444 332534 307934 292021 285591
$$ packed form
8259C03812o350P111L212l449j0607j186k0097p403K234j2363o374K3775J7063
8246B89378J0330J5563J4856J6178K173J289j8200k6256j3071J3065K1403o575
8234C20133Q091K0553K2014J7339N067J4674K0541K8186M2487O7546P5790O7539
8222G09960R3993J36069J52134J47829J36708R4034j2274p9681j30577j56752
8212A091443j40236j04203q5520n4997j6277P29k0595k5612L2263N9283Q7862
8201H24140J18887J39843J50846J36447N5880l5257j20595j70750j57909j28456
8191H13076j24722r0756p4622n2349l4006k6764k1392j8292k0156j2207o754j5794
8179C15262j0493n87Q335O875J4807m315m712J8005O267j6910k4600j5913o430
$$ plain form
8166 285591 263782 250379 242167 223796 226205 229053 259181 290496 291617 312226 330839 343830
8154 343830 348314 349769 347873 328821 329406 353196 388287 371696 333278 294216 266864 231419 215151
8141 215151 208393 203210 185871 172888 163600 171062 194031 207942 198976 184415 188128 199742 198061
8128 198061 197642 195569 175813 179107 178471 182959 187566 201899 198838 201747 195135 204702 219738 208864
8114 208864 222249 231351 234762 236145 239843 237022 243961 258900 264700 263990 252273 247517 250440 263767
8100 263767 262388 250030 249651 240912 238434 223055 208141 197760 201602 199770 209217 221090 227981
8087 227981 242994 258547 277132 279004 261014 256804 256321 237550 234868 241515 245497 240909 242503
8074 242503 261511 269606 256446 228691 222055 242160 244838 242507 250655 246100 244275 239967 227689
$$ packed form
8166B85591k1809j3403q212j8371K409K848L0128L1315J121K0609J8613J2991
8154C43830M484J455j896j9052N85K3790L5091j6591l8418l9062k7352l5445j6268
8141B15151o758n183j7339j2983r288P462K2969J3911q966j4561L713J1614j681
8128A98061m19k073j9756L294o36M488M607J4333l061K909o612R567J5036j0874
8114B08864J3385R102L411J383L698k821O939J4939N800p10j1717m756K923J3327
8100B63767j379j2358l79q739k478j5379j4914j0381L842j832R447J1873O891
8087B27981J5013J5553J8585J872j7990m210m83j8771k682O647L982m588J594
8074B42503J9008Q095j3160k7755o636K0105K678k331Q148m555j825m308j2278
$$ plain form
8061 227689 222078 208105 190656 190941 189991 167774 158171 163231 154605 177284 192757 192149 187886 180980
8047 180980 172503 157887 164103 153108 145303 142712 140289 132127 132697 124245 140764 163903 164401 148977
8033 148977 130530 128035 126601 115532 121695 139321 141113 138128 134058 119307 122853 127217 119436
8020 119436 119184 119495 118841 124806 121466 113912 116549 114588 105983 93451 95252 102237 105318 111354 118398
8005 118398 134601 129633 134034 127482 130312 125064 117681 124442 115161 105734 130962 153475 148018 130893
7991 130893 132041 138288 143421 144648 131277 142200 162837 165479 173434 166636 150022 149686 134475
7978 134475 123735 116169 109220 105774 108063 122306 127261 136176 147202 160234 174382 187087 199937
7965 199937 231254 271873 296059 312514 331083 324163 289569 257126 238872 230420 229962 221722 202487
$$ packed form
8061B27689n611j3973j7449K85r50k2217r603N060q626K2679J5473o08m263o906
8047A80980q477j4616O216j0995p805k591k423q162N70q452J6519K3139M98j5424
8033A48977j8447k495j434j1069O163J7626J792k985m070j4751L546M364p781
8020A19436k52L11o54N965l340p554K637j961q605j2532J801O985L081O036P044
8005A18398J6203m968M401o552K830n248p383O761r281r427K5228K2513n457j7125
7991A30893J148O247N133J227j3371J0923K0637K642P955o798j6614l36j5211
7978A34475j0740p566o949l446K289J4243M955Q915J1026J3032J4148J2705J2850
7965A99937L1317M0619K4186J6455J8569o920l4594l2443j8254q452m58q240j9235
$$ plain form
7952 202487 198709 213257 209627 201156 192990 204104 213725 228885 240680 237593 211842 186029 184612
7939 184612 181876 193132 194004 204318 212870 211155 221009 218200 215804 225333 245464 252219 269447 297462
7925 297462 351278 432767 564879 747644 948406 1150738 1302452 1296194 1093896 845034
7915 845034 669207 557392 485125 431348 393041 370308 340392 322665 297824 287166 283635
7904 283635 267874 252902 243351 248000 247987 231073 197387 180322 185159 185433 177029 157227 151665 159697
7890 159697 177730 173625 176744 188778 201548 202228 178885 155288 144302 147276 152841 150107 163346
7877 163346 174227 172556 160554 159574 166161 168317 180758 189607 190947 190722 183284 179137 171101 166529
7863 166529 165569 163446 167299 168318 162403 162386 172045 172727 158989 149288 132708 127637 119483 112440 112612
$$ packed form
7952B02487l778J4548l630q471q166J1114R621J5160J1795l087k5751k5813j417
7939A84612k736J1256Q72J0314Q552j715R854k809k396R529K0131O755J7228K8015
7925B97462N3816Q1489J32112J82765K00762K02332J51714o258k02298k48862
7915H45034j75827j11815p2267n3777l8307k2733k9916j7727k4841j0658l531
7904B83635j5761j4972r551M649j3j6914l3686j7065M837K74q404j9802n562Q032
7890A59697J8033m105L119J2034J2770O80k3343k3597j0986K974N565k734J3239
7877A63346J0881j671j2002r80O587K156J2441Q849J340k25p438m147q036m572
7863A66529r60k123L853J019n915j7R659O82j3738r701j6580n071q154p043J72
$$ plain form
7848 112612 118849 125779 129190 138891 140639 134852 124236 123292 103441 101546 122817 140761 141450 139505
7834 139505 143312 128246 117552 108515 91364 93822 104019 121745 135430 147490 172786 183906
7822 183906 186301 181701 157799 152973 145880 141276 133678 141668 147020 127940 115061 134188 143883
7809 143883 131511 105409 95688 109046 105680 102937 110402 108891 104934 108686 107912 111918 110532 102444
7795 102444 100783 112430 111803 102855 112448 105137 82455 71086 89463 82994 66700 59978 63663
7782 63663 89666 115173 129082 136961 129538 119121 102859 98690 92370 84217 71677 71987 70632
7769 70632 63572 77779 91470 87139 78254 83401 85009 81267 92495 96910 100978 102966 102266 99746
7755 99746 98864 93869 82439 73970 66172 66400 77169 73036 73243 96537 109950 106782 91675 94283
$$ packed form
7848A12612O237O930L411R701J748n787j0616r44j9851j895K1271J7944O89j945
7834A39505L807j5066j0694r037j7151K458J0197J7726J3685J2060K5296J1120
7822A83906K395m600k3902m826p093m604p598P990N352j9080j2879J9127R695
7809A43883j2372k6102r721J3358l366k743P465j511l957L752p74M006j386q088
7795A02444j661J1647o27q948R593p311k2682j1369J8377o469j6294o722L685
7782F3663K6003K5507J3909P879p423j0417j6262m169o320q153j2540L10j355
7769G0632p060J4207J3691m331q885N147J608l742J1228M415M068J988p00k520
7755I9746q82m995j1430q469p798K28J0769m133K07K3294J3413l168j5107K608
$$ plain form
7741 94283 93477 90857 78778 69638 82273 85634 74664 67361 61412 64196 60630 48784 45704 47899
7727 47899 55303 63701 88598 92740 84218 82780 78546 66454 70360 95710 103730 99012 91951 79603
7713 79603 71495 66154 65394 70958 67604 70419 74419 86125 94939 89891 96765 105552 106403 98331 84488
7698 84488 84026 90057 82158 67636 70968 71109 62405 57416 55326 56068 54397 64141 67676 64770 59073
7683 59073 52016 53614 66961 68628 67739 64191 56281 80833 101746 104107 109837 95886 99205 90063
7669 90063 78732 67825 52964 58553 61379 54440 53706 44181 43413 42636 47638 55652 57271 58281 56619
7654 56619 52978 59510 64734 62887 53568 33539 32704 32963 26064 22770 22134 30246 23708 31686 41109
7639 41109 36544 14533 9487 12051 19479 32299 29343 30514 25490 28273 45663 54214 57587 59435
$$ packed form
7741I4283q06k620j2079r140J2635L361j0970p303n949K784l566j1846l080K195
7727D7899P404Q398K4897M142q522j438m234j2092L906K5350Q020m718p061j2348
7713G9603q108n341p60N564l354K815M000J1706Q814n048O874Q787Q51q072j3843
7698H4488m62O031p899j4522L332J41q704m989k090P42j671R744L535k906n697
7683E9073p057J598J3347J667q89l548p910K4552K0913K361N730j3951L319r142
7669I0063j1331j0907j4861N589K826o939p34r525p68p77N002Q014J619J010j662
7654E6619l641O532N224j847r319k0029q35K59o899l294o36Q112o538P978R423
7639D1109m565k2011n046K564P428J2820k956J171n024K783J7390Q551L373J848
$$ plain form
7625 59435 39524 30227 46774 47896 47703 50444 63520 50410 52113 54790 47532 45706 45701 47442 35673
7610 35673 17950 21934 32274 22646 26286 19456 11528 2576 5573 13923 23453 20246 17888 15217
7596 15217 28919 39539 40407 39262 36771 33539 22259 17883 19001 30923 42242 31459 23342
7583 23342 24909 25830 40640 47467 46159 41678 35204 29398 32860 38174 40947 44458 39211 31641 33874
7568 33874 46363 38870 11085 954 3058 9256 12873 26037 23737 19802 23197 24319 24240 9629
7554 9629 7639 18773 20720 29708 30670 36167 23924 19394 30354 29117 17323 6061 5553 15039
7540 15039 24790 32537 32969 21171 16692 15446 20745 31825 33468 25240 5487 656 7670 -1801
7526 -1801 -12727 -1920 5907 2723 12169 15221 13611 13082 12462 26256 35043 29806 20052 17665 25382
$$ packed form
7625E9435j9911r297J6547J122j93K741J3076j3110J703K677p258j826nJ741j1769
7610C5673j7723L984J0340r628L640o830p928q952K997Q350R530l207k358k671
7596A5217J3702J0620Q68j145k491l232j1280m376J118J1922J1319j0783q117
7583B3342J567R21J4810O827j308m481o474n806L462N314K773L511n247p570K233
7568C3874J2489p493k7785j0131K104O198L617J3164k300l935L395J122p9j4611
7554I629j990J1134J947Q988R62N497j2243m530J0960j237j1794j1262n08R486
7540A5039R751P747M32j1798m479j246N299J1080J643q228j9753m831P014r471
7526a801j0926J0807P827l184R446L052j610n29o20J3794Q787n237r754k387P717
$$ plain form
7511 25382 20496 24612 24852 25409 19926 30152 20939 18823 16163 31262 40061 61118 58778 44948
7497 44948 26643 18825 15020 25096 22020 16618 8739 17422 26527 29814 37177 22105 17578 20790
7483 20790 19578 33927 48303 53668 49796 43727 43275 48426 29247 8117 4369 440 10920 16116
7469 16116 13298 15486 18823 23383 29422 21838 23500 28368 28344 17874 25427 42939 50445 31785
7455 31785 24475 26721 24942 21352 17598 16534 7469 7058 11536 14561 16253 14564 10868 -569 2976
7440 2976 4254 -5599 3557 1685 10008 13914 -3865 -2537 -2157 4063 9817 1879 -17030 -19779 -2177
7425 -2177 10597 17000 13208 331 -3759 5243 15431 19194 25120 36347 34416 28736 22752 19070
7411 19070 16163 17449 25035 27692 12611 -3539 -6973 7261 24016 22391 6707 3992 25224
$$ packed form
7511B5382m886M116K40N57n483J0226r213k116k660J5099Q799K1057k340j3830
7497D4948j8305p818l805J0076l076n402p879Q683R105L287P363j5072m527L212
7483B0790j212J4349J4376N365l872o069m52N151j9179k1130l748l929J0480N196
7469A6116k818K188L337M560O039p584J662M868k4j0470P553J7512P506j8660
7455C1785p310K246j779l590l754j064r065m11M478L025J692j689l696j1437L545
7440B976J278r853R156j872Q323L906j7779J328L80O220N754p938j8909k749J7602
7425b177J2774O403l792j2877m090R002J0188L763N926J1227j931n680n984l682
7411A9070k907J286P586K657j5081j6150l434J4234J6755j625j5684k715K1232
$$ plain form
7398 25224 27898 17533 19211 24026 11769 -5501 381 -7718 -6985 6506 24226 39562 20087
7385 20087 6382 2706 5450 5623 13281 25019 24707 9309 -6963 5247 15061 2249 -299 4439
7371 4439 -5217 -1533 8440 26089 32896 35244 28815 24509 29373 50032 45847 32676 17432 1540
7357 1540 -3725 -4150 -1284 21726 32406 30893 27631 24569 17200 -155 7427 13444 5666 -249
7343 -249 7085 13313 12972 10050 880 5009 11772 12365 5396 21082 23299 24921 16509 5701 1748
7328 1748 8082 13087 17158 35012 40688 35574 20005 6172 -643 -8093 -1974 -3746 -8908 -12427
7314 -12427 -12438 -18939 -18822 -23099 -33946 -24618 -12229 492 6631 10719 17418 26651 26139 21235 7228
7299 7228 4692 23847 31189 32672 17452 19396 28350 20870 8543 16053 13519 15277 18640 9033
$$ packed form
7398B5224K674j0365J678M815j2257j7270N882q099P33J3491J7720J5336j9475
7385B0087j3705l676K744J73P658J1738l12j5398j6272J2210R814j2812k548M738
7371D439r656L684R973J7649O807K348o429m306M864K0659m185j3171j5244j5892
7357A540n265m25K866K3010J0680j513l262l062p369j7355P582O017p778n915
7343b49P334O228l41k922r170M129O763N93o969J5686K217J622q412j0808l953
7328A748O334N005M071J7854N676n114j5569j3833o815p450O119j772n162l519
7314a2427j1o501J17m277j0847R328J2389J2721O139M088O699R233n12m904j4007
7299G228k536J9155P342J483j5220J944Q954p480j2327P510k534J758L363r607
$$ plain form
7285 9033 19029 27373 19898 22638 23802 5043 -13731 -17287 -7064 -6686 -12443 -18150 -8495 19519
7271 19519 30440 21649 47 -540 10905 12974 6233 4582 -4856 -23163 -22924 -4721 4089 -99
7257 -99 -3872 2008 5146 3436 13914 12919 -53 7764 22315 31014 25235 22410 26147 19784 13363
7242 13363 4456 1739 22832 30451 36555 28946 29848 26569 25501 30581 19148 7812 2291 -470
7228 -470 9826 10274 732 3242 12717 12429 13832 7870 11200 6031 2508 9407 11814 1717 -328
7213 -328 467 10243 11876 11172 11308 15468 22305 20642 19201 15711 4515 7900 11402 6368 16457
7198 16457 26006 8005 8114 3382 -1086 -237 -9254 -12774 -11664 -13939 -19205 -20252 -23272 -19173 -21141
7183 -21141 -21659 -10851 2469 -5486 1788 10523 25403 28062 24082 -697 -10584 -8180 -258 13964
$$ packed form
7285I033R996Q344p475K740J164j8759j8774l556J0223L78n757n707R655K8014
7271A9519J0921q791k1602n87J1445K069o741j651r438j8307K39J8203Q810m188
7257i9l773N880L138j710J0478r95j2972P817J4551Q699n779k825L737o363o421
7242A3363q907k717K1093P619O104p609R02l279j068N080j1433j1336n521k761
7228d70J0296M48r542K510R475k88J403n962L330n169l523O899K407j0097k045
7213c28P95R776J633p04J36M160O837j663j441l490j1196L385L502n034J0089
7198A6457R549j8001J09m732m468Q49r017l520J110k275n266j047l020M099j968
7183b1141n18J0808J3320p955P274Q735J4880K659l980k4779r887K404P922J4222
$$ plain form
7169 13964 35120 20547 10400 11286 11749 9940 14766 20967 20440 15178 3525 -5368 -24183 -25160
7155 -25160 -13813 -9647 8546 16183 -3838 -12709 -21000 -11824 -7453 -6295 12442 875 -15666
7142 -15666 -14512 -19169 -1058 10703 8401 12063 18576 6794 4814 9023 5266 -8415 -689 6887
7128 6887 1464 6268 3158 5671 9952 20496 10800 -3661 -4243 5749 7699 9731 22272 26484
7114 26484 12818 5722 12008 16907 17258 -592 -7957 -2148 -4548 -7776 10984 23734 21487 521
7100 521 -2649 10325 19744 7735 6310 9117 -7953 -20692 -14757 -2124 832 8075 20055 20409
7086 20409 20561 19436 9207 11921 27013 20298 13083 15523 27743 26848 27782 18118 3494 -8530
7072 -8530 1052 -15 -1042 -7334 -11797 -10943 -11323 -5856 -4811 14241 25163 11907 14877 9583 19346
$$ packed form
7169A3964K1156j4573j0147Q86M63j809M826O201n27n262j1653q893j8815r77
7155b5160J1347M166J8193P637k0021q871q291R176M371J158J8737j1567j6541
7142a5666J154m657J8111J1761k302L662O513j1782j980M209l757j3681P726P576
7128F887n423M804l110K513M281J0544r696j4461n82R992J950K032J2541M212
7114B6484j3666p096O286M899L51j7850p365N809k400l228J8760J2750k247k0966
7100E21l170J2974R419j2009j425K807j7070j2739N935J2633K956P243J1980L54
7086B0409J52j125j0229K714J5092o715p215K440J2220q95R34r664j4624j2024
7072h530R582j067j027o292m463Q54l80N467J045J9052J0922j3256K970n294R763
$$ plain form
7057 19346 20759 23126 15090 8264 10359 6111 12266 17464 12279 14497 19907 22811 18721 9194 4357
7042 4357 -2190 -843 -5918 -13740 866 11752 8182 -3317 3293 14964 22598 13467 4805 2965
7028 2965 10697 21231 20311 15043 10138 -468 -16575 -19770 -6352 3835 -829 -4047 -3078 -4136
7014 -4136 8708 8607 -2557 853 2263 535 6063 10729 1809 -20260 -26617 -17877 -16580 -11127
7000 -11127 3279 15140 13898 7305 4235 13237 17348 18139 14569 23545 21299 9091 19787 25460
6986 25460 33322 30556 21642 29248 18288 16444 23362 13077 -1108 -5429 -3861 9667 20515
6973 20515 31745 28804 7505 1764 -2704 -7454 11447 16024 5808 7348 -5098 6780 12786
6960 12786 -5262 -2825 -3904 9723 20850 25886 18500 8436 8391 -4968 -10723 707 5459 4752
$$ packed form
7057A9346J413K367q036o826K095m248O155N198n185K218N410K904m090r527m837
7042D357o547J347n075p822J4606J0886l570j1499O610J1671P634r131q662j840
7028B965P732J0534r20n268m905j0606j6107l195J3418J0187m664l218R69j058
7014d136J2844j01j1164L410J410j728N528M666q920k2069o357Q740J297N453
7000a1127J4406J1861j242o593l070R002M111P91l570Q976k246j2208J0696N673
6986B5460P862k766q914P606j0960j844O918j0285j4185m321J568J3528J0848
6973B0515J1230k941k1299n741m468m750J8901M577j0216J540j2446J1878O006
6960A2786j8048K437j079J3627J1127N036p386j0064m5j3359n755J1430M752p07
$$ plain form
6946 4752 -8750 416 4548 11065 22730 9596 -4569 -2242 2016 2758 8818 3908 -1109 -5479
6932 -5479 -10608 -5127 3090 8027 21897 25211 10353 15179 18998 13978 13540 10898 19734 27821 30946
6917 30946 22622 22165 22406 13211 14566 16760 13377 2939 6775 22755 23265 25592 18425 20124 2548
6902 2548 -7584 -6127 -13239 -3208 8645 -3608 -23952 -25202 -28348 -12394 17994 34806 11156
6889 11156 -273 2886 6282 5353 -300 2517 5600 6876 12941 10927 639 -2420 5680 19705
6875 19705 12526 1189 18356 31855 38924 43909 29446 9433 8829 18112 21838 17141 478
6862 478 -14441 -18617 -9854 -1375 4850 3025 4446 6777 101 6542 12944 14605 9884 10844 9670
6847 9670 35 -433 4127 -1635 1458 12278 21962 18467 7092 2727 -9627 -23599 -22300 -8824
$$ packed form
6946D752j3502R166M132O517J1665j3134j4165K327M258P42O060m910n017m370
6932e479n129N481Q217M937J3870L314j4858M826L819n020m38k642Q836Q087L125
6917C0946q324m57K41r195J355K194l383j0438L836J5980N10K327p167J699j7576
6902B548j0132J457p112J0031J1853j2253k0344j250l146J5954L0388J6812k3650
6889A1156j1429L159L396r29n653K817L083J276O065k014j0288l059Q100J4025
6875A9705p179j1337J7167J3499P069M985j4463k0013o04R283L726m697j6663
6862D78j4919m176Q763Q479O225j825J421K331o676O441O402J661m721R60j174
6847I670r635m68M560n762L093J0820R684l495j1375m365j2354j3972J299J3476
$$ plain form
6833 -8824 -3397 -3960 -7666 -14271 -6116 944 8524 15533 16201 14958 22424 26930 20561 16381 14831
6818 14831 24447 26502 21100 12717 23990 39874 31420 18570 24178 26648 23353 37711 40283 31469
6804 31469 9117 5233 21096 22604 8653 6005 10316 20804 14445 9724 -4582 6977 10457
6791 10457 -1309 376 3893 2826 -7749 -10708 -4769 -7403 -316 4660 12977 26198 23062 7437
6777 7437 -4963 -8210 -6603 -3296 1335 -9944 -9478 -3055 -799 -1403 -1098 -7615 -14515 -16388 -10868
6762 -10868 -4925 4463 -3235 -20000 -28887 -25111 -4237 2595 -11617 -14215 -4678 4950 3167 1344
6748 1344 10457 5750 11363 735 -503 -12151 -116 17588 21632 19108 14661 -1947 -2579 745
6734 745 4087 -1992 -1064 5964 3957 6671 2926 -929 2127 7406 8690 135 3091 7360 5802
$$ packed form
6833h824N427n63l706o605Q155P060P580P009O68j243P466M506o369m180j550
6818A4831R616K055n402q383J1273J5884q454j2850N608K470l295J4358K572q814
6804C1469k2352l884J5863J508j3951k648M311J0488o359m721j4306J1559L480
6791A0457j1766J685L517j067j0575k959N939k634P087M976Q317J3221l136j5625
6777G437j2400l247J607L307M631j1279M66O423K256o04L05o517o900j873N520
6762a0868N943R388p698j6765q887L776K0874O832j4212k598R537R628j783j823
6748A344R113m707N613j0628j238j1648J2035J7704M044k524m447j6608o32L324
6734G45L342o079R28P028k007K714l745l855L056N279J284q555K956M269j558
$$ plain form
6719 5802 -740 -11622 -33102 -40916 -47696 -38007 -13420 2421 18875 19921 16950 12609 4264 8705
6705 8705 6848 6626 11762 6902 -1894 -6937 -3018 2258 8639 17205 15316 15711 16586 13760 2758
6690 2758 8662 8849 16289 19035 7258 11478 18074 21413 29521 39807 39958 27569 18118 6187
6676 6187 1781 15721 9864 -6309 -14038 -15708 -6076 6281 14575 20497 24027 18425 20573 21834
6662 21834 13222 5444 11998 26529 40962 38102 17440 15261 19385 21316 19161 5606 19956
6649 19956 19732 10533 5049 -2302 5361 3197 7286 6454 2117 7919 1873 -5549 -3170 -2010 12317
6634 12317 7905 -3355 3795 13963 18063 10675 16163 14083 10991 11303 -5607 -17492 3069 6911
6620 6911 12496 12753 17432 18369 22298 24290 17856 9092 23785 34406 25170 24891 30448 17535 10572
$$ packed form
6719E802o542j0882k1480p814o780R689K4587J5841J6454J046k971m341q345M441
6705H705j857k22N136m860q796n043L919N276O381Q566j889L95Q75k826j1002
6690B758N904J87P440K746j1777M220O596L339Q108J0286J51j2389r451j1931
6676F187m406J3940n857j6173p729j670R632J2357Q294N922L530n602K148J261
6662B1834q612p778O554J4531J4433k860k0662k179M124J931k155j3555J4350
6649A9956k24r199n484p351P663k164M089q32m337N802o046p422K379J160J4327
6634A2317m412j1260P150J0168M100p388N488k080l092L12j6910j1885K0561L842
6620F911N585K57M679R37L929J992o434q764J4693J0621r236k79N557j2913o963
$$ plain form
6605 10572 8022 16961 24211 10765 1323 -3266 6594 2597 -9043 -21274 -26657 -21975 -21117 -20431
6591 -20431 -8720 -4268 4788 13310 8821 6188 5788 8348 9084 16039 13915 15889 19354 5429 -1937
6576 -1937 -1549 -8288 -13268 -9593 8898 8415 11455 19464 14172 -1713 -17221 -32100 -15625 11790
6562 11790 16374 2141 7841 22223 15819 8731 4617 9721 11701 23589 13897 6531 6806 18098
6548 18098 14033 -482 -18000 -15081 2723 9870 22372 25144 11650 7910 14609 29092 22716
6535 22716 10215 3420 -9509 -16016 -17535 -7311 -2996 6256 -1555 1169 4488 -5508 -15853 -9666
6521 -9666 3265 5367 12254 24045 24973 5783 147 -948 -1802 6655 11472 10412 15485 14254 5286
6506 5286 5627 -3285 -7672 1958 11101 17202 -831 -13285 -1705 5450 4797 -16370 -17037 -4761
$$ packed form
6605A0572k550Q939P250j3446r442m589R860l997j1640j2231n383M682Q58O86
6591b0431J1711M452R056Q522m489k633m00K560P36O955k124J974L465j3925p366
6576a937L88o739m980L675J8491m83L040Q009n292j5885j5508j4879J6475K7415
6562A1790M584j4233N700J4382o404p088m114N104J980J1888r692p366K75J1292
6548A8098m065j4515j7518K919J7804P147J2502K772j3494l740O699J4483o376
6535B2716j2501o795j2929o507j519J0224M315R252p811K724L319r996j0345O187
6521i666J2931K102O887J1791R28j9190n636j095q54Q457M817j060N073j231q968
6506E286L41q912m387R630R143O101j8033j2454J1580P155o53k1167o67J2276
$$ plain form
6492 -4761 1519 4912 -6323 -12329 -16359 -8169 -12277 5947 26596 -740 -14202 2535 10114
6479 10114 8646 -10050 -21821 -24347 -30303 -18586 -10791 7690 10747 5497 10748 5057 -1479 2136
6465 2136 -2111 -917 -11032 -28189 -24070 -17540 -11287 -10373 -18444 -22337 -8840 -13964 -15668 -21934
6451 -21934 -24285 -13978 -10576 -4289 1246 -9377 -8926 10328 19649 3023 -11535 -28584 -40851
6438 -40851 -33657 -23222 -21957 -19151 -35708 -33730 -14986 -10956 -11372 -11155 -10277 2065 5474 9537
6424 9537 9613 307 -1324 -2293 1496 8534 6921 4767 22729 20632 15328 22151 9476 1450 14642
6409 14642 4437 -315 5049 6760 4473 -3059 -10947 -5352 17780 14475 5281 4366 -1317 -8187
6395 -8187 6000 9043 5848 -5136 -10937 -13681 -2756 -7415 -1777 -2974 -15058 -5245 -1413 2506
$$ packed form
6492d761O280L393j1235o006m030Q190m108J8224K0649k7336j3462J6737P579
6479A0114j468j8696j1771k526n956J1717P795J8481L057n250N251n691o536L615
6465B136m247J194j0115j7157M119O530O253R14q071l893J3497n124j704o266
6451b1934k351J0307L402O287N535j0623M51J9254R321j6626j4558j7049j2267
6438d0851P194J0435J265K806j6557J978J8744M030m16K17Q78J2342L409M063
6424I537P6r306j631r69L789P038j613k154J7962k097n304O823j2675q026J3192
6409A4642j0205m752N364J711k287p532p888N595K3132l305r194r15n683o870
6395h187J4187L043l195j0984n801k744J0925m659N638j197j2084R813L832L919
$$ plain form
6381 2506 -6981 -9752 -12411 234 -4633 -11101 -10120 -7070 -6723 7702 3680 1968 3733 10412 22298
6366 22298 17448 2495 -8956 6987 3495 -9691 -6741 2984 2660 2843 -3422 -6967 -2368 1175
6352 1175 -8127 -16569 -13543 -13572 -22925 -12400 -411 5701 14972 8609 2796 5122 9413 23310 29159
6337 29159 18040 18285 14730 14251 8566 18657 15610 20396 28496 22618 21722 12604 -633 -4134 3151
6322 3151 6292 -9514 -11041 -9752 -8007 -12586 -7877 -12452 -2270 2205 11789 21730 14163 2205
6308 2205 1690 -476 -654 9977 8227 -4390 9044 8499 -6701 -9656 5123 15174 17817 23052
6294 23052 45013 43120 16769 -13206 -19762 -11808 -8389 -13681 -9371 -14915 -16211 -8293 -8710 7966
6280 7966 31919 33739 10139 -1662 -1537 7302 10711 -5604 -7981 1013 17748 22698 27911 37327
$$ packed form
6381B506r487k771k659J2645m867o468R81L050L47J4425m022j712J765O679J1886
6366B2298m850j4953j1451J5943l492j3186K950R725l24J83o265l545M599L543
6352A175r302q442L026k9r353J0525J1989O112R271o363n813K326M291J3897N849
6337B9159j1119K45l555m79n685J0091l047M786Q100n878q96r118j3237l501P285
6322C151L141j5806j527J289J745m579M709m575J0182M475R584R941p567j1958
6308B205n15k166j78J0631j750j2617J3434n45j5200k955J4779J0051K643N235
6294B3052K1961j893k6351k9975o556P954L419n292M310n544j296P918m17J6676
6280G966K3953J820k3600j1801J25Q839L409j6315k377Q994J6735M950N213R416
$$ plain form
6266 37327 23147 2352 4632 15751 17507 17982 2128 -14711 -15847 8707 16169 9852 20897
6253 20897 22802 29663 22228 27177 29950 21173 31237 39062 25246 4953 -6969 7183 25088
6240 25088 34039 32052 23249 20021 15120 8778 13041 21770 15348 24175 21836 10459 -10567 -14463
6226 -14463 -23083 -24837 -25992 -16921 -6727 -9129 3007 22002 20885 10945 -8664 -9221 -193 -20172
6212 -20172 -7339 10723 2569 -501 3406 1337 7711 6771 6879 597 -5092 -1558 -6661 -13050 -23251
6197 -23251 -17182 -7774 -2154 1686 -5942 -11991 -9058 -825 670 -22454 -36385 -14048 3775 1546
6183 1546 3887 -7452 -12734 13459 22200 34055 13452 1468 -7419 -1591 -15507 -14274 -4494
6170 -4494 5453 -6223 6364 4293 -3452 2223 9956 839 -6213 1038 4688 9241 -4072 -1112
$$ packed form
6266C7327j4180k0795K280J1119J756M75j5854j6839j136K4554P462o317J1045
6253B0897J905O861p435M949K773q777J0064P825j3816k0293j1922J4152J7905
6240B5088Q951j987q803l228m901o342M263Q729o422Q827k339j1377k1026l896
6226a4463q620j754j155R071J0194k402J2136J8995j117r940j9609n57R028j9979
6212b0172J2833J8062q154l070L907k069O374r40J08o282n689L534n103o389j0201
6197b3251O069R408N620L840p628o049K933Q233J495k3124j3931K2337J7823k229
6183A546K341j1339n282K6193Q741J1855k0603j1984q887N828j3916J233R780
6170d494R947j1676J2587k071p745N675P733r117p052P251L650M553j3313K960
$$ plain form
6156 -1112 6826 5529 6618 12087 7659 3180 14862 15925 4206 2699 16648 21987 21598 23859
6142 23859 18877 6190 2274 -5186 7980 8998 8468 9640 -364 -4579 1546 11484 15818 -919
6128 -919 -1134 -2669 -16408 -8457 -1954 -1779 -1169 -214 8312 23881 26778 19222 15888 -6301 -2736
6113 -2736 -6293 -4485 -2731 -6777 7114 10911 4536 -3092 -9589 -13450 -16078 -7849 -806 9050 3426
6098 3426 4385 -6214 -3527 -1497 16611 26367 13836 -108 1497 9823 11303 1221 10892 8935
6084 8935 232 9122 1347 -10297 3232 22578 41686 30462 15729 15860 17216 15446 12665 18431
6070 18431 17441 12786 -4170 -977 5976 -2992 -6493 -16026 -840 3363 -13332 -17690 -10247 -8337
6056 -8337 -9903 -6257 -1392 -1068 -5818 -11004 -2398 2787 6314 -2842 -18530 -12190 5912 5670 -11903
$$ packed form
6156a112P938j297J089N469m428m479J1682J063j1719j507J3949N339l89K261
6142B3859m982j2687l916p460J3166J018n30J172j0004m215O125R938M334j6737
6128i19k15j535j3739P951O503J75O10R55Q526J5569K897p556l334k2189L565
6113b736l557J808J754m046J3891L797o375p628o497l861k628Q229P043R856n624
6098C426R59j0599K687K030J8108R756j2531j3944J605Q326J480j0082R671j957
6084H935q703Q890p775j1644J3529J9346J9108j1224j4733J31J356j770k781N766
6070A8431r90m655j6956L193O953q968l501r533J5186M203j6695m358P443J910
6056h337j566L646M865L24m750n186Q606N185L527r156j5688O340J8102k42j7573
$$ plain form
6041 -11903 -21844 -20800 -2896 2474 10446 16786 22975 23332 24646 8656 -988 -12889 -15997 -15214
6027 -15214 5853 15650 19871 1424 -1349 1738 1215 -3932 4776 20399 14659 -3255 -11102 -9689
6013 -9689 -11410 5974 -227 -3972 -4135 8188 14644 9134 14306 13106 14699 14986 -394 -6643 6827
5998 6827 17554 17047 6998 6003 11914 16236 25043 6057 -14703 -11814 -3358 4564 14812 7398
5984 7398 3600 7425 -1784 -4725 -7885 8862 14504 27230 17579 1772 4388 21660 26663 6404
5970 6404 2722 5740 762 -26173 -45693 -33989 -10389 9420 9647 1123 -7797 -15063 -7275 9756
5956 9756 10376 1854 9678 13247 14860 11928 8835 -10387 -13268 -3125 6858 10521 12535 17245 15717
5941 15717 21205 15376 11307 5088 4534 4671 -2784 -13512 -8429 3791 14349 6617 -5038 4029
$$ packed form
6041a1903r941J044J7904N370P972O340O189L57J314j5990r644j1901l108P83
6027a5214K1067R797M221j8447k773L087n23n147Q708J5623n740j7914p847J413
6013i689j721J7384o201l745j63J2323O456n510N172j200J593K87j5380o249J3470
5998F827J0727n07j0049r95N911M322Q807j8986k0760K889Q456P922J0248p414
5984G398l798L825r209k941l160J6747N642J2726r651j5807K616J7272N003k0259
5970F404l682L018m978k6935j9520J1704K3600J9809K27q524q920p266P788J7031
5956I756O20q522P824L569J613k932l093j9222k881J0143R983L663K014M710j528
5941A5717N488n829m069o219n54J37p455j0728N083J2220J0558p732j1655R067
$$ plain form
5927 4029 6852 -5403 -6728 -2410 530 -14069 -25396 -12611 -4513 -11744 -18717 -11763 -13307 -24091
5913 -24091 -28558 -9023 4071 5414 -18438 -16478 9796 13659 15905 23206 18708 5807 -1773
5900 -1773 279 5620 12465 13705 14934 16903 26097 15372 -8898 -11900 -17754 -21975 -19077 -21278
5886 -21278 -22328 -18385 10880 40837 45503 23274 15844 6746 -12601 -13363 -12513 -7531 -18621 -21599
5872 -21599 -3627 -2992 -1792 -5962 -5235 -3428 -11570 -23846 -18600 -6018 -15864 -13032 1571 -4356
5858 -4356 -11319 -4214 13575 21391 13397 3571 8232 16089 31952 29689 17913 11408 6065 -9798
5844 -9798 -3016 20154 18330 9438 960 -453 -4217 -1088 17024 25611 8420 2433 -8572 -3839
5830 -3839 4777 7972 -291 2054 -9229 -11928 -5486 -14562 -23668 -26110 -19874 -5864 12553 10482
$$ packed form
5927D029K823j2255j325M318K940j4599j1327J2785Q098p231o973O954j544j0784
5913b4091m467J9535J3094J343k3852J960K6274L863K246P301m498j2901p580
5900a773K052N341O845J240J229J969R194j0725k4270l002n854m221K898k201
5886b1278j050L943K9265K9957M666k2229p430r098j9347p62Q50M982j1090k978
5872b1599J7972O35J200m170P27J807q142j2276N246J2582r846K832J4603n927
5858d356o963P105J7789P816p994r826M661P857J5863k263j1776o505n343j5863
5844i798O782K3170j824q892q478j413l764L129J8112Q587j7191n987j1005M733
5830c839Q616L195q263K345j1283k699O442r076r106k442O236J4010J8417k071
$$ plain form
5816 10482 3727 7409 1587 -11640 -9990 -6004 -9577 -21510 -24206 -19465 -4548 13644 17229 9204
5802 9204 -9467 -10456 1809 24968 35055 33811 29914 26427 25838 22454 11545 3536 -3034 6708
5788 6708 3526 -12404 -18105 -8338 -7381 -4085 17194 14109 19323 17326 2456 9273 -5667 -16717
5774 -16717 -21282 -4286 10062 13074 16143 12175 10487 -4943 -10018 -13560 -13878 -8652 -6424 -6096
5760 -6096 -18411 -24770 -24351 -15338 2237 3572 -4347 5970 2273 -2302 2517 -10931 -12161 -2789
5746 -2789 719 11781 17213 14633 7497 2906 2524 -87 -7912 14477 19362 16343 14042 22067 18465
5731 18465 10821 4999 -16771 -28690 -23259 -10967 -6012 -8948 -9810 3838 6950 7932 15539 26933
5717 26933 17179 13539 26824 23742 21441 28561 11581 10418 1204 -24835 -24259 -9435 -6489 -15140
$$ packed form
5816A0482o755L682n822j3227J650L986l573j1933k696M741J4917J8192L585q025
5802I204j8671r89J2265K3159J0087j244l897l487n89l384j0909q009o570R742
5788F708l182j5930n701R767R57L296K1279l085N214j997j4870O817j4940j1050
5774a6717m565J6996J4348L012L069l968j688j5430n075l542l18N226K228L28
5760f096j2315o359M19R013J7575J335p919J0317l697m575M819j3448j230R372
5746b789L508J1062N432k580p136m591l82k611p825K2389M885l019k301Q025l602
5731A8465p644n822k1770j1919N431J2292M955k936q62J3648L112R82P607J1394
5717B6933r754l640J3285l082k301P120j6980j163r214k6039N76J4824K946q651
$$ plain form
5703 -15140 -1108 15458 1451 -35810 -42729 -27136 -9400 -3369 6582 13011 6814 6562 19417
5690 19417 20874 287 -12756 -9341 -249 -1900 -7109 -11246 2087 16507 31851 22932 10667
5677 10667 7330 8035 7773 9306 -14102 -15621 -8130 -12033 -22181 -16885 751 2441 -21385 -15260
5663 -15260 -12230 -23833 -21393 -1449 133 -671 -3554 -4194 -3353 -962 8383 8923 9363 8236 -3116
5648 -3116 6741 -6060 -19310 -7887 -8497 -8342 -3398 8448 -8194 -13118 -2909 -10367 -14792 -16401
5634 -16401 -17645 -11897 -8501 -3312 14277 17105 15587 12770 -2417 -15558 -18972 -10986 -10287 -14409
5620 -14409 -22213 -27469 -24854 -28926 -33076 -20431 -8082 -1761 -7293 -6389 2307 17112 13702 95
5606 95 601 10765 16541 15791 4348 7650 2434 -11816 -3350 3188 14766 11487 -143 -5655 -7075
$$ packed form
5703a5140J4032J6566j4007l7261o919J5593J7736O031R951O429o197k52J2855
5690A9417J457k0587j3043L415R092j651n209m137J3333J4420J5344q919j2265
5677A0667l337P05k62J533k3408j519P491l903j0148N296J7636J690k3826O125
5663a5260L030j1603K440J9944J582q04k883o40Q41K391R345N40M40j127j1352
5648c116R857j2801j3250J1423o10J55M944J1846j6642m924J0209p458m425j609
5634a6401j244N748L396N189J7589K828j518k817j5187j3141l414P986O99m122
5620a4409p804n256K615m072m150J2645J2349O321n532R04Q696J4805l410j3607
5606I5N06J0164N776p50j1443L302n216j4250Q466O538J1578l279j1630n512j420
$$ plain form
5591 -7075 -6317 -8480 -6451 -564 -2665 -8810 -11221 -21458 -8878 -10884 3423 7144 8195 24396
5577 24396 34287 28666 22276 14803 5702 -9488 -21005 -4023 1567 -2371 -14796 -17320 -18272 -11442
5563 -11442 -7471 -1149 8156 2459 -11073 4255 29622 19968 18180 8538 -2073 -9545 -30064
5550 -30064 -17485 888 2269 -3824 -7972 -5296 -10572 -2242 -413 11424 -7401 -21303 -16578
5537 -16578 -9946 -6543 -12640 -9368 -5733 1693 4610 1302 -3744 -4680 3352 1065 -8594 -26979 -19231
5522 -19231 -6738 -5611 -17355 -22162 -16198 -18645 -5906 8477 5863 -6163 -4093 13470 8029
5509 8029 -4005 -12297 -572 -191 -16626 -25128 -16486 -14141 -16666 -26352 -24579 -10082 -16846 -10883
5495 -10883 -8153 208 -1301 193 -2350 -15629 -6468 -9337 -9726 -8274 -6220 2443 2768 -4830 -3889
$$ packed form
5591g075P58k163K029N887k101o145k411j0237J2580k006J4307L721J051J6201
5577B4396R891n621o390p473r101j5190j1517J6982N590l938j2425k524r52O830
5563a1442L971O322R305n697j3532J5328K5367r654j788r642j0611p472k0519
5550c0064J2579J8373J381o093m148K676n276Q330J829J1837j8825j3902M725
5537a6578O632L403o097L272L635P426K917l308n046r36Q032k287r659j8385P748
5522a9231J2493J127j1744m807N964k447J2739J4383k614j2026K070J7563n441
5509H029j2034q292J1725L81j6435q502Q642K345k525r686J773J4497o764N963
5495a0883K730Q361j509J494k543j3279R161k869l89J452K054Q663L25p598R41
$$ plain form
5480 -3889 -15550 -15970 -3781 1006 -6796 -9479 -1595 9198 6024 10535 11814 15191 19056 16638
5466 16638 10025 585 -6201 18936 10799 -2465 726 -7085 -12554 -13243 -8307 8881 6853 3602
5452 3602 -2497 -12023 -6902 -430 -1030 8147 21695 17119 20134 14759 3990 92 -6036 -1132 -5610
5437 -5610 -8135 -2654 -11236 -20522 -5581 7505 13598 18604 8647 15444 789 -6968 -16620 -16752
5423 -16752 -6157 4460 10443 11039 19433 49562 53432 27145 22832 36551 31571 5450 -4580
5410 -4580 614 5408 14229 9017 2982 -4469 -12127 -14855 -7082 -2543 -196 28130 30129 24147 4846
5395 4846 1339 3662 -2911 -8559 -29075 -31231 -20908 -985 8920 1434 -19523 -24526 -9359 -814
5381 -814 -2729 -17093 -16258 -11059 -23601 -21460 -5198 -11734 -16930 -16640 -13383 -10784 -8511 -15400 -21058
$$ packed form
5480c889j1661m20J2189M787p802k683P884J0793l174M511J279L377L865k418
5466A6638o613r440o786K5137q137j3264L191p811n469o89M936J7188k028l251
5452C602o099r526N121O472o00R177J3548m576L015n375j0769l898o128M904m478
5437e610k525N481q582r286J4941J3086O093N006r957O797j4655p757r652j32
5423a6752J0595J0617N983N96Q394L0129L870k6287m313J3719m980k6121j0030
5410d580N194M794Q821n212o035p451p658k728P773M539K347K8326J999n982j9301
5395D846l507K323o573n648k0516k156J0323J9923R905p486k0957n003J5167Q545
5381h14j915j4364Q35N199j2542K141J6262o536n196K90L257K599K273o889n658
$$ plain form
5366 -21058 -17906 -8678 -9424 -17400 -15614 -7848 7878 14912 11367 -329 -21314 -16300 2052 -2379
5352 -2379 -5820 -9121 -26106 -30876 -34194 -21757 -16154 -16135 -4602 -10552 -7422 7070 17504 5975
5338 5975 -2658 -13461 -2788 -10471 -14573 -11174 -5405 3334 28132 33704 4022 -12815 -12651 -8494
5324 -8494 -9835 -20532 -17519 -14136 -17423 -22632 -25661 -12467 419 7824 7561 -3549 -19772 -9837
5310 -9837 1673 -18266 -35672 -29427 -17656 -9622 -5432 2116 4609 -4473 -5932 8479 15818 -329
5296 -329 -7759 -8 5117 -5502 1747 6734 -1060 -10571 -11506 -7491 -1127 1347 -7821 -17867 -26341
5281 -26341 -24626 -13567 3144 -3865 -10243 -17034 -19492 -27283 -27838 -33103 -33369 -15971 -20380 -24176
5267 -24176 -14428 -3459 -3408 -11300 -9540 -19801 -11719 -1834 -6548 -5446 -12463 -17259 -2445 2478
$$ packed form
5366b1058L152R228p46p976J786P766J5726P034l545j1696k0985N014J8352m431
5352b379l441l301j6985m770l318J2437N603J9J1533n950L130J4492J0434j1529
5338E975q633j0803J0673p683m102L399N769Q739K4798N572k9682j6837J64M157
5324h494j341j0697L013L383l287n209l029J3194J2886P405k63j1110j6223R935
5310i837J1510j9939j7406O245J1771Q034M190P548K493r082j459J4411P339j6147
5296c29p430P751N125j0619P249M987p794r511r35M015O364K474r168j0046q474
5281b6341J715J1059J6711p009o378o791k458p791n55n265k66J7398m409l796
5267b4176R748J0969N1p892J760j0261Q082R885m714J102p017m796J4814M923
$$ plain form
5253 2478 9695 16312 11893 6389 3401 1946 -11576 -5445 -7514 8265 14784 9335 8423 -568 -19294
5238 -19294 -13644 -1409 3050 -94 -11192 -5287 2511 6615 6291 16963 19957 8734 -1346 9729
5224 9729 4328 -3088 -18629 -30902 -21048 -12295 -9069 14638 8094 -10174 -18603 -19809 -6445 -4106
5210 -4106 -9357 4390 7155 1463 -13618 -9078 -13496 -26962 -8135 -5314 -3385 -5695 -10340 -11817
5196 -11817 -11452 -7728 -805 -2183 -15153 -19310 -10145 -9625 -13848 -14645 5130 4257 -11812 -1503 13213
5181 13213 6824 5410 23226 22013 3451 -8626 -15672 -15097 -6856 17798 21117 9303 12498 1090
5167 1090 5326 1523 -473 -6139 -14421 -6263 -5392 -13860 -9510 4688 -595 -15093 -21234 5666
5153 5666 7320 4850 10377 21209 16636 10772 11868 -956 -4626 -8569 6378 22816 20155 7431
$$ packed form
5253B478P217O617m419n504k988j455j3522O131k069J5779O519n449r12q991j8726
5238a9294N650J2235M459l144j1098N905P798M104l24J0672K994j1223j0080J1075
5224I729n401p416j5541j2273R854Q753L226K3707o544j8268q429j206J3364K339
5210d106n251J3747K765n692j5081M540m418j3466J8827K821J929k310m645j477
5196a1817L65L724O923j378j2970m157R165N20m223p97J9775q73j6069J0309J4716
5181A3213o389j414J7816j213j8562j2077p046N75Q241K4654L319j1814L195j1408
5167A090M236l803j996n666q282Q158Q71q468M350J4198n283j4498o141K6900
5153E666J654k470N527J0832m573n864J096j2824l670l943J4947J6438k661j2724
$$ plain form
5139 7431 3025 4340 -12548 -21275 -35023 -23022 -10700 -7718 -903 5972 1347 -704 -5975 -15238
5125 -15238 -19196 -14855 -1046 5673 4314 -1778 -5594 -9833 -21583 -23800 -15165 -12843 -3414 -1103
5111 -1103 8481 3233 6590 4343 -6581 -20941 -4862 -4619 -10017 -18115 -22850 -18195 -13073 -2711
5097 -2711 3322 -3232 -1260 11872 11011 10033 9591 8246 -4423 9777 10675 -13112 -25716 -8292
5083 -8292 9925 2860 5113 6898 -2318 -219 -4655 -9524 -6316 -4308 5632 17478 13145 -1825
5069 -1825 -7279 -4380 -19286 -16993 -14598 -16078 -9701 -10625 -27820 -27148 -4717 10484 2366 -2420
5055 -2420 -3051 8936 14316 4847 7379 14683 5789 2451 7023 3650 -8472 -19679 -25297 -14608
5041 -14608 -14396 -11522 3780 16523 6084 -11966 -8841 -5989 -16098 -11717 -8179 -6192 -16439
$$ packed form
5139G431m406J315j6888q727j3748J2001J2322K982O815O875m625k051n271r263
5125a5238l958M341J3809O719j359o092l816m239j1750k217Q635K322R429K311
5111a103R584n248L357k247j0924j4360J6079K43n398q098m735M655N122J0362
5097b711O033o554J972J3132q61r78m42j345j2669J4200Q98k3787j2604J7424
5083h292J8217p065K253J785r216K099m436m869L208K008R940J1846m333j4970
5069a825n454K899j4906K293K395j480O377r24j7195O72K2431J5201q118m786
5055b420o31J1987N380r469K532P304q894l338M572l373j2122j1207n618J0689
5041a4608K12K874J5302J2743j0439j8050L125K852j0109M381L538J987j0247
$$ plain form
5028 -16439 -20268 -1209 4256 23833 15940 -4328 -19205 -11625 4330 1501 -10412 -20019 -34202
5015 -34202 -33206 -28207 -3873 16215 8436 1364 18103 8794 -13474 -17912 -11155 3466 1907 7369
5001 7369 -1467 -16898 -3535 10489 2885 -14129 -21260 -16984 -7637 -8948 -8508 2547 2007 -5322
4987 -5322 -5499 -6218 1824 4610 -11840 -17796 -7218 -4302 -13225 -11369 -12408 5042 7834 1567 -3491
4972 -3491 -26224 -34823 -17864 -3885 606 918 7815 10551 21962 17896 9125 7298 11764 9701
4958 9701 -220 -5892 7610 10747 9082 -9105 -32138 -31171 -32254 -37805 -24110 2906 8038 14722
4944 14722 8638 -10372 -18314 -24153 -23194 -24464 -12276 1392 -919 -19153 -12851 1936 5360 12906
4930 12906 17112 9527 1946 5798 6967 847 -1006 3512 -4833 -6617 -4567 -510 -4999 -16148
$$ packed form
5028a6439l829J9059N465J9577p893k0268j4877P580J5955k829j1913r607j4183
5015c4202R96M999K4334K0088p779p072J6739r309k2268m438O757J4621j559N462
5001G369q836j5431J3363J4024p604j7014p131M276R347j311M40J1055n40p329
4987e322j77p19Q042K786j6450n956J0578K916q923J856j039J7450K792o267n058
4972c491k2733q599J6959J3979M491L12O897K736J1411m066q771j827M466k063
4958I701r921n672J3502L137j665j8187k3033R67j083n551J3695K7016N132O684
4944A4722o084j9010p942n839R59j270J2188J3668k311j8234O302J4787L424P546
4930A2906M206p585p581L852J169o120j853M518q345j784K050M057m489j1149
$$ plain form
4916 -16148 -27973 -42451 -50215 -38534 -36876 -36851 -27665 -21936 -12873 7286 12399 -384 -8191 2766
4902 2766 -7031 -10782 -4501 -7666 -10565 -8066 -8305 -12142 -18231 -16607 -7508 9805 19716 18499 18922
4887 18922 15259 13306 12951 4908 -4363 -7670 -2239 -586 -2291 -9045 -1809 -8212 -13870 -23257 -11668
4872 -11668 12558 5086 -2320 7086 5130 -2402 -11368 -6574 5982 8862 7821 -803 -9594 -6696
4858 -6696 -8947 -8234 -21233 -29783 -33134 -26915 -21111 -22543 -20197 -16527 -7538 -11502 -24024 -21384 -12748
4843 -12748 -17038 -28985 -28862 -25946 -22091 -15813 -23614 -31202 -22849 2998 10429 11678 6763 2980
4829 2980 1605 -23 -343 5624 1919 -2287 -5697 -2207 -2889 -897 -16781 -20114 -11018 5034 7834
4814 7834 2865 -19830 -38449 -36531 -14475 -58 -17441 -16645 -17947 -18021 1532 5315 2683 7748
$$ packed form
4916a6148j1825j4478p764J1681J658K5R186N729R063K0159N113j2783p807J0957
4902B766r797l751O281l165k899K499k39l837o089J624R099J7313R911j217M23
4887A8922l663j953l55q043r271l307N431J653j705o754P236o403n658r387J1589
4872a1668K4226p472p406R406j956p532q966M794J2556K880j041q624q791K898
4858f696k251P13j2999q550l351O219N804j432K346L670Q989l964j2522K640Q636
4843a2748m290j1947J23K916L855O278p801p588Q353K5847P431J249m915l783
4829B980j375j628l20N967l705m206l410L490o82J992j5884l333R096J6052K800
4814G834m969k2695j8619J918K2056J4417j7383P96j302p4J9553L783k632N065
$$ plain form
4800 7748 10343 -3019 -5583 -18438 -27381 -27185 -13336 -171 -13741 -16560 -1246 -210 -10660
4787 -10660 -13079 -2704 -3330 -19780 -19960 -22186 -34233 -38457 -26559 -17024 -15679 -22452 -20707 -8718
4773 -8718 -2104 -12538 -16037 -12553 -7454 -2144 -3577 -7352 3912 1474 -6388 -6243 -2183 972 28
4758 28 -7597 -11112 -6310 7777 10581 18469 22068 20352 9488 9315 11139 5136 980 10973 10667
4743 10667 20018 13308 3971 9297 202 8636 28084 30998 20460 1816 8957 17795 20634 -487
4729 -487 -20623 -18763 -3899 -13889 -16703 -15191 1085 -7090 -15027 -5718 -3377 -10251 -960 -10040
4715 -10040 -21253 -20216 -10407 -18172 -19110 -4048 18819 22384 19144 15417 15302 18071 4382 1624
4701 1624 -8981 -8003 11056 8768 5960 14998 1641 -14876 -10025 -10666 -6722 9188 7719 -14888
$$ packed form
4800G748K595j3362k564j2855q943J96J3849J3165j3570k819J5314J036j0450
4787a0660k419J0375o26j6450j80k226j2047m224J1898R535J345o773J745J1989
4773h718O614j0434l499L484N099N310j433l775J1264k438p862J45M060L155r44
4758B8p625l515M802J4087K804P888L599j716j0864j73J824o003m156R993l06
4743A0667R351o710r337N326r095Q434J9448K914j0538j8644P141Q838K839k1121
4729d87k0136J860J4864r990k814J512J6276q175p937R309K341o874R291r080
4715a0040j1213J037R809p765r38J5062K2867L565l240l727j15K769j3689k758
4701A624j0605R78J9059k288k808R038j3357j6517M851o41L944J5910j469k2607
$$ plain form
4687 -14888 -18939 -12115 -15836 -4526 -12208 -12806 2454 6662 6019 6457 4040 -7971 2053 -3509
4673 -3509 -285 -357 -10783 -6056 -2761 -7516 -8068 7216 14578 12928 4147 -2227 -5494 -4956 -15602
4658 -15602 -12124 -13990 -19365 -10677 -3639 3224 3459 3272 -2451 11544 14014 14595 -4778 -23605 -14695
4643 -14695 -12188 -5396 2011 7650 1754 3732 -7650 -7118 -15292 -24605 -16449 -22451 -5054 8957
4629 8957 16966 12619 -4901 -11043 3505 12547 -8954 3055 -918 -3115 8701 19271 1220
4616 1220 -13543 -18305 -16767 -6888 -2008 -771 2070 -13136 -2008 -1947 -12076 -22734 -13093 -3741
4602 -3741 -15263 -18272 -9573 -3540 8903 13134 13678 -10065 -15959 -13399 -13030 -15512 -22468 -18578 -1203
4587 -1203 6532 8970 8155 11641 2189 -10104 8888 19115 6286 -7525 8883 3236 -2964 -15093
$$ packed form
4687a4888m051O824l721J1310p682n98J5260M208o43M38k417j2011J0024n562
4673c509L224p2j0426M727L295m755n52J5284P362j650q781o374l267N38j0646
4658a5602L478j866n375Q688P038O863K35j87n723J3995K470N81j9373j8827Q910
4643a4695K507O792P407N639n896J978j1382N32q174r313Q156o002J7397J4011
4629H957Q009m347j7520o142J4548R042k1501J2009l973k197J1816J0570j8051
4616A220j4763m762J538R879M880J237K841j5206J1128O1j0129j0658R641R352
4602c741j1522l009Q699O033J2443M231N44k3743n894K560L69k482o956L890J7375
4587a203P735K438q15L486r452j2293J8992J0227j2829j3811J6408n647o200j2129
$$ plain form
4573 -15093 -8918 -12162 -23567 -9136 -77 -6 -10557 -28698 -29038 -22290 -21444 -19591 -890 -1624 -12675
4558 -12675 -9900 -13027 -17138 -5799 2987 4415 6064 17799 13702 -1808 -12195 7681 3445
4545 3445 -9453 -18283 -8097 -14435 -17655 -20289 -19016 -23058 -25413 -22195 -12681 -4032 9173 13137
4531 13137 318 -14553 -33325 -18356 -2581 -7997 -7771 -4340 8473 7571 -705 -453 9987 4096
4517 4096 5819 9772 -2204 1804 7193 5887 342 -5045 -7040 125 9704 6597 -2258 -2695 5976
4502 5976 14045 14022 6459 -3779 -1777 -3872 -9438 -10013 -998 963 11659 19606 3464 -2559 1074
4487 1074 -7685 -12767 -11495 -4990 -16960 -16149 -2097 7798 13881 1198 -7196 -16916 -19865 -11719
4473 -11719 -6850 6822 15218 7056 -5643 -13123 -30080 -21592 -15108 -11428 -21992 -12996 -3499 -14366
$$ packed form
4573a5093O175l244j1405J4431R059P1j0551j8141l40O748Q46J853J8701p34j1051
4558a2675K775l127m111J1339Q786J428J649J1735m097j5510j0387J9876m236
4545C445j2898q830J0186o338l220k634J273m042k355L218R514Q649J3205L964
4531A3137j2819j4871j8772J4969J5775n416K26L431J2813r02q276K52J0440n891
4517D096J723L953j1976M008N389j306n545n387j995P165R579l107q855m37Q671
4502E976Q069k3p563j0238K002k095n566n75R015J961J0696P947j6142o023L633
4487A074q759n082J272O505j1970Q11J4052R895O083j2683q394r720k949Q146
4473a1719M869J3672Q396q162j2699p480j6957Q488O484L680j0564Q996R497j0867
$$ plain form
4459 -14366 -28658 -31709 -30030 -20120 -29986 -39416 -34634 -11527 2973 -5300 -9576 -3526 -12836 -13611
4445 -13611 7373 24406 16711 8196 11284 9143 14653 24171 15012 4500 9032 -6441 -12150 -6354
4431 -6354 -9775 3920 7238 7203 7016 18923 19772 4076 -1653 -4773 201 -4326 -8686 -22470 -21127
4416 -21127 -20186 -16309 -20030 -28686 -26959 -28413 -25430 -17918 -21891 -10826 -15605 -18059 -27720 -20971 -9458
4401 -9458 4063 16142 6737 1808 6702 7627 -123 -10191 -12028 -14691 -9982 812 2492 -6834
4387 -6834 -1967 4550 2614 -9121 -8607 -7651 -9553 13027 20772 2726 -3525 4218 20542 22789
4373 22789 24698 15869 3089 2650 -2957 -4582 -12259 -7670 15791 12223 -13010 -20837 -22385 -16428
4359 -16428 -10255 -20232 -18067 -22616 -17674 899 -4184 -4539 5098 7902 -2281 -2048 8515 11360
$$ packed form
4459a4366j4292l051J679R910r866r430M782K3107J4500q273m276O050r310p75
4445a3611K0984J7033p695q515L088k141N510R518r159j0512M532j5473n709N796
4431f354l421J3695L318l5j87J1907Q49j5696n729l120M974m527m360j3784J343
4416b1127R41L877l721q656J727j454K983P512l973J1065m779k454r661O749J1513
4401i458J3521J2079r405m929M894R25p750j0068j837k663M709J0794J680r326
4387f834M867O517j936j1735N14R56j902K2580P745j8046o251P743J6324K247
4373B2789J909q829j2780m39n607j625p677M589K3461l568k5233p827j548N957
4359a6428O173r977K165m549M942J8573n083l55R637K804j0183K33J0563K845
$$ plain form
4345 11360 9585 3996 5640 10374 8043 3991 -4678 -10041 -14874 -21227 -20332 -8932 -8476 -10238 -1615
4330 -1615 9994 11493 9077 3513 936 8963 4940 819 -5214 -18608 -3709 -8910 3150 8259
4316 8259 924 1348 -7199 -14359 -25007 -12407 -1069 -4093 -21844 -25386 -11648 4240 15957
4303 15957 18125 5100 -17266 -34133 -28245 -4872 2786 2802 -7922 -18597 -13784 -6240 -9417 -23001
4289 -23001 -24946 660 3602 -9696 -6020 -12491 -16422 -8196 -6528 -9356 -14705 -9454 -2632 697
4275 697 -653 3424 2321 -1541 12239 25710 17806 8697 2854 4771 4194 -3065 -6967 -22879 -29042
4260 -29042 -5337 5042 10444 15388 27322 30319 2835 -8920 -12687 -1674 10209 13712 23675
4247 23675 22645 18409 16894 13775 5487 -10679 -12380 610 5679 9668 127 -12832 -16132 -11982
$$ packed form
4345A1360j775n589J644M734k331m052q669n363m833o353Q95J1400M56j762Q623
4330a615J1609J499k416n564k577Q027m023m121o033j3394J4899n201J2060N109
4316H259p335M24q547p160j0648J2600J1338l024j7751l542J3738J5888J1717
4303A5957K168j3025k2366j6867N888K3373P658J6j0724j0675M813P544l177j3584
4289b3001j945K5606K942j3298L676o471l931Q226J668k828n349N251O822L329
4275F97j350M077j103l862J3780J3471p904r109n843J917n77p259l902j5912o163
4260b9042K3705J0379N402M944J1934K997k7484j1755l767J1013J1883L503R963
4247B3675j030m236j515l119q288j6166j701J2990N069L989r541j2959l300M150
$$ plain form
4233 -11982 -6110 -8067 8183 4249 -6262 -4543 -2510 11582 16032 -601 -4586 13020 8558
4220 8558 5790 2687 2807 16054 14147 13958 5912 -7269 -18315 -13429 -12226 -14390 -10055 6145
4206 6145 8336 11162 15488 8502 -7733 -8302 7604 8924 -1565 -15331 -3818 -1266 -4511 2131
4192 2131 5669 -8284 -18672 -16694 -16682 -22775 -22107 -14966 -10760 10502 9032 -12459 -4626 4005 5040
4177 5040 -1983 -4448 -4206 2151 2705 11057 12490 13857 22335 26439 17209 11680 5614 11583 14184
4162 14184 4693 5350 9027 22519 37743 37935 15925 8912 -33 346 6015 1971 -8423 2923
4148 2923 2577 -7309 -13487 -8541 -12142 -20357 -19131 -15849 7757 12264 14446 19085 4550 -10190
4134 -10190 -22938 -26964 -35396 -34674 -20366 -10420 -7943 -10868 -10256 4176 16390 7633 6244 11372
$$ packed form
4233a1982N872j957J6250l934j0511J719K033J4092M450j6633l985J7606m462
4220H558k768l103J20J3247j907j89q046j3181j1046M886J203k164M335J6200
4206F145K191K826M326o986j6235n69J5906J320j0489j3766J1513K552l245O642
4192B131L538j3953j0388J978J2o093O68P141M206K1262j470k1491P833Q631J035
4177E040p023k465K42O357N54Q352J433J367Q478M104r230n529o066N969K601
4162A4184r491O57L677J3492J5224J92k2010p013q945L79N669m044j0394J1346
4148B923l46r886o178M946l601q215J226L282K3606M507K182M639j4535j4740
4134a0190j2748m026q432P22J4308R946K477k925O12J4432J2214q757j389N128
$$ plain form
4120 11372 17807 4597 -2741 15848 11291 -10708 -19979 -6216 7229 12554 10169 1640 -6569
4107 -6569 -7862 -6659 -7592 -5725 -5608 -10600 -19370 -22880 -12138 -20276 -21637 -26563 -25558 -21825 -11162
4092 -11162 1677 25527 27661 27340 15775 4865 9204 10752 12595 11908 1695 13848 23372 16360
4078 16360 7474 18644 11048 13031 4628 -5737 -14290 -1691 8261 11481 -6902 -19372 -10336
4065 -10336 5613 5919 6639 7999 11859 14117 16590 14758 15028 25314 22275 25299 23040 25487 14316
4050 14316 -10967 -12900 -7228 8779 9506 8025 14879 20959 19006 6423 4094 2343 -15764 -20957
4036 -20957 -4107 91 -6408 -2936 1596 10047 17666 5102 -13190 -9095 -6258 -9983 -5666 -4725
4022 -4725 -9542 -20411 -23693 -13715 -6616 4971 -1100 -3609 2356 3299 9854 21599 10323 7232
$$ packed form
4120A1372O435j3210p338J8589m557k1999r271J3763J3445N325k385q529q209
4107f569j293J203r33J867J17m992q770l510J0742q138j361m926J005L733J0663
4092a1162J2839K3850K134l21j1565j0910M339J548J843o87j0213J2153R524p012
4078A6360q886J1170p596J983q403j0365q553J2599R952L220j8383j2470R036
4065a0336J5949L06P20J360L860K258K473j832K70J0286l039L024k259K447j1171
4050A4316k5283j933N672J6007P27j481O854O080j953j2583k329j751j8107n193
4036b0957J6850M198o499L472M532Q451P619j2564j8292M095K837l725M317R41
4022d725m817j0869l282R978P099J1587o071k509N965R43O555J1745j1276l091
$$ plain form
4008 7232 -6392 -6521 3993 8244 15830 18566 15295 20314 -2355 -14658 -7482 3643 5604 2771
3994 2771 8896 -2063 -9143 -6671 -8675 -5641 9370 4597 -8553 -8278 -8879 -5625 9230 10572
3980 10572 9744 18548 30004 20458 14760 10932 17118 27137 14493 17633 19855 29022 40914 17574
3966 17574 19849 18667 -1750 -20343 -15734 -16371 -9895 6526 128 -4938 -4761 10469 10520 -1056
3952 -1056 4057 -1480 -1031 3221 6262 11027 17357 29543 13753 8164 -8764 -7264 -10279 -16732
3938 -16732 -11493 -6702 -5097 -11079 -12702 -2428 3807 -447 6280 -15290 -28546 -31492 -27804 -39066
3924 -39066 -41872 -37549 -34999 -35381 -33093 -11072 -1688 11639 11537 -8602 -16912 -5885 2639 11927
3910 11927 15410 22086 8214 3403 1265 4543 -9437 -20462 -12811 -1466 15085 16521 15179
$$ packed form
4008G232j3624j29J0514M251P586K736l271N019k2669j2303P176J1125J961k833
3994B771O125j0959p080K472k004L034J5011m773j3150K75o01L254J4855J342
3980A0572q28Q804J1456r546n698l828O186J0019j2644L140K222R167J1892k3340
3966A7574K275j182k0417j8593M609o37O476J6421o398n066J77J5230N1j1576
3952a056N113n537M49M252L041M765O330J2186j5790n589j6928J500l015o453
3938a6732N239M791J605n982j623J0274O235m254O727k1570j3256k946L688j1262
3924c9066k806M323K550l82K288K2021R384J3327j02k0139q310J1027Q524R288
3910A1927L483O676j3872m811k138L278j3980j1025P651J1345J6551J436j342
$$ plain form
3897 15179 15284 6297 2053 3317 -638 -13671 -11162 1153 3543 -1576 -1479 -2028 -13008 -14645 -21702
3882 -21702 -30429 -18788 -18290 -14905 -19438 -32250 -40428 -33850 -15438 -7489 -2935 -8649 -17266 -19815
3868 -19815 -3991 1580 -2648 -8934 -7837 -5844 -15754 -20085 -22393 -22913 -14109 -10337 -15783 -15782 -5242
3853 -5242 6143 14468 18634 15573 532 -20232 -6328 14310 10413 2280 -8448 -12612 -8275
3840 -8275 -9205 -5970 -2025 -1184 -2955 2225 9708 -5301 -12074 -13951 -3416 8166 360 -17826
3826 -17826 -15294 363 5132 5780 5667 8069 9744 19249 19343 10415 -2293 -1781 920 8080 11668
3811 11668 11733 -4606 -17939 -6923 9830 17030 8955 5780 -538 10853 16341 9495 14245 9522
3797 9522 -3595 -17566 -14862 -3619 -2260 -12989 -20431 -23152 -8331 -6256 -15686 -12651 3035
$$ packed form
3897A5179J05q987m244J264l955j3033K509J2315K390n119R7n49j0980j637p057
3882b1702q727J1641M98L385m533j2812q178O578J8412P949M554n714q617k549
3868a9815J5824N571m228o286J097J993r910m331k308n20Q804L772n446JJ0540
3853e242J1385Q325M166l061j5041k0764J3904K0638l897q133j0728m164M337
3840h275r30L235L945Q41j771N180P483j5009o773j877J0535J1582p806j8186
3826a7826K532J5657M769O48j13K402J675R505R4q928j2708N12K701P160L588
3811A1668O5j6339j3333J1016J6753P200q075l175o318J1391N488o846M750m723
3797I522j3117j3971K704J1243J359j0729p442k721J4821K075r430L035J5686
$$ plain form
3784 3035 3208 -11672 -10186 -10070 -11969 -11082 10922 20824 3291 -8005 -2197 -16212 -23606 -25708
3770 -25708 -27862 -21110 -4248 5469 11400 -5368 -6555 -459 6125 1375 6063 14302 12972 7809
3756 7809 1876 -9670 -10625 -17469 -18391 -14096 5305 681 5709 8995 -3449 -9411 -2413 -8648 -11431
3741 -11431 3795 -3793 -11189 -1915 -7362 -11265 -21589 -10141 -621 -1863 -1721 -8850 -4432 -12339
3727 -12339 -5402 8609 1182 -16258 -16748 -12204 -2394 14895 10419 3808 211 -2336 9523 18592
3713 18592 22312 31465 26326 15203 -6026 -3999 -3396 -9269 -22017 -26015 -32837 -20987 -25470 -20279
3699 -20279 -2884 8852 21785 20968 7314 50 -7975 -16371 -10632 -11540 -1765 -6523 -20567 -12687
3685 -12687 2812 5837 17461 20242 8197 -14070 -10331 -737 -984 277 7621 14210 9889 3653
$$ packed form
3784C035J73j4880J486J16j899Q87K2004R902j7533j1296N808j4015p394k102
3770b5708k154O752J6862R717N931j6768j187O096O584m750M688Q239j330n163
3756G809n933j1546r55o844r22M295J9401m624N028L286j2444n962O998o235k783
3741a1431J5226p588p396R274n447l903j0324J1448R520j242J42p129M418p907
3727a2339O937J4011p427j7440m90M544R810J7289m476o611l597k547J1859R069
3713A8592L720R153n139j1123k1229K027O03n873j2748l998o822J1850m483N191
3699b0279J7395J1736J2933q17j3654p264q025q396N739r08R775m758j4044P880
3685a2687J5499L025J1624K781j2045k2267L739R594k47J261P344O589m321o236
$$ plain form
3671 3653 -2130 -4615 -369 -165 -7888 5346 5660 -7609 279 12694 9803 5268 -6424 -2627
3657 -2627 6164 -518 -8207 -2510 882 8606 -8612 -13638 -25679 -30295 -25914 -22872 -22938 -24157 -15894
3642 -15894 -13182 -16975 -15315 3608 6937 -6992 -5782 -10940 -9094 -12652 -9097 -1899 3634 648
3628 648 -412 -2049 -4370 -1753 2436 11847 7724 -6077 -12281 -5070 5334 5800 14532 20640 7583
3613 7583 -15771 -11651 -8772 -5287 -7227 -19690 -7121 3595 11873 10603 7994 901 -11719 1316
3599 1316 5408 -13463 -21175 -18336 -16550 -18506 -20594 -5014 -1599 -3005 -2630 1696 5918 3384 -6573
3584 -6573 -17979 -15253 -7975 -12343 -19127 -9384 -14912 -5089 -12772 -19367 -19709 -13298 -10014 -11584 3569
3569 3569 -347 -11709 -23240 -20165 -3984 11690 9728 -1994 -10364 -27265 -38105 -32294 -11273
$$ packed form
3671C653n783k485M246K04p723J3234L14j3269P888J2415k891m535j1692L797
3657b627Q791o682p689N697L392P724j7218n026j2041m616M381L042o6j219Q263
3642a5894K712l793J660J8923L329j3929J210n158J846l558L555P198N533k986
3628F48j060j637k321K617M189R411m123j3801o204P211J0404M66Q732O108j3057
3613G583k3354M120K879L485j940j2463J2569J0716Q278j270k609p093j2620J3035
3599A316M092j8871p712K839J786j956k088J5580L415j406L75M326M222k534r957
3584f573j1406K726P278m368o784R743n528R823p683o595l42O411L284j570J5153
3569C569l916j1362j1531L075J6181J5674j962j1722q370j6901j0840N811K1021
$$ plain form
3556 -11273 -9965 -7155 -4043 -785 -3844 -1442 -9297 -14185 -4793 3530 -4378 4357 14197 19869 17725
3541 17725 19022 15576 17174 9132 16467 8417 4142 9750 4914 -16820 -24871 -28126 -22814 -6013
3527 -6013 -14420 -17761 -19196 -5905 11213 10311 5592 -1872 -4672 -5975 -5263 -4103 12122 9864 -477
3512 -477 554 3353 8262 19536 15650 3208 21738 21888 6675 -1619 -5451 -5172 -11234 9324
3498 9324 12223 15502 10024 6242 6128 3782 5428 -3431 -5069 -2343 -10642 -12344 -6725 -26601 -35852
3483 -35852 -14734 -6374 -15279 -21302 -24027 -16575 -13233 3185 -4174 -13065 -21209 -16567 -10099 -8047
3469 -8047 -8540 -496 514 2925 7305 -4177 -8691 -1285 1647 -3213 -14933 -10358 -9313 -2277 -12571
3454 -12571 -18979 -30885 -24743 -16398 -22134 -29106 -24714 -27184 -19062 -5886 -5132 -13720 -7259 -10494
$$ packed form
3556a1273J308K810L112L258l059K402p855m888R392Q323p908Q735R840N672k144
3541A7725J297l446J598q042P335q050m275N608m836k1734q051l255N312J6801
3527f013q407l341j435J3291J7118r02m719p464k800j303P12J160J6225k258j0341
3512d77J031K799M909J1274l886j2442J8530J50j5213q294l832K79o062K0558
3498I324K899L279n478l782j14k346J646q859j638K726q299j702N619j9876r251
3483c5852K1118Q360q905o023k725P452L342J6418p359q891q144M642O468K052
3469h047m93Q044J010K411M380j1482m514P406K932m860j1720M575J045P036j0294
3454a2571o408j1906O142Q345n736o972M392k470Q122J3176P54q588O461l235
$$ plain form
3440 -10494 -24406 -26286 -17095 3525 18584 13241 -20354 -31915 -19203 -18730 -7431 -6193 -8562
3427 -8562 -11850 -6770 -12476 -21599 -25230 -24611 -11414 6951 14306 8236 338 -5114 -12157 -27362
3413 -27362 -15911 -17430 8539 16520 1913 -6003 -4637 -12257 -13344 -789 1442 1042 10681 19834
3399 19834 16661 4148 -1037 3604 6595 881 -2198 5934 12170 9373 6068 7265 3149 483
3385 483 4460 -6915 -30240 -21709 -10182 -13837 -475 5299 15674 22055 32545 21931 13056
3372 13056 -3281 -16110 -22364 -29644 -31623 -35051 -36091 -20632 -12721 -17761 -16382 -12160 5000 9788
3358 9788 6751 -775 -14393 -18933 -10668 325 -4886 6298 5829 6401 -452 1612 3194 -4637 -25450
3343 -25450 -12372 -1843 1676 -13923 -23473 -24148 -13354 -5631 -5766 -1999 3956 4659 9649 11153
$$ packed form
3440a0494j3912j880R191K0620J5059n343l3595j1561J2712M73J1299J238k369
3427h562l288N080n706r123l631O19J3197J8365P355o070p898n452p043j5205
3413b7362J1451j519K5969P981j4607p916J366p620j087J2555K231m00R639R153
3399A9834l173j2513n185M641K991n714l079Q132O236k797l305J197m116k666
3385D83L977j1375k3325Q531J1527l655J3362N774J0375O381J0490j0614q875
3372A3056j6337j2829o254p280j979l428j040J5459P911n040J379M222J7160M788
3358I788l037p526j3618m540Q265J0993n211J1184m69N72o853K064J582p831k0813
3343b5450J3078J0529L519j5599r550o75J0794P723j35L767N955P03M990J504
$$ plain form
3329 11153 2985 6888 5518 -6012 -3411 1758 19061 22830 13284 3958 433 1681 9969 16803
3315 16803 22540 18210 11922 15139 403 6859 32777 43311 39539 23975 26455 29076 29526 31355
3301 31355 20905 4053 -2231 -4192 -21129 -34301 -11339 -1017 -1670 8572 9650 5786 -183
3288 -183 6421 21205 18769 14008 8109 20328 30466 13143 3774 8355 13101 18085 5290 -9612
3274 -9612 -20566 -13493 -3124 490 12533 19854 16502 10228 5873 -8412 -22766 -21518 -3477
3261 -3477 12296 -851 1775 9945 6074 565 -10660 -13754 -3506 3174 -3736 -6967 1825 5254
3247 5254 -10465 -11268 189 -13812 -21695 -10810 -3541 -3086 -11710 -5251 -4226 3482 1315 -1636
3233 -1636 -15020 -23054 -13749 -4968 -10986 -15983 -5423 6345 12060 12648 20516 16383 -6860 -10668
$$ packed form
3329A1153q168L903j370j1530K601N169J7303L769r546r326l525J248Q288O834
3315A6803N737m330o288L217j4736O456K5918J0534l772j5564K480K621M50J829
3301C1355j0450j6852o284j961j6937j3172K2962J0322o53J0242J078l864n969
3288a83O604J4784k436m761n899J2219J0138j7323r369M581M746M984j2795j4902
3274i612j0954P073J0369L614J2043P321l352o274m355j4285j4354J248J8041
3261c477J5773j3147K626Q170l871n509j1225l094J0248O680o910l231Q792L429
3247E254j5719q03J1457j4001p883J0885P269M55q624O459J025P708k167k951
3233a636j3384q034R305Q781o018m997J0560J1768N715N88P868m133k3243l808
$$ plain form
3219 -10668 -4750 -5211 -2032 6689 7442 5451 -533 -4130 -4477 -3388 4644 -1722 6946 14060 20219
3204 20219 13330 13092 14892 21427 4253 -8151 -4592 -1735 2143 4867 5922 10280 8112 7581 6329
3189 6329 19504 37107 40905 34752 25676 21080 3939 1412 22801 26235 15814 -763 462
3176 462 -1112 4266 17297 23505 23617 20748 3140 -14534 -13214 -19452 -22297 -13633 1363 4372
3162 4372 -2137 -9021 -13946 1712 5993 2683 16517 12474 -6635 -7370 1644 -13117 -24688 -15966
3148 -15966 4480 13878 5534 1332 -6361 -24199 -16641 -2877 -2846 -3560 -6693 -19077 -23891 -19567
3134 -19567 -16559 2851 2392 -2998 4969 8131 11797 15822 12273 170 -9001 -14662 -5083 9047
3120 9047 6548 7341 -5363 -17170 -22437 -20139 -19280 -20889 -12105 -5796 2516 5015 9588 1042 -1956
$$ packed form
3219a0668N918m61L179Q721P53j991n984l597l47J089Q032o366Q668P114O159
3204B0219o889k38J800O535j7174j2404L559K857L878K724J055M358k168n31j252
3189F329J3175J7603L798o153r076m596j7141k527K1389L434j0421j6577J225
3176D62j574N378J3031O208J12k869j7608j7674J320o238k845Q664J4996L009
3162D372o509o884m925J5658M281l310J3834m043j9109p35R014j4761j1571Q722
3148a5966K0446R398q344m202p693j7838P558J3764L1p14l133j2384m814M324
3134a9567L008J9410m59n390P967L162L666M025l549j2103r171n661R579J4130
3120I047k499P93j2704j1807n267K298Q59j609Q784O309Q312K499M573q546k998
$$ plain form
3105 -1956 -5803 -5921 -3640 4247 2484 7239 1901 -2459 -8285 -3946 -8584 -15402 -12015 5527 4653
3090 4653 -10926 -17415 -23051 -18665 -11776 -30476 -39345 -20513 -8098 958 17748 18164 17246 16664
3076 16664 -92 -16344 -11445 -18024 -26080 -37916 -50360 -45244 -21664 -4826 -13927 -20299 -14380
3063 -14380 -12127 -8487 -12939 -4931 3970 -7218 -12515 -8605 -12228 -21288 -28670 -15325 -10669 -1985
3049 -1985 -5777 1577 10721 -550 -15914 -15964 -1310 -4976 742 11029 4896 -5964 11489 9247
3035 9247 -645 -8194 -11393 1786 -9788 -10750 -9587 -14560 -21627 -14515 -14650 -19292 -1139 9069
3021 9069 -2738 -15192 -18143 -23079 -26327 -28921 -27822 -29554 -31288 -24627 -14283 -6302 -19029 -33405
3007 -33405 -17829 -15524 -12489 -16715 -6953 -5008 -1209 1953 12194 9100 10269 12269 9167 3354
$$ packed form
3105a956l847j18K281P887j763M755n338m360n826M339m638o818L387J7542q74
3090D653j5579o489n636M386O889j8700q869J8832J2415R056J6790M16r18n82
3076A6664j6756j6252M899o579q056j1836j2444N116K3580J6838r101o372N919
3063a4380K253L640m452Q008Q901j1188n297L910l623r060p382J3345M656Q684
3049a985l792P354R144j1271j5364n0J4654l666N718J0287o133j0860J7453k242
3035I247r892p549l199J3179j1574r62J163m973p067P112j35m642J8153J0208
3021I069j1807j2454k951m936l248k594J099j732j734O661J0344P981j2727j4376
3007c3405J5576K305L035m226R762J945L799L162J0241l094J169K000l102n813
$$ plain form
2993 3354 1695 8322 8395 4648 -3749 -11911 -9345 -9712 -3504 647 -9809 -17011 -15048 -10370 4376
2978 4376 2350 6308 -229 1428 -3515 -15879 -22471 -22002 -25063 -25580 -25506 -21371 -14218 -10942 -12358 -16645
2962 -16645 -15384 -16650 -16505 -14326 2442 12268 7738 -6584 -8557 -9781 -13443 -18402 -13691 -5535
2948 -5535 8738 21145 16873 6246 10113 13579 6091 16018 16378 5410 -1060 654 6283 14902
2934 14902 5738 -8457 -11104 -16506 -21946 -12127 1912 4663 -8493 -746 5671 5254 -243 1862
2920 1862 2053 -530 6061 3621 2949 10755 2351 2289 13354 6636 7350 10763 4002 -6688 -3681 9538
2904 9538 25389 12935 -9775 -26705 -28653 -6300 2678 7132 3795 -10118 -18887 -18098 -7614
2891 -7614 16570 28818 28101 1598 -13252 -15481 226 15585 1352 824 -4698 -6080 11421
$$ packed form
2993C354j659O627P3l747q397q162K566l67O208M151j0456p202J963M678J4746
2978D376k026L958o537J657m943j2364o592M69l061n17P4M135P153L276j416m287
2962a6645J261j266J45K179J6768R826m530j4322j973j224l662m959M711Q156
2948e535J4273J2407m272j0627L867L466p488R927L60j0968o470J714N629Q619
2934A4902r164j4195k647n402n440R819J4039K751j3156P747O417m17n497K105
2920A862J91k583O591k440o72P806q404o2J1065o718P14L413o761j0690L007J3219
2904I538J5851j2454k2710j6930j948K2353Q978M454l337j3913q769P89J0484
2891g614K4184J2248p17k6503j4850k229J5707J5359j4233n28n522j382J7501
$$ plain form
2878 11421 15102 11681 2938 1883 3869 10888 24966 43085 41302 26066 33002 49973 43520 34954
2864 34954 26179 12101 11546 16296 6840 4811 6207 11118 15947 13624 16065 2478 -12089 2023
2850 2023 11150 1431 -9019 -13274 -5518 4700 -65 -662 -726 7631 17664 16802 16148 13665 21583
2835 21583 21460 20021 33448 30362 25342 6990 4970 -5745 -12156 -19049 -15879 -23418 -22248 -13054
2821 -13054 -16085 -17136 589 13879 13385 27693 40472 33969 29041 16329 929 -778 7660
2808 7660 -1933 2289 14011 25455 15019 6387 254 11891 6479 -6984 -10129 3987 19247
2795 19247 8806 1301 -4336 -12423 -20398 -22916 -25523 -6009 3140 12175 11316 8739 19656 11825
2781 11825 -4671 -12090 -50 24200 33499 16725 6583 7736 13748 17791 8336 4874 -3043
$$ packed form
2878A1421L681l421q743j055J986P019J4078J8119j783j5236O936J6971o453q566
2864C4954q775j4078n55M750r456k029J396M911M829k323K441j3587j4567J4112
2850B023R127r719j0450m255P756J0218m765n97o4Q357J0033q62o54k483P918
2835B1583j23j439J3427l086n020j8352k020j0715o411o893L170p539J170R194
2821a3054l031j051J7725J3290m94J4308J2779o503m928j2712j5400j707Q438
2808G660r593M222J1722J1444j0436q632o133J1637n412j3463l145J4116J5260
2795A9247j0441p505n637q087p975k518k607J9514R149R035q59k577J0917p831
2781A1825j6496p419J2040K4250R299j6774j0142J153O012M043r455l462p917
$$ plain form
2768 -3043 -18347 -12363 -2420 -2917 -10768 -17751 -8925 -10769 -18679 -4539 10514 15016 944 -7031
2754 -7031 3644 -1033 -7798 -15175 -21280 -21825 -12698 -7366 1367 2176 13710 3701 1450 -2652 -7124
2739 -7124 -9815 -11803 -4300 3182 8448 7267 -4099 -6110 -6382 -15447 -24950 -22797 -30389 -28606 -14800
2724 -14800 -9236 -6180 -4568 -8836 6414 16433 -546 -21537 -14716 -14824 -13860 532 496 -6614
2710 -6614 2171 -3881 -10520 -6541 -14126 -11239 -27566 -40886 -34205 -19387 -615 44 -4518 -4311
2696 -4311 -543 1541 -3627 -24294 -24038 -17619 -568 18426 13063 5005 7969 13392 10665 19879
2682 19879 8136 -7451 -11673 -11218 -21413 -15636 -2878 9621 4077 12780 8539 20092 15386
2669 15386 3174 5617 17833 23531 26431 16203 13736 19698 9306 -9978 -32066 -36925 -28895
$$ packed form
2768c043j5304N984R943m97p851o983Q826j844p910J4140J5053M502j4072p975
2754g031J0675m677o765p377o105n45R127N332Q733Q09J1534j0009k251m102m472
2739g124k691j988P503P482N266j181j1366k011k72r065r503K153p592J783J3806
2724a4800N564L056J612m268J5250J0019j6979k0991O821j08R64J4392l6p110
2710f614Q785o052o639L979p585K887j6327j3320O681J4818J8772O59m562K07
2696d311L768K084n168k0667K56O419J7051J8994n363q058K964N423k727R214
2682A9879j1743j5587m222M55j0195N777J2758J2499n544Q703m241J1553m706
2669A5386j2212K443J2216N698K900j0228k467N962j0392j9284k2088m859Q030
$$ plain form
2656 -28895 -12935 -16404 -16291 -6896 -3450 -2046 13297 23432 7504 -10336 -17714 -15108 -16261 -12364
2642 -12364 -3911 3739 9954 13714 10362 9682 2280 -6648 -14365 -19359 -16841 -17462 -8155 4206 -3429
2627 -3429 -4558 -6465 -8086 798 7681 16225 9613 1727 -16081 -13745 1619 -5452 -10215 -12333
2613 -12333 -7160 -18235 -23327 -2344 14153 15 -27508 -19347 -14275 -4279 -8287 -11681 -11717 -16961
2599 -16961 -20518 -34510 -39819 -26153 -7406 4285 16186 21257 22016 16527 5716 -7043 -8114
2586 -8114 -4028 1235 -12409 -21198 -13669 -19733 -18855 -18741 -6718 -6284 -10487 -16471 -17122 -18734 -17715
2571 -17715 -6607 -6979 -2494 -1952 8876 888 -4020 -8451 -8862 -10199 -15230 -12793 -9351 -7525 3718
2556 3718 -603 -9763 -4137 3903 14334 13290 9416 5333 5332 15086 19681 701 -6736 -4281 18119
$$ packed form
2656b8895J5960l469J13R395L446J404J5343J0135j5928j7840p378K606j153L897
2642a2364Q453P650O215L760l352o80p402q928p717m994K518o21R307J2361p635
2627c429j129j907j621Q884O883Q544o612p886j7808K336J5364p071m763k118
2613a2333N173j1075n092K0983J6497j4138k7523Q161N072R996m008l394l6n244
2599a6961l557j3992n309J3666J8747J1691J1901N071P59n489j0811j2759j071
2586h114M086N263j3644q789P529o064Q78J14J2023M34m203n984o51j612J019
2571a7715J1108l72M485N42J0828p988m908m431m11j337n031K437L442J826J1243
2556C718m321r160N626Q040J0431j044l874m083jR754M595j8980p437K455K2400
$$ plain form
2541 18119 30873 29914 16829 9201 9093 17477 5391 9364 17678 21352 7162 -10506 -11994 6800
2527 6800 13566 10398 -1895 1040 1818 -7883 -19049 -19625 -21426 -20024 -91 6118 -8239 -2794
2513 -2794 -12802 -9223 -3023 -7615 -13989 -17758 -13029 2904 -4537 -14296 -17226 -10098 -7791 -4297
2499 -4297 -12934 -20539 -13775 -19085 -15398 -6369 -5206 3424 -3844 -7239 6353 -2101 -646 -1441 -17637
2484 -17637 -25980 -25736 -26237 -17265 -15484 -24727 -17554 -2613 4628 10359 3060 -17392 -8841 1258
2470 1258 2388 1499 -463 279 -10826 -10193 1210 -6982 -11385 -15546 -16259 -8115 -8624 -19268 -14478
2455 -14478 -6776 -7512 -8030 -10589 -11119 -6163 5770 15222 11876 17562 10459 5362 5870 -9619 -25043
2440 -25043 -23013 -27877 -30312 -33402 -16463 544 6139 14214 -12078 -27526 -21972 -20632 -21680 5180
$$ packed form
2541A8119J2754r59j3085p628j08Q384j2086L973Q314L674j4190j7668j488J8794
2527F800O766l168j2293K935P78r701j1166n76j801J402J9933O209j4357N445
2513b794j0008L579O200m592o374l769M729J5933p441r759k930P128K307L494
2499d297q637p605O764n310L687R029J163Q630p268l395J3592q454J455p95j6196
2484a7637q343K44n01Q972J781r243P173J4941P241N731p299k0452Q551J0099
2470A258J130q89j962P42j1105O33J1403q192m403m161p13Q144n09j0644M790
2455a4478P702p36n18k559n30M956J1933R452l346N686p103n097N08j5489j5424
2440b5043K030m864k435l090J6939J7007N595Q075k6292j5448N554J340j048K6860
$$ plain form
2426 5180 5918 9116 26791 25673 5441 -3760 -12433 -18476 -11627 1634 3725 -9615 -26730 -22381
2412 -22381 -495 9599 7825 3867 -6390 -17670 -10832 -14898 -7610 2811 3441 12 518 1152
2398 1152 -14283 -10108 -2905 47 6093 -720 -1339 10373 1110 -16078 -19029 -10669 1547 4917
2384 4917 -4518 -17223 -16197 -17657 -9655 -13471 -16997 -15460 -7019 1211 -6724 -8205 3271 4048 9573
2369 9573 11445 -898 10623 34948 26845 2880 4281 11656 7586 9937 7217 -3712 -6182 7396
2355 7396 7239 -6805 -12588 -14059 -3240 -6263 -52 1814 -8925 -10808 -13157 -20437 -19589 -13975 -11766
2340 -11766 1092 -1391 -4053 2456 7655 -4811 -8140 -5981 8376 13954 9020 4715 -7146 -13891
2326 -13891 -16404 -8772 -3649 -5025 -1929 -3090 -17490 -12672 -12034 -3734 5735 8166 -10558 -7563
$$ packed form
2426E180P38L198J7675j118k0232r201q673o043O849J3261K091j3340j7115M349
2412b2381K1886J0094j774l958j0257j1280O838m066P288J0421O30l429N06O34
2398A152j5435M175P203K952O046o813o19J1712r263j7188k951Q360J2216L370
2384D917r435j2705J026j460Q002l816l526J537Q441Q230p935j481J1476P77N525
2369I573J872j2343J1521K4325q103k3965J401P375m070K351k720j0929k470J3578
2355G396j57j4044n783j471J0819l023O211J866j0739j883k349p280Q48N614K209
2340a1766J2858k483k662O509N199j2466l329K159J4357N578m934m305j1861o745
2326a3891k513P632N123j376L096j161j4400M818O38Q300R469K431j8724K995
$$ plain form
2312 -7563 -20 -6185 -7420 -7624 6036 13260 4903 -8720 -21635 -7535 5994 -1541 2509 8492
2298 8492 10617 4289 -9289 -2511 14981 16108 10379 16468 15376 12062 4871 -671 -1727 13485
2284 13485 23820 21821 19808 6090 -10648 -25581 -27839 -14690 -1812 5353 7250 14772 -9592
2271 -9592 -15574 -21041 -27116 -20844 -11651 -9569 -14321 -10809 -5220 -3216 -6094 -12643 -11515 -6634 -426
2256 -426 9679 9322 50 -9881 -26269 -24350 -14412 -3764 -4426 -10954 -7472 -6517 7668 6429 11263
2241 11263 25195 18638 9305 -320 875 -3177 -17313 -19725 -15459 -5324 -6761 -18994 -13635 -4167
2227 -4167 -3298 1347 505 -11450 -14143 -12117 -14154 -15007 -15636 -1505 5213 12131 16733 13458 3938
2212 3938 -152 5622 -3575 -13496 -9491 -1507 -7978 -9315 -18794 -16473 -11127 -12119 5356 25334 33583
$$ packed form
2312g563P543o165j235k04J3660P224q357j3623j2915J4100J3529p535M050N983
2298H492K125o328j3578O778J7492J127n729O089j092l314p191n542j056J5212
2284A3485J0335j999k013j3718j6738j4933k258J3149J2878P165J897P522k4364
2271i592n982n467o075O272R193K082m752L512N589K004k878o549J128M881O208
2256d26J0105l57r272r931j6388J919R938J0648o62o528L482R55J4185j239M834
2241A1263J3932o557r333r625J195m052j4136k412M266J0135j437j2233N359R468
2227d167Q69M645q42j1955k693K026k037q53o29J4131O718O918M602l275r520
2212C938m090N774r197r921M005P984o471j337r479K321N346r92J7475J9978Q249
$$ plain form
2197 33583 29954 19170 11567 11662 16858 -6712 -13413 -17375 -20394 -8468 -2337 -12698 -15562 -7548
2183 -7548 -5554 -6557 -9324 -16141 -9448 5908 15991 28914 20378 5860 2265 13082 4278 -10035
2169 -10035 -14071 -16666 -7743 -7006 -7520 4072 12925 6309 -9666 -10670 -4601 1552 7037 1112 1972
2154 1972 -5183 -1886 5723 -3277 1675 9317 22496 9794 -17681 -18819 -9206 -9077 -13360 -23779
2140 -23779 -12910 -8694 -21934 -17197 -13936 -9365 2749 6883 1795 2282 5096 -250 8441 -416
2126 -416 -363 9825 3865 8106 15035 -3772 -22464 -25452 -14576 -10694 -23673 -19527 -10443 -7473
2112 -7473 -9620 -13390 -9523 4834 8631 12420 6977 -6198 -3220 -9383 -9849 -13877 -21892 -18809 -13754
$$ packed form
2197C3583l629j0784p603R5N196k3570o701l962l019J1926O131j0361k864Q014
2183g548J994j003k767o817O693J5356J0083J2923q536j4518l595J0817q804j4313
2169a0035m036k595Q923P37n14J1592Q853o616j5975j004O069O153N485n925Q60
2154A972p155L297P609r000M952P642J3179j2702k7475j138R613J29m283j0419
2140b3779J0869M216j3240M737L261M571J2114M134n088M87K814n346Q691q857
2126d16N3J0188n960M241O929j8807j8692k988J0876L882j2979M146R084K970
2112g473k147l770L867J4357L797L789n443j3175K978o163m66m028q015L083N055
$$ [...]
##END NTUPLES=NMR SPECTRUM
##END=
