##TITLE=Analysis number 322721
Compound Code cc 27505
Project Code adrs
Chemist Name fudan
##JCAMPDX= 6.0         $$ Bruker NMR JCAMP-DX V2.0
##DATA TYPE= NMR SPECTRUM
##DATA CLASS= NTUPLES
##ORIGIN= Bruker BioSpin GmbH
##OWNER= nmr
$$ XWIN-NMR		Version 3.5
$$ Sat Oct 14 11:07:52 2006 GMT Daylight Time (UT+1h)  MAYBRIDGE\nmr@NMR_250MHZ
##.OBSERVE FREQUENCY= 250.131544655141
##.OBSERVE NUCLEUS= ^1H
##.ACQUISITION MODE= SIMULTANEOUS (DQD)
##.ACQUISITION SCHEME= undefined
##.AVERAGES= 16
##.DIGITISER RES= 18
##SPECTROMETER/DATA SYSTEM= dpx250
##.PULSE SEQUENCE= zg30
##.SOLVENT NAME= CDCl3
##.SHIFT REFERENCE= (INTERNAL, CDCl3, 0, 16.522)
##AUDIT TRAIL= $$ (NUMBER, WHEN, WHO, WHERE, WHAT)
$$ ##TITLE= Audit trail, XWIN-NMR		Version 3.5
$$ ##JCAMPDX= 5.01
$$ ##ORIGIN= Bruker BioSpin GmbH
$$ ##OWNER= nmr
$$ C:\u/data/dgb/nmr/ADRS/270/pdata/1/auditp.txt
$$ ##AUDIT TRAIL=  $$ (NUMBER, WHEN, WHO, WHERE, WHAT)
(   1,<2006-10-14 11:07:29.98 +100>,<MAYBRIDGE\nmr>,<NMR_250MHZ>,
      <created by zg, POWCHK disabled, PULCHK disabled
       configuration hash MD5:
       49 4B E0 1D 92 C2 6B 37 9F E6 65 BC 52 41 86 1D
       data hash MD5: 64K
       FE 0A 27 99 4E 8F 83 39 7B B6 61 CA 19 BB 75 15>)
(   2,<2006-10-14 11:07:43.78 +100>,<MAYBRIDGE\nmr>,<NMR_250MHZ>,
      <Start of raw data processing
       ef LB = 0.3 FT_mod = 6 PKNL = 1 SI = 32K 
       data hash MD5: 32K
       0B F7 5B 3A D2 57 00 44 D6 D8 41 BE 7F 3F C0 A3>)
(   3,<2006-10-14 11:07:45.37 +100>,<MAYBRIDGE\nmr>,<NMR_250MHZ>,
      <apk 
       data hash MD5: 32K
       1A FA 48 BB 02 23 CE 46 51 6E 03 B0 8A 6F 2C 5F>)
(   4,<2006-10-14 11:07:46.20 +100>,<MAYBRIDGE\nmr>,<NMR_250MHZ>,
      <abs ABSG = 5 
       data hash MD5: 32K
       57 E6 D7 4E 92 DA 91 4C C8 AF FB 4F 11 21 E9 8D>)
$$ ##END=
$$ 
$$ hash MD5
$$ 48 08 CB A9 AA 87 2E 6B 7D 75 1B F9 18 60 2C 96
##$RELAX= 
##$RELAX= 
##$RELAX= 
##$RELAX= 
##$RELAX= 
##$RELAX= 
##$RELAX= 
$$ Bruker specific parameters
$$ --------------------------
##$DU= <C:\u>
##$EXPNO= 270
##$NAME= <ADRS>
##$PROCNO= 1
##$TYPE= <nmr>
##$USER= <dgb>
##$AMP= (0..31)
100 100 100 100 100 100 100 100 100 100 100 100 100 100 100 100 100 100 
100 100 100 100 100 100 100 100 100 100 100 100 100 100 
##$AQSEQ= 0
##$AQ_mod= 3
##$AUNM= <au_zg>
##$AUTOPOS= <4 >
##$BF1= 250.13
##$BF2= 250.13
##$BF3= 250.13
##$BF4= 250.13
##$BF5= 500.13
##$BF6= 500.13
##$BF7= 500.13
##$BF8= 500.13
##$BYTORDA= 1
##$CFDGTYP= 0
##$CFRGTYP= 5
##$CHEMSTR= <none>
##$CNST= (0..31)
1 1 145 1 1 1 1 1 1 1 1 1 1 1 1 1 1 1 1 1 1 1 1 1 1 1 1 1 1 1 1 1 
##$CPDPRG= <>
##$CPDPRG1= <>
##$CPDPRG2= <>
##$CPDPRG3= <>
##$CPDPRG4= <mlev>
##$CPDPRG5= <mlev>
##$CPDPRG6= <mlev>
##$CPDPRG7= <mlev>
##$CPDPRG8= <mlev>
##$CPDPRGB= <>
##$CPDPRGT= <>
##$D= (0..31)
0 1 0 0 0 0 0 0 0 0.06 0 0 0 0 0 0 0.0002 0 0 0 0 0 0 0 0 0 0 0 0 0 0 
0 
##$DATE= 1160820448
##$DBL= (0..7)
120 120 120 120 120 120 120 120 
##$DBP= (0..7)
150 150 150 150 150 150 150 150 
##$DBP07= 0
##$DBPNAM0= <>
##$DBPNAM1= <>
##$DBPNAM2= <>
##$DBPNAM3= <>
$$ [...]
##$SUBNAM7= <"">
##$SUBNAM8= <"">
##$SUBNAM9= <"">
##$SW= 20.6930455092707
##$SWIBOX= (0..15)
0 0 3 0 0 0 0 0 0 0 0 0 0 0 0 0 
##$SW_h= 5175.983436853
##$TD= 65536
##$TD0= 1
##$TE= 683.16
##$TE2= 300
##$TE3= 300
##$TEG= 300
##$TL= (0..7)
0 120 120 120 120 120 120 120 
##$TP= (0..7)
150 150 150 150 150 150 150 150 
##$TP07= 0
##$TPNAME0= <>
##$TPNAME1= <>
##$TPNAME2= <>
##$TPNAME3= <>
##$TPNAME4= <>
##$TPNAME5= <>
##$TPNAME6= <>
##$TPNAME7= <>
##$TPOAL= (0..7)
0.5 0.5 0.5 0.5 0.5 0.5 0.5 0.5 
##$TPOFFS= (0..7)
0 0 0 0 0 0 0 0 
##$TUNHIN= 0
##$TUNHOUT= 0
##$TUNXOUT= 0
##$USERA1= <user>
##$USERA2= <user>
##$USERA3= <user>
##$USERA4= <user>
##$USERA5= <user>
##$V9= 5
##$VALIST= <valist>
##$VCLIST= <CCCCCCCCCCCCCCC>
##$VD= 0
##$VDLIST= <DDDDDDDDDDDDDDD>
##$VPLIST= <PPPPPPPPPPPPPPP>
##$VTLIST= <TTTTTTTTTTTTTTT>
##$WBST= 1024
##$WBSW= 4
##$XGAIN= (0..3)
0 0 0 0 
##$XL= 0
##$YL= 0
##$YMAX_a= 482290
##$YMIN_a= -331442
##$ZGOPTNS= <>
##$ZL1= 120
##$ZL2= 120
##$ZL3= 120
##$ZL4= 120
##$ABSF1= 16.522
##$ABSF2= -4.171173
##$ABSG= 5
##$ABSL= 3
##$ALPHA= 0
##$AQORDER= 0
##$ASSFAC= 0
##$ASSFACI= 0
##$ASSFACX= 0
##$ASSWID= 0
##$AUNMP= <proc_1d>
##$AZFE= 0.1
##$AZFW= 0.1
##$BCFW= 0
##$BC_mod= 0
##$BYTORDP= 0
##$COROFFS= 0
##$CY= 12.5
##$DATMOD= 1
##$DC= 0
##$DFILT= <>
##$DTYPP= 0
##$F1P= 14.0000005364418
##$F2P= -0.99999901652339
##$FCOR= 0.5
##$FTSIZE= 32768
##$FT_mod= 6
##$GAMMA= 0
##$GB= 0
##$INTBC= 1
##$INTSCL= 1
##$ISEN= 128
##$LB= 0.3
##$LEV0= 0
##$LPBIN= 0
##$MAXI= 10000
##$MC2= 0
##$MEAN= 0
##$ME_mod= 0
##$MI= 0
##$NCOEF= 0
##$NC_proc= -3
##$NLEV= 6
##$NOISF1= 0
##$NOISF2= 0
##$NSP= 0
##$NTH_PI= 0
##$NZP= 0
##$OFFSET= 16.522
##$PC= 1
##$PHC0= -41.99239
##$PHC1= 5.47103
##$PH_mod= 1
##$PKNL= yes
##$PPARMOD= 0
##$PSCAL= 4
##$PSIGN= 0
##$REVERSE= no
##$SF= 250.13
##$SI= 32768
##$SIGF1= 0
##$SIGF2= 0
##$SINO= 400
##$SIOLD= 32768
##$SREGLST= <1H.CDCl3>
##$SSB= 0
##$STSI= 32768
##$STSR= 0
##$SW_p= 5175.98343685301
##$SYMM= 0
##$S_DEV= 0
##$TDeff= 65536
##$TDoff= 0
##$TI= <Analysis number 999999
Compound Code 99
Book Reference 9
Project Code 9>
##$TILT= no
##$TM1= 0
##$TM2= 0
##$TOPLEV= 0
##$USERP1= <user>
##$USERP2= <user>
##$USERP3= <user>
##$USERP4= <user>
##$USERP5= <user>
##$WDW= 1
##$XDIM= 32768
##$YMAX_p= 348162319
##$YMIN_p= -467206
$$ End of Bruker specific parameters
$$ ---------------------------------
##NTUPLES= NMR SPECTRUM
##VAR_NAME=  FREQUENCY,     SPECTRUM/REAL,   SPECTRUM/IMAG
##SYMBOL=    X,             R,               I
##VAR_TYPE=  INDEPENDENT,   DEPENDENT,       DEPENDENT
##VAR_FORM=  AFFN,          ASDF,            ASDF
##VAR_DIM=   32768,         32768,           32768
##UNITS=     HZ,            ARBITRARY UNITS, ARBITRARY UNITS
##FACTOR=    0.157963299565203, 1,           1
##FIRST=     4132.6476996994, 0,             0
##LAST=      -1043.33573715361, 0,           0
##MIN=       -1043.33573715361, -467206,     0
##MAX=       4132.6476996994, 348162319,     0
$$ Real data points
##PAGE= N=1
##DATA TABLE= (X++(R..R)), XYDATA
$$ [...]
18880F7402J16419N4526L3084q0379j2727K3487m215K27j864L7547K5554p9789
18868A79272o9640N1888L7649l2038m5685J32008K9561Q573j6474J6260j0331
18857B81043p502p6617J4601l2851L0844n7997k0510Q3267M6041M2569J02725
18846D05613l4458K945r0834m2271J03989P7836j9746r5062l6718l9222m8203
18835A83869l3694k4393j17019q3856J7417K8787Q362P6887Q8107O7010l8170
18824A73307p4359j28385K1968J11326K6037N273L3246Q2436O2029J6062j1240
18813C17700M1837j2584k9981K5044k3698j3485J1680p9238l8798j4046p2792
18802A11639p5042M9540O3485M6489M522K3869r565p1599O9180L9350M7667M949
$$ plain form
18880 67402 183821 238347 271431 191052 178325 201812 197597 197824 195960 233507 259061 179272
18868 179272 109632 161520 199169 167131 121446 253454 283015 291588 275114 291374 281043
18857 281043 273541 196924 211525 178674 209518 151521 131011 214278 260319 302888 405613
18846 405613 371155 374100 283266 240995 344984 422820 403074 308012 271294 232072 183869
18835 183869 150175 125782 8763 -75093 -57676 -28889 -20527 56360 144467 211477 173307
18824 173307 98948 -29437 -7469 103857 129894 135167 168413 250849 312878 328940 317700
18813 317700 359537 346953 316972 342016 318318 304833 316513 237275 198477 184431 111639
18802 111639 36597 86137 149622 196111 200633 224502 214937 143338 212518 251868 299535 304484
18790C04484K1323p8544j44439n8775O5236o7783p3575K4834J02220J30188m5530
18779A79639j750O9428O885j8590q2292q3815R6392j4049M5832R8384K09670K57730
18767G63464M275k8425j63732j89692q6399j25114o7223m0832N9428M9769K271
18756A77790k8271q2778m1334j7049r060n0839l0240Q7786N530m3581P6464J42212
18744A86630j33q8215R814p0819k5168K6799n0184J5342J9085k6926n373M5662
18732C6514J0909Q8731L2224m0038J3299k3451J4694n4147q5582k4028n7839K3082
18720f5632k8361K1162L6452q2006O4124J18224J88029O6925N8541o2203r8894
18709B16361j75492k5353L430m7964J10949J00536l0629k3802m2069J35J46157
$$ plain form
18790 304484 325807 247263 102824 44049 109285 41502 -32073 -7239 94981 225169 179639
18779 179639 177889 247317 254202 235612 153320 69505 165897 151848 197680 296064 505734 763464
18767 763464 767739 739314 575582 385890 299491 174377 107154 66322 125750 175519 177790
18756 177790 149519 66741 25407 8358 -702 -51541 -81781 6005 11535 -32046 44418 186630
18744 186630 186497 98282 108096 37277 12109 38908 -11276 4066 23151 -3775 -9148 36514
18732 36514 47423 136154 168378 128340 141639 118188 132882 78735 -6847 -30875 -88714 -65632
18720 -65632 -93993 -72831 -36379 -118385 -54261 63963 251992 318917 377458 315255 216361
18709 216361 40869 15516 18946 -29018 81931 182467 151838 128036 85967 86102 232259
18698B32259J34721m0755j38498J047j12672o8907o1669P5538J10280K6047j6531
18687A40860J32684M7764m1289q9362l0998p665o41l6789p3381Q9063q659J2946
18675A34533R0089O7847m0973p2497p0458J32801J564j11013J8660J7268K4006
18664A91827P8778j1961Q4788O4313n6991j60085k7144N7009P0509O3252M5644
18653C99939J10119P5755R5123M0412J03920J75374K87000M40824N47280O20293
18643B896039P35134N12471J08149l48126o18875o89356n01372k83530j10625
18634A699909N1812Q3471J922l6241M1858J0676J44115K55702L79948M82309Q79248
18623C994729J291743K226795L391623L977483L363621K326112K140618J270514
$$ plain form
18698 232259 366980 326225 187727 188774 76102 7195 -54474 21064 131344 157391 140860
18687 140860 273544 321308 280019 190657 159659 151994 151353 114564 41183 130246 121587 134533
18675 134533 224622 292469 251496 178999 108541 241342 242906 131893 150553 167821 191827
18664 191827 270605 258644 343432 407745 350754 190669 163525 220534 291043 354295 399939
18653 399939 510058 585813 680936 721348 825268 1000642 1287642 1728466 2275746 2896039
18643 2896039 3631173 4143644 4251793 3903667 3284792 2595436 2094064 1810534 1699909
18634 1699909 1751721 1835192 1837114 1800873 1842731 1853407 1997522 2253224 2633172 3115481 3994729
18623 3994729 5286472 7513267 10904890 14882373 18245994 20572106 22712724 23983238
18615B3983238n18733j098911j438619j736959l425902l903420k488474j417641
18607G954579p48123m28132k1691L21152N08022R59513J744450K787329L428757
18598A6505856L133448K216946J799019J354348L90571J2663m75547o96799j597254
18589B2643251k308263p33959J083123J364383M27799o57215j996385l407236
18581A6415498l188304k107459j200123m39003J12385P11272J559758K944048
18573A4808072M219572M072541J948062J45847j252627l969188m303574k376753
18565A3291952n21052Q45065K245272M151147N853704N924279M153962L313047
18557C9257376K640484k03893j921359k536174k767904m688682o967057n581425
$$ plain form
18615 23983238 23464505 22365594 20926975 19190016 15764114 11860694 9372220 7954579
18607 7954579 7206456 6778324 6756633 7077785 7585807 8545320 10289770 13077099 16505856
18598 16505856 19639304 21856250 23655269 25009617 25400188 25412851 24937304 24240505 22643251
18589 22643251 20334988 19601029 20684152 22048535 22476334 21819119 19822734 16415498
18581 16415498 13227194 11119735 9919612 9480609 9592994 10304266 11864024 14808072
18573 14808072 19027644 23100185 25048247 25194094 23941467 19972279 15668705 13291952
18565 13291952 12770900 13615965 15861237 20012384 25866088 31790367 35944329 39257376
18557 39257376 41897860 41693967 39772608 37236434 34468530 29779848 22812791 17231366
18549A7231366l386573k031172j326283q36758o82793o36408m09431j98907R1997
18540G815038M32972P99879J058068O50655J07731k90732q54035j628795j284055
18531F806726p31181m82973j82774J97012O31782O70037L76124k02860m49951
18522F631942q61194r71357p48341o11697l54732k40644r1614N7258q5679n8018
18512B665924n8848j76816m9018q5801j08960j27026j27174j06069n7450n6508
18502A712254q0130q5483j21816j40434r1362l1519m2754p714J1761l4963j2123
18491A075717l7617m898M2994j2691p7101M88J618P3058j789q1597q404J0560
18479I80338p6450l1978J1114K6375N809j30205j33517Q1801L7228r349m5179
$$ plain form
18549 17231366 13844793 11813621 10487338 9650580 8967787 8331379 7921948 7723041 7815038
18540 7815038 8248010 9047889 10105957 10756612 10864343 10573611 9719576 8090781 6806726
18531 6806726 6075545 5592572 5409798 5606810 6238592 6908629 7284753 7081893 6631942
18522 6631942 5770748 4799391 4051050 3439353 3084621 2843977 2752363 2809621 2723942 2665924
18512 2665924 2607076 2430260 2381242 2295441 2186481 2059455 1932281 1826212 1768762 1712254
18502 1712254 1632124 1546641 1424825 1284391 1193029 1161510 1118756 1111042 1122803 1087840 1075717
18491 1075717 1038100 1033202 1076196 1063505 986404 986892 988510 1061568 1059779 978182 969778 980338
18479 980338 903888 871910 883024 909399 915208 785003 651486 733287 770515 761166 715987
18468G15987L7390p0415n3595o4647o0451N7442l2706m8888o8603Q871n0510n2885
18456C16990O8673l8874L3600r4641n2851J41734J15133J162q9283n004L6824
18445D33463J30503p6965J470O4149m7681P86R2118J410n1460j6152M7512j1050
18433E68103k3262o450N7176M1548J12626M5772K7484L3057J29368K58193K95808
18422A539423L67120L96738J76458N7108j03992j81379k74233k34746k27049m3007
18412A472441J26463J03611J58174K22134N19200Q89749J252140J889780K096749
18403H730441J774999J176893R0655j014301j261626j244197p76182J99097P67416
18394H443195O79574J00033k40351p11223j174789q62011k10184k1253K7712K39642
$$ plain form
18468 715987 753377 682962 629367 564720 504269 561711 529005 480117 411514 420385 369875 316990
18456 316990 385663 346789 380389 285748 232897 374631 489764 490926 401643 396639 433463
18445 433463 563966 487001 488471 552620 504939 505725 597843 599253 547793 531641 579153 568103
18433 568103 544841 538391 595567 637115 749741 795513 822997 856054 985422 1243615 1539423
18422 1539423 1906543 2303281 2479739 2536847 2432855 2251476 1977243 1742497 1515448 1472441
18412 1472441 1598904 1702515 1860689 2082823 2602023 3491772 4743912 6633692 8730441
18403 8730441 10505440 11682333 11772988 10758687 9497061 8252864 7476682 7675779 8443195
18394 8443195 9122769 9222802 8982451 8271228 7096439 6234428 6024244 6002991 6030703 6270345
18384F270345M52731M84686O74987J208168J915749L193794N280291Q205451J1453264
18375C9139466J3197240J2902539J1257310O351704j275442p567506j0637305
18368F3368006j2588466j2457680q932980n043415k473760p08681P24395K283695
18360B4171114M428699O089741O335961N042503K730236q62863l866713m899645
18352C9169033m133476o70626L067750M828502L558154J031343j503580m850394
18344D0496706o771370m629443j277341J710337M063251M932723L960045K056993
18336D4541901n58775k643442k692366r35420K638515M658910L081503L79165
18328D8469991k033392n933056q097498o314614l701572j987269j024671k44592
$$ plain form
18384 6270345 6723076 7207762 7882749 9090917 11006666 14200460 19480751 27686202 39139466
18375 39139466 52336706 65239245 76496555 82848259 81572817 74005311 63368006
18368 63368006 50779540 38321860 29388880 24345465 21871705 21163024 21887419 24171114
18360 24171114 28599813 34689554 41025515 46068018 48798254 47935391 44068678 39169033
18352 39169033 35035557 34364931 37432681 42261183 45819337 46850680 45347100 40496706
18344 40496706 33725336 29095893 27818552 29528889 33592140 38524863 42484908 44541901
18336 44541901 43983126 41339684 38647318 37711898 40350413 45009323 48090826 48469991
18328 48469991 46436599 40503543 32406045 26091431 22389859 20402590 19377919 19133327
18320A9133327N87223K050726M208623P585583J1774279J3877757J1262358N260947
18312G5740823j346087q482109j4268703j4487523r514705n348592l207049k090550
18304A6995505j466058j124172j049050r27358p29370n41778n37617k90476q7957
18295A0241669j92553L837K4626M7580j45114k77024k64176r7265K95665Q69459
18285A0506704J031550M91507j95680o31483j455207j590150j168969p59307m61827
18276E767138n22628n00682l53650k44618j16301n5194p1159N3873r311K5774
18266C973242j9483n8692j85361j14608k41310j65016k40368j41123k92802j68402
18256B346077o0273q9843l1866J1031L8289n7010r4513n8955j24525p5476q8136
$$ plain form
18320 19133327 19720550 21771276 25979899 33565482 45339761 59217518 70479876 75740823
18312 75740823 74394736 65912627 51643924 37156401 27641696 22293104 19086055 16995505
18304 16995505 15529447 14405275 13356225 12428867 11699497 11157719 10620102 10329626 10241669
18295 10241669 10049116 10052953 10077579 10125159 9980045 9703021 9438845 9341580 9637245 10506704
18285 10506704 11538254 12029761 11834081 11202598 9747391 8157241 6988272 6228965 5767138
18276 5767138 5244510 4743828 4390178 4145560 4029259 3974065 3902906 3956779 3947468 3973242
18266 3973242 3953759 3895067 3709706 3595098 3353788 3188772 2948404 2807281 2514479 2346077
18256 2346077 2285804 2195961 2164095 2175126 2213415 2156405 2061892 2002937 1878412 1802936 1714800
18245A714800k6391j01676j18421j8023J7762o4566m4723J6616O9723k7236m8780
18234A369085o0324m472q2766n8898j98974l9835J7402P4087j00455J1777J25549
18223A052176o4395n0658m0531K0638M8080m1925j8420p7792k5946n5075j10595
18212F35557l4310K449K5401m4118L1898O4661O359J2111m3980J6086j10950J0877
18200E72041O6251N159p4173j15500l2679k8640O2362M4876k4060o085O7720M2374
18188E79646l2927J1379N012m0827L3657k0712j55552l4559O8297M0820n8174
18177C96060k6256l799m0321L4570M4695k7519k136J7995o2308J52320O258r2466
18165C97093r4412M5770O3533m5453r597j1865O1635K0242n1488L0192j6349k8271
$$ plain form
18245 1714800 1688409 1586733 1468312 1450289 1468051 1403485 1358762 1375378 1445101 1417865 1369085
18234 1369085 1308761 1304289 1221523 1162625 963651 923816 941218 1015305 914850 926627 1052176
18223 1052176 987781 937123 896592 917230 965310 923385 904965 827173 801227 746152 635557
18212 635557 601247 603696 629097 584979 616877 681538 687897 700008 656028 672114 561164 572041
18200 572041 638292 643451 569278 453778 421099 392459 454821 499697 475637 469552 537272 579646
18188 579646 546719 558098 563110 522283 555940 535228 379676 345117 413414 454234 396060
18177 396060 369804 366005 325684 360254 404949 377430 375294 393289 330981 483301 489559 397093
18165 397093 302681 348451 411984 366531 356934 345069 406704 426946 375458 405650 389301 361030
18153C61030q642J1188O3613P6891P7698n9692j00200j4358N1502q9462j0871
18142C58697P6365K21662J22170K4629J4647q708k338J1565k9498P2344P3276
18131I34811Q8361R2388J27108J87487J64713J30079K88932K77197L67594M25350
18121C084020M52608Q02298R97272J420043K189987L771886O339416J0985479
18113C0043009J8930767K7387516K6360750J1559979Q30661o998119k7785315
18106H0329248k9863916j6734797q538955m908917l009604j986357j552417j190452
18098A2543833j016649q95456r62214q04245o76454m79942n34455m74109l53364
18089F346945l49278l70993l42544l39467k99513k16398j90878j71915k03476
$$ plain form
18153 361030 352388 363576 427189 504080 581778 522086 421886 407528 459030 369568 358697
18142 358697 435062 656724 778894 803523 818170 809462 807124 818689 789191 861535 934811
18131 934811 1023172 1115560 1242668 1430155 1594868 1724947 2013879 2291076 2658670 3084020
18121 3084020 3536628 4338926 5336198 6756241 8946228 12718114 19057530 30043009
18113 30043009 48973776 76361292 102722042 114282021 115112682 108114563 80329248
18106 80329248 50465332 33730535 25191580 20282663 17273059 15286702 13734285 12543833
18098 12543833 11527184 10631728 9669514 8865269 8188815 7708873 7174418 6700309 6346945
18089 6346945 5997667 5626674 5284130 4944663 4645150 4428752 4237874 4065959 3862483
18080C862483j76275r0925j18921j95595k10265k07306o9188m2911o0144j8076
18070B672877M1477j52864j73765o4765l5929j3496J7371o5099K9392p7056j29351
18059B048792j18182j41523p3758j48016o6707P326J9391P640l3987l596j33655
18048A363725j57924r3086j54937R231L8722l3058o0931J8328q5751p2108P4839
18037H47050r597K1672r5357l4397l3351M1738O1083R1403j2161l7936K1299K5986
18025H87432K4838p3957q8026p2318j8133n542l4573N3206J04696j36646o5156
18014E75821J592J01223p8928p1815k33n7063j0089O2543k4842p5360N2962J8581
18002D94392N9034R843J804O0819M6742K5872n6006M2000j3262j35808m068L895
$$ plain form
18080 3862483 3686208 3595283 3476362 3280767 3070502 2863196 2794008 2751097 2690953 2672877
18070 2672877 2714354 2561490 2387725 2322960 2287031 2273535 2290906 2225807 2255199 2178143 2048792
18059 2048792 1930610 1789087 1715329 1567313 1500606 1507932 1527323 1534963 1500976 1497380 1363725
18048 1363725 1205801 1112715 957778 967009 1005731 972673 911742 930070 844319 772211 847050
18037 847050 837453 859125 763768 729371 696020 737758 798841 890244 878083 840147 861446 887432
18025 887432 912270 838313 750287 677969 659836 654294 619721 672927 777623 640977 575821
18014 575821 577413 678636 599708 527893 527660 470597 460508 523051 498209 422849 475811 494392
18002 494392 553426 563269 565073 625892 672634 698506 642500 684500 671238 535430 531362 535257
17990E35257j7410r4306n2017r7294M3706P9640m7913j10762m3341M54k6837N2516
17978B21693J23112N9379p9886j37679o4857J7290N0861o3435o2840L6509J1716
17967A11863O8974l2341j35584L2495O6158N6095L0816M1117J27821O1205r1891
17956C36728j45278j62380J42632K2596k4465o4622k3852O8216N9136K4989N3888
17945B87588l9735j3550O105J2452L4917L3947j1213o8708k7254N8275l9209m1323
17933A92292j1049l6126j5925J44546J13447m8324j05813M7681J03567j34824
17923B49472r5184J3589N1653M2795p673k534l7653K4254J7950n1369m6130r1711
17911F7459O6007j7074j8676M2667l4459K1257J12381R83m2555r3753O468k291
$$ plain form
17990 535257 517847 423541 371524 274230 317936 397576 349663 238901 195560 196014 169177 221693
17978 221693 344805 404184 324298 186619 121762 139052 189913 126478 63638 100147 111863
17967 111863 180837 148496 12912 45407 111565 167660 198476 239593 367414 428619 336728
17956 336728 191450 29070 171702 194298 169833 105211 81359 149575 208711 233700 287588
17945 287588 247853 234303 240408 252860 287777 321724 310511 241803 214549 272824 233615 192292
17933 192292 181243 145117 129192 273738 387185 338861 233048 280729 384296 249472
17923 249472 154288 167877 219530 262325 254652 252118 214465 238719 256669 205300 159170 67459
17911 67459 133466 116392 97716 140383 105924 127181 239562 240545 197990 104237 110705 108414
17899A08414K5253p7745k0030P4133J01323N265p1158m5821j9458k7189k984K5508
17887G5511L3850J46149N3309m1385Q5802J0631j10434j67069p520J61379k7921
17876B12302n3488K9015J14034p6229Q533N9221j8199R9528Q6806o1450q7970
17865C12103L1634M113n1492q8320J5391M8694q502j04009N293l4100l1158j8487
17853H1160L3958R0752l4656l3056Q416n0448k9492o0865N4047M3744L0100k4156
17841A09504R9461n598Q469k6937N4763J41439l1372q0848P2156k337J6004k3871
17829C30833l7647j2480R6270R7071M7647K1909k0291p3020n6962L2400o0589
17818C65141r5106j63938q1188k4606o805m2026j0116M8733M484J00696L2232
$$ plain form
17899 108414 133667 55922 35892 110025 211348 216613 145455 99634 80176 52987 50003 75511
17887 75511 109361 255510 308819 267434 353236 363867 253433 86364 78844 240223 212302
17876 212302 158814 187829 301863 225634 234167 293388 275189 374717 461523 400073 312103
17865 312103 343737 347850 296358 208038 223429 272123 263621 159612 164905 130805 99647 81160
17853 81160 115118 205870 171214 138158 146574 96126 66634 5769 59816 103560 133660 109504
17841 109504 208965 203367 211836 184899 239662 381101 349729 268881 341037 338700 354704 330833
17829 330833 293186 280706 376976 474047 521694 543603 523312 450292 393330 425730 365141
17818 365141 270035 106097 24909 303 -6502 -48528 -58644 -9911 -5427 95269 127501
17807A27501L109N6547K6275l4741p1667o949J07554j0057r5656l9396p203L7372
17795I2689j25R648L7209k7796P1232M7102l6559K1893l3627K678n2797J6016
17783A47563K6613R9607L0253o716r0297j6820L3398k3274P225k0906p6144j1378
17771I9124o2337J5038J7342K36523M2348K5560j42942j28573n4017R1881j807
17760A38140l9046k5768l1815n8774m8058j8034l4217J2201M7212K3650N3275
17749A8766J645K5202J0895K1452O582J05373k575M0177o438j20432o3640J1606
17737D8613o2274m7733l0521m9543K5674P1410J73678N7945n6550p7822m0052
17726A2825K05207M4667j28049j21307m888K1795j3517j3806P8905M4579R7632
$$ plain form
17807 127501 130610 187157 213432 178691 107024 100075 207629 197572 101916 62520 55317 92689
17795 92689 92564 102212 139421 111625 182857 229959 193400 215293 181666 184344 131547 147563
17783 147563 174176 273783 304036 297320 207023 190203 223601 200327 207552 186646 110502 99124
17771 99124 36787 51825 69167 305690 348038 373598 230656 102083 48066 139947 138140
17760 138140 99094 73326 41511 -17263 -65321 -83355 -117572 -105371 -58159 -34509 18766
17749 18766 20411 45613 56508 77960 84542 189915 187340 227517 221079 100647 37007 48613
17737 48613 -13661 -61394 -91915 -141458 -115784 -44374 129304 187249 130699 52877 12825
17726 12825 218032 262699 134650 13343 8455 30250 16733 2927 81832 126411 224043
17715B24043j10091o9337O8039Q4596M3384L324j56407l3634j9277J4602Q5539
17704A34781j3802o4932J0852o4278M5800N0771o3050j22452L8295J04523M4270
17693A00778R5009o350r4476o7718L6248L3881m738P0583M5988p1815k9980l4311
17681G3099k1695n0959j373n6166M6036O2074P7771j1166J04328l8109j50974
17670C2866p106K4209K9172l1665K3015J414l5161r256Q1234L5829k2839J1316
17658A33028j8955o0338L7251k2445N2115j6034j257J2435k5644o293j02490L2075
17646A3448n3889m6075J24579N6844q0883M2958k9092p1171O584o518J31965K4612
17634A13362R887p9836o9210Q996J6663j5337Q7934k8786R7475k9665j26680L7424
$$ plain form
17715 224043 113952 44615 112654 197250 240634 243958 87551 53917 34640 49242 134781
17704 134781 120979 56047 66899 2621 48421 99192 36142 -86310 -48015 56508 100778
17693 100778 195787 189437 94961 27243 63491 97372 92634 163217 209205 137390 107410 73099
17681 73099 51404 445 -928 -57094 -11058 51016 128787 117621 221949 183840 32866
17670 32866 25760 49969 79141 47476 70491 71905 36744 27488 108722 144551 121712 133028
17658 133028 114073 53735 90986 68541 120656 104622 103365 115800 90156 83863 -18627 13448
17646 13448 -40441 -86516 38063 94907 14024 56982 27890 -43281 -36697 -43215 88750 113362
17634 113362 123249 43413 -25797 -16801 -138 -15475 72459 43673 141148 111483 -15197 22227
17622B2227k4324L6813Q0439Q9719m9017j1090R623k4786o0798Q6393L3043r2780
17610I5462j8689m4123J0016K532k9359j8042j7707L4358L223k7682n3620J03388
17598C9757Q6086p2840j7929l924j04899m2355P290l7219J4908l2235m0591J50943
17586e3008K8237k2565P4629N0702m8455n2021N2517l0350m133p3300k3879J2057
17574h9569R775N6621j6177j22999L699J09574J26212n4862J5427K26959M1681
17563C06341j0736j2652r5826l0261N0252m2903j97792o551R2252K5289j04732
17552b7319M0330j5947o9160o5956J04796m4732K888j6659J0810K6786o6229j6008
17540a36400O8723m437p5271k3353N5139M1019J27207P8555M4011n9862n6835
$$ plain form
17622 22227 -2097 34716 115155 204874 155857 144767 154390 129604 68806 155199 188242 95462
17610 95462 76773 32650 42666 45198 15839 -2203 -19910 14448 17671 -10011 -63631 39757
17598 39757 125843 53003 35074 31150 -73749 -116104 -108814 -146033 -131125 -163360 -203951 -53008
17586 -53008 -24771 -47336 27293 77995 29540 -22481 30036 -314 -4447 -77747 -101626 -89569
17574 -89569 -79794 -23173 -39350 -162349 -158650 -49076 77136 22274 37701 264660 306341
17563 306341 295605 282953 187127 156866 207118 164215 -33577 -40128 52124 77413 -27319
17552 -27319 13011 -2936 -72096 -138052 -33256 -77988 -75100 -91759 -80949 -54163 -120392 -136400
17540 -136400 -67677 -72114 -147385 -170738 -115599 -74580 52627 131182 175193 115331 58496
17529E8496K5006m8498k0197J186r6158P294J7696k3690k5185P3312N6751Q4144
17517A10157J9912p0624l0994O5400r0503r3279J5839J4957N2810J02976L9354
17506A36005O4207L7317q5259O4839k402k11572j2963J09010k3464j0457k9856
17495C5405j0075K9604p8801O2199K8451l2682k7708J5757l5p0437R8033N6800
17483A06511K8259j10309L2457J9240n4762n0266j10870M816J71063J1598J0258
17472E7995q206n5877n9766r949k7471O9205J06072J35879J3585j56028m1184
17461B4255j24677r1990R4488J04210l271O6545O7267N3873l1155N7727P3546
17450B90818J0230q2431r4540N5675J58079K44160J34817j5947O6694j58657k40730
$$ plain form
17529 58496 83502 35004 14807 15993 -80165 -72871 -55175 -78865 -104050 -30738 26013 110157
17517 110157 130069 59445 28451 93851 3348 -89931 -74092 -59135 -6325 96651 136005
17506 136005 200212 237529 152270 217109 214707 3135 -9828 99182 75718 65261 35405
17495 35405 25330 54934 -23867 38332 66783 34101 6393 22150 22115 -48322 49711 106511
17483 106511 134770 24461 56918 76158 21396 -28870 -139740 -134924 36139 47737 57995
17472 57995 49789 -6088 -65854 -75803 -103274 -34069 72003 207882 221467 65439 24255
17461 24255 -100422 -192412 -97924 6286 3015 69560 136827 190700 159545 217272 290818
17450 290818 301048 218617 124077 179752 337831 581991 716808 700861 767555 608898 368168
17439C68168r3748Q428N0866j81279j53835M5000J23051J2149l9818m4144r2699
17428B139R8286l3927o7976K7461o5778p264J08829J898k8155j11L8576L5920
17416A09898J05524K4299M9224p5031j42961L120N1484K8408M1561L0273L2553
17405B58352o0290m678R570j10197k2008l2916L7171j3417o5497k6106l3176k7157
17393i0349j3372R94Q3291P2446o9928N5796j5968K4402l6963m9687N5801M2734
17381E9197P3423k2842r8326O591j9953R605n6305o2777L8813O2917N3177J1607
17369E5127m0935l9898n995P5829M6097n72l4840p52o527k0328J41359Q1016k6179
17356B23402p6842m8775m1018n5331J0130J3408K3672J8156M2430K7945l6574
$$ plain form
17439 368168 274420 282848 333714 152435 -1400 43600 166651 178800 138982 94838 2139
17428 2139 100425 66498 -1478 25983 -39795 -47059 61770 63668 35513 35402 73978 109898
17416 109898 215422 239721 288945 213914 70953 74073 125557 153965 195526 225799 258352
17405 258352 198062 193384 202954 92757 70749 37833 75004 61587 -3910 -30016 -63192 -90349
17393 -90349 -103721 -102727 -19436 53010 -16918 38878 22910 47312 10349 -39338 16463 59197
17381 59197 132620 109778 11452 18043 -1910 7695 -48610 -111387 -72574 -9657 43520 55127
17369 55127 14192 -25706 -31701 44128 90225 89653 54813 54061 47534 27206 168565 249581 223402
17356 223402 146560 97785 56767 1436 11566 24974 48646 66802 109232 137177 100603
17345A00603m2963L5413K0549r1846n4072j3766J1270L5306k8001m7691J62930
17334H7732J59010j60734j30891j2723K2330J459p2131j490J08397j0322l6694
17323d6057l9175n4335J127N1077R5186P3149O8723R7946K0172o5456j04580j39201
17311d1424m0061K3236j8862O5104K6289O1978o608p796R6344Q5595l7183j08837
17299I7775l6470l8654m3743r7201M6819N0006j24761M5293P0157n0051n326J3052
17287g3104K3161L2035M9479k4709n96J9310j0255j0662L1124j315m465K4159
17275E4162L5455j2738Q389k0783o0205L9495J37088P6131k6410k2550j6304m1445
17263A50285j20198l9302O2607m9986j10485K9360j5356L5628J65012M9636l0593
$$ plain form
17345 100603 57640 93053 113602 21756 -32316 -46082 -34812 494 -27507 -75198 87732
17334 87732 246742 86008 -44883 -57606 -35276 -33817 -105948 -107438 959 -9363 -46057
17323 -46057 -85232 -139567 -138440 -87363 7823 80972 149695 247641 267813 202357 97777 -41424
17311 -41424 -81485 -58249 -77111 -12007 14282 76260 69652 61856 158200 243795 206612 97775
17299 97775 61305 22651 -21092 -118293 -71474 -21468 -146229 -100936 -30779 -80830 -86156 -73104
17287 -73104 -49943 -17908 31571 6862 6266 25576 15321 4659 35783 34468 30003 54162
17275 54162 89617 76879 85268 64485 4280 43775 180863 256994 230584 208034 191730 150285
17263 150285 30087 -9215 53392 3406 -107079 -77719 -93075 -57447 107565 157201 126608
17252A26608L56Q4165n022j54149k9984L7245k3844k7330l4884j0721k1577m8016
17240a07153R7199k7128n5530l2899K6808N0102L6891J51602m856N9919m6016
17229A48939j5725J2010j9079j24974q3833J8993M0686j30043O295J20903O5292
17218C9464j1957o701k0799l7051m6489N9096J23670N6581N164j3246o5131q5370
17206b769M480m6379J6443L6452J09610p4274m2112L1047O4373N144J3563r3622
17194B1956J22183o7879L7588p513j5846M0783j7586l8974k2366M7145m2205k533
17182E4753J9832n4054J07798J1099k07567j23272M2220P0667O2835o655P83n7740
17170g9301n8353L7637k5928l7951K0548R2602R3450L6793R115q9338p2642j4470
$$ plain form
17252 126608 126964 211129 206107 51958 21974 59219 35375 8045 -26839 -37560 -59137 -107153
17240 -107153 -9954 -37082 -92612 -125511 -98703 -48601 -11710 139892 135036 194955 148939
17229 148939 133214 145224 126145 1171 -82662 -63669 -22983 -153026 -146731 -25828 39464
17218 39464 27507 20806 7 -37044 -83533 -24437 99233 155814 160978 147732 82601 -2769
17206 -2769 1711 -44668 -28225 8227 117837 43563 1451 32498 96871 102015 115578 21956
17194 21956 144139 76260 113848 106335 90489 131272 113686 74712 52346 99491 57286 54753
17182 54753 74585 20531 128329 139428 -68139 -191411 -149191 -78524 -15689 -22344 -21561 -79301
17170 -79301 -137654 -100017 -125945 -163896 -143348 -50746 42704 79497 88612 -726 -73368 -87838
17158h7838K3938K0034J63703Q298n2225j3036k2387N9287L146m6684K2666K4941
17146A03843k0349O662l6842k6456q7481j08838m8200L9209N3445O8406l5356
17135i1957J8544n9816Q4392J42969Q2025N637K3299p7921l2589n5805l2809K5505
17123C1474Q8528n8180K6748n4469l2589j330p67J0411P273L6828j3697K6642
17111F6872P4952j09609p9859K207O4578N3807O579l9090p2709L9125N7911j01044
17099c6280r3624p045n5629o0173J11706J59549m3445l3118R8061M8855j09347
17088b0490j7253O2488J3054R0715Q986o1786M1155O834O1443l5515r4777R2388
17076A47242j436o3164n4858k5804p0806J2813L9100J1591n0414M9546O6188L4682
$$ plain form
17158 -87838 -63900 -43866 119837 128135 75910 62874 40487 99774 102920 56236 78902 103843
17146 103843 83494 90156 53314 26858 -60623 -169461 -217661 -178452 -125007 -56601 -91957
17135 -91957 -73413 -133229 -48837 94132 176157 181794 205093 127172 94583 38778 5969 31474
17123 31474 120002 61822 88570 34101 1512 182 -585 9826 17099 53927 40230 66872
17111 66872 141824 32215 -47644 -45437 19141 72948 79527 40437 -32272 6853 64764 -36280
17099 -36280 -129904 -136949 -192578 -252751 -141045 18504 -24941 -58059 40002 88857 -20490
17088 -20490 -37743 24745 37799 128514 137500 75714 116869 123703 185146 149631 54854 147242
17076 147242 145806 82642 27784 1980 -68826 -56013 -16913 -5322 -55736 -6190 59998 94680
17064I4680k7672L4663r356j61326k7706Q079N8320N4264l5182m2761N3262J40256
17052A39521p5055k1163m2002j16927m3243L3584O5905P6871L1013K6292k5018
17041D9778l0120J59109J4153L5592r6997j30578r1206n4711P1904O4191M3016
17030C4131r6015K372P7904Q2020N9366l5591r9990n1662J08624k1718j34767
17019g5326k7400J15903K2976p6751O110j045Q2750R3657o5388j5943q1343N8671
17007C6871K198O4332L0027j4405n9330j2992q0115Q223n6550L8527J6466j04861
16995a31609L1523P6819k2410o2437j6010O8755j21683k2904P7697J18974q545
16984a1830o9993l4350n890K6160N2121K7184M8931j03273j1170k6036l8649K2061
$$ plain form
17064 94680 67008 101671 92315 -69011 -96717 -88638 -30318 23946 -11236 -53997 -735 139521
17052 139521 64466 43303 1301 -115626 -158869 -125285 -59380 17491 48504 74796 49778
17041 49778 19658 178767 192920 228512 131515 937 -90269 -144980 -73076 -8885 34131
17030 34131 -61884 -59512 18392 100412 159778 124187 24197 -27465 81159 59441 -75326
17019 -75326 -102726 13177 36153 -40598 -34488 -35533 47217 140874 75486 59543 -21800 36871
17007 36871 39069 103401 133428 119023 59693 46701 -33414 -25191 -81741 -43214 -26748 -131609
16995 -131609 -100086 -23267 -45677 -108114 -124124 -55369 -177052 -199956 -122259 -3285 -11830
16984 -11830 -81823 -116173 -122063 -95903 -43782 -16598 32333 -70940 -82110 -108146 -146795 -124734
16972a24734J2389R9439k9166O5072j4680l9849M415k2486Q0989P8310k9539M7903
16960A28063M4514j59787j23321j07738R743J15028N7637L1666q9704K2954R9710
16949B8765K6848q0294m3972R7215P6992j2062O2855J0658p2890j04551M2511
16938C2075j7072L7733K0376p806l0693M7084K3036N312L3176p0642l9446K7648
16926F0781n2365J17490r6455k774K2779o2520M8425L789j08293K2175J02587
16915E5619K7844j5505j23086m5767M5164L3722l580J1238M8754l4899L4363J2172
16903D6039q5594K5306k4160M6383n7927p0728J4452K6943J9367L0060j4799K265
16891d2393K8370M038j8631P7028q061l7552m9931n7746M5717J12439J03704N0389
$$ plain form
16972 -124734 -112345 -12906 -42072 23000 8320 -31529 -27114 -49600 31389 109699 80160 128063
16960 128063 172577 12790 -110531 -218269 -208526 -93498 -35861 -4195 -93899 -70945 28765
16949 28765 55613 -24681 -68653 28562 105554 93492 156347 167005 94115 -10436 32075
16938 32075 15003 52736 73112 65306 34613 81697 104733 110045 143221 72579 33133 60781
16926 60781 8416 125906 29451 26677 49456 -13064 35361 39150 -69143 -46968 55619
16915 55619 83463 67958 -55128 -100895 -55731 -22009 -25589 -14351 34403 -496 33867 46039
16903 46039 -39555 -14249 -38409 7974 -49953 -120681 -106229 -79286 -59919 -29859 -44658 -42393
16891 -42393 -14023 -9985 -28616 48412 40351 2799 -47132 -104878 -59161 53278 156982 207371
16879B07371K72J2546q1977q2437j47504J4368n3881n7490J33994K6011Q2789
16868E4062N5777l7605r5289J2091O0822N0383m4425o5779r4227K5049L7222M3742
16856A823m3209j2534M2236k409o5309R2631N6199q3965n0337L9124j274K9281
16844B257K5734o616l007l644L8628n5657m4359l0986k777j1511R0815J01055
16832I9932m9251P542L1389j07350j50353P0369L243P9065K3959K0964j3534m0969
16820b4994Q4528M5874j9932L7930O0189m0971j58006M3991N8014l4400k6207
16809B6016j3591k3267j3264r7972L9526P6011o2806J1009O059m4163k9278L7691
16797h8029O4754Q038k5471M0523k4406l1725L0975M1456k5435q866J40731L9108
$$ plain form
16879 207371 207643 220189 138212 55775 -91729 -77361 -131242 -188732 -54738 -28727 54062
16868 54062 109839 72234 -23055 -10964 49858 100241 55816 -9963 -104190 -79141 -41919 1823
16856 1823 -41386 -53920 -11684 -14093 -79402 13229 69428 -14537 -64874 -25750 -27024 2257
16844 2257 27991 21375 18368 14724 53352 -2305 -46664 -77650 -80427 -91938 -1123 99932
16832 99932 50681 58223 89612 -17738 -168091 -97722 -94479 -15414 8545 29509 15975 -24994
16820 -24994 59534 105408 85476 123406 183595 142624 -15382 28609 86623 52223 26016
16809 26016 12425 -10842 -24106 -122078 -82552 -6541 -69347 -58338 -52279 -96442 -125720 -88029
16797 -88029 -23275 -15237 -40708 -185 -24591 -56316 -25341 16115 -9320 -18186 122545 161653
16785A61653j8004k8377n0657k1785N2129l6361j06633m1818j8392M7846J1932
16774d8467J8968j17667L502O9632k6074O9601K9471k0766o1803J8990L5510j68479
16762a97582K957N4667j8358j291Q2420J7394L3680m8612J34108J30519m7364
16751A42538j32444r5855o4889k9709Q4500M11m1423K972l3635M456K3948J02544
16739c6586p5528r6063o9268P6505P1636O8777N8694J1868J12869K8581L4445
16728A85930K0154M8335q1861q3257q1337p23M6019L6249N0484l3248J5979q8495
16716C4229n3987l6147K3889P263k6270L3287k6490j72903k0148Q4639P1970k6566
16704a07234J8983r148R685N4198N1564q6139N9896Q3712r5032M588r576n755
$$ plain form
16785 161653 143649 115272 64615 42830 94959 58598 -48035 -89853 -108245 -60399 -48467
16774 -48467 -29499 -147166 -143664 -74032 -100106 -30505 -1034 -21800 -83603 -64613 -29103 -197582
16762 -197582 -194625 -139958 -158316 -159607 -77187 -59793 -26113 -74725 59383 189902 142538
16751 142538 10094 -85761 -150650 -180359 -95859 -95448 -136871 -133899 -167534 -163078 -139130 -36586
16739 -36586 -112114 -208177 -277445 -200940 -129304 -60527 -1833 10035 122904 151485 185930
16728 185930 206084 254419 172558 89301 7964 7241 53260 89509 139993 106745 122724 34229
16716 34229 -19758 -55905 -32016 -24753 -51023 -17736 -44226 -217129 -237277 -152638 -80668 -107234
16704 -107234 -88251 -97399 -87714 -33516 18048 -68091 -8195 75517 -19515 -14927 -24503 -30258
16692c0258J43438K7042l6532j9948m0357j33053L8714K1915n8628o316R7609
16681C626P4178m6488j42376K8001J28200L4889k9456m6623m5631r416l779R305
16669d5570k9343M9682J01971N9497r6605O4643k3550j59887r3815K592P885J10732
16657e1768Q2362J9055p1326o6196M6508J1829K7134L8458J163j7128l9992m4539
16645f4440P2990R3926L1313l8435m5076l3191O0463K3907J1531o8955k8118M6407
16633F2322j8644J0215j7217n1086L0718m5851J20005J79184J23858J10860K86460
16622G90824K54739J08516r839j03769m08652m12889r3190L5420K3939M3558j3438
16611B15219n801j7283p9595o3488m3597p2158M4144K9614k3552P418L1845j35607
$$ plain form
16692 -30258 113180 140222 103690 83742 43385 -89668 -50954 -29039 -87667 -93983 3626
16681 3626 77804 31316 -111060 -83059 45141 80030 50574 3951 -41680 -51096 -54875 -45570
16669 -45570 -74913 -25231 76740 136237 39632 104275 80725 -79162 -172977 -170385 -162500 -51768
16657 -51768 30594 49649 -21677 -87873 -41365 -29536 -2402 36056 37219 20091 -19901 -64440
16645 -64440 8550 102476 133789 95354 50278 17087 77550 101457 112988 44033 15915 62322
16633 62322 43678 53893 36676 -14410 16308 -29543 90462 269646 393504 504364 790824
16622 790824 1045563 1154079 1144240 1040471 631819 218930 125740 161160 185099 228657 215219
16611 215219 209418 192135 112540 49052 5455 -66703 -22559 7055 -16497 -9079 22766 -112841
16599a12841R9878K5786J2388O4215J26842j3994j73567n4109K981K2629o0847
16588f0639k1525P3194N1436P5798m2065j39255N6001Q0926m9094l338L7631N9336
16576A18406P8135Q8960m0504o8782k4869r6666j58525L5906P1060J3281n1169
16565c4767l2420O8341K1650P7747K6284p1238m4240M6063k2488k2763j1112m2555
16553d1498P1710Q0359m5900m5676L9154M2739N1353l7464j5137L934N810p253
16541A02131N698j4878L2337r331m3875k7215n178l1708m3027j868J19807m3920
16529C8973P7551O3229l0821q3565j6324K0200R3197K8386L7372k2952l5531j64310
16517E405N4451N4194p2997k5049l4848k1534j4771M6825q5326q379Q9007Q294
$$ plain form
16599 -112841 -12963 12823 25211 89426 216268 202274 28707 -25402 -22421 208 -60639
16588 -60639 -82164 -8970 42466 118264 76199 -63056 -7055 73871 24777 21439 59070 118406
16576 118406 196541 285501 244997 176215 151346 54680 -103845 -67939 3121 16402 -34767
16565 -34767 -67187 1154 22804 100551 126835 55597 11357 57420 34932 12169 1057 -41498
16553 -41498 30212 110571 64671 18995 58149 100888 152241 114777 99640 103574 109384 102131
16541 102131 107829 92951 125288 115957 72082 44867 39689 7981 -35046 -36914 82893 38973
16529 38973 116524 179753 148932 65367 49043 69243 162440 190826 228198 205246 169715 5405
16517 5405 59856 114050 41053 16004 -18844 -40378 -55149 -8324 -93650 -102029 -13022 -4728
16505d728o8788p882P0713O8587P381j05845J2740K4062P0463k526M5040J16305
16493B25522J9024q513j67726M519M9072k5155l7192J22029m2275j03935J8860
16482E4230j00818j58150K5189L1623L1860Q0347k1230k1652p987k6863J3469
16471i9982k6224P4439R3826L5086K676R0448M1890o0772r2275k6498l5061j3532
16459a5979l2104o39K0371K3074m8199M6843O995P9078M4616Q155l2780j1957
16447H7474j09987Q6287q1908M2839k2801r1133K6514K4123N8737l997K2096R3587
16435A31831o651j9149K058m9831p874L4846p8372o4911m8386N6159K4658J5556
16423a0066M3824N1410k8576l6617R9032J83439q5646j55016j22796K9754n8567
$$ plain form
16505 -4728 -73516 -81398 -10685 57902 65283 -40562 -27822 -3760 66703 64177 109217 225522
16493 225522 244546 236033 68307 72826 121898 96743 59551 181580 139305 35370 54230
16482 54230 -46588 -204738 -179549 -147926 -116066 -35719 -56949 -78601 -86588 -113451 -99982
16471 -99982 -126206 -51767 42059 77145 79821 170269 212159 151387 59112 32614 -2447 -15979
16459 -15979 -48083 -48722 -28351 -5277 -53476 -6633 362 79440 124056 132211 99431 87474
16447 87474 -22513 63774 -18134 24705 1904 -89229 -62715 -38592 20145 16148 38244 131831
16435 131831 125180 106031 108089 58258 50384 85230 6858 -58053 -106439 -50280 -25622 -10066
16423 -10066 33758 85168 56592 19975 119007 302446 216800 61784 -61012 -31258 -89825
16412h9825R128j5776O2539N6558O072k4596L4658n1624j4646j8955j9425J67927
16400A02035J1909m997l3001L511l601j25893M391j7145M5261N7271M3185j3456
16388F9470n8558k6373M4834M6205k7845p2619J7878r220p9583M2388J03691k8051
16376B2217M137K1351J4995m8300j9141L5854P1374L1957q0953l8625L8182m9731
16364C317J21542O8255l1413m4779K9975R1420o3602p2657n9323m5102J823r4104
16352i4648j08736J67515P1465r6979J3661J46124J3484j11502o6862M0457O7768
16341D1747l2411k6664k2249l6476n1668L0087K0420L8779L3389P3273R6577n6925
16329A07879J9720K3824j01100L6131Q158q0606N4393N9562j02736j46757p7746
$$ plain form
16412 -89825 -80697 -96473 -33934 22624 28696 4100 38758 -12866 -27512 -46467 -65892 102035
16400 102035 113944 108947 75946 79457 75856 -50037 -45646 -62791 -17530 39741 82926 69470
16388 69470 10912 -15461 29373 75578 47733 -24886 -7008 -16228 -95811 -53423 50268 22217
16376 22217 26354 47705 62700 14400 -4741 31113 102487 134444 53491 14866 53048 3317
16364 3317 124859 193114 161701 116922 146897 238317 174715 102058 42735 -2367 -544 -94648
16352 -94648 -203384 -35869 35596 -61383 -47722 98402 111886 384 -66478 -26021 41747
16341 41747 9336 -17328 -39577 -76053 -127721 -97634 -77214 -38435 -5046 68227 164804 107879
16329 107879 127599 151423 50323 86454 94612 14006 68399 127961 25225 -121532 -199278
16318a99278J64502r787P4169M9050n1346P9332k0969j09717o9721K1524P3242
16307A001J15751o151j46812n2787k8854Q0632Q7768k42o2414j99N966j40331
16295a46672k5104M1531m1396J7313K17472K3949p2706q7493m1708J6092l338
16284a02060L8524J20045J51131j5676r4825l8259O555o0770J9378n4289K5058
16273e188k5794k8849j5171o1408m8855J9958J22936J00007N1559P762O7420m5980
16261A38397n683O0018O8849L0195j27078l0173q204l8583l6800R5539N7006j2753
16249A90730j1504p4372P3033L8464j17594N7836r580p1782K778l7889j548O5092
16237A03664K4426o796l2040p3892r5654j15873O5374J0632J7521n70j05679P3757
$$ plain form
16318 -199278 -34776 -44563 29606 78656 27310 106642 85673 -24044 -93765 -72241 1001
16307 1001 116752 110601 -36211 -88998 -117852 -37220 50548 50306 -12108 -12307 -6341 -146672
16295 -146672 -171776 -130245 -171641 -154328 63144 87093 14387 -73106 -114814 -98722 -102060
16284 -102060 -63536 56509 207640 191964 97139 58880 65435 4665 24043 -30246 -5188
16273 -5188 -30982 -59831 -75002 -136410 -185265 -165307 -42371 57636 109195 116957 184377 138397
16261 138397 132714 192732 261581 291776 164698 134525 126321 87738 50938 146477 203483 190730
16249 190730 179226 104854 177887 216351 98757 156593 147013 75231 78009 40120 38572 103664
16237 103664 128090 121294 89254 15362 -80292 -196165 -130791 -120159 -102638 -103208 -208887 -135130
16225a35130J09259p9748L7277m283K3289m4832q062N9749k019K6292K3678m5799
16213d0329O0541k0635j2589r774Q2121Q9131j7436n2067K677J1842j5028k3919
16201E4535l958N6209O8958L7338r5912L167q8352N985M9143O0040k1342l9790
16189H6021o6242R82K7073l7594L7860P0568j29973O1227o6717n2963j4727l3115
16177a17600k45k907J00801j629l4921M4370l5841q7628K535N2091r299L8861
16165e1412O5531J110n4203j29181l3957O3988O3429p3956k9698O4964N0893l3838
16153i6330p8521l353L0121J05801J1824n2704M747Q9687R1649N91m8207j17578
16141f2273L3829n4426p078o065P1347J71851R2591n1456l2689n6772p1832j32436
$$ plain form
16225 -135130 -25871 -105619 -68342 -72625 -49336 -94168 -102230 -42481 -44500 -18208 5470 -40329
16213 -40329 20212 -423 -13012 -22786 59335 148466 131030 78963 81640 93482 78454 54535
16201 54535 50577 106786 175744 213082 117170 120337 31985 37970 87113 147153 125811 86021
16189 86021 19779 20761 47834 10240 48100 118668 -11305 49922 -16795 -69758 -84485 -117600
16177 -117600 -117845 -120752 -19951 -21580 -56501 -12131 -47972 -135600 -133065 -80974 -90273 -51412
16165 -51412 14119 15229 -38974 -168155 -202112 -138124 -74695 -148651 -178349 -113385 -62492 -96330
16153 -96330 -174851 -178204 -148083 -42282 -30458 -83162 -78415 11272 102921 103512 55305 -62273
16141 -62273 -28444 -82870 -89948 -96013 -24666 147185 239776 188320 155631 98859 27027 -105409
16129a05409m032L8183O5221L497N0567L3117j36392n9931j3229L7262k2566j9470
16117a33182J6807M6865Q0835P0080K4625j5447j26907l0990l4815p1975N3380
16106a20724l7466m018Q8195J01766j3260J7876o6451j2316P5297n640q894N2387
16094F6752m7269j288k8747Q279K0211j0498R8257J20195r7493j52173n6490J6492
16082f3772J5700l9498K7439R9515p465J9593j7665m8820k0439p1707J9770M3467
16070d3882J1722N9568p5170O0816M6422L1842p6536q621J3568m4893Q7330j2636
16058D9530N3089n015p3713m73q8625Q772M2262P4089J0629J8224o4056j8048
16046F665p2423N0595n5344k2847o3591J15599P1121l0181J4955M2696l0762j8522
$$ plain form
16129 -105409 -109441 -71258 -6037 -2540 48027 81144 -55248 -115179 -128408 -91146 -113712 -133182
16117 -133182 -116375 -69510 11325 81405 106030 90583 -36324 -67314 -102129 -174104 -120724
16106 -120724 -158190 -162208 -74013 27753 14493 32369 -34082 -46398 28899 23259 14365 66752
16094 66752 19483 18195 -10552 -2273 17938 7440 105697 225892 128399 -23774 -80264 -63772
16082 -63772 -48072 -87570 -60131 39384 31919 51512 33847 -14973 -35412 -107119 -87349 -43882
16070 -43882 -32160 27408 -47762 13054 59476 91318 14782 6161 19729 -25164 62166 49530
16058 49530 102619 97604 23891 23418 -65207 -56435 -14173 59916 70545 88769 24713 6665
16046 6665 -65758 -15163 -70507 -93354 -156945 -41346 29775 -406 14549 57245 26483 7961
16034G961O4433J02799k6919o6968l2983p570J9017k9813M1343J2381o3352n3218
16022c2889m9529k0864k4467P1364J13862j0664k5384L2309P5644k1472j43384
16011c5474r7665K1871j206p537L4505L6775L7088M992j18707l3595j9937M0517
15999a38373j7053N3431J21497j15414n1978P5983J42328L1442q4913L2982N3183
15988A03115N7923o6812m7314o1291q2815Q7760K1163N5250k7671n0274j08763
15977a19729n4958l242P1620N1911O5847P9318n2404k4884O1818Q233r7358p4551
15965h8379j1233O1926J0058k4914J6316J7655L7258p2391p0243J9831O1367P6508
15953C3759N9916n5267Q9305L2380m0544k1120n1974N2665K0268k3828k779l8278
$$ plain form
16034 7961 72394 175193 148274 81306 48323 40753 59770 29957 71300 83681 20329 -32889
16022 -32889 -82418 -103282 -127749 -56385 57477 46813 21429 53738 129382 107910 -35474
16011 -35474 -133139 -111268 -112474 -120011 -85506 -48731 -11643 -6651 -125358 -158953 -178890 -138373
15999 -138373 -155426 -101995 19502 -95912 -147890 -71907 70421 101863 16950 49932 103115
15988 103115 161038 94226 46912 -14379 -97194 -9434 11729 66979 39308 -10966 -119729
15977 -119729 -174687 -177929 -106309 -54398 11449 90767 38363 13479 75297 83530 -13828 -88379
15965 -88379 -99612 -37686 -27628 -52542 -36226 -18571 18687 -53704 -123947 -104116 -42749 33759
15953 33759 93675 38408 127713 160093 119549 98429 46455 99120 119388 95560 92781 54503
15941E4503K5463J0309Q365L7247k6777K5144P7281O050q4016k4597m9904j36450
15929g7382r7085P6169J73953L0118j73286r2633M9561Q6780P9909l1256m5871
15918b1023k1899J01326M7074j70499j51125l7152J10653J19645p519M2390K645
15907A4516o0763j72245q9847N8761J30406L8269o4489J05029j0445K6073m5588
15896g0323j5369l654L7135L7793o5867j1631P840q282J8991K8809J9797P3342
15884D8581O1257l6802j21045k4299M3265Q9784J30847k7813j11462K3197P7079
15873A52589L0503j03472r0186k3467N5060J6417J7847l0347n7575j40939J08434
15862f5136L5588j8137l3407M4298K319J0930n3339j19613M3925k8883m817J95037
$$ plain form
15941 54503 79966 90275 98640 135887 109110 134254 211535 217585 133569 108972 59068 -77382
15929 -77382 -174467 -98298 75655 105773 -67513 -160146 -110585 -23805 56104 24848 -21023
15918 -21023 -42922 58404 105478 -65021 -216146 -253298 -142645 -23000 -30519 11871 14516
15907 14516 -46247 -218492 -308339 -249578 -119172 -80903 -145392 -40363 -50808 -24735 -70323
15896 -70323 -85692 -89346 -52211 -14418 -80285 -91916 -84076 -92358 -73367 -44558 -24761 48581
15884 48581 109838 73036 -48009 -72308 -29043 60741 191588 163775 52313 75510 152589
15873 152589 183092 79620 -10566 -34033 21027 37444 55291 24944 -32631 -173570 -65136
15862 -65136 -29548 -47685 -81092 -36794 -34475 -23545 -76884 -196497 -152572 -181455 -186272 8765
15850H765O8686j94972j0165N7150k0060J4613M8747Q3101J66187J3945j87871
15839D8126n6500m8855r470J06054j8233l7402j00104q123J27743P1449l6104
15828C8581M370q0862j30851Q8521M5548o3083n1891J4396N0269J13353J12485
15817A40836M5881M8846r0649o1518N9634l6127o6349n5620k9742J8445M1609
15806A5246o2641K8703o8870m410M1129l2454M8504j4045K4631j16756o0181L6492
15794a64652R5338J12335M7975r4607q1067K1878k2031r4545l5189O1819R5436
15783e7310O6414J3486q962N2141j1018P2090m7150k139L1751m7593j0032m8193
15771C485n0804r539l6434l5059o4393L753J15563P6063J8750L1396l0207l4783
$$ plain form
15850 8765 77451 -117521 -127686 -70536 -90596 -75983 -27236 55865 222052 235997 48126
15839 48126 -8374 -57229 -66699 39355 21122 -16280 -116384 -124507 3236 74685 38581
15828 38581 42951 -37911 -168762 -80241 -34693 -97776 -149667 -135271 -85002 28351 140836
15817 140836 186717 235563 144914 83396 143030 106903 40554 -15066 -44808 -26363 15246
15806 15246 -47395 -18692 -87562 -91972 -50843 -83297 -34793 -48838 -24207 -140963 -201144 -164652
15794 -164652 -69314 43021 90996 -3611 -84678 -62800 -84831 -179376 -214565 -152746 -57310
15783 -57310 9104 22590 13628 65769 54751 126841 79691 77552 109303 61710 51678 3485
15771 3485 -47319 -56858 -93292 -128351 -192744 -188991 -73428 2635 21385 52781 22574 -12209
15759a2209R158L7729l3162o8262n7480N8429N8877K1700J20042m953j19364p9254
15747f8749O1498L5363L4875o8009p8934p1495O2021N517J7002N6185q3555j26537
15735b24818j8505O8893J49746M2962p4296j09235K1609P0089N8045O7220q1146
15724b9436M7041m0040l0959p5699n4305R0723K4103o5001j1401k886k8001M8510
15712a27351J42729J59966o7790p4453Q1883j4758j42192l4026N1739m3299p6254
15701a43806j6038K8530J34950M1622K5624l8169L5721Q521k1343o9863p5822
15690i0073K988K0572M6417q3821n855l5576R7070J0224r8662k7953P6108l592
15678i2153j6840O8356M3035Q361o6571k0833l1008J1505O7788o3724l5943P375
$$ plain form
15759 -12209 -3051 34678 1516 -66746 -124226 -65797 -6920 14780 134822 129869 10505 -68749
15747 -68749 -7251 28112 62987 -5022 -83956 -155451 -93430 -87913 -70911 -14726 -98281 -224818
15735 -224818 -243323 -174430 -24684 18278 -56018 -165253 -143644 -73555 -15510 51710 -29436
15724 -29436 17605 -22435 -53394 -129093 -183398 -92675 -68572 -133573 -144974 -147860 -175861 -127351
15712 -127351 15378 175344 107554 33101 114984 100226 -41966 -75992 -24253 -67552 -143806
15701 -143806 -159844 -131314 3636 45258 70882 32713 68434 76955 55612 -14251 -90073
15690 -90073 -87085 -66513 -20096 -103917 -109772 -145348 -48278 -38054 -136716 -164669 -88561 -92153
15678 -92153 -108993 -40637 2398 10759 -55812 -76645 -107653 -96148 -28360 -92084 -128027 -120652
15666a20652L3313N8886k99l7758j18480K0976J39620L0256J2535n8552k9565
15655f9720o325N8252R9639j21416r1022M7959K4013M9429N5857n2064r273j2466
15643b7137k3699j8076O0590j59002j02052J65951R9314L786k4735L3133l7282
15632b9209M0490P5658K118M8250o911o5831K1358O4208p8442J9434j76107n8468
15620a43452j4611j16218N7043K0361P413R7629N8002J2470N2757o4359R742j3990
15608c7213K4718k9654J2808N8589O7039j02375j05657k5169J4835P990N2699
15597f1390K6152l1431L9800K6621m8787K1691M6456n6487q1839N1840N9544O5825
15585E7995K5423j7854k2414j1328p0345n1370J34023P6535j07135r6168L9939
$$ plain form
15666 -120652 -87339 -28453 -28752 -66510 -184990 -164014 -24394 5862 18397 -40155 -69720
15655 -69720 -76045 -17793 81846 -39570 -130592 -82633 -58620 -9191 46666 -5398 -14671 -27137
15643 -27137 -50836 -68912 -8322 -167324 -269376 -103425 -4111 -325 -25060 8073 -29209
15632 -29209 11281 86939 89057 137307 130396 64565 85923 150131 71689 91123 -84984 -143452
15620 -143452 -158063 -274281 -217238 -196877 -189464 -91835 -33833 -21363 31394 -32965 -23223 -37213
15608 -37213 -12495 -42149 -29341 29248 96287 -6088 -111745 -136914 -122079 -114089 -61390
15597 -61390 -35238 -66669 -26869 -248 -49035 -27344 19112 -37375 -119214 -67374 -7830 57995
15585 57995 83418 65564 43150 31822 -38523 -89893 44130 120665 13530 -82638 -42699
15574d2699R6281m483j01359j7260J7961L2105q9566j2023R2116n5729J2604l819
15562g5871q6824n7071J94808R9845j6882r1761L744L3044K097J5594k5550N3505
15550D8678j772l6856p9931k3307L2977L9162J5986N6992j5421J3490o689Q2578
15538A25887K1922j2548l5154P2102J12636p4237j77563q0443K9061q239n5272
15527h1848j14227Q7642k2115p860N2846m7076j05057O4677P9203K6079j9862
15516h7598L7116Q2359j02755L8601j6886l0906K4282O5608Q081l0564M3583N4962
15504H5883L9N7442l2431n8288L5547q4990j11418j0281j9639J00810k3873m3160
15492a04359K6321J27317r8614k2542j4720L5274J47291Q8688J7433j07095j55874
$$ plain form
15574 -42699 53582 49099 -52260 -69520 -51559 -19454 -109020 -121043 -28927 -84656 -72052 -75871
15562 -75871 -162695 -219766 -24958 74887 58005 -33756 -30012 3032 5129 20723 -4827 48678
15550 48678 46906 10050 -69881 -93188 -60211 -21049 -5063 51929 36508 49998 43309 125887
15538 125887 147809 135261 100107 172209 284845 210608 33045 -47398 -18337 -26576 -81848
15527 -81848 -196075 -108433 -130548 -138408 -85562 -132638 -237695 -173018 -93815 -67736 -87598
15516 -87598 -50482 31877 -70878 -32277 -49163 -80069 -55787 9821 17902 -12662 30921 85883
15504 85883 85922 143364 110933 52645 88192 3202 -108216 -118497 -138136 -37326 -61199 -104359
15492 -104359 -78038 49279 -49335 -71877 -86597 -51323 95968 184656 202089 94994 -60880
15481f0880o7351M1874l5285Q827K7350J2943M7512o4661N7092J33401l5792M9752
15469A14782r0099p4529K1834J10414J2526l3742r8973l9358P740J19771j8108
15458C2258p2599j443o3066k5790k1357O0171L8562m018N7801j6186o6790M7811
15446c4646n3839M6910O7288k8693J08596j1576p0154p4195l2529O8484M0020
15435B5666K484q5390m4098P3682j8114j30647J0277l6144J8924N3169J1426L3796
15423h4969P9031Q2130m1500l2100j28973J0336J57757J48136K3938n9469j87506
15412c3189j06820R3237J15577L9279j611l6754k9252K5891l0050n6648O002l969
15400a8307k7147R5456l3153l8318M0818n3685k8035N4477P3743M5450L4144j0007
$$ plain form
15481 -60880 -128231 -86357 -121642 -112815 -85465 -72522 -25010 -89671 -32579 100822 65030 114782
15469 114782 24683 -49846 -28012 82402 94928 61186 -37787 -77145 -69405 50366 32258
15458 32258 -40341 -41784 -104850 -130640 -151997 -91826 -53264 -57282 519 -15667 -82457 -34646
15446 -34646 -88485 -41575 25713 -2980 105616 94040 23886 -50309 -82838 -14354 25666
15435 25666 28150 -57240 -101338 -27656 -45770 -176417 -166140 -202284 -183360 -130191 -118765 -84969
15423 -84969 -5938 76192 34692 2592 -126381 -116045 41712 189848 213786 154317 -33189
15412 -33189 -140009 -46772 68805 108084 106473 69719 40467 66358 36308 -20340 -14338 -18307
15400 -18307 -45454 50002 16849 -21469 19349 -34336 -62371 -7894 65849 111299 145443 135436
15388A35436J8189m4705j02323q2291L6541K1826J17396R7305o7890j54427p8395
15377a03338R7519L0063j20717K8691J27669m3690m6286p768l3585m257j8438
15366i4137N3563P8851J10692k6294l4970j37077N8337j9812n9153R7046K8022
15355E5068k2330J6907N7320J5243o4893r8028P4352J27274N8853j56381r1570
15344b8185l8832J07255N7232l3362j5978l7971p2075J4164Q1039K1267J20510
15333A75064Q599p2328k623r6015K5846l2942o0514L964P8064Q9504m6871o8648
15321A100r4505N893r959L568Q4688K8257l5435P5267J35900o3575j19764j54571
15309a43136K1753K3355j9704p073q1751L7808P6078P479j0002O9741R4273L470
$$ plain form
15388 135436 153625 108920 6597 -75694 -39153 -17327 100069 197374 129484 -24943 -103338
15377 -103338 -5819 24244 -96473 -67782 59887 16197 -30089 -37857 -71442 -75699 -94137
15366 -94137 -40574 38277 148969 122675 87705 -49372 8965 -10847 -70000 27046 55068
15355 55068 32738 49645 106965 122208 57315 -40713 33639 160913 219766 63385 -28185
15344 -28185 -67017 40238 97470 64108 48130 10159 -61916 -47752 33287 54554 175064
15333 175064 183663 111335 108712 12697 38543 5601 -54913 -50949 27115 116619 69748 1100
15321 1100 -93405 -87512 -97471 -93903 -9215 19042 -16393 58874 194774 131199 11435 -143136
15309 -143136 -121383 -98028 -117732 -124805 -206556 -168748 -92670 -85191 -95193 -25452 68821 72291
15297G2291p967k6328j3415k2781j2258l0196n3349j6716M4446J7O308L3340m0970
15284f7578M7263l0078j704O3298K5103k4545r7678M2646N1015p3905k9826K5073
15272g0916M8251J6269R742L0523j34518J1914o4312K5601J36M6972O7299p6974
15260i0013m2120r2624J0994O7013P2709q305L5657L2332O4447n0777l6162j3880
15248e0729O1726Q7675q021K0001j20493j7074l9310l0911J11121J13792k0247
15237A07530P040o0213q4413o7133p6551l2795J11663J45111l3988p5780J074
15226e8455m6585j44024k438Q6194k249j5704l7510J6248J1160L4164p6043P0058
15214a65184J48433K583r971L8707p0090j07401O5773N9223k7200l9763J49916
$$ plain form
15297 72291 64324 37996 24581 1800 -10458 -40654 -94003 -110719 -66273 -66256 -59948 -26608 -67578
15284 -67578 -20315 -50393 -52097 11201 36304 11759 -85919 -43273 7742 -66163 -95989 -70916
15272 -70916 -22665 -6396 3346 33869 -100649 -88735 -153047 -127446 -127310 -80338 -13039 -90013
15260 -90013 -132133 -224757 -213763 -146750 -74041 -82346 -46689 -14357 50090 -687 -36849 -50729
15248 -50729 10997 98672 90651 110652 -9841 -26915 -66225 -97136 13985 127777 107530
15237 107530 114570 54357 -30056 -97189 -173740 -206535 -94872 50239 16251 -59529 -58455
15226 -58455 -105040 -249064 -251502 -165308 -167557 -183261 -220771 -204523 -193363 -159199 -235242 -165184
15214 -165184 -16751 -14168 -24139 14568 -55522 -162923 -97150 -37927 -65127 -104890 45026
15203D5026N282n1616O6882L0814k6044q6573P126L8795o8400J8653j3411j6543
15191e0009n4309L7752P4792J03129K3847j18245q7344j3594l6399J594K010m2730
15179a59506o4570J63985M1953m8273J8996J5050J6347n9923o2687N2499N9708
15168b6421j5217o5104J4238J13189L3317n109l3694j4823q8287N046M2396K0196
15156b0273K4732P001P7197O1218o9395r384r2741l5745n5980k6248J0460o4450
15144a93608j2156J47693P0192P6750L7419O5167L6592l7087n5892J2499J8456
15133A66025P918l669j09132O3039O9553L4396j15633j48236m3699j068N4694
15122b5812j1301J8275K8212N9195P4053L6967j57050r7151P1447L5172q5917
$$ plain form
15203 45026 50308 -1308 65574 96388 70344 -16229 -9103 29692 -38708 -20055 -33466 -50009
15191 -50009 -104318 -66566 8226 111355 135202 16957 -70387 -83981 -120380 -118786 -116776 -159506
15179 -159506 -224076 -60091 -18138 -66411 -47415 -32365 -16018 -75941 -138628 -86129 -26421
15168 -26421 -41638 -106742 -92504 20685 54002 48893 15199 376 -87911 -82865 -40469 -20273
15156 -20273 4459 11460 88657 149875 80480 71096 -21645 -57390 -113370 -139618 -129158 -193608
15144 -193608 -205764 -58071 12121 88871 126290 191457 228049 190962 135070 147569 166025
15133 166025 173943 170274 61142 124181 193734 228130 112497 -35739 -79438 -80506 -25812
15122 -25812 -37113 -18838 9374 68569 142622 179589 22539 -74612 -3165 32007 -53910
15111e3910o7249R2871P3768l6693j1820m1749k794L6773N5844M7226P4987j05241
15099F2013p9991j2109N9871Q0962k8968p8815o9393n0201L425J55532p0938P839
15087b0773J33273J14007j04857j47818p6578L2815P4525Q4143M266m1285j9495
15076C2223J1605J46544L1689J6943j3158j43777k15759P55j9398Q9930J8086
15065d4317o6974j4331J04964N5923m668q8930p7363j7552P5011Q9256P9792M0041
15053A30852m7955j53139j22483P3315O8703J03683k8706l8758p1077M6646K9519
15042i400j7123o5224o0277R3444N5191J05187l7797n7690K8322L168N0245l374
15030H4672j37712p3320l1935O5813O6238M4518M4547L5201K3112l9918j2012
$$ plain form
15111 -53910 -121159 -28288 45480 8787 -3033 -44782 -47576 -10803 45041 92267 167254 62013
15099 62013 -17978 -30087 29784 110746 81778 2963 -66430 -116631 -113206 42326 -28612 -20773
15087 -20773 112500 226507 121650 -26168 -102746 -69931 4594 88737 93003 51718 32223
15076 32223 43828 190372 222061 239004 225846 82069 -133690 -132935 -152333 -62403 -44317
15065 -44317 -111291 -125622 -20658 35265 30597 -58333 -135696 -153248 -78237 11019 90811 130852
15053 130852 82897 -70242 -192725 -119410 -50707 52976 24270 -14488 -85565 -38919 -9400
15042 -9400 -26523 -91747 -152024 -58580 -3389 101798 64001 6311 34633 37801 88046 84672
15030 84672 -53040 -126360 -158295 -92482 -26244 18274 62821 98022 121134 81216 69204
15019F9204j05665q449k9964l401J4446Q3168j991m8873l5473N0084q8428O7967
15007c7375q4703J23161P9149j1913j17817N3542j6039j8802N7847o4672k9125
14996f6747O191R0866P824m7884j0284J0896j0660k053L5446j22120j3412J60459
14984C8522l7237o6518K3999M8253P5224M685m5945p4659p2431n934R3055j6034
14972c5020m4083l0619L2064l047O9574R553j5762L5603J8672j3382M8509l4834
14960C7228q549M1508J0569q1206j48943N9472Q0255k3332j00955n6688R2657
14949i7984P9779J14387O7040j34204j14663R3473N1491j17729j722l5490P170
14938h8452J06452O8013p2064p6471l7156p7530K9375R8184j627j18180R384O6858
$$ plain form
15019 69204 -36461 -44910 -74874 -78275 -63829 19339 17348 -31525 -66998 -16914 -105342 -37375
15007 -37375 -122078 1083 80232 68319 -49498 4044 -11995 -30797 27050 -37622 -66747
14996 -66747 -60556 30310 38134 -9750 -20034 -9138 -19798 -21851 13595 -108525 -121937 38522
14984 38522 1285 -65233 -41234 7019 82243 86928 40983 -33676 -106107 -112041 -18986 -35020
14972 -35020 -79103 -109722 -77658 -80705 -11131 -1578 -17340 18263 36935 23553 72062 37228
14960 37228 28679 70187 80756 -450 -149393 -89921 -9666 -32998 -133953 -190641 -97984
14949 -97984 -18205 96182 163222 29018 -85645 7828 59319 -58410 -60132 -95622 -88452
14938 -88452 18000 86013 13949 -62522 -99678 -177208 -147833 -49649 -51276 -169456 -160072 -93214
14926i3214Q6880R3431l774l0105l4126q6058j56075j15744o8904J86656J25593
14915i5440N134l5527P2092J28160M4439k328o0926m7571q6345K4780M7666j51625
14903a57491n1031m1038k1411J20422K8913n7119L2323L6451N9541P2943r5572
14892g3069K9791J4671l504q2599j00885L5460N092k1565L4162r6381k041J20463
14880a40405P7475n2656O6377O3360M1633j9452q0278j3755Q934P390P8707J35345
14868A72675N1071k5507j35661o0274J6722R2593M1046k6399o6640j3716k7797
14857A8113r1192K3854M2067k8883J2010L3443J0052n6854j2961J1272K3392J39852
14845A24165n7026l7824j2035m9318q365j057q673P304N6516J2234j503M7424
$$ plain form
14926 -93214 -6334 87097 83323 53218 19092 -66966 -223041 -338785 -407689 -221033 -95440
14915 -95440 -90306 -125833 -53741 74419 118858 116530 55604 8033 -78312 -53532 -5866 -157491
14903 -157491 -208522 -249560 -270971 -150549 -121636 -178755 -146432 -109981 -50440 22503 -73069
14892 -73069 -43278 -28607 -32111 -114710 -215595 -180135 -175043 -196608 -162446 -258827 -260868 -140405
14880 -140405 -62930 -115586 -49209 14151 55784 36332 -43946 -57701 -48767 -41377 37330 172675
14868 172675 223746 198239 62578 2304 19026 111619 152665 126266 59626 45910 18113
14857 18113 -73079 -49225 -7158 -36041 -24031 9412 19464 -37390 -50351 -39079 -15687 124165
14845 124165 67139 29315 17280 -32038 -40403 -41460 -50133 -42829 13687 25921 24418 71842
14833G1842K3631q2793P33m1590j4821O0294O313r5156j1798l8903K3018L3269
14821f5961N2061l8835q5076O0418O7357K9941j2213K8712K9365M7431R0912o1211
14809A42901j49097K960o380l8378k9623m8293P4889O5786J5620j8177n9198j02477
14797a49467o6455j8251J53006R6321R5912K295j20245k3230j6380o284J60669
14786A07891O7692o5372J8373J14453m7156o6555o4378P4249J00290j42k17376
14775B1969j81910o7163R4955L6737k6039j2856K7787J6908L866K1156Q2176r995
14763G591l4732m5464L1516k63P452P123l858l6804N5668R9253l0864l1746P648
14750C2520L5750r23l1950j68356k5911J1976K4919J51995L7650j3534K0856M6452
$$ plain form
14833 71842 95473 12680 13413 -28177 -42998 17296 23609 -71547 -83345 -122248 -99230 -65961
14821 -65961 -13900 -52735 -137811 -77393 -10036 19905 7692 36404 65769 113200 204112 142901
14809 142901 -6196 -3236 -9616 -47994 -77617 -125910 -51021 14765 30385 12208 -46990 -149467
14797 -149467 -215922 -234173 -81167 15154 111066 113361 -6884 -30114 -46494 -52778 107891
14786 107891 175583 110211 128584 243037 195881 129326 64948 139197 239487 239345 21969
14775 21969 -159941 -227104 -132149 -95412 -121451 -134307 -106520 -89612 -85746 -64590 17586 7591
14763 7591 -27141 -72605 -41089 -41352 -33900 -26777 -30635 -67439 -11771 87482 56618 24872 32520
14750 32520 68270 67347 35397 -132959 -158870 -146894 -121975 30020 67670 54136 74992 121444
14738A21444O3129K1371q543j10727q2904r2906j9532K0134J83225M4040J2586
14727A51317M0401m3444J7194O2664p1576j36526k764n462k0045o0313K2998j8500
14715f4056l9787m723O3991Q6211J08984J64j01039j02557k3754j2863L2698l8834
14703i5565k1938j15861J9730Q7657O8881j9722J1520j3453l0728L2265J28628
14692E1414P7209o5533l5501l2844q032j06315r6495l1572j3547l3599J7118J07632
14680a70065O3089p882M6282P8521k6042j45318K794P6959Q6117K8541P7006K8164
14668A38166j650L123q5310O820r1858q6120Q6126l6803k7114R7048L2885m6046
14656a0733J08727J279L986j2590n5270K728Q0041J22299n2465q1421p9756m7086
$$ plain form
14738 121444 184573 205944 197401 86674 3770 -89136 -108668 -88534 94691 138731 151317
14727 151317 191718 148274 165468 228132 156556 20030 17266 11804 -8241 -68554 -45556 -64056
14715 -64056 -103843 -108566 -44575 41636 150620 150784 49745 -52812 -76566 -89429 -56731 -95565
14703 -95565 -117503 -233364 -213634 -125977 -57096 -76818 -65298 -78751 -109479 -77214 51414
14692 51414 128623 63090 27589 -5255 -13287 -119602 -216097 -247669 -261216 -294815 -277697 -170065
14680 -170065 -106976 -114858 -68576 9945 -16097 -161415 -158621 -81662 4455 32996 110002 138166
14668 138166 136516 139639 54329 61149 -30709 -116829 -30703 -67506 -94620 2428 35313 -10733
14656 -10733 97994 99273 103259 90669 35399 38127 118168 240467 188002 106581 26825 -20261
14644b0261k8039n7060K0185N6494N4450L6921M3407m9563L5963k8543n5287o533
14632B134p4587j1343O5961o6568L3265j23761l6028J1961L1173K4218P2272N2950
14620a8353l4321J7270M8008O0675k490p8277R3004j3110r5944L6042J0009k6589
14608d076k441j0077j2452R6154N7500J0419l008m3865l3709K6466k1819j44833
14596h5741Q779n4870P6043m148o486R3723j14056j24677O9114P3706k381l6175
14584a07169J29415J26869k305n4289L3700O8061n5868n3610J8878l7437k8835
14573C7410l2406M7498p5256l7018j9785j16817K8496P4777P1587k6288p5905
14562a23707l8927Q9940L9971K2059L4868M5853m5718l7105R9017k4204m1199
$$ plain form
14644 -20261 -48300 -105360 -85175 -28681 25769 62690 106097 56534 92497 63954 8667 2134
14632 2134 -72453 -83796 -17835 -84403 -51138 -174899 -210927 -198966 -167793 -143575 -71303 -18353
14620 -18353 -52674 -35404 12604 73279 70789 -7488 85516 72406 -23538 12504 22513 -4076
14608 -4076 -6517 -16594 -29046 67108 124608 135027 132019 88154 54445 80911 59092 -85741
14596 -85741 -76962 -131832 -55789 -59937 -66423 27300 -86756 -211433 -142319 -68613 -70994 -107169
14584 -107169 22246 149115 146810 92521 126221 194282 138414 84804 103682 66245 37410
14573 37410 5004 52502 -22754 -59772 -79557 -196374 -167878 -93101 -21514 -47802 -123707
14562 -123707 -162634 -72694 -32723 -10664 24204 70057 24339 -12766 86251 62047 20848
14551B0848O0733k7601o3163m003Q8883L7806n9921r5288p0018k023Q9897K0174
14539c676m6329P7795J27241j9114M3867J5099l6732j29419m4772L122M0660J86588
14527B14330K422j85105r6184O4521R5744K4778q0577j837m7073n4491l4654J0111
14515h8015j10159j6720K04187Q4525j84190L1594l9217k1417j6305L7260J56938
14504C8481m3793p3094L2360P5207K8562k8741K3486o0175n6275N4270j3154j15204
14492a38070k7070M4810k980p0372P9003j2750N5595m0356L3801J11873p976k6019
14480e11j5882j09808j10003J5986J10433J60254K7997o5677M5615j51j30848
14469g2595j23939J9877n2698p1131Q8216r3393q966J09582L9165N860M5129M3433
$$ plain form
14551 20848 81581 53980 -9183 -13186 75697 113503 53582 -41706 -111724 -113747 -23850 -3676
14539 -3676 -50005 27790 155031 135917 179784 194883 158151 28732 -16040 -12918 27742 214330
14527 214330 216752 31647 -64537 -16 95728 120506 39929 38092 -8981 -63472 -98126 -88015
14515 -88015 -198174 -214894 -10707 73818 -110372 -78778 -117995 -139412 -155717 -118457 38481
14504 38481 -5312 -78406 -46046 29161 57723 28982 52468 -7707 -63982 -9712 -22866 -138070
14492 -138070 -165140 -120330 -123310 -193682 -114679 -127429 -71834 -112190 -78389 33484 25508 -511
14480 -511 -16393 -126201 -236204 -220218 -109785 50469 78466 12789 58404 58253 -72595
14469 -72595 -196534 -176657 -229355 -300486 -212270 -305663 -314629 -205047 -165882 -160022 -114893 -71460
14457g1460m3191L6990K6791O0678o9035n7078n619O9221J00978J9048r2050o7405
14445i2132P213O2990Q3025K2942J0147q1947q8613k1761J7544O7464N6001k9879
14433A2994n2518j1092N2843O6959J652l3060n3776O0591J8465j44527L7669P072
14421c6728q2090J24601M0165n2787j46400M687J36271R6561Q5096p6513o4149
14410B8714L7157j27589n1723Q1705J00601j4876p9773k8112o9760J1707n38L5417
14398g7070J55026O4592o1037j50693l6211J16271N9177P3056j03532j32881m4713
14387a38015J9899N7059N4496L4425q2624k9550r4304J6891P3603M1180L1363
14376a5577j6852n0977Q434n689j906M6577l5783J8102P2405p4453l7368J2501
$$ plain form
14457 -71460 -114651 -77661 -50870 9808 -59227 -116305 -121924 -52703 48275 67323 -24727 -92132
14445 -92132 -84919 -21929 61096 84038 94185 12238 -76375 -98136 -80592 -13128 42873 12994
14433 12994 -39524 -50616 2227 69186 70838 37778 -15998 44593 63058 -81469 -43800 -36728
14421 -36728 -118818 5783 45948 -6839 -153239 -148552 -12281 84280 169376 92863 28714
14410 28714 65871 -61718 -113441 -31736 68865 53989 -25784 -53896 -123656 -111949 -112487 -77070
14398 -77070 77956 142548 81511 -69182 -105393 10878 70055 143111 39579 -93302 -138015
14387 -138015 -118116 -61057 -6561 27864 -54760 -84310 -178614 -161723 -88120 -46940 -15577
14376 -15577 -32429 -83406 -74972 -80661 -82567 -35990 -71773 -53671 18734 -55719 -93087 -80586
14364h0586P5358l1078p6152M2226L403r2996J5705R8709N868p1874o6553N6483
14352a21487m6861P5158J15408J4566p0258n6573n0408n4379O7048R9437L9756
14341A1407q6437m1805P3066L5783L7040J6838j20385p004J8814M5058P1456j17180
14329f3349m9664J4425n540J47029R3755n713K4274K2343k0008j82476r6040m1402
14317a62366M9247Q9976O1160R95n3130p1853O0399k7759j30678r3401k4029J21030
14305a80409J31879j1878n6408p410K4741k4204L317n2939N7742k2074O8595L7402
14293c1646l8087k2442J23567K614k0172J6069j11481r7874o815l6952p2767N3235
14281b42751Q0230K7265J3467j9137Q3617P9729O0488K4963j25777l7583p6462
$$ plain form
14364 -80586 -5228 -36306 -112458 -70232 -66829 -159825 -144120 -45411 -39543 -111417 -177970 -121487
14352 -121487 -168348 -93190 22218 36784 -33474 -90047 -140455 -194834 -127786 -28349 11407
14341 11407 -75030 -116835 -43769 -7986 29054 45892 -74493 -81497 -62683 -17625 53831 -63349
14329 -63349 -113013 -98588 -104128 42901 136656 130943 155217 177560 157552 -24924 -120964 -162366
14317 -162366 -113119 -23143 38017 39012 -14118 -85971 -25572 -53331 -184009 -277410 -301439 -180409
14305 -180409 -48530 -60408 -116816 -124226 -99485 -123689 -120372 -173311 -115569 -137643 -69048 -31646
14293 -31646 -69733 -92175 31392 34006 13834 29903 -81578 -179452 -186267 -223219 -295986 -242751
14281 -242751 -162521 -135256 -121789 -140926 -57309 22420 82908 107871 -17906 -55489 -131951
14270a31951R4742K9465R6292r3814j01628L9103L8842j21102j1278J7320j8846
14259a62855J35303O642N7643K5212o9990j9096j93o5562l0899K91J547j0754
14247a32711P5430j8316P3778j671m6617K4312j16279O4097J289J22580n8987
14236a3095q1635l9233M5825J29499P9223l4469j09233q8855K7449l5395k6774
14225a46693K5622L8224P7683N0499p1943k8011L4238o319l8643o9420n6620L4522
14213a56861K7092Q897J1254J8133O8427j1895J0254K3080n5566o9393m8499J03229
14201g1848N3073J4019k488l6363J9181j2799m3112q8037m5862k971O867J1639
14189a98701L3770J6553k9688L7783Q8225P5241J1660m4840J5404K50o7147k7642
$$ plain form
14270 -131951 -37209 -7744 88548 -5266 -106894 -67791 -28949 -150051 -161329 -144009 -162855
14259 -162855 -27552 -20910 36733 61945 -8045 -27141 -27334 -92896 -123795 -123504 -121957 -132711
14247 -132711 -57281 -75597 -1819 -3490 -50107 -25795 -142074 -77977 -76688 45892 -13095
14236 -13095 -94730 -133963 -88138 41361 120584 86115 -23118 -111973 -84524 -119919 -146693
14225 -146693 -121071 -82847 -5164 45335 -26608 -54619 -20381 -26700 -65343 -134763 -191383 -156861
14213 -156861 -129769 -120872 -109618 -91485 -23058 -34953 -24699 -1619 -57185 -126578 -175077 -71848
14201 -71848 -18775 -4756 -7244 -43607 -24426 -37225 -80337 -168374 -214236 -217207 -210340 -198701
14189 -198701 -164931 -148378 -178066 -140283 -52058 23183 34843 -9997 5407 5657 -61490 -89132
14177h9132M1440J09357J0690n5481J405p4868j6048J4902O6798j9176o4756Q908
14165f5961L099M1697J0296n2353P232N9062M7338k8735J1n3419L3931J04919
14153A07117m980k9086k3555n0642o1404k3366M9000J03103n8533k5150Q6285
14142F8789j9397m9460R946j1483j7549J6355m2953o3162R0312N9503o8301n0712
14130g8112Q8561L1447P4703P9429j9125m0664j01019O218l5196J0236Q0605M4506
14118A41589p2917K7780q2033m6626O9425J13420j9725q4463j04385j45K788Q2092
14106B6800R6207L7068J1087o493L8403q8492q9614k9999l1185O0382q7354l3593
14094i6783m7479m6565k5957k9359J0792Q4866l4991j15546R0193P4635j25967
$$ plain form
14177 -89132 -47692 61665 72355 16874 18279 -56589 -72637 -57735 9063 -10113 -74869 -65961
14165 -65961 -62862 -21165 -10869 -63222 -55990 3072 50410 21675 21686 -31733 2198 107117
14153 107117 102137 73051 49496 -1146 -62550 -85916 -36916 66187 7654 -17496 68789
14142 68789 49392 -68 9878 -1605 -19154 -2799 -45752 -108914 -18602 40901 -27400 -78112
14130 -78112 10449 41896 116599 196028 176903 136239 35220 41438 6242 16478 97083 141589
14118 141589 68672 96452 14419 -32207 37218 150638 130913 46450 -57935 -58080 -55292 26800
14106 26800 123007 160075 171162 164669 203072 114580 24966 -5033 -36218 24164 -63190 -96783
14094 -96783 -144262 -190827 -216784 -246143 -235351 -150485 -185476 -301022 -210829 -136194 -262161
14083b62161O1353P264l4806Q3900R9520R9588r7042j0286k6098j99Q3738J25081
14071A29852N7493r1266j56038Q044J44471J3614L7274O5299j25324j41103j514
14060e9198R3522k0053Q2392N8119k7263k3165N4399l1508j35196o1980l1877
14049a01808R2015M9121n9656j6730n467J0745L8601L2148m2661L8154j9738K1343
14037C6067m4505j00558l209J47441J02311j1896k4357j30817k4054K8756J55045
14026A30224O3904j03574r3181J08468n887o1134P6079l2059j4279N3988L7037
14015A59586j3449K0896P0027m4264p3306p4487r9942l19Q4315M8830j50814l7765
14003a10692R1926L5444J0880j00363j49125l1479J7849Q4851J0059n6352j9413
$$ plain form
14083 -262161 -200808 -193544 -228350 -144450 -44930 54658 -42384 -52670 -78768 -78967 4771 129852
14071 129852 187345 96079 -59959 -51915 92556 106170 143444 208743 83419 -57684 -59198
14060 -59198 34324 14271 96663 154782 127519 104354 158753 127245 -7951 -69931 -101808
14049 -101808 -9793 39328 -20328 -37058 -42525 -31780 6821 38969 -3692 34462 14724 36067
14037 36067 -8438 -108996 -112205 35236 137547 125651 101294 -29523 -53577 -24821 130224
14026 130224 194128 90554 -2627 105841 99954 38820 114899 82840 68561 122549 159586
14015 159586 146137 167033 237060 192796 119490 45003 -54939 -55258 29057 77887 -72927 -110692
14003 -110692 -18766 16678 27558 -72805 -221930 -253409 -235560 -150709 -140650 -197002 -216415
13992b16415P6135m8621P4275J41769q923p435J4889N4625m7296m2835M8877J9139
13980E8184M3609J01478k5603q3133r6682p3538L8510k7900m5299L0646n7530
13969a37258j0045N2668O1715J25740m4975N6913o9557O5526k2195j24150j05796
13958a51414N8563j05946k9778L1817L5215p4737Q5385L4650J1113J7726M6149
13947d1257M0750P8742k677L1880q5617q0145k8082P2603J39268J21989J39831
13936C87285p288k9198K27955L38302L62271L77650Q5096j21809q2855j94321
13926A343088l42101k52484j34128r0061j86566p3875R198K2778K0442p1033j06308
13915A38950l3317K4218k0947m1298o5032j8408J07094K0348n5672P1497L4691
$$ plain form
13992 -216415 -140280 -188901 -114626 27143 18220 10785 25674 80299 33003 -9832 39045 58184
13980 58184 101793 203271 177668 94535 -2147 -75685 -37175 -65075 -110374 -79728 -137258
13969 -137258 -147303 -94635 -32920 92820 47845 104758 35201 100727 78532 -45618 -151414
13958 -151414 -92851 -198797 -228575 -196758 -161543 -236280 -150895 -116245 -105132 -87406 -41257
13947 -41257 -507 78235 75558 107438 21821 -58324 -86406 -13803 125465 247454 387285
13936 387285 379997 350799 578754 917056 1279327 1656977 1742073 1620264 1537409 1343088
13926 1343088 1000987 748503 614375 524314 337748 263873 273071 295849 316291 245258 138950
13915 138950 105633 129851 108904 67606 2574 -15834 91260 111608 55936 127433 162124
13904A62124q704m806P5079j04082j19969l7956n2009o3204R3348J36812L9742
13893A16375O760K833m9917Q509j8725k228k7697o0208J9482K4919Q919r38N216
13880C3300L654m9362k375k7519r917L8787J40497o8672l4111o2753L4646M2354
13868C8529o3126J28651n1935k8235J8228M2347p1420L6970q3501j1051P3386
13857B8843m9186M2701J2103N9683Q2917l4395p6057Q026O6785m9476n1086n1004
13845a0146m1906n2961Q7090K2085k8997j2556M6534q426J01602o5494q9374L1902
13833b0647N0930L6786q0523j0626O5748O3246k817n9292q379n0135k3249M9411
13821A0453M2778M5934q5891j51924N1686N118r97l0563J3084Q1158l0604N6719
$$ plain form
13904 162124 153420 148614 223693 119611 -358 -38314 -90323 -153527 -60179 76633 116375
13893 116375 123135 125968 76051 84560 65835 63607 35910 -24298 -4816 20103 29022 28084 33300
13880 33300 36954 -12408 -14783 -42302 -52219 -13432 127065 58393 24282 -38471 -3825 38529
13868 38529 -24597 104054 52119 23884 42112 84459 13039 50009 -33492 -44543 28843
13857 28843 -20343 22358 34461 94144 177061 142666 66609 74635 141420 91944 40858 -10146
13845 -10146 -52052 -105013 -17923 4162 -24835 -37391 9143 717 102319 36825 -52549 -20647
13833 -20647 30283 67069 -13454 -24080 41668 104914 102097 42805 34426 -15709 -38958 10453
13821 10453 53231 99165 13274 -138650 -86964 -81846 -82843 -113406 -100322 -19164 -49768 6951
13809F951J01158q643o224O183m6755n7929N0006Q6555N0215n7562r5650n959
13797B2346M10m2365N376J7614m7061j3305k4211l9705Q999K1786j969J18585
13785B6500k0256n9M6390N1427K1130n8199p1113q6110q858Q3574R6902m3983
13773C7345m9128m78O687j03377n3588R4342M0258L8121L9751o940j46088p3908
13761a77003Q1123M2816K7636J37745k4985L664r210m3489p3079l3116J177j9681
13749h6402J3511k7711l2332J1680J04218J20237N2351j20593q5989L6736J45737
13738A31443K8715j07314o3839M0742N7607J42593L4583J4203n5164n5671q2297
13727H5601n1770q709k7083J707J23583O1066q0880K5840J8993K6558O5654K8655
$$ plain form
13809 6951 108109 99466 93242 99425 52670 -5259 44747 131302 181517 123955 28305 22346
13797 22346 22756 -19609 -14233 3381 -43680 -56985 -81196 -120901 -111902 -90116 -92085 26500
13785 26500 6244 6185 52575 104002 125132 66933 -4180 -90290 -99148 -15574 81328 37345
13773 37345 -11783 -12261 -5574 -108951 -162539 -68197 -27939 10182 49933 42993 -103095 -177003
13761 -177003 -95880 -53064 -25428 112317 87332 90996 81786 38297 -34782 -67898 -66721 -86402
13749 -86402 -72891 -100602 -132934 -121254 -17036 103201 155552 34959 -51030 -14294 131443
13738 131443 160158 52844 -10995 29747 87354 229947 264530 278733 223569 167898 85601
13727 85601 33831 25122 -1961 -254 123329 184395 103515 129355 148348 174906 240560 269215
13715B69215o9820j00076l6273L4835J0480K1461J36783P5296K4433M9950k8429
13704C87855j22751m9681j48462j33331j3698L3031L2555K80m6867O7593K7989
13693C4513k3779L1427M7966p0302j1031M5080k1838j9874K5862O5700j6866L9666
13681A26524k0457N6931k3138J4207O9960K852q388p109k4111j15230n4677o3842
13669d6478k7688L4245K6539P872J5295P1991M7184j7316l469j8188K3637l1247
13657H2377K6895N225N0323Q4293L494r0570j59023J1373R1106J01644P3879p1863
13645B09153j40081j24869j06510j49759j51836l304J57309J84847J64781K9562
13635F9293n6839q7638j01485M6667j7595l5382l476K6009L2625M9643m7880O6299
$$ plain form
13715 269215 199395 99319 63046 97881 108361 129822 266605 341901 366334 416284 387855
13704 387855 265104 215423 66961 -66370 -80068 -47037 -14482 -14202 -61069 6524 34513
13693 34513 10734 42161 90127 19825 8794 53874 32036 12162 38024 103724 86858 126524
13681 126524 106067 162998 139860 154067 224027 226879 218491 211382 187271 72041 17364 -46478
13669 -46478 -74166 -39921 -13382 -5510 9785 81776 128960 111644 108175 89987 113624 82377
13657 82377 109272 114497 164820 249113 252607 162037 3014 14387 105493 207137 281016 209153
13645 209153 69072 -55797 -162307 -312066 -463902 -467206 -309897 -125050 39731 69293
13635 69293 12454 -75184 -176669 -130002 -147597 -182979 -186455 -160446 -127821 -78178 -126058 -59759
13623e9759J08835m0405K4491p354j23814k4390K0800j02055o2310J42392J27536
13612C967J8768K1880n9082j4164N3705M6953n696n1926m3739K3404n1462r3042
13600a50434k8227L2508K7152P7373m0568O6838Q8573N500k0852m3919P0826j507
13588H3263Q8804J20498J1170n6002p405N6146M4417q0361l8417o8285j15007
13577C8821p7380N8238k7241l2535L8841J7613q4854k365N7039K2818R3741J36358
13565B39094l6804k1471j14188r4267M4213n204K5346j6167n3235q6719K9390
13554i0012N3871K5386N7625J08116M6967m2447K8066j5610o7983P3026L4201
13543B11206M3790j22774j36960n5714M8821P8240M633J4597J7231J34394J00799
$$ plain form
13623 -59759 49076 8671 33162 25808 -98006 -122396 -101596 -203651 -265961 -123569 3967
13612 3967 22735 44615 -14467 -28631 25074 72027 66331 14405 -29334 -5930 -57392 -150434
13600 -150434 -178661 -146153 -119001 -41628 -82196 -15358 73215 78715 57863 13944 84770 83263
13588 83263 172067 292565 303735 247733 240328 296474 340891 260530 222113 153828 38821
13577 38821 -38559 19679 -7562 -40097 -1256 16357 -68497 -70862 -13823 8995 102736 239094
13565 239094 202290 180819 66631 -27636 16577 11373 36719 20552 -32683 -119402 -90012
13554 -90012 -36141 -10755 46870 154986 201953 159506 187572 171962 103979 177005 211206
13543 211206 254996 132222 -4738 -60452 -11631 66609 71242 85839 103070 237464 338263
13532C38263p1861m876K0471J6922j15943j2473J1724P4775Q7061N9730n4581
13521C49212j04468j7859k139J3317r1459r0313J1463J4915M5625l6502M7538
13510A39330L4977n3727K4957J05266J15247J5192o3032m3290J6239N7158R3155
13499D41472J21853k9193j8112J01572L0312K1239P8069J45654N4467K3694N9538
13488A030565J8593P9208J31655K36265J46365J11359J32496Q5708J9684J72133
13478B164031K57727K78228L34201M31796M41078L77610N13055Q34832R06191
13469F538749J194603J491864J865318K213932K664878L283789M656616P446128
13461C1355877J2647671K1563382L6922884O0009800Q0441375P2197987L1299464
$$ plain form
13532 338263 266402 261526 281997 298919 182976 170503 182227 257002 344063 403793 349212
13521 349212 244744 226885 224746 238063 146604 56291 67754 82669 128294 91792 139330
13510 139330 174307 120580 145537 250803 366050 381242 318210 274920 291159 348317 441472
13499 441472 563325 534132 516020 617592 647904 669143 747212 892866 947333 971027 1030565
13488 1030565 1049158 1128366 1260021 1496286 1642651 1754010 1886506 1972214 1991898 2164031
13478 2164031 2421758 2699986 3034187 3465983 3907061 4284671 4797726 5632558 6538749
13469 6538749 7733352 9225216 11090534 13304466 15969344 19253133 23909749 31355877
13461 31355877 44003548 65566930 102489814 162499614 242940989 315138976 346438440
13454C46438440J723879k7709774q2074956q3285234m8727610k6163193j5542576
13447F4658976r980138o588270m579979l460374l048290k749163k699562k864791
13439B8688409k628413k114615j730844j652554j426668j279507j225016r36959
13431A5693833q86135q60137o73924o87703o48195o89477n53894n59982m78393
13422I655993n10570m37326k89605k76767k88931l33390m04355k23848k46542
13413F644659k31109j86479j54978j87210k90777j67041j52925k58788j74349
13404D841003l9470j34662j36145k08915j34613j80442j80416k41807q1249m4606
13394C458678j72113q2713j64293j93596j75214M0482n7369j47346j22955o0320
$$ plain form
13454 346438440 348162319 320452545 238377589 155092355 106364745 80201552 64658976
13447 64658976 54678838 48090568 43510589 40050215 37001925 34252762 31553200 28688409
13439 28688409 26059996 23945381 22214537 20561983 19135315 17855808 16630792 15693833
13431 15693833 14807698 13947561 13273637 12585934 11937739 11248262 10694368 10134386 9655993
13422 9655993 9145423 8708097 8418492 8141725 7852794 7519404 7115049 6891201 6644659
13413 6644659 6413550 6227071 6072093 5884883 5594106 5427065 5274140 5015352 4841003
13404 4841003 4801533 4666871 4530726 4321811 4187198 4006756 3826340 3584533 3503284 3458678
13394 3458678 3286565 3203852 3039559 2845963 2670749 2711231 2653862 2506516 2383561 2323241
13384B323241p2577m426M0917q519p7375j11069l2884r3829j07664R2599m6111
13373A902303j17655r7440j07890j02826R6263L0313K4234q0162j06589J7808
13363A458359J02122j26461j70489R135n8928m3265n5280R1024P1270p7131j06178
13352A094178j62455l7462J5091q1228o5446q729l1699n0942p4272k39Q0097J0332
13340F87226p2571k1687L9459q8253q3473Q3344Q380n8549Q4182n6454n5492j6789
13328D49323l5187j4230N1036o9699n2109n7489Q3962O6229P6165n079o3908p8990
13316C50024j3551j5083M8596l1107p8684l8235m2824m6196J5086m2360O6614
13305A72280O5751M7100K3254l1989J08739J16589j04993q7834J5053P7525j2378
$$ plain form
13384 2323241 2250664 2246238 2287155 2278636 2201261 2090192 2057308 1963479 1855815 1948414 1902303
13373 1902303 1784648 1687208 1579318 1476492 1572755 1603068 1627302 1547140 1440551 1458359
13363 1458359 1560481 1434020 1263531 1272666 1213738 1170473 1115193 1206217 1277487 1200356 1094178
13352 1094178 931723 894261 909352 828124 762678 753949 722250 671308 597036 596797 676894 687226
13340 687226 614655 592968 632427 544174 460701 544045 552425 493876 578058 521604 466112 449323
13328 449323 414136 399906 450942 381243 329134 271645 355607 421836 498001 492922 429014 350024
13316 350024 336473 321390 369986 338879 260195 221960 179136 132940 148026 105666 172280
13305 172280 238031 285131 308385 276396 385135 501724 396731 308897 323950 401475 389097
13294C89097k5553M658J25721n346m3224q9830l7991N984n1117q809L7269l0646
13282B70213l7980Q337l9310p2650K7570j3027o7282J57366J02562L7219K2517
13271C95535O8352o82P9889o0886r2488j43843j28695o1780L3056N4385N862m5187
13259A03518J7269R1210l4232k2767m4578L215l3162R9999O4107r7076n0301j22708
13247b5506o6168O8019M8049m6621J11741J3810m7569P523L2846p45j60239r7176
13235a62036O5924N9055J02795Q100j4007Q3993Q3057n6806l5572p6237q2907
13224b4641L1692M4435p83p21J11391L8964n1715M348n9615p711J4083p72k6496
13211G2459R6014l3016k2121L4345J9462R6126l5288k8238k0491J7111l8794q6683
$$ plain form
13294 389097 363544 368202 493923 488577 445353 355523 317532 323516 272399 263590 300859 270213
13282 270213 232233 240570 201260 128610 156180 143153 75871 233237 335799 373018 395535
13271 395535 463887 463205 543094 482208 389720 245877 117182 55402 88458 142843 148705 103518
13259 103518 120787 211997 177765 154998 110420 113635 80473 180472 244579 147503 97202 -25506
13247 -25506 -91674 -23655 24394 -22227 89514 103324 55755 63278 96124 95379 -64860 -162036
13235 -162036 -96112 -37057 65738 73838 59831 143824 226881 170075 134503 58266 -24641
13224 -24641 7051 51486 50703 49982 161373 200337 148622 152970 93355 85644 99727 98955 72459
13211 72459 168473 135457 113336 147681 167143 263269 227981 199743 179252 196363 157569 70886
13199G0886m3908l7955k8151R70K5483J7989n3243P7720k7088J7812n2399J5663
13187a6221Q3901M1150k1494l3522j06462j23745N001N8876l5280O7624J6540
13176f3632K2065O7723N8803J8323N6592r034p7181m6785q408Q8246j13325k8036
13164c4649M4932J04431P7946o4275j01039k0510j06785L1221k6046K5556m4995
13153a14213J8450L4663J11318R7967P2196N3848P704j07108j00028K1744J24478
13142B21019k8984n1804n9082k7062R8613N3752j1125j13562j0562J13970L4507
13131B19680l6390k1210J572p2766p5015N8786l9800K5442k4797P4776J19427
13120B29705l4056r3199l5550J68796J11116n7499p2326r4332L483Q4046j22734
$$ plain form
13199 70886 26978 -10977 -39128 -38158 -12675 5314 -47929 29791 2703 20515 -31884 -16221
13187 -16221 67680 108830 87336 53814 -52648 -176393 -171392 -112516 -147796 -80172 -63632
13176 -63632 -41567 26156 84959 103282 159874 150840 73659 26874 18466 106712 -6613 -34649
13164 -34649 10283 114714 192660 128385 27346 6836 -99949 -68728 -94774 -69218 -114213
13153 -114213 -95763 -61100 50218 148185 220381 274229 281933 174825 74797 96541 221019
13142 221019 192035 140231 81149 54087 152700 206452 195327 81765 71203 185173 219680
13131 219680 183290 162080 163652 90886 15871 74657 34857 60299 35502 110278 229705
13120 229705 195649 102450 66900 235696 346812 289313 216987 122655 126138 210184 87450
13109H7450J09985O6168j67984j18388l4149J6160L9255Q038N6180q5666j15226
13098a38177L8353O5344k0304k0152J08876n1306n3415l9101l2153l1420Q2351
13087i1104J87081J9012j2982O1639K7050o3375j50569o0136O9901J6101o4913
13076f2295j08357j35201l793J75381J2768O500J2344P8261K2058N0716L132l2631
13064A8883K3777N7513l516k3767M3532J3978J4774r796n7143m8655L1437k9275
13052C1742K7764J27132n5559j60481O2499L514j39484j51686M2542J9080m9920
13041b42857l3852J16562J28729J06519P4044O9885k0018q2592j8208l2761q9162
13030b3711l2509R3555K5978m9963p0595J7965k5485M7826l0122L997Q9970M4918
$$ plain form
13109 87450 197435 263603 95619 -22769 -56918 -40758 -1503 6535 62715 -22951 -138177
13098 -138177 -99824 -34480 -54784 -74936 33940 -17366 -70781 -109882 -142035 -173455 -91104
13087 -91104 95977 114989 102007 163646 190696 127321 -23248 -83384 -13483 2618 -62295
13076 -62295 -170652 -305853 -309646 -134265 -121497 -114997 -102653 -24392 -2334 48382 51514 18883
13064 18883 42660 100173 96657 72890 116422 130400 145174 135378 78235 29580 61017 31742
13052 31742 59506 186638 131079 -29402 33097 36611 -102873 -254559 -212017 -192937 -242857
13041 -242857 -276709 -160147 -31418 75101 149145 219030 199012 116420 98212 65451 -23711
13030 -23711 -56220 37335 63313 13350 -57245 -39280 -64765 -16939 -47061 -43064 46906 91824
13018I1824l3358k3746Q4469l3848l6880j4697o2571q139J0776R723M4546N3018
13006H1117M6289L7352J20724k1049q7222j05089o259j03746p2572M3554J51546
12995H4645L7189j10469m2811O8077J1358k5734q9087j04364p635N0587L4181
12984i4063J12902P1047J7279K7444J25283J30888J21437K38049L13194L26377
12974A389837L33686Q7236j43094l35478l43672l15500j64523o3846l8954j25939
12964B79753j01764k9062K640k3420l5320Q5801M8958L933J17762m445n5337q5456
12952B04043j11289j69306N3228J32103K2616M3151k1426n7031L4603o5613q35
12941F4244o1839j9083M5092L8700L64m2132j11493j5664M0446j22296P8834J274
$$ plain form
13018 91824 58466 34720 119189 85341 48461 33764 -28807 -36946 -26170 -16447 28099 81117
13006 81117 127406 164758 285482 264433 177211 72122 65863 -37883 -110455 -66901 84645
12995 84645 121834 11365 -31446 36631 47989 22255 -66832 -171196 -178831 -128244 -94063
12984 -94063 18839 89886 107165 134609 259892 390780 512217 750266 1063460 1389837
12974 1389837 1723523 1810759 1667665 1332187 988515 673015 508492 444646 405692 279753
12964 279753 177989 148927 151567 128147 92827 178628 227586 231519 349281 344836 289499 204043
12952 204043 92754 -76552 -23324 108779 131395 174546 153120 96089 130692 65079 64244
12941 64244 2405 -16678 28414 67114 67478 25346 -86147 -101811 -61365 -183661 -104827 -103553
12929a03553R7585J61414P4945q5354j31888L370R2315M7050j05840n3306n532
12918h794K0578J01407P4334J2720j49638l5123r6175r4191p354k4698O785m7077
12906b47226k8889M7842R9825K6226k9099N8367O0067j1493k5993K086K8370r9357
12894a19274o0225R240l1390k5264K4791J99064P9397o027j07151j17191L2216
12883a21814R1865q2181k5340l1694m232L099N8936O6364N9354J2332J00970J9188
12871A46847k9562n3003j9186l9710P9018O3760m1744j95005M777Q8928R5892
12860A01012K9631R7805k9389j12635o6525l4814j369K8029j3373J5017M3017
12849E6406m5922P4411j76424m4791J9440k8321R1115N630j6989j8972J16230
$$ plain form
12929 -103553 -5968 155446 230391 145037 13149 16519 108834 155884 50044 -3262 -8794
12918 -8794 11784 113191 187525 200245 50607 15484 -80691 -174882 -182236 -206934 -200149 -247226
12906 -247226 -276115 -228273 -128448 -102222 -131321 -72954 -12887 -24380 -50373 -48287 -19917 -119274
12894 -119274 -179499 -170259 -201649 -226913 -202122 -3058 76339 70312 -36839 -154030 -121814
12883 -121814 -29949 -112130 -137470 -169164 -173396 -170297 -111361 -44997 14357 26689 127659 146847
12871 146847 117285 64282 45096 5386 84404 148164 106420 -88585 -83808 5120 101012
12860 101012 130643 228448 199059 86424 19899 -14915 -16284 11745 -1628 13389 56406
12849 56406 10484 84895 -91529 -136320 -116880 -145201 -54086 -48456 -65445 -84417 31813
12838C1813J20343r0049k1698O9906q0291l2474m3445n5374K5655m7283Q1894
12827d1003O1812N6660J7076r0238m5148N8922K618j60959J8634L3510L9479R4095
12815D5458j3921j6534l188j3663k7591l4297j432q906K9320N7812Q918l0791
12803h815Q3463P546l8704r828J5987L2668M922r9578l1001P909N2225j00373
12791h3579o7985O4019k6351J5136J9393M4380j6828j16682K3695J9329J19592
12780e881K264O6961K6220J4687M402j12348m1318J8013j3701N5583L1996j6419
12768C0459j1207r0689P3440P6180l6116O739q2447j12017j9343J53631k3008
12757c4378k6708L4324O2658Q7948J6717j7805r6840j3462n830K4226m2546k974
$$ plain form
12838 31813 152156 62107 40409 110315 30024 -2450 -45895 -101269 -75614 -122897 -41003
12827 -41003 20809 77469 94545 4307 -40841 18081 20699 -140260 -121626 -88116 -48637 45458
12815 45458 31537 15003 11815 -1848 -29439 -63736 -65168 -74074 -44754 13058 21976 -8815
12803 -8815 74648 82194 43490 33662 49649 82317 87239 -12339 -43340 -35431 16794 -83579
12791 -83579 -151564 -87545 -113896 -98760 -79367 -34987 -51815 -168497 -144802 -125473 -5881
12780 -5881 -3617 63344 89564 104251 108653 -3695 -45013 -27000 -40701 14882 46878 30459
12768 30459 19252 -71437 2003 78183 42067 48806 -33641 -145658 -165001 -11370 -34378
12757 -34378 -61086 -26762 35896 123844 140561 122756 25916 12454 6624 30850 -11696 -14670
12745a4670K1582o274Q9282O0367k7272j38534m7429R219R584n1126M0170Q4176
12733B9075k1442J3424o0062M4702l3538Q5611R7660l7757L1159K516k2434N273
12721A34187o3912k3492J39041k9338o1994j4082j0421n6265o6968J16455M8517
12710A11728n6317p8632p4830M1613J19026P9678P8020m0842q4878j588J0055
12699A03033N6290J17607m2090q5162J2294Q7542l5094m2261O62q4739q3499M9412
12687E3995L5337j6875n6705k31904j87241J50246J07860K1271Q193R0363M7253
12676B1793k1550j01187j6363M6892R4739J5240n7860L0661Q3142J3727k7627
12665H1607K2789n8818j29217p6005J11591N8625p0741m9387j9954J40638J26003
$$ plain form
12745 -14670 6912 638 89920 150287 123015 -15519 -62948 -53729 -44145 -95271 -55101 29075
12733 29075 7633 21057 -39005 5697 -27841 57770 155430 117673 148832 151348 128914 134187
12721 134187 70275 46783 185824 156486 94492 80410 69989 13724 -53244 63211 111728
12710 111728 55411 -23221 -98051 -56438 62588 142266 220286 179444 94566 92978 103033
12699 103033 159323 276930 234840 149678 161972 249514 214420 172159 172821 88082 4583 53995
12687 53995 89332 72457 15752 -216152 -403393 -253147 -145287 -124016 -115823 -25460 21793
12676 21793 243 -100944 -117307 -70415 24324 39564 -18296 12365 95507 109234 81607
12665 81607 104396 45578 -83639 -159644 -48053 10572 -60169 -109556 -129510 11128 137131
12654A37131p9674j97220o9587N7808J4037J46740R3867k5980O5631K1937K9917
12643A94607j00238j16702J4896O4042K507K9161O2418J6397k8451m4224Q6794
12632A81207p2362L2982m3591k9597P1192m7852l579N6289j6052L4583K5860o3038
12620A26042K86J6367r4321O8659j6975r39l5111k136l7580l7424P2738K257j8465
12607D3398P1117j1720O9297l5441k4427m8419N0801M1151j05678r1633J19171
12596G7617N3431r3810n0027j5457j8336J321n8623J02624q579K1256J32934l066
12584A41285j57021o6831j0942J4022J934O088J24968J28248p6391k2308p0467
12573A2585p9701m8689R1731R9430p0512m5720L8574N1975P2325K1594j24417
$$ plain form
12654 137131 57457 -139763 -209350 -151542 -137505 9235 103102 77122 142753 164690 194607
12643 194607 94369 -22333 -7437 56605 59112 88273 150691 167088 138637 94413 181207
12632 181207 108845 141827 98236 68639 139831 91979 88400 144689 128637 163220 189080 126042
12620 126042 126328 142695 48374 117033 100058 99119 64008 61872 24292 -13132 59606 61863 43398
12607 43398 114515 102795 172092 136651 112224 63805 114606 155757 50079 -41554 77617
12596 77617 131048 37238 -12789 -28246 -46582 -45261 -103884 -1260 -9839 11417 144351 141285
12584 141285 -15736 -82567 -93509 -79487 -77553 -71465 53503 181751 105360 83052 12585
12573 12585 -67116 -115805 -24074 75356 4844 -40876 -2302 49673 121998 143592 19175
12562A9175j04434j6700P9102k1250n6149r4070j4489P9329R4606k036o0709M2110
12550e5515N338l9344M0903N7103J0741J19691R185o520j07432j03122K5112P2977
12538B9117J9335o1218r2913L8133J088l7911K0358J7270Q6736Q1448q2409j35536
12526a16502N8790k1846o375O1493k8835K7760K4950k4503p8386r9026K3045O2630
12514a16805J40959J32794P4336l0906j65767l8717N3882q1868j01529l6436K4262
12503a45795L8036O3245L568l554J21493N2103m2759j09690p5999J1465R6384
12492H497L2446M2057j08262j5494J7043p622K3824k393k4568k9551L1837n255
12480c7441p5234j6089J06255l9567k3338k4596m4675l6409M9536k9991K403q839
$$ plain form
12562 19175 -85259 -101959 -22857 -44107 -100256 -194326 -208815 -129486 -34880 -36916 -97625 -55515
12550 -55515 -50177 -89521 -48618 8485 19226 138917 148102 141582 34150 -68972 -43860 29117
12538 29117 48452 -12766 -105679 -67546 -66458 -104369 -84011 -66741 19995 101443 19034 -116502
12526 -116502 -57712 -79558 -85933 -24440 -53275 -25515 -565 -25068 -103454 -202480 -179435 -116805
12514 -116805 24154 156948 231284 200378 34611 -4106 49776 -32092 -133621 -170057 -145795
12503 -145795 -107759 -44514 -40946 -44500 76993 129096 86337 -23353 -99352 -87887 8497
12492 8497 40943 83000 -25262 -40756 -23713 -31335 -7511 -9904 -34472 -64023 -32186 -37441
12480 -37441 -112675 -128764 -22509 -62076 -85414 -110010 -154685 -191094 -141558 -171549 -169146 -177985
12468a77985j5732M5573j3123l1430o9923J9011k5585J12475O2973K70K1511M6718
12456b5247L2285J21956O6901K067j09497j31609l7383J5096M9224P6487k849
12445E7431m9598l1358L8102Q2954M5832j3786j65709m7778O5852j7098M4055
12434H899J3450K1054p1717j3148R4502m0966q9728n1756l81L4539L1749l7273
12422a00776M7133N1578L842M7575q608j3316J41463J2030j0406L9463j9325P045
12410A97698k2268m2741m6302O8772m5612k755K829K3775n5741N2585k8468n1602
12398E0170M6145N7911M711L9067k4434j22380n3362k1798J0032j18630k9139
12387a61707K2178L9790K7546J1395l1906k83N8706O2373j9213R3927M5508r7207
$$ plain form
12468 -177985 -193717 -148144 -161267 -192697 -262620 -243609 -269194 -156719 -93746 -93476 -71965 -25247
12456 -25247 7038 128994 195895 197962 88465 -43144 -80527 -65431 -16207 60280 57431
12445 57431 7833 -23525 14577 97531 143363 129577 -36132 -83910 -18058 -35156 8899
12434 8899 22349 43403 -28314 -41462 53040 12074 -77654 -129410 -129791 -95252 -63503 -100776
12422 -100776 -53643 -2065 1777 49352 40744 27428 168891 180921 170515 209978 190653 197698
12410 197698 175430 132689 86387 155159 109547 106792 109621 133396 77655 130240 101772 50170
12398 50170 96315 154226 158937 198004 173570 51190 -2172 -23970 -13938 -132568 -161707
12387 -161707 -139529 -99739 -72193 -60798 -92704 -92987 -34281 28092 8879 102806 148314 51107
12375E1107K0381K5220j1016k2229j12031K9193O7111m9676j0405J17052j74989
12364g0282l3430P0957J00093n2154j46574P3819M1570j9690l2131q1411p4960
12353b24193J07290M6495n0j7l022l2220P6660J2629r5590k4799P5832J26673
12341F5688J20857l1793M5252r7931j11664j57701q9993M8213P3999J20657j0010
12330b4426m7549q8516K6987R191n6528K1713J9746N613R6922O0221J3194J3963
12318E0531p26l0651r1984M1136K7940O3352r9987j73287n2639L6370O6233J01097
12306f2615M2619n8786O8884k0805M655O421N7351L8445p1861L6552N184n2650
12294f606n811K7806J5285r5236n0459N8228k2736q9102J02100M3705l2605m5806
$$ plain form
12375 51107 71488 96708 85692 63463 -48568 -19375 47736 -1940 -12345 104707 -70282
12364 -70282 -103712 -32755 67338 15184 -131390 -57571 -16001 -35691 -67822 -149233 -224193
12353 -224193 -116903 -70408 -70458 -70475 -73497 -105717 -29057 -16428 -112018 -136817 -60985 65688
12341 65688 186545 154752 200004 102073 -9591 -167292 -257285 -209072 -135073 -14416 -24426
12330 -24426 -71975 -160491 -133504 -124313 -180841 -159128 -139382 -133769 -36847 23374 36568 50531
12318 50531 49805 19154 -72830 -31694 -3754 59598 -40389 -213676 -266315 -229945 -163712 -62615
12306 -62615 -19996 -78782 -9898 -30703 -26048 -19627 37724 76169 4308 40860 46044 -6606
12294 -6606 -12417 15389 30674 -64562 -115021 -56793 -79529 -168631 -66531 -22826 -55431 -101237
12282a01237m8274k173L6376m1825J0827Q7009j3162O9681o8549j3184L8676N1045
12270E210n516N586J3413K7096k4249m1184L3482j10379n5192R8312L9170r3050
12258a07301N2927L9684p316L5319k0077N730J39465l1385j32146k7275m196j9515
12246g6086L819q9408K992O5457N1971R9600k1385J3173L655k3227m4804j8409
12234c2652L9177L8742j6872o4112m4333J0114J23326L1524j1597m7828p9502
12223e4013j31238m6882J04921N1138J00678n5652j02422o8321j7478R9879J58470
12212C9080k69K3734p2643l9475N6098N3026j254O05P6471m7270n315j00239l4729
12199e2180O7581q7657N755j3465m8796J07234K7341k4784M8642n933j8105p0836
$$ plain form
12282 -101237 -149511 -151684 -115308 -157133 -146306 -59297 -72459 -2778 -71327 -84511 -45835 5210
12270 5210 -306 5280 18693 45789 21540 -19644 13838 -96541 -151733 -53421 -14251 -107301
12258 -107301 -54374 -14690 -22006 13313 -6764 -1034 138431 107046 -25100 -52375 -56571 -76086
12246 -76086 -72267 -161675 -158683 -93226 -41255 58345 36960 50133 53788 30561 -14243 -32652
12234 -32652 6525 45267 28395 -35717 -80050 -69936 53390 84914 73317 25489 -54013
12223 -54013 -185251 -232133 -127212 -76074 24604 -31048 -133470 -201791 -219269 -119390 39080
12212 39080 38811 62545 -10098 -49573 6525 59551 58297 58902 135373 88103 82788 -17451 -52180
12199 -52180 15401 -72256 -66501 -79966 -128762 -21528 5813 -18971 29671 23738 5633 -65203
12187f5203l4910J32772J09906j21687r5703Q1858J24945p1399J5220o5295J0348
12176B0852k3226l2665J6374m9382n8561j5041P4012J9231M2275L7075m1349N8443
12164D8038k8353o2496o0052j8925L2464N2683L5770l6557l6272m5477J4021j7586
12152a22742l5599M2700n5588p2619J44819R8993R0141m6281l02P8784j38682
12141a6376n5790N7370n9691m0604N1207J57062M3482p5234l2553j03188m7030
12130a21345N3479J93404P3716j05709K9979j21408r8539O4912K5169k6813P0764
12119C7609m169K6220O1361o9668J4301K23556k1598p4598q2975j5607k2643q1686
12107i897N5194J5995n4618k4992Q744p9455o9455k5481O0309J3433R7329J20988
$$ plain form
12187 -65203 -100113 32659 142565 20878 -74825 7033 131978 60579 75799 10504 20852
12176 20852 -2374 -35039 -18665 -68047 -126608 -141649 -67637 -48406 -6131 30944 -10405 48038
12164 48038 19685 -42811 -102863 -121788 -89324 -36641 -871 -37428 -73700 -119177 -105156 -122742
12152 -122742 -158341 -115641 -171229 -243848 -99029 -36 90105 43824 43522 122306 -16376
12141 -16376 -72166 -14796 -74487 -115091 -63884 93178 136660 61426 28873 -74315 -121345
12130 -121345 -67866 125538 199254 93545 123524 2116 -96423 -31511 -6342 -33155 37609
12119 37609 33440 59660 121021 51353 65654 289210 267612 193014 110039 94432 71789 -9897
12107 -9897 45297 61292 6674 -18318 -9574 -89029 -158484 -183965 -123656 -110223 -12894 108094
12095A08094k3410L668k941j12144j09301m0316j6584L2354Q4201J34320M7704
12084A05645n7788K163j5188L2281N4770J8233n6231p4772K5079r1253M253R4572
12072D1764j3310j17333o007r856K0400L6051P4809N2434L12o1027m5472R0032
12060F2797k0867p2449n0650O1707P2553J325M5366o8203k0051L5173J3564q300
12048E1965N1853L8908q9077j48919q3241L6786o4839l3955p4193N0528R6671
12037a67513Q3021R4951J22671K9392n4516q8000o1104J17635J7937L0739J8621
12026A43834o1482m571M8018k9950k0180k5576r6577m3811L7410j2396L472L5003
12014b6806Q5804l3022r3525R1427O4968L7491Q8169p169r4183o3352j5856O795
$$ plain form
12095 108094 84684 88352 85411 -26733 -136034 -176350 -192934 -160580 -76379 57941 105645
12084 105645 47857 50020 34832 67113 121883 140116 83885 9113 34192 -57061 -52808 41764
12072 41764 28454 -88879 -94886 -104742 -84342 -48291 26518 78952 79264 18237 -27235 62797
12060 62797 41930 -30519 -81169 -19462 53091 54416 99782 31579 11528 46701 60265 51965
12048 51965 103818 142726 53649 -95270 -178511 -141725 -206564 -240519 -314712 -264184 -167513
12037 -167513 -84492 10459 133130 162522 108006 20006 -41098 76537 94474 125213 143834
12026 143834 82352 77781 125799 95849 75669 50093 -46484 -90295 -52885 -65281 -61809 -26806
12014 -26806 58998 25976 -67549 23878 88846 126337 214506 207337 113154 49802 33946 40741
12002D0741R607O9455j12924j65397l9121J68080Q6708J6076K424K2248j0950
11991H6947l0441n1339Q2054N5634l7774q3152k037m776l4028P6639M5923q2544
11979B1106M6693Q378r3833n1593P0588N8913j1637k598M1645k5306j39905j00626
11967a78175k0668N9064P7944n2489p8205N6577J06623J63024k1601o1843O166
11956E6417J2000l0723r2668o3046K5599J00693Q3709n887r4926j35177N6100
11945h7909J38731k6149j10393N1069K4196j3498k9499j168K5442j4770j783m5050
11933i0781k85M2547j8116J4727M5250J35028K3892n1455P8201r7989m7296k5008
11921H715m6352L8680O0394N131K4232j07426o8760N2710j3228J17834J01783
$$ plain form
12002 40741 50348 119803 6879 -158518 -197639 -29559 57149 73225 75649 97897 86947
11991 86947 56506 5167 87221 142855 105081 21929 19892 15116 -18912 57727 103650 21106
11979 21106 67799 76177 -17656 -69249 1339 60252 48615 46017 87662 62356 -77549 -178175
11967 -178175 -198843 -139779 -61835 -114324 -192529 -135952 -29329 133695 112094 50251 56417
11956 56417 68417 37694 -54974 -118020 -92421 8272 91981 86094 -8832 -144009 -87909
11945 -87909 50822 24673 -85720 -34651 -10455 -23953 -53452 -54620 -29178 -43948 -45731 -90781
11933 -90781 -91066 -48519 -66635 -51908 -6658 128370 152262 100807 179008 81019 33723 8715
11921 8715 -37637 1043 61437 66568 90800 -16626 -85386 -32676 -45904 71930 173713
11910A73713J08967L7423j41953j9770j1488n7928k2295j4466l7350l6566k2428
11899d4141m071R3844m757n4891J4502M6262r3874p2683P9377K08906R4785j34158
11887A29101l7222o0428r2839j4114O0278N6192j7927j03j4638n4372j4382P2823
11875A2369N390j4483R5941k4140n8725m1532l6826O1722L6277m7402J6001K8516
11863C3108J0067o982j5534M1146r0564l4667M110N5543Q2544L6831q5291j04805
11851g4494J5327k6916M4785q1303m5685k0649k7705P4316N0668k3247J55855
11840D0952k7884m4147K8708o399Q3587j6472j04310o0433J22261N520n6076K6799
11828g894Q3747j4808p1614o8655j7784Q0749J2256J15552J8903q8510p3196K0700
$$ plain form
11910 173713 282680 320103 178150 158380 146892 88964 66669 52203 14853 -21713 -44141
11899 -44141 -48212 45632 40875 -14016 486 46748 -47126 -119809 -40432 168474 263259 129101
11887 129101 91879 31451 -61388 -75502 -15224 40968 23041 22938 8300 -46072 -60454 12369
11875 12369 17759 3276 99217 75077 16352 -25180 -62006 -284 35993 -11409 4592 33108
11863 33108 43175 36193 20659 61805 -28759 -63426 -59316 -3773 78771 115602 30311 -74494
11851 -74494 -59167 -86083 -41298 -122601 -168286 -188935 -216640 -142324 -91656 -114903 40952
11840 40952 13068 -31079 -2371 -8770 74817 58345 -45965 -106398 15863 21383 -34693 -7894
11828 -7894 75853 61045 -10569 -79224 -97008 -16259 -4003 111549 130452 41942 -31254 -10554
11816a0554K373N8821k7074m8217m9689J28129j8694j3928M349J12922j2724p910
11804A17804K7196l0260j30140o7290M7649N5971J3197O6858p1003Q189l911n2275
11792a8015k4607L4043O9995K2670L628n4917r4847j36181k2375N3196L6903p32
11780a31239l8470P3793M6797M0695K6448p4959j57823j00471M4862R4902l6535
11769b12000j4117k6757K7013J43446k876o1344M7740J15316N5857j08716L2374
11758d064J11631j18030m4636l745M3974o7640P3664P7353J0516K3358N5120n2949
11746A04552r256m1584O1915n4739k30562o3799R3749K1616P3252O7783l3575
11735a0648K3343j3674m7234J1806L109l2102M0099K1107p1879j14450k5420M9113
$$ plain form
11816 -10554 -8181 50640 23566 -24651 -74340 53789 35095 21167 25516 138438 125714 117804
11804 117804 145000 114740 -15400 -82690 -35041 20930 34127 100985 29982 38171 34260 -18015
11792 -18015 -42622 -8579 61416 84086 87714 32797 -62050 -198231 -220606 -167410 -130507 -131239
11780 -131239 -169709 -95916 -49119 -8424 18024 -56935 -214758 -315229 -270367 -175465 -212000
11769 -212000 -226117 -252874 -225861 -82415 -85291 -146635 -98895 16421 72278 -36438 -4064
11758 -4064 107567 -10463 -55099 -58844 -14870 -82510 -8846 68507 79023 102381 157501 104552
11746 104552 95296 53712 115627 60888 -169674 -233473 -139724 -118108 -44856 22927 -10648
11735 -10648 12695 -979 -48213 -36407 -33298 -65400 -25301 -4194 -76073 -190523 -215943 -166830
11723a66830O5782J45068J45536j04896j43198j9520L5728M5261p2570j6678J8330
11712f7987r092N9431J3303M4578K9777J1347N7121l5184P11n6043l4289p9957
11700f6284k497m0439l0164o0620o959m7466N6014Q7038n0400k7651J94226P6538
11688H1336k5096k3238k5718p533M5127l6389l3984o5153p2691L7040L0594L2853
11676f2852Q475k2645Q4147M1996o8158L3374j02390n9832p5736J8574M4935J5665
11664a44447R845P7737N0422J4055o82J04652P6904j01877J4563r756j3645m9595
11652B8176n913Q026R2891Q7063j79517k3256P1031n0830j2538P7725K9058o8862
11640E3054o6597k7804N73j5179j13039k3285J39791N7889k0054o6496q86l1134
$$ plain form
11723 -166830 -101048 44020 189556 84660 -58538 -78058 -42330 2931 -69639 -86317 -67987
11712 -67987 -77079 -17648 -4345 40233 70010 81357 138478 103294 104005 47962 13673 -66284
11700 -66284 -68781 -109220 -139384 -200004 -206963 -254429 -198415 -111377 -161777 -189428 4798 81336
11688 81336 56240 33002 7284 -249 44878 8489 -25495 -90648 -163339 -126299 -95705 -62852
11676 -62852 -54377 -77022 7125 49121 -19037 14337 -88053 -147885 -223621 -205047 -160112 -144447
11664 -144447 -134602 -56865 -6443 7612 6930 111582 188486 86609 101172 91416 77771 28176
11652 28176 22263 30289 123180 210243 30726 7470 78501 27671 15133 92858 121916 53054
11640 53054 -13543 -41347 -40774 -55953 -168992 -192277 -52486 5403 -14651 -81147 -82033 -113167
11628a13167P986n5933J4005M3639M5606j4389M8881O7584l2085r6690n9653M5938
11616i8278J29061O1400k0250j00411p2683P9785J5646K8855K0762j48898N8580
11605d6431M1280j8205k2780L814n1057L6114l0048N4726R4033m7443n4303J8564
11593b1736P2570P6813n4775j170M6052m1201j5307r1538L0467P7072N3524j11881
11581A8890K2707K5893l0557j5351J3498q0184J013Q6592n2700J4819L9089l6631
11569G078j08831k2377l1363j9773O0274K2500M3410O4230m2674o1054R231M9832
11557b9517n465K9760k9383o1376o8243K1571J1035l9730n5936N6506J45981j3459
11545c8256q9426N0797K1511M4170P2875K2990P8120N4125q5832j07330M3522
$$ plain form
11628 -113167 -105181 -161114 -147109 -103470 -57864 -72253 -23372 44212 12127 -84563 -144216 -98278
11616 -98278 30783 92183 71933 -28478 -101161 -21376 -5730 23125 43887 -105011 -46431
11605 -46431 -5151 -23356 -46136 -42322 -93379 -57265 -87313 -32587 61446 14003 -40300 -21736
11593 -21736 50834 127647 72872 71702 117754 76553 61246 -30292 175 77247 130771 18890
11581 18890 41597 67490 36933 21582 35080 -45104 -44091 42501 -10199 4620 43709 7078
11569 7078 -101753 -124130 -155493 -175266 -114992 -92492 -49082 15148 -27526 -88580 -79349 -29517
11557 -29517 -34982 -5222 -34605 -95981 -164224 -142653 -131618 -171348 -227284 -170778 -24797 -38256
11545 -38256 -127682 -76885 -55374 -11204 61671 84661 162781 216906 131074 23744 67266
11534F7266P2261r7854K213j1618l6553j27047K5242L0226O664n7367m3103j6669
11522a86339N8711R9242j5872l0009R1273n0346L9276J19003K3794r0731n6247
11511A755n4112p0878L7480J22923Q1674K869o9605m3308l743O18L2216M0802
11499G8691k1712n8332j8863k7840O6166k1711k8633m5667o0513l278Q5945L8478
11487a7269M204P9617J6802k3883J7814j39715k1730M9637L8718P7620P904O7433
11475A57152l3777O095o6689q6617j6185N4497o4638j8398K1300J3619l7267n6453
11463a27361M1666J30647O249M3774N2952q2290o6269O2682m0837p9026M318L6686
11451a6809J31623q6800j63950k1437N2130J6623m5149R4220N8586m3318l4293
$$ plain form
11534 67266 139527 41673 43886 32268 -4285 -131332 -106090 -75864 -69200 -126567 -169670 -186339
11522 -186339 -127628 -28386 -44258 -74267 17006 -33340 5936 124939 148733 58002 1755
11511 1755 -52357 -123235 -85755 37168 118842 121711 52106 8798 5055 5673 37889 78691
11499 78691 56979 -1353 -20216 -48056 18110 -3601 -32234 -77901 -138414 -141692 -55747 -17269
11487 -17269 -13065 66552 83354 59471 77285 -62430 -84160 -34523 4195 81815 89719 157152
11475 157152 123375 129470 62781 -23836 -40021 14476 -50162 -68560 -47260 -33641 -70908 -127361
11463 -127361 -85695 44952 51201 94975 147927 65637 -632 62050 21213 -57813 -53495 -16809
11451 -16809 114814 28014 -135936 -157373 -105243 -88620 -133769 -39549 19037 -24281 -58574
11440e8574N6714K1442N3897L3890N8757l9285o4953j3642n1135R241K1477j4361
11428A3468p1217k6275L8464J07393R9017l5918n5889j47615p906l1071j07078
11417b24627Q3856O5786J9464N2569K9616q788l9011O6387j1265j2776O4584P134
11405I2929M2822L3997j66880J8635J18362K2089m8353k8727l7046N576J1096
11394F4500Q0468N2114J7757r4988j01835p7172k6871J12242L7970K9927o0146
11383C3966l5895J15061n7043N767O8141q2574J9971o2981q4879K8714K9975N0888
11371B9111J01766k4264r2313L2564j3446K7199n8838J3425O498P1228j696J490
11359I2724O4603p2171j46174p2182l8309M7548J1167q818J5976J08297O2161
$$ plain form
11440 -58574 -1860 19582 73479 107369 166126 126841 61888 48246 -2889 6352 27829 13468
11428 13468 -57749 -84024 -45560 61833 160850 124932 69043 -78572 -86478 -117549 -224627
11417 -224627 -140771 -74985 -55521 -2952 26664 17876 -21135 45252 33987 21211 85795 92929
11405 92929 135751 169748 2868 21503 139865 161954 113601 84874 47828 53404 64500
11394 64500 144968 197082 214839 119851 18016 -59156 -86027 26215 64185 94112 33966
11383 33966 -1929 113132 56089 61856 129997 47423 67394 4413 -80466 -51752 -21777 29111
11371 29111 130877 106613 14300 46864 33418 60617 1779 15204 21702 92930 91234 92724
11359 92724 157327 85156 -61018 -133200 -171509 -123961 -112794 -121612 -105636 2661 64822
11348F4822Q1166K2744j25428l9520j08367l5482R0155N8979q3832k295J17239
11337D0181O1436m6915K4545l6954n3631R5766M5948q7184j1993N6691M2513o3051
11325F7352k0986q5014n3656j1112J4768J30918L7048p0250n5242K5510J3055
11314g609o2669j5057K7888J9093K376L9920p4599J2236J8280k2616p9642M0704
11302a01695J61833J8613j63937r3848J9664k2680K8950Q0501l1263R5454l9586
11291d7994k0176L3968O4375M4168K7978K7031O8775n2623l3406k3792r2241j04205
11279a08142j0843R5283M0329m832N4275J39085j4761m5020p9504m2384k1818
11268A668O4899M3992L7860j04652j18478m3142J33773J01872m2626J2177J5869
$$ plain form
11348 64822 145988 168732 43304 3784 -104583 -140065 -49910 9069 -74763 -77058 40181
11337 40181 101617 54702 79247 42293 -11338 84428 130376 43192 31199 87890 130403 67352
11325 67352 46366 -38648 -92304 -103416 -88648 42270 79318 9068 -46174 -20664 -7609
11314 -7609 -70278 -85335 -57447 -38354 -35978 3942 -70657 -58421 -40141 -62757 -142399 -101695
11302 -101695 60138 78751 -85186 -179034 -159370 -182050 -153100 -72599 -103862 -8408 -47994
11291 -47994 -68170 -34202 30173 74341 102319 129350 198125 145502 112096 88304 -3937 -108142
11279 -108142 -118985 -23702 16627 11795 66070 205155 190394 145374 65870 23486 1668
11268 1668 66567 110559 148419 43767 -74711 -117853 15920 117792 75166 87343 103212
11257A03212N7079j52056p0093M4748p0369k8578Q9897l1631m4967Q6757O136
11246i865P9561P7781M5599n9690r7625N187l5396j2820j07256n9776Q0060K2216
11234g2024N5828K9015l9086p908L8259O7929j19207j6362K3513l1852P204O7985
11222C294o2789L2992M8707K2364j9218q1589n4746J3351k0336q4133J56117P0512
11210B4526J9074p0047q9023O7461J01036n268J126O2950k7813o8673L6394p9089
11198b7346J2075j9322j6991K1335Q8411L5985n2061q8996J14174r2792o7212
11187i2740m6447o738Q4858R7358L3928Q722k7338q3618J8386J24987m3889j21296
11175e3827n4790P9154L5558P4526r450l5903N284M7601P8617j0828j48725r9257
$$ plain form
11257 103212 160291 8235 -61858 -17110 -87479 -116057 -26160 -57791 -102758 -16001 -9865
11246 -9865 69696 147477 193076 133386 35761 40948 5552 -7268 -114524 -174300 -94240 -72024
11234 -72024 -16196 12819 -26267 -34175 4084 72013 -47194 -63556 -40043 -71895 -64691 3294
11222 3294 -59495 -26503 22204 44568 25350 -56239 -110985 -97634 -117970 -202103 -45986 24526
11210 24526 43600 -26447 -115470 -48009 53027 47759 48885 111835 84022 15349 51743 -27346
11198 -27346 -15271 -34593 -51584 -30249 58162 94147 42086 -46910 67264 -25528 -92740
11187 -92740 -139187 -145925 -61067 36291 70219 78941 51603 -32015 -13629 111358 67469 -53827
11175 -53827 -108617 -29463 6095 80621 71171 35268 40552 88153 166770 155942 7217 -92040
11163i2040N1875J04780J6786j9352J9237l4041k6506r0946M675J08095m5909
11152c346o1786J18102L5887l4548N8744k6910m0904m8394r8607m9507M4772N8910
11140d7587J38209O75p2577l7690p5230l387k871m0642q214J13777M5969j21267
11128a10835K7142K7617l9999l6921m4525P941R0688P6836L5168j7480J69K3791
11116C9592k1p8240l2707O6997L8422p9336k4653k3012o1871M283o6725J33020
11104h4251N5680o7085o741K5711n1456j8927J11709n865j12663L8158K1069j3247
11092a07908N5951O3193j02574N7024L5375M6069N5283Q103j49799p28L6511M2568
11080C9068K8467r3536L969L3154O1192p0102j20677O7334J14241j9981j23180
$$ plain form
11163 -92040 -40165 64615 81401 62049 81286 47245 20739 -70207 -65532 42563 -3346
11152 -3346 -65132 52970 88857 54309 113053 86143 45239 -3155 -101762 -151269 -106497 -47587
11140 -47587 90622 91297 18720 -18970 -94200 -97587 -100458 -141100 -149314 -35537 10432 -110835
11128 -110835 -83693 -56076 -96075 -132996 -177521 -169580 -78892 -2056 33112 15632 15801 39592
11116 39592 39571 -38669 -71376 -4379 34043 -45293 -69946 -92958 -154829 -150546 -217271 -84251
11104 -84251 -28571 -95656 -102397 -76686 -128142 -147069 -35360 -41225 -153888 -115730 -94661 -107908
11092 -107908 -51957 11236 -91338 -34314 1061 47130 102413 110516 -39283 -40011 -3500 39068
11080 39068 67535 -26001 -22032 11122 72314 2212 -118465 -51131 63110 43129 -80051
11069h0051j0777J5387L1160J11866o4589P2297j0454j4080M1468n175r2469r2581
11057i7998n1124l23K7477R3146J27225N2870J1909M2323q5726j67220m5799P8013
11045a5227J6540N035P3733j2640J4338k9524R648j8856K0355L8923J5577j9719
11033I8183P3752m6274p7898m4929L0293J1483J2867M0072O7521r8600r1663O4308
11021C9115K8364k5496n5236q7802o8957K0431J12373m1388r7616k5908P8860
11010a23260P9687J22295M8831q1819N9204R1822M2889n0424k08379o1991M3297
10999c7848o9648p5185R6855J38971p0737l4392L5222j1350L4076k378j35880
10988a32294P8067K8717p8715L6472P2314k2806k8424K3488p3624r172M866P6809
$$ plain form
11069 -80051 -90828 -75441 -44281 67585 2996 75293 64839 50759 92227 87052 -5417 -97998
11057 -97998 -149122 -149445 -121968 -28822 98403 151273 163182 205505 119779 -47441 -93240 -15227
11045 -15227 1313 6348 80081 67441 81779 52255 61903 43047 63402 102325 117902 98183
11033 98183 171935 125661 47763 2834 33127 44610 57477 97549 165070 66470 -25193 39115
11021 39115 67479 41983 -13253 -101055 -170012 -149581 -37208 -78596 -176212 -202120 -123260
11010 -123260 -43573 78722 127553 45734 104938 196760 239649 189225 -19154 -81145 -37848
10999 -37848 -107496 -182681 -85826 53145 -17592 -51984 -16762 -28112 5964 3586 -132294
10988 -132294 -54227 -25510 -104225 -67753 4561 -18245 -46669 -23181 -96805 -105977 -101111 -24302
10976b4302K2850l1639O8983P0263k2707q2215N5160L5753k0460j15379j13180
10965a56873M9729J26682L4068N2255j17337j36216M1317J33051J4747j3867N061
10954C2617P056L3891L5079j6522l9742L1165O6951n0004K3679L8772n8783n5678
10942D8481l7705o9794q1143K0814N3210R5920p281j2011n93k9867j1721K4323
10930g367Q441o2013L1107J4606K170r4993q5107O8770P2428J17735j1292q0612
10918b6127j0392P0992k0665o7063l9218L1345j678N2264M2035L3745N9205O5863
10906A90306k256p3019m0556l7678k1630k576p6815N1418J53058n157p0243j8086
10894D6766M8054n5099p3883n2021l3071R880N2529K6578j3339L8035o0465j3641
$$ plain form
10976 -24302 -1452 -33091 35892 106155 83448 1233 56393 92146 71686 -43693 -156873
10965 -156873 -107144 19538 53606 105861 -11476 -147692 -106375 26676 41423 27556 32617
10954 32617 39673 73564 108643 92121 52379 83544 150495 100491 124170 162942 104159 48481
10942 48481 10776 -59018 -140161 -119347 -66137 29783 22502 10491 9898 -19969 -31690 -7367
10930 -7367 1074 -60939 -29832 -15226 -13056 -108049 -193156 -124386 -51958 65777 54485 -26127
10918 -26127 -36519 34473 13808 -53255 -92473 -61128 -62806 -10542 31493 65238 124443 190306
10906 190306 188050 115031 74475 36797 15167 12591 -64224 -12806 140252 135095 64852 46766
10894 46766 94820 39721 -34162 -86183 -119254 -109374 -56845 -30267 -43606 -5571 -66036 -79677
10882g9677K3083K4736m525l0388n5935K4939l7691N3428O9227N4687k659l215
10870C6010K0081r0996O8646N4535J0651l0505o2310J5096M9085k3874k5512k405
10858A8502j01851o8644P6488Q9462L7537K5901N4313M5459K4180J765k9466j37299
10846C6347n5575K8170M0101R0912j893P5529M4698p3419j38793k1125r196J18694
10834A34450Q9273L1450k7592j04986j32851o187K3158J1011O6566P6741j57555
10823C478j48204q1948j4626J1369N0293R7921K7064L0822J64899L6660q7588
10812I0140J0459R0460j02674K2867o1514j05481m5972k1486K7782K6404J1494
10801e7521m1337m4389p2359l150M5342O3589M5849l4742m8981R6766Q3802K0409
$$ plain form
10882 -79677 -56594 -31858 -36383 -66771 -122706 -97767 -135458 -82030 -12803 41884 39225 36010
10870 36010 56091 -34905 33741 88276 98927 68422 6112 21208 70293 46419 20907 18502
10858 18502 -83349 -151993 -75505 13957 51494 77395 131708 177167 201347 203112 173646 36347
10846 36347 -19228 8942 49043 139955 138062 213591 258289 184870 46077 24952 15756 134450
10834 134450 223723 255173 227581 122595 -10256 -16443 6715 17726 84292 161033 3478
10823 3478 -144726 -226674 -241300 -229931 -179638 -81717 -54653 -23831 141068 177728 90140
10812 90140 100599 191059 88385 111252 49738 -55743 -101715 -123201 -95419 -69015 -57521
10801 -57521 -98858 -143247 -215606 -218756 -173414 -109825 -63976 -98718 -147699 -50933 32869 53278
10789E3278J2559n3585K5825k7638K2591m4028k2254P958j7457l2494j4841j2019
10777a02105M2476J40501R9991k6084Q305n116j28101N6328J1428j61253o8595
10766a32225l3338M4972J09124j5713L0243o1323R31J44349J44628l1744l2438
10755A67466r3120j7150p2314n0084K7488J2075k5314K468o1716J5513Q9463q0023
10743h5248N759j8496J00863R5634n4782q0029k9372j1177Q4081Q3936k6300r1254
10731b6385K0719O7218k0657l9860k3109M5136K5488q0104M8264j3395l4800k0095
10719e1580O1119m9975K7900K3912K5180J1735r7245N0132L0017k0806J450O5140
10707G6979M8506o1156m6959P6574j6444L7626j8955M5518M0817m6500m8516n4030
$$ plain form
10789 53278 65837 12252 38077 10439 33030 -10998 -33252 -25294 -42751 -75245 -90086 -102105
10777 -102105 -59629 80872 180863 154779 163084 157968 29867 86195 97623 -63630 -132225
10766 -132225 -165563 -120591 -11467 -27180 3063 -58260 -57329 87020 231648 199904 167466
10755 167466 74346 57196 -15118 -65202 -37714 -25639 -50953 -48485 -110201 -94688 -5225 -85248
10743 -85248 -79489 -97985 2878 98512 43730 -36299 -65671 -76848 7233 91169 64869 -26385
10731 -26385 -5666 61552 40895 1035 -22074 23062 48550 -31554 16710 3315 -31485 -51580
10719 -51580 9539 -40436 -12536 11376 36556 48291 -48954 1178 31195 10389 11839 76979
10707 76979 125485 64329 17370 93944 77500 115126 96171 141689 182506 136006 87490 33460
10695C3460k4002n1187P4284R9325k5511O9707J93178L60072N42855O14125P47962
10684B634268Q39200N14641P7718k46346r10843j011172o46310m14363j28782
10675G08011j40774L4807J6265n7028r9102o1449p0996l2383L0821n8975l6833
10664B32364L2977p2614M9904Q4143o6081j15347j7780Q9885M6978M2923q7779
10653B19573r3725l1319J766k4887M0989p2867j6964R5548J05033j20429j15143
10642a2425J22813P3148q0485l7234j11980J0450n734M0701K9397Q2050L3069
10631A43770K4877k5470M9222m6747n7266L919m6277N2088k7618o081O6409P3078
10619B03904o892l9815j35551k6096L2619n257l9034n713N5195j11618O9427J36425
$$ plain form
10695 33460 9458 -41729 32555 131880 106369 176076 369254 729326 1272181 1886306 2634268
10684 2634268 3473468 3988109 4065827 3819481 2908638 1897466 1251156 836793 708011
10675 708011 567237 602044 618309 561281 462179 400730 329734 297351 328172 269197 232364
10664 232364 265341 192727 242631 326774 260693 145346 127566 217451 264429 307352 219573
10653 219573 125848 94529 96295 71408 112397 39530 22566 118114 223147 102718 -12425
10642 -12425 110388 183536 103051 65817 -46163 -35713 -41447 -746 28651 110701 143770
10631 143770 168647 143177 192399 145652 88386 92305 46028 98116 70498 64417 130826 203904
10619 203904 197012 157197 21646 -4450 28169 22912 -16122 -21835 33360 -78258 -8831 127594
10607A27594J04o9251R8838R6315j43368j11822k130R7457O808q7358k2144k6085
10595c5042k3710O4794o6482J3970R5928q7270n3399j1437N8305N2288L271P224
10583A8440L0439M06r3822k1676Q5245N4960r3742k2885l4035K0542P9665j796
10571B1741L552p778o895L6987N1341J5241o3453j26928O7044M6039o908k3375
10559F608L130j12422O626j6784m5177l4486L5149r5513m4704P4782J84030N2729
10547A3968M1246K1934O876M379L8840K4104p765n0044o2947o732O4419m2342
10535D5936j0710l4132K288o8189K8588N820j3691k1910l9445K203P0056L889
10523b9297l4865j3582m8651K4677N0336M7010K4805n7224q3230j5870L4378J19488
$$ plain form
10607 127594 127698 58447 157285 253600 110232 -1590 -3720 93737 100545 13187 -8957 -35042
10595 -35042 -58752 6042 -60440 -46470 49458 -37812 -91211 -102648 -44343 7945 11216 18440
10583 18440 48879 49285 -44537 -66213 19032 73992 -19750 -42635 -76670 -56128 23537 21741
10571 21741 25293 17515 10620 47607 98948 114189 50736 -76192 -9148 36891 29983 6608
10559 6608 9738 -102684 -96058 -112842 -158019 -192505 -157356 -252869 -297573 -222791 -38761 13968
10547 13968 55214 77148 84024 88403 127243 151347 143582 93538 30591 23859 88278 45936
10535 45936 35226 1094 3382 -64807 -36219 -30399 -44090 -66000 -105445 -103242 -33186 -29297
10523 -29297 -64162 -77744 -126395 -101718 -51382 -4372 20433 -36791 -120021 -135891 -101513 17975
10511A7975R2812l851q7468J1697J8079J208j0135q3446l394k1378J58989K7613
10499A18701o3550p1536j1214L1089N3999k7408j54993j5814J78533R7340q3764
10488E1383l6380J9716r833j7120l9780M9515O323j71598k0094J28462J04047
10477F4641R3183M4357m6599j03708j8808j19518j26077k6422K2451J01552L5882
10466g9066l0988R5500J78494K0157j43369m7931m2777k2964O9147M656K8436
10455B9295l2050r948p142l3959m5862k1233R9141M9707r443M430L436o5619m0542
10442g9789j8573j7269J8214k3281n0487k6422R1951M8538N418n2345m8536O0769
10430i1812L7807Q4236P9307m1288n9523O2421O4332r6104r6917J24464P55l8825
$$ plain form
10511 17975 110787 106936 19468 31165 49244 50452 40317 -43129 -46523 -67901 91088 118701
10499 118701 55151 -16385 -27599 3490 57489 30081 -124912 -140726 37807 135147 51383
10488 51383 15003 34719 24886 7766 -32014 17501 23824 -147774 -167868 -39406 64641
10477 64641 157824 202181 155582 51874 33066 -86452 -212529 -238951 -216500 -114948 -79066
10466 -79066 -110054 -14554 163940 184097 40728 -7203 -49980 -72944 -3797 859 29295
10455 29295 -2755 -12703 -19845 -53804 -99666 -120899 -21758 27949 18506 22936 26372 -39247 -79789
10442 -79789 -98362 -115631 -97417 -120698 -171185 -197607 -105656 -57118 -51700 -104045 -152581 -91812
10430 -91812 -54005 30231 109538 68250 8727 71148 135480 39376 -57541 66923 67678 28853
10418B8853O748l1527q6167N2879Q9303N676l3963R5427L2383j13538O4143j32831
10406b2614p5580n9387J21889J23541q3348j57455q363q874j01389O2621M1365
10395a67594Q3182J9235Q2624k8096q3856j30098m2124K1087J21846J48215J6290
10384D0711l6481j17550J5416N9322j3218j17008k3137M9208O083M4642O5730
10373b6282k4277n6381O7199K533J3833J02417J46399q4508j4139l4889r0739
10362A166m8398J0815J14875N5495J773J6460J0593r5077K4200n740R9833O5707
10350B51702M9071J69653J25221J56878K00319N7048n6254Q626J106j1483n7507
10339H94380j06055j08273j63630j29617k6123m4588o7244k7556l5403j39634
$$ plain form
10418 28853 35601 4074 -82093 -29214 60089 65765 31802 127229 159612 46074 110217 -22614
10406 -22614 -98194 -157581 -35692 87849 4501 -152954 -161317 -170191 -271580 -208959 -167594
10395 -167594 -84412 -65177 17447 -10649 -94505 -224603 -266727 -245640 -123794 24421 40711
10384 40711 4230 -113320 -97904 -38582 -51800 -168808 -191945 -142737 -136654 -92012 -26282
10373 -26282 -50559 -106940 -39741 -37208 -23375 79042 225441 140933 126794 91905 1166
10362 1166 -47232 -36417 78458 133953 135726 152186 162779 67702 91902 86162 185995 251702
10350 251702 300773 470426 595647 752525 952844 1009892 953638 962264 963370 951887 894380
10339 894380 788325 680052 516422 386805 360682 316094 248850 221294 185891 46257
10329D6257n0650k9201j1391J28874O5571m0462m9157j2960N600P147L3494n9789
10317C3333l6696k4516J0933P5405N1614p2380N339k0476j17189m6098j8265n19
10305a59515N8625m9383m7202j0443O2980m7844m2219P0268R0835j3028o6087
10294a53013o7664N0100J25252O7832M4051P1010J4035l5217p368r1070j36689
10283a18741j75394K0184J29999Q3157K8769O6656m2399p481p486K6212L62K1975
10271B5813J8977l8839J34500J5406j05357q715p8044o7523M252N3849R5303L4428
10259H4050j03378M6698L0675L3762Q2808R5741k2732r6129p4576j0120L9980
10248A06779n925m8079j25262l2585O2322m5032p6253O164J26865o5154j25517
$$ plain form
10329 46257 -4393 -33594 -44985 83889 149460 108998 59841 46881 52481 59628 93122 33333
10317 33333 -3363 -27879 -16946 58459 110073 37693 43032 22556 -94633 -140731 -158996 -159515
10305 -159515 -100890 -150273 -197475 -207918 -144938 -192782 -235001 -164733 -73898 -86926 -153013
10294 -153013 -220677 -170577 -45325 22507 66558 137568 151603 116386 109018 17948 -118741
10283 -118741 -294135 -273951 -143952 -60795 -32026 34630 -7769 -15250 -22736 3476 3838 25813
10271 25813 44790 5951 140451 155857 50500 41785 -36259 -103782 -99530 -45681 49622 84050
10259 84050 -19328 27370 58045 91807 174615 270356 247624 151495 76919 66799 106779
10248 106779 100854 52775 -72487 -105072 -42750 -87782 -164035 -157871 -31006 -96160 -221677
10237b21677J23898L9026m3734L1408m0083q3436N1636J08933J01454L4884r4226
10226H083J7128O4746R030m9560r240n6064j52818m8195J70277N1756N739r642
10214A240o5097k4181O4720R487N8722K3309M706M0773m7946O3396R0095j1617
10202B07607j16917n1390l0697j8626R0785L9119n0421M4102l8461K9935k9728
10191G5308q5230m3286L2775O7031o2093j01452L815J8069J7986O3973r823N231
10179a7696l3403o4489r5538J08754J5359n5698N6247M3345q8586J9359L4834
10168g7512P5006l6160k0849O6004K2137p5292l4154k7465j2595J11102J05502
10157I5724n2084j4400L2340R5719r8046l6823p3947r6842L4354J4034l9880L8596
$$ plain form
10237 -221677 -97779 -58753 -102487 -71079 -111162 -194598 -142962 -34029 67425 102309 8083
10226 8083 25211 89957 98987 49427 40187 -15877 -168695 -216890 -46613 5143 10882 1240
10214 1240 -63857 -88038 -23318 -13831 44891 68200 72906 113679 65733 129129 219224 207607
10202 207607 90690 39300 8603 -10023 80762 119881 69460 113562 75101 105036 75308
10191 75308 -9922 -53208 -20433 46598 -15495 -116947 -113132 -95063 -77077 -13104 -22927 -17696
10179 -17696 -51099 -115588 -211126 -102372 -87013 -142711 -86464 -43119 -131705 -112346 -77512
10168 -77512 -2506 -38666 -59515 6489 28626 -46666 -80820 -108285 -120880 -9778 95724
10157 95724 43640 29240 61580 157299 59253 22430 -51517 -148359 -114005 -99971 -139851 -101255
10145a01255L7834L6008N3159k8428M4538l9872P7629M1991J095q2508q1463p2612
10133a13884N620M0900p1130P6234M3825j27570J694N4337j1317R570K3944j2069
10121g9846j2701P797O2339P0777N5600j3543l8431m303o1687m7477N3048M2722
10109C4295K7959L2819k6406j2212K0028L4964j93r3928j26607n4248O2922L0023
10097g0584Q3965P6192j8995L7023J7906l3251j9066l0473K5041k0878n4293Q9949
10085H2536K470p3619p3289M8539P9938L5583n8181m5663o02n3016J23962R3273
10073A61931M772q5846o8251m5365o6445o4268K647P0521J492K9198J7033p4290
10061a16871M4631K19412J35801j0249J03085K73172J30139L5948k0725j20912
$$ plain form
10145 -101255 -63421 -27413 25746 -2682 41856 1984 79613 121604 122699 40191 -41272 -113884
10133 -113884 -108264 -67364 -138494 -62260 -18435 -146005 -144311 -89974 -101291 -91721 -67777 -79846
10121 -79846 -92547 -84750 -22411 48366 103966 90423 51992 47689 -13998 -61475 -8427 34295
10109 34295 62254 95073 68667 56455 76483 111447 111254 17326 -109281 -163529 -100607 -70584
10097 -70584 13381 89573 70578 107601 125507 92256 73190 42717 67758 46880 -7413 82536
10085 82536 85006 11387 -61902 -13363 66575 102158 43977 -1686 -2288 -55304 68658 161931
10073 161931 166703 80857 12606 -32759 -99204 -163472 -160825 -90304 -88812 -59614 -42581 -116871
10061 -116871 -72240 147172 282973 272724 375809 648981 779120 815068 794343 673431
10051F73431k00088q6022j28132j25073m5058r6810N7743K0689K3843M3120L3847
10040A71490j16968m7109m6261k9561P2122j8271N6478n6653l922Q7161K1500
10029I0006k043J01640j8023j0146K9680p867l7696l0753K4450L173l9021k8633
10017G4767m4459m375M4348P80n7321L3380p707o8567j38572L3738P4977k7996
10005h7007j05156l9268J9954J014L2055J20865Q6167q0514N4745L5582n9061
9994b0624M4669k464n7338K635o3874l693K7826P5760J41585O8601m1360o4388
9982A07335k2844J4201J5639L3352n9649n3608R229R5054l1086M988L2872L4147
9970A79630r0692j13434Q4882Q6866j09713j70023j7224M1524p8480K720o0119
$$ plain form
10051 673431 473343 387321 259189 134116 89058 -7752 49991 70680 94523 137643 171490
10040 171490 54522 7413 -38848 -68409 3713 -14558 41920 -14733 -18655 68506 90006
10029 90006 87963 189603 171580 161434 191114 183247 145551 114798 139248 142421 103400 74767
10017 74767 30308 25933 70281 71061 13740 47120 39413 -29154 -167726 -133988 -59011 -87007
10005 -87007 -192163 -231431 -211477 -210463 -178408 -57543 28624 -51890 2855 38437 -20624
9994 -20624 24045 21581 -35757 -33122 -96996 -100689 -72863 2897 144482 213083 171723 107335
9982 107335 84491 98692 114331 147683 88034 34426 43655 138709 107623 112611 145483 179630
9970 179630 88938 -24496 60386 147252 37539 -132484 -149708 -108184 -186664 -183944 -244063
9959b44063N0099K13617R9018k1506J7733K7326n0204j30801L3502k7239L703
9948b8815m524Q769J9263O1842K9598m7713m9430J6780M4619P5826l7482j0784
9936G7949Q8222k3231m8510P811j55102n2121P3081m542P8067O8887R5951k7628
9924A78834m5524j05801j66074R634P5111J17051K3826K5164p7960p6519r9470
9913a41728N297Q1288O7294l1898Q4534o4130q7535m291L4538J13935J01668l2055
9901A26917j35711n9006M8023k2784O8362R6483o051N610M6052j4476n1831k8440
9889G3148l4689j2218k676K0473q8589M2132J7786K6176m2427L7384J21963n7582
9877A00881j10781j1974n8227j8363L5546J29400Q7709j026Q089k7133j17786
$$ plain form
9959 -244063 -193964 19653 118671 97165 114898 142224 92020 -38781 -5279 -32518 -28815
9948 -28815 -33339 -24570 -5307 56535 86133 38420 -11010 5770 50389 126215 88733 77949
9936 77949 166171 142940 94430 102241 -52861 -104982 -31901 -36443 41624 110511 206462 178834
9924 178834 133310 27509 -138565 -128931 -53820 63231 87057 112221 34261 -42258 -141728
9913 -141728 -136431 -55143 12151 -19747 64787 657 -86878 -91169 -56631 57304 158972 126917
9901 126917 -8794 -67800 -19777 -42561 25801 122284 116233 121843 167895 153419 101588 73148
9889 73148 38459 26241 23565 44038 -44551 -2419 15367 41543 -884 36500 158463 100881
9877 100881 -9900 -21874 -80101 -98464 -62918 66482 154191 153165 161254 134121 16335
9866A6335J0971Q5776n1569q4387q1103J8027J15001P8356J0058K520j19820J13762
9854A13927J56023j8153n5394p9602l7083m7633l2359L4386Q9781M523N1704N3228
9842B33348m9254k4102k7380j05271r254j00927l3846O4588j1305J15904M6339
9831I8840n4154r7001K6157K0959k8791L45K5303l3251k6983J8218J14467M7784
9819A11893n4660Q93N8505r7370l0449l0889r3516K3406J11747J70359J10817
9808B80736j05786o9684p0953l2002L2021M963j7810o524q2028n1029L6076K7850
9796e4170j9654m0321j1761K9952k5432j4496J22623K01588R877j54192O3878
9785A07892L9483r0468k955m5121o9460r970O681l4969j9032J01765R3746n3725
$$ plain form
9866 16335 27306 113082 61513 -22874 -103977 -85950 29051 107407 117465 119985 165 113927
9854 113927 269950 251797 196403 116801 79718 32085 -274 34112 123893 128416 180120 233348
9842 233348 184094 159992 132612 27341 18087 -82840 -116686 -52098 -63403 52501 98840
9831 98840 44686 -52315 -26158 -5199 -33990 -33645 -8342 -41593 -68576 -50358 64109 111893
9819 111893 57233 58126 116631 19261 -11188 -42077 -135593 -112187 -440 169919 280736
9808 280736 174950 105266 34313 2311 34332 39295 21485 14961 -67067 -118096 -82020 -54170
9796 -54170 -73824 -114145 -125906 -95954 -121386 -135882 -13259 188329 198206 44014 107892
9785 107892 147375 56907 53952 8831 -60629 -70599 -63918 -98887 -117919 -16154 77592 23867
9773B3867p0997p7291K9712L1288k864j3005m677K1996l3787P5324J0727r1818
9761a01525L5768O1183k3929R632M9740M6600k2677K0691k1494l7156P7229O5797
9749A59859J5882j19379j10977Q9057Q2064L579M454J2246r9504j18555J521K1547
9737e8206J3504J41831n9282l3351n465K3429p969n2190j4159L3687J8865m9024
9725d8330N9248l9938j77807l4848J17047N4981J7825J48710Q547q5722j4271
9714E442L3751k4261l74p0164K99j8031L9466l8277L1077P9993m7398j04460M8997
9701f3940J25405M8848l6267l7572l1149p4565l867k4720O9616J36688k8026n1558
9689B8893j1687k1006o8312J3634N73L7000j2853J187J25831N5184j10721K679
$$ plain form
9773 23867 -47130 -124421 -94709 -63421 -66285 -79290 -83967 -61971 -95758 -20434 -9707 -101525
9761 -101525 -65757 -4574 -28503 -18871 30869 77469 54792 75483 53989 16833 94062 159859
9749 159859 175741 56362 -54615 34442 116506 120085 124539 136785 37281 -81274 -79753 -58206
9737 -58206 -44702 97129 37847 4496 -969 22460 14491 -37699 -51858 -18171 694 -48330
9725 -48330 10918 -29020 -206827 -241675 -124628 -69647 -51822 96888 105435 19713 5442
9714 5442 39193 14932 14558 -55606 -55307 -73338 -33872 -72149 -41072 38921 -8477 -112937 -63940
9701 -63940 61465 110313 74046 36474 5325 -69240 -73107 -97827 -28211 108477 80451 28893
9689 28893 17206 -3800 -72112 -58478 -57905 -20905 -33758 -32571 93260 148444 37723 40402
9677D0402o4122n1885K5345M9651o8535k1924R6491p8651m7442n8897j08342O0419
9665b27490Q4291J6596K6746k3211j2806R1797J28879o3018j02662o8225J1062
9654a38041M9724O9338O0463N3279Q618L9579l1661j45945p4933j1858P7302O5096
9642B0961o6253K0367O8147L3234L7770l5296q0971p1307r6084r4428J69302J53858
9630E9300n149m4245J3428l8913r8889J9322J32218k5060p4907L0176K3314q3372
9618i2777L3515L9764o2042n9544K3948o1113n3739j6023R1726O8588j21219j0072
9606b18988N8081O3371k2725J3997O0045P574P9835J443m9638k7079q9577l9972
9594a63633o4024q704N4612L2664m3503M0944P9452L4077Q1124j6163P8405K9791
$$ plain form
9677 40402 -23720 -75605 -50260 -609 -69144 -91068 5423 -73228 -120670 -179567 -287909 -227490
9665 -227490 -143199 -126603 -99857 -123068 -135874 -44077 84802 21784 -80878 -149103 -138041
9654 -138041 -88317 -18979 41484 94763 103381 142960 111299 -34646 -109579 -121437 -44135 20961
9642 20961 -45292 -24925 43222 76456 114226 78930 -2041 -73348 -169432 -263860 -94558 59300
9630 59300 54151 9906 23334 -15579 -114468 -95146 37072 12012 -62895 -32719 -9405 -92777
9618 -92777 -59262 -19498 -81540 -141084 -117136 -178249 -231988 -248011 -156285 -87697 -208916 -218988
9606 -218988 -160907 -97536 -120261 -106264 -46219 -38645 41190 42633 -7005 -34084 -123661 -163633
9594 -163633 -227657 -236361 -181749 -149085 -192588 -151644 -72192 -38115 43009 26846 105251 135042
9582A35042P4364j04380j19501l4558k0089M4964K3748M02n9513Q493K8836k0056
9570d2248N6489q6849o8055M1375l668M1614L5604m2442O5126K1958K290n4650
9558c3456l9054O7061J2134m3884L4749o373j2003L7863M2347j2333q453j4502
9546B4096p812L3192L6438m9132j04437j11077q07Q1875J16179L690p6351n9164
9534a13310N3116Q5301M4309r073j29463M7198J00881J19935j8258j27515p4685
9523b1564j11332Q911O3318R2283K6320j25441J4299J30735J5445j14494o556
9512b8076K8081m4448l7004k8213r361J9888p8176l825K3533Q4459L8161k1602
9500e6583O8313J6793o3276m3306R209O8890m2184k0850L0323J59Q6007N5628
$$ plain form
9582 135042 209406 105026 -14475 -49033 -69122 -24158 -410 -8 -59521 -51028 -22192 -42248
9570 -42248 14241 -72608 -140663 -99288 -102956 -61342 -25738 -68180 -3054 18904 21194 -33456
9558 -33456 -72510 -5449 6685 -37199 -2450 -8823 -20826 17037 59384 47051 38598 24096
9546 24096 16284 49476 85914 36782 -67655 -178732 -179539 -97664 18515 22205 -54146 -113310
9534 -113310 -60194 25107 69416 60343 -69120 -21922 78959 198894 180636 53121 -21564
9523 -21564 -132896 -123985 -60667 31616 57936 -67505 -53206 77529 92974 -21520 -28076
9512 -28076 5 -44443 -81447 -109660 -119021 -99133 -177309 -181134 -157601 -73142 -34981 -56583
9500 -56583 11730 28523 -34753 -78059 -68850 40 -42144 -62994 -32671 -32512 53495 109123
9488A09123q3220q4936j25248M6841J7599j3357P9112M8612k9884j101Q5515K9988
9476G9044j36150l1588N2664Q6724Q8312P8949qr7560J1461j8068n3074J5324
9464G6030m2706N816k8199j1890j56579k3865O0359K4231k78O831J28269j6404
9452B1615m8647k8583N0371M7956o4501L8378o193l9246m2099J8073J9840J51773
9440A18737P2968k4963q1406j33777l4163L3441N5978J5169j7486r1212l2580
9429a19294J18347J47706P9140p9334q0078j47473p5280N9915L9216k2618k8394
9418a08147M5764P639k5103N9866N8164m6406m0944k5900p968J4679L4753J2007
9406b1596j6607l4511l4983r640j4335J00802q0347k8964N1159O3617L729L0084
$$ plain form
9488 109123 25903 -59033 -184281 -137440 -119841 -133198 -54086 -5474 -35358 -36459 49056 79044
9476 79044 -57106 -88694 -36030 50694 139006 217955 217947 120387 131848 113780 60706 76030
9464 76030 33324 39140 10941 -949 -157528 -181393 -121034 -96803 -97081 -90250 38019 21615
9452 21615 -27032 -55615 -5244 42712 -21789 16589 10396 -28850 -70949 -52876 -33036 118737
9440 118737 191705 166742 85336 -48441 -82604 -49163 6815 21984 4498 -86714 -119294
9429 -119294 -947 146759 225899 146565 66487 -80986 -156266 -96351 -57135 -79753 -108147
9418 -108147 -62383 -54744 -79847 -19981 38183 -8223 -49167 -75067 -83035 -68356 -33603 -21596
9406 -21596 -38203 -72714 -107697 -117337 -131672 -30870 -111217 -140181 -89022 -25405 -21676 8408
9394H408o0825r411M3275K7930r9709p6700k7672r065P835R9661K046J5832m0090
9381a18485O303L2543m6199O6965O6379K5221m470N546L260p941p8331p2747j4190
9368a36146Q6153J05477o8080j37532J5683O6342m0133j11153L7845R5484l7996
9357a24056Q7162L4205R878o844L618O2132k8448R402O1975p5001J4217L3389
9345H1629M6272M5406q707P8220j7796k2011m6839m7769l8471j3484j10349l981
9333e7880j4908p0272O7629j6133p0620N7510J87410N0073N0642n4155j55325
9322b6029k4762O9389Q6202L9343O883p7823P4451L9967J2602j4381m0033l2619
9310A13190p3257l8596m9070J9783Q0941M3874M7607n3425l4939O2504o5835k9177
$$ plain form
9394 8408 -52417 -61828 -18553 9377 -90332 -167032 -194704 -203769 -195934 -96273 -94227 -78395 -118485
9381 -118485 -112182 -79639 -125838 -58873 7506 32727 28257 33803 37063 29122 -49209 -121956 -136146
9368 -136146 -49993 55484 -12596 -150128 -134445 -68103 -108236 -219389 -181544 -86060 -124056
9357 -124056 -36894 -2689 7189 345 3963 66095 37647 47049 109024 34023 48240 81629
9345 81629 127901 173307 164600 242820 225024 203013 156174 108405 69934 56450 -53899 -57880
9333 -57880 -72788 -143060 -75431 -91564 -162184 -104674 82736 132809 183451 129296 -26029
9322 -26029 -50791 18598 104800 144143 151026 73203 147654 187621 200223 185842 145809 113190
9310 113190 39933 1337 -47733 -27950 52991 96865 144472 91047 56108 118612 52777 23600
9298B3600o4539J3002j1175l4726N7960L0476K6688R3453O6843j3687l9298L4954
9286A83551L4262m0932j07731K7780K4531k9737m0131J4610q4859j29880j0923
9275a59459j3023Q3438N6399j05214n6523k1279R2615P5640P986j8595O1960K3693
9263B7638j13719M3644J36189L0622k1639n6460j83204j4160J39328L7348k0807
9252D780j1845Q7419P3307K2313l7239J1139M7153J3399n2385Q936o5200j3463
9240H8314K63n003k7986M3427j3115K4838p4940r2059n4308J17680O7774Q7039
9228A61924J20594K5058q8571N2714m1690l1037j265j3566j24008p398L3619j331
9216H5043O0740q1129O94m9153J2554N7794k5111K6562m6277l5168M9397Q0861
$$ plain form
9298 23600 -40939 -27937 -39112 -73838 -15878 14598 41286 134739 201582 187895 148597 183551
9286 183551 217813 176881 69150 96930 121461 91724 51593 66203 -18656 -148536 -159459
9275 -159459 -172482 -89044 -32645 -137859 -194382 -215661 -123046 -47406 -39420 -58015 3945 27638
9263 27638 -86081 -42437 93752 124374 102735 46275 -136929 -151089 -11761 25587 4780
9252 4780 -7065 80354 153661 175974 138735 149874 197027 210426 158041 166977 101777 88314
9240 88314 88577 83574 55588 99015 85900 110738 35798 -56261 -110569 7111 74885 161924
9228 161924 282518 307576 219005 271719 230029 198992 197727 184161 60153 52755 86374 85043
9216 85043 145783 64654 65348 16195 28749 86543 61432 87994 41717 6549 55946 136807
9204A36807q2591q0057o868P410J15506J06079n9639j6924m0777K990K9239m6026
9192F5149M1896J2163K3365P6731P9022j0731o3807q1115p2531j471p6235J22911
9180A15347J25876m4114q6136k9929k7908k3402N8711J3187j3735P4092O2008
9169B23997j7722K1458m6621R1957Q6097p1205q9554L0353O0376K5777N00k0997
9157B94416j2039l0111l4168O6884L2851K6360J26280L5566p6983o8129L7197
9146C98124L4448j1123Q778q1116j2740Q2828O6946J7072j0232N0327j5447p395
9134E20470j3740j30701R8045M3949l2292P9210R6325J42052L0449K5281J4316
9123H73364r714N4842O2102J57596J26494J37935J47588J21193J07451L03720
$$ plain form
9204 136807 54216 -25841 -32709 -25299 90207 196286 136647 119723 78946 81936 111175 65149
9192 65149 107045 119208 142573 219304 298326 287595 223788 142673 70142 68671 -7564 115347
9180 115347 241223 197109 110973 81044 53136 29734 88445 101632 87897 161989 223997
9169 223997 206275 227733 181112 273069 359166 287961 198407 228760 289136 314913 315413 294416
9157 294416 282377 252266 218098 284982 317833 344193 470473 506039 429056 360927 398124
9146 398124 432572 421449 430227 349111 336371 419199 486145 503217 492985 543312 527865 520470
9134 520470 506730 376029 474074 518023 485731 564941 661266 803318 833767 859048 873364
9123 873364 863650 918492 980594 1138190 1264684 1402619 1550207 1671400 1778851 2082571
9113B082571L86517K27003J64535K43366J74354M58586N36233N64991P11595R21380
9103F471131J152291J412059J852470K544708L549383N104907P678338J1616159
9095D1381446J6938581K2986823K6020723K1620940J0695318p56550j2984330
9088A25902951k4158253k5212213j8785731j2590812q334637n670799m168295
9081B6982211l119563k496498j970386j733064j491852j259611j050154j018343
9073A2842740r56024q44999p90549o11097n98075n44686n36217n04164l54733
9064G102196l28527m23010l12921k78776l06066k86832k89061k81682r3384j40913
9054D361024l04135k04783m5168o5089r6190j23150j11588p5819r7249r7462j48409
$$ plain form
9113 2082571 2469088 2696091 2860626 3103992 3278346 3736932 4273165 4838156 5549751 6471131
9103 6471131 7623422 9035481 10887951 13432659 16982042 22086949 29765287 41381446
9095 41381446 58320027 81306850 107327573 128948513 139643831 138887281 125902951
9088 125902951 101744698 76532485 57746754 45155942 36821305 31150506 26982211
9081 26982211 23862648 21366150 19395764 17662700 16170848 14911237 13861083 12842740
9073 12842740 11886716 11041717 10251168 9640071 9041996 8497310 7961093 7456929 7102196
9064 7102196 6773669 6350659 6037738 5758962 5452896 5166064 4877003 4595321 4501937 4361024
9054 4361024 4056889 3852106 3806938 3741849 3645659 3522509 3410921 3335102 3237853 3140391 2991982
9043B991982j23595p4833j42105j44356L016N213J2737n5516p6870j90614j27852
9032B077207o8877l9973m3572j21065p4991j22290q5845R2136o6585j24022L587
9021A425710j5734j15675r8429l6650L2860N865P0394j02869j58975n0291M2855
9010I99061L4284j35683j3158p156N9502P386j04997r1011j13369O46M513R1518
8998G31536M1760j40453k36757N5448J11799L5079j19946j7124L1953m6314N8208
8987E05189L9015p9884M8466Q3922m8814n8063J9116J7463j6526j5594M6102p0617
8975D69775l2185n2138l8915l1628k3265l9884P5838J05463J47215L9203j32332
8964D87147l3542j03419k0671j8900k24751m6883R3799k1573j2727L6537J71996
$$ plain form
9043 2991982 2868387 2793554 2651449 2507093 2510109 2515322 2528059 2472543 2395673 2205059 2077207
9032 2077207 2008330 1968357 1924785 1803720 1728729 1606439 1520594 1612730 1546145 1422123 1425710
9021 1425710 1409976 1294301 1195872 1159222 1192082 1197947 1268341 1165472 1006497 956206 999061
9010 999061 1033345 897662 884504 877348 936850 944236 839239 748228 634859 635505 640018 731536
8998 731536 773296 632843 396086 451534 563333 598412 478466 461342 493295 446981 505189
8987 505189 544204 464320 512786 596708 547894 489831 508947 526410 509884 494290 540392 469775
8975 469775 437590 385452 346537 314909 291644 251760 327598 433061 580276 619479 487147
8964 487147 453605 350186 329515 310615 85864 38981 132780 111207 98480 135017 307013
8953C07013O2466j13466l5411l7368n0674k9206L6754l3705L6006O8547O1272
8942B72228q6858j11766K5939j07068j25716K6356J41137L444J4845M9954o0667
8931D1828o160k6155m4802N2107N4718J2740l8238J07110M2628P6856p825j33799
8919A31008k2325N3020Q2742q2418j82116M3953J08118K6974m5933n5457l0155
8908B7411M8636M2785J19034L7869j89884j05617k610R0347J02933j0768p6870
8897H3266l8916l9259m912N7830K3541q0387k4445J08987l3170j01996J385R1634
8885D3558J04974M1606R7327k6053q7249L1004j0032p3547k5147o7731r746N0826
8873F9790K56p8580q1478R0442J28342l1630r703o1266O0094K4988l9899M5620
$$ plain form
8953 307013 369479 256013 220602 183234 132560 103354 140108 106403 142409 210956 272228
8942 272228 185370 73604 99543 -7525 -133241 -106885 34252 37696 52541 102495 41828
8931 41828 35668 9513 -35289 16818 71536 84276 46038 153148 195776 272632 264807 131008
8919 131008 108683 161703 244445 162027 -20089 23864 131982 158956 113023 57566 27411
8908 27411 76047 118832 237866 275735 85851 -19766 -22376 67971 170904 160136 83266
8897 83266 44350 5091 179 58009 81550 1163 -23282 85705 52535 -49461 -48076 43558
8885 43558 148532 190138 287465 261412 174163 205167 195135 121588 96441 28710 18964 69790
8873 69790 70046 -8534 -90012 430 128772 97142 87439 26173 86267 111255 71356 116976
8861A16976O6636o0258K5967q550J0237n5443j2981J9868l4531q150l1657o3651
8849c5537k9503Q1897M3103L0789n1187K5604j2232l7572n2132K7722J9764Q2927
8837I3643K6652O784j4643j38204k0336J8831r857J4341r0046n9707J18950R8965
8825D5373M6315n1587L9873l7846p8650o8130K8125J49373R9038J8206k3403p2470
8813I4217L5034J3949o3737o4316k0790l7124L024N6724J2624q57L2998O3608
8801A25354r2508k190J0555P6343l3911k69J15955j6898p4088j1055o917J5997
8789A06368L7617j12156p9753K1196q3762O373J11270O3558j5991q6279M2517
8778A0958M8906R2504J7853p9852j63342j5538J73642L9140j4936n0540p7475
$$ plain form
8861 116976 183612 123354 149321 140771 151008 95565 82584 102452 67921 59771 28114 -35537
8849 -35537 -65040 16857 59960 90749 39562 65166 52934 15362 -36770 -9048 10716 93643
8837 93643 120295 127079 112436 -25768 -46104 -27273 -37130 -22789 -112835 -172542 -53592 45373
8825 45373 91688 40101 79974 42128 -36522 -104652 -76527 72846 171884 190090 166687 94217
8813 94217 129251 143200 79463 15147 -5643 -42767 -39743 16981 29605 28748 61746 125354
8801 125354 32846 30656 41211 117554 83643 83374 199329 182431 108343 97288 90371 106368
8789 106368 143985 31829 -47924 -26728 -110490 -104117 7153 70711 54720 -31559 10958
8778 10958 59864 152368 170221 90369 -72973 -88511 85131 124271 109335 58795 -18680
8767a8680j01548Q8261R0082J6527m8034l6417j9874L9330J5485L0617k4804o1413
8755c0468l4674M5279J03814J09834n1086j37914N1879L4529k9263o02M0453l836
8743I7945l9984k3961J0757k1954p7121J4633J57758o9918k2386R2390m877p8891
8731C4391L6778N3586L2292n420Q0860O6607k6043j77647o9041L8555K2105K8219
8719A15242l9441K7694j9788k8125K040q353J3431l202L6530l9651n9923M2944
8707C9398L455p0464L773O9657N1551k4869p9168n8644k7460M0558J266J11185
8695F0238R8556p864J0883l496l1517R0187l9705l7142r7899q6246Q6814L7600
8683H0409j8948N7652k9533j18039m013M4964k6407L0652N9330p2235L093j8233
$$ plain form
8767 -18680 -120228 -31967 58115 74642 26608 -9809 -29683 9647 25132 55749 30945 -30468
8755 -30468 -65142 -19863 83951 193785 142699 4785 56664 91193 61930 61328 101781 97945
8743 97945 57961 34000 44757 22803 -54318 -39685 118073 48155 25769 118159 113282 34391
8731 34391 71169 124755 157047 151627 232487 299094 273051 95404 26363 64918 87023 115242
8719 115242 75801 103495 83707 55582 57622 49269 62700 59498 96028 56377 -3546 39398
8707 39398 42853 -27611 -23838 45819 97370 72501 -6667 -65311 -92771 -52213 -50947 60238
8695 60238 158794 150930 161813 158317 126800 216987 177282 140140 42241 -44005 42809 80409
8683 80409 61461 119113 89580 -28459 -32472 12492 -13915 16737 76067 3832 6925 -11308
8671a1308J4211N1590l4046l563j05600J7651M3552M9097l7920M5480j2675p4454
8659e7985l8287M8285R5330k2674L2117J6336K5999q5653j7722M007p1428p9174
8647a50849P0514O0088P7997R317n4601r8179J01678Q7223l9472r9291K2889M2886
8635C0200l8476r8370J8847J29767M3221P6373l1440j97339M9786Q1738K1460
8624H5767R4285N6649j8821n2388K414J7343L7703m2025j08795O3529M1010o9974
8612A06697N062J47455J11111j00819L8249J18599r4806q8117n4281o2609J492
8601A28033J5152R0025O2859J04119J5608n992p9307j6670l4831J01159l1063
8590C49092l6023j7737l1793j43603O930K1637O2723l8363r5906M0617J2118l64
$$ plain form
8671 -11308 2903 54493 20447 16884 -88716 -71065 -27513 21584 -16336 29144 16469 -57985
8659 -57985 -96272 -47987 47343 24669 56786 73122 99121 13468 -4254 -247 -71675 -150849
8647 -150849 -80335 -20247 57750 67067 12466 -85713 15965 103188 63716 -35575 -12686 30200
8635 30200 -8276 -106646 -87799 41968 85189 161562 130122 -67217 -17431 64307 85767
8624 85767 180052 236701 217880 165492 167906 185249 222952 180927 72132 135661 176671 106697
8612 106697 111759 259214 370325 269506 307755 426354 331548 243431 189150 126541 128033
8601 128033 143185 233210 296069 400188 415796 409804 330497 313827 278996 380155 349092
8590 349092 313069 295332 263539 119936 126866 148503 211226 172863 76957 117574 129692 129328
8578A29328N438M3730m4962j25557j19270J13816J6390J5320R5586J8437j5303
8567A32953M671M4659L1158j01816j50115j00634L4374J11295J67477j1504n8158
8556A04360j75718p1997L0676Q7359N6178p888L2097K1528M823J6197Q2098N8943
8544B38656j831l2382j20939j18992N4863R1697M5029r5952n8064o8351M1481
8533b4785L2125N4284K9178j5695p2447j46205J9521P3923J06499M5102j44607
8522d3107j13469M489N1365J23718R2523n1972K3961L7979n6875j9288K4340m8799
8510B4865l7696L1361R0817j6249K0907j4840K1415l455m3961n3677j4620N6883
8498F1750q2324l5628K1169N0656N4538k275Q6003N02r0664j15247K4006J14486
$$ plain form
8578 129328 134766 178496 133534 7977 -111293 2523 18913 34233 129819 148256 132953
8567 132953 137624 182283 213441 111625 -38490 -139124 -104750 6545 174022 162518 104360
8556 104360 -71358 -143355 -112679 -25320 30858 22970 55067 76595 81418 97615 179713 238656
8544 238656 236825 204443 83504 -35488 19375 111072 156101 60149 2085 -66266 -24785
8533 -24785 7340 61624 90802 75107 2660 -143545 -124024 -50101 56398 101500 -43107
8522 -43107 -156576 -152087 -100722 22996 115519 63547 87508 125487 68612 49324 73664 24865
8510 24865 -12831 18530 109347 93098 114005 99165 120580 117125 73164 19487 4867 61750
8498 61750 -20574 -56202 -35033 15623 70161 67886 153889 154391 63727 -51520 -27514 86972
8486H6972Q0369j2548o9182l4885n1123q0572m181J3129M6121Q8161R1513j13263
8474D0511L394n3178j14099p695R9718M0628j7686O0892j2076K0019k344j7318
8462D0766p2600j22550M3874J04678r540K2439k4926r4705P9043O0290K5254p2348
8450b0325r1652o017O3876M8190R5578j33217o4121J7612K7203O0559J8095j07187
8438i1406J7848P3441l6942j2819q6070J05916M0081L8235L8932N6332j28988
8427A4560j18975Q6295K0746m2319L4345K1387l9548l5304j31548l9083K2679
8416b06765J58380Q1828J3756Om7488j00737J09569J78376j4249j10952m2311
8405A9413J58980K6398m2239r8459L4727J4539K3988m5910p5456j504L028O2726
$$ plain form
8486 86972 167341 154793 85611 50726 -397 -80969 -85150 -72021 -25900 62261 153774 40511
8474 40511 43905 -9273 -123372 -131067 -31349 9279 -8407 52485 40409 60428 58084 40766
8462 40766 -31834 -154384 -110510 -5832 -15372 7067 -17859 -112564 -33521 26769 52023 -20325
8450 -20325 -111977 -117994 -54118 -5928 89650 -43567 -107688 -90076 -62873 -2314 15781 -91406
8438 -91406 -73558 -117 -37059 -49878 -135948 -30032 10049 48284 87216 143548 14560
8427 14560 -104415 -18120 2626 -39693 -5348 16039 -23509 -58813 -190361 -229444 -206765
8416 -206765 -48385 33443 47199 47205 -283 -101020 8549 186925 172676 61724 19413
8405 19413 178393 204791 162552 64093 98820 113359 137347 91437 15981 14477 17505 80231
8393H0231o6486j29570K4776k0779j73M3461j00709o1007P5551o08J0713J6292
8381a28308N4233L1821P9273L0149j3794Q7355K0017o7861K3740J09j60727n2821
8369i6814M9072O0341k3777Q535K644m7108K7645P3933N5079P795k8658j7772
8357G0915o1982q3208l1381N7694M3615L2686N9178K7367k7841r601j18655n2246
8345i3459p2889K1103k350J05922L7749J0400j6298N8830J2538r15p3156q0548
8333i3073L8825M3841n2501R7602N0287o7714j89772k392J47483j19052o0338
8322b06804k6819K7111o5677J05215J12183R9718N7148k0008J0099j6514O2023
8311A37675M3627o1177k03181n9512Q1576J1003M8518J20142k2531l1667k6360
$$ plain form
8393 80231 13745 -115825 -91049 -111828 -112001 -68540 -169249 -230256 -154705 -155313 -144600 -128308
8381 -128308 -74075 -42254 37019 67168 53374 140729 160746 92885 116625 116734 -43993 -96814
8369 -96814 -47742 12599 -11178 -2643 1 -47107 -19462 54471 109550 117345 88687 70915
8357 70915 8933 -74275 -105656 -47962 -4347 28339 87517 114884 87043 77442 -41213 -93459
8345 -93459 -166348 -145245 -147595 -41673 -3924 6476 -9822 49008 61546 60631 -12525 -93073
8333 -93073 -54248 -10407 -62908 34694 84981 17267 -172505 -174897 -27414 -146466 -206804
8322 -206804 -233623 -206512 -272189 -166974 -54791 44927 102075 82067 92166 75652 137675
8311 137675 181302 120125 -83056 -142568 -60992 -49989 -1471 118671 96140 64473 38113
8300C8113l2957n8001M8889j1822m931q7872J0399N2110K7154k0731P6259k7088
8288I522J096k2504K8374q9174k8307M422p991R4434O7429p0785j1924l3011k7593
8275h6012K7935R6985l0824q7565m7473J25327Q5263j35756j53727k1871J11299
8264a16419j1361L8301J41985J35666k8203q8863j54212q576k0232J00844J02537
8253I1467L6671m0008o0135l4204n5989q3147J09771J41919q6282j25951o596
8242a12484L8886J7373O9665J14663R448l3041R892l7104m736L8238k6492j04085
8230a9777J8861P9241r9153j02235J718O2732j4379M754J80914P1207l0027p5517
8218G8339n1247R2192p502j19561p0100p4005m4187R7170R6941j2236q6760K9570
$$ plain form
8300 38113 5156 -52845 -3956 -15778 -20709 -108581 -98182 -46072 -18918 -39649 36610 9522
8288 9522 10618 -11886 16488 -72686 -100993 -96571 -104562 -10128 57301 -13484 -25408 -58419 -86012
8275 -86012 -58077 38908 8084 -79481 -126954 -1627 83636 -52120 -205847 -227718 -116419
8264 -116419 -127780 -89479 52506 188172 159969 71106 -83106 -91682 -111914 -11070 91467
8253 91467 128138 88130 27995 -6209 -62198 -145345 -35574 106345 20063 -105888 -112484
8242 -112484 -73598 -56225 13440 128103 137551 104510 114402 77298 72562 110800 84308 -19777
8230 -19777 -916 78325 -20828 -123063 -121345 -58613 -72992 -68238 112676 183883 153856 78339
8218 78339 27092 119284 111782 -7779 -77879 -151884 -196071 -98901 -1960 -14196 -100956 -71386
8206g1386Q0998o952j31167j70P1790Q2742Q0438N036o3736l1794M9395P466m5700
8193B6960o1798j3224o0506P044M247M9452J14452j1000p376Q6315m7948j23551
8181c6933o8944N4382M9862L8439n4872m8610P4931J06534o0402n2983q6733j4175
8169i9504M3399J32j10514n5793J02259j1460M0773J5340Q1824M9855L4533O061
8157I6905p0963j65386J3702J20614P8445o7481j40384m4884J09420K9199K1341
8146a9472n534o8985n1768L6400L8732m6251n8264Q328J5510R819O193n4041j2432
8133b01765Q5809P7318m9205m8592J04063M7794n9671R982O0499R657L896N0705
8121I0490q8372o1226L9057K1875J8686K2447N1504j28826p0335m2563N6071R5262
$$ plain form
8206 -71386 9612 2660 -128507 -128677 -56887 25855 106293 111329 47593 15799 65194 72660 26960
8193 26960 -34838 -48062 -108568 -101524 -97277 -47825 66627 55627 48251 134566 86618 -36933
8181 -36933 -105877 -51495 -1633 36806 -18066 -66676 8255 114789 54387 1404 -85329 -99504
8169 -99504 -56105 -55973 -166487 -222280 -120021 -131481 -90708 -75368 6456 56311 90844 96905
8157 96905 25942 -139444 -125742 -5128 73317 5836 -134548 -179432 -70012 -40813 -19472
8146 -19472 -25006 -93991 -145759 -109359 -70627 -116878 -175142 -166814 -151304 -141485 -135292 -189333 -201765
8133 -201765 -115956 -38638 -87843 -136435 -32372 15422 -44249 -34267 26232 35889 39785 90490
8121 90490 2118 -59108 -20051 1824 20510 42957 94461 -34365 -104700 -147263 -91192 4070
8109D070P262o1139m1332M0641m1580M343K0146N6723Q7488k2475L9271n5297
8097C8121o1455j7862j5518P9330L5294J5086O4101K905m6992m38K2469Q98K7626
8084A43565k5353j6912Q8108J6753m1801j07395j24295o3334Q7996J46410q0879
8073B2863J927m6049m6778L8422k2592J6112J05129J3907Q4047O5246n6620k14307
8061c8693o2330J31147J38112M6207J4419k8926m2213j5833q4243k7571P9697
8050A09773O6643R466l5538j0660q4433n0153o9507J3649R2189Q5556m4921j04365
8038b2301n9232p0707N0508O6029p3092l8619J4784O9767J14749K9487q3912l4824
8026c7363j5626J488j5748o4406j9662O6679Q2632n081M8280K1871n8479J8098
$$ plain form
8109 4070 11332 -49807 -91139 -50498 -92078 -87735 -67589 -10866 76622 54147 93418 38121
8097 38121 -23334 -41196 -56714 22616 57910 72996 137097 140002 93010 92572 115041 115939 143565
8084 143565 118212 101300 189408 206161 164360 56965 -67330 -130664 -42668 103742 22863
8073 22863 24790 -21259 -68037 -29615 -52207 -36095 69034 82941 166988 232234 175614 -38693
8061 -38693 -101023 30124 168236 214443 228862 199936 157723 141890 57647 30076 109773
8050 109773 176416 185882 150344 139684 55251 5098 -64409 -50760 41429 126985 82064 -22301
8038 -22301 -81533 -152240 -101732 -35703 -108795 -147414 -132630 -62863 51886 81373 -2539 -37363
8026 -37363 -52989 -51501 -67249 -131655 -151317 -84638 -2006 -7087 41193 63064 4585 22683
8014B2683R8297M7358L7535m8481l0642o5729o1701m582L876J17446R2768r1834
8002A16994j67377n66K1727J8598K8897J31991M2108L7984p1203p1148l1601q4274
7990b7870O6069J3244j13769K7985O7507J0169q264L8219n3993n2193N0132J0469
7978B7705j867L7740P42l8722l1663O3526M0662J1608k9106M6130J01686r3677
7966A34764j6601j18N5208J7195J34913r555j02513j32560k861K0198j7515M0302
7954A20857k205K9833o8165j18237m1059R0830J23681k3627l0223K9016j7066
7943I3635j06886m0413M5557p2K8863O380q925j9036k2898l4425J4290l6300l2201
7930a12431j0490O8095J4542l6112n2783J2471Q459l0139O8458O1015Q8976K0660
$$ plain form
8014 22683 120980 168338 205873 157392 126750 61021 -680 -5262 -1386 116060 208828 116994
8002 116994 -50383 -50949 -29222 -10624 18273 150264 192372 230356 159153 88005 56404 -27870
7990 -27870 38199 51443 -62326 -34341 33166 43335 35071 73290 19297 -32896 17236 27705
7978 27705 25838 63578 64320 25598 -6065 57461 98123 109731 80625 126755 228441 134764
7966 134764 118163 118045 173253 190448 325361 315806 213293 80733 77872 98070 80555 120857
7954 120857 118652 148485 80320 -37917 -78976 11854 135535 111908 81685 110701 93635
7943 93635 -13251 -53664 -8107 -8179 20684 27064 18139 -897 -23795 -58220 -43930 -80230 -112431
7930 -112431 -122921 -54826 -40284 -76396 -129179 -116708 -108249 -138388 -69930 -8915 80061 100721
7918A00721m281p9013r3661M7011p464j5550Q3675j05067L1302L0368P3753J14674
7906A76468j11075r2912M323J288K3366l4215j19133m2005L8265P155N8309R6943
$$ plain form
7918 100721 96440 17427 -76234 -29223 -36687 -52237 31438 -73629 -42327 -11959 61794 176468
7906 176468 65393 -27519 -23196 -21908 1458 -32757 -151890 -193895 -155630 -148475 -90166 6777
$$ [...]
##END NTUPLES=NMR SPECTRUM
##END=
