##TITLE=Analysis number 323199
Compound Code cc 27510
Project Code adrs
Chemist Name ugmt
##JCAMPDX= 6.0         $$ Bruker NMR JCAMP-DX V2.0
##DATA TYPE= NMR SPECTRUM
##DATA CLASS= NTUPLES
##ORIGIN= Bruker BioSpin GmbH
##OWNER= nmr
$$ XWIN-NMR		Version 3.5
$$ Wed Oct 18 10:46:36 2006 GMT Daylight Time (UT+1h)  MAYBRIDGE\nmr@NMR_250MHZ
##.OBSERVE FREQUENCY= 250.131544655141
##.OBSERVE NUCLEUS= ^1H
##.ACQUISITION MODE= SIMULTANEOUS (DQD)
##.ACQUISITION SCHEME= undefined
##.AVERAGES= 16
##.DIGITISER RES= 18
##SPECTROMETER/DATA SYSTEM= dpx250
##.PULSE SEQUENCE= zg30
##.SOLVENT NAME= CDCl3
##.SHIFT REFERENCE= (INTERNAL, CDCl3, 0, 16.522)
##AUDIT TRAIL= $$ (NUMBER, WHEN, WHO, WHERE, WHAT)
$$ ##TITLE= Audit trail, XWIN-NMR		Version 3.5
$$ ##JCAMPDX= 5.01
$$ ##ORIGIN= Bruker BioSpin GmbH
$$ ##OWNER= nmr
$$ C:\u/data/dgb/nmr/ADRS/900/pdata/1/auditp.txt
$$ ##AUDIT TRAIL=  $$ (NUMBER, WHEN, WHO, WHERE, WHAT)
(   1,<2006-10-18 10:46:12.41 +100>,<MAYBRIDGE\nmr>,<NMR_250MHZ>,
      <created by zg, POWCHK disabled, PULCHK disabled
       configuration hash MD5:
       49 4B E0 1D 92 C2 6B 37 9F E6 65 BC 52 41 86 1D
       data hash MD5: 64K
       49 0F 80 91 16 E6 69 5A 5F 0A 16 F0 40 E3 28 81>)
(   2,<2006-10-18 10:46:26.10 +100>,<MAYBRIDGE\nmr>,<NMR_250MHZ>,
      <Start of raw data processing
       ef LB = 0.3 FT_mod = 6 PKNL = 1 SI = 32K 
       data hash MD5: 32K
       16 BA 4B 3F 68 C3 99 87 E5 C8 08 BB 0E 84 7F 9D>)
(   3,<2006-10-18 10:46:27.76 +100>,<MAYBRIDGE\nmr>,<NMR_250MHZ>,
      <apk 
       data hash MD5: 32K
       05 47 F7 01 24 A9 00 BC EE A0 D6 6A 83 74 ED C0>)
(   4,<2006-10-18 10:46:28.59 +100>,<MAYBRIDGE\nmr>,<NMR_250MHZ>,
      <abs ABSG = 5 
       data hash MD5: 32K
       D2 C9 E6 B3 DD EE C9 47 DC FE 50 D9 C9 53 D1 94>)
$$ ##END=
$$ 
$$ hash MD5
$$ DD B5 E8 5A EF 04 BF 9F D0 0F 8B 55 75 68 28 BD
##$RELAX= 
##$RELAX= 
##$RELAX= 
##$RELAX= 
##$RELAX= 
##$RELAX= 
##$RELAX= 
$$ Bruker specific parameters
$$ --------------------------
##$DU= <C:\u>
##$EXPNO= 900
##$NAME= <ADRS>
##$PROCNO= 1
##$TYPE= <nmr>
##$USER= <dgb>
##$AMP= (0..31)
100 100 100 100 100 100 100 100 100 100 100 100 100 100 100 100 100 100 
100 100 100 100 100 100 100 100 100 100 100 100 100 100 
##$AQSEQ= 0
##$AQ_mod= 3
##$AUNM= <au_zg>
##$AUTOPOS= <9 >
##$BF1= 250.13
##$BF2= 250.13
##$BF3= 250.13
##$BF4= 250.13
##$BF5= 500.13
##$BF6= 500.13
##$BF7= 500.13
##$BF8= 500.13
##$BYTORDA= 1
##$CFDGTYP= 0
##$CFRGTYP= 5
##$CHEMSTR= <none>
##$CNST= (0..31)
1 1 145 1 1 1 1 1 1 1 1 1 1 1 1 1 1 1 1 1 1 1 1 1 1 1 1 1 1 1 1 1 
##$CPDPRG= <>
##$CPDPRG1= <>
##$CPDPRG2= <>
##$CPDPRG3= <>
##$CPDPRG4= <mlev>
##$CPDPRG5= <mlev>
##$CPDPRG6= <mlev>
##$CPDPRG7= <mlev>
##$CPDPRG8= <mlev>
##$CPDPRGB= <>
##$CPDPRGT= <>
##$D= (0..31)
0 1 0 0 0 0 0 0 0 0.06 0 0 0 0 0 0 0.0002 0 0 0 0 0 0 0 0 0 0 0 0 0 0 
0 
##$DATE= 1161164771
##$DBL= (0..7)
120 120 120 120 120 120 120 120 
##$DBP= (0..7)
150 150 150 150 150 150 150 150 
##$DBP07= 0
##$DBPNAM0= <>
##$DBPNAM1= <>
##$DBPNAM2= <>
##$DBPNAM3= <>
$$ [...]
##$SUBNAM7= <"">
##$SUBNAM8= <"">
##$SUBNAM9= <"">
##$SW= 20.6930455092707
##$SWIBOX= (0..15)
0 0 3 0 0 0 0 0 0 0 0 0 0 0 0 0 
##$SW_h= 5175.983436853
##$TD= 65536
##$TD0= 1
##$TE= 683.16
##$TE2= 300
##$TE3= 300
##$TEG= 300
##$TL= (0..7)
0 120 120 120 120 120 120 120 
##$TP= (0..7)
150 150 150 150 150 150 150 150 
##$TP07= 0
##$TPNAME0= <>
##$TPNAME1= <>
##$TPNAME2= <>
##$TPNAME3= <>
##$TPNAME4= <>
##$TPNAME5= <>
##$TPNAME6= <>
##$TPNAME7= <>
##$TPOAL= (0..7)
0.5 0.5 0.5 0.5 0.5 0.5 0.5 0.5 
##$TPOFFS= (0..7)
0 0 0 0 0 0 0 0 
##$TUNHIN= 0
##$TUNHOUT= 0
##$TUNXOUT= 0
##$USERA1= <user>
##$USERA2= <user>
##$USERA3= <user>
##$USERA4= <user>
##$USERA5= <user>
##$V9= 5
##$VALIST= <valist>
##$VCLIST= <CCCCCCCCCCCCCCC>
##$VD= 0
##$VDLIST= <DDDDDDDDDDDDDDD>
##$VPLIST= <PPPPPPPPPPPPPPP>
##$VTLIST= <TTTTTTTTTTTTTTT>
##$WBST= 1024
##$WBSW= 4
##$XGAIN= (0..3)
0 0 0 0 
##$XL= 0
##$YL= 0
##$YMAX_a= 665794
##$YMIN_a= -562685
##$ZGOPTNS= <>
##$ZL1= 120
##$ZL2= 120
##$ZL3= 120
##$ZL4= 120
##$ABSF1= 16.522
##$ABSF2= -4.171173
##$ABSG= 5
##$ABSL= 3
##$ALPHA= 0
##$AQORDER= 0
##$ASSFAC= 0
##$ASSFACI= 0
##$ASSFACX= 0
##$ASSWID= 0
##$AUNMP= <proc_1d>
##$AZFE= 0.1
##$AZFW= 0.1
##$BCFW= 0
##$BC_mod= 0
##$BYTORDP= 0
##$COROFFS= 0
##$CY= 12.5
##$DATMOD= 1
##$DC= 0
##$DFILT= <>
##$DTYPP= 0
##$F1P= 14.0000005364418
##$F2P= -0.99999901652339
##$FCOR= 0.5
##$FTSIZE= 32768
##$FT_mod= 6
##$GAMMA= 0
##$GB= 0
##$INTBC= 1
##$INTSCL= 1
##$ISEN= 128
##$LB= 0.3
##$LEV0= 0
##$LPBIN= 0
##$MAXI= 10000
##$MC2= 0
##$MEAN= 0
##$ME_mod= 0
##$MI= 0
##$NCOEF= 0
##$NC_proc= -3
##$NLEV= 6
##$NOISF1= 0
##$NOISF2= 0
##$NSP= 0
##$NTH_PI= 0
##$NZP= 0
##$OFFSET= 16.522
##$PC= 1
##$PHC0= -46.08544
##$PHC1= 0.7094184
##$PH_mod= 1
##$PKNL= yes
##$PPARMOD= 0
##$PSCAL= 4
##$PSIGN= 0
##$REVERSE= no
##$SF= 250.13
##$SI= 32768
##$SIGF1= 0
##$SIGF2= 0
##$SINO= 400
##$SIOLD= 32768
##$SREGLST= <1H.CDCl3>
##$SSB= 0
##$STSI= 32768
##$STSR= 0
##$SW_p= 5175.98343685301
##$SYMM= 0
##$S_DEV= 0
##$TDeff= 65536
##$TDoff= 0
##$TI= <Analysis number 999999
Compound Code 99
Book Reference 9
Project Code 9>
##$TILT= no
##$TM1= 0
##$TM2= 0
##$TOPLEV= 0
##$USERP1= <user>
##$USERP2= <user>
##$USERP3= <user>
##$USERP4= <user>
##$USERP5= <user>
##$WDW= 1
##$XDIM= 32768
##$YMAX_p= 321778399
##$YMIN_p= -169149
$$ End of Bruker specific parameters
$$ ---------------------------------
##NTUPLES= NMR SPECTRUM
##VAR_NAME=  FREQUENCY,     SPECTRUM/REAL,   SPECTRUM/IMAG
##SYMBOL=    X,             R,               I
##VAR_TYPE=  INDEPENDENT,   DEPENDENT,       DEPENDENT
##VAR_FORM=  AFFN,          ASDF,            ASDF
##VAR_DIM=   32768,         32768,           32768
##UNITS=     HZ,            ARBITRARY UNITS, ARBITRARY UNITS
##FACTOR=    0.157963299565203, 1,           1
##FIRST=     4132.6476996994, 0,             0
##LAST=      -1043.33573715361, 0,           0
##MIN=       -1043.33573715361, -169149,     0
##MAX=       4132.6476996994, 321778399,     0
$$ Real data points
##PAGE= N=1
##DATA TABLE= (X++(R..R)), XYDATA
$$ [...]
24677f1700K6711M7384M0159o3783J2412J1078n459n0730j0402J2866M9061M30
24665H027K0964o420n3935l2660j0159M4451J5258M9854N5598j0872m9602j0964
24653A9540j5146l5357J9621p714J5684J8017l040j7177N399J1190m946l6027
24641b9956j2179J4442j9913j3761K4521j1231J9680L2634J5011M109j4287k1168
24629a2098l4753J856K7521N0048M3762l2946m7083j1488o211L0761L5753j6442
24617B8680r011P27J5115j9953k179j0487K5410r669j6759J0185p742l5714J0610
24604b0787j588k2009P494L0601J4817k6056K7192J3102K6971l6698l4546M3044
24592B1537O066j5535M8698j1606q352l9585j5634N7655K381l1187L5013j266
$$ plain form
24677 -61700 -34989 12395 52554 -11229 1183 12261 6802 -43928 -54330 -41464 7597 8027
24665 8027 28991 22571 -31364 -64024 -74183 -29732 -14474 35380 90978 80106 30504 19540
24653 19540 4394 -30963 -11342 -19056 -3372 14645 11605 -5572 -173 11017 6071 -29956
24641 -29956 -42135 -27693 -47606 -61367 -36846 -48077 -28397 4237 19248 23357 9070 -12098
24629 -12098 -46851 -44995 -17474 32574 76336 43390 -3693 -15181 -21392 9369 45122 28680
24617 28680 19669 20396 35511 15558 13379 2892 28302 18633 1874 12059 4317 -31397 -20787
24604 -20787 -22375 -44384 -36890 -6289 8528 -17528 9664 22766 49737 13039 -21507 21537
24592 21537 27603 12068 60766 49160 40808 1223 -14411 43244 45625 14438 49451 48185
24580D8185O152l3333k7255m1026J3957K4762j3167M1079k2208o0641P590N1366
24568d539K9322J5167M732j7843j6045M427m278K0744J0936k8122k8675L2972
24556A8798J5093J3235K0146m381N190R463l2126k2061O73j0134j1910m466K515
24543C5j2818J6467L8993k888o0881J5445J2060m0769J2447j7971L3106K8290
24531B1516J19J3404k230k3296k5488R107M3332K9806J0044J7053k8794k2008
24519D2565K5871P451p2516k5304K0423N2483K793l2961m644j7533K671J7618
24507A8917j3216J3510K4373j4101m1257n1401Q101J9609K823K802k9522j6506
24495g5868J8114K0365M5755L7197q171P129j16J4867k0832n2078j1665K6489
$$ plain form
24580 48185 54337 21004 -6251 -47277 -33320 -8558 -21725 19354 -2854 -63495 -55905 -4539
24568 -4539 24783 39950 44682 26839 10794 15221 10943 31687 42623 14501 -14174 18798
24556 18798 33891 47126 67272 62891 68081 77544 45418 23357 24030 13896 1986 -2480 35
24543 35 -12783 3684 42677 39789 -21092 -5647 6413 -34356 -21909 -39880 -6774 21516
24531 21516 21635 35039 32809 9513 -15975 -6868 36464 66270 76314 93367 64573 42565
24519 42565 68436 75887 3371 -21933 -1510 50973 53766 20805 16161 -1372 1299 18917
24507 18917 5701 19211 43584 29483 -11774 -63175 -55074 -35465 -32642 -29840 -59362 -75868
24495 -75868 -57754 -37389 8366 45563 37392 44521 44405 59272 38440 -13638 -25303 1186
24483A186M2337J3668j6586l2647P671K0123K6292l3598k3769k4029M767M384
24471a0201l712o478l4087l9978n89K4145L9242J7741m5682k6600r70j9498o65
24458a07332p807j260M1419J1799O706J0230M3669J2249j4506k5580K8639L1762
24446B9988q931P520Q854r111o8720P782K6931P366M1461p089q8050k7667Q077
24433g1589J135J62K7769o13n885J1877k2840Q618k997L667K6254Q570k4632P122
24419c3382L9758j0475J6881l900J0471K2094J8143M066K1018M574k3926k5144
24407D0178m3045l023M6699j5156r390l819j1990k6262l236J857m134n857k828
24394d0006K1704J3795J595J8442J9661j0838J6377J2942m141p150k3887j2019
$$ plain form
24483 1186 43523 57191 40605 7958 15629 35752 62044 28446 4677 -19352 -14585 -10201
24471 -10201 -13913 -20391 -54478 -94456 -95045 -70900 -31658 -13917 -59599 -86199 -87169 -106667 -107332
24458 -107332 -115139 -116399 -74980 -63181 -56475 -46245 -2576 9673 -4833 -30413 -1774 29988
24446 29988 21057 28577 37431 28320 -40400 -32618 -5687 1679 43140 36051 -51999 -79666 -71589
24433 -71589 -70454 -70292 -42523 -43136 -49021 -37144 -59984 -51366 -54363 -50696 -24442 -15872 -40504 -33382
24419 -33382 6376 -4099 12782 8882 19353 41447 59590 63656 84674 89248 65322 40178
24407 40178 -2867 -5890 40809 25653 16263 12444 454 -25808 -29044 -27187 -31321 -37178 -40006
24394 -40006 -18302 -4507 -2912 15530 35191 24353 40730 53672 49531 42381 18494 6475
24382F475K9505l2873l3717l0075j6287k9601K6671O1211N5908o423n422q07J9108
24369D3673Q42n3006j8804l1113N288Q682J9848K5628j5928k2673L7018L4432
24357C3887P61j5539l6200L487j0591K2708j4848n9457k3279K5921n322O5378
24345a3094M1528q532j0235J0890n1814J8722L0851k4917j4334n784J1391q27
24333a6155L008J9703j0521R988r577J6935j6227q239m2325J0559N1130K4090
24321C2369k1952l869j9342k1470j1574K149O61K2828N13j1137j3388J4199J6864
24308a3149N25J7814J0408L907J6021m742n6076m3485L0926K7224L2185j3190
24296H368n526R332j0843j7527k5505K7431N5538O732m8815n9618n986n253j921
$$ plain form
24382 6475 35980 3107 -30610 -60685 -76972 -106573 -79902 -18691 37217 30794 25372 24565 43673
24369 43673 44515 -8491 -27295 -58408 -53120 -44438 -24590 1038 -14890 -37563 -545 33887
24357 33887 34648 19109 -17091 -13604 -24195 -1487 -16335 -75792 -99071 -73150 -78472 -13094
24345 -13094 28434 19902 9667 20557 -31257 -12535 18316 -6601 -20935 -26719 -15328 -16155
24333 -16155 -13147 6556 -3965 6023 -3554 13381 -2846 -11085 -53410 -42851 8279 32369
24321 32369 10417 6548 -12794 -34264 -45838 -43689 -43028 -20200 -19687 -30824 -44212 -30013 -13149
24308 -13149 -12624 5190 15598 19505 35526 30784 -25292 -68777 -37851 -10627 21558 8368
24296 8368 2842 12174 1331 -16196 -41701 -14270 41268 48000 -815 -60433 -66419 -71672 -73593
24283g3593L0013j8042k2998J3384L906R124L1941N5209r726l1884l852J5392
24271a126n465m447k0505P424K489k1781R332K4285J4329K2282N258n223k0260
24258F592j163K4656Lm9685k0142L8629L3825o6595m0602K2691L1854J7704M5311
24245D3078N480J2323n2111k178j1688L488l5229j5676l238L1652Q497l1894k0989
24232f8485J9417O2135L5118J3951k5883j0074q033k4974j0423j6757L5313J1959
24220A3264q58K887N428M62j5058k7569j1556L0906M6827j5612m4474J3204j5134
24207a7283k1469Q452m216j624K1873O823J1575N728J1519J9920k9118j892O738
24194A7026J3254o740k8748j3099J7337N940J1018k0171j5034m937k5435k0509
$$ plain form
24283 -73593 -43580 -61622 -84620 -71236 -67330 -58206 -26265 28944 19218 -12666 -16518 -1126
24271 -1126 -6591 -11038 -31543 -24119 -21630 -43411 -34079 -9794 4535 26817 32075 26852 6592
24258 6592 5429 30085 30088 -19597 -39739 -1110 32715 -33880 -74482 -51791 -19937 -2233 43078
24245 43078 48558 60881 8770 6592 -5096 -1608 -36837 -52513 -55751 -24099 -15602 -47496 -68485
24232 -68485 -49068 13067 48185 62136 36253 26179 18146 -6828 -17251 -34008 1305 13264
24220 13264 12406 15293 20721 21183 6125 -21444 -33000 -2094 44733 29121 -15353 -2149 -17283
24207 -17283 -38752 -30300 -34516 -36140 -14267 -7444 4131 9859 21378 41298 12180 10288 17026
24194 17026 30280 23540 -5208 -18307 -970 4970 15988 -4183 -19217 -24154 -49589 -70098
24182g0098k8382N93k387J0809K3877K6132K7074N0547L968K9288l0411l928J8742
24169E5824j6608m0705q928J5414J4692O2671k327n9744j1049J5158k409m4765
24157b2776M067R875l3023j264N9377Q133J0885J5980j9120k5808J4983j4312
24145F997l5244J2642L2813K8846n557k2154l2389j0260K3817L6259j1109j5718
24133H943k5193j0865p577K7220j5191J4403M9134M490l3553k0018k2699J5162
24121a5744K2838L239K6826J5408k6468n2253j1595k5781o803O5218M2221N171
24109D2277m9916m2856N3205J0118m4673l070k1990n84L5129K1711K4760K2629
24097D6740l9442j9741M28k1293M1256M4890M716Q900m4077j9180L1202j2918
$$ plain form
24182 -70098 -98480 -97887 -100274 -89465 -65588 -39456 -12382 38165 42133 71421 41010 37082 55824
24169 55824 39216 -1489 -10417 4997 19689 82360 80033 20289 9240 24398 21989 -22776
24157 -22776 -18709 -8834 -41857 -43121 16256 24389 35274 51254 32134 6326 21309 6997
24145 6997 -28247 -15605 17208 46054 40497 18343 -14046 -24306 -489 35770 24661 8943
24133 8943 -16250 -27115 -34692 -7472 -22663 -8260 40874 45364 11811 -8207 -30906 -15744
24121 -15744 7094 10333 37159 52567 26099 -26154 -37749 -63530 -70333 -5115 37106 42277
24109 42277 -7639 -50495 2710 12828 -31845 -34915 -56905 -57489 -22360 -649 24111 46740
24097 46740 7298 -12443 -12015 -33308 7948 52838 57554 66454 22377 3197 34399 21481
24085B1481m878o414O40R252m1093k2125K6033K3052m7665M837j4345J5811Q622
24072b6792J2024L4679l6377J4116Q67o597M0108K6612j55j7978P771J5276j026
24059F2528p598p166j5852K1067p268l2150J1394J8668l331n8608q356J5589O61
24046a0422K988l0917m915k0815j0629k3815J0873K9333l901P160J8942j1003
24034d7121K2594K8836J4228k9961m6003N8289K2665k8313n1849J0347R830m4153
24022h0611j9471J0337P9387M8618M3853J386k6418m0568m219K7980q782m2695
24010a1203J451j720l7221r802L7640L1015r630O734m1283L2078K7851k7525r116
23997a0731J4700J2602N799N1170K3447k5329k6366j3390L2247K9613l2594j2823
$$ plain form
24085 21481 16603 10189 10829 20081 -21012 -43137 -17104 5948 -41717 -36880 -51225 -35414 -26792
24072 -26792 -14768 19911 -16466 -2350 -1483 -8080 32028 58640 58485 40507 48278 63554 62528
24059 62528 54930 47764 31912 52979 45711 13561 24955 43623 40292 -18316 -26672 -11083 -10422
24046 -10422 -7434 -38351 -43266 -64081 -74710 -98525 -87652 -58319 -62220 -55060 -36118 -47121
24034 -47121 -24527 4309 18537 -11424 -57427 862 23527 -4786 -56635 -46288 -36458 -80611
24022 -80611 -100082 -89745 -10358 38260 82113 83499 57081 16513 12294 40274 31492 -11203
24010 -11203 -9752 -11472 -48693 -58495 -20855 10160 530 7264 -34019 -1941 25910 -1615 -10731
23997 -10731 3969 16571 22370 73540 96987 71658 45292 31902 64149 93762 61168 48345
23985D8345J0347Q6L474j7007j5885n7620J0951L9199J0280l4245n7692Q218K1578
23972b9971j449k7751K85L5561j4296k1634j5323J8463M0391l5318p417M1629
23960a6830N6566J6966J2968k2752j5985m8884j8983N9161M6218K2836n0147m2095
23948i61j7121k0550P581J7064K3773O6J4732l713j3492j5846j6403O467j1944
23935c0347q745K1165j4788K2984j9720j0512J1018K234N329L6996P552j4084
23923I082k7844q974Q931J2153j6620J877K2811L1423k7606m1274j378j8006K7233
23910b8192K4913L0647K614M714j9199l5866J3959K4197j128Q818K6038L717o5182
23897i950j5373j1525J3547L174J1039m9954m7862L873O6499K8561K4789r347
$$ plain form
23985 48345 58692 58778 62252 45245 29360 -28260 -17309 21890 32170 -2075 -59767 -51549 -29971
23972 -29971 -31420 -59171 -58886 -23325 -37621 -59255 -74578 -56115 -15724 -51042 -58459 -16830
23960 -16830 39736 56702 69670 46918 30933 -17951 -36934 22227 68445 91281 41134 -961
23948 -961 -18082 -38632 -31051 -13987 9786 9852 24584 20871 7379 -8467 -24870 -18403 -30347
23935 -30347 -39092 -17927 -32715 -9731 -29451 -39963 -28945 -26711 -21382 15614 23166 9082
23923 9082 -18762 -27736 -18805 -6652 -23272 -21395 1416 32839 5233 -36041 -37419 -55425 -28192
23910 -28192 -3279 27368 29982 34696 15497 -20369 -6410 17787 16659 25477 51515 55232 -9950
23897 -9950 -25323 -36848 -23301 -20127 -9088 -59042 -106904 -103031 -36532 -7971 16818 7471
23885G471J1545j3973L7164M2841j7312m7406j3403L2648j468p179q572j0137
23873A2219j5452J8570j9051l1152P658M399L4995K5789j4961l2180l1254j8915
23861e9335M3326k5784m6184j0784K069J4239K8824j4914J3793J1684K4516M9220
23849C0670J377j5011k841K610k0794l6062J7291L0020l2461m5969K1862J4736
23837c4572M9467l855j8064K841L2337K30k8205j7937m8070J1087J8868q775k5504
23824g0152p002k0630K3796J7343j3138J7744L4876J3600Q468K5891n447r982
23812A5367M017K2403p208j014p988l4061m2565k08J7547L0978k3696j6521K2302
23799b0647J7j6865K6095n324J8819J5087p1991j1779N658J5753L4641L9525m5253
$$ plain form
23885 7471 19016 5043 42207 85048 67736 20330 6927 39575 38107 30928 22356 12219
23873 12219 -3233 15337 -3714 -34866 -27208 -22809 12186 37975 23014 -9166 -40420 -59335
23861 -59335 -16009 -41793 -87977 -98761 -96692 -82453 -53629 -68543 -54750 -43066 -18550 30670
23849 30670 32047 17036 14195 16805 -3989 -40051 -22760 7260 -25201 -71170 -49308 -34572
23837 -34572 14895 11040 -7024 -4183 28154 28384 179 -17758 -65828 -54741 -35873 -44648 -70152
23824 -70152 -77154 -97784 -73988 -56645 -69783 -52039 -17163 -3563 4905 30796 25349 15367
23812 15367 19384 41787 34579 33565 25577 -8484 -51049 -51257 -33710 -2732 -26428 -42949 -20647
23799 -20647 -20630 -37495 -11400 -16724 2095 17182 -54809 -66588 -60930 -45177 -10536 28989 -16264
23786a6264m5601J1096m8K7759J3808j290l785j2029K1684L1344K1732q971l5815
23773C620o3268m236L3077L2395j5559K874J9231k8037j8888Q494l4227L6014
23761b8510L8060m2755J8192K4942j3400q003Q599l1173P195M3119J3415l5874
23749f193L643j5979o7558P935M553R72L0601L9665k7451J0375K9904J5750J2098
23736C8315n818k4170l8819j2386J5151K6861k337n869k8334m6355L9474M1639
23724b648K198K0282m7931L1908L9006j7473n9558m2871j0878M4223O8372J6317
23712D0947l0911Q109n869J7800K31j4400k224r703l8780p32J1553M3516P592
23699B7129o122k5099k6148L0958r576j7416j8912N8007m1226k2688K8947L1477
$$ plain form
23786 -16264 -61865 -50769 -50817 -23058 -9250 -10540 -14325 -26354 -4670 26674 48406 39435 3620
23773 3620 -59648 -63884 -30807 1588 -13971 -11097 8134 -19903 -38791 -30297 -64524 -28510
23761 -28510 9550 -33205 -15013 9929 -3471 -11474 -2875 -34048 -26853 16266 29681 -6193
23749 -6193 -2550 -18529 -86087 -78152 -73599 -72627 -42026 -2361 -29812 -19437 10467 26217 38315
23736 38315 32497 8327 -30492 -42878 -27727 -866 -3203 -9072 -37406 -83761 -44287 -2648
23724 -2648 -450 19832 -28099 3809 42815 25342 -34216 -77087 -87965 -43742 24630 40947
23712 40947 10036 18145 12276 30076 30307 15907 13683 3980 -34800 -35532 -23979 19537 27129
23699 27129 21007 -4092 -30240 718 -8858 -26274 -45186 12821 -28405 -51093 -22146 9331
23687I331l793k2424o435j607j7043Q800K4340K1387k3349M1727p299r212L69
23674A4792Q548Q533m486m2522k409M3175k3036J9090L4844j9398j8810K3442
23662D1763k8397l0192R737j5094j6029R559J5391j8662Q494K5782L0186j4310
23650A8228J0207L2591J7273J3984K0071k3897J0624l5787l0294m177m3778k1833
23638c6788k4496j3067L5289O8975q181l0204l2839m4334M1613L6799m7528K4839
23626b9922K8500L245P385k2527q77O445K9610o687l4541k4324R412P715J2984
23613a3582J5569q605J0949o321J056L7977J482j6545j3380R950r899J7697M340
23600C0688J3206R639j9880l1646j5614J5201l526K3659p948r622L5565l3973
$$ plain form
23687 9331 5538 -16886 -23321 -24928 -41971 -33171 -8831 12556 -10793 30934 23635 14423 14792
23674 14792 23340 31873 27387 -15135 -17544 25631 2595 21685 56529 37131 18321 41763
23662 41763 13366 -16826 -7089 -22183 -38212 -28653 -13262 -31924 -23430 2352 32538 18228
23650 18228 28435 61026 78299 92283 112354 88457 99081 63294 33000 28823 -14955 -36788
23638 -36788 -61284 -74351 -39062 29913 21732 -8472 -41311 -85645 -44032 -7233 -54761 -29922
23626 -29922 -1422 1823 9208 -13319 -14196 -7751 21859 15172 -19369 -43693 -34281 -26566 -13582
23613 -13582 1987 -6618 4331 -1990 -934 37043 38525 21980 8600 18550 8651 26348 30688
23600 30688 43894 53533 33653 2007 -13607 1594 -1932 21727 13779 4157 39722 5749
23588E749l4786N3379j4596r67K1957k1284K1993m8592l4556p065L1240J2411
23576a5117M210j1299l3977K6199l284l0798J6473M0956J4133k791j9973k5366
23564d0634j1203l813P012J4217M3744K5086k9020L2570M7089K6638J0853k9456
23552I3083r3637j0550J1310m3340R440L1896j2542P669N2923K6953k6915j7027
23540B9263j2699k0743l6698j2403m485j9606R4805N5078k0667m8443n1395K003
23528d5990J9880j9929j6299J7086j992o031K028r835L107K6960K2091J7117J7728
23515B5921L3208m733q708Q2K0215j5998j0788P976l0357k5234K3784R134m6947
23502b2445j6223q106N0666O2440j4277j4068K9149q762k4611k8862k0457r058
$$ plain form
23588 5749 -29037 24342 9746 8779 30736 9452 31445 -17147 -51703 -58768 -27528 -15117
23576 -15117 -10907 -22206 -56183 -29984 -33268 -64066 -47593 -6637 7496 4705 -15268 -40634
23564 -40634 -51837 -55650 -48638 -34421 9323 34409 5389 37959 85048 111686 122539 93083
23552 93083 -554 -11104 206 -43134 -33694 -1798 -14340 -6671 46252 73205 46290 29263
23540 29263 16564 -4179 -40877 -53280 -57765 -77371 17434 72512 51845 3402 -47993 -45990
23528 -45990 -26110 -46039 -62338 -45252 -47244 -53275 -51247 -61082 -57975 -31015 -8924 8193 25921
23515 25921 59129 54396 45688 45770 65985 49987 39199 47175 16818 -8416 15368 24502 -22445
23502 -22445 -38668 -46774 3892 66332 52055 37987 67136 58374 33763 4901 -15556 -24614
23490b4614J5287M5236Q259K5655L413j2982l0169J6624m949j2164q919q673K3096
23477C5100K6722k5567J4410o713J6483k5971k7240j192n60l3818m0166L5098
23465c3414K6668K008l1293j1366O2256J997l9603K277j0139j3894J2919P2536
23453D0952n48p1229k0137J2304M6843j1090N265P890l2169k6379k018K6271L9569
23440A5524q368p353J0068N537J2571l7865Q405L8852q344o546o766J8583N713
23427D0011k561k2159j0193k8277J624J3603k0237K4460j9013L8363O577m4879
23415b2681j377N7732L5899l5533L619l3250m049J6862k8427M047K7078L6543
23403E6463j6321k1695j162p981R765j3780p423k0738J7218J1230J0101j0906
$$ plain form
23490 -24614 -9327 35909 44168 69823 73236 60254 30085 46709 41760 29596 20677 12004 35100
23477 35100 61822 36255 50665 43952 60435 34464 7224 6032 5472 -28346 -68512 -33414
23465 -33414 -6746 -4738 -36031 -47397 14859 16856 -22747 -20470 -30609 -44503 -31584 40952
23453 40952 40404 -30825 -50962 -38658 8185 -2905 2360 10250 -21919 -48298 -50316 -24045 15524
23440 15524 7156 -197 9871 15408 27979 -9886 -1481 37371 29027 22481 15715 34298 40011
23427 40011 37450 15291 5098 -23179 -21555 -7952 -28189 -3729 -22742 15621 22198 -22681
23415 -22681 -24058 33674 69573 34040 37659 4409 360 17222 -11205 -7158 19920 56463
23403 56463 40142 18447 17285 9304 19069 5289 -2134 -22872 -5654 5576 15677 4771
23391D771J0981l9481j2404k066O144M4546r369j1957j8669J8996J1333j4507
23379a1682l173K5816j3821j5878j5414j4372m049l9870l0207K6453P9131O879
23367a0187L250R519m4654J9528M1879K2580K8690P689j1886j6438n9191m8422
23355e7643R213K8100l054k9709j980R442P591J0428K4048l608J530n031M542
23342f131J1691R128m5635l0816l154K5645K983j9582J0899N7110J9631m2289
23330a0520n8387l988J5632K9734J5602j7077R120J4790J2315J2165k6194J5238
23318H430K7651J2420N182o0274O868J1140n661j8426j1971j9659r305J7917J0213
23305b5475N589M987j4361J194L4297j6874r1q681J2067N5670L208j3203j7655
$$ plain form
23391 4771 15752 -23729 -36133 -38199 -32055 12491 3122 -8835 -27504 -8508 2825 -11682
23379 -11682 -14855 10961 -2860 -18738 -34152 -48524 -52573 -92443 -122650 -96197 -17066 -10187
23367 -10187 -6937 2582 -42072 -22544 19335 41915 70605 78294 66408 49970 -9221 -57643
23355 -57643 -48430 -20330 -23384 -53093 -55073 -45631 -38040 -27612 -3564 -7172 -5642 -10673 -6131
23342 -6131 5560 14688 -30947 -61763 -64917 -39272 -36289 -55871 -44972 12138 31769 -10520
23330 -10520 -68907 -72895 -57263 -27529 -11927 -29004 -19884 -5094 7221 19386 -6808 8430
23318 8430 36081 48501 53683 -6591 277 11417 5756 -12670 -24641 -44300 -53605 -35688 -25475
23305 -25475 -19886 -14899 -29260 -28066 6231 -10643 -10734 -19415 -7348 48322 51530 38327 20672
23292B0672n5414r880l4038p012J7290L9236K1079K9892l3205j8708n271K6171
23280i188L5096j6609j6676Q157r219l5163K182J3420l4308k909L2151M6925M4865
23267E8724j2360m6913o827N535l1644j2077J9810M4575k2720R846K6974j9362
23255A3561j2723L8651K4229r800n0231K8288N1102M0316j7377j9402k9667k7576
23243B9371k0905J5855j895m8068k5769N4888L5056K306j703l2371m0573J1313
23231b2495J4186K814M509k766n106J0862P177j6506p890k33J39j8021l7192j5776
23217h6298M5378K5755j7537m189k6228J1896K1534L720K2664J943J6444l005
23205A2077J201R052J5257L2597L381j627k6812l3223m1658K6044N1964J7120
$$ plain form
23292 20672 -34742 -44622 -78660 -85672 -68382 -29146 -8067 21825 -11380 -30088 -35359 -9188
23280 -9188 25908 9299 -7377 780 -8439 -43602 -41420 -28000 -62308 -65217 -33066 13859 58724
23267 58724 46364 -549 -7376 -1841 -33485 -45562 -25752 18823 -3897 5949 32923 13561
23255 13561 838 39489 63718 53918 3687 31975 83077 123393 106016 86614 56947 29371
23243 29371 8466 24321 22426 -25642 -51411 3477 38533 40839 39136 6765 -33808 -22495
23231 -22495 -8309 -5495 -986 -3752 -8858 2004 9181 -7325 -15215 -15448 -15309 -33330 -70522 -86298
23217 -86298 -40920 -15165 -32702 -36891 -63119 -51223 -29689 -25969 -3305 -1362 15082 12077
23205 12077 13278 22330 37587 70184 73565 71938 45126 11903 -29755 -3711 48253 65373
23193F5373o6106j8297L0453Q10J2746N0476m0669l0333j6751p776n752K2399
23181c427j2489l6366M769k020q72J430K1827M1963N686j9281l3643m8188N850
23168g4761K4065K5776R399M210l00L9501k0308o582j8186j2348K9540M288j9401
23155a5107r526J3323k9274M7582N4055l284J8663k56p0056l9538j988l504j3085
23142e1995M2937O4233k3506l0642l141K0582j2882o625K1300L9700l5122j8112
23130F727j3756J436j0504J278M4308r724J7014J2687l902j4199j0453l2967l7230
23117d9285R943L4803Q514l2889L2208o003j4990j7202j706M5975p21K5389J8920
23104E2956k7458j8208j6355P947j7478j826j084P123o414j3231j6374m6015N5238
$$ plain form
23193 65373 -733 -19030 11423 12233 24979 75455 34786 4453 -12298 -20074 -25826 -3427
23181 -3427 -15916 -52282 -47513 -49533 -50405 -48975 -27148 14815 20501 1220 -32423 -80611 -74761
23168 -74761 -50696 -24920 -15521 -11311 -11611 27890 7582 1000 -17186 -29534 6 4294 -15107
23155 -15107 -24633 -11310 -40584 6998 61053 57769 76432 76176 6120 -33418 -35406 -38910 -51995
23142 -51995 -9058 55175 31669 1027 -2114 18468 5586 -1039 20261 59961 24839 6727
23130 6727 -7029 -5593 -16097 -14819 29489 19765 36779 49466 45564 31365 20912 -12055 -49285
23117 -49285 -39342 -4539 3975 -28914 3294 -2709 -17699 -34901 -36607 9368 8647 34036 52956
23104 52956 25498 7290 -9065 -1118 -18596 -20422 -21506 -14383 -20797 -34028 -50402 -96417 -41179
23091d1179Q2563J3413j7919k373m9084J9341J8609J2390l8343m471K2800k5109
23079i362k349p261J4378j1240k2806J9271l0940J5171J6007J049N6156J7188
23067E5262K6487J0042j6671m0510m0121k7296k9080K2966K6950M2888K1826N092
23055E7835m2191m2659n160J8002J4880L419j4843k9623l4900l999L5095O853
23043c7291J6926K8246M5229k1428q1871j7850L1316k3569k5997L7818K7636R857
23031a0978j6105o441j4106L8224J508k0257K0105L5300K4809p573q414N449O887
23018D8408K3006m2183l4061O424m687k3849j5839j1796j2199j5967M610m263
23006h2396M0674R133l7930M365j0707K8186O2423K1153j0999k6778k4994K5163
$$ plain form
23091 -41179 41384 54797 36878 34505 -14579 4762 23371 35761 -2582 -7053 15747 -9362
23079 -9362 -11711 -18972 -4594 -15834 -38640 -19369 -50309 -35138 -19131 -18082 38074 55262
23067 55262 81749 91791 75120 34610 -5511 -32807 -61887 -38921 -11971 30917 52743 57835
23055 57835 15644 -27015 -32175 -14173 707 4126 -10717 -40340 -75240 -79239 -44144 -37291
23043 -37291 -20365 7881 53110 31682 -50189 -68039 -36723 -60292 -86289 -48471 -20835 -10978
23031 -10978 -27083 -33524 -47630 -9406 -7898 -28155 -8050 27250 52059 44486 36072 41521 48408
23018 48408 71414 29231 -4830 1594 -3093 -26942 -42781 -54577 -66776 -82743 -78133 -82396
23006 -82396 -41722 -32589 -70519 -66154 -76861 -48675 13748 34901 23902 -2876 -27870 -2707
22994b707J047L604K2677j9516n646o654j8202J906k3354K4449L4503O872p247
22981A1732L5405j8952k4824n6106N44L08J7819J8723j6621k2982m3720j2279
22969a10953K0932L8010O3730R442P416R925l2037l6495q110K6489N798l29j5228
22956b1410j3604o582P151N4293J672k4731k1877l417J3736M4694j508k8885J5007
22943A4539K0088p718l1683J1064L4924L7842k6437m3718k116L7437K9603J736
22931G5561n023j6875k5638P428M800J1454m0821k2176p2687k8879M1799O649
22919f4408M042K5338L9374K8827N8859l5528n0788o919M2258J6920n1169k4195
22907a7389p3075l1620K0797M1845M9440J8798J9730j4445R685k8J3657J35k7620
$$ plain form
22994 -2707 -1660 1944 24621 5105 -541 -7195 -25397 -23491 -46845 -22396 12107 18979 11732
22981 11732 47137 28185 3361 -52745 -52201 -51893 -34074 -15351 -31972 -54954 -98674 -110953
22969 -110953 -90021 -52011 11719 21161 28577 38502 6465 -30030 -38140 -11651 -5853 -6182 -21410
22956 -21410 -35014 -41596 -34445 19848 21520 -3211 -25088 -28505 -14769 29925 28417 -468 14539
22943 14539 34627 26909 -4774 6290 41214 79056 52619 8901 6785 44222 73825 75561
22931 75561 70538 53663 28025 35453 40253 51707 10886 -11290 -83977 -112856 -71057 -64408
22919 -64408 -60366 -35028 4346 33173 92032 56504 5716 -1203 41055 57975 6806 -17389
22907 -17389 -90464 -122084 -101287 -59442 -10002 8796 28526 14081 23766 23738 37395 37530 9910
22894I910K059q580n0844j477L1159j0711l5642l716P485R030O0318M7632m0257
22881A6366o1174k686l109P322J7607k8569l1419K9111N9712m009j596J1166k5520
22868a6798l9334K8920N4036q263k6411j0326K1813K3017J0751j1976O597J1018
22856D3044n3522j057J3835K3945o852l8745P785k2952m8158O337O6891J4103
22844D654j6939m676m5793J668M6767o104r294k1730j6499O306K0646P816J441
22831c1737k085L685j733J836L6360K1402l175l4659J0234R109K50J2274J1294
22818C3055m7664m728L0187j0451l0034K8388M9409k0908l6462r478n226k8417
22806e2329K5579K2153J4489j8274j355P948J9161L114k8707k6241J6720n799
$$ plain form
22894 9910 11969 3389 -47455 -48932 -17773 -28484 -64126 -67842 -60357 -51327 8991 56623 16366
22881 16366 -44808 -47494 -50603 -43281 -25674 -54243 -85662 -56551 3161 -848 -2444 8722 -16798
22868 -16798 -56132 -27212 26824 18561 -7850 -18176 3637 26654 37405 25429 32026 43044
22856 43044 -10478 -11535 2300 26245 19393 -19352 -11567 -34519 -82677 -76340 -9449 4654
22844 4654 -12285 -16961 -62754 -61086 -14319 -20423 -29717 -51447 -67946 -61640 -40994 -33178 -31737
22831 -31737 -33822 -30137 -31870 -30034 6326 27728 24553 -10106 128 9237 9487 21761 33055
22818 33055 -14609 -19337 10850 399 -29635 -1247 48162 27254 -9208 -18686 -23912 -52329
22806 -52329 -26750 -4597 9892 -8382 -9737 -1789 17372 20486 -8221 -34462 -17742 -23541
22794b3541L618M4579q907K2256K2681k2011k6450J54k8902J2178M8836j9314
22782B5177o9023j0608j5188M351K5632M7546P657n9894l3840k2412L0024K7172
22770d3406M4365K4906k9718m0985J322M1695j2138l5244l1720J489M3989L9941
22758D496L2915l4520r088J6294j902o123K4330J9010j897k9278J9909J5400J1352
22745F0898l1709o9630l3698L0312L7608R859K472p684k2718j3468m6678J9500
22733f4936O528l0251J5264J4203L4938L8365K463q212k0045l1667p089K3118
22721b7321L7551K1911L3047j5410j8358k7724j1282j9417M668j5138l4767J7520
22709e4720M1854N3951l362n2761j8302K3093O089q287J4728j8543l601O862L163
$$ plain form
22794 -23541 -19923 24656 15749 38005 60686 38675 12225 12379 -16523 -4345 44491 25177
22782 25177 -43846 -54454 -69642 -65291 -39659 7887 15544 -44350 -78190 -100602 -70578 -43406
22770 -43406 959 25865 -3853 -44838 -43516 -1821 -13959 -49203 -80923 -79434 -35445 4496
22758 4496 37411 2891 -6197 10097 8195 2072 26402 45412 43515 14237 34146 49546 60898
22745 60898 29189 -40441 -74139 -43827 -6219 3640 6112 -1572 -24290 -37758 -84436 -64936
22733 -64936 -58408 -88659 -73395 -59192 -24254 14111 16574 8362 -11683 -43350 -50439 -27321
22721 -27321 10230 32141 65188 49778 31420 3696 -7586 -27003 -22335 -37473 -72240 -54720
22709 -54720 -12866 41085 37723 -15038 -33340 -10247 -4158 -12445 2283 -16260 -19861 -12999 -9836
22696i836J5031K072k5053K079N435j1003J6582K0857n357k7954K3372O6934N258
22683G8417j3012k3491p5923l1070L7661L794l5240l8451K6148N3724m6082O55
22671f2870P254M4836K8915K5124K3593K7542o722o0981j1134Q898l1550J9207
22659A2112J0929k6551k8895m3070J7739J5492j2766J1622K0847L7831n30j6448
22647a688m280L209k3794n67K4918K5634p232J3085j6101M261j5393p984j8109
22634b4041Q123J0119j2229l0178R524N1267K1838k5599m1107o957N501J002O578
22621b6159K1676K2274j0395J25j2893k7180j7254N0489j8891k5739K3316l0006
22609e0637j5651K367j1354l399j3349L943R899J6266J2874K5195L4806J7059
$$ plain form
22696 -9836 5195 7267 -17786 -15707 -10272 -21275 -4693 16164 10807 -17147 6225 73159 78417
22683 78417 65405 41914 -34009 -65079 -27418 -23624 -58864 -97315 -71167 -17443 -63525 -62870
22671 -62870 -55616 -10780 18135 43259 66852 94394 87672 26691 15557 24455 -7095 12112
22659 12112 23041 -3510 -32405 -75475 -57736 -42244 -55010 -43388 -22541 15290 14760 -1688
22647 -1688 -5968 -2759 -26553 -27120 -2202 23432 16200 29285 13184 17445 2052 -5932 -24041
22634 -24041 -15918 -5799 -18028 -48206 -38682 12585 34423 8824 -32283 -39240 -33739 -32737 -26159
22621 -26159 -4483 17791 7396 7521 -5372 -32552 -49806 683 -18208 -43947 -20631 -50637
22609 -50637 -66288 -63921 -75275 -78674 -92023 -88080 -78181 -61915 -49041 -23846 10960 28019
22597B8019P373Q725o917l1746o1180o112K5792O770J3979M7235n535n8964l5024
22584f7585K7368M4668J0476P742K1367K3911j4006l6108m3392O591L3057R114
22572B3203j1920K8648J0235n8307p1716j0359j0410J1396L2203j0793J2779J3279
22560d1762k713N5733r603j7120l4302k8176K5783k4334J5272K1905j0097J7557
22548c1857J5374o312k3111j9317L8796K4837j8842l257L220j2894K8969J0142
22536E748K2031P795J2718j499k7390k2j8495n677Q875j2769l2314J995L3449
22523e555K2384J2236m297j499J4588l2765l7867K6895K1361M5170k2517j6982
22511B1152j1797n1713J628l896n679r263p885K3079K6933K2891R492j7469o2176
$$ plain form
22597 28019 35392 44117 37200 5454 -55726 -61838 -36046 -29276 -15297 31938 26403 -32561 -67585
22584 -67585 -40217 4451 14927 22669 44036 67947 53941 17833 -25559 -18968 14089 23203
22572 23203 11283 39931 50166 -8141 -79857 -90216 -100626 -89230 -57027 -67820 -55041 -41762
22560 -41762 -44475 11258 1655 -15465 -49767 -77943 -52160 -76494 -61222 -39317 -49414 -31857
22548 -31857 -16483 -22795 -45906 -65223 -26427 -1590 -20432 -23689 -20469 -33363 -4394 5748
22536 5748 27779 35574 48292 46793 19403 19381 886 -4791 4084 -8685 -40999 -39004 -5555
22523 -5555 16829 29065 24768 23269 37857 5092 -32775 -5880 15481 60651 38134 21152
22511 21152 9355 -42358 -40730 -44626 -50305 -59568 -67453 -44374 -17441 5450 14942 -2527 -64703
22498f4703J1302M3563M517j4554k854r033L1807M0073m1247n9762j7242K3668
22486e4465K6243L1203J1735K97M7323k5749o2091Q310J4186P265K2640J1545
22474C8442k2183l0159L6717J3269k0276q659l5941j0612O367K62J0682K4937
22462B846J5462K880k1891k5513j0692J5360J0050k3956J1457K9915J6403j5749
22450F572l323J042K5689k8563r133J7666k0876J0218K9456k8605l22P070j0290
22437c399m2975M4117m321K116K8240Q033m6862j6742r192Q93J2104J1253K9361
22424A2626m8187P074J4932P569J3788j8832m2019o563O5557m821p685J1983n430
22411hM657J1293L1073O910o2549o3945K1620K7222K6766M3768q777n0406k179
$$ plain form
22498 -64703 -53401 -9838 -5321 -19875 -22729 -31762 45 40118 -1129 -60891 -78133 -54465
22486 -54465 -28222 2981 14716 15013 62336 36587 -25504 -17194 -3008 4257 26897 38442
22474 38442 16259 -13900 22817 36086 15810 7151 -28790 -39402 -33035 -32773 -22091 2846
22462 2846 18308 21188 -703 -26216 -36908 -21548 -11498 -35454 -23997 5918 22321 6572
22450 6572 3249 4291 29980 1417 -7716 9950 -10926 -708 28748 143 -179 6891 -3399
22437 -3399 -46374 -2257 -6578 -4462 23778 31811 -15051 -31793 -40985 -40092 -27988 -16735 12626
22424 12626 -35561 -28487 -13555 -5986 7802 -11030 -53049 -59612 5945 1124 -6561 5422 -8
22411 -8 4649 15942 47015 53925 -8624 -72569 -50949 -23727 3039 46807 38030 -12376 -14555
22398a4555K9418M0970k7722m545j2587n7972p217J4150j3550J5669Q302j5515
22386d5154k0939K1754l28J0482K3741P482j7994j5788j1365Q619L4264J7580
22374A2354J4668J958l9444p6822L1047Q3540J567l8718l0274O083K1482N403
22362g156J6953l4847O707M9769k1344j620j4455K2034J9944L5613O982M746l7897
22349D5429p891Q812k6138k0474k0202L9981N000M839n840p522j0300L7831j7570
22336B5955k0946k8274M2634L5042J1311k1011l0440k513k7722O470m819N255
22324i058j7591K4881J2832m7987j3433K2919L3953J7321m940K002J1294r27k0555
22311A0711k8230p726k564j2377J025J05j7021L3548K5991n4413j2034L4354J9804
$$ plain form
22398 -14555 14863 55833 28111 23566 10979 -46993 -54210 -40060 -53610 -37941 -29639 -45154
22386 -45154 -66093 -44339 -44667 -34185 -10444 -2962 -20956 -36744 -48109 -39490 -5226 12354
22374 12354 27022 28980 -10464 -87286 -56239 27301 28868 -9850 -40124 -34041 -12559 -7156
22362 -7156 9797 -25050 -18343 31426 10082 8462 -5993 16041 35985 71598 78580 83326 45429
22349 45429 37538 46350 20212 -262 -20464 19517 24517 29356 23516 15994 5694 43525 25955
22336 25955 5009 -23265 19369 54411 65722 44711 14271 11758 -15964 -9494 -14313 -9058
22324 -9058 -26649 -1768 11064 -36923 -50356 -27437 6516 23837 18897 20899 32193 31266 10711
22311 10711 -17519 -25245 -27809 -40186 -39161 -39056 -56077 -22529 3462 -50951 -62985 -28631 -8827
22298h827J684j7945R591P655j5573j5556J360N6210K6372j3345r5869j9140P32
22285h2651K0311N04j3461p707l600N5132L7762m386N58m1959n632N6880L5651
22272D7402k3980Q040M227Q515l8706k7338n303P575M3936L6904l910m3386J1112
22259B5088K1633n3815l4614L7822M3531J2205l1436k989j4636O643j4767k9142
22247c4477k779M8254K8864j5277M275N6261l7051l5864k312j5711l1405r174
22235d6396K8354R052j3757K2170m311J587L422n1191n0908k7318R925L1191J5765
22222g2415K9611J4853R750k4084j3679r034L2904J3945j6349J1467j483M392
22210b0122l885J623M7240J8605m4650k9697q130J5140K2895p051k7972l011P1927
$$ plain form
22298 -8827 -7143 -25088 -15497 -7842 -23415 -38971 -37611 18599 44971 31626 -64243 -83383 -82651
22285 -82651 -62340 -61836 -75297 -83004 -86604 -31472 6290 1904 2462 -39497 -45129 11751 47402
22272 47402 23422 31462 35689 44204 5498 -21840 -27143 -19568 24368 61272 57362 13976 25088
22259 25088 46721 -7094 -41708 -3886 39645 51850 20414 17425 2789 9432 -5335 -34477
22247 -34477 -37256 10998 39862 24585 28860 85121 48070 12206 9894 -5817 -37222 -46396
22235 -46396 -18042 -8990 -22747 -577 -4888 -3301 121 -51070 -101978 -129296 -119371 -88180 -72415
22222 -72415 -42804 -27951 -18201 -42285 -55964 -64998 -32094 -18149 -34498 -23031 -24514 -20122
22210 -20122 -24007 -22384 24856 43461 -1189 -30886 -39016 -23876 -981 -8032 -36004 -39015 32912
22197C2912K7733p844j8588m5384j7192J8181K1541M893j6550J1189K2788J3215
22185D6894r682q976m5498m4712M079K0238L7016J5965p7457m1604J1941L8183
22173e3613M0455J7967n824l4531K6188J5236k1393K6875j7360m044O978l448
22161f514n4863k0876J1442K4388J1813j7530q728M6588j7428k4178L3096L0515
22149G725N8811l7745m4877j3066K764p406k5772M474K3625k004J6442k2392k8389
22136f7810K2401K502J9042P4552j7338j6571L1460k2188k8278J8060J6171j3546
22124A8457J4235K0034j8361k5551J6088R798K3306j6373J3513Q37q787k7094
22112B0102m553N3026n2507n7845l642P631M2421M4469l6269R134Q612R954J4335
$$ plain form
22197 32912 60645 52801 34213 -11171 -28363 -10182 11359 16252 -298 10891 33679 46894
22185 46894 37212 28236 -17262 -61974 -57895 -37657 -641 15324 -62133 -103737 -91796 -53613
22173 -53613 -13158 4809 -1015 -35546 -9358 5878 -15515 11360 -6000 -10044 -3066 -6514
22161 -6514 -61377 -82253 -70811 -46423 -34610 -52140 -60868 -14280 -31708 -55886 -22790 7725
22149 7725 66536 28791 -16086 -29152 -26388 -33794 -59566 -55092 -31467 -33471 -17029 -39421 -67810
22136 -67810 -45409 -42907 -23865 50687 33349 16778 48238 26050 -2228 15832 32003 18457
22124 18457 32692 52726 34365 8814 24902 34700 58006 41633 55146 55983 47196 20102
22112 20102 15549 68575 16068 -41777 -45419 -37788 4633 49102 12833 21967 30579 40533 54868
22099E4868k6615k2597j9354Q200K4648K8598l303l1548j9149R184J667l1278
22087b6679m315J4679l086M8383J715k5337j7842j1893l3781K3979L0003j3526
22075a7700j7072k249j1701K1341O621P90J0221J0523j4346J7986P846J2453j4826
22062I887j919P346Q409j1160j2633k8720j2181M2531K6882m8301m2184j901J2338
22049e1606K983K1275N3137L4135P9r485j1818j4495j1630K1049K0812k5233l6834
22036g631l5478k849k1599p819M673K6589J4858J32l1777J3245O7243J2398J6217
22023D8202J921k5380O787N831l3964j8989K2988r611q950l2183P306K7748K5736
22010A7442J9467o190k6770k5727K0561M7024l483k1687l1089k072K420j0025
$$ plain form
22099 54868 28253 5656 -13698 -5498 19150 47748 44445 12897 -6252 2932 4599 -26679
22087 -26679 -30994 -16315 -19401 28982 30697 5360 -12482 -24375 -58156 -34177 -4174 -17700
22075 -17700 -34772 -37021 -48722 -27381 -20760 -19970 -9749 774 -13572 4414 12260 24713 9887
22062 9887 7968 15314 23723 12563 -70 -28790 -40971 1560 28442 -19859 -62043 -63944 -51606
22049 -51606 -48623 -27348 25789 59924 60003 50518 38700 24205 12575 33624 54436 29203 -7631
22036 -7631 -43109 -45958 -67557 -75376 -70703 -44114 -29256 -29124 -60901 -47656 19587 31985 48202
22023 48202 50123 24743 31530 37361 3397 -15592 7396 -2215 -11165 -43348 -36042 -8294 17442
22010 17442 36909 30719 3949 -21778 -1217 45807 42324 20637 -10452 -12524 -10104 -20129
21998b0129k3981K170M2635n360m931k9402j6177K3765N0866K9324k3467j8139
21986G174L7199L3915m630k9600l6186l0590o566l8178K5332P5099Q291m3046
21974a786n0292L5437O6853J1885M984l0419j3873k347n043J5632q589k35J0798
21961C3005J8122k026n9918m0469M5L2824o379J5682J6890k4261k6170K3629r142
21948b8168k5844J4403K4471j684j4462J7090L6166L6384O988l4025m938L0991
21936E7372k2355P7j9325o771l1424J0329J966K3322k4459k016j6k6300q020Q520
21922c9100P967m0623j7480O7368P2539J0702j2500k7592j8187o017L1699k0571
21910H205L483j1543k9807j4678m88O93M9912l1433N87J4044O7071k1724j257
$$ plain form
21998 -20129 -44110 -41940 695 -4665 -9596 -38998 -55175 -31410 19456 48780 25313 7174
21986 7174 44373 78288 73658 44058 7872 -22718 -29284 -67462 -42130 32969 41260 -1786
21974 -1786 -52078 -16641 50212 62097 67081 36662 22789 20442 15399 31031 22442 22207 33005
21961 33005 51127 49101 -10817 -51286 -51241 -18417 -24796 -9114 7776 -16485 -42655 -19026 -28168
21948 -28168 -54012 -39609 -15138 -16822 -31284 -14194 21972 58356 65344 31319 26381 57372
21936 57372 35017 35094 15769 8998 -22426 -12097 -10131 13191 -11268 -13284 -13300 -39600 -47620 -39100
21922 -39100 -31133 -71756 -89236 -21868 50671 61373 48873 21281 3094 -2923 28776 8205
21910 8205 11688 145 -29662 -44340 -44828 -44135 5777 -25656 -25069 -11025 56046 34322 33065
21897C3065m2393j3232J8280M2862o156l3621L446j7116K0210O442l5998j3099
21885c7310K7285L5236J4896j4624k1708o020J0045K9331k145k4548q475l0431
21873b8468k9341R12j4908n652k1654K7582K7392q519j8633L4168M2341J5402
21861B0622Q117K1367J0267k3762q360l3083l2688N752n466n7753j6326N8565
21849e2748m207L1299M2473J596j2445m367m270R332J9027p926j4991r527k337
21836i091Q709l5356o0371j4229M951J7912J1174K5194M5059m898m107J6729R117
21823A0793J5519q705j8244K882j214j4765k4335J9302L7018j9891k963J4448
21811I845M1004j1561m493J167j1054N014p853M427K2833j3460j2664k1204n0829
$$ plain form
21897 33065 -9328 -22560 -4280 38582 32426 -1195 2251 -14865 5345 11787 -24211 -37310
21885 -37310 -10025 25211 40107 25483 3775 -2245 7800 37131 34986 10438 1963 -28468
21873 -28468 -57809 -56897 -71805 -77457 -99111 -71529 -44137 -52656 -71289 -37121 5220 20622
21861 20622 28739 50106 60373 36611 28251 -4832 -37520 -31768 -37234 -94987 -111313 -52748
21849 -52748 -56955 -25656 16817 18413 5968 1601 -2669 6663 25690 17764 2773 -6754 -9091
21836 -9091 -382 -35738 -96109 -110338 -105387 -87475 -76301 -51107 -6048 -10946 -15053 1676 10793
21823 10793 26312 17607 -637 2245 1031 -13734 -38069 -18767 18251 -1640 -4603 9845
21811 9845 50849 39288 34795 35962 24908 29922 22069 26496 49329 35869 23205 2001 -48828
21798d8828J9670M3947l2039j4130K1235M7736M4820k0507Q461j6602r691j0662
21786C3410o3792k8723P2171M6497N500J2321k5913j1324N01m5737k8549n601
21774c9239K5904n210L3241J0005j109m1236L7062M3594k6124j2384R395j1214
21762B2685m3565j1775m355M53O218j8887K6067K8190Q459k2104J77l361k9944
21749d1742k165q854K0060J0254K1211l485p381O253K606j9284l4835j5607M1007
21736c1962K3074J5539k3634K0452p792m689q81L4642M5563j7528j9945o1815
21724b8976j880Q128o925q812L0959l4403j8578M2242L7069K2431J62j3735j2483
21711A5199J3351R845o988j0322k6404k6837J4104J1481n061K287l8237j9560
$$ plain form
21798 -48828 -29158 14789 -17250 -31380 -10145 37591 82411 61904 70365 53763 44072 33410
21786 33410 -30382 -59105 13066 59563 65063 77384 51471 40147 40648 -5089 -33638 -39239
21774 -39239 -13335 -18545 14696 24701 23592 -17644 19418 63012 36888 24504 33899 22685
21762 22685 -20880 -32655 -37010 -36557 -30339 -49226 -23159 5031 13490 -8614 -8437 -11798 -41742
21749 -41742 -43907 -52761 -32701 -22447 -1236 -4721 -12102 -5849 -3243 -22527 -57362 -72969 -31962
21736 -31962 -8888 6651 -16983 3469 -4323 -9012 -9893 24749 70312 52784 32839 -28976
21724 -28976 -30856 -22728 -29653 -38465 -7506 -41909 -60487 -18245 18824 41255 41417 27682 15199
21711 15199 28550 38395 31407 21085 -5319 -32156 -18052 -6571 -11632 -9345 -47582 -67142
21699f7142P170r26J9953K2609k3716m1519K5987J1583J7458R180M125l78r33
21686a6549k6868n7490n205K4284M831O2945M0272l850J0167k0368Q685J948N017
21673B7819K5430m6085l5281k0046K816M20L1368p280k6190P753L4970o1m7317
21660e1684l0670M1938L1880q367r912M383p121j9066M0855O227n694N534J5733
21647A4036J2311r673l3558j6652J5438n0132J6755K9977K8859k3716o569n2283
21635g5207K1650K3359R792K0061J9982J0818j3418n589j4518Q509M6218J7503
21623F9160j5725J8587N1180k6175l1739l2210n6579j9877J3786K8544R459J584
21611I995p2562j3966O527K6006K9191L0962j5090n3554j6297J9655M2008k2225
$$ plain form
21699 -67142 -59972 -60898 -40945 -18336 -42052 -83571 -57584 -46001 -28543 -19363 -15238 -15616 -16549
21686 -16549 -43417 -100907 -106112 -81828 -76997 -14052 26220 22370 32537 12169 20854 22802 27819
21673 27819 53249 7164 -28117 -48163 -45347 -44927 -13559 -20839 -47029 -39276 -4306 -4367 -51684
21660 -51684 -82354 -40416 -8536 -16903 -26815 -22432 -29553 -48619 -7764 -1537 -7231 -1697 14036
21647 14036 26347 16674 -16884 -33536 -18098 -68230 -51475 -21498 7361 -16355 -22924 -75207
21635 -75207 -53557 -30198 -20406 -345 19637 30455 17037 11448 -3070 5439 51657 69160
21623 69160 53435 72022 123202 97027 65288 33078 -23501 -43378 -29592 -1048 8411 9995
21611 9995 -62567 -76533 -70006 -44000 -14809 16153 1063 -52491 -68788 -49133 -7125 -29350
21599b9350m9830J1638M5439O80l3351r608K2403P552J0988m1852J0362M6894
21587h035P833k8799J0231K6150K7895m8330m7282l6474K2488K6186L5580J8527
21575E970o143k0194K7837P561j8329J8449L4745J9776j8567l5024l1622k7269
21563d2810N331L1934J5704K504l1591j3238k4828L4515L4182k8872j3952P0M902
21550b6149J012k9750K6852j1652k486K1365K7747J3957J0073k417k6887K5862
21538B7527M6614J4711j1386n1048j4490J8631l247m3264j3681j2066J9527L4698
21526A2526K354k6267O804k1488J7791J9495n1556L241N1953J9603j0275m6288
21514b2107k6154L925K2997n7090k5885K3104K1278n5567K5539M7519J2509j2444
$$ plain form
21599 -29350 -79180 -67542 -22103 -21423 -54774 -64382 -41979 -34427 -23439 -65291 -54929 -8035
21587 -8035 -202 -29001 -18770 7380 35275 -13055 -60337 -96811 -74323 -48137 -12557 5970
21575 5970 -173 -20367 7470 15031 -3298 15151 49896 69672 51105 16081 -15541 -42810
21563 -42810 -37479 -5545 10159 12663 -18928 -32166 -56994 -22479 11703 -17169 -31121 -31051 -26149
21550 -26149 -25137 -54887 -28035 -39687 -42173 -20808 6939 20896 30969 28552 1665 27527
21538 27527 74141 88852 77466 26418 11928 30559 27312 -15952 -29633 -41699 -22172 12526
21526 12526 14880 -11387 -4583 -26071 -8280 11215 -40341 -37100 14853 34456 24181 -22107
21514 -22107 -48261 -44336 -21339 -78429 -104314 -81210 -59932 -115499 -89960 -42441 -29932 -42376
21502d2376P867j2382L2444M4139k6454r7K0237n224k5000k404o490R459j1296
21489a7577j8699M135M8386J7057l7354l6013P381m887p9217Q374O0972J7490
21477b9952N956L873n177k220M403k2731M0604M0698l5566j3606L2425j8547j443
21464a283J0272j6217l583M6083N476M580j9753P556l245n1339J2861L7825Q729
21451C7962k0J9318l5440m4455P647J6080N33J9993J7931l2877j919k136M197
21438F814k7728o3656q049q231J00M010K9665M2145J0918J1680K8489K3647j7130
21425C2674j7167N385K2035q605j8491j1536l1953J6289K9085j7793l180K2586
21413A9329J1633j0622J3093O124J7936k0090l1924R477J0961m682L2363L4503
$$ plain form
21502 -42376 -34509 -46891 -14447 29692 3238 3141 23378 18154 -6846 -9250 -15740 -6281 -17577
21489 -17577 -36276 -32141 16245 33302 -4052 -40065 -32684 -37571 -116788 -108414 -47442 -29952
21477 -29952 -23996 -20123 -25300 -27520 -23117 -45848 -5244 35454 -112 -13718 18707 160 -1283
21464 -1283 8989 -7228 -10811 35272 40748 45328 25575 33131 29886 -21453 -8592 29233 37962
21451 37962 37942 57260 21820 -22635 -14988 1092 1625 21618 39549 6672 4753 2617 6814
21438 6814 -20914 -84570 -92619 -100850 -100750 -96740 -67075 -24930 -14012 -2332 26157 49804 32674
21425 32674 15507 20892 42927 34322 15831 4295 -27658 -11369 17716 -77 -3257 19329
21413 19329 30962 20340 33433 39557 57493 37403 5479 14956 25917 21235 53598 88101
21401H8101J2024J8440m5929m2006q890J8044J3508Q287n552l0814P085J3582
21389D5880R846m0510q208m973o632J057j1269K2702J7142j3922j8773k0963l5943
21376f4566K104P872J1850j016q863J9544o301J9301K1516N262l3918J2285L7637
21363B2707L1939m5787o6747J1377K6103K1003P981N387j0443n524J5576n2487
21351c8915P365K2715J6231O469j020j2015j658k1128q070P328P283j3606J2682
21338a6339j3300j948O0118q642L880j7781j3400Q709L3821m6051k8739n419j807
21325d6898l159p430j1774K1466K4451L239j1415o1278k0107N8371k740j3137
21313g0411J3201O309N448N8566n096j9669j5424J8077k839q730k293o532J5496
$$ plain form
21401 88101 100125 118565 72636 30630 21740 39784 53292 61579 56027 25213 32298 45880
21389 45880 55726 15216 7008 2035 -4597 -3540 -14809 7893 25035 11113 -7660 -28623 -64566
21376 -64566 -62462 -54590 -42740 -43756 -52619 -33075 -39376 -20075 1441 6703 -27215 -14930 22707
21363 22707 54646 8859 -57888 -46511 -20408 595 8576 13963 3520 -2004 13572 -38915
21351 -38915 -31550 -8835 7396 13865 12845 830 -828 -21956 -30026 -22698 -15415 -29021 -16339
21338 -16339 -29639 -31587 28531 19889 23769 5988 -7412 1297 35118 -10933 -39672 -45091 -46898
21325 -46898 -50057 -57487 -69261 -47795 -23344 -20105 -31520 -92798 -112905 -54534 -57274 -70411
21313 -70411 -57210 -50901 -45453 13113 8017 -11652 -27076 -8999 -11838 -20568 -22861 -29393 -13897
21300a3897J2184N669J8394k0610m3777P653K676K0559L1515K0919n726l4699
21288H60k9946J8843P42k8842j6718K630L0387K3558J1694n658j0539L8924Q382
21275D4317n265o2516k6260J1009k0502J5320O7738M0130L6659k5769n4485m977
21263A5399J833N793K1479M2762J7688r352m6938j7368L1357J5895o5684m0204
21251b7340Q237j4450k0190j285M553O515k6602J6990K5408J0867L7445L8762
21239E8910p309m9287r738K947j0493o995M0394l414n0476N0068M0190k3354P959
21226C9402K6055l5954k1748J4432J7501k3638j3280j4390k8569o61L5423m484
21214i911j2538J6535n022J8533j4775k9398m861N756K8299L9274k5611l3374
$$ plain form
21300 -13897 -1713 3956 22350 1740 -42037 -34384 -31708 -11149 20366 41285 35559 860
21288 860 -29086 -10243 -9501 -38343 -55061 -52431 -22044 1514 13208 7550 -2989 35935 44317
21275 44317 39052 -23464 -49724 -38715 -59217 -43897 23841 63971 100630 74861 20376 15399
21263 15399 17232 23025 44504 87266 104954 95602 48664 31296 62653 78548 12864 -27340
21251 -27340 -19103 -33553 -53743 -55028 -50475 -43960 -70562 -53572 -28164 -17297 20148 58910
21239 58910 51601 2314 -7424 -4477 -14970 -21965 18429 15015 -35461 14607 54797 31443 39402
21226 39402 65457 29503 7755 22187 39688 16050 2770 -11620 -40189 -40850 -5427 -9911
21214 -9911 -22449 -5914 -10936 7597 -7178 -36576 -41437 -35681 -7382 31892 6281 -27093
21202b7093k164q353M7914j0127l1471j0768k7776L9889r101l0205L2391J8278
21190a8586l8702r425J3602k3189j0487K8224K6014L2833J2611k9967K0733O894
21178A0555J530j8714m4387o119J6724J1776q953K5542j5535l3436k1789K9643
21166e3163L2360M6007J6868l6797k6976M950K7544K7661Mk6490M544l0324q098
21153b1910r874j6892K4302K1312j7432Q923K2240R047l316l2398K6878l944o482
21140D54j2120k691j3187J214l5961J5538j7698N1767K9452k0726M639K8578J8993
21127D8252O5l4316j1693r937Q917r342O270L7568P345k1827l1336O8907K3921
21114H2794j8072k1923r798l6597k3493L180M744N4403M9483k7747m2425n933
$$ plain form
21202 -27093 -29257 -37610 10304 177 -31294 -42062 -69838 -29949 -39050 -69255 -36864 -18586
21190 -18586 -57288 -66713 -53111 -76300 -86787 -58563 -32549 284 12895 -17072 3661 10555
21178 10555 12085 -6629 -51016 -57135 -40411 -28635 -37588 -12046 -27581 -61017 -82806 -53163
21166 -53163 -20803 25204 42072 5275 -21701 -16751 10793 38454 38458 11968 16512 -13812 -21910
21153 -21910 -31784 -48676 -24374 -3062 -20494 -11571 10669 19716 16400 -15998 10880 6936 454
21140 454 -11666 -14357 -27544 -26330 -62291 -46753 -64451 -12684 16768 -3958 681 29259 48252
21127 48252 48317 14001 2308 -7629 1288 -8054 -1784 35784 43129 21302 -10034 58873 82794
21114 82794 64722 42799 33001 -3596 -27089 -23909 -19165 35238 84721 56974 14549 8616
21102H616k3867k5028K4086l2151n865L716M8029j2891J7254M939J6116r81K1211
21089D3184m814k9943n6010k3723M7228J5317k5668J7677p376L9521L207n6423
21077c7823o58o232k490k7821P571K9438M5631K4473k349o452k9462k5978J099
21064c1053p734J8183J0338m6012m8232j1918K8253L3767J9891J4254n357L0180
21052D560N1979J4708l3903q030P104k8710m9670m814J691M3653J0836n910R737
21039A3231M6471j7731m4391l7075j6478J8329j78k5164O102L1769K171l6370
21027e9314J0119O4878J5755K6754N650k5812L1718j7176j8191j8183l1654Q539
21015f917J3195k2276J1639P1566K1082m3410k2752K1555J2249p399p335j4422
$$ plain form
21102 8616 -15251 -40279 -16193 -48344 -54209 -50493 -2464 -15355 1899 6838 22954 21973 43184
21089 43184 38370 8427 -47583 -71306 -24078 -8761 -34429 -16752 -24128 15393 18600 -37823
21077 -37823 -38481 -44713 -47203 -75024 -67453 -38015 7616 32089 29740 23288 -6174 -32152 -31053
21064 -31053 -38787 -20604 -10266 -56278 -104510 -116428 -88175 -54408 -34517 -20263 -25620 4560
21052 4560 56539 71247 37344 29314 36418 7708 -41962 -46776 -45085 -1432 9404 3494 13231
21039 13231 59702 41971 -2420 -39495 -55973 -37644 -37822 -62986 -56884 -25115 -22944 -59314
21027 -59314 -49195 15683 31438 58192 63842 38030 69748 52572 34381 16198 -15456 -6917
21015 -6917 6278 -15998 -4359 67207 88289 44879 22127 43682 55931 48532 41197 26775
21003B6775Q446j9839j4093j3728j5233J9996J4349M909K0585k378k1428j0453
20991b092l436j6257N554Q81L7184o621J7052P082M678L9649L4330m3494k5866
20978D8644J290k4486n2062m405K8066k44j740l3043P435J597j6735L6947J9151
20965A0415m37n1922j210P642l236K186j0614L2418K3437r071j9139L6599J0848
20952B7916m5594j5275j1896J6778K7839L208m3736K0421P734j4834J9379j4384
20940b2444k1847k1474l1057k5159M4193P4084L4626L3787L291j946l3990L7433
20928F9497K8118l975N172n9684k9167k2235N993J2590n7863J7988L2599O098
20916E131L0884n9122R378J6101M155k6440J441J636J8162J0735K7408N321l7356
$$ plain form
21003 26775 35221 15382 1289 -12439 -27672 -7676 6673 11582 32167 29789 8361 -2092
20991 -2092 -5528 -21785 -16231 -15350 21834 15213 32265 39347 44025 83674 118004 74510 48644
20978 48644 49934 25448 -26614 -31019 -2953 -3197 -4937 -37980 -30545 -28948 -45683 -8736 10415
20965 10415 9978 -41944 -43154 -35512 -38748 -36562 -47176 -14758 8679 -392 -19531 17068 27916
20952 27916 -17678 -32953 -44849 -28071 -232 2976 -40760 -20339 -12605 -27439 -8060 -22444
20940 -22444 -44291 -65765 -96822 -121981 -77788 -3704 30922 64709 68000 66054 32064 69497
20928 69497 97615 93640 98812 39128 9961 -12274 -6281 6309 -51554 -33566 -967 5131
20916 5131 36015 -23107 -13729 2372 6527 -19913 -18472 -16836 1326 12061 39469 44790 7434
20903G434m6557l3681M8136L3880j4565k4242r254k693m317O6368L8045j753l5173
20890B1628l4462k3364J691J8196j0773j5274m405j48j5741l6863N6526M7710
20878D721K4278j3213l2648k2285j385K9802j8659p689M5969k1868q207o797R468
20865a8513M1355j8217l4431k8977k1396J7769N0011M8982K2749p3251l1545k7996
20853g3460J4230N004R192M6730K9276o415n544r553O277Q329N009r631l191j3533
20839B720k6315M656J9062J7711j6872K185N5595J7345j9123k342R824j5661q314
20826D0471l2527L47k3566K4849K0951k2634M4997K41j3269j5845J048k6677l265
20813d879O837J1252N349J5109N809j0844K358k9774j1433l248K207k8115M592
$$ plain form
20903 7434 -39123 -72804 -24668 9212 -5353 -29595 -38849 -41542 -45859 20509 58554 56801 21628
20890 21628 -12834 -36198 -34507 -16311 -27084 -42358 -46763 -46911 -62652 -99515 -42989 4721
20878 4721 28999 15786 -16862 -39147 -40532 -10730 -29389 -37078 8891 -12977 -21184 -27981 -18513
20865 -18513 22842 4625 -29806 -58783 -80179 -62410 -12399 36583 59332 -13919 -45464 -73460
20853 -73460 -59230 -54226 -45034 1696 30972 24557 19013 9460 15737 24066 29075 19444 16253 2720
20839 2720 -23595 -18939 123 17834 962 3147 58742 76087 56964 54622 64446 48785 40471
20826 40471 7944 8291 -15275 9574 30525 7891 52888 53129 39860 24015 25063 -1614 -4879
20813 -4879 1958 13210 18559 33668 39477 28633 30991 1217 -10216 -13464 -11257 -39372 -34780
20800c4780k4568J5872J7857K9081K1140k2774M153J3985J802k0827R590M5959
20788E6490K2455m439m4478m2828j4606J251m0553L6101M1249p678n2429O493
20776d2972K9725j3024j7460j0646K9032L1402J7397j8569j5000J205N0171M225
20764D5486j7505j9729J4823M6100k3926l4743K4532j1067l47j8150K4400L665
20752C3539r152k2651m567j8411j6010N0250M2393j1645l1847j3554k0669p502
20740b9826l251O319q286k5317L4009J1727k788m3293j9174j1596l375J3267L708
20727g7876K7063J2834J6849L5126Q957q021l1524Q53m55k8160L4813M8344O668
20714D5471P050N914J5374k2554K512J1144n14m1056j4798m5247j1545L7560Q618
$$ plain form
20800 -34780 -59348 -43476 -25619 3462 24602 1828 5981 19966 21768 941 10531 56490
20788 56490 78945 74506 30028 -12800 -27406 -26155 -66708 -30607 10642 2964 -49465 -42972
20776 -42972 -13247 -26271 -43731 -54377 -25345 6057 23454 4885 -10115 -8910 41261 45486
20764 45486 27981 8252 23075 69175 45249 10506 35038 23971 23624 5474 29874 33539
20752 33539 24387 1736 -2831 -21242 -37252 12998 55391 43746 11899 -1655 -22324 -29826
20740 -29826 -33077 -26758 -35044 -60361 -26352 -14625 -17413 -60706 -79880 -91476 -94851 -81584 -77876
20727 -77876 -50813 -37979 -21130 13996 22953 14932 -16592 -15739 -16194 -44354 -9541 38803 45471
20714 45471 52521 58435 73809 51255 53767 64911 64397 23341 8543 -36704 -48249 -10689 -2071
20701b071M3114J0231L924L005j176L581m3310o457O06j6918R787m3579j508K9109
20687a1662J0307k2308k0777J6431J5420J9193K6923o067l4359O068L3643J6193
20675D9005M595j6275m1135k6887p558J7868J0153k6118m1855J3436M3399K6069
20663D697K2345k5053q118M5280L559J1844J0065k4987N335k7636p0996J4365
20651c9300N366K6541J0046j1108K0587K7273k4592l0822K1127M19k0110J1691
20639b882k7508J5586K5816M210n3537l2641R586J2093M904j8204r188L2997l735
20626d2503J2516J3863j2750J5184J2691J7808K9377J475J3749j6236o368J0705
20614D9511J2565l3085k0427j0152l5033M5912M446q711j5578J6420q602m2759
$$ plain form
20701 -2071 41043 51274 55198 58203 57027 60608 17298 10841 11447 -5471 4316 -39263 -40771 -11662
20687 -11662 -1355 -23663 -44440 -28009 -12589 6604 33527 27460 -6899 -831 32812 49005
20675 49005 53600 37325 -3810 -30697 -38255 -20387 -10234 -36352 -78207 -64771 -21372 4697
20663 4697 27042 1989 -6129 39151 42710 54554 64619 39632 44967 17331 -53665 -39300
20651 -39300 -33934 -7393 2653 -8455 12132 39405 14813 -16009 5118 5537 -14573 -2882
20639 -2882 -30390 -14804 11012 15222 -38315 -70956 -61370 -49277 -44373 -62577 -71765 -38768 -42503
20626 -42503 -29987 -16124 -28874 -13690 -999 16809 46186 47661 61410 45174 38806 49511
20614 49511 62076 28991 8564 -1588 -36621 9291 13737 5026 -10552 5868 -2734 -45493
20602d5493o693K3585m770l6108K4860l6021N564P948J7728L349k310J7821K3183
20589g357n454m878j0491L1093L2333K4O222j4719k8344r003j8864M015J5920
20576i503L370l5253J7730J179L4349m1746q493j7767K94M2868K2604K0671p680
20563B2623k8306j6762K785q435q073J2141J9919j6387J7662k5382K631j3084
20551c8668l4987Q947N9679L0926O4971q278k4752J205j4264J3873M808l3929
20539B9531L121p436p4044p732J9438j7447Q118L3332J9678K8232k9864n8659
20527e3732j2306l70K2300P680L0680P089O32j0705R291k4680J5774N2721K0401
20514F4775l0441l9171j5984l5923L8005N5733j346m3104l1540N974J7208M0799
$$ plain form
20602 -45493 -52186 -28601 -33371 -69479 -44619 -80640 -75076 -67128 -49400 -46051 -48361 -30540 -7357
20589 -7357 -12811 -17689 -28180 2913 35246 35270 41492 26773 -1571 -10574 -29438 -25423 -9503
20576 -9503 -6133 -41386 -23656 -22477 11872 -29874 -38367 -56134 -55840 -12972 9632 30303 22623
20563 22623 -5683 -22445 -19660 -28095 -36168 -24027 -4108 -20495 -2833 -28215 -25584 -38668
20551 -38668 -73655 -64708 -5029 25897 90868 82590 57838 59043 44779 58652 63460 29531
20539 29531 32652 25216 -48828 -56560 -37122 -54569 -46451 -13119 6559 34791 4927 -53732
20527 -53732 -66038 -66408 -44108 -36428 -5748 1341 1973 -8732 559 -24121 -8347 44374 64775
20514 64775 34334 -4837 -20821 -56744 -18739 36994 35648 -7456 -38996 -33022 -15814 24985
20502B4985k2071l682J1995J5226J8980k7177k4349k5161j008L4565M021l7255
20490c0931j6853L5981j854l7662J4280NN150J4289J2312M6579O34k2831n0454
20477c1355j2793M3128M884J1383L6182l6996k7711o235l3823p201K0699k311
20465d2149K8999K2926L0520J8868l3743k5728N967J8539j7380j3221j284k3574
20453c1260J2416J2837j6408R277J4229j4627J6198J1399K9255j3388o97m9993
20441b0762m2825o449M7965J4458N590J2941J5086L3502l1230p350j4921J123
20429G128K037L3733J8348j4420l3754l1296j5808L9087K7612k9229j4717M8174
20417C6895j9725j6338k3274k5006l35k4148j4212N5380M3961m012k9979R23q104
$$ plain form
20502 24985 2914 -768 11227 26453 45433 18256 -6093 -31254 -32262 2303 6324 -30931
20490 -30931 -47784 -11803 -13657 -51319 -37039 -37034 -31884 -17595 -5283 41296 41930 19099 -31355
20477 -31355 -44148 -1020 3864 15247 51429 14433 -13278 -19513 -53336 -60537 -39838 -42149
20465 -42149 -13150 9776 40296 59164 25421 -307 5660 24199 6819 -6402 -7686 -31260
20453 -31260 -18844 -6007 -22415 -13138 1091 -13536 2662 14061 43316 29928 29231 -20762
20441 -20762 -63587 -70036 -22071 -7613 -2023 10918 26004 59506 28276 20926 6005 7128
20429 7128 9165 42898 61246 46826 13072 -18224 -34032 5055 32667 3438 -11279 36895
20417 36895 17170 832 -22442 -47448 -47783 -71931 -86143 -30763 13198 9186 -20793 -19870 -27974
20404b7974j9234K7431L3760L3160J8443p681q626l7683M1222R138m9862k4615
20392a2521l9338n7959J5401J7144R004K8560M0973r644o787K4987O1038K28l0231
20379D0855j7302K5304j8881r801k5633l4684n364L8151K7881j3727P41l2409
20367b4869k138j1256P719J2911l774J3316M2025J5952L622j4474j8523j9079
20355A432K1152R178J3647m5382K691K7159Q599l7842q785l1197k8035n51M807
20342f3127L4733L7110K0238l2699l6228R088N260n184Kl1177K8985L2435j0200
20329a0764l5957K268J9739J3740r761j0797K8728J4129J612j3844j8411P456
20317a1862K1193p352l6692K6503k271m0078J2439L0770r217o635N4231J5333
$$ plain form
20404 -27974 -47208 -19777 13983 47143 65586 57905 49279 11596 52818 61956 12094 -12521
20392 -12521 -51859 -109818 -94417 -77273 -68269 -39709 1264 -8380 -15167 9820 70858 71086 40855
20379 40855 23553 48857 29976 20175 -5458 -40142 -45506 -7355 20526 6799 7540 -24869
20367 -24869 -27007 -38263 -30544 -17633 -21407 -8091 33934 49886 53508 39034 20511 1432
20355 1432 22584 31762 45409 27 2718 29877 38476 634 -8151 -39348 -67383 -67934 -63127
20342 -63127 -28394 8716 28954 -3745 -39973 -30885 -25625 -30809 -30807 -61984 -32999 -564 -10764
20329 -10764 -46721 -44453 -24714 -10974 -20735 -31532 -2804 11325 12937 -907 -19318 -11862
20317 -11862 9331 1979 -34713 -8210 -10481 -50559 -38120 -7350 -16567 -23202 31029 46362
20305D6362J1609j8661m5173j2619j8108k2426J7837L309k057J4009k237K7169
20293i86L3914J3951J2269L01J3541n301r315j4323k7182j3239k8183m5247k4474
20280i4274J473J2052k1508L0967K6261K1475M2565K6061j5469r105J5396J5946
20268E1840j5942m6038j6612J5003j3553l3643p237M508J5038O607M528O3012
20256B7511N9477k4273n7931J6533L0430K2005k4868l6906N523L120M151K4344
20244D9116m1899k4132N251J1169K3571K4927j5589j403j2922J5058p397m8442
20232b2692q067j3876k146L8693K7843J5007k5504l1560l864J2813N4326K3311
20220F4284k7743k0559N622O400k447K961l4506L876O067l434J4757K1670k5674
$$ plain form
20305 46362 57971 39310 -5863 -18482 -36590 -59016 -41179 -37870 -39927 -25918 -28155 -986
20293 -986 32928 46879 59148 59449 72990 67689 58374 44051 16869 3630 -24553 -69800 -94274
20280 -94274 -92801 -80749 -102257 -71290 -45029 -23554 19011 45072 29603 20498 35894 51840
20268 51840 35898 -10140 -26752 -11749 -25302 -58945 -66182 -61674 -46636 -40029 -35501 27511
20256 27511 86988 62715 4784 21317 51747 73752 48884 11978 17501 20621 24772 49116
20244 49116 7217 -16915 -11664 -495 23076 48003 32414 31011 18089 33147 25750 -22692
20232 -22692 -30759 -44635 -46781 -8088 19755 34762 9258 -22302 -26166 -13353 40973 64284
20220 64284 36541 15982 21604 28004 25557 28518 -5988 -2112 3955 521 15278 36948 11274
20207A1274l9094p265J272l4144J3331K8082L6791j9141k457R690R19m5082k4611
20194g0435K6692M1866K9497K7289j363p969k1586j3457Q249j1908K6856J2558
20182D6289l835p282p020k4190k4457j3583M2591Q886j5059l0731r585K2591K9794
20169A4409J1459K5046N3584K5437k7301r4784l5810J4414L4165M616J6259L3643
20157G5137K0232k2505o9220j8821J3170j8625m670K0529l2310J7770o091j0702
20145c6106K1977K4976n620J0129j8060k753k8187k5761K4625M1966K6450k4008
20133I628j5994j4318k2805J8370M0154n154n7938J5587J5773N607L8057r367
20121A7600N899j328m209J7738o671l9132J1348L7396j3680m987J0979P083l507
$$ plain form
20207 11274 -27820 -35085 -33813 -67957 -54626 -26544 10247 -8894 -11351 -1661 -742 -45824 -70435
20194 -70435 -43743 -1877 27620 54909 53546 45577 23991 10534 18783 6875 33731 46289
20182 46289 42454 35172 28152 3962 -20495 -34078 8513 17399 2340 -28391 -37976 -15385 14409
20169 14409 25868 50914 104498 129935 102634 7850 -27960 -13546 20619 25235 41494 75137
20157 75137 95369 72864 3644 -15177 -2007 -20632 -25302 -4773 -37083 -19313 -25404 -36106
20145 -36106 -14129 10847 5227 15356 -2704 -5457 -33644 -59405 -34780 7186 33636 9628
20133 9628 -6366 -20684 -43489 -25119 15035 9881 -48057 -32470 -16697 -11090 26967 17600
20121 17600 23499 22171 17962 35700 29029 -10103 1245 38641 24961 19974 30953 38036 34529
20108C4529K0940P374j1732m3308k6123K2513J1602n2310l6464j0666j8603K127
20096a00121O5034K8483k0825N0708L7120q55l9862j5708p87J8659K1122l683
20084C9285P43J1120J2989o9880j4704K7107K1673j5975n1361l616K147M412J0403
20071b5657L530J9293m611n118j4133P470L1996K0635k5973k8375L1124K2849
20059C3030K322K7550L0821j0954o1830k1202K1221j4932k2529K7171K3246q273
20047B5641Q836l979o2556k881K6427L393K2035N7599P353o4362k1074N6869j0880
20034D2421m8420k4261M8831M3958J3887l579m3070j7631k3543K3157L1638K5682
20022F9070l3739o3231K3086k3590l0923R656J299L2790Q473K8304L8330n6436
$$ plain form
20108 34529 55469 62843 51111 7803 -18320 4193 15795 -36515 -72979 -83645 -102248 -100121
20096 -100121 -35087 -6604 -27429 23279 60399 59544 19682 3974 3187 21846 42968 39285
20084 39285 40028 51148 64137 -5743 -20447 6660 28333 12358 -39003 -42619 -40472 -36060 -25657
20071 -25657 -22127 -2834 -7445 -12563 -26696 -19226 12770 33405 7432 -20943 10181 33030
20059 33030 35352 62902 93723 82769 20939 -263 20958 6026 -16503 10668 33914 25641
20047 25641 34477 30498 -32058 -34939 -8512 -5119 16916 74515 81868 17506 -3568 53301 42421
20034 42421 -5999 -30260 18571 62529 76416 72837 29767 12136 -11407 11750 43388 69070
20022 69070 35331 -27900 -4814 -28404 -59327 -49671 -48372 -15582 -7109 21195 59525 3089
20010C089k7369K1199j1598l6228O075K2755l252n605j0729l12j3803L6823K8888
19997I933j525l885L37J8874j8676j6924K9823l0887k5216Q213K4847K6403K3583
19984D4900K0106l850j5331k2496j3371o223K5940n909O625L3786J89j0399j9341
19971C4626j139k3979N932m849j9784J7253K0990k5208r171J8649k8685q726K0773
19958c318k6187k2611M5441r032k10M5759k5444j6085K3734o6N222j1442K8252
19945C4013K6561j4458j7096j4994l0688m0857k670O0657O952K831K6230J1321
19933D7802m2982j4949K5429k9074J758K1134J4882l343k889m0563J605L0398
19921I208p419k2092q833q483j5832M216L076j3594O343R1385K773m9859j9232
$$ plain form
20010 3089 -24280 -3081 -14679 -50907 -44832 -22077 -25329 -30934 -41663 -41975 -55778 -18955 9933
19997 9933 8408 4523 4860 23734 5058 -11866 17957 -12930 -38146 -29933 -5086 21317 44900
19984 44900 65006 61156 45825 23329 9958 3735 29675 23766 30391 64177 64366 53967 34626
19971 34626 33487 9508 15440 10591 -9193 8060 29050 3842 -5329 13320 -15365 -24091 -3318
19958 -3318 -29505 -52116 -6675 -15707 -15917 29842 4398 -11687 12047 11981 17203 5761 34013
19945 34013 60574 46116 29020 14026 -16662 -57519 -60189 468 7420 10251 36481 47802
19933 47802 4820 -10129 15300 -13774 -12016 9118 24000 20657 17768 -22795 -21190 9208
19921 9208 1789 -20303 -29136 -37619 -53451 -49235 -46159 -59753 -53410 37975 40748 -9111 -28343
19908b8343j2144J3243N8874p417m3323j0226p142M8335N0537j0293k2588Q808
19896C8321j2570K7842M8708k7158m9128l5898J1715L1838m2365j5827K087J0186
19884a2249j2728p488J5448r471k664J0297M756l718o101l7327P945R584N1686
19871G970L3596P064J2610l7611m7033M4963K218J25j3916J9175J230l175P666
19858C4882q599k1293K6069M4369Q250P52l5175n970k2651J3114J4388K71M0622
19845H9029K4760l8252l1620p916J4681m728k4461P260k0753O30n1842j5783J3409
19832d5586K5270L5972j9480j5363M750m3283l256J3599K0145k4645J8295M3869
19820A0287K1848K4508m135J845l4552j4899L2691J4125L0557O757j507k6651
$$ plain form
19908 -28343 -40487 -27244 31630 24213 -19110 -29336 -36478 11857 62394 52101 29513 38321
19896 38321 25751 53593 102301 75143 26015 -9883 1832 33670 -8695 -24522 -22435 -12249
19884 -12249 -24977 -32465 -17017 -26488 -29152 -18855 -14099 -17817 -23918 -61245 -53300 -43716 7970
19871 7970 41566 48630 61240 23629 -23404 21559 23777 23902 9986 29161 30391 27216 34882
19858 34882 26283 4990 31059 75428 83678 84430 49255 43285 20634 33748 48136 48407 89029
19845 89029 113789 75537 43917 36001 50682 45954 21493 28753 8000 8630 -43212 -58995 -45586
19832 -45586 -20316 15656 -3824 -19187 -14437 -57720 -60976 -47377 -27232 -51877 -33582 10287
19820 10287 32135 56643 52508 54353 19801 4902 37593 51718 82275 89032 87525 60874
19808F0874q850P073M395j08k7995p761l347M0657O724k7999j1479k0257n4620
19795d2693k5544N0423J0382k6473j6142K9890j059l2942J0630N4189J7934R379
19783C7974K7957k3695M227Q886K2807K0117k5112n8891n8902J9378N3440M2956
19771G1142R125j5555j0191l5314N352L5707j135l9845j0229N806K1337q628n133
19758B2439k5902j5901k6796K5754l3896l37L7185P40j5064n056M689N681R317
19745a7147J3941M0160O92l839k7108j2965K2265M340m6373n315M9276K8542j2631
19732C3838k7899j5210J1665j7352L222J8437n695K660j3123j6924j9295k8203
19720g3879L0284N2015k0293k2540j6623l669L6151L9451K960M019N6889k978
$$ plain form
19808 60874 52024 59097 63492 63384 35389 27628 24281 64938 71662 43663 32184 11927 -42693
19795 -42693 -68237 -17814 -7432 -33905 -50047 -20157 -21216 -54158 -43528 10661 28595 37974
19783 37974 65931 42236 46463 55349 78156 98273 73161 14270 -44632 -25254 28186 71142
19771 71142 80267 64712 54521 19207 24559 60266 59131 19286 9057 14863 36200 27572 22439
19758 22439 -3463 -19364 -46160 -20406 -54302 -54639 -17454 -16714 -31778 -36834 -32145 -26464 -17147
19745 -17147 -3206 36954 37646 33807 6699 -6266 15999 20339 -26034 -31349 17927 46469 33838
19732 33838 5939 -9271 2394 -14958 -11736 6701 1006 3666 -9457 -26381 -45676 -73879
19720 -73879 -43595 8420 -11873 -34413 -51036 -54705 -18554 20897 23857 27876 84765 81787
19708H1787q058J9763m7122m991L7274J229k2032O142m2182l2488K9628K5653
19696D4603Q119P63J3892k4937k6175J107O7595L606k9543n4982K927J0925j8753
19683h53J4691J6132K044N42m7248l0575L5411N786L405k781k3987K0042K8773
19670B1382M3248l405N027j1999L0388J1843l7858k7126n0332K02L2123J1661
19658B5154L7804j3377o991q124l2595p130n484m94L0674m556K2735J5789K5302
19645G8707o7R457J7752k9153k7395M998l5505K1540L9406o86k7080n9n5831O284
19631B368M656J8152O589J2268M20N06N1100P835k2135k6104J4227m059l5597
19618C0226k1576L0430J5926M7426q793M327j1943o0144m4951M0369J4501k3999
$$ plain form
19708 81787 73729 93492 46370 41379 78653 79882 57850 63992 21810 -10678 18950 44603
19696 44603 52722 53485 67377 42440 16265 17372 84967 88573 59030 4048 6975 17900 -853
19683 -853 13838 29970 32014 32556 -14692 -45267 -9856 -4070 -665 -3446 -27433 -7391 21382
19670 21382 64630 61225 66252 54253 84641 96484 58626 31500 -18832 -18630 13493 25154
19658 25154 62958 49581 42590 34466 1871 -5259 -10743 -11237 19437 14881 37616 53405 78707
19645 78707 78640 88097 105849 76696 49301 54299 18794 40334 79740 79054 51974 51915 -3916 2368
19631 2368 7024 25176 31765 44033 44453 44959 96059 103894 81759 55655 69882 65823 30226
19618 30226 8650 39080 55006 102432 93639 97966 86023 25879 -19072 21297 35798 11799
19606A1799J0330J0026r658J2550k1591q65L6285K5873L1955O372O90q524j1139
19593I4103o3220k1846K0906L0252M419j8876k31K5788J3800r322J9998J0584
19581A06355l5565m5069Q992l69l2195K438M5702L2230m5970j2987O2853J8742
19569A05157l7799l8644m4394J6438Q276k6570o294J0964J3509N314R499j0759
19557D697l3081J3103K5494j1754J5222J9627j0213O287K0899j7585K7396Q343
19545F8435K7959j8201l9406l0013J2168r723m4688K4121M1950k3179k6651j2803
19533c0031J8380K1359k4526l40K4895K6336l0905m6853J6808J9300M3374J6893
19521E4690p9j5366M771M567Q383l9404l4110j9713L793L0099O2558P100n8897
$$ plain form
19606 11799 22129 32155 22497 35047 13456 12591 48876 74749 106704 113076 113766 105242 94103
19593 94103 30883 9037 29943 60195 64614 45738 45507 71295 85095 75773 95771 106355
19581 106355 70790 25721 34713 34344 2149 4587 50289 82519 36549 23562 86415 105157
19569 105157 67358 28714 -15680 758 9034 -17536 -23830 -12866 643 5957 15456 4697
19557 4697 -28384 -15281 10213 -1541 13681 33308 23095 29382 50281 32696 60092 68435
19545 68435 96394 78193 38787 8774 20942 11219 -33469 -9348 32602 9423 -17228 -30031
19533 -30031 -11651 9708 -14818 -15158 9737 36073 5168 -41685 -24877 -5577 37797 54690
19521 54690 54611 39245 44016 48583 56966 17562 -16548 -36261 -32468 -2369 60189 67289 8392
19508H392o822J4954J0647j3222M2579K170p247M0923j0205l1746k96K5771K5505
19495A01403j5877k3233R951j779j641j4824m4521J6837K2822J1997l0118r229
19483B1788k0223L4930M3857j3507l9904n654k4492O245L9021R101j430J3554
19471F3286L3980p040l7444K182o1774l73K9732K2852R710j636j0940J0671k5289
19458B7917M391J4196j0667o448K5743M5356q111J9915p487n6910k4405J5026
19446C8516m897m5523l8755J0580L8331O019j8338J3054N948r018m0744k1079
19434f5906N3106O1938L568n194l1269n857j5736K5814k7189j3505O2258J3415
19422E5443M2813M2161L0373J0820j2665l8762q4822k8908L4054L6808J9181K6450
$$ plain form
19508 8392 1570 16524 27171 13949 56528 58698 51451 92374 82169 50423 50127 75898 101403
19495 101403 85526 62293 72244 70465 68824 54000 9479 26316 49138 61135 31017 21788
19483 21788 1565 36495 80352 66845 26941 21287 -3205 3040 42061 51162 49732 63286
19471 63286 97266 90226 52782 54964 -6810 -7183 22549 45401 55111 53475 42535 53206 27917
19458 27917 32308 46504 35837 29389 55132 100488 92377 112292 104805 47895 23490 38516
19446 38516 33619 -11904 -50659 -40079 -1748 4271 -14067 -1013 4935 -4083 -44827 -65906
19434 -65906 -12800 49138 52706 47512 16243 10386 -5350 20464 -6725 -20230 42028 55443
19422 55443 98256 140417 170790 181610 168945 130183 45361 16453 50507 87315 106496 132946
19410A32946K8977L9244J4934N691K7825O0146J41731J51433J71947K34238K68300
19399A277412K18700J95804J00330q8244k19788k93778l01570k11119j98090j05203
19389C74454l4992r6026o4266K167k8275J5707J5332j6814J449J65J8827K3697
19377B11425N370l2956l0518j9045m0202k3062K3990L4008q096l6656k3393j9611
19365D1254O2907K8360J6778J6858m5508J60l2146m4669M8854Q435n5701Q862
19353E4444l860M173M0186j7599J4493M181p035j6443j957J0579l328k5606K241
19340E4469k3540n34L0228q278j1881K4092k8983o688O2417p900K7136j9566l5770
19327E5202k8244l9636K3762j3498J6154j1918l629R620M0109M9066J8710p534
$$ plain form
19410 132946 161923 201167 216101 221792 249617 309763 451494 602927 774874 1009112 1277412
19399 1277412 1496112 1691916 1792246 1704002 1484214 1190436 888866 677747 479657 374454
19389 374454 339462 243436 179170 181337 153062 168769 184101 167287 168736 168901 187728 211425
19377 211425 216795 183839 153321 134276 94074 71012 95002 129010 120914 84258 60865 41254
19365 41254 104161 132521 149299 166157 120649 120809 88663 43994 92848 101283 45582 54444
19353 54444 50584 54757 94943 77344 91837 96018 88983 72540 70583 81162 77834 52228 54469
19340 54469 30929 30395 60623 52345 40464 64556 35573 28885 91302 83402 110538 90972 55202
19327 55202 26958 -12678 11084 -2414 13740 1822 -1807 7813 47922 96988 115698 108164
19315A08164j2853k844j1505n2706j2389K4030J1473M838K1570J3514O413j2264
19303H5441k8559l480J5130m15L0242J6550k2125k8899J5644L1781N075j9120
19291I7265k2763O629J1816J6680l0788r045k0740o721J2182p599j6026J453k3129
19278I214K3921K3838j5917k14K4237K6415L3589l2358j3838k5991l470m9724
19266b98K2441O8462L4084k6548q26l582q558R362j2189L4025k7413k9080M13
19253F0293J9627J6993L799M201o54r119j5151k8533k451N061J7470J2736j8394
19240F5878k983l0801m2325L515m159K9560K5692J6001J386k6131k6022k6665
19228a7054M0951R409J3639R043J3274p828M070M5128M1680O844k5295n4468k8073
$$ plain form
19315 108164 95311 92467 80962 28256 15867 39897 51370 56208 77778 91292 97705 85441
19303 85441 56882 53402 68532 68117 98359 114909 92784 63885 79529 111310 116385 97265
19291 97265 74502 81131 92947 109627 78839 69794 49054 42333 54515 46916 30890 32343 9214
19278 9214 33135 56973 41056 40842 65079 91494 125083 92725 78887 52896 49426 -298
19266 -298 22143 90605 124689 98141 97315 93733 85175 94537 82348 116373 88960 59880 60293
19253 60293 79920 96913 100712 104913 104259 95140 79989 51456 49005 54066 71536 84272 65878
19240 65878 62895 32094 -10231 -6716 -10875 18685 44377 60378 61764 35633 9611 -17054
19228 -17054 23897 33306 46945 55988 69262 61434 65504 110632 152312 159156 133861 79393 51320
19215E1320J9638j9795n819n1144j7783N0590O9423L8928m4472l7785L255j147
19203E5209m9036L499P7895N7015j9446l7456n0872q061K0422l944J5193J623
19191F2041L615J3277K1078m552j7884l887j4118k6782n4441L4249K5027j0328
19179B7295N905K6875R964Q594q092k1536j4892l041J1688r607m453P076j5321
19166B0455N1384P4547M7125k5387l0830k392N8452L0162O234l4520m3511j0696
19154A41023L2168K5130k204m6773l3790K1782J9582j1036K2994N4643P255p028
19142B23746Q965O6466R6420N4552M23j0470J1310O2563O569j3575n5127J706
19130D53548p601q287j6487j9903J4046J4945k0189k1124j2015l782l7102k0895
$$ plain form
19215 51320 70958 51163 45344 -5800 -23583 27007 96430 135358 90886 53101 56356 55209
19203 55209 6173 9672 87567 144582 125136 87680 36808 28747 49169 45225 60418 62041
19191 62041 65656 78933 100011 95459 77575 73688 59570 32788 -21653 12596 37623 27295
19179 27295 33200 60075 70039 78633 70541 49005 34113 31072 42760 33153 28700 35776 20455
19166 20455 71839 146386 193511 168124 137294 134902 193354 223516 229750 195230 151719 141023
19154 141023 173191 198321 196117 149344 115554 137336 156918 145882 168876 223519 230774 223746
19142 223746 232711 299177 395597 450149 450572 440102 451412 513975 520544 506969 451842 453548
19130 453548 445947 437660 421173 401270 415316 430261 410072 388948 376933 373151 336049 315154
19118C15154j3819n5363l1597m4373k9142K8968P699o845k0489j4126k5333k9245
19106H1489L4193L5068O554l6184J0281N3458K7691O0443N050J8463M5484O1882
19094D03872J13542N2784l0984K4092P69o0114n8338m893j3837l1888J691J1025
19082D07721M7736M2601O4955N5330r592j4454m6996o0375l6847k8032o4662n9648
19070B97737k1004n211l4603l1704l5057J334Q25q637L942l34O832J2110p286
19057A78944J8078j4765m147L9850O6393N2288M5008P1730N8215L9176K27j5466
19045E35531j8175r837k9238M3o8919m8095K0606J6151j7547P115L0523J2069
19033D30227k357k303k7071m6868J8207K5848O536L3184L0560l5500o8215n1263
$$ plain form
19118 315154 301335 245972 214375 170002 140860 169828 177527 170682 150193 136067 110734 81489
19106 81489 115682 150750 157304 121120 131401 184859 212550 272993 278043 296506 341990 403872
19094 403872 517414 570198 539214 563306 564075 503961 445623 440730 426893 395005 396696 407721
19082 407721 455457 498058 563013 618343 608751 594297 547301 486926 450079 422047 357385 297737
19070 297737 276733 271522 236919 205215 170158 171492 172317 163680 167622 167288 174120 186230 178944
19057 178944 197022 182257 178110 217960 284353 336641 381649 453379 511594 550770 550997 535531
19045 535531 517356 507519 478281 478324 409405 361310 381916 398067 380520 387635 418158 430227
19033 430227 427870 425567 398496 351628 369835 395683 402219 435403 465963 430463 362248 310985
19021C10985L23l4434K0818O155P774N3346L5459J5859j0599K9833n5885l0057
19009C49577J576o2852j9442M8457Q0021L9200L1670N2802P9752O1539P1255P8412
18997H11967N3016n8005o3442m5013j5688J934N86n754k931n4086p6833k9096
18985E16655l3643m9725l5340o2005n6967j2842r472m551k4006p075j3647o171
18973B01211M684K4048J9641K069M41J0021j0059k6527j478J729k0143m540l1579
18960A69518j6632J3925j1860j2049K267K6902L1675j6598n0348K3382K5268M6262
18948B31712P814l764l2365L3925M4636m9327J933m309n466o618p753J9638K3824
18935B53880j6991n004N959M084k7913l2148k383K28M1606L4926l570M876M4190
$$ plain form
19021 310985 311308 276874 297692 303847 311621 364967 400426 416285 405686 435519 379634 349577
19009 349577 351153 288301 268859 317316 397337 436537 468207 521009 600761 662300 733555 811967
18997 811967 864983 806978 743536 698523 682835 684769 685355 679601 676670 622584 545751 516655
18985 516655 483012 433287 397947 335942 278975 266133 256661 252110 228104 221029 207382 201211
18973 201211 205895 229943 249584 251653 252094 262115 252056 225529 224051 225780 205637 201097 169518
18960 169518 152886 166811 154951 142902 145169 172071 203746 187148 136800 160182 185450 231712
18948 231712 239526 235762 203397 237322 281958 232631 234564 230255 224789 218171 210418 230056 253880
18935 253880 236889 231885 237844 241928 214015 181867 179484 179712 221318 256244 252674 257550 301740
18922C01740N1978J8000L049J0094l1696r613J0547K227j5875l6316k9253l9137
18910B35745j1913L8140J6928j9947m7242M1279R155l2365j3242J9306L0173Q683
18898B74700L656o400J2860J6977j548k408K542L8750O2198L9062j6764j9564
18886D04061k2688j2251l465j8125J6299J5917k3213N6455M2329N661J0659J5044
18874D86683K3337J6991M517p223m992J5742M0328J3774K2409n542l2579k2238
18862E51207p859L9705k0725j5265l512m138M224K91J8973j2784p525J3347Q2787
18849F38726L8879P876J4192m329L071L7391k8816m0105M0259O6945O3735M4758
18837H82582j690q5297l8374j3601l0729j8292k1872k91J3832k1179O713M8910
$$ plain form
18922 301740 353718 371718 374767 384861 353165 343552 354099 356326 340451 304135 274882 235745
18910 235745 223832 261972 278900 258953 211711 252990 262145 229780 216538 235844 266017 274700
18898 274700 278356 271956 284816 301793 300245 297837 300379 339129 401327 440389 423625 404061
18886 404061 381373 369122 365657 347532 363831 379748 356535 412990 455319 460980 471639 486683
18874 486683 510020 527011 531528 524305 519313 535055 575383 589157 611566 606024 573445 551207
18862 551207 543348 583053 562328 547063 543551 539413 543637 543928 562901 550117 542592 555939 638726
18849 638726 677605 685481 699673 695344 698415 735806 706990 666885 707144 774089 837824 882582
18837 882582 880892 795595 757221 743620 712891 694599 672727 672436 686268 665089 671802 720712
18825G20712K4774k2025j7993L9695L8466O7524M2657L7369k2165n2153j6990
18814H39871p817J9608Q437j3470L3044Q1088O1205M8935J02095R1262J07756
18803A372014P3494N8406P4696L8058Q4191R0527R1146J46642Q2205K7652O8565
18792B207596L6002j6816N7218O7269J03659J17201N7110O4238N9212J44177K00087
18781C096953J91192K21295L46637L51599L96247M82417M55154L28364K76051
18772F145909J99987J88550K31252L02201M49478M72815M35244L72139L82521
18763I180096N15874Q05124J052544J112351J202163J437728J818390K573473
18755A9697743L667103N214476P452588J0843387J5941818K3020476L1190617
$$ plain form
18825 720712 745486 723461 705468 745163 783629 851153 893810 931179 909014 856861 839871
18814 839871 832054 851662 860099 846629 879673 960761 1021966 1070901 1172996 1264258 1372014
18803 1372014 1445508 1503914 1578610 1616668 1700859 1791386 1882532 2029174 2111379 2139031 2207596
18792 2207596 2243598 2226782 2284000 2351269 2454928 2572129 2629239 2693477 2752689 2896866 3096953
18781 3096953 3288145 3509440 3856077 4207676 4603923 5086340 5541494 5869858 6145909
18772 6145909 6345896 6534446 6765698 7067899 7517377 7990192 8425436 8797575 9180096
18763 9180096 9695970 10501094 11553638 12665989 13868152 15305880 17124270 19697743
18755 19697743 23364846 28579322 36031910 46875297 62817115 85837591 117028208
18748A17028208L8183193M2251795M4205564M3271965L1616280N221394k7625550
18741B94152849m8240089n6712253n3873124l9293499k5523218j6741898j1255479
18734D2513289p829964n516079m049876l030997k268927j696630j343858j132983
18726A5643975r56736r35749q83101p64732p15935o08362m49797m42274n24818
18717I362471o17122o21577n63095l64174k29631j48434j19649k00048l27479
18708F171262l91739m68894m54183k99470k17091j86524j68660j28780o3407k1709
18698C770805q231r3452n2699K8995m5094j15020m4116l3871k5870m5320j11728
18687C224399j46877j56310j20239j43032o3566k7231m4897j7360m8493q8717
$$ plain form
18748 117028208 155211401 197463196 241668760 284940725 316557005 321778399 294152849
18741 294152849 245912760 189200507 135327383 96033884 70510666 53768768 42513289
18734 42513289 34683325 29167246 25117370 22086373 19817446 18120816 16776958 15643975
18726 15643975 14687239 13751490 12868389 12103657 11387722 10779360 10329563 9887289 9362471
18717 9362471 8745349 8123772 7560677 7196503 6966872 6818438 6698789 6498741 6171262
18708 6171262 5779523 5310629 4856446 4556976 4339885 4153361 3984701 3855921 3792514 3770805
18698 3770805 3762574 3669122 3616423 3645418 3600324 3485304 3441188 3407317 3381447 3336127 3224399
18687 3224399 3077522 2921212 2800973 2657941 2594375 2567144 2522247 2504887 2456394 2367677
18677B367677j07932l324k856j2497j9739p707k4571L4729J4850l7311K3683O1229
18665B286231J9898K2075M9308Q3747J14304M8091J33104J95830K31526L11823
18655C495937L72760M39826N16279N14958N15874K41604j3627j58090k84983l75712
18645E264826k73169j21818L5218J17556J41849K39484L53289M38205N93271P34347
18635G523058J012257J363040J936419K825199L926193N073162O006387O749778
18627C6415493P695934Q423251O576855K431884p27657o46546J26333j777653
18619E8517894m309855m724344k417113Q1390J701137J555891j411747m878998
18611D4114255o735322n214387k050807N85729K216426L160661L541896L697714
$$ plain form
18677 2367677 2259745 2256421 2253565 2241068 2221329 2213622 2189051 2223780 2238630 2201319 2225002 2286231
18665 2286231 2306129 2328204 2377512 2461259 2575563 2623654 2756758 2952588 3184114 3495937
18655 3495937 3868697 4308523 4824802 5339760 5855634 6097238 6083611 5925521 5640538 5264826
18645 5264826 4991657 4869839 4905057 5022613 5164462 5403946 5757235 6195440 6788711 7523058
18635 7523058 8535315 9898355 11834774 14659973 18586166 23659328 29665715 36415493
18627 36415493 44111427 52534678 59111533 61543417 60815760 60169214 60295547 58517894
18619 58517894 54208039 49483695 47066582 47147972 48849109 50405000 48993253 44114255
18611 44114255 37378933 32164546 30113739 30699468 32915894 36076555 39618451 43316165
18603D3316165J656684j989078m553001o892345o671359m472522k739011j655681
18595A5999852q97404l22000O4431L11651P21486J296070K058641L265952M877670
18586B7376349O905930Q791787R994295J0392709J0403509Q931819L439626m829676
18578H1406348j0698178j2607668j0622430o200506j992516J472624M268302O237360
18570E1263336P677209R233636J0124367P150540J434501k837778l104112l454500
18562G7487199p903406j2646928j3554080j0369759o890051m656779l287349k386308
18554A5792539j642210j174477q21882n57180l95809k86368k05138r4449J16730
18545A0731756L42592M90744O89697J105284J663750K450744L576256M967286
$$ plain form
18603 43316165 44972849 42983771 38430770 31538425 24867066 20394544 17655533 15999852
18595 15999852 15102448 14780448 14844879 15156530 15878016 17174086 19232727 22498679 27376349
18586 27376349 34282279 43074066 53068361 63461070 73864579 82796398 86236024 81406348
18578 81406348 70708170 58100502 47478072 41277566 39285050 40757674 45025976 51263336
18570 51263336 58940545 68174181 78298548 85449088 86883589 84045811 80941699 77487199
18562 77487199 69583793 56936865 43382785 33013026 26122975 21466196 18178847 15792539
18554 15792539 14150329 12975852 12153970 11596790 11200981 10914613 10709475 10615026 10731756
18545 10731756 11074348 11565092 12254789 13360073 15023823 17474567 21050823 26018109
18537B6018109O068038O437200O780685P521685P439881L305043l330430m452395
18529E5787816j490652l99760m320345o839954l810565K74780L407083N281395
18521D7889798O269745O676829O418716L040488l413691q944002j2292668j0970343
18513C4674872p524581m988082l354441k304973j580791j118337q05532n79728
18505A2418407m07348k41056j65297r4373J77417M68744R13377J391500K004265
18496A6465636L010504M340836N664851O193668N955245N943746O111642L027352
18488E6713480m684485q620446n657779j279757K356622N340067P092996Q080978
18480E9341676R781973J2184631J0523286J678706k375454J896170O830502M676227
$$ plain form
18537 26018109 32086147 38523347 45304032 52825717 60265598 63570641 60240211 55787816
18529 55787816 54297164 53897404 49577059 42737105 38926540 39201320 42608403 47889798
18521 47889798 54159543 60836372 67255088 70295576 66881885 57937883 45645215 34674872
18513 34674872 27150291 22162209 18807768 16502795 14922004 13803667 12998135 12418407
18505 12418407 12011059 11770003 11604706 11510333 11687750 12156494 13069871 14461371 16465636
18496 16465636 19476140 23816976 29481827 35675495 41630740 47574486 53686128 56713480
18488 56713480 52028995 43408549 37750770 36471013 38827635 44167702 51260698 59341676
18480 59341676 69123649 81308280 91831566 93510272 91134818 93030988 99861490 104537717
18472A04537717n868647j0122312o108037l661001r407407j5754606j3714656
18465C9901051r186862o182353m242989k950459k114311j587691j223340r49919
18457A1463127p67902o87106n45463m09077k87649j78633r7780j2835K11173M18412
18447I106267O76958O89092O09323O41134N05829j92885j296228j843465j588139
18438G307886j094587p16002m89877m04642k84466k44409k15156k26589j87888
18429C444270j76714j32876j88387r8139k8598r8063m6281j8117k1421l8929k1077
18418B575668Q1086J45128J37177J56543K10349K25752K51289K20073J33919j38788
18408C998196l05243l93481l41369j96689q0041l129k7599k4533p439N1542R3675
$$ plain form
18472 104537717 98669070 88546758 82438721 78777720 69370313 53615707 39901051
18465 39901051 30714189 24531836 20288847 17338388 15224077 13636386 12413046 11463127
18457 11463127 10695225 10008119 9462656 9053579 8765930 8587297 8489517 8476682 8687855 9106267
18447 9106267 9783225 10472317 11081640 11722774 12228603 12035718 10739490 8896025 7307886
18438 7307886 6213299 5497297 5007420 4602778 4318312 4073903 3858747 3632158 3444270
18429 3444270 3267556 3134680 2946293 2848154 2819556 2721493 2675212 2657095 2635674 2596745 2575668
18418 2575668 2656754 2801882 2939059 3095602 3305951 3531703 3782992 4003065 4136984 3998196
18408 3998196 3692953 3299472 2958103 2761414 2681373 2678244 2650645 2626112 2618673 2670215 2763890
18397B763890L3916r3124o7153k2959K6598n4519j38063j35799q2881n5139n6361
18386B118406j01044j21947r7148l5292o026L372j7344Q705Q5190M3325N4616
18375A934813N6097K4442l091l519K6975O4393M8662J1842K9058O9326K6687K1925
18363B307610P1336N9157Q1466J06329J18137J10988J58076K35727K74492L87529
18353C910847M97618P73606J051818J489595K061599K483429K777362K957755
18345A8003629L083331K635339P80686q89420j889180k582011j492426L35447
18337A7985395J879703K848310L491902L905085L870867K110124j166493k964066
18329C1960827m920085o120650m845685l174248k054793j302669q47673n60729
$$ plain form
18397 2763890 2797806 2704682 2637529 2614570 2641168 2586649 2448586 2312787 2229906 2174767 2118406
18386 2118406 2017362 1895415 1798267 1762975 1756949 1760321 1742977 1751682 1836872 1880197 1934813
18375 1934813 1990910 2015352 2012261 2008742 2035717 2100110 2148772 2160614 2189672 2258998 2285685 2307610
18363 2307610 2378946 2438103 2519569 2625898 2744035 2855023 3013099 3248826 3523318 3910847
18353 3910847 4408465 5182071 6233889 7723484 9785083 12268512 15045874 18003629
18345 18003629 21086960 23722299 24502985 23613565 21724385 19142374 17649948 17985395
18337 17985395 19865098 22713408 26205310 30110395 33981262 36091386 34924893 31960827
18329 31960827 27040742 20920092 16074407 12900159 10845366 9542697 8695024 8134295
18321H134295m29967k90683k00598j02622n6026O0303J99186K93287L94157N25488
18311H526820O69696R00142J204171J690795K364505L384726M781717O682609
18303C0205181Q679876J0132759J1038828J1519892J0959744O596106j044705
18296H8087681o113602j0689025j1736856p011164j653873K220113M591381O376174
18288F4070829P475899O730185J815177l110920o029121r801393j0267692p822387
18280D3060577n380411l779645j979507K56040K501942N062456P753884R872052
18272E7367388J0291999R936574J0085481R269944J44016j4254000j7693058j2103929
18264E3044415o599788k581546J003566M838223R223498J3780520J7461118J9370915
$$ plain form
18321 8134295 7704328 7413645 7213047 7110425 7054399 7114702 7313888 7607175 8001332 8526820
18311 8526820 9196516 10096658 11300829 12991624 15356129 18740855 23522572 30205181
18303 30205181 38885057 49017816 60056644 71576536 82536280 89132386 88087681
18296 88087681 81974079 71285054 59548198 52537034 50883161 53103274 57694655 64070829
18288 64070829 71546728 78276913 80092090 76981170 70952049 61150656 50882964 43060577
18280 43060577 37680166 33900521 31921014 32177054 34678996 39741452 47495336 57367388
18272 57367388 67659387 77595961 87681442 96951386 97095402 82841402 65148344 53044415
18264 53044415 46444627 43863081 44866647 49704870 58928368 72708888 90170006 109540921
18256A09540921J9333232J7903853J2147257K79634j7562170l0860076k9126190
18249H1656461k0063521j2654718p913317m750176k428857m85042J440406L340184
18241C8141420M682465N513001O151472O320341M858738L09335l667090o770899
18233E5538783q946360o965123l474794l69361K598376N672267Q142288Q948924
18225F1145000Q730383R039201Q775268K062837j0424408j4155952q469556k328417
18217E4374356J632934L357097M156025N002245M040828m336585j3647153j3402591
18209D1177156r057532n900740m176353l408944k886758k208866j577657j148777
18201A0811529q82892o85123n68156m68006l75702k95130k44479k32070j87165
$$ plain form
18256 109540921 128874153 146778006 158925263 159204897 141642727 110782651 81656461
18249 81656461 61592940 48938222 41024905 36274729 33845872 33360830 34801236 38141420
18241 38141420 42823885 48336886 54488358 60808699 65667437 65976772 62309682 55538783
18233 55538783 46592423 39627300 36152506 35783145 38381521 44053788 52196076 61145000
18225 61145000 69875383 78914584 87689852 89752689 79328281 65172329 56702773 54374356
18217 54374356 56007290 59364387 63520412 68522657 72563485 68226900 54579747 41177156
18209 41177156 32119624 26218884 22042531 18633587 15746829 13537963 11960306 10811529
18201 10811529 9928637 9243514 8675358 8207352 7831650 7536520 7292041 7059971 6872806
18192F872806j56716q5700M3934J14669J36040K59653L72346N53265R77403J598992
18182A0686692K308782K771561K703574K588308K767808K481611m25515m002983
18174B1879838l978973k128784o42511K14047O27732Q78041J046975O0007k484171
18165A5472201l590206k730830j807440j279152r19594p00605m81248k96126k39390
18156C427610j51892j92272j62450j36263q9647o4412p2239o7761m0928m6402
18146B403344n9017k679j9500p715p8372q2073o5511p9075k6081K4397Q1219R9319
18134B188256J43401J62170J70054J80339J23395K0264o5348q3190l1668L6941
18124B844614J38478K29362K63546L77025N37437O95058R03943J205616J701155
$$ plain form
18192 6872806 6716090 6630390 6674324 6788993 6925033 7184686 7557032 8110297 9087700 10686692
18182 10686692 12995474 15767035 18470609 21058917 23826725 26308336 25882821 21879838
18174 21879838 17900865 15772081 15129570 15343617 15971349 16849390 17896365 17956372 15472201
18165 15472201 11881995 9151165 7343725 6064573 5144979 4444374 3963126 3667000 3427610
18156 3427610 3275718 3083446 2920996 2784733 2695086 2630674 2558435 2490674 2449746 2403344
18146 2403344 2344327 2341648 2322148 2314433 2236061 2153988 2088477 2009402 1983321 2007718 2088937 2188256
18134 2188256 2331657 2493827 2663881 2844220 2967615 2987879 2922531 2839341 2807673 2844614
18124 2844614 2983092 3212454 3476000 3853025 4390462 5085520 5989463 7195079 8896234
18115H896234K534371L870726N309734N902989N480913N317558N905228M055725
18107D7273478n683529j1997536r221819n734042l674552k424704j600814j087281
18099E849201p41475m70038m11482l28958j81938m7831L0420O9067Q8400J69879
18089D025245K43891J73163o3457l35883k80988j09244m9182p4359j94542l32849
18079C001795l28892l51539l38036k65755j31124J236O6234Q7964N2429J20166
18069A914478J16892J7231j49294q3646m4877k7495L0941M8408N9069m2239j58893
18058A680575k06478q6533n8941N5956R5724P481m8409J8237J1591j43665j90094
18047A135444j86451j18082q1048k8112k8871L1487M4858k1100l8557k9033l5666
$$ plain form
18115 8896234 11430605 15301331 20611065 26514054 31994967 37312525 43217753 47273478
18107 47273478 41589949 29592413 20370594 14636552 10962000 8537296 6936482 5849201
18099 5849201 5107726 4637688 4226206 3897248 3715310 3667479 3697899 3766966 3855366 4025245
18089 4025245 4269136 4442299 4378842 4042959 3761971 3652727 3603545 3529186 3334644 3001795
18079 3001795 2672903 2321364 1983328 1717573 1586449 1587685 1653919 1741883 1794312 1914478
18069 1914478 2031370 2048601 1899307 1815661 1770784 1743289 1774230 1822638 1881707 1839468 1680575
18058 1680575 1474097 1387564 1328623 1384579 1480303 1487784 1439375 1457612 1469203 1325538 1135444
18047 1135444 948993 830911 749863 721751 692880 724367 769225 748125 709568 680535 644869
18036F44869j5575J3853l8214p2768o0086k4515l8811p82M4726j7895k9266M2847
18024D48383J9369n8062K491j5508q15J9479L1190P5519N6597M884R658K77r1433
18011E02029m1703p042M0160P0995P2589M9253O0628P9130O5747n1370j17725
18000G22691k0433K5388l6600k6224r430J6191R132J9962K2135L5103l7776q9933
17988F30206r2119j01421p3228K534j0336k0248q524n2721o4273j712M8938K752
17976B59848j8631j5676k0813J402K643J747q226N194j1306R620j1002n961o349
17963A82490J3967O0846L4613j1015j9422K4538M2956P5229O1038k5425p2587
17952C67228o2759M418P9418M9816N3500K7384j4211K5117j525L004m2979n4648
$$ plain form
18036 644869 629294 643147 604933 532165 472079 447564 408753 407971 452697 434802 405536 448383
18024 448383 467752 409690 412181 396673 395858 415337 446527 522046 578643 583527 593185 593462 502029
18011 502029 460326 453284 493444 564439 637028 686281 746909 826039 891786 840416 722691
18000 722691 702258 727646 691046 664822 655392 671583 680715 700677 722812 757915 720139 630206
17988 630206 538087 436666 363438 365972 355636 335388 326864 274143 209870 208158 257096 259848
17976 259848 241217 225541 204728 206130 208773 210520 202294 207488 196182 205802 194800 188839 182490
17963 182490 196457 257303 291916 280901 261479 286017 328973 404202 465240 439815 367228
17952 367228 304469 308887 388305 438121 491621 519005 504794 529911 528386 531390 488411 433763
17940D33763l7388j5403m6234n2730m6604o5398m0777M36L3525K0193N250m4409
17928A44224j0288J2892l1392k0225m065K8070n7686M541L4086O7596Q002o2643
17916A13112l6321P764L6418j7869n9631M3418N9453o92n673k0841o758L0941
17904A43321P755m1224j2569n279j7639m510K0131M1432r961l8390K1804n180
17892I9691o5702J3772k8331J9293k596l456k2000K2456m601j3901J3201R764
17880C7590K8470M5002O767k9643N111k370m3936j3420L7559L078l6382k1632
17868A6194o498L234O078K9272J2258J3965j4409j7273J1301K866m1112l2529
17856a6653p01K5128q392J3099Q721k9876K4645J2095K6126L6373J5977j6855
$$ plain form
17940 433763 396375 380972 334738 282008 235404 170006 129229 129665 163190 183383 188633 144224
17928 144224 133936 146828 115436 95211 91146 119216 61530 66071 100157 167753 175755 113112
17916 113112 76791 84555 120973 103104 43473 86891 146344 145652 139979 119138 112380 143321
17904 143321 151076 109852 97283 92004 74365 69855 89986 131418 121457 83067 104871 99691
17892 99691 33989 47761 19430 38723 36127 32671 10671 33127 28526 14625 27826 37590
17880 37590 66060 111062 117829 88186 93297 90927 46991 33571 71130 74208 37826 16194
17868 16194 9696 12930 19008 48280 60538 74503 60094 42821 54122 56988 15876 -16653
17856 -16653 -17354 7774 -618 12481 21202 -8674 15971 28066 54192 90565 106542 89687
17844H9687k9030K937j0654n083J6081j2071r336J9278J3756K6368J051J4586
17832A17570P424o283L2241K0244J7196M3047K5694j0282J8058l6430K6866L4331
17820B89676J171j8466J7602K8923K2274L301l2644n3545n2690k5291J2420p7053
17808A15678r3429j9181J4153M3584q140k2887J8651K3208K2009j4954j2964Q575
17796G4303K1237j3991j2036O086J5386m435J7177J348j5985l1813K3367k4270
17784E6374O513N0724Q1775M4713M8070K0402M3321L7149J7511N0292J0720L7337
17772E04901O9745O7607M5960Q896j5428q064J9206j120l9654m3636k0118j3653
17760E74642l2535p4777p8201q2841p7498j4764l9176l6844K0491k0021k0077
$$ plain form
17844 89687 60657 63594 52940 47857 63938 51867 42531 61809 75565 101933 102984 117570
17832 117570 124994 118711 150952 171196 188392 231439 257133 246851 264909 228479 255345 289676
17820 289676 290847 272381 289983 318906 341180 344481 311837 258292 205602 180311 192731 115678
17808 115678 22249 3068 17221 60805 52665 29778 48429 71637 93646 78692 65728 74303
17796 74303 95540 81549 69513 75599 90985 86550 103727 105075 89090 57277 80644 56374
17784 56374 62887 113611 195386 240099 288169 308571 351892 389041 406552 456844 467564 504901
17772 504901 574646 642253 688213 697109 681681 673617 692823 691703 652049 608413 588295 574642
17760 574642 542107 467330 389129 306288 228790 214026 174850 138006 158497 138476 118399
17749A18399m4137J1159K5086p794N806N039o182K2885J7144J7501n0417k8615
17737H5874M829J2055N734J8004K6115K0210m8538N9744P6528M3434K9986N0798
17725C84773L5679N2610J4316N6875N1163P7450P2998K5974M3951J6978q511q8957
17713G35299r4512j07799o5526r868m8049m3818q3653o4152p7081m3552j806J2974
17701A08457j6580l9331L1353j4720J5853m6893l6658k5454J6161O1421M3485
17690I7094k1414N753r528J8864L0949k2953j914J4194o649O477j8179J0486J9484
17677A22664j5809m925N5147p618k746L7423N3003N8011k9235j8848L4518L2634
17665C14219q544j7525r8947n2101M164J7222k2257l2746k3288j663m617k402
$$ plain form
17749 118399 74262 85421 110507 102713 108519 113558 107376 130261 147405 164906 114489 85874
17737 85874 90703 102758 108492 126496 152611 172821 124283 184027 260555 303989 333975 384773
17725 384773 420452 473062 487378 544253 595416 672866 745864 771838 815789 832767 824256 735299
17713 735299 640787 532988 467462 457594 409545 365727 282074 217922 140841 97289 95483 108457
17701 108457 91877 52546 83899 69179 85032 38139 1481 -23973 -7812 53609 97094
17690 97094 75680 81433 71905 90769 121718 98765 96851 111045 104396 110873 92694 103180 122664
17677 122664 106855 101930 157077 149459 146713 184136 237139 295150 265915 247067 281585 314219
17665 314219 305675 288150 189203 137102 141266 158488 136231 103485 80197 78534 73917 71515
17653G1515L7253l2917n3220k0903J3992K5668l26l3956N748J903K4895k7877
17641A1775j6925J3224j7241q912m78O532j4091J5431k7229J2371O1286k3738
17629A2005l3025R419K1444k4287k6679L6215K5160N999p296k5988k7236m7319
17617h1588J6922K5743K1499L2639L6454k0193n0246j6576P756L0385p367j2690
17605a7262Q250J8820j8737K2837k5026n5871N3586J9786M5488J7808q994m2480
17593A8205l9073O461K5658J7070o057J6685p140k1298m2573l1219J4215n826
17581e4892J0936j1754Q512L7397M4554m5452l0537k0646R241N5778K2928o803
17569A9262l2736K898N6048L661j1410l2672k7640m5174j3187K0920K1128L0300
$$ plain form
17653 71515 108768 75851 22631 1728 15720 41388 41062 7106 12854 14757 39652 11775
17641 11775 -5150 8074 -9167 -18079 -18557 -12025 -26116 -10685 -37914 -25543 35743 12005
17629 12005 -21020 -11601 9843 -14444 -41123 -4908 20252 26251 18955 -7033 -34269 -81588
17617 -81588 -64666 -38923 -17424 15215 51669 31476 -18770 -35346 -27590 2795 -4572 -17262
17605 -17262 -9012 9808 -8929 13908 -11118 -66989 -13403 6383 51871 69679 60685 18205
17593 18205 -20868 -14407 11251 28321 22264 38949 31809 10511 -32062 -63281 -49066 -54892
17581 -54892 -43956 -55710 -47198 -9801 34753 -10699 -41236 -61882 -52641 3137 26065 19262
17569 19262 -13474 -10576 45472 49133 37723 5051 -22589 -67763 -80950 -60030 -38902 -8602
17557h602L735J0394K2424l95l4970R978P199j5743O779Q571L6647o41j6554k9770
17543i48L019j7825k6282K8584J8495J3154k4412j102j2712j5349M409M6484K5690
17530D1205L4259m828l1399j9194J0459J5211r719j0949K841k6401n933K1795
17518A7347k7971L7280j3470K5999k215K5565n1614m4008J5440O1084L588k8283
17506A8742M883Q939l5735K8242N9893J742k8302K778m2942j0762p721o305M2968
17493C6420J203m1037J2789J6666m5768L2299Q896l0468N133L19K2204l599n023
17480A0034n490k3107k9326K9641j3207l4541p653R770J1031K3964K1922n428
17468a2390K7195o599j7973p582m332k1220j2462N938O4513N2249P844J0820j35
$$ plain form
17557 -8602 -4867 5527 27951 27556 -7414 2564 9763 -5980 799 9370 46017 45376 28822 -948
17543 -948 2071 -15754 -42036 -13452 5043 18197 -6215 -7317 -20029 -35378 -30969 15515 41205
17530 41205 75464 70636 39237 20043 30502 45713 35994 25045 27886 1485 -4448 17347
17518 17347 -10624 26656 13186 39185 36970 62535 10921 -33087 -17647 43437 47025 18742
17506 18742 23625 32564 -3171 25071 84964 86706 58404 61182 18240 7478 -243 -6548 36420
17493 36420 37623 -3414 9375 26041 -19727 12572 21468 -9000 -3867 -3548 18656 15057 10034
17480 10034 4544 -18563 -47889 -18248 -31455 -65996 -73649 -63879 -52848 -28884 -6962 -12390
17468 -12390 14805 8206 -9767 -17349 -21681 -42901 -55363 -49425 15088 67337 75181 86001 85866
17455H5866n9767m1994M1687J2553r912l1602K6735j0493K8410N2538O0454O5589
17443B20064J6465L6270q318m8106m7484m3696p8588m6599L6203J1839J4895l3138
17431B9807m7242j1423K330O2898J1797l6129m6362J0249K3206J6673M531o818
17419A3517k0955l8368r927p343L4555J2846M4469K361j4620k3767j0586j729
17407a9547j194O684R909K8477j9597j4059j4330j9889K6708M1231p459m5740
17395b8806j8076j7178M5584R998J5671K5884O026Q896L1570j6107M85J2139m3330
17382C2756m0688J6799k2908l5121m0275L0316O0181L5303o48P446k4091m2867
17370b3797j2069M5217K179L1913p344j4933l184O644m6450K2412K0211n835j1633
$$ plain form
17455 85866 26099 -15895 25792 38345 28433 -3169 23566 13073 41483 94021 154475 220064
17443 220064 236529 272799 264481 216375 168891 125195 46607 8 36211 48050 62945 29807
17431 29807 -17435 -28858 -26528 36370 48167 12038 -34324 -24075 -869 15804 20335 13517
17419 13517 -7438 -45806 -55733 -63076 -28521 -15675 28794 31155 16535 -7232 -17818 -19547
17407 -19547 -20741 -14057 -4148 24329 4732 -9327 -23657 -43546 -16838 24393 16934 -28806
17395 -28806 -46882 -64060 -18476 -8478 7193 33077 39103 47999 79569 63462 63947 76086 32756
17382 32756 -7932 8867 -14041 -49162 -89437 -59121 1060 36363 35715 43161 19070 -23797
17370 -23797 -35866 9351 11530 43443 36099 21166 17982 24626 -21824 588 20799 14964 3331
17357C331L3094J0053J9396m064k9124k1084j3108j6321L2403J7113j0657k6183
17345e151J5347j4079L274l5760q512M9529R732J731J6716k5537L060M441j8462
17332c671J9820O234K8406m0103p42O3k1253N640R60Q669m6333l427N9394P4695
17318H8352J204k1840J1008L838L0439k5661n1197j9285p97N946l0913j402J176
17305i132J5338J022K9422K8462Q745q01o63K7717K8379k2465k0514k3147J3993
17292G6356R4719L4902k00K6659N8052O0855q358L7904O0295J04572J40753K51130
17280I37639L57704L40925K96077L64683M34482L05447n8336k17199j66021R78
17270B596379L7892j59907n42165n86898m07178k23483j74808q0886l3363n9669
$$ plain form
17357 3331 36425 46478 65874 61810 32686 11602 -1506 -17827 14576 31689 21032 -5151
17345 -5151 10196 -3883 -609 -36369 -44881 4648 14380 16111 32827 7290 10350 14791 -3671
17332 -3671 16149 22383 50789 10686 9944 10007 -11246 -5606 -4646 4023 -42310 -45737 13657 88352
17318 88352 89556 67716 78724 82562 113001 87340 36143 16858 16061 22007 -8906 -10308 -9132
17305 -9132 6206 7228 36650 65112 73857 73056 72393 100110 128489 106024 85510 62363 76356
17292 76356 171075 205977 205777 232436 290488 351343 342985 380889 441184 545756 686509 937639
17280 937639 1295343 1636268 1932345 2297028 2731510 3036957 2978621 2761422 2595401 2596379
17270 2596379 2634271 2474364 1932199 1345301 938123 714640 539832 458946 425583 365914
17260C65914l3003m2486l1096n5479k8224j8164L554Q2981P476l5223q906l7329
17248A70015k2599j6516l204k2544n0901l4296k2162N295K2037K4966j3048N344
17236D2387j3748K2647J728l3943j9854l3012m39L7568J447j3524O965N771K4125
17223B8118o527k2550j7044L363L9439J0895K079j3803m5371o722R656J1750J4540
17210G823Q94q699r255J8232n8297l3204K0519J0761K6627K6189J0969l574K8949
17197C7934q281m1267J6866j4770k4901l5703k7450K299J9801n595J5905N7401
17185g761M1518K1545l0258J402P826l85l3108j4702j5799L4864M0766k5778j6557
17172C573m6425k7653k275M3010M4249J0835J9457R795o145m2364l3334J3637
$$ plain form
17260 365914 332911 290425 259329 203850 175626 157462 161016 243997 251473 216250 207344 170015
17248 170015 147416 130900 127696 105152 54251 19955 -2207 3088 25125 50091 37043 42387
17236 42387 28639 51286 53014 19071 -783 -33795 -34234 3334 4781 -8743 -1778 3993 28118
17223 28118 21591 -959 -18003 -14640 24799 35694 37773 23970 -21401 -28123 -18467 -6717 7823
17210 7823 8717 18 -9237 8995 -49302 -82506 -61987 -51226 -24599 1590 12559 8985 37934
17197 37934 29653 -11614 5252 -9518 -34419 -70122 -97572 -95273 -75472 -81067 -65162 -7761
17185 -7761 33757 55302 25044 26446 34272 33887 779 -13923 -29722 5142 45908 20130 3573
17172 3573 -42852 -70505 -72780 -29770 14479 25314 44771 54566 48421 6057 -27277 -13640
17160a3640N9547j9248p7640K6499K9080N678m750K122j0974k2734m210j6401
17148d6671P219P68J6289M912J5978j7187j0085P544N003N933N3283k2678N536
17135B5844k5226l3847j996J2059j2323p211K9023o441p594l9790J8301Q1274
17123C2073M500m7848j8898m171k6440J355o376L6112L4566j350L7749j1363O209
17110C6118L6103J0554n5043q8504m1044N4145M2338J4180R496j8996m8160k0475
17098f9288J6771M7233L5926M0644J1531j2284l1491k2911j0852j152q774j4267
17086a8914m449j8529k839K0035j6063o954j2057L7237J443k9951O2976L3762
17074D5697l5475n3365K0406M4639m216P383Q515l7265J5949M0403m7672m0303
$$ plain form
17160 -13640 45907 26659 -50981 -24482 4598 10276 5526 7648 -3326 -26060 -30270 -46671
17148 -46671 -39452 -38684 -22395 -17483 -1505 -18692 -28777 -21233 -16230 -10297 42986 20308 25844
17135 25844 618 -33229 -35225 -23166 -35489 -42700 -13677 -20118 -27712 -67502 -49201 32073
17123 32073 36573 -11275 -30173 -34344 -60784 -59429 -65805 -29693 4873 3523 41272 29909 36118
17110 36118 72221 82775 27732 -60772 -101816 -47671 -5333 8847 18343 -653 -48813 -69288
17098 -69288 -52517 -5284 30642 71286 82817 70533 39042 16131 5279 4127 -4647 -18914
17086 -18914 -23363 -41892 -44731 -24696 -40759 -47713 -59770 -22533 -21090 -51041 11935 45697
17074 45697 10222 -43143 -22737 21902 17686 25069 33584 -3681 12268 52671 4999 -35304
17062c5304j0770R677q342j3703n268L996J5521j4879j9109M8028K1967l6011
17050d4197j0510k122M6276J7223K0767J2508p058j8381k6674k8264J293K1528
17038a7611k74N0316K1133k2898J1797J3023q681K1974k9185n2926r728M4289
17026B1229n7010n1957J0658L0548M4873j071j7621J4500J4399o9339k3649L4991
17014d9449K3471J2766j1230q389R589l963J5418J1521l9267l918L4486J9430
17002A0465j31r793j1877N451J6280J4412l5856j1907j882j284J0754L5893N1594
16989G2119L854K0325J2744j8165l0665k3231o9000k9962k674N2820K6575k250
16977A2490j2383j2377J1527K4436j093K0871j3676k5132j8456R628M9863J1183
$$ plain form
17062 -35304 -46074 -36397 -44739 -58442 -63710 -59714 -44193 -59072 -78181 -30153 -8186 -44197
17050 -44197 -54707 -56829 -10553 6670 27437 39945 32887 14506 -12168 -40432 -39139 -17611
17038 -17611 -17885 32431 53564 30666 42463 55486 46805 68779 39594 -13332 -23060 21229
17026 21229 -35781 -87738 -77080 -46532 -1659 -2730 -20351 -5851 8548 -60791 -84440 -49449
17014 -49449 -25978 -13212 -24442 -32831 -23242 -27205 -11787 -266 -39533 -43451 -8965 10465
17002 10465 10334 541 -11336 -5885 10395 24807 -11049 -22956 -24838 -26122 -15368 20525 72119
16989 72119 75973 96298 109042 90877 60212 36981 -32019 -61981 -64655 -11835 14740 12490
16977 12490 107 -12270 -743 23693 22600 43471 29795 4663 -13793 -4165 45698 56881
16965E6881J990j8916Q711J3363O941K4326k1178j0800j7562m9358p223j9066
16953c1891l1795J0017Q256N96l38K0909K8308k3789j0428J605O2338Q218j3356
16940B8650O479J1755n9233l3605J1150J2679L5726J3886N2956j2938j4084o595
16928D6826K0016R179l1412l5624K5812J5895L419J5781L179n2746m6757k6911
16916e3343j1254L9556P5920P647j781J5945m962r462j5038l6481k3126J8931
16904B552p13o003p344Q254L1895M3990j4656R325k8125J0736l3665j7465J0897
16891I678m0243j5358M6171l755k5486p457o273j9109L17M311Q552L8522K8061
16878A7931l2826l2267L985J5630K6436N073r899J4488K5393j5929K179q749J7198
$$ plain form
16965 56881 58871 39955 48666 62029 68970 93296 72118 61318 43756 -5602 -12825 -31891
16953 -31891 -63686 -53669 -45413 -44817 -45155 -24246 4062 -19727 -30155 -28550 33788 42006 28650
16940 28650 35129 46884 -12349 -45954 -34804 -22125 13601 27487 80443 67505 53421 46826
16928 46826 66842 76021 44609 8985 34797 50692 54111 69892 73071 20325 -26432 -53343
16916 -53343 -64597 -25041 50879 58526 56745 72690 67728 58266 43228 6747 -16379 2552
16904 2552 1839 -4164 -11508 -3254 28641 72631 57975 67300 39175 49911 16246 -1219 9678
16891 9678 -30565 -45923 248 -3507 -28993 -36450 -42723 -61832 -61515 -57204 -48652 -10130 17931
16878 17931 -14895 -47162 -43177 -27547 -1111 3962 -5937 8551 33944 18015 20194 11445 28643
16865B8643k142k4125k495J3286K616l2087j2653j6587k8194M4558N3612j1691
16853A2741k939K0664J1966k0950j6751o909J0792l7526R533K9120M7963k722
16841E4982l7052J0112R200J2830Q345j6790L714o892j3457j0907n392k048o176
16828D69r538N1078J4479l5841k4157L0441J3811l4073j953j1512j3881K1793
16816A116L7065K0449R656l0504k2494k9611j3297J7777J0375m2272j4045K8795
16804b6990N9314L920O852M032k823q822l9129k1403K1241J1560k6244n8700K62
16791g6930K5344N2324M2638j3392o358l4164O9928l2962m2273L526M66K1218
16779I365k3939q967l1060j8665Q322K7212M8652N3727m7239m0301K0314j0300
$$ plain form
16865 28643 26501 2376 -119 13167 15783 -16304 -28957 -45544 -73738 -29180 24432 12741
16853 12741 9802 30466 42432 21482 4731 -2178 8614 -28912 -19379 9741 57704 54982
16841 54982 17930 28042 37242 50072 58417 41627 45341 38449 24992 14085 8693 6645 469
16828 469 -9069 42009 56488 20647 -3510 26931 40742 6669 4716 -6796 -20677 1116
16816 1116 38181 58630 68286 37782 15288 -14323 -27620 -9843 532 -41740 -55785 -26990
16804 -26990 32324 36244 43096 47128 44305 35483 -3646 -25049 -3808 7752 -18492 -77192 -76930
16791 -76930 -51586 738 43376 29984 23626 -10538 59390 26428 -15845 -12319 -11853 9365
16779 9365 -14574 -23541 -54601 -73266 -64944 -37732 10920 64647 17408 -22893 -2579 -12879
16767a2879q341k0278L223K5588o0221j6175J5217O6815J5936L0809J8057q108
16755D9643m8852j9552J5697k527k933K3453J3681k3136k3339J2560K3644k1058
16743b719K5632N665o621l6178j8407O186J8857K2611p1045m861M5849q872k7242
16730e1145J8563j8678K9813k972J1703J4549J0627j1515L521J7234P110j0899
16718A7911j7009N59j0476m8722j5310l4963J8324K7748K5494M4888j9366l9438
16706e0360L7636k523k073J3304mJ9078k1905J6377J2959k0767J809N448l3248
16693b4269O052K1332J35J9531k077j5663j3468j7348J9355K418M0529q847l8486
16680a0806o696L6215p965j9970j5667k153p393j6259j0349j4535J918M3444L7610
$$ plain form
16767 -12879 -21220 -41498 -38275 -12687 -72908 -89083 -73866 -7051 8885 39694 57751 49643
16755 49643 791 -18761 -3064 -5591 -8524 14929 28610 5474 -17865 -5305 18339 -2719
16743 -2719 22913 28578 21957 -14221 -32628 -26442 -7585 15026 -56019 -60880 -15031 -23903 -51145
16730 -51145 -32582 -51260 -21447 -24419 -12716 1833 12460 945 4466 21700 28810 17911
16718 17911 902 1461 -9015 -57737 -73047 -108010 -89686 -61938 -36444 8444 -10922 -50360
16706 -50360 -12724 -15247 -17320 -4016 -4020 15058 -6847 9530 22489 1722 3531 8979 -24269
16693 -24269 -18217 3115 3250 22781 20704 5041 -8427 -25775 -6420 -4002 36527 27680 -10806
16680 -10806 -17502 18713 10748 -9222 -24889 -27042 -34435 -50694 -61043 -75578 -73660 -30216 7394
16667G394L5857r812j5431Q606n528j2492K0465j524j1614O629j6278j2990J5556
16654H838M093j3301J0407Q337j6877J295J1041J9866J7066J6212r896K5226M7476
16641A29783l0655O03k3577k8088K971Q403k779j9841j5599k1945L1575M4027
16629G4878J0588m106k8535l7862l5320j4507K0009l3736k4231n539M4654K7412
16617f295N7514J3756m1477p505o624N8028J8801o9631k1027j123l2984O208l3427
16604f5786n759p834L7221M6407L4541j6758J7272O626k1807k3075m9573m5822
16592i4347J2145k4773L705L635K680K6335K0352M7127L2449k3425l9348o593
16580d0058K1839L3436K8545j1384L075m0296l3679M8816N4824l2148l7750r806
$$ plain form
16667 7394 43251 33439 18008 26614 21086 8594 29059 27535 15921 22550 6272 -6718 8838
16654 8838 12931 -370 10037 18374 1497 2792 13833 33699 50765 66977 57081 82307 129783
16641 129783 99128 99731 76154 48066 51037 59440 56661 36820 21221 -724 30851 74878
16629 74878 85466 81360 52825 14963 -20357 -34864 -14855 -48591 -72822 -78361 -33707 -6295
16617 -6295 51219 64975 23498 15993 9369 67397 86198 16567 -4460 -5583 -38567 -32359 -65786
16604 -65786 -71545 -79379 -42158 4249 38790 22032 39304 45930 24123 1048 -48525 -94347
16592 -94347 -82202 -106975 -103270 -99635 -96955 -70620 -50268 -3141 29308 5883 -33465 -40058
16580 -40058 -18219 15217 43762 32378 35453 -4843 -38522 10294 65118 32970 -4780 -14586
16568a4586J9420p41k2256j881R560R908k5567L0572m1944m006J98K7037K4057
16555I771M095M8876K3945j9786j4634J6162j3885L837J657q884K1345Q790L1432
16542A12721l3966r710j0588k5195q206o273k0551R351L0846L5957o340o9400
16530a354j6148L9757N330j0239m3888k7144L8279L0607K993j4950o189L768j8484
16517a7662j8855M0985K7070l0015L398j9879K457K2159j8827r090J9797N517
16505G055j1724J4815o184j7527n363K1792j4290K6152k4244l5996k6228K8032
16493d3710M6851K4770L8506j1112o3050p142K3704k688l5671p554M2272L1699
16481C6875K096J3703J2718n518l9079n9171k8193k0869M0906P0338M5054R285
$$ plain form
16568 -14586 4834 4093 -18163 -20044 -10484 -576 -26143 4429 -37515 -41521 -41323 -14286 9771
16555 9771 13866 62742 86687 66901 52267 68429 54544 58381 60038 51154 72499 81289 112721
16542 112721 78755 69045 58457 33262 25056 18783 -1768 7583 38429 74386 68046 -1354
16530 -1354 -17502 22255 27585 17346 -26542 -53686 -15407 15200 18193 3243 -2946 822 -17662
16517 -17662 -36517 4468 31538 1523 4921 -14958 -12501 9658 -9169 -18259 1538 7055
16505 7055 -4669 10146 3962 -13565 -18928 2864 -11426 14726 -9518 -45514 -71742 -43710
16493 -43710 3141 27911 66417 55305 -7745 -14887 8817 6129 -29542 -37096 5176 36875
16481 36875 38971 52674 65392 59874 20795 -38376 -66569 -87438 -46532 23806 68860 78145
16469G8145J0769l4001j1696k5762K4545j0036j6195k0804k5818J254n913L927
16457c1585O167M8301J8806l9686l4683M7781J4912l1953p4990j7414J9869M2741
16445c1734O4311n50J621K906l061l9199L33J7826m178p954O7931K8364j910r005
16431H5701l6048k323j3429j0817k1267K0339n935n0656R681N687l3495j6121
16419f8683K9252L3621J492l091j4704L5899O1814j801k8588L145l7103j3895
16407b642N813l4291L2071M8530L1014m7208l8701j4879l3919k4519L0338L6144
16395a2249L1731J6159J6923r257R075r091k7366n5187j2268j5741K0670K0223
16383b6378j0444L7689o687k1132L1827M488k1696J714P691l426j2299n349l0579
$$ plain form
16469 78145 88914 54913 43217 17455 42000 31964 15769 -5035 -30853 -29599 -35512 -31585
16457 -31585 -25418 22883 41689 2003 -32680 15101 30013 -1940 -76930 -94344 -74475 -31734
16445 -31734 32577 32027 33648 36554 33493 -5706 -5373 12453 8275 321 68252 96616 94706 85701
16431 85701 49653 47330 33901 23084 1817 22156 16221 -34435 -24754 -19067 -52562 -68683
16419 -68683 -39431 -5810 -4318 -7409 -22113 13786 75600 73799 45211 48356 11253 -2642
16407 -2642 3171 -31120 951 49481 80495 33287 -5414 -20293 -54212 -78731 -48393 -12249
16395 -12249 19482 35641 52564 43307 52382 43291 15925 -39262 -51530 -67271 -46601 -26378
16383 -26378 -36822 867 -5820 -26952 4875 9363 -12333 -10619 -2928 -6354 -18653 -24002 -54581
16370e4581P612q410J7780J1337k525j1322K5622K8323j8322J4830N545n770J6093
16357B6212J2848M202M810j5886j1095l5133l4951L5842L0052l5628J6058K3509
16345B0840L0476n684j5492m831k9305N56r064L870l2390J0073N1966J3798n3141
16332a8328l7511l1380K9051L2821o120j3872j1621J0132K0274O762J3087k5772
16320c2477L0172K7948m78j5958l1579R826J6107J877q060k7367n969l5830L1042
16307d0746N1393l3745l9595M4162j2659j122K8044N898m475K798J1921j1771
16295A03R712J5306k5000K9420M6938K8324J909j8930n8396m624k1368m1063Q707
16282b8962L9496R063k1034J5401M7272n992L191J0959K3140J1558l3731m4324
$$ plain form
16370 -54581 -46969 -55379 -37599 -26262 -28787 -40109 -14487 13836 -4486 10344 15889 10119 26212
16357 26212 39060 43262 48072 32186 21091 -14042 -48993 -13151 16901 -18727 -2669 20840
16345 20840 51316 45632 30140 25309 -3996 -3440 -12504 -8634 -41024 -30951 21015 34813 -18328
16332 -18328 -55839 -87219 -58168 -25347 -31467 -45339 -56960 -46828 -26554 -19792 -6705 -32477
16320 -32477 -2305 25643 25165 9207 -22372 -12546 3561 5438 -2622 -29989 -35958 -71788 -40746
16307 -40746 10647 -23098 -62693 -18531 -31190 -32312 -4268 1630 -2845 -47 11874 103
16295 103 9815 25121 121 29541 76479 104803 106712 87782 29386 24762 3394 -37669 -28962
16282 -28962 10534 19597 -1437 13964 61236 55244 58435 69394 92534 104092 70361 26037
16270B6037m8585M77L1116J8472m311J3869m971l0593k5715o754K6181k2442K1302
16257e917j2287J5755k024k0499L3746O626j6750j3285j743j4069l1867J0399
16245e1915K5898r493r347R769M5886K4135Q048O915l7086m7217K5952J9652K7761
16232C8958P179k4888n353K927k8359r577q90J1848K5569L5493l2109k7500L1024
16219B4322M6413K5474k7409l249k019k2218k1798M8796K2486L895p0898l721
16207B0074k330J3072N3292m8031o2982Q702k4303k6044L9939o778l3477K2750
16195d6116L3010M214n295j4404k1884L0168J2483J462J1501K4266P621k191O504
16182D1339o357m1356l9717J0699M054j520j8565K0871P450M7542M3822q510j1236
$$ plain form
16270 26037 -22548 -22071 9045 27517 23206 37075 32104 1511 -24204 -30958 -4777 -27219 -5917
16257 -5917 -18204 -2449 -4473 -24972 8774 15400 -1350 -14635 -16378 -30447 -62314 -51915
16245 -51915 -26017 -35510 -44857 -35088 10798 34933 42981 49896 12810 -34407 -8455 11197 38958
16232 38958 46137 21249 15896 18823 -9536 -19113 -20003 -8155 17414 52907 20798 -6702 24322
16219 24322 70735 96209 68800 65551 63532 41314 19516 68312 90798 94693 23795 20074
16207 20074 17744 30816 84108 36077 -26905 -18203 -42506 -68550 -28611 -35389 -68866 -46116
16195 -46116 -13106 -8892 -14187 -28591 -50475 -20307 -7824 -6362 5139 29405 37026 34835 41339
16182 41339 34982 -6374 -46091 -35392 -31338 -32858 -51423 -30552 -23102 24440 68262 59752 48516
16169D8516m6085K1143n736M083j3719J213m0987j6707P094R071J6476r771j687
16156b7096L4629q556P835l177k8316m919l2930K8441M548q09J551M8131K9835
16143D9167l5704l9733o942N542K2443l962k1372q635J1681r637K5929J9543L5866
16130D4186r08m0180K433K0908l0075k9976K080M2256j4964k7878m952q08j6846
16117e4724k854M9470P1872k8954k7959j3237N452m743l2625l585K0778K0261
16105h48j7689N12K2528k7088l6367M0907Q685K432K8861J1249j1571P24P040
16092B9375J7136l6853n9120j4598M1305J8385p497J0131K791j0695k2244l1370
16080f3254L387L8016M1329R390O835l2370m8255m2881j565j6758J5305J3250
$$ plain form
16169 48516 2431 23574 17838 21921 8202 9415 -31572 -48279 -41185 -32114 -15638 -25409 -27096
16156 -27096 7533 -1023 6812 3635 -24681 -29600 -62530 -34089 -29541 -30350 -28799 19332 49167
16143 49167 13463 -26270 -33212 -27670 -5227 -9189 -30561 -39196 -27515 -37152 -11223 8320 44186
16130 44186 43278 3098 5531 26439 -3636 -33612 -31532 10724 -4240 -32118 -37070 -37878 -54724
16117 -54724 -57578 -8108 63764 34810 6851 -6386 -934 -5677 -38302 -41887 -21109 -848
16105 -848 -18537 -18025 4503 -22585 -58952 -18045 -9360 -6928 21933 33182 21611 22335 29375
16092 29375 46511 9658 -49462 -64060 -22755 -4370 -11867 -1736 1055 -9640 -31884 -63254
16080 -63254 -59867 -21851 19478 28868 35703 3333 -44922 -87803 -89368 -106126 -90821 -77571
16068g7571Q15J3918q927J4873M6889J845n104P964K96k448j490l7479j956K6096
16054b2279R884J2375p6666o503K1153J2272r163K2642L3790q452K6356L6602
16042E2011L3065n831q204j0637L4136m3445k4431J6461m3727k3654J4555P457
16030b244M876J0129N1007j8044p2425J4816j340k4550j703N1463J6821l1811
16018c005n0819j3637J7021J1859J0229J9054J4201j9824o075l69O195j5069j3048
16005d3287J0191M7601L2317l1412j9163l3176N6638L2144m3605k090k2047k8926
15993d4815M855j766l270m8941j8201J0095N2539K5091K0126l50J759P232M9377
15980E3731K7960m2057j1188n565o4952l2515L6299J0873l5343J0682J0044J9467
$$ plain form
16068 -77571 -76756 -62838 -71765 -56892 -10003 -8158 -13262 -5298 -5002 -7450 -8940 -46419 -48375 -22279
16054 -22279 -12395 -20 -76686 -83189 -62036 -49764 -58927 -36285 -2495 -10947 15409 52011
16042 52011 85076 79245 71041 60404 94540 51095 26664 43125 -602 -24256 -9701 -2244
16030 -2244 2632 12761 63768 45724 -26701 -11885 -13225 -37775 -39478 11985 28806 -3005
16018 -3005 -53824 -67461 -50440 -38581 -28352 -9298 4903 -14921 -20996 -21365 -15170 -30239 -43287
16005 -43287 -33096 14505 46822 15410 -3753 -36929 19709 51853 8248 6158 -15889 -44815
15993 -44815 -39960 -41726 -44996 -93937 -112138 -102043 -49504 -24413 -4287 -4637 -2878 4354 53731
15980 53731 81691 39634 28446 22881 -42071 -74586 -38287 -27414 -62757 -52075 -42031 -22564
15968b2564k6820j591L3027k0622J3502j1913o182K7575j1983m4270J1432J5917
15956d4492K7770l145k326o998K1472Q262M904J0873o003L0158k1288j5323k5586
15943b1722J5962R231k2885j1770p737L812J0729j6375j1757L1795J4349J5462
15931I094O541q737K1618O183L225l6964R759J415o4168N9409J7301m0014K5226
15918I888L0992j6111l1758l5375J395L3158l3890l8013j556L6657M3541K3980
15906B2908O762M336J619M3400k3478l1421j6647l9314M702k242L7259K0156j2459
15893A5581k8874J2938j2364J1130N3783J1004m2899o904k0492l0064O4825L5148
15881F2812l333l2965N62K5151l3408k4401k0444J7056K8045J6665P962R296j7621
$$ plain form
15968 -22564 -49384 -50975 -17948 -38570 -25068 -36981 -43163 -15588 -27571 -71841 -60409 -44492
15956 -44492 -16722 -19867 -22193 -29191 -7719 543 5447 16320 10317 40475 19187 3864 -21722
15943 -21722 -5760 3471 -19414 -31184 -38921 -35109 -24380 -40755 -52512 -20717 -6368 9094
15931 9094 15635 6898 28516 34699 37924 960 10719 12134 -52034 7375 24676 -15338 9888
15918 9888 40880 24769 -6989 -42364 -40969 -7811 -41701 -79714 -81270 -44613 -1072 22908
15906 22908 29670 34006 35625 79025 55547 24126 7479 -31835 -27133 -29375 7884 28040 15581
15893 15581 -13293 -355 -12719 -1589 52194 63198 20299 13395 -7097 -37161 27664 62812
15881 62812 59479 26514 27076 52227 18819 -5582 -26026 -8970 19075 35740 43702 52998 35377
15868C5377M877J4844j3890l8328j6602R034k0519n4481j6563J6611O3993n301
15856b0948j9265N0628K55l7526L3141m4729k3041n974M3038P2022J3667j0286
15844E0982q169j8805J0929O795j3424j9657k709J2878j824K1752j5376j3439
15832I933k9180J4612N584j7383K0801N820o333o6279K85k2573O000N99K017J4422
15818f1675j5491j2188L9594Q2674J9333j4439J3708j1650J773L8752k4227l5829
15806B0335j418r639R838K8n257J3821P826l3142j5648K012J7596J5825r452q440
15792D285k9011k5038M4640J7281P417J8100n2704l1236K3107j4227j4904M0167
15780a2123j3101N88J8671p111K2974M5060k266k8724j1312j8713k1064K8365
$$ plain form
15868 35377 40254 55098 41208 2880 -13722 -4688 -25207 -79688 -96251 -79640 -15647 -20948
15856 -20948 -40213 10415 10670 -26856 6285 -38444 -61485 -67459 -24421 47601 61268 50982
15844 50982 42813 24008 34937 41732 28308 8651 5942 18820 16996 38748 23372 9933
15832 9933 -19247 -4635 949 -16434 4367 10187 3854 -62425 -62140 -84713 -78713 -78114 -76097 -61675
15818 -61675 -77166 -89354 -49760 32914 52247 37808 51516 39866 41639 80391 56164 20335
15806 20335 18917 9278 19116 19144 13887 27708 35534 2392 -13256 -11244 6352 22177 12725 4285
15792 4285 -24726 -49764 -5124 12157 19574 37674 -15030 -46266 -23159 -37386 -52290 -12123
15780 -12123 -25224 -24636 -5965 -13076 9898 54958 52692 23968 12656 -6057 -27121 1244
15768A244N9708k0160k7043O15L9274l2048m4967l2976n380j3217n668M5329R925
15755b5364R356N2405j6660o4587q1149M0335O6275L7414O431L8340N1959m7147
15743F7608p8417j6799j2112q759K138L3417o561o477k5416K3033N2111l723K3827
15730D3870O197L525O031l8332j0308K1583l852k7643J7038R676k2072j6713j6872
15717b7872K4598J3084j9933J1598J1572l739M3435J3171k4616l876k436j9246
15705A5740J1071j2892o888l6375k1686N5321N5726r985l1627l0528m663K3517
15693F731K5778J4096J3152m1990m62j5056R967Q86j4149P205L8873j5534l9806
15680a0309J4859P272j9687k7606m5891L2828L4110K3562K3860K3488j3197m0251
$$ plain form
15768 1244 60952 40792 13749 14364 53638 21590 -23377 -56353 -61733 -74950 -80618 -35289 -25364
15755 -25364 -16008 36397 19737 -44850 -125999 -85664 -19389 18025 24456 62796 114755 67608
15743 67608 -10809 -27608 -39720 -48479 -46341 -12924 -19485 -25962 -51378 -28345 23766 20043 43870
15730 43870 50067 53592 59623 21291 10983 32566 28714 1071 18109 27785 5713 -11000 -27872
15717 -27872 -3274 9810 -10123 1475 13047 9308 52743 65914 41298 37422 34986 15740
15705 15740 26811 13919 7031 -29344 -51030 4291 60017 50032 18405 -12123 -16786 6731
15693 6731 32509 46605 59757 17767 17305 2249 12216 13102 -1047 6158 45031 29497 -10309
15680 -10309 4550 11822 -7865 -35471 -81362 -48534 -14424 9138 32998 56486 43289 3038
15668C038m3237k9470J56k1463N419L3528K0347K4927l5844k1670K712L998K9998
15655b7561J9114Q761l028K1672j50P103K636l9885J0191j0657j3363J4664j2648
15642b3151j7495L9004R416j5813l5075K0296L5685K7033k2282j3768j5893J0719
15630a324N133q511K8113l7824l8302J4073M6766K8847l632J9549l339L8853j6613
15617G1789l152O407k7471m0490l6296k6853J4889N0354N3067j368m324n6583
15605c1k5584l1464m415k9752j2421L1612N2675q124m4475L707p102J197L0435
15592d3742R194J0549L0849n85K7397k9729q564K3139L9377L530j3074o1519P423
15579e755J1527J9545j439m0751O766J9454k5166k8772J6362L9756K0708j1559
$$ plain form
15668 3038 -40199 -69669 -69513 -90976 -85557 -52029 -31682 -6755 -42599 -64269 -61557 -57559 -27561
15655 -27561 -8447 314 -2714 18958 18808 25911 28547 -11338 -1147 -11804 -25167 -10503 -23151
15642 -23151 -40646 -1642 7774 -8039 -43114 -22818 12867 39900 17618 3850 -12043 -1324
15630 -1324 3809 -4702 23411 -14413 -52715 -38642 8124 36971 33339 52888 49549 88402 71789
15617 71789 68637 75044 47573 7083 -29213 -56066 -41177 9177 62244 60876 56552 -31
15605 -31 -25615 -57079 -61494 -91246 -103667 -72055 -19380 -27504 -71979 -68272 -75374 -74177 -43742
15592 -43742 -34548 -23999 6850 6265 33662 3933 -4631 18508 57885 61415 48341 -13178 -5755
15579 -5755 5772 25317 23878 -16873 -10107 9347 -15819 -44591 -28229 11527 32235 20676
15567B0676l9155O865j3139J2025K2338L3948n334l1739k8047j3083k3376L1886
15555b6135K8457R929k8251l1217O4l942J2128M9156J141J480L142l1161j3022
15542b8231K9309j2103l896J6993K6202M8302j5837l0228j1405j6525J9285o769
15530A5097J1121q12K828n846J1627K807J8859k5834k2220J9449j3684l457M2872
15517E2807J5808l2243l201l790l3247l8552m195O02r674J4686L9314Q199n6107
15504d9593P810j0063J5312J2596K3840J2171J2788j3102J8432J0998j9709L470
15492B4950l87j2740k4808J427j0772j9722K3810K6559j5694K947q096K9982Q955
15479B6411m322p875j5595N1035J1705m1138Q079K640o5057j1315O308J9594K0942
$$ plain form
15567 20676 -18479 -11614 -24753 -12728 9610 43558 38224 6485 -21562 -34645 -58021 -26135
15555 -26135 2322 12251 -16000 -47217 -47153 -51095 -38967 10189 11330 12810 15952 -15209 -28231
15542 -28231 1078 -11025 -14921 2072 28274 76576 60739 30511 19106 2581 21866 15097
15530 15097 26218 25406 28234 22388 34015 36822 55681 29847 7627 27076 13392 9935 52807
15517 52807 68615 36372 33171 29381 -3866 -42418 -46613 -46011 -55685 -40999 -1685 6514 -49593
15504 -49593 -41783 -51846 -36534 -23938 -98 12073 24861 11759 30191 41189 21480 24950
15492 24950 24563 11823 -12985 -11558 -22330 -42052 -18242 8317 -7377 -4430 -12526 17456 26411
15479 26411 22089 14214 -1381 49654 61359 20221 28300 30940 -34117 -45432 -39124 -19530 1412
15466A412l3137q101j6425K599M6123j459o593k0359k2692j4974P863K1324l8465
15453h2884j3922L2984L6036J5609L1285M6881j8273k3073L6043n4470o9420L2968
15441c0236M9776J0724k3327r918K1170j8625k3994j7325J2186J6216k2076K5421
15429a0008M174J6690m058K3039O3154L5550l7147m2025m5080M1155l8438l6204
15417b9198K3618o086K058L8496K5359k7479j1233m4864Q512j4883K6736M4057
15405C5093J6976n2081r921N3922K8444J5005k0646m9344k6203L1768j7415r666
15393d068l746J1370K5045K4463j9055j631m3387n2831K8310M2872L4564M2k5293
15380A6655j3100k0657l2649l2193l01J7538J1420Q428j5359l243L3631O444J23
$$ plain form
15466 1412 -31725 -39826 -56251 -53652 -7529 -8988 -15581 -35940 -58632 -73606 -65743 -44419 -82884
15453 -82884 -96806 -63822 -27786 -12177 19108 65989 47716 24643 60686 6216 -63204 -30236
15441 -30236 19540 30264 6937 -2981 18189 -436 -24430 -41755 -29569 -13353 -35429 -10008
15429 -10008 -5834 10856 6798 29837 92991 128541 91394 49369 4289 45444 7006 -29198
15417 -29198 -5580 -11666 -9608 28888 54247 26768 15535 -29329 -20817 -35700 -8964 35093
15405 35093 52069 -12 -9933 43989 72433 87438 66792 17448 -8755 23013 5598 -4068
15393 -4068 -7814 3556 28601 53064 34009 32378 -11009 -63840 -35530 7342 41906 41948 16655
15380 16655 3555 -17102 -49751 -81944 -82245 -64707 -53287 -44859 -60218 -63461 -29830 -23386 -23263
15367b3263J6385J5611K0372l2899p273l1130j603M2357L4677l2169l9142j4427
15355e2504k8300J4060K290K0579O8659M1070n3842j2979L8640j9496o884J9316
15343C0609p845j717J8639r234l7677p484J6279K906k9871j7798j3191L2222J8410
15330e752m466k3079J4534n569M8854M420p4245k0157K3216O6232J6869M3910
15318H4767J4277l0710j5503l9454n0658k9709Q600K7256M3705O1498m0836k4702
15306H531J7872j4255k841O678l586K2726L3021m787n0217k8948o8444l9686L4496
15293h9440Q7524l4315l508M2537k7170J1806O2709K156k8643m0506J3329L547
15281B6K4050j9437n1750j5537L3551k6694k4713M6041M7917l3968j9567j4681
$$ plain form
15367 -23263 -6878 8733 29105 -3794 -11067 -42197 -43800 -1443 33234 1065 -38077 -52504
15355 -52504 -80804 -66744 -64454 -43875 24784 65854 12012 -967 37673 18177 11293 30609
15343 30609 22764 21047 39686 30452 -7225 -14709 1570 4476 -25395 -43193 -56384 -24162 -5752
15330 -5752 -10218 -33297 -18763 -24332 24522 28942 -45303 -65460 -42244 23988 40857 84767
15318 84767 99044 68334 52831 13377 -37281 -66990 -58390 -31134 12571 74069 33233 8531
15306 8531 26403 12148 9307 15985 12399 35125 68146 63359 13142 -15806 -84250 -123936 -89440
15293 -89440 -1916 -36231 -39739 2798 -24372 -12566 50143 52299 23656 -16850 -3521 26
15281 26 24076 4639 -47111 -62648 -29097 -55791 -80504 -34463 13454 -20514 -40081 -54762
15269e4762K9147K064O002k6878k0448K9626O5961J4971j4229J5264k1970j6378
15257H370p895P926q202m0699k1155L900J3330l7002N3637O9566K2787k3591m1967
15244i95l4010j5202L1651l132j1562P134K3314l8392k5285L6603L0676L2496
15232C3296K3490n3141p4979M045j8478L4524M1291J6497l4533R282p753K5209
15220a250J3837j1289k7472L3083j9404J8373L6467J1597j5802k2237k7368k3067
15208c4532N9232K5194j752j6574j2355N716J2216k6230N504J553j2247k9674
15196b3949l679r10k737l263K6533J3531P065j3776J9603k1951k2427J615N985
15183a8360J3956M3561j9421m6250p454L1952l2685L135l365j46J0145J0190L2482
$$ plain form
15269 -54762 -25615 -23551 -17549 -44427 -64875 -35249 30712 45683 31454 46718 24748 8370
15257 8370 475 8401 199 -40500 -61655 -57755 -44425 -81427 -27790 41776 64563 40972 -995
15244 -995 -35005 -50207 -18556 -21688 -33250 -26116 -2802 -41194 -66479 -29876 800 33296
15232 33296 56786 3645 -71334 -67289 -85767 -51243 -9952 6545 -27988 -18706 -26459 -1250
15220 -1250 12587 1298 -26174 6909 -12495 5878 42345 53942 38140 15903 -11465 -34532
15208 -34532 24700 49894 48142 31568 19213 24929 37145 10915 16419 17972 5725 -23949
15196 -23949 -27628 -28538 -31275 -34538 -8005 5526 12591 -1185 18418 -3533 -25960 -24345 -18360
15183 -18360 -4404 39157 19736 -26514 -33968 -2016 -34701 -31566 -34931 -35077 -24932 -14742 17740
15170A7740L835m9965k1195J0955N5364K8489o148k7819o058K3845K2515K5883
15158G7441k4895k7260j8030L2389k7630k1618J8659K6508l1266k4128M8450N121
15146C3741l0655k0993j8865M777J336j5227m190J3918K4765J9440k3685m1488
15134e7126p540p720M6344J5698o929J4864L2344q938Q408J3010m2123j0226r795
15121a9729p425j2609K9159k8191J5548J235m3057K8645Q414l359r199K7198R085
15108d285j2963j9255j088K4134L4560O173j1023k4915o458J6361O019J292P996
15095A6548O992k0952J3258M8277K6275q198P531j248o5239m3554J9867P003L3809
15082D0369j5166m8107j8919M278J8981K3251o446k4063J3682J8296L561k1259
$$ plain form
15170 17740 21575 -28390 -49585 -38630 16734 45223 39075 11256 5198 29043 51558 77441
15158 77441 52546 25286 7256 39645 12015 -9603 9056 35564 4298 -19830 28620 33741
15146 33741 3086 -17907 -36772 -31995 -30659 -45886 -50076 -36158 -11393 8047 -15638 -57126
15134 -57126 -64666 -72386 -26042 -10344 -17273 -2409 29935 20997 29405 42415 292 -9934 -19729
15121 -19729 -27154 -39763 -10604 -38795 -23247 -22012 -65069 -36424 -28010 -31369 -40568 -13370 -4285
15108 -4285 -17248 -36503 -37591 -13457 21103 27276 16253 -8662 -15120 1241 7260 8552 16548
15095 16548 23540 2588 15846 64123 90398 82200 89731 88483 23244 -20310 -443 6560 40369
15082 40369 25203 -22904 -41823 -37545 -18564 4687 -1759 -25822 -12140 6156 9717 -11542
15070a1542K9348M590O822o101Q43l0306j9821l328J9433J4670k888N2483N7254
15057A11457j1025l6589k9728j6718r032J4647p973l2588l2218N845J4926O986
15045b2010l582L4104J454l3270j33k096J1625j3747J8188L6996J163k5295L3135
15032C6532o711j2594P166J3685o2259j6285j3171r199J092q762o75K2281M5890
15019c010J7608j7141j2097r105K5530K0500j3373m2092l9555L416L0033K5427
15007a3859r028k1848K7490L9102k2816j7084J3899l0039J6370L4224L5040l290
14995D8161o2324o665j285k9181J0911M5100K2621K4502n300l3016k3240m2990
14983e2706j0415K2450L7774M1386j6089n8493m4121J3598O181K6044M3003n454
$$ plain form
15070 -11542 17806 22396 29218 23117 23960 -6346 -26167 -29495 -10062 4608 1720 54203 111457
15057 111457 100432 63843 34115 17397 8365 23012 15039 -17549 -49767 -43922 -28996 -22010
15045 -22010 -25592 8512 9966 -23304 -23437 -25533 -13908 -27655 -9467 27529 28692 3397 36532
15032 36532 29821 17227 24393 38078 -24181 -40466 -53637 -62836 -61744 -70506 -71181 -48900 -3010
15019 -3010 14598 -2543 -14640 -23745 1785 22285 8912 -33180 -72735 -69319 -39286 -13859
15007 -13859 -22887 -44735 -17245 21857 -959 -18043 -4144 -34183 -17813 16411 51451 48161
14995 48161 -14163 -20828 -22113 -51294 -40383 4717 27338 51840 46540 13524 -9716 -52706
14983 -52706 -63121 -40671 -2897 38489 22400 -36093 -80214 -66616 -60435 -34391 8612 3158
14971C158j3376p442n017p359n523K4090j2087O629J6832j1506k7580p370K7342
14958a9209j504J2233L7695J154k9069m6407j0936j1392Q994L8206R406L1126
14946B0297R222N775M5038j3503n3013k6562J7347O357J9979p325J5815n0827
14934a1400l9694j5177K2438K9641O828k2668J0905K7050N824M4978L7754j4503
14922H1976k0594K2284K2873l2276n6848l3896k118k2244L2136J5351r323r179
14910a1858J7899N3898p172l2046k4930K1805O5088l8343n1861k0314Q867k8484
14898d7451O279J6429m6048K2504N4416O724J3311J008L518J6029l330m6224k5951
14885b8786M540m3331L773J5571J1771K2894l4099M556L6657j9022L1915L7204
$$ plain form
14971 3158 -10218 -17660 -22677 -30036 -35559 -11469 -23556 -16927 -95 -11601 -39181 -46551 -19209
14958 -19209 -20713 -8480 29215 30369 1300 -45107 -56043 -67435 -58441 -20235 -10829 20297
14946 20297 29519 35294 80332 66829 13816 -12746 4601 10958 30937 23612 39427 -11400
14934 -11400 -51094 -66271 -43833 -14192 -7364 -30032 -19127 7923 13747 58725 96479 81976
14922 81976 61382 83666 106539 74263 17415 -16481 -18599 -40843 -8707 6644 -2679 -11858
14910 -11858 6041 59939 52767 20721 -4209 17596 82684 44341 -7520 -27834 -18967 -47451
14898 -47451 -41172 -24743 -70791 -48287 6129 12853 26164 27172 30690 46719 43389 -2835 -28786
14885 -28786 -24246 -67577 -63804 -48233 -36462 -13568 -47667 -43111 -6454 -25476 6439 43643
14873D3643K2688j5379P624m0690p1594o3766j0425K5281J6782K1213L2920K6274
14861e429L1604L4299K0513l3436n488r968j943O65j4597m943l6875l0984K7577
14848b9005j052M0847M0689o545m4501n5486o619N1911K2102M505r54r815k0866
14835a4789M151j2761j5699J5161k2217Q123k0392j6691L4120o25k8101k2636
14823i2356M9493M3907l2945N333J5461j0476m850L56K5724J8636j4608j1469
14811g794P290k0166j8321M0257J6149J7799K7864q632K183J3978J6923m2108
14799D5422J1450J9750r719l6183L1045k1967r154J5223k1935j7746M3662l3836
14787A6012p6662K10j3876L3201K3002R92o92k778l1299L5313K9670k9375o7811
$$ plain form
14873 43643 66331 50952 58576 17886 -53708 -117474 -127899 -102618 -85836 -64623 -31703 -5429
14861 -5429 26175 60474 80987 47551 42063 32095 30152 30817 16220 11277 -25598 -56582 -29005
14848 -29005 -30057 10790 51479 44934 433 -55053 -61672 -9761 12341 16846 15892 6077 -14789
14835 -14789 -10638 -23399 -39098 -23937 -46154 -38031 -58423 -75114 -40994 -41619 -69720 -92356
14823 -92356 -42863 1044 -31901 -26568 -11107 -21583 -26433 -26077 -353 18283 3675 -7794
14811 -7794 -504 -20670 -38991 1266 17415 35214 63078 54446 56629 70607 87530 45422
14799 45422 56872 76622 66903 30720 61765 39798 30644 45867 23932 6186 49848 16012
14787 16012 -60650 -60440 -74316 -41115 -18113 -17121 -17813 -20591 -51890 -16577 13093 -16282 -84093
14774h4093p003L2561K9577K3523J1698L105k335l1817k6395P409N7680J575N769
14761B1254k3558j6641k1666j4411R183j4182L4046M6441n176n8449o552L0863
14749a8848J9018k4029K504L766J793R488j6584J6247R2455K237o7667j2967p112
14736C01n035N155J5009q867k9227j5226J2595N0849J2206m909J629o353m9738
14723b1611o0621K5194M6618K515L534j2945k748l7413O972M68j3587O835K8894
14710b7895L9384l6269l3707K3963K6660M1216K1635k08p893K7118l8300j3280
14698B2424R789J7879j7690l5790J1932l430l4118J2333K8153O118j2475o626
14686a501n085l0250O358J7053K2268k528l85L6485j9476j9330N6605M240k4658
$$ plain form
14774 -84093 -91096 -58535 -28958 -5435 6263 9368 7033 -24784 -51179 -43770 13910 15485 21254
14761 21254 -2304 -18945 -40611 -55022 -45839 -60021 -25975 20466 15290 -43159 -49711 -18848
14749 -18848 170 -23859 -21355 -17589 -15796 -6308 -22892 -6645 85810 88047 20380 7413 301
14736 301 -4734 421 15430 6563 -22664 -37890 -25295 25554 37760 32851 34480 28127 -21611
14723 -21611 -82232 -57038 -10420 -7905 -4371 -17316 -20064 -57477 -50505 -50037 -63624 -56789 -27895
14710 -27895 11489 -24780 -58487 -34524 -7864 33352 54987 54779 46886 74004 35704 22424
14698 22424 32213 50092 32402 -3388 8544 5114 -29004 -16671 11482 17600 5125 -1501
14686 -1501 -6586 -36836 -30478 -13425 8843 6315 5930 42415 22939 3609 60214 64454 39796
14673C9796K1102o151j1926J7209j0081j8448J2353n394L221J3154j6607J6876
14661E5104j5274p226N378J8673n6514l3179K8074J4327l7093n257j0966n292
14649d9245O1037O728M51j8015m2270k0952M6438L7659j5331J243k2936R151L0799
14636B4757k0497P416J6983K0810N523O91Q15l9383j7058m5270j8297J6233k9333
14623g6610K714K4709M1167j9703N738P816R162N5354J579o9030l1544k8071J667
14610g5052N4832L8016J0213J3463k3178j5844K934m355j1725K5436M4583n378
14598E3945n1987l0912n163j3808p478k7994J1933J2187M3326Q461K6740n804
14586A3446K816l1132m2951n769M460L037O201M3748j7575q284o308K2045K4581
$$ plain form
14673 39796 60898 54747 42821 60030 49949 31501 43854 38460 41681 54835 38228 55104
14661 55104 39830 32604 37982 56655 141 -33038 -4964 9363 -27730 -32987 -43953 -49245
14649 -49245 11792 18520 18971 956 -41314 -62266 -15828 21831 6500 7743 -15193 -6042 24757
14636 24757 4260 11676 28659 49469 54992 55683 56498 17115 57 -45213 -63510 -47277 -76610
14623 -76610 -73896 -49187 -8020 -27723 -21985 -14169 -5007 50347 51926 -17104 -48648 -76719 -75052
14610 -75052 -20220 17796 28009 41472 18294 2450 5384 1029 -10696 14740 59323 53945
14598 53945 1958 -28954 -34117 -47925 -55403 -83397 -71464 -59277 -15951 -7490 19250 13446
14586 13446 16262 -14870 -57821 -63590 -59130 -56093 -49892 -6144 -23719 -32003 -38311 -16266 8315
14573H315R630k962j505k6010l4237j2679J2514l0649R934J9679M8963P362L8353
14560D6708J4317m4554k4963k776K9237q568j7961j8554J0628L2584L9773p706
14548D8165J0933j1833m6141J5227R230J3620K6722j9006k0986r597k8579L5746
14536B3501J8218l4588R122j074K489L5564j9726n0475k8210k0273L4597n663
14524c6518M4756N9366m4857l8636j0002o291K6866M3344K0237j7073m1127k3686
14512b3621n4054m7952M9535L2367m52J7573M055k806j3533J0837K8619M8923
14500D9491K8147m0688q58K2389m291l7991n4967p093K0947M1817J4537k662m7450
14487a8672J9476l4069l4478K4787K4160Q632R358K2164K5196k0581J5721j3552
$$ plain form
14573 8315 17945 14983 13478 -12532 -46769 -59448 -46934 -77583 -67649 -47970 993 8355 46708
14560 46708 61025 16471 -8492 -11268 17969 9401 -8560 -27114 -16486 16098 55871 48165
14548 48165 59098 47265 1124 16351 25581 39201 65923 46917 25931 16334 -12245 23501
14536 23501 41719 7131 16253 15179 17668 53232 33506 -16969 -45179 -65452 -30855 -36518
14524 -36518 8238 67604 22747 -15889 -25891 -32182 -5316 38028 58265 41192 65 -23621
14512 -23621 -77675 -125627 -76092 -43725 -44177 -26604 -22549 -25355 -38888 -28051 568 49491
14500 49491 77638 36950 36092 58481 54190 16199 -38768 -45861 -24914 16903 31440 28778 -18672
14487 -18672 804 -33265 -67743 -42956 -18796 -10164 -806 21358 46554 25973 41694 28142
14475B8142j8914p710k3694k213k693r591o414O5734K9692k9219k5769O625l3094
14462b9118J7328N533J2685P834l4382o0460P474M0915j003J1684m494K7480J2571
14449A4047l4105l301L4338j6759k7884j2076Q008J8775j8263j649M1747J2144
14437A5022l4736Q823K071N4255j6231k1552m152K0931L4482J4974n0688n0665
14425b7466J8425J873J2152K3503O512m7366J2567K2074l1056k9807J5902L0002
14413G315j2781m278l1243J5633J5238k4912j4440L2625N2707m354J3807k6476
14401A8841o7072l3202k6190p22j9450M0685J7267L2906P798k7017M4868J6529
14389E241m675n681p119R835K5896n121L3612j7451o6348M155K3933Q396n29J0109
$$ plain form
14475 28142 9228 1518 -22176 -24389 -27082 -36673 -43087 22647 52339 23120 -2649 3976 -29118
14462 -29118 -11790 -6257 6428 14262 -20120 -80580 -73106 -32191 -33194 -21510 -26004 1476 14047
14449 14047 -20058 -23359 10979 -5780 -33664 -45740 -37732 -18957 -37220 -38869 2878 15022
14437 15022 -19714 -10891 -8820 45435 29204 7652 3500 24431 58913 73887 23199 -27466
14425 -27466 -9041 -7168 4984 28487 34999 -12367 200 22274 -8782 -38589 -22687 7315
14413 7315 -5466 -9744 -40987 -25354 -10116 -35028 -49468 -16843 35864 31510 45317 18841
14401 18841 -48231 -81433 -107623 -108345 -127795 -87110 -69843 -36937 -29139 -56156 -11288 5241
14389 5241 566 -5115 -12234 -2399 23497 18376 51988 34537 -31811 -27656 -3723 4673 4144 14253
14375A4253n1232m883l370J379j7800k6396N2554j4406j7330j3971Q101L8797
14363c4304L8090K6220J2422j9310l2074k0646r168Q677M0098N4950O963o7104
14351D814k8287J7410L8792K284j1432k7212r509j2319r458M7707L9689j6173
14339C6306K22j6790p785k3972N408j8930Q822L8793j661N141k6482l3633K4281
14326a0280N6961p564m5470m2749L480M1157l4237k4953K8839K6530J7754J2844
14314B2312l6025l1170N0227M2543Q219j5648j2280K6093L5509L283j4350K249
14302H0962j8772l1467j453P337L3062j3541j153J7715k2470n5076j9552J1190
14290a3218m38k050K1682j6543Q646k2495k3327J885J4437J7776M6481j6926l9908
$$ plain form
14375 14253 -36979 -41862 -45232 -43853 -61653 -88049 -35495 -49901 -67231 -81202 -73101 -34304
14363 -34304 3786 30006 42428 23118 -8956 -29602 -38770 -30093 10005 64955 71918 4814
14351 4814 -23473 -6063 32729 35013 23581 -3631 -13140 -25459 -34917 12790 52479 36306
14339 36306 36528 19738 11953 -12019 -6611 -25541 -16719 22074 20413 25554 -928 -34561 -10280
14326 -10280 46681 39117 -6353 -49102 -45622 -4465 -38702 -63655 -34816 -8286 9468 22312
14314 22312 -13713 -44883 5344 47887 56106 40458 28178 54271 89780 93063 78713 80962
14302 80962 62190 30723 29270 36607 69669 56128 54975 72690 50220 -4856 -24408 -13218
14290 -13218 -13656 -15706 5976 -10567 -1921 -24416 -47743 -45858 -31421 -13645 32836 15910 -23998
14277b3998K1221k977J7803j385j2371M9577J8869K0252l9775K579J602n7614
14265f217k8077J0428p448J908j4957j3414l7392K375K7964P119K2481k8573j8129
14252h1932K5791K5344M9783J3920k8674j9530q063K6823l259k8256m3169K241
14240f8981j4657j3960K1818O1348J2270J3746K1619p699n1221j3811J8531j4664
14228c5661K1161j4233j1291j950N8016J9596n942J2382j8373j8240J3181j2300
14216F346k77p5552k9328J4134O366k8332K6802K2882j1601K8416L9201K2869
14204B1926j3025j04j0715m4J7682j4659J7133m8752l7308P342K4122L2406J9088
14191A5092p976q541j7378M882o68J4609L4715j1509n58L3004J8372l2302n6133
$$ plain form
14277 -23998 -2777 -5754 12049 10664 -1707 47870 66739 86991 47216 49795 51397 -6217
14265 -6217 -34294 -23866 -31314 -29406 -44363 -57777 -95169 -92794 -64830 -57711 -35230 -63803 -81932
14252 -81932 -56141 -30797 18986 32906 4232 -15298 -23361 3462 203 -28053 -71222 -68981
14240 -68981 -83638 -97598 -75780 -14432 -2162 11584 33203 25504 -25717 -39528 -20997 -35661
14228 -35661 -14500 -28733 -40024 -41974 16042 35638 29696 42078 23705 5465 18646 6346
14216 6346 6069 -69483 -98811 -84677 -78311 -106643 -79841 -56959 -68560 -40144 -943 21926
14204 21926 8901 8797 -1918 -1962 15720 1061 18194 -30558 -67866 -60524 -36402 -3996 15092
14191 15092 7116 -1425 -18803 -13921 -14589 20 34735 23226 22668 55672 74044 41742 -14391
14178a4391m714L0509L8803N17m0885K5704N0062l7975k6880K3863r96l5055J9643
14165B8205j7282r164j8730J5420M4984o90j3312k5079j6175N147k1463j3875
14153d2014M35K8661m728L878P593M0486K0832l1038m304j9079J3943K9065L0370
14140G4100o610n1881p6834J2434J4011j366J6296K2952j993j3959M4915L8681
14128G0746l3149m9884K2631k4467k6164k090P726K2105o379L4763P726L2779
14116E6343K6679k2743J4532J1488n2146m4454J4092L2389J9022k726Q533j0991
14104E0018m8823j1585k5733j2176J9275p05J1227J2233J8259O252J0027J6740
14092D5009m2122k0651M9360k693l2613M502m1226l4786J6998J1872M1873R431
$$ plain form
14178 -14391 -19105 11404 50207 50724 9839 35543 85605 47630 20750 44613 43617 8562 28205
14165 28205 10923 1759 -16971 -1551 43433 42743 29431 4352 -11823 -6676 -28139 -42014
14153 -42014 -41579 -12918 -17646 -13768 -6175 34311 55143 24105 19801 722 14665 43730 74100
14140 74100 67490 15609 -61225 -48791 -34780 -36146 -19850 3102 1109 -12850 32065 70746
14128 70746 37597 -12287 10344 -14123 -40287 -42377 -34651 -12546 -18925 15838 23564 56343
14116 56343 83022 60279 74811 86299 34153 -10301 3791 36180 55202 52476 61009 50018
14104 50018 1195 -10390 -36123 -48299 -29024 -29729 -18502 -6269 11990 18242 28269 45009
14092 45009 2887 -17764 31596 28903 -3710 792 -40434 -75220 -58222 -46350 -4477 4954
14080D954k0331K1167L8190Q428m2227j1249L586j0226p547J2856q860J4964O57
14067D362k1322l24J4144k436k8813j1348L1197R375k6949P751J4309K4346l3607
14054a9315k4393k8017L1329J2895L989M4659L4710k4029k7916M946k4599o63
14042a6404l2260k0341J2907K3311J7586j6938j06j4323L1877j8605j5507J0779
14030c8024K7877j5700m2809k4028Q70M9687R854k1659j3813j410J294j4243r61
14017h3065j0920J2122R482j465L1058M9701J0688m1714J3937l8920j9592O8735
14005D7N0713j1861k6054k5385l9081k0154L3703L3499P117L7833K0305o6524
13993e842m3771j6511j5266J7616K8135J5287N023j4138k1180L2548Q202j8101
$$ plain form
14080 4954 -15377 5790 43980 52408 10181 -1068 2518 -7708 -15255 -2399 -11259 3705 4362
14067 4362 -16960 -17284 -3140 -5576 -34389 -45737 -14540 -5165 -32114 -24363 -10054 14292 -19315
14054 -19315 -43708 -71725 -40396 -27501 -23512 21147 55857 31828 3912 8858 -15741 -16404
14042 -16404 -48664 -69005 -56098 -32787 -15201 -32139 -32245 -46568 -14691 -33296 -48803 -38024
14030 -38024 -10147 -25847 -68656 -92684 -91814 -42127 -32273 -53932 -67745 -69155 -67861 -82104 -83065
14017 -83065 -93985 -81863 -72381 -73846 -42788 6913 17601 -24113 -10176 -49096 -68688 47
14005 47 50760 38899 12845 -12540 -51621 -71775 -38072 -4573 2544 40377 60682 -5842
13993 -5842 -49613 -66124 -81390 -63774 -35639 -20352 -15329 -29467 -50647 -18099 -9897 -27998
13981b7998R353K1536l2518j2422K5190J4283m4441n3504Q73N8681n32j5197m501
13968f1197M2980L1084O2392J9169j8796n3692k6695j5418p609L6825l661m5341
13956c9959l584J725J2961j3821r251k0998j3735R325L5667P491l3740K2002K4448
13943b1469M0264n1815n966K9050L2870J9603m5480p927J1506J1586n7315l3007
13931g8100M9977K5989P860M463n6481j3381j097L8599J5253j8884k8014l7481
13919i1297n710L9661N0623o882k9255k7153k6784M1744M3963K7290J2754n3679
13907b4725m3829L9002J9899K7304J6271J0247j6802n796j1640j5293J1012J2660
13895A8310K0509N389J5562R230k4781k3374J997N335K0647n616n9064m7103M9701
$$ plain form
13981 -27998 -18645 2891 -29627 -42049 -16859 -2576 -47017 -100521 -99648 -40967 -41499 -56696 -61197
13968 -61197 -18217 12867 75259 94428 75632 21940 -4755 -20173 -27782 9043 5382 -39959
13956 -39959 -43543 -41818 -28857 -42678 -51929 -72927 -86662 -77337 -41670 -34179 -67919 -45917 -21469
13943 -21469 18795 -33020 -38986 -9936 22934 42537 -2943 -10870 636 12222 -45093 -78100
13931 -78100 -28123 -2134 5726 10189 -46292 -59673 -60770 -22171 -6918 -25802 -53816 -91297
13919 -91297 -97007 -57346 -6723 -13605 -42860 -70013 -96797 -55053 -11090 16200 28954 -24725
13907 -24725 -68554 -29552 -9653 17651 33922 44169 27367 21571 9931 -5362 5650 18310
13895 18310 38819 44208 59770 69000 44219 20845 22842 28177 48824 43208 -15856 -62959 -13258
13882a3258K2520l1826j6804k4117l0997J8596N1898J4838K0740L98J7307j724
13870B7571n753Q352n1609r252n087N4345J0722j4519J255j6439J1313M6033j0391
13857D6541j1340o5391k5802K1221n879J517L7736j5544o517R754p669o06m574
13844b6553L94J926l8767L1575J7067k3359J6625J8160M804J1796j0046j5440
13832a1818m370j2641L968K883j1987k573j3973o622n248L0025k954M048J5845
13819a5417j9564J1585J6406J6082L16l9477l2034L958K4182r526p456J0822J4496
13806b5627j613K658Q422K0801J6896M160r833K9273L799k6455l2721K4605K5259
13793C9624n266L8767m2344l6354N121q860O26K0637k4431j4606p129k905l964
$$ plain form
13882 -13258 9262 -22564 -39368 -63485 -94482 -75886 -23988 -9150 11590 11988 29295 27571
13870 27571 21818 30170 -21439 -30691 -35778 18567 29289 14770 16025 -414 10899 56932 46541
13857 46541 35201 -30190 -55992 -34771 -40650 -39133 -1397 -16941 -23458 -13704 -21373 -21979 -26553
13844 -26553 -26159 -24233 -63000 -31425 -14358 -37717 -21092 -2932 1872 13668 3622 -11818
13832 -11818 -16188 -28829 -24861 -21978 -33965 -36538 -50511 -57133 -62381 -32356 -35310 -31262 -15417
13819 -15417 -34981 -23396 -6990 9092 9408 -30069 -62103 -58145 -33963 -43489 -50945 -40123 -25627
13806 -25627 -27240 -24582 -16160 4641 21537 25697 15864 45137 48936 22481 -10240 14365 39624
13793 39624 34358 73125 30781 -5573 -452 -9312 -8686 11951 -12480 -27086 -34215 -37120 -41084
13780d1084k1335r0K5506L3945L671l854J7818M67j3369J962K922l0552j6524
13767d0517p455L946k1422j5472N788N5878P020j3224r771L5951n578k574j6155
13754b3585J1902j3002m627M4781N371j756k405j2297k4238N249k4659o265J9120
13741b6411J1840J0927P070l1322L3012Q563j8152l5792j1611J1323K3394M2854
13729B5695j9101K1590K2006q845j7391J5254m1688l2931Q546K0827m042j1387
13717b1467o4726j1162L6397j9925n2503K5990O1426L412L4122L5414k0884k5072
13705a8978j7797M638J1360J8988K2239J5650j0422N969j5381J886J1307n037
13693B4422r040L221J5616K3259j0813l525m031J9990j6918k3658K9828L39j5231
$$ plain form
13780 -41084 -62419 -62509 -37003 -3058 613 -3241 14577 15044 1675 3637 6559 -23993 -40517
13767 -40517 -47972 -44026 -65448 -80920 -75132 -19254 -12234 -25458 -35229 722 -4856 -7430 -23585
13754 -23585 -11683 -24685 -29312 15469 20840 19084 16679 4382 -19856 -14607 -39266 -45531 -26411
13741 -26411 -14571 -3644 3426 -27896 5116 13679 -4473 -40265 -51876 -40553 -17159 25695
13729 25695 6594 28184 50190 41345 23954 39208 -2480 -35411 -26865 -6038 -10080 -21467
13717 -21467 -86193 -97355 -60958 -80883 -133386 -107396 -45970 -42558 -8436 26978 6094 -18978
13705 -18978 -36775 -32137 -20777 -1789 20450 36100 25678 31647 16266 18152 29459 24422
13693 24422 15382 18603 34219 57478 46665 43140 39109 59099 42181 18523 48351 48690 33459
13680C3459n431n8332j9324N635P306N1623L2784j0610k4789J608j4351j0930
13668a1352l4741j3975K6021N0793J205j4184P685K0070M2099K8k3734l2543m622
13655A2750J723m0745J997N418K8042N1861j6884n2758R660k7266L847q334L0622
13642f7K4381k302K9508r221l8517n929j1958J1186n472j4482l713Q445j1641
13629b9782l1016J1812Q3489L4396k6941j9223k793q323J0741l2948M80l3953
13617d4061J1565L2561Q698N1411l0989m8731j1511M5561K734J355o325m6663
13605c4395j0351M6293K9278M903l4034P43l014k2323M2705J6343m5085k5819
13593c4756k2995L250J5256J0786K4059K4062q971R280Q07P43k7853n195J1189
$$ plain form
13680 33459 28028 -30304 -49628 -43993 -36687 14936 47720 37110 12321 13929 -422 -11352
13668 -11352 -46093 -60068 -34047 16746 17951 3767 11452 31522 73621 73649 49915 17372 12750
13655 12750 14473 -26272 -24275 -18857 9185 61046 44162 -8596 1064 -26202 -22355 -30689 -67
13642 -67 24314 22012 51520 42299 3782 -2147 -14105 -2919 -8391 -22873 -26586 -18141 -29782
13629 -29782 -60798 -48986 34503 68899 41958 22735 19942 11619 22360 -10588 -10108 -44061
13617 -44061 -32496 65 8763 60174 29185 -19546 -31057 14504 17238 18593 12268 -34395
13605 -34395 -44746 1547 30825 35728 1694 2437 -577 -22900 19805 36148 -8937 -34756
13593 -34756 -57751 -54501 -39245 -28459 -4400 19662 10691 19971 20778 21521 -6332 -11527 -338
13580c38m7397j0327J0752M0986L7113O506k7688K7649K46J0113R38j6875J5618
13567D7296j639J5764j2240r88Q260l2954m3057L2437j2899K1909l3413n936K9988
13554A2528J2389k6748L817j5597j5087L2925K9297k5147N380j7575l1885m373
13542d0076L3586K1405j067o3445m3940J2330J7663L8986L0862l475R825k2074
13530i420O012r147M8582L2791j5950j6156J4742j2633l4347j1638q700k2193
13518c8057l3920M8349m877K0689N615j432M451l1996J4852m48K2513K010K6371
13505C4120p387l008j3440J4322K1756P224m0697j0261q546j5059m4405l7436
13493a02817J8486M4979N9925l081m2464j4204r884j3957K4795K5130j8689J640
$$ plain form
13580 -338 -47735 -58062 -47310 -6324 30789 37295 9607 37256 37502 47615 48553 31678 47296
13567 47296 45657 61421 49181 48193 56453 23499 -19558 12879 -20 21889 -11524 -17460 12528
13554 12528 24917 -1831 1986 -13611 -28698 4227 33524 8377 13757 -3818 -35703 -40076
13542 -40076 -6490 14915 13848 -49597 -93537 -81207 -63544 -24558 6304 2829 12654 -9420
13530 -9420 -3408 -12555 36027 68818 52868 36712 51454 38821 4474 -7164 -15864 -38057
13518 -38057 -71977 -23628 -28505 -7816 -2201 -3633 818 -31178 -16326 -16774 5739 7749 34120
13505 34120 26733 23725 10285 24607 46363 53587 12890 2629 -5917 -20976 -65381 -102817
13493 -102817 -84331 -39352 20573 17492 -24972 -39176 -49060 -63017 -38222 -13092 -31781 -30141
13481c0141Q275o790J3920j0851J0588k0138j9026K1330K8919l2008J7239J6191
13469b492m158K342m447Q995K282j8206n265N576k5317K989N7793r03n6894j8656
13455e6361K4159J7696p259L25L9761J4806k9133o3179j4211P758j1519N311J7621
13442e4225K8157N5827J7328O76P18m0619o4718K24J4387L0597L973J882J7372
13429A1579J2246l7881K210N558K242k1826k0546P8035L7391l485q114k4386l6865
13416c842O624K8841K4872J0367k0386J7192R276n9282m0303J2664J3088k4635
13404b5524L5425P117k3746K988r848m1717J0246L5709j6530l186J889J1751k814
13391a8240K3940L3296O631m1005k7202K569j7771k3469J6091N4434L0801j9840
$$ plain form
13481 -30141 -21866 -28656 -14736 -25587 -14999 -35137 -54163 -32833 -3914 -35922 -18683 -2492
13469 -2492 -6650 -4308 -8755 240 2522 -15684 -20949 -15373 -40690 -37701 20092 19189 -37705 -56361
13455 -56361 -32202 -14506 -21765 -21440 18321 33127 3994 -59185 -73396 -65638 -77157 -71846 -54225
13442 -54225 -26068 29759 47087 47763 48481 7862 -56856 -56632 -42245 -11648 -7675 -5793 11579
13429 11579 23825 -14056 -11846 -6288 -4046 -25872 -46418 31617 69008 65523 57409 33023 -3842
13416 -3842 2782 31623 56495 66862 46476 63668 72944 13662 -26641 -13977 -889 -25524
13404 -25524 9901 17018 -6728 -3740 -13588 -55305 -45059 -9350 -25880 -29066 -27177 -15426 -18240
13391 -18240 5700 38996 45627 4622 -22580 -20011 -37782 -61251 -45160 9274 40075 20235
13379B0235J2781K2182j6211o1689j0803K1662Q577M6487j2270k2379j554m3044
13367c6026M419K0788K4810K8600J0919j416j9668l8891P232K681J0051J4451
13355B7950K3451M9934J6473k8902j7069o7650l4799J1938M1527J4530k8723J7714
13343B6374J1851L024K2120k0685l3820n577R106j5847j9582m6736j4887q529
13331i3188J0268L5319j9200J5425l0255K4051j895o2781k819L1451J5553j2272
13319i0343J529J5036L735J6408Q697K9933r312r356j2428k554l444K6195J6749
13306i155O955o379J7153K7927k3392j3457K370k6821n307J4123J1484J5959j708
13293I752J3835o077P57j3903o622J118k1267j4462j9395J1864N6359L6213k9487
$$ plain form
13379 20235 33016 55198 38987 -22702 -33505 -11843 -3266 43221 30951 8572 7018 -36026
13367 -36026 -31607 -10819 13991 42591 53510 52094 32426 -6465 767 3448 13499 27950
13355 27950 51401 101335 117808 88906 71837 4187 -30612 -18674 22853 37383 8660 26374
13343 26374 38225 41249 63369 42684 8864 3287 12393 -3454 -23036 -69772 -84659 -93188
13331 -93188 -82920 -47601 -66801 -51376 -81631 -57580 -59475 -122256 -125075 -93624 -78071 -90343
13319 -90343 -88814 -73778 -70043 -53635 -44938 -15005 -24317 -33673 -46101 -48655 -52099 -25904 -9155
13306 -9155 -2200 -8579 8574 36501 13109 -348 2022 -24799 -30106 -15983 -4499 11460 9752
13293 9752 23587 17510 18267 4364 -2258 -1140 -22407 -36869 -56264 -44400 11959 48172 18685
13280A8685j0602K5710M5994k5774n9454j9320L1414n286l2415N281K4553K1957
13268B0743p766k7921J1632N4452K0520n794p3886n0805j0337M6068M165O248
13256a2681K9327L6902k6564l109l5571o345q393L4218J8267J9345l7426N926
13244A3896K0985O52K6585K263l0597p6383k1316L1183P80m3314j3900N1274N1965
13231A4073j6261r759j8254J5008K5639l347j7953M2188k6130l9575P3431K0651
13219E9711l6398j7367J8621l080K9521j824l3259l869j7198k8345k9213p204
13207f9904n651J5532M7653K9768J1626m3063j6N26l5300l710J0283M987M730
13194c2539m152K5832L70j9933J207j7289Q687R028L6549N199k6195K5510q718
$$ plain form
13280 18685 8083 33793 79787 54013 -5441 -24761 6653 1367 -31048 -25767 -1214 20743
13268 20743 12977 -14944 -3312 51140 71660 65866 -8020 -58825 -69162 -23094 -18929 -12681
13256 -12681 16646 53548 26984 23875 -11696 -18041 -26434 7784 26051 45396 7970 13896
13244 13896 34881 35533 62118 64381 33784 -42599 -63915 -32732 -31952 -75266 -89166 -37892 14073
13231 14073 -2188 -11947 -30201 -15193 10446 7099 -10854 31334 5204 -34371 39060 59711
13219 59711 23313 5946 24567 21487 51008 49184 15925 12056 -5142 -33487 -62700 -69904
13207 -69904 -75555 -60023 -12370 17398 29024 -14039 -14055 -13529 -48829 -52539 -42256 -37269 -32539
13194 -32539 -36691 -10859 -10489 -30422 -29215 -46504 -37817 -28789 7760 12959 -13236 12274 3556
13181C556j1167p867J6138K8301k2757p6446l9938K4852P812N0183L4442l802
13169C307M536o271J5605K9385n642l5974J6804j634n0294Q456M7936J1181l524
13156C3871r292k1194n915k2195l837l371j0591j778J5816J3712k2789j8149K9099
13143b6613j2703L371K3249M0434J8911l9389o954J2288P301p696k5567Q819Q551
13130D002r714l6899j089J4062j900J2344K4845J7471k797R0l5803k013N76K9314
13116A2489P52k0229j3114j5502J7177J7845l1764K2207K3374l033j4973j5027
13104a9798k247J1354K435n915M6933K9648k2611j870k7169l8547O385J8357K2007
13091A8962k109j491O692M521k1467k4594m085n508o828j524o529L3344J6652
$$ plain form
13181 3556 -7611 -15478 660 28961 6204 -70242 -110180 -85328 -77516 -27333 7109 3307
13169 3307 7843 1572 17177 46562 40920 4946 21750 20116 -30178 -21722 26214 37395 33871
13156 33871 24579 3385 -2530 -24725 -28562 -31933 -42524 -44302 -28486 -14774 -37563 -55712 -26613
13143 -26613 -39316 -35945 -12696 27738 46649 7260 306 12594 19895 12199 -13368 -4549 4002
13130 4002 -5712 -42611 -43700 -29638 -31538 -19194 5651 23122 20325 20415 -15388 -17401 -16825 12489
13116 12489 13241 -6988 -20102 -35604 -18427 -582 -32346 -10139 13235 10202 -4771 -19798
13104 -19798 -22045 -10691 -8256 -14171 32762 62410 39799 37929 10760 -27787 -21402 -3045 18962
13091 18962 16853 15362 22054 26575 5108 -19486 -23571 -29079 -35907 -37431 -43960 -10616 6036
13078F036L935J719k2949j6278j3093J4311M5420M301K544l9703m0541o793j7465
13065g8556L05M1970J433l4457N420M2070L946j7043L1801m581m0254k9516P503
13052f9959K8820K9490k0305j0742J5491L4070J0157k6845k7820n679k178o46
13040d6146L5661J2106j986K4681J0293K540J8030j736k2578K568Q806m0342j2552
$$ plain form
13078 6036 9971 11690 -11259 -27537 -40630 -26319 19101 23402 25946 -13757 -54298 -61091 -78556
13065 -78556 -78251 -36281 -34848 -69305 -63885 -21815 -17869 -34912 -3111 -7692 -47946 -77462 -69959
13052 -69959 -41139 -11649 -31954 -42696 -27205 6865 17022 -9823 -37643 -43322 -45500 -46146
13040 -46146 -10485 1621 -365 24316 34609 37149 55179 53443 30865 33433 42239 1897 -10655
$$ [...]
##END NTUPLES=NMR SPECTRUM
##END=
