##TITLE=Analysis number 322637
Compound Code cc 28509
Project Code adrs
Chemist Name fudan
##JCAMPDX= 6.0         $$ Bruker NMR JCAMP-DX V2.0
##DATA TYPE= NMR SPECTRUM
##DATA CLASS= NTUPLES
##ORIGIN= Bruker BioSpin GmbH
##OWNER= nmr
$$ XWIN-NMR		Version 3.5
$$ Fri Oct 13 08:38:17 2006 GMT Daylight Time (UT+1h)  MAYBRIDGE\nmr@NMR_250MHZ
##.OBSERVE FREQUENCY= 250.131544655141
##.OBSERVE NUCLEUS= ^1H
##.ACQUISITION MODE= SIMULTANEOUS (DQD)
##.ACQUISITION SCHEME= undefined
##.AVERAGES= 16
##.DIGITISER RES= 18
##SPECTROMETER/DATA SYSTEM= dpx250
##.PULSE SEQUENCE= zg30
##.SOLVENT NAME= CDCl3
##.SHIFT REFERENCE= (INTERNAL, CDCl3, 0, 16.522)
##AUDIT TRAIL= $$ (NUMBER, WHEN, WHO, WHERE, WHAT)
$$ ##TITLE= Audit trail, XWIN-NMR		Version 3.5
$$ ##JCAMPDX= 5.01
$$ ##ORIGIN= Bruker BioSpin GmbH
$$ ##OWNER= nmr
$$ C:\u/data/dgb/nmr/ADRS/90/pdata/1/auditp.txt
$$ ##AUDIT TRAIL=  $$ (NUMBER, WHEN, WHO, WHERE, WHAT)
(   1,<2006-10-13 08:37:50.57 +100>,<MAYBRIDGE\nmr>,<NMR_250MHZ>,
      <created by zg, POWCHK disabled, PULCHK disabled
       configuration hash MD5:
       49 4B E0 1D 92 C2 6B 37 9F E6 65 BC 52 41 86 1D
       data hash MD5: 64K
       AA 48 C9 DE FD B4 89 A1 47 5C 54 5C 4F 65 B6 71>)
(   2,<2006-10-13 08:38:03.51 +100>,<MAYBRIDGE\nmr>,<NMR_250MHZ>,
      <Start of raw data processing
       ef LB = 0.3 FT_mod = 6 PKNL = 1 SI = 32K 
       data hash MD5: 32K
       42 46 92 A6 88 10 41 6A 34 AB 39 8E 45 57 5D 68>)
(   3,<2006-10-13 08:38:05.07 +100>,<MAYBRIDGE\nmr>,<NMR_250MHZ>,
      <apk 
       data hash MD5: 32K
       E7 65 5B D3 0A A5 93 A5 07 8C DD ED 3D 2B 4C 53>)
(   4,<2006-10-13 08:38:05.96 +100>,<MAYBRIDGE\nmr>,<NMR_250MHZ>,
      <abs ABSG = 5 
       data hash MD5: 32K
       48 55 54 36 A0 2C 17 39 BF D8 13 14 37 8E B7 35>)
$$ ##END=
$$ 
$$ hash MD5
$$ E1 FA 4A DC 82 04 D1 54 38 08 FF 18 53 7A AF C5
##$RELAX= 
##$RELAX= 
##$RELAX= 
##$RELAX= 
##$RELAX= 
##$RELAX= 
##$RELAX= 
$$ Bruker specific parameters
$$ --------------------------
##$DU= <C:\u>
##$EXPNO= 90
##$NAME= <ADRS>
##$PROCNO= 1
##$TYPE= <nmr>
##$USER= <dgb>
##$AMP= (0..31)
100 100 100 100 100 100 100 100 100 100 100 100 100 100 100 100 100 100 
100 100 100 100 100 100 100 100 100 100 100 100 100 100 
##$AQSEQ= 0
##$AQ_mod= 3
##$AUNM= <au_zg>
##$AUTOPOS= <5 >
##$BF1= 250.13
##$BF2= 250.13
##$BF3= 250.13
##$BF4= 250.13
##$BF5= 500.13
##$BF6= 500.13
##$BF7= 500.13
##$BF8= 500.13
##$BYTORDA= 1
##$CFDGTYP= 0
##$CFRGTYP= 5
##$CHEMSTR= <none>
##$CNST= (0..31)
1 1 145 1 1 1 1 1 1 1 1 1 1 1 1 1 1 1 1 1 1 1 1 1 1 1 1 1 1 1 1 1 
##$CPDPRG= <>
##$CPDPRG1= <>
##$CPDPRG2= <>
##$CPDPRG3= <>
##$CPDPRG4= <mlev>
##$CPDPRG5= <mlev>
##$CPDPRG6= <mlev>
##$CPDPRG7= <mlev>
##$CPDPRG8= <mlev>
##$CPDPRGB= <>
##$CPDPRGT= <>
##$D= (0..31)
0 1 0 0 0 0 0 0 0 0.06 0 0 0 0 0 0 0.0002 0 0 0 0 0 0 0 0 0 0 0 0 0 0 
0 
##$DATE= 1160725069
##$DBL= (0..7)
120 120 120 120 120 120 120 120 
##$DBP= (0..7)
150 150 150 150 150 150 150 150 
##$DBP07= 0
##$DBPNAM0= <>
##$DBPNAM1= <>
##$DBPNAM2= <>
##$DBPNAM3= <>
$$ [...]
##$SUBNAM7= <"">
##$SUBNAM8= <"">
##$SUBNAM9= <"">
##$SW= 20.6930455092707
##$SWIBOX= (0..15)
0 0 3 0 0 0 0 0 0 0 0 0 0 0 0 0 
##$SW_h= 5175.983436853
##$TD= 65536
##$TD0= 1
##$TE= 683.16
##$TE2= 300
##$TE3= 300
##$TEG= 300
##$TL= (0..7)
0 120 120 120 120 120 120 120 
##$TP= (0..7)
150 150 150 150 150 150 150 150 
##$TP07= 0
##$TPNAME0= <>
##$TPNAME1= <>
##$TPNAME2= <>
##$TPNAME3= <>
##$TPNAME4= <>
##$TPNAME5= <>
##$TPNAME6= <>
##$TPNAME7= <>
##$TPOAL= (0..7)
0.5 0.5 0.5 0.5 0.5 0.5 0.5 0.5 
##$TPOFFS= (0..7)
0 0 0 0 0 0 0 0 
##$TUNHIN= 0
##$TUNHOUT= 0
##$TUNXOUT= 0
##$USERA1= <user>
##$USERA2= <user>
##$USERA3= <user>
##$USERA4= <user>
##$USERA5= <user>
##$V9= 5
##$VALIST= <valist>
##$VCLIST= <CCCCCCCCCCCCCCC>
##$VD= 0
##$VDLIST= <DDDDDDDDDDDDDDD>
##$VPLIST= <PPPPPPPPPPPPPPP>
##$VTLIST= <TTTTTTTTTTTTTTT>
##$WBST= 1024
##$WBSW= 4
##$XGAIN= (0..3)
0 0 0 0 
##$XL= 0
##$YL= 0
##$YMAX_a= 496973
##$YMIN_a= -390113
##$ZGOPTNS= <>
##$ZL1= 120
##$ZL2= 120
##$ZL3= 120
##$ZL4= 120
##$ABSF1= 16.522
##$ABSF2= -4.171173
##$ABSG= 5
##$ABSL= 3
##$ALPHA= 0
##$AQORDER= 0
##$ASSFAC= 0
##$ASSFACI= 0
##$ASSFACX= 0
##$ASSWID= 0
##$AUNMP= <proc_1d>
##$AZFE= 0.1
##$AZFW= 0.1
##$BCFW= 0
##$BC_mod= 0
##$BYTORDP= 0
##$COROFFS= 0
##$CY= 12.5
##$DATMOD= 1
##$DC= 0
##$DFILT= <>
##$DTYPP= 0
##$F1P= 14.0000005364418
##$F2P= -0.99999901652339
##$FCOR= 0.5
##$FTSIZE= 32768
##$FT_mod= 6
##$GAMMA= 0
##$GB= 0
##$INTBC= 1
##$INTSCL= 1
##$ISEN= 128
##$LB= 0.3
##$LEV0= 0
##$LPBIN= 0
##$MAXI= 10000
##$MC2= 0
##$MEAN= 0
##$ME_mod= 0
##$MI= 0
##$NCOEF= 0
##$NC_proc= -4
##$NLEV= 6
##$NOISF1= 0
##$NOISF2= 0
##$NSP= 0
##$NTH_PI= 0
##$NZP= 0
##$OFFSET= 16.522
##$PC= 1
##$PHC0= -43.99606
##$PHC1= 5.872296
##$PH_mod= 1
##$PKNL= yes
##$PPARMOD= 0
##$PSCAL= 4
##$PSIGN= 0
##$REVERSE= no
##$SF= 250.13
##$SI= 32768
##$SIGF1= 0
##$SIGF2= 0
##$SINO= 400
##$SIOLD= 32768
##$SREGLST= <1H.CDCl3>
##$SSB= 0
##$STSI= 32768
##$STSR= 0
##$SW_p= 5175.98343685301
##$SYMM= 0
##$S_DEV= 0
##$TDeff= 65536
##$TDoff= 0
##$TI= <Analysis number 999999
Compound Code 99
Book Reference 9
Project Code 9>
##$TILT= no
##$TM1= 0
##$TM2= 0
##$TOPLEV= 0
##$USERP1= <user>
##$USERP2= <user>
##$USERP3= <user>
##$USERP4= <user>
##$USERP5= <user>
##$WDW= 1
##$XDIM= 32768
##$YMAX_p= 449045048
##$YMIN_p= -433538
$$ End of Bruker specific parameters
$$ ---------------------------------
##NTUPLES= NMR SPECTRUM
##VAR_NAME=  FREQUENCY,     SPECTRUM/REAL,   SPECTRUM/IMAG
##SYMBOL=    X,             R,               I
##VAR_TYPE=  INDEPENDENT,   DEPENDENT,       DEPENDENT
##VAR_FORM=  AFFN,          ASDF,            ASDF
##VAR_DIM=   32768,         32768,           32768
##UNITS=     HZ,            ARBITRARY UNITS, ARBITRARY UNITS
##FACTOR=    0.157963299565203, 1,           1
##FIRST=     4132.6476996994, 0,             0
##LAST=      -1043.33573715361, 0,           0
##MIN=       -1043.33573715361, -433538,     0
##MAX=       4132.6476996994, 449045048,     0
$$ Real data points
##PAGE= N=1
##DATA TABLE= (X++(R..R)), XYDATA
$$ [...]
23046I8730J23578j1812k1685k9914r9385n8620q4091O7678J46375l9406J919
23035I3367K2674l0529j24298l2175N0458k1805n5523k7027Q0652j2524o782k3090
23023h6602M4272J63914P1810m7348j39769r2834r419j3321Q7302K0450o7852
23012f9397k9367j01716m8625Q8639P6627M6215o6777r593M1956Q6816l9199J7371
23000g050N3942n1138l1460K303j00520j06679k0667N5222K1340P9130Q3092M2978
22988B0493n8528j7765M2443r7563q8029k1416j3238j9086N476J89213R8487L7847
22976G8334n9404l2592j2980m5128n045J04798l6514p2290N1382k0762R6479J6975
22964F3253j1624Q0041p929j9727m5531m2827J8747j8592q3399p623o0530M5763
$$ y = [98730, 222308, 210496, 188811, 158897, 59512, 892, -83199, -15521, 130854, 91448, 93367, 116041, 85512, -38786, -70961, -20503, -42308, -97831, -124858, -44206, -56730, -63512, -86602, -42330, 121584, 193394, 146046, 6277, -86557, -95976, -109297, -21995, -1545, -69397, -98764, -200480, -249105, -160466, -83839, -37624, -104401, -113994, -72038, 14778, -24421, -7050, 46892, -4246, -35706, -33403, -133923, -240602, -261269, -206047, -184707, -105577, -22485, 20493, -38035, -55800, -13357, -110920, -198949, -220365, -233603, -252689, -247213, -58000, 40487, 78334, 18930, -13662, -26642, -71770, -76815, 27983, -8531, -80821, -29439, -50201, 46278, 63253, 51629, 131670, 123741, 104014, 58483, 15656, 34403, 15811, -67588, -75211, -135741, -89978]
22952h9978O5299l3869J47094J48502K1038q3707r6376p1988Q1064q6519k1179
22941b0619J20829O6418m2867j35921j45401j6764j7074N3641P835k2535J01283
22930e1175Q8655n6784J5737r898p7704n2704j1259M6580N0186m1698N1632J5048
22918c3384m4768r465N263N6281O9830Q1858p2473r8372K7915M8142j4741j1070
22906E016l809J4782O638m9433M0764J3013m9846J04335L9850k3420K3683q352
22894A13221k6875p7448l4669Q698R158j9127l3601k1610j3573M960J6104O4988
22882i774O2012P9459l0812j0763k3119q8319m9415R6896k842j0091k4827o0247
22870g1842J03512R1042q1241K3534j1504j57434P1307Q8329M7031p4441m7285
$$ y = [-89978, -24679, -58548, 88546, 237048, 258086, 174379, 78003, 6015, 87079, 560, -20619, 100210, 166628, 123761, -12160, -157561, -174325, -191399, -137758, -129923, -152458, -51175, 37480, -19304, -3567, -13465, -91169, -143873, -155132, -108552, -58366, -100064, -48432, -33384, -78152, -87617, -82354, -26073, 43757, 125615, 53142, -45230, -17315, 30827, 16086, 5016, 1207, 15989, 22627, -26806, 13958, 26971, -22875, 81460, 121310, 97890, 121573, 113221, 86346, 8898, -25771, -17073, -7915, -27042, -60643, -82253, -95826, -90866, -74762, -9774, 52238, 131697, 100885, 90122, 67003, -21316, -70731, 26165, 23323, 13232, -11595, -71842, 31670, 122712, 41471, 65005, 53501, -103933, -32626, 55703, 102734, 28293, -18992]
22859a8992j10340m4961j5179J08889J11953o35j3349l486M0965L873o427l3201
22847A9110m9494O567K9432l1020o9599l0988K1781m631j9663R143J17989L1679
22835C0306p5013q7336R627l7640q9647L2251J22995K329j1693L0291O0229j7599
22823c0900j8500M1151J94042N5265r1368p6424k5521q6501m3253J5295n3039
22812a19753O8174J10011J02401M5283N2493j20948n4332l3007l3083M7999j1036
22801E4202q0887L3385J08282l7866l9172k5777p3149K9347P3539K8331N5423
22790A25658m9903q4081m2205r217O6987o4515o3103O3883n8109n1046Q0123m357
22778h9885m6931j128M4438O4990K7874N7416K1081l9162Q9127r5021J629Q9735
$$ y = [-18992, -129332, -174293, -189472, -80583, 31370, 30735, 17386, 13900, 54865, 58738, 52311, 19110, -30384, -23817, 5615, -25405, -95004, -125992, -104211, -108842, -128505, -119362, -1373, 30306, -44707, -132043, -122416, -160056, -249703, -217452, -94457, -92128, -103821, -73530, -13301, -30900, -49400, -8249, 185793, 241058, 149690, 73266, 47745, -38756, -82009, -66714, -119753, -51579, 58432, 160833, 206116, 258609, 137661, 83329, 50322, 17239, 65238, 54202, -26685, 6700, 114982, 77116, 37944, 12167, -60982, -31635, 41904, 70235, 125658, 75755, -8326, -50531, -59748, 7239, -57276, -120379, -56496, -114605, -165651, -85528, -89885, -136816, -137944, -93506, -28516, -642, 56774, 77855, 38693, 127820, 32799, 34428, 124163]
22766A24163m6449K1529P108j5675q0549k3859l1710o1546p337o3011p544m2322
22754b27202J15416K0573M3184M7095J3886J9517n8438j24710n5817N0619R1131
22743f4746j18570r5315L1761k3256J42475P3141J5286J6064m6144q5338L9468
22732a15174N8082K4187Q2999J0120q8686J0247L3111j726m611K6458l4571m5604
22720d5168k3808Q8123l5415O9260l6974j16931j9119N9154k4087j3153n4323
22709a52441r3141J27549K04917j8135N3998K0601N185K9589r7411j17486m6820
22698h3595L3776o5344Q2601Q0896m216j58018p8932N5175P1195K3433n7779k865
22686a03673Q3091P8624L8969k1788m6543q1668k7476n946J2098R1517N8847o5193
$$ y = [124163, 77714, 99243, 106351, 90676, 10127, -13732, -45442, -106988, -114325, -177336, -184880, -227202, -111786, -91213, -48029, -934, 12952, 32469, -25969, -150679, -206496, -155877, -64746, -183316, -278631, -246870, -270126, -127651, -54510, -39224, -23160, -69304, -154642, -115174, -57092, -32905, 50094, 60214, -28472, -18225, 14886, 13160, 8549, 35007, 436, -45168, -68976, 19147, -16268, 52992, 16018, -100913, -120032, -60878, -84965, -98118, -152441, -245582, -118033, 86884, 68749, 122747, 143348, 148533, 178122, 80711, -36775, -83595, -49819, -115163, -32562, 48334, 44118, -113900, -192832, -137657, -66462, -43029, -100808, -103673, -20582, 58042, 97011, 75223, 28680, -52988, -80464, -86410, -74312, 17205, 76052, 10859]
22674A0859o438p7430q5261O5103M0596J0172k781j738k51o0996J5588R5506Q7285
22661I0214j6500n4486m7043n1892L8047J29843Q8q0848O2452K5149j00690k9005
22649c4671Q8173p122K1052l6955n6308J32144Q0954j92006m9658M2011m3943
22638e6329O9806J10405m8328j1349j032N8233r433j28239r494P5895M3765J331
22626I5231Q015k341q8002l0108M7151J05342l7278L2721L6068m291J18793k7803
22614B53498N220j30875j27355k308m5876o255L3101R1202k8982k9513o2201l6031
22602h6375p6248R8530J17360n4588m6617R380O992J2636K4153r5731n6759m6430
22590a93697M8174P2471l938K4656P4466j01182k5642O6574l7290J2591P0558
$$ y = [10859, 4421, -73009, -158270, -93167, -52571, -42399, -45180, -46918, -47169, -108165, -92577, 2929, 90214, 73714, 19228, -27815, -79707, -41660, 88183, 88271, 7423, 69875, 95024, -5666, -34671, 53502, 46380, 67432, 30477, -25831, 106313, 187267, -4739, -54397, -12386, -56329, 13477, 123882, 75554, 64205, 63173, 121406, 111973, -16266, -25760, 50135, 93900, 95231, 103246, 100905, 12903, -17205, 29946, 135288, 98010, 130731, 166799, 162508, 281301, 253498, 258718, 127843, 488, -1820, -47696, -53951, -20850, 70352, 41370, 11857, -50344, -86375, -162623, -64093, 53267, -1321, -47938, -38558, -31566, -18930, 5223, -90508, -147267, -193697, -145523, -73052, -76990, -52334, 22132, -79050, -104692, -38118, -75408, -62817, 7741]
22579G741p26N913j0184R309q6452J1759J00325L0957n2789n671j086o973J3560
22566A5683k2733J5860m953J6682k3926j0912O056n8161j07463L0010J41524p5947
22554g8280l6736k8055J43355K1294p960J05238K7739o3610p396n8531l0625O3650
22542E0083q5054n0691N9725l6531o02R7702Q419m4130m4727M0370k3779j4575
22530d3790n1279p8539Q4152J26665M4576M2692j04483n5140j05676q2525R4681
22519a28666l4593R369P5310j4592L941J3545l3094O635l3234M3059Q491o756
22507i0585o9633O7990J00174q5661P1352L1437k4530q2586L013J28610O4633
22496A14214o1594k7673m7744q6070M9158P4398J5067m1067j4412L8704l468L5430
$$ y = [7741, 7015, 12928, 2744, 12053, -74399, -62640, 37685, 68642, 15853, 10182, 9096, 2123, 15683, -7050, 8810, 3857, 20539, -3387, -14299, -8243, -66404, -173867, -143857, -2333, -78280, -115016, -143071, 284, 21578, 13618, 118856, 146595, 82985, 75589, 17058, -13567, 50083, -34971, -85662, -25937, -62468, -63070, 34632, 43051, -1079, -45806, -5436, -29215, -43790, -95069, -173608, -89456, 37209, 81785, 124477, 19994, -35146, -140822, -223347, -128666, -163259, -153890, -78580, -93172, -89231, -75686, -108780, -102145, -135379, -92320, -83829, -90585, -160218, -92228, 7946, -77715, -6363, 25074, 544, -82042, -79029, 49581, 114214, 52620, 24947, -22797, -108867, -59709, 14689, 29756, -11311, -25723, 12981, 9513, 44943]
22484D4943n5667n4521K6676p599J5031m6069j01519L9157O7731k5861j9567J21437
22472D172J16348N9499k9145M588q9163o8057J25639P5592n5329l6972J9948n4871
22460G2249j18186j2315Q0613l0032p1958O0241K5216k0993K2716o2027J6326
22449c8150K6821n1823j38206J3955J18208J29937J45035N7186o8637j85098q9954
22438h0726J14179N7757r660O7994P5783j9898l6601K1542m7698j49307n6636
22427f3271j425j6226j3731K1770R8446J35060R336j70657k9291q4089K8140O8176
22415a7762O202q527o3237o9343K7511P8448J09796J15373o8985p2158j338p8618
22403d2638j10871m225n477J7096J03248K4582p9536q6980Q1256M5389q737L5729
$$ y = [44943, -10724, -65245, -38569, -46168, -31137, -77206, -178725, -139568, -71837, -97698, -117265, 4172, 120520, 180019, 150874, 155462, 66299, -1758, 123881, 199473, 144144, 107172, 127120, 72249, -45937, -58252, 22361, -7671, -79629, -19388, 5828, -15165, 7551, -54476, -38150, -11329, -63152, -201358, -187403, -69195, 60742, 205777, 262963, 194326, 9228, -80726, 33453, 91210, 81550, 149544, 225327, 205429, 168828, 190370, 142672, -6635, -63271, -64696, -80922, -94653, -72883, 25563, 160623, 169959, -698, -29989, -114078, -85938, -17762, -11560, -20087, -83324, -152667, -125156, -46708, 63088, 178461, 109476, 37318, 35980, -42638, -153509, -157734, -163211, -146115, -42867, -18285, -97821, -184801, -103545, -58156, -66893, -31164]
22391c1164L7502J11953L4806n8012l7587m5679J4227J3237o3714o0451L4483
22380e0399R4050Q9993O6M1309r5159m6661O7176M1632m8094K1743M1034N6613
22368B13303m0899p9970p6898o7440l5651Q0258K4806j46802o5164P1698r196
22357a31955p544J66381N3708q8626m2801L7449q3392q6719J07503J14724l6593
22346B135j29669J7043P2955P7175J5837n7478m7575k227j3317o822k2401M5655
22334d8689N7748m6q9448j32009l2838O5385P7009j7221q3547J5002N2406M5564
22322i0684M0607N5840M6211o0101k7634P5981P877P0425p5398p703J8254k7527
22310B6148l0200P3474l6605o628j5304j5510l8425r5987N9599J44958L741K901
$$ y = [-31164, 6338, 118291, 153097, 95085, 57498, 11819, 26046, 39283, -24431, -84882, -50399, 43651, 133644, 133710, 175019, 79860, 33199, 100375, 142007, 93913, 115656, 156690, 213303, 172404, 92434, 15536, -51904, -87555, -7297, 17509, -129293, -194457, -122759, -131955, -139499, 26882, 80590, -8036, -50837, -13388, -96780, -183499, -75996, 38728, 2135, -127534, -110491, -37536, 39639, 55476, -2002, -49577, -51804, -65121, -71943, -94344, -48689, 9059, 9013, -80435, -212444, -245282, -179897, -102888, -120109, -203656, -188654, -136248, -90684, -50077, 5763, 51974, -8127, -35761, 40220, 48097, 118522, 43124, 35421, 53675, 26148, -4052, 69422, 32817, 26189, 10885, -4625, -43050, -139037, -79438, 65520, 69261, 72162]
22298G2162J2160K6577j08792r6973m811j05420o6995Q1497J03131M1915L9894
22287e655j9215j1978q695q9533k258M2346J34041n1186o2034O1294K8492L9590
22275E5209p276o3017J2298k1939R292R65m8013J01339J01257o266m4774J3631
22263A02706R8741K38568L6778j94026j57050q7084q3130l2229M375N3252l9711
22252e8810M7662J1072J07871l273j0546m1553R2023J05118j63510o1615P5634
22241A00073k5855j63508K3160P3298K7546P6393L1056n452q4172o8571o2105
22230g8137M953N5223j2439r6294m296Q1802Q5623k9830l4537Q775k3093l6863
22218g9113P5670L1751r1807l2475L7586K2209M2710O5918J4360O7013J4378p2112
$$ y = [72162, 84322, 110899, 2107, -94866, -99677, -205097, -272092, -190595, -87464, -45549, -5655, -24870, -36848, -45543, -135076, -137334, -94988, 39053, -12133, -74167, -12873, 15619, 55209, 47933, -15084, -2786, -24725, -15433, -14468, -62481, 38858, 140115, 133849, 89075, 102706, 201447, 440015, 476793, 282767, 125717, 38633, -44497, -76726, -72351, -19099, -58810, -11148, -76, 107795, 104522, 93976, 52423, 144446, 249564, 86054, 24439, 100073, 74218, -89290, -66130, 7168, 34714, 111107, 142163, 136711, 52539, -16032, -78137, -73184, -17961, -30400, -126694, -130990, -49188, 36435, 6605, -27932, -19157, -42250, -79113, -3443, 28308, -63499, -95974, -58388, -36179, 6531, 72449, 86809, 153822, 168200, 96088]
22206I6088o4392j9536j01072o1200P8302Q4824j23940m6033q4371P2528J06723
22195f2079l2451R3534k5555m9486P4362M4748M5999n4098j15356p9874L9023
22184a21233N2632j3583L0761M2406j21943j2480L4259O1667j2526k7844Q457
22173g9427R7666J8922n2889l1527L9553R3560m4309j3388n869J3413p1029l0177
22161f5501M9745j365L5315n2737K7092p0027r4347P2060L7707Q3195p4576k8944
22149h2383L6122J7670P3065M3329l1408j7288j3861n2814l5116o598L5381k2563
22137e6464P6823m6384k7513P8709o1022P0530Q1504q3743j06376n3224P495j49
22125a19814M6509m309k7565q7359P6150L4445L6685j6887L165O2894M0353j0236
$$ y = [96088, 31696, 12160, -88912, -150112, -71810, 13014, -110926, -156959, -241330, -168802, -62079, -94530, -996, -26551, -76037, -1675, 43073, 89072, 34974, -80382, -160256, -121233, -68601, -82184, -51423, -9017, -130960, -143440, -109181, -47514, -60040, -87884, -79427, 18239, 37161, -15728, -47255, -7702, 85858, 41549, 28161, 22292, 35705, -35324, -65501, -15756, -17121, 18194, -34543, -7451, -77478, -171825, -99765, -62058, 21137, -53439, -82383, -46261, -28591, 44474, 87803, 56395, 39107, 25246, -27568, -62684, -69282, -33901, -56464, 20359, -26025, -53538, 25171, -35851, 34679, 116183, 32440, -73936, -127160, -119665, -119814, -73305, -77614, -105179, -192538, -116388, -81943, -45258, -62145, -58980, 3914, 44267, 34031]
22113C4031j3179k6216p6106j3705K9124j6133L2176J08201M679K2358j0473o8075
22101F682o3523l5673L0804L3964l7993n7038P8322Q5923p1057K5893M4376m7635
22089f955q3038J3773P1536P8239j4485q2566l7357o0313j5549j262Q4800R693
22077d3484K3330P0983J1098m0507P8942R1826p6277o0799n4541N605R8010m9652
22065E4534j42038M7852j27468r9117M845P1979N0447J0416K6867l5738M6227
22054i1194J24776R573m5698l0227r009M6372J0308p7110M514J2066r7528n567
22042a48724R4054L9750j5164K3053P5579J04757k0742q9061K8656K163q4970
22031I351k6761O5882M5866r9138m0459M286R1385M9874l0380j54379o8034L2052
$$ y = [34031, 20852, -5364, -81470, -95175, -66051, -82184, -50008, 58193, 62872, 85230, 74757, 6682, -56841, -92514, -61710, -27746, -65739, -122777, -44455, 41468, -29589, -3696, 40680, -6955, -89993, -76220, -4684, 73555, 59070, -23496, -60853, -121166, -136715, -137977, -53177, -43484, -20154, 50829, 61927, 21420, 100362, 192188, 115911, 55112, 571, 6176, 104186, 54534, -87504, -39652, -167120, -266237, -261392, -189413, -138966, -128550, -101683, -137421, -91194, 33582, 43155, -2543, -32770, -41779, 4593, 14901, -62209, -57695, -45629, -143157, -148724, -54670, -14920, -30084, -7031, 68548, 173305, 152563, 63502, 92158, 94321, 9351, -17410, 48472, 94338, -4800, -45259, -40973, 50412, 100286, 69906, -84473, -152507, -120455]
22019a20455o5868P494J43192O3334J2855j9788J5976o2382n2525M0958M2785
22008E576Q0581N9591l6435n0087j5091m3416M3221N9421Q7913o0288r7220o5019
21996c1253L9565J26913J5780r4558r3501P7645N3965n4130m4862m2947k5949
21985g3332n069O157j5180l2342p1098n8547j6855J9652P1555K1716Q8522O0834
21973c987Q7626j304j4893n5936l4835q478O3806K1375k325N692l2349k3990o688
21960f286l0863M9133j8592k5404n6280n1703Q817J2948J24264K7705k6865N5452
21948F2326n7347r01k4436M9400K1237k1285K4320O3996o135o6660K6958K4261
21936I5734j4619k8910j12382N9814Q6995K4131R7313m5404l4802n2978P0401
$$ y = [-120455, -186323, -178829, -35637, 27697, 40552, 20764, 36740, -25642, -78167, -37209, 5576, 86157, 145748, 109313, 59226, 44135, 719, 43940, 103361, 191274, 130986, 33766, -31253, 8312, 135225, 151005, 56447, -37054, 40591, 94556, 40426, -4436, -47383, -73332, -78401, -72244, -87424, -119766, -190864, -249411, -266266, -246614, -175059, -153343, -64821, -3987, 83639, 82335, 67442, 11506, -23329, -31807, 31999, 53374, 51049, 56741, 24392, 402, -6286, -37149, 11984, -6608, -32012, -88292, -139995, -131178, -118230, 6034, 33739, 6874, 62326, 4979, 4078, -20358, 29042, 50279, 28994, 53314, 117310, 111175, 44515, 71473, 95734, 81115, 52205, -60177, -363, 86632, 110763, 208076, 162672, 127870, 74892, 145293]
21925A45293j08056j22056m6947k3332R6030l5950j02454n9888R1007P5378N1309
21914c9666J6466J02743j2701j7002k4102k7154j28173L026o624N94J13799N0758
21902C1964m1017j5937P3591J36762M1027p1150j0206O8238O335k1174n5774j40274
21890B385K510O6671Q1325j05669j63225p7341L0735K4673Q1737J04094O914J5479
21878G0288L1861l7984m4548n338K2016p8612m6358l1247k7273N6066J47063M9069
21866A05003J7480M022q0298L14m2999q4360J20549M6158M663m866o2062o2384
21854c8780j11163N5502O6558j03655o7455n2176J7232M6640R546o1867j8109
21843b57727M612R6796j905q260Q9237M9608l4225M228J70919J5160j09653q1846
$$ y = [145293, 37237, -84819, -131766, -155098, -59068, -95018, -197472, -257360, -166353, -90975, -39666, -23200, 79543, 66842, 49840, 25738, -1416, -129589, -126563, -133187, -132593, -18794, 31964, -9053, -24990, 48601, 185363, 226390, 155240, 145034, 213272, 219607, 198433, 142659, 2385, 4895, 71566, 152891, 47222, -116003, -193344, -162609, -137936, -56199, 47895, 54809, 70288, 102149, 64165, 19617, 14279, 36295, -42317, -88675, -119922, -147195, -91129, 55934, 105003, 122483, 126505, 46207, 46521, 3522, -80838, 39711, 85869, 90532, 85666, 23604, -38780, -149943, -94441, -27883, -131538, -198993, -251169, -233937, -187297, -177751, -239618, -257727, -253115, -156319, -158224, -166484, -77247, -27639, -61864, -57636, 113283, 128443, 18790, -63056]
21831f3056r4768N7421M2974J3363M7424n9885l3203J16251N1417j15392R9480
21820F2026P4538k5778K1102p134q6326j41695J2756Q9125L7754P4817O4697k7271
21808A48611m6690P5476r411o5518m3070j45056L4790R9532J4551m2101K2519
21797D3633k7950o7962l0828P1296Q7878P4022r87r1843n3746o3806j01686K2298
21785a39681m6223j4618N3875M5961M0183L3127l2563l4200Q0457R326n0567N5280
21773C57J7834L2712J48269j1927o5202o7877q6898q8150M4554r286l6929n3138
21761a75681l371j0724Q1199N6784M8725J6083q467M1586p2296l9066J6983M1382
21749f863n628R201J5811P8367r1067j5928Q5954K6390M164j35772j9373J9482
$$ y = [-63056, -157824, -100403, -57429, -44066, 3358, -56527, -89730, 26521, 77938, -37454, 62026, 136564, 110786, 131888, 124754, 38428, -103267, -90511, -1386, 36368, 111185, 175882, 148611, 101921, 177397, 167986, 102468, 59398, -85658, -50868, 48664, 63215, 21114, 43633, 15683, -52279, -83107, -11811, 76067, 150089, 149102, 57259, 3513, -60293, -161979, -139681, -185904, -200522, -146647, -100686, -60503, -27376, -59939, -94139, -13682, -4356, -54923, 357, 18191, 50903, 199172, 187245, 122043, 54166, -32732, -120882, -76328, -85614, -122543, -175681, -179052, -189776, -108577, -51793, -3068, 13015, 4548, 46134, -26162, -65228, -48245, -6863, -12491, -3290, 12521, 90888, -179, -16107, 69847, 96237, 100401, -35371, -54744, -35262]
21737c5262K9243j1489n1255m0748R0443j4665o4897p1200M4711J04053k6823
21726d7889p2244P8360J35028K8550k5325p8699j5926P4278O2268M925j16997
21715B6329p6436q7251P5224K1066j7627L558m0884P0659O2547o8561J0295L2237
21703A1156M9353J09783m0209l7670m5611r5485j0776K4406j0196N9545n8003
21692d3707l583J9442q7539L4939K4292O0653o5922K8083N9747M5829m7713k8008
21680c487q220j08999k0202P7755M8515l272p0041J6473q617R183J6562j01893
21668a56243K6037L3218J04567l0249l6182J3561J0132J00946o7169j08889J35300
21657B5029L8743p1695N217q4258j36385k0392p814J00308l2292n1804N3436O4725
$$ y = [-35262, -6019, -17508, -68763, -109511, -19068, -33733, -98630, -169830, -125119, -21066, -47889, -120133, -41773, 93255, 121805, 96480, 17781, 1855, 76133, 138401, 143326, 26329, -50107, -137358, -62134, -41068, -58695, -55137, -96021, -25362, 37185, -31376, -21081, 11156, 60509, 170292, 130083, 92413, 46802, -48683, -59459, -35053, -45249, 14296, -43707, -47290, -27848, -115387, -80448, -56156, 4497, -61425, -33342, 26405, 72234, 24521, -3487, -11707, -120706, -140908, -63153, -14638, -17910, -87951, -71478, -80095, -70912, -54350, -156243, -130206, -96988, 7579, -22670, -58852, -45291, -35159, 65787, -1382, -110271, 25029, 63772, -7923, -2706, -86964, -223349, -243741, -251555, -151247, -183539, -235343, -181907, -117182]
21645a17182P4152O0844k3482m8864j0267J0086o397Q411R916r9303k7119J13499
21633e5706L9137k8730q1645J8426n9735K7805J34074m0501l5484J06374l2992
21622h977j57309m3254J4709R2907k086r1756M7617Q7900J05844k7526j29213
21611a11144N6338o7998J8581O4377K27812J011m5848n1737j38429l5525l946
21600h6508r817m5954P715M3595R016N3677n2488j6998M980J3915j4044R0354
21588b557m2895j02878j18098N2358J28236N6545k2172l7533l525M076K7663N0870
21576i910R8445j1120m3922p5073L3828j9647K9473O6667K728n1702n9292n4114
21564i3639m4757N2692L4422q5045K3863J7370L1636Q4000Q2817n4538p3122q022
$$ y = [-117182, -43030, 17814, -5668, -54532, -64799, -54713, -61110, -52699, -42783, -142086, -169205, -55706, -16569, -45299, -126944, -108518, -168253, -140448, -6374, -46875, -82359, 24015, -8977, -166286, -209540, -194831, -101924, -104010, -195766, -148149, -60249, 45595, 18069, -111144, -54806, -122804, -104223, -39846, 187966, 188977, 143129, 91392, -47037, -82562, -86508, -96325, -142279, -134564, -90969, -81953, -28276, -80764, -97762, -92782, -78867, -92911, -2557, -45452, -148330, -266428, -214070, -85834, -29289, -51461, -88994, -92519, -88443, -60780, -9910, 88535, 77415, 33493, -41580, -7752, -27399, 2074, 68741, 71469, 19767, -39525, -93639, -138396, -85704, -51282, -136327, -112464, -95094, -63458, 20542, 103359, 48821, -24301, -32323]
21552c2323p2089j41795L9071J12547P0122J9369K1455o7796n6032j056O5333
21541d3194Q3041n0189k8828O1288O4150j0888j11337j00918k3482Q3205l687
21530h0839K9908J03329n5311r8757J7748P1617J06540K3614j11713n8443N8043
21519E736Q7137K7768l6261L7108n6049k9927m6110J26232J7537j62299q3069
21508a12197o1873J4376J42238L9351j06757P3015l3897n5564K4255k9962O9411
21497c7604L6406l8403l0258j4422N280L0550O977O4596O102p7405p4774J02175
21485b0780N6854J7357m7637r6827M9904N7935J05671M884l9907r3779m6704q7940
21473a40969P7641O0052R3017p1519M7034m8953l4809M243r9615l3718J3369j2888
$$ y = [-32323, -104412, -246207, -207136, -94589, -24467, -5098, 16357, -51439, -107471, -108527, -43194, 39847, -10342, -39170, 22118, 86268, 75380, -35957, -136875, -160357, -77152, -80839, -50931, 52398, -2913, -101670, -83922, -12305, 94235, 117849, 6136, -52307, 5736, 92873, 120641, 84380, 121488, 65439, 35512, -10598, 115634, 133171, -29128, -112197, -174070, -159694, -17456, 21895, -84862, -11847, -45744, -101308, -77053, -107015, -37604, -1198, -39601, -69859, -84281, -79001, -48451, -41474, 23122, 29224, -48181, -122955, -20780, 36074, 53431, 5794, -91033, -41129, 16806, 122477, 127361, 87454, -6325, -53029, -140969, -63328, -3276, 89741, 18222, 65256, 16303, -18506, -14263, -113878, -147596, -134227, -147115]
21461a47115J8276K8744L9918j07006l6465j2245n546J24318Q6776R1772J3322
21450I4749j05594r1735l8235p230J13751J26422k6137q5860p9165J6992M7402
21439c4640J02731j0672l1731n5095l8615k2116l3976K7162L4001L9908L4998
21428A1955j16896p6609P932j2431m8482J660Q7875J04608P931m8886Q779K0531
21416e2033Q6750r289j06150k3958p640K6548p257l3149K3016Q3763k782m9277
21404g1458k2092R2993j4847r5305R4572J13796J513j12876q6760K078M3134L2279
21392b2973O9188j7651L2493K5294J4893M1925j02591l8665M9184J01753p1425
21381H1425n9527k2677K8490N6961j2445k3227n9790q1984Q7509O4963j5693J04574
$$ y = [-147115, -128839, -100095, -60177, -167183, -203648, -215893, -221439, -97121, -10345, 81427, 94749, -10845, -102580, -140815, -148045, -34294, 92128, 65991, -19869, -99034, -82042, -34640, 68091, 57419, 25688, -29407, -68022, -90138, -124114, -96952, -62951, -23043, 11955, -104941, -181550, -173618, -186049, -234531, -232871, -144996, -40388, -32457, -81343, -72564, -52033, 34717, 25428, -80722, -104680, -112320, -85772, -93029, -126178, -103162, -19399, -22181, -71458, -93550, -557, -15404, -110709, -16137, 97659, 99172, -13704, -100464, -98386, -55252, -22973, 46215, 28564, 61057, 86351, 101244, 143169, 40578, 1913, 51097, 152850, 81425, 21898, -779, 27711, 84672, 72227, 49000, -10790, -92774, -5265, 59698, 44005, 148579]
21369A48579r0388q4218j10963q4745N6851J30105M7126k943j5207q0926L8785
21358d7944n984n3088R7082Q7611M5648l9731m1423J4200q5928q0827j7857K193
21346a26048N8965J6869m2980j1552K1435M5695N0834n3163n092J09038K9593
21335I3594o0758J2559k2308j3560L6333J78k4339J7553n8156k5761N5675O8929
21323G9939j051O3086j7304r6291o3744q9607j6411O4563M4958O7846l6230p4985
21311g5231l982Q6708l9829R1436k8634j58050j27091O1447L368N0023J4667k7276
21299a52444O0905Q0412Q1240J8473k7603k4306o5290p9811l0249J61386J85186
21288B07899p0296l2987J8652l2944j21225j35042K7846L8807K6558Q5015m6889
$$ y = [148579, 58191, -26027, -136990, -221735, -164884, -34779, 12347, 9404, -5803, -86729, -47944, -53928, -107016, -9934, 77677, 123325, 83594, 42171, 56371, -29557, -110384, -128241, -126048, -67083, -50214, -93194, -104746, -83311, -37616, 13218, -39945, -45037, 64001, 93594, 32836, 45395, 23087, 9527, 45860, 46038, 21699, 39252, -18904, -44665, 11010, 79939, 78888, 141974, 124670, 28379, -35365, -124972, -141383, -76820, -31862, 35984, -246, -75231, -79213, 7495, -32334, 59102, 30468, -127582, -254673, -193226, -189858, -139835, -125168, -152444, -91539, -11127, 70113, 88586, 60983, 36677, -28613, -108424, -138673, 22713, 207899, 137603, 104616, 123268, 90324, -30901, -165943, -138097, -99290, -72732, 12283, -34606]
21277c4606j1829l095n8010N4J3827R585O0432j16892N9712O4642Q5088O1654
21265A30562q3249p9046q5385O368N3078p9920k1096J34245L2947M5274p7095
21254b3317q6838N6213M1391q2642O7137K7230K4964J2102n7984j22809J3244
21243a31309J35480J17630o8589k808L4624R066n0033o6518M294n3566p658N3415
21231b5972J9330r1280J0886M7805k564J16051K884p2225p2442Q8211Q9148l8023
21219G1809l6070q58n2265r42L2402m2713p0915N0674Q7174q3927L9425N0309
21207D4103k334P1359q1419n5344Q260n5580m9170J4313L5332J38440k1187j72255
21195a25482m4778n974N323J63754L4155k2243O712L5161J389J8273K8712m7728
$$ y = [-34606, -46435, -49530, -107540, -107486, -93659, -84074, -23642, -140534, -80822, -16180, 68908, 130562, 47313, -31733, -117118, -110750, -57672, -137592, -158688, -24443, 8504, 53778, -23317, -110155, -53942, -12551, -95193, -28056, -826, 24138, 36240, -21744, -144553, -131309, 4171, 121801, 53212, 50404, 85028, 94094, 44061, -22457, -18163, -71729, -79387, -25972, -6642, -97922, -87036, -39231, -41795, 74256, 77140, 4915, -67527, 20684, 109832, 71809, 35739, 34881, -17384, -18326, 14076, -28637, -99552, -48878, 38296, -45631, -6206, 44103, 41769, 113128, 31709, -23635, -15375, -70955, -120125, -105812, -70480, 67960, 46773, -125482, -170260, -176234, -170911, -7157, 26998, 4755, 11467, 46628, 48017, 66290, 95002, 47274]
21183D7274p0130q387J266n371Q8386O8447m9942j40644o6578q808R698j4961
21171a49750N6612K1118o0532P367Q0426O407r5694P801J79610N0928o0267k7082
21159A6944J20909l4684p9244k1302k161q1593l943J5100M2095J7314N3871J5500
21147E8806q5160N733r3568Q6245O0300n5558K4884K5532j9765Q3773O7562o6927
21135I1857k6668J8479k3589j3359p602k4623L0684j00628n9908K4526l6950Q2003
21123d5778j8580L370N0644k1380o1927q215Q4156l8798J1148J2373n1099p6454
21111a60540M1818L7650P1136M6663j3193K9979J1806k5876p8274K6669O4096
21100E1934m9878r0361R3091K3824j4401M9177K4515l5008r1514M2775j2838q7746
$$ y = [47274, -22856, -31243, -29977, -35348, 53038, 121485, 71543, -69101, -135679, -144487, -134789, -149750, -93138, -72020, -132552, -125185, -44759, -38352, -134046, -126245, 53365, 104293, 44026, 16944, 137853, 103169, 23925, 2623, 462, -81131, -85074, -69974, -27879, -10565, 43306, 58806, -26354, -20621, -114189, -27944, 32356, -23202, 1682, 27214, 7449, 91222, 158784, 91857, 65189, 83668, 60079, 46720, 39118, 14495, 45179, -55449, -115357, -90831, -127781, -45778, -64358, -60988, -10344, -31724, -93651, -101866, -17710, -56508, -45360, -32987, -84086, -160540, -118722, -81072, -9936, 36727, 23534, 53513, 65319, 39443, -38831, -12162, 51934, 2056, -88305, 4786, 28610, 14209, 63386, 87901, 52893, -38621, 4154, -8684, -96430]
21088i6430J1133P4702M8900l2038J7212m9440j87668J6258O0636N3346N6949
21077b6440Q6046N7924k8296n5471r650j208O1155K3290j3030R2530n8854j8728
21065A09268j06214k3833M9721k5258O3106o58K8990J0801O9459r7511L9273P42
21053A17886o1511o490L0046j4547j595l5963n2090j7507k1265K6206k7663j640
21041f6133j6623m530L1061J1124N9019N4133j16272j04388l6828L5575R8576
21030e5286n8776m4677N0518Q8645N6310m8954j2422M6182M2016L4793j7048k7816
21018E3485Q896K2115q146O130O9724o8121j11470L4769k5220o9512k0259K2739
21006h4870q294O1697P2939L5427M0658l7868k828j5496j0832J0428K2076p167
$$ y = [-96430, -85297, -10595, 38305, 6267, 23479, -25961, -213629, -197371, -136735, -83389, -26440, 59606, 117530, 89234, 33763, 24113, 22905, 84060, 107350, 94320, 186850, 127996, 109268, 3054, -20779, 28942, 3684, 66790, 66132, 95122, 105923, 175382, 77871, 117144, 117886, 56375, 49885, 79931, 65384, 63789, 27826, -24264, -41771, -63036, -36830, -64493, -66133, -82756, -87286, -56225, -45101, 13918, 68051, -48221, -152609, -189437, -153862, -55286, -114062, -158739, -108221, -19576, 36734, -12220, -24642, 21540, 63556, 98349, 81301, 53485, 62381, 84496, 76350, 82480, 152204, 84083, -27387, 7382, -17838, -87350, -107609, -84870, -93164, -31467, 41472, 76899, 117557, 79689, 76861, 61365, 50533, 60961, 83037, 75870]
20994G5870m1511j01581m3505j7829M9495m0235o9184m8520k3608J0494O4369
20983a85745J717l91o914L281J35177Q3714P5035L0133r0263o182Q5907N7435
20971A82904q7612j33018O52k4404n7820l9668R4434P8617J1524L6305L784m5993
20959A9705j30671n7080Q4848j6364n244P7576l3230n0300Q3136k4617p8727K119
20947a28849J52722k285L1082r0339l7122j51151r3720O2638J00257O6517Q7061
20936c189j3580J5397K2795n2623n0638o9384P5242N1585K3676M5241j8334p1478
20924d5290p6680n2117O545L2360r44J968p2236m6862Q505J67397R8202j067O012
20911B5793J5265m4567L7055l3182j3359N8320K6088l5935K1546N170k048J4742
$$ y = [75870, 34359, -67222, -110727, -128556, -79061, -119296, -188480, -237000, -260608, -250114, -185745, -184028, -184419, -191333, -188052, -52875, 30839, 105874, 136007, 45744, 39562, 125469, 182904, 95292, -37726, -37074, -61478, -119298, -158966, -64532, 14085, 25609, 61914, 65698, 19705, -110966, -168046, -83198, -99562, -104806, -27230, -60460, -110760, -27624, -52241, -130968, -128849, 23873, 21588, 52670, -37669, -74791, -225942, -319662, -257024, -156767, -90250, -3189, -16769, -1372, 21423, -31200, -81838, -151222, -75980, -24395, -719, 44522, 26188, -45290, -121970, -174087, -167542, -135182, -136126, -134158, -206394, -253256, -244751, -77354, 20848, 19781, 25793, 41058, -3509, 33546, 364, -12995, 45325, 71413, 35478, 57024, 62194, 60146, 74888]
20899G4888L1981P7741j3264l6249l3325p2900L1664J8357l9885n6085k2240M1227
20887A910L0915O434R356j04217l2529J8244M6343J10666j7702p8541K4604J5008
20875C0491m4914p1538L456J2233K026N4185J174K0058q40N6892J3259l2848K1523
20862F5157o2199m0132o0506j5871J0241N157p145J0353l0654o7327P3572M2618
20850g6736j2906J7799J0999K546Q702l63j28049j38700k2133l8690K0399J21306
20838b35826P1532O5929L2174J4049p1305r7256q201J39695N0749K2650j7763
20827c3573j5628M5878M1003m6953m0084l3215L9109J0343n4833k0602J4948n6998
20815a50605J9641P8389P0938n6781j00280P1901R3604J911p6693k3224l9717
$$ y = [74888, 106869, 184610, 171346, 135097, 101772, 28872, 60536, 78893, 39008, -17077, -39317, 1910, 32825, 39259, 48615, -55602, -88131, -69887, -23544, 87122, 69420, -9121, 15483, 30491, -14423, -85961, -82505, -70272, -68246, -14061, -12887, 7171, 6331, 63223, 76482, 43634, 65157, 2958, -37174, -97680, -113551, -103310, -98153, -105298, -94945, -125599, -192926, -119354, -76736, -89642, -71843, -60844, -58298, -49596, -49959, -178008, -316708, -338841, -377531, -357132, -235826, -164294, -98365, -66191, -52142, -123447, -220703, -228904, -89209, -38460, -15810, -33573, -49201, -3323, 37680, -9273, -49357, -82572, -43463, -33120, -87953, -108555, -93607, -150605, -130964, -52575, 18363, -38418, -138698, -66797, 26807, 28718, -47975, -71199, -110916]
20804a10916P0886O2254q3028l4630j279R6246P5131q3831j2039l5414m34j1194
20792f8248k2193n583n1416n2291n8977J9904Q8332J45841n5615K9785J34575
20781A04114r26j50444J6967O4852J08795K2316K7806J9531p6837j06130Q74q2995
20769e2077M7645O9824m183k4679k2742L804k3496m2704Q092M1236o882K8706
20757B2544M04J12353l2585n5668n2757O9661J15543m9019n7126j29280j66673
20746b22603p2094M9890O3092O4378J4232k6180m7729k7872o19q5428J33514K6153
20734a31266n1999n2835Q0867R162L1771O90L7759J6095J501O332o7323k3606
20722a42852l743R0962l854M5842j66446l8193K6745M3197J03928P1164r5040
$$ y = [-110916, -40030, 22224, -60804, -95434, -96713, -467, 74664, -9167, -21206, -56620, -57054, -68248, -90441, -96024, -147440, -199731, -258708, -238804, -150472, -4631, -60246, -30461, 104114, 103188, -47256, -30289, 34563, 143358, 165674, 193480, 213011, 136174, 30044, 30918, -52077, -4432, 65392, 61209, 36530, 13788, 17592, -5904, -48608, -40516, 720, -6162, 22544, 22948, 135301, 102716, 47048, -5709, 63952, 179495, 130476, 73350, -55930, -222603, -294697, -244807, -181715, -117337, -103105, -129285, -177014, -204886, -205505, -290933, -157419, -131266, -183265, -236100, -155233, -146071, -114300, -113610, -75851, -59756, -58255, -51923, -119246, -142852, -146595, -55633, -59487, -13645, -180091, -218284, -191539, -148342, -44414, 26750, -68290]
20711f8290q7002K6769M4556R7744Q3638j0044p2209J0240O3315R601L6652o919
20699A28051m0083m1430j19437p0761j984P1884P4382K6450N2552l6529K9453
20688G2548j2910n4438r3660O5266Q7011l4054j13113M419M2957k1415J06182
20677D8793Q8698r8777p3581k3346P3115M8294N7792r1576j35540J24808J65298
20666A83978N4762j15148q5094N129k7837Q0624m7341j64656r6615O4290J82401
20655C4493K4785o5392Q702n5011p8995N5729M7849l5995L67J16380O2538j43971
20643b8521k2327P6516p6555O081M8245M9234k3364j7240l8169K591J18532Q2173
20631A77196k9994n5445K9111o1165q823j20561l2105q4059l2332Q0111J37710
$$ y = [-68290, -155292, -128523, -83967, 13777, 97415, 87371, 15162, 25402, 88717, 98318, 134970, 128051, 87968, 46538, -72899, -143660, -145644, -73760, 622, 27072, 79624, 43095, 72548, 59638, 5200, -88460, -23194, 63817, 29763, -83350, -78931, -35974, -57389, 48793, 137491, 38714, -34867, -58213, 14902, 63196, 120988, 29412, -106128, 18680, 183978, 238740, 123592, 38498, 43627, 15790, 96414, 49073, -115583, -212198, -147908, 34493, 59278, -6114, 2588, -52423, -131418, -75689, -27840, -63835, -63468, 52912, 115450, -28521, -50848, 25668, -50887, -44806, 3439, 52673, 29309, 12069, -26100, -23509, 95023, 177196, 147202, 91757, 120868, 59703, 50880, -69681, -101786, -185845, -218177, -138066, -356]
20620c56J4386j9515M5167o2814L5456l6353m9598O1520P2864L4743j6441m5025
20608C4034l4390Q4362n1543m5855p1344k261O1401J00375N1032j04657p2856
20597e1702Q009k1701P223N0260J3702l4299j11831K1861N8927Q5447m8380k2534
20585d5018j49443J13223J11320L8001l700P1164K3136p1068J1166k128L8327
20574A34980j7006n4171L2573L3394M0491j6805o1518n8998r1887j0101N0013
20563a9035J25006J6049k3888k2511p1746P0686Q2167J2767n8375j00882k7338
20552a7100j4701m0128o543n6853L6564P5323J9541N7951J9890M2266l3050l7212
20540D5948n2022M595P9751O5917j8290j65814j81956R3945J12790j2607P3583
$$ y = [-356, 14030, -5485, 39682, -23132, 12324, -24029, -73627, -12107, 60757, 95500, 79059, 34034, -356, 84006, 32463, -13392, -84736, -86997, -25596, 74779, 125811, 21154, -51702, -43693, -65394, -58171, -7911, 5791, -28508, -140339, -118478, -59551, 25896, -22484, -45018, -194461, -81238, 30082, 68083, 64383, 135547, 158683, 87615, 98781, 96653, 134980, 117974, 63803, 96376, 129770, 170261, 153456, 91938, 32940, -58947, -69048, -19035, 105971, 122020, 98132, 75621, 3875, 74561, 156728, 169495, 111120, 10238, -17100, -31801, -71929, -78472, -135325, -98761, -23438, -3897, 54054, 73944, 116210, 83160, 45948, -6074, -1479, 78272, 144189, 125899, -39915, -221871, -127926, -15136, -27743, 45840]
20529D5840Q1125Q8247K4490m7739j00921N048L1112Q2930q2639j39938l6347
20518d8792J2619l5655r5954k7053R5595J59569L8278O0721j8292p7551Q21m8319
20506A5987m1708L7430P0419N9273j26906k7595M4469N0478m1448J8410m1721
20495A7088o1799L221J27892P0589p3608j25123p6489n02J47895O9653N3549N4583
20483B06949q4509j6961o064o8621n5225k7046N9059J3305n4189k6675J8935j2508
20471e3550r2620m3192L7628J7399M878K3406J2340J56622M2000R371J8588O6480
20459A99350k8862n2431j11026m7228L1306l1077M4494J92632N2593j40061k3647
20448H6043O066r09j17360J05403O5624q6833j17473J02282K0805j3026o0539
$$ y = [45840, 126965, 215212, 239702, 191963, 91042, 96090, 127202, 210132, 127493, -12445, -48792, -36173, -71828, -167782, -194835, -99240, 60329, 98607, 159328, 141036, 63485, 64306, 15987, -25721, 11709, 82128, 141401, 14495, -13100, 31369, 81847, 40399, 58809, 17088, -44711, -41490, 86402, 156991, 83383, -41740, -118229, -118731, 29164, 98817, 152366, 206949, 122440, 105479, 99415, 30794, -24431, -51477, 7582, 20887, -33302, -59977, -41042, -53550, -146170, -189362, -151734, -134335, -129457, -106051, -93711, 62911, 104911, 114282, 132870, 199350, 170488, 118057, 7031, -40197, -8891, -39968, 4526, 197158, 249751, 109690, 86043, 92109, 91200, -26160, 79243, 144867, 58034, -59439, 42843, 63648, 50622, -9917]
20437i917j31948L8373J59679l0543k6675P551j41060q1801N0828J12104M2039
20426a1370j3507K6348L623j8556j9376m2046J1393K9971M155o3782j18818L653
20414b08312P8162p944P1371K2060m9123j8885r613J5750N2229M0655L9135M8616
20402G4101j09262q2619N1228N6808l3955P454J7197R897J58671l2502j62694
20391d5676o3568k2205L0187P8635J5158l335J0647M6213M008q1400M4890k6449
20379a2895j44643M863P7472J46258k8881j7483n6608j1941l1886p821Q9192J1418
20367A7045J9073K1106m6210n1573J9617k5959k203J18517J05175j1682j3054
20356A49852J0735j0348l1361r0180m8965n2620K8062m3059J9515P5394R444m1769
$$ y = [-9917, -141865, -103492, 56187, 25644, -1031, 6520, -134540, -216341, -165513, -53409, -11370, -24877, 1471, 5094, -13462, -32838, -74884, -63491, -33520, -29365, -93147, -211965, -208312, -130150, -138094, -66723, -44663, -93786, -112671, -122284, -106534, -54305, -13650, 25485, 74101, -35161, -117780, -66552, -9744, -43699, -36245, -19048, -9151, 149520, 117018, -45676, -109244, -131449, -101262, -22627, -7469, -10804, -157, 46056, 50064, -31336, 13554, -12895, -157538, -152675, -75203, 71055, 42174, 24691, -31917, -43858, -75744, -83565, 5627, 17045, 36118, 57224, 11014, -40559, -20942, -46901, -49104, 69413, 174588, 162906, 149852, 160587, 150239, 118878, 28698, -20267, -72887, -44825, -87884, -68369, 7025, 16469, -25300]
20344b5300j4481Q941n2191J7897M327K2872p5243p2296N7464J04463M0651r2871
20332g5767P0236Q7590m6070m4765M1721n3806n8913k1222L4615M1517m2078p4933
20320a41875k1931O3649M2993N1477n7634m0970k1445Q0849n5328l110J1055n9666
20308a51936M3006J32461Q38O500l329r156o2025o620K7337K3615M577J7281p5783
20295e3234M689N069k5137J10949l8998o3490J2069J17430L3078q1548O553j00472
20283g3042j11828j3702o7071R533J43460j3414K0910M3882R7371k7282j1504
20272b687l1307k276N6647k6299r282M0629n0732P649J5724k7958n5401R801P734
20259f7758K8393L340J5998q7431K559m524K0847k6874O3258P5103j01868l8340
$$ y = [-25300, -39781, -30840, -83031, -65134, -60807, -37935, -113178, -185474, -128010, -23547, 17104, -75767, -5531, 82059, 35989, -8776, 32945, -20861, -79774, -100996, -66381, -24864, -66942, -141875, -163806, -100157, -57164, -5687, -63321, -104291, -125736, -44887, -100215, -103325, -92270, -151936, -108930, 23531, 24369, 30869, 27540, 18384, -43641, -50261, -22924, 691, 5268, 22549, -53234, -48545, -43476, -68613, 42336, 3338, -60152, -48083, 69347, 102425, 20877, 27430, -73042, -184870, -198572, -265643, -256110, -112650, -126064, -105154, -61272, 36099, 8817, -2687, -33994, -36270, 20377, -5922, -15204, 25425, -25307, -17658, -1934, -29892, -85293, -75492, -67758, -39365, -36025, -20027, -107458, -104899, -109423, -88576, -115450, -52192, 22911, -78957, -117297]
20247a17297J00827j0917j733n8447q250m6192r5441K1304P0209K896l106N3899
20235i2248R144P325M3150r569M2551j25988m4194N0005j04072l7714M6313j3660
20223b28957P2956J03113R5211K5208n6804k0595l191n4722O8656j7433O6714
20212E0156l6225j02802m2721J35890N0500j13442j9835J536M6688L5348O6994
20201G2087l0571k3062l1200k9273P3903P5412L718n0895l0746l5610L5556j8112
20189A1207m3715K4651J3530m1500n8337L2002p5125l8843k0339Q1176j6072M1930
20177h9435o375N6808K6345j6334J00266K9165J9514m2636k3700L1325q7134m5084
20165d7275m4588l2704Q6704L3668N146J569j3932M9J5561p0000K1858O8275P294
$$ y = [-117297, -16470, -27387, -29120, -87567, -95817, -142009, -237450, -216146, -145937, -143041, -146147, -92248, -83104, -75779, -32629, -42198, 353, -125635, -169829, -119824, -223896, -261610, -215297, -228957, -156001, -52888, 42323, 67531, 10727, -9868, -13059, -67781, 875, -16558, 50156, 13931, -88871, -131592, 4298, 54798, -58644, -78479, -76943, -30255, 5093, 72087, 41516, 18454, -12746, -42019, 31884, 107296, 111014, 60119, 29373, -6237, 29319, 11207, -32508, -7857, 5673, -35827, -94164, -62162, -137287, -176130, -196469, -115293, -131365, -89435, -95810, -39002, -12657, -28991, 71275, 100440, 119954, 77318, 53618, 84943, -2191, -47275, -91863, -124567, -37863, -4195, 951, 2520, -11412, -11363, 4198, -65802, -43944, 24331, 31625]
20152C1625N3628L6650n8959k915J09588k0796l5562j18878j28450q9287P9009
20141a44347J19247M3545k0880Q784J8983l6351j01006L90R8149o6801n693J20978
20129C4998L0489k7122j12176r1786P7180J01403M1428O2921K7183k9953n6107
20118E8458q4618j03659J644m3585J10791R770j0129n3080M1555O0624k4231J8394
20106a8066K4496K257J5508m8329n3139O5738J6008l8019q467k6963k0896J1081
20094g8791O0731m1617l7069O5255J09222O629n7091n6335N5132J11273k6699
20083A10640r4419m4998N05J20697M4487k4828R381j17343r5049L3793q4754m512
20071a46400J37851J02632p8148l4454M2984J28304j4355o064n965o6309n4970
$$ y = [31625, 85253, 121903, 62944, 60029, 169617, 148821, 113259, -5619, -134069, -223356, -144347, -25100, 18445, -2435, 6349, 25332, -11019, -112025, -111635, -13486, -80287, -85980, 34998, 65487, 38365, -73811, -165597, -88417, 12986, 54414, 117335, 144518, 114565, 58458, -26160, -129819, -128175, -171760, -60969, -51199, -61328, -114408, -72853, -12229, -36460, -18066, 6430, 8687, 24195, -24134, -77273, -11535, 4473, -33546, -42013, -68976, -89872, -78791, -18060, -59677, -96746, -31491, 77731, 84360, 27269, -29066, 26066, 137339, 110640, 16221, -28777, -28272, 92425, 136912, 112084, 121465, 4122, -90927, -57134, -141888, -146400, -8549, 94083, 15935, -18519, 24465, 152769, 138414, 132350, 126385, 60076, 5106]
20060E106M6773P5710l965J8784J9479l2695p4156o4271o830k7032n2990k3776
20048a19863L9145N5911q777q7085l0835l1182L8222J6674k78J2903K070Q0737
20036c2358l3730q2944o2054O1225P4646J7771o2316N5939Q9924n9355j3299j7933
20024f4484P1972p5116J9974L4513j887K6674J280j30180m4171k079J4819l986
20012a52671M6831M6639M1881m4616L1501J794j4150j9511J21154M2293m3217
20001E7928k2543p6982o9621L8758n660l8288k9023O6681O9443L9515n2813l0403
19989e3008L4316K5487j6653q2793q0486K7967N151l2714j0623n41L6998R8027
19977d8872P9490m0531O1471j02231O234M1219j326O6987j02888p5221M502M0840
$$ y = [5106, 51879, 127589, 123624, 142408, 161887, 129192, 55036, -9235, -16065, -43097, -96087, -119863, -80718, -24807, -33584, -120669, -151504, -182686, -144464, -127790, -128068, -115165, -113095, -32358, -66088, -149032, -211086, -149861, -75215, -57444, -119760, -63821, 26103, -33252, -46551, -64484, 7488, -67628, -47654, -13141, -15028, 11646, 12926, -117254, -161425, -163504, -148685, -152671, -105840, -59201, -17320, -61936, -30435, -28641, -42791, -62302, 58852, 101145, 57928, 35385, -41597, -111218, -72460, -78120, -116408, -145431, -78750, -9307, 30208, -22605, -53008, -18692, 6795, -9858, -92651, -173137, -145170, -140019, -172733, -183356, -183897, -146899, -48872, 30618, -9913, 51558, -50673, -44439, -3220, -4546, 62441, -40447, -115668, -111166, -70326]
19965g0326l1335P789Q3456M8960j1710L1612n8609p7935N2464K6710M3361J7806
19953F2243r0122J2583q9052p960J02539P8083m4409J7397M996j1323N624L8032
19941G8631Q163O090l5084o9738k0137J26325O1638J2694j6514j42661k8898Q7793
19929F8302L4682M488N794L4036j9688k8566m420j01676n8664N5502P1043J9093
19917G9926j45683M0866J55776m5644j03346N107J75486J0937k4118k8890j9236
19906A01181o1545k3004m9711k6803P7275K0180J16671L5563n3531j4677n1969
19895F9630n6597K834P3455M1343m5834j21050K7479N9921L5213j2064p9223L2237
19883B7344L1998l3864O4367k9440p6435p2778j23547J03884R1128J4849K6904
$$ y = [-70326, -101661, -93872, -10416, 38544, 26834, 58446, -163, -78098, -25634, 1076, 44437, 62243, -27879, -15296, -104348, -112308, -9769, 68314, 23905, 41302, 46298, 34975, 40599, 78631, 86794, 92884, 57800, -11938, -32075, 94250, 155888, 168582, 152068, 9407, -19491, 68302, 102984, 107472, 113266, 147302, 127614, 99048, 94628, -7048, -65712, -10210, 60833, 79926, -65757, -24891, 130885, 85241, -18105, -12998, 162488, 173425, 149307, 120417, 101181, 39636, 16632, -33079, -59882, 17393, 37573, 154244, 189807, 136276, 121599, 69630, 13033, 15867, 89322, 130665, 84831, -36219, -8740, 51181, 86394, 74330, -4893, 27344, 59342, 25478, 89845, 60405, -16030, -88808, -212355, -108471, -17343, -2494, 24410]
19872B4410k2811J0525M1044r4968j16687l7105L8929J06718o5412j18819Q0130
19861a54046J15473j2825N2868n7908p6902k1837k5124q717J1436P080J78746
19850H244J00306k7918n0189q5517m6093j4896j8382M1174N3737Q5720K8166O5405
19838A39757M1881j6967p2262j10936j4622N3602O4333N5423j21400l2982m6789
19827f0962l9141R4881J0237m1731n1118Q3762P8762R964q80M551r6191j01799
19815a09665n3032n7008O5210P7330O6972m509J4059o7587j21631M070j02495
19804b88286M8814J18097P0654M8528o7541j8730L9799j05805p0275J93784J63261
19793A32300l8188j33914p1765j665j7382o967Q8017J464q4058M5858o4266j7531
$$ y = [24410, 1599, 12124, 53168, -41800, -158487, -195592, -156663, -49945, -115357, -234176, -154046, -38573, -51398, 1470, -56438, -133340, -155177, -180301, -189018, -177582, -170502, 8244, 108550, 80632, 30443, -55074, -101167, -116063, -134445, -93271, -39534, 46186, 74352, 139757, 181638, 164671, 92409, -18527, -33149, 20453, 84786, 140209, 18809, -14173, -60962, -100103, -5222, 5015, -36716, -87834, -4072, 74690, 84654, 83774, 88325, -7866, -109665, -162697, -219705, -154495, -77165, -10193, -14702, -643, -68230, -189861, -185791, -288286, -239472, -121375, -50721, -2193, -69734, -88464, -48665, -154470, -224745, -30961, 132300, 94112, -39802, -111567, -113232, -130614, -137581, -49564, -48100, -132158, -86300, -150566, -168097]
19781a68097P5882L2953l6295k4005M1214J48317L6570n2562o0791o9065k738
19770g8617O8733J6996j10677o0559J6343L1170L8427P1381L9209L7602R459j538
19758G7929M125r4265o1128O5763P2433m743l5197l7813l5401r533n541J08594
19746D5223N6625R1430n9973k8335l2487J2196o4997o5205O13J3505K864n9329
19734h7870l9100k728j0853K1829k8992O1295O6849R3181j8883o224q62j39491
19722i1849j5751M0780R6593J3111r724p1239p0694L1083K1905p6541K8416R361
19710i4549j8451M5503j6821q630k1688L2938M6260L4870r4270j8249n5506n0175
19698b18768L3381L5556M7285L1636K7994K0508k8336p7428l9759Q1000J41770
$$ y = [-168097, -92215, -59262, -95557, -119562, -78348, 69969, 106539, 53977, -6814, -75879, -78617, -9884, 7112, -103565, -164124, -147781, -116611, -78184, -6803, 32406, 70008, 79467, 77929, 82054, -12211, -73339, -7576, 64857, 60114, 24917, -12896, -48297, -57830, -63371, 45223, 101848, 193278, 133305, 104970, 72483, 84679, 19682, -45523, -44910, -31405, -28541, -87870, -126970, -129698, -140551, -118722, -147714, -86419, -19570, 73611, 54728, 48504, 47642, -91849, -107600, -66820, 29773, 42884, 33160, -38079, -108773, -77690, -55785, -132326, -103910, -94549, -113000, -67497, -84318, -92948, -114636, -81698, -35438, -568, -94838, -113087, -168593, -218768, -185387, -149831, -102546, -70910, -42916, -22408, -50744, -128172, -167931, -86931, 54839]
19687E4839J6642P836j2008N564k0002M1839J8273n2885j0903J911M5384K93N249
19674A02032j51417l3698P2278J6721L3940N785M7011J46903j00052j13380K2299
19663D8422j28003j74080r0133Q7925J47928N8779N6447p542q6241M8481Q1669
19652D3652M4732J1205m7520M6620k6955N7117j10166k6098l3388L2661J10970
19641A02830m9964j22760j1281K6198k6608o0356n2179J13423J08024L637P0436
19630A01400P0454k3630j07279r3638j32162K2323J62266j0594j63758J17862
19620e6756K1645L4840L1167l178o7624q8205J0934N7043R2403o1856P8110J47103
19608A95626l0238j68493j0944J3121J16973L0465j18970o2219Q2226J4095k1261
$$ y = [54839, 71481, 79317, 67309, 72873, 52871, 94710, 112983, 60098, 49195, 51106, 96490, 96783, 102032, -49385, -83083, -10805, 5916, 39856, 45641, 92652, 239555, 139503, 26123, 48422, -79581, -253661, -343794, -255869, -107941, -49162, 7285, -257, -86498, -38017, 43652, 88384, 99589, 52069, 98689, 71734, 128851, 18685, -7413, -40801, -8140, 102830, 52866, -69894, -81175, -54977, -81585, -141941, -194120, -80697, 27327, 30964, 101400, 171854, 148224, 40945, -52693, -184855, -162532, -266, -10860, -174618, -56756, -35111, -271, 30896, 27718, -39906, -128111, -117177, -60134, 32269, -29587, 48523, 195626, 165388, -3105, -14049, -928, 116045, 146510, 27540, -34679, 47547, 61642, 40381]
19597D0381M9710k3267o7649M3584l2415k01515o2769R4514k8418l0281J06210
19586a11915P0060q2777L5014j8546r1362N7057J39662O0515N739k5685m0486
19575b724N872o8667K0344K0444M1538m297j6200K5283k8455o6263P7653J20753
19563A25281R8312j5562k7349m7544p3583q1238M9612k9581n0616N6517N3435
19552E7684m3594j48871k8804J27421Q5858n2554o8261j0737k2292m3915o434
19541a54499Q5789L1071K0579O3981l2796Q226j08822J5655O5287J4933m4232
19530c4828r026j8839m1362J9691M3685r0718o0764R1991N882m127J61174o7649
19518d890j54683p1176J27779J54327k7056l5706m4678N9423l3097J987N913O9721
$$ y = [40381, 90091, 66824, -825, 42759, 10344, -191171, -253940, -159426, -187844, -218125, -111915, -41855, -124632, -89618, -108164, -199526, -142469, -2807, 57708, 63447, 37762, -2724, 3148, -65519, -45175, -24731, 16807, 12510, -3690, 21593, -6862, -73125, 4528, 125281, 223593, 208031, 180682, 133138, 59555, -21683, 27929, -1652, -52268, 4249, 57684, 14090, -134781, -163585, -36164, 49694, -2860, -71121, -81858, -104150, -148065, -154499, -68710, -37639, -17060, 46921, 14125, 22351, -86471, -70816, -5529, 9404, -34828, -43854, -62693, -104055, -84364, -40679, -131397, -192161, -100170, -94288, -98415, 62759, -4890, -159573, -230749, -102970, 51357, 24301, -11405, -56083, 3340, -29757, -27770, -21857, 47864]
19506D7864L6137L2884p7573k9223R153j30856J4858J58774J6107N505m7598n474
19494C0558L363j05078n1994J1811l4573p6000J9614Q8479l0823l7093K8275O6088
19482h7373J49037J01507k4629j98386n1689N8527r5645k4956J7035o8787M0937
19471a84422J04482P3398k3704J4166n0947j2275Q3222n2181Q1798n3335q0831
19460a00629P5562J5561j05164J3978M3237O2465L0575m732o8796l073k9808O5028
19448e796m717L9593N7235M3396L8764p3634j05556P6L2209O20L3782K5222k2722
19435E8472k0762k2907o5180n3596M8485M2787L161o0262p5244j2884O1696M876
19423i1358l3133J0639P9796L6537L8790L7778M1096l5043p7109J5803P8065m4898
$$ y = [47864, 84001, 116885, 39312, 10089, 19242, -111614, -96756, 62018, 78125, 83630, 36032, 30558, 33921, -71157, -123151, -111340, -145913, -221913, -202299, -113820, -144643, -181736, -153461, -87373, 61664, 163171, 138542, -59844, -111533, -53006, -148651, -173607, -156572, -225359, -184422, -79940, -6542, -30246, -16080, -67027, -79302, 3920, -48261, 33537, -19798, -100629, -25067, -9506, -114670, -100692, -57455, 5010, 35585, 30853, -37943, -41016, -70824, -5796, -10513, 29080, 86315, 129711, 168475, 94841, -10715, -10639, 21570, 22190, 55972, 81194, 58472, 37710, 14803, -50377, -103973, -55488, -12701, -9540, -69802, -145046, -157930, -96234, -91358, -124491, -113852, -34056, 2481, 41271, 79049, 120145, 85102, 7993, 23796, 101861, 56963]
19411E6963O093o9609k0179q2844K7078L7289n2815O521N3423J41756J49732n0663
19399B02745j40353l6763L0979k0471n5314l9404N8331L3049p1332q2493J438
19388a19588J5654m6227l2342M5886J9308J45275P9903m8279j40973o8514O4745
19377h5152N4275n4814k3305m6300Q0467P265m2437K4963K3160O5188L4581K5447
19365F3338O2703O423j16391j5382j2418r791J5626j5352J9894R2271L8987q952
19353A20956K713M2478o9601j54265J3864k563o9036J3814J27887N9554m8146
19342C7655j06157j5812Q8943M3951j31903k3501L4836J9997j5172K9651j10485
19331a47997O6191M7194M6607j3209n2733K7619P8166q390j09291l1769j0503
$$ y = [56963, 63056, -6553, -26732, -109576, -82498, -45209, -98024, -91503, -38080, 103676, 253408, 202745, 62392, 25629, 56608, 36137, -19177, -58581, -250, 32799, -38533, -121026, -119588, -103934, -150161, -182503, -136617, -117309, 27966, 107869, 59590, -81383, -149897, -85152, -30877, -85691, -108996, -155296, -74829, -67564, -110001, -85038, -61878, 3310, 37891, 63338, 126041, 132464, 16073, 691, -11727, -21518, -5892, -21244, -1350, 90921, 129908, 120956, 123669, 166147, 96546, -57719, -43855, -46418, -115454, -101640, 26247, 85801, 37655, -68502, -84314, 4629, 48580, -83323, -106824, -71988, -51991, -67163, -37512, -147997, -81806, -34612, 11995, -1214, -53947, -26328, 51838, 43448, -65843, -97612, -108115]
19320a08115p8016k4472J22444Q1154j6469J1220O190j07868j6818k191K0493
19309a12448N5883Q0276J7649r1909m4821L4855J50404M4804l8130m9363j9144
19298B8056L9510K2693k3938p9077l6696q9345J7993M7906L5726M7445n2434l1792
19286g3953k6043l9531L0138O2066O4728K5991m7475N5654Q596p4211m8312j009
19274f3361N0233L8801p1958k7778k6540P0088R969l9227l9364j03324N9460J30899
19262a2102j5958o5912P7904P2840q631J6869K3864j17471j3685Q3214J42767
19251A83699q2661n955K6571l5138L1793l9168j72065j21304k6144J4858P4998
19240a50516M329q0723o7743k9537J17946M5781n7738o601R1447J0016L3779J17686
$$ y = [-108115, -186131, -210603, -88159, -7005, -23474, -12254, -6064, -113932, -130750, -132941, -112448, -56565, 23711, 41360, -50549, -95370, -60515, 89889, 134693, 96563, 47200, 28056, 67566, 90259, 66321, -12756, -49452, -138797, -120804, -72898, -37172, 10273, -42161, -73953, -99996, -139527, -109389, -47323, 17405, 43396, -4079, 51575, 60171, -14040, -62352, -63361, -13128, 25673, -46285, -74063, -100603, -30515, -20546, -59773, -99137, -202461, -143001, -12102, -28060, -93972, -16068, 56772, 48141, 65010, 88874, -28597, -42282, 40932, 183699, 101038, 95083, 121654, 86516, 118309, 79141, -92924, -214228, -240372, -225514, -150516, -146187, -226910, -294653, -324190, -206244, -160463, -218201, -224802, -133355, -123339, -89560, 28126]
19228B8126n7966o7236O0539O8759N6459J7851K4488o7168p617K0827o7116o962
19216B984j8424k139l1502m180J187n6272l0253j1045J11872M7645l6298K0384
19204f041p9429q4258k7721Q4344Q4415L9166N4111n0971L3224J0708j17148K0129
19192c9471m093J2834J00526J05084J1753j20274Q649M0476q1671O923n683j2150
19180B2903o2234n601M5810k4987k6809K3052J8358p982j9372n3298M2930R5528
19168D8298Q8781N152r0320K5608l776N0463m1358J9788J6945k3335l1601j8806
19156D5839j21136m4574O0146J20170k6031k4548p7505m1384m2105R168p5845
19145b17805J04070N2314j7353N7337k9824j03703N854l5156J49519J30330q6815
$$ y = [28126, -29840, -97076, -36537, 32222, 88681, 106532, 131020, 63852, 56235, 77062, 9946, 2984, -15440, -17579, -49081, -53261, -52074, -108346, -138599, -149644, -37772, 9873, -26425, -6041, -85470, -169728, -197449, -113105, -28690, 10476, 64587, 13616, 46840, 57548, -59600, -39471, -43564, -30730, 69796, 174880, 186633, 66359, 75008, 115484, 33813, 40736, 35053, 22903, -39331, -44932, 878, -24109, -50918, -27866, -9508, -17490, -36862, -90160, -47230, 48298, 137079, 142231, 51911, 77519, 73743, 124206, 82848, 102636, 119581, 96246, 64645, 45839, -75297, -119871, -59725, 60445, 34414, 9866, -67639, -109023, -151128, -141960, -217805, -113735, -61421, -78774, -21437, -51261, -154964, -149110, -184266, -34747, 95583, 8768]
19134H768k3872l7292R570j1753L2849J17647L4103K3133M1012j5497K1550r7561
19122A02657j22425l9759R0701P1385l2231o4274M781k0349k1589K2099j6335
19111b5339l9336N7223O5986l1481q025l6600m6828j12975K1776P8193J12864
19100C5458P6899P3301n146j07590m8914k8909j3105N7766J23211r6740q8850
19089b2619K5091O0508q5949q1780l553K7518O6907k7373n2158k0045J1677J7353
19077h4423j5416J8761Q2319M1027p03l2738k464M1603M4441K631m1231m4234
19065I573n8155n2271l2146L54r623j3089K7000M5911j2408n7062j9735R5491
19053g6160O8524l7538J0015j845q2914N251Q3472M0911O0982K9350k3973L7800
$$ y = [8768, -15104, -52396, -42826, -54579, -21730, 95917, 130020, 153153, 194165, 178668, 200218, 102657, -19768, -59527, 31174, 102559, 70328, 6054, 10835, -9514, -31103, -9004, -25339, -64675, -7452, 58534, 27053, 19028, -17572, -64400, -177375, -155599, -77406, 35458, 112357, 185658, 180512, 72922, 24008, -4901, -18006, 39760, 162971, 66231, -22619, 2472, 62980, -22969, -104749, -108302, -80784, -13877, -41250, -93408, -113453, -101776, -84423, -99839, -81078, 1241, 42268, 41565, 8827, 6363, 47966, 92407, 95038, 53807, 9573, -48582, -100853, -132999, -132645, -142268, -155357, -128357, -82446, -94854, -151916, -171651, -76160, -7636, -45174, -35159, -37004, -119918, -114667, -31195, 9716, 70698, 100048, 76075, 113875]
19041A13875N6525o5689p7907j12514Q333J42494K1783K2212J6010r2042j12791
19030g9711Q2527l6428n4786j29121r113N4387J11197N7607q95p630p244j9063
19018c8273N3046J78j11332j08457k9369L83O0496q376k6401L104J8846N6612
19006a29543P3686Q2533P62n0489j0093L6747Q2152M4942M7599M4018O127j09898
18994A18543j166J2254r2782O4766K8940o1918r8518k5436n997J333j05364K0640
18982a44705q770l1397O0323k6101K7646J16150M2392K3461r4293K7132Q3716
18971G5554p717j3076J00916N6643L8769o5431j07771p7028o7264l3277K4120
18960g5562N0767K4675J7700k0276N5007J10940M2323n5614q8341k3701K7576
$$ y = [113875, 170400, 104711, 26804, -85710, -77377, 65117, 86900, 109112, 125122, 33080, -79711, 2816, -33612, -88398, -217519, -226632, -172245, -61048, -3441, -4336, -11966, -19210, -38273, 14773, 14951, -96381, -204838, -234207, -233824, -173328, -181704, -208105, -205001, -186155, -129543, -55857, 26676, 27438, -23051, -33144, 3603, 85755, 130697, 178296, 222314, 228441, 118543, 117377, 129631, 36849, 101615, 130555, 68637, -29881, -55317, -61314, -59981, -165345, -144705, -153475, -184872, -124549, -150650, -123004, -6854, 35538, 58999, -35294, -8162, 75554, 67837, 54761, 155677, 212320, 251089, 185658, 77887, 859, -66405, -99682, -75562, -24795, -120, 17580, -2696, 52311, 163251, 205574, 149960, 61619, 37918, 65494]
18949F5494M7059Q6017L887j12760m422J7431k8485o0763N3957J5996j75668r1810
18937a84067N148o458N5437N6129J7870k5221J3007N8674J1489J1542M9116p1048
18925h382j27721L732M7645P5283l2850M1711R7239m3239m1308m7914k7986J1106
18913e2684o1007r539J6775o416J5905M0334J1537j0083Q8008P8616L7465k3600
18901A25311l1217M3830k5402P332p612j6980l9660p3693j04268k5060J5352J15111
18889a6956O1933j03377o3866P6412m1765K4947J0065R995R1973J1982p0910j08669
18877a18236N3107K74718J59872j21145r7669l39n4644j33202l7263r175Q1070
18866b906m5110m5432J27468J36176n8363j31859n8271R0488l4880L2277r1332
$$ y = [65494, 112553, 198570, 202457, 89697, 85275, 102706, 74221, 13458, 67415, 83411, -92257, -184067, -178919, -185377, -129940, -73811, -55941, -81162, -68155, -9481, 2008, 13550, 62666, -8382, -136103, -132371, -84726, -9443, -42293, -582, 96657, 53418, 12110, -35804, -63790, -52684, -113691, -123230, -106455, -112871, -96966, -56632, -45095, -55178, 32830, 111446, 148911, 125311, 94094, 137924, 112522, 119854, 112242, 95262, 55602, -18091, -122359, -147419, -132067, -16956, 44977, -58400, -122266, -45854, -87619, -62672, -52607, -42612, 49361, 61343, -9567, -118236, -65129, 209589, 369461, 248316, 150647, 150308, 95664, -37538, -74801, -83976, -2906, -48016, -93448, 34020, 170196, 111833, -20026, -78297, 12191, -22689, 9588, -81744]
18855h1744k0990P2123K1388o7312M1547p107M796Q713o6545J5412M8829J11332
18843H0442K5789j15422m3749O8299Q1843m3471M9648q5880o4239o6930J2124
18832a01546K2867j4661K4537n2681K5890l1015j9726M8567K7384k4320J4909
18821g9795q450N9003J15761k8730j50883j4908J21422J1767j30957n5485L4330
18810a26925K8916K2652J34512j7407k8612N639n6536J3541p280j6093o5404P2505
18798d0492O8445j1540j8121l7180m5923j1493O6492N1609Q27m7389j080m2557
18786f8402O389j9528P0475J31639J5811k3910L8179j01075r7251j3393K4092
18775c6974R849j401j4864J70275O5179J20479J27486J18493L2218m5586j88032
$$ y = [-81744, -102734, -30611, -9223, -76535, -34988, -42095, -37299, -28586, -95131, -79719, -30890, 80442, 106231, -9191, -52940, 15359, 97202, 53731, 103379, 17499, -46740, -113670, -101546, -78679, -93340, -68803, -121484, -95594, -126609, -146335, -97768, -70384, -94704, -79795, -88245, -29242, 86519, 57789, -93094, -108002, 13420, 25187, -105770, -161255, -126925, -98009, -75357, 59155, 41748, 13136, 18775, -37761, -24220, -31500, -47593, -112997, -40492, 27953, 16413, -1708, -38888, -84811, -96304, -29812, 21797, 22624, -24765, -25845, -68402, -62013, -81541, -11066, 120573, 136384, 112474, 150653, 49578, -47673, -61066, -36974, -27125, -28526, -43390, 126885, 192064, 312543, 440029, 558522, 590740, 545154, 357122]
18764C57122k40667r1861k2785J6901k5989m2137l2983M6774R80J9795M0339j514
18752B3975L5631M7454o0001q3113j03988n5801L5707R5586j6753j633q1369K7851
18740a36454J0392p9132n4094J30703J47883Q1212j1282l7037O7902o6991j4659
18729C8443O6469l7580l6609N3159L6417L939L3819K7987q963q0499K9765J3281
18717A39628j01038r0149j06051n5983o324q123J16649O0482L1954J4468j26514
18706a31001p186J30301O2315p9591L2862q1682m6071P645K8323l0068m5261k7178
18694a86592K5957J17321M5216o0090K9384J04371l8687P3515n9432j5728j54263
18683a19028L5713O7858j5186K9465Q8392L1404n6822j46724k2603M9731P8755
$$ y = [357122, 116455, 24594, 1809, 18710, -7279, -49416, -82399, -35625, -34645, -14850, 25489, 23975, 59606, 107060, 47059, -36054, -140042, -195843, -160136, -64550, -81303, -82936, -164305, -136454, -126062, -205194, -259288, -128585, 19298, 100510, 89228, 52191, 120093, 53102, 38443, 104912, 67332, 30723, 83882, 120299, 124238, 158057, 186044, 177081, 96582, 126347, 139628, 38590, -51559, -157610, -213593, -219917, -228040, -111391, -50909, -18955, -4487, -131001, -138187, -7886, 54429, -25162, 7700, -73982, -120053, -112408, -84085, -114153, -159414, -186592, -160635, -43314, 1902, -58188, -28804, 75567, 36880, 110395, 50963, 35235, -119028, -83315, -15457, -30643, -1178, 87214, 118618, 61796, -84928, -107531, -57800, 20955]
18672B0955j8499j2798J10538m5329L0759O5149m8944m6204p2733L6456O3130
18661H2480K0620J6560J16550l7242j73731j4414N7835k0279m2500r4890o9231
18650a58242N5410O5718q39J500K0981k2445K6024j26107L7689Q5697j2740k3389
18638e0743K1914k0320R4061k4427j28674P4242R2739M4378p9209j16931L4398
18627e8572J24291J1462M516J19230j3943L064M581o3664j44362k5310n3222j9627
18615a11556l4653R8421J21823P6934Q958M4545j2242j0110L4731r1130l8850
18604H6871l6734m6671M7694N9783N8935N9536j5077M569j5421j21154j9170L4095
18592I7256k1848m998P4021J16810J10663J40361K95535M26692L13710L58510
$$ y = [20955, 2456, -10342, 100196, 54867, 85626, 150775, 101831, 55627, -17106, 19350, 82480, 103100, 119660, 236210, 198968, 25237, 10823, 68658, 48379, 5879, -89011, -158242, -102832, -37114, -37953, -36453, -15472, -37917, -11893, -138000, -100311, -14614, -27354, -50743, -28829, -49149, 44912, 20485, -108189, -33947, 58792, 103170, 23961, -92970, -58572, 65719, 77181, 81697, 200927, 186984, 190048, 194629, 130965, -13397, -38707, -91929, -111556, -146209, -47788, 74035, 150969, 159927, 204472, 192230, 182120, 216851, 125721, 86871, 50137, 3466, 51160, 110943, 169878, 229414, 214337, 218906, 203485, 82331, 63161, 97256, 75408, 70410, 144431, 261241, 371904, 512265, 807800, 1234492, 1548202, 1906712]
18582A906712N05528k19872o63120l54962p5581L0892K32256J81532L02169L65276
18572B210830p4124o58516n70104m19028j25540k462J5853o9839J7180l9668m6085
18561B38497O2302q837j9070q0575n3118k5514m8388j2640O7110j0762N1702j10806
18549D9901N849K0318n0866O4324j9287n2134J7588J30849M3825J0479j1745m109
18537B04992k0104Q319l5754m448n7652o9137n0602N6950K7115k389O3213K579
18525A23082o3863k022l559n8295J0544R0659n3763l9796K4153P8410M6259k590
18513A49219k3877k5845r6285J45988P8613j04225n3157Q024q2363J8721Q3154
18502I7967p5516P0088J3852q1742L5734O9468N4477O0967o0312j06564m4029
$$ y = [1906712, 2412240, 2192368, 1529248, 1174286, 1098705, 1129597, 1361853, 1543385, 1845554, 2210830, 2136706, 1478190, 908086, 489058, 363518, 361056, 376909, 307070, 324250, 284582, 238497, 300799, 291962, 272892, 192317, 139199, 113685, 65297, 52657, 119767, 109005, 160707, 49901, 55750, 76068, 25202, 89526, 70239, 18105, 35693, 166542, 210367, 220846, 209101, 204992, 184888, 193207, 157453, 153005, 95353, 26216, -24386, 32564, 59679, 57290, 120503, 123082, 59219, 57197, 53638, -4657, 5887, 96546, 42783, 2987, 27140, 105550, 151809, 149219, 125342, 99497, 3212, 149200, 227813, 123588, 70431, 78455, -3908, 14813, 97967, 22451, 92539, 106391, 24649, 60383, 129851, 184328, 245295, 184983, 78419, 34390]
18491C4390p257J1163j0763j42333n4296n8635J05321O3113M471R0151O3814l4602
18479F4537K9329J02003m5411p6385M1332k579j2521j3203q6057q1061L2590K6881
18467b0545N297j346R927M4454M7990K4332N104m5311j09190j09088j7355l9777
18455b05508O3931J7947Q048L5445J6294j2625J03253L2356k4975K6635J492Q3373
18443A45666l4079L1164N4679j36120j29621J0345R8454l5990O7109J01941l9635
18432A33913j28329n5955J6414k1217k106J34639r8325j14955K4366K3534J15535
18421B7514J73941m9211r1230K6771O648L7042r9149j96075p4476Q8331J35804
18410a4090P684K375L4424k03k127O9244j9106j8294J1198M1841K4248o2564p6269
$$ y = [34390, 27133, 38296, 27533, -114800, -169096, -227731, -122410, -59297, -54826, 35325, 99139, 64537, 93866, 195869, 150458, 74073, 115405, 112826, 100305, 87102, 1045, -80016, -47426, -20545, -15248, -16594, -6667, 37787, 85777, 110109, 115213, 69902, -39288, -148376, -165731, -205508, -141577, -123630, -115582, -80137, -63843, -76468, 26785, 59141, 34166, 60801, 62293, 145666, 111587, 142751, 197430, 61310, -68311, -57966, 40488, 4498, 71607, 173548, 133913, 5584, -50371, -33957, -55174, -57280, 77359, -20966, -135921, -111555, -88021, 27514, 201455, 152244, 61014, 87785, 94433, 131475, 32326, -163749, -238225, -149894, -14090, -6406, -4031, 30393, 30190, 28063, 97307, 78201, 59907, 71105, 112946, 137194, 74630, -1639]
18397a639m978p86k2799m5392q2644L611K3329n914P4333O5597L9659q5416k6413
18384f9452j479M5655N9429P2755P1311M8639j9161j7531R863n0436R58L9772
18372A90323q7828k4170K1107O5272K7069p3330O8721O8834Q062m1435L9138j11295
18360A50468k61199j58813P8698J03463J19104J09268K2878l3391j04886L1622
18350E7212L7235k7001l3769J4417l4191o5506M4210j1610O9754k9109J4212j1276
18338B4578K2877l5135Q16k3958L5300j6982N018R3017l5225p6536q4017K7359
18326f2888o267M2436M2369K2246p748L6085l9878k9104K0947O8337M734j8378
18314G2891j3811j2966q384J61546Q7119j49879j36060O0742Q3966K720L1337
$$ y = [-1639, -6617, -7403, -30202, -75594, -158238, -154627, -131298, -137212, -62879, 2718, 42377, -43039, -69452, -70931, -25276, 34153, 106908, 178219, 226858, 207697, 190166, 200029, 149593, 150551, 190323, 102495, 78325, 99432, 164704, 191773, 118443, 187164, 255998, 264060, 222625, 261763, 150468, -110731, -269544, -190846, -87383, 31721, 140989, 163867, 130476, 25590, 57212, 94447, 67446, 33677, 48094, 13903, -51603, -7393, -19003, 50751, 21642, 35854, 24578, 47455, 12320, 13136, -10822, 24478, 7496, 12514, 105531, 70306, -6230, -90247, -62888, -69155, -26719, 15650, 37896, 30148, 66233, 26355, -2749, 18198, 86535, 91269, 72891, 59080, 46114, 37730, 199276, 286395, 136516, 456, 61198, 145164, 147884, 179221]
18303A79221N2975l8957L6203k2509j15877l8135k4156l7059N8887P7735L1825
18292A60153k4620k4505j9547j0422J82581J12468j30123l5171N3047J07316P0143
18281D41320j25490j28588l0697O6611K7298k2945k2228r467r0160q3998L108
18270B4764J294N4597N8532n0231l3773j9765J01274M1957l5253o3935M7356P2476
18258A99293k0432m9146K5447m0416q7847j06990M3109n8621R721J46028N9822
18247A19968k9120J8981R4190r6263K4800j0666O3947O1105R1044J05898O1359
18236E05243K7883m8402r7880o2323K3458k1038M1226L1755L7496o1297l075J3254
18224C86300n2300P7910J22382j35412j75544p9694K175K5720j09295j9354R6008
$$ y = [179221, 232196, 193239, 229442, 206933, 91056, 52921, 28765, -8294, 50593, 128328, 160153, 135533, 111028, 91481, 81059, 263640, 376108, 245985, 210814, 263861, 371177, 441320, 315830, 187242, 156545, 223156, 250454, 227509, 205281, 195814, 105654, 21656, 24764, 26058, 80655, 139187, 88956, 55183, 35418, 136692, 178649, 143396, 79461, 126817, 199293, 178861, 129715, 155162, 114746, 26899, -80091, -36982, -95603, -85882, 60146, 119968, 90848, 109829, 204019, 107756, 132556, 121890, 185837, 246942, 337986, 443884, 505243, 533126, 484724, 386844, 324521, 347979, 326941, 368167, 399922, 437418, 376121, 373046, 386300, 334000, 411910, 534292, 398880, 223336, 143642, 145817, 171537, 62242, 42888, 138896]
18213A38896p1511k270J2469L9863N86j27663q74j9590J6612L9607l0278J9027
18201A4874N1475L4242P393m3338m0114N0199j7330N6637j555P9964J69109m357
18189C57199o0153j05941L4580n5641q2978j5504Q7207Q4703m151k0858p714l125
18177B07624n0285L6920J48071N074l5782L3317M2275p0435m9294m280j2152J0219
18165B61272J7664k7583M2231J30714J33832R4563q4419n0361L1258l7298K2481
18154E34354k4890n140J01978l5472o7686k1185L060L120R3886M7633N3874L6513
18142G20045L8692N1216J26288j8977O189J9773M3684m680J57309J92301J70076
18131A501916J60884K55355J70144K44876J38869K54219M00547N12297N12845
$$ y = [138896, 67385, 65115, 77584, 117447, 118033, -9630, -10504, -30094, -13482, 26125, -4153, 14874, 66349, 100591, 107984, 64646, 24532, 74731, 57401, 114038, 112483, 192447, 361556, 357199, 297046, 191105, 225685, 170044, 87066, 71562, 158769, 243472, 239321, 218463, 210749, 207624, 157339, 194259, 342330, 347404, 311622, 344939, 387214, 316779, 267485, 263205, 251053, 261272, 278936, 251353, 293584, 424298, 558130, 652693, 568274, 517913, 549171, 511873, 534354, 509464, 504324, 606302, 570830, 503144, 481959, 485019, 488139, 582025, 629658, 683532, 720045, 758737, 809953, 936241, 917264, 923453, 943226, 986910, 982230, 1139539, 1331840, 1501916, 1662800, 1918155, 2088299, 2333175, 2472044, 2726263, 3126810, 3639107, 4151952]
18122D151952M16695N00780O57525R05292J024671J599192K341137M164674Q238678
18113B4000596J5521833K1385812K0085264K1642971K5700049l669583m5975257
18106G8691685l2076764j5574544q387492m545998k478169j504558j405169j420668
18098A1298323j501288j422947r42833p05260o82906o75714l82322j57302k74694
18089D553057l38695k49040k94111j95268m6089j27025r0561r1228j37951j36086
18079B847003j15841j62801n9426k06477j36567K2355j0636r2578j46343m2187
18069A896502J6196q8196k36964q2212m6238K470P0366Q20j07915r8351p2379
18058A254099Q3666m6399j40861j5611K287m0521M6471P3510j8157l8355P830
$$ y = [4151952, 4568647, 5069427, 5726952, 6632244, 7656915, 9256107, 11597244, 15761918, 24000596, 39522429, 60908241, 80993505, 102636476, 128336525, 124666942, 78691685, 46614921, 31040377, 22652885, 18106887, 15628718, 14124160, 12718991, 11298323, 9797035, 8374088, 7431255, 6725995, 6043089, 5367375, 4985053, 4827751, 4553057, 4214362, 3965322, 3671211, 3475943, 3429854, 3302829, 3212268, 3121040, 2983089, 2847003, 2731162, 2568361, 2508935, 2302458, 2165891, 2188246, 2177610, 2085032, 1938689, 1896502, 1912698, 1824502, 1587538, 1505326, 1459088, 1461558, 1531924, 1532744, 1424829, 1326478, 1254099, 1337765, 1291366, 1150505, 1134894, 1137181, 1096660, 1143131, 1216641, 1198484, 1160129, 1167959]
18047A167959J09416O6705k4347J11700J03542J0312p5028k8398J722N3521j3389
18036A483715N7702L9365O8359J01904J06932m3254j91535j32552k7137J26387
18026A589886K28139P9492K4885M3865M9291O1932J33247N9834M9575M9488O8055
18015B437689r6L3409K69562J37983R1704J77187K20886J53049L89881M99523
18005D410777M74649O35890P12612P75470M99928J40366L78833Q87276J321063
17996A0236864J380364P47733P55423J271091J504967J573331K417643L546285
17988B3433701N204957P329530J0530664J8555473L7332161O1296001O6279250
17981B29961737O1977082P8614232M9376984r6471067j09280851m4303479Q34933
$$ y = [1167959, 1277375, 1344080, 1319733, 1431433, 1534975, 1545287, 1470259, 1441861, 1443583, 1497104, 1483715, 1541417, 1580782, 1649141, 1751045, 1857977, 1814723, 1623188, 1490636, 1463499, 1589886, 1818025, 1897517, 1922402, 1966267, 2015558, 2077490, 2210737, 2270571, 2320146, 2369634, 2437689, 2437593, 2471002, 2740564, 2878547, 2970251, 3147438, 3368324, 3521373, 3911254, 4410777, 4885426, 5521316, 6233928, 7009398, 7509326, 7649692, 8028525, 8915801, 10236864, 11617228, 12364961, 13120384, 14391475, 15896442, 17469773, 19887416, 23433701, 28638658, 35968188, 46498852, 65054325, 102386486, 163682487, 229961737, 291938819, 370553051, 419930035, 323458968, 214178117, 169874638, 170709571]
17974A70709571L9442865N7923835N4332972O8487870N8147935q2165067j41674925
17967B25205056p7926278m0555164k3411517j3678617p810334n241516n120876
17960E1460754n525796n107003m144798k981028k362072k645597k093403j292619
17952B5308438j053323j530421j316975j099544r76702q29657j398102j343334
17944A5760380r70566q32911q43798p17049n63886m35661n09422l65464m29544
17935A0092079m08814m37693l55758k92241k75514m56241m50225l13509k94425
17926F807659j81679j97827p7755j92463j69396k90305l12881k35466j68105k2840
17916D958942j14159m1275r9473j35909j28609j80745j62039q2252j82619j28031
$$ y = [170709571, 210152436, 268076271, 322409243, 390897113, 449045048, 366879981, 225205056, 147278778, 106723614, 83312097, 69633480, 61823146, 56581630, 51460754, 45934958, 40827955, 36683157, 33702129, 31340057, 28694460, 26601057, 25308438, 24255115, 22724694, 21407719, 20308175, 19331473, 18501816, 17103714, 15760380, 14789814, 13956903, 13113105, 12396056, 11832170, 11396509, 10887087, 10521623, 10092079, 9683265, 9245572, 8889814, 8597573, 8322059, 7865818, 7415593, 7102084, 6807659, 6625980, 6428153, 6350398, 6157935, 5988539, 5698234, 5385353, 5149887, 4981782, 4958942, 4844783, 4803508, 4704035, 4568126, 4439517, 4258772, 4096733, 4014481, 3831862, 3703831]
17906C703831l3581j7228k5430n8664p5796J2320L4333j56096j52499j24111l9803
17895C067276Q0411p3505n1395K9074q6987l9567j4371o5290j21313j50602q6734
17884B486997K188m8899m8390j23895j08178k8695j0621j10038k51634p688q7931
17873A663216j36828O068J02145J4898j12769k9980K6218o1759j12263m8206R2178
17862A402918L5464m9769j9373Q481q923N1916N2332N3075o8194j29956r2759
17851A235212k7306K6244J7789L6126K5258M8282q7526r855k2897m3145m1241
17840A156941o911o2707K3220l983M2275r720j37085j45332N6249K4133p584R9025
17828A028521J20672J5138j05563j41078j4227l7016l6247o2844q3069M633J716
$$ y = [3703831, 3670250, 3653022, 3627592, 3568928, 3493132, 3505452, 3539785, 3383689, 3231190, 3107079, 3067276, 3147687, 3074182, 3022787, 3051861, 2964874, 2925307, 2910936, 2845646, 2724333, 2573731, 2486997, 2489185, 2440286, 2391896, 2268001, 2159823, 2131128, 2120507, 2010469, 1758835, 1751147, 1663216, 1526388, 1532456, 1634601, 1649499, 1536730, 1506750, 1532968, 1471209, 1358946, 1310740, 1402918, 1438382, 1388613, 1369240, 1377721, 1368798, 1420714, 1473046, 1526121, 1457927, 1327971, 1235212, 1207906, 1234150, 1251939, 1288065, 1313323, 1361605, 1274079, 1264224, 1241327, 1198182, 1156941, 1150030, 1087323, 1110543, 1106560, 1148835, 1139115, 1002030, 856698, 912947, 937080, 929496, 1028521, 1149193, 1164331, 1058768, 917690, 903463, 866447, 830200, 767356, 684287, 688920, 690636]
17817F90636k8914L2663L750L8407J3258o3284j17330j12786o2018K4922M299
17806D23603K3296J00472M9786N8979m0403m4145J8772L9317r4265j12772l7360
17795C85280R7042r261k4913L3330j2415n0737K9985J0794L4012Q3765N617m8144
17783E34355K7305m1n4817m7076L460R2878n4237K8982J0667j09191m1405o0665
17771C30215o2465l516L4371k8102k4056p8475J3691O7473M0327j9103J8257p7044
17759B11573o9338j07540J15680M513m7561l1653L6621J70k7745M0042J1724P0120
17747B06606M1053k9468o7603j8573K3704L3698L0085O4309M8205k6298l4283
17736B71435P6042M8031N8720N3088l9027q904K4959r8174j23350O5326Q7230
$$ y = [690636, 661722, 694385, 698135, 736542, 749800, 686516, 569186, 456400, 394382, 419304, 423603, 446899, 547371, 597157, 656136, 615733, 571588, 590360, 629677, 535412, 422640, 385280, 482322, 473061, 448148, 481478, 469063, 418326, 448311, 459105, 493117, 576882, 582499, 534355, 561660, 561619, 506802, 459726, 463186, 556064, 501827, 530809, 541476, 432285, 390880, 330215, 267750, 264234, 298605, 270503, 246447, 167972, 181663, 249136, 289463, 270360, 288617, 211573, 142235, 34695, 150375, 154888, 107327, 75674, 112295, 112465, 84720, 124762, 136486, 206606, 247659, 218191, 150588, 132015, 155719, 189417, 219502, 283811, 332016, 305718, 271435, 347477, 395508, 454228, 507316, 468289, 459385, 484344, 386170, 262820, 328146, 415376]
17725D15376o256n0851k9285N9959P6253O1280R5574J26971j16885o0472L6197
17714F07861l7799j06540o4781O4401l998L7679L1241o507J8225J03398q9186
17703E53994j0504L9179M1592O6622k8820q1975n4215p5753L1839M5599J52059
17692F79617O0101j82153j60837j3754j3315j6112Q4749M9514j3296q6353m4703
17681C43458K0098P152P9524O743P5002n0683p5509q5075l6121M7029p4699M7078
17669C03997L5381K9933k2973n7425k2023j29782M3271J76186L6637M1739O3137
17658D98078K3417n5829n5134O1335M8072L128j30553j9603J26555L7280P7466
17647F14212o124o6148J6926J9215P6509o102M2723J41414Q5407J28104N2817
$$ y = [415376, 409120, 358269, 328984, 388943, 465196, 526476, 622050, 749021, 632136, 571664, 607861, 570062, 463522, 398741, 463142, 459144, 496823, 528064, 521557, 539782, 643180, 553994, 543490, 582669, 624261, 690883, 662063, 580088, 525873, 450120, 481959, 527558, 679617, 739718, 557565, 396728, 382974, 369659, 353547, 438296, 487810, 474514, 388161, 343458, 363556, 370708, 450232, 456975, 531977, 481294, 405785, 320710, 284589, 331618, 256919, 303997, 339378, 369311, 346338, 288913, 266890, 137108, 180379, 356565, 393202, 434941, 498078, 521495, 465666, 410532, 471867, 519939, 523067, 392514, 372911, 499466, 536746, 614212, 608088, 541940, 558866, 578081, 654590, 648488, 691211, 832625, 918032, 1046136, 1098953]
17636A098953m8864j64360k283J68968J23535Q9395J25554j7678p1059O74P9542
17625A382377J13298J19794J41770P3978Q3188J5967m7097K14511J92340P760
17615B297886Q1834K83336K70788K97925L91540K74337K11324K20025L30361N61028
17605E220384N80377L83143O06873O47678M57054O50513R34664J089412J498472
17596A2068570J460318J306705J913804K647758M020411O271465J0580554J6775271
17588E7044856J9787937K0494634K6145151K6335430P823684Q576376K0999344
17581A87207412L3585549M8036740K0897998k9944048j0231989J3403150R640627
17574B72595439L667997r931834j1940323J0809357J253560m9801032m2794947
$$ y = [1098953, 1050089, 885729, 883446, 1052414, 1175949, 1265344, 1390898, 1373220, 1302161, 1302835, 1382377, 1495675, 1615469, 1757239, 1831217, 1914405, 1930372, 1883275, 2097786, 2290126, 2297886, 2379720, 2663056, 2933844, 3231769, 3623309, 3897646, 4108970, 4328995, 4659356, 5220384, 5800761, 6183904, 6790777, 7438455, 7895509, 8546022, 9480686, 10570098, 12068570, 13528888, 14835593, 16749397, 19397155, 23417566, 29689031, 40269585, 57044856, 76832793, 97327427, 123472578, 149808008, 157631692, 166208068, 187207412, 220792961, 268829701, 289727699, 259783651, 249551662, 262954812, 272595439, 276263436, 266331602, 254391279, 265200636, 266454196, 216653164, 173858217]
17567A73858217j8308216m140622M76478j8723602l5023135k3667214j4051785
17560F0420121r263986o419335m765547l340804k719572k542096k334173k165274
17552B6869334k092893j491546j198829j439251j346441j085347p67202n76390
17544A6871435q44160j207067r50395p09553o71701o12269o06711n07314m27087
17535A0335178n15386m78462l16286l26644k35321l73438l86555k40710k75614
17526G186762l00875k21033k72729k76522k58776j93973j22577j46832j97076
17517E196369j71032j56202k23029j68694j28553o1969m703j52883j44140r6012
17507C889152m7767q1617j15329m9226j1790r0724p0729q5162p501J8359q0596
$$ y = [173858217, 155550001, 151409379, 151885857, 133162255, 98139120, 74471906, 60420121, 51156135, 44736800, 39971253, 36630449, 33910877, 31368781, 29034608, 26869334, 24776441, 23284895, 22086066, 20646815, 19300374, 18215027, 17447825, 16871435, 16027275, 14820208, 13869813, 13160260, 12488559, 11876290, 11269579, 10762265, 10335178, 9819792, 9341330, 9025044, 8698400, 8463079, 8089641, 7703086, 7462376, 7186762, 6885887, 6664854, 6392125, 6115603, 5856827, 5662854, 5540277, 5393445, 5196369, 5025337, 4869135, 4646106, 4477412, 4348859, 4286890, 4282187, 4129304, 3985164, 3889152, 3841385, 3759768, 3644439, 3595213, 3583423, 3492699, 3421970, 3336808, 3329307, 3347666, 3267070]
17496C267070j41062j25520k6018O039m6457j01574r2604r4931p6643j46426r5706
17485B326168j53384j2778l0699q349M2251j16009p5095j218l4284J4388P0315
17474B021306j02439j73546n0982p0014n6296L653K3742K7535K0628j10700j64566
17463A368321o4212K5528M1928J9304K34K6140J3681p8572j05558j27365o6112
17452A053317N6669J1472L5517k1464L3119O2385J68331J63626P9201O6436J8058
17441A726667k63574k38717o8332P6135l2001j58580j64260p2161j1349j4170
17431G79658r773m125r6061j99292j54332J7891J50035O9294k3612L9660J5401
17420E84744N7205N5216k1058n5405n5272l9964J07192J71820K66192Q1241K07417
$$ y = [3267070, 3126008, 3000488, 2974470, 2980509, 2934052, 2832478, 2739874, 2644943, 2568300, 2421874, 2326168, 2172784, 2160006, 2129307, 2120958, 2163209, 2047200, 1972105, 1970887, 1936603, 1950991, 2021306, 1918867, 1745321, 1694339, 1624325, 1568029, 1571682, 1595424, 1622959, 1643587, 1532887, 1368321, 1304109, 1329637, 1371565, 1390869, 1391103, 1417243, 1430924, 1352352, 1246794, 1119429, 1053317, 1109986, 1121458, 1156975, 1135511, 1168630, 1231015, 1399346, 1562972, 1642173, 1708609, 1726667, 1463093, 1224376, 1156044, 1232179, 1200178, 1041598, 877338, 805177, 793828, 779658, 769885, 765760, 669699, 470407, 316075, 333966, 484001, 553295, 529683, 569343, 584744, 641949, 697165, 676107, 620702, 565430, 525466, 632658, 804478, 1070670, 1151911, 1359328]
17409A359328K22745J19374m9813R8212K54251K78439L11971J34341n32466m64318
17399A732064j07581P0687J29905k0158m48261l24166j58498j48447o3331l0824
17389F31390L8247m6882p0651j20644j590j7016k7967L05N5806J1816J05625O281
17377E64720m4228O5643j9031J25403M53527M45206L49812M56238L70243k77071
17367B490462o19593k67632j31096J5685J90844K53864L06199L44796j58402p15207
17357A709920n32243k50817j80647j47976j62797k213j0562K7264m5069n1414
17347C53446m5674o6839J3822O8519Q0817J444p773P789n4532N6115m1607k4086
17335C41441l4126p8072J4330n199K200J5720J62384l7142q5230l6568m4318n9091
$$ y = [1359328, 1582073, 1701447, 1651634, 1749846, 2004097, 2282536, 2594507, 2728848, 2196382, 1732064, 1624483, 1695170, 1825075, 1804917, 1356656, 1032490, 873992, 725545, 662214, 631390, 669637, 622755, 552104, 431460, 429870, 412854, 384887, 385192, 440998, 452814, 558439, 564720, 520492, 586135, 567104, 692507, 1146034, 1591240, 1941052, 2397290, 2767533, 2490462, 1870869, 1603237, 1472141, 1487826, 1678670, 1932534, 2238733, 2583529, 2425127, 1709920, 1177677, 926860, 746213, 598237, 435440, 433227, 422665, 449929, 404860, 353446, 307772, 240933, 254755, 323274, 404091, 405535, 397762, 405551, 351019, 407134, 365527, 341441, 307315, 229243, 243573, 238374, 240574, 256294, 418678, 381536, 296306, 259738, 215420, 156329]
17323A56329n3177J17804J1295l9176m2632K770J4306Q2421m2392n2940o2589
17312I2019p0945N9432J35258M4343k608o8988o2178K3693o0742M5178j7563l444
17300A13455m9771p4722Q229O7510M5146N6627m2377n3434L1169m1374M0803L4141
17288A35402j3838k657l3267r1598Q6701K1624j58992j0253N4723j4575O1628
17277C4898K8241Q3853o2559o0424m5088J9512l0166q2395J873J30056M206j8203
17265C804M5305j5130M7023m2328M2055k8354p3230l6970P7377j2320n5444p6908
17253a25120l9492J28142J02441m1451l6173K2030r204K3543L862K2812o6224
17242a4834m9571q191L7774J91687M2084m7629q4623k1136N877l5292O3161m2927
$$ y = [156329, 103152, 220956, 232251, 193075, 150443, 153213, 167519, 249940, 207548, 154608, 92019, 21074, 80506, 215764, 260107, 257499, 188511, 126333, 150026, 89284, 134462, 116899, 113455, 63684, -11038, -2809, 64701, 109847, 166474, 124097, 70663, 101832, 60458, 101261, 135402, 121564, 118907, 85640, -5958, 80743, 102367, -56625, -66878, -12155, -26730, 34898, 63139, 146992, 84433, 24009, -21079, -1567, -31733, -114128, -112255, 17801, 22007, 3804, 49109, 33979, 81002, 38674, 80729, 52375, -20855, -57825, 19552, 7232, -48212, -125120, -164612, -36470, 65971, 24520, -11653, 10377, 1173, 24716, 28578, 51390, -14834, -64405, -72596, -34822, 156865, 198949, 151320, 66697, 45561, 51438, 16146, 79307, 36380]
17230C6380j9656L5727k1169J4986O6198k1737l5793R6057P747K8049o7320j9768
17218I9701M5500l7480n6497j8763q5985j2204O5129j11145l4428R5967P2783
17207B2578p0170q6006J6263P3305Q8804m2255m3425L3691p2867J16377Q4925
17196A21220L4784n664l3463m4483m2423n6470M2120P889K6474N0237m9522J8160
17184F8859j7339o7019n3377J4289M4641L222N760M7937o1452n5258K1094M9356
17172G13l2526j0535J5267M1319m912J4415m7317p2234K5039P3119p8709J8114
17160e8247J7655P0364o8198o7049J8027J32253Q2750m7925L7227J4295j03475
17149B7677m5511o3022P3676k9851j16620m6874R509O0387J1425m0458O2438J16352
$$ y = [36380, 16724, 52451, 31282, 46268, 112466, 90729, 54936, 150993, 158740, 186789, 119469, 99701, 145201, 107721, 51224, 32461, -53524, -65728, -599, -111744, -146172, -50205, 22578, -47592, -133598, -117335, -44030, 44774, 2519, -40906, -7215, -80082, 36295, 121220, 156004, 150340, 116877, 72394, 29971, -26499, 15621, 23510, 49984, 100221, 50699, 68859, 51520, -15499, -68876, -54587, -9946, -6724, -964, 46973, -14479, -69737, -48643, 713, -31813, -42348, -27081, 14238, 9326, 23741, -23576, -95810, -70771, 2348, -76361, -58247, -40592, 29772, -38426, -105475, -87448, 44805, 127555, 79630, 116857, 131152, 27677, -17834, -80856, -7180, -37031, -153651, -200525, -191016, -130629, -119204, -159662, -97224, 19128]
17137A9128K5099O679M6018N7593N2061k2176j25321r3974M4027M6960l0114O1899
17125H7879N5415l7921l8097j0542Q75n9623m6437K8509j8876o5870M50m9682
17113a53920j2626J780J5810K1830P9121R1819M5668q4540j5691L640j47170j5110
17101a69389j5024P084J322O0677J7826r9787J1642R2162J40835J4680r2764Q009
17089b2727Q3208R2013j0504l3085J1744o3084p8691P4179l4637K427m3209J4158
17077h208k5798q8101j6375Q2756J19699P6026O992m8125N3352M9908q6842q1949
17065C3335K40j20202j06733l1023L5743K7255O3735J21642R8687k6396q7548
17054H735j3977K4547o8071m6319Q042J36655N6126m3888M703n7161l9276r39
$$ y = [19128, 44227, 50906, 96924, 154517, 206578, 184402, 59081, -34893, 9134, 56094, 25980, 87879, 143294, 105373, 67276, 56734, 57609, -2014, -48451, -19942, -38818, -104688, -104238, -153920, -166546, -164766, -148956, -127126, -48005, 43814, 89482, 4942, -10749, -7109, -154279, -169389, -184413, -177329, -176007, -115330, -97504, -197291, -185649, -93487, 47348, 62028, -30736, -22727, 60481, 152494, 141990, 108905, 120649, 57565, -21126, 53053, 18416, 20843, -22366, -8208, -34006, -122107, -138482, -55726, 63973, 139999, 146991, 98866, 152218, 202126, 115284, 33335, 33575, -86627, -193360, -224383, -188640, -161385, -97650, 23992, 122679, 96283, 8735, -5242, 19305, -48766, -95085, -87043, 49612, 105738, 61850, 66553, 9392, -29884, -30823]
17042c0823Q5551J36321N5824J45683K19768Q4076J39101R8381N145J16018J24306
17031A179351K78550K66307j3036k62460m1884P0155n8909J2649p9240j4397Q2539
17020A419625j77123k77581p2655K6848K9643j18528k22448k50528j69666R1746
17010B79333k150L5089J1634M1437L0001j06207j40695j16297q6616P8055M3098
16999F6682L2012K7907o1452p5679L5585O612P3132P3337M9538J3101q0193p2379
16987H8203L8984m1509P693o0630o8102r5748n6127L2484L5940L4541N5714J7813
16975a0744j8272K3109l4210j6366K9864k7718o5779O5413K01103K8217M848K6001
16963B05466n8095m2111j7246K927L0433M5081K8253Q330n4961O5314j59699r7273
$$ y = [-30823, 54728, 191049, 246873, 392556, 612324, 696400, 835501, 933882, 939027, 1055045, 1179351, 1457901, 1724208, 1711172, 1448712, 1406828, 1476983, 1418074, 1430723, 1351483, 1337086, 1419625, 1242502, 964921, 892266, 919114, 948757, 830229, 607781, 357253, 187587, 279333, 277183, 312272, 323906, 365343, 395344, 289137, 148442, 32145, -54471, 23584, 66682, 98694, 126601, 65149, -10530, 25055, 31667, 104799, 178136, 227674, 240775, 160582, 88203, 127187, 85678, 93371, 32741, -35361, -131109, -187236, -154752, -118812, -84271, -28557, -10744, -29016, -5907, -40117, -56483, -26619, -54337, -120116, -54703, 146400, 174617, 179465, 205466, 147371, 105260, 88014, 90941, 121374, 166455, 194708, 203038, 148077, 213391, 53692, -43581]
16951d3581l290L3496K1961P0484P3928J8042j2404J5004n3592j02128k1157L4562
16939C1325l7556O130n750k9911K8608K7362j21313l4325k9k3488K8151J09658
16927b1138K6507J2547N0291p0138l4382p134m5871Q0096Q3416l30k9567O6976
16915A11273k5281K1458J16426j5076o9348r7475j691Q1878k8508m5712O8399
16904A16343K0382j30735p0027k3565L4384O373m5069Q7449K4580j6641o9037
16893f5563J38223R215p7199J6814L2676p0871l9927L6045K2080m6536n7787n4475
16881a57305Q8361M8259L3640L247J30232m2547J790R4661j4700j9608N03n0640
16869A15893j16647r6440Q0475J55035r09K3382q172p3225j09462q6413J722N2649
$$ y = [-43581, -46871, -13375, 8586, 79070, 152998, 171040, 158636, 173640, 120048, 17920, -3237, 31325, -6231, -101, -5851, -35762, -7154, 20208, -101105, -135430, -135459, -158947, -130796, -21138, 5369, 17916, 68207, -1931, -36313, -43447, -89318, -9222, 74194, 73864, 44297, 111273, 85992, 107450, 223876, 208800, 139452, 41977, 40286, 122164, 93656, 47944, 116343, 136725, 5990, -64037, -87602, -53218, -46845, -91914, -4465, 20115, 3474, -65563, 72660, 81875, 4676, 21490, 54166, -16705, -56632, -20587, 1493, -45043, -102830, -157305, -68944, -20685, 12955, 16202, 146434, 103887, 105677, 200338, 185638, 166030, 166533, 115893, -754, -97194, -16719, 138316, 137407, 160789, 152617, 79392, -30070, -116483, -114761, -62112]
16857f2112k8886N4404J9962P6934O0594R971o0294o2869j6198Q2392O8097l7612
16845A04383j5515o9736j3235j2725l311p1674m2657N1485M4673N0632K9415M6686
16833I8421r55p9587j2995k145P5761M0934j06174L9262J6906j3710r0482M2186
16821G422M4037n3983m365N1274q9028l0985L3467O0570n0436r1390N8466N8670
16809f281M2165O1532M6693l9589n0362n9546Q4065j04135r258k7934J6409j287
16797d7528j4844J5112n3578O3764K8620p6984o3367L8883P3372M2211K5885n7265
16785b5719M6090J6331p4034l2234o4652O9397k6209l7604K7967N5561L5712P9162
16773F9768l6107L78o3269J9339J01590j42900j0185K6121q95p4045n2568n2406
$$ y = [-62112, -90998, -36594, -16632, 60302, 120896, 130867, 70573, 7704, -8494, 73898, 141995, 104383, 88868, 19132, 5897, -6828, -10139, -81813, -124470, -72985, -28312, 22320, 51735, 98421, 97466, 17879, 4884, 2739, 78500, 119434, 13260, 52522, 69428, 55718, -34764, 7422, 51459, -2524, -6889, 44385, -44643, -75628, -42161, 18409, -32027, -123417, -64951, -6281, 35884, 97416, 144109, 104520, 54158, -5388, 78677, -25458, -34716, -62650, -46241, -47528, -62372, -47260, -100838, -37074, -8454, -85438, -148805, -109922, -36550, 5661, 31546, -25719, 20371, 36702, -37332, -69566, -134218, -64821, -91030, -128634, -100667, -45106, -9394, 69768, 33661, 34039, -29230, -9891, 91699, -51201, -61386, -35265, -36160, -110205, -162773, -215179]
16761b15179M7022J06988L9452k0163q2082n1689M3030Q0628J00016j8569o1729
16750c2275n4713R298k3645J26754J15758j8801r9347j14622q1623q983k6585
16739b08784M6883R094p2636O7091J28380k1155O2690m734j6181q894J8209L4153
16727C4116o4157K3246l9011m8362L3176P3296Q9914j9165j24621L8919R2423
16716H9774K9353J5475j5682M2609o967q962M850m0909l789k5336m6820K6524
16704F0120J8739J01425R6260j4494o6029R094j9782o3750r4586J8614K9431m3218
16692C1824k5763P9639q0234m0461m2713K1101l7638M036L5850P6965L3026N132
16680F0764n4993R4578L3761n0938k4334j0838q9540k8997J10165M4042M9136
$$ y = [-215179, -168157, -61169, -21717, -41880, -123962, -175651, -132621, -51993, 48023, 29454, -32275, -86988, -77690, -101335, 25419, 141177, 122376, 23029, -91593, -173216, -182199, -208784, -161901, -152807, -225443, -158352, -29972, -51127, 11563, 6829, -9352, -18246, -37, 34116, -30041, -6795, -45806, -94168, -60992, 12304, 102218, 83053, -41568, -2649, 89774, 119127, 134602, 118920, 161529, 154562, 145600, 150450, 109541, 105752, 80416, 33596, 60120, 78859, 180284, 276544, 262050, 196021, 205115, 185333, 121583, 26997, 45611, 75042, 31824, 6061, 85700, 5466, -34995, -77708, -56607, -94245, -90209, -54359, 22606, 55632, 60764, 5771, 100349, 134110, 83172, 58838, 48000, -41540, -70537, 39628, 83670, 132806]
16669A32806j54396r4816j2156N7065K1889M4773J360J7929k9425q9559P3774
16658c0756k8521N6805j8352j6525P4122J12378M461N0075q7318j44090l0718
16647e8439N0802l9266l5700M930Q5746R0772k2158j6751m6144j9897l9262k0447
16635f5814Q1767Q866J8252J8966n2106L0715N4306k5979j3198o1121L6770M4491
16623G5915j00341o2892P86m4652N9918J24646j0065j11637r5253p759k3472L1875
16611a62931Q6356J6945K0749K3651q8585n3485M8593r472r901P4726P8858L3858
16599E9362m0350M7726L7319K3052j9567q0594l2586K648l752J368Q3815J02232
16587A80673k8642k8732j22665r1646L5574R2272Q7537M6202j4042m4108n9999
$$ y = [132806, -21590, -116406, -128562, -71497, -49608, -4835, -3475, 14454, -14971, -104530, -30756, -59277, -2472, -20824, -37349, 36773, 149151, 153612, 203687, 116369, -27721, -58439, -7637, -46903, -82603, -77673, 8073, 98845, 76687, 59936, 13792, -6105, -45367, -65814, 15953, 24819, 43071, 62037, 9931, 40646, 94952, 68973, 55775, -5346, 31424, 75915, -24426, -87318, -86532, -131184, -71266, 53380, 43315, -68322, -163575, -171334, -194806, -162931, -76575, -59630, -38881, -15230, -103815, -157300, -108707, -118179, -128080, -53354, 25504, 59362, 19012, 66738, 104057, 127109, 107542, 26948, -5638, -2990, -6742, -5374, 78441, 180673, 152031, 123299, 634, -91012, -55438, 36834, 124371, 170573, 156531, 112423, 52424]
16576E2424n9454l2544O8267J39951N5706m0393m4298n627j3037J0558R5554o949
16564B20158o5611J2231M456l0324j59864j11242K9012K57o2015J29028M6253
16553A2339P809P70p9440l1901K8543J06102L7251q3528m7487K4867K6171l1233
16541b9737m306K0950N5813J0870O7712p184o6480j3416J7490n2069n4303j9252
16529g3912J7126N8809K5765J05705P1964o9608j16860m6234N7148O7037J1241
16518A08181q8858r8378j9640P9391J08904j1088k3586K4003r0106K9221P4180
16507I2224j1640n9886r3971l290J0684l0167J0768Q91q9824j8684k5189J45M3218
16494a74721J393j0277M4172P6759O1878l6537j0130L9520p0542l6943m007j1648
$$ y = [52424, -7030, -39574, 28693, 168644, 224350, 183957, 139659, 134032, 120995, 131553, 227107, 220158, 154547, 166778, 171234, 140910, -18954, -130196, -101184, -100927, -162942, -33914, 12339, 20148, 20918, -58522, -90423, -61880, 44222, 81473, -2055, -49542, -24675, 1496, -29737, -34043, -13093, 42720, 53590, 121302, 114118, 47638, 34222, 51712, -357, -54660, -73912, -56786, 2023, 27788, 133493, 205457, 135849, 18989, -27245, 29903, 96940, 108181, 19323, -79055, -98695, -19304, 89600, 78512, 54926, 78929, -11177, 18044, 92224, 80584, 20698, -73273, -76563, -65879, -96046, -85278, -84387, -174211, -192895, -218084, -217939, -174721, -173328, -183605, -139433, -62674, -796, -37333, -47463, -7943, -78485, -115428, -119435, -131083]
16482a31083L204o6470J5149N9346K335k8369J47993R7207j6427Q138m1066j1573
16470C8384l9516m0059m9030P771M8463j0008q5348J20326J36260l5199o8623
16459B3421k8374k0935l1610l0658L3629J0222J11558J40873r4111j54590l4952
16448g5527j0991r3212p6049N6542O3852k7046Q5708O7607k1325L1505j3529p1977
16436h4442j44522m9838J04921J88501M0746J6324R570o8865j08291L8462P2844
16425A5410Q8580k3210N3827k0105q6698q339l7748M2357K1632M909k6322p1923
16413d7630m0439J7619l5097P6954Q1661m2579p8160L173J15400R1541j2068n3026
16401G7349r1475M8055o1455m6998O1897N9298M420k2566o5499j49469O7760N7353
$$ y = [-131083, -127879, -194349, -179200, -119854, -117519, -145888, 2105, 99312, 82885, 91023, 49957, 38384, -1132, -41191, -90221, -82450, -33987, -43995, -129343, -9017, 127243, 92044, 23421, -4953, -25888, -57498, -88156, -54527, -44305, 67253, 208126, 114015, -40575, -75527, -86518, -179730, -255779, -199237, -135385, -162431, -76723, -9116, -30441, 1064, -12465, -84442, -228964, -278802, -173881, 14620, 55366, 71690, 81260, 12395, -95896, -57434, 15410, 103990, 80780, 134607, 114502, 27804, 19465, -18283, 24074, 45706, 50615, 24293, -47630, -88069, -70450, -105547, -28593, 53068, 10489, -67671, -64498, 50902, 142443, 130375, 77349, -14126, 33929, -27526, -74524, -12627, 46671, 51091, 28525, -36974, -186443, -118683, -61330]
16389f1330J1422N6199J45J9398n7050j18276K8843k5246k4015K4215K6680o905
16377a25920M1728j4315Q9242P2436k0212O4313M1426K6657j9772J9364n2072
16366A22875q6894j29124R716N5913M0486p0008j25769l0416O2404Q9917Q7127
16355B6227k9910j17969P6940R1529O8433q7693n6652N0638n1981m6595p8443
16344a55476K8484Q473L363L1460J65403O245p2527m6556m4557m3849p0563R5365
16332i4735P6898R4812K1434o0633o172j498j9747r9044N1899M0072J9534j7735
16320E085j21662j4835J61781Q5894l4339p7317k9405j1256L9504O5010J4058
16309H2518j0175K8459k3683k8494o9487j6808N7664k3324k42Q8870k3432m7169
$$ y = [-61330, -49908, 6291, 6436, 25834, -31216, -149492, -120649, -145895, -169910, -145695, -119015, -125920, -84192, -98507, -9265, 63171, 42959, 107272, 148698, 175355, 155583, 174947, 122875, 35981, -93143, -83427, -27514, 12972, -57036, -182805, -213221, -150817, -60900, 26227, -3683, -121652, -44712, 46817, 115250, 27557, -29095, 21543, -30438, -77033, -155476, -126992, -118519, -115156, -83696, 81707, 87952, 15425, -31131, -75688, -119537, -190100, -94735, -17837, 76975, 98409, 37776, 31604, 30106, 10359, -88685, -36786, 3286, 22820, 5085, -116577, -131412, 30369, 116263, 81924, 4607, -24798, -36054, 3450, 68460, 82518, 72343, 100802, 77119, 48625, -20862, -37670, 19994, -3330, -3572, 85298, 61866, 14697]
16297A4697L1343J09968m7806j38880o8957J2620R4050L0268n4815n3569l3239
16286a04320m036K0522j3226L3182Q3130O3588J4657o201r8556j21297L0398N8345
16274d3814r3004M7166l1145J3331l520Q7915M5322L6500P0262M2860r7435p5593
16262a155n0190m8185J03997L2906j04596j12874N2133k5685J03754L0855K682
16251a6358Q3344l6959J32O1921k1574K8967O4278m5570j47635k1202j4841q7279
16239a52776l8545l434J23065K0259K710J06508N5381j5741n4108r0756m520R4042
16227D2085n8960k2451P7667K0559j08814k9561j5530k1831q9632L9574J10704
16216e6190L0356j26219O4129j137N2077k400O5568K789O29M0670j772k6154q5009
$$ y = [14697, 46040, 156008, 108202, -30678, -99635, -87015, 7035, 37303, -17512, -71081, -104320, -108356, -87834, -101060, -67878, 15252, 78840, 93497, 87296, -11260, -132557, -102159, -43814, -136818, -89652, -120797, -107466, -110986, -23071, 22251, 58751, 129013, 171873, 74438, -1155, -51345, -99530, 4467, 37373, -67223, -180097, -127964, -153649, -49895, -19040, -16358, 66986, 30027, 30159, 92080, 70506, 99473, 163751, 118181, -29454, -50656, -65497, -152776, -191321, -194755, -71690, -51431, -48721, 57787, 113168, 97427, 43319, -47437, -51957, 42085, -16875, -39326, 38341, 58900, -49914, -79475, -95005, -116836, -206468, -166894, -56190, -25834, -152053, -87924, -89061, -36984, -39384, 26184, 28973, 29602, 70272, 68500, 42346, -42663]
16203d2663k3126M5201p4279J2696M8805L3723O2465L4131l2817M5189N6198n0670
16191A14853L6587o6396j0998p853m463J3974R742o3709l9264R444j4903K2089
16179h97p1247j1913R1653n3873R6665J13698p1966m7205J3606L4212p1671j03526
16167h2464l860R6367j5569J1781N0700o2646k2926j02995r198M5126j7238L4934
16155g7988R3803j2881p0339j9269K2942J02513r4815q7942L6242J43674R5995
16144A31935n9086j19160o4244J0257J16044K2081k4709j3109M0841K5996q1466
16133a4620P785N0252m9324n1871P9211O6897n0877q5369l0735O4655M5091M3651
16121G4746j06234q4453j11580N4317O7739Q6502L2180J04260o0199r4200n0882
$$ y = [-42663, -65789, -20588, -94867, -82171, -33366, 357, 62822, 96953, 64136, 109325, 165523, 114853, 151440, 85044, 74046, 66193, 61730, 75704, 85446, 21737, -17527, -8083, -22986, -897, -72144, -84057, 7596, -46277, 50388, 164086, 92120, 44915, 58521, 92733, 21062, -82464, -86324, 10043, -5526, 6255, 56955, -5691, -28617, -131612, -140810, -95684, -112922, -77988, 15815, 2934, -67405, -86674, -63732, 38781, -56034, -143976, -107734, 35940, 131935, 72849, -46311, -110555, -100298, 15746, 37827, 13118, 9, 40850, 66846, -14620, -6835, 43417, -5907, -57778, 21433, 88330, 37453, -47916, -78651, -13996, 31095, 74746, -31488, -115941, -227521, -173204, -105465, -18963, 13217, 117477, 57278, -36922, -87804]
16110h7804Q3444N3579m132o4665j9143J41339O054r2998q536n0293J3428r6203
16098a25930N6019N6943K348l1725M0209J3522K0789n704J5643o8375q3136m5342
16086a54739n5903J3043j5251L9596R9512J5251J2929O9396q5833q8908K8913
16075a21994L8911J0849N973M8255N459p7160L3055L3410J21777o7118o8277Q3846
16063D6986O6716r866r6340j4867J6468o3438n0500O1248J72609r1014q2571J9254
16051b5315j641j04556M6342J8170M5274M0155r4413L0836j3161J13845O5861
16040A21397r5426q6536J13419P0116m5464P9391k8525l1834l9509m6334n7815
16029d7120l9527q040n2377j5445M2213P1002L5151J8630l1655j271P498j04858
$$ y = [-87804, -4360, 49219, 45087, -19578, -38721, 102618, 108672, 15674, 7138, -43155, -29727, -125930, -69911, -12968, -10620, -42345, -2136, 11386, 32175, 26471, 42114, -26261, -109397, -154739, -210642, -197599, -212850, -173254, -73742, -58491, -45562, 23834, -61999, -150907, -121994, -83083, -72234, -66261, -18006, -12547, -89707, -56652, -23242, 98535, 31417, -36860, 46986, 113702, 103836, 7496, -7371, 9097, -54341, -104841, -43593, 129016, 38002, -44569, -25315, -26956, -131512, -85170, -67000, -21726, 18429, -75984, -45148, -58309, 55536, 121397, 25971, -60565, 52854, 122970, 77506, 156897, 128372, 96538, 57029, 10695, -47120, -86647, -94687, -147064, -162509, -120296, -49294, -14143, 4487, -27168, -28439, -20941, -125799]
16017a25799j590J01003M2104o6805J0778J0690J3601Q017q2730j11565o3010
16006b65306R8595J12023m0558k4197J4775J3085L1455K3177M6993j00854J6688
15995g4124P873o55M8067K0266n4817L9083p1658n9891K1319P9062l114N5834
15983G245m0700j0415J08281M9819k8856q9043J10661k2731l5547o368k0922O4072
15971H5496O8786q8922j19098P4860Q3100n3532m8595l6045K607j24545K6557
15960a29331K1690J6634n9559k0854J3542Q6899L2740n7006n2068J04922N1479
15949I088j4850q1962r1823k5611Q5905R0568J35142J7276J8662m3n7197j05171
15937b0016j20951M2374R6530P8975K381j14338q4066K5284M9327o9773j5890
$$ y = [-125799, -127389, -26386, 15718, -51087, -40309, -29619, -16018, -8001, -90731, -202296, -265306, -166711, -54688, -95246, -119443, -104668, -91583, -60128, -36951, 10042, -90812, -74124, -66251, -66906, -18839, 1427, -53390, -14307, -85965, -145856, -124537, -45475, -48589, 7245, -33455, -43870, 64411, 114230, 85374, -3669, 106992, 84261, 48714, 42346, 21424, 85496, 154282, 65360, -53738, 21122, 104222, 50690, 2095, -33950, -31343, -155888, -129331, -107641, -91007, -150566, -171420, -157878, -70979, -38239, -95245, -147313, -42391, 9088, -5762, -87724, -179547, -205158, -119253, -28685, 106457, 123733, 142395, 142352, 85155, -20016, -140967, -98593, -2063, 76912, 79293, -35045, -119111, -93827, -44500, -114273, -130163]
15926a30163K0729o1059j8508O3225O7908n0974J2542Q3875j4948j4565Q4283
15915D2345l0313p983P6642P4215j7259j434J6934n0251k6262m6765N870J4176
15903D9915q279j4693l8908K1434M1800j4144p022P2829J00029k1327j2689P7039
15891B45984j11551n5537j9919n1781o326q6464P9134R6916k0452l5006n4930
15880a9932K5255N7817n3549o1186J2419O261L0095P9913r503K3617R095l1644
15868F8658l1607m5389L8697l72N7112J560m6598L3798L9334K3804R7138o7633
15856A68502j13789o0104J5919L0850L2679L4849Q338m2373m3285Q1430K450l8608
15844G6858R0900J8308r465j5091q0569l5013j4201q068K7834l4906N9567p1272
$$ y = [-130163, -109434, -170493, -189001, -125776, -57868, -108842, -96300, -12425, -27373, -41938, 42345, 12032, 4049, 80691, 154906, 137647, 136213, 153147, 102896, 76634, 29869, 35739, 49915, 41636, 26943, -11965, 9469, 51269, 37125, 30103, 102932, 202961, 181634, 168945, 245984, 134433, 78896, 58977, 7196, 870, -85594, -6460, 90456, 70004, 34998, -19932, 5323, 63140, 9591, -51595, -39176, -32915, -2820, 77093, 67590, 91207, 100302, 68658, 37051, -8338, 30359, 29987, 87099, 88659, 42061, 75859, 115193, 138997, 236135, 168502, 54713, -5391, 10528, 41378, 74057, 108906, 117244, 74871, 31586, 113016, 115466, 76858, 167758, 186066, 176601, 161510, 80941, 45928, 31727, 23659, 51493, 16587, 76154, 4882]
15832D882q1874O0441M2819o2490j3787M6844n2403j3416J5932M4661O1138p1817
15820a9070k5027K678o4361m4451n8859L8756R9460q708K6512N0780L8863L9762
15808G6335o6548m9672L0868L1632p0942r53J9350m4449Q4249M1112L307k5276
15796B9013L899O1690N4979O804q1494n8134K3297K768J721M5645R6948m8564
15784A38572k0503k8404n9515p5674l6923O4490K2679N6027J05608J3931q3634
15773I6654o3918M7563P8581j12339l8395Q9709j2461j8770M2226K5628K3145
15762A57623J153o3228n5070m9782q9215k6449K6549Q335K2548j0218k1602J7088
15750h2268k6672L9161L5382j1835N4015j45303l3046L5861m7090j1402J8082
$$ y = [4882, -76992, -16551, 26268, -36222, -50009, -3165, -55568, -68984, -53052, -8391, 52747, -19070, -44097, -41419, -105780, -150231, -209090, -170334, -70874, -79582, -53070, -2290, 36573, 76335, 9787, -39885, -9017, 22615, -48327, -49280, -29930, -74379, 9870, 50982, 54289, 29013, 32912, 94602, 149581, 156385, 74891, 16757, 40054, 42822, 44543, 90188, 187136, 138572, 118069, 89665, 30150, -45524, -82447, -17957, 4722, 60749, 166357, 180288, 96654, 32736, 80299, 158880, 46541, 8146, 97855, 85394, 66624, 108850, 134478, 157623, 158776, 95548, 40478, -9304, -98519, -124968, -98419, -90084, -67536, -77754, -99356, -82268, -108940, -69779, -34397, -46232, 7783, -137520, -170566, -134705, -181795, -193197, -175115]
15739a75115J04306J09585K7927l5957j48293L6660K8024P1797k6441m4805P2191
15728A9879J21900J4920o4449K150q7930J780K8256j6671n712M2432j41483L2340
15716e2588J07618r4815o5162K2393K177K8441Q85k9732R761J13092l5297M4534
15704E1307M0264P0291j3722j17117k3270L9356q3592j32592P2093Q7855J01224
15693I2097R9071K6886p5369m9766o5087J43023l8802j01235p419J6463R089J05327
15681A54278K0757m1758L8171N6526j553j5776o7460j18897p0590P590P4010j3602
15669B1696k386m6565p4840J6529Q3707K4723j236p6374O7879P0952J9446m3792
15657E9739P6808J16368K409j14398j56362p373o679j7788L1163j4102l5307L0061
$$ y = [-175115, -70809, 38776, 66703, 30746, -117547, -80887, -52863, 18934, -7507, -52312, 19879, 141779, 156699, 92250, 94400, 6470, 8250, 36506, 19835, 14123, 56555, -84928, -52588, 55030, -39785, -104947, -82554, -80377, -51936, -51051, -80783, -71022, 42070, 6773, 51307, 91571, 161862, 148140, 31023, 7753, 47109, -36483, -169075, -96982, -9127, 92097, 191168, 218054, 142685, 92919, 27832, 170855, 132053, 30818, 23399, 39862, 48951, 154278, 175035, 133277, 171448, 227974, 226421, 210645, 143185, 24288, -46302, -38712, 35298, 21696, 19310, -27255, -102095, -85566, -1859, 22864, 21628, -54746, 13133, 84085, 103531, 59739, 136547, 252915, 255324, 140926, -15436, -22809, -29488, -47276, -16113, -30215, -65522, -35461]
15645c5461l4275M0028O3381L0137R729j13506l3707N2293L8911k0086J6701K7764
15633D1909Q278k6578m6649K192P3471K6428k8455l2867j8140p9854m9898m2304
15621a72467j7888J4355O1453L7279P3135l7739m8495J572J25669N5713R646J9511
15609A21744m8958M0584N2072r4674L0119k8645M4989M5494n1205j04802n3800
15598d7082L0354p582j6514m4658k7625J33484m473R6951J5209j03912j62378
15587a38226k4305J04408J0756J7035j925P6643N8321n1312m9002L678r3089N0906
15575c6112K3760o5732p079N7483J02289M1965J7189j0390L1961p5216q9739K4766
15563A5145N6832m7275P1753l8503m5791l1096J0592L4177J15164p2457q3183
$$ y = [-35461, -69736, -29708, 33673, 63810, 73539, -39967, -73674, -21381, 17530, -2556, 14145, 41909, 50187, 23609, -23040, -20848, 52623, 79051, 50596, 17729, -411, -80265, -130163, -172467, -190355, -176000, -114547, -77268, -4133, -41872, -90367, -88795, 36874, 92587, 102233, 121744, 72786, 113370, 165442, 70768, 100887, 72242, 117231, 162725, 111520, 6718, -47082, -16728, -24310, -40824, -85482, -113107, 20377, 15904, 112855, 128064, 24152, -138226, -162531, -58123, -47367, -30332, -32257, 44386, 102707, 51395, 2393, 6071, -87018, -36112, -12352, -78084, -85163, -27680, 74609, 116574, 133763, 123373, 155334, 80118, -9621, 15145, 71977, 24702, 96455, 57952, 12161, -18935, -8343, 25834, 140998, 68541, -14642]
15552a4642K1943M8466K3664k7211m2135k7304j26641J00424J13040J04578k0723
15541A53459r4013J698N439J7478j19513K6612p0999m1833J07155k005P107J17954
15529A08539P4714q8888n1983N2614j01363m2491n6921r068k4084k676M539O3589
15517g3479M1238n6497j0811M4932j20509K1593L1044l1307N4075K3950N6590
15506a9181K7072N1972N35m2544M2285M4366L878m6550m8181j7320k3619q0895
15494a08182m4469R8843R2163l4808r1298j1641M7596R724L9904O8496J7475r4241
15482a0438j00860K3046J53583J18326K7553j0612P7728l5065j12838J6434l1593
15471A15264o9936k1164J9185K591l3686k767j0294L0977J00388j6264M4586p8262
$$ y = [-14642, 7301, 55767, 79431, 52220, 10085, -17219, -143860, -43436, 69604, 174182, 153459, 59446, 61144, 66583, 84061, -35452, -8840, -79839, -121672, -14517, -16522, -9415, 108539, 183253, 94365, 42382, 94996, -6367, -48858, -105779, -114847, -138931, -141607, -137068, -73479, -32241, -88738, -99549, -54617, -175126, -153533, -122489, -153796, -99721, -75771, -19181, 7891, 59863, 60398, 17854, 60139, 104505, 108383, 61833, 13652, -3668, -27287, -108182, -152651, -53808, 38355, 3547, -87751, -99392, -51796, -42072, -2168, 66328, 83803, -10438, -111298, -88252, 65331, 183657, 211210, 200598, 278326, 243261, 130423, 146857, 115264, 45328, 24164, 43349, 45940, 12254, 9487, -807, 30170, 130558, 114294, 158880, 80618]
15459H0618k1168M6371N1127j2660j40822p059K14748Q5114p4863r2032o1135
15448F8239M3754N3421q3201p6098p831k631p2588k3927L3918J09856M1456k45
15436H4123q8821n7090j4367k4139M7982K7292j8354L2052O0158k6986l8136N3359
15424C7073J3809l9227k6138J0158R5282K4371p67k6841n7137p6556J17290O2228
15412A33545k0231q8288k4310l6264N1813J276q0377L4407J5951J9245R1317o6547
15400C1537r9172K2931n4070o5012J9205o0141m3322P7746M5064R1610J6174m3702
15388f1152J7072J1407N8770o125j47292q3534j6829K9383Q9275K0401L7489j6582
15376f7717K2906P5254Q5258L8467j03054j8803Q615J2373n2030r3605R22J06256
$$ y = [80618, 59450, 105821, 156948, 144288, 3466, -3593, 211155, 296269, 221406, 129374, 68239, 111993, 165414, 82213, 6115, -1716, -4347, -76935, -100862, -66944, 42912, 84368, 84123, -4698, -61788, -76155, -100294, -52312, -25020, -43374, -11322, 48836, 21850, -16286, 37073, 50882, 11655, -14483, -4325, 90957, 115328, 114561, 87720, 30583, -45973, 71317, 133545, 113314, 25026, 716, -35548, 16265, 17541, -62836, -28429, -12478, 6767, 98084, 31537, -67635, -44704, -98774, -163786, -144581, -204722, -248044, -170298, -125234, -33624, -17450, -61152, -44080, -32673, 26097, 19972, -127320, -210854, -227683, -198300, -109025, -88624, -51135, -67717, -44811, 30443, 115701, 154168, 51114, 32311, 40926, 53299, 1269, -92336, -91414, 14842]
15364A4842k8201j30376J0302n1144q3108J72611J48937M2721K0301r5826j59507
15353a38448K9170O5193K0768n6802l8927K5745L9007N5409k292N3455n9508p4894
15341h2124k0635N2602j412M211K4421J07007N5288j6293m5401j02546l0484L8057
15329a7309J7117P0628p0896p3927q1981p3178O3766Q2353N1866N7486K9069J5504
15317G0498l0492m2282p1393O4357k1133K7958j30080j00950N8360R3386J27628
15306D5857M665j67372J4185P5056O5021R4623N778L0442N4137J9740j0253o8225
15294A63654k0113k7881R6258n1538r6419o449o1262k2647O9946j5284L5361R052
15282G2678o8769q5377J1503Q5805N5865n4636p1133p9930M9422K7973K4078Q4102
$$ y = [14842, -13359, -143735, -133433, -184577, -267685, -95074, 53863, 96584, 116885, 21059, -138448, -109278, -44085, -23317, -80119, -119046, -93301, -54294, 1115, -1177, 52278, -7230, -82124, -102759, -50157, -51569, -47358, -22937, 84070, 139358, 123065, 77664, -24882, -55366, -17309, -192, 70436, -460, -74387, -156368, -229546, -165780, -83427, -31561, 25925, 54994, 70498, 40006, -2276, -73669, -9312, -30445, -2487, -132567, -233517, -175157, -81771, 45857, 50522, -116850, -102665, -27609, 37412, 132035, 137813, 168255, 222392, 242132, 231879, 163654, 143541, 115660, 211918, 160380, 63961, 57512, -3750, -26397, 43549, 28265, 63626, 72678, 3909, -81468, -69965, 15840, 71705, 17069, -54064, -133994, -84572, -56599, -32521, 51581]
15270E1581r493j1744N5003K2170k9958m6071n4694N19J6496P2828J9521r7385
15258a1227r4858P5874P0785m693o5434j02840K362L1102m0636R9542M0196M1388
15246D1561l4662j27106L940J29255O7768l8711K0531p1680J2295P5560P4747
15235A53498L7072k7314J0436q5652q3619K351j29791m7646J45762j2911k180
15224c9994N1632O774j01219l8261J80650M4942N0076m4644n0092o2131K7197
15213B4930R9016P6012o4351L162M5353n2838r6346L5374R0703l4466m3214l2722
15201E0613K0431M0180l946J0142j1451m0055M483J14360P8497o1427k8552m1562
15189A31713M8312m290j11023l6022P88N0625r3712m9099O2409J5129n4394l5917
$$ y = [51581, 42088, 30344, 85347, 107517, 77559, 31488, -23206, -22687, -6191, 66637, 86158, -11227, -106085, -30211, 40574, 35881, -29553, -132393, -130031, -98929, -139565, -40023, 173, 41561, 6899, -120207, -116267, 12988, 80756, 42045, 62576, -9104, 3191, 78751, 153498, 190570, 163256, 173692, 88040, 4421, 6772, -123019, -170665, -24903, -37814, -39994, 11638, 18412, -82807, -121068, 59582, 104524, 154600, 109956, 59864, -2267, 24930, 123946, 199958, 135607, 138769, 184122, 131284, 34938, 70312, 161015, 126549, 83335, 50613, 71044, 111224, 107278, 117420, 105969, 65914, 70397, 184757, 263254, 201827, 173275, 131713, 180025, 175735, 64712, 28690, 29478, 80103, -13609, -62708, -299, 14830, -39564, -75481]
15177g5481J910Q3747r165k1328M9521J773K5250P535r793k9655l3483L377J27415
15164A21623R1510m3292j46977p7998Q6764J54960n34O822n5490r9658q2100n4472
15152i8842J40419J63104J01504m7698j20274j31084k5913k4249l6095j8932k5852
15141a23912k351Q394M9430K7370M9978M4131m4041M6384M7620j17818r8255Q1024
15129c2046J22501J06720n1735m8983k2365L7058K3981K4810L7845k2245j3023
15118A62518j17473L761L597K719k2069o2971k4569L6699l095j9424O9584m0035
15106a0758j484o5414l2323m550J1565N0128L5740n4388m5391k4466M7619J913
15094i1809k0179R3181P8621L1620M8523o6862p1331J00852O1444q3517j15922
$$ y = [-75481, -73571, 10176, 1011, -20317, 29204, 30977, 56227, 63762, 53969, 24314, -9169, -5792, 121623, 213133, 169841, 22864, -55134, 31630, 186590, 186056, 192878, 137388, 37730, -44370, -98842, 41577, 204681, 306185, 258487, 138213, 7129, -18784, -43033, -79128, -98060, -123912, -126263, -117869, -68439, -41069, 8909, 53040, 8999, 55383, 103003, -14815, -113070, -32046, 90455, 197175, 145440, 96457, 74092, 111150, 135131, 159941, 197786, 175541, 162518, 45045, 48806, 52403, 55122, 33053, -29918, -54487, -17788, -20883, -40307, 29277, -10758, -12242, -77656, -109979, -114529, -102964, -52836, -17096, -71484, -116875, -141341, -93722, -91809, -111988, -18807, 59814, 91434, 139957, 73095, 1764, 102616, 164060, 80543, -35379]
15083c5379l3393R4383L1369j36067q5464M490K962q367J9093m717j50185K4225
15071b77050l53Q314M4125J44490J48659K5832l4951l3223L8460o4994j04750
15060a05441J19780K6415p589N6565o3970k9069l2249J8817J01138J0962l0297
15049F5062n9243M005l3970p3692N5107n2761k2430N8452R5228O1270o3694o6553
15037c3219k8184N4352J18663n0755r254m1827j3592l4745K1151K9406K1916n5841
15025b1929J871J4825n7965r4982j2039K4283J41069L6037q1121m4692K4307N9531
15013a0805M7242n5951n3494M5722k8336J922o2950N4769j4963j32794p9872P5032
15001b14478J0342l6987N6928N3573O5050m4153n881M4667L3970m1096l8844N8013
$$ y = [-35379, -68772, 25611, 56980, -79087, -164551, -160061, -157099, -165466, -146373, -151090, -301275, -277050, -277403, -269089, -224964, -80474, 68185, 94017, 59066, 25843, 64303, -691, -105441, 14339, 40754, 33165, 89730, 25760, -3309, -35558, -16741, 84397, 95359, 65062, 5819, 9824, -24146, -97838, -42731, -95492, -117922, -59470, 35758, 97028, 33334, -33219, -61403, -7051, 111612, 60857, 51603, 9776, -3816, -38561, -17410, 11996, 33912, -21929, -20058, -5233, -63198, -158180, -170219, -145936, -4867, 31170, -49951, -94643, -70336, -10805, 36437, -19514, -73008, -27286, -55622, -53700, -116650, -61881, -76844, -209638, -289510, -214478, -204136, -241123, -184195, -130622, -65572, -109725, -115606, -70939, -36969, -78065, -116909, -58896]
14989e8896M4543R9634J3980J22100K3485l7949n6963p8119o2848l4969m6399
14978g2401j3352J17878P1856q800k9560J7021L5589l2264k5467l1768k1217p4020
14966f6505q6931k9842L7831Q8134p2859L0401q0000q9542R4402P0071J4148M3574
14954d7118J05515J167k8170q9732j6569j5055O9328J4982m6882K5027l0355K933
14942e4929M1064N69j4515j11632j877j1085K4210R0354j5395q088L9464p5782
14930i7642j7759J9002J7805O7587O0199r1783L827o0077L730J15449R7481n3116
14918F4703r6624j36578K6129N2171M6792K2234K3115m8934l9592J31102L9627
14907H4145o742J4942M1987n3395l7459k1981r2183m1451R0801M2457q8276k9686
$$ y = [-58896, -14353, 85281, 99261, 221361, 244846, 206897, 149934, 71815, 8967, -26002, -72401, -85753, 32125, 103981, 95181, 65621, 82642, 118231, 85967, 60500, 28732, 7515, -66505, -153436, -183278, -145447, -57313, -130172, -99771, -179771, -269313, -174911, -104840, -90692, -47118, 58397, 59564, 31394, -58338, -74907, -89962, -20634, -5652, -52534, -27507, -57862, -54929, -13865, -13296, -27811, -139443, -141320, -152405, -128195, -37841, -53236, -61324, -21860, -97642, -115401, -96399, -78594, -11007, 49192, -42591, -38764, -98841, -95111, 20338, 117819, 64703, -31921, -168499, -142370, -90199, -43407, -21173, 1942, -46992, -86584, 44518, 84145, 77403, 92345, 134332, 80937, 43478, 21497, -70686, -112137, -21336, 21121, -67155, -96841]
14895i6841o9491J14155O1393j4626k683O6661J8001k3988o3185k8009q917j0210
14883e7740n8463k0151J35596J27658n2064k7572p2766l0249m546K2349J1777
14872b6171j2332J5011L3840K2145N7862r3647j32539p6867K4379J57251J10865
14861G9797J7762l2236p6193L7936r5745N577R2087M2769m0312R128L3652k2673
14849E1549j49958n8424K3837O7909P054k1376o0338R804L7459m5603o8579L0215
14837a76451O3391Q8010m943j8341L1644J05027L4527K9159r2939p0794l7239
14826d8949O8848J8410n2588o1660O6199K6280l0080j5129k44K1708L7538p825
14814B2508L2165J16721q1792j68048J8045J05707k3400j71629j1982L0068J0664
$$ y = [-96841, -166332, -52177, 9216, -5410, -8093, 58568, 76569, 52581, -10604, -38613, -47530, -57740, -116203, -136354, -758, 126900, 74836, 47264, -25502, -55751, -60297, -37948, -26171, -38503, -23492, 10348, 32493, 90355, -3292, -135831, -212698, -188319, -31068, 79797, 97559, 65323, -10870, 27066, -68679, -63102, 28985, 71754, 31442, 40570, 74222, 51549, -98409, -156833, -132996, -65087, -58033, -79409, -139747, -129943, -92484, -138087, -206666, -176451, -113060, -25050, -29993, -48334, -16690, 88337, 122864, 152023, 59084, -11710, -48949, 19899, 38309, -14279, -75939, -9740, 16540, -13540, -28669, -28913, -7205, 30333, 22508, 54673, 171394, 89602, -78446, -60401, 45306, 21906, -149723, -161705, -131637, -120973]
14803a20973O5483R5446K8877j0720k6614r6298Q498K9669m3161K233R2047M3732
14791F8219k9952q0561Q4426L5405k2379o9503M8664M975K0478M0400O9873j084
14779A68961k668j2843k7383j7173j22350o1808N9724O7041l7728K5371j44J1155
14767E0155M7958j22687j8J939L5794Q1839K6185N1367k424j03560k7862O7999
14755A06685J4880M758L2859p4532j02801K5069J06317J2086o0864J2730L4799
14744A11986J9882O3816M8165m5348N4819j7174r1954k7376M8147m5393j5960
14733A03610R036p1861j49551j07286n2731O8035J12904Q2712L1865N804K6716
14722E9253o8378m5172R3243K0788n6369j9695m3975n5568l4343k604J47018K3786
$$ y = [-120973, -55490, 39956, 68833, 58113, 31499, -64799, -56301, -26632, -69793, -67560, 24487, 68219, 38267, -42294, 42132, 77537, 55158, -14345, 34319, 39294, 59772, 100172, 170045, 168961, 166293, 153450, 126067, 108894, -13456, -75264, -15540, 51501, 13773, 39144, 39000, 50155, 98113, -24574, -24592, -22653, 13141, 94980, 121165, 172532, 170108, 66548, 38686, 106685, 121565, 126323, 159182, 84650, -18151, 6918, 113235, 125321, 64457, 77187, 111986, 131868, 195684, 243849, 198501, 253320, 236146, 144192, 116816, 164963, 119570, 103610, 112646, 40785, -108766, -216052, -268783, -200748, -87844, -5132, 26733, 32537, 59253, -9125, -54297, 38946, 59734, 3365, -16330, -60305, -115873, -150216, -152820, -5802, 17984]
14710A7984Q4130O0791p8999l4482J2315R937N6852l556r185K8999K2037K0806
14698A87629O4406M5989j38647j60371L1550L8069K3316P6895j27962j0818J69340
14687A99396J46114M6989j01173o0597P8333J09779L9038l3696j8714O8725J17654
14676E91848M5213M4437Q188L492J33646K7328R6983J02023J77576J08382k5229
14665A313887p9911o3596J750n0601Q988O1831J1837k3616k08792j05517o395
14654H59865O6909M7091k2693l0477q807O414m9129m8136O3234J9839K1084J8747
14642I43941J26233P9693J12778N3205N9849m0867o8190j9152K0137J32481Q1052
14631A481160r7845o7311q1224j10020j05567o8043m7991j24703j44168J20Q8
$$ y = [17984, 102114, 162905, 83906, 49424, 61739, 71676, 128528, 124972, 115787, 144786, 166823, 187629, 252035, 298024, 159377, -994, 30556, 68625, 91941, 168836, 40874, 30056, 199396, 345510, 392499, 291326, 230729, 309062, 418841, 457879, 424183, 405469, 474194, 591848, 637061, 681498, 689686, 693178, 826824, 854152, 951135, 1053158, 1230734, 1339116, 1313887, 1233976, 1170380, 1172130, 1121529, 1130517, 1192348, 1204185, 1180569, 971777, 866260, 859865, 926774, 973865, 951172, 920695, 911888, 918302, 869173, 821037, 884271, 904110, 925194, 943941, 1070174, 1149867, 1262645, 1315850, 1375699, 1334832, 1266642, 1247490, 1267627, 1400108, 1481160, 1383315, 1316004, 1234780, 1124760, 1019193, 951150, 903159, 778456, 634288, 634408, 634496]
14620F34496q3709r9737j3239k0236o6284m0569K1481L7231r7608O047r747Q4700
14608C52826O226l8127J6340n314j2684j63077o7777j6036p8358o9408R1804J08563
14596A24978R7108L6425j15507q1895P3143Q7166M3699q3035l1335P2116M8652
14585B71515J4491p4459r7335m5205k6211L0473M0175K8468J12634O4952r8160
14574B21338q4811L5166Q2625j4494j10203n7964l5372j2393M9976j5994l429
14563E4445J8924K0302o1454p866J3578J2635q7459J2452N6946L145K6094O353
14551F8095j8184M9144R0L560R8336K1821l3308j31664J1328m76r8822o133K168
14538c4045R6556K5314j6776q8589j02836O0307R3717J10576J1945k082L7939
$$ y = [634496, 550787, 451050, 437811, 417575, 351291, 310722, 332203, 369434, 271826, 277873, 268126, 352826, 359052, 320925, 337265, 331951, 319267, 156190, 88413, 72377, -5981, -75389, 16415, 124978, 222086, 258511, 143004, 61109, 134252, 221418, 265117, 182082, 150747, 222863, 271515, 286006, 211547, 114212, 69007, 42796, 73269, 113444, 141912, 254546, 319498, 221338, 136527, 171693, 254318, 239824, 129621, 71657, 36285, 23892, 73868, 57874, 54445, 73369, 93671, 32217, 24351, 37929, 50564, -36895, -24443, 32503, 35648, 61742, 68095, 49911, 99055, 99145, 102705, 201041, 222862, 189554, 57890, 69218, 68742, -30080, -36213, -34045, 62511, 87825, 71049, -17540, -120376, -60069, 33648, 144224, 156169, 154087, 192026]
14527A92026J4386J3391K1978j6875L7563K6381M5663n8561j5286o8812J03421
14516B95275L1246Q377M8544k0910M235M7024J05313m2620n7551m608J0249m4426
14504C80148P151n3897p5716m5918K5449J11117N4504J6086q4120l3175Q4017
14493C85646o5361k8368j5984r0918r054R5474R2850p7666q0880N7757m3817q7166
14481A32513k7704j4605K8143L3310R4326P1484q9407o3686Q442M4916J9116J6991
14469B53839p1854L4391J03771j1688J27438P6056n4986L5024p7711M5246m8289
14458D11237q8461L1163J8782l9206n2415P720O1056k6657o9736r4148L4083O2028
14446B55446M1415K8500J9062j4949l6351p9891J8513O3894k0015J41672o9351
$$ y = [192026, 206412, 219803, 241781, 224906, 262469, 288850, 334513, 275952, 260666, 191854, 295275, 326521, 334898, 383442, 362532, 366767, 413791, 519104, 476484, 418933, 414325, 424574, 380148, 387299, 333402, 257686, 211768, 237217, 348334, 402838, 418924, 334804, 301629, 385646, 320285, 291917, 275933, 185015, 175961, 271435, 364285, 286619, 205739, 263496, 219679, 132513, 104809, 90204, 118347, 151657, 245983, 317467, 228060, 164374, 172816, 217732, 236848, 253839, 181985, 216376, 320147, 308459, 435897, 511953, 456967, 491991, 414280, 459526, 411237, 322776, 353939, 372721, 333515, 281100, 288820, 349876, 323219, 253483, 159335, 193418, 255446, 296861, 325361, 344423, 329474, 293123, 213232, 231745, 295639, 275624, 417296, 347945]
14435C47945p6653N3620O5026L6650o0697o0295L9432K3764m0124n9289M2847
14424C12226j6411l3990K9034P2800L3677k6385m5707k0845M8646o3490r5457
14413A94098l8200Q6269r14R4883J08115q2069n0454Q9552j0417j25195O2226
14402C27894p456q8784j02785K4780Q9203l7845j03081m726P0458l2321N0361
14391A85698M8033l729k7519J0521K9795J7785k9314M5439M3346j8507m5461K6237
14379B82324M6509J4084j29320q2583M3928l8444J34232M3034J409J01805K1152
14368D38130k3306K8882K4586j05730j08776l0044J9516R2952O8932o1516j3414
14357C30212o3549o1251p9081K728j7222Q601J26632M0636P8774M0461J06642
$$ y = [347945, 271292, 324912, 389938, 426588, 365891, 305596, 345028, 368792, 328668, 269379, 312226, 295815, 261825, 290859, 363659, 397336, 370951, 325244, 304399, 353045, 289555, 194098, 155898, 242167, 241253, 336136, 444251, 362182, 311728, 401280, 390863, 265668, 327894, 320438, 231654, 128869, 153649, 242852, 205007, 101926, 97200, 167658, 135337, 185698, 233731, 230002, 202483, 213004, 242799, 260584, 231270, 276709, 320055, 301548, 256087, 282324, 328833, 342917, 213597, 131014, 174942, 136498, 270730, 313764, 315173, 416978, 438130, 414824, 443706, 468292, 362562, 253786, 223742, 243258, 336210, 405142, 343626, 330212, 266663, 205412, 126331, 129059, 111837, 120438, 247070, 287706, 366480, 406941, 513583]
14346E13583P2239L2885Q5703n786j22977q2818l3998P3881Q8273N9354J2238
14335F92577O2166O885J0832j9883L6398R776j5837l2873j39445q0375j7952k6992
14323D85277N3984P6446J16581J9790l4594k2576O346L1607o7469J7689J7920
14312G01001k0963J12924R3349q0949q5141K4978J23328j9268M96P2259q1337
14301H40677m928N7686K1956Q4236M6594j14161l469O5367P127O5997j7283l8225
14289A011574j7272J13147O1370Q4676l332l34J6631q301J67061L9049K834L8584
14277A505687J53772J86077K3074p2724J7454Q2171P9043P7799L2360P6404R8538
14266B259655L7320N2317m2070Q5253J18612K44686J60577P1400J90878J58444
$$ y = [513583, 585822, 618707, 704410, 698624, 575647, 492829, 458831, 532712, 620985, 680339, 692577, 754743, 761628, 772460, 752577, 788975, 798751, 782914, 750041, 610596, 530221, 512269, 485277, 539261, 615707, 732288, 752078, 717484, 694908, 701254, 732861, 665392, 683081, 701001, 680038, 792962, 886311, 805362, 720221, 745199, 868527, 849259, 849755, 922014, 840677, 835749, 893435, 915391, 999627, 1046221, 932060, 928591, 993958, 1001085, 1067082, 1049799, 1011574, 994302, 1107449, 1168819, 1253495, 1250163, 1249829, 1266460, 1258159, 1425220, 1464269, 1467103, 1505687, 1659459, 1845536, 1868610, 1795886, 1813340, 1895511, 1974554, 2052353, 2084713, 2161117, 2259655, 2296975, 2349292, 2307222, 2392475, 2511087, 2755773, 2916350, 2987750, 3178628, 3337072]
14256C337072J08469K48433J68159K22699K32174K98383K85611L32629M03387
14247E637016L66413L32892L19896M67501N93908O52194O74451P34889Q77817
14238A0656977Q67306J016572J066481J373926J654500J720350J826402K264927
14230B2447441K663957L030567L556694M110102M783123N578467O680302P983340
14222F0833993R129957J0671439J2409857J4294525J5939686J7158998J8033838
14215A58472293J8101510J7274830J5694475J3402230J0670227P647017M577457
14208B45840039J358498j874886m859752p066399q492024r182641r222630q706158
14200A97794047p891080o991278n947580m926637m004812k873245j818969r10824
$$ y = [3337072, 3445541, 3693974, 3862133, 4084832, 4317006, 4615389, 4901000, 5233629, 5637016, 6003429, 6336321, 6656217, 7123718, 7717626, 8369820, 9044271, 9779160, 10656977, 11524283, 12540855, 13607336, 14981262, 16635762, 18356112, 20182514, 22447441, 25111398, 28141965, 31698659, 35808761, 40591884, 46170351, 52850653, 60833993, 69963950, 80635389, 93045246, 107339771, 123279457, 140438455, 158472293, 176573803, 193848633, 209543108, 222945338, 233615565, 241262582, 245840039, 247198537, 245323651, 240463899, 233397500, 224905476, 215722835, 206500205, 197794047, 189902967, 182911689, 176964109, 172037472, 168032660, 165159415, 163340446, 162429622]
14192A62429622K19135J149839K169268L297876M477101N710256O944641Q159389
14184A94557127R304769J0227456J0784395J0664933R921918Q408800O058437
14177B59927835L077790j60589l487696o749649r720878j2473232j4797536j6449452
14169A99166593j7392148j7370283j6609164j5331154j3776646j2355565j0805474
14162I5526159r433825q213823p206899o299440n367007m901299m360106l860481
14154D5883279l393074l023651k670245k426017k259569j975720j739741j543200
14146B6852062j365159j303906j162745j086129j151715q74974q76358q28829
14138A8202247p86285p31591p58005p37896m80808l80267n03993o11114m65185
$$ y = [162429622, 162648757, 163798596, 165967864, 169265740, 173742841, 179453097, 186397738, 194557127, 203861896, 214089352, 224873747, 235538680, 245460598, 253869398, 259927835, 263005625, 262845036, 259357340, 252607691, 242886813, 230413581, 215616045, 199166593, 181774445, 164404162, 147794998, 132463844, 118687198, 106331633, 95526159, 86092334, 77878511, 70671612, 64372172, 59005165, 54103866, 49743760, 45883279, 42490205, 39466554, 36796309, 34370292, 32110723, 30135003, 28395262, 26852062, 25486903, 24182997, 23020252, 21934123, 20782408, 19907434, 19031076, 18202247, 17415962, 16684371, 15926366, 15188470, 14707662, 14327395, 13823402, 13212288, 12747103]
14129A2747103m09864l53926k74814l40304l93520k74283k61225k82096k91301
14120I865770l13319j55266j46168j38980j01864j99439k06117j31484j00605
14111H372528k13429k28656j92529j15584k12743j73487k36663j66276j09165
14102F723996j22815j79292r8232j68762j01821l3815o1887j96402k19818o80
14092E540472j05792q2336q477L7154p0o4981o9797k1684j31941j38496l0912
14081D923140k16193j49963j32483j70111K2656j86672l71170j34166M4894m6069
14071C583863j51251j44855r4726r8393j76026j18500m3397j3340j35835j10439
14061B497101k6161j10366j87823L7330J7080l1968j8873j18508j16252n8420
$$ y = [12747103, 12337239, 11983313, 11708499, 11368195, 10974675, 10700392, 10439167, 10157071, 9865770, 9552451, 9397185, 9251017, 9112037, 9010173, 8810734, 8604617, 8473133, 8372528, 8159099, 7930443, 7737914, 7622330, 7409587, 7236100, 6999437, 6833161, 6723996, 6601181, 6421889, 6323657, 6154895, 6053074, 6019259, 5957372, 5760970, 5541152, 5540472, 5434680, 5352344, 5343867, 5381021, 5380951, 5315970, 5246173, 5224489, 5092548, 4954052, 4923140, 4706947, 4556984, 4424501, 4254390, 4277046, 4090374, 3719204, 3585038, 3629932, 3583863, 3432612, 3287757, 3193031, 3094638, 2918612, 2800112, 2756715, 2743375, 2607540, 2497101, 2470940, 2360574, 2172751, 2210081, 2227161, 2195193, 2176320, 2057812, 1941560, 1883140]
14051A883140q5870l4223n4638l9239P6372J71m7942q4380N3460j3000m0902q3947
14039A529002j02973r5702j13464K6421J0029j5387o3036o6017q3696J6521m8334
14028I93364L9171L8879q6138p5345q6017k6909K9287p870l1633k3821l6676p135
14016G19157L6594l2062M9350O0331M1057p7502p6514p6590o9153J6619L2035
14005F23322M8912J08J3Q3881O3865j02402p8507O651n8051o3111J1580M029p2553
13992D67737n1924R1714P1505m4137l5062O676l1100q4620L1855J19500r8085
13981D44059j2444M9550M5990M3748Q7899j21423k27673n4509N8299r4955j1844
13970B06697K2474J41069K9393r6330K9273P547N0450R287l5233p3488J9842q1496
$$ y = [1883140, 1797270, 1763047, 1708409, 1669170, 1745542, 1745713, 1697771, 1613391, 1666851, 1653851, 1612949, 1529002, 1426029, 1330327, 1216863, 1243284, 1253313, 1237926, 1174890, 1108873, 1025177, 1041698, 993364, 1032535, 1071414, 985276, 909931, 823914, 797005, 826292, 818422, 786789, 762968, 726292, 719157, 755751, 723689, 773039, 833370, 874427, 796925, 720411, 643821, 574668, 591287, 623322, 672234, 672342, 672355, 756236, 820101, 717699, 639192, 645843, 587792, 524681, 536261, 540290, 467737, 415813, 507527, 579032, 534895, 499833, 506509, 475409, 390789, 422644, 542144, 444059, 431615, 481165, 527155, 570903, 658802, 537379, 309706, 255197, 313496, 218541, 206697, 229171, 370240, 399633, 303303, 332576, 340123, 390573, 399860, 364627, 291139, 310981, 229485]
13958B29485k8993R4175m1518m2589J5633l9329J0777R405L7249K4514j1800j0022
13946B46987L6550M60P446m8911o1735J29972R1898n5901l8990P2778n5007j8218
13934C07329K6912R734j2732p6043k3161j2075K7119j39750r043J41040K0491
13923B59821m1331K5857L4389l799l0046k9586K8889L9169k09l1061o5146n0195
13911A36752l029m5102J9766p8330m2690M1060J6938n2024q2171P3792R2092J1742
13899H8796m5549L0780k9011P2137R4087l8747j56446L4061l8114j500o1070q5030
13887a35606J21533K8824M667p533J0723P255Q229o4683K2960p422n5972J02318
13875C5293R6537p9226j79914K567O8326K6286r6171r466P1354K2068l5607N134
$$ y = [229485, 200492, 294667, 253149, 210560, 226193, 186864, 197641, 207046, 244295, 268809, 257009, 246987, 283537, 283997, 291443, 242532, 180797, 310769, 402667, 346766, 307776, 380554, 325547, 307329, 334241, 343975, 331243, 255200, 232039, 219964, 247083, 107333, 98290, 239330, 259821, 218490, 244347, 278736, 274937, 244891, 215305, 244194, 283363, 283154, 252093, 186947, 136752, 133723, 88621, 108387, 30057, -12633, 28427, 45365, -6659, -88830, -15038, 77054, 88796, 43247, 74027, 45016, 117153, 211240, 172493, 16047, 50108, 11994, 10494, -50576, -135606, -14073, 14751, 19418, 11885, 22608, 29863, 38092, -26591, -3631, -11053, -67025, 35293, 131830, 52604, -127310, -124743, -56417, -30131, -126302, -135768, -64414, -42346, -77953, -72819]
13863g2819M9500l0069K0393O1995J3304l4777m3979M5584O1806N050M1451L5578
13851A53017o89k9558j23746m0230k2995P6379N5805L3664k8698R6420N6009O951
13839B32329p4867q1739j41346k9079P9651P1065M511r632j7167K3712P2324N6700
13827A86462o9461m6782M6916j29816l6664N0532N9866P2004M8521l6542k9283
13816A15753M5445M2906j0654j06500l6227l9167l3150k0347j076K0967L7186
13805A5136j8935r947J14093j9787n8917j4645Q72p3776j00072j9952Q0653q397
13793a13674l0314J1079O3669l5814Q7733O819j0664M9745K4077K4844R8952m1507
13781A34945n5593k3722j0238N6300L5345M5315L6977j5777p8513o4639L3295
$$ y = [-72819, -23319, -53388, -32995, 29000, 42304, 7527, -36452, 9132, 70938, 75988, 117439, 153017, 152328, 122770, -976, -41206, -64201, 12178, 67983, 101647, 72949, 169369, 225378, 232329, 157462, 75723, -65623, -94702, -15051, 56014, 60525, 50893, 33726, 57438, 129762, 186462, 117001, 70219, 117135, -12681, -49345, 1187, 61053, 133057, 181578, 145036, 115753, 161198, 204104, 193450, 86950, 50723, 11556, -21594, -41941, -43017, -22050, 15136, -3799, -13746, 100347, 80560, 21643, 6998, 7870, -65906, -165978, -185930, -105277, -113674, -143988, -132909, -69240, -105054, -17321, -10502, -21166, 28579, 52656, 77500, 176452, 134945, 79352, 55630, 45392, 101692, 137037, 182352, 219329, 203552, 125039, 60400, 93695]
13770I3695k8037l4990O4418P6892K7093m6382k1748m7922N1438P1540P8583N4209
13758C38789J62554J62792o4472p0631K7604J20716J00900J38385J66314J73530
13748A256481M0843P9614J8138N9716r8487l9383o2319O2865j7087j52072r0001
13737A058308j2907j4665k2001j18928O510j0995m2357O7105k6392k0275o8712
13726G94691J4249K2410L826p3569J19788J02989K27486J7099M1725O1333R6022
13715A428049k4661J03854P7424P508Q979j00883j51352J6582n817l8810r8354
13704A222519j39313j63469j35592k0983k8879q2862j12060m9194k1822j3836
13694D54509K1734n9929l8415n5969j09558K2470J77499Q4480q0589r6725l8151
$$ y = [93695, 65658, 30668, 95086, 171978, 199071, 152689, 130941, 83019, 134457, 205997, 284580, 338789, 501343, 664135, 599663, 529032, 556636, 677352, 778252, 916637, 1082951, 1256481, 1297324, 1376938, 1395076, 1454792, 1356305, 1316922, 1254603, 1317468, 1300381, 1148309, 1058308, 1045401, 1030736, 1008735, 889807, 896317, 885322, 842965, 910070, 883678, 863403, 794691, 808940, 831350, 835176, 761607, 881395, 984384, 1211870, 1228969, 1270694, 1332027, 1428049, 1403388, 1507242, 1584666, 1592174, 1601153, 1500270, 1348918, 1365500, 1359683, 1320873, 1222519, 1083206, 919737, 784145, 763162, 734283, 651421, 539361, 490167, 468345, 454509, 476243, 416314, 377899, 321930, 212372, 234842, 412341, 496821, 416232, 319507, 281356]
13683B81356o2890o3369n8100j05681j4712k7434L0550L0999J8154K379L4037
13672F5289L9873q6046M628Q7804P9199j22476l7440P300j9808K56J02170R0881
13660B11630P2884l0351q3930q9760o1691m387q682J7778L9105O199J9745k2986
13648F5554N4456P9146j1742L7470j49466j52485q041J01156Q1444N369k2117
13637H0744o0363m0022m579M9092m9546k9464r9706L7300K3090k0276J20596N8545
13625F5411k4778M7843j9083J3436J2769o5644r345O5798P5490m4997l1900p1087
13613A3913P109r544m8807k7167J11378J12846L5762K8685j56124l3878K6047
13602F0220k3821q4221l5279r352K2233P3332j9879L1889K4570J19351K0221n2524
$$ y = [281356, 218466, 155097, 96997, -8684, -23396, -50830, -20280, 10719, 28873, 31252, 65289, 105162, 19116, 23744, 111548, 190747, 68271, 30831, 38131, 18323, 18579, 120749, 211630, 284514, 254163, 170233, 80473, 18782, 14395, 5713, 23491, 62596, 68795, 88540, 65554, 120010, 199156, 187414, 224884, 75418, -77067, -85108, 16048, 97492, 102861, 80744, 20381, -19641, -24220, 24872, -24674, -54138, -153844, -116544, -93454, -113730, 6866, 65411, 40633, 88476, 69393, 82829, 95598, 29954, 20609, 86407, 161897, 116900, 85000, 13913, 21022, 11478, -37329, -64496, 46882, 159728, 195490, 224175, 68051, 34173, 60220, 36399, -47822, -83101, -92453, -70220, 3112, -16767, 15122, 39692, 159043, 179264, 126740]
13590A26740p2695J505L1109N1554O4775n4504q7971j67740k9210P3801K8673
13579c3963k1363r6785M5253M6436j12038Q6136Q8600q226M2030k5849l6448j01525
13567a27742N3587J20384o1369j57220J5724K9026M4603J18438j4291j6764K4711
13556B9087N2644j3337j00403N013m9320j9660K7861N7613j32198k6196R5967
13545g2929J7870m6240L588M0622k7990o1211l1788O267J13199J60107k0061m9416
13533C2018J5732o6170n6447j05497L2698R6935J22783q8450r0290J22490Q9705
13522A05507p7499n5650J1035l8192l0569L4444Q6026M2899J24256m220j83214
13511A4823j9033L4003P1944O049o4945q6240J28371L2619J200r9786k5287P1734
$$ y = [126740, 54045, 55550, 86659, 138213, 202988, 148484, 60513, -107227, -136437, -62636, -33963, -55326, -152111, -106858, -60422, -172460, -86324, 2276, -5950, 36080, 10231, -26217, -127742, -74155, 46229, -15140, -172360, -156636, -127610, -83007, 35431, 21140, 4376, 29087, 81731, 68394, -32009, -26996, -76316, -95976, -68115, -10502, -142700, -168896, -72929, -55059, -101299, -97711, -57089, -85079, -146290, -178078, -171811, -58612, 101495, 81434, 32018, 47750, -18420, -74867, -180364, -147666, -50731, 72052, -16398, -106688, 15802, 105507, 28008, -27642, -16607, -54799, -85368, -50924, 35102, 78001, 202257, 198037, 14823, -4210, 29793, 101737, 107786, 42841, -43399, 84972, 117591, 118791, 19005, -6282, 65452]
13499F5452O7992r0017P416J164K2149K523r5559l1352K0639j6859J4907P8674
13487D7129k577n5781l3574L1394L4148m6168p1831J0094J1289L8453N1023r05
13475A2694J0729J41525O6333O465j26126o9606k8238q4897K5956R1520J15780
13464A62135k7703o9646p8646n9081K3946R2034K4378j2828L8356J69609k7464
13453B35090k24222q6151l1166j33145M2921Q8895J5721J1862N6058L381M6002
13442B5246q1921j07619N4283Q4863n1152O5952R860j8056k1713M5359M2077Q078
13430E5257K0529J23764L8844r4113J2933K407q7835O6426Q6089o406m704k7510
13418A85681j9322P0742k5908j8392j34258j45818p6519k0253M4428M5414j9515
$$ y = [65452, 133444, 43427, 50843, 52007, 74156, 76679, -18880, -50232, -29593, -46452, -31545, 47129, 44552, -11229, -44803, -13409, 20739, -25429, -97260, -87166, -75877, -37424, 13599, 12694, 23423, 164948, 231281, 237746, 111620, 42014, 13776, -71121, -45165, 46355, 162135, 134432, 64786, -13860, -72941, -48995, 43039, 67417, 54589, 92945, 262554, 235090, 10868, -75283, -106449, -239594, -196673, -107778, -92057, -80195, -24137, -20756, 25246, -56675, -164294, -110011, -25148, -76300, -10348, -488, -18544, -40257, 5102, 47179, 55257, 75786, 199550, 238394, 144281, 157214, 159621, 71786, 138212, 224301, 217895, 213191, 185681, 166359, 237101, 211193, 192801, 58543, -87275, -163794, -184047, -139619, -94205, -113720]
13407a13720K9152K0025m132M498n3512n8472q608K0118N0433N0180Q605K4851
13395c0582N0078N8146r3043j0179J6444K7051M6543m9731m803O4835J2621m9527
13383C7853M5290k3941p3899j4932m314K2146O0547l1859m6902p8288K3429n0498
13371a35368L8931M6672Q9826j7135j34576P7175Q6293J4813l8204n880m0638
13360a8091Q1736K2374J732m4206j18312n3394J2612L3686o1195r445J35459J50798
13348A33754M3470q4626k3232N083j11221o7901K3237l9655p7516k7358P6002
13337a49963L9099N6615p1435o6741k8672Q4710R6411N2760k2998q1058J3041
13326g8231j7419P9307M8417l3974r593O1780j05726r2751R5239J13907K7364
$$ y = [-113720, -84568, -64543, -68675, -64177, -117689, -176161, -184769, -164651, -114218, -64038, -55433, -30582, 19496, 77642, -15401, -25580, -9136, 17915, 64458, 14727, 9924, 74759, 87380, 37853, 83143, 59202, -14697, -29629, -33943, -11797, 48750, 16891, -30011, -108299, -84870, -135368, -96437, -49765, 40061, 22926, -111650, -34475, 51818, 66631, 28427, 22547, -18091, 63645, 86019, 87751, 43545, -74767, -128161, -115549, -81863, -143058, -152503, -17044, 133754, 177224, 92598, 69366, 74449, -36772, -104673, -81436, -121091, -198607, -225965, -149963, -110864, -54249, -125684, -192425, -221097, -136387, -39976, 12784, -10214, -91272, -78231, -95650, -16343, 32074, -1900, -11493, 50287, -55439, -148190, -52951, 60956, 88320]
13315H8320j50280m6986J8898J2039M4709J42865k7352J5600K0707m9925j16715
13304d8120P6598J41544q0194j8660j07054l5240J09517m4098j1611m2649Q3423
13293B3456N6350M3140p4119K5640o586O3888N4934l7905l0043L1318j6468q0253
13281E3352j08021j55325r712O2655Q4218J3568p5064K6486j8766n4639N2293
13270a28955J6628J1306L1451N7739j443Q78L6815l8021J21585J23361n5586j63614
13258A2144o3120p9079L1456R1957K7808J4368j1061j30792m2218M9773J32167
13247C3403l2717k096n9786k6636J6383Q2001J5144n8691M047j8864J411j7988
13235f4389J5134L6527j671j12528l193N3692k6212O263p6614o0880j223l9777
$$ y = [88320, -61960, -108946, -90048, -78009, -33300, 109565, 82213, 97813, 118520, 68595, -48120, 28478, 170022, 89828, 71168, -35886, -71126, 38391, -5707, -17318, -59967, 23456, 79806, 122946, 48827, 74467, 67881, 131769, 186703, 148798, 118755, 150073, 133605, 53352, -54669, -209994, -219706, -157051, -72833, -59265, -134329, -107843, -126609, -181248, -128955, -112327, -101021, -69570, -11831, -13274, -12396, 24419, -13602, 107983, 231344, 175758, 12144, -50976, -130055, -98599, -6642, 21166, 35534, 24473, -106319, -148537, -98764, 33403, 686, -1410, -61196, -87832, -71449, 10552, 25696, -32995, -28948, -47812, -46401, -64389, -49255, -12728, -14399, -126927, -130120, -76428, -102640, -96377, -172991, -233871, -235094, -274871]
13223b74871o9181P5433Q6010J35618l6400m311N6659N0817Q7658l1504L7417
13212A13345j09512n9549K8036N0437J7632k2157N8485M6078n1437n3453J6642
13201C4547L7786o301j30674L6841L5787k3751k5131J3491l8559L9749l4792j2494
13189g3501K8051J09514N896q1457m1643J2434Q559J3971J4601Q825L143n5879
13177d7486R8761O0032o7716K9290k1089J2540j3047j11482l3580k3179n360N5623
13165f6693J03428m0793R851j4043m3770J4762o2728J2210k8381M277n725N2728
13153f4877K6924n595L4831L173j2950J01343L9251q248K1239j36614J05284j6367
13141H7394j4758K0028P3057R380m4679l8044q2086j54737k9326O0060l6172j7182
$$ y = [-274871, -344052, -268619, -182609, -46991, -83391, -87702, -31043, 19774, 107432, 75928, 113345, 3833, -55716, -27680, 22757, 40389, 18232, 76717, 122795, 71358, 17905, 34547, 72333, 66032, -64642, -27801, 7986, -15765, -40896, -27405, -65964, -26215, -61007, -73501, -45450, 64064, 69960, -11497, -53140, -40706, -32147, -18176, -3575, 5250, 8393, -47486, 51275, 111307, 43591, 72881, 51792, 64332, 51285, -60197, -93777, -116956, -122316, -66693, 36735, -4058, 5793, -8250, -52020, -37258, -99986, -87776, -116157, -111880, -117605, -64877, -37953, -43548, -8717, -5544, -18494, 82849, 122100, 113852, 135091, -1523, 103761, 87394, 72636, 92664, 165721, 175101, 130422, 92378, 10292, -144445, -173771, -113711, -149883, -167065]
13129a67065R583K0066O3191J8780J58920N5409q2086q0092o6380M4634o215k6684
13117e7939M3831M4168q958K6661q9884J8699O4182m7498l090J427L3837r3562
13105f8126j63386Q096j2052M3374Q7612M2091k5480k9910P626m9396k6533o6785
13093b52869P8697k5978O0351N5086J9061p4950l8903N0785N0347J42475P0398
13082A34500l7101j25196L798K3757l343L2714N3673k3290J5433k6997r9763K7149
13070b4666l4515K7538P3729J6369n7080K0502R9517l2627L8260m7154L2230k1162
13058I0941p207r2064j57301N1203L5086p028l0780q3921m4180L4164Q9947M8433
13046g2707R0989j4467r3103j23708l8631k1782J24207P3785L8002K6533J15635
$$ y = [-167065, -157482, -137416, -74225, -55445, 103475, 158884, 76798, -3294, -69674, -25040, -31255, -57939, -14108, 30060, 21102, 47763, -42121, -23422, 40760, -6738, -9828, -8401, 25436, -68126, -231512, -223416, -235468, -192094, -104482, -62391, -87871, -117781, -110155, -159551, -186084, -252869, -174172, -200150, -139799, -84713, -65652, -140602, -179505, -128720, -78373, 64102, 134500, 97399, -27797, -23999, -242, -3585, 29129, 82802, 59512, 74945, 47948, -51815, -24666, -59181, -31643, 42086, 58455, 1375, 21877, 121394, 88767, 127027, 79873, 112103, 90941, 83734, -8330, -165631, -114428, -79342, -86370, -117150, -201071, -245251, -211087, -121140, -72707, 18282, 3815, -89288, -212996, -251627, -273409, -149202, -75417, -37415, -10882, 104753]
13035A04753o63J7866m6742q9209k233q4899j1060O0073o3324N2177L4966p3901
13023a02196n9970R0677O1954O7900k3222p2568n5890m6423J05622N0584q286
13012H182O5556P4219n312J8065j02072n8959L8405P9712l9765J8045q2312l5808
13000b2044j4481k6422l7012o5301J6074Q6536L8659M9166L8181O446m6604o5487
12988d2289m7389K99m2102k5769J07166Q0116r91P0104J00268q5447j71987j01068
12976a59089Q7639J06047L3432J07849j01386p1147j7700J5381Q7849j09438m4573
12965f5136J11126J6284N9200p0449k0999k5508n7081j5643n7943l3381P9310
12954h0220K4099J4128N2870L6786l4722j438j71708J5152J00928N3374n8265
$$ y = [104753, 104090, 121956, 75214, -13995, -16228, -101127, -112187, -52114, -115438, -63261, -28295, -102196, -162166, -71489, -9535, 58365, 35143, -37425, -93315, -139738, -34116, 16468, 8182, 73738, 147957, 142645, 160710, 58638, -321, 38084, 117796, 78031, 96076, 13764, -22044, -36525, -62947, -99959, -165260, -149186, -62650, -23991, 25175, 63356, 69802, 23198, -42289, -89678, -89379, -131481, -157250, -50084, 30032, 29041, 99145, 199413, 113966, -58021, -159089, -71450, 34597, 68029, 175878, 74492, 3345, -14355, 1026, 88875, -20563, -65136, 45990, 62274, 121474, 51025, 30026, 4518, -52563, -68206, -126149, -159530, -80220, -56121, -41993, 10877, 47663, 12941, 11503, -160205, -145053, -44125, 9249, -49016]
12943d9016j39897k0178J10384Q3189p702M707k4412k0815M1535j20970J1063
12932a32112M1758P6381R3698p4792p2102J52541o540j40709P570P055J2621n883
12920d0514L9872p6217r0984J20240L1182K2155R1034k1003K8009o9167r0936
12909e6329l5363M2181J46602M3003l1358m8336j07362p0652O7587O8842n93l8181
12897a9959P8217o0902l3523R173J39113j635l3410j23156R413J23743j2894m3117
12885C1063j5015J5857m9854j16659J1632o9488N6713O0775K3259M4810j01231
12874a08138p402J20133r556n6969J11653R3328k723m3999j0832j48688q6752
12863a49945M4400M3584o494j2660Q0695J35934M6214M89k6696m3391p8185j04141
$$ y = [-49016, -188913, -209091, -98707, -15518, -23220, -18513, -42925, -63740, -22205, -143175, -132112, -90354, -13973, 79725, 4933, -67169, 85372, 78832, -61877, -54307, -47252, -34631, -40514, -642, -76859, -167843, -47603, -16421, 5734, 96768, 75765, 103774, 34607, -56329, -91692, -49511, 97091, 140094, 108736, 60400, -46962, -117614, -50027, 18815, 18222, -19959, 58258, -2644, -36167, -26994, 112119, 110484, 77074, -46082, -36669, 87074, 74180, 31063, 16048, 31905, -17949, -134608, -122976, -192464, -135751, -74976, -51717, -6907, -108138, -115540, 4593, -4963, -61932, 49721, 143049, 140326, 96327, 85495, -63193, -149945, -105545, -61961, -68455, -81115, -420, 135514, 181728, 182217, 155521, 112130, 33945, -70196]
12851g0196p4007J6695Q4596L9617Q6863p4164n5458j3359K9560L101K8079K3429
12839B4756q1500q8179L0006M9389l2056K4205j7798M2833M3536O232L8798m9573
12827i351n3326k833j0767O3738R2831N9017k235j36365o7853M186j1399J11264
12815C6907J16154J53697k5108j29920r963K8386R441j15107j21599O679R3408
12804D2975J10626M1876k5124J4279j5968n9194Q804j13033n9856N8747L5039
12793C9171p7278J6034M2030k8205k6957O7990R3553j8874r410j0541q5311J0096
12781A2298K4367n9099k7728K5110k1714n1638J1414M7528M7521k0894N4573m5067
12769c329J5825r0436j6608N4361L6108j18203o367M1589M7782K9335M9086J05965
$$ y = [-70196, -144203, -127508, -42912, -3295, 83568, 9404, -46054, -59413, -29853, -26752, 1327, 24756, -56744, -144923, -114917, -65528, -97584, -73379, -91177, -48344, -4808, 1424, 40222, -9351, -62677, -65510, -76277, -12539, 80292, 139309, 137074, 709, -67144, -62958, -74357, 36907, 153061, 306758, 281650, 151730, 141767, 170153, 179594, 64487, -57112, -50433, 42975, 153601, 195477, 170353, 184632, 168664, 109470, 118274, 5241, -54615, 4132, 39171, -38107, -22073, 19957, -8248, -35205, 32785, 126338, 107464, 98054, 87513, 2202, 12298, 36665, -22434, -50162, -25052, -46766, -98404, -86990, -39462, 8059, -12835, 41738, -3329, 12496, -77940, -94548, -40187, -4079, -122282, -128649, -87060, -39278, -9943, 39143, 145108]
12757A45108n580l0404J9709j17502L9708j0124K1846j12395l4281K5853O6399
12746H337j8448O874m738M4129N3451j47203p6402L4485M5182m9921j09084M716
12734b08622J31088J21894m680r9859M7716Q4299q4853o2890o4820J1734L9155
12723h9838Q391J02400O9000r2567k2886M4124J1623r5378J19309O4145M9471
12712A67794N2067n9345k12781m087O3816L3242M9070m8135j61505L566P6863
12701c9435O1907k7690P62M936q6570N3215n8627n0127j2483n186M8897j0098
12689a20499J21848O4988j8765q2664q5731J0962K0134L4131k3085j0743j792
12678i1216K3249Q7007R4335K6496p1099j79753o60J25798j6930J5155m3084L2943
$$ y = [145108, 139528, 109124, 128833, 11331, 51039, 40915, 62761, -49634, -83915, -58062, 8337, -10111, -3237, -7975, 36154, 89605, -57598, -134000, -99515, -54333, -104254, -213338, -208622, -77534, 44360, 39680, -60179, -12463, 71836, -13017, -75907, -140727, -128993, -89838, -81447, 20953, 89953, -2614, -25500, 18624, 30247, -65131, 54178, 118323, 167794, 219861, 160516, -52265, -56352, 7464, 40706, 89776, 41641, -119864, -116298, -39435, 22472, -5218, -4456, 480, -86090, -32875, -91502, -141629, -154112, -159298, -110401, -120499, 1349, 66337, 47572, -35092, -120823, -109861, -89727, -55596, -78681, -89424, -91216, -67967, 19040, 113375, 139871, 68772, -110981, -111641, 14157, -2773, 12382, -30702, 2241]
12666B241O7877r1232p1446k6463J10670N2153l2422j38017n312R3112n2784L8161
12654e3462O6783L0220k1285N1075L6971p9384j64688q9298n089o1467Q4274J08567
12642i6783L9785j3366O8239L6965k6552N9825o4925j18671O4136N6375l1772
12631b6744l9637J34332K8635j0421J581o4752m0334M3459K4497o8422N3481J00534
12619A36209P9690l6428n0768n1246P920j793K8265k4865n5105k6281p4189j00465
12607a69056r7390O2120N1165l154J40481J23217j34027r9812K1160L0450J4475
12596f0371Q4901P2465N647k3814o3761m0872r1394O1421J05334Q298m1286j0552
12584F016L7406Q5816l1880n7960l0626m9220k215J03021m7880L1623J31668J7037
$$ y = [2241, 70118, -21114, -92560, -119023, -8353, 43800, 11378, -126639, -131951, -38839, -91623, -53462, 13321, 43541, 22256, 73331, 110302, 30918, -133770, -223068, -228157, -289624, -205350, -96783, -56998, -70364, -2125, 34840, 8288, 68113, 3188, -115483, -51347, 5028, -26744, -66381, 67951, 96586, 86165, 87746, 22994, -17340, 26119, 50616, -17806, 35675, 136209, 215899, 179471, 128703, 77457, 85377, 83584, 111849, 86984, 31879, 5598, -68591, -169056, -266446, -204326, -153161, -156315, -15834, 107383, -26644, -126456, -105296, -74846, -60371, 24530, 96995, 102642, 78828, 15067, -25805, -117199, -55778, 49556, 57854, 16568, 6016, 43422, 129238, 97358, 39398, 8772, -40448, -42663, 60358, 12478, 44101, 175769, 192806]
12572A92806L6131P569j00009J0936j34415Q1840Q5873N3619j1220q2416j13282
12561B7432o8043N2511J502m2639L2789K2535j34787n0445J62172Q0273l6386
12550D6914m2477l702J22568J18861O9779j09956l6467n3515N042J24773J06805
12539C48625m9654q4119P082J38134k3991J3242k3197L2370L8628O5243N0336
12528E12699J28557J58518J1219k7342j04319j26682n766J20234M9882j63635
12518E53365j49674o4706j7505K5825J4595M7086l3139Q7123J0617J8943L3764
12507E26294n1593k1060q198j7790K4749N3165Q0900J96378k4545j22138j4959
12496F21203J8496n9828r3152l4008l268M0831Q0611J18758k1743m9740P754j7808
$$ y = [192806, 228937, 236506, 136497, 147433, 13018, 94858, 180731, 234350, 223130, 140714, 27432, -40611, 11900, 13402, -29237, 3552, 26087, -108700, -159145, 3027, 83300, 46914, 4437, 735, 123303, 242164, 311943, 201987, 165520, 112005, 117047, 241820, 348625, 298971, 214852, 221934, 360068, 336077, 349319, 326122, 358492, 397120, 462363, 512699, 641256, 799774, 810993, 783651, 679332, 552650, 546884, 667118, 717000, 553365, 403691, 338985, 321480, 347305, 361900, 408986, 375847, 462970, 473587, 492530, 526294, 474701, 453641, 445443, 427653, 452402, 505567, 586467, 782845, 758300, 636162, 621203, 639699, 579871, 486719, 452711, 449443, 490274, 570885, 689643, 667900, 618160, 625914, 608106]
12484F08106J6263j178j06088o9349M5945O3585m5098l6176L705J29449N4043
12473F63207l2231j11370j27168J4900L6123p3645N1613o9181l8639N2500O0477
12462D26586M0474P457J1353K1708R9165N7489k3393k1288J4894r7884j85485
12451C51076j00227M5452J1389p3153N1109J27940M6225j04630K515k4998r1883
12440B40815L9038J07421L0160J36082j5852j19010k2668O5951o0418p3250p3407
12429B54862N9205J7150r8181o4101P3715J1600j0132J0528q817j1459q3681q758
12417A41931J2874mQ1288J21788j10634j05406K537M7084N191K2957J7778n138
12405B32246n8929L2384J23055m8396k2090O9494O6638n8506m6202j11986j00013
$$ y = [608106, 624369, 623191, 517103, 447754, 493699, 557284, 512186, 476010, 479715, 609164, 663207, 630976, 519606, 392438, 407338, 443461, 369816, 421429, 352248, 313609, 366109, 426586, 467060, 474517, 485870, 507578, 606743, 664232, 640839, 619551, 634445, 536561, 351076, 250849, 296301, 307690, 234537, 285646, 413586, 459811, 355181, 357696, 332698, 240815, 279853, 387274, 417434, 553516, 537664, 418654, 395986, 461937, 401519, 328269, 254862, 314067, 331217, 233036, 168935, 242650, 254250, 244118, 254646, 245829, 234370, 150689, 141931, 154805, 154801, 236089, 357877, 247243, 141837, 144374, 191458, 196649, 219606, 237384, 232246, 173317, 205701, 328756, 280360, 258270, 327764, 394402, 335896, 289694, 177708, 77695]
12394G7695o7727N7245J0020j3661j8254q1342R312L6902Q2831L5676j7801M6993
12382A57889m7261l676j03307m3881K2384K2427j9542P7143J02020L2701o453
12371A90444N2945p6866q9485j14013L5920R1468J08186n0438n7628M2420k7574
12360A05379L1160k8552J8573N1662j3795q2551P784N2481l6494M5736j5766k8272
12348A07345o9307J09818M7698m8200q2054m9467n604J7618j28828L4626O0347
12337f008k9951P9718J0016K5948o2191R447q3782K5577L1177k7931j8826N285
12325d1521J4775J7528L6081j3680K7692J1050P890M636P2917m5813l6533k8447
12313B6575p2799p6469p0401R5831l1347P6133R2198j6676o4133l4950K183M0410
$$ y = [77695, 9968, 67213, 77233, 63572, 45318, -36024, -26712, 10190, 93021, 128697, 110896, 157889, 110628, 106952, 3645, -40236, -17852, 4575, -14967, 62176, 164196, 196897, 190444, 243389, 166523, 77038, -36975, -1055, 90413, 198599, 148161, 90533, 132953, 105379, 136539, 107987, 126560, 178222, 164427, 81876, 89660, 142141, 105647, 151383, 135617, 107345, 38038, 147856, 195554, 147354, 65300, 15833, 10229, 27847, -100981, -66355, -6008, -35959, 43759, 53775, 79723, 17532, 26979, -56803, -31226, -49, -27980, -46806, -41521, -26746, -9218, 26863, 13183, 40875, 51925, 59815, 64451, 137368, 91555, 55022, 26575, -46224, -122693, -193094, -97263, -128610, -52477, 39721, 23045, -41088, -76038, -73855, -33445]
12301c3445K4593L8428P4192k7098p5183J1077N4051q4855J6048l1356j361P4667
12289C9758O2785j4601o5673j3131l7864M1955N2136l5276j3168q427J5423j8079
12277E838J43519J6632l930m2353n4114m7763j6768n1892q6019l9613j2100J23738
12265f4825M8240n8597J7368Q2807q1190k2906N7891L9051P9429j7313q7344n0724
12253e8113M0056J36873J07332Q0407k4847o1045j3170m9834j64650q1834j1999
12242a00824r050J2073J54147J5785p713o119k6824K2854j2376j4735l5807m7743
12230e6332M9382O208N4462n241j6674M4340k3943l9279m6293m1278Q6302Q4169
12218I5823M7594M63j7108n5196O3088j4775k3531o717j52144n77R4749O1503
$$ y = [-33445, -8852, 29576, 103768, 76670, 1487, 12564, 66615, -18240, -2192, -33548, -34909, 39758, 102543, 87942, 22269, 9138, -28726, 13229, 65365, 30089, 16921, 8494, 23917, 5838, 149357, 165989, 162059, 119706, 65592, 17829, 1061, -50831, -136850, -176463, -188563, -64825, -16585, -75182, -57814, 24993, -56197, -79103, -21212, 17839, 97268, 79955, -7389, -58113, -18057, 118816, 226148, 306555, 281708, 220663, 207493, 157659, -6991, -88825, -100824, -109874, -97801, 56346, 72131, 64418, 58299, 31475, 54329, 41953, 27218, -8589, -56332, -6950, -742, 53720, 48479, 31805, 76145, 52202, 12923, -33370, -74648, 11654, 95823, 143417, 143880, 126772, 71576, 134664, 119889, 96358, 89641, -62503, -63080, 31669, 93172]
12206I3172m551l5946k1915J10618m4094q1865P204p9887L3885J7395j00408l3740
12194a40132J60345M7662K1566m4473q9569o56L611L1363k5094m771m2638j5852
12182i8638K4486n8770r7639N0056R1885M4759M0620L7748n5370m8390L1107L133
12170c5013p5735l2900J02626J77567j2364m0452l2372J43148J7229o1808m2812
12159A07114o3196K8464j2646q0810l8689J64865N8026l257l646K2603l843j0280
12147A64705K0795K4265N9763M5535j20272j49368q5088n9130J5068N0163M6398
12136A2834l2082j7280K9612N8126K7273j5954L0888Q1735J4702l7482M4193p6658
$$ y = [93172, 88621, 52675, 30760, 141378, 97284, 15419, 22623, -57264, -23379, -5984, -106392, -140132, 20213, 67875, 89441, 44968, -44601, -45257, -41646, -10283, -35377, -40148, -82786, -98638, -74152, -132922, -230561, -180505, -88620, -43861, -3241, 34507, -20863, -69253, -38146, -35013, -110748, -143648, -41022, 136545, 124181, 83729, 51357, 194505, 211734, 149926, 107114, 43918, 72382, 59736, -21074, -59763, 105102, 163128, 159871, 156225, 178828, 174985, 164705, 185500, 209765, 269528, 315063, 194791, 45423, -39665, -98795, -83727, -33564, 12834, -19248, -36528, -6916, 51210, 78483, 62529, 93417, 175152, 189854, 152372, 196565, 119907]
$$ [...]
##END NTUPLES=NMR SPECTRUM
##END=
