##TITLE=Analysis number 323287
Compound Code cc 30606
Book Reference 451/169
Project Code adrs
Chemist Name evam
##JCAMPDX= 6.0         $$ Bruker NMR JCAMP-DX V2.0
##DATA TYPE= NMR SPECTRUM
##DATA CLASS= NTUPLES
##ORIGIN= Bruker BioSpin GmbH
##OWNER= nmr
$$ XWIN-NMR		Version 3.5
$$ Fri Oct 20 13:08:30 2006 GMT Daylight Time (UT+1h)  MAYBRIDGE\nmr@NMR_250MHZ
##.OBSERVE FREQUENCY= 250.131544655141
##.OBSERVE NUCLEUS= ^1H
##.ACQUISITION MODE= SIMULTANEOUS (DQD)
##.ACQUISITION SCHEME= undefined
##.AVERAGES= 16
##.DIGITISER RES= 18
##SPECTROMETER/DATA SYSTEM= dpx250
##.PULSE SEQUENCE= zg30
##.SOLVENT NAME= CDCl3
##.SHIFT REFERENCE= (INTERNAL, CDCl3, 0, 16.522)
##AUDIT TRAIL= $$ (NUMBER, WHEN, WHO, WHERE, WHAT)
$$ ##TITLE= Audit trail, XWIN-NMR		Version 3.5
$$ ##JCAMPDX= 5.01
$$ ##ORIGIN= Bruker BioSpin GmbH
$$ ##OWNER= nmr
$$ C:\u/data/dgb/nmr/ADRS/1050/pdata/1/auditp.txt
$$ ##AUDIT TRAIL=  $$ (NUMBER, WHEN, WHO, WHERE, WHAT)
(   1,<2006-10-20 13:08:05.11 +100>,<MAYBRIDGE\nmr>,<NMR_250MHZ>,
      <created by zg, POWCHK disabled, PULCHK disabled
       configuration hash MD5:
       49 4B E0 1D 92 C2 6B 37 9F E6 65 BC 52 41 86 1D
       data hash MD5: 64K
       69 A0 E2 A0 97 12 A3 EE 97 87 85 0B 78 73 36 8A>)
(   2,<2006-10-20 13:08:18.67 +100>,<MAYBRIDGE\nmr>,<NMR_250MHZ>,
      <Start of raw data processing
       ef LB = 0.3 FT_mod = 6 PKNL = 1 SI = 32K 
       data hash MD5: 32K
       FF 59 4E 33 4F C3 D7 EC 10 DC 38 E6 74 B6 02 65>)
(   3,<2006-10-20 13:08:20.23 +100>,<MAYBRIDGE\nmr>,<NMR_250MHZ>,
      <apk 
       data hash MD5: 32K
       5E 5B 24 61 4C 21 61 E4 67 D4 54 A1 5E 3A 46 81>)
(   4,<2006-10-20 13:08:20.95 +100>,<MAYBRIDGE\nmr>,<NMR_250MHZ>,
      <abs ABSG = 5 
       data hash MD5: 32K
       8B 81 4D DE 9E D0 AF 3B 6C 66 5D 65 40 4B B6 2E>)
$$ ##END=
$$ 
$$ hash MD5
$$ 53 8B E4 8F 80 23 FA 68 E7 24 B7 D5 C9 8A 18 43
##$RELAX= 
##$RELAX= 
##$RELAX= 
##$RELAX= 
##$RELAX= 
##$RELAX= 
##$RELAX= 
$$ Bruker specific parameters
$$ --------------------------
##$DU= <C:\u>
##$EXPNO= 1050
##$NAME= <ADRS>
##$PROCNO= 1
##$TYPE= <nmr>
##$USER= <dgb>
##$AMP= (0..31)
100 100 100 100 100 100 100 100 100 100 100 100 100 100 100 100 100 100 
100 100 100 100 100 100 100 100 100 100 100 100 100 100 
##$AQSEQ= 0
##$AQ_mod= 3
##$AUNM= <au_zg>
##$AUTOPOS= <15 >
##$BF1= 250.13
##$BF2= 250.13
##$BF3= 250.13
##$BF4= 250.13
##$BF5= 500.13
##$BF6= 500.13
##$BF7= 500.13
##$BF8= 500.13
##$BYTORDA= 1
##$CFDGTYP= 0
##$CFRGTYP= 5
##$CHEMSTR= <none>
##$CNST= (0..31)
1 1 145 1 1 1 1 1 1 1 1 1 1 1 1 1 1 1 1 1 1 1 1 1 1 1 1 1 1 1 1 1 
##$CPDPRG= <>
##$CPDPRG1= <>
##$CPDPRG2= <>
##$CPDPRG3= <>
##$CPDPRG4= <mlev>
##$CPDPRG5= <mlev>
##$CPDPRG6= <mlev>
##$CPDPRG7= <mlev>
##$CPDPRG8= <mlev>
##$CPDPRGB= <>
##$CPDPRGT= <>
##$D= (0..31)
0 1 0 0 0 0 0 0 0 0.06 0 0 0 0 0 0 0.0002 0 0 0 0 0 0 0 0 0 0 0 0 0 0 
0 
##$DATE= 1161346083
##$DBL= (0..7)
120 120 120 120 120 120 120 120 
##$DBP= (0..7)
150 150 150 150 150 150 150 150 
##$DBP07= 0
##$DBPNAM0= <>
##$DBPNAM1= <>
$$ [...]
##$SUBNAM7= <"">
##$SUBNAM8= <"">
##$SUBNAM9= <"">
##$SW= 20.6930455092707
##$SWIBOX= (0..15)
0 0 3 0 0 0 0 0 0 0 0 0 0 0 0 0 
##$SW_h= 5175.983436853
##$TD= 65536
##$TD0= 1
##$TE= 683.16
##$TE2= 300
##$TE3= 300
##$TEG= 300
##$TL= (0..7)
0 120 120 120 120 120 120 120 
##$TP= (0..7)
150 150 150 150 150 150 150 150 
##$TP07= 0
##$TPNAME0= <>
##$TPNAME1= <>
##$TPNAME2= <>
##$TPNAME3= <>
##$TPNAME4= <>
##$TPNAME5= <>
##$TPNAME6= <>
##$TPNAME7= <>
##$TPOAL= (0..7)
0.5 0.5 0.5 0.5 0.5 0.5 0.5 0.5 
##$TPOFFS= (0..7)
0 0 0 0 0 0 0 0 
##$TUNHIN= 0
##$TUNHOUT= 0
##$TUNXOUT= 0
##$USERA1= <user>
##$USERA2= <user>
##$USERA3= <user>
##$USERA4= <user>
##$USERA5= <user>
##$V9= 5
##$VALIST= <valist>
##$VCLIST= <CCCCCCCCCCCCCCC>
##$VD= 0
##$VDLIST= <DDDDDDDDDDDDDDD>
##$VPLIST= <PPPPPPPPPPPPPPP>
##$VTLIST= <TTTTTTTTTTTTTTT>
##$WBST= 1024
##$WBSW= 4
##$XGAIN= (0..3)
0 0 0 0 
##$XL= 0
##$YL= 0
##$YMAX_a= 619816
##$YMIN_a= -576520
##$ZGOPTNS= <>
##$ZL1= 120
##$ZL2= 120
##$ZL3= 120
##$ZL4= 120
##$ABSF1= 16.522
##$ABSF2= -4.171173
##$ABSG= 5
##$ABSL= 3
##$ALPHA= 0
##$AQORDER= 0
##$ASSFAC= 0
##$ASSFACI= 0
##$ASSFACX= 0
##$ASSWID= 0
##$AUNMP= <proc_1d>
##$AZFE= 0.1
##$AZFW= 0.1
##$BCFW= 0
##$BC_mod= 0
##$BYTORDP= 0
##$COROFFS= 0
##$CY= 12.5
##$DATMOD= 1
##$DC= 0
##$DFILT= <>
##$DTYPP= 0
##$F1P= 14.0000005364418
##$F2P= -0.99999901652339
##$FCOR= 0.5
##$FTSIZE= 32768
##$FT_mod= 6
##$GAMMA= 0
##$GB= 0
##$INTBC= 1
##$INTSCL= 1
##$ISEN= 128
##$LB= 0.3
##$LEV0= 0
##$LPBIN= 0
##$MAXI= 10000
##$MC2= 0
##$MEAN= 0
##$ME_mod= 0
##$MI= 0
##$NCOEF= 0
##$NC_proc= -2
##$NLEV= 6
##$NOISF1= 0
##$NOISF2= 0
##$NSP= 0
##$NTH_PI= 0
##$NZP= 0
##$OFFSET= 16.522
##$PC= 1
##$PHC0= -50.44579
##$PHC1= 4.239334
##$PH_mod= 1
##$PKNL= yes
##$PPARMOD= 0
##$PSCAL= 4
##$PSIGN= 0
##$REVERSE= no
##$SF= 250.13
##$SI= 32768
##$SIGF1= 0
##$SIGF2= 0
##$SINO= 400
##$SIOLD= 32768
##$SREGLST= <1H.CDCl3>
##$SSB= 0
##$STSI= 32768
##$STSR= 0
##$SW_p= 5175.98343685301
##$SYMM= 0
##$S_DEV= 0
##$TDeff= 65536
##$TDoff= 0
##$TI= <Analysis number 999999
Compound Code 99
Book Reference 9
Project Code 9>
##$TILT= no
##$TM1= 0
##$TM2= 0
##$TOPLEV= 0
##$USERP1= <user>
##$USERP2= <user>
##$USERP3= <user>
##$USERP4= <user>
##$USERP5= <user>
##$WDW= 1
##$XDIM= 32768
##$YMAX_p= 294790683
##$YMIN_p= -346547
$$ End of Bruker specific parameters
$$ ---------------------------------
##NTUPLES= NMR SPECTRUM
##VAR_NAME=  FREQUENCY,     SPECTRUM/REAL,   SPECTRUM/IMAG
##SYMBOL=    X,             R,               I
##VAR_TYPE=  INDEPENDENT,   DEPENDENT,       DEPENDENT
##VAR_FORM=  AFFN,          ASDF,            ASDF
##VAR_DIM=   32768,         32768,           32768
##UNITS=     HZ,            ARBITRARY UNITS, ARBITRARY UNITS
##FACTOR=    0.157963299565203, 1,           1
##FIRST=     4132.6476996994, 0,             0
##LAST=      -1043.33573715361, 0,           0
##MIN=       -1043.33573715361, -346547,     0
##MAX=       4132.6476996994, 294790683,     0
$$ Real data points
##PAGE= N=1
##DATA TABLE= (X++(R..R)), XYDATA
$$ [...]
16531F9075j3641k0004M844j2583k33J3363P702N115q404j0778K810k473k372
16518C2421O291j0479K375N557p78l645k3614p199K608O66O912o08l889l295K404
16503E727O056M402j0656M518O650o649n41j6216O144J5667J851J556K634l230
16489A7913Q31j1711M650J4360o926j7049P411o135K840J709n798N540J1046m932
16475A3749j0231L452j931L923J682J5013O09j910J1725J0061r273j7387p383
16462A2099J6420P926q437k1412j3136Q949K527P809j7734j1191J2520J4684M46
16449A1470o372N107N134k325n942R01j933N147N179J317N379N055j6646k978
16435H493Q913o157n72J329R060N243k389l075p58K915N779O532l376N870J412
$$ plain form
16531 69075 55434 35430 40274 27691 27458 40821 48523 53638 45234 34456 37266 34793 32421
16518 32421 38712 28233 30608 36165 35387 31742 8128 929 3537 4203 11115 10507 6618 3323 5727
16503 5727 11783 16185 5529 10047 16697 10048 9507 -6709 -565 15102 16953 18509 21143 17913
16489 17913 18744 7033 11683 26043 19117 2068 9479 3344 6184 7893 2095 7635 18681 13749
16475 13749 3518 6970 5039 8962 10644 25657 26266 24356 36081 46142 36869 19482 12099
16462 12099 28519 36445 28008 6596 -6540 2409 4936 12745 -4989 -16180 -3660 11024 11470
16449 11470 5098 10205 15339 13014 7072 7973 6040 11187 16366 17683 23062 28117 11471 8493
16435 8493 17406 11249 10677 12006 21066 26309 23920 20845 20087 23002 28781 35313 31937 37807 39219
16420C9219n783k08k028O801m371J8220k232j5677l473j238n720k422M310j054
16406B4344m069L96j310p602j555K1796K3352J0195j1952j4862K528J2681J0310
16393F4252J7054J1828K3314M6389O4103N3264O9916M6497K8223J753l0548l6295
16381C59750j3142j5201j8442J3977L0584M7461K9107K1568j7999m6367m5797
16370C45499o0823n6699l7523k4378j6448l9328m684k2587j7020P576P184o141
16358G4628p227M060m566o206o073j2450r030Q449P110M751Q357j335p953P707
16344F0222q795K322o553j9869P380N336J0684R961J028m10N741p507L306R911
16330G2757J8633K8120O815k476Q281K2005J5242J3511M9624M9127K695j600K051
$$ plain form
16420 39219 33436 33228 31200 38001 33630 51850 49618 33941 30468 29230 23510 21088 25398 24344
16406 24344 20275 20671 19361 11759 10204 32000 55352 65547 53595 38733 41261 53942 64252
16393 64252 81306 93134 116448 162837 226940 280204 350120 396617 424840 426593 396045 359750
16381 359750 346608 331407 312965 326942 357526 404987 434094 455662 437663 391296 345499
16370 345499 284676 227977 190454 166076 149628 110300 105616 83029 66009 73585 80769 74628
16358 74628 67401 71461 66895 60689 54616 42166 33136 41585 48695 53446 61803 60468 52515 60222
16344 60222 51427 53749 47196 27327 34707 40043 50727 60688 61716 61306 67047 59540 62846 72757
16330 72757 91390 119510 126325 123849 132130 154135 169377 182888 232512 281639 284334 282734 284785
16317B84785j1707Q412K8013N0646K3927j0631M78J950k0988l7527k2295J0244
16305C05307K662J1436K0091k4442n7406m2363j5900n651m349j0124l0079k7521
16293A21661j4498J155j1983j8528o216M949N920m77p79l199j3551j4612p542
16280D2300m595m129P43J2158R272j0093q501J6754P867j57j0341k188j3013K658
16266C8735N336K371P907k224j0084J474N076Q064j0041o999K119M353l123o787
16252C6177L198Q655n57m896o226j712k717p825p471p686K304r89J1300J5308
16238C6863J53o757J567J338l339n703q332p157K40N322m125J81J5882J4955J552
16223D2640j5973q185Q721J1659R895J139j3850q379o948p695q347j6347L69M643
$$ plain form
16317 284785 273078 281490 309503 360149 384076 373445 373923 375873 354885 317358 295063 305307
16305 305307 307969 319405 339496 315054 257648 215285 199385 193734 189385 179261 149182 121661
16293 121661 107163 108318 96335 77807 71591 76540 82460 81983 81204 78005 64454 49842 42300
16280 42300 37705 33576 34319 46477 55749 45656 37155 53909 61776 61619 51278 49090 36077 38735
16266 38735 44071 46442 54349 52125 42041 43515 48591 56655 46614 39615 41734 46087 42964 36177
16252 36177 39375 48030 47473 42577 36351 34639 31922 24097 16626 8940 11244 10255 21555 36863
16238 36863 37016 30259 31826 33164 29825 24122 15790 8633 8873 14195 10070 10251 26133 41088 42640
16223 42640 26667 18482 27203 38862 48757 49896 36046 27667 20719 13024 4677 -11670 -11301 -6658
16209f658J7317O061L185m976J7494J1170k99j5964j47J3012p040o586k777K197
16195B5989N214j0191q770r349L23J0153J1221M111J775j4116J66J3004n146K066
16181B6450K110Q49R541r627k685R743k631j2793j8721J86J40J0683J1213J236
16167B5694J1229L235j3799l434o817j2027Q739J4707j1920k328q322n134R053
16154H876J9222j3137q696j2075L025J2800n239k016N80r05J1927O912o982j404
16140A2888P040j754n353J102k625n774L252K125j932o829o212n360Q512q838
16126i758K4R383L339P266J4971O987N115J5508o33j9300j2477o504p220j666
16112E035j0984L597Q708K299q33J461P689O11J852k441l74q75j0290J4781M322
$$ plain form
16209 -6658 10659 16720 19905 14929 32423 43593 43294 27330 27183 40195 33155 26569 23792 25989
16195 25989 31203 21012 12242 2893 3216 13369 24590 28701 30476 16360 16526 29530 24384 26450
16181 26450 28560 29409 38950 29323 26638 36381 33750 20957 2236 2422 2562 13245 24458 25694
16167 25694 36923 40158 26359 22925 16108 4081 12820 27527 15607 13279 4957 -177 8876
16154 8876 28098 14961 6265 -5810 -2785 10015 4776 2760 3340 2435 14362 21274 14292 12888
16140 12888 19928 18174 12821 13923 11298 5524 8776 10901 8969 2140 -4072 -9432 -920 -9758
16126 -9758 -9734 -351 2988 10254 25225 32212 37327 52835 52202 32902 20425 13921 6701 5035
16112 5035 -5949 -2352 6356 8655 7822 9283 16972 17583 19435 16994 16620 15745 5455 20236 24558
16097B4558j1943j3996J0594J1076J2350m407j909J019L634m505N91j4323q729
16084D010l232J2501R218N538p827j536J943p325K202n100N039j1536j026J3307
16070A6176Q118m537n615j6431O085K6888L092j6969j6783r185j022J8420O847
16057A5084n74k428Q771o196j5833j5207K0705R926Q192J823M889j1883L624K642
16043B3535j7050j2014m780J4826R57r420o649J986Q262O902P684j1731k608K3736
16029B3636J1480j1688k6209k014N340O988K066m19R387j4135m222P919O414R155
16015B3698M316k176R553M119K714j1939j5086m659n219K271M159n069n741M562
16001E503J742R628J1012j0434j3365K060j2283j2754K1527J0429m999j962j1620
$$ plain form
16097 24558 12615 -1381 9213 20289 32639 28232 26323 27342 30976 26471 27062 12739 4010
16084 4010 778 13279 22497 28035 20208 18672 20615 13290 15492 10392 15431 3895 2869 16176
16070 16176 24294 19757 14142 -2289 3796 30684 33776 16807 24 -9161 -10183 8237 15084
16057 15084 14510 12082 20853 14657 -1176 -16383 4322 14248 22440 24263 29152 17269 20893 23535
16043 23535 6485 -5529 -10309 4517 5474 -3946 -10595 -8609 -347 6555 14239 2508 -100 23636
16029 23636 35116 23428 -2781 -4795 545 7533 9599 9180 18567 4432 210 8129 14543 23698
16015 23698 28014 25838 35391 39510 42224 30285 15199 10540 5321 7592 11751 6682 941 5503
16001 5503 7245 16873 27885 17451 4086 6146 -6137 -18891 2636 13065 8066 6104 -5516
15988e516r871J1042J4454M521k413j1851n900M504k290r978j505J3342k387j71
15974d019j2296m588J4874K0878K408j5558q176P241K2620Q253r596j1482K681
15961A3240J4921O464j9126p974J662j1753j9605p371K6016O824M687J5925j2970
15948A0940q206K268k634J617K837j5487r48O754M630J804m27K799p17r567n186
15933i523Q176j963j69m251j20l214P834J7010R747K232J209l435J560p333j1149
15918F611Q183j5727q117l208O239R599K8767O85o905j4788K603n66n873j791
15904E712J180o85M682J0273J3189M022k0931o061k28n335p455j2981n336N296
15890a4658P004k643P4m931j5124l242K3854J9645M962K066k529j514J2046j3565
$$ plain form
15988 -5516 -15387 -4345 10109 14630 12217 366 -5534 -1030 -3320 -13298 -14803 -1461 -3848 -4019
15974 -4019 -16315 -20903 -6029 14849 17257 1699 -6477 764 23384 31637 22041 10559 13240
15961 13240 28161 34625 15499 7525 9187 -2566 -22171 -29542 -3526 3298 7985 23910 10940
15948 10940 2734 5002 2368 3985 6822 -8665 -9613 -2859 1771 3575 3148 5947 5230 -4337 -9523
15933 -9523 -1347 -3310 -3479 -7730 -7850 -11064 -3230 13780 23527 25759 26968 23533 25093 17760 6611
15918 6611 14794 -933 -9050 -12258 -6019 3580 32347 33032 26127 11339 13942 13376 7503 5712
15904 5712 6892 6207 10889 21162 34351 38373 17442 11381 11153 5818 -1637 -14618 -19954 -14658
15890 -14658 -7654 -10297 -10223 -15154 -30278 -33520 -9666 9979 14941 17007 14478 12964 25010 11445
15876A1445j7038n662P203P640O362m225q709p452Q180J3698m014j1730J2174
15863G872J1299j1902r488n924K638l749K348J2578k494j0504q88l421J0559M120
15849C044o759K710M687N838j448k542p38p139m853L045J1642K314l733J6656
15835B2724O662q158M771O211o102p063j2554j0193j621J612p76m517J4955o422
15821d71k570N742J2643j2506j1815r557q467N50j355p959J2800O882o76Q299
15807h460J3334O663k819m204p605Q502J2759l475N32p601Q495k734j3162M628
15793D853q030Q886J121k385k3831J888R137J3398m768l794l505J8024M371p770
15779G595m787K501P298k316J2129Q85j3605l502J1721o072j1499J837N26J360
$$ plain form
15876 11445 -5593 -11255 -4052 3588 9950 5725 -2984 -10436 -2256 11442 7428 -4302 7872
15863 7872 19171 7269 -2219 -8143 -5505 -9254 -6906 5672 3178 -7326 -8214 -11635 -1076 3044
15849 3044 -3715 -1005 3682 9520 8072 5530 4792 -2347 -7200 -4155 7487 9801 6068 22724
15835 22724 29386 21228 25999 32210 26108 19045 6491 -3702 -5323 -3711 -4487 -9004 5951 -471
15821 -471 -3041 2701 15344 2838 -8977 -18534 -27001 -26451 -27806 -35765 -22965 -16083 -16759 -8460
15807 -8460 4874 11537 8718 4514 -3091 5411 18170 14695 15227 7626 16121 13387 225 4853
15793 4853 -3177 5709 6830 4445 -19386 -17498 -8361 5037 269 -3525 -7030 10994 15365 7595
15779 7595 2808 5309 12607 10291 22420 23305 9700 6198 17919 11847 348 2185 2711 4071
15765D071r40q076k176L084l390k958l707J469J732J0460j819J1264L605l192
15751I427o863P195n508j758j0746o90Q886P514k844o61M410J225j0349K341O220
15736G799j6638k687J1404N190j3068M636J1863J2260j4452q800q209Q027J2365
15723I690K601j1506L866J0679O416m060J0321J430j4581j4519j4737q91K2136
15710F845J3884r217j6767K816M370m804R053m316J1858n20q524j0488L425P661
15696E276Q170M805m725j2068j7342N532Q098r353l538J1258J3032n35p708J8217
15682A9119N508q740q061j2247P92j4857K920J0499J0071p760m901K564r7J428
15668c762m198M775N601M634L895J0894q923j1350J562k17M864O905j1502p790
$$ plain form
15765 4071 3131 -4945 -7121 -4037 -7427 -10385 -14092 -12623 -10891 -431 -2250 9014 12619 9427
15751 9427 2564 9759 4251 2493 -8253 -8943 -57 7457 4613 3952 8362 9587 -762 1579 7799
15736 7799 -8839 -11526 -122 5068 -8000 -3364 8499 20759 6307 -2493 -10702 -2675 9690
15723 9690 12291 785 4651 15330 21746 17686 28007 29437 14856 337 -14400 -15291 6845
15710 6845 20729 11512 -5255 -2439 1931 -2873 6180 1864 13722 13202 4678 -5810 -2385 5276
15696 5276 13446 18251 13526 1458 -15884 -10352 -2254 -11607 -15145 -3887 9145 8610 902 19119
15682 19119 24627 15887 7826 -4421 -3629 -18486 -15566 -5067 5004 -2756 -7657 -5093 -5190 -3762
15668 -3762 -7960 -3185 2416 7050 10945 21839 12916 1566 3128 2911 7775 14680 3178 -4612
15654d612K380J4174J8368n727j4316j5025J728K578M10o949p033O730N467n49
15640b376J758r709J594O908j685J404m163R699N165j991O806M798l592N212l744
15625A6084m284K157R100p071N795M932j1442r156j2280r10J3628J7439P289j2030
15611A9251j3121K653K091k589M902R186L532K97O736j2951o994p305N305M476
15597A5469J676k299p342J813j14k916n823j0674o075R411P397K4014q567l369
15583A2601Q30J812r726J5n536J8112R580M477k048n154K89j6734Q80M083K036
15568A5517M877o534j4431j322Q295j386j9338k0509K939J3983R165L737K3545
15555A8538J3444k365L688j5492J032Q648m271K789j1773j3946N153J935n215
$$ plain form
15654 -4612 -2232 11942 30310 24583 10267 -4758 -3030 -452 -42 -6991 -14024 -7294 -1827 -2376
15640 -2376 -618 -10327 -8733 -1825 -3510 -2106 -6269 3430 8595 6604 13410 18208 14616 19828 16084
15625 16084 11800 13957 23057 15986 21781 26713 15271 6115 -6165 -7075 6553 23992 31281 19251
15611 19251 6130 8783 10874 8285 13187 22373 25905 26202 32938 19987 12993 5688 10993 15469
15597 15469 17145 14846 7504 9317 9203 6287 464 -10210 -16285 -6874 523 24537 15970 12601
15583 12601 13431 15243 5517 5532 -4 18108 27688 32165 30117 24963 25252 8518 9398 13481 15517
15568 15517 20394 13860 -571 -1893 6402 5016 -14322 -34831 -31892 -17909 -8744 -5007 18538
15555 18538 31982 29617 33305 17813 18845 27493 23222 26011 14238 292 5445 7380 2165
15542B165M893N856J380m004L31J6081P365j1327j1240N972M595j330o803l201
15528A0733J3645J2101p621k5532j216P312O345J873J236j2995j9564N902r73
15515h754M787J2935o6l189l490j091q164O713J6301j509j0902q959P171J0611
15501A2394O741J818m851r658r789P051Q247l225o452l40R983O467m779r63r070
15486C574j38K147l170k206j2859m579J2357J8216P678O998L442J74n983q769
15472A6882j573O174O75q565k331K0515O480j8240L366J0262k377l811p712R607
15458B9352n879p650q849J343J974r64K282m987j696O181O690M234k781O548r207
15443A6591L822O755j3417j4123n29J4778O219K497J2860k323j4342j6690j8725
$$ plain form
15542 2165 7058 12914 14294 10290 10621 26702 34067 22740 11500 17472 22067 20737 13934 10733
15528 10733 24378 36479 28858 3326 2110 9422 15767 17640 18876 5881 -13683 -7781 -8754
15515 -8754 -3967 8968 8902 5713 2223 1132 -7032 -319 15982 14473 3571 -5388 1783 12394
15501 12394 19135 20953 16102 6444 -3345 3706 11953 8728 2276 1936 11919 18386 13607 12644 3574
15486 3574 3436 5583 2413 207 -12652 -17231 -4874 13342 21020 28018 31460 31634 25651 16882
15472 16882 15309 21483 22158 13593 11262 31777 38257 20017 23383 33645 31268 27457 19745 29352
15458 29352 23473 15823 6974 8317 10291 9327 11609 6622 4926 11107 17797 22031 19250 25798 16591
15443 16591 20413 27168 13751 -372 -901 13877 20096 22593 35453 33130 18788 2098 -16627
15430a6627m467N783Q936l294N510k007J3614K450J978j2248k4026m76J7845J7016
15416I987J7220m50m968j7456R35N772k998N895n163N820N798L915O99j3770o460
15401D776r407j9769l759N518O087Q768L171O268L263o765J0781J4566p684j0095
15387E719O852R692j2199k0668o410K3362q984K1037N725j2936N75l755m065p269
15373c324o847P112M457k650j679P021Q705m617L009K125J7896k410k4311k405
15359B082m460K687R74n296N826k66j890J0529K1843p095j0295j5641j1227M029
15345h200J0628N710J518M148m140o758q272l290O175o817R588J0304J953j6629
15331d082l294r21k782p87L331l618J573O783P361m232j3706m45M351Q037J3325
$$ plain form
15430 -16627 -21094 -15311 -6375 -9669 -4159 -6166 7448 9898 11876 -372 -24398 -24874 -7029 9987
15416 9987 27207 26757 21789 4333 5268 11040 8042 13937 8774 14594 20392 24307 25006 11236 4776
15401 4776 -4631 -24400 -28159 -22641 -16554 -7786 -4615 1653 4916 -1849 8932 23498 15814 5719
15387 5719 12571 22263 10064 -10604 -17014 6348 -2636 18401 24126 11190 11765 8010 3945 -3324
15373 -3324 -10171 -3059 1398 -1252 -2931 4090 12795 8178 11187 13312 31208 28798 4487 2082
15359 2082 -2378 309 1283 -4013 1813 1547 -343 10186 32029 24934 14639 -1002 -12229 -8200
15345 -8200 2428 8138 9656 13804 9664 2906 -5366 -8656 -2481 -9298 290 10594 12547 -4082
15331 -4082 -7376 -8297 -11079 -11866 -8535 -12153 -10580 -3797 3564 -668 -14374 -14819 -10468 -2431 10894
15316A0894J0131O369m203j6454o087N856m135p051O232J0735M260O696Q297j6605
15302A4935l263j1965j425K371j8553j0782J750k759L659J2467m959l089r286
15289c0899M991R991J1830Q969J82k783J0980j7885m968O976j3552o839J6349
15276f658J3836k800j2428k079Q70k048k589L277Q160N418R18M204m396M095J420
15261I200K751j990m610j046j1077p264J3494M475o275N848k792j881O610Q200
15247A3643J923j60m860k3367p522J2811M102N201J2604J715j1029O273j3012
15234a678K715j775O852M527r079j096m108J282l148n277k214M56M653L022Q879
15219D011K4681q442j3603n562N016j970p44M626j4397n018J5004j0939l071Q89
$$ plain form
15316 10894 21025 27394 23191 6737 650 6506 2371 -4680 1552 12287 16547 23243 31540 14935
15302 14935 11672 -293 -1718 653 -17900 -28682 -26932 -29691 -26032 -13565 -18524 -21613 -30899
15289 -30899 -25908 -15917 -4087 4882 5064 2281 13261 -4624 -9592 -2616 -16168 -23007 -6658
15276 -6658 7178 4378 -8050 -10129 -9259 -11307 -13896 -10619 -2459 2959 3877 8081 3685 7780 9200
15261 9200 11951 9961 5351 4305 -6772 -14036 -542 3933 -2342 3506 714 -1167 5443 13643
15247 13643 15566 15406 10546 -12821 -20343 -7532 -3430 1771 14375 16090 5061 11334 -1678
15234 -1678 1037 -738 6114 10641 1562 466 -3642 -2360 -5508 -10785 -12999 -12543 -7890 -4868 4011
15219 4011 28692 20250 6647 1085 6101 4131 3387 8013 -6384 -11402 3602 -7337 -10408 -9519
15205i519P392Q372J7879M204j0201J0942o226o571M781j892j1108j1176M796
15192A673l724J207J937r2O67o483R702j2186M110K2619N252l2752l880J4046
15178B096N205O713j015j5196l169j0946o232l382R866Q058M693M231j134K608
15164B396Q56M514k919r73J15R186K378M359K740j807r962N098m069M677j4505
15149B084J896J7539J720j6489j3574j0173o572M727J2271J2988O920p480j5704
15136i847Q966P058K255m858L501l026R428K348J617p504j2156n036J647K923
15122b684q030Q093Q290n133j72O270k252K853m026M351K499L836m426j3783k65
15107d579J5721L135N168L574n683o208L978J4215k601j2676l739n562j5229r223
$$ plain form
15205 -9519 -2127 6245 24124 28328 18127 29069 22843 16272 21053 19161 8053 -3123 1673
15192 1673 -2051 -844 1093 1001 1668 -4815 4887 -7299 -3189 19430 24682 -8070 -11950 2096
15178 2096 7301 14014 12999 -2197 -5366 -16312 -22544 -25926 -16060 -8002 -3309 922 -212 2396
15164 2396 3252 7766 4847 3874 3989 13175 15553 19912 22652 20845 10883 15981 11912 16589 2084
15149 2084 3980 21519 23239 6750 -6824 -16997 -23569 -18842 -6571 6417 13337 5857 -9847
15136 -9847 -881 6177 8432 3574 7075 4049 13477 15825 17442 9938 -2218 -7254 -5607 -2684
15122 -2684 -10714 -2621 5669 536 364 6634 4382 7235 3209 7560 10059 13895 9469 -4314 -4579
15107 -4579 11142 14277 19445 23019 17336 11128 15106 29321 26720 14044 10305 4743 -10486 -19709
15093a9709o948Q32J8923J6544Q060p322j087m341q727O515O612l900J1304K861
15079A9617n868q581j1750j3553q939m17R110O720R523J3341j244r390o610J226
15065f815q714m481N518J3886m465J152L064L92J7245J628j391m980Q157J3078
15051C3274r962m612k901o445q807l873J0879l883k0927j8234o708M266J2303
15038b5630J55K1070O133j8607Q422l115o375p226K3763K637k640J3195r185o177
15024c580L845N564r507j5063j1256K774P341J5804N847j1963o896P818K786l206
15010i692p171J3579K847j488J9377J0770j0919J6300J2462o257k1179p129K996
14997A4496K687j027o993J041l996j392J9436Q248Q56R50n451j3772j417M94o272
$$ plain form
15093 -19709 -26657 -25825 -6902 9642 17702 10380 9293 4952 -3775 2740 9352 5452 16756 19617
15079 19617 13749 5168 -6582 -20135 -29074 -29491 -20381 -13661 -4138 9203 7959 -1431 -8041 -6815
15065 -6815 -15529 -20010 -14492 -606 -5071 -3919 -855 -463 16782 18410 17019 12039 20196 33274
15051 33274 23312 18700 15799 9354 547 -3326 7553 3670 -17257 -35491 -42199 -37933 -25630
15038 -25630 -25475 -4405 1728 -16879 -8457 -11572 -17947 -25173 -1410 1227 -1413 11782 2597 -3580
15024 -3580 265 5829 -3678 -18741 -29997 -27223 -19882 -4078 1769 -10194 -17090 -9272 -6486 -9692
15010 -9692 -16863 -3284 -437 -1925 17452 28222 17303 33603 46065 39808 18629 11500 14496
14997 14496 17183 16156 9163 10204 6208 4816 24252 32500 33356 34306 28855 15083 13666 14160 7888
14982G888j2087J262p811Q748R220J714p556Q173R461l213j2346o50J508k265
14968B046l032j9096j3003O083M061J9242r82K291q016j0294j454O360K0774M240
14954I220j1099j3098l024p98P987n442j793O291J3323Q092J2812q313j1715k803
14940c60m562R734O884p801O18J013N364q542L887q806r248k537j2206K627J8837
14925e098J939J3770j339o31N103k728K127J666P578n9k633j341r574q345j070
14910f35J879k075j2386P0l0o360q657J91J340J6262Q662J2533o194j1870J4999
14895G729N78J83O871n749j0717p048l98n325J1658J4164K410j0953o685Q19l783
14880f246J7846J1516r788j4813M08R045K177j0102r150l633J519Q12p349K876
$$ plain form
14982 7888 -4199 -2937 -10748 -2000 7220 8934 1378 9551 19012 15799 3453 2803 4311 2046
14968 2046 -986 -20082 -33085 -27002 -22941 -3699 -4681 -2390 -10406 -20700 -22154 -15794 4980 9220
14954 9220 -1879 -14977 -18001 -18799 -10812 -16254 -18047 -11756 1567 9659 22471 14158 2443 -360
14940 -360 -4922 4812 11696 3895 4513 5526 10890 2348 6235 -2571 -11819 -14356 -26562 -23935 -5098
14925 -5098 -3159 10611 9272 8641 13744 11016 13143 14809 22387 22328 19695 18354 8780 435 -635
14910 -635 1244 -831 -13217 -13147 -13177 -19537 -28194 -28003 -26663 -10401 -1739 10794 4600 -7270 7729
14895 7729 8307 8490 15361 9612 -1105 -8153 -8551 -13876 -2218 11946 14356 3403 -3282 -2463 -6246
14880 -6246 11600 23116 13328 -1485 -1077 7968 10145 43 -9107 -12740 -11221 -10409 -17758 -14882
14866a4882O950J1424r896j6215q382J0792Q164n890q316J31n67n55K711K573
14852b1958M495j2106l500J4299J2527L572J2360j0847Q2M482o369J216O087Q390
14838A2730j4147p03m820N754l101m120J490L662L440N603Q540q912n564J111
14824I63r058P52J0317J250l247j4257n43L987j2388N026P497J0189R026N844
14810A5358n666p608j3416K352J8634l717j807M536O566K31j1748Q9J163n943
14796i76k162Q846K0588P474p182j0121j9754N33O685N70j2517j2167L151R502
14782g530r6N742j701l206q383n571J0428J6458n353O144J098n817m888N693n719
14767b701P547N112p622P322k431r259P547l44J316q502N138j1870j1855P548
$$ plain form
14866 -14882 -7932 3492 -6404 -22619 -31001 -20209 -12045 -17935 -26251 -26120 -26687 -27242 -24531 -21958
14852 -21958 -17463 -29569 -33069 -18770 -6243 -2671 9689 -1158 -1076 3406 -2963 -1747 4340 12730
14838 12730 -1417 -2120 -6940 -1186 -4287 -8407 -6917 -3255 185 5788 14328 5416 -148 963
14824 963 -8095 -7343 2974 4224 977 -13280 -13823 -9836 -22224 -17198 -9701 488 9514 15358
14810 15358 9692 2084 -11332 -8980 9654 5937 4130 8666 15232 15463 3715 3804 4967 -976
14796 -976 -3138 5708 26296 33770 26588 16467 -3287 -2754 3931 4501 -8016 -20183 -17032 -7530
14782 -7530 -7626 -1884 -3585 -6791 -15174 -20745 -10317 6141 788 6932 8030 2213 -2675 3018 -2701
14767 -2701 4846 9958 2336 9658 7227 -2032 5515 5171 6487 -2015 3123 -8747 -20602 -13054
14753a3054J4000N679p60N251m76q063l430o17o583L981J2534L12j3143n105J5885
14738F411J1045r654M318M45j7680j4770O881K7762j252O41k027q981m983j413
14724c257o405j942M595Q384o259J23j4112n71K2362Q114m973L542Q941K459n414
14709A5587m498n800n655O751l647o981J012Q03L039j5494j0811J997K4414J179
14695A896j0826r992m407k139J7710P681M581N295l412k593j0266j3957O188J2673
14681a568o047L805J3750P674j7691k338K2p765q39j1030J3584J1857r974L648
14667b912M682r791Q649K260N617J1781J3081L939J675j6782j5474J343O877O111
14653B1056j3286j3169q742M839L165m174K513R087n460j1305Q904j336o039L631
$$ plain form
14753 -13054 946 6625 5865 11116 10640 2577 -853 -1470 -8053 -4072 8462 8774 -4369 -9474 6411
14738 6411 17456 7802 12120 12565 -5115 -19885 -13004 14758 13506 14147 12120 3139 -1844 -3257
14724 -3257 -9662 -11604 -7009 1375 -4884 -4761 -18873 -19444 2918 11032 6059 9601 18542 21001 15587
14709 15587 11089 5289 -366 6385 2738 -4243 -3231 -2428 611 -14883 -25694 -23697 717 1896
14695 1896 -8930 -18922 -23329 -25468 -7758 -77 4504 9799 6387 3794 -6472 -20429 -14241 -1568
14681 -1568 -7615 -3810 9940 17614 -77 -2415 -2393 -10158 -10997 -22027 -8443 3414 -6560 -2912
14667 -2912 1770 -8021 628 2888 8505 20286 33367 37306 38981 22199 6725 8068 14945 21056
14653 21056 7770 -5399 -14141 -9302 -6137 -10311 -7798 1289 -4171 -15476 -6572 -7908 -13947 -10316
14639a0316O062L107o91j0430j1453J4385L0j6136R105P260J2561N581K713l134
14625H644n545K937L586r811j9332k585L751J556K2804J6553n809k024J979q075
14611H629j0127m515L160j920j200r482l660J0564J4430J2324R652J039N700o388
14597B8206j3590m627K4307N965j7124j2953p383j4308r174k781L954P081j944
14584a4371Q413Q988L965J0898o783n862p018q187k144J3443J422j6934J036K194
14570a0940J8080J2496M46q9m516R38q362j2209l627K47J1477M019j4794r670
14556a6504j855K585O614J7992p500j0150P853J7825p918r132m896m754p053M418
14542a2475O128n472n148k316J163J955j751m830J1367O027L89N246k686o554
$$ plain form
14639 -10316 -4254 -1147 -1838 -12268 -23721 -9336 -9306 -25442 -16337 -9077 3484 9065 11778 8644
14625 8644 3099 6036 9622 -189 -19521 -22106 -18355 -16799 6005 22558 16749 14725 16704 8629
14611 8629 -1498 -6013 -2853 -4773 -5973 -15455 -19115 -8551 5879 18203 27855 28894 34594 28206
14597 28206 14616 9989 34296 40261 23137 10184 2801 -11507 -20681 -23462 -19508 -12427 -14371
14584 -14371 -5958 3030 6995 17893 11110 5248 -1770 -9957 -12101 1342 2764 -14170 -13134 -10940
14570 -10940 7140 19636 20082 19993 15477 16415 8053 -4156 -7783 -7536 3941 7960 -6834 -16504
14556 -16504 -18359 -15774 -9160 8832 1332 -8818 -965 16860 8942 -190 -5086 -9840 -16893 -12475
14542 -12475 -6347 -11819 -16967 -19283 -18120 -16165 -17916 -22746 -11379 -5352 -4963 283 -2403 -8957
14528h957p862R583O734k544k834J038O953N816p982r317j2837P103L806j1186
14514b2486O027R839R091j226n437p846M573R695j3412j4653J2908K7362K2235
14501C6670k5086j7275j1643j1391M957Q731J9203O271j0499j1512j569j6407
14489b9550j7049j6005J5346K2537J2591l006N565n718n870L448o028J1005J1633
14476a101q496m672l98J4746j0149q923n147n344M487J1189N751n330j481J2367
14462b501M011O072q455q437R365R077j4337k0092O238J0547P53J458J1270m211
14448G58l502L479j55l969J4583k195k809M346M85O7p821j2926p528j2765P82
14433b9170k947N688J1745P462r908L342J8243J424j2547Q218J6921J3862l68
$$ plain form
14528 -8957 -16819 -7236 -502 -3046 -5880 -4842 2111 7927 -55 -9372 -22209 -15106 -11300 -22486
14514 -22486 -16459 -6620 2471 1245 -4192 -12038 -7465 2230 -11182 -25835 -12927 14435 36670
14501 36670 11584 -5691 -17334 -28725 -23768 -15037 4166 10437 -62 -11574 -13143 -29550
14489 -29550 -46599 -62604 -47258 -24721 -12130 -15136 -9571 -15289 -21159 -17711 -23739 -12734 -1101
14476 -1101 -9597 -14269 -14667 79 -10070 -18993 -24140 -29484 -24997 -13808 -8057 -13387 -14868 -2501
14462 -2501 1510 7582 -873 -9310 55 9132 -5205 -25297 -19059 -8512 -7759 -6301 4969 758
14448 758 -2744 735 580 -3389 11194 8999 6190 10536 11021 11088 3267 -9659 -17187 -29952 -29170
14433 -29170 -32117 -26429 -14684 -7222 -17130 -13788 4455 5879 -6668 1550 18471 32333 31965
14420C1965j6355j1721o308n241Q716M413O052P06O818j0083J811M976o124k938
14406F687j642k198j2083Q619n051n244l470j189L37n03J4016L404k671P294N400
14391A1706q834j1115l300M519m700n898O701M483p70K418q548K724M954r71j866
14376h497J045J694K688o3j5409P493M728n791l151n142k930J7009J8258K86l3383
14361b1165j2571J4036p358j0648P35N028L716O989R462J899r241p713R542J4946
14347b343J7773j459j0055q305j1361K400P651J2960Q098k0405k3398K328J5154
14334a0962J7358k355J988r34O644K805o638J86J471l942q309J959P87P873j0072
14319b141p003l283N556J2650R405r490q361K475n613j1145M402J4489J0677j6120
$$ plain form
14420 31965 15610 3889 -2419 -7660 1056 5469 11521 12227 19045 8962 10773 15749 9625 6687
14406 6687 5045 2847 -9236 -617 -5668 -10912 -14382 -15571 -15234 -15737 -1721 1683 -988 6306 11706
14391 11706 2872 -8243 -11543 -7024 -11724 -17622 -10921 -6438 -7208 -4790 -13338 -10614 -5660 -6631 -8497
14376 -8497 -7452 -5758 -3070 -3133 -18542 -11049 -6321 -12112 -15263 -20405 -23335 -6326 11932 12218 -21165
14361 -21165 -33736 -19700 -27058 -37706 -36971 -31943 -28227 -21238 -11776 -9877 -19118 -26831 -17289 -2343
14347 -2343 15430 13971 3916 -4389 -15750 -13350 -5699 7261 15359 -5046 -28444 -26116 -10962
14334 -10962 6396 4041 6029 5095 11739 14544 7906 8092 9563 5621 -2688 -729 58 7931 -2141
14319 -2141 -9144 -12427 -6871 5779 15184 5694 -2667 -192 -5805 -16950 -12548 1941 12618 -3502
14305c502o501R134J003p569J119M689K554O454o224j4923N609J0603j0037j2325
14291a9916n228m964P370J0918J5672J0668j1926j0848K824R540J0677L25N864
14278B0976j6142j1478l398j829K877m014l739k648J3660J5038M341j1996r896
14265h248Q961K29K322l169R217N682M109j0750m796L812j1066R424O774m135
14251H366q841q299j691J364M060M529j724n869j2906p497J3962M239K293q68
14237h882n702J3320P161m005J720q446r41p13O552K976K1007m970K966j0251
14223A1792q985o762j8672P377K1502Q164p655j5965l444j371M129p789o183O120
14209a7742m170p395K5948J9198n818J183j1341n705q47N207J8158P521k450k8914
$$ plain form
14305 -3502 -10003 -869 134 -7435 -6316 -1627 927 7381 1157 -13766 -8157 2446 -7591 -19916
14291 -19916 -25144 -30108 -22738 -11820 3852 14520 2594 -8254 -5430 4110 14787 15112 20976
14278 20976 4834 -6644 -10042 -11871 -8994 -13008 -16747 -19395 -5735 9303 13644 1648 -8248
14265 -8248 713 942 3264 95 9312 14994 19103 8353 3557 7369 -3697 5727 12501 8366
14251 8366 -475 -8774 -10465 -9101 -5041 -512 -2236 -8105 -21011 -28508 -14546 -10307 -8014 -8882
14237 -8882 -14584 -1264 5897 1892 3612 -4834 -5775 -6488 64 3040 24047 19077 22043 11792
14223 11792 2807 -3955 -22627 -15250 6252 14416 6761 -9204 -12648 -14019 -9890 -17679 -23862 -17742
14209 -17742 -21912 -29307 -3359 15839 10021 11204 -137 -5842 -6689 -1482 16676 24197 21747 -7167
14195g167q501J7435J4631k506R874j4790k9561N36P953j4635k506K3536p292
14182a2993Q43J2898P260j2197k398J4667j862j6256j388J1789N752j719O309
14169A0705l185j849l059n445l343j3421j04m581J3415J3337K281j8304j5537
14156b9090J3957q53l54o255j8864l242L786J3022O562k908J0853k543N049L196
14142g684q257L799Q008J5416J269L874M29j9686j33J1149j152p063J3681j2254
14128A396j5864k802k050l527O151l681j747J2996M550q886m715M065R811J3157
14114H854O515q211N284J002m087J441n230l749N569P326k811k4076m351Q173
14100h351n67N306K243N572N192j0089j0604Q71J4203J2156j5386o933Q705r513
$$ plain form
14195 -7167 -15668 1767 16398 13892 23766 8976 -20585 -20049 -12096 -26731 -29237 -5701 -12993
14182 -12993 -12150 748 8008 -4189 -6587 8080 6218 -10038 -11426 363 6115 4396 10705
14169 10705 7520 5671 2612 -2833 -6176 -19597 -19701 -24282 -10867 2470 4751 -13553 -29090
14156 -29090 -15133 -15986 -16340 -22595 -41459 -44701 -40915 -27893 -21331 -24239 -13386 -15929 -10880 -7684
14142 -7684 -15941 -12142 -4134 11282 12551 16425 16854 -2832 -2965 8184 7032 -31 13650 1396
14128 1396 -14468 -17270 -19320 -22847 -16696 -20377 -22124 -9128 -4578 -13464 -18179 -14114 -4303 8854
14114 8854 15369 7158 12442 13444 9357 10798 5568 1819 7388 14714 11903 -12173 -16524 -8351
14100 -8351 -8918 -3612 -1369 4203 9395 -694 -11298 -10427 3776 15932 546 -6387 2318 -7195
14086g195l982p069M522J3530P821K2N774p815r484j0716J0470j2193K624J1958
14072a733L666r700n420J7140R076q845J607o304r752j4427J218J4511L634j16
14058e445K836l275Q852J857k544L933q053K560N96p891j0190J307k408N116O790
14043e959j3057R164J1887q562q736J3385J1915O164j938K383k942q983j5944
14030a1223J634J0777L415j5636Q709M887j2081j3061P386P986n656Q957J0679
14017F773J842r740J3426k409j6320j1877o527L4M002M116J5553O985j4518j3533
14003b2193m00J0298Q21L041L94J803J1472P446j477k6022k494O771q940N643
13989a3837L574O376r235j5205N202P854N290r562n997K543j825J2066J812J8703
$$ plain form
14086 -7195 -11177 -18246 -13724 -194 7627 7649 13423 5608 -3876 -14592 -4122 -16315 -13691 -1733
14072 -1733 1933 -7767 -13187 3953 13029 4184 5791 -513 -10265 -24692 -23474 -8963 -5329 -5445
14058 -5445 -2609 -5884 2968 4825 2281 6214 -1839 721 1317 -6574 -16764 -15457 -17865 -12749 -5959
14043 -5959 -19016 -9852 2035 -6527 -15263 -1878 10037 16201 14263 16646 13704 4721 -11223
14030 -11223 -9589 1188 4603 -11033 -2324 2563 -9518 -22579 -15193 -7207 -12863 -3906 6773
14017 6773 8615 -1125 12301 9892 -6428 -18305 -24832 -24798 -20796 -16680 -1127 5858 -8660 -22193
14003 -22193 -22593 -12295 -11474 -8433 -8039 -6236 5236 12682 11205 -14817 -17311 -10540 -19480 -13837
13989 -13837 -10263 -3887 -13122 -28327 -23125 -15271 -9981 -19543 -25540 -22997 -24822 -12756 -10944 7759
13975G759j225j5048r72r197J624J1205Q517P104J298j0419O469n084q949j759
13961h677r956M020J2647o143r606J4517P290j4319M802P184K754Q480P662j922
13947A8733n396j113p095m415J5197M443j556J2746j1783l843o043j7110k432
13934i667j0792l646R879J788J166R715K1208J7528q715j1032j3255M567k271
13921F473k499J0960J53j478j64j3626p871j1716J0136N912p264p929J544j562
13907a8931K8315K2962n668o748O305K6755L5069J2551K7924O690j5230l0036
13895H9958j8944j3861k4036k6783j2120o499J2436L731J1423J0783l695n628
13883A6765q153O891r465M546J6869j1289j7348j0825q682r331R689J7072R961
$$ plain form
13975 7759 6534 -8514 -9486 -18683 -17059 -5854 2663 9767 11065 646 7115 2031 -6918 -8677
13961 -8677 -18633 -14613 -1966 -8109 -17715 -3198 4092 -10227 -5425 1759 4513 12993 20655 18733
13947 18733 13337 12224 5129 714 15911 20354 18798 31544 19761 15918 9875 -7235 -9667
13934 -9667 -20459 -24105 -14226 -12438 -11272 -1557 19651 37179 28464 17432 4177 8744 6473
13921 6473 3974 14934 15087 13609 13445 -181 -8052 -19768 -9632 -3720 -10984 -18913 -17369 -18931
13907 -18931 9384 32346 26678 19930 26235 52990 88059 100610 128534 135224 119994 89958
13895 89958 71014 57153 33117 6334 -5786 -12285 151 3882 15305 26088 22393 16765
13883 16765 8612 15503 6038 10584 27453 16164 -1184 -12009 -20691 -30022 -20333 -3261 6700
13870F700R817j1829j0732O458J3896n1k054j0426N080j8700K627K478K5669l155
13856A5778j1481J3844Q804p309p532o511J7712K870j5089l80m53k366k159K266
13842G994R788j2010k0238m011J5699J7346L646K823j4370j0530M03P24J0755
13829H019O744j3095k1462o898K0789J683J1342Q413j6152p320j0210L796n833
13816b0184o511J8303l2J048R060O531j879Q511O821J905j584j5877R156j842
13802A3426J721q558l331j3088N420N003p148l167N438R129r016j2351q883n88
13788b5993k755N318R299J2918Q063o710j1849O5J3244J1975J28r185o394L099
13774A223J2038L581P694l089j3446j492k758R917Q389o951j6414j373R111J1706
$$ plain form
13870 6700 16517 4688 -6044 414 14310 14259 12205 1779 6859 -11841 -9214 -6736 18933 15778
13856 15778 4297 18141 26945 19636 12104 5593 23305 26175 11086 10706 10253 7887 5728 7994
13842 7994 17782 5772 -14466 -18477 -2778 14568 18214 21037 6667 -3863 -3460 -2736 8019
13829 8019 14763 1668 -19794 -26692 -5903 -4220 7122 15535 -617 -7937 -18147 -14351 -20184
13816 -20184 -26695 -8392 -8424 -7376 1684 8215 6336 14847 21668 23573 21989 6112 15268 13426
13802 13426 15147 6589 3258 -9830 -4410 593 -6555 -9722 -4284 4845 -4171 -16522 -25405 -25993
13788 -25993 -28748 -23430 -14131 -1213 6850 140 -11709 -11644 1600 13575 13703 4518 -1876 1223
13774 1223 13261 16842 24536 21447 8001 6509 3751 13668 22057 15106 -1308 -2681 6430 18136
13760A8136L439q627P912K669j2308n344J488k365J192l164j0436o527q048K153
13746a9830K0637M183k172j1252k463N432L280J046j4764p380J0115J7266l072
13733A026m15k607k983l726N85m925J3669N840n315K873j421j0569l191P888l21
13718c592j7888N09J0230L457O37j051n790j240Q959P932K23Q934J0439n938o527
13703I294m38j0026o095R194M62k569p55P52P921O417r135j046L8j4190j0821
13688b0997j0225P46P480N453j5278J0556K0162J701p817j154M672o834p171J8627
13674g9O288r08l894n129J3861m001k830P979J548j9633Q697J3988o067q129J027
13659B718P255o507j6268l670P530K0855j089q357N236O279j0878j4346p723K0215
$$ plain form
13760 18136 21575 12948 20860 23529 11221 5877 7365 5000 6192 3028 -7408 -13935 -21983 -19830
13746 -19830 807 4990 2818 -8434 -10897 -5465 -2185 -1139 -15903 -23283 -13168 4098 1026
13733 1026 611 -1996 -4979 -8705 -8120 -13045 624 6464 1149 4022 2601 -7968 -11159 -3271 -3592
13718 -3592 -21480 -20971 -10741 -7284 -6647 -7698 -13488 -14728 -5769 2163 2386 11320 21759 15821 9294
13703 9294 8856 -1170 -7265 1929 2391 -178 -933 -181 7740 14157 5022 3976 4014 -10176 -20997
13688 -20997 -31222 -30476 -22996 -17543 -32821 -22265 -2103 -402 -8219 -9373 -4701 -11535 -18706 -79
13674 -79 6209 5301 1407 -3722 10139 6138 3308 11287 12835 -6798 1899 15887 9820 1691 2718
13659 2718 9973 3466 -12802 -16472 -8942 11913 10824 2467 7703 13982 3104 -11242 -18965 1250
13645A250M256M262M259j055j9205o929J5988N369j7030o926o575j840J3629R231
13631a316m529n933J709K303L586O680j1686M867j415O12O73j4362J5765J2825
13617I779k0190r355k613l98n331M186J5185j946l681J9305K0736p782k865N089
13603B0119P646N473r516l109l750j6876k1759o022R756L000m543J3343m55L897
13589b796Q01p58Q12m824j7603j6333J0579K8757K725j1202N146N496j6436o236
13575b1872k396m451Q833J3647O133J0043p419n858L314O063k122j1049o739j537
13561a5410j0003p361J3923J3742J44J0294n107Q290P369j3707m478l600j0093
13548a5997j636R103M719l319Q700N514o083Q089J6510p729j7351J0543K82j7347
$$ plain form
13645 1250 5506 9768 14027 12972 -6233 -13162 2826 8195 -8835 -15761 -22336 -24176 -10547 -1316
13631 -1316 -5845 -11778 -10069 -7766 -4180 2500 -9186 -4319 -5734 -5122 -4449 -18811 -3046 9779
13617 9779 -10411 -19766 -22379 -22777 -28108 -23922 -8737 -10683 -14364 4941 25677 17895 15030 20119
13603 20119 27765 33238 23722 20613 16863 -13 -21772 -27794 -18038 -15038 -19581 -6238 -6693 -2796
13589 -2796 -1995 -2753 -1941 -6765 -24368 -40701 -30122 -1365 1360 -9842 -4696 800 -15636 -21872
13575 -21872 -24268 -28719 -19886 -6239 -106 9937 2518 -3340 -26 6037 3915 -7134 -13873 -15410
13561 -15410 -25413 -32774 -18851 -5109 -4965 5329 222 8512 15881 2174 -2304 -5904 -15997
13548 -15997 -17633 -8530 -3811 -7130 1570 7084 1001 9090 25600 17871 520 11063 11345 -6002
13534f002m257N479J200n577O649n451L800O863k456l527m363J3876M629O40j4916
13519c413q913r610k95J3338R778q300P385P952O776P750j0323o905q124J2516
13505I612J502j3928J170j7180j5144J1819q59o268J9130j0450k432J480o648
13492b8196J337K794K0892J2042l303j5459N893N581J167L881R484j1624j4857
13479a0368o937L763P536J1811k329p731j828o26Q870m140r468O129L532l796
13465e582P502o885j5331Q498K0502o116p348l857M820m782l953L54K732K502
13451f944O976l929j7198o337J9311O248j0634r01J5629J1313m892p797K264r038
13437e929r385j0456q958K969P350k986J7538J8998M654J315p063j1159p701m840
$$ plain form
13534 -6002 -10259 -4780 -3580 -9157 -2508 -7959 -4159 2704 248 -3279 -7642 6234 10863 11503 -3413
13519 -3413 -12326 -21936 -22231 -8893 885 -7415 -30 7922 14698 22448 12125 5220 -2904 9612
13505 9612 11114 -2814 -1644 -18824 -33968 -22149 -23008 -29276 -10146 -20596 -23028 -21548 -28196
13492 -28196 -26859 -24065 -3173 8869 5566 -9893 -4000 1581 2748 6629 16113 4489 -10368
13479 -10368 -17305 -13542 -6006 5805 3476 -4255 -6083 -6709 2161 -1979 -11447 -5318 -1786 -5582
13465 -5582 1920 -4965 -20296 -11798 8704 2588 -4760 -8617 -3797 -8579 -12532 -12178 -9446 -6944
13451 -6944 32 -3897 -21095 -27432 -8121 -1873 -12507 -13408 2221 13534 8642 845 3109 -5929
13437 -5929 -15314 -25770 -34728 -31759 -24409 -27395 -9857 9141 13795 15110 8047 -3112 -10813 -15653
13423a5653o445m354R742P238Q638q77J031k100j2902j7744k071o66Q661J3160
13409a4342P494J0740L96k229L10J2852q770j6776l72Q407P823K647J6085O195
13395C0460r380j0139j3349J64J400J4506J4626j0123j0785r498J3K078J1120
13382A1093K039j2032N016K928L6M493J038l613j492k721o204l521j3008j1571
13368b7519k936K7047O041l68n548P204J0519N174j4879k4379m862P13M435J2825
13354f533J0910k734j4783N95O423P534q509r801J0545J1623n690r29m96r372
13340a1217M172l114o913P297R537j1349m862q34L747n218K782M473N723J285
13326d491K848K029n454n540L230J2489m759k809J025P591o248j1732J6817P178
$$ plain form
13423 -15653 -22098 -26452 -16710 -9472 -834 -1711 -680 -2780 -15682 -33426 -35497 -36163 -27502 -14342
13409 -14342 -6848 3892 4288 2059 2369 15221 6451 -10325 -10697 -2290 5533 8180 24265 30460
13395 30460 21080 10941 -2408 -2244 -844 13662 28288 18165 7380 -2118 -2105 -27 11093
13382 11093 13132 1100 6116 9044 9080 13573 14611 10998 9506 6785 581 -2940 -15948 -27519
13368 -27519 -30455 -3408 2633 2265 -3283 3921 14440 19614 4735 -19644 -24506 -23793 -19358 -6533
13354 -6533 4377 1643 -13140 -12545 -6122 1412 -7097 -16898 -6353 5270 -420 -1349 -1845 -11217
13340 -11217 -7045 -10159 -17072 -9775 -238 -11587 -16449 -17283 -13536 -18754 -15972 -11499 -5776 -4491
13326 -4491 -1643 386 -5068 -10608 -7378 5111 352 -2457 -1432 6159 -89 -11821 4996 12174
13312A2174q78J3743j829n567j8652j4402j1186J9556M471l916p337j747O642
13299h928k251J1705j12m537j27J8380M044l875m040q648r365j2787L809J5597
13285a135mQ948Q885o203q127m631l952K805q373j498P433K576L126p310L869
13270c591J0116N241q230n189k402q404K599p161o885N330Q113K371N998m323
13256f417J434n961n801j2238P974J473J961J949j1389o948o400J0024R038J0770
13242a0531J6166n804n833l659L747M917M650k778K359k064j8843o305O037J7763
13228a78j569P292o902m895k253l797k910k158J63L101P323j941R277n587j5189
13213b0223k136J5287Q177n625n401P112M765K944K486o210j737J387L284l904
$$ plain form
13312 12174 11296 25039 23210 17643 -1009 -15411 -26597 -7041 -2570 -6486 -13823 -15570 -8928
13299 -8928 -11179 526 414 -4123 -4250 14130 18174 14299 10259 1611 -7754 -20541 -16732 -1135
13285 -1135 -1139 7809 16694 10491 2364 -2267 -6219 -3414 -11787 -13285 -5852 -3276 -150 -7460 -3591
13270 -3591 6525 11766 3536 -1653 -4055 -12459 -9860 -17021 -23906 -18576 -10463 -8092 -2094 -6417
13256 -6417 -4983 -10944 -16745 -28983 -21009 -19536 -17575 -15626 -27015 -33963 -40363 -30339 -21301 -10531
13242 -10531 5635 -169 -6002 -9661 -5914 -997 3653 875 3234 1170 -17673 -23978 -17941 -178
13228 -178 -1747 5545 -1357 -6252 -8505 -12302 -15212 -17370 -17207 -14106 -6783 -8724 553 -5034 -20223
13213 -20223 -22359 -7072 1105 -4520 -9921 -2809 1956 4900 7386 1176 -561 826 4110 206
13199B06m467j0532p793m172j6736J0897Q540p491P214J1486Q056j6461K692J2225
13185f336k12l571j157q36p772j244m223l663J549J7227J2348n108m586j4326
13171b1910j176n12N387M104Q987K155N405l981o776o806K115K046J5422l692
13157G68J1363J0024j2569p437R68J159M006J4119n275j0555J213j119j3686k2489
13143b9510j232K742m049O679O533J8255O608l192K856N96n215J3561K214r812
13129G034m62j2013J394j771j3840k38K0582J6248j2171J4147J1404r129k288
13116A8897L397M034k565N154Q316j5923j8021j3365o307r339O511L718K2414
13103F921L361r672j5766j178M888J02M432L939q790j4381o271J5054J5536q831
$$ plain form
13199 206 -4261 -14793 -22586 -26758 -43494 -32597 -24057 -31548 -24334 -12848 -4792 -21253 -18561 -6336
13185 -6336 -6548 -10119 -11276 -12112 -19884 -21128 -25351 -29014 -27465 -10238 2110 -2998 -7584 -21910
13171 -21910 -23086 -23598 -18211 -14107 -5120 -2965 2440 -1541 -8317 -15123 -13008 -10962 4460 768
13157 768 12131 22155 9586 2149 3117 4276 8282 22401 17126 6571 7784 6665 -7021 -29510
13143 -29510 -30742 -28000 -32049 -25370 -18837 -582 6026 2834 5690 6286 1071 14632 16846 7034
13129 7034 6572 -5441 -4047 -5818 -19658 -19896 686 16934 4763 18910 30314 21185 18897
13116 18897 22294 26328 23763 28917 37233 21310 3289 -10076 -16383 -25722 -19211 -15493 6921
13103 6921 10282 610 -15156 -16334 -11446 -11344 -6912 -2973 -11763 -26144 -32415 -17361 -1825 -10656
13089a0656j139J9845L322m626j812J408K845R715r215o03n233k783j2391K60
13075a1063J1601j438N769q582k0011O47r46J741M268Q030O271p265j3926o153
13061c1057N180J4031J177Q725J742j5089P023M092m17o188n611P53K71L977M556
13046f835q437m160K4700O203j0560m280N341j55n754l266O026j582J0232j5751
13032h278j2503Q467L021N192K0117J2428P516m625k4101k3533R556R184j9077
13019a6636p631N443P250J0460m759o945P475l715l18r613l676j909O682R776
13005h116L928M293O32n025o344l37L697L958j3812k48k082J8749N320q483r452
12990a3322n924J4563N756J699j989n719j7623o439N687j4422R632J0662J7878
$$ plain form
13089 -10656 -11795 8050 11372 6746 4934 6342 9187 18902 9687 9084 3851 1068 -11323 -11063
13075 -11063 538 -900 4869 -3713 -23724 -23077 -24023 -22282 -18014 -9984 -3713 -10978 -24904 -31057
13061 -31057 -25877 -11846 -10669 -1944 -202 -15291 -8268 -4176 -4593 -10781 -16392 -15639 -15368 -11391 -6835
13046 -6835 -15272 -19432 5268 11471 911 -3369 1972 1817 -3937 -7203 -1177 -2759 7473 -8278
13032 -8278 -20781 -12314 -9293 -4101 16016 28444 35960 31335 7234 -16299 -6743 2441 -16636
13019 -16636 -24267 -18824 -11574 -1114 -5873 -12818 -5343 -9058 -9376 -18989 -22665 -24574 -17892 -8116
13005 -8116 -4188 105 737 -4288 -10632 -10969 -7272 -3314 -17126 -17374 -19456 -707 4613 -3870 -13322
12990 -13322 -19246 -4683 1073 2772 783 -4936 -22559 -28998 -23311 -37733 -28101 -17439 439
12977D39j4316r463k398n414J4578J1034J4240l510k579o852L414r97o935l772
12963a2531j143R01P512N775l66o06K2875l5j5199K354r56K103l245P676l577
12948A1538j5363p185j224O937J154K310J620L440M164O473J718P047j3432j5726
12934f529l220l628N984j3412n347n772o413N056O187J5959Q323N495K055j2627
12920g889J1394J820p076M642j0965m456R85M369o453j1755O710J4134L676K390
12906A526r327r876j516K996J0742N649k055R58L607L458J4576N896n797m11M185
12891B4611j4421l284j3471q720M787Q51K750J5365O594q836k110K145M257n246
12877E272k531O303M002j8457n036J5376P955j3182j0j1949j536p548Q154K1598
$$ plain form
12977 439 -13877 -23340 -25738 -31152 -16574 -5540 8700 5190 2611 -4241 -827 -1824 -8759 -12531
12963 -12531 -13674 -12773 -5261 514 148 -458 22417 22382 7183 9537 8581 10684 7439 15115 11538
12948 11538 -3825 -11010 -12234 -5297 -4143 -1833 -213 3227 7391 13864 15582 22629 9197 -6529
12934 -6529 -9749 -13377 -7393 -20805 -26152 -31924 -38337 -33281 -27094 -11135 -2812 2683 4738 -7889
12920 -7889 3505 5325 -1751 2891 -8074 -12530 -11545 -7176 -13629 -25384 -18674 -4540 -864 1526
12906 1526 -7801 -17677 -19193 -16197 -5455 194 -1861 -903 2704 6162 20738 26634 20837 20426 24611
12891 24611 10190 6906 -6565 -15285 -10498 -9647 -6897 8468 15062 6226 4116 6261 10518 5272
12877 5272 2741 9044 13046 -5411 -10447 4929 12884 -298 -308 -12257 -13793 -21341 -13187 8411
12863H411q162m886P562j1098o105l472j6537P822Q074J0268Q761j4104j7685
12850c1151J4670J0715L730o371J138J1206M932j302p168M72p870M782M615l522
12836a124N30p470m705K878n65p107K606M358J3074J799K530J0627j268k2405
12822f242o460j2838L443J8181M419p587j6733o705L350O699O054R855n684m428
12808a4676L674J423L20M176N735M530m111q038j583m221r49q75k004N983j872
12793a2488j1614J580L365M617j718J683Q582m490l21n280j9529J1708J1895N894
12779f116L369k674n739n477j1685l98j0m169K575R894J1382k636m773P761Q299
12764c97n058j0577J408k295j8570O627K755J8350P02p282K63Q156M456J606L440
$$ plain form
12863 8411 249 -4637 2925 -8173 -14278 -17750 -34287 -26465 -18391 -8123 638 -13466 -31151
12850 -31151 -16481 -5766 -2036 -8407 -7269 3937 8869 7567 399 871 -6999 -2217 2398 -1124
12836 -1124 -594 -8064 -12769 -9891 -10456 -17563 -14957 -10599 2475 4274 6804 17431 16163 -6242
12822 -6242 -12702 -25540 -22097 -3916 503 -7084 -23817 -30522 -27172 -20473 -14419 -4564 -10248 -14676
12808 -14676 -11002 -9579 -9259 -5083 652 5182 1071 -6967 -8550 -12771 -13720 -14595 -16599 -10616 -12488
12793 -12488 -24102 -22522 -19157 -14540 -16258 -14575 -5993 -10483 -10804 -16084 -35613 -23905 -12010 -6116
12779 -6116 -2747 -5421 -11160 -16637 -28322 -28720 -28730 -32899 -30324 -20430 -9048 -11684 -16457 -8696 -397
12764 -397 -5455 -16032 -14624 -16919 -35489 -28862 -26107 -7757 -7055 -14337 -14074 -5918 -1462 144 3584
12749C584M962p113p894J515J4663j2501j1878N640J2206O515M776j248j0622
12736B605p677J623m689p100P543l019j2013P503J5510M875k6j022o657O205M785
12721H446J961k862J653O04p816J0004q325j2436N65k100J565K162J3344k464
12707D301r472p318j184Q868r696j212j3258q047K0805J949j422j4263j674M89
12693c1134K278K5624K0677K782q524j1989j2727o891o317J3901L562K341j3004
12680a9421l686R435L548r005j370J0074L538N420J3819J48n342n66m842m188
12666b438p937m649l51N928k607K292l981j650k053R647J2777n609o109K875K30
12651c635K846p52o098J1825R096j2938n470l711J3424M610j2449r807Q084k103
$$ plain form
12749 3584 8546 1433 -6461 -4946 9717 -2784 -14662 -9022 3184 9699 14475 13227 2605
12736 2605 -5072 -3449 -8138 -15238 -7695 -10714 -22727 -15224 286 5161 5135 4113 -2544 3661 8446
12721 8446 10407 7545 9198 9802 1986 11990 3665 -8771 -8206 -10306 -8741 -6579 6765 4301
12707 4301 -5171 -12489 -13673 -4805 -14501 -15713 -28971 -37018 -16213 -14264 -15686 -29949 -31623 -31134
12693 -31134 -28856 -3232 17445 20227 11703 -286 -13013 -19904 -26221 -12320 -8758 -6417 -19421
12680 -19421 -23107 -13672 -10124 -19129 -20499 -10425 -6887 -1467 12352 12500 7158 6592 1750 -2438
12666 -2438 -10375 -15024 -15375 -9447 -12054 -9762 -13743 -15393 -17446 -7799 4978 -631 -6740 -3865 -3635
12651 -3635 -789 -1541 -7639 4186 13282 344 -5126 -8837 4587 9197 -3252 -13059 -4975 -7078
12637g078O553L361j0490k473K0169J4445j3177j4458n388m91j1877l96J4540
12624f760j0805n127R893J3349r517N351l684L924J8118l717P90n12q886q994
12610f577L76O805n224m002k141J4464m947j3787j0670q842J1478J1761k96L109
12596h493J8987N190l161k378P461o744k57N119r529J501J606m989o625n401l07
12581h020J0401O131N859r849j6019O570p062j9639M119Q431J2668M980K597p561
12567f394j5863K295P628l674Q944J685l084K187N506R928J4952j1565j5379p217
12553a0051r176M728J0090j843J3190J5836j7302J1151J6255P76m999j0625k1984
12540c954n290k654j4133M520K770P423J3660q90M055r617P44M489p203j2851
$$ plain form
12637 -7078 -525 2836 -7654 -10127 10042 24487 11310 -3148 -8536 -9027 -20904 -21300 -6760
12624 -6760 -17565 -22692 -12799 550 -8967 -3616 -7300 -3376 14742 11025 11815 11303 2417 -6577
12610 -6577 -6201 604 -4620 -8622 -10763 3701 -1246 -15033 -25703 -34545 -23067 -11306 -11602 -8493
12596 -8493 10494 15684 12523 10145 17606 10862 10605 15724 6195 7696 9302 4313 -2312 -7713 -8020
12581 -8020 2381 8512 14371 4522 -11497 -4927 -11989 -31628 -27509 -19078 -6410 -1430 1167 -6394
12567 -6394 -22257 -19962 -12334 -16008 -7064 -5379 -8463 -6276 -770 9158 24110 12545 -2834 -10051
12553 -10051 -19227 -14499 -4409 -6252 6938 22774 5472 16623 32878 33654 28655 18030 -3954
12540 -3954 -9244 -11898 -26031 -21511 -18741 -11318 2342 1452 5507 -4110 -3366 1123 -6080 -18931
12526a8931J507J881K292J4503N430r770o079L664J2861J985o353j0703r231r269
12512b6213J0248J2468J0441j741o204R429m965l161j2354m157N141J586M114
12499e368M839r540k691J0257j3539q149j3404K1050L6131J4609j6621k5349N114
12486b661R069j1550K033q360j6431L692K160P880N163M090O693l747p377R209
12472a37o051j1156O822Q027l070j3388j6019j260N861K5404N867n747m981o333
12458a6161J1665m126j6375l670l040m193J3377J6943l454k295pR972J5088N424
12444A9148p740p409M377r010k127r602M765m182K490R869P635P622n666m858
12430E312p321K008K414l170J718L434j1547k342K809j1287j2789M885J8983K235
$$ plain form
12526 -18931 -17424 -15543 -13251 1252 6682 -3088 -9167 -5503 7358 9343 2990 -7713 -16944 -26213
12512 -26213 -15965 -3497 6944 5203 -1001 8428 3463 302 -12052 -16209 -11068 -9482 -5368
12499 -5368 -529 -10069 -12760 -2503 -16042 -24191 -37595 -16545 19586 34195 17574 -7775 -2661
12486 -2661 6408 -5142 -3109 -11469 -27900 -24208 -22048 -14168 -9005 -4915 1778 -1969 -9346 -137
12472 -137 -6188 -17344 -10522 -2495 -5565 -18953 -34972 -36232 -30371 -4967 900 -4847 -9828 -16161
12458 -16161 -4496 -8622 -24997 -28667 -31707 -35900 -22523 -5580 -9034 -11329 -11336 -1364 13724 19148
12444 19148 11408 3999 8376 -634 -2761 -12363 -7598 -11780 -9290 579 8214 15836 10170 5312
12430 5312 -2009 -1 2413 -757 961 4395 -7152 -9494 -6685 -17972 -30761 -25876 -6893 -4658
12416d658j6331m353J0663m565j3290J1946m26k043J0397O88o867j102m816p365
12402c2122J0904M525j9939N222J3971J1943J6606J6730j6179l673j632j728r984
12389e356j6905N054J1204l87Q703P237L74j1477m426L867J411j179K669k85L117
12374C621J781m205L535r79j7600J410O53M65K2700k866J57l923r083r342Q544
12359e132J3206J966m449j701j4231p021K2952j90J492p848r302O243m043M813
12345c245m887j147J705L166O539r674m075J5822p199j2947Q986J612j7266J1978
12331a0632M441J0599m360j0562R330M898l623q388j6520o579L326J0478k152
12318a9744O809P381J653k6197n507O360O503K920J4140J5267L28l018o102j5177
$$ plain form
12416 -4658 -20989 -25342 -14679 -19244 -32534 -20588 -21014 -23057 -12660 -11972 -18839 -19941 -24757 -32122
12402 -32122 -21218 -16693 -36632 -31410 -17439 -5496 11110 27840 11661 7988 6356 4628 -5356
12389 -5356 -22261 -17207 -6003 -6390 2313 9550 9924 -1553 -5979 -2112 -701 -1880 789 504 3621
12374 3621 5402 1197 4732 3753 -13847 -12437 -11784 -11319 11381 8515 8672 4749 -4334 -13676 -5132
12359 -5132 8074 10040 5591 3890 -10341 -17362 5590 5400 6892 -956 -10258 -4015 -8058 -3245
12345 -3245 -8132 -9279 -7574 -4408 2131 -7543 -11618 4204 -2995 -15942 -6956 -5344 -22610 -10632
12331 -10632 -6191 4408 48 -10514 -1184 3714 91 -8297 -24817 -31396 -28070 -17592 -19744
12318 -19744 -12935 -5554 -3901 -30098 -35605 -29245 -22742 -19822 -5682 9585 9913 6895 793 -14384
12304a4384m284J0801J598m088j178Q289p14j74K220J168n198j8246K4868K517
12290C195j8033j577J4311N132L565l090m811J1811J0904L096l2896j0689k40
12277a9322M710K12K353J9841O941K355o131p723p777o189M28J5651P49m070J462
12262C490n641M44m768l119Q557j607q478L90K687J293P577J3503o284P28j855
12247F917R614J3911p224j1298j5756L684L084M514r589o485k69q987J2081K913
12233b890j714o264p181K27P284R204J1936p013K479p440j1979n991Q596J0740
12219fJ86j3485O320P349j247j0686P274J6019J2107p318j2860K049k820J097
12205C979l786O630P048K377q408J113j4665o013K63o593P960qK0833p48p411
$$ plain form
12304 -14384 -18668 -7867 -6269 -10357 -11535 -3246 -3960 -4134 -1914 -746 -5944 -24190 678 3195
12290 3195 -14838 -16415 -2104 3028 6593 3503 -1308 10503 21407 24503 -8393 -19082 -19322
12277 -19322 -14612 -14400 -12047 7794 14735 17090 10959 3236 -4541 -10730 -10302 5349 6098 2028 3490
12262 3490 -2151 -1707 -6475 -9594 -1037 -2644 -11122 -10732 -8045 -6752 825 14328 8044 8772 6917
12247 6917 16531 30442 23218 11920 -3836 -152 2932 7446 -2143 -8628 -8897 -17884 -5803 -2890
12233 -2890 -4604 -10868 -18049 -17822 -10538 -1334 10602 3589 6068 -1372 -13351 -19342 -10746 -6
12219 -6 180 -13305 -6985 364 -883 -11569 -4295 11724 23831 16513 3653 5702 2882 3979
12205 3979 193 6823 13871 16248 7840 8953 -5712 -11725 -11462 -18055 -10095 -10103 10730 9982 2571
12190B571p426j9767J7314O779j2038J328R43p519Q680J4247N290k4558q434J0558
12176a2032m635J1092M547P578l988Q788M690r522j8901j0242P286O83K091q063
12162b0628P286p385k803J4526J7284r29k1928J1510J32J674O379l790m352L361
12148C37J741o914j3892k1224n071J4732J3590J2339P084o435j7024n76P437m704
12134a8580K367P669j174K917j3451N943M380j0732n14P647J2726p439j1908n088
12120b5237k529o619o051J0849l486L471J9061l200j230R660n947Q574Q054p129
12106a759J2671j845R254j38j1451j754j6681M004m253l339J5318R428k243p265
12092e3j7849O765O099j5636J100J5979Q985l40j533m757R276M084P357l462p577
$$ plain form
12190 2571 -4855 -24622 -7308 -529 -12567 -11239 -10296 -17815 -9135 5112 10402 -14156 -22590 -12032
12176 -12032 -16667 -5575 -1028 6550 2562 11350 16040 6518 -12383 -22625 -15339 -14656 -12565 -20628
12162 -20628 -13342 -20727 -23530 -9004 8280 7351 -14577 -3067 -2935 -1261 5118 1328 -3024 337
12148 337 2078 -4836 -18728 -39952 -45023 -30291 -16701 -4362 2722 -3713 -20737 -21313 -13876 -18580
12134 -18580 -16213 -8544 -9718 -6801 -20252 -14309 -9929 -20661 -21175 -13528 -802 -8241 -20149 -25237
12120 -25237 -27766 -34385 -40436 -29587 -33073 -29602 -10541 -13741 -14971 -5311 -11258 -2684 5370 -1759
12106 -1759 10912 9067 18321 18183 6732 4978 -11703 -7699 -11952 -15291 27 9455 7212 -53
12092 -53 -17902 -11137 -5038 -20674 -19574 -3595 5390 5050 3517 -1240 8036 12120 19477 16015 8438
12077H438o347o871K318R291N88n502j7516j1616Q188J2206J3627R621L293M57
12063B0175j2029j0688p072q982M693R58P823j5L563l778J669O192J3812m3K153
12048A8431j6951j1180J1789N612L406P140N643K114k232p700K02q660j6583O529
12034b440j1280K28K184O014J3745O225K67p550j1085q734K66K962j1629O053
12020a4774M859J7638J1489n330k860m488j1571Q601P723k2928j0965K997o002
12007b5611j026o9M530K0494K966p18r102r409J608M785M882j774J1116j0047
11993g375n598Q540q412k475m679p096j0306O219J8213N635Q263n092M372J1720
11979A1929N845k64j1033P569J0938j774K913Q931J2622J4347J9069n254k7347
$$ plain form
12077 8438 2091 -4780 -2462 6829 7417 1915 -15601 -27217 -19029 -6823 6804 16425 19718 20175
12063 20175 8146 -2542 -9614 -18596 -13903 -12945 -5122 -5137 -1574 -5352 -3683 2509 16321 16278 18431
12048 18431 1480 -9700 2089 7701 11107 18247 23890 26004 23772 16072 16274 7614 -8969 -2440
12034 -2440 -13720 -13492 -11308 -5294 8451 14676 14943 7393 -3692 -12426 -12160 -9198 -20827 -14774
12020 -14774 -9915 7723 19212 13882 11022 6534 -5037 3564 11287 -11641 -22606 -19609 -25611
12007 -25611 -26637 -26706 -22176 -1682 1284 566 -8536 -17945 -16337 -11552 -6670 -8444 2672 -7375
11993 -7375 -12973 -4433 -12845 -15320 -19999 -27095 -37401 -31182 -12969 -7334 929 -4163 209 11929
11979 11929 17774 17510 6477 14046 24984 23210 26123 35054 47676 62023 81092 75838 48491
11966D8491j2482j007n878k2563j5245J223K223O586J1707J2151q102Q82j1786
11953F200J589J0004k225N60o213p605m970p826j806J0171J346J050K431O471
11939I177k90j3906R200J51p336Q658p357n488o444q962k871R25J2694O607R928
11924D686M837r68l509r051k220K0205O877p82p754n139k2660Q08k076r0Q111
11909h725J5659J1410K261j9725q126q535L609L476J6265j981j5623q994n622
11896b4651o108k30P055r74j399J3445J1609l197J706o80k347q482N293j73j0062
11881a9195N143J2628l091o857j8302J4747J1395K1135m484k5471r623O949J4745
11868b81j20j8310j7500J426R217O501j4859j5028J784N772J5774L081N468R57
$$ plain form
11966 48491 36009 35002 29124 6561 -8684 -7461 -5238 1348 13055 25206 17104 17986 6200
11953 6200 7789 17793 15568 16128 9915 2310 -2660 -10486 -12292 -2121 -775 275 2706 9177
11939 9177 8887 -5019 4181 4332 -3004 5654 -1703 -7191 -13635 -22597 -25468 -24543 -11849 -5242 4686
11924 4686 9523 8555 5046 -4005 -6225 13980 20857 20075 12321 7182 -15478 -14670 -16746 -16836 -8725
11909 -8725 6934 18344 20605 880 -7246 -15781 -12172 -8696 7569 5588 -10035 -19029 -24651
11896 -24651 -30759 -30989 -23934 -24908 -26307 -12862 -1253 -4450 -2744 -3424 -5771 -14253 -8960 -9133 -19195
11881 -19195 -14052 -1424 -4515 -11372 -29674 -14927 -3532 17603 13119 -12352 -21975 -15026 -281
11868 -281 -401 -18711 -36211 -34785 -25568 -19067 -33926 -48954 -47170 -41398 -25624 -22543 -17075 -16118
11854a6118K104K1564J525k7104j1332R155J2664M026J5038O686j4663P620j488
11841I677J3994j536j0467J559k635k946R210j1015j3469J0413L298J0939l619
11828A3403j78n022n057m068j5186k222J1695J0919M020p354J473R316j061k698
11814G980j9579j7679J2244K2937o110j0553j298M247o046J2640J1963j2575n159
11801f988M361l847o050R566P634j3046k288l871j0094O17q17j584j18M673M527
11786a7325Q211J1252m891k102J250j0332m723J37N709J2396O444p079L887N788
11772H622k3803r672M654L086J3013R396R544p130j0226p82n634P662K380Q768
11758I878k925P633O346r956k4166o447M098j089j992l252q51j068m74O712N104
$$ plain form
11854 -16118 -14014 7550 9075 -18029 -29361 -20206 -7542 -3516 11522 18208 3545 11165 9677
11841 9677 23671 22135 11668 13227 10592 7646 16856 5841 -7628 2785 6083 17022 13403
11828 13403 13225 8203 3146 -922 -16108 -18330 -6635 4284 8304 950 2423 11739 10678 7980
11814 7980 -11599 -29278 -17034 5903 -207 -10760 -12058 -7811 -13857 -1217 10746 -1829 -6988
11801 -6988 -2627 -6474 -12524 -2958 4676 -8370 -10658 -14529 -24623 -24006 -24823 -26407 -26525 -21852 -17325
11786 -17325 -9114 2138 -2753 -4855 -3605 -13937 -18660 -18523 -12814 -418 6026 -1053 2834 8622
11772 8622 -15181 -24853 -20199 -17113 -4100 5296 14840 7710 -2516 -3298 -8932 -1270 1110 9878
11758 9878 6953 14586 20932 10976 -13190 -19637 -15539 -16628 -18620 -21872 -22723 -23791 -24265 -17553 -12449
11743a2449j977j784r897L199M4P938J8338M01p50P845r239j4830j0653p299J758
11728b9355M168P604m466J932m884J2670K0855j0009J279l85k751j3161J802J2356
11714b345R70k545n829j103j2400n455M045L691J4316J408j2263O387N319M616
11700a188J0397j1110L412p452p149p05J4327l44j2239O913j5397j207Q41l765
11686b4666J0466N282m215Q134M858N976j552J175j1288p676M031j11m27R060
11672i53O265l061m743K243K591L398q256O365n654Q063j767P239Q025r222p094
11657C439J338K17R023J860j0757k1002J0198J3217J3814m312m263m038r642j514
11643b422q335J35n52o599J2270J2461M84K44q715j4429J3783L438k157K083j9053
$$ plain form
11743 -12449 -14426 -16210 -26107 -22908 -22864 -14926 3412 3813 3063 10908 1669 -13161 -23814 -31113 -29355
11728 -29355 -25187 -17583 -22049 -20117 -25001 -12331 8524 -1485 -206 -591 -3342 -16503 -14701 -2345
11714 -2345 -1375 -3920 -9749 -10852 -23252 -28707 -24662 -20971 -6655 -5247 -17510 -11123 -5804 -1188
11700 -1188 9209 -1901 1511 -5941 -13090 -13795 532 188 -12051 -5138 -20535 -21742 -20901 -24666
11686 -24666 -14200 -8918 -13133 -4999 -141 5835 4283 5458 -5830 -13506 -9475 -9586 -10013 -953
11672 -953 5312 2251 -2492 -249 2342 5740 -2516 3849 -1805 6258 4491 11730 19755 10533 3439
11657 3439 4777 4994 14017 15877 5120 -15882 -5684 7533 21347 17035 12772 8734 -908 -2422
11643 -2422 -10757 -10622 -11174 -17773 -5503 6958 7442 7686 -1029 -15458 -1675 1763 -394 1689 -17364
11628a7364Q421O134k28k645q108j275k380l304K680k278O515k846n340j2271
11614c4289p955P302J7434j1444p116P270k099J8669J3584J0642n237M546K644
11601A3951j8769N327M36j962M617N357j2086o829j2846J1016J0681l039O49k937
11587f434q007O575K593Q020m531n503j3954j0370J1556Q065l15J864L5q646L56
11572a8696J223J1737L102P68R381M442K811j3983m705M060M835o975j2883m194
11558a9077k345j933J5780j0756N573J4526L593J0009o959n592L861O164l100
11545I744j1723N095P071q906j730k630N359K245J16M25j658k073o678K298j560
11530d605k61J0900N80k4706j3035Q899n162J3189J2014m533J3902Q714n581r816
$$ plain form
11628 -17364 -8943 -2809 -3037 -5682 -13790 -15065 -17445 -20749 -18069 -20347 -13832 -16678 -22018 -34289
11614 -34289 -42244 -34942 -17508 -28952 -36068 -28798 -30897 -12228 1356 11998 6761 11307 13951
11601 13951 -4818 509 945 -1017 3600 8957 -3129 -9958 -22804 -11788 -1107 -4146 -3497 -6434
11587 -6434 -14441 -7866 -5273 2747 -1784 -7287 -21241 -31611 -20055 -11990 -12305 -10441 -10406 -19052 -18696
11572 -18696 -17473 -5736 -2634 -1866 7515 11957 14768 785 -3920 140 4975 -2000 -14883 -19077
11558 -19077 -21422 -23355 -7575 -18331 -12758 1768 5361 15370 8411 2819 6680 12844 9744
11545 9744 -1979 3116 10187 1281 -449 -3079 2280 4525 4641 5066 3408 1335 -5343 -3045 -4605
11530 -4605 -4866 6034 6614 -18092 -31127 -22228 -27390 -14201 -2187 -6720 7182 15896 10315 499
11516D99m615M640r135j996Q56n171j3227M613o309p1Q410J3802O701P856j7878
11501a1025j0953J0933M965l528O156R358j2465n526l893J2824p65q540L98l227
11487a5288J285J9676K1153K873j6951j3216q86L954L694M671j4462j0814J5199
11474H88K2727L383o921j5053q283M566j348J5764l72O730M625J206o081j3570
11460H261j1970l861O918Q625J3794o324q111l548j762j778l35k0755p93J4843
11446f796R681p26j1879J4001p779j6054N989l906p89N245l125J0028m759j8979
11432b9848n04R862O210Q182K904O505n757j2924k053J1918J1045Q703p723m411
11418B109j0881p76M202P88L657m900O689k8j574m535m719L218M365P59Q85R054
$$ plain form
11516 499 -4116 524 -8611 -10607 -9751 -14922 -28149 -23536 -29845 -29916 -21506 -7704 -1003 6853 -11025
11501 -11025 -21978 -11045 -6080 -9608 -3452 5906 -6559 -12085 -15978 -3154 -3919 -12459 -12061 -15288
11487 -15288 -14003 5673 26826 29699 12748 -468 -1354 2600 6294 10965 -3497 -14311 888
11474 888 23615 26998 20077 5024 -3259 1307 -41 15723 15351 22081 26706 27912 21831 8261
11460 8261 -3709 -7570 -652 7973 21767 15443 7332 3784 2022 244 -91 -20846 -21639 -6796
11446 -6796 2885 2159 -9720 4281 -3498 -19552 -13563 -17469 -18258 -13013 -16138 -6110 -10869 -29848
11432 -29848 -30352 -20490 -14280 -6098 -3194 3311 -2446 -15370 -17423 -5505 5540 14243 6520 2109
11418 2109 -8772 -9548 -5346 -4558 -901 -5801 888 860 -714 -5249 -9968 -6750 -2385 -1626 -741 8313
11402H313K919j2784k0727N154K0376p99n455J694N321K324m650O619Q568q214
11388H659j4435r739R813k336k2306P180P235J2022J117l464J7817J0847j9845
11375B565k4864l310J4351r059k27P157o348L357K950j3819J8036K6577o875O648
11361A7139l152j5930m14J2749L309j0020J047j6805r435k553R110J138l603j1876
11347b9296M122m366K0621o885m814L440N877J0085J3334L136j1246j0648k376
11334i016K193L766J2151J3990j1991q244L412Q152J1883R710r088p046l775q187
11320G910k069m775j0033l915p92j75L09j4103j161J1453L490r651P002Q503M238
11305c769j0680p610N871J1199M573o416l620r742O213J0755M987J707L522M34
$$ plain form
11402 8313 11232 -1552 -22279 -17125 3251 2452 -3003 -1309 4012 6336 1686 8305 16873 8659
11388 8659 -5776 -15515 -5702 -8038 -30344 -23164 -15929 -3907 -2790 -6254 11563 22410 2565
11375 2565 -22299 -25609 -11258 -20317 -20544 -13387 -19735 -16378 -13428 -27247 -9211 17366 10491 17139
11361 17139 13987 -1943 -2357 10392 13701 3681 4728 -12077 -21512 -24065 -14955 -13817 -17420 -29296
11347 -29296 -25174 -29540 -8919 -15804 -20618 -17178 -11301 -1216 12118 15254 4008 -6640 -9016
11334 -9016 -6823 -3057 9094 23084 11093 2849 6261 14413 26296 36006 26918 19872 16097 7910
11320 7910 5841 1066 -8967 -12882 -13674 -13849 -13540 -27643 -28804 -17351 -13861 -23512 -16510 -8007 -3769
11305 -3769 -14449 -22059 -16188 -4989 -416 -6832 -10452 -20194 -13981 -3226 1761 3468 6990 7424
11291G424Q122M857O540J11k2911r362P408J4929j867p574L039P833j3585r013
11277d049k00Q841j747l739k864p742M814L775L528m306j934J1895O956n698q106
11262e76j3361k423q823k926N710L374L282J1219J0253Q783J2073K656j0681j5363
11248C197l581J506Q174M838K5138J2726k3281j1680r25M900n999j5732M075Q372
11234A1728k619k2232j3291J3090l249j283O221j041M260P70J653L520m411J5858
11220H974J5727j7489P63N26k544n954p555k764J0159K2684O115j674M61j4373
11206A3056k852j539q079k936j932J0238N00P303p695k972n373Q988P538O557
11192B0802q845p617l093q690L941M501j098q66K514Q487m270J891N994j2978
$$ plain form
11291 7424 15546 20403 26943 27054 4143 -5219 2189 17118 15251 7677 10716 18549 4964 -4049
11277 -4049 -4249 4592 2845 -894 -3758 -11500 -6686 -2911 617 -3689 -5623 6272 13228 7530 -576
11262 -576 -13937 -16360 -25183 -28109 -22399 -19025 -15743 -4524 5729 14512 26585 29241 18560 3197
11248 3197 -384 1122 9296 14134 39272 51998 28717 17037 16112 21012 15013 -719 3356 11728
11234 11728 9109 -13123 -26414 -13324 -16573 -17856 -11635 -12676 -8416 -7646 -5993 -2473 -6884 8974
11220 8974 24701 7212 7975 8501 5957 3 -7552 -10316 -157 22527 28642 26968 27429 13056
11206 13056 10204 8665 586 -2350 -4282 5956 6456 13759 6064 3092 -2281 6707 14245 20802
11192 20802 11957 4340 1247 -7443 -3502 999 -99 -965 1549 10036 5766 7657 13651 673
11178F73j666K27L191m429P192R569q069l845n784q79O552Q17k146q182P903J2613
11162A3737J0289l209R65K3403M840j3943k7957k0949q83J994m302R032Q52m873
11148a1004j2374K703J2333k08M408M154j6845l92Q631j429n684m000M75N599
11134a3633J1633j21J115M08o63o551J3167j332K777N955M916j4569m179p012
11120h089q885o345J478O318J1944L888p576O338K879N165J682O94p969r438o585
11105a4501Q026J6390J111o61j9639j0277j165n903j1922R771J9225r63l057R538
11091d027k358L205O192L615J5121J0742j3044L892J399n396P970L446j2049n982
11077A2726J344o147r599j0558J105K917o303M639R082q376p741L693J1181k1
$$ plain form
11178 673 -993 -766 2425 -2004 5188 14757 6688 2843 -2941 -3820 2732 3549 1403 -6779 1124 13737
11162 13737 24026 20817 21782 45185 50025 36082 8125 -12824 -13707 -11713 -16015 -6983 -6131 -11004
11148 -11004 -23378 -20675 -8342 -8550 -4142 12 -16833 -17225 -8594 -10023 -15707 -19707 -19232 -13633
11134 -13633 -2000 -2121 -1006 -598 -1261 -7812 5355 4023 6800 12755 17671 3102 -1077 -8089
11120 -8089 -16974 -23319 -21841 -15523 -3579 309 -7267 -929 1950 7115 8797 9491 1522 -7916 -14501
11105 -14501 -6475 9915 11026 10365 -9274 -19551 -20716 -26619 -38541 -28770 -9545 -10508 -13565 -4027
11091 -4027 -6385 -3180 3012 6627 21748 32490 19446 23338 24737 19341 27311 30757 18708 12726
11077 12726 14070 7923 -1676 -12234 -11129 -8212 -14515 -9876 -794 -9170 -16911 -13218 -2037 -2058
11063b058m117l449J6337M09j8656o219O424Q033J833q68J4231J3804l271j1713
11049A0720k986N168M593r83n791j6311k36J0134J904j295L790m227j338k982
11035A60l349R196J5354R246K081L133j1371j8229j6682O359K0953N773r817r206
11021C601l209l620O370k297j3772o879K2795J2497o447j2738p733m447J3401
11008b478Q684J844k432K466O429o995n845n270p253R543K300n610n696m927J540
10993a3700L914l94O344l195r723p31J005J6878j1015P89R715J8290Q85j7822
10979A240K722J0053P521p75p071L445k0222j4518L194Q359J1165R414J167m74
10965A5220j919k3459j734P094J0916J3128P522N860j1332r502O680j1081q404
$$ plain form
11063 -2058 -6175 -9624 6713 7122 -11534 -17753 -11329 -3296 -1463 -2331 11900 25704 22433 10720
11049 10720 7734 12902 17495 16512 10721 -5590 -5826 4308 6212 4917 8707 4480 3142 160
11035 160 -3189 6007 21361 30607 32688 35821 24450 6221 -10461 -4102 16851 22624 12807 3601
11021 3601 392 -3228 3142 845 -12927 -19806 2989 15486 9039 -3699 -11432 -15879 -2478
11008 -2478 6206 8050 5618 8084 14513 7518 1673 -3597 -10850 -1307 993 -4617 -10313 -15240 -13700
10993 -13700 -9786 -10180 -3836 -7031 -16754 -17485 -16480 398 -10617 -9828 -113 18177 19062 1240
10979 1240 3962 14015 21536 20761 13690 17135 -3087 -17605 -14411 -6052 5113 14527 15694 15220
10965 15220 13301 -10158 -11892 -4798 6118 19246 26768 32628 21296 11794 18474 7393 -1011
10952a011M947N495R21n150N621q59j3777J0851P511j4221n193J854m596J8169
10938A0562L742r640Q78p133j833l227L632k613R580K893N775K030k745j2598
10924f97m652l860N599j00P808J0047r724n785N606n004L572L979q240P185m231
10909A503r397L587J0202m865j357J729j38j095k674R581J617j3645j238N540
10895f50n700j724R482O284k057l848L608l32J3043n416l409p458m580J3781J5719
10880B6743M304j3255j2301J8390j4242j7031q154j15O750r436l932Q77R087j0497
10866b2812R778P454j23L569p365J7771N744o544Q626J0651n014Q451P697k1426
10852A6457J670J0030q585p996M28J464K140m600m112J1155n584J36R421j710
$$ plain form
10952 -1011 3936 9431 10352 5202 10823 9964 -3813 7038 14549 328 -4865 -3011 -7607 10562
10938 10562 14304 4664 5542 -1591 -3424 -6651 -3019 -5632 3948 6841 12616 14646 11901 -697
10924 -697 -5349 -9209 -3610 -3710 4098 14145 4421 -1364 4242 -762 2810 6789 -1451 5734 1503
10909 1503 -7894 -4307 5895 1030 -327 1402 1264 169 -2505 7076 8693 -4952 -6190 -650
10895 -650 -6350 -8074 1408 7692 5635 1787 5395 5063 18106 12690 9281 1823 -2757 11024 26743
10880 26743 31047 17792 5491 23881 9639 -7392 -15546 -15661 -8911 -18347 -22279 -21402 -12315 -22812
10866 -22812 -13034 -5580 -5703 -2134 -9499 8272 14016 7472 16098 26749 21735 30186 37883 16457
10852 16457 18127 28157 19572 11576 12004 13468 15608 11008 6896 18051 12467 12603 22024 20314
10838B0314j391m274j5703m281K7222n952k1428j7555M721J5688R911J2683k928
10825A7027o316J3010K446k223q539k208J066N643m386L465o911j8845l800Q519
10811b052J4943O736R87j6442J6178J5174p883o245p012p010q773q412N925J0522
10797F636J1960J3688O984q646r782N28p94j093j1907J1526K063k213n179k498
10783A1273o161J0413l643P721J1390L038p99j4742j2743J151P702J0985J4406
10770C9991o284j1441j738j2355j3309o410j171K272P936o845J5024J4000j3863
10757E807m13J2467k433O566R115l274p356j0657l743M735N863N287M158J0408
10743C6530q62L975J0739m276p543O252N390K695k8639n450l94P099o011M558
$$ plain form
10838 20314 18923 14649 -1054 -5335 21887 15935 -5493 -23048 -18327 -2639 7272 19955 17027
10825 17027 10711 23721 26167 23944 15405 13197 14263 19906 15520 18985 12074 -6771 -10571 -2052
10811 -2052 12891 19627 20614 4172 20350 35524 27641 21396 14384 7374 -1399 -9811 -3886 6636
10797 6636 18596 32284 39268 30622 20840 21368 20574 19481 7574 19100 21163 18950 13771 11273
10783 11273 5112 15525 11882 19603 30993 34031 33232 18490 5747 6898 14600 25585 39991
10770 39991 33707 22266 20528 8173 -5136 -11546 -12717 -10445 -2509 -9354 5670 19670 5807
10757 5807 5394 17861 15428 21994 31109 27835 20479 9822 6079 10814 16677 21964 26122 36530
10743 36530 35668 39643 50382 46106 38563 44815 50205 52900 24261 18811 18417 25516 19505 24063
10729B4063O546j0949m025m072k904J0847m115Q801J6718J833J253q556n587j6858
10715A2995q175p708Q201J8104J6577r942j0823K553Q425k209N982K380j320n429
10701B9611o423M074K874j268R081O704l929j6376p932k55N504J604p85L554j0900
10686A5138M680R612L048L579J211j1388l27J9001P492j1816p817L664j310j935
10672C2832n535q363n315j4588L153R578N96K1361L457M291k334m952j5220q490
10658A0471j0272j380R667M841J036K21N281j80J867m058j965o738k600R628j046
10643A4773r174j4121j887K1432J8894j454k159n041K060Q630j0052o74K1052
10630D2279J4298j2810k2018J155J4500N659k508L410j0097k691j4779L825j0303
$$ plain form
10729 24063 30609 19660 15635 11563 8659 19506 15391 24192 40910 42743 43996 35440 29853 12995
10715 12995 4820 -2888 5313 23417 39994 30052 19229 21782 30207 27998 33980 36360 35040 29611
10701 29611 23188 27262 30136 28868 37949 44653 40724 24348 16416 16161 21665 23269 22484 26038 15138
10686 15138 19818 29430 32478 36057 37268 25880 25553 44554 52046 40230 32413 36077 34767 32832
10672 32832 27297 18934 13619 -969 2184 11762 12358 33719 37176 41467 39133 34181 18961 10471
10658 10471 199 -1181 8486 13327 14363 14584 19865 19685 21552 17494 15529 8791 6191 15819 14773
10643 14773 5599 -8522 -10409 11023 29917 28463 26304 21263 23323 31953 21901 21227 42279
10630 42279 56577 43767 21749 22904 37404 43063 40555 43965 33868 31177 16398 20223 9920
10617I920o790J4256K7584J2786R099J1357K1077J5284l603L355k7111k9379J768
10604E9603K959p767l39o257k0739k4315N967J0444L20n114J203j166J180l229
10590A2750Q282J2506l230N638J4039J500j3418j0072q34p625o66q858j422P655
10576A6245m442J3754M909o763N611J2412J770l815J2625M749j3481J0107J5463
10563F9144Q502J936K314n62k686n293k952j6749j0548o475q835j1100p91M891
10549B0796j623R87p902P11p567L351o301R451J9338p413p929p644k516o380M461
10534C820P907K009j004n072N205M966J0275L290P12L161j2011P67K8684R052
10520F1761j1161p610P609J0958k663O338K131L352n785j9599m36J1231n38j9521
$$ plain form
10617 9920 3130 17386 44970 57756 66855 78212 99289 114573 110970 114325 87214 57835 59603
10604 59603 62562 54795 54456 48199 27460 3145 9112 19556 19876 14762 15965 14799 15979 12750
10590 12750 21032 33538 30308 35946 49985 51485 38067 27995 27161 19536 18870 10012 8590 16245
10576 16245 11803 25557 30466 23703 29314 41726 43496 39681 52306 57055 43574 53681 69144
10563 69144 77646 79582 81896 81334 78648 73355 70403 53654 43106 36631 27796 16696 15905 20796
10549 20796 19173 20160 12258 12969 5402 8753 2452 11903 31241 23828 15899 8255 5739 -641 3820
10534 3820 11727 13736 12732 7660 12865 17831 28106 31396 32108 35269 23258 24025 52709 61761
10520 61761 50600 42990 50599 61557 58894 65232 67363 70715 64930 45331 44895 56126 55588 36067
10506C6067p101l621p98J0593K847K41j437O543k689j0825q180J868Q657K8009
10492F0174J6179j250j479K237L188O695J6466k115J0051J2068k022O188K0122
10479A46502L2601J5213K2364L0964M6956M3147M3456P6318J48826K40948K84581
10468A131876J48108K9795J22982J92733J00308J4488j03883j36456k5539k1155
10458A453257j96935k80296k07698j40082j02413q2519n1333n1046l9449k1164
10448B80322l0778k0800m874p690n215K862j940p056j2264n448n026k2712j8281
10435A41100j1508k952j353p751O368n007L255J1569j9302j9635L040l141l717
10422I0966N577j317J2871j316k968j1414q376n204m868r146p760k219J2453M159
$$ plain form
10506 36067 28966 25345 24547 35140 37987 38228 36791 43334 40645 29820 21640 23508 32165 60174
10492 60174 76353 75103 73624 75861 79049 85744 102210 100095 110146 122214 120192 126380 146502
10479 146502 179103 194316 216680 247644 294600 337747 381203 457521 606347 847295 1131876
10468 1131876 1279984 1309779 1432761 1625494 1725802 1740290 1636407 1499951 1474412 1453257
10458 1453257 1256322 976026 768328 628246 525833 443314 391981 340935 301486 280322
10448 280322 249544 228744 223870 216180 210965 213827 211887 204831 192567 187119 182093 159381 141100
10435 141100 129592 126640 125287 117536 123904 118897 122152 133721 114419 94784 97824 94683 90966
10422 90966 96543 95226 108097 106781 103813 92399 84023 78819 73951 64805 57045 54826 67279 71438
10408G1438K095O032o333j8017j5389p117l704J2647J0446m903r80J759j224o324
10394D0426l587k165j938o8j8397k3611l118m818Q881k061k1852k2180j3122j5226
10380h2836j2334j9023k7368n8206p4166m2325r419k0870J759K4875J4168J2522
10368b93223N2740L8775J2592P2950J05320R6744Q5878P6982Q3057Q5139J01678
10357E18632O3986L1488K9727J5888n250k7428n2016n0857n5281o7514o3721n0714
10345B86940l8447k8476j4504Q496k903j2722o74O689R769j6100q629r344j1507
10332A68588j2045m513J919L099J6980N633l948J1236K8199M2430M6659K2512
10320C26749J5680J8736K0673J6465J3908R136j0624J335j1294m4229n5721n2293
$$ plain form
10408 71438 73533 79565 73232 55215 39826 32709 29005 41652 52098 47195 46215 47974 46750 40426
10394 40426 36839 34674 32736 32668 14271 -9340 -12458 -17276 -8395 -10456 -32308 -54488 -67610 -82836
10380 -82836 -95170 -114193 -141561 -199767 -273933 -316258 -325677 -346547 -344788 -319913 -305745 -293223
10368 -293223 -240483 -201708 -189116 -116166 -10846 85898 171776 248758 331815 416954 518632
10357 518632 582618 614106 643833 659721 654471 627043 575027 524170 468889 401375 337654 286940
10345 286940 248493 220017 205513 214009 211106 198384 197710 204399 214168 198068 189439 180095 168588
10332 168588 156543 152030 153949 157048 174028 179661 175713 186949 215148 257578 304237 326749
10320 326749 342429 361165 381838 398303 412211 421347 410723 412058 400764 356535 300814 248521
10308B48521l5518k7588j2581j3220q835j3194m22O671r465K483l918k245j3714
10295A16975j4994j7568K066J573j423J6299j2805j0434L652n27q24J209L692
10282H6891P394k571O366R637J9243K665J3643K5630K6928K7641J6984J5859K28
10269B56538J692n841o880O173n51o402j9490l7071k8386l0032j7173J387L3645
10256A47609K0634n698O165m887N410J3477J953Q30r335J87j2079j3926j0827
10243A39513j015m374m64O993J8542R596M133J4880j548o130O085J2698N727n991
10229A98645J668P230Q497J7393K2089K6388M0242M9049J6783j9373O219N082
10217C79912j9397m96Q653k1203j6339M95l7405n0045j8865o593K262r821l558
$$ plain form
10308 248521 213003 185415 172834 159614 150779 137585 137163 143834 134369 136852 132934 130689 116975
10295 116975 101981 84413 86479 88052 86629 102928 90123 79689 83341 82814 81990 83199 86891
10282 86891 94285 91714 98080 107717 126960 129625 143268 168898 195826 223467 240451 256310 256538
10269 256538 258230 252389 245509 251682 251131 244729 225239 188168 159782 129750 112577 113964 147609
10256 147609 168243 162545 168710 163823 169233 182710 184663 185493 176158 176345 164266 150340 139513
10243 139513 138498 134124 133660 140653 159195 168791 172924 187804 186256 180126 186211 198909 204636 198645
10229 198645 200313 207543 216040 233433 255522 281910 322152 371201 387984 368611 374830 379912
10217 379912 360515 360019 368672 347469 331130 331625 294220 244175 225310 218717 220979 211158 207600
10204B07600O407O004L211N091r31l221M791m767q958L1155N9254M5434K0044
10191C71114M0996M5561R175K4117M0176L69J2465L2125R27j3264j8708j8834
10179E26219j4496k8947k2791n998k3995k2176k8853K289R722J4251N064R436
10167D19725K283J116P12K168N271Q663J3392l522J2727J1999N415L884j991o397
10153D75445r309j240P164J393r764M557L4961K7655P027R424R346J2607O400
10140E75666K6729M0447Q833J9285L9259K7036K8307M7776K9226K9195J9748K5727
10128I17234K5805L8529L6587L6207K4152J3473J3923J1319L3591O2080L5048
10117A247948L3166L2892K2625L563L97l433M137L2546L8049L7136L1112M0100
$$ plain form
10204 207600 214007 220011 223222 228313 227382 224161 228952 224185 215227 246382 305636 351070 371114
10191 371114 412110 457671 466846 490963 531139 531508 543973 576098 577025 563761 545053 526219
10179 526219 511723 482776 459985 453987 429992 407816 378963 381252 390974 405225 410289 419725
10167 419725 422008 423124 423836 426004 431275 439938 453330 449808 462535 474534 479949 483833 481842 475445
10153 475445 466136 464896 472060 473453 463689 468246 503207 530862 537889 547313 556659 569266 575666
10140 575666 602395 642842 651675 670960 710219 737255 765562 813338 842564 871759 891507 917234
10128 917234 943039 981568 1018155 1054362 1078514 1091987 1105910 1117229 1150820 1212900 1247948
10117 1247948 1281114 1314006 1336631 1340194 1340591 1337158 1341295 1373841 1411890 1449026 1480138 1520238
10105A520238O9443P3666R5892J03704J31428J46089J43510J46777J74624K09481
10095B814852K18773K78089L16629L37267M13822N39796P04516R74245J158525
10086G756514R82915J030388J315093J448729J747177K100939K287112K625499
10078B1294366K978858L166119L551696M546643N972388Q055021J1390519J6953354
10070G7908964K7155267M3967847N4748627L1862896Q584719K0601629J6828665
10063B81658614j499480P088505P543044j5018613r766108j986538l3589209n1694565
10055A82735650l8370595k7522263k1765935j5982191j1196327q155465o038909
10048E3703965m420635l482865l042380k750850k466125k383682k148186j587400
$$ plain form
10105 1520238 1589681 1663347 1759239 1862943 1994371 2140460 2283970 2430747 2605371 2814852
10095 2814852 3033625 3311714 3628343 3965610 4379432 4919228 5623744 6597989 7756514
10086 7756514 8739429 9769817 11084910 12533639 14280816 16381755 18668867 21294366
10078 21294366 24273224 27439343 30991039 35537682 41510070 49565091 60955610 77908964
10070 77908964 105064231 149032078 203780705 235643601 244228320 264829949 281658614
10063 281658614 280159134 287247639 294790683 279772070 270005962 268019424 234430215 182735650
10055 182735650 144365055 116842792 95076857 79094666 67898339 59742874 53703965
10048 53703965 49283330 45800465 42758085 40007235 37541110 35157428 33009242 31421842
10040C1421842j338211j434373j369701j386006j523503j455276j252203j105525
10032B0557044r87155q73575p91847p37129o95195o63528o27002n94892n62925
10023A4023796n36437n25317n09857m88479m47073m25150m02721l97963l74893
10014I915906l58249l47817l44973l29488k99291k95027k83195k72611k58405
10005G126850k49104k33155k47155k12233k01297j91955j74084j64124j58903
9996E294840j48426j26630j20769j23885j12364q4841r0034j05173j09207j09244
9986D164267p4776p4989o5145o9362p9238p7459p7994p2590p0319q3265o7087
9975C352043o4611q0996p0851o6789o8895o7998n5653o0714n8225m8541n1502
$$ plain form
10040 31421842 30083631 28649258 27279557 25893551 24370048 22914772 21662569 20557044
10032 20557044 19569889 18696314 17904467 17167338 16472143 15808615 15181613 14586721 14023796
10023 14023796 13487359 12962042 12452185 11963706 11516633 11091483 10688762 10290799 9915906
10014 9915906 9557657 9209840 8864867 8535379 8236088 7941061 7657866 7385255 7126850
10005 7126850 6877746 6644591 6397436 6185203 5983906 5791951 5617867 5453743 5294840
9996 5294840 5146414 5019784 4899015 4775130 4662766 4577925 4487891 4382718 4273511 4164267
9986 4164267 4089491 4014502 3949357 3879995 3800757 3723298 3645304 3572714 3502395 3419130 3352043
9975 3352043 3287432 3206436 3135585 3068796 2999901 2931903 2876250 2815536 2757311 2708770 2657268
9964B657268m6561n2761n5387n2458n8470m8692m4302n3192o1111m7954m9486
9953B086894m1094m2339m7758p1628p0509n5347o5643m8600m8167o0658l6323
9942A498828k8513l4483q071q255j9266R459M657j7423j775J2658j3050k0752
9930A374014o763j6484k6513l6365m0682l4789k9309n6093m7382k0413k8350l2027
9918I98844l0571l3912k6176n4033o6463n0346j9499l5570k9855j2387l2040l5394
9906E72598r957j4684m2889K578L5488J0482K0570L1537K2582J8907K2375Q706
9894F78293k5126l4839l6325q498o498r872q383n872K503L673j3179j8943j5874
9881E01060j983j1789j4538q843l3835m2297j4045K91l013k7346j4701J0291J6786
$$ plain form
9964 2657268 2610707 2557946 2502559 2450101 2391631 2342939 2298637 2245445 2184334 2136380 2086894
9953 2086894 2045800 2003461 1955703 1884075 1813566 1758219 1692576 1643976 1595809 1535151 1498828
9942 1498828 1470315 1435832 1427761 1419506 1400240 1409699 1414356 1396933 1395158 1407816 1394766 1374014
9930 1374014 1367251 1350767 1324254 1287889 1247207 1212418 1183109 1127016 1079634 1059221 1030871 998844
9918 998844 968273 934361 908185 854152 787689 737343 717844 682274 652419 640032 607992 572598
9906 572598 562641 547957 505068 507646 543134 553616 574186 605723 628305 647212 669587 678293
9894 678293 653167 618328 582003 573505 567007 557135 548752 542880 545383 549056 535877 516934 501060
9881 501060 499077 487288 472750 463907 430072 387775 373730 374021 371008 343662 328961 339252 356038
9868C56038P232J8562R884q356j6889K904l6060m5142j8378j5302j3672J80j5282
9855B25719L203K5621j4065j8821l22o398j6143j570K142J413k867J2539j2865
9842A97586J2664j482r007K496K490o237o902p582j3911j7398j7035n037M971
9829A35616J1215j501j6057m420m075K073J8169L544q030q898p269j8315J910
9816A03962R272j1347l561o052P900J290M048J8019L944R93J9891k150j7599r03
9802A27707k10q894j0308j8520n200n134l212j1464L710j3764j2020q152q729
9789B5810L091J5411k799j2305j2592j670M327l371n964M630R015J2069K2267
9776E7919J2463k359j3282p121Q33M811R855o453j1843j0004K887J4179K4445
$$ plain form
9868 356038 363270 381832 391716 383360 366471 369375 333315 288173 269795 254493 240821 241001 225719
9855 225719 228922 254543 240478 221657 221335 214937 198794 197224 199366 200779 197912 210451 197586
9842 197586 210250 208768 199761 202257 204747 198510 191608 184026 170115 152717 135682 130645 135616
9829 135616 146831 145330 129273 124853 120778 122851 141020 144564 136534 127636 120367 102052 103962
9816 103962 113234 101887 98326 92274 100174 101464 105512 123531 127475 128468 148359 146209 128610 127707
9802 127707 127497 118603 108295 89775 84575 79441 76229 64765 68475 54711 42691 34539 25810
9789 25810 28901 44312 41513 29208 16616 14946 19273 15902 9938 14568 23583 35652 57919
9776 57919 70382 68023 54741 47620 48453 53264 63119 56666 44823 34819 37706 51885 76330
9763G6330K7757L8103P2428Q9398L0908J7744N0844L5372k849J6645K2310j8685
9751D56305j02J1494n3374o7820n1134m0588k5315k4234j0569J998k4444j2202
9739A60015L342j1727j1983M648M440o336j7139n854j2222r416J1478N784n318
9726A09712J421R88j3362R563k84o236k551r820k0941q845N275N414J242r66m770
9711F5840N845N636o781k426P83M385m443j3751k586J3501J0523K77q150O036
9697G4689p397N954N256L711r247j274j560m652K223m00p366o114O368j606P27
9682E9312J9051J3587N77N16J015J1196L664N322J1960J5307J2586J836J6845
9669A72774K2782K9470L2722M0667P3584J10617J60775K77971L02355J46421P8638
$$ plain form
9763 76330 104087 142190 214618 304016 334924 352668 403512 438884 436035 452680 474990 456305
9751 456305 456203 467697 414323 346503 295369 254781 229466 205232 194663 196661 172217 160015
9739 160015 163357 151630 139647 144295 148735 142399 125260 119406 107184 97768 109246 115030 109712
9726 109712 111133 112121 98759 108322 108038 101802 99251 89431 68490 59645 64920 70334 71576 70610 65840
9711 65840 71685 77321 70540 68114 68897 73282 68839 55088 52502 66003 76526 76803 68653 74689
9697 74689 67292 73246 78502 82213 72966 71692 70132 65480 67703 67303 59937 53823 60191 58585 59312
9682 59312 78363 91950 92527 93043 94058 105254 108918 114240 126200 141507 154093 155929 172774
9669 172774 195556 225026 257748 298415 371999 482616 643391 921362 1223717 1370138 1448776
9658A448776R2104l9747o9652P9703J00511l2963l2084n5372k48625k72535j84330
9647G85786j55968j16372p5662o3540m6048j6891k6981k6681k9197k7013l981
9636A97452p54j9897j4444k413l358k657O51K80j7529k2920q329P93J4341K2516
9622A43732o269k1210j3738K231K061j1648l785j4506J302J2420j5811j7977K368
9609E9170J0342k6076j7872N25R76O383J1237l981J8284J9697M551q722p994j3915
9595E2605j197O255j809j309M201j5401j1336P456K6765J8305j3187q448j5076
9582D7824Q41J318j3077j3852J0575m883O459J7231N220k4353qJ6274R074Q77
9568E9520o815L853l321o571R62j215j2300J1470J7506M749k798p568j1118o671
$$ plain form
9658 1448776 1540880 1501133 1431481 1511184 1611695 1578732 1546648 1491276 1242651 970116 785786
9647 785786 629818 513446 437784 374244 328196 311305 284324 257643 228446 201433 197452
9636 197452 196698 176801 162357 159944 156586 153929 154580 154860 137331 114411 106082 106875 121216 143732
9622 143732 137463 116253 102515 104746 106807 95159 91374 76868 78170 90590 74779 56802 59170
9609 59170 69512 43436 25564 26089 27065 33448 44685 40704 58988 78685 83236 74514 66520 52605
9595 52605 51408 57663 55854 54545 58746 43345 32009 39465 66230 84535 71348 62900 47824
9582 47824 48665 49983 36906 23054 33629 28746 35205 52436 57656 33303 33295 49569 58643 59520
9568 59520 52705 56558 53237 46666 47628 46413 34113 45583 63089 67838 65040 57472 46354 39683
9554C9683J743K371r917k236q049M818j3387q949j243J2432J6622J2184l165k69
9540D2638m232q706o776N486J4741K259M565j7455r481K166l729j098P501n165
9526B2714O820j097j289K864R580J7118l287o556j9121r568P422R475m606j3441
9512A7028N379J4032l722o940O11J22N071L712j0075J782L946L438J360j139j0086
9497B4519N6m245j4524L62L071l024l646J712l594Q126o922k4127J8395J2697
9483H856j4519O842P511l360M307J5316Q578o604r312q901J4426N490L312P655
9469C9597K101k476j1195m496n977K333J3157o892j6145k619q61J1410O615j706
9455B2846p51N444O230J607j4270o436L530N136O690N129o124j7579N593P576
$$ plain form
9554 39683 41426 43797 33880 31644 23595 28413 15026 6077 4834 17266 33888 46072 42907 42638
9540 42638 38406 29700 22924 28410 43151 45410 49975 32520 23039 25205 21476 20378 27879 22714
9526 22714 29534 28437 27148 30012 39592 56710 53423 46867 27746 18178 25600 35075 30469 17028
9512 17028 22407 36439 32717 25777 26388 26510 31581 35293 25218 27000 30946 34384 35744 34605 24519
9497 24519 24575 20330 5806 6168 9239 6215 2569 4281 687 8813 1891 -22236 -3841 8856
9483 8856 -5663 1179 8690 5330 9637 24953 33531 26927 17615 8714 23140 28630 31942 39597
9469 39597 41698 39222 28027 23531 17554 19887 33044 26152 10007 7388 6527 17937 24552 22846
9455 22846 22095 27539 33769 35376 21106 14670 18200 23336 30026 35155 29031 11452 17045 24621
9441B4621J0958P263n025J87K515p420j8724p310J7897M992P582P073l966j0171
9427C0472q964K854q733R585J376k1017p335J4241N971J6246m034j2975J7753
9414C5440r88J626L602j2446J972J3018R316o736j8780k493M627j0708K137o710
9400A2877m143N85q154p440R271k156M23N613J2064R205J508j8607k6045J2067
9386b932J1995J1607P36r659k495L886k808p414k2386p292K2837K2992J5487o248
9372B8306j3804m509J0053j19j9428n704J3976j2951J403J9117J5794K188j3220
9359B1102m091Q077Q19r744N667N309p444j3556l511P709j896O218M681P456o256
9344B0540j8536k829J3764K458k1674j133J7182K0435M382l684l00q098j3111
$$ plain form
9441 24621 35579 42842 37817 38004 40519 33099 14375 7065 24962 29954 37536 44609 40643 30472
9427 30472 21508 24362 15629 25214 26590 5573 -1762 12479 18450 34696 30662 17687 35440
9414 35440 34452 36078 39680 27234 29206 42224 51540 44804 26024 23531 28158 17450 19587 12877
9400 12877 8734 9319 1165 -6275 2996 840 1263 6876 18940 28145 29653 11046 -14999 -2932
9386 -2932 9063 20670 21406 11747 9252 13138 10330 2916 -19470 -26762 -3925 19067 34554 28306
9372 28306 14502 9993 20046 19927 499 -5205 8771 -4180 -2777 16340 32134 34322 21102
9359 21102 17011 25088 25907 16163 21830 27139 19695 6139 2628 10337 8441 14659 19340 26796 20540
9344 20540 2004 -825 12939 15397 -6277 -7410 9772 30207 34589 30905 30605 22507 9396
9331I396R602N486k860M717o005q828k32l597J3994R71j194m13J0369m869j0563
9316A5974O482N543k684r225n966P814J2208P139j6628j3336J8506L365j5080
9303A4112o91K616q314j4707k54L705j340r34j4057J36P651J0768N690P195Q02
9288A2378j0685j715J1587p558j7043J326J3390J5258n250n718k741o932M995
9275A292j979p438L626J9010O002n870K636q813r138j097J3916J7223K151q656
9261B2865k2145j2636M916L826P599j9621M481J1474J366L283J1594j0363N77
9248G216R117l900m627L09j4839J2347P687q530l313K659j997Q005O278P58L431
9233B0601J0963P955m034j8830o868R357R537r662p939j320L928L709K43n92J5826
$$ plain form
9331 9396 18998 24484 21624 26341 20336 11508 11276 7679 21673 22644 21450 21037 31406 26537 15974
9316 15974 22456 27999 25315 16090 10124 17938 30146 37285 20657 7321 25827 29192 14112
9303 14112 13421 16037 7723 -6984 -7238 -3533 -4873 -5807 -19864 -19728 -12077 -1309 4381 11576 12378
9288 12378 1693 -22 11565 4007 -13036 -11710 1680 16938 11688 5970 3229 -3703 1292
9275 1292 -687 -8125 -4499 14511 20513 14643 17279 8466 -672 -1769 12147 29370 31521 22865
9261 22865 720 -11916 -7000 -3174 4425 -15196 -10715 759 2125 5408 17002 6639 7216
9248 7216 16333 12433 7806 8115 -6724 5623 13310 4780 1467 4126 2129 10134 16412 17170 20601
9233 20601 31564 39519 35485 16655 9787 19144 28681 19019 11080 9760 13688 17397 17640 17048 32874
9218C2874o60o599n656J3968O379o373j324O917L211N063k0555m614n20K69J0002
9203C2382J0296K340l77j6473R09k253P99J403j1073j3607k270J4882J740O295
9189B4993N638k769N31K784k0106N453J8306J737j9218p471L265O35j511o027
9175F240j227J175J1363P277L834N848o506k0396J5611N481o962N366r012j4907
9161C185j958J179J5794J1690R903Q757q214m706k598j892L685j0597j1188l1
9147A3009k75J6907m630R37P586J4154J0773k048j2973j7579M633K202J353L619
9133C7668j5799j5113j321K21O239J5000J3858r765j4602M33N479P196p828M710
9119B6376J3504P004J459j1258r396K641J2377M446q010N151m255K257L351r149
$$ plain form
9218 32874 32214 25615 19959 33927 40306 33933 32609 39526 42737 47800 27245 22631 22111 22380 32382
9203 32382 42678 45018 44641 28168 29077 26824 27623 29026 17953 4346 2076 16958 18698 24993
9189 24993 30631 27862 28393 31177 11071 16524 34830 36567 17349 9878 13143 13778 12267 6240
9175 6240 5013 6188 17551 24828 28662 34510 28004 7608 23219 28700 21738 27104 18092 3185
9161 3185 1227 2406 18200 29890 39793 48550 40336 35630 33032 31140 34825 24228 13040 13009
9147 13009 12734 29641 25011 25948 33534 47688 58461 56413 43440 25861 30494 32696 34049 37668
9133 37668 21869 6756 5435 5656 11895 26895 40753 30988 16386 16819 22298 29494 21666 26376
9119 26376 39880 46884 48343 37085 27689 30330 42707 47153 39143 44294 40039 42296 45647 36498
9105C6498j8524k905J7181L579K188J1384J5446n158J563K937L856P826N014r139
9091G1746J660J7028K6856m868p380N860K1093K9004J8727M5949K4927L3186M8419
9078C32207M8529O9341P9388P9044Q5310J24720J58618K19738L12172M14214O19952
9067B543233R72858J429295J568498P32407p02515j223272j056938q55937p23125
9058B684504n47114l96300k84120j99326j65073j26026r6221r9083q1982o2062
9048F27197n2860k6017n195j9549m4681j3975k5587m3618k5658j9045j0935k1140
9036C18937j3451j1206j8724n344o937N021j4733j9154j089n732J1342P629j6677
9023B29882j7988j5626n869l42J406k1092j0667q688m139k77k540m616m405O747
$$ plain form
9105 36498 17974 15069 32250 35829 38017 49401 64847 59689 61252 64189 68045 75871 80885 71746
9091 71746 73406 90434 117290 112422 105042 110902 131995 160999 179726 225675 250602 283788 332207
9078 332207 380736 450077 529465 608509 693819 818539 977157 1196895 1509067 1923281 2543233
9067 2543233 3516091 4945386 6513884 7246291 6543776 5320504 4263566 3407629 2684504
9058 2684504 2137390 1741090 1456970 1257644 1092571 966545 870324 771241 689259 627197
9048 627197 574337 548320 543125 523576 478895 464920 439333 395715 370057 351012 340077 318937
9036 318937 305486 294280 275556 270212 263275 268296 253563 234409 233320 227588 238930 246559 229882
9023 229882 211894 196268 190399 190057 191463 170371 159704 151016 146877 146600 144060 139444 135039 141786
9009A41786j2047m585n18o695m119j3006j1Q535Q152k193j232N507m189o659j3828
8994I4898j8678r381K625r165m885l20l767O323o90p176M179M738K600R005j43
8979G0163J486j1146q621o012q048K181J946O830K46m746n392l906O149J7791
8965E8921J3484j7267j3904j277P155R867l992q131L745K708q724r86j891N772
8951D5480l852j663j2551n998J7047P510J173j2599q674p11J738l608m057j017
8937A8218J1016J057j8489k113J0756J1723j026m063L083K892m869j6891P894
8924A9188N064L801n402K84o899Q48K581J0898J1797n94L384p145N142p771j0741
8909B4435j2545O715Q726l890k704j756Q39p985j2314L869J2945M118j237l969
$$ plain form
9009 141786 129739 125154 124636 117941 113822 100816 100805 109340 117492 115299 114067 119574 115385 108726 94898
8994 94898 76220 66839 69464 60299 55414 55094 51327 57650 56960 49784 53963 58701 61301 70306 70163
8979 70163 71649 60503 51882 45870 37822 40003 41949 48779 49025 44279 38887 34981 41130 58921
8965 58921 72405 55138 41234 39957 47112 56979 52987 44856 48601 51309 42585 41599 39708 45480
8951 45480 41628 39965 27414 21416 38463 45973 47146 34547 25873 25162 26900 23292 19235 18218
8937 18218 29234 30291 11802 9689 20445 32168 31142 27079 30162 33054 28185 11294 19188
8924 19188 24252 28053 22651 22935 16036 16884 19465 30363 42160 41566 44950 37805 42947 35176 24435
8909 24435 11890 18605 27331 23441 20737 18981 19820 11835 -479 3390 16335 20453 19216 15247
8895A5247r914K334R997j2201l724R215J1763j590q66p131p365l955J8646q802
8881A1654J473P84q681M939k440Q852R244q963k3263j0607J3092L104O024K3246
8867B8458K1004j4089p817r974m870J7497r420m381m109j4085O062J0495n549
8854I222M540n878L864N003k429j4257k6445m375J0945J727p540p553J6723J6105
8840c48M218j2185o563R110J1468J0520O688L57l79l595m542n463j4803p711o748
8825a9976J1780K435J263M740l674j9422K431J3856J1430J019Q545L419m852j8281
8811e287j9985o821J4902K0439o77M236l798k79M772J5719J1114j5060o774j156
8797A1345o228j910J8341J6514Q29p614j4859j4211q0l131m58M27P042J110R158
$$ plain form
8895 15247 5333 7667 17664 5463 1739 10954 22717 21127 20261 13130 5765 1810 20456 11654
8881 11654 13127 13911 5230 10169 7729 16581 25825 16862 -6401 -17008 -3916 -812 5212 28458
8867 28458 49462 35373 27556 17582 12712 30209 20789 16408 12299 -1786 4276 14771 9222
8854 9222 13762 7884 11748 16751 14322 65 -26380 -30755 -19810 -18083 -25623 -33176 -16453 -348
8840 -348 3870 -8315 -14878 -5768 5700 16220 22908 23265 22886 19291 14749 9286 -5517 -13228 -19976
8825 -19976 -8196 -5761 -4498 242 -3432 -22854 -20423 -6567 4863 5882 14427 17846 12994 -5287
8811 -5287 -25272 -32093 -17191 3248 2571 6807 3009 2730 7502 23221 34335 19275 12501 11345
8797 11345 5117 3207 21548 38062 38891 31277 16418 2207 2127 -1004 -1462 -1035 6007 7117 16275
8782A6275J0179O856m381J637n305k790N076M731j7514r655M037J647N447L431
8768A9671k619j5098j8893n233J9358J6492j4915j2464O252L384k726J319J8400
8755A2928J3749m201L475l721j6426O270L726K966M838k698O787k961L124j5499
8741A2357o825Q968M439j0718n980O15K818j5661M32P956N336Q470j430m077k842
8726C858O594j997j117m298q247J0334R370P805j976k056n877j2194J6581Q254
8712B5034k2754j4012J1269L484m429q257M660J949O660q07j22m907k407q995
8698a3634O500o326J22M673K440Q421M477o524o119J2970J1756M599M154J6118
8684D3627n948k3459j2055O508J0012l826k416J3150K993N953k077J32P6j7556
$$ plain form
8782 16275 26454 33310 28929 30566 25261 22471 27547 32278 14764 5109 9146 10793 16240 19671
8768 19671 17052 1954 -16939 -22172 -2814 13678 -1237 -13701 -7449 -4065 -6791 -5472 12928
8755 12928 26677 22476 25951 22230 5804 12074 15800 18766 23604 20906 27693 24732 27856 12357
8741 12357 5532 14500 18939 8221 2241 2856 5674 -9987 -9555 -1599 3737 12207 10777 6700 3858
8726 3858 10452 8455 7338 3040 -5207 5127 14497 22302 20326 18270 12393 199 16780 25034
8712 25034 2280 -11732 -463 3021 -1408 -9665 -5005 -3056 3604 2797 2675 -2232 -4639 -13634
8698 -13634 -7134 -13460 -13338 -8665 -6225 2196 6673 149 -5970 7000 18756 23355 27509 43627
8684 43627 37679 14220 2165 8673 18685 14859 12443 25593 28586 34539 32462 32594 32670 15114
8670A5114j6702P380M273n748Q347j9472l218N872K573O072P463L798R163k138
8656B2777O88J846L054J1604j3370O911K00k3911k230N151J6603n866r797M567
8642A8227m931J2296l195p873P075N903o469p972o02j0719m638L342J1911J8674
8628C1029j975k1639q076J2212J8179K195R293R40j6560L811M184m119l846p45
8614B4883R121R340J129p819j3628J473J1221Q083M570l372M400J4712Q10l907
8600F1016N227r049n992j6336r886M01l92r52j305J431l475p050K951M5j4142
8585B492j854R377K486J345J5834n657j6583J0543M626J3019K911j6672j3027
8572H840j3139R150K626M537m038L009k885K579O003K1434J6646m01O826j954
$$ plain form
8670 15114 -1588 5792 10065 4317 12664 -6808 -10026 -4154 -1581 4491 11954 15752 24915 22777
8656 22777 23465 25311 28365 39969 26599 33510 33710 9799 7569 12720 29323 23457 13660 18227
8642 18227 13296 25592 22397 14524 21599 27502 21033 13061 12459 1740 -2898 444 12355 31029
8628 31029 29054 7415 -661 11551 29730 31925 41218 42158 25598 29409 33593 29474 25628 24883
8614 24883 34004 43344 44473 36654 23026 24499 35720 43803 48373 45001 49401 64113 64923 61016
8600 61016 66243 57194 51202 34866 24980 25381 24989 24037 22732 24163 20688 13638 16589 16634 2492
8585 2492 638 10015 12501 13846 29680 24023 7440 17983 22609 35628 38539 21867 8840
8572 8840 -4299 4851 7477 12014 7976 10985 8100 10679 16682 38116 54762 54361 61187 59233
8558E9233j7582j6647J0136k126q318j4973k927J0014N67n315J1294N542n158
8545B3740L676R480j0924k0210j800P037j955J0124J0329j5253k0337j2383m709
8532b3185n845n481N210K0009L329j85k043L772L84q45N412J0256Q506q310q162
8517B822J3327r51J019j9175j587j2531k0814l207R378J0966n453J572J7840P45
8503f049j248J586M811J3195J3439j188j3752l261j0664j2420K0889J7812k913
8490B0237j619j0874n544k177P669J3866j899j0591r419J2340K4249O788j2848
8477C0178j1486m981Q964j38j1434n607M14N236j863k0199k0389P852J3258L558
8463f637L941p863q557M699J2455K546n989r764R947l542j3781J0154K79J1454
$$ plain form
8558 59233 41651 25004 35140 33014 24696 9723 6796 16810 17377 12062 23356 28898 23740
8545 23740 27416 36896 25972 5762 3962 10999 9044 19168 29497 14244 -6093 -18476 -23185
8532 -23185 -29030 -34511 -29301 -9292 -5963 -6148 -8191 -4419 -4035 -4880 532 10788 19294 10984 2822
8517 2822 16149 15198 16217 -2958 -4545 -17076 -37890 -41097 -31719 -20753 -26206 -24634 -6794 -6049
8503 -6049 -7297 -5711 -900 12295 25734 24546 10794 7533 -3131 -15551 5338 23150 20237
8490 20237 18618 7744 2200 23 7692 21558 19659 9068 -351 11989 36238 43026 30178
8477 30178 18692 13711 22675 22537 11103 5496 5910 11146 9283 -10916 -31305 -23453 -10195 -6637
8463 -6637 -2696 -10559 -19116 -14417 -1962 584 -5405 -15169 -5222 -8764 -22545 -12391 -12112 -658
8449f58o003p146o84J523R450M530M852J280Q129N711q070J023K156J395j2075
8434E413j3389k513J1221j5463l73P420Q99J4896j2698j1345R466j471k471l060
8420a3468N792P379l81q192m362M0r226L964K0756N233m021k555J0231o378J038
8405E850q876o801O69Q923j225K006O737O14q805n676q262Q273N862Q038K488
8390I815P989N416j7030n790j2652j323j6967j2321P197N230P828K3456P396j0405
8376b161m231M475J3824k913r832p807Q416p716j5918P60L071l809q547O285J3691
8361a2412J0531N10j181P60J2162p663Q737J6005P366j5955O75P888q199j4495
8347D729j9504n553J837K0133J9882l148p257K76J465K083J543j164K0519N770
$$ plain form
8449 -658 -6661 -13807 -14491 -12968 -3518 1012 5864 7144 15273 20984 12914 13937 16093 17488 5413
8434 5413 -7976 -10489 732 -14731 -15104 -7684 -6785 8111 -4587 -15932 -6466 -7937 -10408 -13468
8420 -13468 -7676 -297 -678 -8870 -13232 -13192 -22418 -18454 2302 7535 3514 959 11190 4812 5850
8405 5850 -3026 -9827 -9158 -235 -1460 546 7283 7897 -908 -6584 -14846 -6573 -711 7327 9815
8390 9815 17804 23220 6190 400 -12252 -13575 -30542 -42863 -35666 -30436 -22608 848 8244 -2161
8376 -2161 -6392 -1917 11907 8994 -838 -8645 -229 -7945 -23863 -23103 -20032 -23841 -32388 -26103 -12412
8361 -12412 -1881 -1371 -2552 -1792 10370 2707 11444 27449 34815 18860 19535 27423 19224 4729
8347 4729 -14775 -20328 -18491 1642 21524 18376 11119 11395 12860 14943 16486 15322 35841 41611
8333D1611j0985j3968l056j0277j988j4551l838j731L41J3924p42L141j608L633
8319i4L2428R717j1716p418j5006j2918j514J8563O189k180N424j9800j5979J180
8305a3124J322M863q547K988J1356n741k844j7605j3398p56K307J5525R096P247
8291g311J0445J637r026m906J8474J5897p228n066n892J054k807k3714j786J6175
8277d054p089M604O688O263R433j412j6858M775R581N394n554q72j1645K969J5517
8262A7740Q295J1200j0343k5876l274j018o784l936O861n340p187O099O400n322
8248a2485O048M125j2269P681J6234L345p095O174P309n422o565j1402m565P936
8234i51J1751J2503m944j1214m504n731P027P319K853J0714q836p368n569j5291
$$ plain form
8333 41611 30626 16658 13602 3325 1337 -13214 -17052 -18783 -18442 -4518 -5260 -2119 -3727 -94
8319 -94 32334 42051 30335 22917 7911 -5007 -6521 12042 18231 16051 21475 1675 -14304 -13124
8305 -13124 -11802 -6939 -15486 -12498 -1142 -6883 -9727 -27332 -40730 -41486 -39179 -23654 -14558 -7311
8291 -7311 3134 4771 -4255 -9161 9313 25210 17982 12916 7024 8078 5271 -18443 -20229 -4054
8277 -4054 -11143 -6539 149 6412 15845 14433 -2425 2350 11931 17325 11771 10899 -746 2223 17740
8262 17740 26035 37235 26892 1016 -2258 -3276 -10060 -13996 -7135 -12475 -19662 -13563 -7163 -12485
8248 -12485 -6437 -2312 -14581 -6900 9334 12679 5584 11758 19067 13645 7080 -4322 -8887 -951
8234 -951 10800 23303 18359 7145 2641 -3090 3937 11256 14109 24823 15987 8619 3050 -12241
8220a2241n167O094m534l858J483J5972Q093m225K139o010N710j299m446m278
8206f567l143K422j191L091m31p086L925j9k546M992J6566J5260j0625r311M522
8191I859l535j402J04J5352r057k262K123m630p567J466N096j036j230q273k81
8176e273J1461P129J934N536M580j778j8153K472J2499J200N911J4254j0059j8306
8162A3407j1795K42J0886K882p697J858P422N958O475q190n608j6861r172k876
8148a3069k626O192K1564J3786n175n863m774K331j1740k032J159J4305J1750
8135B5808J1733n896q891J2005J0567L100j0864j9378k824O707L15p739p215L441
8121A0869l059q980J5239o152j6075J6955K825O498N369q720j4623j6899K546
$$ plain form
8220 -12241 -17408 -11314 -15848 -19706 -18223 -2251 5842 1617 3756 -2254 3456 2157 -2289 -6567
8206 -6567 -9710 -7288 -8479 -5388 -5819 -12905 -8980 -8999 -11545 -6553 10013 25273 14648 5337 9859
8191 9859 6324 4922 5026 20378 11321 9059 11182 6552 -1015 451 5547 4511 3281 -4992 -5273
8176 -5273 6188 13317 15251 20787 25367 23589 5436 7908 20407 21607 27518 41772 31713 13407
8162 13407 1612 1854 12740 15622 7925 9783 17205 23163 29638 21448 15840 -1021 -10193 -13069
8148 -13069 -15695 -9503 12061 25847 20672 14809 10035 12366 626 -1406 -247 14058 25808
8135 25808 37541 31645 22754 34759 45326 48426 37562 18184 15360 22067 22382 14643 7428 10869
8121 10869 7810 -1170 14069 7917 -8158 8797 11622 18120 23489 14769 146 -16753 -14207
8108a4207j242Q473p200R603O903N032J3322L356k032R34M647l746j6581N226
8094A2488k797j3718K205O75L850J1859j568m796P363K414n035j5415k778o574
8080a1827K445L40J2550P871L277j181r006R102j23j237J0457r08r271m140K63
8065H612k881j931N398M889N879R158O308k136j0736j5980j498O015K157J1555
8051B4809M539P153J3604L089q892R5K373o733j3715j9652P852J950j2045o714
8037b287m769J67L503J1779J2214j231o87M492P911M79L169n074l352l079n416
8022A7819n890L428k613O263R743k005M173O553Q427k511p427j5897J933K003
8008B3999o833K063N761N556k036L698L86j841j1716k184M267p287P608m74j5807
$$ plain form
8108 -14207 -15449 -6976 -14176 -4573 2330 7362 20684 24040 22008 22942 27589 23843 7262 12488
8094 12488 9691 -4027 -1822 -1147 2703 14562 12994 8198 15561 17975 12940 -2475 -5253 -11827
8080 -11827 -9382 -9042 3508 11379 14656 13475 4469 13571 13448 12211 22668 21760 12489 8349 8612
8065 8612 5731 3800 9198 14087 19966 29124 35432 33296 22560 6580 5082 11097 13254 24809
8051 24809 29348 36501 50105 53194 44302 44397 46770 40037 26322 6670 14522 16472 4427 -2287
8037 -2287 -7056 -6889 -3386 8393 20607 19376 18689 23181 31092 31571 34740 29666 26314 23235 17819
8022 17819 11929 15357 12744 19007 28750 26745 30918 37471 45898 43387 35960 20063 21996 23999
8008 23999 17166 19229 24990 30546 28510 32208 32594 30753 19037 16853 21120 13833 21441 20967 5160
7993E160k930k2m739p27o943k88K1654J8357N044j706l787j0711q450n92q325
7978I95L061N8L883J5980m246q018o494k1778l002J2507K3963J3698J798j0329
7964B2076j2163l526L872P181J1598j3875J13K481R137O997j8158o505M691n20
7950A3399n971k095J4397n052L303K888j3829K715k1134l720Q505r951j231o298
7936b4074J6530K2382R929j2269o112k414J5681j324p273o675j8572m660R012
7923i839J2739K0764O377p265K501Q819j402o918q708J660J774q017r307j3561
7909a0383N816K5032J0698J5721j0716k0533m679n686N451O684o475n965K218
7896G183R491K849k95N995j8371l918p321k868M173k989q724J6604P989L537j1715
$$ plain form
7993 5160 2230 2208 -2531 -3258 -10201 -10489 11165 29522 34566 32860 29073 18362 9912 9320 995
7978 995 4056 4114 7997 23977 19731 11713 5219 -16559 -19561 -7054 16909 30607 32405 22076
7964 22076 9913 6387 10259 17440 29038 15163 15276 17757 26894 33891 15733 9228 13919 13399
7950 13399 7428 5333 19730 14678 17981 20869 7040 9755 -11379 -15099 -6594 -16545 -17776 -24074
7936 -24074 -7544 14838 24767 12498 6386 3972 19653 18329 11056 4381 -14191 -18851 -9839
7923 -9839 2900 23664 30041 22776 25277 34096 32694 25776 17068 18728 20502 12485 3178 -10383
7909 -10383 -4567 20465 31163 46884 36168 15635 10956 5270 10721 17405 10930 4965 7183
7896 7183 16674 19523 19228 25223 6852 2934 -4387 -7255 -3082 -6071 -14795 1809 9798 13335 1620
7881A620j0218q576P583P927j372Q179p374N714L674m239l398r073K063J032j1143
7866a7601M266M580J4944j667o860Q55k87J879o1J1085K821j8148j4589K227K291
7851a4265J0899M595q304j0450r479J0182O968n387k264L422P447J5284M862p888
7837E622j917J2567q320j5771j9271P29P514Q885R098P793l266j216R66K548J236
7822G197K241r176m942J6216J0465j0563j1451j1103K982J0657N332K493L74n014
7808E708l687o257j1463O291J2939J757j530M721K59m209L872N630k978o247k341
7793B465l495p300Q250K857n715P133k333M186K428j8067J823Q789J224Q129j0141
7778B33k8369m35L861Q537J0104j0385l829o493j166O484J0737L475Q149M001
$$ plain form
7881 1620 -8598 -17174 -9591 -1664 -3036 5143 -2231 3483 7157 2918 -480 -9553 -7490 -6458 -17601
7866 -17601 -13335 -8755 6189 4522 -2338 -1483 -1770 109 48 11133 13954 -4194 -18783 -16556 -14265
7851 -14265 -3366 1229 -7075 -17525 -27004 -16822 -9854 -15241 -17505 -14083 -6636 8648 13510 5622
7837 5622 3705 16272 7952 -7819 -27090 -26361 -18847 -9962 -864 6929 3663 2447 3413 5961 7197
7822 7197 9438 262 -4680 11536 22001 11438 -13 -11116 -8134 2523 7855 10348 10722 5708
7808 5708 2021 -4236 -15699 -9408 3531 5288 3758 8479 8738 4529 8401 14031 11053 4806 2465
7793 2465 -1030 -8330 -80 2777 -2938 4195 1862 6048 8476 -9591 -7768 1021 2245 10374 233
7778 233 -28136 -28571 -24710 -16173 -6069 -16454 -20283 -26776 -27942 -21458 -10721 -7246 903 4904
7764D904j3334k553Q336l064k773j6633Q394R041J5243P175m898r290p267Q719
7750B000J6191Q027j1550r028J0516N085l664N24K54J0340j481L060K592j3765
7736A9101j7815M00j1763o466O741K348p590j3018P640J3184R806q678L121l33
7722c322j903j386K19P909j319M607j319m894N528K2002j71n460K065j3119k749
7707F688K117P967N141J286j1303j3349j1081k1738K377N238P027J6311Q984j0393
7693d728r894J0724j36O13k229p823P09J100m683M31Q815Q712j1339m771m571
7678a9070J6131m64o206o291N466L026L848N64N527N708J6691j3878j4351R298
7664E999Q218r232p566K961J2817j0711j0522Q569M890P693M687Q607j0154k8880
$$ plain form
7764 4904 -8430 -10983 -2647 -5711 -8484 -25117 -16723 -7682 7561 14736 9838 548 -6719 2000
7750 2000 18191 26218 14668 5640 16156 21241 17577 18101 18355 28695 27214 30274 32866 19101
7736 19101 1286 1686 -10077 -16543 -9802 -7454 -15044 -28062 -20422 -7238 2568 -6110 -2989 -3322
7722 -3322 -5225 -6611 -6392 1517 198 4805 3486 -1408 4120 26122 25951 20491 22556 9437 6688
7707 6688 8805 16772 21913 23199 11896 -1453 -12534 -34272 -31895 -26657 -19630 -3319 5665 -4728
7693 -4728 -14622 -3898 -4034 -3421 -5650 -13473 -12764 -11664 -16347 -15916 -7101 1611 -9728 -14499 -19070
7678 -19070 -2939 -3403 -9609 -15900 -10434 -7408 -3560 -2996 2531 8239 24930 11052 -3299 5999
7664 5999 14217 4985 -2581 380 13197 2486 -8036 533 5423 13116 17803 26410 16256 -12624
7650a2624m117J1160K155N617K386K382l307l728J0416J594J211L897j1310j204
7636D528k700N932j455n709p122J2685N107m347k567K942J0628M561r504k682
7622A0297J0567r825j4345M90m458j6727O274k066N779J2210R571N670n395j3382
7608e340n983l494K194O420L09R888K105M659q253j3379J762N776N92K062L4j1119
7592a1767r520k95j345R481J6327m243J1122K4336l575j2319m059j5985j5968
7579a7810r165N390m69N115J329J8753J378l288j690J5327J0541j5069p807L754
7565F289j934o610r361k009N262m80J5543M458j0534j3003o035j489J3476N315
7551a112q394j110O818P247p333j7114j7369K117K622J5240J5083J0722J720r793
$$ plain form
7650 -12624 -16741 -5581 -3426 2191 4577 6959 3652 -76 10340 11934 13145 17042 5732 4528
7636 4528 1828 7760 6305 596 -6526 6159 11266 6919 4352 7294 17922 22483 12979 10297
7622 10297 20864 11039 -3306 -2816 -7274 -24001 -17727 -19793 -14014 -1804 7767 13437 8042 -5340
7608 -5340 -11323 -14817 -12623 -6203 -5894 3994 6099 10758 2505 -10874 -9112 -3336 -2744 -682 -648 -11767
7592 -11767 -21287 -21582 -22927 -13446 2881 -1362 9760 34096 30521 18202 14143 -1842 -17810
7579 -17810 -26975 -21585 -22054 -16939 -15610 3143 4521 1233 -457 14870 25411 10342 2535 6289
7565 6289 4355 -2255 -11616 -13625 -8363 -8843 6700 11158 624 -12379 -18414 -19903 -6427 -1112
7551 -1112 -9506 -10616 -3798 3449 -3884 -20998 -38367 -36250 -33628 -18388 -3305 7417 9137 -656
7537f56r882n20O957L953J4535M447j3675o126q262n368Q768P847r400J0144k264
7522D98k2924J0616J4832J1787k225l1408j260N15R900J0871L787K272r368J302
7508h05J3741Q114l260j3193j2379K740M76K314J4386O19l220k56J568M948j250
7493A4543J9553J4342j160k4477N75R55j5287o511O263j0046q461P255J2135l528
7479F151k1017Q93J6529R10M664L588J119j0589j2954M002k151l583L158M468
7465d812J3339Q128j0555J362R555N547K430q355j6614j5175j6149M583J2098
7452a4618P641Q69O067k354p709n987J1993j1136l040J2776n271j579K112L840
7438f396N221j3010r546J3335J4832O81j4765N755J871O27K988J0166j86j142
$$ plain form
7537 -656 -10538 -11058 -4101 -148 14387 18834 5159 -967 -9229 -14597 -5829 2018 -7382 2762 498
7522 498 -22426 -11810 3022 14809 12584 -18824 -20084 -19569 -9669 1202 4989 7261 -2107 -805
7508 -805 12936 21050 17790 4597 -7782 -5042 -4566 -2252 12134 12753 9533 9277 10845 15793 14543
7493 14543 34096 48438 47278 22801 23376 24331 9044 2533 8796 -1250 -9711 -2456 9679 6151
7479 6151 -14866 -13973 2556 3466 8130 11718 12837 2248 -10706 -6704 -8855 -12438 -9280 -4812
7465 -4812 8527 16655 6100 7462 17017 22564 24994 16639 25 -15150 -31299 -26716 -14618
7452 -14618 -6977 -6108 -41 -2395 -10104 -16091 -4098 -15234 -18274 -5498 -10769 -12348 -10236 -6396
7438 -6396 -1175 -14185 -23731 -10396 4436 5117 -9648 -3893 -2022 -1395 1593 11759 11573 10431
7424A0431R677N171p858j2099o53J297o004l960j0102O419M815n208P545J8840
7410A8311J0341n186j7959j0487p939m306l177M990J5991p588p376j720L986m581
7396a6700L462J5532J1953l017n05k0464L797J5135R01P006L560j48j0861k005
7382G646K70O492J794j0147k6030j0301J301J0452J6832k052J819L612n456r998
7368a3766P584O483o233J6072m135K538m349n151j3713j0824J5466P419m600L117
7354d092J0443m043l420Q154p074R012l690j2031j6888J644L199l418L413N960
7340a2831m314k694R839L187j2373J1901J6537p838j6567J5773p828r830J7839
7327H01M767p420J398p537n046j649J6511K084j3058j149m172m450O453K227o90
$$ plain form
7424 10431 20108 25279 17421 5322 4669 5966 -38 -3998 -14100 -7681 -2866 -8074 -529 18311
7410 18311 28652 23466 5507 -4980 -12919 -17225 -20402 -15412 579 -7009 -14385 -16105 -12119 -16700
7396 -16700 -13238 2294 14247 11230 10725 -9739 -5942 9193 10094 17100 20660 20512 9651 7646
7382 7646 7916 14408 16202 6055 -19975 -30276 -28975 -18523 -1691 -3743 -1924 1688 -3768 -13766
7368 -13766 -6182 301 -5932 10140 6005 8543 4194 -957 -14670 -25494 -10028 -2609 -7209 -4092
7354 -4092 6351 2308 -1112 7042 -32 8980 5290 -6741 -23629 -21985 -18786 -22204 -18791 -12831
7340 -12831 -17145 -19839 -10000 -6813 -19186 -7285 9252 1414 -15153 620 -7208 -17038 801
7327 801 5568 -1852 -454 -7991 -13037 -14686 1825 3909 -9149 -10298 -14470 -18920 -12467 -10240 -10930
7312a0930K718M340P228R679J2210l503M152J803j0107r570n437l84j449K021
7298B771n978J2L393K541j2804o895k118n723O487J2227M709o577P402J1513N606
7283A6566j1043J0627j3630j1342j3796n883j657o157J0887M669j589j949J1578
7270a2719J2179J967Q99q907j2459J717O744l578J0424o73M442p570R959j1104
7256h679j522J5593J3245j4296j6794j1349j917J2542M941j2479M226O310J1908
7243A729m837j3585m576M684l08N024L114Q866N551o582j0735k534P506N647P257
7228F221J3566j4313j1938P408P922q3M908n032j2000N08o954K662J317p937q546
7213b2291K409m401j3639J0365J0679N183L857J1120p697q699N22K112J4887Q236
$$ plain form
7312 -10930 -8212 -3872 3356 13035 25245 21742 25894 27697 17590 8020 2583 2199 750 2771
7298 2771 -3207 -3195 198 2739 -10065 -16960 -19078 -24801 -18314 -6087 -1378 -7955 -553 10960 16566
7283 16566 5523 16150 2520 -8822 -22618 -28501 -30158 -36315 -25428 -20759 -22348 -24297 -12719
7270 -12719 -540 1427 2326 -6581 -19040 -17323 -10579 -14157 -3733 -4406 36 -7534 2425 -8679
7256 -8679 -10201 5392 18637 4341 -12453 -23802 -25719 -13177 -8236 -20715 -16489 -10179 1729
7243 1729 -3108 -16693 -21269 -16585 -16893 -11869 -8755 111 5662 -920 -11655 -14189 -6683 -1036 6221
7228 6221 19787 5474 -6464 944 8866 8783 13691 8659 -3341 -2833 -9787 -7125 -5808 -13745 -22291
7213 -22291 -19882 -24283 -37922 -27557 -16878 -11695 -7838 3282 -4415 -13114 -12592 -10480 4407 12643
7199A2643j777j5479n417J3299r331N849J1470M905M516N814j2629j6239l377
7186e753N275J161o612L126n471j1419j0218J8907o450j1318M558J2703J3379
7173A868P785k899m724J758k152K814j0646j4794l002J0275Q274L264r871o431
7159a8481p917n688J5632J9072J6552l304j3922j605m517K735J5696J820j2637
7146C436j5813M296J5548J6649p66K784p210j1915K34N113m361K570K281n305
7132G541M937j7989q420J8436N008l159P508p479j2103o198R724q92m01r703m163
7117a7353O866R580J4591n38j1415k7002n601J0922J1313K872L028O58N956O360
7103A0237l868p585j8201K562K4389J2137K729N651m078j2570k4400r940q332
$$ plain form
7199 12643 10866 -4613 -10030 3269 -6062 -213 11257 16162 20678 26492 13863 -2376 -5753
7186 -5753 -478 683 -5929 -2803 -8274 -19693 -29911 -11004 -17454 -28772 -24214 -11511 1868
7173 1868 9653 6754 2030 3788 1636 4450 -6196 -20990 -23992 -13717 -5443 -2179 -12050 -18481
7159 -18481 -26398 -32086 -16454 2618 19170 15866 1944 339 -4178 -1443 14253 16073 3436
7146 3436 -12377 -8081 7467 24116 23350 26134 18924 7009 7243 12356 7995 10565 12846 7541
7132 7541 12478 -5511 -13931 4505 9513 6354 13862 6383 -5720 -11918 -2194 -3086 -3487 -13190 -17353
7117 -17353 -10487 -907 13684 13146 1731 -25271 -30872 -19950 -8637 -5765 -2737 -2079 3877 10237
7103 10237 6369 -1216 -19417 -16855 7534 19671 22400 28051 23973 11403 -12997 -22937 -31269
7090c1269l299J4273J3462J5289J3567j0012k4479r165Q712O842j341L927L021
7077d72r784K489J0898o248k097r448r018Q345J7667l700K866J3713j1932l1126
7063b7847k017R422j422L970Q454m301K157L862j0872k596N336R774K00r17K2720
7048A5923j027n288K0227J7266q094j6413o514J2047K482k5841m062R480P018
7035A7204j6655j0390p10l24j966r347N050J24K897l919j0094N450J1315o916
7021a8281j1563j6754P371K1977O833j1995l702J2405K436J2937J5564m384j1942
7008I02J2662N560R432J311J103j3678k1326l897O694J321J0864N068j5188k0268
6994a9440P802J1770J0355K574l574n493L292J1372l270k621j387k5641j4529
$$ plain form
7090 -31269 -34568 -20295 -6833 8456 22023 12011 -12468 -21633 -12921 -6079 -7420 -3493 -472
7077 -472 -10256 -7767 3131 -3117 -5214 -14662 -23680 -15335 2332 -1368 1498 15211 3279 -27847
7063 -27847 -29864 -20442 -21864 -17894 -9440 -13741 -11584 -7722 -18594 -21190 -15854 -6080 -5880 -6797 15923
7048 15923 14896 9608 29835 47101 39007 22594 16080 28127 30609 4768 706 10186 17204
7035 17204 549 -9841 -10551 -10875 -12841 -22188 -17138 -17014 -14117 -18036 -28130 -22680 -11365 -18281
7021 -18281 -29844 -46598 -39227 -17250 -10417 -22412 -26114 -13709 -11273 1664 17228 12844 902
7008 902 13564 19124 28556 29867 30970 17292 -4034 -7931 -1237 84 10948 16016 828 -19440
6994 -19440 -11638 132 10487 13061 9487 3994 7286 18658 15388 12767 11380 -14261 -28790
6981b8790N285M227j0439p724P982J1642J3736J1009L109m176j231q736l845n647
6967a3598m364Q999L863j2856o81J2926J5005J0324r017l836K916L555j2507r587
6953h858m721M162J293j1760j7326j2684M887J4812j261M606N187Q906R62K081
6939i714P812J6566N95k3319p865J4101K944K180n357o402K091p38q399M727P089
6924c689K44J0100p736O915l543L173K3948N772j6179p151K057O268N486j7069
6910H596j3936J1555Q943j3625n972J4526R033p562j0868n000R057J4007m538
6897A4216P020L316p057m727m778J807M576p665j0619j0662p033J0355J0089j4673
6883a5835j94J6074j2051m192J430o884o126J56J5385Q425M26l809k802Q342k686
$$ plain form
6981 -28790 -23505 -19278 -29717 -37441 -29459 -17817 -4081 6928 10037 5861 4630 -4106 -7951 -13598
6967 -13598 -17962 -8963 -5100 -17956 -18637 -5711 9294 19618 10601 6765 9681 13236 729 -8858
6953 -8858 -13579 -9417 -8124 -19884 -37210 -49894 -45007 -30195 -31456 -26850 -21663 -12757 -11795 -9714
6939 -9714 -1902 14664 15259 -8060 -15925 -1824 1120 3300 -2057 -8459 -6368 -7106 -15505 -10778 -3689
6924 -3689 -3445 6655 -1081 5834 2291 5464 29412 35184 19005 11854 13911 20179 25665 8596
6910 8596 -5340 6215 15158 1533 -4439 10087 19120 11558 690 -4310 4747 18754 14216
6897 14216 21236 24552 17495 12768 7990 9797 14373 6708 -3911 -14573 -21606 -11251 -1162 -15835
6883 -15835 -16029 45 -12006 -16198 -14768 -21652 -27778 -27622 -12237 -3812 -3386 -7195 -9997 -1655 -4341
6868d341q075M84P195J0097J827j0054K304k754J569M650k452Q79n946J399J2275
6853I057J158p895r574j620N963M710j0875N97p514N804L994j909K239P084j9571
6838a8352k2636O519R750Q053l79Q083Q389J2351J1475j4843o914n926j668k772
6824h870K514q261j3354j193K4885R327M654Q20l126k0417j2175M19J3837J31
6810a0809j11J6566J0632P17o097J9870k405p458J4400q971p578j277o68J1769
6796B8580P57K257k0973j5554K331J4166J066j355j3676R40N768M798k952N872
6782A2025p974k08k270j1480j452l890J233L232l174L092K621q29J703o549l988
6767a7908K6j807M767P937O978K725r624j6115M411p866l080J9363L4468J2776
$$ plain form
6868 -4341 -12416 -11932 -4737 5360 7187 -2867 -563 -3317 -1748 2902 450 1329 -4617 -3218 9057
6853 9057 10215 2320 -7254 -8874 -2911 1799 -9076 -8479 -15993 -10189 -6195 -8104 -5865 1219 -18352
6838 -18352 -40988 -34469 -24719 -16666 -17045 -8962 -573 11778 23253 8410 1496 -4430 -6098 -8870
6824 -8870 -6356 -14617 -27971 -29164 -4279 5048 9702 10522 7396 -13021 -25196 -24777 -10940 -10809
6810 -10809 -10920 5646 16278 16995 10898 30768 28363 20905 35305 26334 18756 17479 16811 28580
6796 28580 29337 31594 10621 -4933 -2602 11564 12630 11275 -2401 -1461 4307 9105 6153 12025
6782 12025 4051 3843 1573 -9907 -11359 -15249 -14016 -10784 -13958 -10866 -8245 -9074 -7371 -13920 -17908
6767 -17908 -17882 -19689 -14922 -6985 -7 2718 -6906 -23021 -18610 -26476 -29556 -10193 24275 37051
6753C7051j6070j9653O137J3897J2369o955r685m326j645j0695Q065J522P313
6740A7325N512k0446j7225N672R707L036m577R316m773m53J7345L963j694j4337
6726H371n686k631k537l042p096J1765J1931J1317n183j1025j4816k944M383m6
6712g239P110M323o571j0252p11J248m91O57l618r105M792j097j1232J3651J9726
6697A191Q039n928k544n962k470j233L7M160r945k581R332m452J01R308j055n443
6681i445O404P151m37Q08r224j1602j0271O920J3316L179J460q120Q946O128N915
6666A1128L439K181j6783j4987l880M469O866J1204p88Q566J4027L564k0845j2586
6652d425n805L251M650j3134j3683J0014R627k347l880J3488J3269n509j2985
$$ plain form
6753 37051 20981 1328 7465 21362 33731 26776 17091 12765 11120 425 8490 10012 17325
6740 17325 22837 2391 -14834 -9162 545 3581 -996 8320 3547 3094 20439 24402 22708 8371
6726 8371 2685 54 -2483 -5525 -12621 -856 11075 22392 17209 6184 -8632 -11576 -7193 -7239
6712 -7239 -129 4194 -2377 -12629 -13340 -12092 -12583 -11926 -15544 -24649 -19857 -20954 -32186 -18535 1191
6697 1191 9230 3302 758 -5204 -7674 -8907 -8870 -4710 -14655 -17236 -7904 -12356 -12255 -2947 -4002 -9445
6681 -9445 -3041 4110 3673 4481 -4743 -16345 -26616 -19696 -6380 -3201 -1741 -9861 -915 5213 11128
6666 11128 14567 16748 -35 -15022 -18902 -14433 -7567 3637 2849 11415 25442 29006 8161 -4425
6652 -4425 -10230 -6979 -2329 -15463 -29146 -19132 -9505 -11852 -15732 -2244 11025 5516 -7469
6639g469Q534J2456K745j7378O76j1295P85J1119P995k1326M361o443k333J0981
6625f592R292l96L243j3904P285R501Q602j6537j4768J1663K987M958m97k703
6611B134K971m3n546L79q261l966J1406J4578r399j5747N056N470J586k734j3496
6596a5612n900p662Q11Q870J1885Q217p237k435N860N807M553K935k463m634j96
6581B799j4654M786K013P5L200J153N92J235j294J1523j5998N513O252n748L802
6566E249P3m481r893Q39L611j715N301N126j2614P753J0917m292j5830p393K850
6551a4499K747J4119J0513J4281j4278r198l811j6102J0156J9097o94K022j3336
6538A017j7494n791j65R173J615j4454M024J7203J0338Q161J3413r36L296n90
$$ plain form
6639 -7469 1065 13521 16266 -1112 -436 -11731 -10946 173 8168 -13158 -8797 -15240 -17573 -6592
6625 -6592 2700 2304 5547 -8357 -1072 8429 17031 494 -14274 -2611 376 5334 4837 2134
6611 2134 5105 5062 -484 -105 -8366 -12332 -926 13652 4253 -11494 -6438 -968 618 -2116 -15612
6596 -15612 -21512 -29174 -28363 -19493 -7608 609 -6628 -9063 -3203 2604 7157 10092 7629 2995 2799
6581 2799 -11855 -7069 -5056 -4981 -1781 -628 -36 1199 -95 11428 -4570 943 7195 1447 5249
6566 5249 5322 841 -9052 -8213 -4602 -6317 -1016 4110 -8504 -751 10166 5874 -9956 -17349 -14499
6551 -14499 -11752 2367 12880 27161 12883 3685 -126 -16228 -6072 13025 12331 14353 1017
6538 1017 -16477 -22268 -22433 -13260 -11645 -26099 -22075 -4872 5466 13627 27040 26104 29400 28810
6524B8810k4090j0319K272j2400j317J0288K468N396r983M308K843K2431k882
6511A7825o969j3731j3644j5451O139J1720J2334J174j8518P646K0654J4511O49
6498B4339p756J503P113k0044j0890j822J4218k950j1220J0368m850r945l051
6485a4987o918M795O314J3066M888p228r837L958N734m488J0458L851l611p955
6471a960k0581O412P430j043k370M764P825j1143n158p143j2469J153J6807K4379
6457F903M407l643P864J0034M868K96r901L378j5289k8447n612R205N271o21k629
6442a3916J5209M357j3945L511O258k622p838j3577l556L609N427J7579O145l253
6428C388k993K982N236n035p250J993J7453r753q211j802O171O169Q482J873r134
$$ plain form
6524 28810 4720 -5599 -3327 -15727 -17044 -6756 -4288 1108 -8875 -4567 -1724 20707 17825
6511 17825 10856 -2875 -16519 -31970 -25831 -14111 -1777 -603 -19121 -11475 9179 23690 24339
6498 24339 16583 18086 25199 5155 -5735 -7557 6661 3711 -7509 2859 -1991 -11936 -14987
6485 -14987 -21905 -17110 -10796 2270 7158 -70 -9907 -5949 -215 -4703 5755 9606 5995 -1960
6471 -1960 -22541 -16129 -8699 -9742 -12112 -7348 477 -10666 -15824 -22967 -35436 -34283 -17476 6903
6457 6903 11310 7667 15531 25565 30433 30729 20828 24206 8917 -19530 -25142 -15937 -10666 -11287 -13916
6442 -13916 1293 5650 -8295 -4784 1474 -1148 -8986 -22563 -26119 -22510 -17083 496 6641 3388
6428 3388 395 3377 8613 3578 -3672 -1679 15774 6021 -2190 -3992 2179 8348 16830 18703 9569
6413I569l757p512N501L767k583j7403k470J5133M172j0367j2755L583J873O167
6399g082J2218J2112k500n844O76m572q523r607k2157J411J5404M251m79j1323
6385b6015L728J4420M923K560O787j814j0871o379K540J625L250M874L671k0009
6371a6710L617K556K242N179j4232n638J702J0685J991K919r98k137L174n563
6357a1213m558Q745l967L909l935n302o137l930K2909R434o957k524J0357J361
6343H192j0819m729J1625J4914P107q232p028l701j7464j8973O474J9503o277
6330i408O1K629L832J5m122O210N105n653J630R891j0375J491K884N056j0319
6315a073k4751r696j668R558K899R321J9931l056r650J2042J6413K1733j3799
$$ plain form
6413 9569 5812 -1700 3801 7568 4985 -12418 -14888 245 4417 -5950 -18705 -15122 -13249 -7082
6399 -7082 5136 17248 14748 8904 9580 5008 -3515 -13122 -35279 -33868 -18464 -14213 -14692 -26015
6385 -26015 -22287 -7867 -2944 -384 6403 4589 -6282 -12661 -10121 -8496 -5246 -372 3299 -16710
6371 -16710 -13093 -10537 -8295 -3116 -17348 -22986 -21284 -10599 -8608 -5689 -6687 -8824 -5650 -11213
6357 -11213 -15771 -7026 -10993 -7084 -11019 -16321 -22458 -26388 -3479 5955 -1002 -3526 6831 8192
6343 8192 -2627 -7356 4269 19183 26290 18058 11030 7329 -10135 -29108 -22634 -3131 -9408
6330 -9408 -9347 -6718 -2886 -2871 -6993 -783 4322 -1331 299 10190 -185 1306 4190 9246 -1073
6315 -1073 -25824 -35520 -37188 -27630 -24731 -15410 4521 1465 -8185 3857 20270 42003 28204
6302B8204k1568q810R250M235p79l282k651q777o122k475m981k877R405O561j016
6287e683j0292m304M41K958R463K182J0170P893n298K790Q851m509q908N718k41
6272A1231j2794p041n188m202q507m670Q898L565m298p966q0K4437L200M93j884
6257d806J0003j245q044J0910P392j1779r970m644r065L190R057M65K016q395
6243a4915k077J2658O427J5852j946J3416m169j0413j493k365l770j954P169j0092
6229B328n800n760M321N290m887j991o170O155Q821L369K517k867N781O939K576
6214B0622q610q976q102k461k250L611J005l327K642O755K703O210l670j0681
6200d529L39M68Q878K977O461k515j2443l539l974m058p082r8o136m906J3692
$$ plain form
6302 28204 6636 -2174 7076 11311 10532 7250 4599 -4178 -10300 -12775 -17756 -20633 -11228 -4667 -5683
6287 -5683 -15975 -20279 -19838 -16880 -7417 -5235 4935 12828 7530 10320 19171 14662 5754 11472 11231
6272 11231 -1563 -8604 -13792 -17994 -26501 -31171 -22273 -18708 -23006 -30972 -31052 -6615 -3415 -2922 -4806
6257 -4806 5197 3952 -4092 6818 14210 2431 -7539 -12183 -21248 -18058 -9001 -8536 -6520 -14915
6243 -14915 -16992 -4334 2093 17945 15999 29415 25246 14833 13340 10975 7205 5251 12420 2328
6229 2328 -3472 -9232 -4911 379 -4508 -6499 -12669 -6514 2307 5676 8193 5326 11107 18046 20622
6214 20622 12012 3036 -5066 -7527 -9777 -6166 -5161 -8488 -5846 909 3612 9822 6152 -4529
6200 -4529 -4190 -3722 5156 8133 14594 12079 -364 -3903 -7877 -11935 -19017 -19115 -25251 -30157 -16465
6185a6465M005K648r53O020M432N006o21r416o768J587P463L600p26J6529r172
6170G169j3777j2153j3212R948J2805N094j447R39j04N615J576K279O126j5976
6156e118j1398O017J6573P813j4812o721L273J3277j42k030P607j2365j874P608
6142G708m404J2877k6j9378q903L866P219N65O000K971p774r837M660n093R96
6127h553N243o57n054Q792J1622k81j2413j2237L650J997J6766P808j0373Q758
6113A5068q043r839r591m971M388K471n0m537J607J4111P289o27n878N325l432
6098C291K544R040j2152m774M389l119R355N499J5075o108j4062j0736l544M096
6084a206O192q214p720J3193l574j7243j784Q708J1745q429L317Q389n770j847
$$ plain form
6185 -16465 -12460 -9812 -10765 -4745 -313 4693 4072 -5344 -12112 -10525 -3062 538 -188 16341 7169
6170 7169 -6608 -18761 -31973 -22025 -9220 -4126 -5573 -4634 -4738 877 2453 4732 10858 -5118
6156 -5118 -16516 -10499 6074 13887 -925 -7646 -4373 8904 8762 6732 14339 1974 100 7708
6142 7708 3304 16181 16155 -3223 -12126 -8260 -1041 -476 5524 8495 721 -9116 -4456 -9549 -8553
6127 -8553 -3310 -3967 -9021 -229 11393 11112 -1301 -13538 -9888 -7891 8875 16683 6310 15068
6113 15068 7025 -2814 -12405 -17376 -12988 -10517 -10567 -15104 -13497 614 7903 7276 1398 6723 3291
6098 3291 5835 14875 2723 -2051 2338 -781 8574 14073 29148 23040 8978 -1758 -5302 -1206
6084 -1206 4986 -3228 -10948 2245 -1329 -18572 -20356 -11648 97 -8332 -5015 3374 -2396 -4243
6070d243L664M125N221o831j368o164J1948K0442j576k0521j0984Q492J895j1963
6056g863j3839J504J0893O536K450j6373K2J2544N752P536K049Q270P70n362o634
6041H255j0144j2154j252N561l700R643p5Q48k028o162p04R03k709q597n157n257
6025c2729M151P175j361J669N748J5470j885q018o825P350j301n22J3793M007
6011F722j1285J902j8467N227L548l423P467J1154J6554K666q731n055j0495p088
5997i304j182n517l445N856J3086K517j898M942n50q390k315L759L434J5223p958
5982H258N679j357o079m019J577P361L53M392k980j0777P479K858j2540p908r108
5967a6811j7009K178K542o411O523l459K394R413Q824K01O577l055Q790n52j3807
$$ plain form
6070 -4243 -579 3546 8767 1936 568 -5596 6352 26794 25218 4697 -6287 2205 4100 -7863
6056 -7863 -21702 -20198 -9305 -2769 -319 -16692 -16670 -4126 1626 9162 11211 19481 20251 14889 8255
6041 8255 -1889 -14043 -15295 -9734 -13434 -3791 -3866 -3018 -5046 -11208 -11912 -11009 -13718 -22315 -27472 -32729
6025 -32729 -28578 -21403 -22764 -21095 -15347 123 -1762 -9780 -16605 -9255 -10556 -11078 2715 6722
6011 6722 -4563 -2661 -21128 -15901 -12353 -15776 -8309 2845 19399 22065 13334 8279 -2216 -9304
5997 -9304 -10486 -16003 -19448 -13592 -506 2011 113 5055 4505 -3885 -6200 -2441 993 16216 8258
5982 8258 13937 12580 6501 2482 4059 11420 11773 16165 13185 2408 9887 12745 205 -7703 -16811
5967 -16811 -33820 -31642 -29100 -35511 -28988 -32447 -30053 -20640 -11816 -11615 -5038 -8093 697 145 -13662
5952a3662K100l186O738j6596j086J4747K2276N133O017L056j2873k6848r021
5939b3205J2333l15q616P154J4482k827m473J856n067O873P099j0861R665J6682
5925B0780j5013j8559p814j2638J2329J6998o836M637L075J013N996J997q074
5912b109J3263n710r303L407m077n932N294o768P698R43j6344Q127M977J309m719
5897i944R295R977m352q537j2294p505J2142o47N434j913L936N474J926j0288
5883g296j891L086m029j72N037l392J012l939M964K1880j0740k5258m334L632
5869b1440N175P450L343O411N959N077L951M91l328l5J0655n460R182M825j1687
5854B0569j1482n864K53R665o452j2411m991J1624J860K913O763P98N360j7476
$$ plain form
5952 -13662 -11562 -14748 -8010 -24606 -25692 -10945 11331 16464 22481 25537 12664 -14184 -23205
5939 -23205 -10872 -11187 -19803 -12649 1833 -994 -5467 -3611 -8678 -1805 5294 -5567 4098 20780
5925 20780 5767 -12792 -20606 -33244 -20915 -3917 -10753 -6116 -3041 -2028 3968 5965 -2109
5912 -2109 11154 5444 -3859 -452 -4529 -10461 -5167 -11935 -4237 -3294 -19638 -11511 -6534 -5225 -9944
5897 -9944 -649 9328 4976 -3561 -15855 -23360 -11218 -11865 -6431 -8344 -4408 1066 2992 -7296
5883 -7296 -9187 -6101 -10130 -10302 -5265 -8657 -7645 -11584 -6620 15260 4520 -20738 -25072 -21440
5869 -21440 -16265 -8815 -5472 939 6898 11975 15926 16417 13089 13054 23709 18249 27431 32256 20569
5854 20569 9087 3223 3476 13141 6689 -5722 -10713 911 2771 5684 12447 13245 18605 1129
5840A129j22K101j4809p135N841o201j1010K250K971J1367J0796l01j917m178
5826i218o272J70O723J5720K975n136m845l137N303J540J390L979K313o784k712
5811B009N682l040m030r236k343p609K388N480N259j0905o300m055K644j361n896
5796c1313m18J3609M763q764j0350N988o70k055K2834J9264j482o373j2032M75
5782f524P007k290l388J3020P815O013k0247k328M086j9703k0818K706J826J0661
5768b2164K1249L098q723j1909j0283j65j0338j0608l89J0810J8087J2579L239
5755e517J1771o21j465M922j1371k4010k62J117j7759J3835K2235R582L930j680
5741D707j628j602n935O537k815j949M405J539m933n313O005j1270n59J0367o841
$$ plain form
5840 1129 1007 3108 -11701 -18836 -12995 -19196 -30206 -27956 -24985 -13618 -2822 -3123 -5040 -9218
5826 -9218 -15490 -15320 -8597 7123 10098 4962 117 -3020 2283 3823 5213 9192 11505 4721 2009
5811 2009 7691 4651 621 -8615 -10958 -18567 -16179 -10699 -5440 -16345 -22645 -26700 -24056 -25417 -31313
5796 -31313 -31731 -18122 -13359 -22123 -32473 -26485 -27155 -29210 -6376 12888 11406 5033 -6999 -6524
5782 -6524 483 -1807 -5195 7825 15640 21653 1406 -922 3164 -16539 -37357 -34651 -32825 -22164
5768 -22164 -915 2183 -6540 -18449 -28732 -28897 -39235 -49843 -50232 -39422 -21335 -8756 -5517
5755 -5517 6254 5633 4168 9090 -2281 -26291 -26553 -25436 -43195 -29360 -7125 2457 6387 4707
5741 4707 3079 1477 -4458 2079 -736 -2685 1720 3259 -1674 -6987 -982 -12252 -12811 -2444 -9285
5726i285R375k940k513J2459k626l701k0512p946r76N474j0465O416K0958k974
5712i256N054k437j931O586j887m377N55k106m955K2111O528k031j1353j2822
5698a2321n014M691l184l050K549P452P605r159J018n881q574L241J395O720J3953
5683A441Q13K0j1835j6526k445N202O902K0134J272K796j0363R100m426j3316
5669a1231R63m303p81R771n472J3947P563m647j6026j7009P49J3760J2125K878
5655B287q507o015M952L062K366p074J0340J088n180j1660K889J7043K272m383
5641C480J3191M327j3313o327r793J2610K696j3430j328K602J1225O236J2385
5628B4561M395K126J713k7304l796J0353J2332j281o309p223k765L771j276J656
$$ plain form
5726 -9285 90 -2850 -5363 7096 4470 769 -19743 -27689 -28665 -23191 -33656 -27240 -6282 -9256
5712 -9256 -4202 -6639 -8570 -1984 -3871 -8248 -7693 -9799 -14754 7357 13885 11854 501 -12321
5698 -12321 -17335 -12644 -15828 -18878 -16329 -8877 -1272 -10431 -9413 -15294 -23868 -20627 -19232 -12512 1441
5683 1441 2254 2274 -9561 -26087 -28532 -23330 -16428 3706 4978 7774 -2589 6511 2085 -11231
5669 -11231 -10268 -14571 -15352 -5581 -11053 2894 10457 5810 -10216 -27225 -26476 -12716 -591 2287
5655 2287 -6220 -12235 -7283 -4221 -1855 -8929 1411 2499 -2681 -14341 -11452 5591 7863 3480
5641 3480 16671 20998 7685 1358 -8435 4175 6871 -6559 -7887 -5285 5940 12176 24561
5628 24561 28956 31082 32795 5491 1695 12048 24380 23099 16790 9567 6802 10573 9297 10953
5614A0953J4328J588j3830j943n471j3932P232j1879J0218p133j069R098J0671
5601H831j5848m902L528O607K555K689m47j4967k232p52L536P559j131J0561K264
5586G851r076P888l089J803K249j5189r996Q457n591K587K4008M07j3210n327
5572f228j1126N598J889O980m884p456M021J1212o32j441J3652J1195n892j3311
5558C577k0210m093j18J220j3085n289O680J9585Q877j965p435M735K818K957
5544a746q23R261N311J5516k60k4668j1715j2872Q859K338J8330j719n012n741
5530d941J5392M693k0159n372q998J105K6547J101q130j1703j179j349r463P140
5516a5316J2005N163l824K832Q78n748M486o164r792J1906J6046K642K845K720
$$ plain form
5614 10953 25281 26869 13039 11096 5625 -8307 -1075 -12954 -2736 -9869 -10938 -1840 8831
5601 8831 -7017 -11919 -8391 -1784 771 3460 3013 -11954 -14186 -14938 -11402 -3843 -4974 5587 7851
5586 7851 -1225 6663 3574 5377 7626 -7563 -17559 -9102 -14693 -12106 11902 12309 -901 -6228
5572 -6228 -17354 -11756 -9867 -2887 -7771 -15227 -11206 6 -626 -2067 11585 22780 16888 3577
5558 3577 -16633 -20726 -20844 -19624 -32709 -37998 -31318 -11733 -2856 -4821 -12256 -7521 -4703 -1746
5544 -1746 -2569 6692 12003 27519 27259 2591 -9124 -21996 -13137 -10799 7531 5812 800 -4941
5530 -4941 10451 15144 -5015 -10387 -19385 -18280 8267 9368 1238 -10465 -11644 -12993 -22456 -15316
5516 -15316 -3311 1852 -1972 860 1738 -4010 476 -5688 -15480 -3574 12472 15114 17959 20679
5502B0679j149j1942j7280M479N381q486p142J8929J9487P052j137m531o852p254
5488A0234j400R140q40k556m702r171l820k2003j24P878N144J0465M188J4020
5474A6453K3349o683j2546r331n180o956J839J474J707j3788j0872O985R210Q200
5460C861P205J608K17j080j5395M448J2240q89p129k941J686o529j6050k88J0166
5445h870O810j2987n938Q330M340l136k321J1239P926k5769m224J3073M324Q425
5431A222J472M800O444j2500j1090Q990R678q813o017L082L676j2745O337J704
5417c760n990J458l356n011J081R90J0130N198o96J843N145n665L801j4055K507
5402f380N901j133l192k766K802r155K168R350K35j5517P850K164k826k73k716
$$ plain form
5502 20679 19530 7588 -9692 -5213 168 -8318 -15460 3469 22956 30008 28871 24340 17488 10234
5488 10234 8834 17974 17134 14578 9876 705 -3115 -25118 -25242 -17364 -12220 -1755 2433 16453
5474 16453 39802 33119 20573 11242 6062 -894 945 2419 4126 -9662 -20534 -13549 -4339 3861
5460 3861 11066 12674 12891 11811 -3584 864 13104 12215 5086 2145 3831 -2698 -18748 -19036 -8870
5445 -8870 -2060 -15047 -20985 -12655 -8315 -11451 -13772 -2533 5393 -20376 -24600 -11527 -7203 1222
5431 1222 2694 7494 13938 1438 -9652 -662 9016 203 -5814 -2732 944 -11801 -5464 -3760
5417 -3760 -9750 -8292 -11648 -16659 -15578 -14588 -4458 740 44 1887 7032 1367 5168 -8887 -6380
5402 -6380 -479 -1612 -4804 -7570 -4768 -13923 -11755 -2405 -2170 -17687 -9837 -7673 -10499 -10772 -13488
5387a3488r403K439J2539k757j3531O910J4738N567m16M412r928n512j1638K791
5373a7277n272J6226J39O357O743Q67K403j303O269k643m004J4988j6177k5673
5359a8357j0276l958Q138J1330M456r943j598O644j3468j9128Q74l827J4422J8105
5345a6586J7368R093j9548K070r609j5036L778n030r982J4210J5771J1651K310
5332D60P457J370j0073r184O33M974Q246O159j8043j514k07j7444K1891P306j5953
5317a3922n262L562N170M746p33r48M007j0041r674m955J7371N53j6146l661p390
5302c7323J3435L080J5543R179k218j858n985r72k598P801J984p359q246j0100
5288b5637p448p792R087K1654N325J501j044P996J421Q087j158l824r55J125k842
$$ plain form
5387 -13488 -22891 -20452 -7913 -10670 -24201 -17291 -2553 3014 2598 7010 -2918 -8430 -20068 -17277
5373 -17277 -22549 -6323 -6184 173 6916 7783 10186 8883 15152 12509 8505 23493 7316 -18357
5359 -18357 -28633 -32591 -24453 -13123 -8667 -18610 -20208 -13564 -27032 -46160 -45286 -49113 -34691 -16586
5345 -16586 782 9875 -9673 -7603 -17212 -32248 -28470 -33500 -43482 -29272 -13501 -1850 460
5332 460 7917 9287 -786 -9970 -9337 -4363 3883 10042 -8001 -9515 -9722 -27166 -5275 2031 -13922
5317 -13922 -19184 -15622 -10452 -5706 -6439 -7387 -3380 -13421 -23095 -28050 -10679 -10126 -26272 -29933 -37323
5302 -37323 -23888 -20808 -5265 3914 1696 -162 -6147 -7119 -9717 -1916 68 -7291 -15537 -25637
5288 -25637 -33085 -40877 -31790 -10136 -4811 -3310 -4354 3642 5063 13150 11992 8168 7213 8338 5496
5273E496q224J4489n41j9601M356O471J1291r561r866r30L86N154l100p835J3745
5258A730l012k0J13O327P320j614j0691o710L891k0010j5787Q747J9618K2325
5244A2227j3251j684Q378l114j0885j0075j275N009N126j5442o023R433N644q792
5230b4724l837J9941O555J0260J2820O307j0491n239j7388k987j0985q338R114
5217a8992l300M328j045q869J7993J9379j0436r545J4915O820K195J621J690L552
5203B0306q633l543K950j673J1217L556O46p790q421O04j990k0766j1503J2627
5189a2413P193O537K293J1734O230L337p801k921k6000n226J4964J0698j983p818
5175a176j3777N83N840N155J1122l146j2173k458Q291k700O482Q449O868J5451
$$ plain form
5273 5496 -2728 11761 11220 -8381 -4025 2446 13737 4176 -5690 -6620 -6234 -1080 -4180 -12015 1730
5258 1730 -1282 -1302 -1189 5138 12458 10844 153 -6557 -2666 -22676 -38463 -29716 -10098 12227
5244 12227 -1024 -2708 5670 2556 -8329 -18404 -19679 -14670 -9544 -24986 -31009 -21576 -15932 -24724
5230 -24724 -28561 -8620 -2065 8195 21015 27322 16831 11592 -5796 -8783 -19768 -28106 -18992
5217 -18992 -22292 -17964 -19009 -27878 -9885 9494 -942 -10487 4428 11248 13443 15064 16754 20306
5203 20306 11673 8130 11080 9407 20624 24180 24826 17036 8615 9219 7229 -13537 -25040 -12413
5189 -12413 -5220 1317 3610 15344 21574 24911 17110 14189 -11811 -17037 -2073 8625 6642 -1176
5175 -1176 -14953 -14370 -8530 -3375 7747 4601 -7572 -10030 -1739 -4439 2043 10492 17360 32811
5161C2811m718j6256l202j3302K808J4436j2067j8763j9652J3095M579o141L361
5148b3011K238n242J3911Q073m198M365p389k774K040K223J3251o824r263j986
5134a4586J0248j4371p127k686R062J2342M258j0791o930J1415J5755k924k997
5121F68J3617O257k1392j4331N829j123Q317O60J105Q008k033O418k123j3545
5107c668j651O48O373q580q29J14J0091m82j7783J164Q401p274J78m728p786N781
5091b0031J4278K1234p749p111m469o602O454j2705m406J1488K1156O780j7737
5078E80k2493j016K3769J6622l255j1601j0551M267k245j1130k086L262R318J0500
5064C941P96q283j3718k884O012J0863J1942l034j6320j0431j752P303L027r751
$$ plain form
5161 32811 28093 11837 8635 -4667 -1859 12577 510 -18253 -37905 -24810 -20231 -26372 -23011
5148 -23011 -20773 -26015 -12104 -4031 -8229 -3864 -11253 -14027 -11987 -9764 3487 -3337 -12600 -14586
5134 -14586 -4338 -18709 -25836 -28522 -19460 -7118 -2860 -13651 -20581 -9166 6589 3665 668
5121 668 14285 20542 -850 -15181 -9352 -10475 -2158 -1498 -393 7615 5582 12000 9877 -3668
5107 -3668 -5319 -4671 1702 -6878 -7707 -7593 2498 2016 -15767 -14603 -6202 -13476 -13298 -18026 -25812 -20031
5091 -20031 -5753 15481 7732 621 -3848 -10450 -3996 -16701 -21107 -9619 11537 18317 580
5078 580 -21913 -22929 840 17462 14207 2606 -7945 -3678 -5923 -17053 -19139 -15877 -6559 3941
5064 3941 4737 -3546 -17264 -20148 -14136 -3273 8669 5635 -10685 -21116 -22868 -15565 -12538 -22289
5050b2289j20J5654P358N278l579l36o855j3754n416k175j679K1877O783l208
5036b461p39J1522K575j1442n977K441O635n786O178N446l075K682r701m042K160
5021c584J8730j6j5198j3153P44J153M969O875Q882R376l543m583N964o681r548
5006C87K727j2857j685O726M034J2568L555n926p209J632r143m029M654N016n743
4991e293r185n387q2J7097J2866j6215q809N101L133K5012k66j8972R631j96j0539
4976b104l212J431O689n743o899Q936J0417J0898j0651j1148R920k383L666l404
4962F413j5677l659m680J683O804N702M687k580L125P127j373P71P055J95o436
4947I157L450O360l441N84j0680r070k008l991n280N926J3274l216l396L689n775
$$ plain form
5050 -22289 -22409 -6755 603 5881 2302 1966 -4889 -18643 -24059 -26234 -27913 -6036 747 -2461
5036 -2461 -3200 8322 10897 -545 -6522 -4081 2554 -3232 2946 8392 5317 7999 -1702 -5744 -3584
5021 -3584 15146 15130 -68 -13221 -12477 -11324 -6355 520 9402 18778 15235 10652 16616 9935 387
5006 387 3114 -9743 -11428 -4702 -668 11900 15455 9529 2320 3952 -5191 -9220 -4566 450 -5293
4991 -5293 -14478 -19865 -19947 -2850 10016 -6199 -15008 -9907 -6774 18238 17972 -1000 8631 8435 -2104
4976 -2104 -5316 -3885 2804 -2939 -9838 -902 9515 20413 9762 -1386 8534 6151 9817 6413
4962 6413 -9264 -12923 -17603 -15920 -9116 -3414 1273 -1307 1818 8945 7572 8343 15398 15593 9157
4947 9157 12607 18967 15526 16110 5430 -3640 -5648 -9639 -14919 -8993 4281 1065 -2331 1358 -4417
4932d417j0042N749J1296N927m071j0989n232r714J0469J3813J937O169j2132
4919a237k0083q805J6830K0522k747L179P09r493m896k123p601J9323j61R68L90
4904D775j5141k42J9664N036k047n809o75j2874l425K873l523q396r056J54J6719
4889a1967K2931O321J866j625r305n251J40l195l381M734j058l066L896Q278m85
4874H833j086j270n500j3357l840Q583n698p072P982N934L287r200O389O14j134
4859f535l702J7222K4751p274p798o68j2130r117K840J337k867q6J113O176m369
4844a107j5149P017J3034K046k537N70K456P116j7812l036R91r686m905L169n769
4829b3602q596m098J5195J8394l052R171K872q625J0031Q559q004j1021P23J637
$$ plain form
4932 -4417 -14459 -8710 2586 8513 4442 -6547 -11779 -21493 -11024 2789 4726 10895 -1237
4919 -1237 -21320 -30125 -13295 7227 4480 7659 8368 -1125 -6021 -8144 -15745 3578 3417 4385 4775
4904 4775 -10366 -10608 9056 14092 12045 6236 5561 -7313 -10738 -7865 -11388 -19784 -28840 -28686 -11967
4889 -11967 10964 17285 19151 17526 8221 2970 3110 -85 -3466 1268 210 -2856 1040 9318 8833
4874 8833 7747 6477 977 -12380 -16220 -7637 -13335 -20407 -12425 -6491 -3204 -12404 -6015 -5401 -6535
4859 -6535 -10237 6985 31736 24462 16664 15996 3866 -5251 -2411 -1074 -3941 -4027 -2914 3262 -1107
4844 -1107 -16256 -9239 3795 5841 3304 3874 6330 13446 -4366 -7402 -6411 -16097 -21002 -17833 -23602
4829 -23602 -32198 -36296 -21101 -2707 -5759 3412 6284 -2341 7690 16249 8245 -2776 -2053 -416
4815d16j2041k610M608o790J005j810Q132N027Q199O123k4608q610K2937p727
4801h581j1846R968j1727k212M277n03O797P705L207m289n151m352j1988j723
4787c0418J3564J9264J3007q593J974j9743r275J5214j0407q556J1684j271o200
4774a9756q33j74M796J1554J060l034j9676K33J3118O736J0347n223m288P993
4760B853q912K171L121K508N503r544Q908r352r997J1174p326j0415K214n60r310
4745b6964J253J065l67K942m376k186k246K6902J8547K80o021o140k12K174l906
4730G45m666M734m236P848R255O411j7801n568J0397q113p624n430R685k507J2105
4715E235m833o003J500R63m160p305M147o667K009J1842k885N137P664j1804q577
$$ plain form
4815 -416 -12457 -15067 -10459 -17249 -16244 -18054 -9922 -4895 3304 9427 -15181 -23791 -854 -8581
4801 -8581 -20427 -10459 -22186 -24398 -20121 -20624 -13827 -6122 -2915 -7204 -12355 -16707 -28695 -30418
4787 -30418 -16854 2410 15417 6824 8798 -10945 -20220 -5006 -15413 -23969 -12285 -13556 -19756
4774 -19756 -20589 -20763 -15967 -4413 -3353 -6387 -26063 -25830 -12712 -5976 4371 -852 -5140 2853
4760 2853 -6059 -3888 -767 1741 7244 -2300 6608 -2744 -12741 -1567 -8893 -19308 -17094 -17654 -26964
4745 -26964 -25711 -24646 -25013 -22071 -26447 -28633 -30879 -3977 14570 14850 8829 2689 2477 4651 745
4730 745 -3921 813 -3423 4425 13680 20091 2290 -3278 7119 -994 -8618 -14048 -4363 -6870 5235
4715 5235 402 -5601 -4101 -3138 -7298 -14603 -10456 -17123 -15114 -3272 -6157 -1020 6644 -5160 -13737
4700a3737L881J4439J8314j810N613m037j0698p073o427j0414j213L028J2407
4687B273Q158j3977j9357M10o373M213K670O561O646k10J0071q177r947K549Q851
4672e639J4635l624r258K798k854j5005Q136P19N24J0741K016J539o705j4807
4658a6784P951N547j1421M504p256k2813j364K1938R94j979m248Q189P668k532
4644a1606Q364J5568Q331q215k9010n887k477L733J7619l042j6038Q661K0970
4631F971n93j1878L43j4661p910R666Q448M646o646j0267R503q76j1826j812R403
4616a7489M299P441N62p497l558Q607M938j2649M643p83K57J2104J750l472M549
4601C702j101j132r457Q381l088L407q50j3723p976r200j414J0199J2905J0708
$$ plain form
4700 -13737 -9856 4583 22897 21087 26700 22663 11965 4892 -1535 -11949 -13162 -10134 2273
4687 2273 10431 -3546 -22903 -22493 -28866 -24653 -21983 -15422 -8776 -8986 1085 -7092 -17039 -14490 -5639
4672 -5639 8996 5372 -3886 -1088 -3942 -18947 -10811 -10092 -9568 1173 3189 4728 -1977 -16784
4658 -16784 -8833 -3286 -14707 -10203 -17459 -40272 -41636 -19698 -18704 -20683 -24931 -16742 -9074 -11606
4644 -11606 -3242 12326 20657 12442 -16568 -22455 -24932 -21199 -3580 -6622 -22660 -13999 6971
4631 6971 6378 -5500 -5157 -19818 -27728 -18062 -9614 -4968 -11614 -21881 -12378 -13254 -25080 -26892 -17489
4616 -17489 -13190 -5749 -5187 -12684 -16242 -7635 -2697 -15346 -10703 -11486 -11229 875 2625 -847 3702
4601 3702 2601 1469 -7988 393 -2695 712 -138 -13861 -21837 -31037 -32451 -22252 -9347 1361
4587A361l42o212k205M670m44N357Q789m062j6845n156o053R706J1932j0005K487
4572g022P998N711j804N545q327L296J0138L894j0668j7416O584J0785j6702j6689
4558b4677N708P059J5322J213n576m739J695k127M013M353J772K091M388k0801
4544a0306q012N917j4232P244K498J7424q184l004P73M745P709J4672j093j0963
4530E188j7461K721m552J699J2822J1176j162l434Q747j6571m560m929L388l527
4516a0455j170j5614k601J1116J1338K0309N03o143r822j6428N797N841J0618
4503C289l255p023l015J3106K0666j1486j5555n497M657o277j049J4869Q012l492
4489G950q530q006P6m696j364L494J3393J9231j1283j3524j3124j0116O827N831
$$ plain form
4587 1361 1019 -5193 -7398 -2728 -3172 2185 10974 6912 -9933 -15089 -21142 -11436 496 -9509 -7022
4572 -7022 976 6687 4883 10428 2101 5397 15535 19429 8761 -8655 -2071 8714 -7988 -24677
4558 -24677 -18969 -11910 3412 4625 -951 -5690 -3995 -6122 -2109 2244 4016 6107 10495 -10306
4544 -10306 -18318 -12401 -26633 -19389 -16891 533 -7651 -10655 -9882 -5137 2572 17244 16151 5188
4530 5188 -12273 -9552 -14104 -12405 417 11593 10431 6997 15744 -827 -5387 -10316 -6928 -10455
4516 -10455 -11625 -27239 -29840 -18724 -7386 12923 13426 7283 -2539 -18967 -13170 -7329 3289
4503 3289 34 -6989 -10004 3102 23768 12282 -3273 -8770 -4113 -10390 -11439 3430 11442 7950
4489 7950 -580 -8586 -8510 -13206 -14570 -11076 2317 21548 10265 -3259 -16383 -26499 -19672 -13841
4475a3841K636O553l049j7601Q133J4695o671K240l507P242o125K705j594o28
4461h812m082o23K034k147l870K912O483o034P920J1547k536n701l565Q891m735
4446b318o390O619Q568j4215j0668R560J925K39L552j40k757j775l484R033J6643
4431A4392K777p579j1756K458o847r465p450J730K3398n275q036n2J5021J4671
4417A7987L75r718o362j0218q187O186J1965n319l925N032N45q860K791Q813K013
4402C118p29l806j2790k463M432K24L581J801o35P527m578l435l310O663k476
4387f876m421p601L095M28k5058J1379M55n603k86J2201J3405L685Q066K0132
4373B3001j14l967j4274j9891k777Q201J863k277J0012K0353O264o082l956j8193
$$ plain form
4475 -13841 -11205 -4652 -7701 -25302 -17169 -2474 -9145 -6905 -10412 -3170 -9295 -6590 -8184 -8812
4461 -8812 -12894 -13517 -11483 -13630 -17500 -14588 -8105 -14139 -6219 5328 2792 -2909 -6474 2417 -2318
4446 -2318 -8708 -2089 6479 -7736 -18404 -8844 -6919 -6680 -3128 -3268 -6025 -7800 -11284 -2251 14392
4431 14392 17169 9590 -2166 292 -6555 -16020 -23470 -21740 1658 -3617 -11653 -11705 3316 17987
4417 17987 18362 8644 2282 -7936 -16123 -9937 2028 -3291 -7216 -2184 -1639 -10499 -7708 1105 3118
4402 3118 2389 -1417 -14207 -16670 -12238 -12014 -8433 -6632 -7267 260 -4318 -7753 -11063 -4400 -6876
4387 -6876 -11297 -18898 -15803 -15375 -40433 -29054 -28599 -34202 -34488 -22287 -8882 -5197 2869 23001
4373 23001 22887 18920 4646 -15245 -18022 -9821 -7958 -10235 -223 20130 26394 20312 16356 -1837
4359a837k286r712k871k552J2431J0426k848L493m520k387J246p773M887J1700
4345G397M420j3434j9381n89o974Q417j269J3008R981M715R366j8375J859J0219
4331I360j628O644O955j0892j0893l454j382L744K792j162q877J2407J0361R351
4317B3326q880r902j2899m765P704j5250o909O214J3795k969M554j831j3032Q789
4303a2055J4402j47j3015m237J0782K3278R39q635m969p762K850m261J0951P989
4289A6110k68j042L960n769p30k883j428q549J150O001l176j616Q61J3317P675
4274B3613J0208m902m710n992r99r30o874N262k027k3013j5681l134J5646L413
4260a0120J4851J0125r441M084k404j2495m434m315O11j2049R38J0248K2147P548
$$ plain form
4359 -1837 -4123 -13835 -16706 -19258 -6827 3599 751 4244 -276 -2663 -1417 -9190 -4303 7397
4345 7397 11817 -1617 -20998 -21587 -28561 -20144 -21413 -8405 1576 6291 15657 -2718 -859 9360
4331 9360 7732 14376 21331 10439 -454 -3908 -5290 -1546 1246 84 -8793 3614 13975 23326
4317 23326 14446 4544 -8355 -13120 -5416 -20666 -27575 -21361 -7566 -10535 -5981 -7812 -20844 -12055
4303 -12055 2347 2200 -10815 -15052 -4270 19008 19947 11312 6343 -1419 1431 -2830 8121 16110
4289 16110 15842 14800 18760 12991 12261 9378 7950 -599 551 6552 3376 1760 2621 15938 23613
4274 23613 33821 28919 24209 18217 17218 16288 9414 14676 12649 -10364 -26045 -29179 -13533 -10120
4260 -10120 4731 14856 5415 9499 7095 -5400 -9834 -14149 -13538 -25587 -24649 -14401 7746 15294
4246A5294q765j554j5313O871Q889P714J0242m588k6229q970Q52J4583J3789l156
4232I659p345j691J419j621q541j5632K486L654K469P98L77j3651M940J7571n140
4217a0248M553Q384L30K637l942j0404l095J930N132J0424L096M298n515j9916
4203a2336j0270L848P37J1317m470m609J203K639M591M247j0882J558J2447k51
4189b31J1892m366q660l647p202N435N123j4198n779j265J2677J651l131m971
4175a6672k261R611R60J422q78K239L726K457O010L409p017M855K524j08j0152
4160A25j1638O111O750o830P002L965K739o85L559l004j0471O237N71O249P954
4145A8634Q70j0822M433K378o102j5783j5971J4435J983l965n098p714M821J2890
$$ plain form
4246 15294 6529 4975 -10338 -3467 5422 13136 23378 18790 -7439 -16409 -15557 -974 12815 9659
4232 9659 2314 623 2042 421 -8120 -23752 -21266 -17612 -15143 -14345 -13968 -27619 -22679 -5108 -10248
4217 -10248 -5695 2689 3019 5656 1714 -8690 -11785 -9855 -4723 5701 8797 13095 7580 -12336
4203 -12336 -22606 -18758 -18021 -6704 -11174 -15783 -14580 -11941 -7350 -3103 -13985 -12427 20 -231
4189 -231 11661 7295 -1365 -5012 -12214 -6779 -1656 -15854 -21633 -22898 -10221 -8570 -11701 -16672
4175 -16672 -18933 -9322 -8362 -6940 -7818 -5579 -1853 604 6614 10023 3006 7861 10385 10277 125
4160 125 -11513 -5402 1348 -5482 1520 5485 8224 7539 11098 8094 -2377 3860 4431 10680 18634
4145 18634 19504 8682 13115 15493 9391 -6392 -22363 -7928 -5945 -9910 -15008 -22722 -17901 -5011
4131e011L167P466r735n239J3109Q720q307k452K000j645K114j3093o254N96O44
4116a3920K894P18K895L265l301K194Q935l150o746O137p040j1793L300l921l48
4101a9881p907R857j3250r041R013J1037M959P700J3575M058J2720o644j5457
4088G39m472k9m609j3332K79O958J6833M462q389n643m670R361Q254O241O864
4073A8847k420o452m171j127p37J2223q47j6992k888q587Q274K5793J1631k0517
4059A2030r634J471n776k0388O727Q574M388P414M176q29J838k914r85j5102j3351
4044b2361M362o293J057K9869J0428o161j4605q75R379M42J1181J746j7282L414
4030D301l277r114P175J1884L132L83J4402N795q415k649p306j3025n950P15o010
$$ plain form
4131 -5011 -1844 5622 -4113 -9352 3757 12477 4170 1718 3718 2073 4187 -8906 -15160 -14564 -13920
4116 -13920 -11026 -10308 -7413 -4148 -7449 -5255 3680 530 -6216 -79 -7119 -18912 -15612 -19533 -19881
4101 -19881 -27788 -17931 -31181 -40222 -31209 -20172 -15213 -7513 6062 10120 22840 16196 739
4088 739 -3733 -3762 -8371 -21703 -21424 -14466 2367 6829 -1560 -7203 -11873 -2512 5742 11983 18847
4073 18847 16427 9975 5804 4677 3940 16163 15316 -1676 -4564 -13151 -4877 20916 32547 12030
4059 12030 2396 3867 -1909 -22297 -15570 -6996 -2608 4806 8982 8153 9991 7077 6092 -9010 -22361
4044 -22361 -17999 -24292 -23235 6634 17062 10901 -3704 -4579 4800 5242 16423 18169 887 4301
4030 4301 1024 -8090 -915 10969 14101 14484 28886 34681 26266 23617 16311 3286 -2664 -1949 -7959
4015g959j1741J2520K1282r760j1589K723J0666N380j3459j4402q824J8801m08
4002f770O31R308J0886n191j3919j3860L991O525p338J029J4342P42j3344j988
3988a4956j844M637l157j2689K48N198J6519L951n17o082o019J9976J9613J357
3974B6235p042j4109j003J4216m977m222r017J783P270M463N313O078p323j4664
3960C001q853M64j1970j4525O234K876j1397n398L168K0660K2706L425j458J0113
3946A9046Q948j3745j1221J864m843o418j10J7734K796j1503k604N171O59J405
3932G179J238m073L90k2404K423J6509P919J2934K23k0167l79K443k1038p000
3918b3803R701N683j0697r53N618o10L039m245j0891j8391M549R119q04Q302M635
$$ plain form
4015 -7959 -19700 -7180 14102 4342 -7247 -4524 6142 11522 -1937 -16339 -25163 -6362 -6770
4002 -6770 -6139 3169 14055 8864 -5055 -18915 -14924 -8399 -15737 -14708 -366 376 -12968 -14956
3988 -14956 -16800 -12163 -15320 -28009 -27761 -22563 -6044 -2093 -2610 -8692 -14711 5265 24878 26235
3974 26235 19193 5084 4081 18297 13320 9098 81 1864 9134 13597 18910 24988 17665 3001
3960 3001 -5852 -5388 -17358 -31883 -25649 -22773 -34170 -39568 -36400 -15740 6966 10391 8933 19046
3946 19046 27994 14249 3028 4892 49 -6369 -6479 11255 14051 2548 -56 5115 5774 7179
3932 7179 8417 4344 4734 -17670 -15247 1262 9181 22115 22338 2171 1792 4235 -16803 -23803
3918 -23803 -14102 -8419 -19116 -20069 -14451 -15061 -12022 -16267 -27158 -45549 -41000 -31881 -32685 -24383 -19748
3903a9748P619J4697j0323q324m421j329n533M540J4842Q376j3730N290J0444
3890B400J725j0219o380L086P604L12J1016K776j4567r814l049j373J4559J6655
3876A4731m678j1260q901j3042M916K2214Q504l392j5352j0224M200N432Q031
3863A179p293l965J5732j432k4767k1142N323J5701J8371J8766p187j705j1937
3850d356M524M07J391N460m441l385N176Q007j881o254L416o115m963p602M750
3835e866J7174M865k023l187j1147n313J280o531q913q640J4836J109o560L398
3821a5518p365P351K0555J713o549n483J2313J1537j878K30k32o019j0597M822
3807D880n93j5616M854K0583O672k2243L970L277P00q56p366m939Q43L021r398
$$ plain form
3903 -19748 -12129 2568 -7755 -16079 -20500 -21829 -27362 -22822 -7980 396 -13334 -8044 2400
3890 2400 4125 -6094 -12474 -9388 -1784 -1472 9544 12320 -2247 -12061 -15110 -16483 -1924 14731
3876 14731 10053 -1207 -10108 -23150 -18234 3980 12484 9092 -6260 -16484 -12284 -6852 1179
3863 1179 -6114 -10079 5653 4221 -20546 -41688 -36365 -20664 -2293 16473 9286 7581 -4356
3850 -4356 168 575 1966 7426 2985 -400 4776 12783 10902 4648 8064 1949 -3014 -10616 -5866
3835 -5866 11308 16173 14150 10963 -184 -5497 -4217 -10748 -19661 -28301 -13465 -12356 -18916 -15518
3821 -15518 -22883 -15532 5023 6736 187 -5296 7017 18554 16676 16906 16674 10655 58 4880
3807 4880 4287 -11329 -6475 14108 20780 -1463 2507 5784 6484 5628 -1738 -6677 -5834 -2813 -12211
3792a2211O176N209N858n433j185n917L959M062J0363P618k701j5560j0437m157
3778a4356J098M033j296Q910n762P220m005j0271n465n790J7324O782O68K0007
3764A9097N514L538m079M229j0184k2066q840O274J4359q672r048R968J1766n080
3750F776o041j4074o297J1298O501L206J37M107k547n669L853J2446r861k379
3736A456j3492J367M666m965k840O491J6482o971O857J1434J103j1902r141L734
3722D279p618M056l541m573J823j3404j5659J3390J2593J2880p501o41K723P220
3708F027L709p22l510J2393j1464o59j458r875j6686j571O979r448K754J3552
3694i979J4251l398j0305k650M67j2209R18R765K147Q322l593j194J2708J1100
$$ plain form
3792 -12211 -6035 -826 5032 -401 -1586 -7503 -3544 518 10881 18499 15798 238 -10199 -14356
3778 -14356 -13258 -9225 -10521 -1611 -7373 -153 -4158 -14429 -19894 -25684 -8360 -1578 -910 19097
3764 19097 24611 28149 24070 28299 18115 -3951 -12791 -6517 7842 -830 -9878 90 11856 6776
3750 6776 735 -13339 -19636 -8338 -1837 1369 1506 5613 3066 -2603 1250 13696 3835 1456
3736 1456 -12036 -10669 -6003 -10968 -13808 -7317 9165 2194 9051 20485 21588 9686 545 4279
3722 4279 -3339 717 -2824 -7397 -5574 -18978 -34637 -21247 -8654 4226 -3275 -3916 -1193 6027
3708 6027 9736 9014 5504 17897 6433 5774 4316 -5559 -22245 -23816 -16837 -26285 -23531 -9979
3694 -9979 4272 874 -9431 -12081 -11614 -23823 -22905 -13140 -10993 -2671 -6264 -7458 5250 16350
3680A6350R520K771j9898o668n182M398N229j4750q25k128j3688J6775J2081N910
3666I895M680p458k16K403R030J009m677N15j2528p059P027n92o252l076R566
3651B267j2859n547P148L186J006j0089k093K045m291m219L187j2368l125Q058
3637b7694R859J3676l888R660J1068o330k083j5010L826J2823L784J019k829q581
3623g00j7934R237N41M157K147j396Q5j3262m500J3217J0927k90k512J969p868
3608f182L123Q363l827J1213m499O095J084O56J2748N738k786o762n379k70P405
3593B6720j1231p878p663r050k09L5j178J100J015R568J057p537M627l984j8948
3578b3556k600J1708J0748J671Q213K898j2436o723J1508J7986r414n623r02L991
$$ plain form
3680 16350 25870 28641 8743 2075 -3107 1291 6520 -8230 -9055 -11183 -24871 -8096 3985 9895
3666 9895 14575 7117 6901 9304 18334 19343 14666 15181 2653 -4406 2621 2029 -4223 -7299 2267
3651 2267 -10592 -16139 -8991 -5805 -4799 -14888 -16981 -14936 -19227 -23446 -20259 -32627 -35752 -27694
3637 -27694 -17835 -4159 -8047 1613 12681 6351 4268 -10742 -6916 5907 9691 10710 7881 -700
3623 -700 -18634 -9397 -8856 -4699 -2552 -3948 -3863 -17125 -21625 -8408 2519 2229 -283 1686 -6182
3608 -6182 -3059 5304 1477 12690 8191 14286 15370 16026 28774 34512 31726 24964 19585 19315 26720
3593 26720 15489 7611 -52 -9102 -9311 -9276 -10454 -9354 -8339 1229 2286 -5251 -624 -4608 -23556
3578 -23556 -26156 -14448 -3700 -2029 6184 9082 -3354 -10077 1431 19417 10003 4380 3478 7469
3564G469R357N002j6163j6001J1035M556n841O311M342p44j8028k299j0262J2304
3550h962N880q994k250M640J4170r11l124Q457j703q415R926J908j3861j5971
3536a9210J632Q995M494m982O67J7429m237k0367L517R693Q215m134o891m304
$$ plain form
3564 7469 16826 21828 5665 -10336 699 5255 -586 5725 10067 9323 -8705 -11004 -21266 -8962
3550 -8962 -3082 -12076 -14326 -9686 4484 3573 449 8906 7203 -1212 8714 10622 -3239 -19210
3536 -19210 -17578 -8583 -4089 -9071 -8404 9025 4788 -15579 -12062 -2369 5846 1712 -5179 -9483
$$ [...]
##END NTUPLES=NMR SPECTRUM
##END=
