##TITLE=Analysis number 323171
Compound Code cc 30909
Book Reference 511/4
Project Code adrs
Chemist Name stevem
##JCAMPDX= 6.0         $$ Bruker NMR JCAMP-DX V2.0
##DATA TYPE= NMR SPECTRUM
##DATA CLASS= NTUPLES
##ORIGIN= Bruker BioSpin GmbH
##OWNER= nmr
$$ XWIN-NMR		Version 3.5
$$ Tue Oct 17 20:05:42 2006 GMT Daylight Time (UT+1h)  MAYBRIDGE\nmr@NMR_250MHZ
##.OBSERVE FREQUENCY= 250.131544655141
##.OBSERVE NUCLEUS= ^1H
##.ACQUISITION MODE= SIMULTANEOUS (DQD)
##.ACQUISITION SCHEME= undefined
##.AVERAGES= 16
##.DIGITISER RES= 18
##SPECTROMETER/DATA SYSTEM= dpx250
##.PULSE SEQUENCE= zg30
##.SOLVENT NAME= CDCl3
##.SHIFT REFERENCE= (INTERNAL, CDCl3, 0, 16.522)
##AUDIT TRAIL= $$ (NUMBER, WHEN, WHO, WHERE, WHAT)
$$ ##TITLE= Audit trail, XWIN-NMR		Version 3.5
$$ ##JCAMPDX= 5.01
$$ ##ORIGIN= Bruker BioSpin GmbH
$$ ##OWNER= nmr
$$ C:\u/data/dgb/nmr/ADRS/840/pdata/1/auditp.txt
$$ ##AUDIT TRAIL=  $$ (NUMBER, WHEN, WHO, WHERE, WHAT)
(   1,<2006-10-17 20:05:20.26 +100>,<MAYBRIDGE\nmr>,<NMR_250MHZ>,
      <created by zg, POWCHK disabled, PULCHK disabled
       configuration hash MD5:
       49 4B E0 1D 92 C2 6B 37 9F E6 65 BC 52 41 86 1D
       data hash MD5: 64K
       DD B9 21 E6 90 77 4E 0F AB C8 A5 48 53 A4 45 17>)
(   2,<2006-10-17 20:05:32.54 +100>,<MAYBRIDGE\nmr>,<NMR_250MHZ>,
      <Start of raw data processing
       ef LB = 0.3 FT_mod = 6 PKNL = 1 SI = 32K 
       data hash MD5: 32K
       87 41 8B 6E D6 23 7B 7B 03 87 B3 C4 3E EC 62 EC>)
(   3,<2006-10-17 20:05:34.38 +100>,<MAYBRIDGE\nmr>,<NMR_250MHZ>,
      <apk 
       data hash MD5: 32K
       1E E2 6E F3 25 A2 8D E2 3F 09 9A 9B E3 E5 DF AD>)
(   4,<2006-10-17 20:05:35.21 +100>,<MAYBRIDGE\nmr>,<NMR_250MHZ>,
      <abs ABSG = 5 
       data hash MD5: 32K
       BA 1A 17 D9 A4 F9 DE 9F 06 C4 96 70 5C 32 07 90>)
$$ ##END=
$$ 
$$ hash MD5
$$ 43 61 45 4A 3B 60 3A 14 C7 F0 32 D7 AB F9 C9 0D
##$RELAX= 
##$RELAX= 
##$RELAX= 
##$RELAX= 
##$RELAX= 
##$RELAX= 
##$RELAX= 
$$ Bruker specific parameters
$$ --------------------------
##$DU= <C:\u>
##$EXPNO= 840
##$NAME= <ADRS>
##$PROCNO= 1
##$TYPE= <nmr>
##$USER= <dgb>
##$AMP= (0..31)
100 100 100 100 100 100 100 100 100 100 100 100 100 100 100 100 100 100 
100 100 100 100 100 100 100 100 100 100 100 100 100 100 
##$AQSEQ= 0
##$AQ_mod= 3
##$AUNM= <au_zg>
##$AUTOPOS= <32 >
##$BF1= 250.13
##$BF2= 250.13
##$BF3= 250.13
##$BF4= 250.13
##$BF5= 500.13
##$BF6= 500.13
##$BF7= 500.13
##$BF8= 500.13
##$BYTORDA= 1
##$CFDGTYP= 0
##$CFRGTYP= 5
##$CHEMSTR= <none>
##$CNST= (0..31)
1 1 145 1 1 1 1 1 1 1 1 1 1 1 1 1 1 1 1 1 1 1 1 1 1 1 1 1 1 1 1 1 
##$CPDPRG= <>
##$CPDPRG1= <>
##$CPDPRG2= <>
##$CPDPRG3= <>
##$CPDPRG4= <mlev>
##$CPDPRG5= <mlev>
##$CPDPRG6= <mlev>
##$CPDPRG7= <mlev>
##$CPDPRG8= <mlev>
##$CPDPRGB= <>
##$CPDPRGT= <>
##$D= (0..31)
0 1 0 0 0 0 0 0 0 0.06 0 0 0 0 0 0 0.0002 0 0 0 0 0 0 0 0 0 0 0 0 0 0 
0 
##$DATE= 1161111919
##$DBL= (0..7)
120 120 120 120 120 120 120 120 
##$DBP= (0..7)
150 150 150 150 150 150 150 150 
##$DBP07= 0
##$DBPNAM0= <>
##$DBPNAM1= <>
$$ [...]
##$SUBNAM7= <"">
##$SUBNAM8= <"">
##$SUBNAM9= <"">
##$SW= 20.6930455092707
##$SWIBOX= (0..15)
0 0 3 0 0 0 0 0 0 0 0 0 0 0 0 0 
##$SW_h= 5175.983436853
##$TD= 65536
##$TD0= 1
##$TE= 683.16
##$TE2= 300
##$TE3= 300
##$TEG= 300
##$TL= (0..7)
0 120 120 120 120 120 120 120 
##$TP= (0..7)
150 150 150 150 150 150 150 150 
##$TP07= 0
##$TPNAME0= <>
##$TPNAME1= <>
##$TPNAME2= <>
##$TPNAME3= <>
##$TPNAME4= <>
##$TPNAME5= <>
##$TPNAME6= <>
##$TPNAME7= <>
##$TPOAL= (0..7)
0.5 0.5 0.5 0.5 0.5 0.5 0.5 0.5 
##$TPOFFS= (0..7)
0 0 0 0 0 0 0 0 
##$TUNHIN= 0
##$TUNHOUT= 0
##$TUNXOUT= 0
##$USERA1= <user>
##$USERA2= <user>
##$USERA3= <user>
##$USERA4= <user>
##$USERA5= <user>
##$V9= 5
##$VALIST= <valist>
##$VCLIST= <CCCCCCCCCCCCCCC>
##$VD= 0
##$VDLIST= <DDDDDDDDDDDDDDD>
##$VPLIST= <PPPPPPPPPPPPPPP>
##$VTLIST= <TTTTTTTTTTTTTTT>
##$WBST= 1024
##$WBSW= 4
##$XGAIN= (0..3)
0 0 0 0 
##$XL= 0
##$YL= 0
##$YMAX_a= 565533
##$YMIN_a= -351878
##$ZGOPTNS= <>
##$ZL1= 120
##$ZL2= 120
##$ZL3= 120
##$ZL4= 120
##$ABSF1= 16.522
##$ABSF2= -4.171173
##$ABSG= 5
##$ABSL= 3
##$ALPHA= 0
##$AQORDER= 0
##$ASSFAC= 0
##$ASSFACI= 0
##$ASSFACX= 0
##$ASSWID= 0
##$AUNMP= <proc_1d>
##$AZFE= 0.1
##$AZFW= 0.1
##$BCFW= 0
##$BC_mod= 0
##$BYTORDP= 0
##$COROFFS= 0
##$CY= 12.5
##$DATMOD= 1
##$DC= 0
##$DFILT= <>
##$DTYPP= 0
##$F1P= 14.0000005364418
##$F2P= -0.99999901652339
##$FCOR= 0.5
##$FTSIZE= 32768
##$FT_mod= 6
##$GAMMA= 0
##$GB= 0
##$INTBC= 1
##$INTSCL= 1
##$ISEN= 128
##$LB= 0.3
##$LEV0= 0
##$LPBIN= 0
##$MAXI= 10000
##$MC2= 0
##$MEAN= 0
##$ME_mod= 0
##$MI= 0
##$NCOEF= 0
##$NC_proc= -5
##$NLEV= 6
##$NOISF1= 0
##$NOISF2= 0
##$NSP= 0
##$NTH_PI= 0
##$NZP= 0
##$OFFSET= 16.522
##$PC= 1
##$PHC0= -57.84701
##$PHC1= 16.39561
##$PH_mod= 1
##$PKNL= yes
##$PPARMOD= 0
##$PSCAL= 4
##$PSIGN= 0
##$REVERSE= no
##$SF= 250.13
##$SI= 32768
##$SIGF1= 0
##$SIGF2= 0
##$SINO= 400
##$SIOLD= 32768
##$SREGLST= <1H.CDCl3>
##$SSB= 0
##$STSI= 32768
##$STSR= 0
##$SW_p= 5175.98343685301
##$SYMM= 0
##$S_DEV= 0
##$TDeff= 65536
##$TDoff= 0
##$TI= <Analysis number 999999
Compound Code 99
Book Reference 9
Project Code 9>
##$TILT= no
##$TM1= 0
##$TM2= 0
##$TOPLEV= 0
##$USERP1= <user>
##$USERP2= <user>
##$USERP3= <user>
##$USERP4= <user>
##$USERP5= <user>
##$WDW= 1
##$XDIM= 32768
##$YMAX_p= 320579457
##$YMIN_p= -435035
$$ End of Bruker specific parameters
$$ ---------------------------------
##NTUPLES= NMR SPECTRUM
##VAR_NAME=  FREQUENCY,     SPECTRUM/REAL,   SPECTRUM/IMAG
##SYMBOL=    X,             R,               I
##VAR_TYPE=  INDEPENDENT,   DEPENDENT,       DEPENDENT
##VAR_FORM=  AFFN,          ASDF,            ASDF
##VAR_DIM=   32768,         32768,           32768
##UNITS=     HZ,            ARBITRARY UNITS, ARBITRARY UNITS
##FACTOR=    0.157963299565203, 1,           1
##FIRST=     4132.6476996994, 0,             0
##LAST=      -1043.33573715361, 0,           0
##MIN=       -1043.33573715361, -435035,     0
##MAX=       4132.6476996994, 320579457,     0
$$ Real data points
##PAGE= N=1
##DATA TABLE= (X++(R..R)), XYDATA
$$ [...]
19371F9334K6584N6500M590k5750O897M0349m7115N3449K8672J43j23979J9580
$$ 69334 95918 152418 157008 131258 138155 178504 131389 184838 213510 213653 89674 109254
19359A09254M0228K4591J1102o8173Q5196J28497q4321P7852Q5518J03314j086
$$ 109254 149482 174073 185175 117002 202198 330695 246374 324226 409744 513058 511972
19348E11972j9434K5015l2137J4182J77065J81199J95090K5179K8275K4304J45953
$$ 511972 492538 517553 485416 499598 676663 857862 1052952 1078131 1106406 1130710 1276663
19337A276663K7429J8291j7232j7644N7849m392N5538L5207p6811l0944N2940
$$ 1276663 1304092 1322383 1305151 1287507 1345356 1340964 1396502 1431709 1354898 1323954 1376894
19326A376894p1554O3794M6781j07921m9817k31q7668l4898Q5201M4385J58941
$$ 1376894 1305340 1369134 1415915 1307994 1258177 1257946 1170278 1135380 1220581 1264966 1423907
19315A423907J05551K9268L1224P7584J75981Q5241K43163J86949J02589J08206
$$ 1423907 1529458 1558726 1589950 1667534 1843515 1928756 2171919 2358868 2461457 2569663
19305B569663J29167K52810J71542K07809K46037K72870K84043K40281J79640
$$ 2569663 2698830 2951640 3123182 3330991 3577028 3849898 4133941 4374222 4553862
19296D553862J16541K62622K14259J08741K38461K31665p3912k37781k20962k53399
$$ 4553862 4670403 4933025 5147284 5256025 5494486 5726151 5652239 5414458 5193496 4940097
19286D940097l25232k81657m47655m41522l74235l31205k20925k53878j60292
$$ 4940097 4614865 4333208 3885553 3444031 3069796 2738591 2517666 2263788 2103496
19277B103496p8635j35936k91079k09809m2381j20408p038r3984O4690j3752j17807
$$ 2103496 2024861 1888925 1597846 1388037 1345656 1225248 1218210 1124226 1188916 1175164 1057357
19266A057357p2844j08108j56485j08681O170q948p6203l2405K8175j5255n6816
$$ 1057357 984513 876405 719920 611239 617409 608461 532258 499853 528028 512773 455957
19255D55957o4467O0071O3531q9201k7832L1921m013j11400p7906m0674j8525
$$ 455957 391490 451561 515092 425891 398059 429980 425967 314567 236661 195987 177462
19244A77462l4693L3283J85981l3633o0002J8342k7229K9206n8372o6096M6214
$$ 177462 142769 176052 362033 328400 268398 286740 259511 288717 230345 164249 210463
19233B10463J5159Q4348L8801k164o5972J0059n5526q148j7860n125j3188O6624
$$ 210463 225622 309970 348771 346607 280635 290694 235168 227020 209160 204035 190847 257471
19221B57471j6223J8679M9405J6112k256K563L448Q611j84253j1404J49423j70190
$$ 257471 241248 259927 309332 325444 323188 325751 329199 337810 153557 142153 291576 121386
19209A21386n1866Q1292j3655O6845J44721N5069o8794o9819n1136P8079N374
$$ 121386 69520 150812 137157 204002 348723 403792 334998 265179 214043 292122 297496
19198B97496p0292q5721J58965N5247m7541o9850j63425q7264J13709J51321K8999
$$ 297496 227204 141483 300448 355695 308154 238304 74879 -12385 101324 252645 281644
19187B81644k2284o0601l1557L1436p6333K1728R8922L9755m9958p2298j93337
$$ 281644 259360 198759 167202 198638 122305 144033 242955 282710 232752 160454 -32883
19176c2883j485J40575p900l7938K8583Q6351J7111n1987K6071j08488N3530Q5960
$$ -32883 -34368 106207 98307 60369 88952 175303 192414 140427 166498 58010 111540 197500
19164A97500l297L3557k7198j88552p30R6640j6378k7207p3428k4258j5955q314
$$ 197500 194203 227760 200562 12010 11280 107920 91542 64335 -9093 -33351 -49306 -57620
19152e7620L3692J46756O8944q4094o3229l5130J00872P5132j3988N1127m1752
$$ -57620 -23928 122828 191772 107678 44449 9319 110191 185323 171335 222462 180710
19141A80710k4655k8383o1091j12512j08439N0497P1976J08578L5813j9579r6051
$$ 180710 156055 127672 66581 -45931 -154370 -103873 -31897 76681 112494 92915 -3136
19130c136N765M4568k7252J7401P0335j39072o6084L654J07657J10399j01010
$$ -3136 2629 47197 19945 37346 107681 -31391 -97475 -93821 13836 124235 23225
19119B3225k1024R4548N0005j04966o1769N1879k4524M5253P9857O0350k7751
$$ 23225 2201 96749 146754 41788 -19981 31898 7374 52627 132484 192834 165083
19108A65083O0164P1757P7117K0001r6209j14107j22549q9297k9563O7065M2732
$$ 165083 225247 297004 374121 394122 297913 183806 61257 -28040 -57603 9462 52194
19097E2194n9099j9606J03895N5028p405l5296K9766o2464q604M6390Q8297o7459
$$ 52194 -6905 -26511 77384 132412 125007 89711 119477 57013 48409 94799 183096 115637
19085A15637m1811n1164M7412L948M8104k9096l9795J58658K0907n1880j39119
$$ 115637 73826 22662 70074 74022 122126 93030 53235 211893 232800 180920 41801
19074D1801p6054k4900o8491P5634K08943J19093k2855p5806k1873m7988N5639
$$ 41801 -34253 -59153 -127644 -52010 156933 276026 253171 177365 155492 107504 163143
19063A63143K02K6035J00691k664Q8653j29176m7110p1667r2049k4588M1505K2160
$$ 163143 163345 189380 290071 287407 376060 246884 199774 128107 36058 11470 52975 75135
19051G5135o1931m096J48663J47694j3258R271p1857p5098P4213j3084p2713J0556
$$ 75135 13204 9108 157771 305465 292207 301478 229621 154523 228736 215652 142939 153495
19039A53495n5597j8471J38441K1574p0438m9628n7021L2409n993P4921L5908
$$ 153495 97898 79427 217868 239442 169004 119376 62355 94764 88771 163692 199600
19028A99600N5400j59527j1847j1861Q0682J7143k7808j23978m6328L9451M889
$$ 199600 255000 95473 83626 71765 152447 169590 141782 17804 -28524 10927 15816
19017A5816o053q5351m026j2132n6502J4980Q8999L0252o9797J04728M5515j11614
$$ 15816 9763 -75588 -79614 -91746 -148248 -133268 -44269 -14017 -83814 20914 66429 -45185
19005d5185Q0496J18789J9378M0331m1140q9003R3924J4635R2897M0203K8166
$$ -45185 35311 154100 173478 213809 172669 83666 177590 192225 285122 325325 353491
18994C53491n4040J6180r3002k7419Q673P1112j9314j26343o253J23079Q4122
$$ 353491 299451 315631 222629 195210 203883 274995 255681 129338 123085 246164 330286
18983C30286m5885j52327K0438l1890k0775Q0030J03999r5506p5683R893M8828
$$ 330286 284401 132074 152512 120622 99847 179877 283876 188370 112687 122580 171408
18972A71408O4185J32699M2685J00936j15831j60267J1278L4895K0525J657K6593
$$ 171408 235593 368292 410977 511913 396082 235815 247093 281988 302513 304170 330763
18961C30763p5340K2373m4542l6116O3240P6163n7009q9524L9677J21789K8031
$$ 330763 255423 277796 233254 197138 260378 336541 279532 190008 229685 351474 379505
18950C79505m2576q2960j15894K596n810j0073j5608n1833m4027J53608j01202
$$ 379505 336929 253969 138075 140671 134861 124788 109180 57347 13320 166928 65726
18939F5726K7618J08253p3317M8736L8029M5179l7197p4790l9488n2109N6551
$$ 65726 93344 201597 128280 177016 215045 260224 223027 148237 108749 56640 113191
18928A13191l5752P6322J40386k6490Q039Q5549k3586l1527P6663J17226n4477
$$ 113191 77439 153761 294147 267657 275696 361245 337659 306132 382795 500021 445544
18917D45544n1883N0898J39588P3695p2900O8059J15133M075q1298o7601m7904
$$ 445544 393661 444559 584147 657842 584942 653001 768134 772209 690911 623310 575406
18906E75406L9757P8813M6456K1349M4268M9158j05438q146J24147K8605q4360
$$ 575406 615163 693976 740432 761781 806049 855207 749769 741623 865770 894375 810015
18895H10015k7873p96n8262n2728m0830j22378m1118M3367j7074n9836r510Q8352
$$ 810015 782142 781346 723084 670356 629526 507148 466030 509397 492323 432487 422977 511329
18883E11329N4413P8134n7299j29170N3795j3660L5770Q8912j17332J3734M167
$$ 511329 565742 643876 586577 457407 511202 497542 533312 622224 504892 518626 522793
18872E22793j15608P8458J27212O0717R2819l3386o6770L5229J6089p6788J5138
$$ 522793 407185 485643 612855 673572 766391 733005 666235 701464 717553 640765 655903
18861F55903N1627J68121J28454K5420L3213M422m6523l9260M8386L4588J14239
$$ 655903 707530 875651 1004105 1029525 1062738 1067160 1020637 981377 1029763 1064351 1178590
18850A178590J34648n4604p6674p825j1259j65953j78693J24471P8870N3492j44883
$$ 1178590 1313238 1258634 1181960 1174135 1162876 996923 818230 942701 1021571 1075063 930180
18839I30180r9959j17973J7167j08742m9023l6924k3061P0955o5294P7391M2765
$$ 930180 830221 712248 729415 620673 571650 534726 511665 582620 517326 594717 637482
18828F37482J8533l4267l5823M944m9214p157L3247n5245Q151Q0444k1493L1243
$$ 637482 656015 621748 585925 590869 541655 534498 567745 512500 520651 601095 579602 610845
18816F10845Q6511L1595k6012K537Q7020K1881m5371p1550j3058k4750L5859O8418
$$ 610845 697356 728951 702939 705476 792496 814377 769006 697456 684398 659648 695507 763925
18804G63925k1459K5983n3516J03254K03872J10447j9725p8807j1238n9412j82701
$$ 763925 742466 768449 714933 818187 1022059 1132506 1112781 1033974 1022736 963324 780623
18793G80623L1786J25969O5601j2235o0679l5144K5437P75j14273m0845k4633
$$ 780623 812409 938378 1003979 991744 931065 895921 921358 922133 807860 767015 742382
18782G42382l8896r2184m8608L0029K1887O2881J02555j4713m8976l5442N0616
$$ 742382 703486 611302 562694 592723 614610 677491 780046 765333 716357 680915 731531
18771G31531Q1679K3450K17684K44500J09173j05624k67135k52353r9439J9862
$$ 731531 813210 836660 1054344 1298844 1408017 1302393 1035258 782905 683466 703328
18761G03328Q451k8337q1728k8828j12213O6706L4259l3871P2211n6872K2447
$$ 703328 711779 683442 601714 572886 460673 527379 561638 527767 599978 543106 565553
18750E65553M6601P805p3894M261o2442r6299J1464R6919J141k7238J1208j32246
$$ 565553 612154 619959 546065 550326 487884 391585 403049 499968 501109 473871 485079 352833
18738C52833O6111p8169m4686N4065P3786J9905j577j85571j196J79066J22472
$$ 352833 418944 340775 296089 350154 423940 443845 442268 256697 255501 434567 557039
18727E57039N009Q8009Q8651m5120p4720m1652Q679P6708l3627j2779J55968J52499
$$ 557039 562048 650057 738708 693588 618868 577216 585895 662603 628976 616197 772165 924664
18715I24664K7802q0296j51260J1474L6075n7543J5024M9787q9665o3501R5414
$$ 924664 952466 872170 720910 732384 768459 710916 725940 775727 686062 622561 717975
18704G17975J53773K9470l8558o550N3953J21382J50813P8672m1993j37175k8475
$$ 717975 871748 901218 862660 856110 910063 1031445 1182258 1260930 1218937 1081762 1053287
18693A053287m3441k8540q7056M1826L1135J57779J61037k2045q8277M0970J13647
$$ 1053287 1009846 981306 894250 936076 967211 1124990 1286027 1263982 1175705 1216675 1330322
18682A330322r1354n5143l6967j8687P8406P8071Q5915l0119o5349j44732j7845
$$ 1330322 1238968 1183825 1146858 1128171 1206577 1284648 1370563 1340444 1275095 1130363 1112518
18671A112518l3638o4026J41553K2992M6268J2234L8468j3624l418O4372J00007
$$ 1112518 1078880 1014854 1156407 1179399 1225667 1237901 1276369 1262745 1259327 1323699 1423706
18660A423706L9661j23190j89295L5779L6471K7281J70248N9062j04890k7969
$$ 1423706 1463367 1340177 1150882 1186661 1223132 1250413 1420661 1479723 1374833 1346864
18650A346864J1770R5382J11669l4559l7546n0831r58m4056q0708Q4498n02L5585
$$ 1346864 1358634 1454016 1565685 1531126 1493580 1442749 1441791 1397735 1317027 1401525 1401023 1436608
18638A436608j8717M2131J10707N4190R4710N7944r6988J049Q343o1190K2218
$$ 1436608 1417891 1460022 1570729 1624919 1719629 1777573 1680585 1681634 1689977 1628787 1651005
18627A651005J5018j09305J6849Q2737j4309n7887N5165k8324j13315p6926m6727
$$ 1651005 1666023 1556718 1573567 1656304 1641995 1584108 1639273 1610949 1497634 1420708 1373981
18616A373981k66J5449L5297N2769n108K5042r257j35333l9441J40643l455n672
$$ 1373981 1373715 1389164 1424461 1477230 1472122 1497164 1487907 1352574 1313133 1453776 1450321 1444649
18604A444649O9030P4657n4773q5613R658L1477J999J7218n128k4686J01117N3676
$$ 1444649 1513679 1588336 1533563 1447950 1457608 1489085 1491084 1508302 1503174 1478488 1579605 1633281
18592A633281k2561p7133P9813J82764p9093l4065K222j66066K2072J36528l5527
$$ 1633281 1610720 1533587 1613400 1796164 1717071 1683006 1685228 1519162 1541234 1677762 1642235
18581A642235l3818O9092L7761r172k7780m1021p7157j22258m859n163j1067J04525
$$ 1642235 1608417 1677509 1715270 1706098 1678318 1637297 1560140 1437882 1433023 1427860 1416793 1521318
18569A521318J04369N5837r0608j10341j24889j17891J24052J67097M0274j3442
$$ 1521318 1625687 1681524 1590916 1480575 1355686 1237795 1361847 1528944 1569218 1555776
18559A555776n775Q2732M0902n366r4768P1528Q7043r1599l9532m0157O0918M9169
$$ 1555776 1550001 1632733 1673635 1668269 1573501 1645029 1732072 1640473 1600941 1560784 1621702 1670871
18547A670871J9683J5094j0308j6298J73653P9781K0271L0104M2604M6508N02
$$ 1670871 1690554 1705648 1695340 1679042 1852695 1932476 1952747 1982851 2025455 2071963 2072465
18536B072465n6960j30065j07528R4470J92841N4596p8570j23589J4396Q2767
$$ 2072465 2015505 1885440 1777912 1872382 2065223 2119819 2041249 1917660 1932056 2014823
18526B014823J62945K6921j15755M0748K15957N5625n9596j81408J43031J73704
$$ 2014823 2177768 2204689 2088934 2129682 2345639 2401264 2341668 2160260 2303291 2476995
18516B476995P4049R9932N6467J47188Q3155j784p5487l3867k6821o6852L1790
$$ 2476995 2551044 2650976 2707443 2854631 2937786 2936002 2860515 2826648 2799827 2732975 2764765
18505B764765p993r2229L0685J04822p5587l4931P2388K9625O063K404M4429M0783
$$ 2764765 2756772 2664543 2695228 2800050 2724463 2689532 2761920 2791545 2797608 2800012 2844441 2885224
18493B885224J06248K4641Q9108l756J3774J20912k0433K8913K07930K13177K16929
$$ 2885224 2991472 3016113 3105221 3101465 3115239 3236151 3215718 3244631 3452561 3665738 3882667
18482C882667K827j0462L1914J0695J87165N0397O7379Q4681J4691R251Q0132
$$ 3882667 3885494 3875032 3906946 3917641 4104806 4155203 4222582 4307263 4321954 4331205 4411337
18471D411337J89978J6041j33436m000k575M2479K5774j08066m5577J64092j9971
$$ 4411337 4601315 4617356 4483920 4479920 4477345 4519824 4545598 4437532 4391955 4556047 4536076
18460D536076n8715J03K6229o5895Q0910J40367N9074P4320J28791J09767O9989
$$ 4536076 4477361 4477464 4503693 4437798 4518708 4659075 4718149 4792469 4921260 5031027 5101016
18449E101016N829J19152J98593O2437K9026J05115J62835R7274O0319J78691
$$ 5101016 5106845 5225997 5424590 5487027 5516053 5621168 5784003 5881277 5941596 6120287
18439F120287K19217K16434P89j3984R7327J53345J26255J63225J20978K03508
$$ 6120287 6339504 6555938 6556727 6542743 6640070 6793415 6919670 7082895 7203873 7407381
18429G407381J66942J84684K72617K58611K11591J51126K36773L18635K62178
$$ 7407381 7574323 7759007 8031624 8290235 8501826 8652952 8889725 9208360 9470538
18420I470538L75084N04929M62001N03319M74271M80816N43233O58549P61683
$$ 9470538 9845622 10350551 10812552 11315871 11790142 12270958 12814191 13472740 14234423
18411A4234423P20235P52661Q41351Q24548J128302J178864J181944J479127J824097
$$ 14234423 14954658 15707319 16548670 17373218 18501520 19680384 20862328 22341455 24165552
18402B4165552J847563K040304K410710K672362K951557L236661L504638L623438
$$ 24165552 26013115 28053419 30464129 33136491 36088048 39324709 42829347 46452785
18394D6452785L741950L737068L432205K951467K676746K326137J619979J116748
$$ 46452785 50194735 53931803 57364008 60315475 62992221 65318358 66938337 68055085
18386F8055085P47115K28061k06518o50368j164650j702499k272853k705484l001931
$$ 68055085 68802200 69030261 68823743 68173375 67008725 65306226 63033373 60327889 57325958
18377E7325958l223732l182104k984768k808485k432287k077556j767960j356837
$$ 57325958 54102226 50920122 47935354 45126869 42694582 40617026 38849066 37492229
18369C7492229j192395j019823p82431o04427k23820j03388J10271K77881L58071
$$ 37492229 36299834 35280011 34497580 33893153 33669333 33565945 33676216 33954097 34312168
18360C4312168O34726P36325Q53308J192959J475679J539412J719062K092360
$$ 34312168 34946894 35683219 36536527 37729486 39205165 40744577 42463639 44555999
18352D4555999K659234K790633L205151L858064M291030M844575N477825O123244
$$ 44555999 47215233 50005866 53211017 57069081 61360111 66204686 71682511 77805755
18344G7805755O662172P317814P818219P948030Q204208Q025638P367549O563745
$$ 77805755 84467927 91785741 99603960 107551990 115756198 123781836 131149385 137713130
18336A37713130N736285M681045L936139K943869J806948N84257o71414j961068
$$ 137713130 143449415 148130460 152066599 155010468 156817416 157401673 156730259 154769191
18328A54769191l285370m479915n418801o198682o684510p072122p308798p376060
$$ 154769191 151483821 147003906 141585105 135386423 128701913 121629791 114320993 106944933
18320A06944933p184838o772767o322122o039345n546762m853647m357308l826030
$$ 106944933 99760095 92987328 86665206 80625861 75079099 70225452 65868144 62042114
18312F2042114l495069k995569k530972k167810j893311j830021j357113j130000
$$ 62042114 58547045 55551476 53020504 50852694 48959383 47129362 45772249 44642249
18304D4642249r40719o77310m78597j80010j08820J67596M01592O69163Q75434
$$ 44642249 43701530 43024220 42545623 42365613 42256793 42424389 42825981 43495144 44370578
18295D4370578R87364J274763J811253K170786K488490K866290L315800L841050
$$ 44370578 45357942 46632705 48443958 50614744 53103234 55969524 59285324 63126374
18287F3126374M273804M669123N099341N439575N400031N281471M754684M096218
$$ 63126374 67400178 72069301 77168642 82608217 88008248 93289719 98044403 102140621
18279A02140621L257195K361448J457899O53824n4601o22775j352384k093208
$$ 102140621 105397816 107759264 109217163 109870987 109816386 109193611 107841227 105748019
18271A05748019k973397l917378m664403n302876n612850n564303n597848n451543
$$ 105748019 102774622 98857244 94192841 88889965 83277115 77712812 72114964 66663421
18263F6663421n163834m689526m120228l688974l378446k939214k566776k336222
$$ 66663421 61499587 56810061 52689833 49000859 45622413 42683199 40116423 37780201
18255C7780201k093731j913681j809325j515493j297330j279348j168833j150431
$$ 37780201 35686470 33772789 31963464 30447971 29150641 27871293 26702460 25552029
18247B5552029r07015p80489p28562p22590p00082m52576m53744n22057m76428
$$ 25552029 24645014 23864525 23135963 22413373 21713291 21260715 20806971 20284914 19808486
18238A9808486m91739n36503m16557l37973j71637j74146k17335l21256l86361
$$ 19808486 19316747 18780244 18363687 18025714 17854077 17679931 17462596 17141340 16754979
18229A6754979l60321l26748k35358k83969q3836p0702n8853J37303k0326n5358
$$ 16754979 16394658 16067910 15832552 15548583 15464747 15394045 15335192 15472495 15452169 15396811
18219A5396811N5935O9914J18565R8807Q9038J01086K72131K97094K75329J62154
$$ 15396811 15452746 15522660 15641225 15740032 15829070 15930156 16202287 16499381 16774710 16936864
18209A6936864K95258L98178N01165O02313N28589M23385M03062N29055O80503
$$ 16936864 17232122 17630300 18131465 18733778 19262367 19685752 20088814 20617869 21298372
18200B1298372Q36048R22416R93558J131023J238495J445564J753681J988657
$$ 21298372 22134420 23056836 24050394 25181417 26419912 27865476 29619157 31607814
18192C1607814K359844K702548K875774L024583L307697L533487L637386L839959
$$ 31607814 33967658 36670206 39545980 42570563 45878260 49411747 53049133 56889092
18184E6889092L910558L838206L603552L274746K418740J568812R41317K22462
$$ 56889092 60799650 64637856 68241408 71516154 73934894 75503706 76445023 76667485
18176G6667485m58901j079306j354222j435283j593886j573314j371370r94270
$$ 76667485 76208584 75129278 73775056 72339773 70745887 69172573 67801203 66806933
18168F6806933n26845j7514N67142J185838J910954K603913L259943L922082M773445
$$ 66806933 66280088 66262574 66829716 68015554 69926508 72530421 75790364 79712446 84485891
18159H4485891N398600N735478N847737O036490O166659N649100M785647L927662
$$ 84485891 89884491 95619969 101467706 107504196 113670855 119319955 124105602 128033264
18151A28033264K832158J520755J74427j412176k683211l409022l988763m657049
$$ 128033264 130865422 132386177 132560604 131148428 128465217 125056195 121067432 116410383
18143A16410383m917773m623476m255247l753415l193734k301110j470898p34611
$$ 116410383 111492610 106869134 102613887 98860472 95666738 93365628 91894730 91160119
18135I1160119p906J061010J807530K331407K850112L365314L690266L532259
$$ 91160119 91152213 92213223 94020753 96352160 99202272 102567586 106257852 109790111
18127A09790111L240443K582632J967150J184934L58527l26486j070709j857266
$$ 109790111 113030554 115613186 117580336 118765270 119123797 118797311 117726602 115869336
18119A15869336k349322k337475k309899j663208J22145L445399R129998J9085595
$$ 115869336 113520014 111182539 108872640 107209432 107331577 110776976 119906974 138992569
18111A38992569L0811681L5284601L1092959p76717m7333592m1044490k2023107
$$ 138992569 169804250 205088851 236181810 235405093 188071501 147027011 125003904
18104A25003904j2249982o937719l701338j695759p58771p25710j119039j566509
$$ 125003904 112753922 105816203 102114865 100419106 99660335 98934625 97815586 96249077
18096I6249077k193224k793156l272281l777225m110662m061644m089250m025203
$$ 96249077 94055853 91262697 87990416 84213191 80102529 76040885 71951635 67926432
18088F7926432l793593l388136l050253k653193k185430j845231j573246j163025
$$ 67926432 64132839 60744703 57694450 55041257 52855827 51010596 49437350 48274325
18080D8274325p59110l64015R9222K84884M88011P27901P24879O96415M96454
$$ 48274325 47515215 47151200 47250422 47535306 48023317 48751218 49476097 50172512 50668966
18071E0668966K64105j31956n42883r15939j312323j657333k052212k277696k260201
$$ 50668966 50933071 50801115 50258232 49342293 48029970 46372637 44320425 42042729 39782528
18062C9782528k362299k319460k278934k173385j982329j888568j890489j686104
$$ 39782528 37420229 35100769 32821835 30648450 28666121 26777553 24887064 23200960
18054B3200960j315571j217977j146756j017671r60384q31691p06410q18303p52561
$$ 23200960 21885389 20667412 19520656 18502985 17542601 16710910 16004500 15186197 14433636
18045A4433636o13202n85767n17268m13005l23950m48410l93135m28451l11060
$$ 14433636 13820434 13234667 12717399 12304394 11980444 11532034 11138899 10710448 10399388
18036A0399388k42572m02380l48005j54803k75603k15161k20640j77516k98152
$$ 10399388 10156816 9754436 9406431 9251628 8976025 8760864 8540224 8362708 8064556
18027H064556l99083k26606j00360k28673j79981k77631k59231j72751k30120
$$ 8064556 7665473 7438867 7338507 7109834 6929853 6652222 6392991 6220240 5990120
18018E990120j32036N074j54009j47315q2072j51889j70475q0735m7817l2279
$$ 5990120 5858084 5863158 5709149 5561834 5479762 5327873 5157398 5076663 5028846 4996567
18008D996567j14433r6863k51239j15801j31031q1812j0114N0965m8146l4754
$$ 4996567 4882134 4785271 4534032 4418231 4287200 4205388 4195274 4246239 4198093 4163339
17998D163339j30068o7029j38926q9331l9731K4797k5113j14211m817o5820j19251
$$ 4163339 4033271 3966242 3827316 3737985 3698254 3723051 3697938 3583727 3578910 3513090 3393839
17987C393839j8796l8420j32456j11021j27726q0840N2783j12395n779K0278m6019
$$ 3393839 3375043 3336623 3204167 3093146 2965420 2884580 2937363 2824968 2819189 2839467 2793448
17976B793448j76920j28401J6389q4536j51161M9627n1238j24793K7280l8746
$$ 2793448 2616528 2488127 2504516 2419980 2268819 2318446 2267208 2142415 2169695 2130949
17966B130949K4644R3545j26817j50376j5271N8013m0450K6613n0140q9839o7975
$$ 2130949 2155593 2249138 2122321 1971945 1956674 2014687 1974237 2000850 1950710 1860871 1792896
17955A792896j4027Q2545L6655j2388n0041R286N7427J30280N0796q0559o4839
$$ 1792896 1778869 1861414 1898069 1885681 1835640 1844926 1902353 2032633 2083429 2002870 1938031
17944A938031l1617N7866M8603J76486J89344J67459J10380P9246P3736Q5390
$$ 1938031 1906414 1964280 2012883 2189369 2378713 2546172 2656552 2735798 2809534 2894924
17934B894924j09836k06450p2258K6349K3511m9061M163m2421j7230K6949K3808
$$ 2894924 2785088 2578638 2506380 2532729 2556240 2507179 2511342 2468921 2451691 2478640 2502448
17923B502448q2733j0324m5384j48649r0304j5726J35474O7972M5815N4311Q6431
$$ 2502448 2419715 2409391 2364007 2215358 2125054 2109328 2244802 2312774 2358589 2412900 2499331
17912B499331K68431Q4929j9248J7858k8245j40338j26400j19981j01520k067
$$ 2499331 2767762 2852691 2833443 2851301 2823056 2682718 2556318 2436337 2334817 2332750
17902B332750j53641k29124k20475p7561l5373k8135l0194M1495M0945m2531j61937
$$ 2332750 2179109 1949985 1729510 1651949 1616576 1588441 1558247 1599742 1640687 1598156 1436219
17891A436219l1872O2340J00831J4645M5708M9667J07350K57316J85990J20607
$$ 1436219 1404347 1466687 1567518 1582163 1627871 1677538 1784888 2042204 2228194 2348801
17881B348801o1906k5192m4440j90562j5661J8842n1941O2048J19685J10115n2586
$$ 2348801 2286895 2261703 2217263 2026701 2011040 2029882 1977941 2039989 2159674 2269789 2217203
17870B217203K981M3921o8167J07060L1518J4399L8944L8967k8846O1656J92409
$$ 2217203 2220184 2264105 2195938 2302998 2334516 2348915 2387859 2426826 2397980 2459636 2652045
17859B652045L29342J92451J65924J8977j52478j33656k24554j55946j96627j98058
$$ 2652045 2981387 3173838 3339762 3358739 3206261 3072605 2848051 2692105 2495478 2297420
17849B297420l18171n8918m2144n3509j70023k99733j06232k1399k6344j5574
$$ 2297420 1979249 1920331 1878187 1824678 1654655 1354922 1248690 1227291 1200947 1185373
17839A185373L3979p0567O416r4679k4265N1545J25406Q958j8930O1832K4149
$$ 1185373 1219352 1148785 1155201 1060522 1036257 1087802 1213208 1222166 1203236 1265068 1289217
17828A289217M0918K3996j90325j39684o1717p6828j4047P5529L5789N8845L1779
$$ 1289217 1330135 1354131 1163806 1024122 962405 885577 871530 947059 982848 1041693 1073472
17817A073472j92432k3732M2873J27364n061o7465l9779n9122R358J37811J12446
$$ 1073472 881040 857308 900181 1027545 1022484 955019 915240 856118 865476 1003287 1115733
17806A115733J1311r1217M1230N8670j31303N3540K23756p2579j07341K9519J2886
$$ 1115733 1127044 1035827 1077057 1135727 1004424 1057964 1281720 1209141 1101800 1131319 1144205
17795A144205J33067l5492j07251p5770o1113o5519q0672o5616j7068J1146n7633
$$ 1144205 1277272 1241780 1134529 1058759 997646 932127 851455 785839 768771 779917 722284
17784G22284N1899P327N664j55630n3942l3125P1948p3392k4107N2674p6765k05114
$$ 722284 774183 781510 787174 631544 577602 544477 616425 543033 518926 571600 494835 289721
17772B89721j1700k52M4589J25091m0155m1218m926k021J2494L1931k2169N6960
$$ 289721 278021 277769 322358 447449 407294 366076 361150 359129 371623 403554 381385 438345
17760D38345K4108k8953o3761J00179j7909j31019J8923J20166J17579j14654
$$ 438345 462453 433500 369739 469918 452009 320990 339913 460079 577658 463004
17750D63004k04681Q6251n987L6130R8678L3658J1573L8766l1942J4429r7270
$$ 463004 258323 344574 338587 374717 473395 507053 518626 557392 525450 539879 442609
17739D42609r0023Q2847Q3238Q3856n0572r5912j9783M587m1506j13552L0380
$$ 442609 352586 435433 518671 602527 551955 456043 436260 440847 399341 285789 316169
17728C16169q6583Q5699n5534J7694j9405n604O3242P3420l8596P9659k5630k14029
$$ 316169 229586 315285 259751 277445 258040 252436 315678 389098 350502 430161 404531 190502
17716A90502j71300j4009K09960m4995J901p8211k3034J36692J18324r1174q9648
$$ 190502 19202 5193 215153 170158 172059 93848 70814 207506 325830 234656 145008
17705A45008N6505K7795j28536j3044L6184l6347Q3313j60518p6741Q4119M6296
$$ 145008 201513 229308 100772 87728 123912 87565 170878 10360 -66381 17738 64034
17694F4034k5036O0208Q5650m3342m2274o506j49269p6299J25614m763J662J04412
$$ 64034 38998 99206 184856 141514 99240 92734 -56535 -132834 -7220 -11983 -10321 94091
17682I4091R651m0275n0723L0500L5338L0314L2059J3002n2219O3275R1753Q347
$$ 94091 103742 63467 12744 43244 78582 108896 140955 153957 101738 165013 256766 265113
17670B65113L0456L271q2969q4313p3602L1128j0018M6738L9503R8179P0921L0786
$$ 265113 295569 298840 215871 131558 57956 89084 79066 125804 165307 263486 334407 365193
17658C65193O0066Q3475o4747m8799J49780p2010j38612n2448K1874J7879M149
$$ 365193 425259 508734 443987 395188 544968 472958 334346 281898 303772 321651 325800
17647C25800K12353R0393l2411j8285j7102q1659j34859o5204N2585k9217O6279
$$ 325800 538153 628546 596135 577850 560748 479089 344230 279026 331611 302394 368673
17636C68673R1432P916M5910j4406l7853R9054J29924p626M1676J5056J8208Q7631
$$ 368673 460105 468021 513931 499525 461672 560726 690650 683024 724700 739756 757964 845595
17624H45595j8254j35093p4961N5677K2324J2115j54272k54244k5572L1359J36831
$$ 845595 827341 692248 617287 672964 695288 707403 553131 298887 273315 304674 441505
17613D41505N1477j13183k2086N8308L5165M082R7085j2233J11644j09404j09709
$$ 441505 492982 379799 357713 416021 451186 455268 552353 540120 651764 542360 432651
17602D32651M8981k996n4286P5547Q0374P704j4475P612q254j05269k0483P4164
$$ 432651 481632 478636 424350 499897 580271 587975 573500 581112 572858 467589 447106 521270
17590E21270K0319k6303O956J6614j08096j38423n9578l7186J00284n9506Q4896
$$ 521270 541589 515286 522242 538856 430760 292337 232759 195573 295857 236351 321247
17579C21247O2510O049Q454J871m9383r616N7403P2047P7766N481K1534j0109
$$ 321247 383757 389806 398260 400131 350748 341132 398535 470582 548348 553829 575363 565254
17567E65254N2437j57908j24199l9588j02299l1390l7687J2297j94684J5N0388
$$ 565254 617691 459783 335584 295996 193697 162307 124620 136917 -57767 -57752 -7364
17556g364M8914J34896P1472p892k4787M8817M1920k0402J02006Q5200r0925q5627
$$ -7364 41550 176446 247918 240026 215239 264056 305976 285574 387580 472780 381855 296228
17544B96228n5406r5546R4746O4029K388O754Q3244K5985o9486l306o5062o6762
$$ 296228 240822 145276 240022 304051 306439 313193 396437 422422 352936 349630 284568 217806
17532B17806l8773R0303j6444j71872j99144L9934Q3138M776m4192N4996m5704
$$ 217806 179033 269336 252892 81020 -118124 -78190 4948 9724 -34468 20528 -25176
17521b5176l0436N2659Q6125j42989o8508J27011K6057l6442k1125L6975r2449
$$ -25176 -55612 -2953 83172 -59817 -128325 -1314 24743 -11699 -32824 4151 -88298
17510h8298j21279R7497J20709J7646j23284r9567l4297K6102P3986Q5391L1179
$$ -88298 -209577 -112080 8629 26275 -97009 -196576 -230873 -204771 -130785 -45394 -14215
17499a4215o9545l9609J6563j0243R42k1151j10090j1242J44059J16203Q021o7668
$$ -14215 -83760 -123369 -106806 -117049 -116107 -137258 -247348 -258590 -114531 1672 9693 -57975
17487e7975p4444Q5700J82000O0974k1799p2390K9279j43257j14503O4105O2674
$$ -57975 -132419 -46719 135281 196255 174456 102066 131345 -11912 -126415 -62310 364
17476C64l0006p8625J01248R8931O5868J140j01861j3429M2926j50005N084r5640
$$ 364 -29642 -108267 -7019 91912 157780 158920 57059 43630 86556 -63449 -58365 -154005
17464a54005N9012k5639m3996O5747J8517P9477k4739q4563k9591n8548k6602
$$ -154005 -94993 -120632 -164628 -98881 -80364 -887 -25626 -110189 -139780 -198328 -224930
17453b24930Q2485o7197K2089Q9936N2145M9996J01366Q1781J35923J92962K11782
$$ -224930 -142445 -209642 -187553 -97617 -45472 4524 105890 187671 323594 516556 728338
17442G28338R8428p8060l06080j70697k9764L6487j76746j21313L5316K5813l3253
$$ 728338 826766 748706 442626 271929 242165 278652 101906 -19407 15909 41722 8469
17431H469Q5661N7904k15201l0365O324L0610J6754l4640j40595l6382M6692L0371
$$ 8469 94130 152034 -63167 -93532 -87208 -56598 -39844 -74484 -215079 -251461 -204769 -174398
17419a74398J7684R5215P081n5126q07J12811J27162r3944j4093K7503J6678O3228
$$ -174398 -156714 -61499 -54418 -109544 -110351 2460 129622 35678 21585 49088 65766 128994
17407A28994j02488j48565J02522P7730j15561j88815k105P20o1695J10970J74849
$$ 128994 26506 -122059 -19537 58193 -57368 -246183 -248288 -247568 -309263 -198293 -23444
17396b3444J04798o1577q5743R1546R5963r2646p8121j73026j0537R097J28019
$$ -23444 81354 19777 -65966 25580 121543 28897 -49224 -222250 -232787 -223690 -95671
17385i5671k2079L9669M1538K6866K9075J9875q1755K5081l2242o6607J8418j646
$$ -95671 -117750 -78081 -36543 -9677 19398 39273 -42482 -17401 -49643 -116250 -97832 -99478
17373i9478M6012J7321P103o2398o6146K8267N7419L159Q3153p440n4491J13201
$$ -99478 -53466 -36145 -29042 -91440 -157586 -129319 -71900 -68741 14412 6972 -47519 65682
17361F5682L8669k9925K875J2674p0578j8584j946k8726P0027O217k20688m2219
$$ 65682 104351 74426 77301 89975 19397 813 -1133 -29859 40168 46385 -174303 -216522
17349b16522O906L125o6865Q155p3776K5686R890M4402P5608Q6381N7818O4939
$$ -216522 -209616 -206491 -273356 -265201 -338977 -313291 -303401 -258999 -183391 -97010 -39192 25747
17337B5747n5454L9586O2522j49919O3825l647p7656M7141J11289O3341m3074
$$ 25747 -29707 9879 72401 -77518 -13693 -17340 -94996 -47855 63434 126775 83701
17326H3701M0965m7874m5095j41636J1411N5189O5843J9742o5179j35499O4487
$$ 83701 124666 76792 31697 -109939 -98528 -43339 22504 42246 -22933 -158432 -93945
17315i3945J79243N9114k20706n0697M5130j18756M110J918l542J14858K5101
$$ -93945 85298 144412 -76294 -126991 -81861 -200617 -196507 -194589 -198131 -83273 -58172
17304e8172o975m7022r313n9982m8054N8959J15855r27K405m6430k01816p9942
$$ -58172 -65147 -112169 -121482 -181464 -229518 -170559 -54704 -55631 -53226 -99656 -301472 -381414
17292c81414P6602J39367j8053J02740m9806n2171o2300N6096l0669j52713M7033
$$ -381414 -304812 -165445 -183498 -80758 -130564 -182735 -245035 -188939 -219608 -372321 -325288
17281c25288L1505J6776J26348K7018K5007n6430j2800M5765L6069o2267N3014
$$ -325288 -293783 -277007 -150659 -123641 -98634 -155064 -167864 -122099 -86030 -148297 -95283
17270i5283j9319p9686L3311K7616j4233j0293O0113L9874n9420n1746M305M6377
$$ -95283 -114602 -194288 -160977 -133361 -147594 -157887 -97774 -57900 -117320 -169066 -164761 -118384
17258a18384O7542k5043j2319N7377O8865r5621M728n9764j3309N7857J52540
$$ -118384 -50842 -75885 -88204 -30827 38038 -57583 -52855 -112619 -125928 -68071 84469
17247H4469K7269J9103q2514q1936r834j18850M3982J37527O3612q7561k7760
$$ 84469 111738 130841 48327 -33609 -43443 -162293 -118311 19216 82828 -4733 -32493
17236c2493Q596L1311O1750j7536j6610m2102l4968m8236N2058o5935j09570L9424
$$ -32493 -23897 7414 69164 51628 35018 -7084 -42052 -90288 -38230 -104165 -213735 -174311
17224a74311J80178J13305r549p477M0088m9879Q3119R0471j23344N157J38959
$$ -174311 5867 119172 109623 102146 142234 92355 175474 265945 142601 147758 286717
17213B86717K3369p3189n2767L2458P6278J32291J24988m0352n9204Q704J87119
$$ 286717 310086 236897 184130 216588 292866 425157 550145 509793 450589 459293 646412
17202F46412N4601O0115K0900k3956M8675P4745K7200l9404J16090J70197Q3997
$$ 646412 701013 761128 782028 758072 806747 881492 908692 869288 985378 1155575 1239572
17191A239572k3299k3871k8519J15917N661N5353K1369M298R959M7572m5983j79181
$$ 1239572 1216273 1192402 1163883 1279800 1285461 1340814 1362183 1366481 1376440 1424012 1378029 1198848
17179A198848r0319R4605J02432O1478O9341k13527l5042l1187j13285k58492
$$ 1198848 1108529 1203134 1305566 1367044 1436385 1222858 1187816 1156629 1043344 784852
17169G84852j67272o2989R3218J35988j64905j31276L9739J4603j52929n7894
$$ 784852 617580 554591 647809 783797 618892 487616 527355 541958 389029 331135
17159C31135M3060j04228m0706j01871n1245J30916O2228n4183K1488M0072j1033
$$ 331135 374195 269967 229261 127390 76145 207061 269289 215106 236594 276666 265633
17148B65633j08855j18381L8297k5075J5394n147m759n8567k3031L2724P6465
$$ 265633 156778 38397 76694 51619 67013 61866 57107 -1460 -24491 8233 84698
17137H4698J17189q662J1468q8660j59002j10642k6452J00397O0755Q8871P8891
$$ 84698 201887 193225 204693 116033 -42969 -153611 -180063 -79666 -18911 69960 148851
17126A48851m2246M0631K2021k3433J447J02069j18395j77856j1941J8318M2893
$$ 148851 106605 147236 169257 145824 147271 249340 130945 -46911 -58852 -40534 2359
17115B359L8902m6478p6524O9788Q3338N587j0084m0125j30035o7752m9198l9818
$$ 2359 41261 -5217 -81741 -11953 71385 76972 66888 26763 -103272 -171024 -220222 -260040
17103b60040M8994J87655J6024l6966J0681j19496L3099J34801O3777j13286p0385
$$ -260040 -211046 -23391 -7367 -44333 -33652 -153148 -120049 14752 78529 -34757 -105142
17092a05142m5769j1008J10815j6828l1462m6719Q3070N4427J2583n6973n1244
$$ -105142 -150911 -161919 -51104 -67932 -99394 -146113 -63043 -8616 3967 -53006 -104250
17081a04250N8726o2258Q9989l4272O800l4765j6924J7283N1068q4914m2563q3053
$$ -104250 -45524 -107782 -17793 -52065 -45265 -80030 -96954 -79671 -28603 -113517 -156080 -239133
17069b39133P3213O8027o8701M276J18257K1451M9438L4802R023L3043r6873P128
$$ -239133 -165920 -97893 -166594 -162318 -44061 -22610 26828 61630 70653 103696 6823 13951
17057A3951J2519r0008l4260J38196J56219n968j03974q9948j52793l6900Q659
$$ 13951 26470 -63538 -97798 40398 196617 190649 86675 -3273 -156066 -192966 -184307
17046a84307J66986N5062J587q4421j15291k111O8379Q3741P0152r1417q4910
$$ -184307 -17321 37741 39328 -45093 -160384 -162495 -94116 -10375 59777 -31640 -116550
17035a16550k5806L7100l3275k1879Q7498R6214P3693j0218j12796J2904q6833
$$ -116550 -142356 -105256 -138531 -160410 -72912 23302 96995 86777 -26019 -13115 -99948
17024i9948m7310J5244O5524m9064p8392J33957R9025K6964q3856j60468K907
$$ -99948 -147258 -132014 -66490 -115554 -193946 -59989 39036 66000 -17856 -178324 -175417
17013a75417J9989J26467N9544q8002L2045j9828K5455Q6641J967r6855n7697
$$ -175417 -155428 -28961 30583 -57419 -25374 -45202 -19747 66894 68861 -27994 -85691
17002h5691L5842Q5593j9257j39403j06030j5974k8846J05128N1932k3972K8073
$$ -85691 -49849 35744 16487 -122916 -228946 -244920 -273766 -168638 -116706 -140678 -112605
16991a12605j0839J4804M6712l0400O0824J28442K0230k2832L0953p9520j16571
$$ -112605 -123444 -108640 -61928 -92328 -31504 96938 117168 94336 125289 45769 -70802
16980g0802o8772r425l2581J66384O5657n4255j16279r344M0895m9603p9738J1075
$$ -70802 -139574 -148999 -181580 -15196 50461 -3794 -120073 -129417 -88522 -138125 -217863 -206788
16968b06788K8870n4190M7156K6615N2977m8684J19817L7082k4720n426j3679
$$ -206788 -177918 -232108 -184952 -158337 -105360 -154044 -34227 2855 -21865 -27291 -40970
16957d0970P8556k5746n9691M3222K7189p2920r140o4533p2280j8438K8748K9553
$$ -40970 37586 11840 -47851 -4629 22560 -50360 -59500 -124033 -196313 -214751 -186003 -156450
16945a56450M4738J17411k5321M1339J33771O2847k5833j81657l1934Q7640j5572
$$ -156450 -111712 5699 -19622 21717 155488 218335 192502 10845 -21089 66551 50979
16934E0979q7370K6003L5122J4731Q4857o5991l327o2401p3313j65656p3889P7577
$$ 50979 -36391 -10388 24734 39465 124322 58331 55004 -7397 -80710 -246366 -320255 -242678
16922b42678K3919J01077Q1914k5344M4000q7073p3833m4153J01645Q4611k0887
$$ -242678 -218759 -117682 -35768 -61112 -17112 -104185 -178018 -222171 -120526 -35915 -56802
16911e6802N5265J07302N5739p5555j36244P7951q827Q4755K7713k549M7040N3014
$$ -56802 -1537 105765 161504 85949 -50295 27656 18829 103584 131297 128748 175788 228802
16899B28802m4236Q145n714j35149N0708J36741o0392l462J6490P165N662J06097
$$ 228802 184566 192711 186997 51848 102556 239297 178905 175443 191933 199098 204760 310857
16887C10857n6981q5360m2444J4126L8166p956n7214j20402Q4797j6606l9038
$$ 310857 253876 168516 126072 140198 178364 170408 113194 -7208 77589 60983 21945
16876B1945Q4163O4491j07338j19235m2591J4021o150l8736j4930K4442R272K7988
$$ 21945 106108 170599 63261 -55974 -98565 -84544 -90694 -129430 -144360 -119918 -110646 -82658
16864h2658K2952M545k8512Q2457K1537M0828K7854k451q0433j30537N2867J15611
$$ -82658 -59706 -55161 -83673 -1216 20321 61149 89003 86552 6119 -124418 -71551 44060
16852D4060N9683K7893L6780j7495k2252p3794L7771k2617m148N2162J11918M4047
$$ 44060 103743 131636 168416 150921 128669 54875 92646 70029 65881 118043 229961 274008
16840B74008j63917j46821N2441K5735m3621n8719M0767k28n0754l0558N3401
$$ 274008 110091 -36730 15711 41446 -2175 -60894 -20127 -20355 -71109 -101667 -48266
16829d8266J4168O9855j4584j03976q9448j2905Q7098K8200J01218q1217j68521
$$ -48266 -34098 35757 21173 -82803 -172251 -185156 -98058 -69858 31360 -49857 -218378
16818b18378n3156J42094J60412l0799j4861K392l2236P6129M7841j32768j52203
$$ -218378 -271534 -129440 30972 173 -14688 -12296 -44532 31597 79438 -53330 -205533
16807b05533Q992R2555K5160O067Q5643k6091j3166k4627J14060M6300k43643
$$ -205533 -196541 -103986 -78826 -72759 12884 -13207 -26373 -51000 63060 109360 -134283
16796a34283j64153o8850o7749K396N2012M2252R6840M1298O1312P4169J25614
$$ -134283 -298436 -367286 -435035 -432639 -380627 -338375 -241535 -200237 -138925 -64756 60858
16785F0858L3688J6931n6142q1986M1770J8448j61450j04624R4379P8709P2619
$$ 60858 94546 111477 55335 -26651 15119 33567 -127883 -232507 -138128 -59419 13200
16774A3200k445j50883N6079P2601q6476O5361P4969o8391n4030o0785J1177P9527
$$ 13200 10755 -140128 -84049 -11448 -97924 -32563 42406 -25985 -80015 -140800 -129623 -50096
16762e0096L3805R4058P3201n8118j27189l3925n8996M5585K8017Q6838m58N4227
$$ -50096 -16291 77767 150968 92850 -34339 -68264 -127260 -81675 -53658 33180 32722 86949
16750H6949m1711p9949K5993L7500M8055P944p8614j7675N2562K6976r719L7225
$$ 86949 45238 -34711 -8718 28782 76837 84781 6167 -11508 41054 68030 58311 95536
16738I5536m5003j37185q0868L0805O3350R4621R9523m0802M3883M0221j19501
$$ 95536 50533 -86652 -167520 -136715 -73365 21256 120779 79977 123860 164081 44580
16727D4580p2574j5883k3335m774Q0781k7558m2010P8585O6861M6527J7288j20114
$$ 44580 -27994 -43877 -67212 -71986 8795 -18763 -60773 17812 84673 131200 148488 28374
16715B8374j13969L3894M1657l5285q4397M4931P6380R9724Q7617p6552j17744
$$ 28374 -85595 -51701 -10044 -45329 -129726 -84795 -8415 91309 178926 102374 -15370
16704a5370k1372L441l9122p050O4583K2598J8676L807l2761O120m9413k1455
$$ -15370 -36742 -33301 -72423 -79473 -14890 7708 26384 30191 -2570 3550 -45863 -67318
16692f7318P8752M2344Q2597o4206r0138k2136J06219J4179n9541l2984m0686
$$ -67318 11434 53778 136375 72169 -17969 -40105 66114 80293 20752 -12232 -52918
16681e2918L4846R718L4977R7995P3519j49173q8613j38590q9687R2341J00949
$$ -52918 -18072 -8354 26623 124618 198137 48964 -39649 -178239 -267926 -175585 -74636
16670g4636O1659J4638J5060N5103o1471p8100R226P2510L2788r892j07573o1087
$$ -74636 -12977 1661 16721 71824 10353 -67747 -58521 13989 46777 36885 -70688 -131775
16658a31775j6844N9552J6452L0396N9306k2569J4464M1474k9564o2688L1813
$$ -131775 -148619 -89067 -72615 -42219 17087 -5482 8982 50456 20892 -41796 -9983
16647i983p5524p7887J29199N5903j46955N7367J02386J5471j14735M8949Q9877
$$ -9983 -85507 -163394 -34195 21708 -125247 -67880 34506 49977 -64758 -15809 74068
16636G4068J3237j7215q8919j37434k0780J26424K4171p4938J3490R2876J7455
$$ 74068 87305 70090 -18829 -156263 -177043 -50619 -26448 -101386 -87896 4980 22435
16625B2435l5681P9282q2550r7104O6015P3433O8211j3733m0011q6906j6912J41118
$$ 22435 -13246 66036 -16514 -113618 -47603 25830 94041 80308 40297 -46609 -63521 77597
16613G7597Q1348o1567j6640o275j13770q223k4712Q1260M5256K3515R940q6007
$$ 77597 158945 97378 80738 74463 -39307 -47530 -72242 9018 54274 77789 87729 1722
16601A722l3876L5314j01607p2258m9047M8292J34094L9555m9412L4271J6262
$$ 1722 -32154 3160 -98447 -170705 -219752 -171460 -37366 2189 -47223 -12952 3310
16590C310r6309j8448M5879p3051r5445j14841j1334P6082J77653N7121o799n8462
$$ 3310 -92999 -111447 -65568 -138619 -234064 -348905 -360239 -284157 -106504 -49383 -56182 -114644
16578a14644r080J03213j764K416o1236l0197O5344j8055P812R8098M9096r363
$$ -114644 -123724 -20511 -22275 -19859 -81095 -111292 -45948 -64003 -56191 41907 91003 81640
16566H1640o0358J9342O23j41230j07790L1603l5156j2233J67800J21957p752
$$ 81640 21282 40624 41247 -99983 -207773 -176170 -211326 -223559 -55759 66198 58446
16555E8446r6882q4607J04355K6417j63429n1066l9235q696k5434J44460j0276
$$ 58446 -38436 -123043 -18688 7729 -155700 -206766 -246001 -254697 -280131 -135671 -145947
16544a45947O9032N3422q3623r8039K4398Q1980K2306k4942O6220k8235q4700
$$ -145947 -76915 -23493 -107116 -205155 -180757 -98777 -76471 -101413 -35193 -63428 -148128
16533a48128j65710o9354R9079R6797N3432j27999q976m1110N9535M7377O6701
$$ -148128 -313838 -383192 -284113 -187316 -133884 -261883 -270859 -311969 -252434 -205057 -138356
16522a38356J2439J20282O9408p4200p949l505m3049J0674n8913m5409m2798P4307
$$ -138356 -125917 -5635 63773 -10427 -18376 -21881 -64930 -54256 -113169 -158578 -201376 -127069
16510a27069J1828L3086R017q038p6316l6214K2939R6157M6885O3502k7868r713
$$ -127069 -115241 -82155 -73138 -81176 -157492 -193706 -170767 -74610 -27725 35777 7909 -1804
16498a804m3751j02006p5608j5164K1122J38193O9916j7732M9140M6797p0727
$$ -1804 -45555 -147561 -223169 -238333 -217211 -79018 -9102 -26834 22306 69103 -1624
16487a624L3022J25068J0627K1563j02514K6167j09286n8497n1449J8322M9636
$$ -1624 31398 156466 167093 188656 86142 112309 3023 -55474 -106923 -88601 -38965
16476c8965Q0422o7190P8741P9282j9993n9254n6913m1790K4372R5518Q187n1464
$$ -38965 41457 -25733 53008 132290 112297 53043 -3870 -45660 -21288 74230 82417 30953
16464C0953M3290r2090K4818P6335P9002L3830l3141q7105q5259P373j29879o8625
$$ 30953 74243 -17847 6971 83306 162308 196138 162997 75892 -9367 -1994 -131873 -200498
16452b00498K8229J06479J38537O0319r541p9842j03847q2020p534K029p2739
$$ -200498 -172269 -65790 72747 133066 123525 43683 -60164 -142184 -149718 -147689 -220428
16441b20428L4299R411o3606P7289j347N4545O0366j6207j3457J1099J8848n746
$$ -220428 -186129 -176718 -240324 -163035 -164382 -109837 -49471 -65678 -79135 -68036 -49188 -54934
16429e4934l5035K1972L456q2814M0079J38204Q7598p9672k40134p3846K4388
$$ -54934 -89969 -67997 -64541 -147355 -107276 30928 118526 38854 -201280 -275126 -250738
16418b50738Q0861J4651Q7216j9945j87480J4991J47939j0560p5023j6632K1314
$$ -250738 -169877 -155226 -68010 -87955 -275435 -260444 -112505 -123065 -198088 -214720 -193406
16407a93406R8334J1086m655Q0418P5883Q6026l0626p8443o5229M0564Q4899j252
$$ -193406 -95072 -83986 -88641 -8223 67660 153686 123060 44617 -20612 19952 104851 103599
16395A03599j55992q1746O3909Q197P1510J26781K178p5401P031J0004J8783m1264
$$ 103599 -52393 -134139 -70230 -62033 9477 136258 138436 63035 70066 80070 98853 57589
16383E7589k1420k7771n9124j2199J38638k0544q6567L866J1316p0723n5224j7514
$$ 57589 36169 8398 -50726 -62925 75713 55169 -31398 -27532 -16216 -86939 -142163 -159677
16371a59677O940p9109J21723J4707j04976j8752J19281J68410Q3272M820M5009
$$ -159677 -152737 -231846 -110123 -95416 -200392 -219144 -99863 68547 151819 156639 201648
16360B01648k06292n2405l5547q591k0845k809J25965j9911K5336K1831j5O5428
$$ 201648 -4644 -57049 -92596 -101187 -122032 -124841 1124 -18787 6549 28380 28365 93793
16348I3793k116J2080R7042K150l8407j7090m5658j04261K0420l0820l4319j27137
$$ 93793 91677 103757 200799 202949 164542 147452 101794 -2467 17953 -12867 -47186 -174323
16336a74323m1401L612Q8519n682r3266J32938O6144M8800J14064j95266q8913
$$ -174323 -215724 -212112 -123593 -129275 -222541 -89603 -23459 25341 139405 -55861 -144774
16325a44774P7368J51612J12891n4720o4068N8517k3679n3047O6467Q6024K665
$$ -144774 -67406 84206 197097 142377 78309 136826 113147 60100 126567 212591 215256
16314B15256L4143p8479j3497m4426k9759M696P792N972q9763o5878M4891J14225
$$ 215256 249399 170920 157423 112997 83238 87934 95726 101698 11935 -53943 -9052 105173
16302A05173J1850j03562n1757p9088K347P6045L4289N5181j7791r2530k028J3925
$$ 105173 117023 13461 -38296 -117384 -115037 -38992 -4703 50478 32687 -59843 -61871 -47946
16290d7946K9473J7123M6677l4277m2472k5706m0827j4557l1253k1582J14546
$$ -47946 -18473 -1350 45327 11050 -31422 -57128 -97955 -112512 -143765 -165347 -50801
16279e0801J11210n5237j20187P6024O7194Q615o1374k8086K9208l1093j02427
$$ -50801 60409 5172 -115015 -38991 28203 36818 -24556 -52642 -23434 -54527 -156954
16268a56954j22818o5685N8082k3990J10883N8296R1023Q7256M4292n7965N3774
$$ -156954 -279772 -345457 -287375 -311365 -200482 -142186 -51163 36093 80385 22420 76194
16257G6194K2614j62993K1094K259q8188j23228j5363J17656R2441R3649J42739
$$ 76194 98808 -64185 -43091 -40832 -129020 -252248 -267611 -149955 -57514 36135 178874
16246A78874N3210n4981j9322m6114k9497l4346m142l873o3375L5925j08965j29478
$$ 178874 232084 177103 157781 111667 82170 47824 43682 39809 -23566 12359 -96606 -226084
16234b26084o5251J11774O9135L484k3671M2973N0124j05834k14525J51701N9838
$$ -226084 -291335 -179561 -110426 -106942 -130613 -87640 -37516 -143350 -357875 -206174 -146336
16223a46336j33660N4070J21292J08685n4677N6864R8635N3441l5915j17050m4502
$$ -146336 -279996 -225926 -104634 4051 -50626 6238 104873 158314 122399 5349 -39153
16212c9153j6944j01601p6512o3992J08377l5035N8814R8483j7339J5519N0311
$$ -39153 -56097 -157698 -234210 -298202 -189825 -224860 -166046 -67563 -84902 -69383 -19072
16201a9072j6132p7104N3280K9506J1181q0725n5198k3314m8742J6634Q6584O3190
$$ -19072 -35204 -112308 -59028 -29522 -18341 -99066 -154264 -177578 -226320 -209686 -123102 -59912
16189e9912M0727L2351j62197o8527K0360O8583K0363K7643r5136O1238j5477
$$ -59912 -19185 13166 -149031 -217558 -197198 -128615 -108252 -80609 -175745 -114507 -129984
16178a29984N1325M8091k2954M8831M1656q4002K1779p4445k0044N0270P090n4825
$$ -129984 -78659 -30568 -53522 -4691 36965 -47037 -25258 -99703 -119747 -69477 -62387 -117212
16166a17212j6729l7631j5298o5182Q1475O9964n618k302j30425J0542j1990n1510
$$ -117212 -133941 -171572 -186870 -252052 -170577 -100613 -106231 -108533 -238958 -228416 -240406 -291916
16154b91916K5151J4379L9492J8750P7414P0015K9363M5862J6178m8871j51886
$$ -291916 -266765 -252386 -212894 -194144 -116730 -46715 -17352 28510 44688 -4183 -156069
16143a56069j3320O4970l4571J19678J6484n0927m7744J0101j23781J7199J615
$$ -156069 -169389 -104419 -138990 -19312 -2828 -53755 -101499 -91398 -215179 -197980 -196365
16132a96365L6461L8813J45165M4424K0047j0774n6373K6314n828o8825q7149
$$ -196365 -159904 -121091 24074 68498 88545 77771 21398 47712 41884 -26941 -114090
16121a14090K02398O2660k5921j05686j35496R6807J7599j8597Q941N3230N8639
$$ -114090 88308 150968 125047 19361 -116135 -19328 -1729 -20326 -11385 41845 100484
16110A00484K0078m010r947n2411J21366R0978N5797o1961r5634j30575q742k9561
$$ 100484 120562 116552 106605 54194 175560 266538 322335 260374 164740 34165 25423 -4138
16098d138r6404l035K9608l2475L4032j018j0038J36266P4590j08620m2055l9690
$$ -4138 -100542 -103577 -73969 -106444 -72412 -73430 -83468 52798 127388 18768 -23287 -62977
16086f2977m5872l2707M6131R4611Q756J5921P2696q3199k3185L8427n0738K5214
$$ -62977 -108849 -141556 -95425 -814 7942 23863 96559 13360 -9825 28602 -22136 3078
16074C078l6040o0670p6261k8599J85268Q3864N6409j13421r576l8580J3895R3660
$$ 3078 -32962 -93632 -169893 -198492 -13224 70640 127049 13628 4052 -34528 -20633 73027
16062G3027k8183j03622o248n6218M9168N9999j6134O0473M8110N3601q9041r2549
$$ 73027 44844 -58778 -65026 -121244 -72076 -12077 -28211 32262 80372 133973 44932 -47617
16050d7617j49842p3032Q6230M6417O9707M1588l5323K7040K1317J01067N061
$$ -47617 -197459 -270491 -184261 -137844 -68137 -26549 -61872 -34832 -13515 87552 92613
16039I2613o5005m1507N0517j14497j09347M1852Q5925j3106q7552K1440J04677
$$ 92613 27608 -13899 36618 -77879 -187226 -145374 -59449 -72555 -160107 -138667 -33990
16028c3990Q2305r123N0698J25396M172k09493p1916Q2526J05127K14431l3935
$$ -33990 48315 39192 89890 215286 219458 9965 -61951 20575 125702 340133 306198
16017C06198j35018j07221K2905R5003o6377r7095O878j0936k9247J65233J005
$$ 306198 171180 63959 86864 181867 115490 18395 25273 14337 -14910 150323 151328
16006A51328j62924m1704O7735O3234l7612j06126N4760J7909O3238M08p0388
$$ 151328 -11596 -53300 14435 77669 40057 -66069 -11309 6600 69838 70246 -142
15995a42n9315l8180Q7471o568j65447n3329J38221J51477l1072M7001j11006
$$ -142 -59457 -97637 -10166 -16734 -182181 -235510 -97289 54188 23116 70117 -40889
15984d0889n70K9623J8920J6776r5180K1437k323K3614J39544J41898o291j50647
$$ -40889 -41459 -11836 7084 23860 -71320 -49883 -52206 -28592 110952 252850 246559 95912
15972I5912m2003K0641m6187J5672r8898k5498L8659j18990j05313P8139J39209
$$ 95912 53909 74550 28363 44035 -54863 -80361 -41702 -160692 -266005 -187866 -48657
15961d8657J04597R859p4984l1533L004M298o0165L9431o2271O3281L9319m5851
$$ -48657 55940 65799 -9185 -40718 -37714 -33416 -93581 -54150 -116421 -53140 -13821 -59672
15949e9672J0750P3141N6449M5005q1384j01201N133r5117n6915N6222P5076j4649
$$ -59672 -48922 24219 80668 125673 44289 -56912 -51779 -146896 -203811 -147589 -72513 -87162
15937h7162j7209J07026P8519m063J1160M4854J5512o3714m0651k7819q7343K0168
$$ -87162 -104371 2655 81174 77111 88271 133125 148637 84923 44272 16453 -70890 -50722
15925e0722J58431O417k8380k4089p5955j02775O4337J7207N7126O6418J30855
$$ -50722 107709 114126 85746 61657 -14298 -117073 -52736 -35529 21597 88015 218870
15914B18870n6001j6879N9965L1632Q5693j21630o1045O3055j27817j3136O2761
$$ 218870 162869 145990 205955 237587 323280 201650 140605 203660 75843 62707 125468
15903A25468m2012R375l8094J6802R7203M9639k0027j3766j92080j01952q0722
$$ 125468 83456 92831 54737 71539 168742 218381 198354 184588 -7492 -109444 -190166
15892a90166O7970j2464K9367J15665M3402p9406l9373J67282O6284J2782m3307
$$ -190166 -122196 -134660 -105293 10372 53774 -25632 -65005 102277 168561 181343 138036
15881A38036r8866p9328j26967J4370N1540L9460M9395q4504R0531m7055m1754
$$ 138036 39170 -40158 -167125 -152755 -101215 -61755 -12360 -96864 -6333 -53388 -95142
15870i5142n244P1528O5419M7547o0318M6398M148p2452r879J53845N7853j59363
$$ -95142 -100386 -28858 36561 84108 23790 70188 74336 1884 -7995 145850 203703 44340
15858D4340j18814L9676K2525m7034N9282R8296N1733R8655r5622l349M7573n9795
$$ 44340 -74474 -34798 -12273 -59307 -25 98271 150004 248659 153037 149688 197261 137466
15846A37466j51904p1171L0956l7926l9030J20881M6786p5500j01158n1351l709
$$ 137466 -14438 -85609 -54653 -92579 -131609 -10728 36058 -39442 -140600 -191951 -195660
15835a95660k1536L9338R1415M0383L3706j27526Q2429J7030p3193k216K7261
$$ -195660 -217196 -177858 -86443 -46060 -12354 -139880 -57451 -40421 -113614 -115830 -88569
15824h8569N767k7481k288o4229P8808J16151J0456k8613m7053N3209O3761O547
$$ -88569 -82802 -110283 -112571 -176800 -97992 18159 28615 2 -47051 6158 69919 76466
15812G6466J0480n4754L6121k1243k5494M7472M2915k6387j48742J9622j10796
$$ 76466 86946 32192 68313 47070 21576 69048 111963 85576 -63166 -43544 -154340
15801a54340k6248Q3783J56196P6387q9506l0421J5266o852j3806l6061P8892
$$ -154340 -180588 -96805 59391 135778 46272 15851 31117 24265 10459 -25602 53290
15790E3290J7111j3506m1114m7015L9729P5592r6425n6132R0098P9126l5540j34822
$$ 53290 70401 56895 15781 -31234 8495 84087 -12338 -68470 21628 100754 65214 -69608
15778f9608L384O5386J63355k5624k17777o5239J46244j2750q4851q9586k6896
$$ -69608 -66224 -838 162517 136893 -80884 -146123 121 -12629 -97480 -187066 -213962
15767b13962L2756R0025m4201j22652J1974J98518Q1209p9069p3786R0547K4494
$$ -213962 -181206 -91181 -135382 -258034 -246060 -47542 33667 -45402 -119188 -28641 -4147
15756d147l8042K3849m2821K470J6784j7823l4595j118O7487M6252j8412J37430
$$ -4147 -42189 -18340 -61161 -58691 -41907 -59730 -94325 -95443 -27956 18296 -116 137314
15744A37314K739j13868l7013k1307L5587L7623J753K335p3592q4404l7280J065
$$ 137314 140053 26185 -10828 -32135 3452 41075 42828 45163 -28429 -112833 -150113 -149048
15732a49048L3940j25647L4322J27064L2328J05491K3237J09864q007j01732k03799
$$ -149048 -115108 -240755 -206433 -79369 -47041 58450 81687 191551 183544 81812 -121987
15721a21987o3040K9767J49555Q2622m5390j2882Q5675J5279j08001n2726Q095
$$ -121987 -185027 -155260 -5705 76917 31527 18645 104320 119599 11598 -41128 -33033
15710c3033k8150L4524Q3767l7897j63668Q221N4385m1675k7507R3139K4962L000
$$ -33033 -61183 -26659 57108 19211 -144457 -136236 -81851 -123526 -151033 -57894 -32932 -29932
15698b9932N3338o8982m5400N394o6974k2560o6547J0046J05645Q4854J55180
$$ -29932 23406 -45576 -90976 -85582 -152556 -175116 -241663 -231617 -125972 -41118 114062
15687A14062N5357J08609j6359q3626M3016j81788j1508K9835l6497l5497o1614
$$ 114062 169419 278028 261669 178043 221059 39271 27763 57598 21101 -14396 -76010
15676g6010k4315j132Q020R4454j630r5384p3062K16231M8194r1234j9343n824
$$ -76010 -100325 -101457 -93437 1017 -613 -95997 -169059 47172 95366 4132 -15211 -21035
15664b1035O4607q668L8023q6463l1381j7239K9498K2345M9973Q5797l1499p7043
$$ -21035 43572 34904 72927 -13536 -44917 -62156 -32658 -10313 39660 125457 93958 16915
15652A6915m7970l8503q7877M1224j5336L7355N8283O98P740K3601J06648l8329
$$ 16915 -31055 -69558 -157435 -116211 -131547 -94192 -35909 -35211 -27471 -3870 102778 64449
15640F4449j25482l2492J9218O5077k6155J1949P5892m506o2085m0437O9330O8065
$$ 64449 -61033 -93525 -74307 -9230 -35385 -23436 52456 47950 -14135 -54572 14758 82823
15628H2823L2199J9577P4070o9664q7263n4512J16677L4080o3704K6947m6427
$$ 82823 115022 134599 208669 139005 51742 -2770 113907 147987 84283 111230 64803
15617F4803q2127o3490k6613p2345M6775Q1737J746L3437P473n0018J2249R0952
$$ 64803 -17324 -80814 -107427 -179772 -132997 -51260 -49514 -16077 -8604 -58622 -46373 44579
15605D4579N94M3837l6054j6377l04l122K5000M0068k3205N8551j14289L7736
$$ 44579 45173 89010 52956 36579 36275 33153 58153 98221 75016 133567 19278 57014
15593E7014J32982K7346j12176r2696n1754M1868M8074J09779P9567M101p7548
$$ 57014 189996 217342 105166 12470 -39284 2584 50658 160437 240004 244105 166557
15582A66557n3444p7891o2120Q6401J01331j818m9089j21635r3221m0952Q5122
$$ 166557 113113 35222 -26898 59503 160834 159016 109927 -11708 -104929 -145881 -60759
15571f0759J25375j19886o7418J657Q8945R8262N6860o9585k255R07N2932m9418
$$ -60759 64616 -55270 -122688 -121031 -32086 66176 123036 53451 51196 52103 105035 55617
15559E5617q070J2739q6306j03251o567J3706M5427j1071J34847m5683j03976
$$ 55617 47547 60286 -26020 -129271 -135838 -122132 -76705 -87776 47071 1388 -102588
15548a02588L8656J00430R4285k9034M4579J4144m0524Q532K7354k3550O9682
$$ -102588 -63932 36498 130783 101749 146328 160472 119948 128480 155834 132284 201966
15537B01966r8070r4685k7626J36785M2533k3237J9181O7337O437l1994j7280
$$ 201966 103896 9211 -18415 118370 160903 137666 156847 224184 230621 198627 181347
15526A81347q8561p4928O1045j9344M9174l1609k0580N5422K4740j33294K4871
$$ 181347 92786 17858 78903 59559 108733 77124 56544 111966 136706 3412 28283
15515B8283P4706m7032N1992O503k7057N6864N676j0687l4040j3099N04l2758
$$ 28283 102989 55957 107949 114452 87395 144259 149935 139248 105208 92109 92613 59855
15503E9855k3095K5853J0190n2053o2468R0219J48139o1908j00240J1035k9675
$$ 59855 36760 62613 72803 20750 -41718 48501 196640 134732 34492 45527 15852
15492A5852q1485K4605K2343Q3702Q3106p9040q4130o100R839j956M3808m4580
$$ 15852 -65633 -41028 -18685 65017 148123 69083 -15047 -21147 -11308 -13264 30544 -14036
15480a4036K121M3437K53p5507J696L1432J608j16384J1611Q8698M0620N5681
$$ -14036 -11915 31522 31775 -43732 -42036 -10604 -8996 -125380 -113769 -25071 15549 71230
15468G1230J53462J97304P371j31359l6794N8098k4782o0858J2636K496l6020
$$ 71230 224692 421996 429367 298008 261214 319312 294530 233672 246308 248804 212784
15457B12784j11394p187L6171N2080k9036j01826K8440j7100j811J4019R8959
$$ 212784 101390 94203 130374 182454 153418 51592 80032 62932 61121 75140 174099
15446A74099L8075o0694N1918k5130j48155j00657J58055J95033l1077r8908J71
$$ 174099 212174 151480 203398 178268 30113 -70544 87511 282544 251467 152559 152730
15435A52730l209q3740J3377O3001o5184P1982j8085n4859L1855K7517M2077k1248
$$ 152730 149521 65781 79158 142159 76975 148957 130872 76013 107868 135385 177462 156214
15423A56214j4926N6273k5328J4599K3659j4020k7123R0471o7649Q9077L3300
$$ 156214 141288 197561 172233 186832 210491 196471 169348 259819 192170 281247 314547
15412C14547p0966K0778l4294L5413j5215P6437L602q2862l3887J04358J26136
$$ 314547 243581 264359 230065 265478 250263 326700 330302 247440 213553 317911 444047
15401D44047O4715J2673q6736n1405j08419M6089J12727M0013m1417l9677O98
$$ 444047 508762 521435 434699 383294 274875 320964 433691 473704 432287 392610 393308
15390C93308Q3809J451o6020l8835Q2896j07659L770N0728j5898N6505J06607
$$ 393308 477117 478568 412548 373713 456609 348950 352720 403448 387550 444055 550662
15379E50662L2208M310k24869l1951J35142j2339j59595L1614J29171O1579o9923
$$ 550662 582870 587180 362311 330360 465502 453163 293568 325182 454353 515932 446009
15368D46009p853N2612j4246N8474k2288R336n3609K9960l0565N8967K33106J11604
$$ 446009 438156 490768 476522 534996 512708 522044 468435 498395 467830 526797 759903 871507
15356H71507p2049M355n7034n3077Q7832K4066k3330J68187j05071j88745l5656
$$ 871507 799458 803813 746779 693702 781534 805600 782270 950457 845386 656641 620985
15345F20985Q6616N7436j0397J08Q8151L036n1842m0658M1053Q9982K5512j19262
$$ 620985 707601 765037 754640 754748 842899 845935 794093 753435 794488 884470 909982 790720
15333G90720r4279p837N9690J8360j08601m8268N9713Q9764p2855K1944R5315
$$ 790720 696441 688604 748294 766654 658053 609785 669498 759262 686407 708351 803666
15322H03666j44239k198O3111m7525q0536l2257j34431Q2190J1228R7833O4974
$$ 803666 659427 657229 720340 672815 592279 560022 425591 507781 519009 616842 681816
15311F81816K3985P413n2445n6958O5639N403m2503q835j4379J6903K8153N5896
$$ 681816 705801 713214 660769 603811 669450 674853 632350 623515 609136 626039 654192 710088
15299G10088q0072p113J645K8513q3678R1674O7555Q349P4373l7155j77977q6986
$$ 710088 630016 622903 624548 653061 569383 661057 728612 736961 811334 774179 596202 509216
15287E09216K9834L1656j88927L9082L0297J8492P2258J40187N1118p0904j17872
$$ 509216 539050 570706 381779 420861 451158 469650 541908 682095 733213 662309 544437
15276E44437q550M8714L9656Q4982J1843K2589l7314o2245P2472J4294j446m4122
$$ 544437 535887 584601 624257 709239 721082 743671 706357 644112 716584 730878 729432 685310
15264F85310J7703J61160j006j53604j18817L3182P0780K1715L9275J8519q1242
$$ 685310 703013 864173 863167 709563 590746 623928 694708 716423 755698 774217 692975
15253F92975R1128K01386L9231k5576l0103j2371r2533k740m0280M4749K6722
$$ 692975 784103 985489 1024720 999144 969041 956670 864137 861397 821117 865866 892588
15242H92588J272o8083o5273k7815L669l1531J37445l4042j03212K7429O7582
$$ 892588 893860 825777 760504 732689 736358 704827 842272 808230 705018 732447 800029
15231H00029r6746o312L3238O1142Q6774k3481n2444j0102k7957j1067N1186k0598
$$ 800029 703283 696971 730209 791351 878125 854644 802200 792098 764141 753074 804260 783662
15219G83662J7350J511m2814n1593l8702j4892J8829L7100M7196m573k7847p5382
$$ 783662 801012 802523 759709 708116 669414 654522 673351 710451 757647 753074 725227 649845
15207F49845j25547j9314Q3157J43061J10420j23044j47547n4301k8546k067O679
$$ 649845 524298 504984 588141 731202 841622 718578 571031 516730 488184 486117 492796
15196D92796o0075k5563l5990N9393P0156o922K7186P3679Q4314j9068o6291j07778
$$ 492796 432721 407158 371168 430561 500717 493795 520981 594660 678974 659906 593615 485837
15184D85837j27320l0271L93P0563L6447j8974O4612Q6296P7668m545L6018J20837
$$ 485837 358517 328246 328639 399202 435649 416675 481287 567583 645251 640706 676724 797561
15172G97561r4282j34813N0916M9356k9264O3865J3327p6666n1765r3086J7828
$$ 797561 703279 568466 619382 668738 639474 703339 716666 640000 588235 495149 512977
15161E12977J54327N0601m0061p0167Q221k631j1202J7526j29699j35283n0639
$$ 512977 667304 717905 677844 607677 615898 613267 602065 619591 489892 354609 303970
15150C03970j4949l4369J09252J06019j08011p0995J23878P4771n7656l8609n6973
$$ 303970 289021 254652 363904 469923 361912 290917 414795 489566 431910 393301 336328
15139C36328N5753Q4593K7930K8119O2320q1904P890J1431M0575N2988j23071
$$ 336328 392081 476674 504604 532723 595043 513139 521029 532460 573035 626023 502952
15128E02952r8204J6053p726m0237M5301p1193L4006J73025L1289l1982M0482
$$ 502952 404748 420801 413075 372838 418139 346946 380952 553977 585266 553284 593766
15117E93766M5849O265m3180r9324j38176j5904O4368J12087j13999r7478O3765
$$ 593766 639615 645880 602700 503376 365200 349296 413664 525751 411752 314274 378039
15106C78039j21319r801K8532O7325Q6527o357N8355L7723n0915j6747j6713j01042
$$ 378039 256720 246919 275451 342776 429303 422946 481301 519024 468109 451362 434649 333607
15094C33607n0781P9625J14592j05570j4746P3736M6098r9114j66197l0930n7072
$$ 333607 282826 362451 477043 371473 356727 430463 476561 377447 211250 180320 123248
15083A23248M5994R2456J38447J3450N378m4374j29582l4562P4482K2120l578
$$ 123248 169242 261698 400145 413595 418973 374599 245017 210455 284937 307057 303479
15072C03479j03924N943l2314L8845K56272J01515j05337K9424o6866n8942J3509
$$ 303479 199555 205498 173184 212029 468301 569816 464479 493903 427037 368095 381604
15061C81604J35110q0605o5177q696n0003K6660K03646Q7292n3014q1975l2040
$$ 381604 516714 436109 370932 362236 312233 338893 542539 629831 576817 494842 462802
15050D62802p4621m064l7361p1318K7246o5761j26053j1546k5433J3207J00798
$$ 462802 388181 384117 346756 275438 302684 236923 110870 99324 73891 87098 187896
15039A87896J29490n4140M2791O7163r5269o4506J15908O8285j5820j0694P4596
$$ 187896 317386 263246 306037 373200 277931 213425 329333 397618 381798 371104 445700
15028D45700k3819Q705P1067J35010p8153j24216J1671L5642j33656J5311J5724
$$ 445700 421881 430586 501653 636663 558510 434294 445965 481607 347951 363262 378986
15017C78986J4651k7178L2200O4744q8533L0237j2320L985L6799q0764m2578J1300
$$ 378986 393637 366459 398659 463403 374870 405107 392787 396772 433571 352807 310229 321529
15005C21529P2471o6271n5140O7045N3775O1481j4658J4896L4773q826l4299L0882
$$ 321529 394000 327729 272589 339634 393409 454890 440232 455128 489901 481075 446776 477658
14993D77658J07560O2887j9842j04638j58150l529P5348M6246L3700J7698n3014
$$ 477658 585218 648105 628263 523625 365475 361946 437294 483540 517240 534938 481924
14982D81924k2628j60918j31816J6835N2675J17398Q4222O3990q538o4104p81
$$ 481924 459296 298378 166562 183397 236072 353470 437692 501682 493144 429040 428259
14971D28259K8311M6520k0681r8041J16662N4761m5739L3299O739o2778N6645
$$ 428259 456570 503090 482409 384368 501030 555791 510052 543351 550090 487312 543957
14960E43957K6543M9884k9622M6921j04923j40069m8900M9633R1714Q1120J41629
$$ 543957 570500 620384 590762 637683 532760 392691 343791 393424 485138 566258 707887
14949G07887l6397k42709j77789M2668J42185P458L2462N6137J24398O979K8427
$$ 707887 671490 428781 250992 293660 435845 443303 475765 531902 656300 663279 691706
14938F91706m359j02412J54850K270J8765J6278q0447j33438P0109N4217Q126
$$ 691706 687347 584935 739785 742055 760820 777098 696651 563213 633322 687539 695665
14927F95665p6222r0235P5932p223J9098j8704M743M6544o6877m4956K4390N873
$$ 695665 619443 529208 605140 597917 617015 598311 603054 649598 582721 537765 562155 568028
14915E68028L4557K7207K3319l3304O8717Q7980R239K028n8135M1026P7415o045
$$ 568028 602585 629792 653111 619807 688524 776504 785743 787771 729636 770662 848077 842032
14903H42032j03759j019N0428j1575J21528l8712k7166L804n2640N5944J49843
$$ 842032 738273 737254 787682 776107 897635 858923 831757 835561 782921 838865 988708
14892I88708l5856O9931n2035j86462l8823r040q5391j02628Q3167R3639l1881
$$ 988708 952852 1022783 970748 784286 745463 736423 651032 548404 631571 725210 693329
14881F93329O9165J31083m4679r448M98j24806o4239R9629J51982n58n1042L6291
$$ 693329 762494 893577 848898 839450 839948 715142 650903 750532 902514 901956 850914 887205
14869H87205J9017j2037O056j8974l3486P8102q017k8080O6152k1493j3789q073
$$ 887205 906222 894185 900241 881267 847781 925883 917866 889786 955938 934445 920656 912583
14857I12583K7400O2957k7092k6470M9312L597m9194L9377R9730M705l6539q81
$$ 912583 939983 1002940 975848 949378 998690 1002287 953093 992470 1092200 1096905 1060366 1059485
14845A059485J01546P0392J9798l8760l6313k3903l6835K5590N2003l9922m0359
$$ 1059485 1161031 1231423 1251221 1212461 1176148 1152245 1115410 1141000 1193003 1153081 1112722
14834A112722q2472J5725L1553P4516o0795r4187n0755r4690r4675J15661J68084
$$ 1112722 1030250 1045975 1077528 1152044 1091249 997062 946307 851617 756942 872603 1040687
14823A040687Q1744N1732p6585J6511O1685r190o8357M7482k491L1897J76146
$$ 1040687 1122431 1174163 1097578 1114089 1175774 1166584 1098227 1145709 1143218 1175115 1351261
14812A351261o2400l9840K7916p4015o979m1859J47094J58725p6950n0116n2376
$$ 1351261 1288861 1249021 1276937 1202922 1195943 1154084 1301178 1459903 1382953 1332837 1280461
14801A280461O8751j4154j5195M1665N0025j07876P79Q8851N3440m928k2611m2792
$$ 1280461 1349212 1335058 1319863 1361528 1411553 1303677 1304456 1393307 1446747 1441819 1419208 1376416
14789A376416k7653J86021J72602k8986m1919J08947J5599P4599P5592M3292j1156
$$ 1376416 1348763 1534784 1707386 1678400 1636481 1745428 1761027 1835626 1911218 1954510 1943354
14778A943354j86114Q3646R9893K454n4807P5413J19350R5635J61958k1834k1770
$$ 1943354 1757240 1840886 1940779 1943233 1888426 1963839 2083189 2178824 2340782 2318948 2297178
14767B297178P689J02956P3529o0089n4859P7143J82880J12193R0444Q5743m1375
$$ 2297178 2304867 2407823 2481352 2421263 2366404 2443547 2626427 2738620 2829064 2914807 2873432
14756B873432k8055J83410J26898n7752j93709O2396J47696Q0128o6681j86323
$$ 2873432 2845377 3028787 3155685 3097933 2904224 2966620 3114316 3194444 3127763 2941440
14746B941440q562K23298L7147J3107j03267j02677j22466m4376N9658P3714k3258
$$ 2941440 2932878 3156176 3193323 3206430 3103163 3000486 2878020 2833644 2893302 2967016 2943758
14735B943758L2358j05861m6245M5367j85315o9478Q4691j3577J3774j46085j16185
$$ 2943758 2976116 2870255 2824010 2869377 2684062 2614584 2699275 2685698 2699472 2553387 2437202
14724B437202j8699q7032N5929J01565R8096j5079k9689q8116q7191n7129j06500
$$ 2437202 2418503 2331471 2387400 2488965 2587061 2571982 2542293 2454177 2366986 2309857 2203357
14713B203357J537j1923P3203O4547r5284R5911J70486m0593L9432n4361P9805
$$ 2203357 2204894 2192971 2266174 2330721 2235437 2331348 2501834 2461241 2500673 2446312 2526117
14702B526117M5562P3110o4559o0602P6348K7505j3747j2025R2115O1868j31934
$$ 2526117 2571679 2644789 2580230 2519628 2595976 2623481 2609734 2597709 2689824 2751692 2619758
14691B619758j30108q758j4118K3797Q0923P1436N5165L3352J6643k8534J3814
$$ 2619758 2489650 2480892 2466774 2490571 2571494 2642930 2698095 2731447 2748090 2719556 2733370
14680B733370q0835j31637j99852L8438R5013P7552M500J05292j47000r5729M8916
$$ 2733370 2652535 2520898 2321046 2359484 2454497 2532049 2536549 2641841 2494841 2399112 2448028
14669B448028J12465K1371J32722Q7686q1964J7915J8999K6154J8667P1872m440
$$ 2448028 2560493 2581864 2714586 2802272 2720308 2738223 2757222 2783376 2802043 2873915 2869475
14658B869475j55810K0984O0827n8216k4259R8767J2940P0841j20452l0900Q4588
$$ 2869475 2713665 2734649 2795476 2737260 2713001 2811768 2824708 2895549 2775097 2744197 2828785
14647B828785L6163l4812J5332L486K8539K422j3704q5755K9913R7366J11705
$$ 2828785 2864948 2830136 2845468 2848954 2877493 2879915 2866211 2780456 2810369 2907735 3019440
14636C019440n7163m5331N1155N2981j3077j6193L8516Q8672J9456o554O6778
$$ 3019440 2962277 2916946 2968101 3021082 3008005 2991812 3030328 3119000 3138456 3131902 3198680
14625C198680R1032R2860j55675j67127M8177O3407J22405Q7450L666N1850M8255
$$ 3198680 3289712 3382572 3226897 3059770 3107947 3171354 3293759 3381209 3384875 3436725 3484980
14614C484980j9448k5232n9398J13437J40265N8052K6402k5285n3012Q6635J6642
$$ 3484980 3465532 3440300 3380902 3494339 3634604 3692656 3719058 3693773 3640761 3727396 3744038
14603C744038J97438l4937j43713P175J07572R309P603J39640J35753l0649j3079
$$ 3744038 3941476 3906539 3762826 3770001 3877573 3886882 3894485 4034125 4169878 4139229 4126150
14592D126150Q6751M5802k2981M1868m6911M2715o9211n7382j9430L8072l5250
$$ 4126150 4212901 4258703 4235722 4277590 4230679 4273394 4204183 4146801 4127371 4165443 4130193
14581D130193L4961M5804J61855K402r2087R743N7096J05952P1079L5449r216
$$ 4130193 4165154 4210958 4372813 4375215 4283128 4292871 4349967 4455919 4526998 4562447 4553231
14570D553231p2536o7443j65590k7064K13229Q2863j02679n359J38473J03860
$$ 4553231 4480695 4413252 4247662 4220598 4433827 4516690 4414011 4408652 4547125 4650985
14560D650985L3256P395K7471O1445m1858R8109L6609m997j6534o3032L6662P1943
$$ 4650985 4684241 4691636 4719107 4780552 4738694 4836803 4873412 4868415 4851881 4788849 4825511 4897454
14548D897454j8193N4975R3621L5370m7593j1988M7059j4522O3634M8282j5854
$$ 4897454 4879261 4934236 5027857 5063227 5015634 5003646 5050705 5036183 5099817 5148099 5132245
14537E132245P6036L9940M4787r4788n7543J48736o4687r2770J05872J0881m6699
$$ 5132245 5208281 5248221 5293008 5198220 5140677 5289413 5224726 5131956 5237828 5248709 5202010
14526E202010M5229M7925n3662r7548O2828K7114M523K8185O3984J2769L3775
$$ 5202010 5247239 5295164 5241502 5143954 5206782 5233896 5238419 5266604 5330588 5343357 5377132
14515E377132J50275K11905o1566j70907J44393J16649l7344N3506N2601Q3320
$$ 5377132 5527407 5739312 5677746 5506839 5651232 5767881 5730537 5784043 5836644 5919964
14505E919964P8589l5539K2823P6517L0203p5733k8739N6126j8303J1051P7788
$$ 5919964 5998553 5963014 5985837 6062354 6092557 6016824 5988085 6044211 6025908 6036959 6114747
14494F114747O406M0764J15631J51836P9267R0614J02626j761J3632o6797J02815
$$ 6114747 6121153 6161917 6277548 6429384 6508651 6599265 6701891 6700130 6713762 6646965 6749780
14483F749780j3660K2886j0830J64714j9779q4647O1771J21630O6230K75520J32800
$$ 6749780 6736120 6759006 6748176 6912890 6893111 6808464 6870235 6991865 7058095 7333615 7466415
14472G466415M813j6265M7632N5079J9883o696J8822R5310N8897Q7714J74150
$$ 7466415 7471228 7454963 7502595 7557674 7577557 7570861 7589683 7684993 7743890 7831604 8005754
14461H005754L4494J34285N0807K4459j26928k6179J19980M4641L1117N7773Q9497
$$ 8005754 8040248 8174533 8225340 8249799 8122871 8096692 8216672 8261313 8292430 8350203 8439700
14450H439700n0597J09832K20978K29247P9888Q7753P3794J14157J35428R0606
$$ 8439700 8389103 8498935 8719913 8949160 9029048 9116801 9190595 9304752 9440180 9530786
14440I530786J50275J83057J08523O7533j5108J03340K12372K05152M4020L750
$$ 9530786 9681061 9864118 9972641 10040174 10025066 10128406 10340778 10545930 10589950 10593700
14430A0593700Q1841K47195J07343K8223R0835Q1195J58716K40291K8557O4142
$$ 10593700 10675541 10922736 11030079 11058302 11149137 11230332 11389048 11629339 11657896 11722038
14420A1722038K44233J86711L41111L67442J05423J65328K10808J87001Q9185
$$ 11722038 11966271 12152982 12494093 12861535 12966958 13132286 13343094 13530095 13619280
14411A3619280Q0532N4645K31622K80746J47160J26973J99695K86157K80164R1503
$$ 13619280 13699812 13754457 13986079 14266825 14413985 14540958 14740653 15026810 15306974 15398477
14401A5398477J30348J92647L87303L27863K70566K28588J54659K37735K70609
$$ 15398477 15528825 15721472 16108775 16436638 16707204 16935792 17090451 17328186 17598795
14392A7598795K93812K84714L57990K69363J98437L35989M67983L79105M37652
$$ 17598795 17892607 18177321 18535311 18804674 19003111 19339100 19807083 20186188 20623840
14383B0623840L70691M97532M02847L14252M62460M02233M76278N34773M19409
$$ 20623840 20994531 21492063 21894910 22209162 22671622 23073855 23550133 24084906 24504315
14374B4504315L54680N09121N91291N98063N97071N65706N88926O81496P38236
$$ 24504315 24858995 25368116 25959407 26557470 27154541 27720247 28309173 28990669 29728905
14365B9728905P12516P01289P23488O95287Q44826Q66690Q36875Q80259R21376
$$ 29728905 30441421 31142710 31866198 32561485 33406311 34273001 35109876 35990135 36911511
14356C6911511R34988J065590J089617J148175J138866J177644J286908J362400
$$ 36911511 37846499 38912089 40001706 41149881 42288747 43466391 44753299 46115699
14348D6115699J288641J305131J562045J705469J672934J749302J829983J923849
$$ 46115699 47404340 48709471 50271516 51976985 53649919 55399221 57229204 59153053
14340E9153053J999025K079074K174293K214506K349321K585441K673222K848472
$$ 59153053 61152078 63231152 65405445 67619951 69969272 72554713 75227935 78076407
14332G8076407L024217L161911L328037L453747L707970L949076M157097M339681
$$ 78076407 81100624 84262535 87590572 91044319 94752289 98701365 102858462 107198143
14324A07198143M494084M899260M991672N360513N646420N798271O150233O468220
$$ 107198143 111692227 116591487 121583159 126943672 132590092 138388363 144538596 151006816
14316A51006816O748616P113915P404681P660284P951805Q156884Q471096Q606583
$$ 151006816 157755432 164869347 172274028 179934312 187886117 196043001 204514097 213120680
14308B13120680Q819075Q803946Q769869Q635627Q563245Q400620Q095764P832239
$$ 213120680 221939755 230743701 239513570 248149197 256712442 265113062 273208826 281041065
14300B81041065P423748O765523N949731N361873M555569L709619K888939J920963
$$ 281041065 288464813 295230336 301180067 306541940 311097509 314807128 317696067 319617030
14292C19617030R38033K4394r55803j847818k703995l601334m468302n287830
$$ 319617030 320555063 320579457 319623654 317775836 315071841 311470507 307002205 301714375
14284C01714375n919904o417386p082956p559160p807418q149137q316174q371445
$$ 301714375 295794471 289377085 282294129 274734969 266927551 258778414 250462240 242090795
14276B42090795q440550q490974q493382q290277q027762p943323p768563p446159
$$ 242090795 233650245 225159271 216665889 208375612 200347850 192404527 184635964 177189805
14268A77189805p065941o854863o539486o394879o123062n852467n501213n188237
$$ 177189805 170123864 163269001 156729515 150334636 144211574 138359107 132857894 127669657
14260A27669657m886028m658980m455607m441797m176003l881558l604814l472469
$$ 127669657 122783629 118124649 113669042 109227245 105051242 101169684 97564870 94092401
14252I4092401l372791l239612k987600k924328k801248k603899k520726k260115
$$ 94092401 90719610 87479998 84492398 81568070 78766822 76162923 73642197 71382082
14244G1382082k220347k211424k044692j955252j868488j972624j812944j600119
$$ 71382082 69161735 66950311 64905619 62950367 61081879 59109255 57296311 55696192
14236E5696192j505326j483416j465762j359411j405651j316585j242738j215707
$$ 55696192 54190866 52707450 51241688 49882277 48476626 47160041 45917303 44701596
14228D4701596j149856j168074j054744j062409r88711q97018j025395r41461
$$ 44701596 43551740 42383666 41328922 40266513 39277802 38380784 37355389 36413928
14220C6413928q95406p51021p37150q53975q18488p03626p56673p92750o38888
$$ 36413928 35518522 34767501 34030351 33176376 32357888 31654262 30897589 30104839 29465951
14211B9465951o01533o93580n46035n03370n71178n12554n31280o49384n73144
$$ 29465951 28864418 28170838 27624803 27121433 26550255 26037701 25506421 24857037 24283893
14202B4283893m46691m70462o86378m60206m22902l11027l38913l77260l81645
$$ 24283893 23837202 23366740 22680362 22220156 21797254 21486227 21147314 20770054 20388409
14193B0388409k68419k99826l28776m31014l93169l21942l19241l29326l07933
$$ 20388409 20119990 19820164 19491388 19060374 18667205 18345263 18026022 17696696 17388763
14184A7388763k89122k91971k85775k25832j99285l37466k97164j99753n9934
$$ 17388763 17099641 16807670 16521895 16296063 16096778 15759312 15462148 15262395 15202461
14175A5202461k76552l10168l66038k33192j94005j34749j64384l71408k77996
$$ 15202461 14925909 14615741 14249703 14016511 13822506 13687757 13523373 13151965 12873969
14166A2873969j48170j29195j45956k58987j23762j05855j80424j54926j96573
$$ 12873969 12725799 12596604 12450648 12191661 12067899 11962044 11781620 11626694 11430121
14157A1430121k32850j57013j37852k64653j08363j13293r5670j47547j65789
$$ 11430121 11197271 11040258 10902406 10637753 10529390 10416097 10320427 10172880 10007091
14148A0007091q4993P465j38206j52542l04413k46210j34583j32941r0111m9045
$$ 10007091 9922098 9929563 9791357 9638815 9334402 9088192 8953609 8820668 8730557 8681512
14138H681512L9465q3980j19226k15352j32983o0970j13396k24664r9900N6152
$$ 8681512 8720977 8636997 8517771 8302419 8169436 8108466 7995070 7770406 7670506 7726658
14128G726658q1689j34183k00990j7379l5272j35919n6521l8872o2960n9528j05701
$$ 7726658 7644969 7510786 7309796 7292417 7257145 7121226 7064705 7025833 6962873 6903345 6797644
14117F797644o7400l4485n6663j71871q4284j87963j54430j9425N7953o4664j54583
$$ 6797644 6730244 6695759 6639096 6467225 6382941 6194978 6040548 6021123 6079076 6014412 5859829
14106E859829N4341n0533j54644m6109j4937k2406n2811m3961P7530o2545K9908
$$ 5859829 5914170 5863637 5708993 5662884 5647947 5625541 5572730 5528769 5606299 5543754 5573662
14095E573662o7228j17572L4295k0828j21089j63955q0019N6592j03004j18173
$$ 5573662 5506434 5388862 5423157 5402329 5281240 5117285 5037266 5093858 4990854 4872681
14085D872681M6827J2828l3247j11720o9960K0474j07267M1144L7798r2532j31216
$$ 4872681 4919508 4932336 4899089 4787369 4717409 4737883 4630616 4671760 4709558 4617026 4485810
14074D485810J1439K2693K6593o5516l7712j20382j4595k9290r6570k2722j01275
$$ 4485810 4497249 4519942 4546535 4481019 4443307 4322925 4308330 4279040 4182470 4159748 4058473
14063D058473o6023j9383o2924M4159Q7803N3900J13648L1939j39490q2616j73395
$$ 4058473 3992450 3973067 3910143 3954302 4042105 4096005 4209653 4241592 4102102 4019486 3846091
14052C846091N072q8585j37422P3392L8104j31874j55930j25972l5350M6818N0195
$$ 3846091 3851163 3762578 3625156 3698548 3736652 3604778 3448848 3322876 3287526 3334344 3384539
14041C384539J07891N4005q1609j58278l1470Q1999m366l0195n2801m4104j05736
$$ 3384539 3492430 3546435 3464826 3306548 3275078 3357077 3352711 3322516 3269715 3225611 3119875
14030C119875r5006O906q33j2305R9683J19384q7144p8717J8185r9557q2765r1645
$$ 3119875 3024869 3031775 3030942 3018637 3118320 3237704 3150560 3071843 3090028 2990471 2907706 2816061
14018B816061N1752K5569j20097k01784k0494m3345O7800M3773O0143k7350p7314
$$ 2816061 2867813 2893382 2773285 2571501 2551007 2507662 2575462 2619235 2679378 2652028 2574714
14007B574714j89831P5542J07853P3702j27195r4795l6199O6957k6599o6905k672
$$ 2574714 2384883 2460425 2568278 2641980 2514785 2419990 2383791 2450748 2424149 2357244 2354572
13996B354572Q2916J25643J6710q0048j3699o051L4873K9120p3412o3075q2132
$$ 2354572 2437488 2563131 2579841 2499793 2486094 2480043 2514916 2544036 2470624 2407549 2325417
13985B325417n0617r6493M7615k3019N6348q8710P6664m0744p5564N2756n5857
$$ 2325417 2274800 2178307 2225922 2202903 2259251 2170541 2247205 2206461 2130897 2183653 2127796
13974B127796J49445Q6244j00014k9753J06361K8154l3819k2612j24327J5638
$$ 2127796 2277241 2363485 2263471 2233718 2340079 2368233 2334414 2311802 2187475 2203113
13964B203113M9203J10531Q3252m9866o1377n9532j6535l4118l3792n6203J98728
$$ 2203113 2252316 2362847 2446099 2396233 2334856 2275324 2258789 2224671 2190879 2134676 2333404
13953B333404Q6686n9j8544q0397p1549J4791P9040j4277n6113j04832M8243K902
$$ 2333404 2420090 2420031 2401487 2321090 2249541 2264332 2343372 2329095 2272982 2168150 2216393 2219295
13941B219295k0233n9020l5355N4450J44766l0456o0800j4630j9152n8575O4151
$$ 2219295 2199062 2140042 2104687 2159137 2303903 2273447 2212647 2198017 2178865 2120290 2184441
13930B184441L9566o0910M9943P2126r496K0923M460l7733m808m4611M6832l1957
$$ 2184441 2224007 2163097 2213040 2285166 2275670 2296593 2301053 2263320 2258512 2213901 2260733 2228776
13918B228776n0509J21707J18595l4563p6959k496P1870p0530j26418p0783J80169
$$ 2228776 2178267 2299974 2418569 2384006 2307047 2304551 2376421 2305891 2179473 2108690 2288859
13907B288859P9061q4174l6388l162k0416L0125N8029k2514k5202J4709p0811
$$ 2288859 2367920 2283746 2247358 2244196 2223780 2253905 2311934 2289420 2264218 2278927 2208116
13896B208116q730L5416K822L3959M7282n327J9824n6071m9198l6222K1077N7544
$$ 2208116 2199386 2234802 2237624 2271583 2318865 2313538 2333362 2277291 2228093 2191871 2212948 2270492
13884B270492P7943K9218P4248P9588o5902o389L40R7241J9687o4101j9928N0197
$$ 2270492 2348435 2377653 2451901 2531489 2465587 2459198 2459538 2556779 2576466 2512365 2492437 2542634
13872B542634Q3871M8981j03515m3567J58477M5665M6132M9373m8633j42728o0805
$$ 2542634 2626505 2675486 2571971 2528404 2686881 2732546 2778678 2828051 2779418 2636690 2575885
13861B575885p7609n2543J08305N4339L9091L7035N1066Q031M5379J55390P1780
$$ 2575885 2498276 2445733 2554038 2608377 2647468 2684503 2735569 2743600 2788979 2944369 3016149
13850C016149K0623L322m1121Q2870N7434O2531O2595P9484P7122J40258m0673
$$ 3016149 3036772 3040094 2998973 3081843 3139277 3201808 3264403 3343887 3421009 3561267 3520594
13839C520594l2551O1711m5578J07128j876j1264R0839N9822n8077L7431J66069
$$ 3520594 3488043 3549754 3504176 3611304 3609428 3598164 3689003 3748825 3690748 3728179 3894248
13828C894248M4959J58812N1357j14991k16084J488K8563l6812o166N6696n7311
$$ 3894248 3939207 4098019 4149376 4034385 3818301 3819789 3848352 3811540 3805374 3862070 3804759
13817C804759j44696q5396J2426j14254n7335O8357j2209j1438o7892J4682n8002
$$ 3804759 3660063 3574667 3587093 3472839 3415504 3483861 3471652 3460214 3392322 3407004 3349002
13806C349002j04431j37563p7624O6648J23376L4869o7098j00187l5782N1073
$$ 3349002 3244571 3107008 3029384 3096032 3219408 3254277 3187179 3086992 3051210 3102283
13796C102283N589j15239m6179r0683Q069n999j38287k1065K8193o9229P777O8220
$$ 3102283 3107872 2992633 2946454 2855771 2863840 2857841 2719554 2698489 2726682 2657453 2665230 2733450
13784B733450j00876p4968R3217O9415J08874M0428r4285m8216k6042L9850J6441
$$ 2733450 2632574 2557606 2650823 2720238 2829112 2869540 2775255 2727039 2700997 2740847 2757288
13773B757288O2633r5910q4013l0663m6565N5623k4931K26677l8561p2042k9383
$$ 2757288 2819921 2724011 2639998 2609335 2562770 2618393 2593462 2820139 2781578 2709536 2680153
13762B680153P873j1494n9497Q1353P121L395n0748M7046J20590K6563j25906
$$ 2680153 2688026 2676532 2617035 2698388 2705509 2708904 2658156 2705202 2825792 2852355 2726449
13751B726449j20254l4455Q3130L5444l2994L2962l0974n463m8486K4106P3684
$$ 2726449 2606195 2571740 2654870 2690314 2657320 2690282 2659308 2653845 2605359 2629465 2703149
13740B703149K8855P6682p4802Q2535J13369K3073j48669q9175N0350R4503n9072
$$ 2703149 2732004 2808686 2733884 2816419 2929788 2952861 2804192 2715017 2765367 2859870 2800798
13729B800798L3242P2203P4339N6088Q9894n2958l5707k8576l983m1641K1817
$$ 2800798 2834040 2906243 2980582 3036670 3126564 3073606 3037899 3009323 3005340 2963699 2985516
13718B985516M0052N757k7522k3557N852M8275Q4282K2519k7018O1466K1034r913
$$ 2985516 3025568 3031325 3003803 2980246 2986098 3034373 3118655 3141174 3114156 3175622 3196656 3186743
13706C186743Q1004N498J7291N4042j44797l6010p1832r6458P0293k6347Q8213
$$ 3186743 3267747 3273245 3290536 3344578 3199781 3163771 3091939 2995481 3065774 3039427 3127640
13695C127640l3586n3511l0709J24639K20415J11820o9798r6480m6192Q723j8321
$$ 3127640 3094054 3040543 3009834 3134473 3354888 3466708 3396910 3300430 3254238 3262961 3244640
13684C244640M3241P7772R093m3295M0176K0528k1281M8485J8166J31306j9449
$$ 3244640 3287881 3365653 3374746 3331451 3371627 3392155 3370874 3419359 3437525 3568831 3549382
13673C549382k5063N1780J54427r8877j08779k1210M1691L5234q7314L6973o0031
$$ 3549382 3524319 3576099 3730526 3631649 3522870 3501660 3543351 3578585 3491271 3528244 3468213
13662C468213k200J43942Q0479j1720j06818j57116O2990J89452L8182l1524N4858
$$ 3468213 3466013 3609955 3690434 3678714 3571896 3414780 3477770 3667222 3705404 3673880 3728738
13651C728738R6429K3240k2366J2279L7397R4505m9732J5923M2747J5756j23647
$$ 3728738 3825167 3848407 3826041 3838320 3875717 3970222 3920490 3936413 3979160 3994916 3871269
13640C871269j79Q9621M3340O2233J13987n1407j5552q0061n4373p433l325P5313
$$ 3871269 3871090 3960711 4004051 4066284 4180271 4128864 4113312 4033251 3978878 3971445 3968120 4043433
13628D043433p1572O2802J17728n0425K163k7718J22813J28456j2746n415m8050
$$ 4043433 3971861 4034663 4152391 4101966 4104129 4076411 4199224 4327680 4314934 4309519 4261469
13617D261469O8510M5610m148N7930L1595P6938j6679L2385l2547N133J30710
$$ 4261469 4329979 4375589 4371441 4429371 4460966 4537904 4521225 4553610 4521063 4526196 4656906
13606D656906J04712j966j4329k0564J5361R929M9165K3324Q2642N6452J146j06912
$$ 4656906 4761618 4759652 4745323 4724759 4740120 4750049 4799214 4822538 4905180 4961632 4962778 4855866
13594D855866o0791Q5364J20301j139l199M4789N4389L6393L12q0085J6434K7094
$$ 4855866 4795075 4880439 5000740 4999601 4996402 5041191 5095580 5131973 5132285 5052200 5068634 5095728
13582E095728J22683P5731j2870l3532J2096P0316r104M6960M2727N9878J38759
$$ 5095728 5218411 5294142 5281272 5247740 5259836 5330152 5321048 5368008 5410735 5470613 5609372
13571E609372M8474K0457N7541N1373j0755K1686K4220O9031O4261l7202m854
$$ 5609372 5657846 5678303 5735844 5787217 5776462 5798148 5822368 5891399 5955660 5918458 5913604
13560E913604O0306N9270j39095O6519O7389L0832L7310p2208J0154O5706K08199
$$ 5913604 5973910 6033180 5894085 5960604 6027993 6058825 6096135 6023927 6034081 6099787 6307986
13549F307986K22230o3717o525J4374P1P5762n4054L4530p1199J28576J37385
$$ 6307986 6530216 6466499 6459974 6474348 6474419 6550181 6496127 6530657 6459458 6588034 6725419
13538F725419M7689p8030N7000l1275J294M00n114j385J01770J67816J48080J71838
$$ 6725419 6773108 6695078 6752078 6720803 6722097 6722497 6717383 6715998 6817768 6985584 7133664 7305502
13526G305502J48607Q9250k2907P720L9767M7432r3659M1565J02912R5340L6732
$$ 7305502 7454109 7543359 7520452 7528172 7567939 7615371 7521712 7563277 7666189 7761529 7798261
13515G798261N6809N7970n7739J16678J57017R1098L2206J5190p3060O0725R3375
$$ 7798261 7855070 7913040 7855301 7971979 8128996 8220094 8252300 8267490 8194430 8255155 8348530
13504H348530j3295L0890O0660N0396L7957K0855P3091P1957P025J18425O659
$$ 8348530 8335235 8366125 8426785 8477181 8515138 8535993 8609084 8681041 8688066 8806491 8813150
13493H813150Q3065J76647Q1508M2235k3745m3077J05106K77393J20017N4606
$$ 8813150 8896215 9072862 9154370 9196605 9172860 9129783 9234889 9512282 9632299 9686905
13483I686905K13833P1026p4731l1374k9190N2383J78741J96297J43538R886J6135
$$ 9686905 9900738 9971764 9897033 9865659 9836469 9888852 10067593 10263890 10407428 10417314 10433449
13472A0433449Q4793r094P7611R1076J24669R2139J95688J57357R2587L4221L0575
$$ 10433449 10518242 10509148 10586759 10677835 10802504 10894643 11090331 11247688 11340275 11374496 11405071
13461A1405071J14539R6394O0797O5603J29227J45832O5452O1838J52061K20975
$$ 11405071 11519610 11616004 11676801 11742404 11871631 12017463 12082915 12144753 12296814 12517789
13451A2517789J67033o472m6251J42955J70240J39946J61825J40011J684J37608
$$ 12517789 12684822 12678350 12632099 12775054 12945294 13085240 13247065 13387076 13388760 13526368
13441A3526368N9846J30360k2340O1102K86628J61393Q3451J66266J79417L1282
$$ 13526368 13586214 13716574 13694234 13755336 14041964 14203357 14286808 14453074 14632491 14663773
13431A4663773R943J14613J54972Q5561J77163J74856J09532Q9829J75420K00518
$$ 14663773 14673716 14788329 14943301 15028862 15206025 15380881 15490413 15580242 15755662 15956180
13421A5956180J07946J17730J47182J05630J50542J66075J46821K15290J40938
$$ 15956180 16064126 16181856 16329038 16434668 16585210 16751285 16898106 17113396 17254334
13412A7254334K36406J96876J53291P1215J52109K47783J11925K60858J90526
$$ 17254334 17490740 17687616 17840907 17912122 18064231 18312014 18423939 18684797 18875323
13403A8875323J29484J00812J42202K61675K83671K83963J55575O1331K67602
$$ 18875323 19004807 19105619 19247821 19509496 19793167 20077130 20232705 20294036 20561638
13394B0561638K18187L00000K60585J72119J06423K21156J89280J18311K07312
$$ 20561638 20779825 21079825 21340410 21512529 21618952 21840108 22029388 22147699 22355011
13385B2355011J12043K33812K13367K04162J25838K49780J60587J88645J55840
$$ 22355011 22467054 22700866 22914233 23118395 23244233 23494013 23654600 23843245 23999085
13376B3999085P4428J25683J14164K71572K32290L8353k6185J50315J79316J37833
$$ 23999085 24073513 24199196 24313360 24584932 24817222 24855575 24829390 24979705 25159021 25296854
13366B5296854J57481J38226J77689J72615J53398R8259J78234Q8430J17466J76979
$$ 25296854 25454335 25592561 25770250 25942865 26096263 26194522 26372756 26461186 26578652 26755631
13356B6755631J98251J50855J06246J13482N2459R8766N7804Q6918K03324J25862
$$ 26755631 26953882 27104737 27210983 27324465 27376924 27475690 27533494 27620412 27823736 27949598
13346B7949598K32739J64134J89376K26329K00260M8053R0470N6801R8046J47216
$$ 27949598 28182337 28346471 28535847 28762176 28962436 29010489 29100959 29157760 29255806 29403022
13336B9403022K46468J15965P403J25797J33121J16381R3607J43574J25696N3538
$$ 29403022 29649490 29765455 29772858 29898655 30031776 30148157 30241764 30385338 30511034 30564572
13326C0564572o178K07117J70326J82380K50573P3485m3067R5208J2400J9857
$$ 30564572 30558394 30765511 30935837 31118217 31368790 31442275 31399208 31494416 31506816 31526673
13316C1526673J18875K11926L3341J29705o225r9293J00974n890p3681J23219
$$ 31526673 31645548 31857474 31890815 32020520 32014295 31915002 32015976 32010086 31936405 32059624
13306C2059624J72783J55354J36641r2023j01988M4447l5963N4065N5991N9968
$$ 32059624 32232407 32387761 32524402 32432379 32330391 32374838 32338875 32392940 32448931 32508899
13296C2508899o6969p8510l6074l9637P5173M5161j04397o2050l5578l7311o6543
$$ 32508899 32441930 32363420 32327346 32287709 32362882 32408043 32303646 32241596 32206018 32168707 32102164
13285C2102164j13724M6839k7643l2714j14832j05347J3986l5937m2091K4249
$$ 32102164 31988440 32035279 32007636 31974922 31860090 31754743 31768729 31732792 31690701 31714950
13275C1714950o3722j93994j77155q4422j35489j92901p3397p4551r3547n1883
$$ 31714950 31651228 31457234 31280079 31195657 31060168 30867267 30793870 30719319 30625772 30573889
13265C0573889j59433j02255k05768j66201j85809j30690j45698n7093r6398k6985
$$ 30573889 30414456 30312201 30106433 29940232 29754423 29623733 29478035 29420942 29324544 29297559
13255B9297559n5147k12285k11651j98616j53272j63513j36772j76452k97756
$$ 29297559 29242412 29030127 28818476 28619860 28466588 28303075 28166303 27989851 27692095
13246B7692095j91607j12797j05903j20085j84966j17808j25081j92010k22633
$$ 27692095 27500488 27387691 27281788 27161703 26976737 26858929 26733848 26541838 26319205
13237B6319205j28878k7840m2297k53175j65906k43733k20560p4486m8936j68665
$$ 26319205 26190327 26162487 26120190 25867015 25701109 25457376 25236816 25162330 25113394 24944729
13227B4944729o6901j37594k69813j67705j29425j67213k54558k15270k6059j28451
$$ 24944729 24877828 24740234 24470421 24302716 24173291 24006078 23751520 23536250 23510191 23381740
13217B3381740k38202k11469l8516k08547j96796j55542k95557k41163n2910r9808
$$ 23381740 23143538 22932069 22893553 22685006 22488210 22332668 22037111 21795948 21743038 21643230
13207B1643230j25812m0867j41287k07166j05930j00516j42430r9557j84167j73193
$$ 21643230 21517418 21476551 21335264 21128098 21022168 20921652 20779222 20679665 20495498 20322305
13197B0322305j60696l39490l56044j42239j64304j68354l5809j05295k51733
$$ 20322305 20161609 19822119 19466075 19323836 19159532 18991178 18955369 18850074 18598341
13188A8598341k36551k8257j09598j91310k52464j67721k00784k03665o9996m187
$$ 18598341 18361790 18333533 18223935 18032625 17780161 17612440 17411656 17207991 17137995 17133808
13178A7133808n2005p7943j17751K2340q7921j09532j92832j45676o9176j94900
$$ 17133808 17081803 17003860 16886109 16908449 16820528 16710996 16518164 16372488 16303312 16108412
13168A6108412j76324j24215q5345k128j72692k68610j27516o6063p9776j59738
$$ 16108412 15932088 15807873 15722528 15720400 15547708 15279098 15151582 15085519 15005743 14846005
13158A4846005j59352j03836j26390j59794k2551q4206p0485J5942j84929j63078
$$ 14846005 14686653 14582817 14456427 14296633 14274082 14189876 14119391 14135333 13950404 13787326
13148A3787326m5376l6966p5296j18326k42850j64368r4423r5206j60804n1870
$$ 13787326 13741950 13704984 13629688 13511362 13268512 13104144 13009721 12914515 12753711 12701841
13138A2701841j14097j09082j8498m6216R398j59060l5319q9390j60810n7308
$$ 12701841 12587744 12478662 12460164 12413948 12423346 12264286 12228967 12139577 11978767 11921459
13128A1921459j38898j44429l4228q8545K2616l0108o1047q7995o1146l2275k23872
$$ 11921459 11782561 11638132 11603904 11515359 11537975 11507867 11446820 11358825 11297679 11265404 11041532
13117A1041532j36696l6600j4664l2340j45016r0935j54471j58750j83031m3606
$$ 11041532 10904836 10868236 10853572 10821232 10676216 10585281 10430810 10272060 10089029 10045423
13107A0045423K5091P7447O3668j04447r1582j1691n5236L4452p2489k05894p3345
$$ 10045423 10070514 10147961 10211629 10107182 10015600 10003909 9948673 9983125 9910636 9704742 9631397
13096I631397q1433l3011k4369m5820j43589P550n2490r4027o3950M5593q0017
$$ 9631397 9549964 9516953 9492584 9446764 9303175 9310725 9258235 9164208 9100258 9145851 9065834
13085I065834j23253K3009n0867j09885n9755M5936J55052O815k01403K3537n5634
$$ 9065834 8942581 8965590 8914723 8804838 8745083 8791019 8946071 8952886 8751483 8775020 8719386
13074H719386r8856J8984q5869p7676q3118j0312o8731k7541j36060j61587N94
$$ 8719386 8620530 8639514 8553645 8475969 8392851 8382539 8313808 8286267 8150207 7988620 7989214
13063G989214M9500o9530M8520k3862N8963r376j66016p5365o5432k2710l5728
$$ 7989214 8038714 7969184 8017704 7993842 8052805 8043429 7877413 7802048 7736616 7713906 7678178
13052G678178n8973j7534j724p4730r4170r3276j35216l5652o5191K1394J4768
$$ 7678178 7619205 7601671 7599947 7525217 7431047 7337771 7202555 7166903 7101712 7123106 7137874
13041G137874k977q434j7910O554o1586l4j00610k5919L1451r4705j27547J959
$$ 7137874 7134897 7126463 7108553 7115107 7053521 7053487 6952877 6926958 6958409 6863704 6736157 6738116
13029F738116K4806j15258r8448r6370l6107J9031O0312O9615l3181n4449n7478
$$ 6738116 6762922 6647664 6549216 6452846 6416739 6435770 6496082 6565697 6532516 6478067 6420589
13018F420589r533k8636o2959n5688J4782Q2367L8479o0915q5493p0583j89818
$$ 6420589 6411056 6382420 6319461 6263773 6278555 6360922 6399401 6338486 6252993 6182410 5992592
13007E992592k2970p9445n1419N0366K182J0174q299j17709o689L2581M9204m3362
$$ 5992592 5969622 5890177 5838758 5889124 5891306 5901480 5893181 5775472 5768783 5801364 5850568 5807206
12995E807206k9897n4140L8601N0371r4132M9045O1541l3706q54l7805k9877O1702
$$ 5807206 5777309 5723169 5761770 5812141 5718009 5767054 5828595 5794889 5794035 5756230 5726353 5788055
12983E788055n5273p1493M0775Q6650K7389o9480l1116k8448l718n8847o5837
$$ 5788055 5732782 5661289 5702064 5788714 5816103 5746623 5715507 5687059 5683341 5624494 5558657
12972E558657m5489J2103k1216p3206n1973m3248m8306Q95O0582r1287m5643q4770
$$ 5558657 5513168 5525271 5504055 5430849 5378876 5335628 5287322 5288217 5348799 5257512 5211869 5127099
12960E127099q005N1863l1864q8803o0360m2814K6140R3962m7715J3813o1689
$$ 5127099 5119094 5170957 5139093 5050290 4989930 4947116 4973256 5067218 5019503 5033316 4971627
12949D971627q1219j3734k6638j8693m6460K8932L5426n937q30q6280r9659j06859
$$ 4971627 4890408 4876674 4850036 4831343 4784883 4813815 4849241 4843304 4842474 4756194 4656535 4549676
12937D549676N7605N6282J9086n3057j05931j04208K1094N1632O8336Q986o9294
$$ 4549676 4607281 4663563 4682649 4629592 4523661 4419453 4440547 4492179 4560515 4569501 4500207
12926D500207j50639n1333K2323o0991Q9652Q4729K4916o0913p1758M668n403
$$ 4500207 4349568 4298235 4320558 4259567 4349219 4433948 4458864 4397951 4326193 4330861 4325458
12915D325458L209k1561O5090p336m5559o8435o4685K4449n861l9830l1965J12969
$$ 4325458 4328667 4307106 4372196 4364860 4319301 4250866 4186181 4210630 4204769 4164939 4132974 4245943
12903D245943L8882J6539O0836k2341k756j63816l2549j49871j58826M5435J17466
$$ 4245943 4284825 4301364 4362200 4339859 4337103 4173287 4140738 3990867 3832041 3877476 3994942
12892C994942n8836p61j2759r8679J608O8482j4230k2713J15160j5277p9197K0425
$$ 3994942 3936106 3935345 3922586 3823907 3825515 3893997 3879767 3857054 3972214 3956937 3877740 3898165
12880C898165j5588m623j45503l8376P7777n8980K4103m4037r0646K2195J06609
$$ 3898165 3882577 3877954 3732451 3694075 3771852 3712872 3736975 3692938 3602292 3624487 3731096
12869C731096o3632o5420p8955J5693N4361K7604O0061k5151R0531j3957J7888
$$ 3731096 3667464 3602044 3523089 3538782 3593143 3620747 3680808 3655657 3746188 3732231 3750119
12858C750119L4400N5790P5232J35598q5296j04816R322M0016O3237o6559j40923
$$ 3750119 3784519 3840309 3915541 4051139 3965843 3861027 3870349 3910365 3973602 3907043 3766120
12847C766120n0273J4326l2770o3154m7341M8365k6321j32520J6724J22623m8771
$$ 3766120 3715847 3730173 3697403 3634249 3586908 3635273 3608952 3476432 3493156 3615779 3567008
12836C567008j85655N6677J65756K2391j70512j39366J542Q5854P2958M9658q393
$$ 3567008 3381353 3438030 3603786 3626177 3455665 3316299 3317841 3403695 3476653 3526311 3517918
12825C517918j09449p6797J03057N8287l2306j53643o9719J4511j7623n6810j570
$$ 3517918 3408469 3331672 3434729 3493016 3460710 3307067 3237348 3251859 3234236 3177426 3175856
12814C175856j13811p8306m0846j24165q7964N1778L6928J09602j17154j54178
$$ 3175856 3062045 2983739 2942893 2818728 2730764 2782542 2819470 2929072 2811918 2657740
12804B657740J64937J10258L0552r7115M5871L5382l5366n2232L9557r7197j5761
$$ 2657740 2822677 2932935 2963487 2866372 2912243 2947625 2912259 2860027 2899584 2802387 2786626
12793B786626Q2379k0187j10222n4109m5852R342l6992k7298K3934N1270j22019
$$ 2786626 2869005 2848818 2738596 2684487 2638635 2647977 2610985 2583687 2607621 2658891 2536872
12782B536872m0420J21428K9139r2726r6234R7500j29259j7146O7767K0822J26567
$$ 2536872 2496452 2617880 2647019 2554293 2458059 2555559 2426300 2409154 2476921 2497743 2624310
12771B624310k3897R63j1425O8461P365j31241p4660r5810J8669N0839Q6888K3729
$$ 2624310 2600413 2601376 2589951 2658412 2665777 2534536 2459876 2364066 2382735 2433574 2520462 2544191
12759B544191o0340l602l5173l6924r800N7344J5304m2746P4964J82510j6190
$$ 2544191 2483851 2480249 2445076 2408152 2398352 2455696 2471000 2428254 2503218 2685728 2669538
12748B669538r3368L505r4293j51224p8519R1127k8346j2698K1937n35l8600J5642
$$ 2669538 2576170 2579675 2485382 2334158 2255639 2346766 2318420 2305722 2327659 2327124 2288524 2304166
12736B304166q5824j39378k8499L4840J0774M4334p7581m7723p2007M296K2002
$$ 2304166 2218342 2078964 2050465 2085305 2096079 2140413 2062832 2015109 1943102 1947398 1969400
12725A969400o2008L1588L9522K6108M0037n8484m1088j8600O952o6020k4076
$$ 1969400 1907392 1938980 1978502 2004610 2044647 1986163 1945075 1926475 1933427 1867407 1843331
12714A843331O7856L9476r1564l755K8715J7298P7325J31446j9681o5343o521
$$ 1843331 1911187 1950663 1859099 1855344 1884059 1901357 1978682 2110128 2090447 2025104 2018583
12703B018583L1931r3179j18028r6582k0216J0123m7256l9459l386N1607J24208
$$ 2018583 2050514 1957335 1839307 1742725 1722509 1732632 1685376 1645917 1642531 1694138 1818346
12692A818346k8959q7775K111P533L8458M5932o8402l510j0130P3225P7363j5176
$$ 1818346 1789387 1701612 1703723 1711256 1749714 1795646 1727244 1723734 1713604 1786829 1864192 1849016
12680A849016J12479L3294r1652n9680j3309M1482m7165o2985P5358l9792m8513
$$ 1849016 1961495 1994789 1903137 1843457 1830148 1871630 1824465 1761480 1836838 1797046 1748533
12669A748533L5096m9836l0695k9107O5317Q5902j52660k1008j46209o6854J36211
$$ 1748533 1783629 1733793 1703098 1673991 1739308 1825210 1672550 1651542 1505333 1438479 1574690
12658A574690P3631j6077N7149q7749o3360j862L8597j4874O0468k3222m2671
$$ 1574690 1648321 1632244 1689393 1601644 1538284 1536422 1575019 1560145 1620613 1597391 1554720
12647A554720K6285P406p8399L2566O5277k2720n381P3156K1563N0012J131K9361
$$ 1554720 1581005 1588411 1510012 1542578 1607855 1585135 1579754 1652910 1674473 1724485 1725616 1754977
12635A754977n1020q930k1591K0853p5404j48926j7218R6226M4543M2512q0665
$$ 1754977 1703957 1695027 1673436 1694289 1618885 1469959 1452741 1548967 1593510 1636022 1555357
12624A555357K7841M8340j53235n1373O1178j18243j04471n563Q3891Q9495N0333
$$ 1555357 1583198 1631538 1478303 1426930 1488108 1369865 1265394 1259831 1343722 1433217 1483550
12613A483550M950m5894Q6168Q5987l2129N1970l6390j47066k7655j11971R790
$$ 1483550 1488500 1442606 1528774 1614761 1582632 1634602 1598212 1451146 1423491 1311520 1321310
12602A321310Q148k5938l730J7797R7123j0870j13141j1325N6370j8313n0202
$$ 1321310 1329458 1303520 1299790 1317587 1414710 1403840 1290699 1279374 1335744 1317431 1267229
12591A267229p745M1710J0836N9416k7759n5579L7966O0943M6936l5238p8296
$$ 1267229 1259484 1301194 1312030 1371446 1343687 1288108 1326074 1387017 1433953 1398715 1320419
12580A320419k5937q8656Q7742J11985p873l8055R338o7727k4031R1919P7742
$$ 1320419 1294482 1205826 1293568 1405553 1397680 1359625 1368963 1301236 1277205 1369124 1446866
12569A446866J05149N7056J8146j06573j11405m6900o3368N4413M8934J48782
$$ 1446866 1552015 1609071 1627217 1520644 1409239 1362339 1298971 1353384 1402318 1551100
12559A551100l2229M714K1366J9736j83868j02416k5379q5682O8045o6383j6311
$$ 1551100 1518871 1523585 1544951 1564687 1380819 1278403 1253024 1167342 1235387 1169004 1152693
12548A152693P8714l184p3476J8963J77063P753L1821L6288J4244r2688j3070
$$ 1152693 1231407 1228223 1154747 1173710 1350773 1358526 1390347 1426635 1440879 1348191 1335121
12537A335121Q0936k5856J4915P397M4158P9431o5849r2135q1380j03847M29q295
$$ 1335121 1416057 1390201 1405116 1412513 1456671 1536102 1470253 1378118 1296738 1192891 1193320 1185025
12525A185025k4409M4730J7104J32245Q3936p6575k7278K7979j5468o5945l0355
$$ 1185025 1160616 1205346 1222450 1354695 1438631 1362056 1334778 1362757 1347289 1281344 1250989
12514A250989l8408J2183k3981m044L6728j10420j8899J4508P2321J03994N4135
$$ 1250989 1212581 1224764 1200783 1196739 1233467 1123047 1104148 1118656 1190977 1294971 1349106
12503A349106r5651q633j21820J367J3800J729J14948J50444r865o3395m0118
$$ 1349106 1253455 1244822 1123002 1124369 1138169 1139898 1254846 1405290 1395425 1332030 1291912
12492A291912L9627l1031m4119p868j1901l4780N637p8644R8754n0351n3913J3563
$$ 1291912 1331539 1300508 1256389 1248521 1236620 1201840 1207477 1128833 1227587 1177236 1123323 1136886
12480A136886M2786p2233p6939Q922J3327q7334O4115M6534M3000K6792l4321
$$ 1136886 1179672 1107439 1030500 1039422 1052749 965415 1029530 1076064 1119064 1145856 1111535
12469A111535k9806P7910j9806r3111J4274J64277N2160n3632r965j8890L9003
$$ 1111535 1081729 1159639 1139833 1046722 1060996 1225273 1277433 1223801 1213836 1194946 1233949
12458A233949j25956O6804J24987l5833k16946n8160J01135K6078R7822P2823
$$ 1233949 1107993 1174797 1299784 1263951 1047005 988845 1089980 1116058 1213880 1286703
12448A286703Q6604K3111K1978o3765m0714O9152R7836l4686j6878L478O7054
$$ 1286703 1373307 1396418 1418396 1354631 1313917 1383069 1480905 1446219 1429341 1432819 1499873
12437A499873J10800O5018K9158o6307l2921j8168j89250k24049j10180M4094
$$ 1499873 1610673 1675691 1704849 1638542 1605621 1587453 1398203 1174154 1063974 1108068
12427A108068l1471k3925L6600M9978n8147j76982J32992J11748J3347j18542
$$ 1108068 1076597 1052672 1089272 1139250 1081103 904121 1037113 1148861 1162208 1043666
12417A043666J4333J35861J1072r6579m5771J4407j7794P659r9345r1695m1130
$$ 1043666 1057999 1193860 1204932 1108353 1062582 1076989 1059195 1066854 967509 875814 834684
12406H34684P7906k1273k20707N91J19568J15838J09287j7583k0967k4664L5651
$$ 834684 912590 891317 670610 671201 790769 906607 1015894 998311 977344 952680 988331
12395I88331K2020j425J2117N1289r9154m827M3995M3263j6589J0288Q6375M8924
$$ 988331 1010351 1008926 1021043 1072332 973178 968351 1012346 1055609 1039020 1049308 1135683 1184607
12383A184607r3668q5224J02280Q4214j3496m8773K564N2477J16998l1497q0461
$$ 1184607 1090939 1005715 1107995 1192209 1178713 1129940 1132504 1184981 1301979 1270482 1190021
12372A190021p8964j24902o8832Q2880K6793L245p5515K2487O0828n9014L6500
$$ 1190021 1111057 986155 917323 1000203 1026996 1030241 954726 977213 1038041 979027 1015527
12361A015527o2531k27564Q9760J10432k7493k3370r1245q4514O465k7098O6256
$$ 1015527 952996 725432 815192 925624 898131 874761 783516 699002 705467 678369 744625
12350G44625P2344j2912P4775O1824Q4462Q4528j49929l3399l9634r8524n3205
$$ 744625 816969 804057 878832 940656 1025118 1109646 959717 926318 886684 788160 734955
12339G34955R843M2222M1775m2076N0110O3812j01758j35619J8870Q8980O5627
$$ 734955 744798 787020 828795 786719 836829 900641 798883 663264 682134 771114 836741
12328H36741J0000Q8035Q5014k2999p9280k8110J441j6965o3911J5074K2394n1615
$$ 836741 846741 934776 1019790 996791 917511 889401 890842 873877 809966 825040 847434 795819
12316G95819j8715O8929M2943n5672n5523k8630J48882J32235j24282r4020O0197
$$ 795819 777104 846033 888976 833304 777781 749151 898033 1030268 905986 811966 872163
12305H72163q6567p2908q4430j38841P8996n1449J20115J07338q1602o2342J8486
$$ 872163 785596 712688 628258 489417 568413 516964 637079 744417 662815 600473 618959
12294F18959M5508j39461k534L2897J694N5571Q1486j5548l0170O5662J24164
$$ 618959 664467 525006 522472 555369 557063 612634 694120 678572 648402 714064 838228
12283H38228o1799p2538K2747n271M1485l6642R545k9080N3713L1159m0866j10005
$$ 838228 776429 703891 726638 721367 762852 726210 735755 706675 760388 791547 750681 640676
12271F40676m8619q69J31005O5810m5893Q1951L2925l4642R449P8252J06386k765
$$ 640676 592057 591188 722193 788003 742110 824061 856986 822344 831793 910045 1016431 1013666
12259A013666r3768J974M1549l9310j999j40273o8210k3895J09854O7293L7033
$$ 1013666 919898 921872 963421 924111 922112 781839 713629 689734 799588 866881 903914
12248I03914o3042n1558n2208l1609k2606Q8102r3549o830N6496J35142P1234
$$ 903914 840872 789314 737106 705497 682891 770993 677444 670614 727110 862252 933486
12237I33486k0565K8075j54993j35889J7721J12506M4287m6914J3491O079q7243
$$ 933486 912921 940996 786003 650114 667835 780341 824628 777714 791205 797284 710041
12226G10041j19478r2199J20168J45596N6392P962l7141n0595O0901l2218j2292
$$ 710041 590563 498364 618532 764128 820520 828482 791341 740746 801647 769429 757137
12215G57137N720k2420J6455l3645J4064R4601p443j6537q0877j20941K8443J56863
$$ 757137 762857 740437 756892 723247 737311 831912 824469 807932 727055 606114 634557 791420
12203G91420J14628l2160M4972o6343q323r2049k7099O2571K2364N724N4463q5710
$$ 791420 906048 873888 918860 852517 844194 752145 725046 787617 809981 815705 870168 784458
12191G84458n8610j10810P6509J15081o046J8728k1802j914J63461J5072p8537
$$ 784458 725848 615038 691547 806628 800582 819310 797508 795594 959055 974127 895590
12180H95590j55248k115K4425n8996o8325O523J68921R0094N4095r7783K1504
$$ 895590 740342 738227 762652 703656 635331 641854 810775 900869 954964 857181 878685
12169H78685M1045Q0527q9284n6747q4638n6371J06189K3560j2461m96l2535n7457
$$ 878685 919730 1000257 910973 854226 769588 713217 819406 842966 830505 830009 797474 740017
12157G40017m6899O3414j8364m5953j4292M5666j7880r1008q1852q2222L876M9333
$$ 740017 693118 756532 738168 692215 677923 723589 705709 614701 532849 450627 454503 503836
12145E03836M2957n563o126P2669J09485N0756Q2849Q3550n8775L3359L1094n9415
$$ 503836 546793 541230 535104 607773 717258 768014 850863 934413 875638 908997 940091 880676
12133H80676j91534p3500J03263L9645R1074q1903r2977m4237R8333L82M6900
$$ 880676 689142 615642 718905 758550 849624 767721 674744 630507 728840 729222 776122
12122G76122J26613o271l8014l5559j53555j02733M474R6592K1693K8O7533M4430
$$ 776122 902735 896464 858450 822891 669336 566603 571077 667669 689362 689390 756923 801353
12110H01353R063O4246q0260n4985r143O9382o8131j2816O6373j4554j6482p733
$$ 801353 810416 874662 794402 739417 730274 799656 731525 718709 785082 770528 754046 746313
12098G46313J13456N923k5544n6230o4522l1976J01780L3698n9612j02199L1623
$$ 746313 859769 865692 840148 783918 719396 687420 789200 822898 763286 661087 692710
12087F92710J11802J6576K1406J3640O1702N3962m0843l1348q5177o873N6672
$$ 692710 804512 821088 842494 856134 917836 971798 930955 899607 814430 807557 864229
12076H64229M0976O6615j3811k5635j56280p1469Q1316N7436o7018m5395k9044
$$ 864229 905205 971820 958009 932374 776094 704625 785941 843377 776359 730964 701920
12065G01920j4874J192l0921L6860J49855M5171l1383j8335o0290M414M4643j3623
$$ 701920 687046 688238 657317 694177 844032 889203 857820 839485 779195 783609 828252 814629
12053H14629o8234P3531q8111k4707N7726M2501j7869j61103l785Q9834P750p9668
$$ 814629 746395 819926 731815 707108 764834 807335 789466 628363 624578 714412 722162 642494
12041F42494j5186N7142m4971o4799m0349j6816k4825Q9435L4993L879P9481j5132
$$ 642494 627308 684450 639479 574680 534331 517515 492690 582125 617118 620997 700478 685346
12029F85346p5004L9173K1972m722j00547o7020J4671j1071L1764N8870Q4443
$$ 685346 610342 649515 671487 666765 566218 499198 513869 502798 534562 593432 677875
12018F77875k6343l7345n4008M1620j34N477o7167J11484J47261k1686j43280
$$ 677875 651532 614187 560179 601799 601665 607142 539975 651459 798720 777034 633754
12007F33754M363L0233j26424P362Q3640J6674j672O542m42O9444l9469j41710
$$ 633754 638117 668350 541926 549288 632928 649602 647930 654472 654030 723474 684005 542295
11995E42295l4190O0910N9073k6112j6873O4121l3162m8275R3043J08925q3155
$$ 542295 508105 569015 628088 601976 585103 649224 616062 567787 660830 769755 686600
11984F86600j09384n0204J53385J37932m8420j47192O4555K3782j37025r9419
$$ 686600 577216 527012 680397 818329 769909 622717 687272 711054 574029 474610
11974D74610j8295n7123P6580J9222L2009O2754k5486j44227J4458n1602l7956
$$ 474610 456315 399192 475772 494994 527003 589757 564271 420044 434502 382900 344944
11963C44944j4131L9924J20922M1119N1755p9228o2507L4687M0598N1134l4074
$$ 344944 330813 370737 491659 532778 584533 505305 442798 477485 518083 569217 535143
11952E35143o9607L7080O6346L7892O2586n0782o6214k4164J5377j020j0493M2467
$$ 535143 465536 502616 568962 606854 669440 618658 552444 528280 543657 542637 532144 574611
11940E74611m1425J09810L8695l0382j46352P3965Q5834m3118q7456K4846j9423
$$ 574611 533186 642996 681691 651309 504957 578922 664756 621638 534182 559028 539605
11929E39605J7911J6585n9242K8070q0291N9444K3053r5307P8709R2630n255O2621
$$ 539605 557516 574101 514859 542929 462638 522082 545135 449828 528537 621167 615912 678533
11917F78533M8673j58325n6712L9367j2285J6247Q285Q2441K7300Q8017q8022
$$ 678533 727206 568881 512169 551536 539251 555498 563783 646224 673524 761541 673519
11906F73519n4783J6795j03810j26931k8379k2560J1946P7394J11664J08741J53417
$$ 673519 618736 635531 531721 404790 376411 353851 365797 443191 554855 663596 817013
11895H17013O186m5328n2757j05704M6045J4579j37538m5131p7722k883K0118
$$ 817013 823199 777871 725114 619410 665455 680034 542496 497365 419643 416760 436878
11884D36878R0900J06303n9604L3307L8981l1354N92r627Q102k1452j07796J4452
$$ 436878 527778 634081 574477 607784 646765 615411 616003 606376 614478 593026 485230 499682
11872D99682J0243L919J1638J5431m4101q103J5627m9274Q0988N2267j09676k9080
$$ 499682 509925 513844 525482 540913 496812 488709 504336 455062 536050 588317 478641 449561
11860D49561L6514K6313j9331L9259L6317K6011N0442K9780n140K031l6079p3652
$$ 449561 486075 512388 493057 532316 568633 594644 645086 674866 669726 671757 635678 562026
11848E62026P4159n3331j8083M2309P1836O49l5168k2408k453o219q2001J2483
$$ 562026 636185 582854 564771 607080 678916 679565 644397 621989 619536 613317 531316 543799
11836E43799P2390K9590k3274j20022l3446j489O6653O1085J1194Q2338Q1945
$$ 543799 616189 645779 622505 502483 469037 467548 534201 595286 606480 688818 770763
11825G70763Q2515M3127k066j23795K2535j07010j9172l3206j10664K5350J67568
$$ 770763 853278 896405 894339 770544 793079 686069 666897 633691 523027 548377 715945
11814G15945O8007r968J45425M4965j67181j4738L5009p3897k4739m252q4052
$$ 715945 783952 773984 919409 964374 797193 782455 817464 743567 718828 714576 630524
11803F30524J1121p8480Q0668J07732n7271j15930r3971j01395L4979J39325J3357
$$ 630524 641645 563165 643833 751565 694294 578364 484393 382998 417977 557302 570659
11792E70659Q087O1305O9060q9196j28245J06830l2480K4665m2952J0628K197
$$ 570659 578746 640051 709111 619915 491670 598500 566020 590685 547733 558361 560558
11781E60558o0571p4126P9403P8133O9739L5092r2843P7286O1137M4150j1589
$$ 560558 499987 425861 505264 583397 653136 688228 595385 672671 733808 777958 766369
11770G66369J9751L5624p4350J9413O7358N1274j22423k22789K112K06287L4847
$$ 766369 786120 821744 747394 766807 834165 885439 763016 540227 542339 748626 783473
11759G83473j71589M8496R2584q6140n1073r8414j491l7244N6827J56028K5385
$$ 783473 611884 660380 752964 666824 615751 517337 515846 478602 535429 691457 716842
11748G16842M4757l7948j34459J5566K4252K3287q6070n0523j191R9231j08887
$$ 716842 761599 723651 589192 604758 629010 652297 566227 515704 514513 613744 504857
11737E04857J5783J3663j1718Q095O2520Q7956j25977j4001L2247J5062N4868
$$ 504857 520640 534303 522585 530680 593200 681156 555179 541178 573425 588487 643355
11726F43355r1395o7670J0847n4766N1104j3829O1551K4016L4328J30316J6171
$$ 643355 551960 484290 495137 440371 491475 477646 539197 563213 597541 727857 744028
11715G44028p0515o1932M0396R5089M17R9988P7793J98750J0374k31416j49703
$$ 744028 673513 611581 651977 747066 747483 847471 925264 1124014 1134388 902972 753269
11704G53269J2723j10643o7267l2203J0649J6948q9948r140L7188N4706j0755
$$ 753269 765992 655349 588082 555879 566528 583476 493528 484388 521576 576282 565527
11693E65527k5260j20262p3913L0067P5621K16769l633m2992n0169J7723J60026
$$ 565527 540267 420005 346092 376159 451780 668549 664916 621924 571755 589478 749504
11682G49504R89k3888J05656j8512o5779K461P215o6620n0122K5797J95425k097
$$ 749504 750493 726605 832261 813749 747970 750431 757646 691026 640904 666701 862126 860029
11670H60029m4425k4015j7188j4025n4548q9922J26435J21290q1023o0442J6177
$$ 860029 815604 791589 774401 760376 705828 615906 742341 863631 782608 722166 738343
11659G38343m3741j04057J5967o2202j9949Q1484j00412j20967P3066P1161J16909
$$ 738343 694602 590545 606512 544310 524361 605845 505433 384466 457532 528693 645602
11648F45602L1577k3598l4027j14242m293o4763k6582L4618J40791J26010k3658
$$ 645602 677179 653581 619554 505312 501019 436256 409674 444292 585083 711093 687435
11637F87435l2651q230r8777J18875P3928O2901P0377Q1436M35j56509r0677M0171
$$ 687435 654784 646554 547777 666652 740580 803481 873858 955294 955729 799220 708543 748714
11625G48714j5667j05631m6981K9660L5063P748J58546J73785j50613r1012j3546
$$ 748714 733047 627416 580435 610095 645158 652906 811452 985237 834624 743612 730066
11614G30066L1457n9162M5778O4635p2711n0906R5063j3815q1085N9100J8236
$$ 730066 761523 702361 748139 812774 740063 689157 784220 770405 689320 748420 766656
11603G66656L052r5767o8772l7498L933K44893J65622k6718q4129k128j8748M2634
$$ 766656 769708 673941 605169 567671 571604 816497 982119 955401 871272 869144 850396 893030
11591H93030O6836Q153m6449R3356l7645n9949O8653J23190J32891Q9818j3500
$$ 893030 959866 968019 921570 1014926 977281 917332 985985 1109175 1242066 1331884 1318384
11580A318384R0028q1057N3536m7918j44239j92587m1397J47467k5692p3996o0741
$$ 1318384 1408412 1327355 1380891 1332973 1188734 996147 954750 1102217 1076525 1002529 941788
11569I41788p6389m2797O0043q1293j0327K1184N482J5725Q0304J9293P0331J0826
$$ 941788 865399 822602 882645 801352 791025 812209 817691 833416 913720 933013 1003344 1014170
11557A014170p6627n3803R3028P479o944j05931q9601j847R7938Q0540J9193J1721
$$ 1014170 937543 883740 976768 984247 977303 871372 781771 779924 877862 958402 977595 989316
11545I89316J4048L2490K9333O377q2050L6091q930o2820j3568j10582Q693J09139
$$ 989316 1003364 1035854 1065187 1071564 989514 1025605 1016675 953855 940287 829705 838398 947537
11533I47537O9920J16952P2483o5014j35009r4694l1491J10456M5784q0474j06641
$$ 947537 1017457 1134409 1206892 1141878 1006869 912175 880684 991140 1036924 956450 849809
11522H49809P52K0643P0529L2621n9179j00406M0911P0433K2159n0998J4136P827
$$ 849809 850561 871204 941733 974354 915175 814769 855680 926113 948272 897274 911410 919237
11510I19237m0620j29708p5466J66990M2353K4618P0040Q051p2445o0645Q500
$$ 919237 878617 748909 673443 840433 882786 907404 977444 985495 913050 852405 860905
11499H60905r7470l1006N2498J15070l6381j25353j5444Q9109j4069K4295p8719
$$ 860905 763435 732429 784927 899997 863616 738263 722819 811928 797859 822154 743435
11488G43435o1224J24403J03255M1167N8462R4859m9382k3321N0045k7267J3848
$$ 743435 682211 806614 909869 951036 1009498 1104357 1054975 1031654 1081699 1054432 1068280
11477A068280k5767j50886m9706q7357j75594Q880N7636J7700K4530J479m5284
$$ 1068280 1042513 891627 841921 754564 578970 587850 645486 663186 687716 689195 643911
11466F43911K8983O3224o7027o380j6604M4146o701m836j5097J0991N877P020
$$ 643911 672894 736118 669091 662711 646107 690253 683552 678716 663619 674610 680487 687507
11454F87507J8920l957O5161m0501j18230N9837J05559r2219n3060O292j8872
$$ 687507 706427 702470 767631 727130 608900 668737 774296 682077 629017 635309 616437
11443F16437N6557K2097o6946J0801P6806n4014k9733K5818R655j30283j5865
$$ 616437 672994 695091 628145 638946 715752 661738 632005 657823 667478 537195 521330
11432E21330N7360q727O8008O8974l8980p3648j9139K6777m2396P8334m4100j49186
$$ 521330 578690 569963 637971 706945 667965 594317 575178 601955 559559 637893 593793 444607
11420D44607p8393Q944m1229O8505J42121o4959n1449J84083P8514j06302l4707
$$ 444607 366214 375158 333929 402434 544555 479596 428147 612230 690744 584442 549735
11409E49735Q5695r3190p3490K0667J28379O8647j2720M2728J59163M2224n2017
$$ 549735 635430 542240 468750 489417 617796 686443 673723 716451 875614 917838 865821
11398H65821K5210j0774j3705O9365p3451r3300k0315j9333o4364p0140K1577
$$ 865821 891031 880257 866552 935917 862466 769166 748851 729518 665154 595014 616591
11387F16591K1799j05936M1955m3453j32224o3472p9657m7685J6202L3701J2227
$$ 616591 638390 532454 574409 530956 398732 335260 255603 207918 224120 257821 270048
11376B70048J05471L5496M8495L2877j51783K1950J15071Q0238n0878P3846N4662
$$ 270048 375519 411015 459510 492387 340604 362554 477625 557863 506985 580831 635493
11365F35493m0057P633m0285o2803k6269l743J8514q5066P684J79422K7477q3296
$$ 635493 595436 603069 562784 499981 473712 469969 488483 403417 411101 590523 618000 534704
11353E34704k3680J02310l4048j04198m8939O0199r5600q9537K4147N6884M8385
$$ 534704 511024 613334 579286 475088 426149 486348 390748 301211 325358 382242 430627
11342D30627J37267P8529l448K3465k5990m9544j38322j3825O4041o1671N4997
$$ 430627 567894 646423 642975 666440 640450 590906 452584 438759 502800 441129 496126
11331D96126R0617R4573l53l2311k2055q3162N815J8108j13453P2497P0233p7396
$$ 496126 586743 681316 680963 648652 626597 543435 549250 567358 453905 526402 596635 519239
11319E19239P2297J61124R0146M2161M5188j33952n6773j9395k1996k3096o1177
$$ 519239 591536 752660 842806 884967 930155 796203 739430 720035 698039 674943 613766
11308F13766k9117J02962R2366K7265P4945j8904r5445L126M7409L2725P4774
$$ 613766 584649 687611 779977 807242 882187 863283 767838 770964 818373 851098 925872
11297I25872P1814M8160O7442J72835K14594J71466J54028K29206L33198L15430
$$ 925872 997686 1045846 1113288 1286123 1500717 1672183 1826211 2055417 2388615 2704045
11287B704045M16970N48196R93930J817683L046640M924727P034966Q522437Q116684
$$ 2704045 3121015 3669211 4663141 6480824 9527464 14452191 21487157 30009594 38126278
11278C8126278M494562P8946k203180n179952q580921q227764n474088l308990
$$ 38126278 42620840 42699786 40496606 35316654 26735733 18507969 13033881 9724891
11270I724891k201327j523245r11979n62409m91770m53601l15828k52046k55826
$$ 9724891 7523564 6000319 5088340 4525931 4034161 3580560 3264732 3012686 2756860
11261B756860l03355r1508j46036j81055j00299j7852j53546j69756R2006m0272
$$ 2756860 2453505 2361997 2215961 2034906 1934607 1916755 1763209 1593453 1685459 1645187
11251A645187P7581j3384q2230n2509n0292j94397p1827P141j50828o0784J54946
$$ 1645187 1722768 1709384 1627154 1574645 1524353 1329956 1258129 1265270 1114442 1053658 1208604
11240A208604l2019n1019j10744r6202l540o7262n7375P7470J08154P3437j36954
$$ 1208604 1176585 1125566 1014822 918620 915080 847818 790443 867913 976067 1049504 912550
11229I12550j69621J16787J15142o518j46530j2580Q6276j42574o8310J14072
$$ 912550 742929 859716 974858 968340 821810 809230 895506 752932 684622 798694
11219G98694k4967j5353M2770m588K1997Q1241q100K0395L0766l5408j46331r8967
$$ 798694 773727 758374 801144 796556 818553 899794 891694 912089 942855 907447 761116 662149
11207F62149m2825N2592m7646l7921J38536J24991j9400j64j1961n9480r5102
$$ 662149 619324 671916 624270 586349 724885 849876 830476 830312 818351 758871 663769
11196F63769P175M111J22801P4936p67J2017M729l2110q1801M7375L3150L5993
$$ 663769 670944 675055 797856 872792 872025 884042 888771 856661 774860 822235 855385 891378
11184H91378q7209N6325J22691k0795L7192P1986l1372J07309K82934K95167M12242
$$ 891378 804169 860494 983185 962390 999582 1071568 1040196 1147505 1430439 1725606 2137848
11173B137848M06991L96213M43594N28016P51474J103196J775561K888486M418623
$$ 2137848 2544839 2941052 3384646 3912662 4664136 5767332 7542893 10431379 14850002
11164A4850002O390207P424498O383324K491614p39590m04729j44028l669313
$$ 14850002 21240209 28664707 35048031 37539645 36800055 36395326 36251298 32581985
11156C2581985p712219p355708m664948l055957k051092j119617q43028p49006
$$ 32581985 24869766 17514058 12849110 9793153 7742061 6622444 5779416 5030410
11148E030410o15000m65526m63936m33564l97030j59203k7657j68868j2259j21010
$$ 5030410 4415410 3949884 3485948 3052384 2655354 2496151 2468494 2299626 2287367 2166357
11138B166357q3373j74188j21699k2001m7351L8892J64756J2270k7570n2495J66549
$$ 2166357 2082984 1908796 1787097 1765096 1717745 1756637 1921393 1933663 1906093 1853598 2020147
11127B020147Q5346R8941J09272k061P3755J46174R2117m866J1633j4452j6496
$$ 2020147 2105493 2204434 2313706 2311645 2385400 2531574 2623691 2618825 2630458 2616006 2599510
11116B599510j29525o4450P237R909R4766n661r1195P5144M7861r6994j9676J61683
$$ 2599510 2469985 2405535 2412772 2422681 2517447 2511786 2420591 2495735 2543596 2446602 2426926 2588609
11104B588609P2433J2766j65149k46721j87050k5348p3588k35396M6624J32520
$$ 2588609 2661042 2673808 2508659 2261938 2074888 2049540 1975952 1740556 1787180 1919700
11094A919700K5654M1121K2091J4327K7409p948k6025R1792N7115m8036J9304
$$ 1919700 1945354 1986475 2008566 2022893 2050302 2042354 2016329 2108121 2165236 2117200 2136504
11083B136504Q2074J9895l5616J1660J89657L7895k3771J04583O8688J88426K22694
$$ 2136504 2218578 2238473 2202857 2214517 2404174 2442069 2418298 2522881 2591569 2779995 3002689
11072C002689J86243N5595J7978j6067j52468n8142j53162k54623l3952j01445
$$ 3002689 3188932 3244527 3262505 3246438 3093970 3035828 2882666 2628043 2594091 2492646
11062B492646K7560M8304M4053K33076L48608L56103K52662M4564k35878l32207
$$ 2492646 2520206 2568510 2612563 2845639 3194247 3550350 3803012 3847576 3611698 3279491
11052C279491l08156j66145j10878k15403k77488k8908J5281k4519l0745K2527
$$ 3279491 2971335 2805190 2694312 2478909 2201421 2172513 2187794 2163275 2132530 2155057
11042B155057m8755N648M1704J24235J40361K06721J39421O3658j54861p5704
$$ 2155057 2106302 2111950 2153654 2277889 2418250 2624971 2764392 2828050 2673189 2597485
11032B597485N0695J81507K9937j36246q0050n3566J12725J28690J29918J77537
$$ 2597485 2648180 2829687 2859624 2723378 2643328 2589762 2702487 2831177 2961095 3138632
11022C138632N8135k80542j63758p1268q3848q2984j56480k25265m9513m3365
$$ 3138632 3196767 2916225 2752467 2681199 2597351 2514367 2357887 2132622 2083109 2039744
11012B039744n5165k4586M0813o19m7242P9026L1930j12492r1010r3864J7727
$$ 2039744 1984579 1959993 2000806 2000187 1952945 2031971 2063901 1951409 1860399 1766535 1784262
11001A784262j11589n8632l24N5111M964l5193k0452r5601M9924J07157L5820
$$ 1784262 1672673 1614041 1613717 1668828 1673792 1638599 1618147 1522546 1572470 1679627 1715447
10990A715447o8545J0861J19825K03380N4663p9013K739N061o9800j63629r4492
$$ 1715447 1646902 1657763 1777588 1980968 2035631 1956618 1959357 1964418 1894618 1730989 1636497
10979A636497J6715l3885o222J6319R9511P6263J1790n1547M397M6094K2959j21145
$$ 1636497 1653212 1619327 1613105 1629424 1728935 1805198 1816988 1765441 1769838 1815932 1838891 1717746
10967A717746j83213j72231r4378M1503m6497j16721p3122Q9525K2166p3910p4466
$$ 1717746 1534533 1362302 1267924 1309427 1262930 1146209 1073087 1162612 1184778 1110868 1036402
10956A036402K7272m2740j31613q8046m2965r5743J5709M6287Q8763P7588n2570
$$ 1036402 1063674 1020934 889321 801275 758310 662567 678276 724563 813326 890914 838344
10945H38344k7224m7686L2259j32386J6595N7562J09326l1672j27598p4308k41
$$ 838344 811120 763434 795693 663307 679902 737464 846790 815118 687520 613212 612971
10934F12971P8547P8793l3558K7353J70822J68034O7467L5074j1034j8313P3604
$$ 612971 691518 770311 736753 764106 934928 1102962 1170429 1205503 1194469 1176156 1249760
10923A249760L7953m4706m9513J317n3676j4132q0371k44782k37677l4604N3708
$$ 1249760 1287713 1243007 1193494 1194811 1141135 1127003 1046632 801850 564173 529569 583277
10912E83277J3732o3110K6954N2974N0768l0705L0435R269R902N9960K4468n6881
$$ 583277 597009 533899 560853 613827 664595 633890 664325 673594 683496 743456 767924 711043
10900G11043j12206q2489l5384n7931n3678M9253K3641q9264K1706J91163O7847
$$ 711043 598837 516348 480964 423033 369355 418608 442249 352985 374691 565854 633701
10889F33701j75872j33676k3507J0023P1231P6252r219o4510j679j6754n4652
$$ 633701 457829 324153 300646 310669 381900 458152 448933 384423 382744 365990 311338
10878C11338j8734N1540P1914j1015M8150j3531j37750m4899P1490n107n6467
$$ 311338 292604 344144 416058 405043 453193 439662 301912 257013 328503 323396 266929
10867B66929O4695j02172j5728k2599k4143K06943J65642j11505l2938M9908j6806
$$ 266929 331624 229452 213724 191125 166982 373925 539567 428062 395124 445032 428226
10856D28226K4017q5479k1300n3144m8571N1962j1259o0820J22817J06608k8635
$$ 428226 452243 366764 345464 292320 243749 295711 284452 223632 346449 453057 424422
10845D24422J18779R9838p9094Q6690K10336l7014j64365j39419m6037N1017K8985
$$ 424422 543201 643039 563945 650635 860971 823957 659592 520173 474136 525153 554138
10834E54138R8450n9144n9707o9738J3477k6078k3108j10674N0925J46259L3648
$$ 554138 652588 593444 533737 463999 477476 451398 428290 317616 368541 514800 548448
10823E48448n1951j3200j6889J0430n3244j91934n6903L6613J40371J16953J609
$$ 548448 496497 483297 466408 476838 423594 231660 174757 211370 351741 468694 470303
10812D70303j3096o9974q233o4892l3137n9826J0697J08871o757l4725J8308O7603
$$ 470303 457207 387233 379000 314108 280971 221145 231842 340713 333956 299231 317539 385142
10800C85142M2860o5421J4546K9459N7035q700j08487q6914N0264j6441P5167
$$ 385142 428002 362581 377127 406586 463621 454921 346434 259520 309784 293343 368510
10789C68510R9612k9207p0861n0074N5766L7591K373K2593J9677K1058j20301
$$ 368510 468122 438915 368054 317980 373746 411337 413710 436303 455980 477038 356737
10778C56737j17324J50166J25250q4292o9923O7669J11132N159j0996m4163N2877
$$ 356737 239413 389579 514829 430537 360614 428283 539415 544574 533578 489415 542292
10767E42292l4718o862j3753q817k6558k6894p7465L3606n251J6335j5696j5039
$$ 542292 507574 500712 486959 478142 451584 424690 347225 380831 375580 391915 376219 361180
10755C61180M3921n759L120K3882l9387j02621J14439M8779j0558J5392J25492
$$ 361180 405101 399342 402462 426344 386957 284336 398775 447554 436996 452388 577880
10744E77880o0198k3706L3138k811l1644J1627n2698m9268p1641L7164J23111
$$ 577880 517682 493976 527114 524303 492659 504286 451588 402320 330679 367843 490954
10733D90954k3311j5867p5468M4406O2896L6463n762j4682l6405J11779p3463
$$ 490954 467643 451776 376308 420714 483610 520073 514311 499629 463224 575003 501540
10722E01540Q916J03701J37239J3022L2667q9297p4882j7060N7654P7117L1586
$$ 501540 510456 614157 751396 764418 797085 707788 632906 615846 673500 750617 782203
10711G82203k7915J3825Q2074N4274l5663Q7620Q3680J33956j51861l4273m8849
$$ 782203 754288 768113 850187 904461 868798 956418 1040098 1174054 1022193 987920 939071
10700I39071J612j2839M4380l2202m8736Q5597J05959l6099l776M2006j16336
$$ 939071 940683 927844 972224 940022 891286 976883 1082842 1046743 1042967 1084973 968637
10689I68637J09112J46228K9562j02429r5416m9602o3383l4252J6480O0511k442
$$ 968637 1077749 1223977 1253539 1151110 1055694 1006092 942709 908457 924937 985448 983006
10678I83006m522q2264M091J20029j12244O970M0765J07883L2622p1439j9388
$$ 983006 978484 896220 900311 1020340 908096 915066 955831 1063714 1096336 1024897 1005509
10667A005509R4790M6372K9541l5121J4278k9929n584j4828p2234m6256N0799
$$ 1005509 1100299 1146671 1176212 1141091 1155369 1125440 1119856 1105028 1032794 986538 1037337
10656A037337P4954J80505L8919P5965N4014M8529p3450q3306N9257j2363P726
$$ 1037337 1112291 1292796 1331715 1407680 1461694 1510223 1436773 1353467 1412724 1400361 1408087
10645A408087r9101P5628R1709J6903O408r837j23507q8691L4048n0704K09156
$$ 1408087 1308986 1384614 1476323 1493226 1499634 1489797 1366290 1277599 1311647 1260943 1470099
10634A470099J35739j41337L8104J12401j0052j33276k9486K2169J20206O6579
$$ 1470099 1605838 1464501 1502605 1615006 1604954 1471678 1442192 1464361 1584567 1651146
10624A651146l2874j54854q1459j87582j87693N1239J22823P2244m104n2757J4756
$$ 1651146 1618272 1463418 1381959 1194377 1006684 1057923 1180746 1252990 1248886 1196129 1210885
10613A210885J29519K4756q6974k697R116o9628l7571P5918J9817n2393j4789
$$ 1210885 1340404 1365160 1278186 1275489 1284605 1214977 1177406 1253324 1273141 1220748 1205959
10602A205959l9598M9440P9615l7532N3288n4137N8885N0890o0206J22914M2771
$$ 1205959 1166361 1215801 1295416 1257884 1311172 1257035 1315920 1366810 1306604 1429518 1472289
10591A472289j2901n7365o8220P861R8359J44839m535o6731j65680p882J02155
$$ 1472289 1459388 1402023 1333803 1341664 1440023 1584862 1580327 1513596 1347916 1340034 1442189
10580A442189j04441m1491N2780l4172o2176j35545j62625k4275j8862k8465m7217
$$ 1442189 1337748 1296257 1349037 1314865 1252689 1117144 954519 930244 911382 882917 835700
10569H35700k2167o405P9723N3065k8933j10148p3812m7493Q9445l7595M4954
$$ 835700 813533 807128 886851 939916 910983 800835 727023 679530 768975 731380 776334
10558G76334k0389O1831M2985k9344p2516j53955p0480N9719n0624O4860J20952
$$ 776334 755945 817776 860761 831417 758901 604946 534466 594185 543561 608421 729373
10547G29373N6676J242j19702l1218R9944J09956r0701l8768P8269o6028j93312
$$ 729373 786049 787291 667589 636371 736315 846271 755570 716802 795071 729043 535731
10536E35731o8833M0244k7926P4968o3573m4378J6705K5202J24621J7749q8896
$$ 535731 466898 507142 479216 554184 490611 446233 462938 488140 612761 630510 541614
10525E41614o2189J0202O4756R6756N9561K5074K2458q6267n9044L404l2118J21632
$$ 541614 479425 489627 554383 651139 710700 735774 758232 671965 612921 616325 584207 705839
10513G05839P3696j1245k4140o0185J8259Q8m0330j09425l1222R8173j525m2659
$$ 705839 779535 768290 744150 683965 702224 702312 661982 552557 521335 619508 617983 575324
10501E75324m9963m6457J27060O4300P2454n9420j50760j06592M7749R1615L5173
$$ 575324 525361 478904 605964 670264 742718 683298 532538 425946 473695 565310 600483
10490F00483q941q8272l3671p1668q557N2418M9686R0934Q4677M050j0831K4299
$$ 600483 591542 503270 469599 397931 389374 441792 491478 582412 667089 671139 660308 684607
10478F84607K42k7945j10850n824J01060L8950j37580k21469q4573J15432J57314
$$ 684607 684849 656904 546054 540230 641290 680240 542660 321191 236618 352050 509364
10467E09364Q7914J6360P5028J03475N5266q5420r1651L0270r605L4775r3568
$$ 509364 597278 613638 688666 792141 847407 761987 670336 700606 691001 725776 632208
10456F32208o4700r265J3468K3508M9998P596j40172O2005M2590j3882l8275N8223
$$ 632208 567508 558243 571711 595219 645217 652813 512641 574646 617236 603354 565079 623302
10444F23302K0418O4041J48894M8041j0036K6959M5919O8327k2855P7534R0015
$$ 623302 643720 707761 856655 904696 894660 921619 967538 1035865 1013010 1090544 1180559
10433A180559L4694k7117n9524p228N5115k194j57694j91642N503n026m4898M5689
$$ 1180559 1215253 1188136 1128612 1121384 1176499 1174305 1016611 824969 830472 825446 780548 826237
10421H26237J5125O235N7927l1618o1043k720K7030n8117O8983P7914l0209j661
$$ 826237 841362 847597 905524 873906 812863 810143 837173 779056 848039 925953 895744 894083
10409H94083r6286q2865p6142m0428O3361O1791j47624k23389n7373K3115J34225
$$ 894083 797797 714932 638790 598362 661723 723514 575890 352501 295128 318243 452468
10398D52468J96396J10297P8926l6961n4354o1300L0694R1087n6867n4642K5577
$$ 452468 648864 759161 838087 801126 746772 685472 716166 807253 750386 695744 721321
10387G21321O7692M6865p1653O5054o8955o3751L9007n7110L7928J57958k3052
$$ 721321 789013 835878 764225 829279 760324 696573 735580 678470 716398 874356 851304
10376H51304o7600N4580R6552j7875O1821K3198M5201j23070j5378R6988M4462
$$ 851304 783704 838284 934836 916961 978782 1001980 1047181 924111 908733 1005721 1050183
10365A050183m0668p7024n3957j2691N4690j11769k3329O3916l0814J5019j8099
$$ 1050183 1009515 932491 878534 865843 920533 808764 785435 849351 818537 833556 815457
10354H15457j3994K5234J9586L3877Q401Q135J60581L358q4529j17963L18J23419
$$ 815457 801463 826697 846283 880160 888561 896696 1057277 1060635 976106 858143 858461 981880
10342I81880J05259J45003p4958j10726N1574J0285m6583k2437j5156j82485p7671
$$ 981880 1087139 1232142 1157184 1046458 1098032 1108317 1061734 1039297 1024141 841656 763985
10331G63985J45717J40194K3323p5323N4641Q3260J69480J22375k672M1825N573
$$ 763985 909702 1049896 1073219 997896 1052537 1135797 1305277 1427652 1424980 1466805 1472378
10320A472378j43463j09764p840k4680K3347Q9200P7905M2597j38130p0808k0932
$$ 1472378 1328915 1219151 1211311 1186631 1209978 1299178 1377083 1419680 1281550 1210742 1189810
10309A189810o6330m0901k2705N668M2316n2677p1868L1591j12168M2846J9615
$$ 1189810 1123480 1082579 1059874 1065542 1107858 1055181 983313 1014904 902736 945582 965197
10298I65197K8391j9377k5256j5974Q4113Q3097K7464o3705M5331J62899m8072
$$ 965197 993588 974211 948955 932981 1017094 1100191 1127655 1063950 1109281 1272180 1224108
10287A224108k840Q0407m294k4384l0499M0300Q5616N7653j4504K998J45598K9957
$$ 1224108 1221268 1301675 1297381 1272997 1242498 1282798 1368414 1426067 1411563 1414561 1560159 1590116
10275A590116l2282J24999J95134L03290M43773M04420O18864Q01114Q93196Q94055
$$ 1590116 1557834 1682833 1877967 2181257 2625030 3029450 3648314 4449428 5342624 6236679
10265F236679P77465R07098P34733L89867K42488k71370n63734o36765p13702
$$ 6236679 7014144 7921242 8655975 9045842 9288330 9016960 8453226 7816461 7102759
10256G102759r57453j003921p75419p00159p27202l93147l84225l09944m539K5691
$$ 7102759 6145306 5141385 4365966 3665807 2938605 2545458 2161233 1851289 1846750 1872441
10246A872441k3396j20837j8586j09719j22241j45871j0730K6911K0575J9346
$$ 1872441 1849045 1728208 1709622 1599903 1477662 1331791 1321061 1347972 1368547 1387893
10236A387893l4705j30122p1807J5470P5890l4727j11352r9774l7360Q069N5406
$$ 1387893 1353188 1223066 1151259 1166729 1242619 1207892 1096540 996766 959406 967475 1022881
10225A022881N4560J6668j03267o2075q4893l9709l1507J14501J18885k7829l2264
$$ 1022881 1077441 1094109 990842 928767 843874 804165 772658 887159 1006044 978215 945951
10214I45951j4307p0443j4595p4456o2235J01170J48950O5367n9005j45671n6104
$$ 945951 931644 861201 846606 772150 709915 811085 960035 1025402 966397 820726 764622
10203G64622l436O4624Q6916L3836o5087j6042K3693J11509O4989p9494m2194
$$ 764622 761186 825810 912726 946562 881475 865433 889126 1000635 1065624 986130 943936
10192I43936n2000l9611M7327k3484q1858J19509J5198r9832j0931R209j9046
$$ 943936 891936 852325 899652 876168 794310 913819 929017 829185 818254 827463 808417
10181H08417o6088N6054l9303j9465O8046q2009q2666p792J39643k3690j08152
$$ 808417 742329 798383 759080 739615 807661 725652 642986 635194 774837 751147 642995
10170F42995q6092o9801Q1231L175q2963m2920R2542J5264o4252k6267J49280
$$ 642995 556903 487102 568333 571508 488545 445625 538167 553431 489179 462912 612192
10159F12192O6036Q5752N439j04318j50826j0007J5430J0597m0641J760k3185
$$ 612192 678228 763980 769419 665101 514275 504268 519698 530295 489654 491414 468229
10148D68229M9637P6223j11450m3004m769J88431P7860n1984p2762L8495l0334
$$ 468229 517866 594089 482639 439635 434866 623297 701157 649173 576411 614906 584572
10137E84572q1600L351M9403K0715r5744j48646q2179M9374J75018M9159k946
$$ 584572 502972 506323 555726 576441 480697 332051 249872 299246 474264 523423 520477
10126E20477l6624j13547o2679J2910R8452J04207K0298Q520n5466p6790N2804
$$ 520477 483853 370306 307627 320537 418989 523196 543494 552014 496548 419758 472562
10115D72562P1710P87l5843k6216j5800J1042O6763r2186m3233l9548k4112O5513
$$ 472562 544272 545059 509216 483000 467200 478242 545005 452819 409586 370038 345926 411439
10103D11439n6323J42772J17525N7162j8798q0140o4273j4192P2300J387k8321
$$ 411439 355116 497888 615413 672575 653777 573637 509364 495172 567472 568859 540538
10092E40538j00488j8722J8235K654N2881J07348n5528k05225O106O3357J79299
$$ 540538 440050 421328 439563 442217 495098 602446 546918 341693 347799 411156 590455
10081E90455j2106q9041m4745q690J64964O2491j9295j433l1836K1008J23533
$$ 590455 578349 489308 444563 435873 600837 663328 644033 642600 610764 631772 755305
10070G55305K9677J42341J92618k4682L0926O6328r0713l7568L2485J826J5562
$$ 755305 784982 927323 1119941 1095259 1126185 1192513 1101800 1064232 1096717 1098543 1114105
10059A114105m8739k8701J43706L31625K62834K03525L95129M53709M55195K08097
$$ 1114105 1065366 1036665 1180371 1511996 1774830 1978355 2373484 2827193 3282388 3490485
10049C490485l5056l7348K63973M12041O31654Q15710J201061J787897K542343
$$ 3490485 3455429 3418081 3682054 4094095 4725749 5541459 6742520 8530417 11072760
10040A1072760L660931O282656J0758072J9191833L4372488M5661749M9043127
$$ 11072760 14733691 21016347 31774419 50966252 85338740 131000489 180043616
10033A80043616L0337921l0079314o5379051m0493368k3230404j4483154r170575
$$ 180043616 210381537 180302223 114923172 74429804 51199400 36716246 27545671
10026B7545671n746963l647067k753603k063146j694931j243474r65218r11875
$$ 27545671 21798708 18151641 15398038 13334892 11639961 10396487 9431269 8519394
10018H519394p34566l93099k60166j48484k18415l82442n18948m18062l17101
$$ 8519394 7784828 7391729 7131563 6983079 6764664 6382222 5863274 5445212 5128111
10009E128111l36876k60911k46730k01399k71463j37905j13912k33464p2391o9266
$$ 5128111 4791235 4530324 4283594 4082195 3810732 3672827 3558915 3325451 3253060 3183794
9999C183794j17794m0560K5530p2960r2065q5080r4612j56234j03987K5423o917
$$ 3183794 3066000 3025440 3050970 2978010 2885945 2800865 2706253 2550019 2446032 2471455 2464538
9988B464538o5110J1980j52679j10323j48007Q670M3666j9044N82j38903l8265
$$ 2464538 2399428 2411408 2258729 2148406 2000399 2009069 2052735 2033691 2034273 1895370 1857105
9977A857105L6521N2380k8066m1741j30236k31335n8660R7443L0119J43515n1350
$$ 1857105 1893626 1946006 1917940 1876199 1745963 1514628 1455968 1553411 1583530 1727045 1675695
9966A675695q5725J6051m4514k47749o8792P401p6489R272J55279l2698j02928
$$ 1675695 1589970 1606021 1561507 1313758 1244966 1252367 1175878 1185150 1340429 1307731 1204803
9955A204803L1499r3341n1872m7998K4714L0336J57357n3939m8486m3806J6478
$$ 1204803 1236302 1142961 1091089 1043091 1067805 1098141 1255498 1201559 1153073 1109267 1125745
9944A125745J14939Q2533m8845m6073O9025Q1393K6152P5356m4861k8333N4865
$$ 1125745 1240684 1323217 1274372 1228299 1297324 1378717 1404869 1480225 1435364 1407031 1461896
9933A461896Q6572j5601j21318K664P4685Q2480Q3313J52060J95529J38546K43940
$$ 1461896 1548468 1532867 1411549 1414213 1488898 1571378 1654691 1806751 2002280 2140826 2384766
9922B384766J30833J08085K33917K13921K84264K47075K69968L74888M65247N24324
$$ 2384766 2515599 2623684 2857601 3071522 3355786 3602861 3872829 4247717 4712964 5237288
9912E237288P61425R69406J289408J591094K141567K905843L428542M172386M565420
$$ 5237288 5998713 6968119 8257527 9848621 11990188 14896031 18324573 22496959 27062379
9903B7062379M434831L182375R34433j310084l327908m323652m092265l468636
$$ 27062379 31497210 34679585 35614018 34303934 30976026 26652374 22560109 19091473
9895A9091473l056039k464352k023638j501094j064981q95447p47845o96096o45747
$$ 19091473 16035434 13571082 11547444 10046350 8981369 8085922 7338077 6641981 5996234
9886E996234n22576l46143l09509l30142k61807k46024j97139j41819k33677j20231
$$ 5996234 5473658 5127515 4818006 4487864 4226057 3980033 3782894 3641075 3407398 3287167
9876C287167j31250o4742j08735k12539j22568j34712k10302r8822J9181o4703
$$ 3287167 3155917 3091175 2982440 2769901 2647333 2512621 2302319 2203497 2222678 2157975
9866B157975q3365J245j3014m5151P1978Q0584k6571q0450j92113l1832j48722
$$ 2157975 2074610 2075855 2062841 2017690 2089668 2170252 2143681 2063231 1871118 1839286 1690564
9855A690564j4082J28891k4381k0302P6806j7157J03350J04841j74927j30862
$$ 1690564 1676482 1805373 1780992 1760690 1837496 1820339 1923689 2028530 1853603 1722741
9845A722741j21730l2620j41779j42492M1659q842J0768J7886J20874O2330o1776
$$ 1722741 1601011 1568391 1426612 1284120 1325779 1316937 1327705 1345591 1466465 1528795 1467019
9834A467019L858o268K683K822m7031J3171R039p5285J08535L618p9851p8509
$$ 1467019 1470877 1464609 1467292 1470114 1423083 1436254 1445293 1370008 1478543 1482161 1402310 1323801
9822A323801k6497j6815O7460O067o7726K816P425n7527j94318r743J74880m3010
$$ 1323801 1297304 1280489 1347949 1354016 1286290 1289106 1296531 1239004 1044686 1034943 1209823 1166813
9810A166813p6836j23521j72009L6270J28936J18247Q8154P1215q2350q9124l8602
$$ 1166813 1089977 966456 794447 830717 959653 1077900 1166054 1237269 1154919 1065795 1027193
9799A027193j0396J1095l1831r8042K1025Q9384K6571L2949j11443L5421Q2004
$$ 1027193 1016797 1027892 996061 898019 919044 1008428 1034999 1067948 956505 991926 1073930
9788A073930J0787r0217j39486r2632j60169J26364J05356L6719k1052j06711
$$ 1073930 1084717 994500 855014 762382 602213 728577 833933 870652 849600 742889
9778G42889p00K4567K5613J90841J4007j47442m1496l2907m2264j05481k8402
$$ 742889 742189 766756 792369 983210 997217 849775 808279 775372 733108 627627 599225
9767E99225k1473J7543j7499K576J17684Q2068N1474p15j44725n0598j9285O3558
$$ 599225 577752 595295 577796 580372 698056 780124 831598 830883 686158 635560 616275 679833
9755F79833K5438p7552M8515l487l7088m3376N964R465K9281j3272n248k2968
$$ 679833 705271 627719 676234 672747 635659 592283 598247 607712 636993 623721 618473 595505
9743E95505l3146J1692J26461J03704p7765j15622M2401o0150j39490j25953n8301
$$ 595505 562359 574051 700512 804216 726451 610829 653230 593080 453590 327637 269336
9732B69336J47847L0285J42564R7734j12138p4915o6682N821k8305M0766j5965
$$ 269336 417183 447468 590032 687766 575628 500713 434031 439852 411547 452313 436348
9721D36348j1074j9754J35496P9025O3417j14977q4242J3068j5119P2665M530
$$ 436348 425274 405520 541016 620041 683458 568481 484239 497307 482188 554853 559383
9710E59383j20643n6337p8031K5171Q9497J17007R3859o2504j09552R1439q417
$$ 559383 438740 382403 304372 329543 419040 536047 629906 567402 457850 549289 540872
9699E40872o8539M6007K7565j113J33736Q6565L4971j52945r8689m8118K0995
$$ 540872 472333 518340 545905 544792 678528 765093 800064 647119 548430 500312 521307
9688E21307p5750k4069m4030q2216r071R4353j3371k529O9498q6097m3471P1110
$$ 521307 445557 421488 377458 295242 286171 380524 367153 364624 434122 348025 304554 375664
9676C75664J49040o4074n1959l014l0785L9872J51823K4092r7027K9272Q0011
$$ 375664 524704 460630 408671 405657 374872 414744 566567 590659 493632 522904 602915
9665F02915Q9445n0169j9370m6518p7480j460r442J1802j14882p0204L1947P2603
$$ 602915 692360 642191 622821 576303 498823 497363 487921 499723 384841 314637 346584 419187
9653D19187P2934q3196j49354j2106L9583P6863m5348K33k1837m0599M7018p1005
$$ 419187 492121 408925 259571 247465 287048 363911 318563 318796 296959 256360 303378 232373
9641B32373N3826J28503J08505k3224n0984n8914O4841O9607J53180J54770O7238
$$ 232373 286199 414702 523207 499983 448999 390085 454926 524533 677713 832483 899721
9630H99721j6861j51700L8355R5359r7578p5842m8949N0913j5458m8264j11648
$$ 899721 882860 731160 769515 864874 767296 691454 642505 693418 677960 629696 518048
9619E18048m5071n8135o1677k6231J02312o241J01744R106j19977r8855M2293
$$ 518048 472977 414842 353165 326934 429246 423005 524749 533855 413878 315023 357316
9608C57316N5345r4197n2979l8288N5360R655Q081l5946j5132J19691J7403q0455
$$ 357316 412661 318464 265485 227197 282557 292212 300293 264347 249215 368906 386309 305854
9596C05854o8565j04783o3913K11781R5213l17L0678l2642o3570o1655j0516m96
$$ 305854 237289 132506 68593 280374 375587 375270 405948 373306 309736 248081 237565 237069
9584B37069m565O5425L8150q2927M4871L5477l0329M8854q7442j18089p2367r868
$$ 237069 232504 297929 336079 253152 298023 333500 303171 352025 264583 146494 74127 64259
9572F4259P5861R4090L9327J8430R5340P598o9256j26580j1813Q2224l0428m5829
$$ 64259 140120 234210 273537 291967 387307 394905 325649 199069 187256 269480 239052 193223
9560A93223J10209Q6495M2600n4776n3441j05692J7419j3284q4558j413l4211
$$ 193223 303432 389927 432527 377751 324310 218618 236037 222753 138195 136782 102571
9549A02571k0244M9419R5219M4313k3339r2413L2103J5736M4260N5467j11739
$$ 102571 82327 131746 226965 271278 247939 155526 187629 203365 247625 303092 191353
9538A91353j1571O4277m7608l2711m1154m1693O1682N9440n5612O9147J34073
$$ 191353 179782 244059 196451 163740 122586 80893 142575 202015 146403 215550 349623
9527C49623L3674j25060J3980m3618j1392M2965L2884l977O7514R79q8745M106
$$ 349623 383297 258237 272217 228599 217207 260172 293056 289079 356593 357572 268827 272933
9515B72933O4302o828L2688n214j29516r4995L0997L3639J9275R9362j08873k5773
$$ 272933 337235 330407 363095 357881 228365 133370 164367 198006 217281 316643 207770 181997
9503A81997O0275j0840j176N6619m9512o6411O194J5703N6661j1016J11519O9752
$$ 181997 242272 231432 230256 286875 237363 170952 177146 192849 249510 238494 350013 419765
9491D19765p5293m1397j6230L2728p9179o5604l7170P1498L2415p3631P5270K8148
$$ 419765 344472 303075 286845 319573 240394 174790 137620 209118 241533 167902 243172 271320
9479B71320j1840J07487J4562R1061P1181j02907N5975K9043k6788M2216K6134
$$ 271320 259480 366967 381529 472590 543771 440864 496839 525882 499094 541310 567444
9468E67444q783j22403r7464J9233J6453N275N8018k4594j15856N1703R4140p8823
$$ 567444 558661 436258 338794 358027 374480 379755 437773 413179 297323 349026 443166 364343
9456C64343m2333q4490K7976l293k4390M997Q4263j5163L1466J2249L0305N6622
$$ 364343 322010 237520 265496 262203 237813 242810 327073 311910 343376 355625 385930 442552
9444D42552m5699M0710K0345K8670o0294k1934j15319j11228Q2780J8006K22253
$$ 442552 396853 437563 457908 486578 426284 404350 289031 177803 260583 278589 500842
9433E00842J25586p0830j74589p483j9545n5467r6497J53542k3701o9002J21957
$$ 500842 626428 555598 381009 373526 353981 298514 202017 355559 331858 262856 384813
9422C84813o798Q0928J54233k7889j36225o1050p9731M1388J38050m6193q1770
$$ 384813 378015 458943 613176 585287 449062 388012 308281 349669 487719 441526 359756
9411C59756j56826q0877J15596M5612K5792M4641J5468N0076P7148N1421l9045
$$ 359756 202930 122053 237649 283261 309053 353694 369162 419238 496386 547807 508762
9400E08762L920o37j0488O8842J34131N4831R977n775o5910j05013j1139l6137
$$ 508762 512682 512045 501557 570399 704530 759361 769338 763563 697653 592640 581501 545364
9388E45364R7416P2933j30274j16494k9581l1874O5913P3000k12979j25518M5040
$$ 545364 642780 715713 585439 468945 439364 407490 473403 546403 333424 207906 252946
9377B52946K6479K882L4871N3571J39545J6711N3729O3238m7148m7499o7276J6586
$$ 252946 279425 282307 317178 370749 510294 527005 580734 643972 596824 549325 482049 498635
9365D98635P980J13244J44043m9531n9332j0513R2916J75392J19671j014Q1542
$$ 498635 506615 619859 763902 714371 655039 644526 737442 912834 1032505 1031491 1113033
9354A113033M9538j5354Q7534J71233K4506p038j8810O4963J6405q8010O7087
$$ 1113033 1162571 1147217 1234751 1405984 1430490 1423452 1404642 1469605 1486010 1398000 1465087
9343A465087p262j45836q7083n3586j40276M5385p853J9716K7741q1814o0432
$$ 1465087 1457825 1311989 1224906 1171320 1031044 1076429 1068576 1088292 1116033 1034219 973787
9332I73787p0266r741O8011l9669l6356k7381L1303l5394l0157R7894K03836J29871
$$ 973787 903521 893780 961791 922122 885766 858385 889688 854294 824137 922031 1125867 1255738
9320A255738p8998j08044L6560k6146R8176J32594J15010M5875J45041J54085
$$ 1255738 1176740 1068696 1105256 1079110 1177286 1309880 1424890 1470765 1615806 1769891
9310A769891J13911N0213k881n4994R9367J44544K68201L33919R8622n162R0431
$$ 1769891 1883802 1934015 1931134 1876140 1975507 2120051 2388252 2722171 2820793 2815631 2906062
9299B906062J38331K0713l0091q2577k09117k64272j43582j39972q1847q3673
$$ 2906062 3044393 3065106 3035015 2952438 2743321 2479049 2335467 2195495 2113648 2029975
9289B029975q6793K7238L2990m4582n2924k2858n7260K7885k8310r5698r4830
$$ 2029975 1943182 1970420 2003410 1958828 1905904 1883046 1825786 1853671 1825361 1729663 1634833
9278A634833j6503Q3166m1570o3271p6205n861J8766R094l5559j5060N3360J43103
$$ 1634833 1618330 1701496 1659926 1596655 1520450 1514589 1533355 1542449 1506890 1491830 1545190 1688293
9266A688293O4053J20705K89627K51982Q3968K9013p0334M2696L1899R2979K16406
$$ 1688293 1752346 1873051 2162678 2414660 2498628 2527641 2457307 2500003 2531902 2624881 2841287
9255B841287J69565J72226K27213K48272J08794J02975M3181l3410j08853j77062
$$ 2841287 3010852 3183078 3410291 3658563 3767357 3870332 3913513 3880103 3771250 3594188
9245C594188j85523j57643j51155k28453k03103j04233q3486l6688k1630L4028
$$ 3594188 3408665 3251022 3099867 2871414 2668311 2564078 2480592 2443904 2422274 2456302
9235B456302j401k1351R3141k4661k02822j68681L009J18154o0492j99335k26728
$$ 2456302 2454901 2433550 2526691 2502030 2299208 2130527 2133536 2251690 2191198 1991863 1765135
9224A765135j71810o9272l3658P29m5563m5422J11671J59772M7807J1063O9995
$$ 1765135 1593325 1524053 1490395 1491124 1445561 1400139 1511810 1671582 1719389 1730452 1800447
9213A800447K03063J6220R5851k8787J59589J42677J1864J30555J87630R6714
$$ 1800447 2003510 2019730 2115581 2086794 2246383 2389060 2400924 2531479 2719109 2815823
9203B815823n3822l384J16438j4120j09326j07627j10023j44663j51509r6051
$$ 2815823 2762001 2758617 2875055 2860935 2751609 2643982 2533959 2389296 2237787 2141736
$$ [...]
##END NTUPLES=NMR SPECTRUM
##END=
