##TITLE=Analysis number 323167
Compound Code cc 31701
Project Code adrs
Chemist Name fudan
##JCAMPDX= 6.0         $$ Bruker NMR JCAMP-DX V2.0
##DATA TYPE= NMR SPECTRUM
##DATA CLASS= NTUPLES
##ORIGIN= Bruker BioSpin GmbH
##OWNER= nmr
$$ XWIN-NMR		Version 3.5
$$ Tue Oct 17 19:35:08 2006 GMT Daylight Time (UT+1h)  MAYBRIDGE\nmr@NMR_250MHZ
##.OBSERVE FREQUENCY= 250.131544655141
##.OBSERVE NUCLEUS= ^1H
##.ACQUISITION MODE= SIMULTANEOUS (DQD)
##.ACQUISITION SCHEME= undefined
##.AVERAGES= 16
##.DIGITISER RES= 18
##SPECTROMETER/DATA SYSTEM= dpx250
##.PULSE SEQUENCE= zg30
##.SOLVENT NAME= DMSO
##.SHIFT REFERENCE= (INTERNAL, DMSO, 0, 16.522)
##AUDIT TRAIL= $$ (NUMBER, WHEN, WHO, WHERE, WHAT)
$$ ##TITLE= Audit trail, XWIN-NMR		Version 3.5
$$ ##JCAMPDX= 5.01
$$ ##ORIGIN= Bruker BioSpin GmbH
$$ ##OWNER= nmr
$$ C:\u/data/dgb/nmr/ADRS/800/pdata/1/auditp.txt
$$ ##AUDIT TRAIL=  $$ (NUMBER, WHEN, WHO, WHERE, WHAT)
(   1,<2006-10-17 19:34:47.23 +100>,<MAYBRIDGE\nmr>,<NMR_250MHZ>,
      <created by zg, POWCHK disabled, PULCHK disabled
       configuration hash MD5:
       49 4B E0 1D 92 C2 6B 37 9F E6 65 BC 52 41 86 1D
       data hash MD5: 64K
       FC 34 8D B1 D9 2A 64 BE 73 07 ED BF E4 16 7E 6F>)
(   2,<2006-10-17 19:35:00.77 +100>,<MAYBRIDGE\nmr>,<NMR_250MHZ>,
      <Start of raw data processing
       ef LB = 0.3 FT_mod = 6 PKNL = 1 SI = 32K 
       data hash MD5: 32K
       FE 00 67 57 B5 80 E6 3E EA 6D 67 D0 17 97 84 22>)
(   3,<2006-10-17 19:35:02.64 +100>,<MAYBRIDGE\nmr>,<NMR_250MHZ>,
      <apk 
       data hash MD5: 32K
       87 E2 0A 76 6B 95 42 AE 98 68 07 C4 DE 34 EE 7B>)
(   4,<2006-10-17 19:35:03.47 +100>,<MAYBRIDGE\nmr>,<NMR_250MHZ>,
      <abs ABSG = 5 
       data hash MD5: 32K
       82 2C AE 52 1E 4B C4 06 2F 77 87 4E E4 73 E2 23>)
$$ ##END=
$$ 
$$ hash MD5
$$ 9E B6 9A 76 22 9A 0C 6B 36 EC 32 7F 1D 0D 2A C2
##$RELAX= 
##$RELAX= 
##$RELAX= 
##$RELAX= 
##$RELAX= 
##$RELAX= 
##$RELAX= 
$$ Bruker specific parameters
$$ --------------------------
##$DU= <C:\u>
##$EXPNO= 800
##$NAME= <ADRS>
##$PROCNO= 1
##$TYPE= <nmr>
##$USER= <dgb>
##$AMP= (0..31)
100 100 100 100 100 100 100 100 100 100 100 100 100 100 100 100 100 100 
100 100 100 100 100 100 100 100 100 100 100 100 100 100 
##$AQSEQ= 0
##$AQ_mod= 3
##$AUNM= <au_zg>
##$AUTOPOS= <28 >
##$BF1= 250.13
##$BF2= 250.13
##$BF3= 250.13
##$BF4= 250.13
##$BF5= 500.13
##$BF6= 500.13
##$BF7= 500.13
##$BF8= 500.13
##$BYTORDA= 1
##$CFDGTYP= 0
##$CFRGTYP= 5
##$CHEMSTR= <none>
##$CNST= (0..31)
1 1 145 1 1 1 1 1 1 1 1 1 1 1 1 1 1 1 1 1 1 1 1 1 1 1 1 1 1 1 1 1 
##$CPDPRG= <>
##$CPDPRG1= <>
##$CPDPRG2= <>
##$CPDPRG3= <>
##$CPDPRG4= <mlev>
##$CPDPRG5= <mlev>
##$CPDPRG6= <mlev>
##$CPDPRG7= <mlev>
##$CPDPRG8= <mlev>
##$CPDPRGB= <>
##$CPDPRGT= <>
##$D= (0..31)
0 1 0 0 0 0 0 0 0 0.06 0 0 0 0 0 0 0.0002 0 0 0 0 0 0 0 0 0 0 0 0 0 0 
0 
##$DATE= 1161110086
##$DBL= (0..7)
120 120 120 120 120 120 120 120 
##$DBP= (0..7)
150 150 150 150 150 150 150 150 
##$DBP07= 0
##$DBPNAM0= <>
##$DBPNAM1= <>
##$DBPNAM2= <>
##$DBPNAM3= <>
$$ [...]
##$SUBNAM7= <"">
##$SUBNAM8= <"">
##$SUBNAM9= <"">
##$SW= 20.6930455092707
##$SWIBOX= (0..15)
0 0 3 0 0 0 0 0 0 0 0 0 0 0 0 0 
##$SW_h= 5175.983436853
##$TD= 65536
##$TD0= 1
##$TE= 683.16
##$TE2= 300
##$TE3= 300
##$TEG= 300
##$TL= (0..7)
0 120 120 120 120 120 120 120 
##$TP= (0..7)
150 150 150 150 150 150 150 150 
##$TP07= 0
##$TPNAME0= <>
##$TPNAME1= <>
##$TPNAME2= <>
##$TPNAME3= <>
##$TPNAME4= <>
##$TPNAME5= <>
##$TPNAME6= <>
##$TPNAME7= <>
##$TPOAL= (0..7)
0.5 0.5 0.5 0.5 0.5 0.5 0.5 0.5 
##$TPOFFS= (0..7)
0 0 0 0 0 0 0 0 
##$TUNHIN= 0
##$TUNHOUT= 0
##$TUNXOUT= 0
##$USERA1= <user>
##$USERA2= <user>
##$USERA3= <user>
##$USERA4= <user>
##$USERA5= <user>
##$V9= 5
##$VALIST= <valist>
##$VCLIST= <CCCCCCCCCCCCCCC>
##$VD= 0
##$VDLIST= <DDDDDDDDDDDDDDD>
##$VPLIST= <PPPPPPPPPPPPPPP>
##$VTLIST= <TTTTTTTTTTTTTTT>
##$WBST= 1024
##$WBSW= 4
##$XGAIN= (0..3)
0 0 0 0 
##$XL= 0
##$YL= 0
##$YMAX_a= 405914
##$YMIN_a= -206102
##$ZGOPTNS= <>
##$ZL1= 120
##$ZL2= 120
##$ZL3= 120
##$ZL4= 120
##$ABSF1= 16.522
##$ABSF2= -4.171173
##$ABSG= 5
##$ABSL= 3
##$ALPHA= 0
##$AQORDER= 0
##$ASSFAC= 0
##$ASSFACI= 0
##$ASSFACX= 0
##$ASSWID= 0
##$AUNMP= <proc_1d>
##$AZFE= 0.1
##$AZFW= 0.1
##$BCFW= 0
##$BC_mod= 0
##$BYTORDP= 0
##$COROFFS= 0
##$CY= 12.5
##$DATMOD= 1
##$DC= 0
##$DFILT= <>
##$DTYPP= 0
##$F1P= 14.0000005364418
##$F2P= -0.99999901652339
##$FCOR= 0.5
##$FTSIZE= 32768
##$FT_mod= 6
##$GAMMA= 0
##$GB= 0
##$INTBC= 1
##$INTSCL= 1
##$ISEN= 128
##$LB= 0.3
##$LEV0= 0
##$LPBIN= 0
##$MAXI= 10000
##$MC2= 0
##$MEAN= 0
##$ME_mod= 0
##$MI= 0
##$NCOEF= 0
##$NC_proc= -5
##$NLEV= 6
##$NOISF1= 0
##$NOISF2= 0
##$NSP= 0
##$NTH_PI= 0
##$NZP= 0
##$OFFSET= 16.522
##$PC= 1
##$PHC0= -61.56148
##$PHC1= 11.2097
##$PH_mod= 1
##$PKNL= yes
##$PPARMOD= 0
##$PSCAL= 4
##$PSIGN= 0
##$REVERSE= no
##$SF= 250.13
##$SI= 32768
##$SIGF1= 0
##$SIGF2= 0
##$SINO= 400
##$SIOLD= 32768
##$SREGLST= <1H.DMSO>
##$SSB= 0
##$STSI= 32768
##$STSR= 0
##$SW_p= 5175.98343685301
##$SYMM= 0
##$S_DEV= 0
##$TDeff= 65536
##$TDoff= 0
##$TI= <Analysis number 999999
Compound Code 99
Book Reference 9
Project Code 9>
##$TILT= no
##$TM1= 0
##$TM2= 0
##$TOPLEV= 0
##$USERP1= <user>
##$USERP2= <user>
##$USERP3= <user>
##$USERP4= <user>
##$USERP5= <user>
##$WDW= 1
##$XDIM= 32768
##$YMAX_p= 301260354
##$YMIN_p= -625443
$$ End of Bruker specific parameters
$$ ---------------------------------
##NTUPLES= NMR SPECTRUM
##VAR_NAME=  FREQUENCY,     SPECTRUM/REAL,   SPECTRUM/IMAG
##SYMBOL=    X,             R,               I
##VAR_TYPE=  INDEPENDENT,   DEPENDENT,       DEPENDENT
##VAR_FORM=  AFFN,          ASDF,            ASDF
##VAR_DIM=   32768,         32768,           32768
##UNITS=     HZ,            ARBITRARY UNITS, ARBITRARY UNITS
##FACTOR=    0.157963299565203, 1,           1
##FIRST=     4132.6476996994, 0,             0
##LAST=      -1043.33573715361, 0,           0
##MIN=       -1043.33573715361, -625443,     0
##MAX=       4132.6476996994, 301260354,     0
$$ Real data points
##PAGE= N=1
##DATA TABLE= (X++(R..R)), XYDATA
$$ [...]
24146a30253R360m6015J8692Q4408J70507J06440m8256j95335j10063J5512O0376
24135f4627J62864P5912j28375o3333j13142j0221J22180k9284k1938R5639J15996
24124A41671N1451j03164j66409P9660P9785n4384J8238j03717l4628M247K2806
24113f4444M5273O6343J1804k7707j19245m3547M4783j5266O7465J365p8038j2131
24101a23345M9731m4510j06881j09328n5165J13959J72213J40959R4242K6278
24091A58153L96j18952n8208j17720O6059O8274L1597J3293n0538R284j2999J17380
24079A06019J46929p8919j43101n8343j27778r0441N7892P6754L5838k1473n131
24068a01754R2504P403q2721j0607J11170Q3560q293k7772N134k3955r5298K1863
$$ plain form
24146 -130253 -120893 -166908 -148216 -63808 106699 213139 164883 -30452 -140515 -125003 -64627
24135 -64627 98237 174149 45774 -17559 -130701 -140922 -18742 -48026 -69964 25675 141671
24124 141671 193122 89958 -76451 3209 82994 28610 46848 -56869 -91497 -87250 -64444
24113 -64444 -19171 47172 58976 31269 -87976 -131523 -86740 -102006 -34541 -33176 -111214 -123345
24101 -123345 -73614 -118124 -225005 -334333 -389498 -275539 -103326 37633 131875 158153
24091 158153 158549 39597 -18611 -136331 -70272 -1998 29599 42892 -7646 1638 -11361 106019
24079 106019 252948 174029 30928 -27415 -155193 -245634 -187742 -110988 -75150 -96623 -101754
24068 -101754 -9250 -1847 -84568 -95175 15995 99555 91262 63490 68624 44669 -50629 -28766
24056b8766K1201N2600K109n3543J0395n9685M9720r395l7614M4584K5270p1208
24044e4332n0045j2221n2052q6309O5406N5606N4712l6871J04928p5913o6074
24033a53165j52L7358R5900o1485K091r7143j7423K8800L8076j7867o2286J9675
24021a87621l0553j7806m5360k0241J54647P8023P2266q4108o3811l9510J09502
24010g4572j0603N6016M0561l6524Q098K9823j5659N5835l2138r9216j3481N0978
23998d0882J5748N8248m488j44960q5749j0421J49229N4447P742Q181k1018m3977
23986e7900l0635n5400L0734o9046K411M3726o927O846P4623k7738J802Q4952
23974b552P3432j9999o2654J5575L5540j21989j39395k2831J08088Q1643O2514
$$ plain form
24056 -28766 -7565 45035 47144 -6399 3996 -55689 -5969 -15364 -52978 -8394 16876 -54332
24044 -54332 -104377 -116598 -168650 -254959 -189553 -133947 -79235 -116106 -11178 -87091 -153165
24033 -153165 -153317 -115959 -20059 -81544 -79453 -176596 -194019 -165219 -127143 -145010 -207296 -187621
24021 -187621 -218174 -235980 -281340 -301581 -146934 -68911 3355 -80753 -144564 -184074 -74572
24010 -74572 -85175 -29159 11402 -25122 -17024 12799 -2860 52975 20837 -78379 -91860 -40882
23998 -40882 -25134 33114 28626 -116334 -202083 -212504 -63275 -8828 -1086 7095 -13923 -57900
23986 -57900 -88535 -143935 -113201 -182247 -179836 -136110 -143037 -136191 -61568 -89306 -87504 -2552
23974 -2552 70880 50881 -11773 3802 39342 -82647 -222042 -244873 -136785 -55142 7372
23963G372j04840k9539N0076J0929r512q7561O0279m2237n5853N625j8655P5583
23951a38333P9674p210n2974O78l1181K9777j57432m3801J9452J28245J36748
23940c6357o9410n8199o9590j1730J00103R8260m9115o9194j01480O5129m5243
23929b46826o1659J69028N8808o9309J1142q9295M2075J07560O7904o2242n8394
23918a31208o1536J2491J75553J52060L7221m0778j01805J6800J47659J2575k325
23907B16707j50713j3888K8874r2770O285O7054O0475K6550o8270L6807O1532
23896A78643q640M323q0706r8335j75848O9875Q7790j9642J34591j0306j67737
23885h5992q4260k95P7414M0809q3006K0535K46717Q7362q6389q2844j587M0978
$$ plain form
23963 7372 -97468 -127007 -76931 -66002 -75514 -163075 -102796 -145033 -200886 -195261 -213916 -138333
23951 -138333 -58659 -65869 -118843 -118165 -149346 -119569 -277001 -320802 -301350 -173105 -36357
23940 -36357 -105767 -163966 -233556 -245286 -145183 -46923 -96038 -165232 -266712 -201583 -246826
23929 -246826 -308485 -139457 -80649 -149958 -138816 -228111 -186036 -78476 -10572 -72814 -131208
23918 -131208 -192744 -180253 -4700 147360 184581 143803 41998 58798 206457 219032 216707
23907 216707 65994 52106 80980 -11790 -5505 61549 122024 148574 80304 117111 178643
23896 178643 170003 174326 93620 -4715 -180563 -110688 -22898 -42540 92051 81745 -85992
23885 -85992 -170252 -170547 -93133 -52324 -135330 -114795 131922 219284 132895 50051 48464 89442
23873H9442j04788j60826r4128n4846J08576J9506J30767J2008k0948o378J5862
23862f5753J6865P1695K4886j12784n632k6904R2677M0447l0456l6609l9017M5858
23850b4727O1110M6892j14197o0301n5813J26187N8596k3790r3898k8133j4945
23839a23019o6160J3134O4443M8815P0752k6816j6855j6194n8162k8462L7219
23828a01305P6257N2947R3904K0681n7171o8064k8325O0921K9547j7020K0373
23817H2745l1610k08720m6490p9870j2110K1820L7302k8606P9363l3169n8176
23806b77521J29384J87172L7036P9102j37485M4341q781r1881o7830k6361N7482
23795g5342J25611J35056K4028q7007k255r9400j02996M2360Q6749r7652j82338
$$ plain form
23873 89442 -15346 -176172 -270300 -325146 -216570 -197064 -66297 -54289 -75237 -81615 -65753
23862 -65753 -48888 22807 47693 -65091 -70723 -97627 -4950 35497 5041 -31568 -70585 -24727
23850 -24727 36383 83275 -30922 -91223 -147036 -20849 37747 13957 -79941 -108074 -123019
23839 -123019 -189179 -176045 -111602 -62787 7965 -18851 -35706 -51900 -110062 -138524 -101305
23828 -101305 -25048 27899 121803 142484 85313 17249 -11076 49845 79392 62372 82745
23817 82745 51135 -157585 -204075 -283945 -296055 -274235 -236933 -265539 -186176 -219345 -277521
23806 -277521 -148137 39035 76071 155173 17688 62029 53248 -38633 -106463 -132824 -75342
23795 -75342 50269 185325 209353 122346 120091 20691 -82305 -39945 46804 -50848 -233186
23784b33186j49852J49329J08210M1300L9079M1796N3730j3588m8740P8243k9048
23773C7273j83936n9167J13679J18826l4408K7986n1493j04696r6095q568l3195
23762b73794J16462J43780Q7870K8671O7125p4831j03876j59845K4217M8822J25651
23751C0252K832p5827r5423J6433o2792J01267R8311r8586m6156o120J9776J839
23739a14194k3360J3301k9691J6427L3833J12938M3857N653p6736n2239O3442
23728f769O5493j31786q3679R6724R6378k8075K3901l9435j53630l1576O2349
23717a30105j8251J21030N3519O5005m8639r0203m4817K1660o2896J7444N5017
23706f1236K9498l9794o2101Q3507Q6221J33192j04665j06014J28059k5086q5462
$$ plain form
23784 -233186 -383038 -233709 -125499 -84199 -45120 -3324 50406 36818 -11922 66321 37273
23773 37273 -146663 -205830 -92151 26675 -7733 20253 -31240 -135936 -232031 -240599 -273794
23762 -273794 -157332 -13552 74318 102989 170114 95283 -8593 -168438 -144221 -95399 30252
23751 30252 33084 -42743 -138166 -121733 -184525 -83258 15053 -83533 -129689 -135809 -116033 -114194
23739 -114194 -137554 -124253 -153944 -137517 -103684 9254 53111 58764 -17972 -70211 -6769
23728 -6769 58724 -73062 -156741 -60017 36361 8286 32187 -7248 -160878 -192454 -130105
23717 -130105 -148356 -27326 26193 91198 42559 -47644 -92461 -70801 -133697 -116253 -61236
23706 -61236 -31738 -71532 -133633 -50126 36095 169287 64622 -41392 86667 61581 -23881
23695b3881m7468l9137P2987M1792j3915q5722J2363p3019R3159j2950p0972J01652
23683d5111n1911o4697J11827L8217m8940q892R2618j6259n0401K3709M083j10040
23671a25797K2516L8959K9566n2948r4103N129R6988R0959k7653o5488j7839O1598
23659c8113R5407o2635o1876J21160r039n9495j13612n2903r120k3092O7848j7076
23647a62546O7094J14786R0644l7415p7296K843m0912J24729j0290p5521K1326
23636A7442m1794o8213n9332N3720J33475j09238j31679J03973J13553q591j33178
23625a29862k3930O8562K0649L7836O7663J9907K656p1149k511N0496J0511n2909
23613b081o4432l0308j75113J8886J2773J58195n0134K8115l2953J02997M3957
$$ plain form
23695 -23881 -71349 -110486 -37499 4293 -9622 -95344 -82981 -156000 -62841 -75791 -146763 -45111
23683 -45111 -97022 -161719 -49892 -11675 -60615 -69507 23111 6852 -43549 -19840 -15757 -125797
23671 -125797 -103281 -64322 -34756 -87704 -181807 -176678 -79690 11269 -16384 -81872 -99711 -38113
23659 -38113 57294 -5341 -67217 53943 44904 -14591 -128203 -181106 -190226 -213318 -145470 -162546
23647 -162546 -95452 19334 109978 72563 -4733 -1890 -42802 81927 71637 -3884 17442
23636 17442 -24352 -92565 -151897 -98177 35298 -73940 -205619 -101646 11907 3316 -129862
23625 -129862 -153792 -85230 -64581 -26745 40918 60825 63481 -7668 -10179 40317 50828 -2081
23613 -2081 -66513 -96821 -271934 -253048 -240275 -82080 -132214 -104099 -137052 -34055 9902
23602I902j6211O254k2668j2727Q2474o6439p4810J8160m6057Q6401J09815k7005
23590D7089j23887j39398J5295J2547Q4082J06378j28872K089M4180o00L3947
23579d7150O115K2149j337K0956o4200K1782R569q8805O1711k3584J15695l337
23567B9564j10300l1349J10328o5786k3514O1321R3571n4905j32552p6872M0764
23556a59730L8193K4452P2451J483Q3389m7046p5052r7084k2285m5560L9272q7470
23544b74987j3841Q8899M5726o24j9479P7173K0332J7239L4605N5231j1781m8636
23532c0143l7257n7284n0144P6453k0665p7713J3613P0649N2509p5575K1132N2111
23520f2314J07463L9871j47856q2568L8406O1805O0726K2260n1636n506L4031
$$ plain form
23602 9902 -6309 -55 -22723 -35450 47024 -19415 -94225 -76065 -122122 -35721 74094 47089
23590 47089 -76798 -216196 -200901 -188354 -104272 2106 -126766 -124677 -80497 -81097 -47150
23579 -47150 -41035 -18886 -20223 733 -63467 -41685 -32116 -120921 -59210 -82794 32901 29564
23567 29564 -80736 -112085 -1757 -67543 -91057 -29736 63835 8930 -123622 -200494 -159730
23556 -159730 -121537 -97085 -24634 -23151 60238 13192 -61860 -158944 -181229 -226789 -187517 -274987
23544 -274987 -288828 -199929 -154203 -154827 -174306 -97133 -76801 -59562 -24957 30274 18493 -30143
23532 -30143 -67400 -124684 -174828 -98375 -119040 -196753 -183140 -112491 -59982 -135557 -114425 -62314
23520 -62314 45149 85020 -62836 -145404 -106998 -45193 15533 37793 -13843 -19349 14682
23509A4682P7727o9005r1018M0058L358k6501N9823k2918o8870l5436L2587N2482
23497c3031J6091j34535k9582J97398P6711p9661m148q8753j084J02082J4594
23486C6082m8896q8418j23750n9973Q9018K0371Q541j0362J9681k807J0107j46776
23474b97182r062Q1892j1931M2847k5823M142O1223R6048L5022O8822l9859P3062
23462G9201J15204j74271j32255j96022o9171N2929Q3058L3576j0812K9164J29523
23451e9876J21760n4066q3454k9206P3870j5767n7085k1952M7358j1025P7603
23440a1840l3029q4982K7385L663n3080P6690P3010J00545n4233q3446q2094P4676
23428d6735M6861L0765N6276j09654o5812n9689M4140L6495K4236o0863m3989
$$ plain form
23509 14682 92409 23404 -67614 -27556 -24198 -50699 9124 -13794 -82664 -118100 -85513 -33031
23497 -33031 -16940 -151475 -181057 16341 93052 13391 9243 -79510 -80594 21488 36082
23486 36082 -12814 -101232 -224982 -284955 -195937 -175566 -167025 -177387 -157706 -160513 -150406 -297182
23474 -297182 -306244 -224352 -236283 -193436 -219259 -215117 -153894 -57846 -22824 45998 6139 79201
23462 79201 194405 20134 -112121 -308143 -377314 -324385 -241327 -207751 -218563 -189399 -59876
23451 -59876 61884 7818 -75636 -104842 -30972 -46739 -103824 -125776 -78418 -89443 -11840
23440 -11840 -44869 -129851 -102466 -98803 -151883 -75193 -2183 98362 44129 -39317 -121411 -46735
23428 -46735 126 30891 87167 -22487 -88299 -147988 -103848 -67353 -43117 -103980 -147969
23417a47969J02M7252J16765N9725k6516r3796r6587M2697P7364K8437k6813m1298
23405f0637K8942l4954L5575J38719j3907q194q6364j62573R4355r768n694M0782
23393d3718m9111o5273M8296l5283R6011r432n8491J26770N2796q5810M5034O3982
23381H5771l792j02164r4248K3892k3262j01990L1731Q6564L3325M832o9157j04572
23369b33070n008L6833R2003K8099j19412q1743n4841J7320P826L1643r650m7680
23357c37680J56867K7581o9047r0988k8117J64955J65220P0220k3846O4828N6181
23346A56174n8177m5163N026j2649K8197n0696j37472J0132P1620l3697M4520
23335b2185m9775j4543j57629l4408K6856J2625J86966L6149j58184M0738J84100
$$ plain form
23417 -147969 -147867 -100615 16150 75875 49359 -44437 -141024 -98327 -20963 7474 -19339 -60637
23405 -60637 -31695 -66649 -31074 107645 93738 85544 -820 -163393 -69038 -78806 -84500 -43718
23393 -43718 -92829 -158102 -109806 -145089 -49078 -58510 -117001 9769 62565 -23245 21789 85771
23381 85771 81979 -20185 -114433 -90541 -113803 -215793 -184062 -97498 -64173 -59341 -128498 -233070
23369 -233070 -238078 -201245 -109242 -81143 -200555 -282298 -337139 -319819 -311993 -280350 -290000 -337680
23357 -337680 -180813 -153232 -222279 -313267 -341384 -176429 -11209 59011 35165 99993 156174
23346 156174 97997 52834 57860 45211 73408 22712 -114760 -104628 -33008 -66705 -22185
23335 -22185 -71960 -86503 -244132 -278540 -251684 -239059 -52093 -15944 -174128 -133390 50710
23324E0710M9382j30942j64615r4060N6435J96708m0846r8905K5386L0489K5594
23313i4664J0077M0410J08010p7525o2970M898m5495r3679m0305p3533Q924J2819
23301c03033j206J03642k2244M5305O9819N8649M4695n1234j15867M5283K13470
23290H7279k5418k8661j5188q0828p603O8497m9036n2101j11450n0665P1912R5395
23278i7867M7127J3827L1853m6093q688K3694L7602N1743L0681j6436r5441k3844
23266e1842N7595N024p8273Q1785Q4465M0409n1467j2516o668J1046j14001j25944
23254a60387L0657J35471J1831Q4594J83753o6243j39005o5493r522j62215j44221
23243c00780P6698j3076J23407k594o3606p7313J6501P9055k1688n8934p4746
$$ plain form
23324 50710 100092 -30850 -195465 -289525 -233090 -36382 -77228 -176133 -150747 -120258 -94664
23313 -94664 -84587 -44177 63833 -13692 -76662 -71764 -117259 -210938 -251243 -324776 -315852 -303033
23301 -303033 -304239 -200597 -222841 -177536 -107717 -49068 -4373 -55607 -171474 -126191 87279
23290 87279 61861 33200 18012 -62816 -70419 -1922 -50958 -103059 -214509 -265174 -193262 -97867
23278 -97867 -50740 -36913 -5060 -51153 -59841 -36147 1455 53198 83879 67443 -27998 -51842
23266 -51842 5753 10777 -67496 14289 98754 139163 87696 75180 68512 79558 -34443 -160387
23254 -160387 -129730 5741 17572 102166 285919 219676 80671 15178 5656 -156559 -300780
23243 -300780 -224082 -237158 -113751 -116345 -179951 -257264 -240763 -161708 -183396 -242330 -317076
23232c17076N8904Q6532J00006l3416o4635j8577j60713k0436J27770R1120J58229
23221G708M7757J7009j76345n3886J1285l1098m1893O310N8929Q0222k1427j57322
23209b52751n2593J04880N4201J4181O8776L4022O9455m731j44468J6214O8748
23198b4066O8931R3762O6080p4425q7498j9041O3485J9312j87479p0582N4657
23187i6864n3482p7895N7899J72073L1763k7747j35271l5552J35237n8773j33336
23176b21948K7850J2555L0180p4624K773J1702n8408J0477J69261L8465j30318
23165a82035j13343j31421M3263J72035J276j15145L0448L5370R1857N5421P001
23154a05273O1314m442m6828j32140j26815J10117P6091O3916N8115Q669n7038
$$ plain form
23232 -317076 -258172 -171640 -71634 -105050 -169685 -188262 -348975 -369411 -241641 -150521 7708
23221 7708 55465 72474 -103871 -157757 -146472 -177570 -219463 -213153 -154224 -74002 -95429 -252751
23209 -252751 -305344 -200464 -146263 -132082 -63306 -29284 40171 35440 -109028 -92814 -24066
23198 -24066 44865 138627 204707 130282 42784 23743 87228 106540 -80939 -151521 -96864
23187 -96864 -150346 -228241 -170342 1731 33494 5747 -129524 -165076 -29839 -88612 -221948
23176 -221948 -194098 -181543 -151363 -225987 -223214 -211512 -269920 -259443 -90182 -51717 -182035
23165 -182035 -295378 -426799 -383536 -211501 -210225 -325370 -294922 -259552 -167695 -112274 -105273
23154 -105273 -43959 -48401 -95229 -227369 -354184 -244067 -167976 -104060 -45945 -37276 -94314
23143i4314k19j5295l0891l837O1286J31109L5302q8641k8977r5908K7273m8796
23131a51908k5503L2799J08482N8719j17162P681m3190O00P8q7831n7031m1606
23119c15872J1732J15484J21141N6070k11821m2032J61193L936n747j7428j2202
23108a35546L1165K7398K1523L4978J4641q3611m3107m1133n2108L7738N8143
23097a29919o4274M3657J79672n28l9903j4737p1847l9095j5091J07762O7805
23086B3502L0774n9774r1553N8071N4622J38715L0903m0718j46217J3160J52761
23075A64246K707o3859p1396K7816p162o014m8252m4850k7435K0950K1454L3011
23063A216n3359r2198j18611Q8834n1894O6005M5272N0262K5919n0112O2532m1179
$$ plain form
23143 -94314 -94533 -109828 -140719 -144556 -83270 47839 83141 -5500 -34477 -130385 -103112 -151908
23131 -151908 -177411 -144612 -36130 22589 -94573 -86892 -130082 -129482 -129404 -217235 -274266 -315872
23119 -315872 -304140 -188656 -67515 -11445 -223266 -265298 -104105 -100169 -105916 -123344 -135546
23108 -135546 -104381 -76983 -55460 -20482 -5841 -89452 -132559 -173692 -225800 -188062 -129919
23097 -129919 -194193 -150536 29136 28608 -11295 -26032 -97879 -136974 -152065 -44303 23502
23086 23502 54276 -5498 -97051 -38980 15642 154357 185260 144542 -1675 11485 164246
23075 164246 166953 103094 31698 59514 52352 46338 -1914 -46764 -74199 -53249 -31795 1216
23063 1216 -52143 -144341 -262952 -174118 -226012 -160007 -114735 -64473 -38554 -88666 -26134 -67313
23051f7313K9740M5312M5637m3379O5666r7238q9045N3725m671j00922L2482M6403
23039h3603K789J4104P7588J6292O800n3991o2861r8039N178R7844J43354K6187
23027I1642j02075q4650L6821Q063o0447n4693m6689R7156j3768j07291q0504
23016c16435Q7179P0853L7892L2543O8124j8639M9830o4652p9626k8591n3015
23005b14537Q1249R7674M9256L3604Q365p4833L0266m1202o1423L3831J8718l155
22993d2187p6323L8396j1422n5075j99375k142J47687J11904L4346Q3242L5515
22982F4566r5677j58182J8548J22602Q4041l0939l0799N6870m5842r584l2004
22971e6400m9033l4496m870l9009K5927J91623P0763J0490j06479q1159K403J01957
$$ plain form
23051 -67313 -37573 7739 53376 9997 75663 -21575 -110620 -56895 -61566 -162488 -130006 -83603
23039 -83603 -80814 -66710 10878 27170 33970 -20021 -82882 -180921 -175743 -77899 65455 91642
23027 91642 -10433 -95083 -58262 -50199 -110646 -165339 -212028 -114872 -128640 -235931 -316435
23016 -316435 -229256 -158403 -120511 -87968 -19844 -38483 11347 -53305 -132931 -161522 -214537
23005 -214537 -133288 -35614 13642 47246 55611 -19222 11044 -30158 -91581 -57750 -39032 -42187
22993 -42187 -118510 -80114 -91536 -146611 -345986 -348128 -200441 -88537 -54191 29051 64566
22982 64566 -31111 -189293 -170745 -48143 35898 4959 -25840 31030 -14812 -24396 -56400
22971 -56400 -105433 -139929 -144799 -183808 -157881 33742 104505 114995 8516 -72643 -70240 31717
22959C1717M0027n8155L7091j02809m9045r099k9831Q712K0233k246j97264k8100
22947c38769p961k5453L9821O5072M6685P7225J55454K7875r2366j25015n7976
22936b35408R8539R9793J59882j11222j06586o833K1127M8186m175q5472p889
22925a30058J7382J14775L9715j31643J698K9689N490k5101R617N3659j19949
22914a34726p731J02759J04866q4900k2346j3745m0523M02O2452J19L6565j08431
22902a05239j41106O4545P3682k3250r9764m2978m2945l4290N6478J52498K0347
22891a22022O1612m6064r8349J3124O4505Q4550L0163O5588K6966j30490j14500
22880a64917n8180n2945O2590J15800M4912j01737J8128m6115j10792O9393J20325
$$ plain form
22959 31717 71744 13589 50680 -52129 -101174 -110273 -140104 -131392 -111159 -113405 -310669 -338769
22947 -338769 -346730 -372183 -332362 -267290 -220605 -143380 12074 39949 -52417 -177432 -235408
22936 -235408 -136869 -37076 122806 11584 -95002 -101835 -80708 -32522 -36697 -122169 -130058
22925 -130058 -112676 2099 41814 -89829 -88131 -58442 -52952 -78053 -68436 -14777 -134726
22914 -134726 -142457 -39698 65168 -19732 -42078 -55823 -96346 -95944 -33492 -33373 3192 -105239
22902 -105239 -246345 -181800 -108118 -131368 -231132 -274110 -317055 -351345 -294867 -142369 -122022
22891 -122022 -60410 -106474 -204823 -191699 -127194 -42644 -12481 53107 80073 -50417 -164917
22880 -164917 -223097 -276042 -213452 -97652 -52740 -154477 -136349 -182464 -293256 -223863 -103538
22869a03538L4134r7069l6984Q6897L1042q7594l6261L5843J9963Q1874N0579
22858b1114r2969j03344k0264P3795m8215m5718P4778P2355M3350o9065l7236
22847a73647P4950J29889N848r7819q0956o441l5389M3624N414j08625O5968p3275
22835b50459j34203K9819J52285J10118M2749j48238O6684l2439m6874K1573P9790
22824a09195L878n7270r6403l4829p3132p2858J13500J13044k296r2008O3470
22813b44099p3669L246O062l3246Q0576P7365O4169P206n7965M1573O3893l4771
22801i9660j3058j00478r9012P5728Q6695j953j271k9583n2152J2366O0536k3582
22789a85424L5888J14595L5226O413O3533k5192n8150N1278p6045l7616k7647
$$ plain form
22869 -103538 -69404 -166473 -203457 -116560 -85518 -173112 -209373 -173530 -153567 -71693 -21114
22858 -21114 -114083 -217427 -237691 -163896 -212111 -257829 -183051 -110696 -67346 -136411 -173647
22847 -173647 -98697 31192 37040 -60779 -141735 -148176 -183565 -139941 -134527 -243152 -177184 -250459
22835 -250459 -384662 -354843 -202558 -92440 -49691 -197929 -131245 -163684 -210558 -188985 -109195
22824 -109195 -105317 -162587 -258990 -293819 -366951 -439809 -326309 -213265 -215561 -307569 -244099
22813 -244099 -317768 -314522 -308460 -341706 -261130 -183765 -119596 -112390 -170355 -128782 -64889 -99660
22801 -99660 -112718 -213196 -312208 -236480 -149785 -151738 -153009 -182592 -234744 -222378 -161842 -185424
22789 -185424 -149536 -34941 285 6698 70231 45039 -13111 38167 -37878 -75494 -103141
22778a03141l4872k8979j06520j66718R4585Q2800O1596m2006J9849N2944k4499
22767a94961p13J06440Q0633r8875j04711j23344q850P0444J21602L9326p347
22756a20356p4378j01206R0062Q9005j0935L155m1628l4369R0927J3074j02245
22745a98894M9277L6427P1544N293o9230n1938j6005O7721M2529N2647j2557p6220
22733i9406j29483N9781P1937j1589j61893j0122J30948K5517L9568M6457M8191
22722I906J17003j62865n4669L0328O4137k5084j06286M477O5757P8234m3530
22711b2592j26066M7417j9532L1990j13495l4667J06000J37014n014j21722o9555
22700a90222k959N5016k8848N8630J30938O9039k1971o8271p6411O440k9449M5476
$$ plain form
22778 -103141 -138013 -166992 -273512 -440230 -345645 -262845 -201249 -243255 -223406 -170462 -194961
22767 -194961 -195674 -89234 -8601 -107476 -212187 -335531 -344381 -273937 -152335 -113009 -120356
22756 -120356 -194734 -295940 -205878 -116873 -127808 -124653 -166281 -200650 -109723 -96649 -198894
22745 -198894 -149617 -113190 -41646 -36353 -105583 -157521 -173526 -105805 -63276 -10629 -23186 -99406
22733 -99406 -228889 -169108 -97171 -108760 -270653 -280775 -149827 -124310 -84742 -38285 9906
22722 9906 126909 -35956 -90625 -60297 3840 -21244 -127530 -123053 -57296 20938 -22592
22711 -22592 -148658 -101241 -120773 -88783 -202278 -236945 -130945 6069 1055 -120667 -190222
22700 -190222 -193181 -138165 -167013 -108383 22555 91594 69623 1352 -75059 -68619 -98068 -52592
22688e2592l4078l0608Q7132Q7672K9264P8670k7331m2610j3723j4870o677k1376
22676C8873m6100q8432p0972J9226R2174j5841r534N210J8870l0189J11312J08520
22664A33117j06857P378M6353j07211j24821o3390j1548R1952j9016J4366L0711
22653a08966J0266O8501k1305M083m0653L5048q4280P9201J2974Q706k3479r5857
22641a55761j7315R615m8098M9841L2587J16833J36166m7582j31881l7530j08228
22630b01353m198M6838Q8577m9688r9607J27413R7293m2962p935j15227m8987
22619b09836M377R889j22607o7538Q215J43002k0075K9711J01444J15991k7819
22608c5246o0452o0976k4751J07553K4012L9580L4609m6433p8934l2309O5587
$$ plain form
22688 -52592 -86670 -117278 -30146 57526 86790 165460 138129 95519 81796 66926 60249 38873
22676 38873 -7227 -95659 -166631 -147405 -55231 -71072 -80606 -75396 -56526 -86715 24597 133117
22664 133117 26260 33638 79991 -27220 -152041 -215431 -226979 -135027 -154043 -139677 -108966
22653 -108966 -98700 -30199 -51504 -47421 -88074 -53026 -137306 -58105 -45131 -36425 -59904 -155761
22641 -155761 -173076 -163461 -211559 -161718 -129131 -12298 123868 76286 -55595 -93125 -201353
22630 -201353 -205551 -158713 -70136 -119824 -219431 -92018 5275 -37687 -45622 -160849 -209836
22619 -209836 -205459 -195570 -318177 -385715 -377500 -234498 -254573 -224862 -123418 -7427 -35246
22608 -35246 -95698 -156674 -181425 -73872 -49860 -10280 24329 -22104 -101038 -133347 -67760
22597f7760K5725p071L9776k3540M1350M8984m4766j52993n0161Q023N9172R1977
22585c1284N5146o7659o4362O8211j5927m1770K1885p6971o7765j3606K9761O0601
22573a43740K1845k2467O6301l5837j13571O214o9905k535J30580M8951k2489
22562a36653J722m5249j66148l7881J30573J44287j24395L4562k1405O1851q4581
22551b43317j15889Q3232Q9599L7201J10044j15384j20594J197M4279O5945L8925
22540a24762K0520m1644j2501Q2222L618N026J15579J67514k0303j80321q433
22529F515N3464q120o8118j59398j42545R2619P2014R286O5655K8997Q225j9530
22517f0936j07982N5805J78055K8566j65942k2928m4784n5508j0004P5940J00574
$$ plain form
22597 -67760 -42035 -49106 -9330 -32870 8480 57464 12698 -140295 -190456 -182433 -123261 -31284
22585 -31284 23862 -43797 -108159 -39948 -55875 -97645 -75760 -152731 -220496 -234102 -204341 -143740
22573 -143740 -121895 -144362 -78061 -113898 -227469 -221255 -291160 -293695 -163115 -114164 -136653
22562 -136653 -134931 -180180 -346328 -384209 -253636 -109349 -233744 -199182 -220587 -158736 -243317
22551 -243317 -359206 -275974 -186375 -149174 -39130 -154514 -275108 -273911 -229632 -163687 -124762
22540 -124762 -104242 -145886 -158387 -76165 -72547 -67521 48058 215572 195269 14948 6515
22529 6515 59979 51859 -16259 -175657 -318202 -225583 -153569 -144283 -78628 -49631 -41406 -60936
22517 -60936 -168918 -113113 64942 93508 -72434 -95362 -140146 -195654 -205658 -129718 -29144
22506b9144L9366m7564l4086N7106N1893P1249n5780o4375n9376j28823L1789
22495a67745J40653J47315R3661j21400l01944j16213j15959N9662R1609J70333
22485a20028L2163l1212J0867j41658o9670K2192M3139L4581O5092j2687k15366
22474c82587o4623m5989j32244J46131J06428N2175l237Q8099m799m8582L1588
22463b57640M5207p3859q6262N2619J53600m3452J193J12985O5103J04502R8174
22452A72170j62289k61470L0447P6774N2640R6884j9816q2896N5138o1342m4661
22441a48421J9847k3444L9445R3178Q7017o9973n9200r214j474j6288P1157l4974
22429e2344j14132J06022P1771J8580J5645j48828n1696P870o320q730Q8979K5844
$$ plain form
22506 -29144 10222 -37342 -71428 -14322 37571 108820 53040 -11335 -70711 -199534 -167745
22495 -167745 -27092 120223 213884 92484 -209460 -325673 -441632 -381970 -290361 -120028
22485 -120028 -87865 -119077 -108210 -249868 -319538 -297346 -254207 -219626 -154534 -167221 -382587
22474 -382587 -447210 -493199 -625443 -479312 -372884 -320709 -323946 -235847 -240646 -289228 -257640
22463 -257640 -212433 -286292 -372554 -319935 -166335 -209787 -208594 -95609 -30506 73996 172170
22452 172170 9881 -251589 -221142 -144368 -91728 5156 -14660 -97556 -42418 -103760 -148421
22441 -148421 -128574 -152018 -112573 -19395 67622 -2351 -61551 -70765 -72239 -88527 -17370 -52344
22429 -52344 -166476 -60454 11317 29897 45542 -103286 -154982 -147112 -153432 -162162 -73183 -47339
22417d7339m5852k144m5944k751l6054L8862N7291m3870Q3999Q3819P160j04804
22405e7627n2421o1691m8861N3970n9223O4974R7229Q7417j70451m020J33659
22394a7045J0287r5569j25701R1270M2579o1485m7273J33299N760j64127M564
22383b23441K8011P9264O689l8953l1097m2298P3104N4435j05875m2743n1064
22372b93968N3508L9660k387N491j2902j771K025R1359K2035k7040p9113n0752
22360b53855J42834J7507j03158j01276J41529P658n3025o1663O3411N8032k9424
22349a71430Q5546K7842k6217p947P093l0518k7550J9172K4962J7288o0219n7222
22337a99200Q6566J70949k7934J333M3021n9482n0374J23415n4268k70016p3339
$$ plain form
22417 -47339 -93191 -95335 -141279 -144030 -180084 -141222 -83931 -127801 -43802 40017 47177 -57627
22405 -57627 -110048 -171739 -220600 -166630 -225853 -160879 -63650 23767 -146684 -150704 -17045
22394 -17045 -6758 -102327 -228028 -136758 -94179 -155664 -202937 -69638 -63878 -228005 -223441
22383 -223441 -195430 -116166 -109477 -148430 -179527 -221825 -148721 -94286 -200161 -242904 -293968
22372 -293968 -240460 -200800 -203187 -197696 -210598 -212369 -210344 -118985 -96950 -123990 -203103 -253855
22360 -253855 -111021 -93514 -196672 -297948 -156419 -148761 -201786 -263449 -200038 -142006 -171430
22349 -171430 -85884 -58042 -84259 -92206 -85113 -115631 -143181 -124009 -99047 -81759 -141978 -199200
22337 -199200 -112634 58315 30381 31714 74735 15253 -35121 88294 34026 -235990 -309329
22326c09329P8136O4766q4196j56772M1154R2209R55O3901k140P2786J85271k114
22314D4627r8199j09046O1280M6355o9683N0612j26826j9110Q0970o0446j37019
22303c36485L8331J65113m4012J8844K0991K5511M4044L8002l2945l417j07943
22292a73966J2127R0428J6176J0337j06498j37947j63838J48685K42169j7616
22282g9943j0829N2886J17783K9710r506J8284j41105j13558o0087L1993J15157
22271d9215L8077j3467N7347P416q9926j1664N4601m8131j11351O1881J05784
22260A352k0269J9591l245l9571n2370O8238K2247L5544r8446r5790L4131L2722
22248i5866n580L5532J0393p652p1620n8587k5551K6847o1397l1060r0851L9539
$$ plain form
22326 -309329 -231193 -166427 -250623 -407395 -366241 -274032 -273077 -209176 -211316 -138530 46741 44627
22314 44627 -53572 -162618 -101338 -54983 -124666 -74054 -200880 -219990 -139020 -199466 -336485
22303 -336485 -298154 -133041 -177053 -158209 -137218 -111707 -67663 -29661 -62606 -66023 -173966
22292 -173966 -161839 -71411 -55235 -44898 -151396 -289343 -453181 -304496 -62327 -79943
22282 -79943 -90772 -37886 79897 109607 100101 118385 -22720 -136278 -196365 -164372 -49215
22271 -49215 -11138 -24605 32742 40158 -49768 -61432 -6831 -54962 -166313 -104432 1352
22260 1352 -18917 674 -2571 -42142 -94512 -26274 -4027 31517 -66929 -162719 -128588 -95866
22248 -95866 -101446 -65914 -55521 -63173 -134793 -193380 -218931 -192084 -253481 -284541 -375392 -335853
22236c35853j5422K1334R3918J30251Q699j835l8782Q9483l6542j26214k1921
22225b32884L6568l6217K7470P0102j13005l4150r530M2034J29687J61893l9875
22214B093p877j1823o8248k2898L3902L9202m7483j3256J3669Q0140q30l3275
22202c6684q4344j18892K4148O1545l6889P9335R4990j1961l6978r9746p0153
22191b35629R4287J13329M1293J4523m374q6081K252p2988m3645j25178N4680
22180b47531O5709J31145J22643k8159k27306j12795J29213N2999j4089K6831
22170a01340j1136R5563L4949M0203o4412j20576j15367l3450J13391m461J2787
22159a53849R0387L2601O0455Q4443J6023O1812m8446O561m8777q6843k6528q4562
$$ plain form
22236 -335853 -351275 -329941 -236023 -105772 -97073 -98908 -137690 -48207 -84749 -210963 -232884
22225 -232884 -196316 -232533 -205063 -134961 -247966 -282116 -291646 -249612 -119925 41968 2093
22214 2093 -5784 -17607 -85855 -108753 -74851 -35649 -83132 -96388 -82719 -2579 -3409 -36684
22202 -36684 -121028 -239920 -215772 -154227 -191116 -111781 -16791 -28752 -65730 -165476 -235629
22191 -235629 -141342 -28013 13280 27803 23429 -62652 -60400 -133388 -177033 -302211 -247531
22180 -247531 -181822 -50677 71966 43807 -183499 -296294 -167081 -114082 -128171 -101340
22170 -101340 -112476 -16913 18036 58239 -6173 -126749 -242116 -275566 -162175 -166636 -153849
22159 -153849 -63462 -30861 29594 114037 130060 191872 143426 149987 101210 14367 -12161 -96723
22147i6723K4417J5246n679N9226n8524p8399L9019n342J02116O6997j33804j00839
22135a72289N8817k9839j0532O109k2826q508j0518O7495J1123Q4286J02632l2216
22123D3734j22919q2873M9940M7455J4061Q9278N2051k5998n0751r3609p9453
22112a59084O7380R7270R1142p1802L9617p9558o622O2909n9655k3678J6813O2935
22100C7667K7372Q9104q4060j78307n2922J1680R0135O9754M1992q6921j63107
22089a97613k6688r6599K5570K3913P8997L8708k9908J09011J53121O3870o1376
22078H1006m6648L6368r596j08818q1461j9494P68p0916J8782J63955J9125p4672
22066i1601l2466N3137N4133k924m3862l8423M9041N9954K3153L3483m388M149
$$ plain form
22147 -96723 -72306 -57060 -62739 -3513 -62037 -140436 -101417 -106759 -4643 62354 -71450 -172289
22135 -172289 -113472 -143311 -153843 -147734 -170560 -179068 -189586 -122091 -110968 -26682 75950 43734
22123 43734 -79185 -162058 -112118 -64663 -50602 38676 90727 64729 13978 -79631 -159084
22112 -159084 -91704 5566 96708 24906 64523 -15035 -21657 41252 -18403 -42081 -25268 37667
22100 37667 65039 154143 70083 -108224 -161146 -149466 -59331 10423 52415 -34506 -197613
22089 -197613 -224301 -320900 -295330 -271417 -192420 -153712 -183620 -74609 78512 142382 81006
22078 81006 34358 70726 61130 -47688 -129149 -148643 -147875 -218791 -200009 -36054 -16929 -91601
22066 -91601 -124067 -70930 -16797 -19721 -63583 -102006 -52965 6989 30142 63625 59237 63386
22054F3386J7611M524o5937j8492m4340l4547J16050K096p0440q3294R751j2409
22042a16041j23863l0961L0592J9405J17724n8026k7018J7313l390J32410q4441
22031a26296j16035k5508J8533K1463M9207J3298N551p3494j4108P3402K9993
22020a43994J8418O8802O1511n9205m0691Q4399q651m9104q5394N565l4034P8315
22008a04063j21461K681J49682J29998o3516p5590O32l332r874L3187J98372J74003
21996C10719m5016j16380o4095p4980n8635p1798o790R2670J3178N9201n3114
21985a5040j65619j3828J1874J07736K6749l5686n1755p7271L0173J37367J07596
21974F2296L9580k1529n2188k09891O091J15971M6465L0393J2561k884j26660
$$ plain form
22054 63386 80997 85521 19584 1092 -43248 -77795 38255 40351 -30089 -113383 -103632 -116041
22042 -116041 -239904 -270865 -240273 -220868 -103144 -161170 -188188 -170875 -174265 -41855 -126296
22031 -126296 -242331 -267839 -249306 -227843 -178636 -165338 -159787 -233281 -247389 -173987 -143994
22020 -143994 -125576 -56774 4737 -54468 -95159 -10760 -19411 -68515 -153909 -148344 -182378 -104063
22008 -104063 -225524 -222843 -73161 56837 -6679 -82269 -81637 -84969 -94843 -61656 136716 310719
21996 310719 265703 149323 85228 10248 -48387 -120185 -126975 -34305 -21127 38074 -15040
21985 -15040 -180659 -194487 -182613 -74877 -48128 -83814 -135569 -212840 -182667 -45300 62296
21974 62296 101876 80347 28159 -181732 -175641 -59670 -13205 17188 29749 26865 -99795
21963i9795k9784J0670L691j6243m8743J31428J42852m4137j12016k9771k6063
21952a17911J4563M4266p7594J63188R4284K3119j64527j46425k5563P6006M2446
21941g4148n1080j37795m593K0466p4474j8724N6357Q3783J55509K38331K734
21930A96366j91502j63974j07711j4691K09673P7185q6991q2549M8237P0715l9420
21919h4662L3681J0632R683N9629K6220p9948l5179K0874k7530j9597r635o5251
21907a61083j02882l734Q3266q2370L5120p450J4082p254l8433P1620R2633L1515
21895g4970O3773K7151L3158K3871O3333r1792o6393J9910N9447O7094M994l4059
21883I5517m0322l7640r0868Q1963l836m553l1861m7469q316q928M0950M6353
$$ plain form
21963 -99795 -129579 -118909 -115218 -131461 -180204 -48776 94076 49939 -62077 -91848 -117911
21952 -117911 -103348 -59082 -136676 26512 120796 143915 -20612 -167037 -192600 -116594 -74148
21941 -74148 -125228 -263023 -267616 -247150 -321624 -340348 -283991 -200208 -44699 193632 196366
21930 196366 4864 -159110 -266821 -281512 -71839 5346 -81645 -164194 -115957 -45242 -84662
21919 -84662 -50981 -40349 -30666 28963 55183 -24765 -59944 -39070 -66600 -86197 -95832 -161083
21907 -161083 -263965 -267699 -184433 -266803 -231683 -239133 -225051 -232305 -270738 -199118 -106485 -74970
21895 -74970 -11197 15954 49112 72983 136316 44524 -21869 -1959 57488 124582 129576 95517
21883 95517 55195 17555 -73313 8650 4814 261 -31600 -79069 -87385 -96313 -55363 -9010
21871i010P965M2125J37931L2867o9449q8204j00205n9915O8553l692J7977J4457
21859h600j5304J3051o4335o1870l379J09951K9986j545K8556O6055j5587j18244
21847d1265p7419m7803J91343K6431j08921j47510P669J61156O6141p3356m2410
21836h5944L4603P9444m4706n283n4863p6124P6703n8997j50139L9151R6830Q2748
21824f6577j22466j05656O1622J22597R4270L768Q509k9345K1470j47538O324
21813a53022O767Q4476J95049m3457j2123o8792q7254K6457r473j1512j22268
21802a95152M9234j5397K5147M3866j44945J2745j5087q1133J73598J12657j2043
21791d6510M6812J24018N190k2367j17042L2208j1677m731Q676J5039n9983k8578
$$ plain form
21871 -9010 -1045 41080 179011 211878 142429 54225 -45980 -105895 -37342 -41034 -23057 -8600
21859 -8600 -23904 -10853 -75188 -137058 -140437 -30486 -500 -2045 26511 92566 76979 -41265
21847 -41265 -118684 -166487 24856 51287 -57634 -205144 -197475 -36319 29822 -43534 -85944
21836 -85944 -51341 28103 -16603 -21886 -76749 -152873 -76170 -135167 -285306 -246155 -149325 -66577
21824 -66577 -189043 -294699 -233077 -110480 -16210 -12442 -3933 -33278 -11808 -159346 -153022
21813 -153022 -146255 -61779 133270 89813 77690 8898 -78356 -51899 -61372 -72884 -195152
21802 -195152 -145918 -161315 -136168 -92302 -237247 -224502 -239589 -320722 -147124 -34467 -46510
21791 -46510 302 124320 129510 107143 -9899 22309 10632 5901 14577 29616 -30367 -58945
21779e8945K0656N3721L7670m4122k0931J609L6300O2240J20917k1076j47385
21768D0654m5691o5339q5588q15P029k9077J64404J37939k3013p5588k2115m0236
21756c7436J6315k4580p2531n1363J05799J960j9768m929r7314M4493L4966M7277
21744e7111m4645m3829R0140K0796q1018N1209l3528j1297K3100N0185l5848j01394
21732a73240L6216J1647n1499n7411J26813P3391j093J5254K7392N1309M143M0342
21720A03264o5155m3323k2972M3873j17316L6438J3535J632R4879n303m4825o6516
21708g1789l16L8486k7658P0363o0220k5518m4672K1798R4624j7580n770n4490
21696h2742q983k5519Q6998J26661N1585P9584L9119j83718j03729n4934J5515
$$ plain form
21779 -58945 -38289 15432 53102 8980 -11951 -10342 25958 88198 209115 188039 40654
21768 40654 -5037 -70376 -155964 -156779 -149750 -178827 -14423 123516 100503 24915 2800 -37436
21756 -37436 -21121 -45701 -118232 -169595 -63796 -61836 -81604 -86533 -183847 -139354 -104388 -57111
21744 -57111 -101756 -145585 -55445 -34649 -115667 -64458 -97986 -109283 -86183 -35998 -71846 -173240
21732 -173240 -137024 -125377 -176876 -234287 -107474 -34083 -35176 -19922 7470 58779 62922 103264
21720 103264 38109 -5214 -28186 15687 -101629 -65191 -51656 -50024 44855 39552 -5273 -71789
21708 -71789 -72105 -33619 -61277 9086 -51134 -76652 -121324 -99526 -4902 -22482 -28252 -82742
21696 -82742 -91725 -117244 -30246 96415 148000 227584 266703 82985 -20744 -75678 -60163
21685f0163k2484n6771k7236P4947R3930N1887m5817l0155Q9821j3551j42539
21674h8131k5876k5341O6777j3153N604O9814k8791j46069L642J05189Q2282K640
21662H587j267m718p6594M4737N3976M6558k1507L865m4166q839J45639l1958
21650A14313p3955o551N2907K9774O5302j37028o2235P9744Q6669L6297j65839
21639A9398j74242j52790j4983N3254J69494N915N3032N6888p5708k8299l5714
21628a23755K0195l6173L3871M060L9435J5964R3722N421j65073j3444J38592
21617A2815K4658N1992R260Q768n3477o2443o0338n1426m1297M1022R1996J17138
21605H8668k1193p0858K5328P5838K1548j09773p075o6286q5304n3435o9581k2902
$$ plain form
21685 -60163 -82647 -139418 -166654 -91707 2223 54110 8293 -21862 67959 54408 -88131
21674 -88131 -114007 -139348 -72571 -85724 -80120 -10306 -39097 -185166 -181524 -76335 5947 8587
21662 8587 7320 2602 -73992 -29255 24721 71279 49772 53637 9471 632 146271 114313
21650 114313 40358 33807 86714 116488 181790 44762 -17473 62271 148940 185237 19398
21639 19398 -154844 -307634 -322617 -269363 -99869 -93954 -40922 15966 -59742 -88041 -123755
21628 -123755 -103560 -139733 -105862 -101802 -62367 -46403 47319 52740 -112333 -125777 12815
21617 12815 37473 89465 98725 107493 54016 -8427 -68765 -120191 -161488 -120466 -28470 88668
21605 88668 67475 -3383 21945 97783 119331 9558 2483 -63803 -149107 -202542 -272123 -295025
21593b95025J39265R7658J4900P5506J0652L8995J5972k04168o5397L2713N6035
21582h2894l0873o3112k4988j2795J94877J49388O6036n0623m938O8134M5550
21571B53762p0424p4851J7962o5377m4239l0707n324j6474k9558L0546P7683p3587
21559c0588L9625N4087J9811n431j2448l7979m0062n3160j22045p2544J40289
21548a20445J53637o1772m8355n7334q8503N1635J54065l6454o1547q181l3073
21537a56327R93J2257P3703j53016O3074K5812j15134m3467O7789k875n7061N0303
21525b33949P8559Q0572M0992P9762Q8877J4492j16071j03831q1068l617J25701
21514b9581L7710l7271n8003m2814o2327j7331Q319J07058J2713l4297k4816l0256
$$ plain form
21593 -295025 -155760 -58102 -43202 32304 42956 81951 97923 -106245 -171642 -138929 -82894
21582 -82894 -113767 -176879 -201867 -214662 -19785 129603 195639 145016 140078 208212 253762
21571 253762 183338 108487 126449 61072 16833 -13874 -19198 -35672 -65230 -34684 42999 -30588
21559 -30588 9037 63124 82935 77504 65056 27077 -12985 -66145 -188190 -260734 -120445
21548 -120445 33192 -28580 -76935 -134269 -222772 -171137 -17072 -53526 -115073 -123254 -156327
21537 -156327 -155334 -143077 -69374 -222390 -159316 -133504 -248638 -292105 -224316 -227191 -284252 -233949
21525 -233949 -155390 -74818 -33826 45936 134813 149305 33234 -70597 -151665 -155282 -29581
21514 -29581 8129 -29142 -87145 -129959 -192286 -209617 -201298 -94240 -81527 -115824 -140640 -170896
21502a70896J0794l8775K3497l368Q7412j3354m768L2678J5087L1830o9098m8316
21490a47277J04011J03066k1002p1637L0021Q521K8165J28855O6309j33945j83221
21479h8134M867j10926r115O3404J4202J1468N2936L1400P501M0403m6205j26657
21467a54856p0680K0187R383k1725N8225J49346J25326R613m6549J8519q3870
21456A2919m6728O460J26034k584r2444k5150j1338q0696o7747M0304J3312Q655
21444a19003J36982o362j26435k2276j1234J07748J44480L5779J641j14783o1796
21433c5259K2003J11919l0262q0155O8243m2712p4761J6281N2440j75483k50280
21422d18026j1336O1966J04015n426n1581L7680M8590l2113L591N2740K1200Q1330
$$ plain form
21502 -170896 -160102 -198877 -175380 -178748 -91336 -104690 -109458 -76780 -61693 -29863 -98961 -147277
21490 -147277 -43266 59800 38798 -32839 -2818 5703 33868 162723 229032 95087 -88134
21479 -88134 -83267 -194193 -203308 -139904 -125702 -114234 -61298 -29898 -22397 18006 -28199 -154856
21467 -154856 -225536 -205349 -195966 -217691 -159466 -10120 115206 124819 78270 96789 12919
21456 12919 -33809 -27349 98685 96101 3657 -21493 -32831 -113527 -181274 -140970 -127658 -119003
21444 -119003 17979 11617 -114818 -137094 -148328 -40580 103900 139679 141320 26537 -35259
21433 -35259 -13256 98663 68401 -11754 56489 13777 -60984 -44703 7737 -167746 -418026
21422 -418026 -429362 -367396 -263381 -268807 -320388 -282708 -234118 -266231 -262640 -209900 -188700 -107370
21410a07370Q5971M377j223n2623Q7214n7438k6566n9526p0044K6868l0084N3521
21398a46923l8504j2975n1360O2165J8232j7162j8552J06275J16559L5020J202
21387E3977o9820R051O1861O6359j3165q7886j12375j54768P3809K6305m4013
21376a90665O2325J3400p3819j16334p6981p1942K8657K8154N4058M8830O0861
21365b33456J23261Q8929m0341k0583n1053N7968J56386J9333n7202j27299j2389
21354i6446P2030o0101j5598l0072J7830J7855n1947m6758K8201L6600L1421P5312
21342b1673o2J20052J61521L8880j72039m2211j904p334j77949r0259J87391O8954
21330F3367j34694l2579j17104N5606J22001N0319Q4426l1819J5728j9848p5976
$$ plain form
21410 -107370 -21399 -17022 -18245 -70868 16346 -41092 -67658 -127184 -197228 -170360 -200444 -146923
21398 -146923 -185427 -198402 -249762 -187597 -169365 -186527 -205079 -98804 17755 52775 53977
21387 53977 -15843 -6792 55069 121428 108263 20377 -91998 -246766 -172957 -146652 -190665
21376 -190665 -128340 -114940 -188759 -305093 -382074 -454016 -425359 -397205 -343147 -294317 -233456
21365 -233456 -110195 -21266 -61607 -82190 -133243 -75275 81111 100444 43242 -84057 -96446
21354 -96446 -24416 -84517 -100115 -130187 -112357 -94502 -146449 -193207 -165006 -128406 -96985 -21673
21342 -21673 -21735 98317 259838 298718 126679 84468 82564 75230 -102719 -192978 -5587 63367
21330 63367 -71327 -103906 -221010 -165404 -43403 6916 91342 59523 75251 55403 -20573
21319b0573m5856j2647M1100M2970N346J18788l0412r7493q631Q9155j28096k3515
21307f9864R4883R3659n9591p2670m6108j46791P5349J13156j29776p6716k9309
21296b53778R5107O1522K0639N1440M101N4559j9935J7284o4703L1004l0024m3228
21284g6012o4873j9128P4433P1324n4388J225J5289k9801j31889j0366O8640J7151
21272a38395K1429k023L6929N7134p17j33889p1574J52329Q4629j04860j6406
21261a15414J46246M649k2176O9609O8226J0487j2209p9843j08476m4551k636
21250h6088Q2759j2201j55534n3996L1190K590N5331o2075Q411j4069m913p8134
21238b86729K7451L0333L8038j5579p1631m289O9068n653j4346L1046J69295Q2019
$$ plain form
21319 -20573 -66429 -79076 -37976 4994 10340 129128 98716 1223 -7408 81747 -46349 -69864
21307 -69864 25019 118678 59087 -13583 -59691 -206482 -131133 -17977 -147753 -224469 -253778
21296 -253778 -158671 -97149 -76510 -25070 -20969 33590 13655 30939 -33764 -2760 -32784 -76012
21284 -76012 -140885 -160013 -85580 -14256 -68644 -67419 -52130 -81931 -213820 -224186 -155546 -138395
21272 -138395 -116966 -118989 -82060 -24926 -25643 -159532 -231106 -78777 5852 -99008 -115414
21261 -115414 30832 35481 13305 82914 151140 161627 149418 69575 -38901 -83452 -86088
21250 -86088 -3329 -15530 -171064 -225060 -193870 -191280 -135949 -198024 -189613 -203682 -208595 -286729
21238 -286729 -259278 -228945 -190907 -206486 -278117 -282406 -213338 -218991 -233337 -202291 -32996 49023
21226D9023m2774n6882j29415k368l6902n5025j1125J20840P691N9182K83J8172
21214g9300L6750R5185k6602K7673Q1801l214o6232j5582j93862m6798Q9472M6962
21202e3747j5021L81R5654o964j30077N3326O4118l5783l2431m0364N6266r1860
21190a36502j05416K4532M2070N9440Q9838n2622P098K6016J04177j5420k15487
21179a72276j7323N3629Q0767O9762J3416r483j22741j15117p1381J30882K8920
21168a30945k406n6823J9513J19827J16309o0962j40368M9639R3347J80971R1706
21157B79808j01780j7232m3633o4326j49097k8901P0251O2489K8627L3854j41233
21146g1173K3944P2946K3355r4518r647N6908o1230L0205k1053L3811J8889l9937
$$ plain form
21226 49023 6249 -50633 -180048 -182416 -219318 -274343 -285468 -164628 -156937 -97755 -97472 -79300
21214 -79300 -42550 52635 26033 53706 135507 132293 66061 50479 -143383 -190181 -100709 -53747
21202 -53747 -68768 -68387 27267 20303 -109774 -56448 7670 -28113 -60544 -100908 -44642 -136502
21190 -136502 -241918 -217386 -175316 -115876 -26038 -78660 -71562 -45546 58631 43211 -172276
21179 -172276 -189599 -135970 -55203 14559 27975 18492 -104249 -219366 -290747 -159865 -130945
21168 -130945 -133351 -190174 -170661 -50834 65475 4513 -135855 -86216 7131 188102 279808
21157 279808 178028 160796 117163 52837 -96260 -125161 -54910 7579 36206 70060 -71173
21146 -71173 -47229 25717 49072 -45446 -55093 1815 -59415 -29210 -50263 -16452 2437 -37500
21134c7500j15892P9570l6672P058q0552k6520J24139Q3582k7629l409l689P0713
21122C3199k3052j07268q5456K8124N6438j21334n2300R8955L1387m0762O1763
21111a20306O5731N2047j0030j63686N5281P7278K5729m2860n6321L4475R6884
21100A4222q3837q1337j4492r210K7984k2677M0052O6579J1729q0838j12101m1498
21088b85424J30244Q2335J52045J5305j25265L2347j33506l9785J43205J03888
21078G5389j279L6623j8665k1262l8747k8513K8738K7856R2323q2265r5504j6317
21066d1623M4450Q012o4079N9697N0850j9588J3890n8796J5354Q5738l5565q3208
21054b4868L1168J1206n9580P4561J36233k6339L8724J6361j47392j9150j12000
$$ plain form
21134 -37500 -153392 -73822 -110494 -103436 -183988 -210508 -86369 -2787 -30416 -33825 -37514 33199
21122 33199 10147 -97121 -182577 -154453 -98015 -219349 -271649 -172694 -141307 -182069 -120306
21111 -120306 -54575 -2528 -12558 -176244 -120963 -43685 -17956 -60816 -117137 -82662 14222
21100 14222 -69615 -150952 -165444 -174654 -146670 -169347 -129295 -62716 -50987 -131825 -243926 -285424
21088 -285424 -155180 -72845 79200 94505 -30760 1587 -131919 -171704 -28499 75389
21078 75389 74110 110733 92068 70806 32059 3546 32284 60140 152463 70198 -25306 -41623
21066 -41623 2827 10839 -53240 6457 57307 37719 51609 -7187 8167 93905 58340 -24868
21054 -24868 6300 17506 -42074 32487 168720 142381 181105 197466 50074 30924 -81076
21043h1076l5467J84089k5339j54341J9733K7613l305o525J38314K1652m8189
21032C7159J1349l6801j55749m6640O2867M9171k4517n1378r776L3885N9028N3923
21020a7479k9356j15020k0855M0031j5508P5060J47551L0774j36468j3383j9688
21009g4341N7703N662j5634J05876J6084J16059p2262m6515L7865j2212r8666
20998A9619j03780J1080J07344J36372J2846j00826j51363r256M0892r6086o9153
20987b02311J24597J40834R8791j90869j37025J73684M0106q0116q6044M3092
20977g5261Q1228q2674m3615m7614j1238M7137P7218p063q681O2184N6416K9055
20965G7092L0191j57762J1958m6795J2131O1294n1354j1327K2631N138j3580k2222
$$ plain form
21043 -81076 -116543 67546 42207 -112134 -92401 -64788 -68093 -74618 63696 85348 37159
21032 37159 48508 11707 -144042 -190682 -127815 -78644 -103161 -154539 -164315 -130430 -71402 -17479
21020 -17479 -46835 -161855 -182710 -142679 -158187 -83127 64424 95198 -41270 -54653 -74341
21009 -74341 -16638 -10976 -26610 79266 95350 211409 139147 92632 130497 118285 19619
20998 19619 -84161 -73081 34263 170635 183481 82655 -68708 -77964 -37072 -133158 -202311
20987 -202311 -77714 63120 161911 -28958 -165983 7701 47807 -32309 -118353 -75261
20977 -75261 5967 -76707 -120322 -167936 -179174 -132037 -54819 -61882 -70563 -8379 48037 77092
20965 77092 107283 -50479 -38521 -85316 -73185 -11891 -63245 -74572 -51941 -46803 -60383 -82605
20953h2605J08207P1902q2608j74025j36117J2658J09740L7267L2578N482m9713
20942a47234P3183K1594n698l2807k737K8365N3159L3750k4904J8803L8212P3936
20930A27622K597m9277M2440J3720l41j20189r0994j50370n2592K6440N1545K0295
20918a79104m1621j1166J26918N2079j10294k8209J19478O8210R2183j7463j82278
20907a11267L5011J11605R5438o098j41997q3917k2829J15797P4435O223q8463
20896a6062Q842j627q6562K0581j7997l1458K9193P4246n2922m9169P7243M6781
20884A089r7127j4700L387L5607Q5465L2272M0005P9282j10224r0823N1069J7040
20872C2342N0358o0696n9893k9611m1738J7306O6958J01580O0343o1622q4606
$$ plain form
20953 -82605 25602 97504 14896 -159129 -295246 -282588 -172848 -135581 -103003 -97521 -147234
20942 -147234 -74051 -52457 -58155 -90962 -93699 -65334 -12175 21575 -3329 15474 53686 127622
20930 127622 130219 80942 123382 137102 136761 16572 -74422 -224792 -277384 -250944 -199399 -179104
20918 -179104 -220725 -231891 -104973 -52894 -163188 -191397 -71919 -3709 88474 71011 -111267
20907 -111267 -76256 35349 130787 124689 -17308 -101225 -124054 -8257 66178 72401 -16062
20896 -16062 -7220 -8847 -95409 -74828 -92825 -124283 -95090 -20844 -73766 -122935 -45692 1089
20884 1089 -96038 -110738 -107351 -71744 13721 45993 85998 165280 55056 -35767 15302 32342
20872 32342 82700 22004 -37889 -67500 -109238 -91932 -24974 76606 136949 75327 -9279
20861i279N4644P3790M1166r860n2090j22974O6656P7444J4530k1365q6760p6073
20849e0171P6470O270o4378m4920J00243J29923O6528j29388j39807l3302n4453
20838a36985J16226n5833L3305P9554k0262p3418M5814N8733J43046o9380r4505
20827B6295L5119L6104N2806o6886M5276j0679q3660k5149q0021M789N0741N9889
20815D4624n3365L760L1107O7825m4556j08431M7190P8385j08615K8171O3042
20804D9137l6746j6512Q5071o9482q3671J8593k8982l3506J36090J0845l1416
20793e79K9138k039j26586p3844J23469J84219N0326p3295j32875o0599p0449
20782a53114K9018j328J8535J74899L1952j52020M153M1982l1277j09105l1847
$$ plain form
20861 -9279 45365 119155 160321 150461 98371 -24603 42053 119497 134027 112662 25902 -50171
20849 -50171 26299 32569 -31809 -76729 23514 153437 219965 90577 -49230 -82532 -136985
20838 -136985 -20759 -76592 -43287 36267 16005 -57413 -11599 47134 190180 120800 26295
20827 26295 61414 97518 150324 83438 128714 118035 34375 9226 -70795 -66006 -15265 44624
20815 44624 -8741 -4981 26126 93951 49395 -59036 -11846 66539 -42076 -13905 49137
20804 49137 12391 -4121 80950 11468 -72203 -53610 -82592 -116098 19992 30837 -579
20793 -579 28559 26520 -100066 -173910 -50441 133778 184104 110809 -22066 -82665 -153114
20782 -153114 -124096 -125424 -106889 68010 99962 -52058 -47905 -5923 -37200 -146305 -178152
20771a78152R9K6202K4837J78325J32247L3490k7450j23588p5720M832P9330j35516
20759f1064n7432J04076N3901K8792q304o7821m1837J3986N307k3181K2075p1205
20747a02707l5010k9434o5116L5345K08033Q7743K6609o7359r0701O4296m5028
20736a3329j00791J592K4394J39772N2807j57153n7561j13634p2069O5111O8448
20725a62413k1783O0029l4109n8288Q9921k314K3881N8543q8188j09227J34169
20714a09779J36253j3227J36228P0942j45237r8290M8427Q2692J3920k62952n2608
20703a93631J27085L0923l6388j2560J31136n9115l3460p3266J3675q7526P5533
20692a17594J91696R2476Q2257j54478m250M8914n9748N2002L3778j7167l0454
$$ plain form
20771 -178152 -178053 -151851 -127014 51311 183558 217048 189598 66010 -9710 -4878 74452 -61064
20759 -61064 -118496 -14420 39481 68273 59969 -7852 -49689 -35703 -30396 -53577 -31502 -102707
20747 -102707 -137717 -167151 -232267 -196922 11111 98854 125463 58104 -32597 31699 -13329
20736 -13329 -114120 -112528 -88134 51638 104445 -52708 -110269 -223903 -295972 -230861 -162413
20725 -162413 -184196 -124167 -158276 -216564 -126643 -128957 -105076 -46533 -134721 -243948 -109779
20714 -109779 26474 13247 149475 220417 75180 -23110 25317 108009 121929 -141023 -193631
20703 -193631 -66546 -35623 -72011 -84571 46565 -12550 -46010 -119276 -105601 -193127 -117594
20692 -117594 74102 166578 248835 94357 90107 139021 79273 131275 165053 147886 117432
20681A17432o099p8311r4507K9673L0675p671r1453j6938J14417Q9595j1796J9624
20669I4641n478k6669J38316L250l5625l0180j03559n0161m0988K5810k0941J27237
20657G5653l9426j33667k3392j09804L1922q811P7858J01531P259Q465o8529R3821
20645A2880k7689r4377L6885M6408M0084P7220o420j69974o7221j2425R0120Q7491
20633A2982L0231m9104O9632M1727J7291m8439j55615n1509O0124J29533K1657
20622G8510L4916o5622m6354R2735P9977r7770n5893j9635M0878o22M2840k979
20610H0981K4109j42379l4084Q7408L6293r0482n1047R9978m0126K1332k4701
20599c2718K1451L743Q806K2825o3920J2475J44698J08199k8895j06273j09137
$$ plain form
20681 117432 111333 33022 -61485 -31812 -1137 -8808 -100261 -117199 -2782 86813 75017 94641
20669 94641 89163 62494 200810 204060 168435 138255 34696 -15465 -56453 -30643 -51584 75653
20657 75653 36227 -97440 -120832 -230636 -198714 -207525 -129667 -28136 -20877 -12412 -80941 12880
20645 12880 -14809 -109186 -72301 -25893 14191 91411 84991 -84983 -152204 -164629 -74509 12982
20633 12982 43213 -5891 63741 105468 122759 74320 -81295 -132804 -72680 56853 78510
20622 78510 113426 47804 1450 94185 174162 76392 20499 864 41742 41120 83960 80981
20610 80981 105090 -37289 -71373 16035 52328 -38154 -89201 10777 -29349 -8017 -32718
20599 -32718 -11267 -7524 1282 24107 -39813 -27338 117360 225559 196664 90391 -18746
20588a8746j7825k7156L221J13354J00113p7224j18008J53948k9334l4016Q1028
20577A29355l792O2182q5712q7461J37534L5487o9744n2811k6631m7419j9229
20566b8241J20697n1020j08445j9937m9730J2273j0075K1195K01904L8133m249
20555A22505L2176j19514O7327j15458j24028p4649L2196K0366O8135j8823J33891
20544B4124R2989r9329N9063n7509j2548R7650Q219n6581j4511j8042k1291q0979
20532g8745J5314P687p35o2525P5736N6398O4773k5473j74183o2590m0346L982
20520b20707J29382J08441j05486m7227p1197p5557P521Q2954O2415R9263J32593
20509A02395m8238j60277l8020J1017J37305R1248p863j54161p6740O8551j05781
$$ plain form
20588 -18746 -36571 -63727 -60506 52848 152961 75737 -42271 111677 82343 48327 129355
20577 129355 125563 187745 102033 14572 152106 187593 117849 65038 38407 -9012 -28241
20566 -28241 92456 41436 -67009 -86946 -136676 -124403 -134478 -113283 88621 126754 122505
20555 122505 154681 35167 102494 -12964 -136992 -211641 -179445 -159079 -90944 -109767 24124
20544 24124 117113 17784 76847 19338 6790 104440 112659 56078 41567 23525 2234 -78745
20532 -78745 -63431 -55744 -56479 -119004 -43268 13130 77903 52430 -121753 -184343 -224689 -220707
20520 -220707 -91325 17116 -88370 -135597 -206794 -282351 -274830 -191876 -129461 -30198 102395
20509 102395 54157 -106120 -144140 -133123 4182 95430 87567 -66594 -143334 -74783 -180564
20498a80564p9773O2475J13302O9000Q5449P8511p384l0892p2485q8467N0831
20487Cn7722n4333R859J94128K5124J936n0840n4751O4088P1735N4072P9042L1755
20474C14096m4139j86006r7158k9648k9757n4345j1700J18208O8595m9080L0845
20463B9911J54919O6288q935o2967l2375n7736p8203j29490N5429M5278M1802
20452B3921P1391K2386J13744k5616p4621l6892r5803k209J32115Q0543k4846
20441A84113l8780K0426O2623K9817M0047J8045k0708M2394J14414J38461J29021
20430G19873j9211q8046P9822O0452n3074J2193M1130j2N1967Q0442L7831j2748
20418I10619J22192J04031Q8928k6086p5213l2964k220j17595j15232k0414m1291
$$ plain form
20498 -180564 -260337 -197862 -84560 -15560 69889 148400 141016 110124 37639 -50828 3
20487 3 -57719 -112052 -102193 91935 117059 118995 68155 13404 77492 149227 203299 282341 314096
20474 314096 269957 83951 -13207 -42855 -72612 -126957 -138657 -20449 48146 -934 29911
20463 29911 184830 251118 242183 179216 146841 89105 10902 -118588 -63159 -17881 23921
20452 23921 95312 117698 231442 205826 131205 94313 -1490 -3699 128416 208959 184113
20441 184113 145333 165759 228382 258199 298246 316291 295583 337977 452391 590852 719873
20430 719873 700662 612616 692438 752890 699816 712009 753139 753127 805094 885536 923367 910619
20418 910619 1032811 1136842 1225770 1199684 1124471 1091507 1089287 971692 856460 836046 794755
20407G94755j16923O3792J9752q4455j94283j16242J0985l0867k17585q6776n0949
20396h796Q319M6385M334P731k1965k6108O5956M2791P7653m2228m8284l268Q2280
20383A84800O2766r0671j50048j7123P631O1569K9724J1166n6480k7510j20485
20372a04661j81J29907J08399K0402K4522P4449k6999j70029l9768L0367j6388
20361C0020M5114L6083m284k370p3046o5071p193O4371N9297J7406L0934K2788
20349A54049N7316j9061J3711m8533j31624M3919o7854k6682q4197l8843J11537
20338c6262N5831r573M4566J10743L5544J8307K1669r2023j5328n8262k0120L4731
20326H9823J40906m3035m6362k2662j6393J18970R7261r5653j25034L4459J35494
$$ plain form
20407 794755 677832 741624 761376 676921 482638 366396 377381 346514 128929 42153 -8796
20396 -8796 -477 45908 50242 57973 36008 9900 75856 118647 196300 154072 105788 102520 184800
20383 184800 247566 156895 6847 -10276 -2645 58924 88648 99814 43334 15824 -104661
20372 -104661 -104842 25065 133464 153866 178388 252837 225838 55809 16041 46408 30020
20361 30020 75134 111217 106933 104563 31517 -33554 -40747 23624 82921 100327 131261 154049
20349 154049 211365 192304 206015 157482 25858 69777 1923 -24759 -108956 -147799 -36262
20338 -36262 19569 9996 54562 165305 200849 219156 240825 148802 133474 75212 55092 89823
20326 89823 230729 187694 141332 118670 102277 221247 318508 222855 97821 132280 267774
20315B67774j7594q4379K9449K3294j4245j22922j25908o6995O2653J07504J11065
20304A69696Q8227l3850j16861j69759O1221J06233j6158j696K3267o8968o3390
20293b2038J04324R2126L7491o5240J3250K5459k1893k7800n4246k8531j1654
20282D1248J2309p2879q4215J49823j9025j5198N1423J4121L087P376o1309k332
20270B4429K8515r946O2283N9010j1957o5697L6193K1476J24766r5259j46491
20259B7322N819j6477P1362Q7278r4046j75693o0499J56413R6093P3970N3920
20248B25462k7592q9345M6528J2533p4262p7800o5197N8996K640l3642O1227j5510
20236B4038J9799p833l1434J3503M1823L6411J4247P2008L5580r4870o8672L5862
$$ plain form
20315 267774 250180 165801 195250 218544 204299 81377 -44531 -111526 -48873 58631 169696
20304 169696 257923 224073 107212 -62547 -1326 104907 88749 87053 110320 41352 -22038
20293 -22038 82286 174412 211903 146663 159913 185372 163479 135679 81433 52902 41248
20282 41248 53557 -19322 -103537 46286 27261 12063 63486 77607 80694 88070 26761 24429
20270 24429 52944 42998 105281 164291 152334 86637 122830 144306 269072 173813 27322
20259 27322 33141 16664 88026 175304 81258 -94435 -154934 1479 97572 171542 225462
20248 225462 197870 108525 155053 167586 93324 15524 -49673 9323 11963 -21679 39548 24038
20236 24038 43837 36004 4570 18073 59896 96307 110554 182562 218142 123272 54600 90462
20224I0462N7396l154N510P1459Q1817p7798p3635K7102J6404J2603j8625J3703
20212B03244J13062l3510j06877q3327P7412N5284O1670J0367l6661q5578J6240
20201A91326K5082N9999q2844Q4504O2803j5072l1270j01781j47419o0795j6768
20190c2235k7560o7333m8020P4130J92343J02028M6308L9685M3546n0990m995
20179B66907n2208o3596O7995j5452K9759m062N8034N5153Q7588K3516o8363j7789
20167C67482j16380K7590j3079L8818J29410k0400J0591K9127j7357o1622o1251
20156C12929O966n2950o8059j9669J56807L0626O1122m9901p8464l1227o3218
20145B04962k6533l0977j1629N8759p0619j020J27054j8277l9250Q2732J09025
$$ plain form
20224 90462 147858 144704 150214 221673 303490 225692 152057 179159 195563 208166 189541 203244
20212 203244 316306 282796 175919 92592 170004 225288 286958 297325 260664 175086 191326
20201 191326 216408 276407 193563 278067 340870 325798 294528 192747 45328 -15467 -32235
20190 -32235 -59795 -127128 -175148 -101018 91325 193353 239661 279346 322892 271902 266907
20179 266907 214699 151103 219098 203646 233405 229343 287377 342530 430118 453634 385271 367482
20167 367482 251102 278692 265613 304431 433841 413441 424032 453159 435802 374180 312929
20156 312929 319895 266945 198886 179217 336024 366650 427772 377871 299407 268180 204962
20145 204962 178429 147452 135823 194582 123963 122943 249997 231720 192470 275202 384227
20134C84227M830O9360j7020l9512j65572L5351M7619j15324j385J7272r5593
20123A24253M8453K2804L8025n4531K3070l7044j4917Q6564N2680j7617p2568
20112A99172K3345k9666k1150J05659r503m6684o405J04974n9054p9065J8378
20101B00001Q6764j8534k9367M2773m0946j21411j3997n6239P17O4341J05271
20090B19373J30371j7771m8283N8594m1172O6384k7100l5145P6814r0130l0978
20079B60957j0310q2360m4122o355N4430J04856j9941o6637L4721n6140p5889
20068I3210N0977J35946J31637R4289K9080p3514j94672L3164N6489L3411M6429
20057D36446Q4410K8986O7155l5656l5136J13692P1302n0517q2184r305k2665
$$ plain form
20134 384227 389057 458417 441397 401885 236313 271664 319283 203959 202574 219846 124253
20123 124253 172706 195510 233535 179004 202074 165030 150113 236677 289357 271740 199172
20112 199172 222517 192851 171701 277360 267857 221173 214768 319742 260688 181623 200001
20101 200001 286765 268231 238864 281637 240691 119280 105283 49044 49761 114102 219373
20090 219373 349744 331973 283690 342284 301112 367496 340396 305251 382065 291935 260957
20079 260957 250647 168287 124165 117810 172240 277096 257155 190518 225239 169099 93210
20068 93210 144187 280133 411770 506059 535139 461625 266953 300117 356606 390017 436446
20057 436446 520856 549842 616997 581341 546205 659897 731199 680682 598498 589193 566528
20046E66528j31595r3731J34336J0329k716L5572P9023q3312k2724J5181O1271
20035E68162o629n8665P539J12606K8379J9462l4268j6817J46342L3661J03301
20024I03073n1922j03753q9166j38486K9543M342o3445J31509J8019r3150J13726
20013F60290J31085J50257j1466q7202J03843P4511o2407K4431o8002m9165j01616
20002G64559n7114p1981J67384K25632J12374q9017n6596J28575O7133M9322j1271
19991A229000j63180L1336L5871K2091P425j0629m7518P4325l437O646Q5150M9072
19979A316152O3249m9272J1609O2984j02434Q9623Q1032M9278O2117L7937L6943
19968A659218J14656J96384L0020J22433P9703J04334Q58j28536N7893J07394
$$ plain form
20046 566528 434933 341202 475538 485867 483151 518723 597746 514434 491710 506891 568162
20035 568162 561533 502868 510407 623013 651392 670854 636586 619769 766111 799772 903073
20024 903073 851151 747398 658232 519746 549289 553631 490186 621695 639714 546564 660290
20013 660290 791375 941632 930166 842964 946807 1021318 958911 983342 915340 866175 764559
20002 764559 707445 635464 802848 1028480 1140854 1051837 995241 1123816 1190949 1240271 1229000
19991 1229000 1065820 1097156 1133027 1155118 1162543 1151914 1104396 1178721 1175284 1181930 1267080 1316152
19979 1316152 1379401 1330129 1341738 1404722 1302288 1391911 1472943 1522221 1584338 1622275 1659218
19968 1659218 1773874 1970258 2000278 2122711 2202414 2306748 2307606 2179070 2236963 2344357
19958B344357l086M2309Q3889J17723O6566J73138Q7432N1376K54699K39091K31891
19947C689385J15622K01327J55874K91973L04703L79897L20665L55317M50692
19938F265455M05085N58124O61202O60194P79867J043381J031427J310591J377388
19929A4092714J440084J936867K498643L204267M478813O478647R202910J2734904
19921E6067849J6239639J8097296J7504375J5088893J0434299L935349j508310
19914A35859390m656629n362046k35512J0846348K2134173K8653972K7840857
19907B15080553K1528260J0791805l042004j4820271k2530887k7878794k6573826
19900A52554836j6838869m457882M835866P547563N300596J80257p493050j3288350
$$ plain form
19958 2344357 2341271 2383580 2467469 2585192 2651758 2824896 2912328 2963704 3218403 3457494 3689385
19947 3689385 3805007 4006334 4162208 4454181 4758884 5138781 5459446 5814763 6265455
19938 6265455 6670540 7228664 7889866 8550060 9329927 10373308 11404735 12715326 14092714
19929 14092714 15532798 17469665 19968308 23172575 27651388 34130035 43332945 56067849
19921 56067849 72307488 90404784 107909159 122998052 133432351 137367700 135859390
19914 135859390 131202761 125840715 125605203 136451551 158585724 187239696 215080553
19907 215080553 236608813 247400618 244358614 229538343 207007456 179128662 152554836
19900 152554836 135715967 131258085 136093951 143641514 148942110 149122367 141629317 128340967
19892A28340967j6003547j8200597j9159409j6412021j2019521q274271n737779
19885C2533822m079277l038897k384194j909080j579309j584130j432440j246962
19877A5279533j046517r61685q17118p81439o41180n54814n76713m44409m65190
19868H990468m99010n19195l62209k15171l45897l07406k70094k29679k29412
19859F012395k53103j94430j54067k13124j83201q4396j52471j75172j25794n2610
19849D424027j46210o1478K1233q2493j55105j76097p8438q0458r8619j46048
19839C420314o7668q0569j71566k02611n4654o8043P1227o6857r0390j35616q3046
19828B470521m4434k07627j00635j01537j83621o0413j11244m9993R1925J365
$$ plain form
19892 128340967 112337420 94136823 74977414 58565393 46545872 38271601 32533822
19885 32533822 28454545 25415648 23031454 21122374 19543065 17958935 16526495 15279533
19877 15279533 14233016 13271331 12454213 11672774 11031594 10476780 9900067 9455658 8990468
19868 8990468 8491458 7972263 7610054 7394883 7048986 6741580 6471486 6241807 6012395
19859 6012395 5759292 5564862 5410795 5197671 5014470 4930074 4777603 4602431 4476637 4424027
19849 4424027 4277817 4216339 4237572 4155079 3999974 3823877 3745439 3664981 3566362 3420314
19839 3420314 3352646 3272077 3100511 2897900 2843246 2775203 2846430 2779573 2689183 2553567 2470521
19828 2470521 2426087 2218460 2117825 2016288 1832667 1772254 1661010 1611017 1702942 1704307
19818A704307j3679j2453O851r0888j06545j34248j1371N1010n2228n669j83510
19807A151577j03665k855l7056p6271j4462J15611J15397m0794q4599k4197L2905
19796A031591J9236m159p2464n1541N4333K0704N7185q1633p5057m7616L7317
19785H87896M3485n0780J2320k8451q1149O9280P8152j6944j30098k0134M7762
19774H11339K3888n4591J626k8370Q301k100o2477j30919N8987J31782j6736K9264
19762G69994j17850j29301J13133N3147j41150j4835r5053k5329M3459l3934J14044
19751E36325r165j34347j1027n2287q8363j0250j0850k5793Q5631O8425M7120
19740C95419r6643P1800L474p0067p3546M6484N4902l3448k2616Q2318Q194j62109
$$ plain form
19818 1704307 1690628 1678175 1685026 1594138 1487593 1353345 1341974 1392984 1340756 1335087 1151577
19807 1151577 1047912 1045057 1008001 931730 917268 1032879 1148276 1107482 1022883 998686 1031591
19796 1031591 1050827 1046668 974204 922663 976996 997700 1054885 973252 898195 850579 887896
19785 887896 931381 880601 892921 864470 783321 852601 930753 913809 783711 763577 811339
19774 811339 835227 780636 782262 753892 762193 760093 697616 566697 625684 757466 740730 769994
19762 769994 652144 522843 635976 689123 547973 533138 438085 412756 456215 422281 536325
19751 536325 527160 392813 381786 329499 241136 230886 220036 194243 279874 348299 395419
19740 395419 298776 370576 374050 303983 230437 276921 331823 298375 275759 358077 366271 204162
19728B04162p5891M9589J48808n5193m3928J9110l0584J9583P2961p6814m0798
19717A91005n7997J3327q423N0660O8702J06313k2479j14658r9135O8119k4313
19706A71121p5876K6964J24619k087o3934l5963L221l2442j2717P628J25891O6407
19694C02832M9122M2440p7071r4465j07598L9611n70p2339j0145O8377L7775M3654
19682B21623l510m5459L7865J40141k5418r8974J7845J71278K0676r6297o1783
19671B77987N04J50904L4335J3907k2298p5686m1066M073J6695k9853J51295J23533
19659F04330O2846j11513q1489j2897K8409o494N5391K6238k0633L382K5902j3207
19647E60265o9433o1617r650k1111M9948n1778J66519J97290P6290n1054j1252
$$ plain form
19728 204162 128271 177860 326668 271475 227547 246657 216073 235656 308617 231803 191005
19717 191005 133008 146335 137912 188572 257274 363587 341108 226450 127315 195434 171121
19706 171121 95245 122209 246828 244741 180807 144844 148065 115623 102906 110534 236425 302832
19694 302832 351954 394394 317323 222858 115260 154871 154301 81962 71817 140194 177969 221623
19682 221623 218113 172654 210519 350660 325242 226268 244113 415391 436067 339770 277987
19671 277987 278491 429395 463730 477637 455339 379653 338587 342660 359355 329502 480797 604330
19659 604330 667176 555663 474174 461277 489686 483192 538583 564821 544188 547570 573472 560265
19647 560265 490832 429215 419565 398454 448402 396624 563143 760433 836723 785669 774417
19636G74417n279n8560Q1809Q5283k5333j16229k0656l9012J30934P4278k22126
19625F59526p1507P2258J1897K4676k3435k3088M390M4537N9704j24765j46336
19614D87857j55746m6800n2226L8112r7590R0064K04336R3044m901n0418j10030
19603C95702J29917j6233q3897P3739O8966R803R6333P9502k3310r6942J4038
19592F47618Q7294P5340J145J3995J07248L1762J08459P0364m9339J2608J13409
19581A219903O8751K1202j27310L583k023q2697j55155n6800P260j9823n5889
19570H21002L6085J6097k3216j57405o1845j2187m4653j23335n1229j5761O8050
19559D51603J23691J02887l7218j23161l9016J30173n374n7383L0000M2083K2949
$$ plain form
19636 774417 769138 710578 792387 877670 852337 736108 715452 676440 807374 881652 659526
19625 659526 588019 660277 672174 696850 673415 650327 654717 699254 758958 634193 487857
19614 487857 332111 285311 233085 271197 173607 263671 468007 561051 556150 505732 395702
19603 395702 525619 509386 425489 499228 568194 577997 674330 753832 730522 633580 647618
19592 647618 734912 810252 811397 825392 932640 964402 1072861 1143225 1093886 1106494 1219903
19581 1219903 1288654 1309856 1182546 1186129 1184106 1101409 946254 889454 896714 876891 821002
19570 821002 857087 873184 849968 692563 630718 618531 573878 450543 399314 383553 451603
19559 451603 575294 678181 640963 517802 478786 608959 603585 546202 576202 618285 641234
19548F41234m0815j2292k5493J1262N2947J01840R7932N7871l0404j36153j3450
19537G04479J11949O2311o2101r3066J06805N7256L1357n3511J14601J62967J51124
19526A294171N6074J04202P2506K2832o0323j25025k6966o6718j10954P0800L0385
19515A260984L4773N2760Q7725R7562Q112j24384M0337L68J9767k4605j57729
19504A295670j41557k5919j16201j06048r482n6364k0898M1078N8464J28813l8844
19493A008712r2490m4055o1332q1794l8503o875k6442m0076J7743J3488P7998
19482G26374j6667q7251J09760N2956M3265J279r603j03723M7100J39955k1195
19471H82250o303Q6948M6562j2929j0669m1660q0305j26720Q9832K53120l955
$$ plain form
19548 641234 600419 588127 562634 573896 626843 728683 826615 884486 854082 717929 704479
19537 704479 816428 878739 816638 723572 830377 887633 918990 865479 980080 1143047 1294171
19526 1294171 1350245 1454447 1526953 1549785 1489462 1364437 1337471 1270753 1159799 1230599 1260984
19515 1260984 1295757 1348517 1436242 1533804 1541916 1417532 1457869 1458237 1478004 1453399 1295670
19504 1295670 1154113 1128194 1011993 905945 896463 840099 819201 860279 918743 1047556 1008712
19493 1008712 916222 872167 810835 729041 690538 683663 657221 617145 634888 648376 726374
19482 726374 709707 622456 732216 785172 828437 829716 820113 716390 763490 903445 882250
19471 882250 875947 962895 1009457 996528 985859 944199 863894 737174 827006 1080126 1076171
19460A076171q8459O966N5155J46503O9168L689J08976J77580q0799J1137R6679
19449A582766J29528K6982N9639J04964M5179r6260M1618m8748N1291O4939R5965
19438B057863j1847k2391p6215j3743O0197J34877M9368m201k5000P2818J47474
19427B369200R7353J46028K81095L03151J92538K95827K10855J65723J41666K79595
19417D483031K67106L16206L25384L38512L55466M72363N33551O54306P87194
19408H533119R05280Q65412J120221J542773J974468K672642L726019N029371
19400B6369305O918464R600900J1834415J1690426Q471492L492454j171407l231046
19392G3975003n40998N357659J0298092J1762821R158732M763301p05142m910990
$$ plain form
19460 1076171 987712 994678 1049833 1196336 1265504 1269193 1378169 1555749 1474950 1486087 1582766
19449 1582766 1712294 1739276 1798915 1903879 1949058 1852798 1894416 1845668 1896959 1961898 2057863
19438 2057863 2046016 2023625 1947410 1933667 1993864 2128741 2178109 2173908 2148908 2221726 2369200
19427 2369200 2466553 2612581 2893676 3196827 3389365 3685192 3896047 4061770 4203436 4483031
19417 4483031 4750137 5066343 5391727 5730239 6085705 6558068 7091619 7745925 8533119
19408 8533119 9438399 10303811 11424032 12966805 14941273 17613915 21339934 26369305
19400 26369305 33287769 42888669 54723084 66413510 74885002 78377456 77206049 73975003
19392 73975003 73434005 78791664 89089756 100852577 110011309 114774610 114069468 109158478
19384A09158478o503881p715816r029644q017190l462256J736099M730744L206644
19376H4103178j706685p640160j2514383j3167007j0230633p094224m750178l275596
19368B3724312k114941j387007j016977p57111m96379l00678k91767j89787M0096
19359A7209761M28585M74153P26323J201794J745001K498724L641160N217179
19351C3142680P716954J0811475J3431028J3842597J0147991M435768j722197
19344I1806296m822829j825924M388895R587574J1121244R212400O019505K114880
19336A27602041j947162n392758q514597j1465797j1101849n542196Q34498M214270
19328H8686450K715202k403722q468867j3727781j4454613j1500787q208108n707613
$$ plain form
19384 109158478 102654597 94938781 85909137 77891947 74429691 76165790 80896534 84103178
19376 84103178 82396493 74756333 62241950 49074943 38844310 31750086 26999908 23724312
19368 23724312 21609371 20222364 19205387 18448276 17951897 17651219 17359452 17169665 17209761
19359 17209761 17638346 18112499 18838822 20040616 21785617 24284341 27925501 33142680
19351 33142680 40859634 51671109 65102137 78944734 89092725 93528493 91806296
19344 91806296 86983467 85157543 89546438 99134012 110255256 119467656 125487161 127602041
19336 127602041 125654879 120262121 111747524 100281727 89179878 83637682 84472180 88686450
19328 88686450 91401652 88997930 80529063 66801282 52346669 40845882 32637774 26930161
19320B6930161l922856k878092k173904j622016j215062j028325r13447p98324
19312A2378135o57624m40531m24800l76013l11919m16752l19736m24727n68947
19303H437086m20869k89816l9209N0655K08861J05630n6197k04239l00681m75203
19293G016018m14623m71485m79177k31210j73754m679K627L3751o6631j55080
19283E055757k20970l38546m16157m36613l15920j15511j39053o2459m4799j09253
19273B856476k9157j21376j22025q8371l9689J8508m4782r261L6594j15699j63722
19262B177496r2988L337K7970M2824k3359p6790K6236K6226J18291k2688j42645
19251B063910j18766j29024r4768q7283J8328L6406M3940j2340l100p5236m9082
$$ plain form
19320 26930161 23007305 20129213 17955309 16333293 15118231 14089906 13176459 12378135
19312 12378135 11720511 11279980 10855180 10479167 10167248 9750496 9430760 9006033 8437086
19303 8437086 8016217 7726401 7687192 7737847 7946708 8052338 7996141 7791902 7491221 7016018
19293 7016018 6601395 6129910 5650733 5419523 5245769 5241090 5243717 5277468 5210837 5055757
19283 5055757 4834787 4496241 4080084 3643471 3327551 3212040 3072987 3010528 2965729 2856476
19273 2856476 2827319 2705943 2583918 2495547 2455858 2474366 2429584 2420323 2456917 2341218 2177496
19262 2177496 2084508 2087845 2115815 2158639 2135280 2058490 2084726 2110952 2229243 2206555 2063910
19251 2063910 1945144 1816120 1721352 1634069 1652397 1688803 1732743 1720403 1717303 1642067 1592985
19240A592985m7020j123l819k2330N3972J13102r4537J2683Q521q8980j00522
19229A422932j52394O4929N4763K8947J1838L1761j48270n4185R598L9026P807
19218A316752M7826K8538N3314n7583K97992Q8151j07634j38857P955K4363n0788
19207A510029l1742j03204n3751j28282L152O3065P896k29R4860P3761N8503J23387
19195A617445n6250K2506M5629Q3316p091j4525k3116k6238L9198l0789j55459
19184A494626r5452O9135J01640J16084l590P699j2766p568K48329M6208j10346
19173A853999o453q5964j06556o042K2115k8018P1070l3453q9231J35980J41424
19162A868871P5166J6351O3379R4417K9939J20763J67172p175p283R3127J68592
$$ plain form
19240 1592985 1545965 1544842 1541023 1518693 1572665 1685767 1591230 1603913 1612434 1523454 1422932
19229 1422932 1270538 1335467 1390230 1419177 1431015 1462776 1314506 1260321 1269919 1308945 1316752
19218 1316752 1364578 1393116 1446430 1388847 1686839 1774990 1667356 1528499 1536454 1560817 1510029
19207 1510029 1478287 1375083 1321332 1193050 1196202 1259267 1267163 1266934 1361794 1435555 1494058 1617445
19195 1617445 1561195 1583701 1629330 1712646 1705555 1691030 1667914 1641676 1680874 1650085 1494626
19184 1494626 1399174 1468309 1569949 1686033 1682443 1690142 1677376 1669808 1918137 1964345 1853999
19173 1853999 1847546 1761582 1655026 1648984 1671099 1643081 1714151 1680698 1591467 1727447 1868871
19162 1868871 1944037 1960388 2023767 2118184 2148123 2268886 2436058 2428883 2421600 2514727 2683319
19151B683319J95089J44993J32088K27288K26109K70407J92750J43960K19899
19142D435902L93471L90090L01791M11646L57098M00989O03270O26049O15163
19133H535469R48161J108682J301258J805592K483131L536872M796882O712785
19125C1228832R428528J1901232J2318467R413511M251988q93563l693348j367092
19117G2588555M800717J0633072J2746155J0826794O564008j2803o424058r342144
19109A02380296j0632076j0295157o547298q07802L604026L726113j38364n799497
19101G5490241j1219519j3325623j0857555p488185m917813l255508k314290j562189
19093B0549559j102519q59395o58216n53394l23290j97406M8728K59433L55335
$$ plain form
19151 2683319 2878408 3023401 3155489 3382777 3608886 3879293 4072043 4216003 4435902
19142 4435902 4829373 5219463 5521254 5932900 6289998 6690987 7294257 7920306 8535469
19133 8535469 9483630 10592312 11893570 13699162 16182293 19719165 24516047 31228832
19125 31228832 40657360 52558592 64877059 74290570 78542558 77648995 73955647 72588555
19117 72588555 77389272 88022344 100768499 111595293 118159301 118146498 111722440 102380296
19109 102380296 91748220 81453063 74905765 74097963 77701989 81428102 81289738 75490241
19101 75490241 64270722 50945099 40087544 32599359 27681546 24426038 22111748 20549559
19093 20549559 19447040 18587645 17929429 17376035 17052745 16855339 16904067 17163500 17518835
19084A7518835N83094R56855J156786J817993K771039M044713N690373Q329569
19076D2869257J2034447J5501110J5877115J1632333M970695k282807o228883
19069I4373267l025462M241918J0388885J2921001J2317269R244370L045166m286552
19061A39219862r711677j3929030j5181034r942426k502661K522961K674724j726601
19053I1424118p855927j3358855j5093727j2405395q742840n837698m060363k925758
19045B1143555k115785j492801j148838j186467j082219r37326p27728n30956
19037A1921435m29499l02822k98090m01213m43879n24979o33213o05395l54656
19028G927689l18268k13424j25845r3637j35445k50340l61995l64854k22830k44766
$$ plain form
19084 17518835 18101929 19058784 20215570 22033563 24804602 28849315 34539688 42869257
19076 42869257 54903704 70404814 86281929 97914262 102884957 100602150 94373267
19069 94373267 91347805 95589723 105978608 118899609 131216878 140461248 143506414 139219862
19061 139219862 129508185 115579155 100398121 90455695 87953034 90475995 93150719 91424118
19053 91424118 83568191 70209336 55115609 42710214 33967374 28129676 24069313 21143555
19045 21143555 19027770 17534969 16386131 15199664 14117445 13180119 12452391 11921435
19037 11921435 11491936 11189114 10891024 10489811 10045932 9520953 8887740 8282345 7927689
19028 7927689 7609421 7395997 7270152 7176515 7041070 6790730 6428735 6063881 5841051 5596285
19018E596285j33707j54723j45188m1734j71396j0763L3966o3497m471J54403
19008E059175p645q7752j13215j56174j71303m5042L8136K03164J36804K34572
18998E090720J68849J00873O5305l7707J110m6307k63493k44179n3669J21336
18988D902838K67858J48798J61893J04407q7046j63361j18108j8431O9356R6371
18978E364575J00354Q7226K8679L6603j31646o6802K30405K93804L21856K81162
18968F546216K14667M01677M61770O00562M94945M89211O19427N01459N63887
18959A0893821N84552N95135N83582O31608Q70334R79031J213745J478221J564213
18950A9394242K001659K570803L185060M245782N492169P138320R832186J4050654
$$ plain form
19018 5596285 5462578 5307855 5162667 5120933 4949537 4938774 4972740 4909243 4904772 5059175
19008 5059175 5051530 4963778 4850563 4694389 4523086 4478044 4516180 4719344 4856148 5090720
18998 5090720 5259569 5360442 5425747 5388040 5389150 5342843 5079350 4835171 4781502 4902838
18988 4902838 5170696 5319494 5481387 5585794 5498748 5335387 5217279 5198848 5268204 5364575
18978 5364575 5464929 5552155 5580834 5617437 5485791 5418989 5649394 5943198 6265054 6546216
18968 6546216 6760883 7162560 7624330 8224892 8719837 9209048 9828475 10329934 10893821
18959 10893821 11478373 12073508 12657090 13288698 14159032 15138063 16351808 17830029 19394242
18950 19394242 21395901 23966704 27151764 31397546 36889715 44028035 53860221 67910875
18942F7910875K0503622K9419900M0038929M6888279M0923162K0658829n823284
18935B60520312l1636955m4688929l9052191k6084012j4344470n006943L202067
18928A02908879J1730632K1754405L3386987M2768143M0795784K3181685l425915
18921B73100600l1506025m9912487m8475474l6294446k4682368j6436579j1343805
18914E4449416q208902o184846m680537l451365k706539j814845j431530j469797
18906B4501055j522698j608590j557077j282926j101008q53567q33511q18831
18898A4922847r57768r22306q21939o14423m37101m04326m76775m36845l80908
18889I470456m70227l41812m17145l54708l75280l32429k34722k77601k56213
$$ plain form
18942 67910875 88414497 117834397 157873326 204761605 245684767 266343596 260520312
18935 260520312 228883357 184194428 145142237 119058225 104713755 99706812 102908879
18928 102908879 114639511 136393916 169780903 212549046 253344830 276526515 273100600
18921 273100600 241594575 191682088 143206614 106912168 82229800 65793221 54449416
18914 54449416 46240514 40055668 35375131 31923766 29217227 27402382 25970852 24501055
18906 24501055 22978357 21369767 19812690 18529764 17428756 16575189 15741678 14922847
18898 14922847 13965079 13042773 12220834 11606411 11169310 10764984 10288209 9851364 9470456
18889 9470456 9000229 8658417 8241272 7886564 7511284 7178855 6944133 6666532 6410319
18880F410319j84978j78905j48196j62512j98073j68482j10204j25344l8878j58693
18870D936054k56614j57118m9936j07932j29686m9792r1616j61496k49234p7472
18860C605158q7876r8181j22188k16011k0430l586o0420l2687r5409k36290j14208
18849B517872m6334O1446k4127J54002K74186P5949N9320J33948J12461K958j65260
18838C156421r2931j60202j53465j48369j32820j02191O5311J57700K29594J33787
18828B952835J95434M8185J1201j48313k70013l05140k03341j38012p5624P5290
18818B142502P6518l1191L1374j11517j7985N4503K7964q3955k21788o8274j70549
18807A627602j69384q3238L7531K1183j37554o4360q3436J09778K00651J08952
$$ plain form
18880 6410319 6225341 6046436 5898240 5735728 5537655 5369173 5258969 5133625 5094747 4936054
18870 4936054 4679440 4522322 4472386 4364454 4234768 4184976 4093360 3931864 3682630 3605158
18860 3605158 3517282 3419101 3296913 3080902 3060472 3056886 2996466 2963779 2868370 2632080 2517872
18849 2517872 2471538 2532984 2508857 2662859 2937045 3012994 3072314 3206262 3318723 3321681 3156421
18838 3156421 3063490 2903288 2749823 2601454 2468634 2366443 2431754 2589454 2819048 2952835
18828 2952835 3148269 3196454 3207655 3059342 2789329 2484189 2280848 2142836 2067212 2142502
18818 2142502 2219020 2187829 2219203 2107686 2089701 2144204 2172168 2088213 1866425 1798151 1627602
18807 1627602 1458218 1374980 1412511 1433694 1296140 1231780 1148344 1258122 1458773 1567725
18797A567725O699j1332J01193q1013n0754M5079Q0560k2607j25347j32332p1507
18786A306364j12627j08235l6793l0136L5354j4152j20082Q3483K17926J24427
18776A345529O8412j9947p1505p2188j60604n6576o9627j10603p1762P5143P753
18765H64025j02294q8855M7023q9058j03225O4504J13641J07729M2091M527l8848
18754H21260K2567k7957m213j21181k2687R4291j4823j57499j23946N9576K9383
18743E54771K0390P4638m9557j24390N1968J73828k48o0499l6087j4800j6041
18732E73973p6025O0926K3534o2905q6817q7191K9227K519Q8429J78902j5530
18721F29042m4318l4466m273l1516l8407J28681R923n945N9411p6359P4661N8774
$$ plain form
18797 1567725 1574424 1563092 1664285 1583272 1532518 1577597 1658157 1635550 1510203 1377871 1306364
18786 1306364 1193737 1085502 1048709 1018573 1053927 1039775 919693 1003176 1221102 1345529
18776 1345529 1413941 1393994 1322489 1250301 1089697 1033121 963494 852891 781129 856272 864025
18765 864025 761731 672876 719899 630841 527616 592120 705761 813490 855581 860108 821260
18754 821260 843827 815870 811657 690476 667789 762080 747257 589758 465812 525388 554771
18743 554771 575161 649799 600242 475852 527820 701648 701400 640901 604814 590014 573973
18732 573973 497948 558874 582408 519503 432686 345495 374722 377241 465670 644572 629042
18721 629042 584724 550258 545985 514469 476062 604743 614666 608721 668132 591773 666434 725208
18709G25208L3117L9914Q5492k2600q69j7690o7353j0533m6692j38835j59P5269
18697F54269o0870r156L5285j3239Q1490l047J72146P5937j7024Q3940k9045j2951
18685I57735k0533k9144q3423o6753J47460M1845q6290K2937P0621R1362j0253
18674A035564q2920l7502M3478j9759p6209M8129J34877J28957K2016Q0802J07855
18663A385288M0126J05651J06563K2995J25460o6843k5789o5648J2059O1430K9229
18652A730521R1119M4640J9109M9409J40011M6907J60976J98591J67050K08909
18642B857242K06122L07595L80279K05211K49690L04115J96303J41670J29125
18633D977352J54335J35058J92895M08416O55387P25951P97918R91037J287675
$$ plain form
18709 725208 758325 798239 883731 861131 860262 842572 775219 764686 717994 579159 579000 654269
18697 654269 593399 584243 619528 606289 687779 684732 856878 932815 915791 999731 970686 957735
18685 957735 937202 908058 824635 757882 905342 947187 860897 883834 954455 1045817 1035564
18674 1035564 952644 915142 958620 938861 862652 910781 1045658 1174615 1196631 1277433 1385288
18663 1385288 1425414 1531065 1637628 1660623 1786083 1719240 1693451 1627803 1639862 1701292 1730521
18652 1730521 1821640 1866280 1885389 1934798 2074809 2121716 2282692 2481283 2648333 2857242
18642 2857242 3063364 3370959 3751238 3956449 4206139 4510254 4706557 4848227 4977352
18633 4977352 5131687 5266745 5459640 5868056 6523443 7249394 8047312 9038349 10326024
18624A0326024J729991K333761L091742M047053N747536Q187716J1494164J5718586
18616F2676573J9054055J8927069J5605796R801007J698731o606382j2244171
18609A08912678j6578560j9367960j7585849j3097421r048950o190462m438790
18602B2604686l111929k284632j669667j333280j103204q06797n67002l52229
18594A1375946j92340O7325L77793M21619L35581K85908K43798J30871q179l8521
18584A2999801Q6978J7774K79740N16934Q02214Q87998J069848J419006J888061
18575A9968354K635140L724794M886554O687512R476044J3632759J9532848K6906817
18567A07450822L2783250L3016840K6862110J7283236L346895j1166863k1158875
$$ plain form
18624 10326024 12056015 14389776 17481518 21528571 27276107 35463823 46957987 62676573
18616 62676573 81730628 100657697 116263493 126064500 127763231 121156849 108912678
18609 108912678 92334118 72966158 55380309 42282888 33233938 27043476 22604686
18602 22604686 19492757 17208125 15538458 14205178 13101974 12295177 11728175 11375946
18594 11375946 11183606 11250931 11628724 12050343 12385924 12671832 12915630 13046501 13038322 12999801
18584 12999801 13086779 13104553 13384293 13901227 14703441 15591439 16661287 18080293 19968354
18575 19968354 22603494 26328288 31214842 37902354 47378398 61011157 80544005 107450822
18567 107450822 140234072 173250912 200113022 217396258 220743153 209576290 188417415
18560A88417415k9050574l4371281l1260413k3132236j5845686j0833098p527926
18553C6396201n336941l931606l001251k257051j814071j509610j256879r24395
18545A6364397p85147n42350k92760k00309j63431j00515j90320l79548o28652
18536A3081365n69171n54252o51496m66602k54983L7786J24604L17123M08357
18527A1472731N90167R20508J404833K075033K922086M041514O045290Q534138
18519C8006300J1686610J4159108J4255399J1655745P308142J322405m909129
18512I3484580r445115j3127090j5391497j3839177j0128028o865470m668824
18505B0019379l129802k257851j652161j377121j002995q50515p15347o10808
$$ plain form
18560 188417415 159366841 124995560 93735147 70602911 54757225 43924127 36396201
18553 36396201 31059260 27127654 24126403 21869352 20055281 18545671 17288792 16364397
18545 16364397 15579250 15036900 14744140 14543831 14380400 14279885 14089565 13710017 13081365
18536 13081365 12512194 11957942 11306446 10839844 10584861 10622647 10747251 11064374 11472731
18527 11472731 12062898 12983406 14388239 16463272 19385358 23426872 29472162 38006300
18519 38006300 49692910 63852018 78107417 89763162 97071304 98393709 93484580
18512 93484580 84039465 70912375 55520878 41681701 31553673 24688203 20019379
18505 20019379 16889577 14631726 12979565 11602444 10599449 9748934 9033587 8422779
18497H422779n52573m49203k54317j82613j14989j77369j50666j33564k95882
18488F111603m21577l78034k99309k58601l52674j73352l27532l27701k94226
18479C278597j92960n5007q9171n2956m4557o5539j7881m0048r2509j3729m7209
18468B567031j9630l2557N5467R4617P1844L51279J75013l2183r9213l50223j98366
18457B583079O8076K25669N5232O6179M9640j4107r5770M2958M5483p9934j79838
18446B766667k07325p7411n8684J2354m0789k3564m1640l0250k18419n2442k37419
18435A791078j08249j08319k23964j24638k8856m1489l0538r2316N152j28218
18425I09643k0128m1856k8766M0978l9543l2577J35455O9105O8837J4096K0566
$$ plain form
18497 8422779 7870206 7421003 7166686 6984073 6869084 6691715 6541049 6407485 6111603
18488 6111603 5690026 5311992 5012683 4754082 4401408 4228056 3900524 3572823 3278597
18479 3278597 3085637 3030630 2941459 2888503 2843946 2778407 2760526 2720478 2627969 2614240 2567031
18468 2567031 2547401 2514844 2570311 2664928 2736772 3088051 3263064 3230881 3131668 2781445 2583079
18457 2583079 2651155 2876824 2932056 2998235 3047875 3033768 2937998 2980956 3026439 2946505 2766667
18446 2766667 2559342 2481931 2423247 2435601 2394812 2371248 2329608 2299358 2080939 2028497 1791078
18435 1791078 1682829 1574510 1350546 1225908 1197052 1155563 1125025 1032709 1037861 909643
18425 909643 889515 847659 818893 859871 820328 787751 923206 992311 1061148 1075244 1095810
18414A095810J53795J17010Q6702K6029J73006M6534j67930j37955K3702p0722
18404A345981j7895J31163m0243J40303m905j36972j61640j66443j15454J1597
18394I85492r849q812M973N3512N2733j24644j61952J1171Q1117m7812p4124m6694
18382G15111O5487J47795k7235j18765q7348j13513m8949O4386J66243M4304L5567
18371H43083n7166K6558k8570P8910J33945R3484j1073J20670M4529N8277P5490
18360A378137J20490J44370J67477O8014J19277N4464j47307k09763J8647j3532
18350A700274N589m3297j4614L22010L80614L69074L55966J58810J30986R5154
18340C460566j77327m58961m70198k82014k88063k62512l3971J15696j9435M5873
$$ plain form
18414 1095810 1249605 1366615 1453317 1479346 1652352 1698886 1530956 1393001 1416703 1345981
18404 1345981 1328086 1459249 1419006 1559309 1554404 1417432 1255792 1089349 973895 985492
18394 985492 975643 966831 971804 1025316 1078049 953405 791453 802624 883741 835929 761805 715111
18382 715111 780598 928393 901158 782393 695045 581532 532583 596969 763212 807516 843083
18371 843083 785917 812475 783905 862815 996760 1090244 1079171 1199841 1244370 1302647 1378137
18360 1378137 1498627 1642997 1810474 1878488 1997765 2052229 1904922 1695159 1713806 1700274
18350 1700274 1705863 1662566 1647952 1969962 2350576 2719650 3075616 3234426 3365412 3460566
18340 3460566 3283239 2824278 2354080 2072066 1784003 1521491 1487520 1603216 1583781 1629654
18330A629654j7391q9426J2391L6032j11129k54589j03490J1975j42544j66918
18320H04565N6423L7536q6386m8474N8497K0508j04803R419R3121Q9795R8814
18309A029015Q8257J24889k4239n0096m1803p7826j02464q2726O5911J33104Q6760
18298A148782L5363J54473M61495L45436L79923K93872J02562K6343k50630m32502
18288B265117m42076l80811m18958j96423j25850k20237j27218q1256j2918L0285
18278B89655K5818M15p0540M763J4718o6614K6533M1356k9480k2057P2043N4684
18266C41294j50503o7168l0218J81483K03603M1108m9339M4518l8147j19030n0465
18255C07136n407J8133M2471N2281J51743j3217m9404p4929N2715K14595J38330
$$ plain form
18330 1629654 1612263 1522837 1535228 1571260 1460131 1205542 1102052 1114027 971483 804565
18320 804565 860988 898524 812138 763664 822161 842669 737866 747285 840406 930201 1029015
18309 1029015 1117272 1242161 1217922 1167826 1126023 1048197 945733 863007 928918 1062022 1148782
18298 1148782 1184145 1338618 1800113 2145549 2525472 2819344 2921906 2948249 2697619 2265117
18288 2265117 1823041 1442230 1023272 826849 700999 480762 353544 272288 259370 289655
18278 289655 315473 315888 245348 250111 264829 198215 224748 266104 236624 214567 286610 341294
18266 341294 190791 123623 93405 274888 478491 519599 470260 514778 476631 357601 307136
18255 307136 301729 319862 362333 414614 566357 553140 503736 428807 481522 696117 834447
18244H34447N6107J61421J66178o0907p5309j49414j75813j91815j57806N3622
18234D60711N3074l3660L847o1200n0922K1981k4310n4333p7268K5241J61696
18223D24857P6068N3842l9419l9821O198J16263J0359j09785r3619J5901Q109
18212D28953J4647k1657J42668J2443k4201J24235R4184j37644j26013k2241k45715
18201B39659j03218J47131J4230n4792J8336R5726M4993n6159o9430j06177L1284
18190B01583o525P7155P1303p374n3580P625p8720N2140L4943p7871k2507J42706
18178C40878J84487o095n019q3046l0190K20633J34124R0842o913p3884j34952
18167F30865j04142j39433j0531n0601q9944K4564j09497K1241Q7337L864k3444
$$ plain form
18244 834447 890554 1051975 1218153 1157246 1081937 932523 756710 564895 407089 460711
18234 460711 513785 480125 483972 422772 371850 393831 369521 315188 237920 263161 424857
18223 424857 500925 554767 515348 475527 481725 597988 608347 498562 404943 420844 428953
18212 428953 443600 421943 564611 577054 552853 677088 771272 633628 507615 485374 239659
18201 239659 136441 283572 297802 243010 261346 357072 402065 345906 276476 170299 201583
18190 201583 195058 272213 343516 336142 282562 290187 211467 263607 298550 220679 198172 340878
18178 340878 525365 519270 514251 431205 401015 621648 755772 846614 839701 765817 630865
18167 630865 526723 387290 376759 326158 236214 260778 151281 172522 259859 263723 240279
18156B40279p4528r396M5810J12238q3890o2824J1797Q7121q7663j66880q1902
18145f9838J00244J72067R9884k6874k0995l7198j8128J2034O2883M9525J17113
18134D40717J48293J06006l5526j1936j8701p29R2314M8646j26050q1270l2278
18123E29486l0952k2401j14498p4469Q2267L2206N2113j8209M6401L4151j41189
18112C74906r5872j15966M3077J54191K6755r6234j2866J38395L0132l1801J08018
18101E22735J0482J42775j22006j58713O696j3789q9466j98298j0898J06323J66373
18090C62214M574j44509o9816P1858k2041O3762P4712R648r5831N0412k2705j94236
18078H8042O6968Q4751M8751M728n5956n7128J048M5395k7417o3612k8254J9700
$$ plain form
18156 240279 165751 156355 202165 314403 230513 167689 179486 266607 178944 12064 -69838
18145 -69838 30406 202473 302357 275483 254488 217290 199162 211196 274079 323604 440717
18134 440717 589010 695016 659490 647554 628853 628124 720438 769084 643034 561764 529486
18123 529486 498534 476133 361635 287166 369433 401639 453752 435543 481944 516095 374906
18112 374906 279034 163068 206145 360336 387091 290857 277991 416386 446518 414717 522735
18101 522735 533217 675992 553986 395273 401969 388180 298714 100416 89518 195841 362214
18090 362214 366788 222279 152463 224321 202280 266042 340754 350402 254571 304983 282278 88042
18078 88042 155010 239761 288512 293240 237284 180156 181204 226599 199182 135570 107316 127016
18066A27016o9930J08912M3819J15244Q4036o354M6789J04314L3391Q2033j09285
18055E59985P6348J1785J74094K77385J36634J10123J55736O9360q9347j8764
18045A463339O4552K5595j39119P2253J43250j0217j21543k93726k41041j01589
18035H61754K3586N711N8919J1576j12247O4740P0104j11296k7572R1370o3488
18024H73157k9451n8911K440q172o6487J04214J07236K9759j00251j59811m3746
18013F49977j35716j20634J3999L0680j54339J6007J25730J24804J0683O0049
18003F21240P6597o8695Q9147J40993o4160o1827J1153q6810k20916j25553o8957
17992B42212j10145Q1703J70827K6392q3148n4458o2277J5148m521k12941j77851
$$ plain form
18066 127016 57086 165998 209817 325061 409097 402743 449532 553846 587237 669270 559985
18055 559985 636333 648118 822212 1099597 1236231 1346354 1502090 1571450 1482103 1463339
18045 1463339 1527891 1553486 1414367 1486620 1629870 1619653 1498110 1204384 963343 861754
18035 861754 885340 891051 949970 961546 849299 914039 984143 872847 845275 936645 873157
18024 873157 843706 784795 787235 779063 712576 816790 924026 953785 853534 693723 649977
18013 649977 514261 393627 407626 438306 283967 299974 425704 550508 561191 621240
18003 621240 697837 629142 718289 859282 795122 733295 744448 657638 436722 311169 242212
17992 242212 132067 213770 384597 410989 327841 273383 211106 226254 221733 8792 -169059
17981a69059p113L6022J11607M4563O7283K0393Q0841j6566j39944l9686j3039
17970b4698N6507m6553j938J759M9296p2408j776R708l8824Q9866J41409L9379
17958B01727r6137p6554N0007l2707M0145J09336Q7686l9300m0882r5858K4353
17947A31816J72645O3770k8356q8491J182N493P7781R5515J24316M4810J4291
17936F14772K34883J44313P1661L883j16025r8059m9848j18211k7919R186p975
17925F60661Q5605K2295N9640O9745j188J9349p0146j58688j83923l0336p7994
17914C95020M7126l1401j46740l4113l8805l1863J4350l480j9383m2570q6776
17903B1365J13961K2640j0118m7213o9727M015m0832q9570M9224R9885n8483p7407
$$ plain form
17981 -169059 -176172 -140150 -28543 16020 83303 103696 184537 167971 28027 -11659 -24698
17970 -24698 31809 -14744 -16682 -14923 34373 -38035 -39811 -30103 -68927 20939 162348 201727
17958 201727 105590 29036 79043 46336 86481 195817 283503 244203 203321 107463 131816
17947 131816 304461 368231 339875 251384 252566 258059 335840 431355 555671 600481 614772
17936 614772 849655 993968 1065629 1069512 953487 855428 805580 687369 659450 668636 660661
17925 660661 746266 768561 828201 897946 896758 916107 845961 687273 503350 473014 395020
17914 395020 442146 410745 264005 229892 191087 159224 173574 170094 150711 108141 21365
17903 21365 135326 157966 147848 100635 30908 34923 -5909 -95479 -46255 53630 -4853 -82260
17891h2260O7658J87227L4390k3314p3877q4527m3471J69578N3433Q612j13450
17880I9999o7594L6708k5926l6712N8706K0240j61105r9094Q645J08543j215J0178
17868d8627n1566p7830r5541J34046R1830Q6357k6826p4032n4250j2782K8263
17857a00958J42910O6014n5936m9397l0007N6226N4625j9077j52218l3796J08437
17846a3177R1686K7947k9839j70762p6964j3149n1653O5301J36145J00384n2163
17835A3756l8565N6608l5787m4114o409l131k354j23851m5401J09920j06188N7875
17823a67641L6294l2812N6619m254o7924j7937K7394R3421l589M4863J10006l3355
17811D1085K0175L051m7907K0059k0391o1913n8896J20696L1496j03809n1105
$$ plain form
17891 -82260 -14602 172625 207015 183701 109824 25297 -18174 151404 204837 213449 99999
17880 99999 32405 69113 43187 6475 65181 85421 -75684 -174778 -166133 -57590 -58805 -48627
17868 -48627 -100193 -178023 -273564 -139518 -47688 38669 11843 -62189 -116439 -129221 -100958
17857 -100958 41952 107966 52030 2633 -27374 28852 83477 64400 -87818 -121614 -13177
17846 -13177 78509 106456 76617 -94145 -171109 -184258 -235911 -170610 -34465 65919 13756
17835 13756 -24809 31799 -3988 -48102 -54511 -57642 -59996 -183847 -229248 -119328 -225516 -167641
17823 -167641 -131347 -164159 -107540 -111794 -179718 -197655 -170261 -76840 -80429 -35566 74440 41085
17811 41085 61260 64311 16404 36463 16072 -45841 -104737 15959 47455 -56354 -107459
17800a07459j5527j1537J04396N7849O3744m5891J0426j01573r0504r7117q2528
17789c15721J28361J04483R8618o5005M1690p2776j08850K4125L8967n5447q3445
17778b65000m177N4383R9292J11573l3403J07668O9040j42217J7266N5058n4351
17767A5132j23259N6989J09492Q9117L574M0344o8010n7787q3757M1608J56737
17756A80180n8495p6492L9735j173k4614q7530K5996J8844n2209P2688O348Q944
17744E2222J0112j08147M2495J12752L4630l2736j78797j28198K8922o3359N7596
17733a72508J86823o988K4457K8121M955J3819p6303k8474k934o3337k008L0461
17721f3916P2696j3738O1637J50132j7731N7055K5278p7724k7436m7046k8099
$$ plain form
17800 -107459 -122986 -134523 -30127 27722 91466 45575 56001 -45572 -136076 -233193 -315721
17789 -315721 -187360 -82877 15741 -49264 -7574 -80350 -189200 -165075 -126108 -181555 -265000
17778 -265000 -269177 -214794 -115502 -3929 -37332 70336 139376 -2841 14425 69483 15132
17767 15132 -108127 -51138 58354 147471 151045 191389 123379 65592 -18165 23443 180180
17756 180180 121685 45193 84928 83755 59141 -28389 -2393 16451 -35758 36930 43278 52222
17744 52222 62334 -45813 -3318 109434 144064 111328 -67469 -195667 -166745 -230104 -172508
17733 -172508 14315 7327 31784 59905 64860 78679 2376 -26098 -29032 -92369 -94377 -63916
17721 -63916 8780 -4958 56679 206811 189080 246135 271413 193689 166253 119207 91108
17710I1108j2466m4256k2002j0562k7757J3447p9573j2351M0610J23213m2244
17699A7167l3399R3436L6526p5008j0082J651K2906j81N6091r2328q5801m4717
17687a13739K8046P7005Q7717o5555k1314J9358N2885j5273o3760P0033J3123
17676F8526J02991M4412j4703j29700k18098J1095J36123J55687p3538j69580
17666h6785R7546K21869M3521p5750j15949n8685P6851r6377j3396Q171m1333
17655d0317q6000K9821J09912K1177j23470k3973K04266O0725R2637l3688j4936
17644A96154k5576j2365N7451N8064Q6896K5632J5532m4608L5702j2075j04483
17633B76324m8870m1930Q250J19384j5567j48432J18885O7260n511k1583J5881
$$ plain form
17710 91108 78642 34386 12384 1822 -25935 -12488 -92061 -104412 -63802 59411 17167
17699 17167 -16232 77204 113730 38722 28640 30291 53197 53016 109107 16779 -69022 -113739
17687 -113739 -85693 -8688 79029 13474 -7840 11518 64403 49130 -14630 55403 68526
17676 68526 171517 215929 201226 71526 -146572 -135477 646 156333 82795 -86785
17666 -86785 10761 232630 276151 200401 84452 25767 102618 6241 -7155 1016 -40317
17655 -40317 -126317 -96496 13416 34593 -88877 -112850 91416 152141 244778 211090 196154
17644 196154 170578 158213 215664 273728 360624 386256 401788 357180 392882 380807 276324
17633 276324 227454 185524 193774 313158 297591 149159 268044 335304 329793 308210 324091
17622C24091J8773j59703o3337r050j13582j5909L8768L2649j15389Q1743o5308
17611d6254m6518k7762r2356L579N3742J05319P5830k8426Q2546J94396k5104
17600B48992j61383K1358R801J31365J22314q829j65729k4342j4469j05634n1696
17589A748N6172J36698k5644q7075Q8412L4072J1298j11644j20758j5201J62735
17578A30813Q5671N4318k1422l423P6062M1878m2294k4472p0193l9075o1264K0306
17566A46905Q6013j9021m2476M169K9812m0547r043r788J6143J06670n8419j11475
17554I8943O3867L339k1666q471j60508j00150O2002N7249K2495Q8620o1827k8303
17542A5590N7235l1009j36415O7418L6662n9975L3397J71041J04326M5564j06445
$$ plain form
17622 324091 342864 183161 119824 110774 -2808 -18717 20051 52700 -62689 19054 -46254
17611 -46254 -92772 -120534 -212890 -209311 -155569 -50250 25580 -2846 79700 274096 248992
17600 248992 87609 108967 118768 250133 372447 363618 197889 173547 159078 53444 1748
17589 1748 57920 194618 168974 81899 170311 204383 215681 104037 -16721 -31922 130813
17578 130813 216484 270802 249380 245957 322019 363897 321603 297131 226938 187863 126599 146905
17566 146905 232918 213897 171421 175590 205402 164855 155812 146024 162167 268837 210418 98943
17554 98943 162810 166149 144483 136012 -24496 -124646 -62644 -5395 17100 105720 43893 15590
17542 15590 72825 41816 -94599 -27181 9481 -50494 -17097 153944 258270 303834 197389
17531A97389r0237R6989q627L0594L2846J3943p523m874L4947M934n8568K6349
17519B68162l8611L8974K5428j13881M5427N0233k7397j67606k3674J60148J11668
17508C28871N8023j12L0553l8396J0765K3645K0904p4683o2899r0199M4145k9065
17496B21552q0641O1041J32389Q088N5675j6239l9643K2471j2960r4592j50587
17485A06554R2714P7878j0786N3071m4852p3476M2528L4562N5494Q1694q3381
17474C32000j19012m5475J9705P7307J05397R1953j60152K8358J07306J10363
17464E47750J4808o6063n7220k1229J86268J99681P4511n4848j09704j6923J3365
17453G10396R751P5031J07354M1407q437N7253O5451J05596J06725j20821m9858
$$ plain form
17531 197389 107152 204141 195514 226108 258954 272897 265374 260500 295447 300381 241813 268162
17519 268162 229551 268525 293953 180072 225499 275732 248335 80729 57055 217203 328871
17508 328871 386894 386782 417335 378939 389704 413349 434253 359570 296671 206472 250617 221552
17496 221552 140911 201952 334341 342429 398104 381865 342222 364693 351733 257141 106554
17485 106554 199268 277146 266360 319431 274579 201103 243631 278193 333687 415381 332000
17474 332000 212988 167513 187218 264525 369922 461875 301723 330081 437387 547750
17464 547750 562558 496495 439275 418046 604314 803995 878506 823658 713954 697031 710396
17453 710396 720147 795178 902532 943939 935502 992755 1058206 1163802 1270527 1149706 1099848
17442A099848J65033J19974j25701j09223m1261J86568Q9617Q2003l3918l6134
17432A396806J44018Q8113J60229K35138K62845J48352J23J07884j7514O2718
17422B588712J99542O0235K01837K67661K21678O5375J05675J77403K71109N15671
17412D674898P29005P70954R35300J065203J165959R62500O40764J48401k2769
17403A1070215K02926N71495O85547Q69349J098348J179273J561962K237198K857392
17394B2333705L844004M702570N795009P750101J0926614J6355446K5234413L8075188
17386A35017050N2927351N8813529M2754529J1443151k3506242n4120070n7856413
17379A65472885m0509003k3520757j1358307k214648O257693J6045651K8854877
$$ plain form
17442 1099848 1264881 1384855 1259154 1149931 1108670 1295238 1384855 1466858 1432940 1396806
17432 1396806 1540824 1628937 1789166 2024304 2287149 2435501 2435624 2543508 2525994 2588712
17422 2588712 2788254 2848489 3050326 3317987 3539665 3605040 3710715 3888118 4159227 4674898
17412 4674898 5403903 6174857 7110157 8175360 9341319 10303819 10944583 11092984 11070215
17403 11070215 11273141 11844636 12530183 13399532 14497880 15677153 17239115 19476313 22333705
17394 22333705 26177709 30880279 36675288 44425389 55352003 71707449 96941862 135017050
17386 135017050 187944401 246757930 289512459 300955610 277449368 223329298 165472885
17379 165472885 124963882 101443125 90084818 87870170 94127863 110173514 139028391
17372A39028391M4425048N4788365M5779552J7238998j7022394n0656958o3435628
17365A70145374m9454401l2104264k0495273j3640857r471645o694210m847576
17358C3437148l580025k945370k296466j807032j711624j543287j293048r98891
17350A7261405q55780r26762p89028q32043q83374q02334n68700m59454l84106
17341A0759824n48836n37647m17741n71793n39068m06191l67305l04959l42846
17332F723438l35313k70205l17497j30129j29258k95033j55934j59166j30688
17323D800215p2960j67168q0733j82576j24458j14549k03513j59095q7539j75344
17313C432280j25926j16218p4027o2334j30417j80691j48787L024n6289m5395
$$ plain form
17372 139028391 183453439 238241804 284021356 301260354 284237960 233581002 170145374
17365 170145374 120690973 88586709 68091436 54450579 44978934 38284724 33437148
17358 33437148 29857123 26911753 24615287 22808255 21096631 19553344 18260296 17261405
17350 17261405 16405625 15478863 14689835 13857792 12974418 12172084 11603384 11143930 10759824
17341 10759824 10210988 9673341 9255600 8683807 8144739 7738548 7371243 7066284 6723438
17332 6723438 6388125 6117920 5800423 5670294 5541036 5246003 5090069 4930903 4800215
17323 4800215 4727255 4560087 4479354 4296778 4172320 4057771 3854258 3695163 3607624 3432280
17313 3432280 3306354 3190136 3116109 3053775 2923358 2742667 2593880 2596904 2540615 2495220
17303B495220k9105r3204k19405o2767o8071M5334P130l5689r8715m5995J871
17292A896604o8262q5130m6146j8828M0181j1838n7271o6589n0720j11442j71497
17281A249062L1506J05760Q5813J3228P324j09409o4489L5354l5071j9146Q9568
17270A389500j46851q1096j59835j34255k6266K38978J03975J0209q4996j1339
17260A098024O3033J57549R0181J08386K59376R8037O9536K0326J8107M6597j31883
17249A897269k55483k28307j18790r3585p4424J48085k0276L5996K54776K66288
17239A811549J72914N4308o4404j21904k88029k37986k19649k84396o1665n6387
17229G04351p9978M150j1833o852k0194J17502O8176p6576O1004N595o3740r6828
$$ plain form
17303 2495220 2466115 2372911 2153506 2090739 2022668 2068002 2075132 2039443 1940728 1894733 1896604
17292 1896604 1828342 1743212 1697066 1678238 1718419 1706581 1649310 1582721 1532001 1420559 1249062
17281 1249062 1280568 1386328 1472141 1485369 1492693 1383284 1318795 1354149 1319078 1299932 1389500
17270 1389500 1242649 1161553 1001718 867463 841197 1080175 1184150 1194359 1109363 1098024
17260 1098024 1161057 1318606 1408787 1517173 1776549 1874586 1944122 1964448 1982555 2029152 1897269
17249 1897269 1641786 1413479 1294689 1201104 1126680 1274765 1254489 1290485 1545261 1811549
17239 1811549 1984463 2038771 1974367 1852463 1564434 1326448 1106799 822403 760738 704351
17229 704351 624373 628523 616690 609838 589644 707146 775322 698746 759750 765345 701605 604777
17217F04777K570Q9169N3802j22719j90250l0935R5670J9335p1964o9085q537
17206C71833j8979Q3525P4177j17608M6348O6932j19811K3858Q8504k5879p2619
17195D00281j32809o2332l0849l1371J4643r610M7232p69p4806J6397q294R9638
17183B27351Q6669P019j9893p534j4783n709R771m3397p2080l5961r8905j0507
17171B2041n6200Q044l1563O1583P547K183k8144j3019L880R7800J28747K8256
17159B31155o2266j37036j58175M7218j8406l6418K4779j8646n0465l1437R0219
17148a19478J85814k1846L64Q7449q5648M1196J08899l1944p805j02671j5517
17137C8813K8926L0174o1740q0336j45404N7843J49438J113q5663P5025L8022
$$ plain form
17217 604777 607347 696516 750318 627599 437349 406414 502084 521419 449455 380370 371833
17206 371833 352854 436379 510556 392948 439296 506228 386417 410275 498779 472900 400281
17195 400281 267472 205140 174291 142920 157563 147953 195185 194416 119610 136007 127713 227351
17183 227351 314020 321039 301146 293612 278829 273120 282891 239494 167414 131453 32548 22041
17171 22041 -34159 -26115 -57678 3905 11452 13635 -14509 -27528 -23648 74152 202899 231155
17159 231155 168889 31853 -126322 -79104 -97510 -133928 -109149 -127795 -178260 -209697 -119478
17148 -119478 66336 44490 44854 132303 46655 87851 196750 164806 157001 54330 38813
17137 38813 67739 97913 36173 -44163 -189567 -131724 17714 18827 -66836 8189 46211
17126D6211r6546l941M9349R4348J32061M0355j05556m1047n8607P9778R3140
17115B29545m4747m6651r1669R4893J30030K8601j44338l4415k4746N9322K54865
17104D10690K06129J22015L2815N416j46263k34853j12926l9827p7499l1598J1775
17093A45874N938J47888J31155R5848J76360o934j85743k0857n8790j49445q5417
17082A95877p2492j5713J7600q957r5157K850l9325N1266N3615p5874r4550K6089
17070e4771J2518N9627L7300o7655j28879j04276M5056J5490J638J9056M9691
17059a15205o396k3465N6251O5972J5414l4975Q4318j3385r9165m3732O8691M2304
17047c373J3031n1146R2208P0080M982r3410m2767k6878n4845P2900O8857J7058
$$ plain form
17126 46211 -50335 -54276 -4927 89421 221482 261837 156281 115234 56627 136405 229545
17115 229545 184798 138147 46478 141371 271401 300002 155664 121249 96503 155825 410690
17104 410690 616819 738834 771649 777065 630802 395949 283023 243196 165697 134099 145874
17093 145874 151812 299700 430855 526703 703063 696129 510386 489529 430739 281294 195877
17082 195877 123385 107672 125272 116315 21158 24008 -15317 35949 89564 13690 -80860 -54771
17070 -54771 -42253 17374 54674 -12981 -141860 -246136 -201080 -185590 -183952 -164896 -115205
17059 -115205 -121601 -145066 -88815 -22843 -7429 -42404 41914 28529 -70636 -114368 -45677 -3373
17047 -3373 9658 -41488 50720 120800 125782 32372 -10395 -37273 -92118 -19218 49639 66697
17035F6697j10404Q5722O1198l0014o1522p5027p8006R2027L1426n1262J4983
17024e4182p4486J00786J35674p0327r8387L6667l1072j43696o8658L8589J9040
17013b10052P6000K9752N365J28686J28748j551n6184k8524j85936q5968K2622
17002a77042R0916L5868p3907m3141P4396O5742N2067L5128k4999j420J2721O6633
16990A12962j51882j41336j16665m5356K10329j4780j6162N8334l5197J2081j16818
16979b44490m3152N6577k8190O8585J00738Q8222J24746P7267j16202k34065o0461
16968b10425r492K6564K7984J50099L395j11479J03015K1049r1938L7692j8336
16957g1872j11600l9999P7412J36090J6816k1514K6183R082m9133p6306p6114
$$ plain form
17035 66697 -43707 42015 103213 73199 11677 -63350 -141356 -49329 -17903 -69165 -54182
17024 -54182 -128668 -27882 107792 37465 -60922 -24255 -55327 -199023 -267681 -229092 -210052
17013 -210052 -134052 -104300 -98935 29751 158499 156948 100764 72240 -113696 -199664 -177042
17002 -177042 -86126 -50258 -124165 -167306 -92910 -27168 24899 60027 35028 33608 46329 112962
16990 112962 -38920 -180256 -296921 -342277 -131948 -146728 -162890 -104556 -139753 -127672 -244490
16979 -244490 -287642 -231065 -259255 -190670 -89932 -1710 123036 200303 84101 -149964 -210425
16968 -210425 -219917 -193353 -165369 -15270 -11875 -123354 -20339 710 -91228 -53536 -71872
16957 -71872 -183472 -223471 -146059 -9969 6847 -14667 11516 20598 -28535 -104841 -180955
16946a80955Q6124j182n7777M6176J78278P8729j34883q3905q9142j700K6814
16935a33423k6566q4958J0531l0293L8035P7912R5685K5691J6947m3245K1056
16924c2628l8602p3048L0628O768P1005r3700p761M4342j6135O4841J0364n7414
16912i1340j05601m4759M3426k5137N4254P790j0316o292L0748m5656n2553J964
16900b43472J03894Q5787R1527r3494j09606R5127J132k3437p1535p0145J0605
16889b23617M5713j1496l0940R9903p8121O5942Q0858q7812j8165k4621K8628
16878a53728R6680Q007j5654M4851K0656J1156q3851m9975r181J0150J15343K6026
16866B0480k9892J33915o6682o9750J512L1894p3295m8660o4030p95M9171N1176
$$ plain form
16946 -180955 -94831 -96013 -153790 -107614 70664 149393 14510 -69395 -158537 -160237 -133423
16935 -133423 -159989 -244947 -234416 -264709 -226674 -148762 -53077 -27386 -10439 -53684 -32628
16924 -32628 -71230 -144278 -113650 -106882 -35877 -129577 -137338 -92996 -109131 -44290 -33926 -91340
16912 -91340 -196941 -241700 -198274 -223411 -169157 -161367 -171683 -177975 -147227 -192883 -245436 -243472
16900 -243472 -139578 -53791 37736 -55758 -165364 -70237 -69105 -92542 -164077 -234222 -223617
16889 -223617 -177904 -189400 -220340 -120437 -198558 -132616 -51758 -139570 -157735 -182356 -153728
16878 -153728 -57048 -49041 -64695 -19844 812 11968 -71883 -121858 -131039 -120889 -5546 20480
16866 20480 -9412 124503 57821 -11929 -10417 21477 -51818 -100478 -164508 -165303 -116132 -64956
16854f4956o5978m9693p4732o459R3109J30704L5056P2345J47591j9877j04400
16843I2710q164K5454j21009l6316M9655J58203J40640p7544n8792j36660k94
16832B7883R7082K69407K17263K38803P6845L8109n8235P1394k2625j04801k86157
16821E64968j61725N6555P8707K0715j804O0530J13507M3091K0597N3905p4099
16810G74947l6980l6240j01900j73624k24788p1708l5843p8507l0139J04108J18033
16799B07359P105R615m0354q6686j4729j4250r4259p4004p0657M6423M2935J26724
16787D5222k6551o2139R8809n2154j4374K4921k6305K9186r0262j27871o8813
16776b70331Q2073J1291l218p4414p6462l4102O7342O1788L4000O6865K0912o5952
$$ plain form
16854 -64956 -130934 -180627 -255359 -261818 -168709 -38005 -2949 69396 216987 197110 92710
16843 92710 84546 110000 -11009 -47325 2330 160533 301173 223629 164837 28177 27883
16832 27883 124965 394372 611635 850438 927283 965392 907157 978551 955926 851125 564968
16821 564968 403243 459798 538505 559220 557416 617946 731453 774544 795141 849046 774947
16810 774947 737967 701727 599827 426203 201415 129707 93864 15357 -14782 89326 207359
16799 207359 214464 224079 183725 97039 82310 68060 -26199 -100203 -170860 -124437 -81502 45222
16787 45222 18671 -43468 55341 3187 -11187 13734 -12571 16615 -73647 -201518 -270331
16776 -270331 -188258 -176967 -180185 -254599 -331061 -365163 -297821 -236033 -202033 -135168 -114256 -180208
16764a80208j20262L3430Q0017O9695R5021k9512K0021L2666p9524J07369J4611
16753D3324j72388K8341M4941p8548j76151R361Q6847L0216K6466Q926j3549j1250
16741a73464M8444k0028J0611M2989l4182P0589O7319N3889r8063Q4524R5483
16730A48111j17551j53926o615K1151j3811Q7741K2217j15370o1190k1733j0543
16719b21519Q2014J4166j17299K5978K5144J06889M1250n7025L2586M0921J00166
16708G3271J09012j35791j57361p6422q9589J38178n0937j42200o4562n8234N0434
16697d04201J49248J46873O5717l9083O937o4855j09493J2714K0633P3946J8833
16686a22731N4304o9766m5960k7247j2473p8480K3434P0602L1891J0698N0274
$$ plain form
16764 -180208 -300470 -267040 -187023 -117328 -22307 -51819 -31798 868 -78656 28713 43324
16753 43324 -129064 -100723 -55782 -134330 -310481 -301120 -214273 -184057 -157591 -148665 -162214 -173464
16741 -173464 -125020 -145048 -134437 -91448 -125630 -55041 12278 66167 -31896 52628 148111
16730 148111 30560 -123366 -129981 -108830 -122641 -34900 -12683 -128053 -189243 -210976 -221519
16719 -221519 -139505 -125339 -242638 -216660 -191516 -84627 -43377 -100402 -67816 -26895 73271
16708 73271 182283 46492 -110869 -187291 -276880 -138702 -189639 -331839 -396401 -454635 -404201
16697 -404201 -254953 -108080 -42363 -81446 -74509 -139364 -248857 -236143 -215510 -141564 -122731
16686 -122731 -68427 -138193 -184153 -211400 -223873 -302353 -278919 -208317 -176426 -165728 -115454
16675a15454R9604J68274j43652j06260k157J06055K7155k3743P2783l1151p1528
16664b0074M6780K1746j42675j26908O9695M3081J55236M5161j49279j71228M121
16653b24344k5051r2011LJ35499j0718Q773O8889J18378j7921m4093j367n7107
16641a41070k2727L6243J39203M3750j09334p2193n6915O2014J9073L9074j5845
16630g8727K4680M4983L8125p7599m0064J6863n1589j0067k7877m1579n7037J6993
16618b42895Q81r0815O5101O5124K300k6349J5974j22829O6738M7360j1923O9389
16606a61944J3222n5671l1282K3784P1259J21241m7977k00556L2841j7296j29302
16595c81681J96P7645J03645O8919K672j4663j2622l7675j15205P2672L2367K6918
$$ plain form
16675 -115454 -15850 152424 8772 -97488 -99645 6410 33565 9822 82605 51454 -20074
16664 -20074 26706 48452 -94223 -221131 -151436 -108355 46881 92042 -57237 -228465 -224344
16653 -224344 -249395 -341406 -341403 -205904 -216622 -207849 -138960 -20582 -38503 -82596 -83963 -141070
16641 -141070 -163797 -127554 11649 55399 -53935 -126128 -183043 -121029 -101956 -62882 -78727
16630 -78727 -54047 -9064 29061 -48538 -88602 -71739 -123328 -133395 -161272 -202851 -259888 -242895
16618 -242895 -242014 -332829 -267728 -202604 -200304 -226653 -210679 -333508 -266770 -219410 -231333 -161944
16606 -161944 -148722 -204393 -235675 -211891 -140632 -19391 -67368 -267924 -235083 -252379 -381681
16595 -381681 -381485 -303840 -200195 -131276 -128604 -143267 -155889 -193564 -308769 -236097 -203730 -176812
16583a76812j9223N6371J29384J06692j11234j24014P0077n0215M3192l4987q8257
16572a99026o2356k4316P5321N6287R2687P870l5155j04913n0696q5666O912J632
16560c21419M9616J0338j8356k6084J23783k0848N0586O1115M6580j17587K901
16549a59375R35M2045J37254j3177l1156n455n299k9199o0579M9231N1517o6447
16537h9705K9957Q3447o4288m8323j02966l169N4967K6181n8826J6826M6130p3535
16525a83304J4425k4367p1654J30234L4911j32209P3037J19641q0571l0570k6833
16514a77260j6670n9641N2655J19655k0050m9553L9091j2422Q9550o9790J591
16503a02844M63j04773N4066K4096l1856o8237K24115j9935o8508o1862Q0840
$$ plain form
16583 -176812 -196035 -139664 -10280 96412 -14822 -138836 -68759 -118974 -75782 -110769 -199026
16572 -199026 -261382 -285698 -210377 -154090 -61403 -53533 -88688 -193601 -244297 -329963 -323051 -321419
16560 -321419 -271803 -261465 -279821 -305905 -182122 -202970 -152384 -91269 -44689 -162276 -159375
16549 -159375 -158440 -116395 20859 7682 -23474 -28929 -34228 -63427 -124006 -74775 -23258 -89705
16537 -89705 -59748 23699 -40589 -88912 -191878 -195047 -140080 -113899 -172725 -155899 -109769 -183304
16525 -183304 -168879 -193246 -264900 -134666 -99755 -231964 -158927 -39286 -119857 -150427 -177260
16514 -177260 -193930 -253571 -200916 -81261 -101311 -150864 -111773 -124195 -34645 -104435 -102844
16503 -102844 -102381 -207154 -153088 -128992 -160848 -229085 -4970 -24905 -93413 -155275 -74435
16492g4435J20663M7085N0842p0736q6518p3095o0336N3790r886Q4011j19399
16481a38014j34613P5637n801J6421l0009P7436m6740p4634k8483Q4772J28205
16470g5823Q176M9351l1702j20977J41L8434k4119k7838p4794L986Q4245Q8133
16458h2787m3684m0977L4027k0461q9707R1977M1797j6941J1717J10781k0479
16447b4737J3185l3569m2179J6621K3978j2722L9810q652l4405o7454o1395N6049
16435a35470m9533O6042O8590J2597j5575m5740J31590J0062n0222j79910m2298
16424b29867M9950J32912j9551r875j4670n4112O0692M5839P502L7505k2556l897
16412b0128q882r7947r6626j10525Q3027J72945M0159k1963k9997l999O9473O963
$$ plain form
16492 -74435 46228 93313 144155 73419 -13099 -86194 -146530 -92740 -102626 -18615 -138014
16481 -138014 -272627 -196990 -202791 -186370 -216379 -138943 -185683 -260317 -288800 -204028 -75823
16470 -75823 -67647 -18296 -49998 -170975 -170834 -132400 -156519 -184357 -259151 -255165 -170920 -82787
16458 -82787 -126471 -167448 -133421 -153882 -243589 -151612 -109815 -126756 -115039 -4258 -24737
16447 -24737 -11552 -45121 -87300 -70679 -46701 -59423 -19613 -28265 -62670 -130124 -191519 -135470
16435 -135470 -185003 -118961 -50371 -37774 -53349 -99089 32501 42563 -7659 -187569 -229867
16424 -229867 -179917 -47005 -66556 -76431 -91101 -145213 -84521 -38682 -31180 6325 -16231 -20128
16412 -20128 -29010 -126957 -223583 -334108 -251081 -78136 -37977 -59940 -89937 -93936 -24463 -17500
16400a7500j7154j2372n737l7048o460n7937l2234n5554n2742M2696J9396N1033
16388a81613k0873n9610j7393k6839L7318L0682L803K0140n9104M6754k6123j63273
16376d16131J07666J76775l4463r3057l6343j9767J2633O062M5477m6519J04556
16365a93111M2534n6840o5356J41706M6211k0537r5712N7164M6644o08n9059J355
16353a55609R0034l9332M2262O8340j7560k3653r5650J9025N7200K3202l3786
16342f5527j02921J402r3723j0270m046J39242N9813N1002j71328j1129K9595
16331a77890q984P5206J33863N0604j06560j35266o4525l9761M2210O7937J83355
16320B0189k29n1264r8624q521k896j245J15775j0007m2896m5743n4384R8170
$$ plain form
16400 -17500 -34654 -47026 -52763 -89811 -96271 -154208 -186442 -241996 -294738 -252042 -232646 -181613
16388 -181613 -202486 -262096 -279489 -306328 -269010 -238328 -234525 -214385 -273489 -226735 -252858 -416131
16376 -416131 -308465 -131690 -166153 -259210 -295553 -315320 -302687 -296625 -251148 -297667 -193111
16365 -193111 -150577 -207417 -272773 -131067 -84856 -105393 -201105 -143941 -97297 -97905 -156964 -155609
16353 -155609 -65575 -104907 -62645 5695 -11865 -35518 -131168 -112143 -54943 -31741 -65527
16342 -65527 -168448 -167046 -260769 -271039 -275085 -135843 -76030 -25028 -196356 -207485 -177890
16331 -177890 -186874 -111668 22195 72799 -33761 -169027 -233552 -273313 -231103 -163166 20189
16320 20189 19960 -31304 -129928 -138449 -141345 -142590 -26815 -36822 -79718 -125461 -179845 -81675
16308h1675N6580N0513l8082n6160q8096K0232r141p3181N5330P9084P1834k0477
16296c3239j8547j1615q5340j03064n4600j1654J00791J15856K2500L9543R9024
16285E9655M522L0400j32746r1944l7673l6019L5423L0633J33589L4847j39548
16274a08861l5012P2152n0759L6712P4777L0873m9012k5329M6604J1859m9341
16263d5337j41507o1575L3999K1557k2296K8511r325k1755J89387K05868j2645
16252A64882j11442K0255k4788j03984o9909J05548n7370r7784j20581o3878J72879
16241a86172R2439l5759q0465o8304J2906J62052j03602o4530O709J18178R3730
16230e2818K3516R9994M5768j1004q8870N0016Q6846j1945J7492o3509p213j6990
$$ plain form
16308 -81675 -25095 25418 -12664 -68824 -156920 -136688 -145829 -219010 -163680 -84596 -12762 -33239
16296 -33239 -51786 -63401 -148741 -251805 -306405 -318059 -217268 -101412 -78912 -39369 59655
16285 59655 64177 94577 -38169 -130113 -167786 -203805 -168382 -137749 -4160 30687 -108861
16274 -108861 -143873 -71721 -122480 -85768 -10991 19882 -29130 -54459 -7855 4004 -45337
16263 -45337 -186844 -248419 -214420 -192863 -215159 -186648 -195973 -217728 -28341 177527 164882
16252 164882 53440 73695 48907 -55077 -124986 -19438 -76808 -174592 -295173 -359051 -186172
16241 -186172 -93733 -129492 -209957 -278261 -265355 -103303 -206905 -271435 -264726 -146548 -52818
16230 -52818 -29302 70692 116460 105456 16586 66602 153448 141503 158995 95486 88273 71283
16218G1283p2642K8930k4467P4941J01159q37n1770j5312r8035m1409K0327R45
16206f887q1045l2712l6477L5538m3457p611R6257P7687p9465L8070j626M5216
16194C488M7181l8246P0671j30920j08664L8158O8287M9981M8621J1698j57689
16183i7434k02737j30281L4768Q7442P2801j7165Q4648N3644l0847J9049l3972
16172a60084j40155n3327L075O6595k9246N9996K7467o7361J4140Q4878n4318
16161b48340J38879R0955J9518k1871n4245M4541m4148J3471L9370J4683m2840
16150e0027n6620J8045N9K1833k3364j0333j12621o8317J8939J1084J5043J30280
16138a05999K7580K8332j6403K9662J7589j38361k8965J7999N7985J2130L0173
$$ plain form
16218 71283 -1359 27571 3104 78045 179204 178367 126597 111285 13250 -28159 -7832 -6887
16206 -6887 -87932 -120644 -157121 -121583 -165040 -172651 -76394 1293 -78172 -40102 -41728 3488
16194 3488 50669 12423 83094 -47826 -156490 -118332 -50045 -64 48557 60255 -97434
16183 -97434 -300171 -430452 -395684 -308242 -235441 -252606 -167958 -114314 -145161 -126112 -160084
16172 -160084 -300239 -353566 -350491 -283896 -313142 -253146 -225679 -293040 -278900 -194022 -248340
16161 -248340 -109461 -18506 1012 -20859 -75104 -30563 -74711 -61240 -21870 -7187 -50027
16150 -50027 -106647 -88602 -88543 -66710 -90074 -100407 -213028 -281345 -262406 -251322 -236279 -105999
16138 -105999 -78419 -50087 -66490 -36828 -19239 -157600 -186565 -168566 -110581 -98451 -68278
16127f8278o4779j11389r57N1087N6295n2204P1718L8429j39225J0372M050n477
16115b10358J16576J48724R3562l6457m8933o5426R2522Q1683j4990o8155j06931
16104a8183l9500l0752m4514p8148Q8679J25701N6512p1617o5188L3131J41781
16093I7902J20149l2139j18314n5717K7j47693q5302M8498L928L5096R005J11
16081a24449J24226J88356l7372j97263M5815K1869Q7785P2998p0139l4421j15578
16070c8173M053J5884O368l4894p5846O6575q033k5632k0676J126m0352m7876
16058a97476R1063n818M171o3486J6761R83K3250J2776J19352l6434j05755m0223
16046a80836o0133J25909P7378n7066M4048m7194k5143J29476l8507p0593M8953
$$ plain form
16127 -68278 -133057 -244446 -245403 -194316 -138021 -190225 -118507 -80078 -219303 -208931 -204881 -210358
16115 -210358 -93782 54942 148504 112047 63114 -2312 90210 171893 156903 88748 -18183
16104 -18183 -57683 -88435 -132949 -211097 -122418 3283 59795 -11822 -77010 -43879 97902
16093 97902 218051 185912 67598 11881 11908 -135785 -221087 -172589 -168661 -133565 -124560 -124449
16081 -124449 -223 188133 150761 -46502 -687 21182 108967 181965 111826 77405 -38173
16070 -38173 -34120 -18236 -11868 -46762 -122608 -56033 -64066 -89698 -110374 -109248 -149600 -197476
16058 -197476 -106413 -112231 -108060 -171546 -154785 -153802 -130552 -117776 1576 -34858 -140613 -180836
16046 -180836 -240969 -115060 -37682 -94748 -50700 -97894 -123037 6439 -32068 -102661 -53708
16035e3708J251M7059J2112j59369k6781J48276J176l173p1937N8329M472j30210
16023a72503m4087K9188J58565P1944J3683P5133K880q2691j10775k4106K2727
16012f0042K3228n1616L8810L3640k8025J0043q571m566P4906M4048n6506J9475
16000C4824r4393j5546J10345J01688n0166l8619L2017j23325j4312j9918m768
15989h2173m3390k451n0692m9552J12403J78500J16474q3864m2613N0143J93l341
15977I9637l859j14459p4765J1549J06813J2258o0378k2502k8604j8686L5403
15966e7593J15840p8562p0399O8718P3005j9831l3391j8927q394m6976K7803N2568
15954C861m7773K0390m2666m0234l9590l8569P7934J20770o4260L6454k0742j89376
$$ plain form
16035 -53708 -52457 -5398 6714 -152655 -179436 -31160 -29984 -33157 -105094 -46765 -42293 -172503
16023 -172503 -216590 -187402 -28837 43107 56790 131923 134803 52112 -58663 -82769 -60042
16012 -60042 -36814 -88430 -49620 -15980 -44005 -33962 -42533 -47099 27807 71855 15349 34824
16000 34824 -59569 -75115 35230 136918 86752 48133 80150 -43175 -57487 -77405 -82173
15989 -82173 -125563 -128014 -178706 -228258 -115855 62645 179119 95255 52642 102785 102978 99637
15977 99637 95778 -18681 -93446 -81897 24916 37174 -23204 -45706 -74310 -92996 -57593
15966 -57593 58247 -20315 -90714 -21996 51009 31178 -2213 -21140 -29534 -76510 -48707 3861
15954 3861 -43912 -23522 -66188 -106422 -146012 -184581 -106647 14123 -50137 -13683 -34425 -223801
15942b23801N8106Q9530j06960O4017o0923m7372L273L0984P1054j352J43859
15931B0415L4727L829N4430o1710j72536L2482K3291k0683L2186n161l3430o5093
15919a57253p1986Q70k6476o643J23307R928n2592l4630J6112o2381N7262J54440
15907e0042K4561j07174J2554M5992P5075o5787R2488J07199j850p557k7435j9476
15895G8548J3057j2369Q966K3861K9652j0432N8151k2730n317N2981r4426n429
15883A14513n6736o4236J047p1474l1317l3549O8205l4141K7182L6722l7810o0702
15871a42296M4311N8885k5004j5834p536o5830K401P4930q2429Q769J7008o9630
15859b02255j4610m6961Q1217J71846M8695n9318m0297k5666J0266N0831M6102
$$ plain form
15942 -223801 -165695 -76165 -183125 -119108 -180031 -227403 -224130 -193146 -122092 -123444 20415
15931 20415 55142 58971 113401 51691 -120845 -88363 -65072 -85755 -53569 -58730 -92160 -157253
15919 -157253 -229239 -228369 -254845 -261488 -138181 -128253 -180845 -215475 -199363 -261744 -204482 -50042
15907 -50042 -25481 -132655 -120101 -74109 966 -64821 27667 134866 133016 125459 98024 78548
15895 78548 91605 79236 88202 112063 141715 131283 189434 166704 161387 214368 119942 114513
15883 114513 57777 -6459 -5412 -76886 -108203 -141752 -73547 -107688 -80506 -43784 -81594 -142296
15871 -142296 -97985 -39100 -64104 -79938 -87474 -153304 -150903 -75973 -158402 -149633 -132625 -202255
15859 -202255 -216865 -263826 -182609 -10763 37932 -21386 -61683 -87349 -77083 -26252 19850
15848A9850J1851q0387K2812J00888m6649n7301m919M0499l3902M1061O2590L0495
15836A06888j26456M0764r6252l2773K4318l925k2839j36055L0132j276M3497
15825a73977K3811k02765j19727J82549J41104P4543J41632J7053k1422L4274
15815I7075J3902j4456q0122M2928O5006j6416j1950q4609o1045P0664N0016Q8477
15803A59470L9194M192N9653q3742j30375k6890p6069l3185k606N5342j53154
15792a88170j4061P3425j1209j35694r56J50552J33218R6310m4095l2992N4162
15781H0490L9533l2086O246j45175j18694J5860K4771l8634O4273L9478N7455
15770f483N3297Q2122j23519q2787k0328K1783Q4370j170j33816k3029O4912R8247
$$ plain form
15848 19850 31701 -48686 -25874 75014 28365 -28936 -33855 6644 -27258 13803 76393 106888
15836 106888 -19568 21196 -75056 -107829 -83511 -87436 -110275 -246330 -216198 -217474 -173977
15825 -173977 -150166 -352931 -472658 -290109 -149005 -74462 67170 84223 62801 97075
15815 97075 110977 96521 16399 59327 124333 107917 95967 11358 -49687 20977 70993 159470
15803 159470 198664 202856 262509 178767 48392 21502 -54567 -87752 -90358 -35016 -188170
15792 -188170 -202231 -128806 -140015 -275709 -276665 -126113 7105 103415 59320 26328 80490
15781 80490 120023 87937 94183 -50992 -169686 -153826 -129055 -167689 -103416 -63938 -6483
15770 -6483 46814 128936 5417 -77370 -97698 -75915 8455 7285 -126531 -149560 -84648 13599
15758A3599M7878r3308q8761l2334K1560Q6553P0754J4738K2642L6461j36646
15747c6864M2601L8149k4018o2829j8834m4077l7656j02281n807l511L3281N9798
15735a62048M3726j72629K1918N1252J36688M9873l9872m9865m9707r8497k3035
15724b92196L3325M2297O9232J15420O2083j1049p0911P146l764l6487p9508J71820
15712G408M8886r2478o8810K414L7736J7727k1036j17242r2778N9467J69651P5217
15700B6162k0372j3297N6964J12686N78r3548j1983l5784k5152k6313l2537R1643
15688B9047J00266k5705j26212K7910J58205J16341q3323j40246q4295n0220k4082
15677a02314J0440J987N3271M066M6862J6371M6140l1236n8671r4117K5048J32941
$$ plain form
15758 13599 61477 -31831 -120592 -152926 -131366 -44813 25941 40679 63321 99782 -36864
15747 -36864 5737 43886 19868 -42961 -61795 -105872 -143528 -245809 -251616 -255127 -221846 -162048
15735 -162048 -118322 -290951 -269033 -217781 -81093 -31220 -71092 -120957 -170664 -269161 -292196
15724 -292196 -258871 -216574 -147342 -31922 30161 19112 -51799 -44653 -48417 -84904 -164412 7408
15712 7408 56294 -36184 -104994 -102580 -64844 -47117 -68153 -185395 -278173 -218706 -49055 26162
15700 26162 5790 -7507 49457 162143 162721 69173 57190 21406 -3746 -30059 -62596 29047
15688 29047 129313 103608 -22604 5306 163511 279852 196529 56283 -28012 -78232 -102314
15677 -102314 -91874 -89887 -36616 -32550 14312 30683 76823 45587 -13084 -107201 -82153 50788
15665E0788m9153m34O920O9055P2108j52937o5458J01085m0216k797L8322l1566
15653d283j95002L1110N2842L8146R5754K5555l0842o1946j8787j3131j03454
15642a84038N8913l6919L1639j4024R4386L9484m309p6141l8702J2022K1787Q2206
15630a3696R4680J2547j8127J1918q3898M2300j1051j18179q7502L6694p037k5163
15618a66514L1508L8961O1097N8638N6769r5451j32575j8955N6162P1004R7926
15607E8570J3252j03792L613P0414J126K2969p3641o4250j9880J73972j8042k5073
15595C9238o0193m2618j7579k1731j9580m3741k3744n0930Q9405q358n5078K7598
15583a87311R7630J07970J46244M5886j14807l8850M0999l0418Q6525n2203r5035
$$ plain form
15665 50788 1635 1201 8121 77176 149284 -3653 -69111 31974 -8242 -11039 27283 -4283
15653 -4283 -199285 -168175 -115333 -77187 18567 44122 13280 -48666 -67453 -80584 -184038
15642 -184038 -125125 -162044 -130405 -144429 -50043 -10559 -14868 -91009 -129711 -117689 -95902 -13696
15630 -13696 80984 93531 75404 87322 3424 45724 34673 -83506 -171008 -134314 -141351 -166514
15618 -166514 -135006 -96045 -34948 23690 80459 -14992 -147567 -166522 -110360 -39356 58570
15607 58570 71822 -31970 -28357 42057 43183 66152 -7489 -71739 -91619 82353 64311 39238
15595 39238 -20955 -63573 -81152 -102883 -122463 -166204 -189948 -240878 -151473 -159831 -214909 -187311
15583 -187311 -89681 18289 164533 210419 95612 56762 97761 67343 153868 101665 6630
15572F630P9264j79209j01155L9077L875R079Q982R488p5193Q9613O0168R0190
15560D0809p5481j80840j8185R9752L5398j218P8986Q6296o5331m9627O1656m0848
15548b8633J1003R1717k1687j16216j14079R8419P0891j7849l1262q2366l2635
15537a72697N9473K4642O7114M7882l5009q8491J6676p221N9325K4503j93066
15526a96869q2629K2560Q0259L7920J03772R08n0029l7109n6236O1893J09289
15515f271o616q2704K4564j01333P2590K9272J6124R0116j2614M7476l6160L2105
15503F6549q8609l9386M1115k764o2675N8601N3799l484j5914j08275n8947J9941
15491a40049j4934l8226N4884J11714J4937J0336l0810k26363k5643P8017P4910
$$ plain form
15572 6630 85894 -93315 -194470 -155393 -151518 -142439 -133457 -123969 -199162 -109549 -49381 40809
15560 40809 -34672 -215512 -233697 -133945 -98547 -99765 -20779 65517 186 -49441 12215 -28633
15548 -28633 -17630 74087 52400 -63816 -177895 -79476 -8585 -26434 -57696 -140062 -172697
15537 -172697 -113224 -88582 -21468 26414 -8595 -97086 -80410 -87631 -28306 -3803 -196869
15526 -196869 -279498 -256938 -176679 -138759 -34987 -34079 -84108 -121217 -177453 -115560 -6271
15515 -6271 -12887 -95591 -71027 -172360 -99770 -70498 -54374 35742 23128 70604 34444 66549
15503 66549 -22060 -61446 -20331 -23095 -85770 -27169 26630 23146 7232 -101043 -159990 -140049
15491 -140049 -154983 -193209 -138325 -26611 -11674 -1338 -32148 -258511 -284154 -206137 -131227
15480a31227K7601O053L046K5853n9137p9874l1831M36j2370N2087M5864N6363
15468i7136J8473L42M2507P8975q2330j14288l3497o8695j08229L5710J89148
15457a39020L0781n666K1635j2056P4267l9844l1309Q728P8809L643p2353J0343
15445g2042Q9210j8327o7770k6710M3678j01462m9812m8461L098L2108o704N196
15433b17998j2202j10023N4754Q0789Q2543K9750P1616k068l0810k8344m1190
15422a23183P6721K3820K7634p3567r7131m5582J33448P8809L0568m5464o8952
15411h2879k4263n2391R1635J14288K3917m3425o4706J2505m7839J4972K2453
15400c5733m1913J11383R9288k00396j12306m7897o9700J09729J37327N4582k7363
$$ plain form
15480 -131227 -103626 -97573 -94527 -68674 -127811 -207685 -239516 -239080 -251450 -199363 -153499 -97136
15468 -97136 -78663 -78321 -35814 43161 -39169 -153457 -186954 -255649 -363878 -328168 -139020
15457 -139020 -108239 -113905 -92270 -104326 -30059 -69903 -101212 -92484 -13675 -10032 -82385 -72042
15445 -72042 17168 -1159 -68929 -95639 -51961 -153423 -203235 -251696 -248598 -216490 -223194 -217998
15433 -217998 -230200 -340223 -285469 -204680 -122137 -92387 -20771 -22839 -53649 -81993 -123183
15422 -123183 -46462 -22642 4992 -68575 -165706 -211288 -77840 969 31537 -13927 -82879
15411 -82879 -107142 -159533 -67898 46390 70307 26882 -37824 -25319 -73158 -58186 -35733
15400 -35733 -77646 33737 133025 -67371 -179677 -227574 -297274 -187545 -50218 4364 -22999
15389b2999J3240j24525j44580o6699J04081Q3473M3829R6308k4586L0090j2730
15378b5098M9102k3811J8845L6275J7354L7329J43026Q73j38348Q0369n880J0158
15366B00194q2909k2678k8028j69179M3655q1251r7997m488J63142J07761Q0792
15355A09014o8760p9851q5502J50176k240m3389m1142r0724K7727J9786J19777
15344A4872j2544j4706m4274p0526J03433K03671R0660j16613n1632Q943j00147
15333A1137n6902M8212O1370Q7893j51241j42199p0930j07420q0889O7146J69173
15322a64650K4374M6646j71q3357M8682R3231Q6981o6194j6547p8636J4438R137
15310h6066N1003J9442K7652r923r5595l4314r5505k1593j1766N4975Q1162p797
$$ plain form
15389 -22999 -9759 -134284 -278864 -345563 -241482 -158009 -114180 -17872 -42458 -12368 -25098
15378 -25098 24004 193 19038 55313 72667 109996 253022 253895 115547 195916 190036 200194
15366 200194 117285 94607 66579 -102600 -58945 -140196 -238193 -242681 -79539 28222 109014
15355 109014 40254 -39597 -125099 25077 22837 -20552 -61694 -152418 -124691 -104905 14872
15344 14872 2328 -12378 -56652 -127178 -23745 179926 270586 153973 102341 111284 11137
15333 11137 -45765 2447 63817 151710 469 -141730 -212660 -320080 -400969 -333823 -164650
15322 -164650 -140276 -93630 -93801 -177158 -128476 -35245 51736 -14458 -31005 -109641 -95203 -86066
15310 -86066 -35063 -15621 12031 2108 -93487 -127801 -223306 -244899 -256665 -201690 -120528 -128325
15298a28325o2553n9486O6916J06460P4229N5876N0430r0524r3498K4097Q704
15287d7674l955o088n3938J19637O4958q2631q2187J3631n58k8580r2953J03074
15275i7264P8860Q548r9165L1994O383o8579K3101J06145N4632k3522j2021L3235
15263D2347L8598l5542q5191l9877P5449N8897o1825o0113j02646k8773J10225
15252h8451L0541m4112J65007R2085r0991k9352J0376r2019j03363k9351N5193
15241a24437J18721O7786K590n2874o4445j897K8273m1879K7768P015L5705M7900
15229E0226k6271j8266K1465J09621J28874k6156p7152j03915j03839N9724J9248
15218C3559R5670R8319l7647r4177j32192l0515M2857o9865L8303J6780k5210
$$ plain form
15298 -128325 -190878 -250364 -183448 -76988 -2759 53117 103547 13023 -80475 -56378 -47674
15287 -47674 -51629 -57717 -111655 7982 72940 -9691 -91878 -78247 -78805 -107385 -200338 -97264
15275 -97264 -18404 -9856 -109021 -77027 -70644 -139223 -116122 -9977 44655 21133 9112 42347
15263 42347 80945 45403 -39788 -79665 -4216 54681 -7144 -67257 -169903 -198676 -88451
15252 -88451 -57910 -102022 62985 155070 64079 34727 45103 -46916 -150279 -179630 -124437
15241 -124437 -5716 62070 64660 11786 -52659 -54556 -26283 -68162 -40394 -33379 2326 50226
15229 50226 23955 5689 27154 136775 265649 239493 162341 58426 -45413 14311 33559
15218 33559 129229 227548 189901 95724 -36468 -66983 -24126 -93991 -55688 -38908 -64118
15207f4118L3799J04767J4497n269o5678r4683m1180k5234J26041J35655K1447
15196A40044m6422O739L0293J7549L7576n1470j74095l5297M1797J5421j0228
15185b8093L1352r3393k9065N019j4142P7395J84191K4739L177J318p4857l4304
15173E3337p1281j7270Q3035m711M3749j12677o1768j11789L4485l1212J35836
15162f0266Q9879j27997o7319N4673r506Q888Q8408Q0203N557k0716N5667n2014
15150D5457j82873L908J33405j7673q9148l5109j6357N9443J01044M8439k6279
15139B4257o929q5074k3885J12102J1007q2998k716o9752q311P3271J09913O5309
15127A16194n3115j85547J6469J14380M3112m6268p6886k0302M1511n3430j41044
$$ plain form
15207 -64118 -30319 74448 88945 83676 17998 -76685 -117865 -143099 -17058 118597 140044
15196 140044 93622 100361 130654 148203 185779 134309 -39786 -75083 -33286 -17865 -28093
15185 -28093 3259 -90134 -119199 -114180 -128322 -50927 133264 158003 161180 162498 87641 53337
15173 53337 -17944 -35214 47821 43110 86859 -25818 -87586 -199375 -164890 -196102 -60266
15162 -60266 29613 -98384 -165703 -111030 -120536 -111648 -23240 56963 62520 41804 97471 45457
15150 45457 -137416 -133508 -103 -17776 -106924 -142033 -158390 -98947 2097 50536 24257
15139 24257 17328 -67746 -91631 20471 31478 -51520 -54236 -123988 -132299 -59028 50885 116194
15127 116194 63079 -122468 -105999 8381 51493 5225 -71661 -91963 -50452 -103882 -244926
15116b44926m5687Q4649J54756k7142j8701l4279m3907M8686R7456k917o1469
15105i3481r9765j7433l0459q4277J54188Q2065m6457M6305o414k4334o0666Q2732
15093i7996R4517Q5106k9637J4075R316m0592n8741k8974n2300Q5677L9675p0585
15081e0459j15605M3399J12079O211J4726J03937k8128o9752k672L5745j5598
15070C3883J5273K746Q2062L4675j86841r2432Q8864M9613j932o5473p4147P4740
15058c8969M3107n4469L5029J5321j14729O5327M4197J4071j08153l2593R472
15047a22389K1781N3519J17933K9244n5936l8461J7809k0746q5634R420N892q8768
15035a56336N3705L7394R8721Q4933K3039J10027j8579j38337l3876K6684j03902
$$ plain form
15116 -244926 -290613 -205964 -51208 -78350 -97051 -131330 -175237 -126551 -29095 -32012 -93481
15105 -93481 -193246 -210679 -241138 -325415 -171227 -89162 -135619 -89314 -95728 -120062 -180728 -97996
15093 -97996 -3479 81627 51990 66065 75381 34789 -23952 -52926 -105226 -19549 20126 -50459
15081 -50459 -166064 -122665 -10586 -4375 10351 114288 86160 16408 13736 49481 33883
15070 33883 49156 51902 133964 168639 -18202 -110634 -21770 27843 25911 -39562 -113709 -38969
15058 -38969 4138 -50331 -15302 19 -114710 -49383 -5186 8885 -99268 -131861 -122389
15047 -122389 -100608 -47089 70844 100088 44152 5691 23500 2754 -82880 -73460 -67568 -156336
15035 -156336 -102631 -65237 33484 118417 141456 251483 232904 94567 60691 87375 -16527
15024a6527r6951M3070j9575p0482L7266J9877M0102M3836l864K8705n7080K287
15012d9336j1284j7719m4941l3586n6294m204O0434r4011J41349Q7580J4594m0810
15000d8228j03106o0368M7627J01117P4358k4510r9477m5320J8306J37828p4996
14989g6769K9391J22805l4455n4306o1503l0733O2120P238j06592p2271Q4452
14978a30623N3852J12199P277j33109j1361l635J8550l7224j0900L9453j25471
14967b20992o4195k0017L6125q8781n5911R4574J12050J52057P4303k9071L3116
14956B3258j464l6173q9142j424M3633N4036l5124K9715k4119n691P494N1208
14944A6207O6142M4979j2062R3610n8031l3878M163J43224r4817r6594l2526o1930
$$ plain form
15024 -16527 -113478 -70408 -89983 -160465 -123199 -103322 -63220 -19384 -23248 5457 -51623 -49336
15012 -49336 -60620 -78339 -123280 -156866 -213160 -217364 -156930 -250941 -109592 -22012 -7418 -48228
15000 -48228 -151334 -211702 -164075 -62958 11400 -13110 -112587 -157907 -139601 -1773 -76769
14989 -76769 -47378 75427 40972 -13334 -74837 -105570 -43450 -36212 -142804 -215075 -130623
14978 -130623 -76771 35428 42705 -90404 -101765 -105400 -86850 -124074 -134974 -95521 -220992
14967 -220992 -285187 -305204 -269079 -357860 -413771 -319197 -207147 -55090 19213 -9858 23258
14956 23258 21794 -14379 -103521 -104945 -61312 -7276 -42400 -12685 -36804 -42495 -35001 16207
14944 16207 82349 127328 115266 208876 150845 116967 121130 264354 169537 72943 40417 -21513
14932b1513o2413j2360j53368O5294J46453L1273O2932R490l3747j8673n0653
14921c7285K7237R0927Q6223L0659n1053J00L5327j11400q3615m696K3277K3304
14909B9005J0132o3512o7564J37629J3943j25914L5254R6291P028p3565r3891
14898i5164J2347Q6800n5801l0860L1346O9751M4074J8838O2836j02433r0652
14887d8918N2010J02759l3401r3459r99k107p264j937J28747M6689p2849j04886
14875c5615l900K8157q1800J23019R1838m252o6514o6945l8976l3459J02038M7786
14863F1377l9576n0487L6288k909o6871R0976J42965k8190j35888J8891P6344
14852A02920o9722j7906n3216m5084K5615m5281j16480J5678J17021O2662N7687
$$ plain form
14932 -21513 -83926 -96286 -249654 -184360 -37907 -6634 56298 65788 32041 13368 -37285
14921 -37285 -10048 80879 167102 197761 146708 146808 182135 70735 -12880 -17576 5701 29005
14909 29005 39137 -24375 -91939 45690 59633 -66281 -31027 65264 72292 -1273 -95164
14898 -95164 -82817 3983 -51818 -82678 -51332 18419 62493 81331 144167 41734 -48918
14887 -48918 3092 105851 72450 -21009 -22008 -24115 -31379 -33316 95431 142120 69271 -35615
14875 -35615 -39515 -11358 -93158 29861 121699 117447 50933 -16012 -54988 -88447 13591 61377
14863 61377 21801 -28686 7602 4693 -62178 28798 171763 143573 7685 26576 102920
14852 102920 33198 15292 -37924 -83008 -57393 -102674 -219154 -203476 -86455 -23793 33894
14841C3894J18100o2398l7432L0277L9354q702j1945l6377M5560J5391J3589M2671
14829A81982L0616j26552p1038n659p3390k6739N8515M7528m8103n5584J12169
14818B3745J19461k3490J7813q477J3258o9895k02773p846J63034M5461J13111
14807A83402N4247k5398q2331l4480N3271m0165j50481j06058q6164K04311M5504
14796A5658r4617j8979q918O8948j2634J07186M1007j4921r8165q5794K9061J5384
14784e6784K9794N2807M0156J6019J6779q044n0738k3359O671Q5453M0082l3341
14772A15495j3092n3020p733N9444J01946l6056O362J11723K8171j15037j33507
14761F4696p7328j56207r1101J1700P6636r433M426L2299L023j6587N5971J083
$$ plain form
14841 33894 151994 89596 52164 82441 121795 113093 101148 64771 110331 125722 139311 181982
14829 181982 212598 86046 15008 9349 -64041 -90780 -32265 15263 -32840 -88424 23745
14818 23745 143206 119716 137529 129052 142310 72415 -130358 -138204 24830 70291 183402
14807 183402 237649 212251 129920 95440 148711 108546 -41935 -147993 -234157 -29846 15658
14796 15658 -78959 -97938 -106856 -37908 -50542 56644 97651 82730 -15435 -101229 -72168 -56784
14784 -56784 -26990 25817 65973 81992 98771 90727 39989 16630 23301 108754 148836 115495
14772 115495 102403 49383 41650 101094 203040 166984 173346 285069 313240 198203 64696
14761 64696 -12632 -168839 -259940 -248240 -171604 -181037 -176611 -144312 -141289 -157876 -101905 -100822
14749a00822J26354O2274q8324l3921p425L2782p7238j04789J7532J04107o4567
14738a34037Q5821K8137P1369l9740m0968k188J7336k7205j2988K4R2112R8977
14726A36650J01956j93081j39871Q1817J07793o1003p5844p4357K3493L0590O3965
14715B108r3754p1093M1334J07148J51518j2967n3917k6056R6851K471j51050
14704g407j03438R2283P0496J1492k7803M7909N1659l1099j00986o548N9214L9162
14692I4934j66674j25711j22808R1591J44443N4738k3791j19426M5994R8980j6247
14681d3977K8073J09127j09807m7256p4268M3651O9228J04382J5179K8957N3814
14670A77103M8816j26013L728k9974L344J8546N0205p8317j40885J018j9381J12184
$$ plain form
14749 -100822 25532 87806 -518 -34439 -41864 -9082 -86320 -191109 -173577 -69470 -134037
14738 -134037 -48216 -20079 51290 11550 -29418 -31606 -14270 -41475 -54463 -54439 37673 136650
14726 136650 238606 45525 -94346 -12529 95264 34261 -41583 -115940 -92447 -61857 2108
14715 2108 -91646 -162739 -121405 -14257 137261 124294 70377 44321 141172 143643 -7407
14704 -7407 -110845 -18562 51934 63426 35623 83532 135191 104092 3106 -3442 55772 94934
14692 94934 -71740 -197451 -320259 -228668 -84225 -29487 -53278 -172704 -126710 -27730 -43977
14681 -43977 -15904 93223 -16584 -63840 -138108 -94457 -25229 79153 94332 123289 177103
14670 177103 225919 99906 103634 73660 77004 95550 145755 67438 -73447 -72429 -91810 20374
14658B0374O5454o043O9994j06604p0184j01908K2130R3434m614q671Q6066J05941
14646A65369o9148Q615M1318r796j65042O1186J126l4070k3950J30760j4152r4927
14634b711L9888o6538r5515N2595J6894l8846r4006j3888J2194P2969K03604p6179
14622A0461m9877L3533K7068l9426q6577M3033Q4237R14o4741O570J39401O8004
14610A72600p0825j07034j78743l8519J8096J97187L3723o9491R121J0096J741
14599b2048J8191k0959J0864K4632L6076Q0290N3737m0255j01202j6873o2793
14588d0340n3308M8450Q9204J2966j46881o1934Q3588J14614Q055o0592j56746
14577a62924J32975K42864L1197q7268j28180k9333j1196J28239O3348m7604j48341
$$ plain form
14658 20374 85828 79785 149779 43175 -27009 -128917 -106787 -13353 -17967 -26638 59428 165369
14646 165369 96221 104836 146154 136358 -28684 32502 33628 -442 -24392 106368 92216 -2711
14634 -2711 37177 -29361 -124876 -72281 -55387 -94233 -188239 -202127 -189933 -116964 86640 10461
14622 10461 -39416 -5883 21185 -18241 -104818 -61785 22452 23366 -41375 -34805 104596 172600
14610 172600 101775 -5259 -184002 -222521 -204425 -7238 26485 -43006 -33885 -23789 -22048
14599 -22048 -3857 -24816 -13952 10680 46756 127046 180783 140528 39326 22453 -40340
14588 -40340 -93648 -45198 44006 56972 -89909 -151843 -68255 46359 54414 -6178 -162924
14577 -162924 -29949 212915 244112 156844 28664 -669 -11865 116374 179722 132118 -16223
14566a6223k0953J454l6602k2276M9142J24574P879l5379Q4718j9078M418o0670
14554F1004k3532J00336j6329o8534K6775L2201O2928j16178j41174J14924o2093
14543b9672m7437O4659o1700P045L985m7577N7967J03120K01694M5675j24748
14532A73011j18795j02798m3078l709n3343L1958M4393J49736J48580J2624j12246
14521A26333p2499j43060m4903j1045K9112K3495R6001Q6538O9947M3555p5094
14510A28380p6477p125m9661M959M7514L9058J31893O2244o5352j20649p0198
14499B4586m7829Q5693j9742R7595m9206l4380P3237J12274J7514q3087j37614
14488C9041O0599k6839p6171m4788n4309P5195L6535N1448j26367j26900N2401
$$ plain form
14566 -16223 -37176 -35722 -72324 -94600 -45458 79116 86995 51616 136334 117256 121674 61004
14554 61004 37472 137808 121479 52945 79720 111921 174849 58671 -82503 32421 -29672
14543 -29672 -77109 -12450 -74150 -67105 -63120 -110697 -52730 50390 252084 297759 173011
14532 173011 54216 -48582 -91660 -95369 -148712 -116754 -72361 77375 225955 238579 126333
14521 126333 53834 -89226 -134129 -145174 -116062 -92567 3434 89972 159919 203474 128380
14510 128380 51903 44778 -4883 76 47590 86648 218541 280785 215433 94784 24586
14499 24586 -23243 62450 42708 140303 91097 56717 129954 242228 259742 176655 39041
14488 39041 99640 72801 -3370 -48158 -102467 -27272 9263 60711 -65656 -192556 -140155
14477a40155R2836J90135J0050j68680M617J1012K339M7681N212r6658J5890Q3260
14465E7539K8930L5451m7512j78841p5847J039K21439K5350o0306k1391n138P731
14453a1556l3907k527N6366M1293r696j26586p2375Q4509r2523k6322O9985Q315
14441a15024j1196N1973J55046N0047Q486L2580m1663q1180n9105q3686K7137
14430f6585L4812k0565l3439M3328M991o4211N1176Q0735l3852j03831j9934J20191
14418g184L4324o5162l7762O8586k9780L3455J23613j3499M0806J13157J2055
14407B72609k07197j73436P5720J89396O9670k201r8403O9924o9472K9188N751
14396A61549r182R7089j9554q5365J3081L5589j66307o3436R5327L3795J517p2127
$$ plain form
14477 -140155 -47319 142816 152866 -15814 -11197 -185 2154 49835 55047 -41611 -25721 57539
14465 57539 86469 121920 74408 -104433 -180280 -179241 42198 67548 7242 -14149 -19287 -11556
14453 -11556 -45463 -47990 8376 49669 39973 -86613 -158988 -74479 -167002 -193324 -123339 -115024
14441 -115024 -126220 -74247 80799 130846 139332 171912 130249 49069 -10036 -93722 -66585
14430 -66585 -31773 -52338 -85777 -42449 -37458 -101669 -50493 30242 -3610 -107441 -127375 -7184
14418 -7184 27140 -38022 -75784 -7198 -36978 -3523 120090 106591 147397 260554 272609
14407 272609 65412 -108024 -32304 157092 226762 224561 126158 196082 126610 155798 161549
14396 161549 152367 249456 229902 144537 157618 193207 26900 -36536 58791 92586 94103 21976
14384B1976j44928K685K279o5330O2990P4242K5519L1828M2662l471L4946k0510
14372F4888p1139k3276K1686J3921m4475L5427q7978J8959n2268m5377O5450J01132
14360c050N2965k5673n6937O378L0212K7239J48261N5207p4280k34539m2355J40286
14348B3714J12993L7702L5139l8326q6667p8915Q438l2181K6960m4380j12445
14337a47968K2164n1410J34371J02722j0708j29238p734K01385Q6406M5086j0797
14326B34279j52809l7966L4913J32754o491l6220n1708p3438p9275P8856K02070
14315B44965K3411n2468j64652l360J1603L053k216K2229k5458p1956n7426Q3774
14303A1499j2726q270Q4558J38710P0673Q831j20623J7299n7399o0881k6497L9859
$$ plain form
14384 21976 -122952 -120267 -117988 -183318 -120328 -46086 -20567 11261 53923 50452 85398 64888
14372 64888 -6251 -29527 -7841 6080 -38395 -2968 -90946 -71987 -124255 -169632 -104182 -3050
14360 -3050 49915 24242 -32695 -26317 3895 31134 179395 234602 160322 -74217 -116572 23714
14348 23714 136707 174409 209548 171222 84555 5640 14078 -18103 8857 -35523 -147968
14337 -147968 -125804 -177214 -42843 59879 49171 -80067 -87801 113584 199990 245076 234279
14326 234279 81470 43504 78417 211171 204680 168460 116752 43314 -35961 42895 244965
14315 244965 268376 215908 51256 47896 59499 62552 60336 82565 57107 -14849 -72275 11499
14303 11499 -1227 -9497 75061 213771 284444 293275 172652 189951 132552 71671 45174 85033
14291H5033J14315J33809n7628n6350o216l107k9307j9613n6480q6492k2655P5854
14279G1163k8194O6893j977q4620L580P644R4417j7526m4150m1309j10516n8404
14267a42999P0526J52624O0110l1937o0224Q4546J21692r4872j16279L9168L6832
14256A19187n367j3571n4606K3939J4264O9276K8P6631K4520r8277M3869O8590
14244B68483k3741r8217p2625n5616K3159o0719J04297Q3434n3168j8376L4009
14233A30920n4020j02840O4506P1977n6877m9301R9772l182j9905N7560K9074
14222A67684l0374l9157j2574L8701J7138k05K4992N386j36072q4834R7612J2158
14210F0455r2626q3509J5668m1390J36810J18749L1362o5306J7429J9441P6156
$$ plain form
14291 85033 199348 333157 275529 219179 212963 209856 180549 160936 104456 17964 -4691 71163
14279 71163 42969 109862 107885 23265 26845 34489 128906 111380 67230 25921 -84595 -142999
14267 -142999 -72473 80151 140261 108324 48100 132646 254338 159466 43187 82355 119187
14256 119187 113820 100249 45643 69582 83846 153122 153150 229781 254301 156024 199893 268483
14244 268483 244742 146525 73900 18284 41443 -19276 85021 168455 115287 96911 130920
14233 130920 76900 -25940 38566 110543 53666 4365 104137 100955 81050 138610 167684
14222 167684 137310 98153 85579 124280 141418 141213 166205 171591 35519 -49315 48297 60455
14210 60455 -32171 -115680 -100012 -141402 -4592 114157 145519 80213 97642 117083 193239
14199A93239J5171o4109j30418n8335J6520J74245M7689j21021p7816L8303j8737
14188A4731j6077K9578n1523k4642J12283Q2993J6546J3339k053j02966P7953
14177A50162L8014k1794N2008J5919r7622j36689J8218l891k7862O1797K6344
14166G4604K5243L6000J74217J31205j36509j61554M7673o545j03629J0839R0520
14155A82064P1152n9375k7510L7105K2106j3634N0568j1039q3354j20915k8054
14144A9114p4473j30313R7119J05269K8765r2380O2177J84653p422p8463o1331
14133E2715k8417O6181p919q1046J0160m3160k8564J26018J4959L1401K0951L5785
14121A69064l0084k9246m1873K7332Q9420j2058l8698Q9500M1089j04696r8400
$$ plain form
14199 193239 208410 144301 13883 -44452 -27932 146313 194002 72981 -4835 33468 14731
14188 14731 -1346 28232 -23291 -47933 64350 147343 163889 177228 175175 72209 150162
14177 150162 188176 166382 218390 234309 136687 -2 18216 14325 -13537 48260 74604
14166 74604 99847 135847 310064 441269 304760 143206 190879 184334 80705 91544 182064
14155 182064 253216 193841 166331 203436 225542 211908 262476 251437 168083 47168 19114
14144 19114 -55359 -185672 -88553 16716 45481 -46899 15278 199931 192509 114046 52715
14133 52715 24298 90479 82560 1514 11674 -31486 -60050 65968 80927 112328 133279 169064
14121 169064 138980 109734 67861 95193 184613 172555 133857 223357 264446 159750 61350
14110F1350l1013j4599Q5612r3055k2542O3683J22050K26807L7167o429j34267
14099B94764q5508j48095o8774l5948j73324J05416J99287k1102J46586k4367
14089A88935j16717K2724j4243R3050Q0795j39176l682O5283j04614J5454O695
14078I4504m6880k0849Q2228J32022L9044l872j09117j91273r3820J20419R4681
14067I7087Q9963L5018m5040j19839m0375K2166o2888j9490N0942N7882k0899
14056D4527O4804q8512n2503R3621O1202R631M2992p9538j07307J53855l7264
14045A05508o3894K5024J18186O7629o0706l5005o987n4259l9607L8861r9915
14034e165n9297O1142J1609J4967R9181R62J21816l6610j31484L5118O5170J1128
$$ plain form
14110 61350 30337 15738 101350 8295 -14247 49436 171486 398293 435460 429031 294764
14099 294764 209256 61161 -7613 -43561 -216885 -111469 87818 66716 213302 188935
14089 188935 72218 94942 80699 173749 254544 115368 111686 176969 72355 87809 94504
14078 94504 47624 26775 109003 241025 280069 276197 167080 -24193 -118013 2406 97087
14067 97087 187050 222068 177028 57189 16814 38980 -23908 -43398 7544 65426 44527
14056 44527 109331 20819 -31684 61937 123139 132770 175762 96224 -11083 142772 105508
14045 105508 41614 66638 184824 252453 191747 156742 149755 95496 55889 94750 -5165
14034 -5165 -64462 -3320 8289 23256 122437 123399 245215 208605 77121 112239 177409 188537
14022A88537l2231M4292J02506j343n3278o9416n7450l0381p2641N487L934N7629
14010H5645N9321j4883k8311q736J5431o374M5890M3311o3384M21J00955j1388
13998B17898j25571p0358m1692L968J46780j5605r67r049n6672O4805j7293j5971
13986H0273O5528n9036r933O9607L7750O9899q6243q8522R4869j6036j0512k036
13974A45608O338L4098o5777j190J9905q728M7221P428k01001O60J93548j7677
13962A60433m0113J01940p7942R983N1650O2606p3831o6963K8187K3300K7926
13951B07176L883p587R0644M0395k8170o8117j23420m8688Q781M8651n9102J8341
13939H2787Q3941L7864m2804m5333M7681q558Q409p5051J15197j9558j19352l1663
$$ plain form
14022 188537 156306 200598 303104 301761 248483 179067 121617 91236 18595 24082 28016 85645
14010 85645 144966 130083 101772 93036 108467 102093 147983 191294 127910 128331 229286 217898
13998 217898 92327 21969 -19723 -15755 131025 115420 114453 105404 48732 113537 96244 80273
13986 80273 145801 86765 76832 146439 184189 254088 167845 79323 174192 158156 147644 145608
13974 145608 151946 186044 120267 119077 138982 130254 177475 184903 -16098 -15438 178110 160433
13962 160433 120320 222260 144318 154301 205951 268557 194726 127763 155950 179250 207176
13951 207176 211059 203472 294116 334511 306341 238224 114804 66116 74897 123548 64446 82787
13939 82787 166728 204592 161788 116455 164136 155578 163987 88936 204133 184575 65223 33560
13927C3560J32522j6302m7833K3265M3262n4667l3332J3244o51n5658N9568N2178
13915A49156n7903p7555J22149R5444J7791o6668o2093R6399O205j05072k6844
13904I1009P8948M6674p6950q5409P3773J2769k9801Q254l8807P4929m64M558
13892A59483L3203K8670K4445q8699k2940o4089j0135q4917m2069N820J31911
13881G0683k1880k5189L0467M6674K9456m7527M381n817P6901Q7187j5902p1942
13869A57492O1803n9981j7738J3098k6983J63679J11989j49971j34283L5182j9570
13858A34717l38l0798r682Q9800n0807r4970K8236k3152j9472k5573N9668J68924
13846B26553M0221K0057M5021L7781R7574k412L419l5486j50150n2321n8380o256
$$ plain form
13927 33560 166082 149780 101947 125212 168474 113807 80475 93719 93068 37410 96978 149156
13915 149156 91253 13698 135847 231291 249082 182414 120321 216720 222925 117853 91009
13904 91009 169957 216631 139681 54272 128045 140814 111013 119267 80460 155389 154925 159483
13892 159483 192686 221356 245801 157102 134162 70073 59938 -24979 -67048 -61228 70683
13881 70683 48803 23614 54081 100755 130211 82684 87065 81248 158149 245336 229434 157492
13869 157492 219295 159314 141576 154674 127691 291370 403359 253388 119105 154287 134717
13858 134717 134379 103581 93899 183699 132892 37922 66158 43006 23534 -2039 57629 226553
13846 226553 266774 286831 331852 369633 467207 464795 468214 432728 282578 230257 171877 165621
13834A65621J01305Q718l3274J8412M4291l3295j45806n3885l9849O027n8102
13823a9837r726J21700k5340o5510Q2226j03267L3791M8973n4262Q7300K79062
13812C75110N6559M149j6215r6318l2848o0707Q581m4825M4359L4449n5998k9565
13800A86731q0713j13759l2841P724N4151J63469J51563L4708j4229j16825n1045
13789A88934P3072J1092j6247j04691j30834O6269M1100k5878M9507Q7988k3735
13778B16577N4483K3772P6557J5531R5041n9075N815m9196j55730L4591J47099
13767D05465o5775m1252j6100J4509n1129L941L9409Q1542J1723O0341n6544j47397
13755B38733l6678L0455O0529q5837o6931L2275N6617k5072K3915J2066j07996
$$ plain form
13834 165621 266926 275644 242370 260782 305073 271778 125972 72087 32238 38265 -19837
13823 -19837 -29563 92137 66797 1287 83513 -19754 14037 63010 8748 96048 375110
13812 375110 431669 435818 419603 323285 290437 229730 238311 193486 237845 272294 216296 186731
13800 186731 106018 -7741 -40582 -32858 21293 184762 336325 371033 356804 239979 188934
13789 188934 262006 273098 256851 152160 21326 87595 128695 102817 152324 240312 216577
13778 216577 271060 294832 371389 386920 481961 422886 428701 379505 223775 258366 405465
13767 405465 339690 298438 282338 296847 245718 249659 289068 370610 382333 442674 386130 238733
13755 238733 202055 232510 293039 207202 140271 172546 229163 204091 228006 240072 132076
13744A32076j9892k5167O2077N0200R5617M27k392j1074k2313n0374k7411K563
13732A84337R8915P0456K5055j06439M2503O3234p7160j56206l806K564Q1121
13721B24574j1051K1282m8936m0646R7979M396R6897K3913K3839j9417l2302l8625
13709C01903n6574p3132J00963N0736q1251j0291j4810j52217o0529P1899P7195
13698A53892K5362M0201M7314q7591K1337K4530K2709K8047J2121j3881k1517
13687B52524O5596l5420r2419J4542J8979L0454n5085q4881o8284K4917P5602
13676A46525J48239P5453j9699j06824q3267J3814P96J22199M8059P8243K1167
$$ plain form
13744 132076 112184 87017 149094 199294 294911 295338 292946 281872 259559 209185 181774 184337
13732 184337 283252 353708 378763 272324 314827 378061 300901 144695 140889 143453 224574
13721 224574 213523 234805 185869 145223 243202 247598 344495 368408 392247 372830 340528 301903
13709 301903 245329 172197 273160 323896 242645 232354 217544 65327 4798 76697 153892
13698 153892 179254 219455 266769 179178 200515 225045 247754 275801 287922 274041 252524
13687 252524 318120 282700 190281 204823 223802 254256 199171 114290 46006 70923 146525
13676 146525 294764 370217 350518 243694 160427 174241 175037 297236 345295 423538 444705
$$ [...]
##END NTUPLES=NMR SPECTRUM
##END=
