##TITLE=Analysis number 323200
Compound Code cc 33814
Project Code adrs
Chemist Name ugmt
##JCAMPDX= 6.0         $$ Bruker NMR JCAMP-DX V2.0
##DATA TYPE= NMR SPECTRUM
##DATA CLASS= NTUPLES
##ORIGIN= Bruker BioSpin GmbH
##OWNER= nmr
$$ XWIN-NMR		Version 3.5
$$ Wed Oct 18 10:54:24 2006 GMT Daylight Time (UT+1h)  MAYBRIDGE\nmr@NMR_250MHZ
##.OBSERVE FREQUENCY= 250.131544655141
##.OBSERVE NUCLEUS= ^1H
##.ACQUISITION MODE= SIMULTANEOUS (DQD)
##.ACQUISITION SCHEME= undefined
##.AVERAGES= 16
##.DIGITISER RES= 18
##SPECTROMETER/DATA SYSTEM= dpx250
##.PULSE SEQUENCE= zg30
##.SOLVENT NAME= CDCl3
##.SHIFT REFERENCE= (INTERNAL, CDCl3, 0, 16.522)
##AUDIT TRAIL= $$ (NUMBER, WHEN, WHO, WHERE, WHAT)
$$ ##TITLE= Audit trail, XWIN-NMR		Version 3.5
$$ ##JCAMPDX= 5.01
$$ ##ORIGIN= Bruker BioSpin GmbH
$$ ##OWNER= nmr
$$ C:\u/data/dgb/nmr/ADRS/910/pdata/1/auditp.txt
$$ ##AUDIT TRAIL=  $$ (NUMBER, WHEN, WHO, WHERE, WHAT)
(   1,<2006-10-18 10:53:59.95 +100>,<MAYBRIDGE\nmr>,<NMR_250MHZ>,
      <created by zg, POWCHK disabled, PULCHK disabled
       configuration hash MD5:
       49 4B E0 1D 92 C2 6B 37 9F E6 65 BC 52 41 86 1D
       data hash MD5: 64K
       26 F6 23 82 01 1F 62 75 A4 9F A4 68 93 CF 54 6B>)
(   2,<2006-10-18 10:54:14.54 +100>,<MAYBRIDGE\nmr>,<NMR_250MHZ>,
      <Start of raw data processing
       ef LB = 0.3 FT_mod = 6 PKNL = 1 SI = 32K 
       data hash MD5: 32K
       63 32 71 3B 26 DA 61 CB 2D 57 93 10 C3 10 8B 4A>)
(   3,<2006-10-18 10:54:16.13 +100>,<MAYBRIDGE\nmr>,<NMR_250MHZ>,
      <apk 
       data hash MD5: 32K
       D1 B0 F1 DD 5B A2 C5 3D E0 23 FD 72 6B 1D 9A D6>)
(   4,<2006-10-18 10:54:16.85 +100>,<MAYBRIDGE\nmr>,<NMR_250MHZ>,
      <abs ABSG = 5 
       data hash MD5: 32K
       20 97 05 FD B3 7C 86 C1 9D 38 62 FF 3C F4 AE 56>)
$$ ##END=
$$ 
$$ hash MD5
$$ 6A 25 68 C5 F9 76 3D 46 5E F5 69 D1 3D 38 80 34
##$RELAX= 
##$RELAX= 
##$RELAX= 
##$RELAX= 
##$RELAX= 
##$RELAX= 
##$RELAX= 
$$ Bruker specific parameters
$$ --------------------------
##$DU= <C:\u>
##$EXPNO= 910
##$NAME= <ADRS>
##$PROCNO= 1
##$TYPE= <nmr>
##$USER= <dgb>
##$AMP= (0..31)
100 100 100 100 100 100 100 100 100 100 100 100 100 100 100 100 100 100 
100 100 100 100 100 100 100 100 100 100 100 100 100 100 
##$AQSEQ= 0
##$AQ_mod= 3
##$AUNM= <au_zg>
##$AUTOPOS= <10 >
##$BF1= 250.13
##$BF2= 250.13
##$BF3= 250.13
##$BF4= 250.13
##$BF5= 500.13
##$BF6= 500.13
##$BF7= 500.13
##$BF8= 500.13
##$BYTORDA= 1
##$CFDGTYP= 0
##$CFRGTYP= 5
##$CHEMSTR= <none>
##$CNST= (0..31)
1 1 145 1 1 1 1 1 1 1 1 1 1 1 1 1 1 1 1 1 1 1 1 1 1 1 1 1 1 1 1 1 
##$CPDPRG= <>
##$CPDPRG1= <>
##$CPDPRG2= <>
##$CPDPRG3= <>
##$CPDPRG4= <mlev>
##$CPDPRG5= <mlev>
##$CPDPRG6= <mlev>
##$CPDPRG7= <mlev>
##$CPDPRG8= <mlev>
##$CPDPRGB= <>
##$CPDPRGT= <>
##$D= (0..31)
0 1 0 0 0 0 0 0 0 0.06 0 0 0 0 0 0 0.0002 0 0 0 0 0 0 0 0 0 0 0 0 0 0 
0 
##$DATE= 1161165238
##$DBL= (0..7)
120 120 120 120 120 120 120 120 
##$DBP= (0..7)
150 150 150 150 150 150 150 150 
##$DBP07= 0
##$DBPNAM0= <>
##$DBPNAM1= <>
##$DBPNAM2= <>
##$DBPNAM3= <>
$$ [...]
##$SUBNAM7= <"">
##$SUBNAM8= <"">
##$SUBNAM9= <"">
##$SW= 20.6930455092707
##$SWIBOX= (0..15)
0 0 3 0 0 0 0 0 0 0 0 0 0 0 0 0 
##$SW_h= 5175.983436853
##$TD= 65536
##$TD0= 1
##$TE= 683.16
##$TE2= 300
##$TE3= 300
##$TEG= 300
##$TL= (0..7)
0 120 120 120 120 120 120 120 
##$TP= (0..7)
150 150 150 150 150 150 150 150 
##$TP07= 0
##$TPNAME0= <>
##$TPNAME1= <>
##$TPNAME2= <>
##$TPNAME3= <>
##$TPNAME4= <>
##$TPNAME5= <>
##$TPNAME6= <>
##$TPNAME7= <>
##$TPOAL= (0..7)
0.5 0.5 0.5 0.5 0.5 0.5 0.5 0.5 
##$TPOFFS= (0..7)
0 0 0 0 0 0 0 0 
##$TUNHIN= 0
##$TUNHOUT= 0
##$TUNXOUT= 0
##$USERA1= <user>
##$USERA2= <user>
##$USERA3= <user>
##$USERA4= <user>
##$USERA5= <user>
##$V9= 5
##$VALIST= <valist>
##$VCLIST= <CCCCCCCCCCCCCCC>
##$VD= 0
##$VDLIST= <DDDDDDDDDDDDDDD>
##$VPLIST= <PPPPPPPPPPPPPPP>
##$VTLIST= <TTTTTTTTTTTTTTT>
##$WBST= 1024
##$WBSW= 4
##$XGAIN= (0..3)
0 0 0 0 
##$XL= 0
##$YL= 0
##$YMAX_a= 478093
##$YMIN_a= -412104
##$ZGOPTNS= <>
##$ZL1= 120
##$ZL2= 120
##$ZL3= 120
##$ZL4= 120
##$ABSF1= 16.522
##$ABSF2= -4.171173
##$ABSG= 5
##$ABSL= 3
##$ALPHA= 0
##$AQORDER= 0
##$ASSFAC= 0
##$ASSFACI= 0
##$ASSFACX= 0
##$ASSWID= 0
##$AUNMP= <proc_1d>
##$AZFE= 0.1
##$AZFW= 0.1
##$BCFW= 0
##$BC_mod= 0
##$BYTORDP= 0
##$COROFFS= 0
##$CY= 12.5
##$DATMOD= 1
##$DC= 0
##$DFILT= <>
##$DTYPP= 0
##$F1P= 14.0000005364418
##$F2P= -0.99999901652339
##$FCOR= 0.5
##$FTSIZE= 32768
##$FT_mod= 6
##$GAMMA= 0
##$GB= 0
##$INTBC= 1
##$INTSCL= 1
##$ISEN= 128
##$LB= 0.3
##$LEV0= 0
##$LPBIN= 0
##$MAXI= 10000
##$MC2= 0
##$MEAN= 0
##$ME_mod= 0
##$MI= 0
##$NCOEF= 0
##$NC_proc= -5
##$NLEV= 6
##$NOISF1= 0
##$NOISF2= 0
##$NSP= 0
##$NTH_PI= 0
##$NZP= 0
##$OFFSET= 16.522
##$PC= 1
##$PHC0= -44.66644
##$PHC1= 0.6062697
##$PH_mod= 1
##$PKNL= yes
##$PPARMOD= 0
##$PSCAL= 4
##$PSIGN= 0
##$REVERSE= no
##$SF= 250.13
##$SI= 32768
##$SIGF1= 0
##$SIGF2= 0
##$SINO= 400
##$SIOLD= 32768
##$SREGLST= <1H.CDCl3>
##$SSB= 0
##$STSI= 32768
##$STSR= 0
##$SW_p= 5175.98343685301
##$SYMM= 0
##$S_DEV= 0
##$TDeff= 65536
##$TDoff= 0
##$TI= <Analysis number 999999
Compound Code 99
Book Reference 9
Project Code 9>
##$TILT= no
##$TM1= 0
##$TM2= 0
##$TOPLEV= 0
##$USERP1= <user>
##$USERP2= <user>
##$USERP3= <user>
##$USERP4= <user>
##$USERP5= <user>
##$WDW= 1
##$XDIM= 32768
##$YMAX_p= 412774246
##$YMIN_p= -786899
$$ End of Bruker specific parameters
$$ ---------------------------------
##NTUPLES= NMR SPECTRUM
##VAR_NAME=  FREQUENCY,     SPECTRUM/REAL,   SPECTRUM/IMAG
##SYMBOL=    X,             R,               I
##VAR_TYPE=  INDEPENDENT,   DEPENDENT,       DEPENDENT
##VAR_FORM=  AFFN,          ASDF,            ASDF
##VAR_DIM=   32768,         32768,           32768
##UNITS=     HZ,            ARBITRARY UNITS, ARBITRARY UNITS
##FACTOR=    0.157963299565203, 1,           1
##FIRST=     4132.6476996994, 0,             0
##LAST=      -1043.33573715361, 0,           0
##MIN=       -1043.33573715361, -786899,     0
##MAX=       4132.6476996994, 412774246,     0
$$ Real data points
##PAGE= N=1
##DATA TABLE= (X++(R..R)), XYDATA
$$ [...]
21668 -283144 -291794 -124674 69354 -47161 -176454 -259845 -260684 -88768 79425 -136422 -424735
21657 -424735 -478329 -430620 -513525 -510554 -405618 -346268 -253030 -171670 -320803 -358543 -383143
21646 -383143 -329605 -345062 -300054 -163311 -2445 122180 38778 121614 280079 290469 26522
21635 26522 -17098 134393 76128 -183606 -114081 -64442 -239070 -230512 -24508 -127341 -346560
21624 -346560 -315884 -129302 -209859 -424596 -491714 -338524 -142964 -229168 -341671 -381272
21614 -381272 -487773 -718515 -533989 -253586 -389101 -446748 -117432 51104 73653 289168
21604 289168 387913 210596 207598 153798 245130 116425 -46644 -187285 -328725 -265639 -11571
21593 -11571 -79454 -54762 25757 -68578 -43801 930 10440 -111507 -147165 -78792 -124884 -189268
21581 -189268 -154730 -82765 -82063 -160480 -97717 19547 136037 148138 143559 269068 237655
21570 237655 256988 -26443 -311272 -301858 -205895 -66189 -140934 -311628 -156293 13046
21560 13046 -78763 -220936 -174720 -84530 -159041 -139189 -307433 -269870 -112454 -62045 -172718
21549 -172718 -149613 -99951 7188 45514 -63209 -194730 -205323 -34882 100798 154832
21539 154832 -66086 -249648 -268435 -405593 -470174 -362168 -170338 -45445 -39447 138281
21529 138281 135895 94222 30041 -19213 -257257 -272586 -278727 -195302 -198707 -189699 -236543 -227862
21517 -227862 -254906 -261900 -133415 91223 234776 324350 187573 -52114 -189736 -137717
21507 -137717 18559 15379 66466 -7593 -113653 -57364 -98891 -146142 -184722 37636 156300
21496 156300 148611 88521 27240 300605 171917 -151372 -210123 -234324 -144197 -113162 -10027
21485 -10027 198902 -22925 41132 73345 2347 4389 -87596 -63554 400 -55863 -135455
21474 -135455 -63556 -219266 -266541 -182231 -149124 -205390 -125044 -85835 -188242 -333176 -298882
21463 -298882 -180703 -274054 -113547 -121617 -136332 32801 -123206 -172878 -140288 -125331 -105521
21452 -105521 -35935 -83828 -128636 -31947 -121039 -397066 -212901 54854 -7190 -145372 -11543
21441 -11543 -69916 -41255 6806 -32054 -132513 -98680 55660 350 -57639 -216283 -47770
21430 -47770 -108460 -55363 61013 -1247 53368 212608 56290 -37237 -4914 35530 3611
21419 3611 33408 24924 -35972 -73809 -68713 32242 244481 286711 145224 11483 82774
21408 82774 185520 173240 226551 57717 -154012 -376540 -358792 -194163 -282526 -532731
21398 -532731 -537226 -466517 -442853 -366985 -291514 -187275 -224992 82429 315218 267562 314638
21387 314638 300051 189503 228949 126012 129167 16084 -265879 -318720 -187789 7
21377 7 80281 48126 105639 22709 -26728 231760 283919 302369 85853 -202151 -237037 -109308
21365 -109308 -102471 36563 98692 95637 -47683 -18375 170179 349817 337658 128469 -44990
21354 -44990 -209172 -134833 -110691 -81547 -181460 -238722 -226740 -470294 -419026 -408929 -226331
21343 -226331 -252401 -356492 -364369 -200163 -45251 3688 80041 52474 4126 -76570 145505
21332 145505 273735 277737 364001 387956 333891 292718 271824 197773 157699 101655 164743
21321 164743 117584 212168 176507 75745 215512 314301 203822 68662 47870 46228 122133
21310 122133 177376 47938 65295 155311 184921 29076 -33876 11180 -8527 49476 38584
21299 38584 -71550 -60075 -145872 -95670 -13563 2231 -233969 -283675 -194940 -97622 -174694
21288 -174694 -192897 -64356 137010 42126 -207361 -196047 156395 48425 -129922 -166022
21278 -166022 -287381 -355095 -292610 -42952 41324 40110 18490 136103 150475 761 -52338
21267 -52338 -117705 -278723 -274418 -161076 -246434 -232017 -12177 109169 190735 195619 218704
21256 218704 239472 271622 255651 153997 40253 -6204 -96328 -83619 -112987 -263078 -418643
21245 -418643 -713013 -565565 -437838 -409640 -498957 -335690 -137537 -96012 61832 -96303
21235 -96303 -386847 -299249 -176335 -165626 -24094 195646 94789 -232083 -375433 -215557
21225 -215557 -160228 -193364 -52584 -117962 -269760 -353618 -287722 34637 340944 170743
21215 170743 83 -86941 -53889 15690 -40757 -103826 -44788 -52972 -95399 -147015 -181397
21204 -181397 -304495 -64583 267448 197207 8556 -91739 -118297 -149500 -176201 -143652
21194 -143652 -253665 -301974 -40003 210350 94835 -71739 -152352 -166235 -112484 -83016
21184 -83016 -188457 -63078 -39356 -32728 57157 59431 -85990 -192260 -93662 -286182 -384887
21173 -384887 -347194 -399155 -521911 -375068 -231989 -184267 -116617 -90008 112243 142420 36750
21162 36750 23204 25009 -3149 -86908 -27816 -13777 54248 88063 129249 135496 199506 209211
21150 209211 92918 -56576 -496257 -465970 -439842 -462428 -240253 -142022 -408525 -363504
21140 -363504 -156638 -7475 25008 95507 90902 -11657 -70568 84399 203001 307271
21130 307271 459765 399886 213075 94763 22055 -2481 -159622 -158515 -135429 -244247 -119952
21119 -119952 -58532 -27564 39998 133127 10483 -206581 -399810 -405797 -445579 -335575 -388172
21108 -388172 -408673 -481029 -448843 -301263 -209616 -180338 -118095 -184975 -185033 -232623 -88624 -88432
21096 -88432 -215808 -198283 -103395 -46727 -593 -4614 -75197 -108248 89877 45 -101545
21085 -101545 -152450 -136375 21201 205270 387793 181470 -52460 -176922 -96475 -184064
21075 -184064 -141842 -115352 -120817 -57867 -97257 -161129 -218442 -297043 -305104 70689 58729 67869
21063 67869 -133056 -172284 -181573 -228030 -183963 -158663 -279242 -142756 -92686 -108918 -169051
21052 -169051 -142391 -98721 -51912 -186506 -127264 69656 210647 204927 34976 -1838 -202389
21041 -202389 -225809 -167499 -136898 -26265 61788 97158 39050 -41270 -118067 -273152 -354607
21030 -354607 -259338 -50799 -41912 6491 70890 113816 -80100 103253 258781 263000 209290
21019 209290 81381 -61994 -121141 31572 63110 -138092 -114839 19571 -185598 -98985
21009 -98985 23964 52183 106364 -68241 -194102 -241079 -56758 -82087 -167608 -7949 100306
20998 100306 63313 -58993 -151818 -211066 -213751 -265993 -469950 -365321 -236400 -185687 -158107
20987 -158107 -331179 -311309 -220977 -127892 -219921 -220006 -224240 -389542 -452438 -251151 -424481
20976 -424481 -510148 -375537 -188199 -130936 -240606 -109108 40285 -169380 -43561 72682
20966 72682 -13253 -154369 -237239 -242751 -159687 104488 346990 278553 190432 205544 62044
20955 62044 90455 -45911 -181404 -121837 -199006 -168580 -149306 -214585 -79740 63684 -106747
20944 -106747 -109083 -50641 -6054 82168 72441 -47219 -60743 107999 161921 92487 -167926
20933 -167926 -285741 -380294 -193129 -152959 -273973 -153307 9311 104047 67883 -64967
20923 -64967 7135 -127441 -340256 -289259 38970 151873 205410 100541 30590 -189241
20913 -189241 -230140 43766 88626 -236027 -316459 -414070 -252537 -199532 -191024 -140295 -288992
20902 -288992 -619479 -785573 -717319 -512073 -386287 -281762 101947 495965 295560 168014
20892 168014 56047 -19785 -82840 -175811 -150730 -387307 -368038 -387978 -241635 -223310 -225886
20881 -225886 -116576 -53165 109827 187996 32859 -100431 -60116 -39845 -78813 -128581 -322327
20870 -322327 -297751 -272061 -197886 -38996 74829 97385 -81967 -1938 178714 113607 49099
20859 49099 82552 203647 116071 -182245 -228014 -114533 -89929 -294244 -266322 -138830 -214867
20848 -214867 -157580 -301958 -288095 -168512 -154861 -95567 -224420 -124151 -50813 -79290 -154006
20837 -154006 -177908 -160959 -184976 -203360 -219803 -100214 -127549 -112615 -30129 22789 -117225
20826 -117225 -74544 -42515 23673 237025 383145 249300 280417 170595 121374 265525
20816 265525 282591 161425 -23810 -305112 -502046 -373177 -155207 -215460 -232248 -237844
20806 -237844 -295536 -403102 -429220 -267438 -52764 26231 -15405 -67659 -83552 -166417 -76640
20795 -76640 40352 -20048 -56438 40039 31396 -11844 -103876 11749 17750 -43797 -46193 -5042
20783 -5042 518 2432 88327 202411 -48212 -309364 -251517 -223515 -203800 -216964 -268746 -182007
20771 -182007 -58148 264598 254593 135174 49096 73157 97415 39995 147137 123585 149180
20760 149180 197289 78355 31030 29888 85044 64986 -121005 -50818 -58344 -61152 -105138 -86665
20748 -86665 -276329 -317648 -306738 -444377 -361815 -205557 -61164 43894 21595 -85994
20738 -85994 -159068 -232167 -262779 -302300 -298976 -316491 114416 -4098 -80753 52227 242328
20727 242328 62795 58541 3348 -61496 -124828 -15159 -41827 19991 47431 -96664 -216388
20716 -216388 -65354 -144193 -184075 -136702 -86829 -122496 -30220 119529 43813 -103841 162527
20705 162527 354660 92067 -109736 -131910 -9184 132529 3158 -257592 -376181 -411218
20695 -411218 -205299 -139191 -3504 -32943 -132706 -151086 -109879 -75117 -98322 -116241 -218967
20684 -218967 -151756 112611 66628 166907 145151 22804 101066 202047 133145 17012
20674 17012 92877 9173 -160182 -197217 -169573 -46369 107468 144212 214929 384797 388434
20663 388434 304123 314289 358386 277502 201886 242418 187947 185124 136662 230362 160587 149275
20651 149275 19943 -66973 54280 77433 182382 220973 -11742 -101510 -14081 -40257 207255
20640 207255 294776 300743 158794 148530 7195 -170539 -130919 -117208 -159670 -183332 -88228
20629 -88228 -64783 -74576 -127268 -70456 -86171 -61557 -275074 -453691 -327120 -9129 78569
20618 78569 169201 276272 192252 -7744 -95150 -96387 -83287 109559 199368 83930 -53401
20607 -53401 -79593 5203 -102899 -27857 33499 -72364 -39405 56208 121003 55353 53744
20596 53744 -128835 -55170 -189940 -468891 -359440 -392777 -337653 -225082 -124118 763
20586 763 216850 146254 -34838 -209509 -198560 -140684 -135037 -282215 -222611 -342909 -233858
20575 -233858 -189135 27054 174357 -18741 -145471 -269483 -121174 72999 -14513 23181
20565 23181 33032 -117264 -64919 20664 124386 242533 392016 284925 192352 130721 -287531
20554 -287531 -464075 -429438 -240891 -265868 -162356 75095 11134 -54400 -135840 184277
20544 184277 357767 78264 -157886 -143829 -250631 -267102 -189950 -142841 -80094 -99323 -95303
20533 -95303 -5059 -107963 -218398 -176563 -84591 -113 -20178 -97367 -165076 -24136 128322
20522 128322 123504 183576 295054 394075 -9 -128725 -76495 -22627 -105590 -216045 -341540
20511 -341540 4675 61250 84549 -54315 -163424 -319577 -348225 -575722 -552122 -530784
20501 -530784 -394320 -241281 -281625 -212818 -209667 -154276 -107008 4964 -17008 100686 47295
20490 47295 -81572 -171266 -196406 -64844 -42872 -125001 -67791 -201179 -500980 -474198 -550544
20479 -550544 -577339 -399557 -365576 -301211 -227263 -75905 -56413 41496 -103301 -144816 -8259
20468 -8259 -137543 -50647 72323 -15061 -64072 -163215 -235532 -342671 -336503 -186100 -161417
20457 -161417 -87809 -218286 -183544 -167280 -106054 -152823 -176187 -431139 -435805 -431520 -310518
20446 -310518 -125034 -64224 -34453 3090 -128204 -166896 -157471 -177611 -39840 -6240 -22479
20435 -22479 -3725 -11245 171117 218911 62452 77650 126809 7986 -73579 -75301 -108133
20424 -108133 -127901 -84268 14499 -57858 -320100 -273963 -142922 -107471 -59757 281003 313658
20413 313658 62467 -225980 -56331 211881 231934 133813 83739 5588 -164320 -334037
20403 -334037 -413260 -586389 -414293 -435666 -392681 -326331 -202959 -9611 180286 74574
20393 74574 -162402 -152988 -362445 -418563 -176394 248095 288494 300162 410960 394353 348345
20382 348345 291157 97029 10149 143213 40984 -49838 72679 343612 78122 -351423
20372 -351423 -335061 -211867 -175819 -209179 -213918 19873 213713 143559 12647 -29832 -169770
20361 -169770 -244688 -81574 101361 -5553 -187506 -203088 -51354 -1122 87012 -43150
20351 -43150 -129999 -178163 -197807 -315 257345 149195 693 25999 -185783 -316026
20341 -316026 -171616 -53047 -43213 11499 136832 183275 -110954 -124863 -134065 -67438 23731
20330 23731 62902 133468 65438 85254 -34188 -50643 43715 -54921 24253 171249 122614
20319 122614 -22669 84886 -45726 -279857 -163976 20168 21045 -114197 -128250 -330544
20309 -330544 -396268 -452081 -331857 -290676 -449877 -493023 -495394 -465428 -359966 -316701 -228731
20298 -228731 525 25111 77997 151370 -9668 -45585 -13173 -120023 -261912 -185182 -43878
20287 -43878 96668 70131 117692 149260 212992 235688 100422 102646 66610 -55132 -87457
20276 -87457 -117870 495 -67614 -22119 112731 192567 123866 -163621 -229802 166915 340426
20265 340426 452648 440799 236628 94957 195061 112351 183535 -25746 -325064 -251041
20255 -251041 -116193 -222342 -151791 59303 97862 -26943 -18629 94544 246725 234771
20245 234771 92244 118102 38831 -99645 -14095 265982 400134 242424 58301 160398
20235 160398 100189 204931 84104 96873 -20599 -108451 -162099 -38110 79252 12582
20225 12582 13921 -23481 -178425 -304310 -265129 -139987 41259 124140 103503 73632 -18197
20214 -18197 54397 -19964 -100165 -15337 -160441 -239294 -229826 -186642 -146277 -262424 -359343
20203 -359343 -352563 -291257 -294259 23914 94849 -70534 -123617 90033 117836 94554 5265
20192 5265 -35295 35790 -5553 -64665 -4487 14399 -41091 -61329 -196746 -242921 -177958 -270935
20180 -270935 -139530 33349 69130 -91842 -130839 9210 -163302 -111992 -126231 -40661
20170 -40661 -3534 -121686 -176800 64136 121233 42894 -76490 -71592 -151310 -121371 -117812
20159 -117812 -66292 65110 125049 56151 55191 -37862 107284 70101 -25277 -13664 -123954
20148 -123954 -101224 -297288 -303055 -217828 -192515 -211405 -112763 -119583 -101191 -292870 -280372
20137 -280372 -156830 -89518 7179 116959 195873 47868 -93752 828 -124742 -100491
20127 -100491 -112682 -342480 -332614 -126794 195479 167143 64090 -102214 -112863 -60221 73142
20116 73142 218452 157607 -74335 -19102 109338 335191 135027 -148445 118158 353605
20106 353605 115956 -158335 -53610 82284 55468 -44856 -95673 -60719 -11458 -145884
20096 -145884 -200264 73854 183359 174457 143508 147484 -68692 -139453 -532 8929 -72059
20085 -72059 -19305 165838 209342 -117727 -36787 -38942 -133435 -104264 71421 -49895 -104848
20074 -104848 -156439 -200172 -350237 -500795 -436376 -302693 -138541 -133356 -42729 97635 35823
20063 35823 114032 315634 295288 292156 157210 15077 -182574 -202098 -144947 -170136 -115233
20052 -115233 39747 -60936 -146831 -431217 -786899 -620795 -253475 -226566 -211298 -236058
20042 -236058 -123011 58842 66241 59959 -117743 -139378 -77972 -42272 -89230 -310959 -515122
20031 -515122 -499594 -358241 -426875 -411768 -279655 -201298 -275089 -409958 -294539 -254099 -500073
20020 -500073 -422329 -149376 -117951 -212732 -124429 -85696 20706 148190 22759 -102451
20010 -102451 -23177 -222117 -97828 -112468 -230976 -267851 -219522 -333424 -282042 -77636
20000 -77636 -201351 -318371 -324319 -337766 -330258 -236570 -138136 -40303 -92722 -131471 -72844 -115538
19988 -115538 -299001 -192885 -172608 -27498 186422 46972 10335 40034 -75033 -230731
19978 -230731 -285342 -281175 -191361 -61043 -62963 103653 -136634 -55752 90800 9105 -61445
19967 -61445 -95404 -173454 -372280 -497542 -430772 -278213 -365922 -450696 -451199 -534152 -444337
19956 -444337 -371378 -410386 -391087 -313150 -158102 -219890 -114892 -89748 -160628 -177717 -121749
19945 -121749 -39561 182917 25937 -127650 -213099 -262886 -229069 -314998 -346300 -220975 -36294
19934 -36294 141566 356790 566529 606293 462364 173612 -48298 -74333 -48359 -78005
19924 -78005 -27980 -7560 -77356 -108065 -228038 -167565 -123059 -12434 -14713 -109218 -129807
19913 -129807 33890 13804 -180241 -355286 -276266 -9051 -11164 -136460 -147694 -173071 -31992
19902 -31992 89641 40086 134986 163665 49766 92339 -31534 -212700 -206108 -86908 66581
19891 66581 364213 463688 539353 460090 235194 110933 43745 -107419 -281226 -27007
19881 -27007 -7891 -115283 -17917 39207 101211 18487 -205244 -240810 -66661 44012 61645
19870 61645 154855 95410 -187065 -2526 89062 -112208 -301226 -165038 -76623 -282491
19860 -282491 -359328 -394030 -341721 -269327 -172607 -116336 -182808 -204980 -316499 -102617 54679
19849 54679 -132520 -92030 -141762 -172780 -223157 -336866 -370286 -393489 -270668 -274589 -149893
19838 -149893 -31857 -121571 -105230 33332 14743 8751 -102447 -436575 -615265 -587733 -300728
19827 -300728 -153224 50372 110864 16036 -12616 83025 27411 -138388 -248492 -133880
19817 -133880 -230505 -435288 -276127 -171498 -168414 -2177 -112902 -38702 -32373 113877 162021
19806 162021 -15175 -20509 -205637 -332075 -309643 -333640 -206028 20323 -18912 -119866
19796 -119866 -108310 -58966 -4234 7743 114160 240489 151862 -10570 -199970 -231641 -288513
19785 -288513 -243889 -171683 -320532 -425923 -555652 -452582 -372414 -394881 -235196 -322628
19775 -322628 -224036 -72526 -234904 -236695 -293832 -648463 -651269 -535794 -508865 -333226 -266434
19764 -266434 -254621 -118907 -123586 4802 209986 188098 -9097 -243465 -141505 -125157
19754 -125157 -498224 -462571 -233625 -110337 -163868 -204887 -224437 -358872 -281408 -77297
19744 -77297 44797 35866 13414 119450 24153 -13688 -127682 -122353 44987 180396 329991
19733 329991 246968 259909 373681 169503 46283 99565 72316 -51693 -145981 -45564
19723 -45564 124276 203358 109345 145422 115670 173873 80594 129621 100454 -98616 -236790
19712 -236790 -320462 -208471 -95147 33301 182949 -21711 -33619 208169 33027 -261448
19702 -261448 -283582 -278003 -223058 100298 306740 283826 66655 77837 149466 66306 114286
19691 114286 218661 121026 127493 185237 139527 73752 -91973 -103838 -163216 -286630 -260237
19680 -260237 -142017 -141942 -8648 -67816 -185871 -213122 -22918 -61695 -29389 103855 71772
19669 71772 31059 -197557 -341895 -367299 -348927 -276049 -250203 -407841 -373596 -295584 -283978
19658 -283978 -286396 -232740 -193775 -146448 -6097 52603 40550 -64962 -189881 -294298 -278864
19647 -278864 -263953 -89124 -136340 -281934 -441720 -551371 -467528 -388439 -232476 -133005
19637 -133005 -16620 141975 160344 295827 278495 211807 119680 -246781 -266398 -199742 -197244
19626 -197244 -195870 -183940 -185216 -265523 -255987 -289220 -316023 -259903 -205954 -115495 189386 346397
19614 346397 406146 277465 214895 140406 28188 -11942 -54678 -139970 -396292 -576948 -411815
19603 -411815 -195406 -223491 -199166 -242180 -304990 -343909 -311340 -95908 -118542 -183668 -328186
19592 -328186 -215247 -252859 -230424 -151095 -12611 -100352 -137452 -168930 -86504 -39009 -84831
19581 -84831 -81850 -163042 -113496 143266 58351 -2854 158533 224640 258286 112543 -210468
19570 -210468 -251786 -346928 -342815 -330380 -149852 109491 282975 133798 -24771 36087 -106297
19559 -106297 -234039 -127660 -21109 53685 29670 134359 211649 316207 314797 127772
19549 127772 -161829 -124035 3283 -109998 -267435 -135630 -184447 -189017 -12220 -406542
19539 -406542 -452816 -203314 -118436 -81394 -240204 -239845 -268750 -255756 -78093 -38613 163246
19528 163246 142136 254222 196809 -97219 -335539 -309740 -291768 -86502 36689 203980
19518 203980 20242 -107790 -59578 -108329 -21177 194399 455838 258801 -13978 -175236
19508 -175236 -189815 -353328 -329516 -170201 -120525 -129343 -170858 -104856 -162717 -103919 -131867
19497 -131867 -22172 89596 79478 82924 96515 -33451 -140474 -286791 -348875 -260459 -166254
19486 -166254 -161268 -485539 -412487 -247468 -136742 -227448 -218033 -202900 -210895 -213819 -47067
19475 -47067 128186 -82877 -266030 -425068 -375677 -294155 -364249 -488605 -657545 -477429
19465 -477429 -193586 -113831 -2931 -77418 -149211 -257454 -256394 -177862 -344493 -441656 -446206
19454 -446206 -338631 -150564 93000 120887 -224414 -513651 -308485 -185227 -312377 -269090
19444 -269090 -48721 114180 186501 116565 -83754 62019 97843 -78126 -136592 -128747 27413
19433 27413 107869 104172 -15307 -259359 -207942 -220841 -174455 -18798 38561 -65979 -4574
19422 -4574 -63397 -131384 -50141 -90274 -32007 32241 163775 -48314 -193795 -92751 -105177
19411 -105177 176434 384963 261961 170280 285717 369567 269421 187756 255489 372729
19401 372729 332921 206400 78718 6241 19380 -36108 -157666 -11087 -99868 -119494 -89478
19390 -89478 -155186 -77490 55640 81594 -41884 -169931 -236731 -271698 -184831 -170162 -188369
19379 -188369 -176614 -235546 -270817 -308467 -215494 -136644 7875 160648 -17301 -86871 22135
19368 22135 279138 144198 31639 9314 -82045 2969 187440 151897 -13765 101195
19358 101195 56414 -9015 -88027 -84367 210642 229290 129686 72341 112838 163330 -2399
19347 -2399 -204792 -248528 -388098 -208342 -120770 25296 -3692 -65489 -285133 -298870 -84725
19336 -84725 -201210 -249491 -180149 -55211 -216432 -258459 -266785 -311273 -270352 -200288 -128880
19325 -128880 -365307 -323384 -144805 -120223 -66996 -64676 -4585 127537 64386 137947 120739
19314 120739 94168 -59686 69551 -3394 5259 10189 11922 -188197 -215435 -202694 -428060
19303 -428060 -391708 -178528 -137378 -62188 -195194 -171817 -169639 -241579 -454304 -501802 -400198
19292 -400198 -354201 -397670 -149722 -95037 42902 260534 287579 151434 109852 92636 71713
19281 71713 -64485 -153836 -242454 -332757 -271510 -217244 58290 -46038 -114698 5051 -30508
19270 -30508 -33449 -25779 -188357 -490193 -586649 -460037 -495929 -192936 -11231 66676 90486
19259 90486 185606 206858 102566 49415 41898 -156730 -398539 -241349 -405832 -470491 -119079
19248 -119079 -226256 -345165 -239866 -205310 -110796 -167295 -198470 -253076 -318379 -161248 -87671
19237 -87671 -89512 -76685 -192365 -241970 -229425 -224868 -145367 -71597 -324788 -390253 -299396 -165158
19225 -165158 -152549 -254039 -249116 -326823 -244359 -133890 60986 -71936 -128222 -227968 -179910
19214 -179910 87249 6726 -59633 -11540 125892 47944 -195776 -185709 -158541 -180599 -81520
19203 -81520 149120 356628 253765 -44695 -203222 -463901 -475371 -362934 -235257 -182017
19193 -182017 -261285 -216474 -8925 -107873 -162028 -33417 67971 60465 -149807 -172844 -166721
19182 -166721 -300219 -386872 -322205 -373003 -270422 -108992 -149357 -170438 -281239 -319765 -438609
19171 -438609 -108099 22472 -126439 -216348 -226701 -328965 -246011 -20772 -148744 -287512
19161 -287512 -424940 -383081 -354828 -355421 -416366 -357709 -351009 -288680 -221667 -260505 -418571 -247533
19149 -247533 21376 132881 100225 -15697 -217639 -250927 -149301 -62552 -34288 141571
19139 141571 182754 77121 263124 -20588 -330996 -527183 -424243 -315017 -223647 -353331
19129 -353331 -281362 -338116 -272986 -408502 -314643 -194481 -77947 101154 -20097 -26703 -180282
19118 -180282 -311571 -103361 -115461 -159694 -130001 -53065 -249189 -464648 -235665 59961
19108 59961 144218 278065 74730 -155746 -376151 -396533 -129378 157998 188463 136381
19098 136381 15404 -36828 -136336 -263256 -173500 -160382 -207164 -44122 147485 98689 -783
19087 -783 -205634 -192678 -177957 -160511 -114679 -30836 71873 125172 142042 166131 77325 -34228
19075 -34228 125526 228305 206901 -131253 -472636 -348581 -272540 -300513 -96641 140100
19065 140100 153723 95851 -89606 -218510 -383977 -521343 -337702 -208721 -300236 -396497
19055 -396497 -357635 -440573 -240834 -46934 -58871 -226664 -290228 -314802 -142018 -12462
19045 -12462 -179971 -382437 -308740 -143692 -184047 -265622 -291666 -123196 -26223 -136061 -246027
19034 -246027 -220375 84269 302812 315630 28868 27606 152765 -10332 3121 221110
19024 221110 229364 325261 307365 306633 65808 56413 155269 66568 5690 215842 103942 86152
19012 86152 21166 73730 -85137 -54994 -154075 -52145 136179 194974 73675 204237 107688
19001 107688 -13508 147016 314084 143511 112241 -23850 -20302 -2457 270486 231299
18991 231299 32665 20399 46062 -125393 -278820 43647 301885 258679 212025 296660
18981 296660 216063 395703 599676 604377 418319 356740 301407 260362 173232 -35936 -54981
18970 -54981 -304651 -127381 -58406 -81012 -65058 -66219 -7454 46546 29535 23059 -34644 -33122
18958 -33122 -155243 93273 360321 461478 457182 442347 463883 388542 338035 430397 266719
18947 266719 132354 172459 105713 -171763 -283702 72988 210179 278627 326873 213586
18937 213586 303534 310630 194951 33042 -207922 -254060 -109809 140171 244863 111070
18927 111070 -144249 -125688 75215 108012 -21080 122119 194072 66782 -78054 -235208
18917 -235208 -141284 -170627 -231573 -11079 117289 192741 233080 158431 190895 248024 165988
18906 165988 214850 125878 153068 378139 523049 486602 523327 522991 554968 499576 231194
18895 231194 262106 393631 476967 334064 351080 276063 214735 279006 274835 351902 384944
18884 384944 357720 235954 260470 370569 313018 158927 194916 159270 37822 108809 147968
18873 147968 320311 439143 456062 284209 266173 466733 478477 334813 298496 240577
18863 240577 -50351 -62604 71115 132006 168194 258466 367933 228903 -40649 -24378
18853 -24378 101639 65429 15418 -23528 102190 109164 -39852 -53249 -93625 -147215 94667
18842 94667 244710 225283 86723 94053 58495 -106697 -256626 -303116 -430055 -390183 -483090
18831 -483090 -495185 -381418 -248566 -199003 -239278 -415478 -294749 -200762 99723 286806
18821 286806 219218 133300 97567 65287 95810 209121 258810 335296 461067 277401 2053
18810 2053 -26063 14434 -30773 -233184 -21037 247500 63357 -109731 6158 268601
18800 268601 384708 148263 51637 38125 198174 162202 193851 195186 180821 -23628 -53831
18789 -53831 -161543 -348422 -292345 -158688 -309072 -215311 -221579 -230482 -336308 -460337 -435092
18778 -435092 -193979 -20937 29050 25603 150348 187564 196660 371763 923822 1145575 1002619
18767 1002619 871399 842758 810331 488477 173285 186960 240267 105158 -143973 -277368
18757 -277368 -422306 -433339 -360385 -382248 -235176 -102173 13085 137210 164920 345426
18747 345426 338017 263507 206084 154689 29063 35430 -7796 -22964 26059 -45789 -40824 -28828
18735 -28828 -102350 -235539 49049 82638 30956 -5403 24168 -64931 -212458 -262964 -172858
18724 -172858 -121498 -71943 -76069 -89856 87429 71865 114493 103831 -92303 -184095 -268619
18713 -268619 -188645 -68270 276315 203891 105812 -46088 -203665 -216635 -288748 -484112
18703 -484112 -345027 5692 116877 60624 -111148 -94959 4578 -23073 -112370 -92476 -139423
18692 -139423 -41549 -38756 -229038 -529956 -531847 -544697 -524081 -567507 -296765 -28119 103776
18681 103776 8925 -108381 -81218 -51941 -42862 45421 177546 234331 198566 -3994 -22855
18670 -22855 -139181 29055 149722 299382 342316 293797 400561 379250 218489 164056
18660 164056 227384 324262 241985 191325 216970 166613 190267 284794 189572 173569 143955
18649 143955 -124347 -316151 -322813 -173254 -184618 -139842 -69012 -232098 -348704 -46401
18639 -46401 57944 123085 186531 237269 -99377 -314569 -118979 -166150 -68477 -267904 -355059
18628 -355059 -351756 -332571 -107271 94086 45336 117142 201138 2262 154995 332055 287732
18617 287732 52504 39917 258820 434275 327154 110553 70216 43868 88591 -41181
18607 -41181 -123401 -152701 -103555 49625 199357 161428 206962 85040 -35855 -11444 14039
18596 14039 62821 71186 -99141 -174642 -75390 -117355 -20338 97728 44511 -44650 -82381
18585 -82381 83278 161994 243987 194126 61911 212873 382992 223044 168678 189984 101554
18574 101554 82689 125267 163030 114086 -18709 -153945 -138181 27949 70597 83112 -30433
18563 -30433 -145815 -140777 -82752 -114874 -128469 -107471 107799 77579 -4264 -403473 -228142
18552 -228142 -79779 114769 229534 81359 -158605 -253726 -208822 -168771 132322 280976
18542 280976 133235 27750 107413 75926 -166568 -341625 -373063 -297696 -94104 -57982
18532 -57982 357 221052 375644 261998 -11502 -181094 -258973 -325915 -206879 75825
18522 75825 126080 -57323 67731 -37952 61267 195031 173864 151541 144924 -22674 17589
18511 17589 40470 -23517 14061 -98709 -92775 -168562 -261613 -53942 115579 305673 264309
18500 264309 17991 25891 53067 199587 230910 22818 58613 27023 -328 -81895 -200791
18489 -200791 -144366 167539 79668 77939 205791 267288 48352 -207734 -238556 -209520 -109466
18478 -109466 130740 112291 -9469 148868 82020 -46467 -23333 -182332 -250965 -205084
18468 -205084 -149090 95311 275283 331151 234608 93505 54550 57316 54124 208503 148272
18457 148272 162343 118610 133361 261118 23776 -8493 59050 148545 173142 202265 311628
18446 311628 366324 321032 270057 547811 578125 710685 664177 669120 929771 996963 752788
18435 752788 633883 695187 945708 1178408 1160919 1060655 1128111 1185228 1394388 1465874
18425 1465874 1744645 1869987 1712742 1536615 1493034 1421413 1433189 1473172 1432597 1551761
18415 1551761 1381754 1188300 1398743 1305182 1320035 1487961 1346477 1244025 1212813 1288903
18405 1288903 1256499 1312711 1215086 1043035 1154465 1253536 1342788 1410535 1152253 1136378 1111347
18394 1111347 1384959 1629442 1713752 1831474 1898144 1749367 1581795 1317501 1100565 1003481
18384 1003481 976597 1165685 1108740 1031017 819205 786298 832589 957328 827637 709460
18374 709460 687096 580247 637777 690065 561929 454545 612290 559152 408971 213163
18364 213163 165694 212586 344265 645630 950197 769190 660241 640064 766903 864116
18354 864116 940216 917776 1079804 1225835 1182241 1359940 1434125 1503640 1266816 943152
18344 943152 804404 672244 575391 589440 507643 366966 401901 352190 178690 123581 223058
18333 223058 281884 189142 139244 66644 -158037 -198527 -185698 -186087 -28607 16273 48895
18322 48895 215695 298969 350878 406355 435722 408455 145453 15312 -79467 142400 228312
18311 228312 372610 437928 586585 723535 806118 943698 1024596 919712 1037716 968595
18301 968595 725337 770086 760387 700078 667294 560613 472657 407162 592532 806400 922418
18290 922418 956951 748393 766053 656305 544367 429041 418616 264946 182186 190736 155580
18279 155580 73287 14622 -36128 -59040 -50537 -213467 -141017 -89246 -106117 -5452 146790
18268 146790 162572 27081 -74059 52221 172833 243044 321282 397902 351406 303964 277280
18257 277280 146271 24866 183160 472515 587095 657532 640507 588175 590066 435046
18247 435046 138874 103462 244783 207009 142027 -12693 107204 225512 453284 772623
18237 772623 785976 655035 565436 519933 570929 550630 451712 163995 101571 196365 264125
18226 264125 371178 367518 157529 -84670 -347568 -301262 -212278 -165825 -52264 29731 147604
18215 147604 294823 404940 266389 33067 -109674 -186849 -88601 -64011 -70403 -150492 -192731
18204 -192731 -6467 -69258 -134477 66010 306788 244201 59618 -236977 -274203 -147944
18194 -147944 15602 227649 278974 274210 -11638 -79167 -131146 -48755 105460 150240 235302
18183 235302 -3635 -129390 -232544 -83369 63798 115061 219024 340693 263642 316715
18173 316715 456218 435988 249856 78137 -161714 -247995 -202268 -178755 -63462 -20038
18163 -20038 109908 143006 111346 204056 341083 343787 428182 472607 357465 377735 380269
18152 380269 285743 277658 225840 476570 728959 804640 839911 814384 1054847 1214155 1085110
18141 1085110 1114833 1340727 1349892 1485391 1575310 1491040 1397637 1200844 1408189 1745973
18131 1745973 2003293 2276377 2461058 2891696 3395745 4070949 4502795 5005469 5878295
18122 5878295 7026153 8369861 9901884 12111850 15495266 19972192 27261976 39452438
18114 39452438 60524108 95050583 140618437 177286383 193127562 202946574 209253500
18107 209253500 197139384 146630256 95703329 64814471 45886152 33817652 26121936
18100 26121936 21019088 17346383 14821198 12788870 11248620 10090947 9214870 8568645
18092 8568645 7829465 7188314 6594913 6168244 5731616 5420542 5166378 4909990 4672818
18083 4672818 4437453 4105711 3835521 3409831 3220083 3386703 3285426 3194777 3061198 2785411
18073 2785411 2582450 2456707 2247998 2127211 2241076 2359539 2133006 1845233 2014795
18064 2014795 1879528 1839470 1660764 1560784 1568717 1338321 1157105 1285905 1444596 1533792
18054 1533792 1482911 1361937 1465132 1488703 1356420 1179740 1207729 1130939 1180265 1291267
18044 1291267 1297026 1221083 1268199 1312017 1197415 1100422 859103 781906 596239 633355 695596
18033 695596 723545 510830 368567 414847 609319 729112 963286 1001507 1032537 1022752 951991
18022 951991 926759 879465 855303 779800 560790 422203 507564 481657 439486 664409 859869
18011 859869 693882 469857 394885 321679 282969 310912 206418 220964 533030 675419
18001 675419 665743 658681 735658 679590 541804 477767 470032 556569 493732 514179 518903 485886
17989 485886 474238 624932 887194 909390 770301 648930 662229 668803 521669 202300
17979 202300 202944 448761 351000 243325 273936 519711 549543 666375 669152 521407 447387
17968 447387 406295 440348 628646 547163 575878 770907 660044 481739 495471 500667 435258
17957 435258 438708 376769 291856 535411 661717 411644 407726 404457 413314 491354 547245 620143
17945 620143 710444 649232 392751 286588 357028 498652 555980 333730 268234 203404 144772
17934 144772 349678 229233 253491 211931 122972 367858 423103 596488 361995 341290
17924 341290 432718 226321 -46289 -218046 -6688 275874 437925 308948 310537 394792
17914 394792 360320 283171 187173 242858 244095 153610 -25586 -84835 161753 398375 636310
17903 636310 704844 739468 676185 608421 596235 809555 893050 671425 760590 771964 595987
17892 595987 731093 845008 701430 510925 426665 517021 496332 750010 879403 1020485
17882 1020485 1405922 1666807 1821138 2050310 2282987 2209914 1972039 1921892 1696005 1411454
17872 1411454 1393074 1516628 1652893 1963084 2025732 2009739 2253115 2588295 2965341 3484061
17862 3484061 3958566 4488268 5187587 6389421 7833362 9733511 12857551 17458705 23932090
17853 23932090 33962527 47692029 62959286 75739024 83377197 87044602 86575085 78661600
17845 78661600 64004467 47624499 35200583 26758940 20991612 17048278 14262042 12339360
17837 12339360 10940392 10024061 9464858 9376456 9941260 11023388 12600942 14691004 17027469
17828 17027469 19179777 20371026 21160234 21213111 20132782 18418134 17119713 17013242 17769598
17819 17769598 18919643 19931092 20227824 20294717 19628798 17988693 15941146 14340593 13586762
17810 13586762 13424185 13941257 14740452 16169383 18450551 21938440 26862001 33802541
17802 33802541 44555659 61326450 85823755 116777037 147134492 169558953 183108403
17795 183108403 188544305 181526730 157556068 123078346 90889122 66578530 50154560
17788 50154560 38906889 31429231 26238032 22697351 20247316 18226015 16724452 15774386
17780 15774386 15400164 15573338 16351991 17610461 19449862 21359325 22928779 24151621
17772 24151621 25276980 25999473 26404875 26331541 26025395 25547042 24957574 23811436 21830608
17763 21830608 18770206 15823943 13582258 11992203 10942238 10664390 10614759 10940214 11629166
17754 11629166 12766502 14166003 16125240 18962054 23315009 30492982 41948654 57969110
17746 57969110 76323739 91502217 100476997 104993518 105217470 96281490 77272451 56518044
17738 56518044 40885743 30338864 23241298 18532175 15314420 12808080 10975161 9604875
17730 9604875 8576300 7939732 7439361 6817991 6304215 5932002 5350082 4911433 4802760
17721 4802760 4592512 4207748 4034896 3952915 4055461 3949221 3961141 3986626 3911817 3793304
17711 3793304 3406856 3112651 3001395 2608650 2373349 2218268 2120352 2233137 2270632 2130636
17701 2130636 1993709 1990823 1903971 2038692 2000894 1854217 1763967 1923281 1976622 1799832
17691 1799832 1580421 1435970 1402566 1332593 1249127 1231537 1256614 1388139 1458471 1295013
17681 1295013 1356923 1364180 1249675 1328259 1350487 1331241 1389612 1468351 1269656 1214559 1124368
17670 1124368 1018520 883250 1048893 1100736 1222462 1353765 1121957 925464 750081 533143
17660 533143 618797 977619 1017808 1080582 1021416 699096 573903 502335 565537 727326 706332
17649 706332 632541 642681 684882 548251 411018 274934 239368 285299 -23924 -18871 25148
17638 25148 196788 437293 562459 662718 595887 740399 688207 669629 693347 561782
17628 561782 484511 444799 541755 575469 701308 621598 522199 337415 469136 553011 714794
17617 714794 771868 919358 883875 789290 664636 619948 761628 1064625 946504 681637
17607 681637 507141 401915 291530 282297 329305 443520 486391 235544 26528 47420
17597 47420 23665 -120644 -146315 -101973 -184084 -186131 -13336 223794 331242 359468 407425
17586 407425 267567 303728 283007 248790 272835 165066 200669 146604 26048 55597 -15020
17575 -15020 -30821 165149 239366 141120 8921 -14881 -163189 44873 127222 183804 150849
17564 150849 33186 121134 292414 205852 88045 -28323 -22373 7555 117598 279269
17554 279269 197837 45955 -92642 -181997 57680 250119 160344 -62645 -101145 199857
17544 199857 451605 528539 581275 319837 214211 121166 -75665 -51959 -18575 179464
17534 179464 30987 -76004 -89463 -7882 153002 108948 -44372 67718 18549 -56650
17524 -56650 261345 274122 252098 400568 445555 266434 -43914 -246244 -261937 -78289
17514 -78289 5948 -27037 -83228 -74832 -149020 -83288 -164208 -290630 -144300 -37768 49424
17503 49424 84058 30953 -86883 -218461 -166559 -212935 -143104 63099 363318 234147 84773
17492 84773 23645 4399 -207495 -227096 -111713 23935 250627 267143 50497 -228476
17482 -228476 -184933 -133863 -142568 -91514 91571 297038 454349 482486 539628 397167 313172
17471 313172 373280 466642 178512 150723 71055 -196072 -152139 -29249 -292260 -255164 -179003
17460 -179003 -53072 71654 27574 145860 164338 54587 -53684 1655 121786 230440
17450 230440 328178 533714 576253 555739 578543 753484 857345 1061827 1035861 948949 833855
17439 833855 603298 601318 371722 332986 106105 -66605 -7987 129356 -63393 -135858
17429 -135858 -78277 -122588 -216093 -260083 -173568 30346 15521 93698 66501 75291 12939
17418 12939 67859 180310 198519 283014 375683 385169 377527 295158 143657 241568 307767 229268
17406 229268 206425 275886 235974 153966 269377 347988 215092 40229 -299431 -382831 -181679
17395 -181679 -58054 -102361 -94451 -58057 16904 17831 -44358 9829 101700 281503 105301
17384 105301 85565 215594 358876 251574 127680 90192 66483 23848 92676 72189 113241
17373 113241 161395 59018 149893 51185 -11380 -43897 -10117 101869 91450 11508 -81225
17362 -81225 -84816 105018 181938 317059 444677 297570 -53635 -14931 347381 457035
17352 457035 375546 534822 691956 878278 669097 652378 640611 352286 462111 604581
17342 604581 544264 612584 616371 220455 32517 131873 291778 263471 292803 158256 -44759
17331 -44759 2372 238373 493132 474466 439191 293632 106441 -112388 -184409 -140840 -99295
17320 -99295 156407 193310 337433 446561 416803 323318 279316 283762 375224 247100 109897
17309 109897 51735 107984 97806 7003 58840 99847 57140 15209 -7886 118003 450910
17298 450910 718094 713525 503077 461031 597186 718298 666076 540034 317373 107143
17288 107143 62987 46767 120291 220946 251917 371310 394822 497201 411494 186773 17558
17277 17558 49841 232818 380850 347573 233223 313745 248548 181880 85266 116265 194452
17266 194452 -19192 -28190 -2996 -13704 41298 5212 -21786 65676 96899 172423 125433
17255 125433 59971 1285 166297 409057 399615 322027 309089 441303 580847 676604 1008551
17244 1008551 1179373 926309 784498 849412 708142 324992 168111 273822 386637 375424
17234 375424 252823 254223 434350 518727 396315 254375 190379 63265 53094 135784 149261
17223 149261 167833 174501 261211 227947 408431 403224 554737 587415 331566 258896 180220
17212 180220 174405 270212 171615 213384 293822 566870 733461 647645 593773 524050 563777
17201 563777 658803 706628 646962 674545 778325 619239 535086 327879 481865 481545 451967
17190 451967 640613 633102 532485 391073 606015 697243 613463 700095 577720 244467
17180 244467 225875 396442 383028 509948 573658 403222 270048 269794 239250 369862 286824
17169 286824 -46396 -268608 -91262 28272 176481 59387 54734 97807 30686 -64436
17159 -64436 -155689 -109002 41818 -21470 -87186 -31274 169649 203479 77644 -20492 114165
17148 114165 301854 263947 287883 248521 50886 -36436 48734 154858 173104 174115 230280
17137 230280 242758 245711 230303 196152 256868 343255 242854 329334 545985 464913 400440
17126 400440 477853 448851 327134 300129 281529 177115 130065 120703 88249 56031 93010
17115 93010 67596 33285 211642 252264 50216 87956 117862 37729 65069 -58633 -55264
17104 -55264 -29809 -28529 -161926 -280009 -82924 -17287 -243571 -177994 -119764 -65142 -112656
17093 -112656 -212168 -108408 -28659 -90296 -286096 -187876 -242588 -242464 -138818 19151 138231
17082 138231 27495 -8627 111319 97937 -19485 163097 140933 -22482 -42358 -100612
17072 -100612 -178009 -101910 -68837 -76046 -36206 121912 263193 257496 123437 196132 170685
17061 170685 40852 -60368 -62771 -16552 47109 132186 42087 -33641 42780 18600 26854
17050 26854 184714 95417 -60148 -37792 157071 291737 127198 -32125 -60233 -79165
17040 -79165 -130453 92368 403678 251493 221075 294460 300347 221747 193455 224400 329780
17029 329780 516825 309885 213891 216832 388715 317907 406730 411622 671011 958700 1069824
17018 1069824 1150963 1132238 1080971 1040038 761489 532564 703851 687413 575399 416704
17008 416704 442568 571926 557236 446746 133941 -2164 52214 270185 217249 128453
16998 128453 311709 632608 911662 1156349 1133813 1107636 1119914 1071551 785856 539886
16988 539886 598145 814154 1094281 1296538 1404536 1637339 1748305 1820868 1887715 2061171
16978 2061171 2054932 1893640 1486902 1322429 1282014 1313314 1357421 1223536 1045852 1159896
16968 1159896 1367294 1458515 1647292 1365861 1291952 1213567 1078083 963192 600963 380552
16958 380552 338495 236093 101629 258186 289077 348708 499490 647555 533418 625461
16948 625461 708987 669003 650246 528969 473171 385768 363020 255294 50752 42624 11052
16937 11052 29653 193969 329263 247238 160835 -77083 -21346 180637 -28549 -166524
16927 -166524 -63056 -107408 -191794 -88429 -37284 -21717 96455 128266 142992 198894 105353
16916 105353 -28445 -35494 29643 -132939 -89118 -184774 -234952 -92587 116695 278636 288351
16905 288351 457319 374225 244731 169222 93995 204132 158312 108504 192928 238051 213809
16894 213809 244278 461524 475447 503089 428365 412500 270329 350016 384744 275434 173953
16883 173953 22682 55901 209696 370547 397815 241245 232974 209833 234807 391269 599819
16872 599819 507684 571668 716588 526748 699002 821277 813123 664625 553039 538659
16862 538659 266345 264782 223117 446495 534720 519397 669012 848206 806977 892604 983579
16851 983579 1080615 1009132 905646 688989 401687 412338 595095 665242 807210 912436
16841 912436 808381 831527 1228058 1488005 1745952 1952174 1941984 1977967 1998340 1999202 1762415
16830 1762415 1630748 1695746 1784242 1616876 1526261 1498576 1676405 2083447 2285183 2510511
16820 2510511 2875873 2994450 2952489 2865191 2977183 2826240 2661234 2474661 2117603 1977998
16810 1977998 1683754 1598914 1637415 1649423 1916894 2106137 2238106 2391170 2458832 2336059
16800 2336059 2054467 1920447 1892355 1823271 1574922 1410099 1283039 1250202 1208272 1005330
16790 1005330 906351 1133832 1476123 1652413 1736313 1860091 1878945 1906659 1776896 1618561
16780 1618561 1805247 1886378 1726192 1632551 1768172 1869167 1922933 2102620 2240865 2388585
16770 2388585 2514160 2414913 2452523 2422297 2521103 2512405 2395485 2214441 2244314 2093543 1940554
16759 1940554 1816701 1809334 1958568 2340382 2344137 2322341 2464789 2779011 3062164 3017543
16749 3017543 2965360 2863382 2570532 2370820 2215996 2381185 2672668 2773555 3015665 3287763
16739 3287763 3434046 3309458 3532284 3528107 3314217 2907649 2751801 2820886 2748316 2822881
16729 2822881 2951868 3245501 3703858 4007806 4287776 4592792 5031661 5115563 5199325 5520566
16719 5520566 6126371 6378398 6533013 7144257 8204286 9412803 11635084 14851182 19337276
16710 19337276 25630818 33826596 42973613 51669610 59273138 65935814 71543700 75811821
16702 75811821 78189030 79008024 79179987 79332264 79241804 77907493 75543440 74070443 74738502
16693 74738502 77493013 81025301 84929835 88612204 91201149 92180483 91488473 89642482
16685 89642482 86581110 81795953 74443187 63851941 51403931 40088413 31432839 25291960
16677 25291960 21073449 18433756 16827058 15846434 15119242 14652130 14555027 14225652 13880812
16668 13880812 13354982 12968646 12572583 12512243 12670225 12999088 13842233 15396334 17978179
16659 17978179 21843940 27419425 34795346 43133488 51180777 58109935 64290597 69534214
16651 69534214 73226841 74426206 73968279 72873372 71547655 70074102 67506409 64730070
16643 64730070 63658875 65961532 70682814 75749357 80528409 85118771 88645940 89863200
16635 89863200 88146319 84630242 80563094 75524436 68496637 58622107 46949493 36191782
16627 36191782 28270690 22408995 18212919 15380352 13356640 11996220 10887491 10078278
16619 10078278 9526019 8689362 8242803 7870939 7613026 7231906 6860224 6608110 6032349
16610 6032349 5559379 5371118 5116979 4765514 4496117 4420263 4348795 4156859 3841395 3531357
16600 3531357 3308376 3215190 3259178 3294980 3249600 3148664 3117482 2922995 2859870 2931949 2900443
16589 2900443 2679800 2520803 2523155 2633607 2573123 2598462 2601693 2467755 2242413 2016878
16579 2016878 1945902 1999704 2404812 2653204 2539575 2598436 2545826 2490475 2596200 2679764
16569 2679764 2681908 2660463 2561078 2495947 2525973 2680380 2805163 2931193 3099311 3014128 3064948
16558 3064948 3199960 3219736 3401502 3632330 3790506 4007407 4350149 4588336 4808353 5162470
16548 5162470 5571303 6009321 6558540 7269987 8003181 8605947 9992902 11667218 14229471
16539 14229471 17985949 22791637 28169360 32797100 37000556 41490027 46042502 49898842
16531 49898842 53461101 56659808 59814906 64458889 70584432 77904566 87618521 101324177
16523 101324177 115619845 127784858 140008740 153424412 165918345 175604414 185802288
16516 185802288 198069001 210722613 219913775 220384463 207939016 186175116 161199215
16509 161199215 136370042 116164143 103810631 100435484 106248341 120648287 141652438
16502 141652438 165520326 187528375 203703215 210971624 207454626 192765202 169086357
16495 169086357 141710076 117296940 99881371 90833445 89362836 94858986 106034172
16488 106034172 120252722 135174967 150187548 165268957 177124915 180691805 175670666
16481 175670666 168696616 163821019 159171083 151074204 141395400 132925377 126078519 119352754
16473 119352754 109057391 94266279 81757076 74614321 70206496 67259867 65728222
16466 65728222 64230054 61269895 56799709 52001878 48043719 44762400 41017249 35700790
16458 35700790 29634639 24677158 20877799 18290471 16091242 14610023 13357199 12489614
16450 12489614 11824180 11214226 10416193 9752393 9198993 8811232 8501952 8156349 7685784
16441 7685784 7301393 7035113 6725200 6519533 6514927 6266845 6067129 5840123 5579072 5330009
16431 5330009 5124338 5127999 5110118 4794842 4571531 4437031 4148344 3960225 3922014 3669001
16421 3669001 3586600 3505292 3308126 3395918 3436568 3260060 3291380 3087226 3050497 2883832
16411 2883832 2755692 2697712 2558802 2545766 2479164 2313931 2273528 2313163 2391016 2513309
16401 2513309 2601501 2609017 2588719 2447171 2452899 2411482 2272008 2127869 2046884 2062737 2161730
16390 2161730 2308709 2325178 2270652 2071447 2125144 2168884 2120632 1938588 1581873 1363201
16380 1363201 1371923 1293622 1274782 1121665 1056638 1257796 1333238 1376414 1108342 1097618 1233261
16369 1233261 1360063 1425184 1303773 1199175 1294085 1494357 1477482 1229545 1286382 1235324
16359 1235324 1117330 1076623 1098214 1014529 1134250 1053567 789500 834991 924819 968170 933296
16348 933296 881142 803656 662170 727258 927670 833357 615071 481704 525690 416990
16338 416990 493994 581496 662421 700264 814222 902276 902161 973690 956780 991253 950538 896880
16326 896880 970305 839881 588816 637609 657805 543258 404440 280994 262433 399725
16316 399725 543594 501308 528829 559909 667016 834105 816971 592479 409720 341061
16306 341061 298952 403035 358855 301826 415240 597589 561858 497366 536588 558962 512034
16295 512034 319032 269405 288797 479699 442428 305998 239169 282863 372980 443847 349846
16284 349846 127903 180506 180934 30676 -120080 -229559 -133747 2310 21858 66997 70656
16273 70656 79136 143350 82224 140466 399153 214421 72630 70774 58648 -15863 -70430
16262 -70430 6583 -65334 -109858 -178598 -160058 51599 91663 145021 142056 129823 274599
16251 274599 363724 373438 398195 383502 347498 206341 105786 187514 350488 440257 672837
16240 672837 560903 331396 314961 245113 204193 157924 79823 119007 302757 432191 398691
16229 398691 478298 327447 63918 221685 424946 445345 264317 191433 306043 464890
16219 464890 409485 167977 217953 198276 -43839 53379 -71486 -137257 -96441 42074 24578
16208 24578 128814 106267 140842 305618 555904 723988 371158 404737 564230 656263
16198 656263 611064 745577 840903 699758 480216 702709 875817 994831 1016342 841988
16188 841988 708640 811248 650109 602570 658967 630505 560461 632260 637102 367137 353630
16177 353630 459894 385946 245655 32330 10999 64129 228180 226642 109863 122301 33210
16166 33210 -18774 115429 187730 147470 401731 500316 352803 273172 300935 303431 212155
16155 212155 163611 271986 358413 459234 526465 587823 639901 461714 422709 604784 551998
16144 551998 310244 94587 151564 274019 364551 443617 499939 639169 653638 756296
16134 756296 813643 851848 712024 722017 776995 650746 646780 478662 464468 310549 95363
16123 95363 -20961 -30472 73645 169659 66829 -73936 -220201 -312878 -119675 5327
16113 5327 -33927 -163444 -33406 118571 247220 229020 321932 183405 -145331 -203800 -13386
16102 -13386 21837 76943 67052 143310 148798 166618 56764 39072 14546 219698 387640
16091 387640 309894 352986 258902 159686 -48636 -154762 -168621 -45866 -148347 -85671 72912
16080 72912 -57575 72629 265136 285793 337665 115336 25749 144587 184441 280481 257830
16069 257830 272099 340883 224802 111099 44104 -29105 17302 59893 306350 401394 234662
16058 234662 215563 122537 117261 191214 179511 228582 113316 128890 69080 -10285 -24005
16047 -24005 96397 92961 175208 227221 356662 373742 319615 413041 424813 374349 445328
16036 445328 463957 348096 137579 256637 454362 619566 733123 908150 1061381 1066823
16026 1066823 1094490 1224957 1145633 1038729 886290 899504 808001 834943 1066144 1057305 1060296
16015 1060296 1068569 1301687 1387322 1328957 1322651 1274289 1048540 1111019 1165739 733909 565189
16004 565189 448890 582104 819596 948538 1142265 1170834 1090913 936012 772539 589125
15994 589125 461155 252401 245610 174131 230046 137935 -38983 97805 213117 138657 141064
15983 141064 253885 236053 299517 290695 219487 450227 728806 786783 719559 715144 644389
15972 644389 737536 678549 389471 377689 535936 629928 681542 514073 461477 352367 258752
15961 258752 320438 481640 683449 553138 449330 257073 249743 279122 194667 83418
15951 83418 42189 117945 13971 133661 111420 214379 227246 257252 220726 9038 2294
15940 2294 19831 -93249 -230228 -232000 -70675 -42633 -129623 -150440 -89406 119615 -177184
15929 -177184 -300473 -78315 110188 223209 284571 88193 199906 349156 342905 368150
15919 368150 170176 337817 403167 338052 182345 165196 110155 162212 265989 117074
15909 117074 70587 107151 40373 -20029 40296 24273 -37128 57889 262620 109978 -51154
15898 -51154 23568 -107042 16033 1414 -100944 -23844 102789 188529 246457 165520 126393
15887 126393 230926 279341 258953 231802 311265 55653 -45367 16462 66536 -11952 227362
15876 227362 384194 233030 113029 42739 -88028 -302389 -348304 -33768 33708 16599
15866 16599 -12683 18430 232638 325022 232872 365623 430558 333147 130258 74821 135620
15855 135620 48081 33635 16298 73717 80392 -82665 -71815 56195 181164 115723 90817
15844 90817 116021 224581 45171 -219774 -108066 -85532 -174653 164572 252924 133316
15834 133316 144577 -81608 -352141 -252476 -6185 71478 153947 30498 -83392 -14304
15824 -14304 -113500 -190715 -224626 -189246 -65660 16203 114386 -16111 -177890 -197701 -260546
15813 -260546 -90343 -135370 -177946 -184471 -235207 -156103 -154710 31963 58845 42546 110226
15802 110226 267854 124437 5320 6260 125161 202662 112283 -13399 -16116 -118712 -117547
15791 -117547 33502 -11656 20822 70218 91159 100070 58004 178852 374405 289054 12869
15780 12869 94928 92029 81502 312011 314934 50663 -297999 -518527 -339923 -191233 -100112
15769 -100112 -126861 10246 310589 404263 361419 184214 -48995 -242371 -362094 -251249
15759 -251249 17323 175387 251049 57718 -143392 -133396 -135176 -29559 -103381 48414 42643
15748 42643 -88966 -20063 167492 314866 402064 379809 156010 18062 50439 210997
15738 210997 263342 135654 -112452 -106372 -160813 -242477 -94009 98520 171249 -21283 -317794
15727 -317794 -279105 -159968 -212097 -439212 -427160 -349471 -65611 155051 250020 121550
15717 121550 117649 52514 4011 -12471 205947 426301 401985 345318 355188 119186 48096
15706 48096 147028 179239 88914 69072 -111248 -74288 41385 80872 136420 47193 13283
15695 13283 41432 24198 -116770 -228105 -187595 -205073 -286617 -225548 -140301 -127916 -241920
15684 -241920 -482811 -338562 -174879 -108039 -183394 -75317 21455 125012 188350 298725
15674 298725 191161 158863 2273 8894 -48727 40367 90806 -89900 -36190 5338 -55445
15663 -55445 -156980 -261773 -255660 -140878 -109399 -132450 -182017 -98455 208749 309997 292489
15652 292489 295091 157250 322203 499119 330443 145400 65834 -70612 -207504 -208657
15642 -208657 -253774 -201340 -162900 -20091 40806 -22559 35404 -99453 -176166 -70887 -18367
15631 -18367 -18815 -182540 -143591 149253 222106 185426 -72007 -189391 -101903 97095 164991
15620 164991 146336 -24196 10324 67975 -188412 -182990 -61328 -33055 -24115 -23678 -237658
15609 -237658 -122524 35753 139379 -117397 -332622 -211500 -353048 -357908 -378145 -254727
15599 -254727 -183078 -245771 -286601 -312391 -310981 -250319 -151952 -509 77766 -58683 -41301
15588 -41301 -191213 -490727 -594793 -376293 -149869 68682 179757 183419 62701 -143619
15578 -143619 -218511 -64192 71588 -73652 -60827 -6535 -10812 -73337 -254640 -122371 31765
15567 31765 200731 276660 213828 259570 256739 -9069 -161956 -142584 -84661 -173970 -125334
15556 -125334 -119527 -89634 -63336 -36876 -184078 -142015 -32082 -134141 -220621 -261660 -115641
15545 -115641 -159832 -212528 -260081 -240475 -218536 -168663 -55558 -58362 -29219 -98773 -45151
15534 -45151 4440 -89835 -290422 -252914 -246158 -345427 -413826 -332235 -144932 -193016 -214983
15523 -214983 -58015 -82378 -103071 -5651 -248731 -333782 -338900 -235174 -97684 164852 -22578
15512 -22578 -174330 -310902 -203034 -13790 217359 322952 165320 142844 296423 288321
15502 288321 325146 271913 14675 31171 141493 187571 124863 104280 52348 -100090 -27763
15491 -27763 112677 85680 -41999 76388 247215 242393 251976 247988 -8123 -52986 -121881
15480 -121881 -167815 -165131 -64439 -82933 -258209 -212017 -9871 116310 84757 82365 -94289
15469 -94289 -272899 -465078 -373655 -225064 -50701 139588 146663 76850 33782 76292 107231
15458 107231 43131 -151053 -264993 -220405 -288885 -236991 -68447 5512 212187 258648 -11640
15447 -11640 -105742 -129419 61534 -2622 -84731 -14719 99942 53615 33696 -45383 -106492
15436 -106492 -145410 -139478 -61287 -65679 22861 -11143 -22518 -80007 -102910 -66652 -268624 -493249
15424 -493249 -161768 122739 109184 96520 -5117 -227609 -226937 -135702 134209 273482 239732
15413 239732 146954 88998 65608 34578 -144364 -189714 -54538 73867 323451 377626 219908
15402 219908 272839 10696 -118678 -60082 19572 -93960 -248170 -283424 -215656 -118588 12263
15391 12263 -132572 -204204 -48286 -8087 -47941 -68244 105058 173536 3676 -206610 -332022
15380 -332022 -203685 -76223 54651 -39370 21256 -68756 -14165 5322 -238090 -377013
15370 -377013 -184440 -139024 -56934 142256 337595 234626 257287 203658 96966 82757
15360 82757 -29128 -106149 8957 233858 303934 229151 114649 178963 231820 76842 44909
15349 44909 -229398 -442594 -454587 -397126 -275948 -30622 8384 -20969 101183 163156 6037
15338 6037 -13559 -108208 -167664 -158413 -56631 73049 66367 -27645 -180943 -368412 -418691
15327 -418691 -300794 -129791 13652 -214446 -269135 -209299 -256895 -103900 -55158 -198639
15317 -198639 -176658 -105079 -257642 -282137 -221302 -130466 -76060 -223739 -383392 -411981 -495080
15306 -495080 -372512 -152734 29173 108327 102807 71012 6146 -7965 84537 291832 247384
15295 247384 194260 37401 -139863 -214960 -228805 -230686 -45950 86757 13905 45034 163264
15284 163264 -167178 -158150 -11276 6551 -30721 40570 -69879 115308 246057 146830 113912
15273 113912 -80099 -154483 -60665 34139 -3960 -21479 -123568 -115949 5372 33787 82138
15262 82138 5862 19854 66926 73548 278770 493844 357103 324374 452390 254136 222899
15251 222899 185094 282856 189579 143549 10458 39487 163285 154321 86103 104983 90465
15240 90465 80575 137837 111633 -15580 -4608 90453 -42325 9011 21677 -167896 211464
15229 211464 499525 316863 55675 58939 1566 -92170 -293364 -214596 -61216 -2938 86806
15218 86806 54829 146533 111343 51857 -101728 -46496 -50216 98420 147722 156734 116526 155055
15206 155055 83283 51783 1782 -92015 -211326 -169392 -55115 136334 79954 97551 4874
15195 4874 181130 418424 358737 296762 368465 283802 123688 86131 201278 229993 298059
15184 298059 298573 452091 513612 306419 209162 199254 49006 -49106 -163754 -307315 -223941
15173 -223941 37290 -33888 -68264 21616 -248375 -195126 -70502 160019 134788 8448
15163 8448 -21224 -84013 -158933 -578 -42478 -100814 -147901 -84948 132752 -19580 -116240
15152 -116240 -23412 -2822 107562 129349 -28965 11106 -82833 -152042 63048 214408 315549
15141 315549 355595 384335 330151 208018 219486 326512 589919 606018 341599 111404
15131 111404 -122706 -58564 -152113 -240662 -19389 82843 67388 30081 41244 145184 171600
15120 171600 95357 160984 9642 -178122 -276300 -195970 32629 100740 -91371 -106442 30116
15109 30116 -21209 -180239 -249778 -179304 -260878 -256806 -112592 -75769 168922 218340 206351
15098 206351 34736 112574 77625 -187860 -356577 -289509 -269820 -342294 -249296 -46088 3656
15087 3656 -129901 -220422 -163092 -145288 -204973 -245822 -183883 76445 -10072 -80791 13814
15076 13814 -75493 -114178 222329 375725 252232 138062 -27350 -295737 -386801 -284543
15066 -284543 -129538 -353290 -261580 -10586 177801 105308 102155 -86145 -58057 42814
15056 42814 -47312 12839 -194427 -270711 -230953 -96793 22448 -71554 -112682 -183263 -1987
15045 -1987 -22420 29101 94083 -59595 -165268 -119019 -205010 -87650 -194578 -331934 -264569
15034 -264569 -41255 27352 -103722 -87387 -47808 116455 296110 207228 145527 30293
15024 30293 61603 -156931 -86028 88823 181681 236044 106398 59517 86515 164063 201272
15013 201272 96317 212102 353465 464574 606790 952085 1332214 1388777 1534168 1856948
15003 1856948 1961582 1716438 1318548 901433 418419 -130190 -33235 6573 -153017 -176434
14993 -176434 -199465 -220673 -193289 -210919 -172260 -23787 152493 191006 -50759 -103249 -46712
14982 -46712 12263 -133921 -33731 152842 304293 294653 73222 130400 147295 -104637 -194668
14971 -194668 -204530 -92763 -96252 -88856 -116971 -65865 2787 86371 3554 84463 261823 391175
14959 391175 325426 65842 -15591 -14217 -7752 -44762 252744 233030 145184 57142 296931
14948 296931 373223 171668 -265601 -315986 -18052 40114 128088 77774 97986 -56197 -47216
14937 -47216 -53826 -86889 -152773 -142986 -169392 -227972 -132803 -24863 -52309 76921 279326
14926 279326 356610 157556 68403 108360 76472 63347 146685 279065 252838 1076 -268897
14915 -268897 -247507 -127660 -22022 62134 141742 43069 53901 100053 42964 51969 11894
14904 11894 -48934 -139567 -116092 -179494 -309908 -241901 -165485 -134385 -47893 7276 -48166
14893 -48166 39889 -59353 22235 87821 -88369 -119991 -98625 -147877 -121082 203176 413740
14882 413740 182131 97935 118471 84703 122433 250028 159075 41522 118000 131783 45332
14871 45332 -131622 -93135 78306 156500 346935 242600 45327 -41978 -24474 -26556 -74278
14860 -74278 -62458 157348 166983 140628 -7475 94616 -11487 -343431 -506051 -347592
14850 -347592 -189628 -167727 -7592 -123696 -238055 -348575 -303972 -183682 -81546 61469
14840 61469 258194 337785 283603 64650 -76749 -193751 -124525 -216629 -346830 -302662 -130832
14829 -130832 -142269 -194894 -118563 3729 62424 -107275 -158328 -26600 51516 -87957 -380821
14818 -380821 -397048 -359520 -297734 -44547 107474 152256 23070 -12338 -40822 -99580 -168846
14807 -168846 -100467 -83863 70812 74479 58929 -93873 -90324 -112743 -235009 19414 176049
14796 176049 130334 243760 239833 228351 19945 -40725 35073 96286 -73684 -153155 -48042
14785 -48042 -141526 -108924 -94214 -122717 -65427 34681 173834 -116929 -249713 -42564 21188
14774 21188 -21813 -64581 -91489 -95214 -65521 141647 274844 74874 -204719 -157718 -4593
14763 -4593 159126 327505 344363 182968 -40228 -69784 14830 -173390 -266830 -230858 -138920
14752 -138920 58896 -169535 -251688 -144161 43338 -83046 -270835 -327968 -68195 66923
14742 66923 -57318 -209891 -174346 -151285 -199895 -314062 -489261 -403283 -140135 33535
14732 33535 170516 227893 333080 81537 -130361 -29554 54728 19472 -19845 39799 35771
14721 35771 -22061 -169123 -256886 -259026 -225334 -186057 -143891 4871 2753 169125 229687
14710 229687 24470 -179493 -193240 -186793 -278388 -296534 -151739 31883 37686 -46934 -132015
14699 -132015 -93025 108687 50143 -107951 -302217 -439248 -368548 -205801 -166598 -70776
14689 -70776 -31082 -40881 -250668 -375200 -180441 -89262 -178140 -205416 -203577 -121739 -12749
14678 -12749 -5856 -70258 -213157 -288205 -88778 57872 33886 33282 223778 68143 119797
14667 119797 51703 -192481 -217953 -138397 67029 45725 110619 203702 40842 4111 -32647
14656 -32647 -164253 -156714 49240 195363 173939 230790 262587 126365 51989 23429 -35575
14645 -35575 44678 -18303 -155107 -148940 -81048 26710 -37033 -179217 -94047 -42188 -27994
14634 -27994 -18354 37886 -91342 -175629 -4229 103371 -223810 -330334 -384907 -291160 -122635
14623 -122635 -79212 -56763 25650 -101159 -291158 -340238 -129244 -170231 -309930 -270892 -253676
14612 -253676 12112 -26031 79493 38442 -20286 28519 96434 -87408 -4912 56059 66911
14601 66911 -182079 -121446 31310 80994 222760 284449 226130 207441 193277 207491 172136
14590 172136 117066 -27550 90765 27826 136302 -36478 -138738 -74715 -189234 -181522
14580 -181522 -64711 -139401 -202168 33736 40756 -85407 -78013 40508 142687 -107506 -70645
14569 -70645 -231059 -291350 -230346 -333449 -333395 -99880 -2193 -73127 -49459 45168 182728
14558 182728 375366 230326 75473 -9861 -50251 44593 44086 -19597 -50444 28884 26701
14547 26701 35338 110280 178132 48675 49448 13777 -50734 -156270 -139328 -53466 -14623 -84063
14535 -84063 -123333 -6662 -253051 -382656 -233717 -17215 -25001 60138 224339 283771 266043
14524 266043 245759 143847 43812 -8008 58932 -1134 -146985 -72569 175811 310264
14514 310264 298974 347898 253356 98365 60335 35156 93753 202953 26791 107150 120653
14503 120653 64498 -15785 -7443 187372 316773 400405 407466 374053 337723 235982 61667
14492 61667 -216204 -116652 -104702 -136060 -81437 -115107 -55382 -63436 -192481 -210920 -5741
14481 -5741 -34934 -106000 -61879 -46723 -63057 -68083 -248924 -395429 -260292 -114583 -197535
14470 -197535 -112833 -17338 3684 18344 -36059 -136214 -114989 -46288 -286152 -359228 -432406
14459 -432406 -362624 -208544 -136482 -133168 -231847 -389039 -291383 -25063 -28435 -56690 -194561
14448 -194561 -221672 -234670 -309067 -117720 -5382 45403 114067 54751 5616 34622 65781
14437 65781 -213259 -269481 -60172 -44041 11616 31329 46449 133973 208422 206177 161180
14426 161180 47261 74872 188949 305794 83515 -138617 -239279 -329812 -301332 -113273
14416 -113273 -23000 37963 56748 51109 -27819 -141730 -238303 -101441 -24665 -236429 -259921
14405 -259921 -92407 -44725 -134621 -183444 -322800 -297500 -188498 4189 35143 14802 -272133
14394 -272133 -444386 -337761 22688 181452 91075 86051 -80585 -75998 -160857 -343062 -348164
14383 -348164 25603 158171 148602 120609 77066 -270382 -410718 -310841 -249687 -266846 -235890
14372 -235890 -118860 -253232 -326013 -329304 -336697 -327014 -252804 -168875 -21906 18055 -159310
14361 -159310 -175652 -22918 -82836 -166411 -333735 -354952 -216345 -274907 -347473 -90876 24870
14350 24870 -33020 -153089 -275949 -158377 64773 240768 322259 510973 265908 75638
14340 75638 32913 107438 105541 -2833 -57976 57457 89174 227971 253808 241862 80934
14329 80934 65007 85046 184518 315855 284059 275800 226739 219391 53836 123211 46352 -84931
14317 -84931 -8311 40575 165344 304142 307350 223721 242217 89530 -36696 13308 69581
14306 69581 177925 193457 -32593 -69057 -16229 -75968 -171249 -44470 38552 233504 338178
14295 338178 254239 -38437 -207966 -62381 -48094 -21884 41415 53812 -41291 -254562 -301252
14284 -301252 -133812 -55607 -96150 -275614 -179873 -85283 20437 -86539 -214931 -153118
14274 -153118 17691 101046 -33512 -182673 -69773 13526 84045 187232 247820 91441
14264 91441 109473 29512 -134072 -7652 144988 -90136 -149973 -205493 -270729 -282581 -246242
14253 -246242 -125248 -45063 -40029 -107599 213574 367818 221087 250786 183725 -49448 -225153
14242 -225153 -261596 -231086 -287032 -46222 120180 98744 -76024 -74477 -12057 -129652 -158630
14231 -158630 -144586 13344 -19974 -124365 -87697 -31736 -33818 -114279 -100551 32309 132156
14220 132156 145347 325747 337439 503763 378432 192223 82475 50040 -18395 -3687
14210 -3687 -41535 98138 172964 -1781 -239216 -261611 -56252 -49282 -138631 -10362 173673
14199 173673 225626 101443 -59369 -26464 109425 64017 -66265 9195 10918 85761 154856
14188 154856 145390 -25988 -239168 -188843 -204855 -134875 -61088 111626 113767 -196387 -486746
14177 -486746 -560761 -350454 -272169 -319208 -254355 -263322 -227418 -227131 -127276 -53437 -268956 -222141
14165 -222141 -134367 -33568 68009 69355 19289 -64030 -86877 113430 83681 -175888 -378305
14154 -378305 -223088 -177094 -335103 -247844 -258591 -51278 148930 73517 -8038 69189 -102152
14143 -102152 -181812 -429980 -403983 -202315 -119760 -14628 -50236 -147571 -129677 28674 -10660
14132 -10660 -206884 -80914 60653 272004 199618 25830 -158174 -8224 276554 498219
14122 498219 398236 170879 209036 340879 140328 82777 138368 19349 -97855 -268636
14112 -268636 -438986 -385921 -176782 -98272 82619 61716 -105371 -201274 -165502 -122161 -33734
14101 -33734 47005 -132885 -156101 57938 35938 -54833 -140513 -378551 -234391 -249721 -196601
14090 -196601 -342120 -380184 -179172 72914 128474 5920 -172555 -180356 -187432 -175947 -94059
14079 -94059 118993 248037 285078 209718 -71881 -219275 -308466 -353400 -276305 32386 105947
14068 105947 5577 -68824 -173492 -125804 -136235 -128319 -154471 -20491 16716 -105118 -116803
14057 -116803 -127301 -187535 -200998 -228910 -102502 -78653 -122621 12340 256906 396319 275921
14046 275921 226525 195337 143120 125758 144512 -101741 -155056 -193559 -383983 -325793 -51328
14035 -51328 41444 77155 131311 3937 -380138 -407846 -262959 10300 143597 33708
14025 33708 31801 -8195 -183515 -150969 -56740 -41515 128500 62897 -47152 81326 2281
14014 2281 -225336 -514556 -538743 -358473 -217644 -251855 -315267 -68308 -86214 -41553 -62951
14003 -62951 -176552 -159340 -287371 -221093 -84716 114479 102178 -155006 -244836 -122365
13993 -122365 -183070 -71467 134525 114417 13 77226 169203 204381 198758 187131 -54635
13982 -54635 -6263 -24626 83940 169999 222225 400439 353759 217998 -3706 -976 -210974
13971 -210974 -108701 146155 3408 -178853 -131506 138089 376015 171587 -28757 164777
13961 164777 345599 259594 132870 15100 -229979 -146509 -108281 -116506 200407 488479
13951 488479 547179 562199 421190 219549 166347 215269 -56060 -213069 -276304 -306872 -397657
13940 -397657 -355969 -265845 42530 180724 164676 7289 -194379 -94669 -27461 -115154 -40072
13929 -40072 40491 36325 29824 -37256 -21209 -17025 -24997 29139 131791 201835 62866 -49144
13917 -49144 -177202 -115068 -203371 -343644 -108617 1641 -58198 -25108 -49914 -58707 -52164
13906 -52164 -33648 157178 228629 -81840 -396714 -272342 -99570 -77003 -497111 -488565 -440991
13895 -440991 -419483 -85858 126073 57771 -158867 -301726 -123317 -209745 -206409 -137305 19148
13884 19148 19538 -12693 6305 53119 54113 111777 107874 -39781 -52749 -60361 -257135 -395001
13872 -395001 -32979 222215 327592 90711 -219419 -291038 -266718 -147271 -117281 -59621
13862 -59621 -49233 -85997 -114595 105202 207985 23255 -98038 -39609 77452 40474 -141591
13851 -141591 -106017 -211071 -197847 -125302 -263095 -316006 -204729 -204335 -81200 209347 261390
13840 261390 304483 270053 146116 151067 116866 46895 -87813 -181093 -229272 -72817 -28372
13829 -28372 80626 177535 -29353 132955 199171 9749 -153722 -22736 29985 18624
13819 18624 33214 7439 -126106 -107806 126202 182135 282123 308116 276234 207258 151567
13808 151567 241068 140119 83326 87734 171366 73693 -11414 -77773 -109006 -71693 95330
13797 95330 151634 29955 -27462 -215852 -263311 -147090 -122048 25280 144870 249441
13787 249441 182083 221348 196890 201591 171290 136164 -7358 -93860 -201084 -249217 -421007
13776 -421007 -453897 -205503 229268 211112 48786 -59153 -97623 -323374 -216561 -106538
13766 -106538 -34412 -51741 -122103 -64200 -77722 -948 -35117 -54236 -157786 -161770 -80895
13755 -80895 -47483 -66224 -133110 33341 -33246 -125148 -34165 124042 181391 344026 376215
13744 376215 328692 226819 -8790 -135370 62696 119940 -9844 -66604 -152202 17834
13734 17834 92945 73405 -83313 -318306 -488703 -301776 -53532 245076 460896 376226
13724 376226 120894 -77697 -372521 -365933 -23897 193023 -9107 49591 149960 186618
13714 186618 122477 -23533 68279 27131 15864 106487 256637 218337 14116 -49024 -165531
13703 -165531 -19017 9930 162576 276412 321930 116971 -183308 -401442 -334848 -219358
13693 -219358 -92657 168641 132469 192628 112421 111314 249689 346481 266919 115011 236128
13682 236128 412381 376979 165507 78953 153777 170293 95906 -11592 102091 155744 61016
13671 61016 -157731 -182402 -89867 1729 -74908 -85382 -62119 -93111 123478 251339 20587
13660 20587 -215165 -129692 41350 211805 125732 164514 -974 -74189 53372 -224597
13650 -224597 -325638 -144106 -74917 72846 93663 12056 -39760 -218363 -140144 -93713 -176170
13639 -176170 -250298 76220 86064 37663 99054 69219 4617 245477 238123 288524 275843
13628 275843 65497 -144345 -179472 71384 169880 196422 89981 -113403 -241429 -208522
13618 -208522 -199123 -82096 -44394 -84010 104180 7975 -244337 -377212 -261846 -115970
13608 -115970 -233530 -183984 -29805 50723 26411 -81961 -35450 7212 -10247 -7855 63412
13597 63412 146061 158022 47509 53098 -94678 -131882 -170239 -354867 -123407 57641 57443
13586 57443 179413 244370 15164 -101445 -31530 126442 158992 139769 238582 77727 -146107
13575 -146107 -215972 -39597 62798 -41503 -161778 -203686 -57988 147129 171569 43609
13565 43609 -76344 29098 -54647 -284848 -200759 16171 279115 322852 44904 -6791
13555 -6791 125399 61814 -56856 195577 316382 137116 65316 -2173 55185 47629 -197399
13544 -197399 -253015 -237332 -251704 -136442 -56314 72779 127481 79593 56123 -16417 -19698
13533 -19698 95230 26904 81224 146440 238166 307240 270403 256631 180890 1360 28904
13522 28904 224531 186634 268602 213798 -20191 -47094 -121188 5829 223209 10798 -194712
13511 -194712 -166306 -82077 -145116 -102848 -197918 -282684 -283581 -281505 -271939 -264768 -296285 -189861
13499 -189861 -10046 5309 -21937 -149397 -473323 -301445 8074 105750 115548 101210 -145503
13488 -145503 -205358 -85348 -131372 -117678 -132913 -178427 -269375 -28093 272154 472375 397869
13477 397869 290486 387860 425578 302189 133763 240343 294864 163685 41710 205940
13467 205940 126658 -130841 -186238 -163527 -114713 -86329 -37537 192755 212363 70619 -141295
13456 -141295 -176084 -231623 -223087 155908 471023 548380 511738 445600 128895 -49757 44665
13445 44665 -30714 112073 77778 170476 156887 172783 112238 65169 -26849 169360 275258
13434 275258 172531 73049 9453 -177420 -77402 -13175 101443 137351 2998 -141463
13424 -141463 -285053 -301597 -93175 39568 62309 -32563 13681 157944 125892 119013 -73795
13413 -73795 -185317 -83984 36725 96431 226533 250482 143795 123861 285505 291449 268447
13402 268447 -42223 -201826 -155443 71808 207237 340545 124817 -8948 -49169 34645
13392 34645 206438 62873 -30916 -122885 -22015 8286 87784 222727 203115 225286 166647
13381 166647 102779 244613 171843 121783 34068 -79258 -262145 -286848 -13543 94012
13371 94012 -127166 -67642 151237 262289 297326 293687 241420 251190 68057 222338 368016
13360 368016 144527 -11988 129563 225355 222691 -3711 -119850 -118551 -112893 -57015 37343
13349 37343 5133 211746 301389 67761 66246 152139 119016 220942 548457 601242 406347
13338 406347 224976 163076 278712 268803 180741 70517 172096 314998 76418 -42426
13328 -42426 152025 317887 242538 108134 -109158 -232994 -86942 129188 242285 289263
13318 289263 278646 51003 48082 194643 219803 144021 58314 23713 212470 167834 281659
13307 281659 412964 481234 413095 461522 483507 254158 63598 279818 356181 277070 3456
13296 3456 36911 299295 308983 38065 1243 316 7787 4467 129456 184902 213465 55318
13284 55318 84078 44712 -113231 -468209 -480371 -289782 -90415 -137167 -80042 198485 189591
13273 189591 241229 208243 342691 307455 55511 173034 249731 446106 371330 126035
13263 126035 156714 263921 358819 399868 357535 476494 603969 682218 627478 513764 425035
13252 425035 304360 424842 456716 221184 12116 181474 106172 206181 20620 5347
13242 5347 202099 211732 178590 243232 397732 304695 174001 173932 253299 385888 292012 371203
13230 371203 571305 561082 298941 199631 184388 -83007 199888 400884 167971 266296
13220 266296 268757 425030 540410 555659 472625 179101 134398 175720 301999 293610 189398
13209 189398 162068 362584 487390 515272 268682 229398 212581 216049 108611 72512 -74699
13198 -74699 205682 459571 589254 355372 422084 514006 191901 231445 284245 94710
13188 94710 121358 200503 116432 219153 606532 833525 1018736 1248268 1330942 1478984
13178 1478984 1712741 1755394 2066537 2216540 2116523 1993678 1629707 1341483 1213074 994246
13168 994246 637634 447445 451041 636025 853418 1031396 999871 1084473 1368254 1343188
13158 1343188 1344947 1357893 1306214 1419330 1602521 1628681 1646844 1757436 1972590 2135151
13148 2135151 1912004 2078548 2222922 2294132 2410118 2312773 2238768 2172804 2039317 1980069
13138 1980069 1933001 1848137 1659166 1585709 1561731 1498290 1678155 1551431 1458157 1333186
13128 1333186 816555 735137 849589 818672 1027447 1001118 1210477 1248256 1419803 1427959
13118 1427959 1686559 2040641 2308013 2497222 2434012 2253404 2197414 2009986 1786765 1321119
13108 1321119 1076060 913989 732686 616233 610542 672609 647348 632592 620792 759081
13098 759081 818538 768779 737322 698921 730004 599323 414419 209569 52774 37581 33328
13087 33328 125565 126554 27185 192941 350142 384615 469095 563246 290461 340464 359083
13076 359083 300302 461763 547951 335895 209966 281001 278891 428897 420559 463813 565594
13065 565594 554516 381198 332923 208112 165679 250073 421052 529509 317004 303459
13055 303459 300319 440728 601204 506099 402430 379226 458332 677355 577138 266623
13045 266623 147972 374368 468305 487558 581952 766435 715660 448155 467691 632553
13035 632553 559368 291005 91161 104445 414438 543523 450152 282583 138570 171364
13025 171364 254652 461269 569339 646025 618619 461818 548406 657365 562826 733548
13015 733548 609789 297368 175173 89671 127269 301681 465797 462171 338169 208178
13005 208178 54227 249592 396888 359019 477486 381250 324230 246297 481599 602002
12995 602002 562877 550912 702975 850625 789826 675273 754646 935173 1031034 1089208 1053815
12984 1053815 1116980 1207881 1063892 931530 908109 754044 712491 767477 854731 933782 920555
12973 920555 905466 696947 645314 819702 866534 832579 820536 815137 974446 1079459 1083924
12962 1083924 987656 1080719 1066562 1073852 1076459 1145546 1062114 914526 990072 944395 1011464
12951 1011464 855939 913396 891497 935353 1007983 1216558 1206185 1114357 1272326 1363234 1352501
12940 1352501 1362656 1215357 1258415 1232642 1130026 1104376 975001 820296 899901 894812 902114
12929 902114 998916 1153425 1415197 1573226 1538645 1456284 1535036 1338739 1257028 1058472
12919 1058472 1136407 1311125 1413012 1366881 1237650 1077378 1060356 948929 881544 898962
12909 898962 819943 844270 912618 951908 1106230 1137027 1378521 1244068 1147238 1215682 1128524
12898 1128524 1028238 1055737 1228995 1124906 892441 982947 1108095 1155606 1160474 1250162
12888 1250162 1357494 1163397 1202457 1225563 1100046 865090 666514 697575 865857 831050
12878 831050 994980 833497 716065 983004 1052901 1072404 927040 830716 764057 897058
12868 897058 931708 952552 1065708 1106656 1107635 1182831 1267384 1293571 1316192 1450206 1663364
12857 1663364 1485586 1520843 1550407 1513030 1529531 1494117 1416905 1380489 1496015 1601405 1514499
12846 1514499 1754055 1884640 2113409 2033151 1787259 1916406 1927025 1971707 2118210 1919038
12836 1919038 1725607 1895815 2171116 2193510 2373854 2339294 2352512 2423394 2651192 2857217
12826 2857217 2878758 2936061 3072292 3088289 3323979 3533654 3897309 4209935 4078185 4148736
12816 4148736 4414168 4505501 4607248 4790457 4694914 4450611 4282711 4096868 3908759 3909508
12806 3909508 3820609 3829668 4017396 4089591 4192788 4588510 4921777 5092436 5210268 5359615
12796 5359615 5513635 5676677 5804755 6085346 6495570 6586144 6650759 6739021 6687769 6689090
12786 6689090 6592672 6796005 7014668 6991359 6965377 6957759 7001239 6950031 7041098 6799281 6618419
12775 6618419 6782982 7015280 7078885 7158518 7340554 7394111 7421017 7686848 8106023 8432649
12765 8432649 8530233 8812809 9159491 9441279 9778906 9924764 10064953 10361392 11024101 11540259
12755 11540259 11848772 12283290 12929652 13500135 14019011 14431931 14830875 15359713 16164046
12746 16164046 17170364 18448680 20161863 22007164 24154826 26751973 29828727 33458413
12738 33458413 37897964 43622613 51535837 62585393 77515928 98021629 126113373
12731 126113373 162845660 207801582 256965047 301898410 334783521 353241621 355561416
12724 355561416 338294036 301523746 255192075 211144949 174685145 147467246 128918188
12717 128918188 117744296 112892530 113163243 118088611 126876643 139302869 154352403 171254840
12709 171254840 188841377 205359104 219295946 230823438 240426898 248870199 258268780
12702 258268780 271783600 290995044 316177867 345502674 374006753 396221447 408080463
12695 408080463 408358105 396173775 371707589 339540409 307484731 280985452 261922296
12688 261922296 249901597 243577394 240500068 238192425 234838490 229324950 220703111 208542836
12680 208542836 193435118 177077672 161437502 147857750 137768826 132213678 131751584
12673 131751584 137317901 150673871 173198118 205842522 248206157 296609719 343906294
12666 343906294 380772904 400768348 402032300 383727328 345136821 291334650 235028150
12659 235028150 186083670 147310163 118173900 96602935 80695534 68853353 59936383
12652 59936383 53337573 48023566 43597250 40390934 37486370 34793370 32362667 30050847
12644 30050847 28138502 26549979 24908438 23556784 22276039 21154201 20260843 19306409
12636 19306409 18483037 17593979 16840614 16219506 15614242 14944456 14681083 14408103 13886585
12627 13886585 13306902 12977940 12554241 12065386 11761973 11731684 11480141 11204940 10925416
12618 10925416 10699494 10529857 10201544 9803149 9697362 9533088 9285631 9066128 8826463
12609 8826463 8742827 8365418 8107307 8014442 7969150 7946543 7957102 7731654 7714130 7804988 7772398
12598 7772398 7735166 7452663 7551904 7429624 7183031 6971024 6857874 6652656 6307145 6244499
12588 6244499 6117085 6193907 6243266 6414430 6164352 5901525 5791697 5964257 6143132 5945093
12578 5945093 5626557 5425449 5470765 5704300 5602274 5628972 5402699 5266660 5373726 5446995
12568 5446995 5432895 5460271 5547637 5586474 5633284 5728876 5732535 5634888 5425885 5223588 5043914
12557 5043914 5013129 5201461 5367395 5376048 5489250 5732926 5885968 6135862 6504002 6440178
12547 6440178 6266761 6118134 6187110 6130858 6015327 5999469 5819724 5375459 5277500 5295562
12537 5295562 5180666 5120926 5168707 5274591 5179916 5058933 4742516 4693594 4777784 4810791
12527 4810791 4756276 4632673 4566041 4707500 4786983 4708839 4668790 4793638 4969935 4924744
12517 4924744 4730226 4953503 4893557 4755946 4750284 4849859 4863875 4761702 4682817 4732513 4792576
12506 4792576 4765363 4706913 4706912 4625025 4622211 4704089 4842290 4853890 4840885 5001746 5191269 5287972
12494 5287972 5294466 5113387 4965553 5157072 5268111 5344662 5374801 5496069 5494549 5612037
12484 5612037 5621385 5721617 5879409 5947068 5834983 5735629 5736928 5761127 5881301 5882643 5947793
12473 5947793 5987081 5975523 6134582 6381864 6402258 6487888 6594354 6676939 6578705 6563098 6655561
12462 6655561 6727326 6860240 7119993 7101688 7253319 7302508 7584097 7865541 7972904 8267632
12452 8267632 8347269 8269941 8138258 8159936 8350663 8699454 9062034 9247938 9141245 9183501
12442 9183501 9587689 9895447 10063653 10039569 10122181 10050967 10185983 10824898 11314466 11618255
12432 11618255 11664430 11770393 12062750 12623704 12935238 13339224 13559944 13868283 14133083
12423 14133083 14540364 14830091 15198910 15601076 16063938 16404485 16893064 17194785 17759626
12414 17759626 18365694 18924831 19311251 19814081 20148514 20372941 20804462 21422183 22019406
12405 22019406 22770280 23550872 24356423 25264389 26142976 26891417 27601194 28262640 28955084
12396 28955084 29941318 31057301 32169852 33104422 34159691 35476753 36457534 37647784
12388 37647784 38865385 40581289 42388947 43873514 45446677 47158229 49035562 51010300
12380 51010300 53031600 55176142 57227911 59409154 61742125 64077354 66663491 69176976
12372 69176976 71679773 74394342 76974060 79670432 82682196 85840742 88825469 91761581
12364 91761581 94666987 97828642 100935870 103705491 106421386 108884963 111319719 113628362
12356 113628362 115917629 117776604 119364432 120732794 121868858 122606175 123060726 123263444
12348 123263444 123192746 122500101 121647523 120373411 118871921 117240134 115344854 113138213
12340 113138213 110625878 108016626 105343055 102644474 99653845 96576420 93602776 90661017
12332 90661017 87717046 84909427 82115811 79435347 76889869 74150367 71615155 69279266
12324 69279266 66766496 64210282 62230050 60114791 58087939 56039163 53890694 52032471
12316 52032471 50212492 48483831 47044646 45386786 43765532 42404349 40966109 39586957
12308 39586957 38473461 37407260 36249135 35151447 34048542 33154135 32090900 30853263
12300 30853263 29805995 29065604 28236107 27364137 26722320 25968386 25279733 24651169 24126187
12291 24126187 23475099 22715872 22182068 21557027 21068644 20608579 19998449 19610656 19245288
12282 19245288 18682181 18058920 17604212 17307167 17120188 16962340 16651907 16315141 16226035
12273 16226035 16019919 15787715 15593624 15455838 15205619 14773698 14221977 13837741 13460469
12264 13460469 13089034 12648445 12229984 11971995 12000887 11710354 11487824 11410371 11225177 11039307
12254 11039307 11093733 11065901 10938371 11032467 10929189 10533491 10193459 10260639 10298671 10190672
12244 10190672 10175588 10264380 10110285 10091125 10056236 9921351 9801962 9492557 9061462 8530402
12234 8530402 8153135 8290833 8508124 8257447 8145179 7998628 7918830 7774739 7653534 7622786
12224 7622786 7679785 7467272 7031439 6675337 6154452 6191519 6380902 6453490 6544789 6496362
12214 6496362 6510134 6617677 6714523 6759239 6975234 7224756 7296010 7109885 6851818 6656659
12204 6656659 6411261 6054188 5501739 5428083 5346371 5157441 4902797 4530705 4212833 4308312
12194 4308312 4531522 4590316 4414190 4158865 4113463 4037565 3794925 3578609 3766679 3948077
12184 3948077 3805259 3767470 3737341 3567764 3623148 3610871 3515839 3395285 3306205 3374368 3309712
12173 3309712 3090605 3279419 3361798 3283049 3280440 3013782 2713465 2821784 2960842 2922957
12163 2922957 2928396 2817286 2851295 3008353 3050379 2861446 2663219 2587318 2605432 2485617
12153 2485617 2237526 2146353 2147430 2111154 2023608 2044879 2253209 2247653 2097002 2255585 2416705
12142 2416705 2244566 2244327 2395428 2376752 2439798 2348378 2333190 2467962 2313301 2177052 2047098
12131 2047098 1919755 1829203 1733810 1691871 1713139 1789092 1809144 1684558 1777819 1906310 1847850
12120 1847850 1690489 1520570 1731491 1799717 1634572 1517187 1497378 1673043 1757288 1861932
12110 1861932 1887520 1845998 1778056 1704112 1715257 1792039 1971660 1955782 1906386 1945384 1991108
12099 1991108 2013198 1986600 1747623 1716373 1568644 1511087 1568692 1326516 1383588 1503611
12089 1503611 1504736 1636463 1775530 1625725 1529825 1537792 1552068 1648052 1766941 1770123 1566738
12078 1566738 1438472 1493982 1528770 1589588 1810127 1627404 1473174 1292471 1029828 1011458
12068 1011458 1368151 1631966 1546479 1433366 1330098 1146026 1096312 1242680 1269024 1276193
12058 1276193 1145918 1105242 1185299 1242820 1276485 1290947 1248447 1347892 1441314 1320876 1239021
12047 1239021 1295747 1408059 1615595 1867634 1748625 1445640 1515998 1578280 1323878 1342975
12037 1342975 1595100 1770722 1745755 1677455 1632203 1709134 1638396 1673472 1699778 1472624 1403627
12026 1403627 1256997 1273482 1380637 1618430 2195297 2626717 2596911 2762644 2799066 2744618
12016 2744618 2708139 2852088 2892759 2590167 2111446 1881639 1814083 1708398 1802107 1970692
12006 1970692 1946782 1969558 2136136 2312097 2317611 2304389 2407071 2320857 2370057 2285839 2099520
11995 2099520 1986272 2156289 2141141 2143477 2078031 2223600 2377794 2616861 2574214 2505590
11985 2505590 2688151 2831071 3074683 3156476 3164964 2726915 2376189 2333046 2387044 2226649
11975 2226649 2186429 2096889 2078378 2077455 1860825 1737908 1738649 1616690 1451650 1380609 1298831
11964 1298831 1260901 1428056 1747270 2156657 2131643 2014297 1999975 2460351 2552335 2526853
11954 2526853 2460616 2314682 2186645 1945019 1736760 1650612 1351371 1366895 1433013 1295741
11944 1295741 1125058 863723 900169 1031457 961934 995774 888529 887783 1082309 996446 942523
11933 942523 882326 945345 1140432 1242655 1201427 1193645 1034740 1033473 970239 902772 784246
11922 784246 781641 882086 850269 687998 558301 640292 1072666 1019095 842208 701560
11912 701560 598608 542158 494278 464934 518058 579486 421493 600913 510651 713645 913150
11901 913150 835979 732131 825877 880203 736601 747942 822642 804548 758520 861114 894943
11890 894943 931612 913656 886345 971804 922927 891783 779155 743574 658140 539975 445574
11879 445574 314956 291020 309922 381318 487487 403104 535270 543664 745113 743082 859703
11868 859703 945105 1015153 783599 611834 549337 644725 698767 1035742 1147510 926424
11858 926424 962762 1254962 1191032 839989 750090 759643 597440 684313 888944 905565 986266
11847 986266 1110728 1120796 1180885 1148895 1243043 1480715 1435605 1275365 1255468 1179261 1242707
11836 1242707 1371063 1454625 1462475 1598291 1708665 1793476 1578954 1474208 1598545 1798087
11826 1798087 2231905 2499227 2749148 2955545 3094493 3308453 3739200 3955076 4097028
11817 4097028 4156467 4235316 4152011 4005555 3724121 3766204 3753524 3555944 3490528 3426594 3275688
11806 3275688 3141255 3131948 3104821 3091045 3238349 3370235 3249766 2991773 3188045 3281228
11796 3281228 3485432 3637734 3513488 3498975 3625261 4014387 4494181 4893811 5087012 5140901
11786 5140901 5137316 5301559 5180936 4893531 4574833 4601310 4498851 4388972 4145652 3874599
11776 3874599 3709953 3478470 3242791 3199166 3248828 3242053 2937909 2654764 2637233 2574445
11766 2574445 2503704 2640464 2732593 2833262 3121916 3413956 3513695 3653834 3995770 4273306
11756 4273306 4150767 4302479 4484903 4358820 4081208 3952909 3598946 3343163 3126008
11747 3126008 2804991 2580587 2370947 2084872 1806971 1523504 1353993 1327405 1465613 1469627
11737 1469627 1347844 1536333 1993150 2043450 1909179 1788166 1900029 1951892 2028950 2270024
11727 2270024 2330634 2235273 2338352 2488973 2634708 2689405 2828455 2544293 2530866 2698899
11717 2698899 2792422 2931475 2988468 2931133 3057978 2858116 2882830 3030131 3228777 2924322
11707 2924322 2650192 2446288 2555086 2702560 2558520 2439525 2351014 2287508 2437613 2384077
11697 2384077 2397259 2427648 2416026 2391708 2525408 2572098 2553330 2695929 2945770 2961999 2755598
11686 2755598 2702645 2595565 2645753 2571071 2556849 2604196 2424660 2427870 2368857 2319616 2306336
11675 2306336 2565942 2565695 2234773 2087825 2219976 2274192 2627517 2824406 2874856 2898460
11665 2898460 2924373 3073659 3207280 3201114 3008216 2981645 3259183 3344242 3330972 3392735 3480019
11654 3480019 3562930 3527421 3521587 3708145 3729381 3831438 3879069 3922536 3984549 4036274 4043663
11643 4043663 4027855 4096536 4124205 4330637 4514540 4702998 4746700 4789887 4968085 5183804
11633 5183804 5370354 5474539 5718477 6075390 6296090 6611626 6897497 7076523 7317834
11624 7317834 7755152 7986710 8382603 8854070 9575336 10205668 10882417 11574811 12285178
11615 12285178 13109298 14248821 15528777 17018966 18901647 21081822 23589556 26850363
11607 26850363 30844216 35325932 40496852 47145000 55692478 67284080 83199430 105032436
11599 105032436 134472912 172926486 219605785 270328872 318171940 356130766 379459498
11592 379459498 384933832 370171622 336690795 291655870 244910062 203710288 171444037
11585 171444037 148524727 134256559 127411751 127283363 132734210 142783557 155517389
11578 155517389 170035989 185209387 200011227 212677464 222225742 228183148 231563180
11571 231563180 233286346 235443143 240492872 251176736 269579068 296415202 329191100
11564 329191100 362594024 390648723 408429348 412774246 402939173 380797026 351212946
11557 351212946 320516014 293908088 274005277 260545853 251563986 244375762 236354673
11550 236354673 226190545 213413950 198714320 182745005 166563649 151155653 137357603
11543 137357603 126704998 120544471 119466743 123800938 134055968 151053838 176087450
11536 176087450 209424179 248817086 289163708 323263216 345632650 353301112 344278039
11529 344278039 317818715 276744648 228988189 183690718 146008672 116851113 94810036
11522 94810036 78273798 66145895 57340570 50528309 45014585 40261353 36163247 32878022
11514 32878022 29991302 27698249 25721360 23946063 22341798 21072325 19868204 18511412
11506 18511412 17324679 16184497 15236734 14570192 14100861 13637411 13041577 12532039 12016665
11497 12016665 11618046 11150050 10726422 10220491 9817532 9558559 9224685 8751632 8346478
11488 8346478 8070578 7872111 7573116 7340872 7143177 6885846 6684689 6576811 6375624
11479 6375624 6189079 5916507 5787580 5902280 5890515 5688697 5490346 5522248 5305611 5098786
11469 5098786 4976293 5094929 4808371 4419714 4266378 4231858 4445829 4345034 4068217 3907681
11459 3907681 3677920 3331809 3320494 3207096 3183342 3050431 3006659 3023924 2812484 2831346
11449 2831346 3069543 3329070 3484111 3284178 3049442 3020546 3037082 3049002 2887587 2581340
11439 2581340 2515380 2482641 2643996 2776410 2809374 2743090 2622019 2574062 2525943 2612397 2430737
11428 2430737 2280408 2145215 2108728 2069576 1984898 1979404 2016642 2117611 2117022 2021356 2087124
11417 2087124 2217764 2110633 2060066 2182306 2319903 2561890 2759145 2616938 2357488 2362015
11407 2362015 2258411 1684698 1405765 1494652 1578432 1515464 1531234 1442619 1408466 1491948 1570903
11396 1570903 1429451 1561493 1444876 1298369 1204563 1223326 1269244 1142154 1051936 1058184
11386 1058184 951735 927586 906805 1100680 1152469 938553 971267 992238 980327 947834 889549
11375 889549 891832 753166 689410 875595 995756 1004282 855684 639103 545616 493624 562217
11364 562217 492274 176750 131180 535724 757043 555644 397158 269608 170942 213274
11354 213274 190611 249675 450949 458646 376087 574528 720607 814933 796128 670689 628463
11343 628463 539303 513580 476869 181024 68014 62169 211207 286354 358526 321591 176063
11332 176063 182596 379645 406694 343656 240499 3033 20002 143685 273238 278918 505356
11321 505356 456469 516359 486984 184911 156857 249151 472328 629905 453635 291157
11311 291157 199553 459873 481200 385108 349160 148151 251468 306625 500021 522465 370551
11300 370551 173617 327650 422160 360713 451973 624410 569606 424608 361271 349464 373813
11289 373813 314394 209782 274738 398229 365007 411531 433280 402762 455238 485842 504253
11278 504253 410878 449786 441856 370230 387071 613600 570311 479831 199882 -42283 -113786
11267 -113786 9160 -170519 -103361 236778 550728 563909 525307 604712 555489 372517
11257 372517 192944 163761 250388 540171 631771 558536 389512 460666 242356 360206
11247 360206 556826 481139 282351 80915 181565 184317 151895 205311 175880 188625 56788
11236 56788 148892 131520 119120 208064 81686 46143 188862 221933 195190 276037 266843
11225 266843 200163 19273 -86430 21910 385089 666416 753757 401470 169879 237572
11215 237572 268584 263197 175512 131875 351924 315727 343500 433066 479008 226460 105121
11204 105121 258618 176109 180132 183211 430304 265610 311386 512591 548820 813783 764388
11193 764388 566704 541201 415018 318440 221767 145540 191556 392375 521579 523674 659665
11182 659665 736835 525098 617894 623867 461447 537437 570638 675736 730337 736612 921013
11171 921013 1005239 1083650 1187036 1457144 1679672 1609337 1802394 1796954 1857364 2090635 2365262
11160 2365262 2508331 2332008 2069737 1943994 1811541 1680692 1700277 1356994 1156352 1271296
11150 1271296 1394886 1264041 1346935 1391401 1342928 1339513 1457785 1570297 1654466 1644602 1496930
11139 1496930 1411552 1534877 1559149 1479964 1593219 1629386 1784969 1992737 2140609 2249637
11129 2249637 2360044 2303135 2008260 1756665 1573613 1713172 1819759 1732351 1522112 1388278
11119 1388278 1286443 1184925 899697 839472 850350 711106 790365 823662 763559 668739
11109 668739 926854 1040022 1025804 994799 1252884 1753288 1925785 2017416 2158649 2148404
11099 2148404 1957873 1968065 1808681 1648053 1363497 1034087 951609 949143 786303 674656
11089 674656 570979 657435 615721 702025 673931 699652 711910 388375 250415 276388 342439
11078 342439 229201 164996 96627 9936 33849 151008 180506 143767 145012 203859 317343
11067 317343 137838 114714 95859 27080 86560 225463 157864 -24635 -144261 -215645 -185538
11056 -185538 -16337 -21322 -22449 -143745 -27217 136654 213263 168407 38126 5462 -98
11045 -98 -174072 -214779 -90948 -57493 -174012 -80682 71156 225066 202951 164726 43889
11034 43889 89718 105117 105127 45099 -179495 -35458 67624 22822 -72759 24163 -34752 75672
11022 75672 34411 114354 174022 82125 112669 89961 -15789 -11562 197801 396448 364624
11011 364624 216586 171812 -30460 -134538 -1148 17150 20999 25318 126349 35726 -218175
11000 -218175 -447159 -478727 -294009 -100765 -135066 -23590 -85977 -124195 8576 25484
10990 25484 7283 75292 82266 -2679 -19602 -32390 22112 89954 91678 91230 144276 333311
10978 333311 119149 2216 152629 236908 230947 256226 105275 136579 134069 109514 -3052
10967 -3052 -235760 -416091 -190303 -207670 -97134 111098 -21581 -69104 -158926 -253802 -291697
10956 -291697 -11705 61334 235758 214040 101441 -128162 -293982 70632 138397 90996
10946 90996 -85013 -217529 -198237 -323532 -372702 -310628 -308476 -200295 34774 39491 -13737
10935 -13737 -23463 -2863 63531 -29880 228944 365770 348605 246512 195836 -54204 -55808
10924 -55808 65551 30971 153936 288791 297344 296566 265891 318186 289339 195394 209012 177896
10912 177896 19731 -46530 -27323 61471 32967 -55698 -2855 85710 -28210 107190 336527
10901 336527 179594 27329 -48121 -47230 -110337 -194086 -382435 -191665 107431 155089 181246
10890 181246 -15930 -226117 -148768 113273 34299 -18716 -1845 17624 9339 182749 104464
10879 104464 -49952 4349 60916 213086 133472 169013 309989 107106 -36108 -25202
10869 -25202 11856 171840 166789 80220 93356 262635 91713 -178919 -157709 -47666 126800
10858 126800 -205959 -69875 -86461 -146186 -151563 -230762 -60541 32137 -231164 -349461 -160483
10847 -160483 44786 67738 -218805 -157941 34118 -16618 227999 380095 295379 185085
10837 185085 57829 -26329 13574 128378 58051 -37708 -187753 -126133 -109936 -51711 62263
10826 62263 138883 50590 89281 124798 34718 239734 345381 233956 255340 214366 45748
10815 45748 -90572 -194172 -88676 6990 -73735 -211909 -174530 -26882 -26854 76081 89595
10804 89595 40594 -113556 25584 102333 215927 205596 10914 -75429 -170335 -489927 -288916
10793 -288916 -203194 -330283 -205548 -61696 54235 -30794 -399616 -344913 -307427 -178160
10783 -178160 -73071 -44522 -135808 -148777 -210361 -128213 -41236 -67631 -168740 -310401 -532211
10772 -532211 -431492 -146214 53621 -15472 160475 177957 109873 137102 164361 137736 123277
10761 123277 255278 189495 217042 348500 286176 420866 463324 211695 -46228 -55507 4125
10750 4125 -118739 -240159 -268644 10 33835 -68051 -112893 -117515 68518 -101329 -90697
10739 -90697 -97385 -26116 -225107 -193934 -123609 -11700 54374 136368 158878 130863 -29085
10728 -29085 -66349 -193821 -213779 61407 156205 84588 1922 -187688 -159240 -68290 -3268
10717 -3268 49834 266714 214662 -139938 -409272 -305291 -167690 -158388 -176599 -272097 -193648
10706 -193648 -89499 33416 137629 176350 -125355 -106222 65546 7907 -152967 -267211
10696 -267211 -178149 -194649 -365416 -217205 -92292 -134680 -53282 -41519 -77080 -301008 -318340
10685 -318340 -221476 -202943 -91286 -145923 -277223 -189141 -155335 -202691 -123880 -111764 -165895
10674 -165895 -158832 -144307 -149545 -166016 -54392 40573 -134404 -190855 -119792 -193341 -155439
10663 -155439 78651 274583 310178 88553 -155928 -9914 61976 71884 80656 223803 257298
10652 257298 318929 330920 342951 461229 104447 -211431 -254375 -218796 -209747 -225699 -83811
10641 -83811 -123682 15330 134049 -8782 -181354 -294810 -86679 130448 70796 -92860
10631 -92860 -65292 -110267 -335134 -273246 -119089 58475 -41929 -12726 -23484 -168131 -263524
10620 -263524 -238873 -148391 16250 210839 241018 282926 137039 -35469 -187772 -203589
10610 -203589 -124629 -242645 -467465 -488753 -318845 -345489 -252053 -122125 -169006 -73211 88780
10599 88780 176548 251086 217396 195167 209212 353634 358717 103863 -73609 -60694 79867
10588 79867 -24397 9295 222121 318059 174101 14577 -92969 185505 237745 219369
10578 219369 240806 243755 410568 380554 325280 459647 598941 581512 449712 238060 49811
10567 49811 -62773 -19003 85628 218574 251475 195230 100651 -34731 -160635 -291804
10557 -291804 -310116 -354939 -276835 -162701 31771 133971 118344 16225 -85334 -323132
10547 -323132 -353404 -200256 125610 188940 1090 13242 16008 -135445 -368520 -415729 -336907
10536 -336907 -288423 -325155 -123674 -123178 -162706 -204395 -245191 -485354 -483158 -249175 -90634
10525 -90634 5057 6387 -7677 -47174 -79250 -213171 -251944 -193390 -271664 -453511 -203111
10514 -203111 -171115 -250000 -233802 -79474 158360 134101 130431 131878 24458 144348 44432
10503 44432 37547 103086 98047 -106944 -77684 -149740 -383718 -346250 -38015 44058 61408
10492 61408 -168030 -360706 -354139 -49827 56400 6418 -87477 -44657 67830 -140258 -319330
10481 -319330 -253874 -277862 -137607 -27960 50863 -58739 -65031 -100843 -124310 107730 209831
10470 209831 206259 221441 61842 -124856 -26664 201639 203391 518158 650793 557012 649761
10459 649761 570343 285084 271421 248635 303229 405781 359094 373015 334447 91844 -206430
10448 -206430 -160026 6149 118409 267076 241271 35740 9547 105823 123206 -34490
10438 -34490 -76446 -74423 -51272 125141 75632 -19101 120454 106884 55638 -88287 24103
10427 24103 115662 -7080 -121396 -172219 -122525 -321076 -243331 72804 230820 97417
10417 97417 85319 61820 33251 24452 -112069 -103836 137981 93299 -216900 -189622 -172724
10406 -172724 -77487 26386 157984 97646 158264 218747 343741 321845 258993 -26160 -145460
10395 -145460 -220839 -298546 -470624 -458895 -226028 -205353 -310515 -211483 -82714 -225814
10385 -225814 -161926 43273 50328 -14889 57271 -30376 -111316 -35516 121198 340184 163022
10374 163022 86929 80335 134649 274022 250499 130790 -130343 -280673 -118427 -26243 -25297
10363 -25297 -153875 -201089 43111 218827 100174 -176493 -32304 23614 79980 22225
10353 22225 -171294 -99057 56330 80266 35619 -21128 23143 38573 -157843 -6203 -25597
10342 -25597 -209646 -51834 31529 135371 94075 -136658 -261221 -110365 37331 187158
10332 187158 51982 -209417 -222708 -126750 -82802 91647 327369 171897 -7493 100925
10322 100925 129881 43100 -97725 137520 188404 172315 53225 -4263 96314 19312 -106256
10311 -106256 -24690 277168 399260 455179 485446 363967 21456 -175860 -117662 -94158
10301 -94158 -32168 12073 69422 142582 209630 252159 113817 65786 79155 -2256 137901
10290 137901 219085 124058 -21271 72641 243121 156857 62991 71740 19209 31788 143312
10279 143312 -38395 -263943 -376713 -282267 -202710 -192705 -21145 130245 -109729 -306326
10269 -306326 -121036 91409 250864 229813 335087 464021 247291 130586 201652 313955
10259 313955 415904 416342 312401 123956 -101024 -41853 136252 167748 203038 283612 319824
10248 319824 57442 -88753 -252315 -172785 -43069 -23379 -332593 -238851 -48647 -95515
10238 -95515 -120463 136023 283378 18618 -163407 -240091 -76093 4855 -57578 15024 42869
10227 42869 74502 169694 178055 -2829 -111756 -209747 -317931 -529824 -563507 -466607 -406721
10216 -406721 -218677 -62058 190869 169026 3914 111138 136745 -45608 -185707 -157010
10206 -157010 -39891 2981 -10149 -155096 -39656 113772 210566 213717 189725 300922 181887
10195 181887 110653 4984 -117108 -22029 54521 -33782 -63330 -23182 241499 345245 345453
10184 345453 306867 125400 107078 218794 304645 56580 136823 265957 94774 -38512
10174 -38512 11912 159054 95922 -56888 -136033 -74437 -118038 -230796 -140856 -44652 -27301
10163 -27301 85489 213253 203406 97603 118174 38844 -130474 -173813 -131561 -17685 -36418
10152 -36418 -184160 -280942 -342073 -328658 -166723 -138761 -258130 -266042 -140490 -4064 54498
10141 54498 200214 231996 299670 339553 480385 438453 316912 307526 232314 129983 171169
10130 171169 -142962 23892 199870 140063 102803 -19046 -63145 -108463 -30101 -157815
10120 -157815 -226464 -105207 -16599 34765 -9211 50763 14810 -91791 -28111 45860 53568
10109 53568 -96312 -217726 -66115 16637 -28209 -23655 122109 49506 2438 -126644 -32322
10098 -32322 -6686 81311 164806 298722 209317 206074 310632 278914 284844 346428 424241 671743
10086 671743 626214 330567 421986 641468 730660 758912 744659 838705 1120222 1319382 1225998
10075 1225998 1448110 1648623 1715074 1937779 2098524 2385804 2659821 2717533 2901898 3298364
10065 3298364 3985440 4895128 6162649 7783060 10318993 14302551 21297060 33100558
10057 33100558 49895609 65716916 73152782 76650877 79747265 77697685 60737538 38868642
10049 38868642 25781505 18015804 13155334 10161092 8029903 6304439 5110713 4333300
10041 4333300 3862102 3701022 3393266 3049153 2891995 2560247 2402308 2409759 2246300 1952753
10031 1952753 1823699 1724625 1488976 1315675 1187553 1047843 1161298 1227980 1190468 1194107
10021 1194107 1033311 891312 760156 815655 804817 726340 746385 753288 687983 517945 295127
10010 295127 317289 526729 682206 515850 452368 707929 942600 806938 756484 704035
10000 704035 592061 499097 386926 427505 293969 236573 221287 380452 379226 258094 188193
9989 188193 243063 262955 62335 25651 121730 248187 287292 103404 152431 240993 142557
9978 142557 -70558 -90895 14290 87976 72065 193043 269166 179433 115245 184007 75461
9967 75461 117612 107258 247393 342165 384275 498894 419182 30839 285571 523726 554639
9956 554639 349979 164808 103675 325357 222526 368686 407822 276402 187300 274990
9946 274990 346968 336717 243506 178037 280257 477454 463713 290983 459906 606755 534619
9935 534619 261387 143819 92236 217553 229009 298628 213193 103450 195781 339916 422362
9924 422362 457266 532319 626219 475998 291968 163919 170658 5310 -259136 -267078 -349058
9913 -349058 -288689 -19322 84174 -144007 -137198 -107395 23892 212998 205910 250728 304178
9902 304178 273889 398013 175137 141378 222847 177094 30401 -49 128184 143133 183876
9891 183876 150925 86765 24210 147649 192082 26811 -10169 -238948 -310573 -381887 -267580
9880 -267580 -195273 -168795 -37466 -21215 -199851 -210654 -148543 -117176 -18584 92596 94316
9869 94316 300436 228046 200814 65053 86350 90084 81676 89276 54653 32926 2524 -49866
9857 -49866 -109977 -239966 -233794 -82005 34024 82852 -80173 101945 -58670 -114133 -26096
9846 -26096 285125 267780 95575 -42428 87751 -11479 10834 -42940 -138307 -38351 591
9835 591 -34934 5004 -13065 -28963 -116600 -47924 -100295 -284911 -447594 -427469 -240315 -12570
9823 -12570 178684 241503 288552 449841 381720 439895 394745 285128 173260 180557 111726
9812 111726 -35238 -52621 62828 22325 -110737 -261250 -134463 -171743 -117895 116682
9802 116682 267514 426381 231220 139132 64826 212389 74066 -38046 -136660 -230626
9792 -230626 -157133 141165 204720 299656 402937 292219 199968 195345 -13876 -28196 -17714
9781 -17714 -71011 -102730 -307267 -418855 -107671 -1037 -47598 -79460 -141024 -417083 -528399
9770 -528399 -499722 -344461 -199021 -212335 -328743 -311211 31977 89552 46418 -119469 -77454
9759 -77454 -234351 -253507 -247550 -157270 -57001 90098 62715 -39853 -65074 95151 253359
9748 253359 139337 -44862 -246315 -328083 -192750 -60861 26000 83073 161979 164113 279627
9737 279627 201039 18629 -13134 91418 38694 -17598 -213284 -242647 -327559 -385406 -281658
9726 -281658 -187646 -198746 -174839 -66497 -242049 -201224 -73022 -87988 -168555 -190902 -72414
9715 -72414 49352 244914 32492 -85157 -52089 -89689 -179155 -298531 -219052 -148853 -901
9704 -901 141314 30429 -42570 6490 60842 253418 52508 -29779 -188206 -31790 19206
9693 19206 -211201 -241922 -337790 -169292 -26165 165405 311903 239181 156431 348043 405794
9682 405794 280263 255362 167745 248958 372678 438771 440579 452222 362850 125405 -54565
9671 -54565 112432 271217 299726 166343 165533 160215 154061 226407 168091 -61111 77536 73805
9659 73805 -126694 -134440 -8778 4939 -26817 -58834 107966 225460 407716 369860 310660
9648 310660 367657 313204 375533 219191 22336 67594 33180 -39713 -53668 16156 -88601
9637 -88601 -164356 -85800 -32713 -36348 -38559 213316 244656 291319 353623 204931 88257 20862
9625 20862 -124628 -185272 -15503 93494 240973 175242 152568 196003 202831 116629 -32210
9614 -32210 -166963 48794 -19354 -55589 -33277 23750 40377 163717 92886 214591 159483
9603 159483 117987 34415 35190 321768 442543 367804 217731 82752 107733 285771 252405
9592 252405 177293 39670 57554 105075 187396 -33111 38730 -24893 -160436 -30958 -138922
9581 -138922 -251749 -53771 -116136 -144343 -168062 -42035 58339 -140582 -86139 125277
9571 125277 249157 195669 170596 16603 -186814 -159867 -237531 -488187 -436851 -255162 -199681
9560 -199681 -146280 37381 88706 -9948 -10548 -139661 8828 62917 30986 -14523 -85932
9549 -85932 -203191 -330699 -371304 -370411 -376503 -548923 -436763 9297 40167 125179 -83523
9538 -83523 -191585 -85389 11619 -48905 63784 93691 -43677 -156134 -39139 55038 -89402
9527 -89402 13272 201806 118372 -176993 -235107 -91424 178172 331575 311997 204650
9517 204650 -18153 -16720 125896 129904 109311 173670 81676 79723 -100048 -50983 87867
9506 87867 121990 70050 80941 69803 65019 -28575 -47584 -60866 -82499 -134119 -270258 -256823
9494 -256823 -88548 67797 86882 1248 -22602 76290 72153 194218 43200 -85300 54080
9483 54080 48201 -45424 -241194 -180357 -106662 148740 180134 93084 -9968 37527 100564
9472 100564 119746 84442 -174925 -48302 71442 -21581 130424 366658 216059 111978
9462 111978 188335 286632 260168 273152 301306 289088 166648 60023 -19692 -178490 -120183
9451 -120183 -93313 -176915 -135947 1017 252773 400780 107010 48071 153934 215792 11861
9440 11861 -118391 -167664 -173790 -163742 -376699 -417964 -232804 -241171 -314619 -30169 222396
9429 222396 126472 5081 -109505 25811 14602 -12853 -133811 -29456 244313 213389
9419 213389 204472 325894 150924 12370 -37542 -23865 141952 22552 -103637 72042
9409 72042 425430 471652 407564 345452 323523 68140 94575 208641 433243 534834 297231
9398 297231 301644 168142 189164 301748 299021 8889 -314912 -208845 -65556 -97555 9679
9387 9679 132784 8440 -176670 -10925 -11555 -51169 65290 218571 116782 -25306 -53996
9376 -53996 -82239 -128869 143410 199849 83621 -39313 -198463 -272814 -367102 -371886 -345023
9365 -345023 -182230 -270032 -316707 -263701 -169823 -39824 39836 140144 205824 236976 86521
9354 86521 61955 167857 341884 331623 303470 283191 263736 269009 307154 219990 164353 80290
9342 80290 88156 276754 294685 394967 436588 283235 -15900 -36233 35589 29920 50360
9331 50360 131162 82534 -38148 -201576 -303410 1615 216891 154892 228739 138907 115108
9320 115108 192491 385166 184283 -6996 -22855 -4455 8309 -234853 -257844 109077 165713
9309 165713 -25332 -403140 -317839 -118228 -119243 -156649 -246142 -287156 -85911 37127 -97178
9298 -97178 -132255 100545 202277 174962 179488 194621 130162 108438 -11163 293084 367166
9287 367166 385651 396775 368901 420476 455745 349073 267452 302130 379987 577139 552241
9276 552241 326701 324391 670341 808586 494546 348038 319710 190934 103688 166400 325324
9265 325324 383084 162566 235295 393933 234895 150849 339960 334668 443914 500383 470280
9254 470280 430069 343752 196238 221666 187874 125851 178801 309260 516265 463653 433665
9243 433665 387782 413131 155861 157585 474072 468430 371710 513703 437698 255040 285280
9232 285280 300057 209228 190417 362491 677207 873210 898530 912610 807020 750582 670905
9221 670905 726384 863373 958094 899380 736603 711905 710807 618674 673430 685486 708500
9210 708500 700727 689677 799052 802791 876462 860770 867251 985490 823215 820838 1110818 1201364
9198 1201364 995180 1179128 1308695 1463784 1370603 1328284 1362100 1463378 1308412 1386256
9188 1386256 1466053 1456178 1452483 1543916 1543712 1466695 1522650 1763812 1844217 2070027 2096522 1995422
9176 1995422 2173618 2285037 2402071 2577933 2617298 2658826 2629916 2926703 3413030 3667708
9166 3667708 3809550 3935271 4182032 4448531 4735490 5204675 5601006 5876333 6169400 6461286
9156 6461286 6981434 7516683 8091423 8827488 9847375 10865295 11854745 12937709 14259791
9147 14259791 15958198 17835484 20155771 22900189 25909277 29381788 33327381 37937869
9139 37937869 43072092 48404336 53886495 59058619 63462903 66602502 68194625 68044775
9131 68044775 66175509 62756443 58111395 52708275 47435785 42445609 37518538 33064599
9123 33064599 29404007 26110346 23156861 20678038 18731548 16815399 15094115 13745420
9115 13745420 12427640 11465366 10481329 9619165 8916660 8346079 7598966 6879771 6487405
9106 6487405 6033640 5543592 5258081 5088218 4799248 4670981 4526446 4231137 3926457 3667418
9096 3667418 3621177 3494274 3419970 3282437 3014789 2796670 2613225 2628196 2396811 2162525
9086 2162525 1904635 1962151 2320534 2185539 2016638 1940128 1945364 1692305 1503046 1278161
9076 1278161 1366267 1481685 1461360 1397584 1392369 1512160 1390539 1155962 1096513 1269428 1396491
9065 1396491 1416554 1314116 1158266 1047476 965714 1025464 1232384 1270685 1135253 927371
9055 927371 985154 1033852 886728 683216 796751 815311 577768 424781 627424 638386
9045 638386 688448 660162 614355 630268 626275 697124 614351 603146 669433 555047 362169
9034 362169 112049 69393 229025 178454 253150 361370 167317 65299 47828 176967
9024 176967 241579 415308 644300 883426 983541 887596 761367 604954 410036 335801
9014 335801 317528 340734 255979 297407 349942 348108 461596 499371 656494 765986 726494
9003 726494 419115 386009 226473 211793 211128 153495 178445 355210 273409 142572 150032
8992 150032 190247 290767 267122 125222 52320 -159739 -1960 259179 375449 278361
8982 278361 78233 67235 90177 125931 -59447 -71186 -84806 55394 82413 -64276 90526
8971 90526 145214 175388 139374 64359 81557 16611 85111 374297 339359 284548 184107
8960 184107 136943 91202 21860 34193 146154 183288 138518 17862 186398 236189 229019
8949 229019 270581 180923 11879 -22439 -19320 48229 57659 216435 277001 159252 171541
8938 171541 268685 110877 -48214 45659 176531 169321 93066 28555 4938 14055 -29520
8927 -29520 -160276 -244304 -170465 39205 61891 110080 52731 -49955 86630 122543 208753
8916 208753 120518 32418 -82348 -35984 -73188 -256907 -561990 -402037 -196159 28143
8906 28143 -44807 -292325 -310633 -4322 186743 44893 -170878 -291796 -349953 -170445
8896 -170445 -4262 -15948 -2029 115912 52726 -56361 -120371 56100 -73051 -168768 -172101
8885 -172101 -309590 -188333 21602 89774 66001 -31637 36280 14260 -3447 45589 248549
8874 248549 189815 205957 -5659 -125788 -204233 -365850 -208234 -4785 79513 -54986
8864 -54986 11434 104979 29207 -87074 -56846 -113255 -73760 -89890 -58647 64838 212539
8853 212539 245142 293046 287576 56324 -1806 -43347 13191 219474 293320 318002 401039
8842 401039 338894 100577 -424 78753 215053 247055 129873 -54323 120055 31897
8832 31897 -213603 -293637 -45742 123356 -83318 -195047 17555 125032 101041 53738
8822 53738 -15473 -198178 -401770 -330497 -164330 -96329 38260 68622 86745 177253 76158
8811 76158 132305 256936 357216 318843 356516 143865 118640 90834 54918 -55215 -109229
8800 -109229 -196169 38622 22608 68686 54642 154170 92879 49310 250596 318871 286324
8789 286324 280644 182991 147522 22252 47978 26125 23243 -34707 87281 176446 44634
8778 44634 -78231 24408 -29410 -72704 31444 110021 275763 284307 269997 188030 74384
8767 74384 -6233 -179265 -261279 -20285 193516 105562 -60467 -48669 4854 -738 -15885
8756 -15885 -27331 -132036 -139933 -137289 81334 93163 175460 422984 371013 146758 180513
8745 180513 271414 112405 105482 89107 74160 69861 164786 82398 39675 28522 -111448 -133425
8733 -133425 -52675 -50342 -99706 -192127 -68314 -43326 -88910 16634 120247 182762 232305
8722 232305 134671 -56854 75150 150586 189997 177011 124783 23788 28172 84052 2276
8711 2276 205535 385444 159193 4571 30095 122375 49446 126607 120387 66550 -105710
8700 -105710 -64159 -106942 -316282 -146938 96096 -67241 -90187 -113360 -76909 215324 217369
8689 217369 14199 -59105 -206648 -397075 -408482 -289202 -97807 120776 110414 55412
8679 55412 -80096 50915 8437 -22243 10678 -15552 93066 223792 385027 312056 242926
8668 242926 215708 213356 63463 -8615 46930 52723 46899 -14920 -142026 -2615 112444
8657 112444 -79948 -100941 101987 50225 151294 29789 -124182 -136628 -7733 81199
8647 81199 -80067 -110057 -49125 -10090 57798 -21102 -41585 -56178 -93680 131845 146354
8636 146354 217142 298675 302658 236274 172798 159896 48460 209702 485087 460597 280709
8625 280709 506460 756383 600700 437034 406197 499047 541898 420840 572157 622972
8615 622972 714110 608720 447282 619103 844796 759955 657628 762747 726821 888773
8605 888773 1121411 1263356 1288223 1220001 1242255 1318192 1293513 1261597 1066333 1091027 1188280
8594 1188280 997703 528710 356041 470597 504328 461974 510260 581800 429053 156010
8584 156010 61339 -44695 -217719 -94531 35508 159879 247730 198751 188588 128273 129744
8573 129744 -52941 -134135 -7674 29259 -18089 -82529 -30034 -128366 -210014 -212872 -261620
8562 -261620 -254638 -229334 -74078 43906 51917 72900 131479 129754 33055 -19518 -120695 -77705
8550 -77705 -195619 -8140 32086 -60024 -116321 -91182 44288 171709 223098 44711 -108526
8539 -108526 -148419 70250 206841 144977 -12028 15676 119775 176435 184129 151905 270390
8528 270390 216602 9986 -327865 -329545 -177875 -126819 -70640 -80425 120628 124657 69085
8517 69085 54587 140740 245744 207296 179206 138268 259657 -60962 -237846 -205890 -55498
8506 -55498 -100542 -48739 -54330 -32435 -134420 -268954 -49332 177913 205337 266779 459549
8495 459549 326051 112 18991 -198327 -218938 -384882 -161906 84836 238783 288350
8485 288350 81813 49648 243743 215053 152195 233458 119340 -10239 -32736 -28225 -4329
8474 -4329 104071 225292 150320 17760 -94467 -82307 -107204 -93669 49079 192885 291825
8463 291825 302459 326661 240738 125265 -43081 -234813 -354428 -118964 56271 7111
8453 7111 -135102 -256635 -205864 -212048 -222799 -101564 53110 145499 60673 -7461 99689
8442 99689 209054 -34878 -52965 31925 43068 -19265 54927 -25503 -150165 -213520 229
8431 229 221781 225719 79173 -138053 -313176 -161090 172566 325773 222707 231952 54288
8420 54288 -83378 -63334 54565 164952 159349 98869 -29053 -223696 -220247 -23825 65797
8409 65797 80893 76 -221541 -98247 -250183 -133301 -54206 8927 -177276 -123514 -58543
8398 -58543 -41358 54691 36754 -63144 72294 6999 -208811 -105148 37654 -37423 -177893
8387 -177893 -302795 -83483 49070 -199345 -337726 -363095 -335962 -316432 -180198 -227851
8377 -227851 -263179 23091 -61477 -155153 1963 342310 475046 302488 250464 139332
8367 139332 -96174 -197026 -38589 -154176 -53003 104824 121112 158879 91391 267928
8357 267928 87268 -139390 -137818 29290 247157 171979 41144 96575 -123000 -121496 -76622
8346 -76622 6998 -53234 -132436 -134630 4688 125208 102780 -16022 -88324 -71877 250137
8335 250137 378645 72316 -3540 141022 94811 36180 77385 250790 378587 232398
8325 232398 42128 53031 -94326 -125210 60301 -79206 -85415 -120575 -144241 -177316 -267722
8314 -267722 -278958 -353906 -339380 -138843 28077 -122956 -398312 -336989 -128726 94565
8304 94565 47638 55101 -141614 -196304 -132106 -277313 -188327 -241233 -193587 -195104 86841 363904
8292 363904 472888 239432 29896 36025 67070 49850 33271 -55207 75816 152971 72761
8281 72761 16382 -61877 24313 224354 358346 276890 186044 22951 -213742 -186609 -97824
8270 -97824 14913 -26026 -74687 -123375 -130210 -202377 -93372 -121882 -345228 -396935 -324989
8259 -324989 -246987 -102146 68006 70481 -54191 -63640 -82926 23998 40695 -4700 -44704
8248 -44704 117994 188205 288107 160190 38672 -108367 -271908 -355302 -364582 -316979 -230468
8237 -230468 -275720 -384275 -304377 -287313 -185613 -222165 -197551 -32451 63980 12141 12237 119077
8225 119077 70992 28022 -48034 32965 132633 58799 -84202 6851 176759 14842 97504
8214 97504 200159 222572 166003 123810 136163 55141 -137722 -112221 -91474 -103305 -218905
8203 -218905 -245204 -145110 145773 -4259 -43435 -107440 117496 217333 373823 388230 259288
8192 259288 216083 177782 107635 197087 215192 250561 212615 121840 -43243 -63659 -106219
8181 -106219 -241935 -318700 -132752 -26934 -20405 30670 -54882 157823 165571 50273 -41383
8170 -41383 -24261 120638 76775 29274 26699 -42786 -654 -28823 -98705 -87368 -156549 -189310
8158 -189310 -379134 -411301 -365259 -344551 -275252 -199286 -54052 -82861 84344 66684 -51079
8147 -51079 -85862 -38880 48940 195602 203773 82320 -145316 -246857 -254624 -223918 -85481
8136 -85481 -11503 -17855 -159899 22923 4789 67520 5260 -129774 48012 57015 -61587
8125 -61587 3379 3500 152376 -59970 -124448 -113006 -134614 -199429 -238174 -215540 -257330 -197353
8113 -197353 -353978 -314724 2391 263466 154710 79952 -28105 -164385 -184007 8767
8103 8767 -30228 -163279 -204669 -209083 -323959 -307829 -224511 -392117 -511495 -341059 -59321
8092 -59321 -11306 -72988 -130474 -122930 -86741 -95503 13940 75978 106570 14778 39553 81724
8080 81724 28182 -148156 -295783 -446641 -459382 -387462 -384010 -337488 -263854 -228118 -148489
8069 -148489 -14440 106229 17667 -193160 -395659 -223576 88376 210738 188724 48480
8059 48480 71763 -168242 -342556 -279606 -232290 -79836 -107686 -216133 -356974 -336215 -258753
8048 -258753 -167525 -18700 106358 36020 -19894 -123946 -186000 -164388 -225611 -258699 -153518
8037 -153518 -148909 -143021 -299701 -192554 -313090 -231441 60484 153476 84918 -75194 15715
8026 15715 124681 54311 -80407 -28627 51558 17966 89351 77608 88116 54884 99031
8015 99031 -77941 -291351 -14423 88723 -22081 76611 150685 301477 356746 473033
8005 473033 443793 234795 120227 58176 65397 30609 50905 78887 -99884 -97238 -147836
7994 -147836 -213136 -118677 -43655 66907 113910 101867 187865 223597 81885 -62134 196862
7983 196862 308855 405457 491547 502945 499365 415120 261988 103188 -36075 93575 63211
7972 63211 25052 1379 -132143 150705 307066 293389 186642 143892 176079 168408 157748
7961 157748 87715 184923 182366 219961 223756 249464 261364 80859 59789 209061 291631 301640
7949 301640 262471 125214 109353 121077 63349 79732 -20863 -53015 -12969 -177006 -283459
7938 -283459 -101333 -69739 69964 -18188 79606 80665 200284 95859 71843 16292 281169
7927 281169 325933 95321 -101043 -176722 -125376 -24083 -47204 8432 86854 82519 69160
7916 69160 315986 362694 146404 74478 165129 328099 397213 123484 94232 -49437 -144414
7905 -144414 -101611 -53391 67158 -3043 20178 -108848 -262362 -198640 -175763 -35464 -11962
7894 -11962 2820 -622 105087 59654 102131 58897 76603 70705 -9321 -51251 -68760 95663
7882 95663 141129 269902 194703 160159 63554 192614 306508 65449 -32006 206924 316099
7871 316099 175566 348341 342440 14414 -16080 186196 345107 149444 69403 175458
7861 175458 139143 106733 169329 47500 7436 4893 126292 106892 -29091 -44214 169695
7850 169695 311233 135999 -198393 -305196 -253872 -182154 -248364 -250686 -339940 -303394 -108193
7839 -108193 30119 151751 212069 131324 243296 144279 65536 -37030 -61134 29568 26889
7828 26889 7951 -64101 -162166 -194143 -240369 -181954 -100489 -181355 -215080 -353257 -412446 -206714
7816 -206714 -103007 24554 68288 133988 21873 -181055 -317995 -198157 84552 195683
7806 195683 226166 302618 85091 -31330 -18594 4218 -80494 -116080 18152 68644 66164
7795 66164 -219885 -172117 -119622 -64782 -83563 -117635 -99174 -36765 108944 124971 20757
7784 20757 -62007 -63513 98900 230183 245664 152175 -38349 -103885 29232 139626 -7907
7773 -7907 -149164 54011 114526 122830 24088 -52527 12638 -142221 -270695 -175960 -173832 -124941
7761 -124941 -6153 32958 -9910 -61748 -67347 122427 190407 52736 11115 -45672 -158589
7750 -158589 -120954 89926 62859 65173 -34195 -230548 -197523 -140748 -165945 -126997 46767
7739 46767 -15587 -348958 -342638 -116291 91376 162664 143135 -62226 -108166 -1418 92801
7728 92801 167222 245126 127454 77201 5360 66779 169984 103015 43607 -20899 191437
7717 191437 159402 1032 -216141 -221282 -34666 176083 324857 346051 403549 300266 240977
7706 240977 269374 395943 297828 193884 122598 82066 120871 71215 -11596 29526 143558
7695 143558 -6578 -67382 -131962 5086 -35723 -105709 -214818 -353425 -280449 -155357 -132867
7684 -132867 -125244 -136615 -154600 -142497 -124203 -120113 -37789 -407 -47826 -110869 -174425 -51791
7672 -51791 478 20445 -77160 -78745 -28768 -32954 -16610 128763 1052 -198976 -151995 -90859
7660 -90859 -68692 -187390 -340922 -193103 -20272 75115 122315 127509 132312 168142 201279
7649 201279 292600 116859 96389 101726 21149 58387 151540 -20538 -93368 165902 414834
7638 414834 386009 247453 -89469 -182498 -154825 -49326 -41509 -209782 -334717 -272074 -124675
7627 -124675 -110958 -294669 -278073 -54564 24585 -109123 -167206 -67599 -56818 -109085 -93616
7616 -93616 -266881 -221219 -76211 -127435 -212387 -177786 -129008 -122088 -186908 -251697 -433650
7605 -433650 -255095 -98949 45687 23998 75671 104933 -49892 91106 114819 209327 416706
7594 416706 317763 122520 -159099 -107691 34594 -216752 -483317 -508474 -609045 -374044
7584 -374044 -130712 120534 205496 29480 -131605 -174722 -113750 -105262 -50279 -114163 -365300
7573 -365300 -562727 -507434 -191267 168998 328318 99341 -97407 -170412 -238334 -232691 -141591
7562 -141591 -68757 8303 -96541 -84602 -14709 61817 139052 301470 199135 103732 192617
7551 192617 220222 191155 244349 200467 40289 -84016 -54430 27070 -2701 -26838 156848
7540 156848 134103 -129934 43537 176727 -2948 -272064 -220087 -183436 21244 20479 -222585
7529 -222585 -264124 -32681 15578 -136375 -161618 26924 125212 119863 -13209 40701 57217
7518 57217 212635 224924 29800 16970 -90375 -187925 -225539 -226415 -154822 -293864 -226693
7507 -226693 -69819 -94056 -234434 -342704 -269121 -238382 -335562 -373656 -363008 -373716 -257903
7496 -257903 -312647 -111150 -38476 116992 -17288 -328687 -275651 9656 57437 -14789 -61647
7485 -61647 -47708 13413 5319 56471 130240 -8597 -82850 -217916 -297718 -157383 -35704
7474 -35704 109593 113319 -50200 -88067 -167721 -29984 20734 -89029 -361626 -436817 -325323
7463 -325323 -144059 26514 162616 186986 44234 -280629 -220058 -18862 60542 34441
7453 34441 -102154 -86821 -147792 -157381 -191693 -176627 -147289 922 1167 -17480 35760 -45713
7441 -45713 -83880 -279010 -560178 -516795 -474537 -197490 149472 141539 168764 84689 -9494
7430 -9494 -80523 33207 185465 147869 -68700 -130199 3787 -151598 -231272 -232726 -142841
7419 -142841 13271 25750 -80620 -65886 -196838 -138742 -272584 -323491 -368543 -310304 -248260
7408 -248260 -62287 57508 82 -20017 -125844 -94392 -4561 177125 191865 -48741 -90477
7397 -90477 107188 155707 98923 221 342 113767 174838 189966 26472 79910 51002 115305
7385 115305 36980 -95862 -20605 -1358 -198007 -180723 -346494 -405467 -267209 -244517 -303418
7374 -303418 -411480 -294758 -227438 -293056 -186910 -151624 -6698 167957 10200 -978
7364 -978 59193 89443 79220 66128 48921 -49465 -46671 -60457 -108095 -13772 206950 105967
7352 105967 120117 141159 -43867 -153624 -352246 -421041 -268705 -41872 64148 -242833
7342 -242833 -394529 -278921 -326867 -275949 -160637 9888 156290 65361 -89368 -180370
7332 -180370 -199939 -107380 -132160 -215662 -295306 -378282 -292751 -77812 2866 -127067 -190988
7321 -190988 -348995 -344911 -200466 -186948 -137243 4102 112788 254908 307400 393703 213936
7310 213936 230579 194672 76390 129628 155919 67059 136987 189077 15769 47106 140794
7299 140794 162603 147524 112371 3827 54062 -17092 64656 279312 78633 66597 346204
7288 346204 261555 -7416 -58687 1623 -46120 -31755 -116438 -237915 -290206 -330909 -289535
7277 -289535 -199663 -90757 -126042 -114892 75265 158828 147673 288781 247193 318418 271068
7266 271068 72795 -93100 -17552 164174 215907 205461 145197 136634 -18271 -57426 -126956
7255 -126956 -57265 33503 75488 126651 210490 57526 -66207 -197292 -210992 -151956 -64570
7244 -64570 99612 -54970 -211332 -165848 -170537 -164504 -11223 74367 -153217 -89076 34925
7233 34925 54555 -88395 -199467 -249675 -205160 -122087 -131156 -80389 167064 166639 -19488 -241659
7221 -241659 -311926 -70727 -38636 -64810 -154217 -101091 -261127 -387091 -264463 -335180 -356023
7210 -356023 -67827 114291 172990 83495 -180812 -50825 -31567 -183114 -200214 -33108
7200 -33108 69451 13406 -230468 -318805 -185648 -105568 -49917 5461 61324 48139 -23965
7189 -23965 -134647 -300410 -244038 -209321 -93315 -166138 -176444 -262406 -319446 -227812 48243
7178 48243 305549 377293 191087 59685 -70092 13007 67332 67592 128640 224254 162204
7167 162204 121852 197515 52953 -85871 -101622 143723 271984 217131 133236 25757 -260582
7156 -260582 -250726 -37809 -16206 -42336 73600 189370 76430 -75636 28527 97556 101312
7145 101312 -25282 -117787 10061 -298 -90079 -17415 -37222 -17591 -76136 -243035 -182670
7134 -182670 -172208 -85642 -117329 -323736 -264205 -141650 -217317 -316539 -394866 -377543 -111085
7123 -111085 -106367 -220666 -153141 24805 148119 144288 131928 146765 -14200 52246 184166
7112 184166 115811 3946 -209716 -311859 -117243 -90005 102257 270741 302951 293523 89141
7101 89141 -205424 -446144 -526688 -486726 -459449 -386506 -239743 -164538 -46239 45410 42216
7090 42216 -159874 -16095 27534 172241 168955 -164508 -262246 -227493 -188260 -134873 -92853
7079 -92853 -198289 73201 182509 223218 134796 49839 -142177 -90957 -6082 -114431 -201618
7068 -201618 -207637 -83740 62762 92602 -116781 -74019 -82806 -71461 2905 -25390 -16726 -38253
7056 -38253 -60584 41050 -160885 -310120 -187505 -120921 -191771 118830 167550 -31231 -120588
7045 -120588 -85880 120405 123517 -205536 -347845 -242292 -143605 121423 -25345 5327 -133245
7034 -133245 -194435 -59055 -229434 -218799 -64201 -163445 -166472 -308206 -294736 -151026 -27235
7023 -27235 23854 -11336 91623 169457 14877 -143455 -178169 -105142 -19461 -81716 -62593
7012 -62593 75636 -90752 -286790 -59823 135496 57161 -91499 -120935 -29574 104311
7002 104311 225310 76088 -154688 -167951 -277435 -392894 -495699 -286571 -83714 -266929
6992 -266929 -429593 -503278 -273731 -316087 -227529 34353 64725 166374 84679 -239814 -482881
6981 -482881 -536454 -372784 -262424 -289034 -119927 -103403 -186011 -214733 -140893 -60812 -83849
6970 -83849 -90280 90409 47742 -212490 -209607 -128872 -14358 137346 -165 90720 214761
6959 214761 229741 161307 -64919 -31564 58739 -93100 -66879 -3287 24383 -5815 122068
6948 122068 108222 -20601 -107261 -68494 -250584 -259574 -227236 -384697 -211227 -94310 -5991
6937 -5991 109261 100789 -18806 86730 50688 21434 197819 388933 281127 208231 137638
6926 137638 90216 180115 -55740 -263523 -203704 -41974 6248 125132 215883 186020 -8942
6915 -8942 -64763 -8840 3740 28844 126091 156277 356230 460519 358175 431747 239278
6904 239278 151733 45553 32476 115311 160161 384396 407375 156422 159305 73886 -53912
6893 -53912 -115420 37871 -5414 -91330 -102840 -52042 -163111 -297467 -197567 -186587 -145679
6882 -145679 30254 -1766 -116274 -281704 -418360 -526540 -459644 -214082 -71282 -184680
6872 -184680 -388343 -547636 -254051 89055 410050 372683 266815 135349 85388 127070
6862 127070 -27521 -144244 -95033 4098 -76355 -17555 -101161 -90988 -35081 -47057 -88340
6851 -88340 -346421 -362348 -355796 -131098 -84444 -143299 -224507 -461232 -453154 -348421 -256170
6840 -256170 -372504 -393862 -205225 -35623 -16632 79807 -214338 -496104 -248165 -106973
6830 -106973 -98040 -127994 -106244 -173754 -246483 -109461 -107411 -118248 -151274 -122554 -53965 -158919
6818 -158919 -146179 -146088 -35743 196483 196243 55533 33377 -71809 -224273 -105579 -6176
6807 -6176 -197378 -200824 -43716 -113613 -60504 41896 226354 62020 16916 -84660 -117834
6796 -117834 -310587 -201798 -45777 -180738 -130707 -209417 -326932 -281521 -50567 -106305
6786 -106305 -195539 -356968 -400335 -377038 -361025 -247807 -228673 -88937 45671 205140 141487
6775 141487 62919 73165 -126207 9920 74362 17680 166086 201697 91476 -240036 -509384
6764 -509384 -411337 -310380 -140866 -154766 -5999 213336 348336 327041 114744 -73805
6754 -73805 -154138 -245366 -268198 -197792 -91854 10518 -45941 -83884 -37923 66895 239520
6743 239520 73079 -60638 -74133 -62412 -85571 -179050 -175312 -4410 85592 5684 -101999
6732 -101999 -215583 -186129 -76483 1005 84362 138645 21799 -15964 28997 26259 -40868
6721 -40868 -169012 -163793 -210329 -203296 -77836 -40226 60079 190870 130958 104596 112700 41686
6709 41686 94412 205458 330971 387748 226167 165703 40828 -121131 -81364 -148931 -4547
6698 -4547 -19817 -213536 -178655 -210797 -483655 -397647 -140151 -109245 -38051 -51439 -93656
6687 -93656 -135606 244410 323878 307553 179788 87352 -77729 -154245 -207223 -189321 65132
6676 65132 192560 183783 103262 205705 146938 -127175 -58418 141098 276517 59046 -27685
6665 -27685 -142100 -236312 -295542 -129904 54538 133836 122305 43681 -142018 -52234 34093
6654 34093 116944 164650 3344 -91770 13167 -55421 -245298 -211876 -256682 -179525 -6640
6643 -6640 -110764 -246665 -271065 -169947 -27320 -15326 -63992 41532 -27251 -112618 -317348
6632 -317348 -330430 -152704 195536 351156 196747 -50299 -271744 -113068 -121159 -79510
6622 -79510 -44005 -131178 -54822 264547 322054 157074 63913 165511 163685 34456 83672
6611 83672 155727 251404 220154 275118 262724 124911 41089 -198300 -394845 -376455 -263094
6600 -263094 -240587 -151125 -191013 -212599 -154055 -9037 21785 -269010 -338361 -212760 -59744
6589 -59744 -85741 -123671 -1799 43706 99114 137108 28308 -52433 52155 17575 -217573
6578 -217573 -387804 -470114 -299041 -122895 -43537 1408 121678 53762 -166022 -233520 -85735
6567 -85735 195515 134812 24249 36611 24924 -69270 53157 135646 95149 173545 185904
6556 185904 65254 182839 268374 151528 172789 89095 80709 81597 146400 113378 168549 -57865
6544 -57865 -220842 -282342 -246467 -277992 -382822 -381270 -434163 -419602 -142448 49778 -33949
6533 -33949 -336246 -402423 -312978 -144196 -207787 -195008 -130569 44078 2155 -188623 -187801
6522 -187801 -376463 -575014 -323398 -135969 -131512 -256248 -316328 -80151 206260 210517 -9542
6511 -9542 -178836 -118587 -117983 -315780 -373060 -257254 58104 161691 74161 31444 157579
6500 157579 48765 -51471 -77215 -37080 81047 61280 91672 61022 -88185 -159796 -134750
6489 -134750 -158100 -291685 -214296 -85087 -99030 1042 167081 78206 -102262 -38279 -238549
6478 -238549 -427597 -300041 -256601 -473623 -451303 -275563 -126929 -27770 -98788 -178818 -124493
6467 -124493 -152727 -153062 -260048 -211784 -124387 -243614 -100825 -205596 -77066 -20659 32996
6456 32996 244329 240683 232116 -5185 -50232 20122 -141996 -161269 -21392 26197 80952
6445 80952 -4730 -117265 -196387 -106452 -123158 -36652 174503 274088 226267 234578 140095 -66087
6433 -66087 -73500 -166476 -98257 27305 63778 -49606 -22169 33161 -8049 -43485 -171764
6422 -171764 35078 134147 64928 30653 119529 387099 462576 395070 226210 177275 145244
6411 145244 89004 -144857 -393186 -578802 -497021 -293667 -114339 -55928 -194420 -237727
6401 -237727 -102548 -25155 -108722 -318133 -349929 -434755 -606585 -661548 -564932 -528839 -294744
6390 -294744 -103448 -62701 119016 219076 128824 -62842 -105726 -7262 29543 -136508 -180251
6379 -180251 -161822 -295570 -340600 -435444 -278153 -338166 -309738 -220445 -234332 -159149 -31697
6368 -31697 -262 177103 392162 281974 266267 79458 -50465 -165940 -222147 -16583
6358 -16583 -122147 -164075 -88671 72645 179038 156495 -71973 -92458 -86840 -189188 -287705
6347 -287705 -293406 -337572 -328758 -167827 -88981 31829 206180 66083 47356 110425 57718
6336 57718 232253 366364 410087 267105 164689 14709 -356715 -308566 -346534 -320024 -266727
6325 -266727 -167181 32162 -41754 -53893 -183901 -275781 -97733 -137283 -117115 -148933 -143525
6314 -143525 -89060 -100467 -170712 -62077 -34480 -9916 46271 85341 323719 344020 280785
6303 280785 226771 29692 1402 -16507 -82784 -60731 93224 122740 -102115 -260196 -369985
6292 -369985 -272277 -44483 50004 56380 170723 348111 160847 -136995 -215222 -72735 -26887
6281 -26887 -49915 44734 127195 234383 157017 -5505 -129704 -232487 -176125 -7952 118349
6270 118349 342784 273936 97975 93843 26323 -14059 -232019 -299306 -521177 -483323 -387183
6259 -387183 -399147 -219918 -6993 -10788 23878 36913 -158919 -415026 -492356 -416462 -440263
6248 -440263 -343846 -246044 -253994 -274157 -108421 174294 254881 44659 -135764 115014 336652
6237 336652 355313 321226 160234 55763 43065 204904 193633 146254 165406 54494 103646
6226 103646 163177 -46420 -135055 19496 92639 -3855 -28888 -108891 32068 -26388 -152370
6215 -152370 -195189 -339108 -345531 -270718 29908 203136 298137 140257 23177 -23534 -161668
6204 -161668 -198911 -27903 -197756 -398086 -393038 -313096 -142104 -80639 119437 132366 82294
6193 82294 107818 -19133 -227576 -168633 76510 40497 25255 193062 245675 144482 89803
6182 89803 -63087 -34040 -160179 -365748 -453736 -257649 -20130 55862 4977 208478 212618
6171 212618 -23737 24116 -50365 68313 88903 34889 -12107 68227 -67686 39679 136489
6160 136489 245557 351024 265905 135368 282149 548804 573475 254145 42991 170572
6150 170572 116377 30337 89284 258138 284407 292898 374534 394152 255602 -118633 -474786
6139 -474786 -393110 -156888 33426 1799 -162120 -81843 -122645 53587 144907 -62613 -176512
6128 -176512 -92727 36004 -210146 -80774 29578 11465 -118053 -214816 -261510 -122228
6118 -122228 13895 -184836 -340375 -311320 -498243 -594511 -466168 -227556 -45079 95510
6108 95510 163616 -9982 -138720 -265394 -273263 -266824 -376372 -212239 -120043 -16265 -90604
6097 -90604 53623 -205146 -94388 64344 66610 -28349 -156490 -64966 67806 47913 -24007
6086 -24007 152886 -13139 -92105 -8292 29607 69425 154038 54966 27780 -88696 -271869
6075 -271869 -121192 38053 190448 271141 235383 173623 211979 259570 183446 36556 18278
6064 18278 145759 60256 -124070 -202392 -71530 -26455 36968 160569 91542 7071 55499
6053 55499 18047 -80822 -96407 -148059 -90860 -139028 -74900 34039 -230023 -267421 -144468
6042 -144468 -156728 -228576 -329539 -275522 4982 48841 -287417 -196849 -164730 -96423 -112298
6031 -112298 -9439 128561 199016 -95163 -398022 -307037 -165837 -176050 -231404 -138452 -96578
6020 -96578 -187090 -146085 -103347 -229695 -414668 -351505 -175724 -42960 -189594 -228770 -243053
6009 -243053 -338792 -195200 -5831 144549 163280 184118 5707 -155151 -199644 -192016 30450
5998 30450 164952 -1742 -162267 -94267 91751 -17583 -29990 36485 -127118 -125940 -159518
5987 -159518 -146543 -47941 42247 200833 -58705 -83848 -61389 37407 -69895 -119626 -84640
5976 -84640 -212587 -173579 50740 226477 19491 -444484 -412885 -245446 -182597 -130027 132993
5965 132993 218285 254917 271566 296208 219581 292881 410337 305588 -83421 -1368 87365
5954 87365 53411 169808 156637 65133 66661 74286 26780 -106209 -228253 -212592 -296297 -213625
5942 -213625 7023 21370 38731 205098 313315 138817 -107847 -181153 -178621 19490 220158
5931 220158 248789 284494 306380 184841 300052 288261 364713 447314 272034 12717 12102
5920 12102 147288 53309 138642 -8533 -64315 -131492 41624 193147 346012 404636 356100
5909 356100 185198 -25322 58566 124698 83287 150825 211067 24272 -200824 -306967 -66374
5898 -66374 128645 165713 227634 341442 335384 73482 139112 120730 56143 -42047 -46736 -125758
5886 -125758 -28910 69497 184664 187362 128425 130058 207525 8474 -112928 -248857 -227569
5875 -227569 -9098 117442 16456 -235267 -357523 -461147 -484924 -321334 -219904 -63245
5865 -63245 -78180 -16207 70282 52587 -81504 -153907 -209657 -331476 -358886 -198345 -30176
5854 -30176 -128229 -263747 -234306 -123859 -2407 68613 -52806 13420 103057 -61176 -58220
5843 -58220 97851 314477 206296 64917 -97317 -15576 107264 151244 81958 82063 146349
5832 146349 349836 240676 153271 -45092 -70023 48245 -140670 -409341 -380827 -313646
5822 -313646 -212690 -216957 -40565 71105 84854 162217 -23333 -11910 56610 110708 -41399
5811 -41399 -24088 118671 138209 -71470 -90980 -2375 145457 46125 264165 326454 236622
5800 236622 124106 54267 -69512 57626 147984 254135 329352 268731 304376 278543 4483
5789 4483 -194154 -127524 -260291 -276389 -345288 -227907 -212453 -67850 -106603 -193876 -178637
5778 -178637 -141348 -32373 -1196 7561 -99539 -158554 -337697 -321958 -44715 -32467 -117826
5767 -117826 9901 31321 -120340 -194710 -428721 -190613 -108169 -125587 -108864 -152409 -203091
5756 -203091 -94620 -65525 -31112 -110247 -131463 -160266 -324909 -303256 -111720 -81043 -83485
5745 -83485 -55819 -168806 -308060 -323190 -185388 -65115 -44543 -128822 -246020 -297745 -234464
5734 -234464 -72258 91354 279225 225962 141599 80041 7165 -145147 -194764 -47042 63158
5723 63158 -64802 -172269 -102475 -72654 9343 43682 25122 -66031 -177918 -53697 133820
5712 133820 189634 358417 423746 306134 309336 349086 188615 9343 33358 105288 127104
5701 127104 23535 -19133 -58408 36547 194824 113517 -146079 -254454 -210702 -144428 69779
5690 69779 242109 254288 283767 295947 267765 11528 -46736 -90946 -139889 116720 153040
5679 153040 -8791 14974 -115760 -115757 -312406 -423859 -244116 -281869 -398630 -126978 -10409
5668 -10409 -181263 -92507 15407 -51895 -53719 -17850 57910 -202903 -50405 -56939 -131665
5657 -131665 -75851 -11137 49641 46250 157054 248509 36904 -178325 -150852 -71288 -55430
5646 -55430 -11562 -119895 -37201 157994 164426 192944 170012 -63325 -220437 -347040 -224276
5635 -224276 -160234 19094 -15064 83183 124910 1412 -227655 -306154 -263403 -332680 -486869
5624 -486869 -386855 -254875 -251865 -326598 -536648 -637676 -470015 -155597 -80121 -95831 -333152
5613 -333152 -554161 -261699 -208686 -217843 -148962 -275882 -472831 -523094 -474849 -185957 -157435
5602 -157435 -86843 65537 126121 189373 265786 108725 -99282 -115974 -39759 -154156 -104940
5591 -104940 -111923 -173979 -38676 71736 362 36647 -65796 -72239 110592 220152 185946
5580 185946 29250 155055 196256 43156 -7786 23790 34737 -37348 39121 34057 131845
5569 131845 205156 131567 37409 47765 7905 -182697 -230277 -6885 278181 455580 365261
5558 365261 473126 437768 382369 369486 511356 496564 370613 65672 -80585 3230 -63228
5547 -63228 -22462 14801 -96532 -94429 -117292 -144694 -83687 31421 -152103 -213740 -288541
5536 -288541 -160858 -182247 -37838 148530 326032 314285 190239 247567 299879 249724 86961
5525 86961 -38980 -90800 -194091 -337413 -71722 -57320 -307296 -222939 -208713 -243652 -217450
5514 -217450 -92587 24680 -19994 -95848 -152993 -141144 54356 64661 -4360 -104158 -184372
5503 -184372 -149135 22695 -99074 -134606 11216 89952 187061 61380 -81777 -281270
5493 -281270 -445778 -411182 -438483 -433744 -279129 -197096 -105160 -19674 73678 72225 134367 135149
5481 135149 178027 -102014 -166500 -31949 -71996 -95537 -29512 -19375 89736 159824 192537
5470 192537 263834 148654 32294 -107040 -354253 -523401 -482886 -392069 -210452 -168285
5460 -168285 -298798 -210574 -92627 -161872 -195796 -82432 -147810 -62019 8304 -86573 -160388
5449 -160388 -292188 -277390 -296535 -413860 -469511 -168389 -114999 -214533 -192447 -177147 23307
5438 23307 176731 167884 232558 397045 235508 190736 129745 163592 289420 267299 274963
5427 274963 111446 -53956 -172724 114515 102287 -45190 -259021 -219903 -91631 -81793
5417 -81793 -171137 -130901 -132090 -63571 16136 71348 -56014 -169101 -265732 -339717 -286340 -88484
5405 -88484 -49050 32718 -10648 -132296 -292218 -282697 -223031 -202101 -35068 148254 327847
5394 327847 437984 394448 245692 99842 209505 162179 30511 261630 211108 78145
5384 78145 125404 205636 107678 268155 371167 439898 267061 51937 -87630 -165229 12963
5373 12963 252788 74633 -6514 50864 164298 169803 282422 263877 47866 -69596 -78029
5362 -78029 38422 -47363 -192545 -140968 -259258 -428045 -308072 -180605 -134004 -82192 67854
5351 67854 52774 2291 -100918 -86242 222048 324390 246706 187032 127896 139046 115807
5340 115807 178424 284054 212042 135879 70966 9144 177161 181010 60872 -39626 -129096
5329 -129096 29801 129779 176199 370395 264660 161922 241236 -62508 -220793 -142783
5319 -142783 -241132 -314279 -240659 109622 314466 251711 41324 -90893 -96797 -104691 -153884
5308 -153884 -85247 -48734 -134704 -255625 -168397 -127044 -37685 65529 -19556 -194586 -197376
5297 -197376 75286 53683 -126560 -303975 -236217 -101782 59386 125661 132108 238157 278164
5286 278164 203544 12970 -34844 -40124 -31170 -143313 -101831 -115988 -139328 -129046 -180655 -264978
5274 -264978 -197205 -132224 -149333 -397141 -340963 -341953 -319724 -290780 -150482 -356606 -624326
5263 -624326 -634683 -664282 -738564 -552489 -307252 -179008 -113203 -52469 -9715 120838 187816
5252 187816 114540 -90547 71348 211631 250484 100468 -17540 -151079 -55006 -102007
5242 -102007 -28309 -259950 -448713 -434253 -201611 -163345 -267633 -121276 -145779 -140529 -87837
5231 -87837 112189 14541 -105008 -176754 -131287 -159200 -48708 14009 136401 20944 -226504
5220 -226504 -53943 -6894 -133401 -143580 -43073 30129 55976 74495 -27100 -111741 -139494
5209 -139494 -198154 -253481 -21321 122351 98942 62442 -5335 -88749 103886 153130 125872
5198 125872 16571 -192604 -388122 -269562 -173218 33325 143578 -79698 -105911 -152153
5188 -152153 -94606 33439 111441 158461 190279 59556 -100961 23874 308325 369203 302234
5177 302234 293162 259749 153611 250390 65822 57738 53823 210475 167068 291141 268778
5166 268778 115122 193597 105234 41231 17457 -278680 -347515 -295647 -268045 -283065 -167124
5155 -167124 -127960 -66113 -91672 -108749 46405 29290 -74198 -196164 -277273 -237186 -223482
5144 -223482 -136893 -251398 -323141 -138306 108862 179821 127636 -10824 -34166 87083 95537
5133 95537 112306 32968 -54648 -90938 -11340 61741 -5897 -34289 -43095 98439 183243 220548
5121 220548 40672 -85907 -93498 -250727 -374590 -313402 -411590 -293873 -149025 34077
5111 34077 63600 160364 68934 -125841 -99706 -97305 19057 92824 26891 170504 158249
5100 158249 224376 228542 201145 245814 290129 214098 263986 204388 324152 188539 95372
5089 95372 228487 152791 -154182 -241291 -166036 -80275 -100338 -3687 62750 171610 -62906
5078 -62906 -142167 -28793 72882 -25329 -115230 -193439 -198115 -217916 -213282 -271678 -235347 -251064
5066 -251064 -272487 -206722 -261063 -293265 -355611 -301120 -298961 -362118 -217667 -122659 -138305 -177630
5054 -177630 -110137 22988 174316 29382 -214447 -251204 -331703 -290779 -291474 -321213 -224328
5043 -224328 -39495 64715 79628 -183343 -268552 -160875 -343831 -386958 -262203 -392652
5033 -392652 -428364 -358127 -413021 11243 178366 210184 135605 -39020 -237120 -385302 -388204
5022 -388204 -390110 -214169 -207968 -90519 -111210 -155845 -171870 -15367 -7944 -169262 -353141
5011 -353141 -390597 -636978 -646429 -611451 -392338 -196189 -63898 -5604 -135597 -174386 -88095
5000 -88095 113272 226366 199496 170230 1793 96738 102865 232891 143549 63849 115218
4989 115218 163597 -58182 -176976 -133503 -13087 53236 -76548 -77322 6707 12094 186810
4978 186810 -41913 -183048 -131139 -150161 -238387 27723 71118 -156063 -212966 106527 -80966
4967 -80966 -73253 -138679 -206304 -272552 -4445 83749 11586 -97913 -79641 -84406 -17891 -157768
4955 -157768 -65346 -116839 -20010 51352 247511 67702 -98917 -211982 -333065 -124514
4945 -124514 -6133 -198259 -434441 -548019 -563755 -492597 -304534 -52978 -81405 -24315
4935 -24315 60174 150657 39214 -140755 -161008 -82069 46092 259307 159107 44714 197292
4924 197292 167250 172205 79007 46055 166927 121083 81409 10473 57828 125497 55779 16140
4912 16140 114410 113944 111326 156107 217425 165135 69740 239432 381464 341905 255553 140055
4900 140055 69599 100954 -12673 -83987 -312462 -311229 -292591 -145572 -62097 -24253 -66937
4889 -66937 -97051 -227781 -281377 -239649 -207291 -88714 -48765 -120019 -160885 -32103 -128936
4878 -128936 -323396 -404561 -407121 -318841 -199750 -193332 -188599 -268649 -259586 -154499 -77848 -158369
4866 -158369 -264818 -267467 -256731 -91181 -72938 -46747 -22246 15767 58200 99183 142617
4855 142617 135699 42264 -81738 -14605 85711 58740 -32954 66065 113415 23038 19953 -96290
4843 -96290 -44274 55988 -40128 -543 72264 14601 60336 44290 129117 31835 -95598
4832 -95598 -22740 51127 70571 148474 188063 -10852 -59551 81238 48275 -157688 -108866
4821 -108866 35301 31284 9575 -67968 -33580 112377 279679 321025 279762 347253 164706
4810 164706 -9161 -76934 90153 258453 331745 263001 68799 4540 -100331 -84918 -13471
4799 -13471 31114 91228 38547 124611 227496 -114224 -411210 -256771 -42988 -12292 -54641
4788 -54641 -189431 -87501 43617 307551 271966 171605 172053 53380 37510 -10549 -73827
4777 -73827 -72007 -93614 59341 46710 35115 100164 -103699 -119912 -82013 -295350 -188566
4766 -188566 58314 255727 318482 264668 41363 -111790 -252833 -215277 28186 206785
4756 206785 -19853 -226099 -381126 -316768 -159374 -619 6687 -102423 -161022 -104910 -107503
4745 -107503 -114555 -3513 -92941 -76867 -104819 -208471 -229905 -267191 -142804 -37941 -22336
4734 -22336 -152796 -354351 -348689 -368492 -311781 -160182 -40647 153707 225349 127558 -68562
4723 -68562 -180743 -84507 -180362 -348154 -203031 56489 116853 71617 199561 240888 236247
4712 236247 188098 332422 212879 109757 -158195 -165148 88903 1499 -71090 -168502 -181391
4701 -181391 -111648 258891 423497 371386 367762 363957 338709 322895 207231 74712 137565
4690 137565 -19710 -200013 161568 434813 334657 334831 296112 432147 283738 332406 423111
4679 423111 328033 -40718 -38476 -86089 -129553 -253411 -296633 -260704 -183273 -215608 -147674
4668 -147674 13386 136421 58064 46802 31391 -46427 -191384 -165328 -89029 -66033 -304630
4657 -304630 -298088 -245700 -74738 -246610 -274003 -69975 16715 83482 -201515 -227260 -135918
4646 -135918 -118444 -51648 -117363 -158602 -205722 -346459 -559519 -400462 -291175 -277382 -8014
4635 -8014 -70209 -245606 22075 238169 174871 -93449 -189334 -123479 -173542 -186669 -6636
4624 -6636 23418 -148540 -256544 -379929 -440699 -301941 -147326 17484 340304 246599 94491
4613 94491 -149273 -306918 -288064 -28263 30951 80581 26698 -218884 -285221 -260147 -190809
4602 -190809 -163759 -33525 30908 102058 129602 81854 75829 18928 252235 260626 102652
4591 102652 275333 142004 40200 -133748 -71545 289987 303611 -29310 -168673 -43354
4581 -43354 14433 320403 223024 -176701 -180709 -2482 240798 360911 230508 20663 -28517
4570 -28517 86670 83836 73073 -27131 -242418 -247849 -219955 -207429 -207072 -42313 209617 136137
4558 136137 -207549 -264696 -258471 -118737 179471 152153 190122 146081 -54389 -112206 -57013
4547 -57013 122864 125963 64843 127410 47987 5400 -5831 -79277 -224073 -288389 -227804 -24549
4535 -24549 49332 39479 -197767 -230809 -208062 -204367 -49977 -73833 70051 38768 -29512 -64556
4523 -64556 612 -79846 -227642 -433564 -460105 -310821 -103709 17713 172444 265585 315807
4512 315807 260938 256743 323760 206491 21950 45143 43641 187224 270687 402324 408021
4501 408021 299728 36571 3778 -10169 51380 92876 -590 -34212 -52907 -113546 17031
4490 17031 78011 -73456 18503 234748 243867 323406 142237 17197 156773 49355 -173067
4479 -173067 56367 176054 18368 86636 181153 173498 50208 115439 273562 154154 51941
4468 51941 126365 81039 157932 399089 163350 130225 -25980 35252 229253 81494 52887
4457 52887 184217 280144 283169 99175 -10967 25515 93546 158873 229482 243846 272562
4446 272562 194364 147095 113360 232717 185637 -147515 -189984 -121741 -41513 -81454 28675
4435 28675 -33691 -161935 -243506 -69565 151957 120383 -101241 -221876 -356249 -361784 -201252
4424 -201252 25854 3040 781 -46322 79501 -6827 -242833 -435471 -328947 -178599 -170263
4413 -170263 -126226 -252529 -331914 -428589 -396477 -138973 -100490 -4380 150667 219411 229160
4402 229160 209442 169441 178558 191859 115685 96893 282370 219662 232990 98189 15102
4391 15102 353063 410174 293958 355864 309392 145913 119809 377071 383062 300956 210522
4380 210522 244921 287831 418391 378116 218625 110937 171903 210901 71851 19655 185631
4369 185631 230501 268753 277560 217181 41273 -208735 -274670 -189710 -226280 -337101 -351555
4358 -351555 -275171 -238968 -147154 -136057 37189 153476 136100 50437 108338 212296 277942
4347 277942 332252 158109 204975 269144 167245 50243 -89745 -190227 -113175 60520
4337 60520 346563 292154 149874 39215 -120034 -201123 -37759 19860 -187818 -146301 -6672
4326 -6672 175348 295005 294703 133294 39554 -49663 -59340 95619 -65105 -125976 -26381 -6859
4314 -6859 -196581 -132958 -59164 -18347 -263761 -222919 -41815 8056 191043 239832 197328
4303 197328 -19418 -88126 22482 -119436 -122365 55526 146580 167862 115647 101282 88364
4292 88364 112595 -56071 -110467 -61278 -150492 -111264 -161774 -247831 -97825 -4204 43875
4281 43875 -157981 -165512 61791 -66597 -208618 -148266 -244221 -341816 -123857 102396 97101
4270 97101 72839 -9832 -108442 -161320 -303624 -179568 -35286 -78865 -183521 -308282 -265133
4259 -265133 -177635 -176997 -257451 -230129 -37648 -94700 -10639 184210 213620 159784 -18063
4248 -18063 -104286 -159696 -73340 -61632 -191623 -49801 11425 -114446 -471 165303 -10967
4237 -10967 29853 90098 25044 -30257 -57247 -118236 -117222 -72715 -165706 -190256 -359203 -314898
4225 -314898 -246473 -27682 266618 308939 93415 41961 115030 226872 368964 547807
4215 547807 316725 116191 -126965 -93711 -44084 -94574 189733 421071 334520 52249
4205 52249 -113740 -32547 22142 -57506 -269559 -234541 -90269 -177063 -3350 129015 95424
4194 95424 206950 15127 -20759 -72779 -33425 29947 -89630 107631 405192 452275 160395
4183 160395 204229 266098 109169 -15340 -28441 167466 328032 116402 72324 -55661
4173 -55661 -92379 -90535 -127740 -276669 -180827 -37542 -170325 -290771 -155865 14340 -47337
4162 -47337 -64287 -114037 252186 281632 127492 184600 181525 258687 380236 158001 -37366
4151 -37366 20956 11536 -82213 -110612 13215 -46819 -10487 -124309 -273567 -326909 -373892
4140 -373892 -274726 -263498 -446028 -555232 -351807 568 50132 15793 -28410 -97032 -83398
4129 -83398 58284 393135 446578 248694 -79168 -78348 -39423 -214441 -175394 43468 10950
4118 10950 -83970 148239 361612 283403 82726 -11584 -208242 -103465 156619 140796 -39322
4107 -39322 -41830 -9711 11921 -135511 -178823 50691 10012 164581 261481 178114 228224
4096 228224 137517 210312 279474 164455 45557 104734 162032 180560 3977 54945 245745
4085 245745 65913 -25338 14681 -117356 -156860 -140026 -122042 -66924 -8210 -7663 825 190986
4073 190986 161151 142128 257559 353686 254579 275999 307222 164488 272909 250289 186066
4062 186066 238898 317595 171454 -64194 -140656 -131659 -13802 138947 131875 66070 -186242
4051 -186242 -240028 -111809 -183358 -144416 11932 -41321 -58408 -460667 -672905 -575202 -348450
4040 -348450 -295652 -213869 -101033 -221935 -292838 -227548 -190496 -135096 44969 73251 -101186
4029 -101186 -254666 -337473 -213639 -136827 -50706 -149680 -340700 -355989 -526750 -567014 -354575
4018 -354575 -32378 19018 -130570 -192974 -150982 -110284 10477 -4649 122602 83574 -186947
4007 -186947 -64074 47100 110835 -78365 -155015 -219534 -279895 -242598 -239122 -123486 -115230
3996 -115230 -132363 -180181 -150392 -98784 -265880 -188574 -146699 -172001 -110862 -97190 -93271 80414
3984 80414 -87764 -149584 -64759 86844 121364 -21681 -28805 -69583 7059 -76686 -89186
3973 -89186 -18775 60608 283383 230752 -38273 -206455 -87956 -180434 -334691 -52569 162130
3962 162130 208132 55686 -67268 -150393 -63077 80385 45948 -159545 -280045 -40019
3952 -40019 200895 223170 173673 208187 211238 268626 111640 -106347 -207108 -180515 -161253
3941 -161253 -322904 -512307 -199652 -59340 -76402 -295527 -297864 -26759 144503 21716
3931 21716 69468 315929 259548 80527 138413 108911 153124 97373 -13787 177134 250394
3920 250394 195952 104301 123462 -95862 -153218 47854 129243 180021 263960 63419 25103
3909 25103 95480 -30673 -1288 -24097 64162 53914 -155137 -268746 -332815 -212991 -102033
3898 -102033 -129724 -106025 -168223 85026 -188884 -338159 -151440 -108864 -331930 -465223
3888 -465223 -201890 -11999 -146300 -16111 239734 321170 324443 190853 129883 -105478
3878 -105478 -363417 -255660 -302543 -145877 -87855 -70281 23278 16344 -195046 -107665 48342
3867 48342 106230 68199 259234 153892 179680 -85831 -223298 -60588 -252844 -149964
3857 -149964 -256596 -294942 -170520 -153824 -206550 -224403 -301023 -302008 -200233 9255 -70987
3846 -70987 -276821 -345458 -415308 -184071 48586 143625 224704 93802 -89086 -218849 -125357
3835 -125357 9652 137975 137361 -69744 -276667 -469682 -499089 -450637 -272107 -198669 11369
3824 11369 9978 -69596 21787 -39727 -197556 -36033 91805 11848 3325 -34377 99406
3813 99406 315366 480305 511137 213254 103612 49172 65890 146393 184300 156360 151368
3802 151368 328868 332361 303151 320372 251106 192217 248628 209028 249169 339228 381057 191959
3790 191959 60623 -183366 -230782 -267624 -415523 -310065 28326 82514 72520 38918 101891
3779 101891 -121301 -363661 -326839 -205806 -306880 -411011 -248054 -6413 14510 61399
3769 61399 188223 229081 99996 -68999 -261614 -42464 -2322 -136032 -118470 -73526 142268
3758 142268 64909 -87978 -243023 -327334 -161262 -338065 -236091 -154727 -243837 -294810 -98144
3747 -98144 45743 97469 77752 -193466 -162200 -111081 -57849 -7769 -188011 -124371 80638
3736 80638 232202 364316 288712 284504 257907 164370 -90381 -28219 95693 114437 116509
3725 116509 46346 -61809 131795 204858 -60899 -293649 -348719 -79013 114788 277292
3715 277292 297994 326053 380934 198990 99266 -24640 -273548 -345029 -77505 48482 -79941
3704 -79941 -202420 -89679 177362 54135 -10340 -11105 -4663 -83373 118765 125119 48357 -47492
3692 -47492 26330 72853 -61135 184793 217873 234289 102823 -3135 -44668 -22461 129783
3681 129783 95603 -92216 -183392 -66603 181927 94101 -70561 -107002 -47674 186634 76962
3670 76962 -191685 -393070 -211196 -208676 -187764 -241849 -268560 -148842 -110921 -319249 -207926
3659 -207926 24922 76413 126643 187019 68223 -74308 -223771 -172845 -47059 200684
3649 200684 125017 111978 -37345 93820 203020 113129 -67089 5309 103581 170207 333514
3638 333514 449160 399115 321468 269809 157963 73559 26821 77072 1906 -17430 -81140
3627 -81140 -158071 -46661 33563 101264 25796 -67585 -168693 23977 38847 -25038 -39042
3616 -39042 -28773 28974 -127875 -184506 16927 103379 36069 -268828 -186388 27304 -47029
3605 -47029 -102494 49983 44915 42566 14055 -37786 79577 121159 243194 215387 171666 16708
3593 16708 34723 185039 315139 380310 381170 277877 103355 -122311 -116881 -191015 -68671
$$ [...]
##END NTUPLES=NMR SPECTRUM
##END=
