##TITLE=Analysis number 323315
Compound Code cc 36509
Book Reference 468/179
Project Code adrs
Chemist Name colinb
##JCAMPDX= 6.0         $$ Bruker NMR JCAMP-DX V2.0
##DATA TYPE= NMR SPECTRUM
##DATA CLASS= NTUPLES
##ORIGIN= Bruker BioSpin GmbH
##OWNER= nmr
$$ XWIN-NMR		Version 3.5
$$ Mon Oct 23 12:23:38 2006 GMT Daylight Time (UT+1h)  MAYBRIDGE\nmr@NMR_250MHZ
##.OBSERVE FREQUENCY= 250.131544655141
##.OBSERVE NUCLEUS= ^1H
##.ACQUISITION MODE= SIMULTANEOUS (DQD)
##.ACQUISITION SCHEME= undefined
##.AVERAGES= 16
##.DIGITISER RES= 18
##SPECTROMETER/DATA SYSTEM= dpx250
##.PULSE SEQUENCE= zg30
##.SOLVENT NAME= CDCl3
##.SHIFT REFERENCE= (INTERNAL, CDCl3, 0, 16.522)
##AUDIT TRAIL= $$ (NUMBER, WHEN, WHO, WHERE, WHAT)
$$ ##TITLE= Audit trail, XWIN-NMR		Version 3.5
$$ ##JCAMPDX= 5.01
$$ ##ORIGIN= Bruker BioSpin GmbH
$$ ##OWNER= nmr
$$ C:\u/data/dgb/nmr/ADRS/1090/pdata/1/auditp.txt
$$ ##AUDIT TRAIL=  $$ (NUMBER, WHEN, WHO, WHERE, WHAT)
(   1,<2006-10-23 12:23:17.54 +100>,<MAYBRIDGE\nmr>,<NMR_250MHZ>,
      <created by zg, POWCHK disabled, PULCHK disabled
       configuration hash MD5:
       49 4B E0 1D 92 C2 6B 37 9F E6 65 BC 52 41 86 1D
       data hash MD5: 64K
       5D 1E 80 DF 4F A2 FA 6F C6 94 6E FB 28 B3 99 91>)
(   2,<2006-10-23 12:23:30.56 +100>,<MAYBRIDGE\nmr>,<NMR_250MHZ>,
      <Start of raw data processing
       ef LB = 0.3 FT_mod = 6 PKNL = 1 SI = 32K 
       data hash MD5: 32K
       D6 68 06 37 BD 66 AC 8B 92 CF 98 D9 E6 18 41 13>)
(   3,<2006-10-23 12:23:32.23 +100>,<MAYBRIDGE\nmr>,<NMR_250MHZ>,
      <apk 
       data hash MD5: 32K
       FB 66 4C 3F 4E 32 AE 4A BB E3 E2 01 8A 50 9A A4>)
(   4,<2006-10-23 12:23:33.01 +100>,<MAYBRIDGE\nmr>,<NMR_250MHZ>,
      <abs ABSG = 5 
       data hash MD5: 32K
       3A 35 EB 2A 24 12 8D 28 A7 7D F6 99 BA 39 9F 4A>)
$$ ##END=
$$ 
$$ hash MD5
$$ DD F7 9B 74 0C E1 1A 6C E9 33 16 D0 E5 C1 46 3E
##$RELAX= 
##$RELAX= 
##$RELAX= 
##$RELAX= 
##$RELAX= 
##$RELAX= 
##$RELAX= 
$$ Bruker specific parameters
$$ --------------------------
##$DU= <C:\u>
##$EXPNO= 1090
##$NAME= <ADRS>
##$PROCNO= 1
##$TYPE= <nmr>
##$USER= <dgb>
##$AMP= (0..31)
100 100 100 100 100 100 100 100 100 100 100 100 100 100 100 100 100 100 
100 100 100 100 100 100 100 100 100 100 100 100 100 100 
##$AQSEQ= 0
##$AQ_mod= 3
##$AUNM= <au_zg>
##$AUTOPOS= <34 >
##$BF1= 250.13
##$BF2= 250.13
##$BF3= 250.13
##$BF4= 250.13
##$BF5= 500.13
##$BF6= 500.13
##$BF7= 500.13
##$BF8= 500.13
##$BYTORDA= 1
##$CFDGTYP= 0
##$CFRGTYP= 5
##$CHEMSTR= <none>
##$CNST= (0..31)
1 1 145 1 1 1 1 1 1 1 1 1 1 1 1 1 1 1 1 1 1 1 1 1 1 1 1 1 1 1 1 1 
##$CPDPRG= <>
##$CPDPRG1= <>
##$CPDPRG2= <>
##$CPDPRG3= <>
##$CPDPRG4= <mlev>
##$CPDPRG5= <mlev>
##$CPDPRG6= <mlev>
##$CPDPRG7= <mlev>
##$CPDPRG8= <mlev>
##$CPDPRGB= <>
##$CPDPRGT= <>
##$D= (0..31)
0 1 0 0 0 0 0 0 0 0.06 0 0 0 0 0 0 0.0002 0 0 0 0 0 0 0 0 0 0 0 0 0 0 
0 
##$DATE= 1161602596
##$DBL= (0..7)
120 120 120 120 120 120 120 120 
##$DBP= (0..7)
150 150 150 150 150 150 150 150 
##$DBP07= 0
##$DBPNAM0= <>
##$DBPNAM1= <>
$$ [...]
##$SUBNAM7= <"">
##$SUBNAM8= <"">
##$SUBNAM9= <"">
##$SW= 20.6930455092707
##$SWIBOX= (0..15)
0 0 3 0 0 0 0 0 0 0 0 0 0 0 0 0 
##$SW_h= 5175.983436853
##$TD= 65536
##$TD0= 1
##$TE= 683.16
##$TE2= 300
##$TE3= 300
##$TEG= 300
##$TL= (0..7)
0 120 120 120 120 120 120 120 
##$TP= (0..7)
150 150 150 150 150 150 150 150 
##$TP07= 0
##$TPNAME0= <>
##$TPNAME1= <>
##$TPNAME2= <>
##$TPNAME3= <>
##$TPNAME4= <>
##$TPNAME5= <>
##$TPNAME6= <>
##$TPNAME7= <>
##$TPOAL= (0..7)
0.5 0.5 0.5 0.5 0.5 0.5 0.5 0.5 
##$TPOFFS= (0..7)
0 0 0 0 0 0 0 0 
##$TUNHIN= 0
##$TUNHOUT= 0
##$TUNXOUT= 0
##$USERA1= <user>
##$USERA2= <user>
##$USERA3= <user>
##$USERA4= <user>
##$USERA5= <user>
##$V9= 5
##$VALIST= <valist>
##$VCLIST= <CCCCCCCCCCCCCCC>
##$VD= 0
##$VDLIST= <DDDDDDDDDDDDDDD>
##$VPLIST= <PPPPPPPPPPPPPPP>
##$VTLIST= <TTTTTTTTTTTTTTT>
##$WBST= 1024
##$WBSW= 4
##$XGAIN= (0..3)
0 0 0 0 
##$XL= 0
##$YL= 0
##$YMAX_a= 556615
##$YMIN_a= -487892
##$ZGOPTNS= <>
##$ZL1= 120
##$ZL2= 120
##$ZL3= 120
##$ZL4= 120
##$ABSF1= 16.522
##$ABSF2= -4.171173
##$ABSG= 5
##$ABSL= 3
##$ALPHA= 0
##$AQORDER= 0
##$ASSFAC= 0
##$ASSFACI= 0
##$ASSFACX= 0
##$ASSWID= 0
##$AUNMP= <proc_1d>
##$AZFE= 0.1
##$AZFW= 0.1
##$BCFW= 0
##$BC_mod= 0
##$BYTORDP= 0
##$COROFFS= 0
##$CY= 12.5
##$DATMOD= 1
##$DC= 0
##$DFILT= <>
##$DTYPP= 0
##$F1P= 14.0000005364418
##$F2P= -0.99999901652339
##$FCOR= 0.5
##$FTSIZE= 32768
##$FT_mod= 6
##$GAMMA= 0
##$GB= 0
##$INTBC= 1
##$INTSCL= 1
##$ISEN= 128
##$LB= 0.3
##$LEV0= 0
##$LPBIN= 0
##$MAXI= 10000
##$MC2= 0
##$MEAN= 0
##$ME_mod= 0
##$MI= 0
##$NCOEF= 0
##$NC_proc= -5
##$NLEV= 6
##$NOISF1= 0
##$NOISF2= 0
##$NSP= 0
##$NTH_PI= 0
##$NZP= 0
##$OFFSET= 16.522
##$PC= 1
##$PHC0= -49.40341
##$PHC1= 6.635867
##$PH_mod= 1
##$PKNL= yes
##$PPARMOD= 0
##$PSCAL= 4
##$PSIGN= 0
##$REVERSE= no
##$SF= 250.13
##$SI= 32768
##$SIGF1= 0
##$SIGF2= 0
##$SINO= 400
##$SIOLD= 32768
##$SREGLST= <1H.CDCl3>
##$SSB= 0
##$STSI= 32768
##$STSR= 0
##$SW_p= 5175.98343685301
##$SYMM= 0
##$S_DEV= 0
##$TDeff= 65536
##$TDoff= 0
##$TI= <Analysis number 999999
Compound Code 99
Book Reference 9
Project Code 9>
##$TILT= no
##$TM1= 0
##$TM2= 0
##$TOPLEV= 0
##$USERP1= <user>
##$USERP2= <user>
##$USERP3= <user>
##$USERP4= <user>
##$USERP5= <user>
##$WDW= 1
##$XDIM= 32768
##$YMAX_p= 445353610
##$YMIN_p= -423236
$$ End of Bruker specific parameters
$$ ---------------------------------
##NTUPLES= NMR SPECTRUM
##VAR_NAME=  FREQUENCY,     SPECTRUM/REAL,   SPECTRUM/IMAG
##SYMBOL=    X,             R,               I
##VAR_TYPE=  INDEPENDENT,   DEPENDENT,       DEPENDENT
##VAR_FORM=  AFFN,          ASDF,            ASDF
##VAR_DIM=   32768,         32768,           32768
##UNITS=     HZ,            ARBITRARY UNITS, ARBITRARY UNITS
##FACTOR=    0.157963299565203, 1,           1
##FIRST=     4132.6476996994, 0,             0
##LAST=      -1043.33573715361, 0,           0
##MIN=       -1043.33573715361, -423236,     0
##MAX=       4132.6476996994, 445353610,     0
$$ Real data points
##PAGE= N=1
##DATA TABLE= (X++(R..R)), XYDATA
$$ [...]
23603a23446J79178p5139N3964K5207j21617L6571J28261Q3157l8999m2279j18712
23592a3854j785m20l8265n9020k0626M7889j3008n270R4827p9800r0692j01081
23580b81105k6655O1396J74081M0810O4642L9434n4390j06523j9712P4887q9332
23569a22467p6791M9676K410p1794J25357J23633j7469l7984M9616R4684n2525
23558F6346n8035l7956Q8383k0034r3036M509K3739N7463k3805M850J0680R106
23546C2210L978K920K3205j35462j16954K4267L5390J28541n7687r1804m318Q5502
23534g0212N933j0128J56962J28417N4845j24444j59772j7639o2353j46R3458
23523e079J87471L7022j05445p2605q0372q4041L3756n7577l9279J11423N7171
$$ y = [-123446, 55732, -19407, 34557, 59764, -61853, -25282, 102979, 186136, 147137, 104858, -13854, -15639, -16059, -54324, -113344, -133970, -86081, -99089, -104359, -9532, -89332, -180024, -281105, -307760, -246364, -72283, -31473, 33169, 72603, 18213, -88310, -108022, -33135, -122467, -199258, -149582, -147172, -218966, -93609, 30024, 12555, -25429, 24187, 118871, 66346, 8311, -29645, 58738, 38704, -54332, -49823, -26084, 31379, 7574, 12424, 23104, 32210, 36188, 39108, 62313, -73149, -190103, -165836, -130446, -1905, -59592, -151396, -155714, -70212, -64279, -74407, 82555, 210972, 265817, 141373, -18399, -36038, -98391, -98537, -5079, 182392, 219414, 113969, 41364, -39008, -123049, -89293, -146870, -186149, -74726, -17555]
23512a7555k272J9268M6145P1563k10j750j21507l2802P3884j09741J4578K9655
23500c0744q3603R303J67085P6634l4563j1404R6539L8268n9633r1077j44708
23489f7903p3983M2020o3898M0163J64660p0397l4293L1763J5333M1930n8032
23478c2637n8856P7264M1212j15037m1269Q40l9231P2065O8370K5120q4967R656
23466g7470O6986m502Q6280k2175r3395J5851O6206o993k7639Q5371J19187q0699
23454A27008K0618o5496n4706K8376L2817K3469k1450O1957m4914j59631j9690
23443g1642Q0443O634q6358o2740o4636J0348J80476J11394n5037k06064o6379
23432b23561n0780J62308l20L7292N1625J12427P3498j02835o5143J30978j02324
$$ y = [-17555, -19827, -559, 45586, 117149, 116939, 115189, -6318, -39120, 34764, -74977, -60399, -30744, -114347, -105044, 62041, 138675, 104112, 92708, 189247, 227515, 167882, 76805, -67903, -141886, -99866, -163764, -123601, 41059, -29338, -63631, -31868, -16535, 25395, -32637, -91493, -14229, 26983, -88054, -129323, -128483, -167714, -95649, -27279, -2159, -87126, -77470, -10484, -14986, 71294, 49119, -44276, -28425, 37781, 30788, 3149, 88520, 207707, 127008, 147626, 82130, 27424, 55800, 88617, 112086, 90636, 152593, 107679, -51952, -71642, 8801, 15435, -70923, -133663, -198299, -187951, -7475, 103919, 48882, -157182, -223561, -274341, -112033, -112353, -75061, -23436, 88991, 162489, 59654, -5489, 125489, 23165]
23421B3165l4647O1636J62381p3211q1718l2507O2126J33059N9280K3081M77j37452
23409A65670p2502j33031j56578l0834M9795J60192R0473k3672j6312R906l8224
23398D883p487O3130L3204j07179j71434j32459N6854J51652L7853K8734L377
23387c8872r4806o4043n1855p864P1040R6198J93003P3858j58504r1808k0518
23376i4171K9914N5769j886o8369K4205j4530k4544J6918n2508K1320L3657J03694
23364B9469m2915m8613K0268j1620o046P4192l8630o8485j1799M1725J0515K936
23352d9003r0563J34870J62152L424j74567j31974o8208j3091K0555O7952J7854
23341a20599R6206J07990L5531o8710o9809N003l9286Q8574n0645M3236J47870
$$ y = [23165, -11482, 50154, 212535, 139324, 57606, 25099, 87225, 220284, 279564, 302645, 303122, 165670, 93168, -39863, -196441, -227275, -177480, -17288, 73185, 49513, 33201, 43107, 4883, -2604, 60526, 93730, -13449, -184883, -317342, -260488, -108836, -70983, -42249, -38872, -133678, -197721, -249576, -257440, -186400, -90202, 102801, 176659, 18155, -73653, -94171, -64257, -8488, -10374, -78743, -54538, -69068, -93612, -76694, -129202, -107882, -74225, 29469, -13446, -62059, -41791, -53411, -59457, 14735, -23895, -92380, -104179, -62454, -51939, -49003, -139566, -4696, 157456, 160880, -13687, -145661, -213869, -226960, -206405, -138453, -120599, -24393, 83597, 119128, 50418, -19391, -14388, -53674, 34900, -15745, 27491, 175361]
23330A75361j8531n2100L5062Q6621O7289j01216J9953N828k6252m5768r6627
23319D9620j65J2164l8497q4458K9357n9940o0029M1985L7474Q2435o1895o2851
23307a14800J22789J34707m9326n9446r9609R026p692O4971q0420P4196J6792
23296A1188j25855M241J02982m8357o9092n7051O8635J04502Q8441Q5641M9044
23285B14319O9945m0968p4434j04015j7230L4276o9749K6879L5357k5869O7331
23274A15842m7937J0583O8132j7413j04404J2799o3593p7679J05350K02865k4192
23263A80353j06321q6727j5517m4625O206K6072j8217m8464j0096k7165k5711
23252a70212J56170Q5127L3384q5631m2297M785j4595l073K9956o275m2792J10164
$$ y = [175361, 156830, 104730, 139792, 226413, 293702, 192486, 212439, 218267, 192015, 146247, 49620, 49455, 61619, 23122, -61336, -31979, -91919, -151948, -109963, -72489, 9946, -51949, -114800, 7989, 142696, 93370, 33924, -65685, -56659, -64351, 620, -79800, -5604, 11188, -114667, -110426, -7444, -55801, -124893, -181944, -113309, -8807, 79634, 165275, 214319, 284264, 243296, 168862, 64847, 47617, 81893, 12144, 39023, 74380, 48511, 115842, 67905, 78488, 146620, 129207, 24803, 37602, -25991, -103670, 1680, 204545, 180353, 74032, -12695, -28212, -72837, -66631, -40559, -58776, -107240, -117336, -144501, -170212, -14042, 71085, 104469, 18838, -23459, -18674, -33269, -36342, -6386, -12661, -55453, 54711]
23240E4711J4350n9592p2878J33199N2383p848r6459o3578l0823N1054m7034n6731
23228a29246q120J33459L7817M452J5739J643Q1861k5969j34788j3502n4079L5071
23216e5662p234m3723o131M6015o9346l6998m2716R519J29409P8263m8067r8468
23204a45139k0631l665J34210N2883K6157Q4054n696M0957R3134m2977r2474j11224
23192I589j45525K8704J12751r30K6171l5268k3047L6355M8263J08131N7096q7079
23180A35211q8853q2972k7945q4160p7208J2180L474r717N4120N1971O5082J56547
23168A07730j4490q1272M0606k0245O8556p6446N239l2844n2522R0750j7455K1310
23156C8917m8426m3275M2124N8130p719l8331j42518j363J03809J01762p606P1751
$$ y = [54711, 69061, 9469, -63409, 69790, 122173, 114325, 17866, -45712, -76535, -25481, -72515, -129246, -137366, -3907, 33910, 38362, 54101, 55744, 137605, 111636, -23152, -36654, -90733, -55662, -62896, -106619, -112750, -66735, -136081, -173079, -215795, -206276, -76867, 1396, -46671, -145139, -165770, -169435, -35225, 17658, 43815, 127869, 122173, 163130, 256264, 213287, 120813, 9589, -135936, -107232, 5519, 4589, 30760, -4508, -27555, 8800, 57063, 165194, 222290, 135211, 46358, -36614, -64559, -148719, -225927, -213747, -210273, -219990, -165870, -113899, -48817, 107730, 93240, 11968, 52574, 32329, 100885, 24439, 29678, -3166, -55688, 35062, 17607, 38917, -9509, -52784, -10660, 47470, 39751, 1420, -141098, -142461, -38652, 63110, 55504, 127255]
23144A27255J5543n1548p6453m4422M6525J51027N83J2018j6979k6437j9679o5695
23132E1738j8512J19243o1462q5726N0516o3650j05418J1154N2814L1926R1092
23121G3715R4454K3150j4669o5520q1341j6081m8181m1310Q9146K756l780n3680
23109d1341j01283j16999O4853P6815P9540O8597p9417o9047l4609Q56P2853R363
23097f9819N1832P9890O5739p3023l8738Q4728j1429j07284m9185J6882J08478
23086E8071n016p9903n2163J27103K1827p2097k2091n5727j9742M8499K5697L2976
23074G434l3634M1015j36511n7484L0952K3473N2394N2989J07124O3632o1525
23063H9859j26839K7658J3904k1043m948K0743L0001m140l921N4684Q4370k0304
$$ y = [127255, 142798, 91250, 14797, -29625, 16900, 167927, 168510, 180528, 163549, 137112, 117433, 51738, 33226, 152469, 91007, 5281, 55797, -7853, -113271, -102117, -49303, -17377, 73715, 168169, 191319, 176650, 111130, 29789, 13708, -34473, -75783, 13363, 16119, 12339, -41341, -142624, -259623, -194770, -117955, -38415, 30182, -49235, -118282, -152891, -152035, -79182, -69819, -17987, 61903, 127642, 54619, 15881, 100609, 89180, -18104, -67289, -50407, 58071, 53055, -26848, -79011, 48092, 69919, -2178, -24269, -79996, -99738, -51239, -25542, 7434, -26200, 14815, -121696, -179180, -148228, -124755, -72361, -19372, 87752, 151384, 89859, -36980, -9322, 4582, -16461, -21409, -666, 29335, 25195, 21274, 75958, 160328, 140024]
23051A40024o8565j57082l8117Q9343L1126M4290R4598M0059k1922j64807l6370
23040d7423R9044l0179Q390N2085P0614K240m9053q3339J03481j9667R2185l2139
23028A66239j14167j18616J4036R2084L0754M4291P8550p3193Q7479j3128k6152
23017A68177m9298q6933K125m2896O5544O3656j07257Q1416L5699p3253o7570
23006a0590l0730O3268J28177O4677j51981n7500r933l6822k0964p500R0268m6257
22994b5887n3967r9044m075o8904k263Q7097J04779R938N1599o1629M1736O4555
22982D3935j02887k0724j9276J00226M0292M2571O5478M542n9557m7837P730N8662
22970A13155Q2058j09032n838M4644r6291n5409k6245k9596o6310j7133M3551
$$ y = [140024, 71459, -85623, -123740, -34397, -3271, 41019, 135617, 175676, 153754, -11053, -47423, 51621, 21442, 29832, 81917, 152531, 154771, 105718, 22379, 125860, 106193, 198378, 166239, 52072, -66544, -52508, 39576, 70330, 114621, 193171, 119978, 207457, 194329, 168177, 118879, 31946, 34071, -8825, 56719, 120375, 13118, 94534, 130233, 56980, -10590, -41320, 21948, 150125, 214802, 62821, 5321, -4612, -41434, -62398, -69898, 20370, -25887, -79854, -178898, -182973, -251877, -254140, -167043, -62264, -52326, -727, -62356, -20620, 43935, -58952, -79676, -98952, 1274, 41566, 84137, 149615, 154157, 94600, 46763, 54493, 113155, 195213, 86181, 80343, 124987, 28696, -26713, -52958, -82554, -148864, -165997, -122446]
22959a22446k2136M0173P5990n535M368k5731K2776k7480M2531l7407o4656l5597
22947a55150L3263p728j8128K9035N0350l377K0680n4284q1786n6236N0901J5270
22935a77190M7158N9127J1744j02962m3328R46J12779O3691M8730j57352j57932
22924b94589J76447J37503J03396j7126J8430K3089O7815J2743n0854j53114p4157
22913e0417l3627K5664M7418q7546j05285n7080P775J91851L6846O058n6012q1552
22901a55907J87758N5474l3612R8256m4619J0803M4873m2876m6522O3798j20476
22890A6950q2568k6782J56L715Q6770M7972m0189j2595P5573J00271j21064j81683
22878a33474K4062O4206J46249l2635m7248q7285j719L0311k2611j4927k8297
$$ y = [-122446, -144582, -104409, -28419, -33954, -29586, -55317, -32541, -60021, -17490, -54897, -119553, -155150, -121887, -129615, -147743, -118708, -68358, -71735, -51055, -105339, -187125, -243361, -192460, -177190, -130032, -70905, -59161, -162123, -205451, -204505, -91726, -28035, 20695, -136657, -294589, -118142, 19361, 122757, 105631, 124061, 147150, 214965, 227708, 176854, 23740, -50417, -84044, -58380, -10962, -98508, -203793, -260873, -253098, -61247, -24401, -18343, -74355, -155907, 31851, 87325, 53713, 151969, 107350, 118153, 163026, 120150, 73628, 137426, 16950, -65618, -92400, -92244, -88529, -1759, 46213, 6024, -6571, 69002, 169273, 48209, -133474, -109412, -45206, 101043, 68408, 21160, -66125, -67844, -37533, -60144, -75071, -103368]
22867a03368l5037P1334J61434M4306k3018p9224l3597R148m1854j7204O5524
22856A8444J48917Q3862p1505j22661o525K2609j9276l8496J7710q8697j25142
22845a80760j9965J96945O5240p6756k1664j2451M1888P4884p3275l3316M8689
22834I459P2581L1948Q2119M6350J2300o0016k10113r3298m1258O8923R4931J09961
22822A23887J7371j00034j22563n5506q5713J1926P4242J70636K2755M4605m990
22811I6616J7683M1124j3840r6646j35661L51J24616q2221N6669R2836O0977m1934
22799A20570q7718n7817K860j20361j35067j06607J64277O6550N917J8091j08009
22788b37314p9389P1557P6322J52644l7l549j9935l5127K8401n1570n4224J03654
$$ y = [-103368, -138405, -67071, 94363, 138669, 115651, 36427, 2830, 11978, -29876, -47080, 18444, 167361, 251223, 179718, 57057, 50532, 73141, 53865, 15369, 33079, -55618, -180760, -200725, -3780, 61460, -15296, -36960, -49411, -7523, 67361, -5914, -39230, 9459, 82040, 113988, 196107, 242457, 254757, 194741, -15372, -108670, -149928, -81005, 13926, 123887, 141258, 41224, -81339, -136845, -222558, -210632, -136390, 34246, 57001, 101606, 96616, 114299, 155423, 141583, 44937, -90724, -90373, 34243, -47978, 8691, 101527, 162504, 120570, 32852, -24965, -22105, -142466, -277533, -384140, -219863, -153313, -147396, -129305, -237314, -316703, -245146, -168824, -16180, -16217, -19766, -39701, -74828, -46427, -97997, -152221, -48567]
22776d8567N7452j0585r7797O7903M1294L9233p3690r3371L3871P5703K3528N4635
22764F9609k1644n0891P6916K0321J1043l2341k100j23931m7972j3485p391J17128
22752d738L3933M2131K5391k3594Q541l3441o8961m2117L2210J10207m2259Q1898
22740A19201j14208j38819R8136J25624o8911k9353j6767n7080N0942q122P747
22729c1610o3935L0884m2170j44342n3004K15983J56252l5470k4185P3747J6101
22718I8251j8649j2954l6542m4275R0646Q5135l7940j55402j85673J580J14356
22707a01467l8686l1863P3570L0791K2351O7141j0254k3237N3867q2810j26044
22696a66641P905R0362P2590n7506n0236r159L7312M0979p2891O7488J7838n468
$$ y = [-48567, 8885, -1700, -99497, -31594, 9700, 48933, -24757, -118128, -84257, -8554, 14974, 69609, 47965, -2926, 73990, 94311, 105354, 73013, 70913, -53018, -100990, -114475, -121866, -4738, 29195, 71326, 96717, 73123, 81664, 48223, -20738, -62855, -30645, 79562, 37303, 119201, 4993, -133826, -35690, 89934, 21023, -8330, -25097, -82177, -31235, -39357, -31610, -95545, -64661, -106831, -251173, -304177, -88194, 68058, 32588, 8403, 82150, 98251, 79602, 66648, 30106, -14169, 76477, 161612, 123672, -31730, -217403, -215823, -101467, -140153, -172016, -98446, -67655, -45304, 21837, 11583, -11654, 42213, -40597, -166641, -158736, -68374, 4216, -53290, -103526, -112685, -75373, -34394, -107285, -39797, -21959, -27427]
22684b7427M0478M0041p3664n6949N4402J95161R342o9760j08873J1816R777l7192
22672a2848j1890o7043l1636O5702k952J50711P7738K4145l5281o6983j41107
22661e1444j4918J30085N18j64885q3602L213J9459J89424l96m7965k8844n2407
22649a01762O0979L0229P9353Q480J814M3155n0892m2008p1504j40909K1860M1037
22637a20168K3189L768q1057O6241P5244M91j06426K7552q298N5085K3583n298
22625d6094K0340n8926n2354J21027J77030k506q1067k9525o6461p5756q8224
22614a82516L9082J19491l4398j34830P6135L2279j31562K7223J36299R9544j0847
22603C5900N6161n7399J7729K9163k0722j0327k472r4207L8608n4652l7766q1542
$$ y = [-27427, 13051, 53092, -20572, -77521, -23119, 172042, 181384, 111624, 2751, 14567, 24344, -12848, -24738, -91781, -123417, -57715, -60667, 90044, 167782, 191927, 156646, 89663, -51444, -66362, 63723, 64241, -100644, -184246, -181033, -161574, 27850, 27454, -20511, -49355, -101762, -40783, -10554, 68799, 77279, 79093, 122248, 71356, 29348, -42156, -183065, -161205, -120168, -96979, -93211, -174268, -108027, -32783, -32292, -138718, -111166, -119464, -64379, -40796, -46094, -25754, -84680, -137034, -16007, 161023, 158517, 77450, 47925, -18536, -94292, -182516, -143434, -23943, -58341, -193171, -117036, -84757, -216319, -189096, -52797, 46747, 35900, 92061, 34662, 52391, 81554, 60832, 50505, 48033, -46174, -7566, -62218, -99984, -181526]
22591a81526o9197O4769M3641l1326Q8822J7241M7228k7333j56373j04806k8430
22580c37290P6776O8992Q9567K4760p2733P1478R707l9634o014j02215M5084N7881
22568a13641J00763M1460L1866j08851q9384P5561j9793n6628L3494P5683Q496
22557b0974P389Q8513N3496r0337p6303n8350k2486L9552J22409k5330m9695o1615
22545i3731J46724q823q0735l4618R140J53811J1042o425k3770L121j4740k9415
22533C1581k2690k8339R4933J11231q4731j31747j27579p7629J05304Q3375P5974
22522B9683n3521j1119M0547K4353j56862n4100k257m9931K8506k1108M0370M1822
22510a43617J31355r1573n3232J0479n63j9053m7990Q0814R1688k3524M9587P5040
$$ y = [-181526, -250723, -185954, -142313, -173639, -84817, -67576, -20348, -47681, -204054, -308860, -337290, -260514, -191522, -101955, -77195, -149928, -78450, -68743, -108377, -114391, -216606, -171522, -113641, -12878, 28582, 60448, -48403, -137787, -62226, -82019, -138647, -105153, -29470, -20974, -13585, 74928, 128424, 38087, -38216, -96566, -119052, -79500, 42909, 17579, -32116, -93731, 52993, 44170, -36565, -71183, -62043, 91768, 102810, 96385, 72615, 75736, 60996, 31581, 8891, -19448, 75485, 186716, 101985, -29762, -157341, -234970, -129666, -46291, 29683, -23838, -34957, 5590, 29943, -126919, -181019, -183276, -233207, -204701, -225809, -185439, -143617, -12262, -103835, -157067, -146588, -147151, -166204, -214194, -133380, -41692, -65216, -15629, 59411]
22498E9411P0637p2284j00186j1984n467J6528k2194l0983j1439L2702K4725J12836
22486F2302J9910j3974o6365L7668q461k9673n4798p4781J23163K1912k2328r0734
22474i6159j0896N6488K5772K0263j7866K4809P5038j00718k539K6192o6051l5370
22462a01037R1973P5714r2426n0793j9142o745k3450M7535J25109N9735K9819
22451A36292l7884K6018O0819m1563r9754j5679m4008L2610J39149K287P462j20488
22439D5261M7762o8336K4710l6874q036m9527k1070O4972j4398l2491r2718l3748
22427a74493o3898L5350M2287J18173L3248o2036j20083J7945k7497L3765L6245
22416a30994j4500n386o7360o2676J9984j3687O662L5234R2168K2417o4965n1930
$$ y = [59411, 130048, 57764, -42422, -54406, -59873, -43345, -65539, -96522, -107961, -75259, -50534, 62302, 82212, 68238, 1873, 39541, 31080, 1407, -53391, -128172, -5009, 16903, -5425, -96159, -107055, -50567, -24795, -4532, -22398, 2411, 77449, -23269, -25808, 384, -65667, -101037, -9064, 66650, -25776, -76569, -95711, -102456, -125906, -78371, 46738, 106473, 136292, 98408, 124426, 185245, 143682, 43928, 28249, -15759, 16851, 156000, 158287, 165749, 45261, 93023, 24687, 49397, 12523, 4487, -45040, -66110, -1138, -15536, -48027, -140745, -174493, -238391, -203041, -160754, -42581, -9333, -71369, -191452, -173507, -201004, -167239, -130994, -145494, -150880, -218240, -280916, -260932, -274619, -267957, -232723, -140555, -118138, -183103, -235033]
22404b35033N794J16983O7971q659r8810M1271L3847l968q9355R4448K8624k8611
22392g5498M6251j09279r536K11553J30033l6358j77390r8158M395J29731K4338
22381D0082j20228n969q9632m7381M0956L5053P9187n0842j0709N9122k3518j14035
22369b07914K2716L2765m4593P2445M1293j059N8103L536k4041K8464L749n3711
22357f8247n6129J80604J61109J01918j2515n4898m3793L2074j4751m7619o4907
22346A12846j27792j11023J08829L5743N1335K4811j65278J465K4060R0005J13709
22335A58710o3585j06051j78576k0640L7458L1892L9168P8641L8301r0591j5026
22324i0299K6353K0181O794N5079R1969L1551j23886n0549k4188p0170o9301N2877
$$ y = [-235033, -229239, -112256, -44285, -52944, -151754, -110483, -76636, -80604, -169959, -75511, -46887, -75498, -29247, -138526, -148062, 63491, 193524, 157166, -20224, -118382, -113987, 15744, 40082, -80146, -86115, -175747, -223128, -182172, -147119, -67932, -118774, -129483, -70361, -93879, -207914, -185198, -152433, -197026, -124581, -83288, -84347, -26244, -22708, -46749, -18285, -14536, -68247, -124376, 56228, 217337, 319255, 306740, 251842, 208049, 240123, 225372, 177753, 112846, -14946, -125969, -17140, 18603, 69938, 94749, -70529, -69064, -45004, 45001, 158710, 95125, -10926, -189502, -210142, -172684, -140792, -101624, -22983, 15318, -75273, -90299, -63946, -43765, -36971, 18108, 110077, 141628, 17742, -32807, -56995, -127165, -196466, -143589]
22312a43589j224j11459J5122N8105Q6177Q8946J08820K6800j44554r5389O8767
22301d3478N9734O3057Q0987l6899j7082J2228r9340p0202n1128j6257r260l3428
22289a61068J01772J62073J6320j56653M8429n3788o5973m9948j45771L5415N2404
22278b16788N9752M0917n8073j07907N925J58957L6940k0712N5034Q0242J70280
22267B04567n0100q5841N4585M396j43668O276R61m6018M3318l8853k4638o1349
22255a36364R4783n268j45378j04405J07307P5654j9962K3166O5209J37398P3133
22244A65273k5535o9114m2528m955j1518p9401j0804l1370j8798J05479N671m8078
22232f5678Q7132J5967L4033n6985Q1450r726j01490r7929J27780J41346l9288
$$ y = [-143589, -144813, -256272, -241150, -183045, -96868, -7922, 100898, 127698, -16856, -112245, -43478, 16256, 79313, 160300, 123401, 106319, 118547, 19207, -50995, -102123, -118380, -127640, -161068, -59296, 102777, 119097, -37556, 10873, -42915, -108888, -158836, -304607, -269192, -216788, -157036, -116119, -174192, -282099, -276174, -117217, -80277, -100989, -45955, 34287, 204567, 154467, 68626, 123211, 127607, -16061, -9785, -8824, -54842, -11524, -50377, -75015, -136364, -41581, -46849, -192227, -296632, -189325, -113671, -133633, -110467, -45258, 92140, 165273, 139738, 70624, 28096, 23141, 11623, -67778, -78582, -109952, -128750, -23271, -17600, -65678, 21454, 37421, 71454, 14469, 95919, 86193, -15297, -113226, 14554, 155900, 116612]
22221A16612j04193J4014J8530k4607N159k5826l8689q9644q7292R0309J17133
22210h494P5250R6241r0795j13462J4523j7897j3950R3523p0523p6777N6898k4535
22198g9998n4319J06603M7257j9947p6849k1090Q4970K0176j6594N031r6400J2344
22186h8816k3647P4853l5774j2463P8379L456j09042q5181J13612K5154O1303
22175A834R519q1141O7145P7756K950j05126R7640J53593K1197j33849j06925
22164D593q3616q1598k1862J28585P1048R8663O3126j63651j76722p0013o4800
22153b96247M2460J1479J30493M6372M4058j828r1039P9440o5202q0806K0478
22142a60342j3891J56916K2257O0722M5706j442j30652l6187O5530m1231j26658
$$ y = [116612, 12419, 26433, 44963, 20356, 25515, -311, -39000, -128644, -215936, -125627, -8494, 66756, 162997, 72202, -41260, -26737, -44634, -58584, 34939, -35584, -112361, -55463, -79998, -134317, -27714, 19543, -404, -77253, -98343, -13373, 6803, -9791, -4760, -101160, -88816, -112463, -37610, -73384, -85847, -7468, -4012, -113054, -198235, -84623, -59469, 1834, 11353, -69788, -2643, 75113, 78063, -27063, 70577, 224170, 245367, 111518, 4593, -79023, -160621, -182483, -53898, 17150, 115813, 178939, 15288, -161434, -231447, -296247, -253787, -242308, -111815, -65443, -21385, -23213, -114252, -34812, -100014, -180820, -160342, -174233, -17317, 4940, 65662, 111368, 109926, -20726, -56913, 8617, -32614, -159272]
22131a59272J15829J29137J0882M4632J0318j24654j1940O1592p5504L8075p5909
22120c6814M2150r0011j08874J10392P4618j9538M864p250N6610n201p717J16825
22108A30054n3647k4401l7598j974j0239M0911J1243m961J9139J0760k4930j07044
22096e2687j03126J2480P1452J49017k5276l7844j06906k9904J7156l7214J06257
22085c6595Q7157r4360m2262J73274O0979q8864p2628K7946Q9916K08953K2776
22074C36292k00922k13277L9486P3804j7252P0140N8752M4611m9202o3246k5240
22063E3946n9922o176Q974O5065j9037J1453j19316q2206k1435l6541j1063J57782
22051e8476M6645l133l1794O2345j17652j17970l625P9947O7394J15069J05941
$$ y = [-159272, -43443, 85694, 96576, 141208, 151526, 26872, 14932, 76524, 1020, 39095, -36814, 5336, -84675, -193549, -83157, -8539, -28077, -23213, -30463, 26147, 20946, 13229, 130054, 76407, 52006, 14408, 12434, 2195, 43106, 54349, 49388, 68527, 79287, 54357, -52687, -155813, -143333, -71881, 77136, 51860, 14016, -92890, -122794, -105638, -142852, -36595, 50562, -43798, -86060, 87214, 148193, 59329, -13299, 14647, 104563, 313516, 336292, 135370, -77907, -38421, 35383, 18131, 88271, 147023, 191634, 142432, 79186, 53946, -5976, -12152, -3178, 61887, 42850, 54303, -65013, -147219, -168654, -205195, -216258, -58476, -11831, -14964, -46758, 15587, -102065, -220035, -223660, -143713, -76319, 38750, 144691]
22040A44691l7260n8745J3757j60065p7207K0731k438L8254L9886J4550J00133
22029C6287P7675J1605j04819l7669M6181L9145q7797J26606J06446o6623j03423
22018D3614n7234P5766J1469l1724j09643K9474P4019J65701k6142j60601o8687
22007e3988J1563J8602J22687n968j00720O0043r4470j10878k4936k0220J9053
21996a79232P5360J51603O2805j893j79952J3796J6349M7366N3542j8744J5509
21985E6509M9811j06181K747n4822j26156J3252R3843J02770P8161r9407j46900
21974a36373j571L280n7541L7206L0161M764J7498k5865j8805L4524J35753Q5056
21962A08087m1454n7423K5629k6412j30835l7006M7504Q8500N7798K3719j4669
$$ y = [144691, 107431, 48686, 62443, -97622, -174829, -154098, -156536, -118282, -78396, -63846, 36287, 113962, 125567, 20748, -16921, 29260, 68405, -19392, 107214, 213660, 147037, 43614, -13620, 62146, 73615, 41891, -67752, -38278, 35741, 201442, 175300, 14699, -53988, -42425, -23823, 98864, 92896, -7824, 52219, -42251, -153129, -178065, -198285, -179232, -103872, 47731, 110536, 108643, -71309, -57513, -41164, 6202, 59744, 41000, 56509, 106320, 139, 2886, -51936, -178092, -164840, -70997, 31773, 109934, 10527, -136373, -137944, -134664, -192205, -154999, -124838, -120074, -102576, -128441, -147246, -112722, 23031, 108087, 66633, 9210, 34839, 8427, -122408, -159414, -111910, -23410, 34388, 58107, 43438]
21951D3438N14r0675p1512J1220q4173J28083n809Q1638M7603j4071L1758P857
21939H5871n6209m8899p205p9935m0681o1129O9623M6296R6928Q5206p6697l2813
21927a9644q5146m6051P7404M1097k035l7999l3770j6888o192Q9245K7780p7317
21915h9516N4492L4591m1686M7345j710L8204n2620l8228J01130k2138l1722j0768
21903a2626J07460J35k3079M5286k7530j43796N4984O773K1315r9489k2138p87
21891i3492O8579n5350J4212q9388j17778o821K08050R5307J18966K7147N891
21880A75323n6101j31759j34157j32710J7811J04562j0416k1639M1649J8384j0882
21869a39935j2803M0659n3885n2462M9910M2539P8282j2747J13975P2817L617
$$ y = [43438, 43952, -46723, -118235, -107015, -191188, -63105, -68914, 12724, 60327, 46256, 78014, 85871, 29662, -19237, -26442, -106377, -147058, -208187, -138564, -92268, 4660, 89866, 13169, -19644, -104790, -150841, -73437, -32340, -34375, -72374, -106144, -123032, -129224, -39979, -12199, -89516, -35024, -433, -42119, 5226, 3516, 41720, -10900, -49128, 52002, 29864, -1858, -12626, 94834, 94969, 71890, 117176, 89646, -54150, 834, 7607, 28922, -70567, -92705, -93492, -24913, -80263, -66051, -155439, -273217, -280038, -71988, 23319, 142285, 169432, 175323, 119222, -12537, -146694, -279404, -261593, -157031, -167447, -189086, -147437, -129053, -139935, -152738, -112079, -165964, -218426, -168516, -125977, -47695, -60442, 53533, 126350, 129967]
21858A29967p2300L8796j4344j90861p7388m286J07111J53323P0015L767j50500
21847f700m685N5283q9054L7821m302P8573M1476O7942k6266j46358j7117n9226
21835g2613m9251P7619j9741l812O9014Q8188R073q3550j6423O8278o8866j40590
21823a42674L2665R4534j20584o1422J8645J28782j45590j02986l3904R8750R9963
21812a33821K07051n035j39997N7884R7187J1492L6008j38413n0049Q418m7896
21801i7171M4695M5065J2392J41006l0416m3476J6154j6242n5439q244l6874m2603
21789g1153m4691m5472l7898m545J01811J13211J44299J4141j26658L736m391
21778D2390q424q189L8207n0787M603R7377j40795n5178L720O555j3567N4502
$$ y = [129967, 57667, 96463, 82119, -108742, -186130, -190416, -83305, 70018, 140033, 143800, -6700, -11385, 43898, -45156, -7335, -11637, 66936, 108412, 176354, 150088, 3730, -13387, -72613, -121864, -44245, -63986, -67798, 1216, 89404, 98477, 14927, -1496, 66782, -2084, -142674, -110009, -15475, -136059, -197481, -178836, -50054, -195644, -298630, -332534, -233784, -133821, 73230, 68195, -71802, -13918, 83269, 94761, 130769, -7644, -57693, -49275, -97171, -52476, -7411, 4981, 145987, 115571, 72095, 88249, 72007, 16568, 8324, -28550, -71153, -115844, -161316, -199214, -203759, -101948, 11263, 155562, 169703, 43045, 46781, 42390, 33966, 25777, 63984, 13197, 17800, 115177, -25618, -80796, -77076, -70521, -84088, -29586]
21766b9586M3506L0836J0275K703K6249p8244p0300k2254J534J18406J19513p9222
21754G3416m4182K2203r3074m6841k41q0250m8433J24063k195K4573j5123j41020
21742b27104j29478n5379J93170L16948N3150o2955o9238l0856P8907R6058N4917
21731B18140L1305j07638j48809k0015O6063m9847o9966K5614P6748j8179J9137
21720B2553L0014Q0955K9885k4210m363n6308m3165J0284m8901n2798J0732Q5601
21708D0279n8067l2188K1495p4081j0656P1856O5295L4756R335r5046L0994J31866
21696A35838P3683j05067o5094J44757l2253p4131r9328k8146m0388m0351Q0714
21685d9766K7246M6296j4813m6640j558M6182j3582M9409k5626L21J06444R6229
$$ y = [-29586, 13920, 44756, 55031, 57734, 83983, 5739, -64561, -86815, -85281, 33125, 152638, 73416, 29234, 51437, -41637, -88478, -88719, -168969, -217402, -93339, -95534, -70961, -86084, -227104, -356582, -411961, -218791, 98157, 151307, 88352, 19114, -11742, 67165, 163223, 218140, 249445, 141807, -7002, -27017, 39046, -10801, -80767, -55153, 21595, 3416, 22553, 52567, 133522, 163407, 139197, 134834, 78526, 35361, 45645, -3256, -56054, -45322, 40279, -17788, -49976, -28481, -102562, -113218, -41362, 23933, 58689, 68024, -27022, 3972, 135838, 209521, 104454, 39360, 184117, 151864, 77733, -21595, -49741, -90129, -130480, -49766, -22520, 23776, 8963, -37677, -39235, 6947, -6635, 42774, 17148, 17469, 123913, 220142]
21673B20142n6951j28619L1316m6184r5874P9836K9309R691P4372M6616p8682
21662H4972K1551o1736J1897j46769j60635K0373P6427L5440m1625P7647J25991
21651D3533o070r6003j69984j42254J6035J01879J19416Q9201L855r5374n1344
21640a87110P7789O1029J21744J20899n799q2683j6168L9195r901L5546m9717
21629A04824j15032J7382p0425N2267R0052k9587j94404m2565K8976R1793O9835
21618C116j46931n5257K3388J5288j6056j4853K2601M5921J15290J19141M3167
21607A54815k853K3932p2113j26579O6311P3388l7818l2537N1047j7509K0505
21596A00589p6844j13550P208n7737k1467J21674k6579j29930O514P6971j7422
$$ y = [220142, 163191, 34572, 65888, 19704, -76170, 3666, 32975, 42666, 117038, 163654, 84972, 106523, 44787, 56684, -90085, -250720, -230347, -153920, -118480, -160105, -82458, 43533, 37463, -58540, -228524, -370778, -354743, -252864, -133448, -44247, -40392, -135766, -187110, -109321, -48292, 73452, 194351, 188552, 105869, 89701, 128896, 118995, 154541, 104824, -10208, 7174, -63251, -10984, 79068, 49481, -144923, -187488, -158512, -66719, 3116, -143815, -199072, -175684, -160396, -176452, -191305, -168704, -122783, -7493, 111648, 154815, 151962, 175894, 103781, -22798, 43513, 116901, 79083, 46546, 97593, 80084, 100589, 23745, -89805, -82597, -140334, -161801, -40127, -66706, -196636, -190122, -113151, -130573]
21585a30573J09736J08013n3873Q26Q1313n6532K0458o8367j56025j251O1055
21574h5220j3321n6895P9811J06814L441L8873k9905K385r6046M526L7683O565
21562a289K2573o645n4248k7397q4173L0326J11213l8115Q8798J4965r7460j14141
21550a55593k7403J5279J03959Q4747m208k2717M285M2420N1987L301j39229k473
21538d5645n3621j3994o0777j0443l2413o42k2771J1321J70213O9564K2206J0033
21526D3031r004j65774q2202J47884L4994K6049N4755L6821j36504L3336O3110
21515D6496M4172n9922M728n3097n7640j39393N1215j23021L416P7773n29Q5888
21503a19914m3924L1962N4092J01419M1292R3002l8812o8528J687m6631k1689
$$ y = [-130573, -20837, 87176, 33303, 34129, 115442, 58910, 79368, 11001, -145024, -146275, -85220, -98541, -155436, -75625, 31189, 34630, 73503, 43598, 45983, -50063, -45537, -7854, -1289, 21284, 14639, -39609, -67006, -151179, -120853, -9640, -47755, 41043, 56008, -41452, -155593, -182996, -167717, -63758, 20989, 16781, -5936, -1651, 40769, 92756, 96057, -43172, -45645, -99266, -113260, -174037, -184480, -216893, -217535, -240306, -228985, -58772, 10792, 32998, 43031, 34027, -131747, -213949, -66065, -31071, -5022, 49733, 86554, -49950, -16614, 46496, 90668, 30746, 35474, -17623, -75263, -214656, -163441, -286462, -283046, -205273, -205802, -119914, -163838, -131876, -77784, 23635, 64927, 157929, 119117, 50589, 52276, 5645, -16044]
21492a6044n1328k2273l8408P4444K6658J14367N3343j6283k5713J9930l2051
21481H6642n1803j0696Q6452n0844j37843l6496j7282q3451J26639L2867r3989
21470a49804K6482K6533P372J0580q4129l3443J49241J64859N082p3513r6827
21459d7567j18705l7918J01696N960M545Q0976J63694M810j00200j56048j09170
21448b07927p990J91600R8547o2585J898j3690j12888L3541N5236o866O0841m641
21436B5076j1289n9556j9969l2867m80K9587O4385M3986l7160q5902O935M4286
21424c2968K0005J88568K226q1343K7189Q241Q475L9486j32738k17298q9353L1420
21412b28090m115K7505K1863j7798J12042Q3286k1868j02215l3110O4432J13281
$$ y = [-16044, -67372, -89645, -128053, -53609, -26951, 87416, 140759, 124476, 98763, 118693, 86642, 34839, 24143, 110595, 59751, -78092, -114588, -131870, -215321, -88682, -55815, -149804, -123322, -96789, -89417, -78837, -162966, -196409, -47168, 117691, 122773, 49260, -47567, -166272, -204190, -102494, -96534, -91989, -11013, 152681, 157491, 57291, -98757, -207927, -215917, -24317, 74230, 11645, 13543, -147, -113035, -79494, -24258, -31124, 29717, 25076, 13787, -45769, -65738, -98605, -99085, -69498, -5113, 38873, 1713, -84189, -77254, -32968, -12963, 175605, 177831, 96488, 123677, 131918, 140393, 179879, 47141, -170157, -259510, -228090, -232205, -204700, -182837, -200635, -88593, -5307, -27175, -129390, -162500, -98068, 15213]
21401A5213N3081k5645j67619k5366R6967n359l9451q8000K884M042j9618J12834
21389h6037p2199j58131j3011K6763L8560J14374K5182K4350J34443P3772r2181
21378A5885J6361m6330p2110n9982r5694J5567K02251M5974r0793N225O0915Q2974
21366H0243Q5349n2216l4710P1136R809p9585n1820p3230k0743m5838O053j19511
21354b25063j14679J3449M0699L2511R1728J7312p4625j11805P8547R9085l5894
21343a88735M2772j03517R376P0281J05632p8574m1736N7667O3300L5294j01803
21332a30043o0434P9888P3757M8800l1188n6722J2395j1977p965K31N9256J71108
21320A47106k0552j09963J9430l3365m0397J1847L2378j21497M38R2543J6634
$$ y = [15213, 68294, 42649, -124970, -150336, -53369, -58728, -98179, -186179, -183295, -179253, -198871, -86037, -158236, -316367, -329378, -302615, -264055, -149681, -124499, -100149, 34294, 108066, 15885, 32246, -14084, -86194, -146176, -241870, -226303, -24052, 21922, -68871, -63646, -2731, 80243, 165592, 113376, 78666, 149802, 159611, 80026, 28206, -45024, -65767, -111605, -105552, -225063, -339742, -326293, -285594, -253083, -161355, -144043, -218668, -330473, -251926, -152841, -188735, -145963, -249480, -240104, -169823, -64191, -142765, -184501, -126834, -63534, -28240, -130043, -190477, -110589, -36832, 11968, -19220, -75942, -63547, -75524, -83489, -83258, -24002, 147106, 126554, 16591, 36021, 2656, -37741, -25894, 6484, -115013, -114575, -22032, -5398]
21309e398m216k6509p6036o0772O5873j1073J5769j7132Q8913j2461m0201M2820
21297d0423J2679O1350O3716j02459M1363Q9929p191k32738l1267P639L4527P8462
21285b4413L0702l0532p6624J9900J7237O3604k3601J2132j17275O1651k6271
21274i3490M4002m7496L9761P524K627k4965Q1805Q5233P058q9448k8846q7708
21262a03943K0620J08188Q9979q1818m9802J4896j5193j3094n7823l1449O0625
21251e8814n4927j16007M2810O8412J63337J53603L0550l870o5037j83585N7100
21240C3572M5332n2412J5599P4615l9082L039j52183n3164o9500J78115J37834
21229A21765J0223j05342n7723k4645N7284j1763o9085J7380L0840N8761N774
$$ y = [-5398, -9614, -36123, -112159, -172931, -107058, -118131, -102362, -119494, -30581, -43042, -83243, -40423, -27744, 33606, 97322, -5137, 36226, 126155, 118964, -113774, -145041, -137402, -102875, -24413, 6289, -24243, -100867, -80967, -63730, -126, -23727, -11595, -128870, -67219, -93490, -49488, -96984, -57223, -49699, -47072, -72037, 9768, 95001, 102059, 12611, -16235, -103943, -83323, 24865, 114844, 33026, -16776, -1880, -17073, -30167, -87990, -119439, -58814, -113741, -229748, -186938, -118526, 44811, 198414, 228964, 225094, 160057, -23528, 33572, 78904, 26492, 42091, 116706, 77624, 80663, -71520, -124684, -194184, -16069, 121765, 131988, 26646, -31077, -55722, 1562, -10201, -79286, -61906, -31066, 27695, 33469]
21218C3469K3483q4366k1155l1764Q6307j7153p3657L1962J38883Q8773J094q5851
21206I0025p1462J5660l5543q9118j00642O4287P1941P527L8120K7186L7841n0553
21194E269n1866r0894l9613R7328J40733n1436j41574j9372n915J9677J80932
21183D3269k935o8299q753m6810j7822R6713J5740j01765j02017o8438L7349J64990
21171e8778Q6284J0040K517N275P6852o9303m0938J9071R4533N9432m3824j23966
21159A7195J7004O8406L2466L4068N6358j01196o9873j00624r3559J14795L8144
21148A3184m2752o0826n09l4764J41570r8970J4967M8210j12155n9444J42117
21137d9372M1039L5141K178q826L0136O2217N0428j2971O358j0029j71286j04795
$$ y = [33469, 56952, -27414, -48569, -80333, 5974, -11179, -84836, -52874, 86009, 174782, 175876, 90025, 18563, 34223, -1320, -90438, -191080, -126793, -54852, -47325, -9205, 17981, 55822, 5269, -46597, -137491, -177104, -79776, 60957, 9521, -132053, -151425, -157340, -137663, 43269, 40334, -27965, -36718, -83528, -101350, -4637, 11103, -90662, -192679, -261117, -223768, -58778, 27506, 37546, 40063, 45338, 122190, 52887, 11949, 31020, 125553, 184985, 141161, 17195, 34199, 102605, 135071, 169139, 225497, 124301, 54428, -46196, -139755, -24960, 13184, -29568, -90394, -90903, -125667, 15903, -83067, -68100, -19890, -132045, -191489, -49372, -8333, 26808, 28986, 20160, 50296, 112513, 162941, 149970, 156328, 146299, -24987, -129782]
21125a29782J28798P0938M068o2279j29387l7860J79550O8822q2827l8711k4439
21114e3109k2984J39666O1989q0664Q1340P1720j12488j43023l5067R6934p254
21103b940k3918n1338O5039K7562O8502m4130l5275m2923L1878M7740q4907q6720
21091a31430M6838O1874P5322m262q9984l649m6536J8929m6004K1134k8313k127
21079a28208j204J04942L6666L5572j49673n0281N2751J96093n1909p1936k02
21068b7389M9741n3084M888K4674K4939j35853j22321o6540O1966N2424J58863
21057b7692R9368l1640K4721o7175n7932o890M7304p2509J08967K9233p9828k2328
21045e6401P5790N3505p7674j955K8637J9899m0619j14572J29173n6564j5003
$$ y = [-129782, -984, 69954, 74022, 11743, -117644, -155504, 24046, 92868, 10041, -28670, -53109, -76093, 63573, 125562, 44898, 126238, 197958, 85470, -57553, -92620, 4314, -2940, -26858, -78196, -13157, 14405, 82907, 38777, 3502, -39421, -7543, 40197, -44710, -131430, -84592, -22718, 52604, 48342, -41642, -45291, -91827, -72898, -118902, -97768, -126081, -128208, -129412, -24470, 12196, 47768, -101905, -152186, -99435, 96658, 44749, -27187, -27389, 22352, -30732, -25844, -1170, 23769, -112084, -234405, -300945, -238979, -186555, -27692, 71676, 40036, 64757, -2418, -60350, -67240, -19936, -92445, 16522, 45755, -34073, -56401, 19389, 72894, -4780, -6735, 21902, 41801, 1182, -113390, 15783, -40781, -55784]
21034e5784j0198J63945P5710j22739p8837j12689r8780p441N0926O389N7976
21023a31522m2918O5563J24962N6617o1801j15264m9986M0279r286n3344P6734
21012i9966K7041Q0005P594J1228m657j94456P4602N5927K1578O4084K9701j26620
21000e3939q9579N3145k494j8032J2012M883K9215o1287j18807l1622J25139J66416
20988A5050J33962n4636j35763Q034p8337j09745J7251Q0442N9259j5716L2000
20977d8199q154J21994j7992L1955j1152k3646k2100J7737M8129J3759o5114r1439
20965e4222j1647p8157j6104J21114O1054k7679j05107K0150K2086m0423k576
20954a11511K0552L0067L1853K1719r9820J9697R9994P5086P710m434j03327l9172
$$ y = [-55784, -65982, 97963, 173673, 50934, -27903, -140592, -239372, -246813, -195887, -189498, -131522, -174440, -108877, 16085, 72702, 10901, -104363, -154349, -114070, -123356, -176700, -99966, -72925, 7080, 14674, 25902, 21245, -173211, -98609, -42682, -21104, 42980, 72681, -53939, -143518, -90373, -92867, -110899, -98887, -94004, -64789, -126076, -244883, -276505, -151366, 15050, 149012, 94376, -41387, -33353, -111690, -221435, -204184, -123742, -64483, -80199, -48199, -56353, 65641, 47649, 79604, 68452, 44806, 22706, 40443, 88572, 102331, 37217, -54222, -65869, -144026, -160130, -39016, 22038, -5641, -110748, -90598, -68512, -108935, -111511, -90959, -60892, -29039, -7320, -107140, -87443, 12551, 87637, 95347, 90913, -12414, -51586]
20942e1586N6114J15522R4404J19848m2592l6986L1655o4378m6011o9193j30106
20931b3309n1172M9009Q6379P0423O043Q4446M5931L5549n6868j59766L5378N3292
20919A75335j08526l3498K5872K5554Q862o6395q0551r308k1133K3464M320l8795
20907i4799p7633k1506J81705J35608J992n5005o8817J13399j1455n5327l2670
20896A5492n0379k931P869o7111M7431J4261q5744k0238O8229k5497p9688K3652
20884a54654K559J681O5418L0599N4090j01486l4243Q2448L2343l1722k4137k6465
20872a03569Q9214K6668J29158O0043p9073N693N7687L3701N3514j11481q8903
20861G2652L0089m9513q8322k1901n296j6616Q0793Q5352q0329K1912O952m2125
$$ y = [-51586, 4528, 120050, 214454, 334302, 291710, 254724, 286379, 222001, 175990, 106797, -23309, -74481, -25472, 60907, 131330, 137373, 221819, 267750, 303299, 246431, 86665, 122043, 175335, 66809, 33311, 59183, 84737, 93599, 27204, -53347, -62655, -83788, -60324, -56004, -94799, -172432, -193938, -12233, 123375, 125367, 70362, 1545, 114944, 103489, 48162, 15492, -34887, -37818, -29949, -97060, -49629, -35368, -121112, -141350, -73121, -98618, -178306, -154654, -152095, -150414, -84996, -54397, -307, -101793, -136036, -53588, -21245, -52967, -77104, -103569, -14355, 12313, 141471, 201514, 122441, 128134, 185821, 219522, 273036, 161555, 72652, 102741, 53228, -35094, -56995, -62291, -78907, 1886, 87238, 6909, 28821, 35773, -6352]
20849f352j22692m0055K620J7948M2235J9057l8366k7313L6458N7299j09554K6822
20837a41893j4613j2790N1435O8090N4535l7027K6711L3505l2742k3363J08323
20826H0171Q121j09970k5276M0133J5906J40729P2422j02036o2652j39067o096
20815h7615l5150O3649J5844k4771l8290J39767P6713N7167l6114j52554q9933
20804a11287j0460p2660K3042J10306K4283k8109m3331m8881n9589K9070N9909
20793a27707J2927j1709N4730j14680j46978J90740J68651J1128l5265L22N0301
20782E2460L5708q0897p3697p8378N0668N6288L0085J7313K847O8719P0938Q3770
20770B35824q9436l6999l288q4703n2867m3003J57446m4640p5158J9157J1936
$$ y = [-6352, -129044, -169099, -166479, -148531, -106296, -87239, -125605, -152918, -116460, -59161, -168715, -141893, -156506, -169296, -117861, -49771, 4764, -32263, -5552, 27953, -4789, -28152, 80171, 88292, -21678, -46954, -6821, 9085, 149814, 222236, 120200, 57548, -81519, -87615, -122765, -59116, -43272, -68043, -106333, 33434, 110147, 167314, 131200, -21354, -111287, -121747, -194407, -171365, -61059, -36776, -64885, -108216, -157097, -216686, -187616, -127707, -114780, -126489, -71759, -186439, -333417, -142677, 25974, 37102, 1837, 2159, 52460, 88168, 7271, -66426, -144804, -94136, -37848, -7763, 9550, 12397, 81116, 152054, 235824, 146388, 109389, 106101, 21398, -31469, -74472, 82974, 38334, -36824, -17667, -5731]
20759e731M1956J4379P9627j18984j31334n4293o4982J51250J30858J8211J03689
20748A64646J31635j69154l7407O7466K694q956o3217j80654L7238K2049o7740
20737a01400J17008O2580M2025n3556j2580k2085j29220N1895J7278n2L0874m0567
20725c7800K8772N1329J29999l4584j76653l522P2289o0852K8657J01823Q0178
20714A79636R22m3896m0929L6m6197o3858m9200J696k0790n4563P8874Q3998P8346
20701A04075K5809n4825n8917J7712j3961j8020k2143k3711K2880k9172j13674
20690a63947P1618P7619l5784J471M8032k4075K5451k2500Q3027p9822O6504Q9715
20678A37309L965n822P960n2921J1935L2331l5832q6292j03996N0288J48052q7219
$$ y = [-5731, 36225, 50604, 130231, 11247, -120087, -174380, -239362, -88112, 42746, 60957, 164646, 296281, 127127, 89720, 157186, 159880, 150924, 87707, -92947, -55709, -33660, -101400, 15608, 78188, 120213, 66657, 54077, 31992, -97228, -45333, -28055, -28107, 2767, -37800, -9028, 42301, 172300, 137716, -38937, -42459, 29830, -31022, -2365, 99458, 179636, 180558, 136662, 95733, 95769, 49572, -14286, -63486, -61790, -82580, -137143, -58269, 25729, 104075, 129884, 75059, 16142, 33854, 19893, 1873, -20270, -43981, -21101, -50273, -163947, -92329, -14710, -50494, -49023, -991, -25066, 385, -22115, 60912, -18910, 47594, 137309, 141274, 135452, 143412, 90491, 102426, 134757, 98925, 12633, -91363, -41075, 106977, 19758]
20666A9758Q0098k0600q7050j05623J3598L3898Q3107O5647j26756q9715J10533
20655b3105J75142N7186m2089r9863k6359j6111N9339O2715j33996K8113k893
20644C8079j20114n7089o5480j6081N421Q4203q0413m9157R0238R4742o5877Q2775
20632e8753o0437j78009K1213R3454J67731p040j26754q1685P8296O2426l616
20621i3174j8210P3826J0484k7352q4853q4663K15760M0148j70391j02893N249
20610b36069K2192R3358M0029o5235J8288P5383J3628j3694n1541N8564m5952
20599i1049L0179M1853J36689J0204j08898r3466k424j08347R3217j118m4341
20588a37501K5633L7070O2416L0802j02788j0149K34111R1938j71058j42790p9781
$$ y = [19758, 99856, 79256, -7794, -113417, -99819, -65921, 17186, 82833, -43923, -133638, -23105, 152037, 209223, 167134, 67271, 40912, 24801, 84140, 146855, 12859, 40972, 38079, -82035, -139124, -204604, -220685, -215264, -131061, -211474, -260631, -170393, -75651, -141528, -58753, -119190, -297199, -275986, -182532, -14801, -21841, -148595, -230280, -151984, -89558, -93174, -111384, -37558, -27074, -54426, -139279, -223942, -8182, 31966, -138425, -241318, -236069, -213877, -120519, -80490, -145725, -127437, -52054, -38426, -52120, -103661, -45097, -91049, -60870, -19017, 117672, 127876, 18978, -74488, -76912, -185259, -92042, -93160, -137501, -111868, -74798, -12382, 18420, -84368, -94517, 139594, 231532, 60474, -82316, -162097]
20577a62097M4617M6249O5209n3465L7938J07289k5086o8445P8250o188r7126
20566c2855j00682P9318P3439m5610j15959j0860n7013N8794M7J8690q055l9789
20554a80535P0030M7321k2458J0518L2459j2232m4438J6913n341M8322m3611p6309
20542a59361o354J04702P9016M0100k9633r5038R478J69066L7775j10100p2298
20531c2647j18471N964J13668P7850m8664j15437n1188q0469p297Q455J22783
20520a25453N6411j54560k6405R7234P2180J31526J3087j8043O443l2539l9294
20509a9413n1981o246l9945j5732L8791N6911j725J8794j0357j07063J18L9142
20497i8706J43349o5343m9990o7023J6496J07770K0073n1083O103L8550k697q8187
$$ y = [-162097, -117480, -71231, -6022, -59487, -21549, 85740, 60654, -7791, 70459, 64271, -32855, -133537, -54219, 19220, -26390, -142349, -153209, -210222, -151428, -151381, -132691, -140746, -180535, -110505, -63184, -85642, -75124, -42665, -54897, -99335, -82422, -87763, -39441, -83052, -159361, -165715, -61013, 18003, 58103, 28470, -66568, -57090, 111976, 149751, 39651, -32647, -151118, -145154, -31486, 46364, -2300, -117737, -168925, -249394, -256691, -248236, -125453, -69042, -223602, -250007, -152773, -80593, 50933, 64020, 45977, 52420, 19881, -19413, -71394, -77640, -117585, -133317, -94526, -37615, -39340, -20546, -30903, -137966, -137848, -98706, 44643, -20700, -70690, -137713, -121217, -13447, 6626, -44457, -38354, 196, -2501, -90688]
20485i0688q1360R9M6374J23805k1960j72828J6784Q1233K0376J20974J47996
20474A90805J2486p5942J7594N4663q8467j65923R2182J02371K5287p0354J3382
20463A08084j04511m9614k2926Q610L313P3275J53944N4635j1736k4831r3396
20452I4847j2059l2462o0950L2326P8632k2831l7125p7331o8765n0760o1958Q2592
20440a35844L5417J2190k2516J82980q092j05650P66Q4672Q8862J1512o5579l6417
20428D2301O2615Q2789O5886j9671q4372O3575Q574n8666K430o9091N957P2709
20416A75036j09901m8250J02131J8620n2746j14935O762o5789j6868p3245k9294
20405b08479J56460J01693k0992L5486L302K1356k5502k540l4281N0848p683J16858
$$ y = [-90688, -172048, -171949, -125575, -1770, -23730, -196558, -179774, -98541, -78165, 42809, 190805, 203291, 127349, 144943, 199606, 111139, -54784, 37398, 139769, 165056, 94702, 108084, 3573, -46041, -68967, -60357, -57044, 16231, 170175, 224810, 213074, 188243, 94847, 82788, 50326, -10624, 21702, 100334, 77503, 40378, -36953, -105718, -156478, -218436, -135844, -100427, -88237, -110753, 72227, 64135, -41515, -40749, 43923, 132785, 144297, 78718, 42301, 104916, 187705, 253591, 233920, 149548, 213123, 221697, 163031, 165461, 96370, 102327, 175036, 65135, 16885, 119016, 137636, 84890, -30045, -23283, -89072, -105940, -179185, -208479, -52019, 49674, 28682, 64168, 67470, 88826, 63324, 60784, 26503, 77351, 69668, 186526]
20393A86526J3434q2821l9484O470m6003O1455J90041R2482j11447j26408r7849
20382D6396o6491l7836J1929k8688q9949O8714J48399J32805K2845o7138k5315
20371A15671k8384j78934o1502N7328Q6193O0660l6620o2516p9739K9831j5413
20360a13425K7530J16132M1653N3140j20448j53200K9851R5983m1793O0142q992
20349a3427L6726J7691j86786P0938K0360m7216j4351j31394m2828K6805K17908
20338d5574J49910L9061J8519r202j24499k9189r9031j8107P5692O2405j09785
20327h9800q2245k3873j7248Q7497L5696P7731J0601q1499r742r007L3603o5797
20315a34083o6694Q761J93085J1626n0742p741N3690j5531J17084J6180r7608
$$ y = [186526, 199960, 117139, 77655, 84125, 38122, 99577, 289618, 382100, 270653, 144245, 46396, -20095, -57931, -46002, -74690, -164639, -95925, 52474, 185279, 208124, 140986, 115671, 87287, -91647, -153149, -95821, -9628, 51032, 14412, -48104, -127843, -98012, -113425, -85895, 30237, 71890, 125030, 4582, -148618, -118767, -22784, -64577, -4435, -13427, 23299, 40990, -145796, -74858, -54498, -101714, -116065, -247459, -290287, -263482, -45574, 104336, 143397, 161916, 152714, 28215, -974, -100005, -118112, -42420, 19985, -89800, -172045, -195918, -213166, -125669, -89973, -12242, -1641, -83140, -92882, -101889, -68286, -134083, -200777, -192016, 1069, 12695, -38047, -45788, 7902, -7629, 109455, 125635, 28027]
20304B8027M7836j34886j15474o189k0144j4360R0642J02399R1757j00194k558
20293c3144l5067o8383J7502j7110m9405n6038L589Q0563J2753P4951J7250o183
20281e8722L7981R0465R1594Q7754l6560j42835j07577p2585o6656Q4270J82128
20270H9257K3468j9420l8698p0651J6231o5481p2501k450J7506M8433Q4508o3388
20258e3186m010R3569N8346R9327r40j86606q1201M6681j32969K1759O1426Q816
20246f8988J38149L0482M9060l2250J2665m1485n9794J1790J1296j5695p9710
20235d4480r6053J68394N0861K7329M6375k6225L7426k0988k805q5111L7321M8446
20223A40490j17310k8593R8244J05163o9208l4061L2010j08219q9811m7676O4255
$$ y = [28027, 75863, -59023, -174497, -180686, -200830, -215190, -124548, -22149, 69608, -30586, -33144, -68211, -136594, -119092, -136202, -185607, -241645, -238056, -157493, -144740, -69789, -52539, -58722, -20741, 69724, 161318, 249072, 212512, 69677, -37900, -110485, -177141, -92871, 89257, 112725, 93305, 54607, -16044, 187, -65294, -137795, -140245, -122739, -74306, 10202, -53186, -57196, 36373, 94719, 194046, 193106, 6500, -74701, -28020, -160989, -139230, -77804, -68988, 69161, 99643, 148703, 116453, 129118, 87633, 27839, 39629, 50925, 35230, -44480, -140533, 27861, 78722, 106051, 152426, 126201, 163627, 142639, 139834, 54723, 92044, 140490, 23180, -5413, 92831, 197994, 128786, 94725, 126735, 18516, -71295, -118971, -54716]
20212e4716J09938R9775M3362m6104j28163p3089K0063p7735m9555n9263j7619
20201b33106r453K4701O9427J15198L1268j1770n8961O0546M9301n5156j50725
20190a68730l2400J28413J0396r25j12150m7624R2510K5645k8362k6477N0174
20179a09530N012j48340j40616O6105K14156J09202j3049N1983M4956l039J7721
20168I4561K345p2960m5626r0887K679K4115O2105j9711o7747k3371R3133l0234
20156g1598j09053J02293m624j18821p9896M1522K473r095K1983P956j33195M8604
20144c01451J35521R5822K4538k1051m1118R7297L9901M7914Q718L2437j6595
20133A01933k4849K4058j8723j54242j84586o6013k940J20410N162J18401M0971
$$ y = [-54716, 55222, 154997, 198359, 152255, 24092, -48997, -28934, -106669, -156224, -215487, -233106, -242559, -217858, -148431, -33233, -1965, -13735, -72696, -12150, 37151, -18005, -168730, -201130, -72717, -62321, -63246, -175396, -223020, -130510, -104865, -133227, -159704, -109530, -104518, -252858, -393474, -327369, -113213, -4011, -17060, 34923, 79879, 76840, 94561, 96906, 23946, -21680, -112567, -109888, -85773, -23668, -43379, -111126, -134497, -41364, -71598, -180651, -78358, -82982, -201803, -281699, -240177, -237704, -246799, -224816, -216860, -350055, -301451, -165930, -70108, -45570, -66621, -107739, -10442, 29459, 77373, 86091, 118528, 101933, 77084, 101142, 82419, -71823, -256409, -322422, -325362, -204952, -199790, -81389, -40418]
20122d0418J0791k3953J9208O435r9585J20073J55913n4194K2675m5269j28127
20111e6451O192j23323O0418N5477N2282j21412k9892N1203P5580l5024J9802
20100d5148J9137l0435K8363M7980o9872k7878l1011L3965n3805m0970n4613L1153
20088a93134J7884K981m9930R393q673O1303J23856L084L1043k9482l575Q4415
20076D9165j7272M2541J7947q0581j8097R6687N9738j18675k9521O4948K0000
20065H6880q0372N076k4867L8066M2271l4585N992m2760O9992L3598M348n5800
20053D7839R3807o7661J7219r764L126Q037o3284k8217l5010p0503Q8919J00824
20041H5332n4621j03585J01932J67648p5816j73598j1394P2897R7297L7727j8481
$$ y = [-40418, -29627, -53580, -34372, -27937, -127522, -7449, 148464, 94270, 116945, 71676, -56451, -50259, -173582, -113164, -57687, -5405, -126817, -156709, -105506, -29926, -64950, -45148, -26011, -56446, -28083, 19897, -49975, -77853, -108864, -74899, -128704, -169674, -224287, -193134, -175250, -172269, -222199, -212806, -221479, -160176, -36320, -33236, -2193, -31675, -35250, 49165, 31893, 74434, 92381, 11800, -6297, 90390, 150128, 31453, 1932, 66880, 86880, 6508, 11584, -13283, 24783, 67054, 32469, 38461, -4299, 65693, 99291, 103639, 47839, 141646, 73985, 91204, 81440, 84566, 92603, 29319, 1102, -33908, -104411, -15492, 85332, 30711, -72874, 29058, 196706, 120890, -52708, -64102, 8795, 106092, 143819, 125338]
20030A25338k9165M9166P4977O8198j15545j38411K6266K4836P0467J21092q0899
20019A96320n2149o6354p4995J4551p1484m4473Q9850P9905p6661J8915J46067
20008A59492k778l4379q8159p5368k6206r482P452Q4499q9204j53174J25694O4583
19996c7030r8092J04757j3828m9230j8581R2846o3193j23452J36784j9191j9292
19985a07502L0259n254j42547O4045N5754O7685J5383J2276k540m1197O4782N1799
19973F2943m704r4113j1646K6155K8393J252q5410p5528o1379Q3411J54481J64627
19961A88482J47181j48794j09200O5595N9417n7200o0388m806N9687k627j09302
19950B8045l8741j7531j31379q6626J02437K65099J6826r1231p6528R769m6840
$$ y = [125338, 96173, 145339, 220316, 288514, 172969, 34558, 60824, 85660, 156127, 277219, 196320, 144171, 77817, 2822, 17373, -54111, -98584, -8734, 71171, -5490, 13425, 159492, 156714, 122335, 34176, -41192, -67398, -76880, -69428, 15071, -74133, -227307, -101613, -37030, -135122, -30365, -44193, -93423, -112004, -19158, -82351, -205803, -69019, -88210, -107502, -77243, -82497, -225044, -160999, -105245, -37560, -22177, -9901, -12441, -53638, 11144, 62943, 58239, -35874, -47520, -21365, 7028, 8280, -77130, -152658, -214037, -130626, 23855, 188482, 335663, 186869, 77669, 143264, 202681, 145481, 85093, 80287, 139974, 137347, 28045, -10696, -28227, -159606, -246232, -143795, 121304, 138130, 46899, -29629, -19860, -66700]
19939f6700l1218j26806N0684J86120N9744j21116j81878O6530K08146R1837j1911
19928A23432o4464o0755P019J4220q525O0558J0203r3891M8796M8179P9818o7889
19916I6701j07990r3386M7995J21481J1466m1008l9344P702N4242l6317j9480
19905B062q0593l6838K4721N8926Q2640J20385j48518k30417j07900q4954O0633
19894c39853J23644Q3095M1953Q7111L3262n2501O5389M3279j7512o5119k9001
19883b6253J40959P2612k28163j02974J23377N8564k8473K1867p2688J7132O9999
19872D5959j27436l5232K3776J7739m1819K3944J92030J20850j6922o0738l1506
19861A10645n8965N3698O2816j42675o7322J2266R539r6981J40784J35142P3050
$$ y = [-66700, -97918, -224724, -174040, 12080, 71824, -49292, -231170, -164640, 43506, 135343, 123432, 58968, -1787, 5232, 19452, 10927, 71485, 81688, -12203, 36593, 84772, 164590, 96701, -11289, -104675, -56680, 64801, 76267, 35259, -4085, 3617, 57859, 21542, 2062, -78531, -115369, -90648, -31722, 50918, 171303, 22785, -207632, -315532, -400486, -339853, -216209, -133114, -91161, -4050, 29212, -23289, 42100, 85379, 67867, 2748, -26253, 114706, 187318, -40845, -143819, -20442, 38122, 9649, 31516, -41172, -24040, 45959, -81477, -116709, -92933, -75194, -117013, -93069, 98961, 219811, 202889, 142151, 110645, 51680, 105378, 168194, 25519, -41803, -29537, -19998, -116979, 23805, 158947, 231997]
19850B31997n5609j47249q8049k5948J04605K3806m5966l8980q4437j68927L3227
19839b61530J02018L3223J11331M8002J47118J7373l9189j14670l3604Q2537O4787
19828A57396j0458j8546n8211l8836m6800m012q3568n8929m0053J57620J23350
19817G8953j7870K8744l3857j71917j49632P188P7843o7547M3956J0812L9382
19806a53945L9876k4363L9381J13544L7055M1292j51133q3617J03944M5134k7881
19795b0713n3134P3158Q1164q3657o1248M1531n9312p4035O0857m8674J26036
19784a8027J31608O8880J405j12879J9748J3575r1500K6677n3106p8229P3780
19773a8068m0076O0007J72990o2690n6506O89R9796p0924j25836n7322k9400O9230
$$ y = [231997, 176388, 29139, -58910, -84858, 19747, 43553, -2413, -41393, -125830, -294757, -261530, -159512, -126289, -14958, 33044, 180162, 197535, 158346, 43676, 10072, 92609, 157396, 146938, 128392, 70181, 31345, -15455, -19467, -103035, -161964, -202017, -44397, 78953, 61083, 89827, 55970, -115947, -265579, -258391, -180548, -248095, -204139, -193327, -153945, -114069, -138432, -99051, 14493, 51548, 92840, -58293, -141910, -37966, 7168, -20713, -73847, -689, 80475, -3182, -64430, -22899, -82211, -156246, -95389, -144063, -18027, 113581, 182461, 183866, 70987, 90735, 104310, 12810, 39487, -13619, -91848, -18068, -58144, 1863, 174853, 112163, 55657, 56346, 156142, 85218, -40618, -97940, -127340, -58110]
19761e8110P7321L9620M381p5008n7599N5758k2740K9179N6721N9506m0343n1366
19749A7320K0228L0221j6927L351q5449r0141L9457L4498N629L4272L796J5280
19737A1535k9903o4266l9372p403J55295J06257k3161j5479p0992J17878P343
19726A47732n3452j7767K5039P8691j36181r8706l037J6324R8795j9117l3702
19715D619j8795M1048P3833q9497K6769J31858J53071J09081l6280m519J07907
19704D99095Q6218R3753Q1187M7817l7638N5945J50352J59610L3899J21100Q6962
19693A378300L1691O627P2302J0911N9709L1030L1309J6512j58104o9273n6136
19682A354878j41706n7779o9664n6303q2146n6190p8316n4369k534O245j21646
$$ y = [-58110, 19211, 58831, 63212, -11796, -69395, -13637, -36377, -7198, 49523, 109029, 68686, 17320, 37548, 67769, 50842, 54193, -31256, -121397, -81940, -47442, -41813, -7541, -3745, 11535, -18368, -82634, -122006, -129409, 25886, 132143, 108982, 93503, 22511, 140389, 147732, 94280, 76513, 101552, 180243, 44062, -54644, -57681, -41357, 57438, 38321, 4619, -14176, 26872, 100705, 11208, 37977, 169835, 322906, 431987, 395707, 391188, 499095, 585313, 679066, 760253, 808070, 770432, 826377, 976729, 1136339, 1170238, 1291338, 1378300, 1409991, 1416618, 1488920, 1499831, 1559540, 1590570, 1621879, 1638391, 1480287, 1411014, 1354878, 1213172, 1155393, 1085729, 1029426, 947280, 891090, 812774, 758405, 755871, 762116, 640470]
19671F40470p3024o491p2661l5505q8477j24711p5382j7400J3028N8087j11655
19660A06279j48413m5566M1907J29897N5556j2447j06227J9751L9909k5763j12816
19649e7933N1542Q9096P2595J7770j0351K1421N7809M2584j16268m2474p5944
19638D9847q8048n69M8962J40795Q9364j6001J06631J03566K32255J53657L0874
19627H51333J81521K51568J00286O6093J79860J16228j3532j82344j68919k21490
19617A160604k73228q8759p9799j75691j7349M8347j0060N0232j6361J58530J76477
19606I32943K18982J44766R8369J95221Q9065M7729J29379q5446m33034m23892
19596I14082k31825q7031n3203l5434l330J2588j10482o155p998k802K3497j0999
$$ y = [640470, 567446, 560955, 488294, 452789, 364312, 239601, 164219, 146819, 159847, 217934, 106279, -42134, -87700, -45793, 84104, 139660, 127213, 20986, 40737, 80646, 54883, -57933, -6391, 82705, 155300, 173070, 162719, 184140, 241949, 284533, 168265, 125791, 49847, -38201, -38770, 10192, 150987, 240351, 224350, 330981, 434547, 666802, 820459, 851333, 1032854, 1284422, 1384708, 1450801, 1630661, 1746889, 1733357, 1551013, 1382094, 1160604, 887376, 798617, 718818, 543127, 525778, 574125, 564065, 614297, 597936, 756466, 932943, 1151925, 1296691, 1395060, 1590281, 1679346, 1727075, 1856454, 1771008, 1337974, 914082, 682257, 595226, 542023, 506589, 503259, 515847, 405365, 399210, 391212, 388410, 411907, 400908]
19584D00908m6098k1431L253q468J5838N3319M9645L7282r9725J1732j994J20446
19572E14707J72368k7470Q377k2843o275j66394l4530J55145o3717o9256N905
19561D66017j07903l4623K7581m6062k0298O2966Q1402K14601J30714p2427l2575
19550F69393K6510N8674n3063o1928L0690n5088O370J15474p8942j69640J00121
19539E88571Q7606r8033j02619j2098J40092L6164p3840n9349m1470j31582j00183
19528B33259J13797J70289P1344k5219q6919L9347l5902j20072J6864Q3184K6758
19517D86730K4784l0858L1227M3327o3750j8347O011n4620m4063k044j7573l2752
19505C28072o373q7558j00560q311N6189N2574R4360j5138n375J10621j1981j00676
$$ y = [400908, 354810, 333379, 336632, 328164, 344002, 397321, 446966, 484248, 384523, 396255, 394261, 514707, 687075, 659605, 667982, 645139, 638864, 472470, 437940, 593085, 529368, 460112, 466017, 358114, 323491, 351072, 305010, 284712, 347678, 429080, 643681, 774395, 701968, 669393, 695903, 754577, 701514, 639586, 670276, 615188, 621558, 737032, 658090, 488450, 588571, 676177, 578144, 475525, 463427, 603519, 639683, 565843, 506494, 465024, 333442, 233259, 347056, 517345, 588689, 563470, 476551, 515898, 479996, 359924, 376788, 459972, 486730, 511514, 480656, 511883, 555210, 491460, 473113, 479124, 424504, 380441, 378397, 360824, 328072, 321699, 234141, 133581, 125270, 181459, 234033, 328393, 313255, 307880, 418501, 406520, 305844]
19493C05844l1080J1122J1552k5037k0466M482o3986k3514K16963K4412Q2648
19482D92940j2526p8255p7555p5558j05516q3527O8131J64759M3240p467M9298
19471C77964j29249p3746J24914r142J6049L1527j1227n0568N2869L3010j66903
19460A95498J4511M3218L2457L0653J43236L0034m3895j3115m7209j115L3026
19449D17299J9265K3838R6740P735r7970j5238R0670J04426O255M3031j5642p4762
19437F05647q8205l7390M7103N767j46806n4350m4475N1164M1362J4833j68145
19426B26505j29181j02508L1359J03220l2333N1116J22848Q8563R3956j00301
19416C53244j42384n859R8646j4978p5179P7003o2136p4939N3608J02027J3237
$$ y = [305844, 274764, 285886, 297438, 272401, 251935, 256417, 192431, 168917, 385880, 410292, 492940, 480414, 402159, 324604, 249046, 143530, 60003, 128134, 292893, 336133, 328666, 377964, 248715, 174969, 299883, 290741, 306790, 338317, 327090, 276522, 329391, 362401, 195498, 210009, 253227, 285684, 316337, 459573, 489607, 445712, 432597, 385388, 384273, 417299, 436564, 460402, 557142, 564877, 466907, 451669, 542339, 646765, 653020, 696051, 680409, 605647, 517442, 480052, 527155, 532922, 386116, 331766, 287291, 338455, 379817, 394650, 226505, 97324, -5184, 26175, 129395, 97062, 148178, 271026, 359589, 453545, 353244, 210860, 205001, 303647, 288669, 213490, 290493, 228357, 153418, 207026, 309053, 322290]
19405C22290l6255M6484O43q6522q8621o3951M4295r4457j1798J79792J6472n4034
19393A74338M4454j8684m4166O6161j78509K7006J0855J4343r305J4288J45872
19382B46653M2811j45103q5477m191M8008J58586Q7242m109J0839J05730J37030
19371E98019M8176k7894j85518j21565M6148M8537J33070o8825l4386J10550J12943
19360F59255j4278M0637o4228j24158q8482J29587J23567l8641k2075J26894m723
19349G23355j06143q4762J6908J11224J0549Q6595N8383l6366j03291n3383p6573
19338E46496P659j3150j5478j24635m3921p7313R0285K54604N7959l2322o6575
19327E83609O3794J82005N9120O1346K8397m57R3133K3434m727O3692n6152o7880
$$ y = [322290, 286035, 332519, 333162, 246640, 158019, 94068, 138363, 43906, 32108, 211900, 228372, 174338, 218792, 200108, 155942, 222103, 43594, 70600, 81455, 95798, 86493, 100781, 246653, 289464, 144361, 58884, 54693, 102701, 261287, 348529, 344420, 355259, 460989, 598019, 646195, 618301, 432783, 311218, 357366, 405903, 538973, 470148, 435762, 546312, 659255, 644977, 685614, 621386, 497228, 408746, 538333, 661900, 623259, 601184, 728078, 723355, 617212, 532450, 549358, 660582, 671131, 757726, 816109, 779743, 676452, 623069, 546496, 554155, 541005, 525527, 400892, 356971, 279658, 369943, 624547, 682506, 650184, 583609, 647403, 829408, 888528, 949874, 978271, 977814, 1070947, 1094381, 1089654, 1153346, 1097194, 1029314]
19315A029314L6115m0484q9058q4227M8387L5026l8905O4513P8826M9999r4656
19304I94850o269J4424J5092J1799o9874L6046J39757J3661n5276M7851J1280
19293A153341k7486O5412N698J45250l5246j22334l7110o5544q8547p4028j44063
19282G75343j03927O263J6443J405K0120K8846L4988m9078J24319J45315J33770
19271A133807O3791P806J02090J47741P1448o5603p1813j45262l7451M3640j7187
19260A233007J34521J39689j59550Q1100R9529M3344N7324K3162j638M3151J71575
19249A865214K04203J48152n9231J19189R8165R9870J25706J30643J22246J83624
19239C037781J39162L04152J70076K3364R8258K51466L64938K99704L26776L27285
$$ y = [1029314, 1065429, 1024945, 935887, 851660, 900047, 935073, 896168, 960681, 1039507, 1089506, 994850, 988581, 1003005, 1018097, 1029896, 960022, 996068, 1135825, 1149486, 1094210, 1142061, 1153341, 1125855, 1191267, 1196965, 1342215, 1306969, 1184635, 1147525, 1081981, 993434, 919406, 775343, 671416, 677679, 694122, 695527, 715647, 744493, 779481, 730403, 854722, 1000037, 1133807, 1197598, 1205404, 1307494, 1455235, 1526683, 1461080, 1389267, 1244005, 1206554, 1250194, 1233007, 1367528, 1507217, 1347667, 1428767, 1528296, 1571640, 1628964, 1652126, 1650488, 1693639, 1865214, 2069417, 2217569, 2158338, 2277527, 2375692, 2475562, 2601268, 2731911, 2854157, 3037781, 3176943, 3481095, 3651171, 3674535, 3772793, 4024259, 4389197, 4688901, 5015677, 5342962]
19229E342962J50149L65404N59329M32685L83701N15884L78688N38867O71183
19220I338852Q05545Q21665J045445J327090J728400K057322K663972L517902
19212B3306193M623468O097024P310884P840697Q868498J1299326J4010353J3778214
19204I7134657J1834749J2780089J6039220J7806894J5517470J2907811J2508204
19197A96529094J4485573J4498498J2166247R332850Q212616P030308N281397
19190B67536583L509482K244796j423547m321066m937649m846200p864170j2625463
19182B37272766j3787226j1118782j1600643j6035524j8905257j7144296j3693376
19175A34987662j3105730j6227852j7487081j3694021r883303q832340r253335
$$ y = [5342962, 5493111, 5858515, 6417844, 6850529, 7234230, 7750114, 8128802, 8667669, 9338852, 10144397, 10966062, 12011507, 13338597, 15066997, 17124319, 19788291, 23306193, 27929661, 34026685, 41337569, 49178266, 58046764, 69346090, 83356443, 97134657, 108969406, 121749495, 137788715, 155595609, 171113079, 184020890, 196529094, 211014667, 225513165, 237679412, 247012262, 255224878, 262255186, 267536583, 271046065, 273290861, 271867314, 267546248, 262608599, 257762399, 249898229, 237272766, 223485540, 212366758, 200766115, 184730591, 165825334, 148681038, 134987662, 121881932, 105654080, 88166999, 74472978, 64589675, 55757335, 46504000]
19168D6504000p963194n976697m323416l346496k637236k086737j644938j418494
19160A7106792j311251j177824j112198r04220r63375r15348o98551n75243o30376
19151H818406n65116l75343l32483m06044k97812k64130j52249m8130p3222o0663
19141F243214l1659o4022k02322j43995k15597j78553j85503j62947j10960n6175
19131D891481J3539l9652j40880j68583j08380q1228r4034j30713j76446j31062
19121C834042j07071N5416J42395O9430N2636K43281R5239J66799K09114M88502
19111E249783N48664O18692P67990J114965J519417J672186J585562J891514J969441
19102A6938214J365830N91631L74461J07383m64698j068552o96325k86412m9479
$$ y = [46504000, 38540806, 32564109, 28240693, 24894197, 22256961, 20170224, 18525286, 17106792, 15795541, 14617717, 13505519, 12601299, 11637924, 10722576, 10024025, 9448782, 8818406, 8253290, 7877947, 7545464, 7139420, 6841608, 6577478, 6425229, 6377099, 6303877, 6243214, 6211555, 6147533, 5945211, 5801216, 5585619, 5407066, 5221563, 5058616, 4947656, 4891481, 4905020, 4865368, 4724488, 4555905, 4447525, 4366297, 4272263, 4141550, 3965104, 3834042, 3726971, 3782387, 3924782, 3994212, 4046848, 4290129, 4385368, 4552167, 4761281, 5249783, 5798447, 6417139, 7185129, 8300094, 9819511, 11491697, 13077259, 14968773, 16938214, 18304044, 18895675, 19270136, 19377519, 18912821, 17844269, 17147944, 16861532, 16812053]
19093A6812053J89337O95385J296420J352197J148732J384935J802886K155228
19085B6837173K416121L229971M700660O520101P421957P680173Q793395Q625372
19077G6224923N667576K604522J484704L33208l450329n853581l517767j339275
19069G2153981q65401R78528L897949M890036K802326Q69303K48639j187471m601631
19060G9186259n681835m033826k430458r52890Q54149K972512O380982J0433238
19052H6728131J3293346J3931026J3918348J4708211J3496842J1417091J0068755
19045A77561750Q636675O625788O156839J4263826K6445918L7168454M6356827
19038C23216077M7526592K9867131R706115K630818l519969k8142565o2806584
$$ y = [16812053, 17001390, 17696775, 18993195, 20345392, 21494124, 22879059, 24681945, 26837173, 29253294, 32483265, 37183925, 43704026, 51125983, 58806156, 67599551, 76224923, 81892499, 84497021, 85981725, 86314933, 82864604, 77011023, 73493256, 72153981, 71288580, 72267108, 76165057, 81055093, 83857419, 84726722, 84975361, 83787890, 79186259, 73504424, 69470598, 67040140, 66087250, 66941399, 69913911, 76294893, 86728131, 100021477, 113952503, 127870851, 142579062, 156075904, 167492995, 177561750, 186198425, 192824213, 198981052, 213244878, 239690796, 276859250, 323216077, 370742669, 400609800, 410315915, 412946733, 409426764, 381284199, 318477615]
19031C18477615o8499208n2439186l3884005j9199469q814176k071060K653252
19024A36223763P804279J4649604K2764321K8711348L2832533M0322965M9466024
19017C32774837M2245748J4234729K4264N283505J425247l2210443o3031704n7814231
19009B42931952m1220331k9100920k0867989j5993189j5858374j7133735j4881057
19002H7876357j2362178j0875263q490499n682306l591243k275338j901329j673419
18994D1024782j500435j658250j995252k338773j960098j344473j078057q97499
18986B8251945m60454l52460o31287p70588p95136j303648k151979k529071j971210
18977A7286112j744004j775004j518334j195720p85531l56908k67738k53765j85133
$$ y = [318477615, 249978407, 197539221, 163655216, 144455747, 135641571, 133570511, 136223763, 144028042, 158677646, 181441967, 210153315, 242985848, 283308813, 332774837, 375020585, 389255314, 389279578, 394563083, 395988330, 363777887, 300746183, 242931952, 201711621, 172610701, 151742712, 135749523, 119891149, 102757414, 87876357, 75514179, 64638916, 56148417, 50466111, 46874868, 44599530, 42698201, 41024782, 39524347, 37866097, 35870845, 33532072, 31571974, 30227501, 29149444, 28251945, 27791491, 27439031, 26807744, 26037156, 25242020, 23938372, 21786393, 19257322, 17286112, 15542108, 13767104, 12248770, 11053050, 10267519, 9910611, 9642873, 9389108, 9203975]
18968I203975k49032q7097l09387m02353m75325l69551l52024l57137o31015o00412
18958E370642m84550l64730k71581l03421k66283k8078N2322Q783r7554r4252
18948C521298p2991j54612j22437k9304Q5927R511j77131j66014r1189l4241n0075
18937B718742j32594n9650k2593r5328j21897r9239j16325p7660k6613K2504N4800
18926B044147j07518k4986j48591j49401Q1213J57960l7780p7987J3440q0639
18916A669858l0509j15126k8459O3884k2812J18053N8390L5126N7385O7326J8852
18905A891968j05797m3793Q4388Q6824M4765L6327P3814n4996k490K5477j56406
18894A880081j82780j20862o7755l0370n4507l3547Q3191J8424J36992Q3363k7159
$$ y = [9203975, 8954943, 8867846, 8558459, 8156106, 7680781, 7311230, 6959206, 6602069, 5971054, 5370642, 4886092, 4521362, 4249781, 3946360, 3680077, 3651999, 3704321, 3713104, 3615550, 3521298, 3448307, 3293695, 3171258, 3141954, 3227881, 3237392, 3060261, 2894247, 2803058, 2768817, 2718742, 2586148, 2526498, 2503905, 2408577, 2286680, 2187441, 2071116, 1993456, 1966843, 1989347, 2044147, 1936629, 1911643, 1763052, 1613651, 1694864, 1852824, 1815044, 1737057, 1750497, 1669858, 1639349, 1524223, 1495764, 1559648, 1536836, 1654889, 1713279, 1748405, 1805790, 1873116, 1891968, 1786171, 1742378, 1826766, 1913590, 1958355, 1994682, 2068496, 2013500, 2011010, 2036487, 1880081, 1697301, 1576439, 1508684, 1478314, 1423807, 1390260, 1473451, 1491875, 1628867, 1712230, 1685071]
18883A685071o6267m0723q4905l515K8664m9161J5116m9816r5520J1322K9835
18872A380101k582K7762R6405l3089P139r1485l7032m8970m6393o0691p0007N0678
18860A171836M3582L5271J04783M2098O1670M0232N0006N4189J78427J68566Q3445
18849B034105p7636j3270R146k05028j72415j68668j92857p2974k1006K6051n0328
18838A095120K9302o198n9234L1081M8625m2645J34009K44439J10507n991k4210
18827A554805J06133J52139K827K21470J59300J86068K26444L76621L95211N6016
18817C437034k033l9758k09909l91736m52632l56362q0252j22002j66734j9236
18807A596380j84471j50197j2680J05165L01385K65276L79210L06686K76297m5886
$$ y = [1685071, 1618804, 1578081, 1493176, 1489661, 1518325, 1469164, 1484280, 1434464, 1338944, 1350266, 1380101, 1377519, 1405281, 1501686, 1468597, 1475736, 1384251, 1347219, 1298249, 1251856, 1191165, 1121158, 1171836, 1215418, 1250689, 1355472, 1397570, 1459240, 1499472, 1549478, 1603667, 1782094, 1950660, 2034105, 1956469, 1943199, 1952345, 1747317, 1574902, 1406234, 1213377, 1140403, 1119397, 1145448, 1095120, 1124422, 1118224, 1058990, 1090071, 1138696, 1096051, 1230060, 1474499, 1585006, 1579015, 1554805, 1660938, 1813077, 1815904, 2037374, 2196674, 2382742, 2609186, 2985807, 3381018, 3437034, 3435001, 3395243, 3185334, 2793598, 2340966, 1984604, 1904352, 1782350, 1615616, 1596380, 1411909, 1261712, 1249032, 1354197, 1655582, 1920858, 2300068, 2606754, 2883051, 2837165]
18797B837165j32385j07896l7299j13950m27553m37111k71459o6315j98004j52350
18787H92843q6558j20315j4990q9407N1192R950J866l4279L208j20715o6761m2063
18775C83971n4386k1719J15827K06427J91124J47013L3607n8281K05846J07262
18765A256691j60587j91595j45865j00051m7541o3005j5294M981j9627L7440k1984
18754E33563j40253j1871m6066J7701p482n078P6669j20243L0825O728o5527r582
18742B59384P297n9229j14139R9347J34079k8299o9137k3211r9513o9433Q0434
18731A17580r454p8649J04902N5613n8415j8184m041N4576M2156j40978J02955
18720A68061R5806j5429o0924O4231N3683k4166l5684l2011M1011o2432q060P15
$$ y = [2837165, 2704780, 2596884, 2559585, 2445635, 2018082, 1580971, 1309512, 1243197, 1045193, 892843, 806285, 685970, 670980, 581573, 632765, 642715, 644581, 610302, 613510, 492795, 426034, 383971, 329585, 307866, 423693, 630120, 821244, 968257, 1001864, 943583, 1149429, 1256691, 1096104, 904509, 758644, 658593, 611052, 548047, 532753, 537734, 518107, 555547, 533563, 393310, 381439, 335373, 353074, 345592, 340514, 417183, 296940, 327765, 334493, 268966, 259384, 266681, 207452, 93313, 192660, 326739, 298440, 229303, 206092, 106579, 37146, 117580, 108126, 29477, 134379, 189992, 131577, 113393, 109352, 163928, 206084, 65106, 168061, 263867, 248438, 187514, 251745, 305428, 281262, 245578, 213567, 254578, 192146, 184086, 184801]
18708A84801K1054K09919K06537J06455o8482l7268R624L4066J59457R5214J13797
18697A035174j6220J01122K75240O1783M662L5037J22128M6516p708J03468J35560
18686A896762M3408M81K179O2314p2116n1051Q2470r4591j33829j79144l5730
18675A521153j09136k16357j02524j2849K5329M693o1377j7474p1342n0639o6777
18664H42700r6665P144j4807N5562K1136l4229k5650j3340J9887j32045k942N1369
18652F78120j09419m3296j13249p3442K2824O4771J00910j9569J20856L9667L0748
18641F98921j21782l6968Q8808N8244J750O5890j3535j6615R5431r721k2125l554
18629G84744p8290N6158J22600Q9968o2014m7007k1354J63103J9592O9362J34328
$$ y = [184801, 205855, 415774, 622311, 728766, 660284, 623016, 632640, 666706, 826163, 921377, 1035174, 1018954, 1120076, 1395316, 1457099, 1461761, 1496798, 1618926, 1665442, 1657734, 1761202, 1896762, 1940170, 1940651, 1942830, 2005144, 1933028, 1881977, 1964447, 1869856, 1736027, 1556883, 1521153, 1412017, 1195660, 1093136, 1080287, 1105616, 1110309, 1048932, 1031458, 960116, 909477, 842700, 746035, 753179, 738372, 793934, 815070, 780841, 755191, 741851, 761738, 629693, 626751, 678120, 568701, 525405, 412156, 338714, 361538, 426309, 527219, 507650, 628506, 668173, 698921, 577139, 540171, 628979, 687223, 688973, 754863, 741328, 724713, 820144, 810423, 788298, 784744, 706454, 762612, 885212, 975180, 913166, 866159, 844805, 1007908, 1027500, 1096862, 1231190]
18618A231190J24889N4514J30415P499o9131K3111N0210l2331k0762j4743j13793
18607A371068k24619j28718n5779r978J1675k7930p382r820j03611j7005O0550
18596H58451K3740m4641q873J84283J76326P6530j70199j53075o017M3023J7442
18585I96990J02418j1791o0063k407R2004q4373n4863k7025j20971q6536q6151
18574F57232q1527m4168P286O1063J19782p245q501M2907J8570Q2576L2729j17860
18562G62844j24219m4866M2097O006K2059j1149J41039P8004n5641O8378j3622
18551H70930P7265R3719n7618j8126O1086J16526J50547L827M893J1015K9801
18540A343865m1503r9180k9852J75152O8878O6789K4471J1868O8926j0336j9690
$$ y = [1231190, 1356079, 1410593, 1541008, 1548507, 1479376, 1502487, 1552697, 1520366, 1499604, 1484861, 1371068, 1146449, 1017731, 961952, 951974, 963649, 935719, 928337, 918517, 814906, 797901, 858451, 882191, 837550, 828677, 1012960, 1189286, 1265816, 1095617, 942542, 936525, 979548, 996990, 1099408, 1087617, 1027554, 1025147, 1117151, 1032778, 977915, 950890, 829919, 743383, 657232, 575705, 531537, 538823, 599886, 719668, 712423, 703922, 746829, 765399, 847975, 880704, 762844, 638625, 593759, 635856, 641862, 663921, 652772, 793811, 871815, 816174, 884552, 870930, 948195, 1041914, 984296, 966170, 1027256, 1143782, 1294329, 1298156, 1303049, 1314064, 1343865, 1302362, 1203182, 1173330, 1348482, 1417360, 1484149, 1508620, 1520488, 1589414, 1579078, 1559388]
18529A559388l106K3353j1895r1303j06284m3285o6542J13219n522j2012k2118
18518A333893N4350p516K181J20372R1419K0201P6374P0978j8768k7102K0107
18507A736489j01830J02031J25166j3362k11105j83316o3835O425L3319p597P029
18496A429414K3917r8490J4986J5785p2021j70286L0300R668R5542J72803N1322
18485A502940m0512J25357J35528J51314J17864Q8419j46873m0290Q5734O4689
18475B044170O273Q6908n4513q6864j55578j52985r3857J69918m432j79239M609
18464A584410K12694J08786J7J09623J00563l4555r8411M4623J35764j4035J57343
18453B306822M5349J02971N980m5697L0532P4247R7241P9797L17558L12042J27123
$$ y = [1559388, 1556282, 1579635, 1567740, 1476437, 1370153, 1326868, 1260326, 1373545, 1368023, 1356011, 1333893, 1388243, 1380727, 1382908, 1503280, 1594699, 1614900, 1691274, 1762252, 1743484, 1716382, 1736489, 1634659, 1736690, 1861856, 1848494, 1637389, 1454073, 1390238, 1396663, 1429982, 1422385, 1429414, 1453331, 1354841, 1369827, 1385612, 1313591, 1143305, 1173605, 1183273, 1278815, 1451618, 1502940, 1462428, 1587785, 1723313, 1874627, 1992491, 2080910, 1934037, 1893747, 1979481, 2044170, 2050443, 2137351, 2082838, 1995974, 1840396, 1687411, 1593554, 1763472, 1759040, 1579801, 1584410, 1797104, 1905890, 1905907, 2015530, 2116093, 2081538, 1983127, 2027750, 2163514, 2149479, 2306822, 2352171, 2455142, 2461122, 2415425, 2445957, 2520204, 2617445, 2697242, 3014800, 3326842, 3453965]
18442C453965M1746J8224K1405q0959j83858k22653j28600j78354j50540j380
18432B588996J30136q4411O1997K16043L39700K20632J67110L29958L62755L22330
18422D655246K92560K41224L64622N26037N34459P08725Q65392J362594J340896
18413A0891755Q57253J099330J561797J898242J129727q2931p00293j94080L17161
18404A6777961k86597k001931k177962j363811n14400N8734N85648P99259P42470
18395A2619371N23429O21033R17356R74551Q85289P30914P38376J140778J492167
18386B0643264J385043R94357O72445Q16137P69849P10193J246800J733492K235851
18377C1207431L010335L671195M146112M693090O063881Q710320J2163726J6973203
$$ y = [3453965, 3495711, 3513935, 3535340, 3454381, 3270523, 3047870, 2919270, 2740916, 2590376, 2588996, 2719132, 2634721, 2696718, 2912761, 3252461, 3473093, 3640203, 3970161, 4332916, 4655246, 4947806, 5189030, 5553652, 6079689, 6614148, 7322873, 8188265, 9550859, 10891755, 11749008, 12848338, 14410135, 16308377, 17438104, 17355173, 16654880, 16460800, 16777961, 16491364, 14489433, 12311471, 10947660, 10433260, 10491994, 11077642, 11876901, 12619371, 13142800, 13763833, 14681189, 15655740, 16541029, 17271943, 18010319, 19151097, 20643264, 22028307, 23022664, 23695109, 24511246, 25281095, 25991288, 27238088, 28971580, 31207431, 34217766, 37888961, 42035073, 46728163, 52792044, 61502364, 73666090, 90639293]
18369I0639293K3304699L1913802M3665172N0183849M2194674L7430988M4622791
18362C63955268M8683496L1498965J215881j8151457j9765088j3508214j0460970
18355C83467881k8193288m2286841l4413506k3390860j7573904j6713545j9761578
18348B01134359k3674443k0532301j6797162j2205593m716927L287757R865822
18341A36361512J4168421J7981830K2119668K2660707K2167874K2224314K5538652
18334B83222978K9620881K5472643J4637963J2185812K1416932K5752001Q520621
18327D20829831j9976715l4105005l3743573k9231023l1607725n2002408n6844775
18320A63318607m1269329k6766754j7513860j1738227q202427o221135m833060
$$ y = [90639293, 113943992, 145857794, 189522966, 239706815, 281901489, 319332477, 363955268, 412638764, 444137729, 445353610, 427202153, 407437065, 393928851, 383467881, 355274593, 312987752, 278574246, 255183386, 237609482, 220895937, 201134359, 177459916, 156927615, 140130453, 127924860, 123207933, 126495690, 136361512, 150529933, 168511763, 190631431, 213292138, 235460012, 257684326, 283222978, 312843859, 338316502, 352954465, 365140277, 386557209, 412309210, 420829831, 400853116, 366748111, 333004538, 303773515, 272165790, 220163382, 163318607, 122049278, 95282524, 77768664, 66030437, 57828010, 51606875, 46773815]
18313D6773815l866107k913912k326581j847186j743859j876036j829787j564038
18305B8806309j474637j436619j188428j166611j230700j616888j598098j493990
18297A7600338j546901j319469j037947p49401n34914m00021k06402p2065L646
18288A1736864K66787M18722R25533J009461O88440J76108L86900P66150L98560
18279A6773525j084397j689732j365853q63447n70706q77815j399389j196398
18271G725788q35863n45126k86173j85384K6071o4800m9499k22508j3836J48978
18261E697648m23j33070q130Q4573Q1079L58687L16466K50682L09246M40786K90740
18250G688284K75135M27364N30839M19194K74087L71919O84898P07472O95149
$$ y = [46773815, 42907708, 39993796, 37667215, 35820029, 34076170, 32200134, 30370347, 28806309, 27331672, 25895053, 24706625, 23540014, 22309314, 20692426, 19094328, 17600338, 16053437, 14733968, 13696021, 12946620, 12411706, 12011685, 11805283, 11733218, 11736864, 12003651, 12422373, 13347906, 14357367, 15045807, 15221915, 15608815, 16374965, 16773525, 15689128, 13999396, 12633543, 11770096, 11199390, 10321575, 8922186, 7725788, 6889925, 6344799, 6058626, 5873242, 5899313, 5834513, 5785014, 5562506, 5548670, 5697648, 5697225, 5564155, 5556025, 5640598, 5721677, 6080364, 6396830, 6647512, 6956758, 7397544, 7688284, 7963419, 8390783, 8921622, 9340816, 9614903, 9986822, 10671720, 11379192, 12074341]
18241A2074341O79337J003747Q60963R07881J244697J757506K539415L366358
18233B4434245M536915O185532Q574370J2504766J8473158K5845179L4664928
18226A35219093M7744408O3140318N5805796J9677867N006051J7267646J3645543
18219C57506722m0873658q4848297p1180260m4426261k6422766j5613089q759362
18212F5383029m138878j38696M326095R759303J6584528K4457402L4041242M8105625
18204A98379650O0505262M4614012R944849M472218J6881420K690303n6089753
18197B81397961q3902294o3383891l9237709k4226170j5699898j0580731p537206
18190C6830062n500001m107615l093324k468669j834891j294878j001297o99774
$$ y = [12074341, 12753678, 13757425, 14618388, 15526269, 16770966, 18528472, 21067887, 24434245, 28971160, 35156692, 43731062, 56235828, 74708986, 100554165, 135219093, 182963501, 246103819, 301909615, 321587482, 326593533, 343861179, 357506722, 316633064, 231784767, 160604507, 116178246, 89755480, 74142391, 65383029, 61244151, 61105455, 65431550, 75190853, 91775381, 116232783, 150274025, 198379650, 258884912, 303498924, 313443773, 317915991, 334797411, 337487714, 281397961, 197495667, 134111776, 94874067, 70647897, 54947999, 44367268, 36830062, 31330061, 27222446, 24129122, 21660453, 19825562, 18530684, 17529387, 16829613]
18182A6829613o76620q93630j003288q58741o70534j011879j312683j119958r44509
18173H337771p37025n87107l67531k64979k59850k51912j71988K5283j25869p5927
18163E520866r1484k76025k71018l11671k56350j00138j81683k31164j77927j76905
18153C446501p8750L207N513l7903j61964q3085O5334l2662l5866n7267k1293
18142C011765P5833l9166k7288j08619j14778k9855J0369o1853J9049J33899J28129
18131B997485J50233J50794K03705J82690L48075M85427M80189O23272P09412
18122F331282R56463J180077J566069K286163L248878M968708P341928J0338665
18114C8218233J3687693J9584578K7466944K1238284J584950P80497R251568P292895
$$ y = [16829613, 16152993, 15259363, 14256075, 13397334, 12726800, 11714921, 10402238, 9282280, 8337771, 7600746, 7013639, 6646108, 6381129, 6121279, 5869367, 5697379, 5722662, 5596793, 5520866, 5429382, 5153357, 4882339, 4570668, 4314318, 4214180, 4032497, 3801333, 3623406, 3446501, 3367751, 3370958, 3376471, 3338568, 3176604, 3093519, 3158853, 3126191, 3090325, 3033058, 3011765, 3087598, 3048432, 3021144, 2912525, 2797747, 2767892, 2778261, 2716408, 2735457, 2869356, 2997485, 3147718, 3298512, 3502217, 3684907, 4032982, 4518409, 4998598, 5621870, 6331282, 7287745, 8467822, 10033891, 12320054, 15568932, 20537640, 27879568, 38218233, 51905926, 71490504, 98957448, 120195732, 121780682, 122561179, 131812747, 139105642]
18106A39105642k5195039l8297518k5742284j5159069r161848n863628l949664
18099A5736592k754838j966563j510877j141689q89945p85496m65392k92999m47450
18090E481343n93779m36400k58541l16057k94168k13830k43172l00934l17023
18081B507439r2844j00817j26648N846K6559L6232q8034k02512l8683l0116r5932
18070A800490p0055r8428o7688j5706r3877j61386j14078M6737k5835j63185n0372
18059I86617M70j14265q6538p8092k0168j65506p6409J32225P3136k0867o9189
18048E61414j1147J02378M2589j12500j6271l3671k9117K8290O2216k4952q5793
18037D83436q0306p6436l2424q5210K9537K23538J12971L5720k0337l9833R989
$$ y = [139105642, 113910603, 75613085, 49870801, 34711732, 25549884, 19686256, 15736592, 12981754, 11015191, 9504314, 8362625, 7472680, 6687184, 6221792, 5928793, 5481343, 4887564, 4451164, 4192623, 3876566, 3582398, 3368568, 3125396, 2824462, 2507439, 2414595, 2313778, 2187130, 2192976, 2219535, 2255767, 2167733, 1965221, 1926538, 1896422, 1800490, 1730435, 1632007, 1564319, 1548613, 1454736, 1293350, 1179272, 1226009, 1200174, 1036989, 986617, 987087, 872822, 786284, 708192, 688024, 522518, 446109, 578334, 651470, 630603, 561414, 550267, 652645, 695234, 582734, 566463, 532792, 503675, 531965, 594181, 569229, 483436, 403130, 326694, 294270, 209060, 238597, 462135, 575106, 610826, 590489, 550656, 560645]
18026E60645j45731q9194J6664P0755R0920m876n7129O2151m8866n5743j05846
18015B93750m1421J40010J19396q6250N1726K1420j5669o0887q1011J20892P6740
18004E38696N1795j14976l6849R2935J10419P618k9785n6800q3291J5832J18239
17993F13833j35839j73978J2830J17597J36426K8308r9247j12087o8917K1247
17983C40173K4980R361n752R6032N7933J04499L1033p9044k862j30688n7229J57628
17971E46064o8698j01035K1126O9664K2347M9109q6838l7310k3806j47755o0040
17960A82828k9564L0556M3927Q8205K6869k1123k458o6666r0090o146J44289l9931
17948B60696j02594p3776l9725j255k1614l5942J12136j7387n6243k7007J23876
$$ y = [560645, 414914, 325720, 342384, 413139, 504059, 499183, 442054, 504205, 455339, 399596, 293750, 252329, 392339, 511735, 425485, 477211, 498631, 482962, 422075, 341064, 461956, 538696, 590491, 475515, 438666, 531601, 642020, 649638, 619853, 563053, 479762, 495594, 613833, 477994, 304016, 316846, 434443, 570869, 599177, 499930, 387843, 318926, 340173, 365153, 374514, 368762, 464794, 522727, 627226, 658259, 579215, 576353, 445665, 388436, 546064, 477366, 376331, 397457, 467121, 489468, 538577, 451739, 414429, 390623, 242868, 182828, 153264, 183820, 227747, 315952, 342821, 321698, 319240, 252574, 162484, 156338, 300627, 260696, 158102, 84326, 44601, 43346, 21732, -14210, 97926, 80539, 24296, -2711, 121165]
17937A21165J34802o7213k8457J3888k5339K4853J02347M9337q4559j10310l7504
17926I3010O6828Q2745r6382n9104J6354O566q5097k8887J48480P3237J02546
17915C20296L6714j60914r0330K0997n4013j9433l3166P5344O8083n6103j06131
17904A344L1344J67726m323N05R225K2292n7870j50726j7834k3063r5066k4193
17892a40639J22590J37499J97141J5830J75205J82593P2258K8717J13106O1791
17882I66091P1242J44747n501R3782K7538j00759j50745l1460j17231o398K3182
17871I14488l430l3843j0073J15615J3545Q426N4626J31614P5765j15417n6050
17860A095266J08684Q795o7632l2341n1021J3975L6796j81328j07717P9511j13616
$$ y = [121165, 255967, 188754, 160297, 174185, 148846, 173699, 276046, 325383, 240824, 130514, 93010, 159838, 242583, 146201, 87097, 103451, 110017, 24920, -3967, 144513, 217750, 320296, 357010, 196096, 105766, 126763, 72750, 53317, 20151, 95495, 163578, 107475, 1344, 32688, 200414, 196091, 196596, 205821, 228113, 170243, 19517, 1683, -21380, -116446, -140639, -18049, 119450, 316591, 332421, 507626, 690219, 762477, 791194, 904300, 966091, 1037333, 1182080, 1176579, 1270361, 1297899, 1197140, 1046395, 1014935, 897704, 891306, 914488, 911058, 877215, 867142, 982757, 996302, 1004728, 1059354, 1190968, 1266733, 1151316, 1095266, 1203950, 1212745, 1145113, 1112772, 1061751, 1075726, 1112522, 931194, 823477, 902988, 789372]
17849G89372j01956j28686l8513R3803O2623j29076j64810K8583J16556n7324
17839D70572Q8089K75303L04390J31783J04732J72899K13127O7539P1046M402
17829A903882j69861j62805n6520j51348l07229j78364m4570j7532o189J3522
17819H22986J17596n4563j6256M52N2842j1372L6857J3790K6623l3510P7602J18062
17807A151109j71059j53755j07920p980J4833l0259m1605n0641j64236r3525n2403
17796B92559N6657O2946J7083j2026M8858n2043j2943N6626K5354Q114R1394K8288
17784F10867L2693O5685J4861K9192m4320j35577p7753q1406j10592j5293M497
17773B92854j0463q6499n3289J34293N0290j25345j56841j7745K9527J32659j41092
$$ y = [789372, 687416, 558730, 520217, 614020, 676643, 547567, 382757, 411340, 527896, 470572, 558661, 833964, 1138354, 1270137, 1374869, 1547768, 1760895, 1828434, 1899480, 1903882, 1734021, 1571216, 1514696, 1363348, 1056119, 877755, 833185, 815653, 809464, 822986, 940582, 886019, 869763, 870215, 923057, 911685, 948542, 962332, 988955, 955445, 1033047, 1151109, 980050, 826295, 718375, 710395, 725228, 694969, 653364, 602723, 438487, 344962, 292559, 349216, 412162, 429245, 417219, 466077, 414034, 401091, 457717, 483071, 491185, 582579, 610867, 643560, 709245, 724106, 753298, 708978, 573401, 495648, 414242, 303650, 288357, 292854, 282391, 195892, 142603, 276896, 327186, 201841, 45000, 27255, 56782, 189441, 48349]
17762D8349L0298Q6239J8381J2778L3693n9906n1767q6019O6707l8208J4459O0071
17750A35075O7839J43524M2458n1087p3825L2052o5760p1965m8714o0346Q8353
17739A37604J04062n5632j04016r226Q7512m5755m4686K05080J38012j4671p0292
17728C27992j02756j18099Q392Q2546j29417N993l9267m6123L3458N0190j2268
17717F0641m9674J02562M572K6334P8517j49640q5758O8183O6730M4285m9121
17706A17631P5334J14939n1197j28404J32005N7852j48009j32193p1733k1860
17696e5635J66797k0493j23765j0388Q0195Q971K5416O600j6147K927J84417j4302
17684B34593j7311J8384o4825j03990L6861k2787p4465J11260J97275N921p6751
$$ y = [48349, 78647, 164886, 183267, 196045, 229738, 169832, 118065, 32046, 98753, 60545, 75004, 135075, 202914, 346438, 388896, 337809, 263984, 296036, 230276, 158311, 109597, 49251, 137604, 241666, 186034, 82018, 72792, 160304, 114549, 69863, 274943, 412955, 398284, 327992, 225236, 107137, 115529, 198075, 68658, 74651, 35384, -10739, 22719, 72909, 60641, 10967, 113529, 118101, 144435, 222952, 73312, -12446, 55737, 122467, 166752, 117631, 192965, 307904, 256707, 128303, 260308, 318160, 170151, 37958, -33775, -55635, 111162, 90669, -33096, -43484, 36711, 45682, 71098, 77698, 61551, 64478, 248895, 234593, 217282, 235666, 170841, 66851, 103712, 80925, 6460, 117720, 314995, 320916, 244165]
17673B44165J3481m7319K4421m693j04781p4304Q7431J52180k7275n2304j12894
17662I8108P0464K7068K6320J08758p2231k73753J3824M7058P4566q151j17547
17651e516O6118j0343N1545J4256p3238j47872J0215J12151n1j26087k6109Q2967
17639e1964J07455J4268p0280l6312L0861q3691J23035J33284Q2908J7509O8160
17628C35233K0630N839Q0716K21518J11768J05588L09330L30603L10541J70421
17618B002187J909l1848m4693k48756l88666l90694k32071j55641L8010R3793
17608F43530p9913r9259k6200J8811J96889K01320L29930L16685K14941J36212
17598A852946J04319j6412p3710m3187l58097m05265l02456j23182j64497r7060
$$ y = [244165, 257646, 210327, 234748, 230055, 125274, 50970, 138401, 290581, 263306, 211002, 98108, 168572, 195640, 221960, 330718, 258487, -15266, -1442, 45616, 120182, 112031, -5516, 60602, 50259, 101804, 116060, 42822, -105050, -94835, 17316, 17265, -108822, -134931, -51964, 55491, 69759, -521, -36833, -5972, -89663, 33372, 166656, 249564, 267073, 335233, 355863, 361702, 442418, 663936, 775704, 881292, 1190622, 1521225, 1831766, 2002187, 2004096, 1972248, 1927555, 1678799, 1290133, 899439, 667368, 511727, 549737, 643530, 563617, 464358, 438158, 456969, 653858, 855178, 1185108, 1501793, 1716734, 1852946, 1957265, 1940853, 1867143, 1823956, 1465859, 1060594, 758138, 634956, 470459, 373399]
17588C73399j47524j78874o1894J15755J24226l4212J62097J105j79597o3057
17578A11424l2946j8402J3644N4547Q0810n1068j21052J5359J22745j4031J08075
17567B69105j03324m6689J6751J8851l5282M178M8334q503l2525J7225o727j34046
17555G348o1399N8426J40637N9832K1037p1275k6896r039q7899P8642K2582n0383
17543H1613P9574Q2418q9607k4844n3238K4151n0419o2964q3358p1770N0992J02274
17531a5178J36270O8554J423M31o4742p67M0356n8476n5830K0382P246j9285j02452
17518d2068m8752r739J65665L9324j343j4917K7483l3304m3778q3862J1798J42885
17506A09392j3210n5133q8346N7890r6686P9584J23024p0792Q2989J69025j14597
$$ y = [373399, 225875, 47001, -14893, 100862, 225088, 190876, 352973, 354078, 174481, 111424, 78478, 60076, 73720, 128267, 209077, 158009, 36957, 52316, 175061, 161030, 269105, 165781, 119092, 135843, 154694, 119412, 123590, 171924, 163421, 130896, 148121, 141394, 7348, -54051, 4375, 145012, 204844, 225881, 154606, 127710, 118671, 30772, 109414, 131996, 81613, 161187, 243605, 153998, 129154, 75916, 100067, 49648, -13316, -96674, -168444, -117452, -15178, 121092, 189646, 191069, 191500, 126758, 125991, 166347, 107871, 52041, 72423, 79669, 60384, -42068, -90820, -100559, 65106, 104430, 103087, 88170, 115653, 82349, 38571, -45291, -33493, 109392, 96182, 41049, -47297, 10593, -86093, -6509, 116515, 45723, 128712, 297737, 183140]
17495A83140o2678j1046O905K8119p4190l39p7969l0918j2815m8602m4141O8249
17483g6285J5278r8725J9410j1874m3144q0525J35322J15451m406K0290J02223
17472I3015n8277l9717j12209o7235K0519J42258L7243j4467K3823j5453O0803
17461G0303n2808n7417N06N8155n0970l974p8669L7349K2721m681M1328O0040
17449D1883J12355R3928k6817P5347K32533P2984N6334j857O5035K0512j47792
17438E94445j53542q8130n3814M001N1078r6477j11022P004R7897m488m5777j26172
17426G5003p1791P2929R9811m2941n8005N4192P7199O801n7551j56779j9076J3590
17414f618l0452K7879M4411J2427p3085q9534K5191L3904O5495J09794J37545
$$ y = [183140, 120462, 109416, 116321, 144440, 70250, 69911, -8058, -38976, -51791, -100393, -144534, -76285, -61007, -159732, -140322, -152196, -195340, -275865, -140543, -25092, -29498, -9208, 93015, 34738, -4979, -117188, -184423, -163904, -21646, 15597, 1130, 24953, 9500, 70303, 17495, -39922, -39416, 18739, -32231, -36205, -114874, -77525, -54804, -59485, -18157, 41883, 154238, 248166, 221349, 296696, 529229, 602213, 658547, 656690, 721725, 742237, 594445, 440903, 352773, 298959, 302960, 354038, 257561, 146539, 153543, 251440, 246952, 201175, 75003, 3212, 76141, 175952, 133011, 75006, 129198, 206397, 213198, 155647, -1132, -20208, -6618, -37070, -9191, 35220, 47647, -25438, -114972, -89781, -55877, 9618, 119412, 256957]
17403B56957j14525m9082m9845o1878j0266o1667Q335n4044L6580P8145J0976
17392a0314q9167J458J35963K2825r3893P8569Q3182O0224j17052q5815j39109
17381a53129R709J90581J5439N7602J0261l3546K646n5894m7652O0033O7202k9416
17369I3836L4366L9673j44919n6158J56304o897n815r2567p508J7152N1367p337
17357G1497j71344J4187M6597J8976R1515r8598l1133J32525m7545j00504r0704
17346a64531l0188l7312J46673J78670j334q6274r5692p8621L3480Q4041l9957
17335i1045j3669K9960o1287q7835N4989J2476L2508M9445J13761J47899p1496
17324A15706q1511p770l056q5686o5399R5247P5202N9985j4075j34247J7922l261
$$ y = [256957, 142432, 93350, 43505, -18373, -28639, -90306, -81971, -136015, -99435, -21290, -10314, -99481, -98023, 37940, 60765, -33128, 45441, 128623, 188847, 71795, -14020, -153129, -143420, 47161, 62600, 120202, 130463, 96917, 99563, 43669, -3983, 56050, 123252, 93836, 128202, 167875, 22956, -33202, 123102, 116205, 110390, 17823, 10315, 27467, 78834, 71497, -99847, -85660, -39063, -20087, 71428, -27170, -58303, 74222, 26677, -73827, -164531, -194719, -232031, -85358, 93312, 91978, 5704, -89988, -168609, -135129, -51088, -91045, -104714, -74754, -136041, -223876, -168887, -156411, -123903, -74458, 39303, 187202, 115706, 34195, 26425, 23369, -62317, -127716, -32469, 42733, 102718, 88643, -45604, -27682, -30943]
17312c0943J3021j1639O0632J00079n8770j68176j3721n04J2873Q9654P4457k9310
17300C7653O036l8280J4770k2395L3776M8267r7672j39855P5679O7744o4291j08851
17288a87419O2834P4826m6969n7901J3168j19834n9106P6545R8116j5344J0271
17277a50813J00878N7300j20610j35134P8072K2729o1253l1508r4292p4960J49208
17266b60383K12175J61227P0824P5779q5727j26301p2062J9114p2685p06K0922
17255e7823J9463j11711O8439J17966J3011r4750M0643J3037j7989m0275M5467
17244d522K7174l949M230j92085M0681O9331o5864l0122j16130N2347M228Q262
17232b06419j4468k1353n0863Q6240J14589K5093L2533l5286p0081M8494K7757
$$ y = [-30943, -17922, -29561, 31071, 131150, 72380, -95796, -109517, -110021, -97148, -7494, 66963, 37653, 43689, 5409, 20179, -2216, 31560, 79827, -17845, -157700, -82021, -14277, -78568, -187419, -124585, -49759, -96728, -154629, -141461, -261295, -320401, -243856, -145740, -161084, -150813, -49935, 7365, -113245, -248379, -170307, -147578, -208831, -240339, -334631, -409591, -260383, -48208, 113019, 183843, 259622, 173895, 47594, -24468, -5354, -78039, -78745, -57823, -38360, -150071, -81632, 36334, 49345, -45405, -4762, 8275, -9714, -49989, -4522, 22652, 18703, 22933, -169152, -128471, -59140, -125004, -155126, -271256, -218909, -214681, -206419, -220887, -242240, -293103, -206863, -92274, -67181, -34648, -69934, -140015, -91521, -63764]
17221f3764l2066L3326j6183p7718J02978J43904p7261N0327P7290m3265j47585
17210e0017K9792K7938k8856P522p969Q16L7925J4108k88K531J6422L8027o959
17197H0992O313j40191j394L7536l0138o2647R3543L3429m3469m1587J8363M7175
17185b075q417n4882J97773Q9881j82534j42729k1474K8886R000k6978o5771J20829
17173e8491N8392q2826L710J4844N4862P7950l7186k6871J06982l3349p0763Q6158
17161I3412P7310J593r3347j64897k6680M1383n4405j719l6872J55619K27335
17150B18732j0320j55554n6310l5031q9L0563L4626M7572m0155j19807m1538P112
17138a20199K1391J7385J56297J67313o8602j50349l7822m8581J9789K6972O8232
$$ y = [-63764, -95830, -62504, -78687, -156405, -53427, 90477, 13216, 63543, 140833, 97568, -50017, -20225, 7713, -21143, -13621, -21590, -20774, 17151, 31259, 30971, 33502, 49924, 87951, 80992, 87305, -52886, -54280, -16744, -46882, -109529, -15986, 17443, -26026, -67613, -49250, -2075, -10492, -65374, 132399, 222280, 39746, -102983, -124457, -95571, -86571, -113549, -179320, -58491, -99, -82925, -79215, -64371, -9509, 68441, 31255, 4384, 111366, 78017, 7254, 93412, 170722, 172315, 78968, -85929, -112609, -71226, -125631, -127350, -164222, -8603, 218732, 208412, 52858, -3452, -38483, -38572, -8009, 26617, 74189, 34034, -85773, -127311, -120199, -98808, -81423, 74874, 242187, 173585, 23236, -14586, -63167, -43378, -16406, 51826]
17127E1826m1122N2733n1035n92o0895r3634m3380N8956Q4257K758k2121q6190
17115a48439n4355N9005J36925n0434k6932N9270M7257j07674p4798k4097p033
17104a91305N3488k1550J32256P7897j832m4925o9456N2808O2739q0056j0784
17093d0720Q816o383l9145L8575j8929J6837Q520M3695P7335k8511o0829M0083
17081C9344O2540J00174p6970j47971r703m5917M7605N5142J4089L6364R3395
17070A68092M1144n5487j8519m975j1107o0098n589L898L0063J00626m9327j38863
17058a42j5037p5673j8433O7451J34325R453j01525q4786l5346o7219J86833J64501
17046A64402M1950j12813j46271N4664k8452j51486m8843P3842J07213O2574j37321
$$ y = [51826, 10704, 63437, 12402, 11810, -49085, -142719, -186099, -127143, -42886, -40128, -62249, -148439, -202794, -143789, -6864, -57298, -84230, -24960, 22297, -85377, -160175, -184272, -191305, -137817, -159367, -27111, 50786, 48954, 4029, -65427, -12619, 50120, -29936, -40720, -31904, -38287, -77432, -38857, -57786, -40949, -32429, 11266, 88601, 60090, -739, 39344, 101884, 202058, 125088, -22883, -32586, -78503, -30898, 24244, 38333, 74697, 168092, 209236, 153749, 135230, 130255, 119148, 59050, 53461, 57359, 87422, 188048, 138721, -142, -15179, -90852, -109285, -41834, 92491, 101944, 419, -84367, -119713, -186932, -99, 164402, 206352, 93539, -52732, 1932, -26520, -178006, -226849, -153007, -45794, 16780, -120541]
17035a20541n4987J58546M0230O8701O9508n4632m3857K0404m6727j23451K8610
17024e8196Q4995N1886N5706n9409n6748o8358j29646l4187Q4434k554o1985q0213
17012b74275L5845J86924M1713N414m3713j01010p7089L2960R9521Q6266q3334
17001i0778k2443J29100m848Q320R984L3520j05598q5148K0173K0257K3291J1991
16989e2179j0250o6564R826J14074j6592n0059q3804l6651J35652k0647M6033
16978c1161O4537j1586j1237k1856l0602Q0350K2395r3609l5540n1196k4049L0683
16966a12871P0501L7707k5978J05213R1778r3537j00194m5652L5328l5003l283
16955g5991L564j159n9402K7166O2662M6544k8320P3354j03187j15984j18480
$$ y = [-120541, -175528, -16982, 23248, 91949, 161457, 106825, 62968, 83372, 36645, -86806, -58196, 26799, 78685, 134391, 74982, 18234, -50124, -179770, -213957, -129523, -132077, -194062, -274275, -238430, -51506, -9793, -4379, -48092, -149102, -226191, -193231, -93710, -7444, -90778, -113221, 15879, 11031, 19351, 29335, 62855, -42743, -127891, -107718, -87461, -64170, -52179, -62429, -128993, -119167, -5093, -21685, -71744, -155548, -192199, -56547, -77194, -31161, 33376, 21790, 10553, -11303, -41905, 38445, 60840, -32769, -68309, -119505, -143554, -112871, -42370, -4663, -30641, 74572, 166350, 72813, -27381, -73033, -37705, -72708, -75991, -72427, -73586, -132988, -105822, -43160, 3384, -24936, 48418, -54769, -170753, -289233]
16944b89233Q3703J20240j3495J280Q974J72652O1872o4277m4189K229o1429n965
16932b7638l465P5935m9400P7775R1694j33521j60566N0782M5386l6001J09770
16921D0751K7581j8942K1224m0992O9899J7692m2680p2232O968K3766j7705M0662
16909E5992j884o3768L246n6314p3284N6425J604n4052m7419R4998r978m3642
16897a38076L4068N436n1701k1195R6860L0044L4324M3309K9833k6515p3390j15654
16885a52657L1208J04417M5913l1758M6359J23149j12130k4945J26825j8256k7146
16874A10979O5677q473r844j4898j35604O8042J01398j49l8565K7956m3136l4449
16862H8934k4067n6749o6733M4904P1869K0492j1226o4981L9542O4741j07939
$$ y = [-289233, -205530, -85290, -98785, -97505, -88531, 84121, 145993, 81716, 37527, 39756, -21673, -27638, -31103, 44832, -4568, 73207, 164901, 31380, -129186, -78404, -33018, -69019, 40751, 68332, 49390, 70614, 29622, 99521, 117213, 74533, 2301, 9269, 33035, 15330, 55992, 54108, -9660, -6414, -62728, -136012, -79587, -77983, -132035, -179454, -84456, -94434, -138076, -104008, -98572, -150273, -171468, -74608, -44564, -10240, 33069, 62902, 36387, -37003, -152657, -121449, -17032, 28881, -2877, 43482, 166631, 54501, 29556, 156381, 138125, 110979, 176656, 168183, 158339, 143441, 7837, 75879, 177277, 177128, 138563, 166519, 123383, 88934, 64867, 8118, -58615, -13711, 58158, 78650, 67424, 2443, 41985, 106726, -1213]
16851a213j015l0234k4238N4403K2640l2003J1499N8497R6013j18572k1394O2851
16839G7234r503O7443l3988p5743l9284M59O1942o4995l4135j15459M3920J15363
16827f746J1943o8310m0470j7434m5574M0022R8083J9005p0180l0336o119o3998
16815a80114j1707P6210K9567K7009l0522p1430j23136M1951J4570K6870P3349
16804a27383M9763J7250J5484j3632j23841M9883J49600P4615O6532J15856k1583
16793B52544j55660j55796K247q19K005j0983j43097j26833k0228N3248N7721
16782b45651J40173Q2567P0966j2704m0122K2810Q1102j48928p6444l7482M7040
16771a16673J63988O317j48853J0415o791l3203p1724N1338L1358p030J08451
$$ y = [-1213, -2228, -32462, -56700, -2297, 20343, -11660, -161, 58336, 154349, 35777, 14383, 77234, 67731, 135174, 101186, 25443, -13841, -13382, 48560, -16435, -50570, -166029, -122109, -6746, 5197, -63113, -103583, -121017, -166591, -126569, -28486, -9481, -79661, -109997, -116116, -180114, -191821, -115611, -86044, -59035, -89557, -160987, -284123, -242172, -227602, -200732, -127383, -77620, -60370, -44886, -58518, -182359, -132476, 17124, 91739, 158271, 274127, 252544, 96884, -58912, -56665, -57484, -55479, -66462, -209559, -336392, -356620, -303372, -245651, -105478, -22911, 48055, 35351, -4771, 18039, 99141, -49787, -126231, -163713, -116673, 47315, 53632, -95221, -84806, -91597, -124800, -196524, -145186, -113828, -120858, -12407]
16760a2407R2173PR64l8034q5024n7503O5411k8166O964l6148l1584N5055Q9788
16747B1496n253P1267N7612j848j54363r6945J13058J09768Q7436K4219j7652
16736B08795j29928K9552K0399r2315m3694k2699K8312j00489m2216K6468L0067
16725h7748J07795j0553j27563K785k2941K6536R9838k3303K0212N9528n4183
16714i597p8288j4199P6920o3887o760M0798l7420J34354O5949j32423j19648
16703a44201j6847l8454Q2260J3978l9246k2071R6006K1216J16922l4214l7487
16692b138O2694q8406P0710K4494j01030p8758J8372R0628j5155l1884R7523k3238
16680B3812m8072n4318j21762P968P734M1722Q0669J54590o5092J2782p5973j71360
$$ y = [-12407, 79766, 79773, 80737, 42703, -42321, -99824, -34413, -62579, -55615, -91763, -123347, -68292, 21496, 16243, 87510, 145122, 143274, -11089, -108034, 5024, 114792, 202228, 226447, 208795, 78867, 108419, 128818, 36503, -7191, -29890, -1578, -102067, -144283, -117815, -87748, 20047, 9494, -118069, -115284, -138225, -111689, -11851, -35154, -14942, 44586, -9597, -87885, -102084, -25164, -89051, -95811, -55013, -92433, 41921, 107870, -24553, -144201, -161048, -199502, -117242, -103264, -142510, -164581, -68575, -47359, 69563, 35349, -2138, 60556, -27850, 42860, 67354, -33676, -112434, -94062, -3434, -18589, -50473, 47050, 23812, -24260, -78578, -200340, -192372, -184638, -142916, -62247, 92343, 27251, 40033, -35940, -207300]
16668b07300N8695R9896j8233n3573J7035j45205q548J76102J20867p6890k5692
16657f2846J8275J67628R68m5719N253Q4378l6098j28135l7543L9211P4489j7949
16645F1912j60545l0698L4395P7254M1829j35338O363P5959K17129N5019p3034
16634A70245m4608p1916R7979L4551j5797j06007j62158q2637K4634M8380N2582
16623e4752l1401k5906J7942m5700P8799O3416M8529J4565N2174j26925j03353
16612a12612m4623J16089M9781M2611J21119L6400K8625k4414m4284M4974j36318
16601G7348j14424N7734P9441j3424q728j04173k7927p7839K6141q0692q2234
16590b68777J70118J85934R8908j23521n5321k810M3530q619l9846r00M7389J03476
$$ y = [-207300, -148605, -48709, -66942, -120515, -103480, -248685, -257233, -81131, 39736, -37154, -62846, -44571, 123057, 124025, 78306, 83559, 167937, 131839, 3704, -33839, 5372, 79861, 61912, -98633, -129331, -94936, -17682, 24147, -111191, -104828, -28869, 188260, 243279, 170245, 125637, 53721, 151700, 186251, 170454, 64447, -97711, -180348, -155714, -107334, -54752, -86153, -112059, -94117, -139817, -61018, 2398, 50927, 65492, 117666, -9259, -112612, -157235, -41146, 8635, 51246, 172365, 208765, 237390, 212976, 168692, 213666, 77348, -37076, 20658, 100099, 86675, 77947, -26226, -54153, -131992, -105851, -186543, -268777, -98659, 87275, 186183, 62662, 7341, 4531, 48061, 39442, -404, -1304, 46085, 149561]
16578A49561L8295l9434q6922o0149L0820j2546k4107j8232l7531k3760N6791
16567b7214M2446m4305J1566j2018P397Q421J1708q4624j17583O7568P2803J32898
16555F9063J09131M1457p9881j31527m0168k6339l1244k4588k5607M0112k5208
16544a24799r3912K5369M5092K4245o7938N2213J5974q9462k933L5713N4361r4696
16532b20773M299J0848L6279J12590j5513J0253O2723L7420N1924J8214p7760
16521C0504M1773R70j12643q7314L3827P2761Q1684J07366r011l9131p6368l7229
16509G189P4043j7744n6391m1281l4448O6382j5188K124l9064l3938l1585j5709
16497a35610l1936M8803J20376K6141l8169J5926n11M445Q3647o5534j05054k4196
$$ y = [149561, 187856, 148422, 61500, 1351, 32171, 19625, -4482, -22714, -60245, -84005, -27214, 15232, -29073, -17507, -29525, -22128, -13707, -1999, -86623, -204206, -136638, -63835, 69063, 178194, 219651, 139770, 8243, -31925, -58264, -89508, -114096, -139703, -99591, -124799, -218711, -193342, -148250, -124005, -191943, -139730, -123756, -213218, -216151, -180438, -126077, -220773, -216474, -205626, -169347, -56757, -72270, -62017, 706, 38126, 90050, 108264, 30504, 72277, 73247, -39396, -126710, -92883, -20122, 61562, 168928, 159917, 120786, 44418, 7189, 81232, 63488, 7097, -34184, -68632, -2250, -17438, -15314, -54378, -88316, -119901, -135610, -167546, -118743, 1633, 27774, -10395, 5531, 5020, 9465, 93112, 27578, -77476, -101672]
16485a01672M9851J44417m7097L4941J56713N648j15986j5416M3192j1256j85102
16474d1767j03942J1471J51569P4222K351K7866p2232k7183j3292j6027K7558
16463B0594o5100o0311O0607p3876n6601O0099J38051M3463R68o1427N5097r4197
16451c2633M6810J67620L2602L672r8136j05598J0654K2009L0996k8146m4056
16440E794p6347J2853M8596p457L7639M8647l003j37066R581j1954K5759J68999
16428A22041n608j00138l2240Q0239r3963j23800j5260R9525R575o4568j03029
16417b27226O3323J17683m2477j960K5081J222n1096J12253o5657j40172l2466
16406b41492J34453P7211N4312K9293o5277J7740q2983p3296k3968L3190O5992
$$ y = [-101672, -51821, 92596, 45499, 80440, 237153, 242801, 126815, 111399, 154591, 143335, -41767, -145709, -134238, 17331, 91553, 93904, 121770, 49538, 22355, 9063, -6964, 20594, -44506, -104817, -44210, -118086, -174687, -114588, 23463, 66926, 67894, 6467, 61564, -32633, 14177, 181797, 214399, 218071, 119935, 14337, 24991, 47000, 77996, 49850, 5794, -70553, -57700, -9104, -16561, 21078, 69725, 66722, -70344, -60763, -72717, -46958, 122041, 116433, 16295, -15945, 64294, -29669, -153469, -168729, -69204, -59629, -124197, -227226, -163903, -46220, -88697, -90657, -65576, -64354, -115450, -3197, -68854, -209026, -241492, -107039, -29828, 24484, 53777, -11500, 6240, -76743, -150039, -174007, -140817, -74825]
16395g4825n299M6037l1405k6455P4705n0257j20252L1687l9712P990k3630N335
16383b06081J40722J0074p3052l0637M6115M8336M0033N1262J8586j08848L4607
16372b8883o2940m0899P9480Q5721r0264j17161k551K7560L8312O1149R0436J9819
16360E9779m5287r6591M614O7913N9756k9976N8671O8836k0822j01460J21236
16349A46669K3438m4641j13710L5299J07468M8031r0456r2812l0409O2473R1434
16338A42784k9311j31430K6771R3141K0097n4557j66452j25540J21386J75415
16328G2304L1208j16296j96274k6212J22826O1043L4458L5885j3430J2070r9851
16317h2269l5499M4332J2768M8283L894n6498J06906N5813n4117q535q8251m9609
$$ y = [-74825, -80124, -34087, -65492, -91947, -17242, -67499, -187751, -156064, -195776, -187786, -211416, -206081, -65359, -55285, -128337, -158974, -112859, -64523, -24490, 26772, 45358, -63490, -28883, -91823, -132722, -53242, 32479, -57785, -174946, -177497, -149937, -111625, -50476, 39960, 59779, 14492, -82099, -77485, -9572, 50184, 20208, 78879, 147715, 126893, 25433, 146669, 170107, 125466, 11756, 47055, 154523, 202554, 112098, 19286, -11123, 51350, 142784, 113473, -17957, 8814, 101955, 122052, 67495, -98957, -224497, -103111, 72304, 103512, -12784, -209058, -235270, -112444, -51401, -16943, 18942, 5512, 17582, -82269, -117768, -73436, -60668, -12385, -8491, -64989, 41917, 97730, 43613, 35078, -53173, -102782]
16305a02782M17p2525p4646L2151O5275n8374l3846Q8661J73191O766m4887o1521
16293h2120J1114K5288m6053K0384J2066N2620l5344q920K9907R3767P5209J43
16281A48061q6102k1196N866k4924j35489l7398P7184P9666k4379M5887K3235
16270E0411Q2719m5864J6285M3845n5170l9307j3151k1679j8923J7981M8852L1709
16258I7708p8025p8003n8317O544R7742K5974k9398r3430p9512m3495j9255J4209
16246b37258O5887L3070K9151m7416J6760Q0120K7598L8520O3633J344m2646m4703
16234a5940J6308O1582o7863r2442o473Q0736N4477M737n1175l2166n2155k803
16222a03177K3447o8664n3243K3534Q9327l4063j11324J99587K14203j42667l9615
$$ y = [-102782, -102365, -174890, -249536, -217385, -152110, -210484, -244330, -155669, 17522, 24288, -20599, -82120, -71006, -45718, -91771, -71387, -59321, -6701, -42045, -50965, -21058, 72709, 147918, 148061, 61959, 40763, 46629, 21705, -113784, -151182, -73998, 5668, -18711, 27176, 50411, 133130, 87266, 103551, 147396, 92226, 52919, 39768, 18089, -834, 17147, 65999, 97708, 19683, -58320, -116637, -110093, -12351, 13623, -15775, -109205, -188717, -232212, -251467, -237258, -171371, -138301, -109150, -156566, -139806, -59686, -32088, 6432, 70065, 71409, 28763, -15940, 368, 61950, -5913, -98355, -104828, -24092, 30385, 35122, -16053, -48219, -100374, -103177, -79730, -148394, -201637, -178103, -88776, -122839, -234163, -34576, 179627, 36960, -2655]
16211b655N4663k1882l1156j8006J5585M4302J351n5000k4499L9398R5033l3970
16199F3164l4756o1930j8313p4498P8998N6110j25606o0747M9820J8222r4475
16188b04011J73694J36450P909j17599j53158j248J19641n9892k9395Q1091j8715
16177f5233J13709N0484j3504L2774M1860j22056j85026O2349M3619j692m3203
16166h5919R5615R7099J063P0201K2876j02744j09792N8190j0064N359M8041l3821
16154E6104l7396M1305m4794r1373n3165P181Q0688P7520o852l9626M5778m1441
16142f071j6594L003N6694P0735J065j61291R3490P9502k3907k0667j15515N1028
16130A1472m823m7745L5824J4851K3482N1375j3229j1900J05046j4091m8477n6237
$$ y = [-2655, 52008, 30126, -1030, -19036, -3451, 40851, 42202, -12798, -37297, 2101, 97134, 63164, 28408, -33522, -51835, -126333, -47335, 8775, -116831, -177578, -127758, -109536, -204011, -30317, 106133, 114042, -3557, -156715, -157963, -38322, -98214, -127609, -46518, -65233, 48476, 98960, 85456, 118230, 160090, 38034, -146992, -84643, -41024, -42716, -85919, 9696, 106795, 107858, 178059, 200935, 98191, -11601, 46589, 36525, 41884, 89925, 56104, 18708, 60013, 15219, -76154, -129319, -122138, -41450, 36070, 29218, -10408, 35370, -6071, -22665, -19662, 37032, 107767, 108832, -52459, 41031, 120533, 96626, 75959, -39556, 11472, 6649, -41096, -5272, 9579, 33061, 84436, 71207, 59307, 164353, 150262, 101785, 45548]
16118D5548R5233N3487k9385l901j41019o6820N9021J08413o1331J6576k093j62519
16106h8790J7689N0794K3648r7752q3543J51833N1399j15822j23J85742K3214
16095A18289m9659m3519p3928n9505J0385J40718M8023r0123k7288L3343n32K3382
16083B9586O4075M3746J5170q0347q127J5377j26984j18633N3865J26838j00027
16072h5461q1525J16001J14919L3002j23058n4716J8800O2866O8067M7965n0544
16061F6316k6062J9514L9360j34565K6202N1272l3043q2334j46799n875J97916
16050b8098O7818k6082M5500p221k798q2599n0814q385k0689J2585M2957m6641
16038a04467k2889K1464Q1554K4342m9778o115R8834J13591M645j40501j15156
$$ y = [45548, 140781, 194268, 164883, 160982, 19963, -46857, 12164, 120577, 59246, 75822, 73729, -88790, -71101, -20307, 3341, -94411, -177954, -26121, 25278, -90544, -90667, 95075, 118289, 68630, 25111, -48817, -108322, -97937, 42781, 90804, 681, -26607, 6736, 6204, 29586, 93661, 137407, 152577, 72230, 64103, 79480, -47504, -166137, -112272, 14566, -85461, -166986, -50985, 63934, 96936, -26122, -80838, -62038, 828, 68895, 116860, 66316, 40254, 59768, 99128, -35437, -9235, 42037, 8994, -73340, -220139, -226014, -28098, 39720, 13638, 59138, 51917, 49119, -33480, -84294, -92679, -113368, -100783, -57826, -104467, -127356, -105892, -24338, 4, -49774, -55889, 42945, 156536, 161181, 20680, -94476]
16027i4476J3385l1530M862K4380J0193R5556k718r2774j08954K0510O0077K3433
16015g8056L7348o9298j1037j02071r438N0920K9427k0526N5498R7942m3252l701
16003f6244O7811j21613J0723R8853m2217P575P839M2489L1231m8909p7275L2061
15991e7676o813O0068j498O8397q7767J5440K0129j10353r41L9023q9187k4115
15979a75293R7622j5330M7645p532L2125p8543j08782M7421P3960K3280N6739
15968f688J01989p0750m7808r3933q1972K5668P5571l7292q4096K6423o465n2827
15956b52180N0340j2403P237J9563L4755N0353J30100m5584N5970l1458j39510
15945a32817K3520R4883P4957J2357m4318p3192n4014L7618J6641M8756o0896
$$ y = [-94476, -81091, -112621, -107759, -83379, -73186, 22370, 19652, -73122, -182076, -161566, -101489, -78056, -40708, -110006, -121043, -223114, -232552, -181632, -152205, -172731, -117233, -19291, -62543, -66244, 1567, -120046, -109323, -10470, -52687, -45112, -37273, 5216, 36447, -12462, -89737, -57676, -64489, -4421, -5919, 62478, -25289, -9849, 10280, -100073, -101014, -61991, -151178, -175293, -77671, -93001, -45356, -52888, -20763, -99306, -208088, -160667, -86707, -63427, -6688, 95301, 24551, -23257, -117190, -199162, -173494, -97923, -135215, -219311, -192888, -199353, -252180, -201840, -214243, -207006, -187443, -152688, -102335, 27765, -17819, 38151, 6693, -132817, -109297, -14414, 60543, 72900, 28582, -44610, -98624, -61006, -44365, 4391, -56505]
15934e6505n0313Q386J09358K9647j06123l4086Q9027j13221q6929L6485Q3247
15923i1027P2448j3703p0872l818O4534P7324m0332l9391o7762J17566M0915J42401
15911A88283p2153R081K457p9534j28034p9702K6662l008j6211P0710J80949K7441
15899A26941J1736J326n3609j21102k9946P0627l3692p4167q7112K1024J91983
15888B4009J7084k8084j11493j4611M1621k3997k7997j09504J7086J45749N4337
15877a5800n2334M6698k2945n3668R481Q3345J19087j13913l6177O7327P2608
15866A03709j1340K1828n9037J1275L2609o7032p5391L9351J07271K9887r9001
15855C4129J3302M2911P7929k5259l0281J7928r7256o0383j29327o2290J08692
$$ y = [-56505, -106818, -98432, 10926, 40573, -65550, -99636, -10609, -123830, -210759, -174274, -91027, -18579, -32282, -103154, -106972, -42438, 34886, -5446, -44837, -112599, 4967, 45882, 188283, 116130, 125211, 127668, 48134, -79900, -159602, -132940, -135948, -152159, -81449, 99500, 126941, 138677, 140003, 86394, -34708, -64654, 5973, -27719, -101886, -188998, -167974, 24009, 41093, 13009, -98484, -113095, -71474, -95471, -123468, -232972, -215886, -70137, -15800, -68134, -21436, -44381, -98049, -88568, -5223, 113864, -49, -36226, 31101, 103709, 92369, 114197, 55160, 66435, 99044, 32012, -43379, -4028, 103243, 133130, 34129, 47431, 90342, 168271, 143012, 112731, 130659, 33403, -26980, -156307, -218597, -109905]
15844a09905O337p3860J5608J22788m9784n8260q58L81M2060K9393j6049M7922
15832d4227Q0037J8717k11005l8544j0513n8835j6888N3619K4099O8872J8184
15821a16484L6056J25645P6134p7248m4871p0844J4875M5330Q7467j06488K8493
15810a935k3743K280J06625k7120k0971l5067o9072N858P619j4812L9804k0797
15798e1331p3401o7678L6053Q222J07819l2043j52296j5630O4256n959Q9283N2375
15786d0330K6438R742j0548o0448J3678l4235M4961k3092N3518P873K2530O9555
15774G9642M3837j23265n7999L3163j0782m5289l0172l4493M6207K7822k6212
15763i7541J21317o834j11499l4278J1810J12419K8506o9133J3216K2601J27561
$$ y = [-109905, -103568, -177428, -161820, -39032, -88816, -147076, -147934, -147553, -105493, -76100, -92149, -44227, 35810, 54527, -156478, -195022, -205535, -264370, -281258, -227639, -203540, -134668, -116484, -80428, 45217, 121351, 44103, -768, -71612, -56737, -11407, 76060, -30428, -1935, -25678, -23398, 83227, 56107, 35136, 69, -69003, -63145, -55526, -70338, -30534, -51331, -124732, -192410, -156357, -148135, -40316, -72359, -224655, -240285, -176029, -181988, -92705, -40330, -13892, -4150, -14698, -75146, -61468, -95703, -50742, -73834, -20316, -12443, 10087, 79642, 123479, 214, -57785, -24622, -35404, -80693, -110865, -145358, -99151, -71329, -97541, 23776, 16942, -94557, -128835, -117025, -4606, 23900, -45233, -32017, -9416, 118145]
15752A18145o4654j06303j6568M1338L5061l851m446n5084k8562O6642J1148r8538
15740a05672j43157m2090R7305J54057J26149j25654r8028l1780M0092m8077O0618
15729a16237J8248j00026n1896O8893j1581k9180Q4268O9386n4405l6783l41Q2175
15717g7479k9288j13858J38247K11580k0153j79827p3215P637o2490l4544j1249
15706b44639p6597P292J47800K04033N0731n5589o8681n7488m1548j51320Q5458
15695b00548K5751M6430M2361Q9059L9425r6107j2195L0163k693N957j8248o5038
15683a15683j9210j4239k646N7281p4340L7228N9565O7882k2459M626l649M7844
15671B2200m2445m4751Q7027Q2346J016o4073Q6636k2639j10885N1165J0481j58201
$$ y = [118145, 53491, -52812, -69380, -28042, 7019, 3168, -1278, -56362, -84924, -18282, -7134, -105672, -248829, -290919, -193614, -39557, 86592, -39062, -137090, -168870, -128778, -176855, -116237, -97989, -198015, -249911, -181018, -192599, -221779, -137511, -68125, -122530, -159313, -159654, -77479, -106767, -220625, -82378, 129202, 109049, -70778, -143993, -136356, -198846, -233390, -244639, -321236, -313944, -166144, 37889, 88620, 33031, -35650, -93138, -134686, -286006, -200548, -174797, -128367, -86006, 3053, 42478, -53629, -65824, -35661, -38354, -32397, -50645, -115683, -134893, -149132, -151778, -94497, -168837, -131609, -72044, -4162, -26621, -21995, -25644, 22200, -20245, -64996, 22031, 104377, 105393, 41320, 127956, 105317, -5568, 45597, 56078, -102123]
15659a02123n9165N7325p6428O9576L4461o5501m2909m7319L0526Q7086k3532
15648a38003q568P5421M4871q4071j56905N2090O8893M3957j4166k9549L3477
15637a12553j3919O2165J13338J2282m7866j73667J49833J52891j64084o6175
15627h7755J5567L3628j2128Q0475R5699K9468l6836j69669m6307o6638J2713
15616a51783M3319P4132R761P1627j5998K8261Q0975l4937m8870L0558k2600n0370
15604A4075m096L1067k0179J32339N8723k5573p529j18254j38133p2734r4602
15593b44896J8702j195J03821J97645L339j24874j0773L7397L5955m8779j1429
15582d5087R396K3998l9904P237P32K0204J13245o7799j09663Q8484K715p8593
$$ y = [-102123, -161288, -103963, -180391, -110815, -76354, -141855, -184764, -232083, -201557, -114471, -138003, -146571, -71150, -26279, -110350, -267255, -215165, -146272, -102315, -116481, -146030, -112553, -126472, -64307, 49031, 61313, 13447, -160220, -10387, 142504, -21580, -87755, -72188, -38560, -50688, 29787, 125486, 154954, 118118, -51551, -97858, -164496, -151783, -108464, -34332, -24571, 47056, 31058, 59319, 140294, 105357, 56487, 87045, 64445, 14075, 9979, 41046, 20867, 153206, 211929, 186356, 178827, 60573, -77560, -150294, -244896, -226194, -227389, -123568, 74077, 77416, -47458, -58231, -20834, 15121, -33658, -45087, -35691, -11693, -51597, -44360, -43628, -23424, 89821, 22022, -87641, 843, 3558, -75035]
15570g5035j4879J3451L9217l3647m198K0680O9149Q149p9693n1409J3489q0296
15558a75022J3141k8995p6908J8399R178P9918O4003P1394q813O971k0751Q2924
15546C5439J8655p2771O1742P7063j3666p6935l980L1133J3142J0740L964j797
15534H2729j6830J4071R596p3384j03027k7720J64423L7979m022L8618L2316R0749
15522B45498M2966K2277m2651l2275o7089j77049n5473j8628k5336q7852j1080
15511b06692R4784O4151n6782R3716k8454n6407N4878L1976k040j031j9043J04318
15499G3374K4012M1657N2981j19171o3004j5936O7225l488k3313P347r3837p3057
15487a25210m1962L3093J00509N0141j26338k5219o5518J0009P0783q4767j21770
$$ y = [-75035, -89914, -76463, -37246, -70893, -75091, -54411, 14738, 22887, -56806, -108215, -94726, -175022, -161881, -190876, -267784, -249385, -240207, -160289, -96286, -24892, -33705, -26734, -47485, 35439, 54094, -18677, 43065, 120128, 106462, 29527, 25547, 56680, 69822, 80562, 84526, 82729, 65899, 79970, 89566, 16182, -86845, -114565, 49858, 87837, 83815, 122433, 154749, 245498, 288464, 310741, 268090, 235815, 168726, -8323, -63796, -82424, -107760, -195612, -206692, -111908, -47757, -104539, -10823, -39277, -95684, -40806, -8830, -10870, -11901, -30944, 73374, 97386, 139043, 192024, 72853, 9849, -6087, 61138, 57650, 34337, 41684, -52153, -125210, -167172, -134079, -33570, 16571, -109767, -134986, -200504, -190495, -119712, -204479, -326249]
15476c26249J05684J24314J04133K7623j9842j36469o3081N4177O573j4934J18607
15465a9464J04735M4124k3508j6866j8950r3553k4922L5811j4017k680O9534J47451
15453A87695n0776j16908P040J1333q0174j54898O429Q3520j740O6182m5796K3178
15441f4915j29209M9467R2453K9827m817L8451l103l3681r098R3475l5536j2485
15429A0829o3626p3468P2300J88157M6502l5610o1040j27503j25169L8384J13133
15418a7111P8512m640M7162K9089K9816K8728k4888P3147l0016o1477p1302k6221
15406E0799P7991P3948n4095o6895n4999N4563J05692Q7799o8898O4360J48870
15395D19135R6498J29431o0410o7507j04497j82390n5910j34165j05866j9700
$$ y = [-326249, -220565, -96251, 7882, 35505, 15663, -120806, -183887, -129710, -123137, -138071, -19464, 85271, 129395, 105887, 89021, 70071, -23482, -48404, -12593, -26610, -29290, 40244, 187695, 136919, 20011, 27051, 38384, -41790, -196688, -190259, -106739, -108479, -42297, -88093, -64915, -194124, -144657, -52204, -22377, -27194, 11257, 8154, -25527, -34625, 58850, 23314, 10829, -52797, -126265, -53965, 134192, 180694, 145084, 84044, -43459, -168628, -130244, -17111, 61401, 56761, 103923, 133012, 162828, 191556, 166668, 239815, 209799, 148322, 77020, 50799, 128790, 202738, 148643, 81748, 26749, 81312, 187004, 274803, 205905, 270265, 419135, 515633, 645064, 584654, 517147, 412650, 230260, 174350, 40185, -65681, -85381]
15385h5381J5838M5172m292p2469k5597l0224n2922l7968N9097P3611J67789r503
15373D3151p2667L9809M5902j938j7179O646j33504r8084p1369J24441J38294
15362C502L0642l2782k04493m2560K3925R9656J28678q773R4485K9859k8256j19591
15350b5708j53658J6876L241Q116O2857L2090p1825r5122N2017J25044J15660
15339F9588j9595j16498j6075n942Q0545P9380m4541j45203j65654j1202J36332
15328a58865O5598k14L8888M0647j37696m867R666O9531J25136k9063K286K0303
15316D1350n754L2509r5910j02643P3646O180j4803j7224m7062p7087j6310j9915
15304b43023n3067o8935O2366P0445O3924M8565P5837j13604n5570Q7570O2298
$$ y = [-85381, -69543, -24371, -28663, -101132, -126729, -156953, -209875, -247843, -188746, -115135, 52654, 43151, -29516, 10293, 56195, 54257, 37078, 43724, -89780, -187864, -259233, -134792, 3502, 34144, 1362, -203131, -245691, -221766, -122110, 6568, -2205, 92280, 122139, 93883, -25708, -179366, -162490, -159249, -151133, -88276, -56186, -128011, -223133, -171116, -46072, 69588, 49993, -66505, -82580, -88522, -7977, 71403, 26862, -118341, -283995, -295197, -158865, -93267, -93481, -54593, -13946, -151642, -156509, -146843, -77312, 47824, 18761, 21047, 41350, 35596, 68105, -27805, -130448, -56802, -50622, -65425, -82649, -129711, -206798, -223108, -243023, -296090, -365025, -302659, -232214, -168290, -119725, -43888, -157492, -213062, -125492, -63194]
15293f3194j28022o1065K566o648Q6320L5576M8250m1911O33n833j14150j01857
15281c49335N9310O1654Q4185J26269L8639k6626m6150r5914L6405p343R7988
15270b0918l2665p8782j3784L9560Q3795O0202l6238k2388n825p3317m723R7333
15258g750j001J2015J8085o0286Q3082q804p8320q4197j2374O1827J04456K2846
15246D9579j4409n9273J10877m3683o5839n5409J54230Q0192j79707n4700j3344
15235i1486o7653l2458R5101M4610o682m703Q1587K6513L6705L4784j08483o4240
15223e6405J11848J14300q5363j05910N0242N0906J06742q416p8006l4105N1984
15212A17817k9052l0664j15165k4465k001j810j6192J37489J27112q9525l7204
$$ y = [-63194, -191216, -252281, -249715, -256363, -170043, -134467, -86217, -128128, -127495, -133328, -247478, -349335, -290025, -228371, -144186, -17917, 20722, -5904, -52054, -147968, -111563, -118906, -20918, -53583, -132365, -146149, -106589, -22794, 37408, 1170, -21218, -27043, -100360, -105083, -7750, -8751, 3264, 21349, -38937, 44145, 35341, -42979, -127176, -139550, -77723, 26733, 49579, 35170, -24103, 86774, 43091, -22748, -78157, 76073, 156265, -23442, -78142, -91486, -159139, -191597, -96496, -51886, -58568, -63271, 18316, 44829, 81534, 116318, 7835, -56405, 55443, 169743, 84380, -21530, 28712, 79618, 186360, 177944, 99938, 65833, 117817, 88765, 58101, -57064, -81529, -83530, -85340, -101532, 35957, 163069, 73544, 36340]
15201C6340J6903l0576j0862O7630l8076k9022J6408p4789m4689Q3236J32724
15190A25227L9380Q009j18423q7082n067j6622r5931M0580j7445j04101k2150
15179b53625K2329M4663O924Q5689Q3317R683j06280K9048M3819j7287j28728
15168a80448J22909O2463R5210n291J03882r6182p6520K9091K9544Q526o1144
15157C2040O1130K7212n4756O5586k5709q6681J46455p9057j20492N4461Q7897
15146A08086r1089n8531J8820Q7706j5706N187l2550m7605k167j5483n4296q6136
15134a83764L0191J23381p4356j18251m3127K4208J9485K8443q441M4368R0847
15123f7016N2296j09843K6392P6303N2302M0234J0721o6340o6946p262M0218N6318
$$ y = [36340, 53243, 22667, 11805, 79435, 41359, 12337, 28745, -46044, -90733, -7497, 125227, 164607, 172616, 54193, -32889, -37956, -54578, -150509, -109929, -127374, -231475, -253625, -231296, -186633, -179709, -94020, -10703, -1020, -107300, -78252, -34433, -51720, -180448, -57539, 4924, 100134, 94843, 198725, 102543, 26023, 55114, 84658, 93184, 32040, 93170, 120382, 65626, 131212, 105503, 18822, 165277, 86220, -34272, 20189, 108086, 16997, -41534, -22714, 64992, 49286, 54473, 21923, -25682, -27849, -43332, -97628, -183764, -153573, -30192, -104548, -222799, -265926, -241718, -222233, -193790, -202231, -157863, -67016, -14720, -124563, -98171, -21868, 30434, 70668, 81389, 15049, -51897, -59159, -18941, 37377]
15111C7377j00803j46253J8428P5043N1049K1120M5969o2365j1631j17232j03305
15100b92603N3910J28638M6742O9906j33792N1368P2076j53736M751R0502n0892
15089a13130q4616M8746J00474K8026J5702k144N2048l294N1710l6525j34526
15078g7529l7410J2360J735P4336m5511J7106K9145q263r7801O0004J10018q9306
15066e1116K1216J72058N928j50508n8652l1759N1676l4829q8573K8365j163O4144
15054g3213J39824P1049m748n1482j23442r9091K53k8592m108n0425K3952P2959
15042a27064J19586J00190J13343j7757L4429j8132m9411j5880o0607K7324R710
15031A15731J11415J3069l3145j0440j59559n4264J7172J1260l9943n5256O3632
$$ y = [37377, -63426, -209679, -191251, -116208, -65159, -44039, 1930, -60435, -72066, -189298, -292603, -238693, -110055, -63313, 6593, -127199, -75831, -3755, -157491, -152740, -62238, -113130, -197746, -149000, -48526, -20500, -4798, -6942, 45106, 41812, 93522, 56997, -77529, -114939, -102579, -100844, -26508, -72019, -54913, -25768, -34031, -131832, -71828, 38190, -51116, -29900, 142158, 148086, -2422, -61074, -92833, -41157, -75986, -164559, -136194, -137357, -73213, 66611, 137660, 132912, 81430, -42012, -141103, -140850, -169442, -173550, -223975, -200023, -127064, -7478, 92712, 206055, 188298, 222727, 204595, 155184, 139304, 78697, 106021, 115731, 227146, 240215, 207070, 196630, 37071, -17193, -21, 11239, -28704, -83960, -20328]
15020b0328L1754l9389j15570n9521M5821R3785K9361o89R7075J8763j1670r5504
15008b6112M9290R404m8437p1031j31547n3615P2198J02539K3765Q1674l7759
14997b9631p8965k3286Q2401m0064j36228L7625J03490n5175j50670m5989J03444
14986b33048P2805L7261O6347j3724K4821k6936L4374J555j22223r935J33519
14975c5184L3361J27620K1354m2189k6700M9035j9o2989j96202j30019N0525J22746
14963h8661M4841m8912m4792o8658m425J01337J57674P4408k680j09794K5895
14952C6233L5249j06054j48678P364l8027j22055K0191J18740L8466k3349q8518
14941b70438K7978J13017J12379N0535l9011k9333K00k3714j08225m8378J08925
$$ y = [-20328, 11426, -27963, -143533, -203054, -157233, -63448, -34087, -34776, 62299, 81062, 69392, -26112, 23178, 32582, -15855, -86886, -218433, -272048, -199850, -97311, -73546, 8128, -29631, -108596, -131882, -49481, -89545, -225773, -188148, -84658, -139833, -290503, -336492, -233048, -160243, -122982, -56635, -70359, -45538, -72474, -38100, -36545, -158768, -168703, -35184, -1823, 125797, 147151, 104962, 78262, 127297, 127278, 64289, -131913, -261932, -211407, -88661, -43820, -92732, -137524, -206182, -210607, -109270, 48404, 122812, 120132, 10338, 36233, 71482, -34572, -183250, -175886, -213913, -335968, -315777, -197037, -158571, -181920, -270438, -242460, -129443, -17064, 33471, -5540, -34873, -34673, -58387, -166612, -214990, -106065]
14930a06065n3870j3245k6258q4294N9189R5083P5332n0510l0917L0740K1285
14919h3530Q4005P5578N4356j1913j10919n0510j3881j8594J29045P4367j06489
14908B1515o9164N9428n1944N630Q9274M3930j43717j41161K7045J03588K7159
14897b8417j209p5640n9108n7640P3926P9468J6168N0715P6172M496p5749L8982
14885D2164L4520l8390j24330M3711k8453J17846L6060o7961L9864K7583j5387
14874F7227r3339j85555k515J23019k2879k1887p035J38282O2689J2190q0654
14863a0457j7974j6071N9981L2938M9504j59559l8349N2282Q0988m834J1882J33354
14851A73685O7780L4027q2728n0398j05304P5855P9312o2982l7302n94j57206
$$ y = [-106065, -159935, -173180, -199438, -283732, -224543, -129460, -54128, -104638, -135555, -104815, -83530, 475, 76053, 130409, 118496, 7577, -42933, -56814, -75408, 53637, 128004, 21515, -47649, 11779, -40165, -34535, 54739, 98669, -45048, -186209, -159164, -55576, -28417, -29626, -105266, -164374, -222014, -148088, -68620, -52452, -1737, 74435, 78931, 3182, 42164, 76684, 38294, -86036, -42325, -70778, 47068, 83128, 15167, 55031, 82614, 67227, -26112, -211667, -214182, -91163, -114042, -135929, -142964, -4682, 58007, 70197, -10457, -28431, -44502, 15479, 48417, 97921, -61638, -99987, -47705, 33283, 28449, 40331, 173685, 241465, 275492, 192764, 142366, 37062, 112917, 192229, 129247, 91945, 91351, -65855]
14840f5855o8233J580R4746j37085j01186k9541J4187R5472L4329M2839n9103
14829a77850L387q166n8041J53439K54949n9257j36512N7771J05267O1747L3296
14818B30030r4723j23788L091L84M5437l1312j48435j4982J23888J11872p4752
14807B6710j36147J2517p3580J9293J70113P2599k2393o2860n5555K8965P9524
14796E9186J12232J576m5995L5495P0095m438k8660J51399J02735o3462j5576
14785C74587M4419Q3787Q7800J72037K55561M13476L81715M54621N68576M70739
14775C307318O94439P53591M58962J22168J73355j06857k56259m84635o72678
14766C989404p36495p47815m68590n10569l97834r0467j33344k21986j03449j20914
$$ y = [-65855, -134088, -132508, -37762, -174847, -276033, -305574, -291387, -195915, -161586, -118747, -177850, -174463, -182629, -240670, -87231, 167718, 108461, -28051, 29720, 134987, 196734, 230030, 135307, 11519, 14610, 14994, 60431, 29119, -119316, -134298, -10410, 101462, 26710, -109437, -96920, -170500, -151207, 18906, 91505, 69112, 6252, -49303, -20338, 59186, 171418, 172994, 126999, 162494, 232589, 228151, 199491, 350890, 453625, 390163, 374587, 419006, 502793, 590593, 762630, 1018191, 1431667, 1813382, 2268003, 2836579, 3307318, 4001757, 4755348, 5214310, 5336478, 5509833, 5402976, 5146717, 4662082, 3989404, 3252909, 2505094, 2036504, 1525935, 1128101, 1037634, 904290, 682304, 578855, 457941]
14756D57941j18046o1461K5132Q1539k6446l4391o6349k0179j46732j32182P2117
14745C0943K09707Q3222N6723j7142j08128j13551k4511K0812o0889o1914J8384
14734C3656K0623P5082o7396N9838N1406J527m7377j70326l943Q8255L8618K1298
14722A01261L0574N9094J5688j14166j68062o8847Q024L6995R3951P7703O1696
14711A33911k1838p4344N4877j00634j29515l5623NK7118o8858R8326N9718M4870
14699a1987J56993j8455K3892j11604j52727n9508N1924R0331O7494j0978o2164
14688c6789M3667O6847q1576p2290M000J9636l5664n120J24985j486o2033p13
14676c6536L9530k1339k5450M9717r083p055N4468l6107l1923O9333L3455j9467
$$ y = [457941, 339895, 278434, 303566, 385105, 358659, 324268, 257919, 237740, 91008, -41174, 30943, 240650, 323872, 380595, 363453, 255325, 141774, 117263, 138075, 77186, 15272, 33656, 54279, 129361, 61965, 121803, 173209, 174736, 127359, -42967, -46910, 41345, 79963, 101261, 131835, 190929, 206617, 92451, -75611, -144458, -136434, -99439, -5488, 72215, 133911, 112073, 37729, 92606, -8028, -137543, -173166, -173161, -146043, -214901, -116575, -56857, -11987, 145006, 126551, 150443, 38839, -113888, -173396, -121472, -31141, 36353, 25375, -36789, 6878, 73725, -7851, -80141, -76141, -56505, -92169, -97289, 27696, 26210, -35823, -36536, 2994, -18345, -43795, 5922, -3161, -10216, 44252, 8145, -23778, 45555, 79010, 59543]
14664E9543O2204k8907k6773q0088M5010K956r3034K6375K5506j9437J3446O4935
14652E1736M9031R2343L9981j16456J04252m6469q5134J1653M2333K6000r353
14641A59917R5032m1724J686p381k2116R8890P8573J41638J39618J07219J71487
14630I22839R7353J06555J97188J58821m881j01767o6074q7142m9716Q980k30479
14619I51677j36212j62376j81128j35943q5537N493M1746M116p6396m2312k4264
14608A58864L689K2413J34091N9959k9107N7274J05970J90051J24728J518n9183
14597G70267P7017J64353J66063J84224K12691N6961J26428J30705J48347R4880
14587B131936J4208j2892j06622k38417j91293p5555j61367j04629q9290j24676
$$ y = [59543, 121747, 92840, 66067, -14021, 30989, 33945, -59089, -32714, -7208, -26645, -13199, 51736, 100767, 193110, 233091, 116635, 220887, 174418, 89284, 100937, 143270, 169270, 159917, 254949, 213225, 214911, 207530, 185414, 284304, 362877, 504515, 644133, 751352, 922839, 1020192, 1126747, 1323935, 1482756, 1477875, 1376108, 1310034, 1222892, 1173176, 1182156, 951677, 815465, 653089, 471961, 336018, 250481, 255974, 297720, 301836, 225440, 183128, 158864, 162553, 184966, 319057, 379016, 349909, 407183, 513153, 703204, 827932, 829450, 770267, 847284, 1011637, 1177700, 1361924, 1574615, 1631576, 1758004, 1888709, 2037056, 2131936, 2146144, 2133252, 2026630, 1788213, 1596920, 1521365, 1359998, 1255369, 1166079, 1041403]
14577A041403j73536j63223j21401M4524r6872l4078M4411K4326o1336j081J36760
14566F39897J03384O6378J11916P3019P1284O8769K81124K51489J35892R9329
14556A902481O5427R5454L3572J02749J90873P155j50074j76951j34753j30467
14546A805466j77837q7474k75736l40968j95378l2829j97607j52675K487K8568
14536C76017O6225J5229n4855n0805o5456o4823K3812K5431j49460Q349p9773
14525D9891j15362J05595P6514q8360j7861R9540Q673n2306j33600m4259J59462
14514D7927m4652n5558J06289M7242M0836r7117j6923L3296p051l2260l4158k7103
14502c9232q0151k6186P3247P4395n1008R0471Q5265J2931m2963P9803J9875r6430
$$ y = [1041403, 867867, 704644, 583243, 627767, 530895, 496817, 541228, 565554, 504218, 503137, 639897, 743281, 809659, 921575, 994594, 1065878, 1134647, 1415771, 1667260, 1803152, 1902481, 1967908, 2063362, 2096934, 2199683, 2390556, 2397711, 2247637, 2070686, 1935933, 1805466, 1627629, 1540155, 1264419, 923451, 728073, 695244, 497637, 344962, 347449, 376017, 442242, 457471, 402616, 351811, 286355, 221532, 245344, 270775, 121315, 129664, 49891, -65471, 40124, 116638, 28278, 10417, 109957, 118630, 66324, -67276, -111535, 47927, 3275, -52283, 54006, 101248, 142084, 44967, 28044, 61340, 54289, 22029, -12129, -39232, -119383, -145569, -72322, 2073, -48935, 41536, 126801, 139732, 96769, 176572, 196447, 100017]
14490A00017K2437m7633o8767R5327L4300N569l8430n0046K1623J77475M2394
14479B94266J1239Q532j23461j59208r5338o956J23401p774j2809p7690o3367
14468a09165J04750J5762k0359n381P6961M4877J22152K6445q6080Q0944M2110
14457B93016p1880n6574j25586m9169k3042J20948K53990j17565k13643K5565
14447C6060J28432J8684o834M4378m2749L050k6672P5947O2598l0042k7295m9573
14435A85984K3236j11041o7893J10542K3859k3827p0905o4530k168P8579n8401
14424B3435N5530j8267j07016Q3052J03097J17413P78j6153k9911J5583m4932
14413A82609P1801J10647j225M4829Q9218R5333n0142r3561j00852M2713m831
$$ y = [100017, 122454, 74821, 6054, 101381, 135681, 141250, 102820, 52774, 74397, 251872, 294266, 305505, 314037, 190576, 31368, -63970, -70926, 52475, 44701, 31892, -45798, -109165, -4415, 11347, -9012, -14393, 62568, 107445, 229597, 256042, 169962, 250906, 293016, 221136, 164562, 38976, -10193, -33235, 87713, 341703, 224138, 10495, 36060, 164492, 183176, 176342, 220720, 177971, 181021, 154349, 230296, 292894, 262852, 235557, 185984, 209220, 98179, 30286, 140828, 164687, 140860, 69955, 5425, 3257, 81836, 23435, 78965, 60698, -46318, 36734, 139831, 257244, 258022, 241869, 211958, 227541, 182609, 254410, 365057, 363832, 408661, 497879, 593212, 543070, 449509, 348657, 391370, 386539]
14402C86539O5763o21o9670N146P3499O4189L3049q4922J2595J650k2942j09922
14390C54353p7245L0378r5905p4775p4756k8888R7858J11540K3114O3815Q032
14379C37521o0639q7172r03K044N6288j7071L9845r3618K5870N3626l247Q2983
14367C35527J08086r8726o0966N3300J5263N0200Q5088L6933L2575K0708q0358
14356D97630r333M3017J1882k1045r8764n0745L6470m0900k350p9230j51423o7347
14344F7862m1554J3601n0219q7448M2512P8497K7830j2304J8439M7132M2099q137
14332A38310k713Q8184J22521J593o1525J14404j8974p9868p6375m0560K4207
14321B09204J5816k7646o4731p4572o8032J67972J38469l8964P6100j07624j08068
$$ y = [386539, 452302, 451681, 382011, 387157, 460656, 524845, 557894, 472972, 485567, 487217, 464275, 354353, 277108, 307486, 211581, 136806, 62050, 33162, 131020, 242560, 265674, 329489, 337521, 276882, 189710, 188807, 190851, 247139, 230068, 269913, 176295, 202165, 255791, 252544, 335527, 443613, 344887, 283921, 337221, 352484, 402684, 487772, 524705, 557280, 577988, 497630, 488297, 531314, 543196, 522151, 423387, 372642, 409112, 368212, 365862, 286632, 135209, 67862, 26308, 39909, -10310, -97758, -55246, 23251, 51081, 38777, 57216, 104348, 146447, 138310, 135597, 223781, 346302, 347895, 286370, 400774, 381800, 301932, 225557, 184997, 209204, 225020, 197374, 132643, 58071, -9961, 158011, 296480, 257516, 333616, 225992, 117924]
14310A17924p0137o3604j70388k3539R3730Q5478P7183J61546J35749k4476J08143
14299D27609M1061P0735j6171p4794r4087j64853O6049J17149Q671Q3995o1837
14288D03527m7881O7037L091n8124L0522n3382j4159J60421N1487m1915r100O2699
14276E54223m9145m4412L8731M3772J30946o7445k6739M1773N3969K734J38170
14265H16577L1518o293m8904k9471j4549P2382J06006M3829l9561J5557J3680
14254I60771p4741r7530j4196O8549L3766O4090M81K0241o1390j80692M0732Q533
14242G68614J1185n7231m7926l6722P562L7641J14518J73534J36820J36516m9897
14231A194614j2598O2853P9485J04935J4583q0690p8063r4330k3433N6011m4476
$$ y = [117924, 47787, -15817, -186205, -209744, -116014, -30536, 46647, 208193, 343942, 319466, 427609, 468670, 539405, 523234, 448440, 354353, 189500, 255549, 372698, 381369, 465364, 403527, 355646, 422683, 425774, 367650, 398172, 344790, 330631, 491052, 542539, 500624, 491524, 554223, 505078, 460666, 499397, 543169, 674115, 606670, 579931, 621704, 675673, 678407, 816577, 848095, 841802, 792898, 763427, 748878, 821260, 927266, 971095, 931534, 947091, 960771, 886030, 788500, 774304, 842853, 876619, 940709, 941190, 961431, 900041, 719349, 760081, 768614, 779799, 722568, 674642, 637920, 645482, 683123, 797641, 971175, 1107995, 1244511, 1194614, 1182016, 1244869, 1324354, 1429289, 1443872, 1363182, 1285119, 1190789, 1167356, 1223367, 1178891]
14220A178891M536Q8598P7230L9093J8591k6600j136R8312P2238p0705O6034P6488
14208A621570k7142L161j977J4735J43811J57818J47795j8367M8021J1785J82548
14197B283758K18468Q9488K12863L7489M1331O3501L5590L8680J15059m242J18268
14186C250253J22943J18115K10816J89994J90702Q5663J41739K37436K95895K94038
14176E137594M51654L66335M48607N19081M50779N42829O90646R13233Q57536
14167A0378294Q98272J071726J273331J517903J694471K214119K619154K996074
14159B4663344L604701M245615M901606O138287P517055R178423J1171883J3639495
14151H5060409J6762126K0599169K4751693K8738809L2179985L4456586L5348032
$$ y = [1178891, 1183427, 1272025, 1349255, 1388348, 1406939, 1380339, 1379203, 1477515, 1549753, 1479048, 1545082, 1621570, 1594428, 1597589, 1595612, 1610347, 1754158, 1911976, 2059771, 2041404, 2089425, 2101210, 2283758, 2502226, 2591714, 2804577, 2842066, 2883397, 2946898, 2982488, 3021168, 3136227, 3131985, 3250253, 3373196, 3491311, 3702127, 3892121, 4082823, 4168486, 4310225, 4547661, 4843556, 5137594, 5589248, 5955583, 6404190, 6923271, 7374050, 7916879, 8607525, 9520758, 10378294, 11276566, 12348292, 13621623, 15139526, 16833997, 19048116, 21667270, 24663344, 28268045, 32513660, 37415266, 43553553, 51070608, 60249031, 71420914, 85060409, 101822535, 122421704, 147173397, 175912206, 208092191, 242548777, 277896809]
14144B77896809L4209188L0729538K5257584J7593382Q312155j281677j0355193
14137C82361786j8201385k4396088k8631824l0382838l0213319k8248732k5071296
14130A97216304k1106265j7191709j3690457j0803278q285173o104237m449847
14123A15585338k795308j366822k4054J422857K930045M578146O435204Q620155
14115A35385561J1246193J4166040J7606228K1171659K4764018K7819302K9935486
14108B82094487L0778894K9650923K6230520K0636807J3159461M117181n884908
14101D00783365j5576653k3816792l0058819l4240262l6226408l6137976l4144116
14094A90582339l0366878k5794278k1249820j7204472j3837626j1097689q948685
$$ y = [277896809, 312105997, 342835535, 368093119, 385686501, 393998656, 392716979, 382361786, 364160401, 339764313, 311132489, 280749651, 250536332, 222287600, 197216304, 176110039, 158918330, 145227873, 134424595, 126139422, 120035185, 115585338, 112790030, 111423208, 111399154, 112822011, 115752056, 120330202, 126765406, 135385561, 146631754, 160797794, 178404022, 199575681, 224339699, 252159001, 282094487, 312873381, 342524304, 368754824, 389391631, 402551092, 406668273, 400783365, 385206712, 361389920, 331331101, 297090839, 260864431, 224726455, 190582339, 160215461, 134421183, 113171363, 95966891, 82129265, 71031576, 62082891]
14087F2082891p388474o242588n420617m714274l950515l450772k937496k480435
14079B5497720k311322k028740j733093j624357j372860j189239j113955q38981
14071A3285173p23837q04700p69346n37558l70805m80990n36060m20532l53537
14062H287808l38397m48288j90451k11593k59619k93561l01454k56532j86239
14053E801674k01303k59427k49477k54627j52907m6287j02631j21242j32079j98856
14043D082838j02214j36663k49035q9489p6412q7037j71762p9283j0864p6063
14033C004016j20225q1452j20663j58876J2540J8931k4122j41318Q381m8189r0881
14022B258142j29374q1636P4486N7601k9262M161N7265O6215M8614j3279j4563
$$ y = [62082891, 54694417, 48451829, 43031212, 38316938, 34366423, 30915651, 27978155, 25497720, 23186398, 21157658, 19424565, 17800208, 16427348, 15238109, 14124154, 13285173, 12561336, 11756636, 10987290, 10449732, 10078927, 9597937, 9061877, 8641345, 8287808, 7949411, 7501123, 7310672, 7099079, 6839460, 6545899, 6244445, 5987913, 5801674, 5600371, 5340944, 5091467, 4836840, 4683933, 4637646, 4535015, 4413773, 4281694, 4082838, 3980624, 3843961, 3594926, 3505437, 3429025, 3341988, 3170226, 3090943, 3080079, 3004016, 2883791, 2802339, 2681676, 2522800, 2535340, 2554271, 2530149, 2388831, 2397212, 2349023, 2258142, 2128768, 2047132, 2121618, 2179219, 2149957, 2154118, 2211383, 2277598, 2326212, 2312933, 2298370]
14011B298370l55P092j80745j24778j27442q8110k8794P2463n582m5340j63886
14000A612893k18346N4494J00333r7540j15888K6805j16313P900J02039n1147
13990A305230k2773P220Q3869m96n4184m7111K9175J3427J9686l1373r142j7973
13978A275555k8441j1702j2577r494l3923p503j12511q9652P0199l8590r5762
13967I05599l5699M006k2541o9782p724J4842n559o8751j16473q1089J3031l312
13955E26548N9424J6670m0551j46585m146O1020m6803K1431P5584M8399j7399
13944E53592p339l3477j39482P8292J48652k8116n4248o2753p0348m705o3778
13933C16290K6691K9048n1161Q4656O9563m9568j9815Q610o7315M5768L2064j44633
$$ y = [2298370, 2298015, 2305107, 2124362, 1999584, 1872142, 1784032, 1755238, 1827701, 1822119, 1776779, 1612893, 1394547, 1449041, 1549374, 1451834, 1335946, 1362751, 1246438, 1254338, 1356377, 1305230, 1282457, 1289677, 1373546, 1373050, 1318866, 1271755, 1300930, 1314357, 1334043, 1302670, 1293528, 1275555, 1247114, 1235412, 1222835, 1213341, 1179418, 1171915, 1059404, 969752, 1039951, 1001361, 905599, 869900, 873906, 851365, 781583, 773859, 788701, 783142, 714391, 597918, 516829, 529860, 526548, 585972, 602642, 562091, 415506, 411360, 472380, 425577, 447008, 522592, 570991, 553592, 546253, 512776, 373294, 451586, 600238, 572122, 517874, 455121, 384773, 380068, 316290, 342981, 372029, 320868, 405524, 475087, 425519, 405704, 414314, 346999, 392767, 424831, 280198]
13921B80198j67270K5249P2988Q2887J2620n6560k176m8045J1613o396J34984
13910C40092p0923j3506p6431l6051K136k1818O2076J20944M3772O2972r4170
13899C19093n7207N045M1506j5374j2935L9871o760m4141r9342K1342K3081j830
13887B12349k1245n3995j35823o087j01720N8764J61306N6667P506k289O4572
13876B40005q2565n9293k042J04226m3080P2457M9555p1079l1204r3504j7619
13865F5857J25944j649N9805q397j0651o604k7711M8946m486o8906l4346K1892
13853A59694n773N2530l410Q0413p869l5517j02219k3401m7299o3341K4675K3341
13841E1824J38036M1855m7725k7376o8440j51990j8159L1629L6059J5041J21748
$$ y = [280198, 112928, 138177, 211165, 294052, 306672, 250112, 247936, 199891, 211504, 205108, 340092, 269169, 255663, 179232, 143181, 145317, 123499, 185575, 306519, 350291, 413263, 319093, 261886, 266931, 308437, 293063, 280128, 319999, 313239, 269098, 169756, 191098, 214179, 212349, 191104, 137109, 1286, -4801, -106521, -47757, 113549, 170216, 177722, 175433, 240005, 157440, 98147, 96105, 200331, 157251, 229708, 279263, 208184, 176980, 83476, 65857, 191801, 190152, 249957, 241560, 230909, 224305, 196594, 245540, 241054, 172148, 137802, 159694, 153921, 206451, 203041, 283454, 275585, 240068, 137849, 114448, 67149, 3808, 28483, 51824, 189860, 231715, 183990, 156614, 88174, -63816, -81975, -50346, -14287, 754, 122502]
13830A22502j9760j56516m1327R8007J21579j6427m6523M0418N3912P0784k9225
13819A97424q7911m2280J30619n9172K4511q9078l1929k9412J387k3483L5428
13808B6104r27P0976n6222k4082k0161M3607Q4179p8359j10918N2251m644m2789
13796f0985O0209p3999j18782J3185J76151L0495r7762p9656k9673P0783K2199
13785h7835J19755J83863K1486m8402p8537j3813L1653m8844j5640r697n4870
13774h81N1811R7827p116P7770M4906k2672n5261k3100L1486r684j77608l3660
13762b6182Q3102l1542m4047M4023J7164O2100j09503M798N3106Q6191J08254
13751B47464j3397j2184J4922j7184j6974r4113m2632J22844l1576q5633K7368
$$ y = [122502, 102742, -53774, -95101, 2906, 124485, 108058, 61535, 101953, 155865, 226649, 197424, 109513, 67233, 197852, 138680, 163191, 74113, 42184, 12772, 14159, -9324, 26104, 25177, 96153, 39931, 15849, -4312, 39295, 123474, 45115, -65803, -13552, -18196, -60985, -776, -74775, -193557, -180372, -4221, 26274, -71488, -151144, -180817, -110034, -87835, 31920, 215783, 237269, 188867, 110330, 96517, 128170, 79326, 63686, 53989, -881, 50930, 148757, 141641, 219411, 264317, 241645, 186384, 163284, 194770, 185086, 7478, -26182, 56920, 25378, -18669, 25354, 42518, 104618, -4885, -87, 53019, 139210, 247464, 234067, 221883, 236805, 219621, 202647, 108534, 65902, 188746, 157170, 71537, 98905]
13740I8905O4485K3657j0851J14905q485m8417j06522K9323k6006p8118j00533
13729d7657N550O5504M7146n4645p7603O5105J2994M2347k292K1710K7836J39816
13717B45811K3581J56761K7796J4967r0665m5379q9801o3914j18109J9477L7756
13706A18281M9176N2683j7683K4711l1492n5758o2598O4042J98963R4839n0071
13695C85093J86717J70377K51403J53445K05328J36475J80878K41794L6646J40276
13685B088432R9003j2198o2484j17774k53802j84681j80722q4308m8230q4331
13675A158905j07716p6480j07496j24240j1368M7019m4836p0373p0781J8435j14528
13664D96541r8043J432J17001K08811Q4477P1343R6145N3189O5641J02798J26912
$$ y = [98905, 163390, 187047, 176196, 291101, 282616, 234199, 127677, 157000, 130994, 52876, -47657, -42107, 23397, 70543, 15898, -61705, 3400, 16394, 58741, 56449, 78159, 105995, 245811, 269392, 426153, 453949, 468916, 378251, 332872, 243071, 179157, 61048, 80525, 118281, 167457, 220140, 202457, 227168, 195676, 139918, 77320, 141362, 340325, 435164, 385093, 571810, 742187, 993590, 1147035, 1352363, 1488838, 1669716, 1911510, 1948156, 2088432, 2187435, 2175237, 2112753, 1994979, 1741177, 1556496, 1375774, 1291466, 1243236, 1158905, 1051189, 974709, 867213, 742973, 731605, 778624, 733788, 663415, 592634, 611069, 496541, 398498, 399930, 516931, 725742, 810219, 881562, 977707, 1030896, 1096537, 1199335, 1326247]
13653A326247J83113L08435K87084N5053j2241P1462M1525j55967j43432j02486
13643A858793k11925k17475m9449r8590k23341j96229j78970k37135l2706P0691
13633D83664j10833k22083l2464j0983M7033Q4801j06335j25215K1161m8004N1533
13622C2275J33495n4743k1814R9927r6718j23155r73J20296j7993o1754P0245
13611G9088J04961p9567p8723M8187l7500L3331o3683O678K8710p846M1101M2761
13599A17498r1899m110J4854M8894k3823j21268R1963L4628j6202L2844m8974
13588C4405L9678O5815q4159l0654j377q1105K5070l4037n2402j5043j0741J21860
13576b2690l209k2112o7208n4647Q857j4039O596N7454j1077J72291P6459j48002
$$ y = [1326247, 1509360, 1817795, 2104879, 2159932, 2147691, 2219153, 2260678, 2104711, 1961279, 1858793, 1646868, 1429393, 1379944, 1281354, 1058013, 861784, 682814, 445679, 412973, 483664, 372831, 150748, 118284, 107301, 154334, 239135, 132800, 7585, 28746, -19258, 32275, 165770, 111027, 89213, 189140, 92422, -30733, -31706, 88590, 70597, 8843, 79088, 184049, 104482, 25759, 73946, 36446, 69777, 6094, 12772, 41482, 33636, 74737, 117498, 25599, 21489, 36343, 85237, 61414, -59854, 32109, 66737, 50535, 83379, 34405, 74083, 139898, 55739, 25085, 23708, -57397, -32327, -66364, -118766, -133809, -144550, -22690, -25899, -48011, -115219, -169866, -161009, -175048, -168452, -110998, -122075, 50216, 126675, -21327]
13564b1327N608N3142J10797j8725n5858p1287j45218M94L879n4245J41763J5600
13552c5377J8202R7855o7507j85945k3065Q1092M5975k0137L4175J84371Q4569
13541B14208j42106l604K5413j09016n8861R1139K0204j7425J31357j2159m7635
13530I1515q8632r2703N8231N6844m2674M9719K0378J6173M321j6862j55191N342
13518i3539n5311M3638P3600N3121J6528K2930P778n1995l723p6247p3107L5521
13506a00806l5273K4396M9319J21301R1618p2352j06768j27346k5151J39878J09062
13495F7878J8969m7386N3505p0471q6621r9193q5256J52911J33541K0186l2247
13484B5816n0903k9658J9172K5297j3771N984Q263N2753m247J5458p9053r8771
$$ y = [-21327, -15719, 37423, 148220, 129495, 73637, 2350, -142868, -142374, -138495, -192740, -50977, -35377, -17175, 80680, 13173, -172772, -195837, -114745, -68770, -88907, -54732, 129639, 214208, 72102, 68498, 93911, -15105, -73966, 17173, 37377, 19952, 151309, 139150, 91515, 2883, -89820, -31589, 25255, -17419, 32300, 52678, 68851, 73172, 56310, -98881, -93539, -148850, -105212, -31612, 21509, 38037, 60967, 68745, 16750, 13027, -63220, -136327, -100806, -136079, -111683, -62364, 58937, 150555, 78203, -28565, -155911, -181062, -41184, 67878, 86847, 39461, 92966, 22495, -64126, -163319, -248575, -95664, 37877, 58063, 25816, -25087, -54745, -35573, -10276, -24047, -18063, -9800, 42953, 38706, 54164, -24889, -123660]
13472a23660L1272P2036j2249M7875N8843q7261n6800O8545R434M8041l3682K7594
13460D9988L9766l4673p1299j9176P0164j7529k8137m5j44524p3903Q1468J4604
13448a33296l0759n0947J13286L2735L334J47674J04379l6350j58878j26783L8583
13437i7022K27138j151j2289k0645K1052o6885r3659J3008K6527O8516R00k3177
13425D2313q8143n8831M0879K1844P3607j0953O8348p447R261P494j27896o7153
13413i6677K7907Q3059L9093l9949q3082q3873k8159m0728P0760J22791j9049
13402d7907N0794R5851O4991j5317j00172j35958p361M0961J75982m6644p0827
13391D393k452Q2300k9782q2265j70033m3451J05463J08205N8845J47904K1667
$$ y = [-123660, -92388, -20352, -32601, 15274, 74117, -13144, -69944, -1399, 8035, 56076, 22394, 49988, 89754, 55081, -16218, -35394, 34770, 17241, -10896, -10941, -155465, -229368, -147900, -133296, -164055, -215002, -101716, -68981, -65647, 82027, 186406, 150056, -8822, -135605, -97022, 130116, 128965, 116676, 96031, 117083, 50198, -43461, -30453, -3926, 64590, 65490, 42313, -45830, -104661, -63782, -41938, 31669, 20716, 89064, 81617, 90878, 98372, -29524, -96677, -68770, 14289, 53382, 13433, -69649, -153522, -181681, -222409, -151649, -28858, -47907, 2887, 98738, 163729, 148412, 48240, -87718, -95079, -54118, 121864, 75220, 4393, 1941, 84241, 54459, -27806, -197839, -241290, -135827, -27622, 31223, 179127, 200794]
13380B00794j5833p703m6103Q175l672p3368j5812O0669Q992l2284k7650J4071
13368G0276l7406l3654L7299R2124k7675j8100M6359o4745j32114o8651K6375
13357a09912O3861J9400J12563Q329j3172O0072K7500j4842k1752r01l7699j4290
13345G9157o7179j48959O775M5669R6852j1257m5866J4784J7315k2267q1601M6613
13333f9964m3229j6984R5087j10568K3847N8430r721O4489J49445p0265r5340
13322b4773j11638j15090K7692P6245l8710n278L9743J16525J7180K3529L8107
13311D3532N0597O560r3795k6637o3928o5917j56265m6784J50617R1783R0342
13300a9895J04221J3739P6202o746j06139j36110K6528M2932M9897J10318L4958
$$ y = [200794, 184961, 177258, 131155, 139330, 135658, 62290, 46478, 107147, 116139, 83855, 56205, 70276, 32870, -784, 36515, 128639, 100964, 82864, 129223, 64478, -67636, -136287, -109912, -46051, -26651, 85912, 94241, 81069, 141141, 168641, 153799, 132047, 131146, 93447, 79157, 11978, -136981, -130206, -84537, 12315, 1058, -44808, -30024, -12709, -34976, -116577, -69964, -113193, -130177, -35090, -145658, -121811, -63381, -73102, -8613, 140832, 70567, -24773, -136411, -251501, -223809, -147564, -186274, -191552, -151809, -35284, -18104, 5425, 43532, 94129, 100689, 6894, -19743, -83671, -149588, -305853, -352637, -202020, -110237, -19895, 84326, 98065, 174267, 167521, 61382, -74728, -48200, -5268, 44629, 154947, 189905]
13289A89905r3255j49125j2734n5432k432J12745P0890j3735K4089j1318m5749
13278A3849k5064M4555L8347l2594K2737M6202n0890l4349j3726q6318l4892o8710
13266a80853q6330J37913O7586M1214p6169O7403J13741n4873k6562o0883j00029
13255a57842q3867k5954K4545Q8083J942j9108L550m5945M4031Q4917j5107m161
13243a04916r709n069J36427M8413n8744J531L3819J37868n4795r6488m5085o1690
13231g8438l883P8281M9182K5174m4862j2750J6396l4376r254n2704N1969k3621
13219c8886P8573J22288J1038l1282R6808j5369j33963o42k721q1827k4254R8317
13207G8080P6825J5123k0655p4396L1403J12710L1969m0009N1012P911K19725
$$ y = [189905, 96650, -52475, -65209, -120641, -123073, -10328, 60562, 46827, 70916, 59598, 13849, -11215, 33340, 71687, 39093, 61830, 108032, 57142, 22793, 9067, -77251, -112143, -180853, -267183, -129270, -61684, -20470, -96639, -29236, 84505, 29632, 3070, -57813, -157842, -241709, -267663, -243118, -155035, -153093, -172201, -168651, -214596, -170565, -85648, -100755, -104916, -114625, -119694, 16733, 65146, 6402, 7933, 41752, 179620, 124825, 28337, -16748, -78438, -82321, -4040, 45142, 70316, 25454, 12704, 29100, -5276, -14530, -67234, -15265, -38886, 39687, 161975, 173013, 141731, 238539, 223170, 89207, 88565, 85844, 4017, -20237, 78080, 154905, 170028, 149373, 74977, 106380, 219090, 251059, 211050, 262062, 269973, 489698]
13196D89698N4939J4978J13401P4287L7858n1546M3640m2203j12393k11222r9457
13185C11980j8923r6523n5845j8860j31527K186J17221Q4608L3502L9439N5206
13174C22464j62950j6246l2677k925p7303R9844L9695n7105l9527P451J28275
13163B08996Q189o2274p4074J04101l7430P5688P8715K7716o6465j3179K13490
13152D63473K22140J65001L18989M43181L71886J62898J11419O1078j00879j85343
13142B033843m19445n47626l87727j56899l0022j84144m4915K2691O2475j10797
13132B37434j07412J07832j15691j08416Q6627L6391N6225j5221j39256j16098
13122g7585O8594N6744M0579J9418j2890M5608M0782K8650n5285o7269J13139
$$ y = [489698, 544637, 559615, 673016, 747303, 785161, 733615, 777255, 735052, 622659, 411437, 311980, 293057, 196534, 140689, 121829, -9698, -7512, 109709, 194317, 227819, 267258, 322464, 159514, 143268, 110591, 107666, 30363, 130207, 169902, 112797, 73270, 80721, 208996, 217185, 154911, 80837, 184938, 147508, 223196, 301911, 329627, 263162, 249983, 463473, 685613, 850614, 1169603, 1612784, 1984670, 2147568, 2258987, 2320065, 2219186, 2033843, 1614398, 1066772, 679045, 522146, 492124, 307980, 263065, 285756, 348231, 237434, 130022, 237854, 122163, 13747, 100374, 136765, 192990, 177769, 38513, -77585, -8991, 47753, 88332, 107750, 94860, 140468, 181250, 209900, 154615, 87346, 200485]
13111B00485q900M3804O1375J22191K29330J51601K00317M39059N24762K70048
13101B234072O5086J06728m5757j75211k84870l93182l73512k34229k30488k4086
13091F44551j24957k92456j15410P8250l2707n7328j2083L5044P7294J3524n7326
13080A56396p1114p0272L8540k2141L83O604n5885R0032N6122N9866M8965j3939
13068B23557j35269p8001M6810K4189Q7363n9347p3338M7652J81983K21609J95997
13057F83205M0697R1742Q0858l6246o9267k12795j21458j14887n7557j10931l0355
$$ y = [200485, 191585, 235389, 296764, 418955, 648285, 799886, 1000203, 1439262, 1964024, 2234072, 2299158, 2405886, 2360129, 2184918, 1900048, 1506866, 1133354, 899125, 668637, 644551, 519594, 227138, 111728, 189978, 157271, 99943, 87860, 122904, 200198, 213722, 156396, 85282, 15010, 53550, 31409, 31792, 38396, -17489, 72543, 128665, 188531, 237496, 223557, 88288, 10287, 57097, 81286, 168649, 109302, 35964, 83616, 265599, 487208, 683205, 723902, 815644, 896502, 860256, 790989, 578194, 456736, 341849, 284292, 173361, 143006]
$$ [...]
##END NTUPLES=NMR SPECTRUM
##END=
