##TITLE=Analysis number 323316
Compound Code cc 36546
Book Reference 468/177
Project Code adrs
Chemist Name colinb
##JCAMPDX= 6.0         $$ Bruker NMR JCAMP-DX V2.0
##DATA TYPE= NMR SPECTRUM
##DATA CLASS= NTUPLES
##ORIGIN= Bruker BioSpin GmbH
##OWNER= nmr
$$ XWIN-NMR		Version 3.5
$$ Mon Oct 23 12:31:15 2006 GMT Daylight Time (UT+1h)  MAYBRIDGE\nmr@NMR_250MHZ
##.OBSERVE FREQUENCY= 250.131544655141
##.OBSERVE NUCLEUS= ^1H
##.ACQUISITION MODE= SIMULTANEOUS (DQD)
##.ACQUISITION SCHEME= undefined
##.AVERAGES= 16
##.DIGITISER RES= 18
##SPECTROMETER/DATA SYSTEM= dpx250
##.PULSE SEQUENCE= zg30
##.SOLVENT NAME= CDCl3
##.SHIFT REFERENCE= (INTERNAL, CDCl3, 0, 16.522)
##AUDIT TRAIL= $$ (NUMBER, WHEN, WHO, WHERE, WHAT)
$$ ##TITLE= Audit trail, XWIN-NMR		Version 3.5
$$ ##JCAMPDX= 5.01
$$ ##ORIGIN= Bruker BioSpin GmbH
$$ ##OWNER= nmr
$$ C:\u/data/dgb/nmr/ADRS/1100/pdata/1/auditp.txt
$$ ##AUDIT TRAIL=  $$ (NUMBER, WHEN, WHO, WHERE, WHAT)
(   1,<2006-10-23 12:30:50.00 +100>,<MAYBRIDGE\nmr>,<NMR_250MHZ>,
      <created by zg, POWCHK disabled, PULCHK disabled
       configuration hash MD5:
       49 4B E0 1D 92 C2 6B 37 9F E6 65 BC 52 41 86 1D
       data hash MD5: 64K
       61 92 2D 89 6C A7 2A 2B D0 84 33 D9 85 57 D5 42>)
(   2,<2006-10-23 12:31:05.83 +100>,<MAYBRIDGE\nmr>,<NMR_250MHZ>,
      <Start of raw data processing
       ef LB = 0.3 FT_mod = 6 PKNL = 1 SI = 32K 
       data hash MD5: 32K
       C3 48 55 34 3E 10 7D 9F 16 8C 2F 8B 3E B1 94 B8>)
(   3,<2006-10-23 12:31:07.62 +100>,<MAYBRIDGE\nmr>,<NMR_250MHZ>,
      <apk 
       data hash MD5: 32K
       77 6F A1 75 78 BC F8 FD 1E 94 67 FE DE 4D 29 A2>)
(   4,<2006-10-23 12:31:08.36 +100>,<MAYBRIDGE\nmr>,<NMR_250MHZ>,
      <abs ABSG = 5 
       data hash MD5: 32K
       6E E5 28 42 D7 79 28 EF 28 01 4F DC 54 03 D0 C1>)
$$ ##END=
$$ 
$$ hash MD5
$$ B1 C1 C2 84 14 D8 41 B3 0A 2B 76 00 4A DE 34 EE
##$RELAX= 
##$RELAX= 
##$RELAX= 
##$RELAX= 
##$RELAX= 
##$RELAX= 
##$RELAX= 
$$ Bruker specific parameters
$$ --------------------------
##$DU= <C:\u>
##$EXPNO= 1100
##$NAME= <ADRS>
##$PROCNO= 1
##$TYPE= <nmr>
##$USER= <dgb>
##$AMP= (0..31)
100 100 100 100 100 100 100 100 100 100 100 100 100 100 100 100 100 100 
100 100 100 100 100 100 100 100 100 100 100 100 100 100 
##$AQSEQ= 0
##$AQ_mod= 3
##$AUNM= <au_zg>
##$AUTOPOS= <35 >
##$BF1= 250.13
##$BF2= 250.13
##$BF3= 250.13
##$BF4= 250.13
##$BF5= 500.13
##$BF6= 500.13
##$BF7= 500.13
##$BF8= 500.13
##$BYTORDA= 1
##$CFDGTYP= 0
##$CFRGTYP= 5
##$CHEMSTR= <none>
##$CNST= (0..31)
1 1 145 1 1 1 1 1 1 1 1 1 1 1 1 1 1 1 1 1 1 1 1 1 1 1 1 1 1 1 1 1 
##$CPDPRG= <>
##$CPDPRG1= <>
##$CPDPRG2= <>
##$CPDPRG3= <>
##$CPDPRG4= <mlev>
##$CPDPRG5= <mlev>
##$CPDPRG6= <mlev>
##$CPDPRG7= <mlev>
##$CPDPRG8= <mlev>
##$CPDPRGB= <>
##$CPDPRGT= <>
##$D= (0..31)
0 1 0 0 0 0 0 0 0 0.06 0 0 0 0 0 0 0.0002 0 0 0 0 0 0 0 0 0 0 0 0 0 0 
0 
##$DATE= 1161603047
##$DBL= (0..7)
120 120 120 120 120 120 120 120 
##$DBP= (0..7)
150 150 150 150 150 150 150 150 
##$DBP07= 0
##$DBPNAM0= <>
##$DBPNAM1= <>
$$ [...]
##$SUBNAM7= <"">
##$SUBNAM8= <"">
##$SUBNAM9= <"">
##$SW= 20.6930455092707
##$SWIBOX= (0..15)
0 0 3 0 0 0 0 0 0 0 0 0 0 0 0 0 
##$SW_h= 5175.983436853
##$TD= 65536
##$TD0= 1
##$TE= 683.16
##$TE2= 300
##$TE3= 300
##$TEG= 300
##$TL= (0..7)
0 120 120 120 120 120 120 120 
##$TP= (0..7)
150 150 150 150 150 150 150 150 
##$TP07= 0
##$TPNAME0= <>
##$TPNAME1= <>
##$TPNAME2= <>
##$TPNAME3= <>
##$TPNAME4= <>
##$TPNAME5= <>
##$TPNAME6= <>
##$TPNAME7= <>
##$TPOAL= (0..7)
0.5 0.5 0.5 0.5 0.5 0.5 0.5 0.5 
##$TPOFFS= (0..7)
0 0 0 0 0 0 0 0 
##$TUNHIN= 0
##$TUNHOUT= 0
##$TUNXOUT= 0
##$USERA1= <user>
##$USERA2= <user>
##$USERA3= <user>
##$USERA4= <user>
##$USERA5= <user>
##$V9= 5
##$VALIST= <valist>
##$VCLIST= <CCCCCCCCCCCCCCC>
##$VD= 0
##$VDLIST= <DDDDDDDDDDDDDDD>
##$VPLIST= <PPPPPPPPPPPPPPP>
##$VTLIST= <TTTTTTTTTTTTTTT>
##$WBST= 1024
##$WBSW= 4
##$XGAIN= (0..3)
0 0 0 0 
##$XL= 0
##$YL= 0
##$YMAX_a= 481001
##$YMIN_a= -446608
##$ZGOPTNS= <>
##$ZL1= 120
##$ZL2= 120
##$ZL3= 120
##$ZL4= 120
##$ABSF1= 16.522
##$ABSF2= -4.171173
##$ABSG= 5
##$ABSL= 3
##$ALPHA= 0
##$AQORDER= 0
##$ASSFAC= 0
##$ASSFACI= 0
##$ASSFACX= 0
##$ASSWID= 0
##$AUNMP= <proc_1d>
##$AZFE= 0.1
##$AZFW= 0.1
##$BCFW= 0
##$BC_mod= 0
##$BYTORDP= 0
##$COROFFS= 0
##$CY= 12.5
##$DATMOD= 1
##$DC= 0
##$DFILT= <>
##$DTYPP= 0
##$F1P= 14.0000005364418
##$F2P= -0.99999901652339
##$FCOR= 0.5
##$FTSIZE= 32768
##$FT_mod= 6
##$GAMMA= 0
##$GB= 0
##$INTBC= 1
##$INTSCL= 1
##$ISEN= 128
##$LB= 0.3
##$LEV0= 0
##$LPBIN= 0
##$MAXI= 10000
##$MC2= 0
##$MEAN= 0
##$ME_mod= 0
##$MI= 0
##$NCOEF= 0
##$NC_proc= -3
##$NLEV= 6
##$NOISF1= 0
##$NOISF2= 0
##$NSP= 0
##$NTH_PI= 0
##$NZP= 0
##$OFFSET= 16.522
##$PC= 1
##$PHC0= -47.31368
##$PHC1= 3.809498
##$PH_mod= 1
##$PKNL= yes
##$PPARMOD= 0
##$PSCAL= 4
##$PSIGN= 0
##$REVERSE= no
##$SF= 250.13
##$SI= 32768
##$SIGF1= 0
##$SIGF2= 0
##$SINO= 400
##$SIOLD= 32768
##$SREGLST= <1H.CDCl3>
##$SSB= 0
##$STSI= 32768
##$STSR= 0
##$SW_p= 5175.98343685301
##$SYMM= 0
##$S_DEV= 0
##$TDeff= 65536
##$TDoff= 0
##$TI= <Analysis number 999999
Compound Code 99
Book Reference 9
Project Code 9>
##$TILT= no
##$TM1= 0
##$TM2= 0
##$TOPLEV= 0
##$USERP1= <user>
##$USERP2= <user>
##$USERP3= <user>
##$USERP4= <user>
##$USERP5= <user>
##$WDW= 1
##$XDIM= 32768
##$YMAX_p= 342154183
##$YMIN_p= -249707
$$ End of Bruker specific parameters
$$ ---------------------------------
##NTUPLES= NMR SPECTRUM
##VAR_NAME=  FREQUENCY,     SPECTRUM/REAL,   SPECTRUM/IMAG
##SYMBOL=    X,             R,               I
##VAR_TYPE=  INDEPENDENT,   DEPENDENT,       DEPENDENT
##VAR_FORM=  AFFN,          ASDF,            ASDF
##VAR_DIM=   32768,         32768,           32768
##UNITS=     HZ,            ARBITRARY UNITS, ARBITRARY UNITS
##FACTOR=    0.157963299565203, 1,           1
##FIRST=     4132.6476996994, 0,             0
##LAST=      -1043.33573715361, 0,           0
##MIN=       -1043.33573715361, -249707,     0
##MAX=       4132.6476996994, 342154183,     0
$$ Real data points
##PAGE= N=1
##DATA TABLE= (X++(R..R)), XYDATA
$$ [...]
16448C4854k2905q55j2853j2409k605J794j0306Q233L1004j737k4607j4840j6467
$$ 34854 11949 11094 -1759 -14168 -16773 -14979 -25285 -17052 13952 12215 -12392 -27232 -43699
16435d3699J1470J7144K6234L2R273J6556J5709k4997m3218l0581J1965J0352
$$ -43699 -32229 -15085 11149 11181 20454 37010 52719 27722 -15496 -46077 -34112 -23760
16423b3760R044J8171L5369m760j8351j9679J0439O501j1427m323J5306l693l475
$$ -23760 -14716 3455 38824 34064 15713 -3966 6473 12974 1547 -2776 12530 8837 5362
16410E362n397J3177R138r149Q62M707L19k7251j2288J4238P01N26N438Q20j4869
$$ 5362 -35 13142 22280 13131 13993 18700 19019 -8232 -20520 -6282 -5581 -5055 383 1203 -13666
16395a3666k6852P474j0431P271K2068K1384N64K510M885m093J6581p300j4945
$$ -13666 -40518 -33044 -43475 -36204 -14136 7248 7812 10322 15207 11114 27695 20395 5450
16382E450k763L0226K3457k8137k5507J0860K837n979p642K56n198J2950L065
$$ 5450 2687 32913 56370 28233 2726 13586 16423 10444 2802 3058 -2140 10810 13875
16369A3875J1345Q833K0371p868M341j3719k4262k1020K477r316O668k856k730
$$ 13875 25220 34053 54424 46556 50897 37178 12916 -8104 -5627 -14943 -8275 -11131 -13861
16356a3861q008P720J3734J1358J2839j4937j7996j0054J2526J2603k2884J2134
$$ -13861 -21869 -14149 -415 10943 23782 8845 -9151 -19205 -6679 5924 -16960 -4826
16344d826J0622k520j4225k1615L2377P533J56J1853Q038n372n224O299p996K6236
$$ -4826 5796 3276 -10949 -32564 -187 7346 7502 19355 27393 22021 16797 23096 15100 41336
16330D1336J3787q085J95o519j4483k8163k3356k0038K8507j2708r84K2286Q353
$$ 41336 55123 47038 47233 40714 26231 -1932 -25288 -45326 -16819 -29527 -30511 -8225 128
16317A28K5434j3936L119K2632j3620j8735N537J9079O995j4035j3620j3623N811
$$ 128 25562 11626 14745 37377 23757 5022 10559 29638 36633 22598 8978 -4645 1166
16304A166J0317k4989R380L1380k750j0132M626L648k0356j6183k926q488M999
$$ 1166 11483 -13506 -4126 27254 24504 14372 18998 22646 2290 -13893 -16819 -25307 -20308
16291b0308l246J4643K5899J8422j1252k6866l462L6659J9520p855j2768k5844
$$ -20308 -23554 -8911 16988 35410 24158 -2708 -6170 30489 50009 42154 29386 3542
16279C542j1278K798O849J4558j3249j960K1838J5332J2271l79j1847j2383R43
$$ 3542 -7736 -4938 1911 16469 3220 1260 23098 38430 50701 50322 38475 26092 27035
16266B7035P148k4314j7101J1535O815J3005N217L608m555o829Q907J5007j7369
$$ 27035 34183 9869 -7232 4303 11118 24123 29340 32948 28393 21564 30471 45478 28109
16253B8109l2214j6586J0323R324M835J5505q409n276R423l894j0229j5762Q274
$$ 28109 -4105 -20691 -10368 -1044 3791 19296 10887 5611 15034 11140 911 -14851 -6577
16240f577N396j8174J1320R948J0064j228j9199K5053Q271j4820j377K7846j9643
$$ -6577 -1181 -19355 -8035 1913 11977 10749 -8450 16603 24874 10054 8677 36523 16880
16227A6880j9291j6318n393q469K1892J6814j9185j0658l622q289j0999K0906
$$ 16880 -2411 -18729 -24122 -32591 -10699 6115 -13070 -23728 -27350 -35639 -46638 -25732
16215b5732j9615M582K7099K7957J0500k0106P993n713k1188K232k121j1355j449
$$ -25732 -45347 -40765 -13666 14291 24791 4685 12678 6965 -14223 -11991 -14112 -25467 -26916
16202b6916K5268L8940J1583k4592m0293j276J7033M212m816P203m321J5l0168
$$ -26916 -1648 37292 48875 24283 -16010 -17286 -253 3959 -857 6346 2025 2040 -28128
16189b8128q690j508J1692J5306J3786J1958r82q05J3463j5836j8831n91K0432
$$ -28128 -36818 -38326 -26634 -11328 2458 14416 13434 12629 26092 10256 -8575 -9166 11266
16176A1266J2050M322k5100j4540j4744N610L100k403j1529K783L7230L3085j0579
$$ 11266 23316 27638 2538 -12002 -26746 -21136 -18036 -20439 -31968 -29185 8045 41130 30551
16163C0551k0169L334K624M831n139l0777K090M480J309l355m521Q693N56J1463
$$ 30551 10382 13716 16340 21171 16032 -14745 -12655 -8175 -6866 -10221 -14742 -6049 -5493 5970
16149E970j1645n90j5104l775j0967K9930K2502j3676J0848J7590k9846J5158
$$ 5970 -5675 -6265 -21369 -25144 -36111 -6181 16321 2645 13493 31083 1237 16395
16137A6395m701k5993q208K1992N142m422L6140k6750l0486m533M733K6144J6198
$$ 16395 11694 -14299 -22507 -515 4627 205 36345 9595 -20891 -25424 -20691 5453 21651
16124B1651M900m622j5013N75L7686j7257O19J2659k0687m5165J2474j369k8677
$$ 21651 26551 21929 6916 7491 45177 27920 28539 41198 20511 -24654 -12180 -13549 -42226
16111d2226j4120K0283O823K2176J6500Q652k4734j7033Q450J6022j8779l4070
$$ -42226 -56346 -36063 -29240 -7064 9436 18088 -6646 -23679 -15229 793 -17986 -52056
16099e2056K6020k233j8382J5835M1441k927n256J4617k7987m1950j3034J1899
$$ -52056 -26036 -28269 -46651 -30816 10625 7698 2442 17059 -10928 -52878 -65912 -54013
16087e4013J4287J4873m228L338N412J0694n162l3109j8041J1947J3718L5071
$$ -54013 -39726 -24853 -29081 -25743 -20331 -9637 -14799 -47908 -65949 -54002 -40284 -5213
16075e213K3380J9613l1419M337j5851l650J1835j9151k9017L8878L2683j7744
$$ -5213 18167 37780 6361 10698 -5153 -8803 3032 -16119 -45136 -6258 26425 8681
16063H681l2092j4954J3500J6789k724O831r152p655P370j5636n252J0595J978
$$ 8681 -23411 -38365 -24865 -8076 -10800 -3969 -13121 -20776 -13406 -29042 -34294 -23699 -21721
16050b1721K1604J9334J2892J4701N858k1906L036j5964k5753J0280J4485j6597
$$ -21721 -117 19217 32109 46810 52668 30762 33798 17834 -7919 2361 16846 249
16038B49K994P464p672N772J3973m411J512o667N964N457k5348o531J8612K0540
$$ 249 3243 10707 3035 8807 22780 18369 19881 13214 19178 24635 -713 -7244 11368 31908
16024C1908j598J8951N550k5853k4581k1947j5296l205Q350K1446L0940L5631
$$ 31908 30310 49261 54811 28958 4377 -17570 -32866 -36071 -27721 -6275 24665 60296
16012F0296j1292l108m1905J8632J6990j7464k1813o161K215j0558M641j2622
$$ 60296 49004 45896 3991 22623 39613 22149 336 -5825 -3610 -14168 -9527 -22149
16000b2149k0837J356K9821J512M464J5432k949k7612n166j215R193K0229p057
$$ -22149 -42986 -41630 -11809 -10297 -5833 9599 6650 -20962 -26128 -27343 -18150 2079 -4978
15987d978L852J7183j4801q075l774K5470J7562J7571p955n493j8278j7664j1245
$$ -4978 -1126 16057 1256 -6819 -10593 14877 32439 50010 42055 36562 18284 620 -10625
15974a0625q746r853O214J3442P681j7444k1943P171M606J4271K63K1348K865
$$ -10625 -19371 -29224 -23010 -9568 -1887 -19331 -41274 -34103 -29497 -15226 -14963 6385 9250
15961I250j021N18j9314J0485J6148k0835j0644K3957J0815O8O758J275l2039
$$ 9250 8229 8747 -10567 -82 16066 -4769 -15413 8544 19359 19427 26185 27460 -4579
15948d579j8007J9624j9829m739J9767L4541j5592l699J0888o896j9132n79R555
$$ -4579 -22586 -2962 -22791 -27530 -7763 26778 11186 7487 18375 11479 -7653 -8232 1323
15935A323j2170j2324k822P061N559j758k700p842J6782K3999K8449j506n762
$$ 1323 -10847 -23171 -25993 -18932 -13373 -15131 -17831 -25673 -8891 15108 43557 42051 36289
15922C6289k2820l3270m36O261J2972L185R38l085M271j3780k2021J31J4423k9466
$$ 36289 13469 -19801 -20237 -13976 -1004 2181 3119 34 4305 -9475 -31496 -31365 -16942 -46408
15908d6408j8754N50J1439K1914J0964l2659O45J4198J1625K4188k5059Q119M501
$$ -46408 -65162 -64612 -53173 -31259 -20295 -52954 -52309 -38111 -26486 -2298 -27357 -19238 -14737
15895a4737J9677M386Q103N604k975J3864k517P30N67k4442J186l3862j1980Q910
$$ -14737 4940 9326 17429 23033 20058 33922 31405 32135 32702 8260 9446 -24416 -36396 -27486
15881b7486p417K0952N8818j006m1303q692M694l97j9471K297j926R283l313p834
$$ -27486 -34903 -13951 44867 43861 2558 -6134 -1440 -1837 -21308 -19011 -20937 -11654 -14967 -22801
15867b2801J6765J535j0651R604J0728N303k1840o466N847P846Q221R36j3014
$$ -22801 -6036 -4501 -15152 -5548 5180 10483 -11357 -17823 -11976 -4130 4091 5027 -7987
15854g987k5685m905K610K7005J4774J5381J8745j1685k2044r996k0340N198N58
$$ -7987 -33672 -38577 -35967 -8962 5812 21193 39938 28253 6209 -3787 -24127 -18929 -18371
15841a8371j3180p148J9714R995j5744J9116j5859m955Q704J0666k707q312J861
$$ -18371 -31551 -38699 -18985 -8990 -24734 -5618 -21477 -26432 -17728 -7062 -9769 -18081 -16220
15828a6220Q735n240j644K4692p621j3985R060j6694j5376j0451j6322K398K6993
$$ -16220 -7485 -12725 -14369 10323 2702 -11283 -2223 -18917 -34293 -44744 -61066 -58668 -31675
15815c1675J6991j596o603k764M824m234J774k36K804j998m986J1789J347Q059
$$ -31675 -14684 -16280 -22883 -25647 -20823 -25057 -23283 -23519 -20715 -22713 -27699 -15910 -14563 -6504
15801f504J7350J583n602J3119J4724l37j9720J2963J627m1022o241J6659j0258
$$ -6504 10846 12429 6827 19946 34670 34333 14613 27576 29203 -11819 -18060 -1401 -11659
15788a1659k518q853J59J4839j380J483J1958m344j0118O051j3494j0275k2613
$$ -11659 -14177 -23030 -22871 -8032 -9412 -7929 4029 -315 -10433 -4382 -17876 -28151 -50764
15775e0764q195Q024J2897J8528J0655J715k123k2574M963O804J1520K1856j5944
$$ -50764 -58959 -50935 -38038 -19510 -8855 -7140 -9263 -31837 -26874 -20070 -8550 13306 -2638
15762b638n599J952K4097N605J1119q117k7026k9665M670K847l812o566L195l668
$$ -2638 -8237 -6285 17812 23417 34536 26419 -607 -30272 -25602 -22755 -26567 -33133 -29938 -33606
15748c3606j5395m594j3659j5935J1832K061P824K2135M6540J0223k2302Q667
$$ -33606 -49001 -53595 -67254 -83189 -71357 -69296 -61472 -39337 7203 17426 -4876 3791
15736C791m046j3045j3224O906R841J0877J8358l1368r039K4228J8724j7911m662
$$ 3791 -255 -13300 -26524 -19618 -9777 1100 19458 -11910 -20949 3279 22003 4092 -570
15723e70p648m237j1972J533M974J5968J5634J3307J0776j4497k2197k2713J3277
$$ -570 -8218 -12455 -24427 -22894 -17920 -1952 13682 26989 37765 23268 1071 -21642 -8365
15710h365j313m2679k0686N554J1070o027J2532q288J8553K810J5753L7807k2649
$$ -8365 -9678 -52357 -73043 -67489 -56419 -62446 -49914 -58202 -39649 -36839 -21086 16721 -5928
15697e928J6508j2933j1520K0013O417j7060l2979J6737J0741J2319O76k621J6405
$$ -5928 10580 -2353 -13873 6140 12557 -4503 -37482 -20745 -10004 2315 2991 370 16775
15684A6775O958l5738L926J3744J8385l7073n5051K7557J9438L4618L8676j279
$$ 16775 23733 -12005 -8079 5665 24050 -13023 -68074 -40517 -21079 13539 52215 50936
15672E0936k2222m578n283p884n860M610P293N342k114j8219j6516l9930O377
$$ 50936 28714 24136 18853 10969 5109 9719 17012 22354 20240 2021 -14495 -54425 -48048
15659d8048L5287J1747j3757N500J9121J4983j6244J5339K7796l4200j7666n38
$$ -48048 -12761 -1014 -14771 -9271 9850 24833 8589 23928 51724 17524 -142 -680
15647f80k1950K5818J2841k2556j8000j4293n890O262K4280l830K623J6197l101
$$ -680 -22630 3188 16029 -6527 -24527 -38820 -44710 -38448 -14168 -17998 -15375 822 -2279
15634b279K90J7362k7668o693K2679q251k0506m466O361l797O224K0375J4832
$$ -2279 -1989 15373 -12295 -18988 3691 -4560 -25066 -29532 -23171 -26968 -20744 -369 14463
15621A4463k149o751j4501p447r340O184K0397J4280R84k4779j0587o114j602
$$ 14463 12314 5563 -8938 -16385 -25725 -19541 856 15136 16120 -8659 -19246 -25360 -26962
15608b6962K109J3233j65l1069J919N999j134n597J3101J3035K9769O959k1225
$$ -26962 -24853 -11620 -11785 -42854 -40935 -34936 -36070 -41667 -28566 -15531 14238 21197 -28
15595b8k8025j1107O803J2976j504j7770M779L7373j4066k189K681J5468O225
$$ -28 -28053 -39160 -32357 -19381 -20885 -38655 -33876 3497 -10569 -12758 -10077 5391 11616
15582A1616J405l006j3882n920j3528j1119L3638J9471K1325L026j7255j5289
$$ 11616 13021 10015 -3867 -9787 -23315 -34434 -796 18675 40000 43026 25771 10482
15570A0482j04N373N123J2122m365J139j5454k1958r354J6805o979J141k9434
$$ 10482 10378 15751 20874 32996 28631 29770 14316 -7642 -16996 -191 -7170 -6029 -35463
15557c5463j2607L1784M1957K6401j2468j9415N045j0935m926j8032l9399L190
$$ -35463 -48070 -16286 25671 52072 39604 20189 25234 14299 9373 -8659 -48058 -44868
15545d4868n908k1577K5286N4249J7215j689P03j5376l462j1923M483K4175K0585
$$ -44868 -50776 -72353 -47067 7182 24397 22708 23411 8035 4573 -7350 -2867 21308 41893
15532D1893Q224k5315k1305l3029J3062J6295o608m283Q725k438m066N651j7850
$$ 41893 50117 24802 3497 -29532 -16470 -175 -6783 -11066 -2341 -4779 -8845 -3194 -21044
15519b1044K4456J6527m143n11l0024k3527j8635L224o520K3882J2095j1709K556
$$ -21044 3412 19939 15796 15285 -14739 -38266 -56901 -53677 -60197 -36315 -24220 -35929 -33373
15506c3373o982r416J8829J2192m710K0566J3101j4316j2262J0597q91j4763m232
$$ -33373 -40355 -49771 -30942 -18750 -23460 -2894 10207 -4109 -16371 -5774 -6665 -21428 -25660
15493b5660J6158L1670P175k0688k9600Q73R732n424k9312r711K7970L5025P568
$$ -25660 -9502 22168 29343 8655 -20945 -20072 -10340 -15764 -45076 -54787 -26817 8208 15776
15480A5776J259j882k5493J5867k913J612k170J19r120p134J3446j7947n742n567
$$ 15776 17035 15153 -10340 5527 2614 4226 2056 2175 -6945 -14079 -633 -18580 -24322 -29889
15466b9889j5218Q589P723j4271J5362M4684j2830m9811l797K2333J2261j4925
$$ -29889 -45107 -36518 -28795 -43066 -27704 16980 4150 -45661 -49458 -27125 -14864 -29789
15454b9789K1113K0065M151k8590j7038L492j5072q023k403J6389L291J5393J1537
$$ -29789 -8676 11389 15540 -13050 -30088 -26596 -41668 -49691 -52094 -35705 -32414 -17021 -5484
15441e484K2243n04o243p5j474J333M4J158m933o073L05P517Q344k8905K201K3293
$$ -5484 16759 16255 10012 9937 8463 9796 9840 10998 6065 -8 297 7814 16158 -12747 -10546 12747
15425A2747K2724k0649j7474j2824k365J6896J6142j273K3494J1826K0370k802
$$ 12747 35471 14822 -2652 -15476 -17841 -945 15197 13924 37418 49244 69614 66812
15413F6812J607L5417N0240N4346O5730Q7779J18050J20720R8656J13959P8869
$$ 66812 68419 103836 154076 208422 274152 361931 479981 600701 699357 813316 892185
15402H92185N7521N6066Q063k5728q0057p6443p3926j05257r4898r4563r4828
$$ 892185 949706 1005772 1013835 988107 908050 831607 757681 652424 557526 462963 368135
15391C68135m8894l7441l8500m7026r675k8665k8114k0335j2544j1664q696k9150
$$ 368135 319241 281800 243300 196274 186599 157934 129820 109485 96941 85277 76581 47431
15379D7431k1692j8559L1278J3556j1478L229k5342L855r973j9805p651m880O757
$$ 47431 25739 7180 38458 52014 40536 43765 18423 22278 12305 -7500 -15151 -20031 -13274
15366a3274O254P950j175J1712J481r328O022j6966J681Q526j2987j3238J441
$$ -13274 -7020 930 -245 11467 12948 3620 9642 -7324 -5643 2883 -10104 -23342 -21901
15353b1901r710j6736J3138K2066J3901p416j0990J3032j635l3489J8057N532
$$ -21901 -31611 -48347 -35209 -13143 758 -6658 -17648 -4616 -6251 -39740 -21683 -16151
15341a6151j2558O628o10K7133J1382K1736L8411M478r086J8806N860R858R04
$$ -16151 -28709 -22081 -22691 4442 15824 37560 75971 80449 71363 90169 96029 105887 106791
15328A06791L4978N188K904m5276k9810J9417L1998N070m4856o0236j9700j3386
$$ 106791 141769 146957 149861 104585 74775 94192 126190 131260 86404 26168 6468 -6918
15316f918J8828N129K0499K084p012k192q358K909o523j3197k896j084L7199l909
$$ -6918 11910 17039 37538 39622 32610 30418 22060 24969 18446 5249 2353 1269 38468 34559
15302C4559j5565J5213l639k3159j5308R822m242J9674R74j5762Q68K650j2200
$$ 34559 18994 34207 30568 7409 -7899 1923 -2319 17355 18329 2567 3435 6085 -6115
15289f115r830j3917L1201p633k6049J5735K3311M261p971q311j775O042P493
$$ -6115 -15945 -29862 1339 -6294 -32343 -16608 6703 10964 2993 -5318 -7093 -1051 6442
15276F442j9511m370r37o657q356N397J0733k038q688K6440J1978k1548j9300
$$ 6442 -13069 -17439 -18376 -25033 -33389 -27992 -17259 -19297 -27985 -1545 10433 -11115 -30415
15263c0415j042K2689R115j3502O24J498M79Q725K7889N5653n479j2667o35M9333
$$ -30415 -31457 -8768 347 -13155 -12531 -11033 -10554 -1829 26060 81713 76234 63567 62932 112265
15249A12265P1755O5273O5278P0463Q2984N4894M0557J8465l4629k116k1241o1900
$$ 112265 184020 249293 314571 385034 468018 522912 563469 581934 547305 545189 523948 462048
15237D62048q4160o2331m8721r215j6108n1622m9415j5764j4110k7311O823K2514
$$ 462048 377888 315557 266836 257621 241513 189891 140476 124712 110602 83291 90114 112628
15225A12628k1800m7605J4719j3279k6414n5550l116K1410K7397J926j2519k1218
$$ 112628 90828 43223 57942 44663 18249 -37301 -40417 -19007 8390 10316 -2203 -23421
15213b3421J8445R403j658j6524k685K0631P259P448L79j3525k0392J17k1401
$$ -23421 -4976 4427 2769 -13755 -16440 4191 11450 18898 19277 5752 -14640 -14523 -35924
15200c5924R620l756J5338K5140N282j3116l1511J4093J0962K755l258L046L961
$$ -35924 -26304 -30060 -14722 10418 15700 2584 -28927 -14834 -3872 -1117 -4375 -1329 2632
15187B632p530J8916j6608m608O348j1128j6366Q359L1823O821k390j1310j6516
$$ 2632 -4898 14018 -2590 -7198 -850 -11978 -28344 -19985 11838 18659 16269 4959 -11557
15174a1557p535J1862j3195j5947J1714k445j8398J7669J208K3432L082l755o61
$$ -11557 -19092 -7230 -20425 -36372 -24658 -27103 -45501 -27832 -26624 -3192 -110 -3865 -4526
15161d526r467k9309K5109K0108j6822J896J9698k5855l0121p477o524n492M788
$$ -4526 -13993 -43302 -18193 1915 -14907 -13011 6687 -19168 -49289 -56766 -63290 -68782 -63994
15148f3994K7545J1824j5379o374J6848p39P647p526q339j0970q347j671o581
$$ -63994 -36449 -24625 -40004 -46378 -29530 -30269 -22622 -30148 -38487 -49457 -57804 -59475 -66056
15135f6056J3223J6670K6270p811m431k4550m079K679J6035N2419L0519l3434
$$ -66056 -52833 -36163 -9893 -17704 -22135 -46685 -50764 -48085 -32050 20369 50888 17454
15123A7454k5668J232J0394J7916K5152n461k2319j0907J281J5589k558r988k0264
$$ 17454 -8214 -6982 3412 21328 46480 41019 18700 7793 9074 24663 22105 12117 -8147
15110h147r687J2530K4845J3869m922q32j180j0619J1921l463j1811k7069l8277
$$ -8147 -17834 -5304 19541 33410 28488 27656 26476 15857 27778 24315 12504 -14565 -52842
15097e2842J4597J8102N086M347J6420K1629R455l0833j9710J466J3626J0849
$$ -52842 -38245 -20143 -15057 -10710 5710 27339 36794 5961 -13749 -12283 1343 12192
15085A2192j8426j3315j6135J0596J3025k8521j0740R255r881j1287K0596L0619
$$ 12192 -6234 -19549 -35684 -25088 -12063 -40584 -51324 -42069 -51950 -63237 -42641 -12022
15073a2022K2063m155M768j0165l3658j769J7966J9963J9805k11j5588N771O022
$$ -12022 10041 5886 10654 489 -33169 -34938 -16972 2991 22796 22585 6997 12768 18790
15060A8790K016j0173k8013k4684J1665L1892K263k775o872m199j2192o657M484
$$ 18790 20806 10633 -17380 -42064 -30399 1493 3756 981 -5891 -10090 -22282 -28939 -24455
15047b4455J4149j380j787J1319J0886J7407J934J1729r500j3942J340j4375j934
$$ -24455 -10306 -11686 -13473 -2154 8732 26139 28073 39802 30302 16360 17700 3325 1391
15034A391j2037j490J1286o126r152q474J5726k2338R77L819q156J7088K0521
$$ 1391 -10646 -12136 -850 -6976 -16128 -24602 -8876 -31214 -30237 -26418 -34574 -17486 3035
15021C035j7849j6063j6958j1091J2740P418R777K0930o809L79J1373J6580j2861
$$ 3035 -14814 -30877 -47835 -58926 -46186 -38768 -28991 -8061 -14870 -14491 -3118 13462 601
15008F01m231J356j3663k0645r557K0143L8301j435J1405L039k0756J0258N2134
$$ 601 -3630 -2274 -15937 -36582 -46139 -25996 12305 10870 22275 25314 4558 14816 66950
14995F6950J2711M7875J21645J50214J56413K24718K26315P3295j2438P3533L0057
$$ 66950 79661 127536 249181 399395 555808 780526 1006841 1080136 1067698 1141231 1171288
14984A171288k56696k67024j92194r1682m7704o3156l6263j6428l2778j714j9947
$$ 1171288 914592 647568 455374 363692 315988 252832 216569 200141 167363 165649 145702
14973A45702n159p410l5025m4244j0288r711j9109j407J4560k1058r569j3953
$$ 145702 140543 133133 98108 53864 43576 33865 14756 13349 27909 6851 -2718 -16671
14961a6671N437M634k0174M268J5114l4082j9976J6266K6891J1412m563r5L1371
$$ -16671 -11234 -6600 -26774 -22506 -7392 -41474 -61450 -45184 -18293 -6881 -11444 -11539 19832
14948A9832J6062j7991o554R023j2066j0115J0348k02J3034R058k6541Q802K2892
$$ 19832 35894 17903 11349 20372 8306 -1809 8539 8337 21371 30429 3888 12690 35582
14935C5582p66j3591r326j4558j6526o356n367J6151J6914l051k5488n076J7815
$$ 35582 34816 21225 11899 -2659 -19185 -25541 -30908 -14757 2157 -894 -26382 -31458 -13643
14922a3643M4133J8089m565l7219j2834k174K2433M23k0292k83J454n638p94L644
$$ -13643 30490 48579 44014 6795 -6039 -8213 14220 14643 -5649 -5932 -4478 -10116 -10910 -7266
14908g266J9637l198M44R00k7235J8780j584N70K3280k2740j9217J2021J9588
$$ -7266 12371 9173 9617 10517 -16718 2062 478 1048 24328 1588 -17629 -5608 13980
14895A3980j0624j4907k2742j8653J3995J7084j1407K4504L8205j2299j1117O230
$$ 13980 3356 -11551 -34293 -52946 -38951 -21867 -33274 -8770 29435 17136 6019 12249
14883A2249k192J0011J8284P21j9510P783j0317j8962Q102M7859M445k7076l5272
$$ 12249 10057 20068 38352 39073 19563 27346 17029 -1933 6169 54028 58473 31397 -3875
14870c875J0560J2406R609J0357K411l7331k7190N499K505j0946k9621R168L0245
$$ -3875 6685 19091 28700 39057 41468 4137 -23053 -17554 -15049 -25995 -55616 -46448 -16203
14857a6203k964k7503k832L8357l087J0808K777J9098k1385k5958L504J085r642
$$ -16203 -19167 -46670 -49502 -11145 -14232 -3424 -647 18451 -2934 -28892 -25388 -24303 -33945
14844c3945o321K6839O205k5022N421j105o239l202K6307J7181J8413j384k3829
$$ -33945 -40266 -13427 -7222 -32244 -26823 -27928 -34167 -37369 -11062 6119 24532 23148 -681
14831f81L929q910j6746J3027R275n131j3047p890J6987K332l081N125J5761J510
$$ -681 3248 -5662 -22408 -9381 -106 -5237 -18284 -26174 -9187 -6855 -9936 -4811 10950 12460
14817A2460k749J9940K3385q421j6985k2468j9934L38O536l0299j6957K3768M275
$$ 12460 9711 29651 53036 44615 27630 5162 -14772 -14434 -7898 -38197 -55154 -31386 -27111
14804b7111j0978R475K4782J298l3976K3930L9277k5626j5859n649J3694J457
$$ -27111 -38089 -28614 -3832 -2534 -36510 -12580 26697 1071 -14788 -20437 -6743 -5286
14792e286k0636m40L657K4400K8903L26j2532j2628Q124j5794j6657l533j9159
$$ -5286 -25922 -26362 -22705 1695 30598 30924 18392 5764 13888 -1906 -18563 -22096 -41255
14779d1255j1548P294J3735O037Q231p579J640K7347j1205q824l084m841J588
$$ -41255 -52803 -45509 -31774 -25737 -17506 -25085 -23445 3902 -7303 -16127 -19211 -24052 -22464
14766b2464L9704j950k8220j8717J3714j252M21L3650M5028J329l3966j3107n163
$$ -22464 17240 15290 -12930 -31647 -17933 -19185 -18764 14886 59914 61243 27277 14170 9007
14753I007J3762j8471j3618l877K287q049l981J6212L611j6546k3401J1666K9082
$$ 9007 22769 4298 -9320 -13197 -10910 -18959 -22940 -6728 -3117 -19663 -43064 -31398 -2316
14740b316k5283q889J3730j1891k750K1709J7593l73j3833j586p267K0294L686
$$ -2316 -27599 -36488 -22758 -34649 -37399 -15690 1903 1530 -12303 -13889 -21156 -862 2824
14727B824J0931j0669l3830j0829o50J1621J0935m764J9419K7880j2871l3903
$$ 2824 13755 3086 -30744 -41573 -42223 -30602 -19667 -24431 -5012 22868 9997 -23906
14715b3906P825K1121n48j6226P60J8187k6922k8061M298K1880L2936j857M806
$$ -23906 -16081 5040 4492 -11734 -10974 7213 -19709 -47770 -43472 -21592 11344 9487 14293
14702A4293J4089P906j8846k4411N135R874R754j1735j2320j2147j2955O568J0195
$$ 14293 28382 36288 17442 -6969 -1834 8040 17794 6059 -6261 -18408 -31363 -24795 -14600
14689a4600J1230L0239k0299o955L785k1214m1114O090P542K1778K0950L10q598
$$ -14600 -3370 26869 6570 -385 3400 -17814 -58928 -52838 -45296 -23518 -2568 -2258 -10856
14676a0856R749J5704j7338M312J74o056K2453J7998j0451j2113j8819P822k980
$$ -10856 -1107 14597 -2741 1571 1745 -4311 18142 36140 25689 13576 -5243 2579 -401
14663d01p68l888K5915N578j2075j3285j8782o963P788N737l175L0759M789k7669
$$ -401 -1169 -5057 20858 26436 14361 1076 -17706 -24669 -16881 -11144 -14319 16440 21229 -6440
14649f440J7819J816J0575K700r677l2690O049M584J8801J3471P24j5701j5085
$$ -6440 11379 13195 23770 26470 16793 -15897 -9848 -5264 13537 27008 27732 12031 -3054
14636c054j1075P551m2808j7325K0712J3463J0922K1597j1926k3487J0509R977
$$ -3054 -14129 -6578 -49386 -66711 -45999 -32536 -21614 -17 -11943 -35430 -24921 -14944
14624a4944m5167J0743K6103o471O164J6511k522k707o108j7669j1144J6002J1108
$$ -14944 -60111 -49368 -23265 -29736 -23572 -7061 -9583 -12290 -18398 -36067 -47211 -31209 -20101
14611b0101M537j1058J6693L524l2917K7476J0044M673J2449j2999j722P848J0777
$$ -20101 -15564 -26622 -9929 -6405 -39322 -11846 -1802 2871 15320 2321 599 8447 19224
14598A9224j4715j946M044R280K4911k6850k7663J0119K0731j0507j2684j3694
$$ 19224 4509 2563 6607 15887 40798 13948 -13715 -3596 17135 6628 -6056 -19750
14586a9750O576R03j6951J2933M870J6542L3531R104k7904r208j4852j935J1853
$$ -19750 -13174 -12271 -29222 -16289 -11419 5123 38654 47758 19854 10646 -4206 -6141 5712
14573E712r528l449j5234l0180J1254K1594j343R18R244j860J630J1689j5710
$$ 5712 -3816 -7265 -22499 -52679 -41425 -19831 -21174 -20256 -11012 -12872 -11242 447 -15263
14560a5263J797L1017r667k2251j6396J8330J9532r267l899Q806J6582J046l5196
$$ -15263 -13466 17551 7884 -14367 -30763 -12433 7099 -2168 -6067 2739 19321 20367 -14829
14547a4829q394O559J4901K2834K6353l0359l2508J5696N113j4924j4293j0743
$$ -14829 -23223 -16664 -1763 21071 47424 17065 -15443 253 5366 -9558 -23851 -34594
14535c4594J520K7798P582j1261K998K1967q051P6j8809m645J4024q5j5315Q35
$$ -34594 -33074 -5276 2306 -8955 -5957 16010 7959 8035 -10774 -15419 -1395 -1480 -16795 -15960
14521a5960P403Q546J5312k3628l36o117K8907m564k8089j4188M771n823L547
$$ -15960 -8557 -11 15301 -8327 -8663 -14780 14127 9563 -18526 -32714 -27943 -33766 -30219
14508c0219O332J171N197O831j4299L0884K9020l5647n680R726J1075j2433o570
$$ -30219 -23887 -22716 -17519 -10688 -24987 5897 34917 -730 -6410 3316 14391 1958 -4612
14495d612j6220k7795K6992K7849O974j1404j1333o436k055k787J993p855N23
$$ -4612 -20832 -48627 -21635 6214 13188 1784 -9549 -15985 -18040 -20827 -18834 -26689 -26166
14482b6166Q505M965O092p655l504m171r06J1132k424n225N177J5860O791o593
$$ -26166 -17661 -12696 -6604 -14259 -17763 -21934 -22840 -11708 -14132 -19357 -14180 1680 8471 1878
14468A878k7226J554N694j2848j8721j4031M768M399p114J8176K854K5133J2781
$$ 1878 -25348 -23794 -18100 -30948 -49669 -63700 -58932 -54533 -61647 -43471 -40617 -15484 -2703
14455b703k0967k0864m723K4556k110r792p321J4977J8884J5839n315j6213N009
$$ -2703 -23670 -44534 -49257 -24701 -26811 -36603 -43924 -28947 -10063 5776 461 -15752 -10743
14442a0743Q443n243j0850m063j215n619N173k8024n948k1128k3806K9553J6181
$$ -10743 -2300 -7543 -18393 -22456 -23671 -29290 -24117 -52141 -58089 -79217 -103023 -73470 -57289
14429e7289o583L1060L2879O476L796q649n796R65k6302l1051L258l877J3070
$$ -57289 -63872 -32812 67 6543 10339 1690 -4106 -3141 -29443 -60494 -57236 -61113 -48043
14416d8043K5419m881l297j9355P135L6000J5696j3748j8537m51j601K0788j2384
$$ -48043 -22624 -27505 -30802 -50157 -43022 -7022 8674 -5074 -23611 -24062 -25663 -4875 -17259
14403a7259k3993K1388J3897l481O297L4385K2956O832k4433m7283J033j3471
$$ -17259 -41252 -19864 -5967 -9448 -3151 31234 54190 61022 36589 -10694 -9661 -23132
14391b3132j3373J8295J044j6715J714K2252J9243p505o521r701L4745O562J3112
$$ -23132 -36505 -18210 -17166 -33881 -32167 -9915 9328 1823 -4698 -14399 20346 26908 40020
14378D0020M372j0883k9257j4541q209k1425K1927L4954j2911j9556P311K3868
$$ 40020 44392 33509 4252 -10289 -18498 -39923 -17996 16958 4047 -15509 -8198 15670
14366A5670L090L234j6580j1832l048j969K3889j7427l9258j7956K8604L5523
$$ 15670 18760 21994 5414 -6418 -9466 -11435 12454 -4973 -44231 -62187 -33583 1940
14354A940K8327J802k9088n1834j0432J0432J2898k429J4882P62j3289J3885K4408
$$ 1940 30267 32069 2981 -48853 -59285 -48853 -35955 -38384 -23502 -22740 -36029 -22144 2264
14341B264o217k5383L1819L6557j9213q948j97j5588j0075k3032l6407J8139J6818
$$ 2264 -3953 -29336 2483 39040 19827 10879 10682 -4906 -14981 -38013 -74420 -56281 -39463
14328c9463n916k474N323J9221k6012k4622j3006J8422M0729l043p792Q27J5611
$$ -39463 -45379 -47853 -42530 -23309 -49321 -73943 -86949 -68527 -27798 -30841 -38633 -37806 -22195
14315b2195O067R484Q759M30j3028j2923r487P084r619J1274J3023J1885R7O716
$$ -22195 -16128 -6644 2115 2545 -10483 -23406 -32893 -25809 -35428 -24154 -11131 754 851 7567
14301G567j3361O131r760j7278p932k169J1932J3421J015K6415o410J0242p574
$$ 7567 -5794 337 -9423 -26701 -34633 -36802 -24870 -11449 -10434 15981 9571 19813 12239
14288A2239M278n824O221M981j0957j0312k1431N98P97K0651O189J0906l94q054
$$ 12239 16517 10693 16914 21895 10938 626 -20805 -20207 -19410 1241 7430 18336 17942 9888
14274I888q859k0193j1467J9385J8041o886j1476j558K031j4808L9717J0061k2836
$$ 9888 1029 -19164 -30631 -11246 6795 -91 -11567 -13125 -11094 -25902 13815 23876 1040
14261A040J5155J1597k2663l1608j1047J3801K6764q84j501M419J883N099j979
$$ 1040 16195 27792 5129 -26479 -37526 -23725 3039 2155 654 5073 6956 12055 10076
14248A0076j2320K1771q801j6654K2595J9078J0566k1107j5820r410j0134j2044
$$ 10076 -2244 19527 10726 -5928 16667 35745 46311 25204 9384 -26 -10160 -22204
14236b2204m226m113k2910R930K2740J6551J2619j673J4407p675j9523j9230l713
$$ -22204 -26430 -30543 -53453 -43523 -20783 -4232 8387 6714 21121 13446 -6077 -25307 -29020
14223b9020J3869M0868J512j6403J2188J1712P656j0261j4117O81L100l659P205
$$ -29020 -15151 25717 27229 10826 23014 34726 42382 32121 18004 18685 21785 18126 25331
14210B5331J5664l387j1744j0947j9814l0112O282R192J1140L069J5999j1045
$$ 25331 40995 37608 25864 14917 -4897 -35009 -28727 -19535 -8395 -5326 10673 -372
14198c72p858J7409k8430j6453M21L506j5128l767K6412J0640r271Q892n594j2678
$$ -372 -8230 9179 -19251 -35704 -35283 -31777 -46905 -50672 -24260 -13620 -22891 -13999 -19593 -32271
14184c2271k0035K5697R389J0021j5034k8099K2857K7325k885q34q156j0122k4074
$$ -32271 -52306 -26609 -17220 -7199 -22233 -50332 -27475 -150 -3035 -3869 -12025 -22147 -46221
14171d6221P998K043J2498K9219L9086L114p160k6243k4276j4010J975J8558J3837
$$ -46221 -38223 -36180 -23682 5537 44623 47737 40577 14334 -9942 -23952 -21977 -3419 10418
14158A0418Q003R411J6415j8262o721j2154j6009M025m488J0323J6267j353J4298
$$ 10418 18421 27832 44247 25985 19264 7110 -8899 -4874 -9362 961 17228 15875 30173
14145C0173M7803M1518k55q00J2944L837N167M6449Q2498P0855J10527J47753
$$ 30173 77976 119494 119239 118439 131383 135220 140387 186836 269334 340189 450716 598469
14133E98469J60612J87021K00761J75965J22743J25820R1554j0658o7275j45601
$$ 598469 759081 946102 1146863 1322828 1445571 1571391 1662945 1652287 1585012 1439411
14123A439411j40604j38755j48928j59940j47943j52549j05421o9033m9501j4430
$$ 1439411 1298807 1160052 1011124 851184 703241 550692 445271 376238 326737 312307
14113C12307m2423l2184k7529k4012j7019l4671k6119l2671l1110J4186K7869
$$ 312307 269884 237700 210171 186159 169140 134469 108350 75679 44569 58755 86624
14102H6624l472m0830M582P297j3537l1346m382L079m632j040j007J3177K5318
$$ 86624 83152 42322 46904 54201 40664 9318 4936 8015 3383 2343 1336 14513 39831
14089C9831j6544l1382j9577K1372J6084k995j8842p856R78j3372n89K142M3649
$$ 39831 23287 -8095 -27672 -6300 9784 6789 -12053 -19909 -18931 -32303 -32892 -30750 12899
14076A2899K6312N732j1926n1399l4595J2760J8810K7821J0968l69k0086j7770
$$ 12899 39211 44943 33017 -18382 -52977 -40217 -21407 6414 17382 17013 -3073 -20843
14064b0843K141J5995j2466j5018L375m370P609L1837K5275M130k2320k8265J9888
$$ -20843 -18702 -2707 -15173 -30191 -26816 -31186 -23577 8260 33535 37665 15345 -12920 6968
14051F968L120M707N312R773L01k4282p573m16j5674p916R546N817R73j3568j8127
$$ 6968 10088 14795 20107 29880 30181 5899 -1674 -2090 -17764 -25680 -16134 -10317 -9344 -22912 -41039
14036d1039O056J8008J298l9194o695J9877r440k448j3198J568K5521J0958J6781
$$ -41039 -34983 -16975 -15677 -54871 -61566 -41689 -51129 -53577 -66775 -65207 -39686 -28728 -11947
14023a1947K6123J0835j7862j9308j8423l111n932p044J4443K0927O926k4882
$$ -11947 14176 25011 7149 -12159 -30582 -33693 -39625 -46669 -32226 -11299 -4373 -29255
14011b9255k2362K4087K1998j0176l5291J5801M1199k5672k3703P679J3909O191
$$ -29255 -51617 -27530 -5532 -15708 -50999 -35198 6001 -19671 -43374 -35695 -21786 -15595
13999a5595J4909j4650j5487J111M7256R892j7070k2018j4952J3444N509K706
$$ -15595 -686 -15336 -30823 -29712 17544 27436 10366 -11652 -26604 -13160 -7651 -4945
13987d945k925P789o165l877j3434q984j3901K2642J1851L693J0510J7172p891
$$ -4945 -7870 -81 -6246 -10123 -23557 -32541 -46442 -23800 -11949 -8256 2254 19426 11535
13974A1535j5656o425o243j5560j4M507O474Q339J1012K0797j0562j0608j8394
$$ 11535 -4121 -10546 -16789 -32349 -32363 -27856 -21382 -13043 -2031 18766 8204 -2404 -20798
13961b0798j811r218P145K5861j117j9860j7308L41k455J2850J8901M133r30m652
$$ -20798 -22609 -31827 -24682 1179 62 -19798 -37106 -36765 -39220 -26370 -7469 -3336 -4266 -8918
13947h918J2740r637q455K7835J1559j5284j5821p290J7315J1726J3428k9028
$$ -8918 3822 -5815 -14270 13565 25124 9840 -5981 -13271 4044 15770 29198 170
13935A70Q354K0885k9890K7261L5069J7395M8968Q7211N7248K2136k5577k9124
$$ 170 8524 29409 -481 26780 61849 79244 128212 215423 272671 294807 269230 240106
13923B40106m3085m3069l7567m341j1106l1084J866L776R660K6240j3385m9737
$$ 240106 197021 153952 116385 112044 100938 69854 71720 75496 85156 111396 98011 48274
13911D8274K038J1666l6215k983J6271M098k8341l4205j8711J5948K4018K2029
$$ 48274 50312 61978 25763 22780 39051 43149 14808 -19397 -38108 -22160 1858 23887
13899B3887J9256R027j2741j5724m630l1088L256M027j418K84K08k2280o692J4150
$$ 23887 43143 52170 39429 23705 19075 -12013 -8757 -4730 -6148 -5864 -5656 -27936 -34628 -20478
13885b0478k307J7790L764K8148M58n056k1083m1322j2424l024l67K9858L0314
$$ -20478 -22785 -4995 -1231 26917 27375 22319 1236 -40086 -52510 -55534 -55901 -26043 4271
13872D271k3159K508J6995l7309R332K3175J0167q869o903K8607J7029j3573j8394
$$ 4271 -18888 -16380 615 -36694 -27362 -4187 5980 -2889 -9792 18815 35844 22271 3877
13859C877K1241J413m0057J1877j286Q286R373p063j4994J0504j2764j1773J6883
$$ 3877 25118 26531 -13526 -1649 -2935 5351 14724 7661 -7333 3171 -9593 -21366 -4483
13846d483J5826l84j971k5941K2336J9754k91j9840q677N156M846j9394k19J2524
$$ -4483 11343 10959 8988 -16953 5383 25137 24846 5006 -3671 1485 6331 -13063 -13282 -758
13832g58R949r095J5202K7774N117l2008o344j7024k382K3506J1264n334p389
$$ -758 9191 96 15298 43072 48189 16181 9837 -7187 -9569 13937 25201 19867 12478
13819A2478J3212J7303N65k7573o186J6513J5743P58l4788j4945l495J6517q657
$$ 12478 25690 42993 43558 15985 9799 26312 42055 42813 8025 -6920 -10415 6102 -2555
13806b555m0324k0395Q332P754J4292J9695J853j820n890J1234j4101p381j8947
$$ -2555 -42879 -63274 -54942 -47188 -32896 -13201 -11348 -13168 -19058 -7824 -21925 -29306 -48253
13793d8253J0703K2527K5019J3271j2677k3126j05J5030n18P777K0711k531R004
$$ -48253 -37550 -15023 9996 23267 10590 -12536 -12641 2389 1871 9648 30359 27828 36832
13780C6832N113j8102L422J0372K4356k4094m675j799l761j2969R975N752l1397
$$ 36832 41945 23843 27265 37637 61993 37899 33224 31425 27664 14695 24670 30422 -975
13767i75J930k08o094O578J4944K796M81j2441J6945j4192q104o259j1806j3971
$$ -975 955 747 -5347 1231 16175 18971 19452 7011 23956 9764 1660 -4599 -16405 -30376
13753c0376n601K4468K4137k4665k3800R033M1958L276k7060J8984K5104p723
$$ -30376 -35977 -11509 12628 -12037 -35837 -26804 15154 18430 -8630 10354 35458 27735
13741B7735j0763j1428j1184j4840j7614m495K1614R028o457j0927K0559j630
$$ 27735 16972 5544 -5640 -20480 -38094 -42589 -20975 -11947 -18404 -29331 -8772 -10402
13729a0402j1054l1463J588L9617j39j1523l2505j3080L8419K9712N00j9226k4692
$$ -10402 -21456 -52919 -51331 -11714 -11853 -23376 -55881 -68961 -30542 -830 -330 -19556 -44248
13716d4248j3118j912o13K9909K5904K1561k6846k9440q09K4443K6220J075J0198
$$ -44248 -57366 -59278 -59891 -29982 -4078 17483 -9363 -38803 -39612 -15169 11051 12126 22324
13703B2324j9765k1308N517J2501P394k1691o778O271J8506K2266J9661J4683
$$ 22324 2559 -18749 -13232 -731 6663 -15028 -21806 -15535 2971 25237 44898 59581
13691E9581k510k0274m1650k9999m129K5590K2688l2781M774L277L0259q800m021
$$ 59581 57071 36797 -4853 -34852 -38981 -13391 9297 -23484 -18710 -15433 14826 6026 2005
13678B005j3068k4622j5735K4652K8691L0461L5070j7321k7918M292k5376Q950
$$ 2005 -11063 -35685 -51420 -26768 1923 32384 67454 50133 22215 26507 1131 10081
13666A0081M949l211R519O286k368j6532o610o730K1368K0549J4272j5437k1364
$$ 10081 15030 11819 21338 27624 25256 8724 2114 -4616 16752 37301 51573 36136 14772
13653A4772j8127P552L168k334r181L1111N521k562P171J6073P811J9834q817
$$ 14772 -3355 4197 7365 5031 -4150 26961 32482 29920 37091 53164 60975 80809 71992
13640G1992l2451k1710j8135j2824l3757o461R366j9335J8292K8557K236j4305
$$ 71992 39541 17831 -304 -13128 -46885 -53346 -43980 -63315 -45023 -16466 -14230 -28535
13628b8535N572O631m998K1402P327j3180j9603J925n198J8923J5917K105j8300
$$ -28535 -22963 -16332 -21330 72 7399 -5781 -25384 -23459 -28657 -9734 6183 8288 -10012
13615a0012o412l33N450J9123J4546L503l23j5177j597K0765k1431N420n303O824
$$ -10012 -16424 -16757 -11307 7816 22362 25865 25542 10365 8768 29533 8102 13522 8219 15043
13601A5043n725K6639O527k9331j0422n967J1302J0922r050K215k6098K353P119
$$ 15043 9318 35957 42484 13153 2731 -3236 8066 18988 9938 12153 -13945 -11592 -4473
13588d473k576J4070J0119k1986q445J6829o727j5066k992K3123J3774j609l30
$$ -4473 -7049 7021 17140 -4846 -13291 3538 -3189 -18255 -21247 1876 15650 14041 13711
13575A3711j2372l370J5524J7440o336M865j9792j8257j7031J034J180K1677L233
$$ 13711 1339 -2031 13493 30933 24597 29462 9670 -8587 -25618 -24584 -23404 -1727 1506
13562A506l8055k738O370J5454K1668M491N840K0804R486k6811m2309j0754L0477
$$ 1506 -36549 -39287 -32917 -17463 4205 8696 14536 35340 44826 18015 -24294 -35048 -4571
13549d571K6972j1040k6653N066k0426O249K0410n789j4286R312J1633N376k1685
$$ -4571 22401 11361 -15292 -10226 -30652 -24403 -3993 -9782 -24068 -14756 -3123 2253 -19432
13536a9432k3291J2623j680r771j373j9194j4222M131J9170K1029J76j3783J1619
$$ -19432 -42723 -30100 -31780 -41551 -42924 -62118 -76340 -72209 -53039 -32010 -31834 -45617 -33998
13523c3998K5662J8442n171j6084J237K0842o645J6912K3002M21O658k8276K911
$$ -33998 -8336 10106 4935 -11149 -9912 10930 4285 21197 44199 44620 51278 23002 25913
13510B5913J5166R656N435k6993M470L5713M928m512N225J8261L0414L2246M6210
$$ 25913 41079 50735 56170 29177 33647 69360 74288 69776 75001 93262 123676 155922 202132
13497B02132L3758O1934P1021M7609N2913K1374j0731j6674j2762l8685k0873
$$ 202132 235890 297824 368845 416454 469367 490741 480010 463336 450574 411889 391016
13486C91016j5350K647j3070n4637j8128J8441P013n815J9633M9563M8124K7900
$$ 391016 375666 378313 365243 310606 292478 310919 317932 312117 331750 381313 429437 457337
13474D57337M0579L3199o386j9721j7875l4028l4984m404k2989n2178k9201n9049
$$ 457337 497916 531115 524729 505008 487133 453105 418121 413717 390728 338550 309349 250300
13462B50300l5789j3310k932k5815l1691k3979o885k182j8768k2839K612J0128
$$ 250300 214511 201201 198269 172454 140763 116784 109899 107717 88949 66110 68722 78850
13450G8850J2790j3270L85J2278r696J1444l984l5135j4998o982r359r634M1146
$$ 78850 91640 78370 78755 91033 81337 92781 88797 53662 38664 31682 22323 12689 53835
13437E3835P14k4567j5516J9778j3430k5333r171O045J7311K0254k143J0446j0197
$$ 53835 54549 29982 14466 34244 20814 -4519 -13690 -7645 9666 29920 27777 38223 28026
13424B8026R235K0082M469r13r28o749k251K1343N045o454L0314L5384N4651P8443
$$ 28026 37261 57343 61812 60899 59971 53222 50971 72314 77359 70905 101219 136603 191254 269697
13410B69697N8158L6171L1106M7571M3653J4560L8767K0886k1037m7966q285l986
$$ 269697 327855 364026 395132 442703 486356 500916 539683 560569 539532 491566 483281 479295
13398D79295l6239l2162l0208n672L752K3156N244K9103J8587N0649N7654N2647
$$ 479295 443056 410894 380686 375014 378766 401922 407166 436269 454856 505505 563159 615806
13386F15806J5763j5421J711l4460n0018k7729k4065n6911l8713k0212m7176n5136
$$ 615806 631569 616148 617859 583399 533381 505652 481587 424676 385963 365751 318575 263439
13374B63439n7591k5251m0663k5161J6291N219L24j9341l4681k6810J4379J0846
$$ 263439 205848 180597 139934 114773 131064 136283 136607 117266 82585 55775 70154 81000
13362H1000k0967k2392q614J4869Q120m1163n975j2040j2365J2802L433r770J6739
$$ 81000 60033 37641 29027 43896 52016 10853 4878 -7162 -19527 -6725 -3292 -13062 3677
13349C677L8903J1548l584l852r458K3174j2241r699j6183k6907k077K8589m221
$$ 3677 42580 54128 50544 46692 37234 60408 48167 38468 22285 -4622 -6699 21890 17669
13336A7669r21k119n194O330o502j9036l5776p006L7959N903o61J8388K1899K061
$$ 17669 16748 14629 9435 15765 9263 -9773 -45549 -52555 -14596 -8693 -9354 9034 30933 32994
13322C2994p9j0493r886q394K5788p554l0045j909O018m874j313J2050K767l6421
$$ 32994 32915 22422 12536 4142 29930 22376 -7669 -9578 -3560 -8434 -9747 2303 5070 -31351
13308c1351r717K2970J3102J616K181K5804O210k2250k4585j0168K4458K47L187
$$ -31351 -41068 -18098 -4996 -3380 -1199 24605 30815 8565 -16020 -26188 -1730 -1483 1704
13295A704J7401j8104j083J67q836K6311N022k536J521m5690j7402l495J3228
$$ 1704 19105 1001 -82 85 -8751 17560 22582 20046 21567 -24123 -41525 -45020 -31792
13282c1792J1772j774N949K6425O911K859j8007j7180K2537J3784n24o119J7520
$$ -31792 -20020 -21794 -15845 10580 17491 20350 2343 -14837 7700 21484 20960 14841 32361
13269C2361J3753m541j4703J2491M405J0502j0124j0553k1838J868L374m749j5472
$$ 32361 46114 41573 26870 39361 43766 54268 44144 33591 11753 13621 16995 12246 -3226
13256c226K933L732O298J8342K551l110j6961o645j1403q68J925O854J2570j3587
$$ -3226 -293 3439 9737 28079 30630 27520 10559 3914 -7489 -8357 -6432 422 12992 -595
13242e95J0891J3869K826Q517q801j654l4951r212J6804M39N116n104M889q110
$$ -595 10296 24165 26991 35508 26707 25053 -9898 -19110 -2306 -1867 3249 -1855 3034 -5076
13228e076j0105j603n288M665J2657K604r785M0371n444k7947j8140P980N70P807
$$ -5076 -15181 -16784 -22072 -17407 -4750 -2146 -11931 28440 22996 -4951 -23091 -15111 -14541 -6734
13214f734L090q296K315J664K911N945q261k1631k921L1821K3697O410j210Q510
$$ -6734 -3644 -11940 -9625 -7961 -5050 895 -7366 -28997 -31918 -97 23600 30010 28800 37310
13200C7310r95k6684j8047j367L1519J4465j6853k9500K178q991K269L932R754
$$ 37310 36315 9631 -8416 -9783 21736 36201 19348 -10152 -7974 -16965 -14696 -10764 -1010
13187a010o191n994R509J6049J6256k1486M757J0582k3772k4332J7229K9972j4863
$$ -1010 -7201 -13195 -3686 12363 28619 7133 11890 22472 -1300 -25632 -8403 21569 6706
13174F706q267M468j0103N70k3727k4602J4978K434O760j3794m799J7468M0733
$$ 6706 -1561 2907 -7196 -6626 -30353 -54955 -39977 -37543 -30783 -44577 -49376 -31908 8825
13161H825M5877L6525J2746L34j604O622l0914k2042o718p142J6109J6067o953
$$ 8825 54702 91227 103973 104307 102703 109325 78411 56369 49651 42509 58618 74685 67732
13148F7732j3884M930K0715O581k2856J0915J2046k7096k2505J3811K898J5544
$$ 67732 53848 58778 79493 86074 63218 74133 86179 59083 36578 50389 53287 68831
13136F8831j311j9661R562J1970J0816q943o945q005K7681k604n520L945L146
$$ 68831 67520 47859 57421 69391 80207 71264 64319 56314 83995 81391 75871 79816 82962
13123H2962j0383k5672O442L1161J340P093R444j572J1536J9295R36j2124l443
$$ 82962 72579 46907 53349 84510 85850 92943 102387 100815 112351 131646 132582 120458 117015
13110A17015n946j3699P596M540J5648r063j1497J5986k755m868L2887Q318j1834
$$ 117015 111069 97370 104966 109506 125154 116091 104594 120580 117825 112957 145844 154162 142328
13097A42328k2160J261R693J4775N132k14J7238J8653q230k0420J1127K6774J8947
$$ 142328 120168 121429 131122 145897 151029 150815 168053 186706 178476 158056 169183 195957 214904
13084B14904P965Q659M1109P5754L8191M8641O8785O4986Q7996R1115R5601J28213
$$ 214904 222869 231528 272637 348391 386582 435223 504008 568994 656990 748105 843706 971919
13072I71919R7360K6576j5420l2702q421m1441j10723j42305q9813o2822m4958
$$ 971919 1069279 1095855 1080435 1047733 1039312 997871 887148 744843 655030 592208 547250
13061E47250o6207m1477j9056k0158j8583m3135m7787L503q461p034k2917R531
$$ 547250 481043 439566 420510 400352 381769 338634 290847 294350 285889 278855 255938 265469
13049B65469M673M857j1208Q387P070J5603k090L161j7134m4022l2237p812K7586
$$ 265469 270142 274999 263791 272178 279248 294851 292761 295922 278788 234766 202529 194717 222303
13036B22303Q579L261n895J1818K7480j4970J1681K06l0541k6300j4109J2494
$$ 222303 230882 234143 228248 240066 267546 252576 264257 264463 233922 207622 193513 206007
13024B06007J9916K9900J9594k8447l8193j9944M072L2962j6159J1193J3404J4041
$$ 206007 225923 255823 275417 246970 208777 188833 192905 225867 209708 220901 234305 248346
13012B48346m0489l939K3273q376j5534j8768P000l827q625K6506j0077O44k764
$$ 248346 207857 203918 227191 218815 203281 184513 191513 187686 179061 205567 195490 196134 193370
12999A93370j323L4742O32k6290j9235j7441L5096L3522p348k4976l5170k206
$$ 193370 192047 226789 227421 201131 181896 164455 199551 233073 225725 200749 165579 163373
12987A63373L4828J0920m749j2722m6278j3133K6552q450m65L133K3545K4136
$$ 163373 198201 209121 204372 191650 145372 132239 158791 150341 149876 153009 176554 200690
12975B00690J3315j8430R65j619j9017k2947m53K2004Q922k6117l4152k3355L857
$$ 200690 214005 195575 196540 194921 175904 152957 152504 174508 183430 157313 123161 99806 103663
12962A03663J4100k0606j8077k2087L3641j4468P009J5345k0896j5715k0900M0625
$$ 103663 117763 97157 79080 56993 90634 76166 83175 98520 77624 61909 41009 81634
12950H1634K2168l73j2491k5128R274j815j5922J9214K0018J7960L0801M489N9
$$ 81634 103802 103429 90938 65810 75084 73269 57347 76561 96579 114539 145340 149829 149888
12937A49888J3466j4887P477k4159l7454J0271J1338j0088n204r054O682o18R722
$$ 149888 163354 148467 155944 131785 94331 104602 115940 105852 100648 91594 98276 97658 107380
12924A07380k0193j7265j9455O117N143k8124J6428K7075j2558k203K9367M3312
$$ 107380 87187 69922 50467 56584 61727 33603 50031 77106 64548 62345 91712 135024
12912A35024J0348J432M3172J7055Q077L5763l262j0337p978k9935j6328R161
$$ 135024 145372 146804 189976 207031 215108 250871 247609 237272 229294 199359 183031 192192
12900A92192P143q809k5816l9520k3197Q530J3219j8920l0801J862K227J3683
$$ 192192 199335 190526 164710 125190 101993 110523 123742 104822 74021 75883 78110 91793
12888I1793J7192j1642j066r855j7331j5405J0478P910o506p737j1148J0134p491
$$ 91793 108985 97343 96277 86422 69091 53686 64164 72074 65568 57831 46683 56817 49326
12875D9326k1406l959L4579N329k4118k9133O734J7652m389r443j2319r417n903
$$ 49326 27920 23961 58540 63869 39751 10618 17352 35004 30615 21172 8853 -564 -6467
12862f467j7900j2541j3300K330J5398L9679J9130M391j5993m0576j9561j0321
$$ -6467 -24367 -36908 -50208 -47878 -32480 7199 26329 30720 14727 -25849 -45410 -55731
12850e5731q402L090j2837N712k2584l9044R070M2311L2994L4968L1405L1201
$$ -55731 -64133 -61043 -73880 -68168 -90752 -129796 -120726 -78415 -45421 -10453 20952 52153
12838E2153N8911N4727J7807R016K5055J6052k2502r425o995q670k6908k4303
$$ 52153 111064 165791 183598 192614 217669 233721 211219 201794 194799 186129 159221 134918
12826A34918o095J220o259R381K8505K8845J886k6902k3980j6467N577J5486q608
$$ 134918 128823 130043 123784 133165 161670 190515 192401 165499 141519 125052 130629 146115 137507
12813A37507j3352M433j3884M959L456p465l675n995J2235J7108j9463q311J6905
$$ 137507 124155 128588 114704 119663 123119 115654 111979 105984 118219 135327 115864 107553 124458
12800A24458L159K34J958l354j1754o608J2969N645O622L3671K3041J535r719
$$ 124458 127617 127851 129809 126455 114701 108093 121062 126707 133329 167000 190041 191576 181857
12787A81857j8098m0242j4997J5506K287J6255l256M917K5299K2835N19J160J192
$$ 181857 163759 123517 108520 124026 126313 142568 139312 144229 169528 192363 192882 194042 195234
12774A95234K0760q730L6404J6870J1460j1602j7194O418N843n316j0289P395
$$ 195234 215994 207264 243668 260538 271998 260396 243202 249620 255463 250147 239858 247253
12762B47253J7027j95j9818M636J8876N438r567l4434l3089j6893K823J9163k0503
$$ 247253 264280 264085 244267 248903 267779 273217 263650 229216 196127 179234 182057 201220 180717
12749A80717L004J6202l3643Q189K8902n939j0803j4372k054M1453L3130J5504
$$ 180717 183721 199923 166280 174469 203371 197432 186629 172257 170203 211656 244786 260290
12737B60290k1038l441j4230J6031K1280P773K5290Q068J1004K0413o716n057
$$ 260290 239252 235811 221581 237612 258892 266665 291955 300023 311027 331440 324724 319667
12725C19667R38J1309J6960J9288k9959j4315j762J8609J8271K0503n780K3445
$$ 319667 320605 331914 348874 368162 338203 323888 322126 340735 359006 379509 373729 397174
12713C97174k5445k5528j5526K4875M3663M1650L0052J6715O1735N3549O570K5374
$$ 397174 371729 346201 330675 355550 399213 440863 470915 487630 549365 602914 609484 634858
12701F34858K8920L1015K5002J9882Q240k438L5830K7001L3113O1466N6908N7085
$$ 634858 663778 694793 719795 739677 747917 745479 781309 808310 841423 902889 959797 1016882
12689A016882O5125Q8216N1286M7139N4465R2796J38392J07432J25290J41654
$$ 1016882 1082007 1170223 1221509 1268648 1323113 1415909 1554301 1661733 1787023 1928677
12679A928677J68956J88294J96187K41209K83363L76142M56701N74224P09637
$$ 1928677 2097633 2285927 2482114 2723323 3006686 3382828 3839529 4413753 5123390
12670E123390Q57606R93349J139547J262364J413783J599927J879952K262266
$$ 5123390 5980996 6974345 8113892 9376256 10790039 12389966 14269918 16532184
12662A6532184K866777L852843N480175P843132J0897644J4470157J7794634J9918564
$$ 16532184 19398961 23251804 28731979 36575111 47472755 61942912 79737546 99656110
12654I9656110K0471211K0144651J8910440J4661111O710701j431287o564868
$$ 99656110 120127321 140271972 159182412 173843523 180554224 179122937 172558069
12647A72558069j0518726j5646607j9631125j9649672j7277693j4935193j2520991
$$ 172558069 162039343 146392736 126761611 107111939 89834246 74899053 62378062
12640F2378062r721288p253110n452793m259101l559907l125431k837849k674493
$$ 62378062 52656774 45403664 39950871 35691770 32131863 29006432 26168583 23494090
12632B3494090k552522k434712k302757k110330j884938j643269j397314j175098
$$ 23494090 20941568 18506856 16204099 14093769 12208831 10565562 9168248 7993150
12624G993150r66533p71470o00328m98205m24121l68931l13137k68863k51093
$$ 7993150 7026617 6255147 5654819 5156614 4732493 4363562 4050425 3781562 3530469
12615C530469k41760k01381j66508j35989j50122j30118j04189j08279q9607n2972
$$ 3530469 3288709 3087328 2920820 2784831 2634709 2504591 2400402 2292123 2202516 2149544
12605B149544o3289r5302q8809l5930m9327o6142n5421r2450o6725n7569m0087
$$ 2149544 2086255 1990953 1902144 1866214 1816887 1750745 1695324 1602874 1536149 1478580 1438493
12594A438493m7063m7464m7108m5959o212Q090j0146k365p529j635N3486n184
$$ 1438493 1391430 1343966 1296858 1250899 1244687 1252777 1242631 1240266 1232737 1231102 1284588 1279404
12582A279404j6091r911j9743o4103o7531p0945p3491o3878m7703p1277n6489
$$ 1279404 1263313 1253402 1233659 1169556 1102025 1031080 957589 893711 846008 774731 718242
12571G18242l1381k9767k4134j6729k2679m0221k2416j1635r841J481K5115k4396
$$ 718242 686861 657094 632960 616231 593552 553331 530915 519280 509439 510920 536035 511639
12559E11639l0960k1304j3094R957j1681n73m617k5376j3578K1092j6607k9775
$$ 511639 480679 459375 446281 456238 444557 443984 439367 413991 400413 421505 404898 375123
12547C75123k1634l1056m735J3457j2227o185k185r134Q445k0582j7452j4931
$$ 375123 353489 322433 317698 331155 318928 312743 310558 301424 309869 289287 271835 256904
12535B56904R499J6001j4407Q295N696J6032J2373O970R250J0693j3784m15L0813
$$ 256904 266403 282404 267997 276292 281988 298020 310393 317363 326613 337306 323522 323107 353920
12522C53920n030j5627J426K3895J1869O250J939r615R476k5707l1455k200P551
$$ 353920 348890 333263 334689 358584 370453 376703 378642 369027 378503 352796 321341 319141 326692
12509C26692J4589j0122l737k2805j9961k3559j4741r769k1134j9103k6333P71
$$ 326692 341281 331159 327422 304617 284656 261097 246356 236587 215453 196350 170017 170788
12497A70788j2115k319O148j5961p984m471o930M0738M6129J4221J3924K1892
$$ 170788 158673 156354 162502 146541 138557 134086 127156 167894 214023 228244 242168 264060
12485B64060l846r686J0053Q924J1275L238J3181L1984N1525O7290Q3247Q1415
$$ 264060 260214 250528 260581 269505 280780 284018 297199 329183 380708 447998 531245 612660
12473F12660P1040O9277N4874K8869J3545J0418k6554m2766q1323p4785m8182
$$ 612660 683700 752977 807851 836720 850265 860683 834129 791363 710040 635255 587073
12462E87073n1105k2815j3592l9546k3210O390J3946j7328k900k8989k1834j1858
$$ 587073 535968 513153 499561 460015 436805 443195 457141 439813 436913 407924 386090 374232
12450C74232l1221j4095N505k9880R117J8782J1023L7287J2211L6231J1m58l0544
$$ 374232 343011 328916 334421 304541 313658 332440 343463 380750 392961 429192 429203 428745 398201
12437C98201m9728j8174J0m2001k9382R805J655J3759L5197o21J4466J2155J6236
$$ 398201 348473 330299 330309 288308 258926 268731 270386 284145 319342 318721 333187 345342 361578
12424C61578j1763l1804j2941M910l5042m6211j4644n799r939j8382j9922L0133
$$ 361578 349815 318011 305070 309980 274938 228727 214083 208284 198345 179963 160041 190174
12412A90174J8255K616r425m459K635R277L3603J5784j5677L8575O1494O3029
$$ 190174 208429 211045 201620 197161 199796 209073 242676 258460 242783 281358 342852 405881
12400D05881J08252J08686N9777L6287M275j8023m8935m6862o2417n8632n5205
$$ 405881 514133 622819 682596 718883 723158 705135 656200 609338 546921 488289 433084
12389D33084k9665n856J392K2852O7831N8208Q6106Q4382K5790o814L3447j1428
$$ 433084 403419 397563 398955 421807 489638 547846 633952 718334 744124 737310 770757 759329
12377G59329p0647j01692r7552n9119l7154k0780k5892l5427j5424P41L5003J0247
$$ 759329 688682 586990 489438 430319 393165 372385 346493 311066 295642 296383 331386 341633
12365C41633J5152L0078M3578L9701M9162J03433J07328P5557M7365P1203K9363
$$ 341633 356785 386863 430441 470142 519304 622737 730065 805622 852987 924190 953553
12354I53553K2803M397j0159n7657m0256l7718m7679p7961o5609p3443o9727j5179
$$ 953553 976356 980753 970594 912937 872681 834963 787284 709323 643714 570271 500544 485365
12342D85365P413M6998O9296Q3340R7775Q0432M3788J9065k135m5881j08200j28817
$$ 485365 492778 539776 609072 692412 790187 870619 914407 933472 931337 885456 777256 648439
12330F48439r8115q5865n2371l5379k6056k0460k981k1344j3632n5j94K4559J8000
$$ 648439 550324 464459 412088 376709 350653 330193 327212 305868 292236 292181 291987 316546 334546
12317C34546n83j8541k0197J27L055L0022N2443O6043Q5431J03623P3076O0010
$$ 334546 333963 315422 295225 295352 298407 328429 380872 446915 532346 635969 709045 769055
12305G69055O1465M6724j5916n8034q3382n9188Q055K8836L4344P2947Q0340N5954
$$ 769055 830520 877244 861328 803294 719912 660724 668779 697615 731959 804906 885246 941200
12293I41200P5909N0893k8248o7278q6952j19519r3550q7154r1767o0695m1070
$$ 941200 1017109 1068002 1039754 972476 885524 766005 672455 585301 493534 432839 391769
12282C91769k9147k394J3957j0608K5602L7593L0333P2855Q1174O5931P3456M7805
$$ 391769 362622 360228 374185 363577 389179 426772 457105 529960 611134 677065 750521 798326
12270G98326M2474J2599K8525K8241J1660l789J7599N9177K3197l0207l1664k1978
$$ 798326 840800 853399 881924 910165 921825 918036 935635 994812 1018009 987802 956138 934160
12258I34160q1207j30726r1373r6103p8110l4625j7186k3432q252L8727K0632
$$ 934160 852953 722227 630854 534751 456641 422016 404830 381398 373146 411873 432505
12247D32505M2689K2753q452o315J6098l8692p1490m6823l1115k0087r92R113
$$ 432505 475194 497947 489495 483180 499278 460586 389096 342273 311158 291071 290079 299192
12235B99192P490l2545J3544M4790N9646P2902Q7861J17292Q6471J06612R1171
$$ 299192 306682 274137 287681 332471 392117 465019 552880 670172 756643 863255 954426
12224I54426Q3174M3994L6088J4152l6206l4415k4398o3396p6098m0764m0613
$$ 954426 1037600 1081594 1117682 1131834 1095628 1061213 1036815 973419 897321 856557 815944
12213H15944l3968l4116j8281K5722M4238R652J8174Q473k3653j1904j7588n5844
$$ 815944 781976 747860 729579 755301 799539 809191 827365 835838 812185 800281 782693 726849
12201G26849o3137n4095o2049l2098o3436p8256q3757l7060k2629j8958p306M364
$$ 726849 663712 609617 547568 515470 452034 373778 290021 252961 230332 211374 204068 208432
12189B08432K988l9730j5347j1528l2646J8811j6669j7841j1326j5000q199j4183
$$ 208432 211420 171690 156343 144815 112169 130980 114311 96470 85144 70144 61945 47762
12177D7762J3225O866J231L1252k5413o762j021k989M612q523k849J9041N031
$$ 47762 60987 67853 69084 100336 74923 68161 67140 64151 68763 60240 57391 76432 81463
12164H1463k3853K208K3703O426K2127j306j5854J6237j1632K7194k129k1000
$$ 81463 57610 59818 83521 89947 112074 110768 94914 111151 99519 126713 124584 103584
12152A03584j1525j0110l4762r037j4282J9725J0527k9411k4653j203K8098K6815
$$ 103584 92059 81949 47187 38150 23868 43593 54120 24709 56 -1147 26951 53766
12140E3766J126m748J0423J4602j0667j5976k6697m315J5719J8850J5316J4468
$$ 53766 54892 50144 60567 75169 64502 48526 21829 17514 33233 52083 67399 81867
12128H1867o106k6726q048K4520L6173K4917J8733L2399L1114L6420L5879Q616
$$ 81867 75761 49035 40987 65507 101680 126597 145330 177729 208843 245263 281142 289758
12116B89758K2636M703l2763j2133m5699m4760J180j5068l6224k0491k3723R265
$$ 289758 312394 317097 284334 272201 226502 181742 182922 167854 131630 111139 87416 96681
12104I6681J358P441N451k5935q860m39P154K1692o359J7571K7101K0526N2760
$$ 96681 98039 105480 110931 84996 76136 75697 82851 104543 98184 115755 142856 163382 216142
12091B16142O8851Q223m408k2197j3603l6646k9774l625l2658j8450k8560j2435
$$ 216142 284993 293216 288808 266611 253008 216362 186588 182963 150305 131855 103295 90860
12079I0860L670J259L038p945j7625j6106l7840n834J8227j2366j011L4574M4612
$$ 90860 94530 95789 98827 90882 73257 57151 19311 13477 31704 19338 18327 52901 97513
12066I7513J4236k6974k4390p853J3600L0173j9467k1349J1830M217j2806k7605
$$ 97513 111749 84775 60385 52532 66132 96305 76838 55489 67319 71536 58730 31125
12054C1125K5185K6699j2858k5025P201J4172j1790j4023o600J5087j7655k7255
$$ 31125 56310 83009 70151 45126 52327 66499 54709 40686 34086 49173 31518 4263
12042D263J7089L4845K749j9550K1355J2919O582k3357l3241J9901K6562J7645
$$ 4263 21352 56197 58946 39396 60751 73670 80252 56895 23654 43555 70117 87762
12030H7762O531L092j356j3113P080K604N332K8036q389k1948R756J1537L490
$$ 87762 94293 97385 96029 82916 89996 92600 97932 125968 117579 95631 105387 116924 120414
12017A20414N845J4430p587l618K5806O655k9233k7578l561O860J7151P353J0707
$$ 120414 126259 140689 133102 129484 155290 161945 132712 105134 101573 108433 125584 132937 143644
12004A43644K0653N736j5604k0249k383K0298K638j5449Kj8232L614K0340j3176
$$ 143644 164297 170033 154429 134180 131797 152095 154733 139284 139286 121054 124668 145008 131832
11991A31832K1688j4898m659k1695N626J6330k52n974p876m62j5939k1789J1567
$$ 131832 153520 138622 133963 112268 117894 134224 133972 127998 120122 119660 103721 81932 93499
11978I3499L481M909o478K5154J1094l4608J0542j3612N338L1863n12n0820n7
$$ 93499 96980 101889 95411 120565 131659 97051 107593 93981 99319 131182 130670 79850 79793
11965G9793j6492j2297j2313k7240K2322L5177K0426j2082k9010j6223O192J2926
$$ 79793 63301 51004 38691 11451 33773 68950 89376 77294 48284 32061 38253 51179
11953E1179J7951K5566J9342k5545k0717K308k340j6181K2502J1657J3898J7376
$$ 51179 69130 94696 114038 88493 67776 70084 67744 51563 74065 85722 99620 116996
11941A16996R201J2881J5883M544L141r326L5007N9460O7534Q0480N6446Q9388
$$ 116996 126197 139078 154961 159505 162646 153320 188327 247787 315321 395801 452247 541635
11929E41635J99221L07378M32623O34134Q64635Q74491N00328Q5786R1983J13074
$$ 541635 740856 1048234 1480857 2114991 2979626 3854117 4354445 4440231 4532214 4645288
11919D645288n69049j081227q07539m98855l37430k34346j35790o2127l8339m020
$$ 4645288 4076239 2995012 2187473 1688618 1351188 1116842 981052 918925 880586 876566
11909H76566N0528M7809O230o2465k4285k2524j08232j80400j14849q7918q1504
$$ 876566 927094 974903 981133 918668 894383 871859 763627 583227 468378 380460 298956
11898B98956m8764l8000l1865r815j5819m278k5656l1833m5420N723K0589j7985
$$ 298956 250192 212192 180327 170512 154693 150415 124759 92926 47506 53229 73818 55833
11886E5833k3955L250M3250J6263J0345k7880l1262r661l186K660p30J4028R760
$$ 55833 31878 35128 78378 94641 104986 77106 45844 36183 32997 35657 34927 48955 58715
11873E8715l616j9909j7700r095J0492L504J0476r465j3104R814K8653k9148n848
$$ 58715 55099 35190 17490 8395 18887 22391 32867 23402 10298 20112 48765 19617 13769
11860A3769l504J373j9836l800K2239J3029j1298q894J6946j60o501m656j426
$$ 13769 10265 11638 -8198 -11998 10241 23270 11972 3078 20024 19864 13363 8707 7281
11847G281l809n983k1357L513K542J7166Q983r915k2168o236M095P511j0532Q701
$$ 7281 3472 -2511 -23868 -20355 -17813 -647 8336 -1579 -23747 -29983 -25888 -18377 -28909 -20208
11833b0208N760J546J9825O204L533K171J8204j9108k5430j7242L6393O895l4367
$$ -20208 -14448 -12902 6923 13127 16660 18831 37035 17927 -7503 -24745 11648 18543 -15824
11820a5824o382J8057J9468r187r135J4442j4173K848J2028j251k9078j614J5765
$$ -15824 -22206 -4149 15319 6132 -3003 11439 -2734 114 12142 10891 -18187 -19801 -4036
11807d036j136p092K2514k0420N252L4857J2120J4491M121m618K036j4656j8992
$$ -4036 -5172 -12264 10250 -10170 -4918 29939 42059 56550 60671 56053 58089 43433 24441
11794B4441J301n908M152j784j6183j5490J0314j0386L663P819J4961Q148O505
$$ 24441 25742 19834 23986 22202 6019 -9471 843 -9543 -5880 1939 16900 25048 31553
11781C1553k5763m2664j4298j3871L6182K7584n594l1472q88K3336r952m0p054
$$ 31553 5790 -36874 -51172 -65043 -28861 -1277 -6871 -38343 -39231 -15895 -25847 -25887 -32941
11768c2941J8235P443L590k147J833j4190j9911K2001L3929j920N109J1447q957
$$ -32941 -14706 -7263 -3673 -5820 -3987 -18177 -38088 -16087 17842 15922 21031 32478 23521
11755B3521j1791r140j2073q525M519j4968J1342Q49J0039J5471j2597j9290k8852
$$ 23521 11730 2590 -9483 -18008 -13489 -28457 -17115 -16266 -6227 9244 -3353 -22643 -51495
11742e1495O366l305p413R070K7484n088k129j960J0691j307O142K4228L640J2007
$$ -51495 -45129 -48434 -55847 -46777 -19293 -24381 -26510 -28470 -17779 -19086 -12944 11284 14924 26931
11728B6931j7925j0780J0997J948R43J328K3428k5549r436j1967p748K8530L1573
$$ 26931 9006 -1774 9223 11171 12114 13442 36870 11321 1885 -10082 -17830 10700 42273
11715D2273k0347k2912M057K4177k469j2553j0211O632O808l189k1451k3454R440
$$ 42273 21926 -986 3071 27248 24779 12226 2015 8647 15455 12266 -9185 -32639 -23199
11702b3199L2116P789n895j2760l002j8020k4999L0984L0872L3120M812j0305
$$ -23199 8917 16706 10811 -1949 -4951 -22971 -47970 -16986 13886 47006 51818 41513
11690D1513k3579m887j0990J9850O146k3864J5598J633r786j447J4093K9801n915
$$ 41513 17934 13047 2057 21907 28053 4189 19787 21420 11634 10187 24280 54081 48166
11677D8166k6691j4648P78J2146J0588r840l5423k1876r997K0510K5289J730j3010
$$ 48166 21475 6827 7605 19751 30339 20499 -14924 -36800 -46797 -26287 -998 732 -12278
11664a2278Q356L1937j7346k5517j2073K779L9408K6060j8707j0341r435R576
$$ -12278 -3922 28015 10669 -14848 -26921 -24142 15266 41326 22619 12278 2843 12419
11652A2419N214m622J3880P730J5471M100j6898k2759K421J2053j4334k1282k2904
$$ 12419 17633 13011 26891 34621 50092 54192 37294 14535 16956 29009 14675 -6607 -29511
11639b9511k129P714J5195k160q579J034J3906J4513l5448J4421J8972K1639Q173
$$ -29511 -31640 -23926 -8731 -10891 -19470 -18436 -4530 9983 -25465 -11044 7928 29567 37740
11626C7740q995q17J7281L6672J2718k2066m189j1485j9032j1758O466k2398j8270
$$ 37740 28745 27928 45209 81881 94599 72533 68344 56859 37827 26069 32535 10137 -8133
11613h133K5573J5833J6154k0157l5885j8799q33r773l126K912P582L0033M855
$$ -8133 17440 33273 49427 29270 -6615 -25414 -26247 -36020 -39146 -36234 -28652 1381 6236
11600F236j1720m866k623j933k518J5909l288j037K7871n822j6961l2301J5488
$$ 6236 -5484 -10350 -12973 -14906 -17424 -1515 -4803 -5840 22031 16209 -752 -33053 -17565
11587a7565l15J9146K3709N057M797q348j1697m1207K809J9310L1306J0131k4371
$$ -17565 -17880 1266 24975 30032 34829 26481 14784 -26423 -23614 -4304 27002 37133 12762
11574A2762j646o854k7334j4971O171K1500L0219j0220M463J2289j4164P02J5428
$$ 12762 11116 4262 -23072 -38043 -31872 -10372 19847 9627 14090 26379 12215 12917 28345
11561B8345j4849j9767j592n042P358p336P551J5532o240k0610J011j2138J8075
$$ 28345 13496 -6271 -7863 -12905 -5547 -12883 -5332 10200 3960 -16650 -15639 -27777 -9702
11548i702K3385n234J7799k427k5584q666j3739r384O697J383J6717K5520Q734
$$ -9702 13683 8449 26248 23821 -1763 -10429 -24168 -33552 -26855 -25472 -8755 16765 25499
11535B5499q715K3763n385l674J4396L0430q427n0860J0687nQ001r747q931j7020
$$ 25499 16784 40547 35162 31488 45884 76314 67887 17027 27714 27709 35710 25963 17032 12
11521A2N077K7819k4833J160L330Q585k3323M569j2760l0730J5917M5588J3045
$$ 12 5089 32908 8075 9235 12565 21150 -2173 2396 -10364 -41094 -25177 20411 33456
11508C3456k3043l646j9903R74k3882j3867K1585K618J6996J7231J8872R113j17
$$ 33456 10413 6767 -13136 -12162 -36044 -49911 -28326 -25708 -8712 8519 27391 36504 36387
11495C6387J8189K5983K0789L0241K0034J7087N4306P4161L6749O6908O8363M3933
$$ 36387 54576 80559 101348 131589 151623 168710 223016 297177 333926 400834 469197 513130
11483E13130K3019j0185k308m3438m2955o3704n8927n5074l2165p281k2342j0538
$$ 513130 536149 525964 523656 480218 437263 373559 314632 259558 227393 220112 197770 187232
11471A87232j6161L779N849l2815j0376N98j2340p369j4788j7800k0421J1239
$$ 187232 171071 174850 180699 147884 137508 138106 125766 118397 103609 85809 65388 76627
11459G6627l1873k1877j8246j4763K5229K3784j9683k0450N447N598P051j4232
$$ 76627 44754 22877 4631 -10132 15097 38881 19198 -1252 4195 9793 16844 2612
11447B612o892o941J3639M617L8515j360k6285j1727k056j176p883q536q950k1752
$$ 2612 -4280 -11221 2418 7035 45550 44190 17905 6178 4122 2946 -4937 -13473 -22423 -44175
11433d4175k694Q51K3793L7793J6379j3179L20j4428O554L1185K1193P014q919
$$ -44175 -46869 -46018 -22225 15568 31947 18768 19088 4660 11214 42399 63592 70606 61687
11420F1687k9473j2310K4913P174m2484j1103m008K3620k0586O271J9561J102
$$ 61687 32214 19904 44817 51991 9507 -1596 -5604 18016 -2570 3701 23262 24364
11408B4364N911l169J7810P431P158q657k8076j6288k630n618j5885J0429J1515
$$ 24364 30275 27106 44916 52347 59505 50848 22772 6484 3854 -1764 -17649 -7220 4295
11395D295J3035j068l804M63j501j0149j5482p227Q133J5004k2775o684l521J6199
$$ 4295 17330 16262 12458 12921 11420 1271 -14211 -21438 -13305 1699 -21076 -27760 -31281 -15082
11381a5082J4430L365j3947r341j4137l327n931Q439L7784P943k0179r332P40
$$ -15082 -652 2713 -11234 -20575 -34712 -38039 -43970 -35531 2253 10196 -9983 -19315 -18575
11368a8575K2006J508j4163K6957L3208N152m6846n5305Q129q814j1938J5721
$$ -18575 3431 4939 -9224 17733 50941 56093 9247 -46058 -37929 -46743 -58681 -42960
11356d2960J5068R642L7584K5584j5899j2097M938p228k1931o649J4636J2572
$$ -42960 -27892 -18250 19334 44918 29019 16922 21860 14632 -7299 -13948 688 13260
11344A3260p364K0990l2147r189r008n47j5316Q107N4722K1044l0097j7056R383
$$ 13260 5896 26886 -5261 -14450 -23458 -24005 -39321 -31214 23508 44552 14455 -2601 6782
11331F782L810K0727j6008j8309j1180j4659k371o424M526m512k1780J0760K9144
$$ 6782 10592 31319 15311 -2998 -14178 -28837 -31208 -37632 -33106 -37618 -59398 -48638 -19494
11318a9494J5633J9004R345k8465j0908j156M354k36J030k535Q088M197j7497
$$ -19494 -3861 15143 24488 -3977 -14885 -16041 -11687 -11923 -10893 -13428 -5340 -1143 -18640
11305a8640J1960L9166o415O022j768j0150j4385R047L9565J9560j9485l0481
$$ -18640 -6680 32486 26071 32093 30325 20175 5790 14837 54402 73962 54477 23996
11293B3996k1721J2589k4885m2732P740J2023j369l740J1781L0755K409n716J3431
$$ 23996 2275 14864 -10021 -52753 -45013 -32990 -34359 -38099 -26318 4437 6846 1130 14561
11280A4561Q901m462K744j7335k8202j901K0320O953j0996j5185n066J7362L1297
$$ 14561 23462 19000 21744 4409 -23793 -25694 -5374 1579 -9417 -24602 -29668 -12306 18991
11267A8991J2705j2499j3664J0298P677N618o759j3332J9490J2438j3960j7306
$$ 18991 31696 19197 5533 15831 23508 29126 22367 9035 28525 40963 27003 9697
11255I697J6763J2508j3762K3774j1663j5072k903n362j4804Q416J6960J1152
$$ 9697 26460 38968 25206 48980 37317 22245 19342 13980 -824 7592 24552 35704
11243C5704j5045R030j740j3733P121j4689j3767N84K478j759k354K1821K9427
$$ 35704 20659 29689 27949 14216 21337 6648 -7119 -6535 -4057 -5816 -8170 13651 43078
11230D3078r595J3115N884k6288k1436R478j525q877N576J230m593M433m402Q520
$$ 43078 33483 46598 52482 26194 4758 14236 12711 3834 9410 10640 6047 10480 6078 14598
11216A4598r869k9527m2J0566k837l07q068k0753J5752K4415J8139K1312j2672
$$ 14598 4729 -24798 -24840 -14274 -17111 -17418 -25486 -46239 -30487 -6072 12067 33379 20707
11203B0707j3009O529K0659J3314m757j3703k29J4707J7042l90q274k262m663
$$ 20707 7698 14227 34886 48200 43443 29740 29511 44218 61260 60870 52596 50334 45671
11190D5671P393J1495n509j5752R380p581k5896J4355J0847p242k6997M429O735
$$ 45671 53064 64559 59050 43298 52678 45097 19201 33556 44403 37161 10164 14593 21328
11177B1328j5911K6982J530Q081K19q327k1028J0949J6754K0180j6616k9367o202
$$ 21328 5417 32399 33929 42010 42229 33902 12874 23823 40577 60757 44141 14774 8572
11164H572M589O673l475j5163J052o409J2819m32O527j3320J0773K2291J6494
$$ 8572 13161 19834 16359 1196 2248 -4161 8658 8226 14753 1433 12206 34497 50991
11151E0991r900j9224k8833k792p984K567J6538K8173J9166l3531n6320J1004
$$ 50991 41091 21867 -6966 -9758 -17742 -15175 1363 29536 48702 15171 -41149 -30145
11139c0145L1919J7870l7767k5490R264K2772m904N064J2848J4296n666R101J0731
$$ -30145 1774 19644 -18123 -43613 -34349 -11577 -16481 -11417 1431 15727 10061 19162 29893
11126B9893J6237j0512j2394M293K3047P189k0065n897M403Q859l773j493j9130
$$ 29893 46130 35618 23224 27517 50564 57753 37688 31791 36194 45053 41280 39787 20657
11113B0657j6496K0282K106j0122J7736R070k9795j7933M342o373K5280L768J206
$$ 20657 4161 24443 26549 16427 34163 43233 13438 -4495 -153 -6526 18754 22522 23728
11100B3728j7394P824L6895k4994M138O6k6646o117K3121J0471p70R361R16J1429
$$ 23728 6334 14158 51053 26059 30197 30263 3617 -2500 20621 31092 30322 39683 40599 52028
11086E2028l0311n391j2689p936q152j384j4657J3526J7942k0008J523J6863K988
$$ 52028 21717 16326 3637 -4299 -12451 -13835 -28492 -14966 2976 -17032 -15509 1354 4342
11073D342J0008k382j6616j0369k3872j8721J0932L6183L0012K8936N385N953
$$ 4342 14350 11968 -4648 -15017 -38889 -57610 -46678 -10495 19517 48453 53838 59791
11061E9791l8099j8840q096p307J7305O963k8090q367J852L9697P814j3038k2088
$$ 59791 21692 2852 -5244 -12551 4754 11717 -16373 -24740 -22888 16809 24623 11585 -10503
11048a0503L1719J5627P919r851k6521j8179Q793J9397K8750k8594q040J0174
$$ -10503 21216 36843 44762 34911 8390 -9789 -996 18401 47151 18557 10517 20691
11036B0691j2457K2495K9438L2108l3058j6638O342m136k5447j3436q423q10M128
$$ 20691 8234 30729 60167 92275 59217 42579 48921 44785 19338 5902 -2521 -3331 797
11023G97Q509M24q91k1160P150K9668p13M07J0246k9498J8175J2932k1766k773
$$ 797 9306 9730 8839 -12321 -5171 24497 23784 24191 34437 4939 23114 36046 14280 11507
11009A1507k2643j2041l2653k0546K9140J6622K027J5390L2583j498K6086J4891
$$ 11507 -11136 -23177 -55830 -76376 -47236 -30614 -28587 -13197 19386 17888 43974 58865
10997E8865k0877r013j4707j401L2935J9665k667n269o227j1788r121n129L968
$$ 58865 37988 28975 14268 12867 45802 65467 62800 57531 51304 39516 30395 25266 29234
10984B9234k2569k2110K6605M112P61J5358J762p6K2885R754k5159j0989J7782
$$ 29234 6665 -15445 11160 15272 16033 31391 33153 33077 55962 65716 40557 29568 47350
10971D7350P924r698J1877J0394l992K1421k746j1194r468j3147K9932K1360J0375
$$ 47350 55274 45576 57453 67847 63855 85276 82530 71336 61868 48721 78653 100013 110388
10958A10388J6501J0748P961K8043K4314J3175L2975P6446R9013J54398J90878
$$ 110388 126889 137637 145598 173641 197955 211130 244105 320551 419564 573962 764840
10947G64840K25041L07465K72700J53479N6774M718r2866k42813k83703k52868
$$ 764840 989881 1297346 1570046 1723525 1780299 1785017 1692151 1449338 1165635 912767
10937I12767k04804j34679q4832q5963m7854l8889k3535k1637k9321k9853k6190
$$ 912767 707963 573284 488452 402489 354635 315746 292211 270574 241253 211400 185210
10926A85210j4584q191j6147k1578n489j7068k7989k3607Q197J7652L898j2327
$$ 185210 170626 162435 146288 124710 119221 102153 74164 50557 58754 76406 80304 67977
10914F7977p929o554j010J6333K0650q769j2561l27P539j0782j217m955l3274
$$ 67977 60048 53494 52484 68817 89467 80698 68137 67810 75349 64567 63350 58395 25121
10901B5121l103K3823N392J0994k2309k4032k690J6870l650j7323k7066q154J6664
$$ 25121 22018 45841 51233 62227 39918 15886 13196 30066 26416 9093 -17973 -26127 -9463
10888i463o17P977L680m865J5115J4632L396Q075Q828J5242J193k979J358j3840
$$ -9463 -10080 -2103 1577 -3288 11827 26459 29855 37930 46758 62000 63193 60214 61572 47732
10874D7732N458M863j786r595l323p086R841J768K5369k6525l350n082R176j61
$$ 47732 53190 58053 56267 46672 43349 36263 46104 47872 73241 46716 43366 38284 47460 47299
10860D7299k2337n609P601M053k4368k7387j102K4341J4501K358K7193J7842m105
$$ 47299 24962 19353 26954 31007 6639 -20748 -21850 2491 16992 19350 46543 64385 60280
10847F0280j0798n721j9392j2603k505K7136N747m1581k8565j2226k078J1580
$$ 60280 49482 43761 24369 11766 9261 36397 42144 563 -28002 -40228 -42306 -30726
10835c0726o560j2605o560j7862j2242J5847J4692J0420n295j1251L0066N3276
$$ -30726 -37286 -49891 -56451 -74313 -86555 -70708 -56016 -45596 -50891 -62142 -32076 21200
10823B1200j092r906J0878R877Q741K043r864j987q194p438n034K766p043K396
$$ 21200 20108 10202 21080 30957 39698 41741 31877 29890 21696 14258 9224 11990 4947 7343
10809G343M499M651K1339q646o937O632j317j7431l47K006n981j1284K249J3592
$$ 7343 11842 16493 37832 29186 22249 28881 27564 10133 9786 11792 5811 -5473 -3224 10368
10795A0368J4183M0634K5276l8849k4909J5087k9593p586J1633K7503L7693N8114
$$ 10368 24551 65185 90461 51612 26703 41790 12197 4611 16244 43747 81440 139554
10783A39554N3122L0906K8917K0180N841L4562J9547K187j5471m1485m3002l9828
$$ 139554 192676 223582 252499 272679 278520 313082 332629 334816 319345 277860 234858 195030
10771A95030j1502L210k6409k3958j8643j4857k4341m816j3773l7623r998j1848
$$ 195030 183528 186738 160329 136371 117728 102871 78530 73714 59941 22318 12320 472
10759D72j0841M8616M6369J5498j748k4876j5666k9970k2969L0800R21m1032j7108
$$ 472 -10369 38247 84616 100114 98366 73490 57824 27854 4885 35685 36606 -4426 -21534
10746b1534p745R368J6631O750k4408q945J0623m174J826n658k3681j7403j9105
$$ -21534 -29279 -19911 -3280 3470 -20938 -29883 -19260 -23434 -21608 -27266 -50947 -68350 -87455
10733h7455N367N543L3785p413j582J9661L6226J0560k2662k2047l3274n3957
$$ -87455 -82088 -76545 -42760 -50173 -51755 -32094 4132 14692 -7970 -30017 -63291 -117248
10721a17248n4070k0571J937k869L2253O3801Q1554J15842J10783P0217K4968
$$ -117248 -171318 -191889 -189952 -192821 -160568 -96767 -15213 100629 211412 281629 306597
10710C06597N0746N7060m125k5767m6581p0274m1311k377n6m708j1636j5835j55
$$ 306597 357343 414403 410278 384511 337930 267656 226345 223968 223912 219204 207568 191733 191578
10697A91578j1032J3412J3536J6727J676j4019J3999L2123K3381j3165p069j748
$$ 191578 180546 193958 207494 224221 225897 211878 225877 258000 281381 268216 261147 259399
10685B59399J4798l936k4857J5346K3918k0076r649Q584L2860L8247L2909L1903
$$ 259399 274197 270261 245404 260750 284668 264592 254943 263527 296387 334634 367543 399446
10673C99446j9335m1421l8298k5404o163p363K908j0464k3877J2839O874j486
$$ 399446 380111 338690 300392 274988 268825 261462 264370 253906 230029 242868 249742 248256
10661B48256J7437M411j9047j4558j3931J9303L0873j3751O109N1006M3813K3361
$$ 248256 265693 270104 251057 236499 222568 241871 272744 258993 265102 316108 359921 383282
10649C83282J2139L247M1576L9115J2410K4589j9977J332L2823L0627O290J8834
$$ 383282 395421 398668 440244 479359 491769 516358 496381 497713 530536 561163 567453 586287
10637E86287L9707K6869J7817j5537K428j286L822k4305l6752l0231k8011j0912
$$ 586287 625994 652863 670680 655143 657571 656285 660107 635802 599050 568819 540808 529896
10625E29896j2549j9196q165k6040l9943k7400P186j1246P338j4584L30L430J6067
$$ 529896 517347 498151 489986 463946 424003 396603 403789 392543 399881 385297 385627 389057 405124
10612D05124J7139J2086q41J1100K9150P257K2123j1200J5446N8865J4119o791
$$ 405124 422263 434349 433508 444608 473758 481015 503138 491938 507384 566249 580368 573577
10600E73577p746m525L8379M0409L9825J211L738k300k816l739m0966j3373k009
$$ 573577 565831 561306 599685 640094 679919 681130 684868 682568 679752 676013 635047 621674 619665
10587F19665k473N32J4823L5283N7598p76J6347J4077L6943M0387J3515M3543
$$ 619665 617192 617724 632547 667830 725428 724652 740999 755076 792019 832406 845921 889464
10575H89464N4733N3971N2313M6226K8007L1350L7469M6097N0747O9554J02967
$$ 889464 944197 998168 1050481 1096707 1124714 1156064 1193533 1239630 1290377 1359931 1462898
10564A462898J06269J04993J12509J43228J44855J00135J12901J26627J41497
$$ 1462898 1569167 1674160 1786669 1929897 2074752 2174887 2287788 2414415 2555912
10555B555912J88684K11344K07779J92740K67003L37646M02793M55575N71223
$$ 2555912 2744596 2955940 3163719 3356459 3623462 3961108 4363901 4819476 5390699
10546E390699P52207Q80258J053302J107212J103949J228343J422092J635094
$$ 5390699 6142906 7023164 8076466 9183678 10287627 11515970 12938062 14573156
10538A4573156J910553K513633L473809M750376O475834Q954175J2888799J9395220
$$ 14573156 16483709 18997342 22471151 27221527 33697361 42651536 55540335 74935555
10530G4935555K8910979M0206754N1428171N8463709M9472469K4664565Q179000
$$ 74935555 103846534 144053288 195481459 253945168 303417637 328082202 336261202
10523C36261202N892981j2429014n2035098o5306921n0964908l4605445k3551921
$$ 336261202 342154183 329725169 277690071 212383150 161418242 126812797 103260876
10516A03260876j6817381j2694794r795958p537179n893851m814566m073493l698865
$$ 103260876 86443495 73748701 63952743 56415564 50521713 45707147 41633654 37934789
10508C7934789l639155l604300l491262l292078l083039k923140k614838k146224
$$ 37934789 34295634 30691334 27200072 23907994 20824955 17901815 15286977 13140753
10500A3140753j647002j220942r05009o28763m28144l17140j85206r7047j7392
$$ 13140753 11493751 10272809 9367800 8739037 8310893 7993753 7808547 7711500 7694108
10491G694108N1963M4701m471m4211j46154k49033l66075m34163n16015n12467
$$ 7694108 7746071 7790772 7786301 7742090 7595936 7346903 6980828 6546665 6030650 5518183
10481E518183m72727l88635l72767l42504k55882k40614j97860j61357j45467
$$ 5518183 5045456 4656821 4284054 3941550 3685668 3445054 3247194 3085837 2940370
10472B940370j50486j42414j28948r8496r0004r5859j34539j41415q0769n8684
$$ 2940370 2789884 2647470 2518522 2420026 2330022 2234163 2099624 1958209 1877440 1818756
10462A818756p0938o8971o9009o5634n1592n8947m6788k6505p0789o5874n5824
$$ 1818756 1747818 1678847 1609838 1544204 1492612 1433665 1386877 1360372 1289583 1223709 1167885
10451A167885l3595k5268m4169m1419m7093k0380l5161m8435l9141l7480o041
$$ 1167885 1134290 1109022 1064853 1023434 976341 955961 920800 872365 833224 795744 789703
10440G89703j3831m625J3062Q888l2306m9570k2851o152j7209k3174j7861L277
$$ 789703 775872 771247 784309 793197 760891 711321 688470 682318 665109 641935 624074 627351
10428F27351j3730m678k7977r039l239k8743j5347J1475j7980j7057k4223N13
$$ 627351 613621 608943 580966 571927 568688 539945 524598 536073 518093 501036 476813 477326
10416D77326K694j3050l9181k8755J693Q784M1991O3l2344o184m569J4080j772
$$ 477326 480020 466970 427789 399034 400727 409511 451502 451565 419221 413037 408468 422548 420776
10403D20776o368J0874j1881o095N072N1765M4039J6274K3825k035J41O270L3996
$$ 420776 414408 425282 413401 407306 412378 464143 508182 524456 548281 546246 546387 552657 586653
10390E86653m050k5993l7134j6420k1966j7421j4672K475J8424j6602k7989k8615
$$ 586653 582603 556610 519476 503056 481090 463669 448997 451472 469896 453294 425305 396690
10378C96690l3047n5462l3204k9374k2138j3324j743N017k024j9394j1021j2300
$$ 396690 363643 308181 274977 245603 223465 210141 208398 213415 211391 191997 180976 168676
10366A68676j3124L990j7151r541k4950K081j2488k2342Q523Q366Q510k0865l5037
$$ 168676 155552 159542 142391 132850 107900 109981 97493 75151 83674 92040 100550 79685 44648
10353D4648j334j238J676O371J4053j6153k3316k7307R321k0850n1928o8689n4954
$$ 44648 43314 42076 43752 50123 64176 48023 24707 -2600 6721 -14129 -66057 -134746 -189700
10340a89700k8984l1023J0612N0135N8830R2266J36261J27818O7244M1154L1652
$$ -189700 -218684 -249707 -239095 -188960 -130130 -37864 98397 226215 293459 334613 366265
10329C66265n218m3414k3809o705k8127p493l1362j5122J4468j6628P463P650
$$ 366265 361047 317633 293824 287119 258992 251499 220137 205015 219483 202855 210318 217968
10317B17968l217J0875P255K1951k9287m5474M602J4220o851n382L005K4553J8282
$$ 217968 214751 225626 232881 254832 225545 180071 184673 198893 192042 186660 189665 214218 232500
10304B32500k7617j8777q912j2619j75j1488o644q201R174J4231j3954j6292j7234
$$ 232500 204883 186106 177194 164575 164400 152912 146268 138067 147241 161472 147518 131226 113992
10291A13992j309p544p043q064K2356J972J1504l845L626L686J3210K5067n227
$$ 113992 112683 105139 98096 90032 112388 114360 125864 122019 125645 129331 142541 167608 162381
10278A62381k6938K301m347l115j4040K9572n463L171l0422k5292m045M7612K9149
$$ 162381 135443 137744 133397 130282 116242 145814 140351 143522 113100 87808 83763 131375 160524
10265A60524J157O368k5713o178K91P642N286n804o285r663n84L6672K1257K0109
$$ 160524 161681 168049 142336 136158 136449 144091 149377 143573 137288 127625 127041 163713 184970 205079
10251B05079K3999l309J1188K7018L3588K3587N0340N8962J06975J14224J35743
$$ 205079 229078 225769 236957 263975 297563 321150 371490 430452 537427 651651 787394
10240G87394J13283O5236O1940L9596J981l7397q0727q6908j01889j08131m6381
$$ 787394 900677 965913 1027853 1067449 1069430 1032033 951306 864398 762509 654378 607997
10229F07997k5924O753j4021L002J9454J8192L4337N3670P3264J14437J77352
$$ 607997 582073 588826 574805 577807 597261 615453 649790 703460 776724 891161 1068513
10218A068513K51553K23549J48882J07844N7840j7009q0757j73447k12794j81386
$$ 1068513 1320066 1543615 1692497 1800341 1858181 1841172 1760415 1586968 1374174 1192788
10208A192788j83459j50590j10815j00309n8305l2598j2413J8539J315N5829J02667
$$ 1192788 1009329 858739 747924 647615 589310 556712 544299 562838 564153 619982 722649
10197G22649J37152J59545J16925P5549j574k674p6242j40721j85208j74363j32567
$$ 722649 859801 1019346 1136271 1211820 1210246 1207572 1131330 990609 805401 631038 498471
10186D98471r9459o3165m5357j5263j3483J090P164K686p634k3042l337k8403
$$ 498471 399012 335847 290490 275227 261744 262834 269998 272684 265050 242008 238671 210268
10174B10268n4894J203L4576j521l0417j6282k1285k971Q460J7100k4482J7998
$$ 210268 155374 156577 191153 189632 159215 142933 121648 118677 127137 144237 119755 137753
10162A37753L6692L1764J5313K624J1039K1249j213k5510k3346k5117K973j6871
$$ 137753 174445 206209 221522 224146 235185 256434 255221 229711 206365 181248 184221 167350
10150A67350j0274k15J4534j7159l3213j1745K0888Q021m888k1107K1509r587
$$ 167350 157076 156861 171395 154236 121023 109278 130166 138187 133299 112192 133701 124114
10138A24114j9785m245J1261m424k879k9607J35l756m827K2496P587j2269j3417
$$ 124114 104329 100084 111345 106921 104042 74435 74570 70814 65987 88483 96070 83801 70384
10125G0384P021P994o911J118J8019N894k4166j3399K2229N5858L6031J0782N271
$$ 70384 77405 85399 78488 79606 97625 103519 79353 65954 88183 144041 180072 190854 196125
10112A96125l4656J080J6970J7396L9093Q9625J12402J67662K11425K57547K76183
$$ 196125 161469 162549 179519 196915 236008 325633 438035 605697 817122 1074669 1350852
10101A350852K46443J40779M8480L6633j3017k02268k94510k96653k07765j28252
$$ 1350852 1597295 1738074 1786554 1823187 1810170 1607902 1313392 1016739 808974 680722
10091F80722r2190q1888n6086j6117l0362m1595m3348k2743p983J9p809l7279
$$ 680722 588532 506644 450558 434441 404079 362484 319136 296393 288410 288429 280620 243341
10079B43341k5318m2932j7704J5745J5728j5529q420n3664k5352M1940J5752r290
$$ 243341 218023 175091 157387 173132 188860 173331 164911 111247 85895 127835 143587 134297
10067A34297O746J0693p184l1910N763K9733P508k4381j6400q810k8092j0213
$$ 134297 141043 151736 144552 112642 118405 148138 155646 131265 114865 106055 77963 67750
10055F7750J0681O547k1213L907L7975K9686K7498P252j8060q575o508J2969L3915
$$ 67750 78431 84978 63765 67672 105647 135333 162831 170083 152023 143448 136940 149909 183824
10042A83824L7791L0303Q453J3306K5991L3606J7090M7339O8574J11265J27224
$$ 183824 221615 251918 260371 273677 299668 333274 350364 397703 466277 577542 704766
10031G04766J41666J43293J25828O4675M7017K2349o0674j65270j63863j34279
$$ 704766 846432 989725 1115553 1180228 1227245 1249594 1188920 1023650 859787 725508
10021G25508j08421j20261p6251n576k1280l5494l7943j9355k0942k5086j3752
$$ 725508 617087 496826 420575 414999 393719 358225 320282 300927 279985 254899 241147
10010B41147m0590k3533p106K4495j7166l4000j7571J9439R240m3697m908o525
$$ 241147 200557 177024 169918 194413 177247 143247 125676 145115 154355 110658 105750 99225
9998I9225j8825J7293Q191q134M076J239j667j8239J3990O134n482k6408j4278
$$ 99225 80400 97693 105884 97750 101826 103065 101398 83159 97149 103283 97801 71393 57115
9985E7115j289J4765J2168j840L9310L541j9519r329R626l2568j8776J6825K3068
$$ 57115 55826 70591 82759 80919 120229 123770 104251 94922 104548 71980 53204 70029 93097
9972I3097J1302l770j363j4530J1367K7221j5022j7994R051K641j9656l3439J448
$$ 93097 104399 100629 99266 84736 96103 123324 108302 90308 99359 102000 82344 48905 50353
9959E0353K5609l8958Q912K5771J2364J3591q761J1379J0590k4678m079r702j2943
$$ 50353 75962 37004 45916 71687 84051 97642 88881 100260 110850 86172 82093 72391 59448
9946E9448J5648k170l001j9576m043O575L6307K8800j3675j9300l128J7967J9328
$$ 59448 75096 72926 69925 50349 46306 52881 89188 117988 104313 85013 81885 99852 119180
9933A19180k1100J741j138J1819J3900l8971j7139l239J2485n600J299N952J9813
$$ 119180 98080 99821 98683 110502 124402 85431 68292 65053 77538 71938 73237 79189 99002
9920I9002K0900R653l463k3858j3105k2394J5667j9458j0138l446K0217r649L6196
$$ 99002 119902 129555 126092 102234 89129 66735 82402 62944 52806 49360 69577 59928 96124
9907I6124L674j8534J0169J7502j2579J4738P480j5849o798J8815L3437j1620
$$ 96124 99798 81264 91433 108935 96356 111094 118574 102725 95927 114742 148179 136559
9895A36559j9238l0788K951Q137L67n594J0689k343K5M54m134J524K3303R228
$$ 136559 117321 86533 89484 97621 97988 92394 103083 100740 100765 101219 97085 98609 121912 131140
9881A31140k2070j6291P806j6367L822M512J9612k679p260j4673k8701j4129q995
$$ 131140 109070 92779 100585 84218 88040 92552 112164 109485 102225 87552 58851 44722 35727
9868C5727K0525J8274J9149k4674J6543L819J707j264r240K0770m961R38j4256
$$ 35727 56252 74526 93675 69001 85544 89363 91070 89806 80566 101336 96375 97313 83057
9855H3057L064k083N277J920j3252j2728N329J6716J2264J056k3375K1561J6313
$$ 83057 86121 84038 89315 91235 77983 65255 70584 87300 99564 100620 77245 98806 115119
9842A15119n682m950k0000j9046L345L236k9187R029J4779L6545j3931q891R491
$$ 115119 109437 104487 84487 65441 68786 72022 42835 51864 66643 103188 89257 80366 89857
9829H9857J3720J05j926M940j308r28n96l9641k4913L0166K8370J6388l1479k8715
$$ 89857 103577 103682 101756 106696 105388 104460 103864 64223 39310 69476 97846 114234 82755 54040
9815E4040O297p293m2049R976M2477J2264n76m10K1307O692j5786P669L513j4520
$$ 54040 60337 53044 10995 20971 63448 75712 75136 74726 96033 102725 86939 94608 98121 83601
9801H3601M85k2127n8047K4599J5974J5356L4488J1341l891j5965j3075M135n965
$$ 83601 84086 61959 3912 28511 44485 59841 94329 105670 101779 85814 72739 76874 70909
9788G0909R325l650J147J6956j3562l764n766j2480L1247L6662O586j5741j2706
$$ 70909 80234 76584 77731 94687 81125 77361 71595 59115 90362 127024 133610 117869 105163
9775A05163J5226P99k3641k3802L605J5814j885O010q304j7006J5094M1111R357
$$ 105163 120389 121188 97547 73745 77350 93164 91279 97289 88985 71979 87073 128184 137541
9762A37541l0287k3285j9396P357Q610m121K905J7485k0509k9178j7410J3645
$$ 137541 107254 83969 64573 71930 80540 76419 79324 96809 76300 47122 29712 43357
9750D3357K3084r1p785L327K4757l266l0963n285L8331J0819J4799j2332m022
$$ 43357 66441 66350 58565 61892 86649 83383 52420 47135 85466 96285 111084 98752 94730
9737I4730j648j9095J1127J6659j4959p015j6965J504Q711L0037o419k1059j8550
$$ 94730 93082 73987 85114 101773 86814 79799 62834 64338 73049 103086 96667 75608 57058
9724E7058n06J852K835K1318J4113M121J3373j7327j2344q053R220P808k0108
$$ 57058 56552 58404 61239 82557 96670 100791 114164 96837 84493 76440 85660 93468 73360
9711G3360k0654R49K5737N805K0332J7395K483k4427n203N865J88P15K7480L135
$$ 73360 52706 53655 79392 85197 105529 122924 125407 100980 95777 101642 101830 102545 130025 133160
9697A33160k158L1104J5872m3779m8253j855L421J4263J799o81j9058P936O735
$$ 133160 131002 162106 177978 134199 85946 84091 87512 101775 103574 102893 83835 91771 98506
9684I8506m8390N627K2069J0811j2599p913J2824k135l420O650K9326J0369l417
$$ 98506 50116 55743 77812 88623 76024 68111 80935 78800 75380 82030 111356 121725 118308
9671A18308l2198l8845j8856J5064M688J9576j1383K142K8815K4888l634J5958
$$ 118308 86110 47265 28409 43473 48161 67737 56354 58496 87311 112199 108565 124523
9659A24523R446j3109n794P945j3386n848J6793k3980k8225J1131J6044K4533
$$ 124523 133969 120860 115066 123011 109625 103777 120570 96590 68365 79496 95540 120073
9647A20073J6537r476j5616K909L543N605k7333k6220J3954L6988j4349k1471
$$ 120073 136610 127134 111518 114427 117970 123575 96242 70022 83976 120964 106615 85144
9635H5144r802m076j9528J0517J5564K198j1338k5122K0324K1399j5744k0807
$$ 85144 75342 71266 51738 62255 77819 80017 68679 43557 63881 85280 69536 48729
9623D8729j313M964R190N756J3912m290K4624L7227r268j632K762p310k1853l2067
$$ 48729 47416 52380 61570 67326 81238 76948 101572 138799 129531 127899 130661 123351 101498 69431
9609F9431p758J1877J3522J5852j392j9782q591J9671K8555l553j0432k582L698
$$ 69431 61673 73550 87072 102924 101532 81750 73159 92830 121385 117832 107400 104818 108516
9596A08516K936j9885o724l7168k721K3174J2289j7797j6211k1568j0072j0173
$$ 108516 111452 91567 84843 47675 44954 68128 80417 62620 46409 24841 14769 4596
9584D596m558J5735K8876L0462Q765k4950k100n484J5061K4028j0713J5323J1320
$$ 4596 38 15773 44649 75111 83876 58926 56826 51342 66403 90431 79718 95041 106361
9571A06361l2L100q120j3714j3851P079k807R78L135l741K0871J1592m118k0146
$$ 106361 106329 109429 101309 87595 73744 80823 78016 78994 82129 78388 99259 110851 106733 86587
9557H6587m0959L971J5459K0233j0125k2814j1745K1146K9803J0796K4407j4594
$$ 86587 45628 49599 65058 85291 75166 52352 40607 61753 91556 102352 126759 112165
9545A12165j1499j1504Q624j456j7449J404o516R057K5063o664j2224q953Q49
$$ 112165 100666 89162 97786 96330 78881 80285 73769 82826 107889 101225 89001 80048 80897
9532H0897l528J2562J7643J0440k1217J993O302l7668n602J0212L0156J862n211
$$ 80897 77369 89931 107574 118014 96797 98790 105092 67424 61822 72034 102190 104052 98841
9519I8841J748q694k9536q109K3975J1387J2216K1313J9203l411J824r341l5738
$$ 98841 100589 91895 62359 54250 78225 89612 101828 123141 142344 138933 140757 131416 95678
9506I5678k825O983k1452p232J3957R758r583k3669j0757K4592J1240r831j3243
$$ 95678 92853 99836 78384 71152 85109 94867 85284 61615 50858 75450 86690 76859 63616
9493F3616K1319L4757j38M942q7Q522m803L216K049k6725k2126r529K4464K3275
$$ 63616 84935 119692 119554 124496 124409 132931 128128 131344 133393 106668 84542 75013 99477 122752
9479A22752q913j6895K1597M257j8818M081N668J7493k142j3968k2951m61j3827
$$ 122752 113839 96944 118541 122798 103980 108061 113729 131222 129080 115112 92161 91700 77873
9466G7873L271K4328j1978L610j4951o019k1230J6320L3399L506k4462M862j2220
$$ 77873 81144 105472 93494 97104 82153 76134 54904 71224 104623 108129 83667 88529 76309
9453G6309J5516J941k2950K395K4156J2771k9281M883M1050p95n27M3135p160
$$ 76309 91825 93766 70816 73211 97367 110138 80857 85740 126790 125995 125468 168603 161443
9440A61443j7946K488j4662m669K0027J5579o814m4217k2060L7504j0910j0690
$$ 161443 143497 145985 131323 126654 146681 162260 155446 111229 89169 126673 115763 105073
9428A05073J2407O895o285n425P294j1297O45j6715j3874j0677N367J8684K9604
$$ 105073 117480 124375 118090 112665 119959 108662 109307 92592 78718 68041 73408 92092 121696
9415A21696L034j8309L168J3694q33j3372l0460o124M279j7627K4729K8823J43
$$ 121696 124730 106421 109589 123283 122450 109078 78618 72494 76773 59146 83875 112698 112841
9402A12841k3552l3325J3432J5913J1740P994o599m677n053J0391J6852l188j7559
$$ 112841 89289 55964 69396 85309 97049 105043 98444 93767 88714 99105 115957 112769 95210
9389I5210m501k8210J1091J6992J1208J4949K0423j2305J1404R698k0703j9220
$$ 95210 90709 62499 73590 90582 101790 116739 137162 124857 136261 145959 125256 106036
9377A06036o95q078Q098j1106l4295L392M134J3518J2968P420R000k3523n378
$$ 106036 105341 97263 105361 94255 59960 63352 67486 81004 93972 101392 110392 86869 81491
9364H1491N2689P010m4136k4749L5016K8442j9985j8683L124J6793K1711J7695
$$ 81491 134180 141190 97054 72305 107321 135763 115778 97095 100219 117012 138723 156418
9352A56418k5179l9160m832J5416L2133j606k489J2353k551o482k4801M679j745
$$ 156418 131239 92079 87247 102663 134796 133190 130701 143054 140503 134021 109220 113899 112154
9339A12154K0307K8747N350m8593k8953k218N806J0113N829j1900Q264o150l324
$$ 112154 132461 161208 166558 117965 89012 86794 92600 102713 108542 96642 104906 98756 95432
9326I5432J4362J1836j5628J7661K7147M990j3616k0584r668J2575j0206j6164
$$ 95432 109794 121630 106002 123663 150810 155800 142184 121600 111932 124507 114301 98137
9314I8137j1530k211j5304J9655K0376K3804j7238j2932m222k14J6562J4321k511
$$ 98137 86607 84396 69092 88747 109123 132927 115689 102757 98535 98321 114883 129204 126693
9301A26693O838K695P544K33K096N429K385j3358K811Q820K1177O023j76l6880
$$ 126693 133531 136226 143770 144003 146099 151528 153913 140555 143366 152186 173363 179386 179210 142330
9287A42330M89P67j2555j1763j4051J9200J8759K576J8229J835j2202n482R93
$$ 142330 142819 143586 131031 119268 105217 124417 143176 145752 163981 165816 153614 148132 149125
9274A49125K4801q686O134j286J1048J1848J6731J863m6633J3234k3975L135J2547
$$ 149125 173926 165240 171374 170088 181136 192984 209715 211578 164945 178179 154204 157339 169886
9261A69886Q839J6067j5366k531m842j684o941K3564J352j7152N034r24k1723
$$ 169886 178725 194792 179426 176895 172053 170369 163428 186992 188344 171192 176226 175302 153579
9248A53579j2553j0180M789J5267O099k4230l071K0104J9587r872J0846J888N818
$$ 153579 141026 130846 135635 150902 157001 132771 129700 149804 169391 159519 170365 172253 178071
9235A78071J2540K4096j3599k4198k4822Q837J8478L9911R136j0780R95J0204
$$ 178071 190611 214707 201108 176910 152088 160925 179403 219314 228450 217670 218665 228869
9223B28869J452k2389j2702K5110j2857q388N073N425k5492J5969Q844j8070J5211
$$ 228869 230321 207932 195230 220340 207483 199095 204168 209593 184101 200070 208914 190844 206055
9210B06055J5119P892Q598P11o746j5502N69j4284K7357K1267n027k109J2700
$$ 206055 221174 229066 237664 238375 231629 216127 216696 202412 229769 251036 246009 243900 256600
9197B56600j803K953k4154k0541j8568L846J0511J2295J9394K2738J336J2386
$$ 256600 254797 257750 233596 213055 194487 198333 208844 221139 240533 263271 264607 276993
9185B76993P19J0437k8434k2485J2730J4979j7312m720l814J2747O814J4444k710
$$ 276993 277712 288149 259715 237230 249960 264939 247627 242907 239093 251840 258654 273098 270388
9172B70388j0195M516J8939J5201k65k727Q481j0738o238L7456K028P640k870
$$ 270388 260193 264709 283648 298849 298584 295857 304338 293600 287362 324818 326846 334486 331616
9159C31616k511J0886N92J3534K1828j2253L628K433j8547J0000k670O715j4235
$$ 331616 329105 339991 340583 354117 375945 363692 367320 369753 351206 361206 358536 365251 351016
9146C51016j3064K7094P876l757J130K2769o182j9326R66J1976J0662q775k5176
$$ 351016 337952 365046 372922 369165 370295 393064 386882 367556 368522 380498 391160 382385 357209
9133C57209J0257K2479O175j1642l2370l004L669J730r166P618J2046K178K5871
$$ 357209 367466 389945 396120 384478 352108 349104 352773 354503 345337 352955 365001 367179 393050
9120C93050N347p816j1309m653k7048j9606K0556K8544M2j2539P270J978k286
$$ 393050 398397 390581 379272 374619 347571 327965 348521 377065 377107 364568 371838 373816 371530
9107C71530J1286n020J5862J4603j860J7737M2456K7947r560l5658j4217j7480
$$ 371530 382816 377796 393658 408261 406401 424138 466594 494541 484981 449323 435106 417626
9095D17626n08L639J8405K3061J7638j0922L433J8973R143P240K9356O357n063
$$ 417626 417118 420757 439162 462223 479861 468939 472372 491345 500488 507728 537084 543441 538378
9082E38378J4422J2493Q739k0303k2531j5836M497L6569k8137m250K3534M956
$$ 538378 552800 565293 574032 553729 531198 515362 519859 556428 528291 524041 547575 552531
9070E52531K1809K6234O105k3042Q759J0203r574R143L0030J4688L3560K2092
$$ 552531 574340 600574 606679 583637 592396 602599 593025 602168 632198 646886 680446 702538
9058G02538K4760L2660l0463p780P083J2893o833m891K5715M0648L2107J7819
$$ 702538 727298 759958 729495 721715 728798 741691 734858 729967 755682 796330 828437 846256
9046H46256L678K1999J2419K6286K9120K8475L7888J7795K7496J4962J116J7281
$$ 846256 849934 871933 884352 910638 939758 968233 1006121 1023916 1051412 1066374 1067490 1084771
9034A084771L2010L5122L2543K2698L5786N3652K8942L2538L8062N0687P4063
$$ 1084771 1116781 1151903 1184446 1207144 1242930 1296582 1325524 1358062 1396124 1446811 1520874
9023A520874O0462O0869N7133P5616M2255M1917N3218R0724J18255R7754M8311
$$ 1520874 1581336 1642205 1699338 1774954 1817209 1859126 1912344 2003068 2121323 2219077 2267388
9012B267388O7453P1720J33292J14268R9062J15696J72179J99890K00775K03868
$$ 2267388 2334841 2406561 2539853 2654121 2753183 2868879 3041058 3240948 3441723 3645591
9002C645591J74401J90192K18548K60764K99766K95166L15945L35057L76267M39168
$$ 3645591 3819992 4010184 4228732 4489496 4789262 5084428 5400373 5735430 6111697 6550865
8992F550865M91696N53047O00380O73356P40572Q46609R39034J055757J216370
$$ 6550865 7042561 7595608 8195988 8869344 9609916 10456525 11395559 12451316 13667686
8983A3667686J400466J555642J764526J988221K218996K536639K805685L058773
$$ 13667686 15068152 16623794 18388320 20376541 22595537 25132176 27937861 30996634
8975C0996634L298021L475962L550650L460993L171397K709325K072004J275141
$$ 30996634 34294655 37770617 41321267 44782260 47953657 50662982 52734986 54010127
8967E4010127M18105m87444j345554k044735k566799k939065l118249l110398
$$ 54010127 54428232 53940788 52595234 50550499 47983700 45044635 41926386 38815988
8959C8815988l008523k837432k689834k485676k277878k082005j877399j714159
$$ 38815988 35807465 32970033 30280199 27794523 25516645 23434640 21557241 19843082
8951A9843082j579450j446744j343155j210829j095058j025170q98603q00571
$$ 19843082 18263632 16816888 15473733 14262904 13167846 12142676 11244073 10443502
8943A0443502p42810o93957o39976n47844n13660m86496m16231l64800l52551
$$ 10443502 9700692 9006735 8366759 7818915 7305255 6818759 6402528 6037728 5685177
8934E685177l46216l17214k58716k31524k43702k19611k15856j67233j54181j46534
$$ 5685177 5338961 5021747 4763031 4531507 4287805 4068194 3852338 3685105 3530924 3384390
8924C384390j27977j18280j35831j30663j11818r5087r3031j21792j12527q7771
$$ 3384390 3256413 3138133 3002302 2871639 2759821 2664734 2571703 2449911 2337384 2249613
8914B249613m6910n1683o2988p6876q1374p7190m5558o1942o4738m7978m2314
$$ 2249613 2202703 2151020 2088032 2011156 1929782 1852592 1807034 1745092 1680354 1632376 1590062
8903A590062m8247n4577m5328k7207l2663l7592m5289n2228k3175l3790o4073
$$ 1590062 1541815 1487238 1441910 1414703 1382040 1344448 1299159 1246931 1223756 1189966 1125893
8892A125893k0465q435m6967l1311k8853j6063l711n561l9999l7455n672Q081
$$ 1125893 1105428 1096993 1050026 1018715 989862 973799 970088 964527 924528 887073 881401 889482
8880H89482j3501k9014l0492q838r698M155l3822o0982j1111J5042l902j2179
$$ 889482 875981 846967 816475 807637 797939 802094 768272 707290 696179 711221 707319 695140
8868F95140K023j2711k3362j3317j2016J575k827l567j5821n628k3793j5242j3978
$$ 695140 697163 684452 661090 647773 635757 637332 634505 630938 615117 609489 585696 570454 556476
8855E56476O029l3702j5798K6688J3364m51J2932l6999k2336k7290l390J5052
$$ 556476 562505 528803 513005 539693 553057 552606 565538 528539 506203 478913 475523 490575
8843D90575j1026k1355k551L074L3534J8184p837j0086j4471l3728J0712M167
$$ 490575 479549 458194 455643 458717 492251 510435 502598 492512 478041 444313 455025 459192
8831D59192J192j8969J535J3254J772k3317n255R80k2575m7484l5973J6249j869
$$ 459192 460384 441415 442950 456204 457976 434659 429404 430384 407809 360325 324352 340601 338732
8818C38732j3595l066L629O575m994j8127j4610K1204j4495L011k2796k6073J385
$$ 338732 325137 322071 325700 332275 327281 309154 294544 315748 301253 304264 281468 255395 256780
8805B56780J8319L655j1968J3169J9805j6348k1942r017j7472p455J4335j9176
$$ 256780 275099 278754 266786 279955 299760 283412 261470 252453 234981 227526 241861 222685
8793B22685R383o556r681k6971q027L8421j1387o385J5957J9498n370l814J0676
$$ 222685 232068 225512 215831 188860 180833 219254 207867 201482 217439 236937 231567 227753 238429
8780B38429l763l3461J0830l833p105q200P136J5482K066L404K7289j660P145
$$ 238429 234666 201205 212035 208202 201097 192897 200033 215515 217581 220985 248274 246614 253759
8767B53759q857j7534p511j5313j6712o769K1313K0289M747Q409n114l3420J2863
$$ 253759 244902 227368 219857 204544 187832 181063 202376 222665 227412 235821 230707 197287 210150
8754B10150L5568L500o107R194j5623j4490k9299j4845l027J4307m84J4715J0408
$$ 210150 245718 249218 243111 252305 236682 222192 192893 178048 175021 189328 188844 203559 213967
8741B13967j2244m9924J3694L2128N919j8417J9547J9440k0641k0730O667J7540
$$ 213967 201723 151799 165493 197621 203540 185123 204670 224110 203469 182739 189406 206946
8729B06946M054K47Q040k9729k0419K519J9865K077j1977l4541k340j1982J2135
$$ 206946 211000 211247 219287 189558 169139 171658 191523 193600 181623 147082 144742 132760 144895
8716A44895J2389j7943m24p742j476K4564k1391k7035j1778J0995M2489K0444
$$ 144895 157284 139341 138917 131175 129699 154263 132872 105837 94059 105054 147543 167987
8704A67987J4967J0934r100K4034o447k4561k3849l459j7389r85K221r549p76
$$ 167987 182954 193888 184788 208822 202375 177814 153965 150506 133117 132132 134353 124804 124028
8691A24028J860K5080L2891j1625j8104k2827l121l159m682j103K3823M8786Q536
$$ 124028 125888 150968 183859 172234 154130 131303 128182 125023 120341 119238 143061 191847 200383
8678B00383j6736k775K1220L889O684l090j232O339M7306K0455j2706J6618p317
$$ 200383 183647 180872 202092 205981 212665 209575 208343 214682 261988 282443 269737 286355 279038
8665B79038J1167J1959o984m651L687J2838K6338P036J248N437j7309j3159J286
$$ 279038 290205 302164 295180 290529 294216 307054 333392 340428 341676 347113 329804 316645 317931
8652C17931J5483J6O079K8030L8696O9084R9482J79766K31374L11159L17306K25210
$$ 317931 333414 333430 339509 367539 406235 475319 574801 754567 985941 1297100 1614406 1839616
8640A839616J36283L3354R39j38408l34321l18296k11673j60137j21977o4163
$$ 1839616 1975899 2009253 2010192 1871784 1537463 1219167 1007494 847357 725380 661217
8630F61217p1677o2448m1108j8248j4309k7420k2700N383K5419K8908K0788L1314
$$ 661217 589540 527092 485984 467736 453427 426007 403307 408690 434109 463017 483805 515119
8618E15119N8672j8292J028O174K1016m8983p3394l6428p778K4823L6124L7218
$$ 515119 573791 555499 556527 562701 583717 534734 461340 424912 417134 441957 478081 515299
8606E15299N9904K2292O3296J29415J60158K57462L91264N13493O27990O30521
$$ 515299 575203 597495 660791 790206 950364 1207826 1599090 2112583 2740573 3371094
8596C371094L54204Q4139P5328k948m50358p28105n85310m05862k60066j98239
$$ 3371094 3725298 3809437 3884765 3881817 3431459 2703354 2118044 1712182 1452116 1253877
8586A253877j33065j12367j34656n8446m9087m0669l1278n4873o0452l8911l2457
$$ 1253877 1120812 1008445 873789 815343 766256 725587 694309 639436 578984 540073 507616
8575E07616k6335j9192j6746j2703n814L378k1481k3101k6286k7011j5374J0999
$$ 507616 481281 462089 445343 432640 426826 430204 408723 385622 359336 332325 316951 327950
8563C27950J71J0527L0166K3816K6482O6673P0346J18929J82137K71211K90765
$$ 327950 328121 338648 368814 392630 419112 485785 556131 675060 857197 1128408 1419173
8552A419173K61270J57030K7614K4778m8100k49765l34128k66095k04702j33890
$$ 1419173 1680443 1837473 1865087 1889865 1841765 1592000 1257872 991777 787075 653185
8542F53185r8326o9139l5530m9549m0939k7579l2374o927J3014l9182l5322N022
$$ 653185 554859 485720 450190 400641 359702 332123 299749 292822 305836 266654 231332 236354
8530B36354K4390j4388j7624R637j2444k970L6530J0188l7615l6693j312j001
$$ 236354 260744 246356 228732 238369 225925 222955 259485 269673 232058 195365 194053 193052
8518A93052l8992l0942k8372j7200J6485K505K6296R909J1576j6372j8724k4693
$$ 193052 154060 123118 94746 77546 94031 96536 122832 132741 144317 127945 109221 84528
8506H4528j4357J499L1868m317n595n737q293P885J6253R311j248j7219K209J4961
$$ 84528 70171 71670 103538 99221 93626 87889 79596 87481 103734 113045 111797 94578 96787 111748
8492A11748R030J7765L0708L471j9283Q00L2996J9940j8390m6858m0308l0209
$$ 111748 120778 138543 169251 172722 153439 154239 187235 207175 188785 141927 101619 71410
8480G1410R900J7314J0291m593k1874k9044j4620J2939J534k2417J4841J633O108
$$ 71410 81310 98624 108915 104322 82448 53404 38784 51723 53257 30840 45681 47314 53422
8467E3422K0399K0708J9211M561l5857n1616l9697J2698K7016P99m441J3893L2856
$$ 53422 73821 94529 113740 118301 82444 30828 -8869 3829 30845 31644 27203 41096 73952
8454G3952J5691j2558M796L354m067K4712L4279k1001k9344l2997K142m44q454
$$ 73952 89643 77085 81881 85235 81168 105880 140159 119158 89814 56817 58959 58515 50061
8441E0061q898J939J7521K4859Q905k9802l3641j870K2467K1905m0n651k3122
$$ 50061 41163 43102 60623 85482 94387 64585 30944 29074 51541 73446 73406 67755 44633
8428D4633k2652k1739j6286J1280O5185K249k7534j2925J0428J6306j006r423
$$ 44633 21981 242 -16044 -4764 60421 62670 35136 22211 32639 48945 47939 38516
8416C8516n428K0933L2383k014K1915R461m450l954m773k4380l5818n079N953
$$ 38516 33088 54021 86404 84390 106305 115766 111316 107362 102589 78209 42391 37312 43265
8403D3265K4414Q510J1693J6236j5292m3530p864M33j4924K8195Q284j3796Q297
$$ 43265 67679 76189 87882 104118 88826 45296 37432 37865 22941 51136 59420 45624 53921
8390E3921q562j5519L0338j141k9228J3827m973j4249J5781J9524j0771J4591
$$ 53921 45359 29840 60178 59037 29809 43636 38663 24414 40195 59719 48948 63539
8378F3539J4426j3622j0370L572M786L138N730o151N468J6178J5982j5447j0283
$$ 63539 77965 64343 53973 57545 62331 65469 71199 65048 70516 86694 102676 87229 76946
8365G6946J5991j7287j1808J762J775j1463j5049P783k4515j057l416j128O716
$$ 76946 92937 75650 63842 65604 67379 55916 40867 48650 24135 23078 19662 18534 25250
8352B5250j6008J4490J2987J4562J0142k607j0817K8056M0066J3425l1247j8194
$$ 25250 9242 23732 36719 51281 61423 58816 47999 76055 116121 129546 98299 80105
8340H0105j7579m882o035j9130O871J6183Q634j7237l4952J5160K9370M433k9087
$$ 80105 62526 57644 51609 32479 39350 55533 64167 46930 11978 27138 56508 60941 31854
8327C1854j4896R41J4986Q895j1860m427J1657R253q358k7181N735p794O12o55
$$ 31854 16958 17899 32885 41780 29920 25493 37150 46403 38045 10864 16599 8805 9417 8762
8313H762J3187n78k0506N167j5206K8932J0185k589J1722L643L426K5442J5905
$$ 8762 21949 21371 865 6032 -9174 19758 29943 27354 39076 42719 46145 71587 87492
8300H7492p263j2643J4219j546r708j0048j3391j1119l81n572J4183P806M605
$$ 87492 80229 67586 81805 80259 70551 60503 47112 35993 35612 30040 44223 52029 56634
8287E6634Q650l5792k2749q415R532Q080q886n104L2259J497j0896K902J8146
$$ 56634 65284 29492 6743 -1672 7860 15940 7054 1950 34209 35706 24810 27712 45858
8274D5858N917l3619N488j1352k24J0125J831j1183J653k1245l77m3486p050K9640
$$ 45858 51775 18156 23644 12292 12068 22193 24024 12841 14494 -6751 -7128 -50614 -57664 -28024
8260b8024K1891M3290R656J855j3966J78O743j235K7210j6144j8819k7883K936
$$ -28024 -6133 37157 46813 48668 34702 34880 41623 40388 67598 51454 32635 4752 7688
8247G688j23J5583o706j4090K6236k780K009J9685r398p795l470K652J2779J773
$$ 7688 7565 23148 16442 2352 28588 25808 27817 47502 38104 30309 26839 29491 42270 44043
8233D4043J9384k501j5439j0590J5012J6516j486J6739j4015P80j5068k945j496
$$ 44043 63427 60926 45487 34897 49909 66425 64939 81678 67663 68443 53375 50430 48934
8220D8934L459r095m890O85Q596J5492J0509K0323O17j6851k9185j2777j3670
$$ 48934 52393 43298 38408 39093 47689 63181 73690 94013 94630 77779 48594 35817 22147
8207B2147k0559k7937n804J2398J0481K574P909k600J333J4758M1943O033O903
$$ 22147 1588 -26349 -32153 -19755 -9274 -6700 1209 -1391 -58 14700 56643 62676 69579
8194F9579N127k663j5453L16R78j8474K240L680p802k2391J2887K8799j5994R324
$$ 69579 74706 72043 56590 56906 57884 39410 41650 45330 37528 15137 28024 56823 40829 50153
8180E0153j3196j4586r16n99J3887o07r714J1646K846K3266K568k9826Q90l3Q1
$$ 50153 36957 22371 21455 20856 34743 34136 24422 36068 38914 62180 64748 34922 35812 35779 35860
8165C5860k5678k9072K3078K8869k8123k6927p758k163K3654K1129J5040J1912
$$ 35860 10182 -18890 4188 33057 4934 -21993 -29751 -31914 -8260 12869 27909 39821
8153C9821j1834J3182R329r343k5905k3208m316l408L687p274R433P932m3262
$$ 39821 27987 41169 50498 41155 15250 -7958 -12274 -15682 -11995 -19269 -9836 -1904 -45166
8140d5166p941k513j2376J8379N0431J2103p269o805J7118N592q609R17r808j9627
$$ -45166 -53107 -55620 -67996 -49617 814 12917 5648 -1157 15961 21553 12944 13861 4053 -15574
8126a5574K1500K8379J093J3230k1467j7003N129o302j695J4490m305n257r700
$$ -15574 5926 34305 35398 48628 27161 10158 15287 8985 7290 21780 17475 12218 2518
8113B518k0090n552K6634N624m858M1506K118k2015K823j3960j3520J8939r978
$$ 2518 -17572 -23124 3510 9134 4276 45782 47900 25885 28708 14748 1228 20167 10189
8100A0189n308K06M712J4514J6131J5134m447p512R097J3076o227k2856r310n67
$$ 10189 4881 5087 9799 24313 40444 55578 51131 43619 52716 65792 59565 36709 27399 26832
8086B6832j1261K1449J6401p562k0049k6540J7255J581k0865k162k4596J6959
$$ 26832 15571 37020 53421 45859 25810 -730 16525 18106 -2759 -4921 -29517 -12558
8074a2558R832K2174J2660k405m348j1909j3014j7473k535p846J8546J7519L1886
$$ -12558 -2726 19448 32108 29703 25355 13446 432 -17041 -19576 -27422 -8876 8643 40529
8061D0529k8768p589K3345p846O669L214R479j2107k2890M643K6507R444j8116
$$ 40529 11761 4172 27517 19671 26340 29554 39033 26926 4036 8679 35186 44630 26514
8048B6514j8294k286j41k8212P443L7609K5902j0872m90l802Q908o075j59J4890
$$ 26514 8220 5934 5793 -22419 -14976 22633 48535 37663 37173 33371 42279 36204 36045 50935
8034E0935O251L509J8311N296j3451k2143k4477N701J3617p293k4278O849K467
$$ 50935 57186 60695 79006 84302 70851 48708 24231 29932 43549 36256 11978 18827 21294
8021B1294o383j703o184r543J2113J9390j804p5N843l495k9372J2872J6086Q374
$$ 21294 14911 13208 7024 -2519 9594 28984 27180 27105 32948 29453 81 12953 29039 37413
8007C7413k0995r200o633J9584O000O82J771J3010J2360k5515r338K3467J6110
$$ 37413 16418 7218 585 20169 26169 26851 28622 41632 53992 28477 19139 42606 58716
7994E8716J5723j3720r596j832L006n054n812j5286L1959K4711l3375j8348r391
$$ 58716 74439 60719 51123 49291 52297 47243 41431 26145 58104 82815 49440 31092 21701
7981B1701l0919o8K2508j946J1310K6832j5824r47j6123l9860o722R818J2734
$$ 21701 -9218 -9286 13222 11276 22586 49418 33594 32647 16524 -23336 -30058 -20240 -7506
7968g506J0719J0609j8079m019O399p779j0474O987K644K5583J7859k4043j6286
$$ -7506 3213 13822 -4257 -8276 -1877 -9656 -20130 -13143 -10499 15084 32943 8900 -7386
7955g386L1089M2158J2852k9663j0882O058j7500j5902j6827J2579j3474j424
$$ -7386 23703 65861 78713 49050 38168 44226 26726 10824 -6003 6576 -6898 -8322
7943h322p929j6095J8327L3451r129R675j3490l7559p05R632N162L1473L5113
$$ -8322 -16251 -32346 -14019 19432 10303 19978 6488 -31071 -31776 -22144 -16982 14491 49604
7930D9604m105J1535n475l4701j8286J0168K1083n102J1868P117j3917q365j5112
$$ 49604 45499 57034 51559 16858 -1428 8740 29823 24721 36589 43706 29789 21424 6312
7917F312j7821K0209K2538j4100j7263N189J2758R18j2376j0366L7621R457m2475
$$ 6312 -11509 8700 31238 17138 -125 5064 17822 18740 6364 -4002 33619 43076 601
7904F01k5990r162J0501K5506j0534r224k082m703o533J1021q660l0028J7557
$$ 601 -25389 -34551 -24050 1456 -9078 -18302 -20384 -25087 -31620 -20599 -29259 -59287 -41730
7891d1730K583J7585L4757K0720m601j5520j0007j0457O638J9226J8530l473J7997
$$ -41730 -39147 -21562 13195 33915 29314 13794 3787 -6670 -32 19194 37724 34251 52248
7878E2248j2053k2075j9452J8366L897p246J1709Q81L6582K2681j6749m6716k8078
$$ 52248 40195 18120 -1332 17034 20931 13685 25394 26275 62857 85538 68789 22073 -6005
7865f005J7430j98p448k5J0512O872K0543j5869l1799q984k834K3286O581j503
$$ -6005 11425 11227 3779 3754 14266 21138 41681 25812 -5987 -14971 -17805 5481 12062 10559
7851A0559J09Q66J2280k6561j5247k343M349O959J4491K7496l415q49k389p203
$$ 10559 10668 11534 23814 -2747 -17994 -20337 -15988 -9029 5462 32958 29543 28694 26305 19102
7837A9102L254k0017j5052J5167l145j3583n665K664J4288p604j063K1189J689
$$ 19102 22356 2339 -12713 2454 -691 -14274 -19939 -17275 -2987 -10591 -11654 9535 11224
7824A1224K8308N322k7612k1062j1236j5217q399K037q302K4472Q186q579m145
$$ 11224 39532 44854 17242 -3820 -15056 -30273 -38672 -36635 -44937 -20465 -12279 -20858 -25003
7811b5003J742j9126l4028O076R725L5700M65l1708K2222J2157Q463J5423J6248
$$ -25003 -23261 -42387 -76415 -70339 -60614 -24914 -24449 -56157 -33935 -21778 -13315 2108 18356
7798A8356r289q551J3145j672j1757K6869L0838J0850q717j6481o822k6382l1744
$$ 18356 9067 516 13661 11989 232 27101 57939 68789 60072 43591 36769 10387 -21357
7785b1357k699O200J584J2102J1811R03j8241k4893J3590R760J0739R928J593
$$ -21357 -24056 -17856 -16272 -4170 7641 8544 -9697 -34590 -21000 -11240 -501 9427 11020
7772A1020j5391k133K235R863k444K1202l76k7296J720J5693r911k8031j2381
$$ 11020 -4371 -6504 -4269 5594 3150 24352 23976 -3320 -1600 14093 4182 -23849 -36230
7759c6230N914J5494L600n457o636J117J4280Q740M474N315m078r530k803O349
$$ -36230 -30316 -14822 -11222 -16679 -23315 -22198 -7918 822 5296 10611 6533 -2997 -5800 549
7745E49o016k0720m220j5003J3875K9892J3395J710k3334k0887J3772J3093L1611
$$ 549 -5467 -26187 -30407 -45410 -31535 -1643 11752 13462 -9872 -30759 -16987 -3894 27717
7732B7717J0550N988m3383m3895j751J5804J584Q038o474P944K4374j4322M159
$$ 27717 38267 44255 872 -43023 -44774 -28970 -27386 -19348 -25822 -17878 6496 -7826 -3667
7719c667K864o254P016L421J8669j5791l1990R872J1261N155Q623N070q489j9846
$$ -3667 -803 -7057 -41 3380 22049 6258 -25732 -15860 -4599 556 9179 14249 5760 -14086
7705a4086N83K3533q667l247k463m429k3173j3144J4030L0087J4604J6952j0395
$$ -14086 -13503 10030 1363 -1884 -4347 -8776 -31949 -45093 -31063 -976 13628 30580 20185
7692B0185o361q314j2729j2731K8322L443j5418j1565j735K1709M169k5333q992
$$ 20185 13824 5510 -7219 -19950 8372 11815 -3603 -15168 -16903 4806 8975 -16358 -25350
7679b5350Q12j411L3550O870J6910L182l1701r486l885o293J5192J9303L9681
$$ -25350 -24538 -25949 7601 14471 31381 34563 2862 -6624 -10509 -16802 -1610 17693 57374
7666E7374J8887m0755k6028M672J7476k7348l436K0570k0471q262K0275R886q635
$$ 57374 76261 35506 9478 14150 31626 4278 842 21412 941 -7321 12954 22840 14205
7653A4205L50j6474l2323J1049j6597J3787K9302N403j9874j7283Q43n638O180
$$ 14205 14555 -1919 -34242 -23193 -39790 -26003 3299 8702 -11172 -28455 -27612 -33250 -27070
7640b7070P666J6772L4j3666J121q832K581q944K1304M078J032L1560j0241o386
$$ -27070 -19404 -2632 -2598 -16264 -15143 -23975 -21394 -30338 -9034 -4956 -3924 27636 17395 11009
7626A1009K4919j188Q554q325k2304j1124J4214j0115j1199J1816j701Q412J3102
$$ 11009 35928 34740 43294 34969 12665 1541 15755 5640 -5559 6257 4556 12968 26070
7613B6070N305l2863j5112J3593j832j2591K3131l0719j1784K8044J5880j1257
$$ 26070 31375 -1488 -16600 -3007 -4839 -17430 5701 -25018 -36802 -8758 7122 -4135
7601d135j0623j4633R949k4135k2545k448K2847L5263O275Q958J127o886k4970
$$ -4135 -14758 -29391 -19442 -43577 -66122 -68570 -45723 -10460 -4185 4773 5900 -986 -25956
7588b5956j7469J5185J7103J2051j7498P33J5576J1459J1771Q914J200M097O996
$$ -25956 -43425 -28240 -11137 914 -16584 -15851 -275 11184 22955 31869 33069 37166 44162
7575D4162j6851k0626l82M905J1155l0468l2800J2330K0900K965r818k0726k6669
$$ 44162 27311 6685 6303 11208 22363 -8105 -40905 -28575 -7675 -4710 -14528 -35254 -61923
7562f1923O232K6050K1782j7255q118L378J15k161P975o73J170L458J486J9569
$$ -61923 -55691 -29641 -7859 -25114 -33232 -29854 -29739 -31900 -23925 -24598 -23428 -19970 -18484 1085
7548A085J2368j1814q925J5232j3660k02P061l0531n023K1497J8162Q213N041
$$ 1085 13453 1639 -7286 7946 -5714 -5916 1145 -29386 -34409 -12912 5250 13463 18504
7535A8504j3441K89q976j0783J243K046p23J2455J2865O286k097k0562j9675Q892
$$ 18504 5063 5352 -3624 -14407 -13164 -11118 -11841 614 13479 19765 17668 -2894 -22569 -13677
7521a3677P967j8780n043Q288J091J043j1832p777k2964K582J9102j3467Q552
$$ -13677 -5710 -24490 -29533 -21245 -20154 -19111 -30943 -38720 -61684 -59102 -40000 -53467 -44915
7508d4915L0106j695r523p539K608L4886L6487j8760k6029l8072P239j041J6101
$$ -44915 -14809 -16504 -26027 -33566 -30958 3928 40415 21655 -4374 -42446 -35207 -36248 -20147
7495b0147L9582J3573J226l2520j3929R501j05o869R594J4847l3486R788J8588
$$ -20147 19435 33008 34234 1714 -12215 -2714 -2819 -9688 -94 14753 -18733 -8945 9643
7482I643l7505j7827q811M056J571m70K081J8471j6123m290J6498j2744j7027
$$ 9643 -27862 -45689 -54500 -50444 -48873 -49343 -47262 -28791 -44914 -49204 -32706 -45450 -62477
7469f2477j2857O376O369J2551j40r315N696R482k026P357K047j921n163j5580
$$ -62477 -75334 -68958 -62589 -50038 -50178 -59493 -53797 -44315 -46341 -38984 -36937 -38858 -44021 -59601
7455e9601k1844j0216j6177J6350K5132K5657J0231n386J5785j102j9738P475
$$ -59601 -81445 -91661 -107838 -91488 -66356 -40699 -30468 -35854 -20069 -21171 -40909 -33434
7443c3434N45j9849J3177J947P700J2188P487k521J5942K0514n658l5743K697
$$ -33434 -32889 -52738 -39561 -37614 -29914 -17726 -10239 -12760 3182 23696 18038 -17705 -15008
7430a5008K6870j3723k0260l0047O282K0994l40J7040L6019J1188J6431J368j1878
$$ -15008 11862 -1861 -22121 -52168 -45886 -24892 -25232 -8192 27827 39015 55446 56814 44936
7417D4936j2644l6871J1513K2728K1235l271n0109l4325J081J53K8289K4784j875
$$ 44936 32292 -4579 6934 29662 50897 47626 -2483 -36808 -35727 -35574 -7285 17499 15624
7404A5624j1203J0370N903j8528l1587k2054o421Q674j0472o357N460l789K2102
$$ 15624 4421 14791 20694 2166 -29421 -51475 -57896 -49222 -59694 -66051 -60591 -64380 -42278
7391d2278L4318P226m922k978j6998r256J5939k461j9883k1978M966K8423J0719
$$ -42278 -7960 -734 -5656 -8634 -25632 -34888 -18949 -21410 -41293 -63271 -58305 -29882 -19163
7378a9163L611M482k873J651k2538J1061O476j4815j8672k0263j1074K7816J3787
$$ -19163 -15552 -11070 -13943 -12292 -34830 -23769 -17293 -32108 -50780 -71043 -82117 -54301 -40514
7365d0514M904R259P337j427Q443q608M740N421m303k439O565L0297K066l468
$$ -40514 -35610 -26351 -19014 -20441 -11998 -20606 -15866 -10445 -14748 -17187 -10622 19675 21741 18273
7351A8273J1303N201j3745r638N260j4881L413K1014j0178j2879J6942q536j3806
$$ 18273 29576 34777 21032 11394 16654 1773 5186 26200 16022 3143 20085 11549 -2257
7338b257j622J359M606R520j1962r502o267J6116k6434k2891Q42j0302j364J9739
$$ -2257 -3879 -2520 2086 11606 -356 -9858 -16125 -9 -26443 -49334 -48492 -58794 -60158 -40419
7324d0419N300j9070J3673L1357J3915j0502o392o977P80R698p1j3416J2197K2840
$$ -40419 -35119 -54189 -40516 -9159 4756 -5746 -12138 -19115 -18335 -8637 -8708 -22124 -9927 12913
7310A2913j9006m4244j6838J5539K3164M893K9823N58l0922k891j6362K300K8356
$$ 12913 -6093 -50337 -67175 -51636 -28472 -23579 6244 6802 -24120 -27011 -43373 -41073 -12717
7297a2717l953j3628K3182J3399K5553j6931j274L872j8410j4878R890J5530j6234
$$ -12717 -16670 -30298 -7116 6283 31836 14905 13631 17503 -907 -15785 -5895 9635 -6599
7284f599r646m116K2497j3456P262L0971m277k7823k8940j7026j2368J8799J0605
$$ -6599 -16245 -20361 2136 -11320 -4058 26913 22636 -5187 -34127 -51153 -63521 -44722 -34117
7271c4117J4130R324p314K824n861O164o228L490J9707K5439q460j7891j1543
$$ -34117 -19987 -10663 -17977 -15153 -21014 -14850 -21078 -17588 2119 27558 19098 1207 -10336
7258a0336L205o381L716j7231J0786J3948L455j511o490k041L269j001j0675j112
$$ -10336 -7131 -13512 -9796 -27027 -16241 -2293 1162 -349 -6839 -8880 -5611 -6612 -17287 -18399
7244a8399J6519j6682l1005N425L2501L1167j4n507l17k2703j5796K4435l948
$$ -18399 -1880 -18562 -49567 -44142 -11641 19526 19512 14005 13688 -9015 -24811 -376 -4324
7231d324j378o964P846L760L628p03m123J0188r724k3516P714J2798J9434k716
$$ -4324 -5702 -12666 -4820 -1060 2568 1865 -2258 7930 -1794 -25310 -17596 -4798 14636 11920
7217A1920j975k362l1455k210J6859K670j4929J2528K0372j6887k2769J0729M522
$$ 11920 9945 7583 -23872 -26082 -9223 -6553 -21482 -8954 11418 -5469 -28238 -17509 -12987
7204a2987J1241J9796j1106l4415k4345J3941L124J7142J708q843k803j0189j2180
$$ -12987 -1746 18050 6944 -27471 -51816 -37875 -34751 -17609 -15901 -24744 -27547 -37736 -49916
7191d9916N205J6536j5847k1686J4310K1231M4285L316j0893k7635K104O560j2085
$$ -49916 -44711 -28175 -44022 -65708 -51398 -30167 14118 17434 6541 -21094 -18990 -12430 -24515
7178b4515O062R510l875l1112k6866R525j707P292K1524j2351J4013j3940k3139
$$ -24515 -18453 -8943 -12818 -43930 -70796 -61271 -62978 -55686 -34162 -46513 -32500 -46440 -69579
7165f9579k2001k4387K8072M9261J6415K1262K6196K1063M695l0051r210k149
$$ -69579 -91580 -115967 -87895 -38634 -22219 -957 25239 46302 50997 20946 11736 9587
7153I587j0557Q274r823M045P77J0523J224j6625j5751j0647j717K2888K9090
$$ 9587 -970 7304 -2519 1526 2303 12826 14050 -2575 -18326 -28973 -30690 -7802 21288
7140B1288P461L421j5010j2049O61j0752j312O91j80O931J3135k7209k5738k7503
$$ 21288 28749 32170 17160 5111 5772 -4980 -6292 -5601 -5781 1150 14285 -12924 -38662 -66165
7126f6165L037K5059J7286j2414l0124J2972k284L232K8407K0175O823q867L258
$$ -66165 -63128 -38069 -20783 -33197 -63321 -50349 -52633 -49401 -20994 -819 6004 -2863 395
7113C95k533j6490m417J5391j6159k3875J266K2108J1088J1939k015M728K598
$$ 395 -2138 -18628 -23045 -7654 -23813 -47688 -46422 -24314 -13226 -1287 -3302 1426 4024
7100D024L794r486p110k863J5160n107J1725J5819k4966P373K2287p39k7715k1321
$$ 4024 7818 -1668 -8778 -11641 3519 -1588 10137 25956 990 8363 30650 29911 2196 -19125
7086a9125n900K068J7476k2405m086J4776K7551l842j2419J165J270J1653k849
$$ -19125 -25025 -22957 -5481 -27886 -31972 -17196 10355 6513 -5906 -4741 -3471 8182 5333
7073E333k5031K7791K1399R086k425L414j6677l2422k1882N568j9127K4660k033
$$ 5333 -19698 8093 29492 38578 36153 39567 22890 -9532 -31414 -25846 -44973 -20313 -22346
7060b2346j2487J1602M924k1635R525L0393J8800j9153j4157q296K643L813J577
$$ -22346 -34833 -23231 -18307 -39942 -30417 -24 18776 -377 -14534 -22830 -20187 -16374 -14797
7047a4797K105M710K4422m65R202k471l2311k307j0136J062k188N555k8480J7625
$$ -14797 -12692 -7982 16440 15975 25177 22706 -9605 -11912 -22048 -20986 -23174 -17619 -46099 -28474
7033b8474J8309N973P044J7843R284j2914j5677P279j5528j5935L406R400j3758
$$ -28474 -10165 -4192 2852 20695 29979 17065 1388 8667 -6861 -22796 -19390 -9990 -23748
7020b3748Q866J2404J919j4743J2308P784k5118j8416j207n206K5969j168k722
$$ -23748 -14882 -2478 -559 -15302 -2994 4790 -20328 -38744 -39951 -45157 -19188 -20356 -23078
7007b3078M0254J3523k9926k6417j4853Q616J5163M082K341L799O177J0871n389
$$ -23078 17176 30699 773 -25644 -40497 -31881 -16718 -12636 -10295 -6496 -319 10552 5163
6994E163l6907m556J1883L3173o776K770k4384j341J0638l507K853r742J6771
$$ 5163 -31744 -36300 -24417 8756 1980 4750 -19634 -20975 -10337 -13844 -10991 -20733 -3962
6981c962J4902j4713m911p107N489J5126K538m130K1380R616r201k6741p080K755
$$ -3962 10940 -3773 -8684 -15791 -10302 4824 7362 3232 24612 34228 25027 -1714 -8794 -6039
6967f039n908r819k5540j7731K4153K5531L4301j699k3439K756N949P133p003
$$ -6039 -11947 -21766 -47306 -65037 -40884 -15353 18948 17249 -6190 -3434 2515 9648 2645
6954B645J1847j4031q059L376K027K5303M352k0463n284P048M772k282j080L838
$$ 2645 14492 461 -7598 -4222 -2195 23108 27460 6997 1713 8761 13533 11251 10171 14009
6940A4009K0546k4509k1993R769j0566k0812R586K0277Q481J8519L749j4273j5181
$$ 14009 34555 10046 -11947 -2178 -12744 -33556 -23970 -3693 4788 23307 27056 12783 -2398
6927b398j370m70k3007J5089J4512j3845J1000k049k4057k2510Q738J3683Q633
$$ -2398 -3768 -4238 -27245 -12156 2356 -11489 -489 -2538 -26595 -49105 -40367 -26684 -18051
6914a8051q182j8020L1537n31k2114J6874N143j5866p820j6637o727J5838K2004
$$ -18051 -26233 -44253 -12716 -13247 -35361 -18487 -13344 -29210 -37030 -53667 -60394 -44556 -22552
6901b2552j0683m293j6881j9340J6316l998L0966K1972o789k7902J3284R735j2111
$$ -22552 -33235 -37528 -54409 -73749 -57433 -61431 -30465 -8493 -15282 -43184 -29900 -20165 -32276
6888c2276K0513M9462q128j3077k469J909l1262j8884L95J4325J1898k052L704
$$ -32276 -11763 37699 29571 16494 14025 15934 -15328 -34212 -33817 -19492 -7594 -9646 -5942
6875e942L910j5069M654J827k725J7215O2153J9870k3597j7011k308n898n034
$$ -5942 -2032 -17101 -12447 -10620 -13345 3870 66023 85893 62296 45285 42977 37079 32045
6862C2045j2650j1113k2134j2492j897K7197J8441J2391O633k076j2925q761N89
$$ 32045 19395 8282 -13852 -26344 -28241 -1044 17397 29788 36421 34345 21420 12659 13248
6849A3248m03n614j1366k6170p482O360K353Q38R858P811K0278J4082j3187k3096
$$ 13248 12845 7231 -4135 -30305 -37787 -31427 -29074 -28236 -18378 -10567 9711 23793 10606 -12490
6835a2490K0354o169o022J2211j9204R123k1539l622K315r076K952K0447k0571
$$ -12490 7864 1695 -4327 7884 -11320 -2197 -23736 -27358 -25043 -34119 -31167 -10720 -31291
6822c1291J3699L499q33K0883J4243j0289O095J501k0322J1210J4338L672m1122
$$ -31291 -17592 -14093 -14926 5957 20200 9911 16006 17507 -2815 8395 22733 26405 -14717
6809a4717l0634R593K0840q869j8156r105L0854L2559q68O035J7169L612k7461
$$ -14717 -45351 -35758 -14918 -23787 -41943 -51048 -20194 12365 11497 17532 34701 38313 10852
6796A0852m2071l27J2169J2324k2321N724O299K0015J0271k2339j5418K7574j0346
$$ 10852 -31219 -31546 -19377 -7053 -29374 -23650 -17351 2664 12935 -9404 -24822 2752 -7594
6783g594k7668K664J6687P579J3530K2440m1146j0473J9451r165k3695J5975L4223
$$ -7594 -35262 -32598 -15911 -8332 5198 27638 -13508 -23981 -4530 -13695 -37390 -21415 12808
6770A2808o882M91R719J5348j71l5967j8271n863L8499J5235j0397k3901p248
$$ 12808 5926 6417 16136 31484 31313 -4654 -22925 -28788 9711 24946 14549 -9352 -16600
6757a6600j2224j7347K5962J7961j6055j7555O167O745J2191l032k7305k291J5543
$$ -16600 -28824 -46171 -20209 -2248 -18303 -35858 -29691 -22946 -10755 -13787 -41092 -43383 -27840
6744b7840K1062j5429J1144M706l052J7009J1961J884r325n58J2548k7720J9538
$$ -27840 -6778 -22207 -11063 -6357 -9409 7600 19561 21445 12120 11562 24110 -3610 15928
6731A5928J049q972K0866K375k1955r724K9289L4896o652k7776P988K0084L2970
$$ 15928 16977 8005 28871 31246 9291 -433 28856 63752 57100 29324 37312 57396 90366
6718I0366o153j0591m85O773j0950k6588m561M264l6211k9058j0383n417J8759
$$ 90366 84213 73622 73137 79910 68960 42372 37811 42075 5864 -23194 -33577 -38994 -20235
6705b0235L2206J5531j3365j1492l528j2790j3293l055p171L6440N560p790l492
$$ -20235 11971 27502 14137 2645 -883 -13673 -26966 -30021 -37192 -752 4808 -2982 -6474
6692f474M568J741P711p62q584k5248p168j6309J347L4224j7672M124J744M279
$$ -6474 -1906 -165 7546 6784 -1800 -27048 -34216 -50525 -49178 -14954 -32626 -28502 -26758 -22479
6678b2479K5324k909j8488k4242R701K4680j854J721j2399n912n136k815j7229
$$ -22479 2845 -64 -18552 -42794 -33093 -8413 -10267 -8546 -20945 -26857 -31993 -34808 -52037
6665e2037L262R265J1942P006O52j4470q051o647N744J0837K868Q68J8314j401
$$ -52037 -48775 -39510 -27568 -20562 -19910 -34380 -42431 -49078 -43334 -32497 -29629 -28761 -10447 -11848
6651a1848P148L802L683m773k0498m126k02J8712K192J6827n321k6142j9700k8889
$$ -11848 -4700 -898 2785 -1988 -22486 -26612 -26814 -8102 -5910 10917 5596 -20546 -40246 -69135
6637f9135J6497K1099K9168m083j0723p197q262O923K111J0168R574J1727J5990
$$ -69135 -52638 -31539 -2371 -6454 -17177 -24374 -32636 -25713 -23602 -13434 -3860 7867 23857
6624B3857K940j8416k4161N067J9294L915J451o560l1470p108K856K4975L9674
$$ 23857 26797 8381 -15780 -10713 8581 12496 13947 7387 -24083 -31191 -28335 -3360 36314
6611C6314p290K091n422k8464l854M313j1890j8542M038L981P25q181Q599K6502
$$ 36314 29024 31115 25693 -2771 -6625 -2312 -14202 -32744 -28706 -24725 -24000 -32181 -23582 2920
6597B920J3768K224k2498m937j745o044K1577j861j7892l740k530j853K4329L53
$$ 2920 16688 18912 -3586 -8523 -10268 -16312 5265 3404 -14488 -18228 -20758 -22611 1718 2071
6583B071p722J3748R951N614n133r505q849k533p716N600L2626J3395j9895l1516
$$ 2071 -5651 8097 18048 23662 18529 9024 175 -2358 -10074 -4474 28152 41547 21652 -9864
6569i864j280K9565r819k1595Q43r030j3779P216L91n407J78R623J5665L723J530
$$ -9864 -11144 18421 8602 -12993 -12150 -21180 -34959 -27743 -27352 -32759 -32581 -22958 -7293 -3570 -2040
6554b040p25P410l05J99p424J0162r489k6818Q319J3971k0201k3735J0787L9935
$$ -2040 -2765 4645 4340 4539 -2885 7277 -2212 -29030 -20711 -6740 -26941 -50676 -39889 46
6540D6K2625P041p420k306r569k1497M451J323k1124l138j27j463N420M71J7302
$$ 46 22671 29712 22292 19986 10417 -11080 -6629 -5306 -26430 -29568 -29695 -31158 -25738 -25267 -7965
6525g965l260k0330R416P506L1840P151l1108k4813l167K149N330Q543j5122L52
$$ -7965 -11225 -31555 -22139 -14633 17207 24358 -6750 -31563 -34730 -32581 -27251 -18708 -33830 -33478
6511c3478J1197N013j7507M349Q330j2713o986J6552o587O187Q334J2758P271
$$ -33478 -22281 -17268 -34775 -30426 -22096 -34809 -41795 -25243 -31830 -25643 -17309 -4551 2720
6498B720q210k7257k13J3959J3508J4986k8712k0738J3947Q810j768j1043j1227
$$ 2720 -5490 -32747 -32960 -19001 -5493 9493 -19219 -39957 -26010 -17200 -18968 -30011 -41238
6485d1238j0339q003k845r0J80O133K3149m172J1230J0132O647o705J463J1478
$$ -41238 -51577 -59580 -62425 -62515 -62335 -56202 -33053 -37225 -25995 -15863 -9216 -15921 -14458 -2980
6471b980k131n127j7419q467J6424q058P957L2305j8834j2572j0044j7991l907
$$ -2980 -5111 -10238 -27657 -36124 -19700 -27758 -19801 12504 -6330 -18902 -28946 -46937 -50844
6458e0844J1405n759J2336J0722J3268K8460J4268k5966l8656J1927N383M048
$$ -50844 -39439 -45198 -32862 -22140 -8872 19588 33856 7890 -30766 -18839 -13456 -9408
6446i408m864K1872J4433j3414j0390K335J2831J1652J0146j4120K824K4261j2984
$$ -9408 -14272 7600 22033 8619 -1771 564 13395 25047 35193 21073 23897 48158 35174
6433C5174L097J671J0695J3J5406j0943l4535j3684j4921p221k0669J4876J3411
$$ 35174 38271 39942 50637 50650 66056 55113 20578 6894 -8027 -15248 -35917 -21041 -7630
6420g630K0257O422p377m365j5606j5030o918j8868o288J6597K8216j0631l035
$$ -7630 12627 19049 11672 7307 -8299 -23329 -30247 -49115 -55403 -38806 -10590 -21221 -24256
6407b4256j3706q896Q905O435j2651j4176J0867o881p19J8922K0177K6443J5012
$$ -24256 -37962 -46858 -37953 -31518 -44169 -58345 -47478 -54359 -55078 -36156 -15979 10464 25476
6394B5476k2772k8212k727J6111J845j2949J1283J0488j2901r029q200J1380P154
$$ 25476 2704 -25508 -28235 -12124 -10279 -23228 -11945 -1457 -14358 -23387 -31587 -20207 -13053
6381a3053j6796k857J5754K6051J2190J5992j2470j4057j8462j9612r679j6281
$$ -13053 -29849 -32706 -16952 9099 21289 37281 24811 10754 -7708 -27320 -36999 -53280
6369e3280P576L0735K5080K1386r403l7564j5701K799j3902J2261K4297j8926
$$ -53280 -45704 -14969 10111 31497 22094 -15470 -31171 -28372 -42274 -30013 -5716 -24642
6357b4642j4805K2404K8211k679r453j4461m382R126p642q638J0930J3002k98
$$ -24642 -39447 -17043 11168 8489 -964 -15425 -19807 -10681 -18323 -26961 -16031 -3029 -3327
6344c327J6523j477l873j7493R68j5784m544n202l187J1864j3483n476j250O559
$$ -3327 13196 11719 7846 -9647 -8679 -24463 -29007 -34209 -37396 -25532 -39015 -44491 -45741 -39182
6330c9182q965L758l008k5114M423J908J8054J2597J7970L279j7286j7199L7202
$$ -39182 -48147 -44389 -47397 -72511 -68088 -66180 -48126 -35529 -17559 -14280 -31566 -48765 -11563
6317a1563L467j8820j0776P160p95l2818L297K3634K4244K9712L969l7264j8140
$$ -11563 -8096 -26916 -37692 -30532 -31327 -64145 -60848 -37214 -12970 16742 20711 -16553 -34693
6304c4693r25k580J0858j1866Q922K8432j101n371J0199l637l271r222j3502l411
$$ -34693 -35618 -38198 -27340 -39206 -30284 -1852 -2953 -8324 1875 -1762 -5033 -14255 -27757 -31168
6290c1168r10M234l563o36N680Q033Q788o83k9536N829P269K5891M716N03j4624
$$ -31168 -32078 -27844 -31407 -32043 -26363 -18330 -9542 -10225 -39761 -33932 -26663 -772 3944 4447 -10177
6275a0177j9618p04J2524J0372O25J2067k0301j6367j815j0510J6521K5167J4263
$$ -10177 -29795 -30499 -17975 -7603 -6978 5089 -15212 -31579 -33394 -43904 -27383 -2216 12047
6262A2047j5927j9675K5868L207j9586j701j1087O201n078j3472p739Q472J3524
$$ 12047 -3880 -23555 2313 5520 -14066 -15767 -26854 -20653 -25731 -39203 -46942 -38470 -24946
6249b4946j6961p789k701J4165J5903j993K488n929K0134M17k6093K665J2968
$$ -24946 -41907 -49696 -52397 -38232 -22329 -24322 -21834 -27763 -7629 -7212 -33305 -30640 -17672
6236a7672q180L08J4444p02k874N711J5066l941k2952K223m25J766P957n29k1342
$$ -17672 -25852 -25544 -11100 -11802 -14676 -8965 6101 2160 -20792 -18569 -18994 -17228 -9271 -9800 -31142
6221c1142p231J7843J8555k477O135l4614r064M0289N654K5829R328p94l6604
$$ -31142 -38373 -20530 -1975 -4452 1683 -32931 -41995 -1706 3948 29777 39105 38311 1707
6208A707N888n145R51j7052j6675j7246r567J7158J4631J5918k441j0737O184
$$ 1707 7595 2450 3401 -13651 -30326 -47572 -57139 -39981 -25350 -9432 -11873 -22610 -16426
6195a6426J8774L2360J7910j8160q661j6048j7638J7979K1500r031k0320n717
$$ -16426 2348 34708 52618 34458 25797 9749 -7889 10090 31590 22559 2239 -3478
6183c478j6604J9621J5876J249K230j611N842j51k0783J17l104J9941R790R342
$$ -3478 -20082 -461 15415 16664 18894 17283 23125 22974 2191 2308 -796 19145 28935 38277
6169C8277n90r683m1949p337J6451J3396J9325P408R472L938M400k1581J0074
$$ 38277 37687 28004 -13945 -21282 -4831 8565 27890 35298 44770 48708 53108 31527 41601
6156D1601J4707M599j0488k8693K159k3174J7987q024m307k434o910L597J572
$$ 41601 56308 60907 50419 21726 23885 711 18698 10674 6367 3933 -2977 620 2192
6143B192J3639j095m3979O249L4612r104j6830J0236j4500o293r173L556r186
$$ 2192 15831 14736 -29243 -22994 11618 2514 -14316 -4080 -18580 -24873 -34046 -30490 -39676
6130c9676J9064R669j359L0552Q828k1001o908J7301r344j8544J1641M212R736
$$ -39676 -20612 -10943 -12302 18250 27078 6077 -831 16470 7126 -11418 223 4435 14171
6117A4171j1772Q562P465k5425j9477J5996j2720J6620J165q047J1089K415j1738
$$ 14171 2399 10961 18426 -6999 -26476 -10480 -23200 -6580 -5415 -13462 -2373 42 -11696
6104a1696j2031j1838q540k213J2767M464J7586J7257j6245j3111R081L4258j9137
$$ -11696 -23727 -35565 -44105 -46318 -33551 -29087 -11501 5756 -10489 -23600 -14519 19739 602
6091F02l1420J954J2944J2565j7459j7139J1789J0073q584j7596j4897j0270K1021
$$ 602 -30818 -28864 -15920 -3355 -20814 -37953 -26164 -16091 -24675 -42271 -57168 -67438 -46417
6078d6417J4918J9244M097M956o789j1115r1J1918j1267j3764J8999K1395J0140
$$ -46417 -31499 -12255 -8158 -3202 -9991 -21106 -21197 -9279 -20546 -34310 -15311 6084 16224
6065A6224N520k3400j0119K0844q252r546j8295J6024M658O05L429J5935o595
$$ 16224 21744 -1656 -11775 9069 817 -8729 -27024 -11000 -6342 -5737 -2308 13627 7032
6052G032l1452K097l216j32J1895j5118j9195K8987J6175J3381K4769P257j3867
$$ 7032 -24420 -22323 -25539 -25671 -13776 -28894 -48089 -19102 -2927 10454 35223 42480 28613
6039B8613Q592K2800n965m4129j0837J3055N044j3763k0676K242j0381K198R862
$$ 28613 37205 60005 54040 9911 -926 12129 17173 3410 -17266 -15024 -25405 -23207 -13345
6026a3345J0284Q821m672r282K564J4596k3003j1284r42j2945P365K0165M791
$$ -13345 -3061 5760 1088 -8194 -5630 8966 -14037 -25321 -26263 -39208 -31843 -11678 -6887
6013f887n369J6934m038j7732m623J7970J0525Q50j2466k4148l5559l866M740
$$ -6887 -12256 4678 640 -17092 -21715 -3745 6780 7630 -4836 -28984 -64543 -68409 -63669
6000f3669K3871J9064K5244R257j1512P56J1016J634n749k1916p160j2617l373
$$ -63669 -39798 -20734 4510 13767 2255 3011 14027 15661 9912 -12004 -19164 -31781 -35154
5987c5154K1627J4767P42J2335j4588r081R49n659j3957k2636m089J4640J3098
$$ -35154 -13527 1240 1982 14317 -271 -9352 -8403 -14062 -28019 -50655 -54744 -40104 -27006
5974b7006Q937J1199j504N900j9980L738K7466J2524j1371j1130m467R457K2082
$$ -27006 -18069 -6870 -8374 -2474 -22454 -18716 8750 21274 9903 -1227 -5694 3763 25845
5961B5845M084R280m874o875m866o681j9316k792J2359O453j3065J6654j6721
$$ 25845 29929 39209 34335 27460 22594 15913 -3403 -6195 6164 12617 -448 16206 -515
5948e15q502J739r314J4556J6804M54k1819j938L1066J5394l798j5712j3817J6579
$$ -515 -9017 -7278 -16592 -2036 14768 15222 -6597 -8535 22531 37925 34127 18415 4598 21177
5934B1177l269J2868q93k517k2384k0047Q882J1432j783M245j3759k3579j7180
$$ 21177 17908 30776 29883 27366 4982 -15065 -6183 5249 3466 7711 -6048 -29627 -46807
5921d6807J3703K2349N158n228j7786P402L0838J5992j3226j1448J5713l5244
$$ -46807 -33104 -10755 -5597 -10825 -28611 -21209 9629 25621 12395 947 16660 -18584
5909a8584j0847K1445j3284q186m555k632N757J4437O564J4379m707q698k798
$$ -18584 -29431 -7986 -21270 -29456 -34011 -36643 -30886 -16449 -9885 4494 -213 -8911 -11709
5896a1709n733O27j3012j1533q84k040M0818j075k53k066P95J7749P150k7410
$$ -11709 -17442 -16815 -29827 -41360 -42244 -44284 -3466 -4541 -4794 -6860 -6065 11684 18834 -8576
5882h576r190j6016O386j4258j4235J7981M1073o281R585K1428j4057Q50m227
$$ -8576 -17766 -33782 -27396 -41654 -55889 -37908 3165 -3116 6469 27897 13840 14690 10463
5869A0463j3399m360m809J0535o376j3194j793j671m798J6117p581L817J0951
$$ 10463 -2936 -7296 -12105 -1570 -7946 -21140 -22933 -24604 -29402 -13285 -20866 -17049 -6098
5856f098N063J4158J8818k8243q746k880n235j2816j0863L35L1521O335Q182p408
$$ -6098 -1035 13123 31941 3698 -5048 -7928 -13163 -25979 -36842 -36507 -4986 1349 9531 2123
5842B123n605J0574j209k7240J611N910j7045j7484J1773n95P796J6951J2235
$$ 2123 -3482 7092 5883 -21357 -19746 -13836 -30881 -48365 -36592 -37187 -29391 -12440 -205
5829b05R092j3929r882O871J2458K488o404J1197k4192m0063k9368Q222K7663
$$ -205 8887 -5042 -14924 -8053 4405 6893 489 11686 -12506 -52569 -81937 -73715 -46052
5816d6052Q176J8929J9942J7264K1601n254k8380j1423M070J470k8427J2062J2429
$$ -46052 -37876 -18947 995 18259 39860 34606 6226 -5197 -1127 343 -28084 -16022 -3593
5803c593J2655K148j2815k0222j581J818K8868R864p240r305j1847r714j7041
$$ -3593 9062 11210 -1605 -21827 -23408 -21590 7278 17142 9902 597 -11250 -20964 -38005
5790c8005J8297K777R257R333j4595L911m428J2510k509j0933N465Q859n419J884
$$ -38005 -19708 -16931 -7674 1659 -12936 -9025 -13453 -943 -3452 -14385 -8920 -61 -5480 -3596
5776c596L387j9983Q212p635R670N314j2646j7063P23p001q825J9558L2001J5455
$$ -3596 -209 -20192 -11980 -19615 -9945 -4631 -17277 -34340 -33617 -40618 -49443 -29885 2116 17571
5762A7571j2345q161P237J5657o118j4094L011N343k200k8147l1141o547K2823
$$ 17571 5226 -2935 4302 19959 13841 -253 2758 8101 5901 -22246 -53387 -59934 -37111
5749c7111O567J1372r381j1887J4457N1516j6795k521J032j7417O654j0389k3370
$$ -37111 -30544 -19172 -28553 -40440 -25983 25533 8738 6217 7249 -10168 -3514 -13903 -37273
5736c7273J1396P171P050j561q720Q929j6402k00K1690K9541J0781k3195k9873
$$ -37273 -25877 -18706 -11656 -13217 -21937 -13008 -29410 -29610 -7920 21621 32402 9207 -20666
5723b0666L766L5002j0571p247K9246j7872k649p710M570m120p483j1030p460
$$ -20666 -16900 18102 7531 284 29530 11658 9009 1299 5869 1749 -5734 -16764 -24224
5710b4224k264k5563j3247K0066M3057J6210M05k0561j5713k6011r80J9461J5005
$$ -24224 -26488 -52051 -65298 -45232 -2175 14035 14440 -6121 -21834 -47845 -48825 -29364 -14359
5697a4359K06J0166j400r904L98K4954J7828j8002j2394N056M345J2542K676m0023
$$ -14359 -14153 -3987 -5387 -15291 -14893 10061 27889 9887 -2507 2549 6894 19436 22112 -17911
5683a7911j3468K7233J8814L583j8806j2341j3771Q404j3192P211N184q071j395
$$ -17911 -31379 -4146 14668 18251 -555 -12896 -26667 -18263 -31455 -24244 -19060 -27131 -28526
5670b8526J9220n59j7705N444K4902K4588r425j7996k194P594K8566k4799l842
$$ -28526 -9306 -9865 -27570 -22126 2776 27364 17939 -57 -2251 5343 33909 9110 5268
5657E268K031j767j4832k378p219l029l2541j820O85K1280O994o672J0779P586
$$ 5268 7299 5532 -9300 -11678 -18897 -21926 -54467 -56287 -55602 -34322 -27328 -34000 -23221 -15635
5643a5635J6683j8331l4765p907L8605J7377L61M454j5214N687j325j1486p455
$$ -15635 1048 -17283 -52048 -59955 -21350 -3973 -3612 842 -14372 -8685 -10010 -21496 -28951
5630b8951J1863M161p271k470P724k0944o825Q897Q772L2901J2369r93j0265J56
$$ -28951 -17088 -12927 -20198 -22668 -14944 -35888 -42713 -33816 -25044 7857 20226 19233 8968 9124
5616I124k6209J286J9977K3349j7784j5207j4382J9082M841l0430j2868p505J3317
$$ 9124 -17085 -15799 4178 27527 9743 -5464 -19846 -764 4077 -26353 -39221 -46726 -33409
5603c3409J9293K230j4775M80L4963j5262l3001J1362L7247j1752j8170j5379
$$ -33409 -14116 -11886 -26661 -26181 8782 -6480 -39481 -28119 9128 -2624 -20794 -36173
5591c6173k0425O813K5603P339J3463n179j6628j8442M223j6185O104J949j3192
$$ -36173 -56598 -49785 -24182 -16843 -3380 -8559 -25187 -43629 -39406 -55591 -49487 -47538 -60730
5578f0730Q661K4573K5908J128j924j1960j7465K1509j4362q720J2682J9944O626
$$ -60730 -52069 -27496 -1588 -460 -2384 -14344 -31809 -10300 -24662 -33382 -20700 -756 5870
5565E870O835j175J6400m0568j0520l0162j1971J7401P503P447J7725l989l9435
$$ 5870 12705 11530 27930 -12638 -23158 -53320 -65291 -47890 -40387 -32940 -15215 -19204 -58639
5552e8639k6044K1414L5447M578J3958j42p115j8063L7615q383l3105K098J3925
$$ -58639 -84683 -63269 -27822 -23244 -9286 -9428 -16543 -34606 3009 -5374 -38479 -36381 -22456
5539b2456R707l076l8690j2386J4707J3878K0949k3501K032J0788J3912J8740
$$ -22456 -12749 -15825 -54515 -66901 -52194 -38316 -17367 -40868 -38836 -28048 -14136 4604
5527D604j63l4496J1728P883o131P861j0050r658L0408K6535J1793j6089J3043
$$ 4604 4441 -30055 -18327 -10444 -16575 -8714 -18764 -28422 1986 28521 40314 24225 37268
5514C7268m432J3693r560m0176j3704J2246j2927K4235J2336k0405j7753l2324
$$ 37268 32836 46529 36969 -3207 -16911 -4665 -17592 6643 18979 -1426 -19179 -51503
5502e1503j337J0913L5823L5825L927L945J3412O356m931J34j7049n99q703J1973
$$ -51503 -52840 -41927 -6104 29721 33648 37593 51005 57361 52430 52564 35515 34916 26213 38186
5488C8186R718l474k0452j0677J3699k0322k2312R807j5500j6573J7524K8727
$$ 38186 47904 44430 23978 13301 27000 6678 -15634 -5827 -21327 -37900 -20376 8351
5476H351K3144O156k487p825m686K088k7264j3323m279j2872M576j818O778o81
$$ 8351 31495 37651 35164 27339 22653 24741 -2523 -15846 -20125 -32997 -28421 -30239 -23461 -24142
5462b4142J4596K5297q09P397J771o398J0472j1440j5379J5226K2335l3713j5364
$$ -24142 -9546 15751 14942 22339 24110 17712 28184 16744 1365 16591 38926 5213 -10151
5449a0151J2068O026r328j3035J3107J5800n999j2147l301j0464K4754J2420q152
$$ -10151 1917 7943 -1385 -14420 -1313 14487 8488 -3659 -6960 -17424 7330 19750 11598
5436A1598j2093J801j1514R76J0556r554L5306j0265k1215r146Q195j020j5187
$$ 11598 -495 1306 -10208 -9232 1324 -8230 27076 16811 -4404 -13550 -5355 -6375 -21562
5423b1562j4591j5M288J9800j2167k071J5068J6686M544J3335R633j0393M737
$$ -21562 -36153 -36168 -31880 -12080 -24247 -26318 -11250 5436 9980 23315 32948 22555 27292
5410B7292N931q797L760j2977l0662j1400J5568N531j7956K2023K101l441k4787
$$ 27292 33223 24426 28186 15209 -15453 -26853 -11285 -5754 -23710 -1687 414 -3027 -27814
5397b7814J6886K0384o593J16P7L196j0089O524M044r940o678j133o298J2855
$$ -27814 -10928 9456 2863 2979 3056 6252 -3837 2687 6731 -3209 -9887 -11020 -17318 -4463
5383d463N321j3040L536O870n055M898J0050j1062k9676J2050K23K453J5195p542
$$ -4463 858 -12182 -8646 -1776 -6831 -1933 8117 -2945 -32621 -20571 -20348 -17895 -2700 -10242
5369a0242m890K1469o379j2418l1898L767R154P013M3J2530J7737J0115K121k6614
$$ -10242 -15132 6337 -42 -12460 -44358 -40591 -31437 -24424 -24381 -11851 5886 16001 18122 -8492
5355h492j3947M998J7749k1138j410K5888J5929J9748n547l0825m6956j0279J83
$$ -8492 -22439 -17441 308 -20830 -22240 3648 19577 39325 33778 2953 -44003 -54282 -54099
5342e4099L7488K4000J3791J6899o981l6498K890p615o114o154n783j430J6678
$$ -54099 -16611 7389 21180 38079 31098 -5400 -2510 -10125 -16239 -22393 -28176 -29606 -12928
5329a2928j186l406n371j9534J6415J1340n60k4749K2745M0057j8848j5474j4543
$$ -12928 -14114 -17520 -22891 -42425 -26010 -14670 -15230 -39979 -17234 22823 3975 -11499 -26042
5316b6042R636J3206K3822J8910L359j0812N172l7283k0404l115L1870j1789k9497
$$ -26042 -16406 -3200 20622 39532 42891 32079 37251 -32 -20436 -23551 8319 -3470 -32967
5303c2967J9420J0051j6483K157j207j433J0136K6065M940j2875M596j8925j9231
$$ -32967 -13547 -3496 -19979 -17822 -19029 -20462 -10326 15739 20679 7804 12400 -6525 -25756
5290b5756j1507J6508K2832K3726r655j4789j9645L003O941K2789J3249k6135
$$ -25756 -37263 -20755 2077 25803 16148 1359 -18286 -15283 -8342 14447 27696 1561
5278A561r418L710J0203k1537j679J4816l770r06L4168m445l4075n129K8909L1433
$$ 1561 -7857 -4147 6056 -15481 -17160 -2344 -6114 -7020 27148 22703 -11372 -16501 12408 43841
5264D3841j9735k9132M180K9692k2334j5279m308Q074K5997K0189j0832J599m8
$$ 43841 24106 -5026 -846 28846 6512 -8767 -13075 -5001 20996 41185 30353 31952 31904
5251C1904P361l309j1812r884K400n817J4488J1518J6131k426j7125L723j426
$$ 31904 39265 35956 24144 14260 16660 10843 25331 36849 52980 50554 33429 37152 35726
5238C5726k192r662K112o317J0319m793l94L1305p159l8819l8585R131J4941M329
$$ 35726 33534 23872 25984 19667 29986 25193 24799 56104 48945 10126 -28459 -19328 -4387 -58
5224e8L1201J9423j4011L28j402k0599j6813r746N562j4066r322J0300L4531J711
$$ -58 31143 50566 36555 36883 35481 14882 -1931 -11677 -6115 -20181 -29503 -19203 15328 17039
5210A7039k8438M02K6051J0154R062p087k0258o084J3596R709o283q625j000P808
$$ 17039 -11399 -10997 15054 25208 34270 27183 6925 841 14437 24146 17863 9238 8238 16046
5196A6046k990J907k2868k9921l6832o815J0667Q989Q039K7880K4041Q351l814
$$ 16046 13056 14963 -7905 -37826 -74658 -81473 -70806 -61817 -53778 -25898 -1857 6494 2680
5183B680j767j2951J1258Q734k6596j7770J8408J2566q230l664J621N37j943p018
$$ 2680 913 -12038 -780 7954 -18642 -36412 -18004 -5438 -13668 -17332 -15711 -15174 -17117 -24135
5169b4135J876l51P824J8065n328j1703j4485J6277R607q519k6524j0700J0512
$$ -24135 -22259 -22610 -14786 3279 -2049 -13752 -28237 -11960 -2353 -10872 -37396 -48096 -37584
5156c7584L1061O344p575j6508O65K3527J1552j2498j9451n024K929p541j3575
$$ -37584 -6523 -179 -7754 -24262 -23597 -70 11482 -1016 -20467 -25491 -22562 -30103 -43678
5143d3678o667J5349J2368j2098P248q175k6514k320p057K2230K8361K6289J6158
$$ -43678 -50345 -34996 -22628 -34726 -27478 -35653 -62167 -64487 -71544 -49314 -20953 5336 21494
5130B1494Q094l7713k1813K061j081L2829K4045k6075q649O737j8583N980L199
$$ 21494 29588 -8125 -29938 -27877 -28958 3871 27916 1841 -6808 -71 -18654 -12674 -9475
5117i475J6911m573J683M419K6420J8893j0891j0211l7821k7349r383j1131M794
$$ -9475 7436 2863 4546 8965 35385 54278 43387 33176 -4645 -31994 -41377 -52508 -47714
5104d7714K4890L5857j7190j0342l466q330j1676M615q026J0608l664K5619L4880
$$ -47714 -22824 13033 -4157 -14499 -17965 -26295 -37971 -33356 -41382 -30774 -34438 -8819 26061
5091B6061k189j8540J3122M0081l095j5892j300j8788j8514l8336l4093J3101
$$ 26061 23872 5332 18454 58535 55440 39548 38248 19460 946 -37390 -71483 -58382
5079e8382L1436J7579K2224k2980q588k152J4296J8272r44p636j2910n598j0786
$$ -58382 -26946 -9367 12857 -10123 -18711 -20863 -6567 11705 10761 3125 -9785 -15383 -26169
5066b6169k0314j086Q070j1449J4026M3109R97m318r460j0504r312k1266j7994
$$ -26169 -46483 -47569 -39499 -50948 -36922 6187 7184 2866 -6594 -17098 -26410 -47676 -65670
5053f5670J4813J2202P705L0421J7402J8646J3708j1420k2492l4979R498o674
$$ -65670 -50857 -38655 -30950 -529 16873 35519 49227 37807 15315 -19664 -10166 -16840
5041a6840N813l871L813J7186m992j389l3803o718L2297M5275K5089k4523j3894
$$ -16840 -11027 -14898 -11085 6101 1109 -280 -34083 -40801 -8504 36771 61860 37337 23443
5028B3443j2236J2608J0966j8541o830j3150R952j6919j7397m9J070L945K761
$$ 23443 11207 23815 34781 16240 9410 -3740 6212 -10707 -28104 -28153 -27083 -23138 -20377
5015b0377K1315J9898k6415l4129R296J8834r597J0442m660k6514J4976P692n785
$$ -20377 938 20836 -5579 -39708 -30412 -11578 -21175 -10733 -15393 -41907 -26931 -19239 -25024
5002b5024k57L414m25m094n036k7120m405L6105K0687l7059J4127R908J7542L061
$$ -25024 -25281 -21867 -22292 -26386 -31422 -58542 -62947 -26842 -6155 -43214 -29087 -19179 -1637 1424
4988A424j19K2169J0123q903O298o283K6p88l528m956L75k0712k5827j903N889
$$ 1424 1305 23474 33597 24694 30992 24709 24735 23947 20419 15463 15838 -4874 -30701 -32604 -26715
4973b6715K4630l456k2623j6142J14J9391L1177l277J6676J3353j4784j2667M213
$$ -26715 -2085 -5541 -28164 -44306 -44192 -24801 6376 3099 19775 33128 18344 5677 9890
4960I890j8977J2275J769k2200j5055J4578N466J5881M469N644j0064j62J6657
$$ 9890 -9087 3188 4957 -17243 -32298 -17720 -12254 3627 8096 13740 3676 3514 20171
4947B0171j300k6083m260R73l407p48o934K0656L0356K287m302P417j0163K004
$$ 20171 18871 -7212 -11472 -10499 -13906 -14654 -21588 -932 29424 31711 27409 34826 24663 26667
4933B6667p858j5511r236k8340l2727k2933R467M9479L1393L281m0126N777J2350
$$ 26667 18809 3298 -5938 -34278 -67005 -89938 -80471 -30992 401 3682 -36444 -30667 -18317
4920a8317k416L007Q98k643J6653M2253l974j9830p465k1222j1791K9577L889
$$ -18317 -20733 -17726 -16828 -19471 -2818 39435 35461 15631 8166 -13056 -24847 4730 8619
4907H619K3463k075J1264M171J1039m105l6253k4089O402L456n672m23Q145L683
$$ 8619 32082 30007 41271 45442 56481 52376 16123 -7966 -1564 1892 -3780 -4203 3942 7625
4893G625j315k1514P587L797M90q86j1354o163J5961j3305j952j0257J6743K3557
$$ 7625 6310 -15204 -7617 -3820 -3330 -4216 -15570 -21733 -5772 -19077 -21029 -31286 -14543 9014
4879I014o27j4150Q836L3112j6256j9551j4886L724n688M232J9298n733k740O461
$$ 9014 8387 -5763 3073 36185 19929 378 -14508 -10784 -16472 -12240 7058 1325 -1415 5046
4865E046R025P09O410m398K221l5238J2384J941k1149k9504k7979J8485M2568
$$ 5046 14071 14780 21190 16792 19013 -16225 -3841 -1900 -23049 -52553 -80532 -62047 -19479
4852a9479J7730L7P442J2077j5544P78M450j1694j4165K343K0827J2453J727m050
$$ -19479 -1749 -1712 5730 17807 2263 3041 7491 -4203 -18368 -16025 4802 17255 18982 14932
4838A4932j07l281K0687l2925k5543m377j0897J8374J6318L095M948j9113K1792
$$ 14932 14825 11544 32231 -694 -26237 -30614 -41511 -23137 -6819 -3724 1224 -17889 3903
4825C903j759k4528k3011J421M600o228j4112K1724M0350o947k000P157L342M772
$$ 3903 2144 -22384 -45395 -43974 -39374 -45602 -59714 -37990 2360 -4587 -6587 570 3912 8684
4811H684k3546j5801J4413M461Q603J7059J6259K407n78r752l035j1396K4178
$$ 8684 -14862 -30663 -16250 -11789 -3186 13873 30132 32539 31961 22209 19174 7778 31956
4798C1956k3522k1301J2270p83J038M292j0449K628P080R408r847k3937J286R503
$$ 31956 8434 -12867 -597 -1380 -342 3950 -6499 -3871 3209 12617 2770 -21167 -19881 -10378
4784a0378j0030j1021o146j0775n69J3696K4810P430R169K9026K217k6791j9450
$$ -10378 -20408 -31429 -37575 -48350 -48919 -35223 -10413 -2983 6186 35212 37429 10638 -8812
4771h812M284N258j0446l0043j5040o799J1903K1460J5928K0995R118k474L0133
$$ -8812 -4528 730 -9716 -39759 -54799 -61598 -49695 -28235 -12307 8688 17806 15332 45465
4758D5465m735k9335k8147j6409J745K1426j43J1019r717K5141L4403N17l4698
$$ 45465 40730 11395 -16752 -33161 -31416 -9990 -10133 886 -8831 16310 50713 51230 16532
4745A6532k2996j818j055q76j68p433P7L2240r437J4088L253j7765o431j1333
$$ 16532 -6464 -8282 -9337 -10213 -10381 -17814 -17737 14503 5066 19154 22407 4642 -1789 -13122
4731a3122q148m2r564J289J4758J4814J5830o859R29J1884j6090o743J3906j3716
$$ -13122 -21270 -21312 -30876 -29587 -14829 -15 15815 8956 9885 21769 5679 -1064 12842 -874
4717h74P161j2491k6152K3177J6923j2848k0936Q643j5914k4899l515L5574J6921
$$ -874 6287 -6204 -32356 -9179 7744 -5104 -26040 -17397 -33311 -58210 -61725 -26151 -9230
4704i230j4085k3164q164L1049J739j3662R731K4257J8233l914k3299k7467N032
$$ -9230 -23315 -46479 -54643 -23594 -21855 -35517 -25786 -1529 16704 12790 -10509 -37976 -32944
4691c2944L4618K1963R849l0477r721J9736q043j4384R606J2130k9929p076O068
$$ -32944 1674 23637 33486 3009 -6712 13024 4981 -9403 203 12333 -17596 -24672 -18604
4678a8604N623O142J0583j2035j7817J7811j8479j1897k2646l012L4975M6737
$$ -18604 -12981 -6839 3744 -8291 -26108 -8297 -26776 -38673 -61319 -64331 -29356 17381
4666A7381r891R707J0781j1563k0617o930J2974J8810j8781j5218L8L063k700
$$ 17381 7490 17197 27978 16415 -4202 -11132 1842 20652 1871 -13347 -13309 -10246 -12946
4653a2946K2072n463l307K8237m996l9339r61J6425L1432p164k5306j5837j5690
$$ -12946 9126 3663 356 28593 23597 -15742 -16703 -278 31154 23990 -1316 -17153 -32843
4640c2843j2787j5410k897J7713J1108R507q538j0706L6985K1844j779k5772l357
$$ -32843 -45630 -61040 -63937 -46224 -35116 -25609 -34147 -44853 -7868 13976 12197 -13575 -16932
4627a6932J0965N919J678p115J4427J8482n995K000j2778K223L2488J9423k3816
$$ -16932 -5967 -48 1630 -5485 8942 27424 21429 23429 10651 12874 45362 64785 40969
4614D0969k7582j6938q872O409J3606M127j8162P900J1941N354M746k1308m6261
$$ 40969 13387 -3551 -12423 -6014 7592 11719 -6443 1457 13398 18752 23498 2190 -44071
4601d4071L376J1433L7501P437k7270K567K844Q113J1719K0924j9466k5381k0031
$$ -44071 -40695 -29262 8239 15676 -11594 -9027 -6183 1930 13649 34573 15107 -10274 -30305
4588c0305j763N249J6530P96Q295J8270K3510j1002j2266Q81j9704j7911n092
$$ -30305 -32068 -26819 -10289 -9493 -1198 17072 40582 29580 17314 18195 -1509 -19420 -24512
4575b4512k226J8349J9564m486k888L5053M239k7722j3595J786Q406J9998j2528
$$ -24512 -26738 -8389 11175 6689 3801 38854 43093 15371 1776 3562 11968 31966 19438
4562A9438j4827k1072k3161l2015r654K1751J6282J3469J8049L1862r684j1615
$$ 19438 4611 -16461 -39622 -71637 -81291 -59540 -43258 -29789 -11740 20122 10438 -1177
4550a177j3958j584K9721J3479j5869N296J0957k3969J5370J0795R368m267P3
$$ -1177 -15135 -16719 13002 26481 10612 15908 26865 2896 18266 29061 38429 34162 34235
4537C4235j1818j0788j1248p14M2J7210k917L736K041K6341p362o136l5858j8299
$$ 34235 22417 11629 381 -333 -291 16919 14002 17738 19779 46120 38758 32622 -3236 -21535
4523b1535M733J780R555K1894M13r156J764J4002J6346K5395l8054k2919R297
$$ -21535 -16802 -15022 -5467 16427 16840 7684 9448 23450 39796 65191 27137 4218 13515
4510A3515J3057J3710k0668k9592o199P206K4889J6875r079j4424J3453j5509
$$ 13515 26572 40282 19614 -9978 -16177 -8971 15918 32793 23714 9290 22743 7234
4498G234Q5p21L5607M767k0572k4780p174N028K2840J0219k2992j3463j5584L902
$$ 7234 7319 6598 42205 46972 26400 1620 -5554 -526 22314 32533 9541 -3922 -19506 -15604
4484a5604o954j2722J9595k748j3344o636r633Q432K0104L4073K347q048m069
$$ -15604 -22558 -35280 -15685 -18433 -31777 -38413 -48046 -39614 -19510 14563 16910 8862 4793
4471D793M81M882r316j6149l1781j3949J5055L4263Q118j1362J6534K4911k4524
$$ 4793 5274 10156 840 -15309 -47090 -61039 -45984 -11721 -3603 -14965 1569 26480 1956
$$ [...]
##END NTUPLES=NMR SPECTRUM
##END=
