##TITLE=Analysis number 323291
Compound Code cc 38501
Project Code adrs
Chemist Name cardiff
##JCAMPDX= 6.0         $$ Bruker NMR JCAMP-DX V2.0
##DATA TYPE= NMR SPECTRUM
##DATA CLASS= NTUPLES
##ORIGIN= Bruker BioSpin GmbH
##OWNER= nmr
$$ XWIN-NMR		Version 3.5
$$ Mon Oct 23 09:30:23 2006 GMT Daylight Time (UT+1h)  MAYBRIDGE\nmr@NMR_250MHZ
##.OBSERVE FREQUENCY= 250.131544655141
##.OBSERVE NUCLEUS= ^1H
##.ACQUISITION MODE= SIMULTANEOUS (DQD)
##.ACQUISITION SCHEME= undefined
##.AVERAGES= 16
##.DIGITISER RES= 18
##SPECTROMETER/DATA SYSTEM= dpx250
##.PULSE SEQUENCE= zg30
##.SOLVENT NAME= DMSO
##.SHIFT REFERENCE= (INTERNAL, DMSO, 0, 16.522)
##AUDIT TRAIL= $$ (NUMBER, WHEN, WHO, WHERE, WHAT)
$$ ##TITLE= Audit trail, XWIN-NMR		Version 3.5
$$ ##JCAMPDX= 5.01
$$ ##ORIGIN= Bruker BioSpin GmbH
$$ ##OWNER= nmr
$$ C:\u/data/dgb/nmr/ADRS/1070/pdata/1/auditp.txt
$$ ##AUDIT TRAIL=  $$ (NUMBER, WHEN, WHO, WHERE, WHAT)
(   1,<2006-10-23 09:29:53.86 +100>,<MAYBRIDGE\nmr>,<NMR_250MHZ>,
      <created by zg, POWCHK disabled, PULCHK disabled
       configuration hash MD5:
       49 4B E0 1D 92 C2 6B 37 9F E6 65 BC 52 41 86 1D
       data hash MD5: 64K
       0D 1D C5 55 5F C8 84 1A AE BF DD B2 B1 DB A6 18>)
(   2,<2006-10-23 09:30:10.98 +100>,<MAYBRIDGE\nmr>,<NMR_250MHZ>,
      <Start of raw data processing
       ef LB = 0.3 FT_mod = 6 PKNL = 1 SI = 32K 
       data hash MD5: 32K
       3F 3A 37 FC 65 62 30 88 33 BF 93 2A 34 7C 43 9F>)
(   3,<2006-10-23 09:30:15.12 +100>,<MAYBRIDGE\nmr>,<NMR_250MHZ>,
      <apk 
       data hash MD5: 32K
       A7 2E 51 7A 5B 63 AD C9 FC 80 D4 F4 84 73 5B D9>)
(   4,<2006-10-23 09:30:15.95 +100>,<MAYBRIDGE\nmr>,<NMR_250MHZ>,
      <abs ABSG = 5 
       data hash MD5: 32K
       0F CD FC E6 52 94 21 F0 36 37 C7 5A 5E 1E B6 B5>)
$$ ##END=
$$ 
$$ hash MD5
$$ 5F 71 9F D4 7E 76 69 6E AD 02 18 4C 6F 0E 39 B5
##$RELAX= 
##$RELAX= 
##$RELAX= 
##$RELAX= 
##$RELAX= 
##$RELAX= 
##$RELAX= 
$$ Bruker specific parameters
$$ --------------------------
##$DU= <C:\u>
##$EXPNO= 1070
##$NAME= <ADRS>
##$PROCNO= 1
##$TYPE= <nmr>
##$USER= <dgb>
##$AMP= (0..31)
100 100 100 100 100 100 100 100 100 100 100 100 100 100 100 100 100 100 
100 100 100 100 100 100 100 100 100 100 100 100 100 100 
##$AQSEQ= 0
##$AQ_mod= 3
##$AUNM= <au_zg>
##$AUTOPOS= <2 >
##$BF1= 250.13
##$BF2= 250.13
##$BF3= 250.13
##$BF4= 250.13
##$BF5= 500.13
##$BF6= 500.13
##$BF7= 500.13
##$BF8= 500.13
##$BYTORDA= 1
##$CFDGTYP= 0
##$CFRGTYP= 5
##$CHEMSTR= <none>
##$CNST= (0..31)
1 1 145 1 1 1 1 1 1 1 1 1 1 1 1 1 1 1 1 1 1 1 1 1 1 1 1 1 1 1 1 1 
##$CPDPRG= <>
##$CPDPRG1= <>
##$CPDPRG2= <>
##$CPDPRG3= <>
##$CPDPRG4= <mlev>
##$CPDPRG5= <mlev>
##$CPDPRG6= <mlev>
##$CPDPRG7= <mlev>
##$CPDPRG8= <mlev>
##$CPDPRGB= <>
##$CPDPRGT= <>
##$D= (0..31)
0 1 0 0 0 0 0 0 0 0.06 0 0 0 0 0 0 0.0002 0 0 0 0 0 0 0 0 0 0 0 0 0 0 
0 
##$DATE= 1161592193
##$DBL= (0..7)
120 120 120 120 120 120 120 120 
##$DBP= (0..7)
150 150 150 150 150 150 150 150 
##$DBP07= 0
##$DBPNAM0= <>
##$DBPNAM1= <>
##$DBPNAM2= <>
##$DBPNAM3= <>
$$ [...]
##$SUBNAM7= <"">
##$SUBNAM8= <"">
##$SUBNAM9= <"">
##$SW= 20.6930455092707
##$SWIBOX= (0..15)
0 0 3 0 0 0 0 0 0 0 0 0 0 0 0 0 
##$SW_h= 5175.983436853
##$TD= 65536
##$TD0= 1
##$TE= 683.16
##$TE2= 300
##$TE3= 300
##$TEG= 300
##$TL= (0..7)
0 120 120 120 120 120 120 120 
##$TP= (0..7)
150 150 150 150 150 150 150 150 
##$TP07= 0
##$TPNAME0= <>
##$TPNAME1= <>
##$TPNAME2= <>
##$TPNAME3= <>
##$TPNAME4= <>
##$TPNAME5= <>
##$TPNAME6= <>
##$TPNAME7= <>
##$TPOAL= (0..7)
0.5 0.5 0.5 0.5 0.5 0.5 0.5 0.5 
##$TPOFFS= (0..7)
0 0 0 0 0 0 0 0 
##$TUNHIN= 0
##$TUNHOUT= 0
##$TUNXOUT= 0
##$USERA1= <user>
##$USERA2= <user>
##$USERA3= <user>
##$USERA4= <user>
##$USERA5= <user>
##$V9= 5
##$VALIST= <valist>
##$VCLIST= <CCCCCCCCCCCCCCC>
##$VD= 0
##$VDLIST= <DDDDDDDDDDDDDDD>
##$VPLIST= <PPPPPPPPPPPPPPP>
##$VTLIST= <TTTTTTTTTTTTTTT>
##$WBST= 1024
##$WBSW= 4
##$XGAIN= (0..3)
0 0 0 0 
##$XL= 0
##$YL= 0
##$YMAX_a= 331388
##$YMIN_a= -356530
##$ZGOPTNS= <>
##$ZL1= 120
##$ZL2= 120
##$ZL3= 120
##$ZL4= 120
##$ABSF1= 16.522
##$ABSF2= -4.171173
##$ABSG= 5
##$ABSL= 3
##$ALPHA= 0
##$AQORDER= 0
##$ASSFAC= 0
##$ASSFACI= 0
##$ASSFACX= 0
##$ASSWID= 0
##$AUNMP= <proc_1d>
##$AZFE= 0.1
##$AZFW= 0.1
##$BCFW= 0
##$BC_mod= 0
##$BYTORDP= 0
##$COROFFS= 0
##$CY= 12.5
##$DATMOD= 1
##$DC= 0
##$DFILT= <>
##$DTYPP= 0
##$F1P= 14.0000005364418
##$F2P= -0.99999901652339
##$FCOR= 0.5
##$FTSIZE= 32768
##$FT_mod= 6
##$GAMMA= 0
##$GB= 0
##$INTBC= 1
##$INTSCL= 1
##$ISEN= 128
##$LB= 0.3
##$LEV0= 0
##$LPBIN= 0
##$MAXI= 10000
##$MC2= 0
##$MEAN= 0
##$ME_mod= 0
##$MI= 0
##$NCOEF= 0
##$NC_proc= -5
##$NLEV= 6
##$NOISF1= 0
##$NOISF2= 0
##$NSP= 0
##$NTH_PI= 0
##$NZP= 0
##$OFFSET= 16.522
##$PC= 1
##$PHC0= -59.00846
##$PHC1= 10.5908
##$PH_mod= 1
##$PKNL= yes
##$PPARMOD= 0
##$PSCAL= 4
##$PSIGN= 0
##$REVERSE= no
##$SF= 250.13
##$SI= 32768
##$SIGF1= 0
##$SIGF2= 0
##$SINO= 400
##$SIOLD= 32768
##$SREGLST= <1H.DMSO>
##$SSB= 0
##$STSI= 32768
##$STSR= 0
##$SW_p= 5175.98343685301
##$SYMM= 0
##$S_DEV= 0
##$TDeff= 65536
##$TDoff= 0
##$TI= <Analysis number 999999
Compound Code 99
Book Reference 9
Project Code 9>
##$TILT= no
##$TM1= 0
##$TM2= 0
##$TOPLEV= 0
##$USERP1= <user>
##$USERP2= <user>
##$USERP3= <user>
##$USERP4= <user>
##$USERP5= <user>
##$WDW= 1
##$XDIM= 32768
##$YMAX_p= 337473258
##$YMIN_p= -610549
$$ End of Bruker specific parameters
$$ ---------------------------------
##NTUPLES= NMR SPECTRUM
##VAR_NAME=  FREQUENCY,     SPECTRUM/REAL,   SPECTRUM/IMAG
##SYMBOL=    X,             R,               I
##VAR_TYPE=  INDEPENDENT,   DEPENDENT,       DEPENDENT
##VAR_FORM=  AFFN,          ASDF,            ASDF
##VAR_DIM=   32768,         32768,           32768
##UNITS=     HZ,            ARBITRARY UNITS, ARBITRARY UNITS
##FACTOR=    0.157963299565203, 1,           1
##FIRST=     4132.6476996994, 0,             0
##LAST=      -1043.33573715361, 0,           0
##MIN=       -1043.33573715361, -610549,     0
##MAX=       4132.6476996994, 337473258,     0
$$ Real data points
##PAGE= N=1
##DATA TABLE= (X++(R..R)), XYDATA
$$ [...]
14822A13373n2765j3797N1279l4250l6525j25336j04189P3015N4028j06766K578
14811a79355J29103L4806m1303J26114J17111l101j05794p7455j02973l0575P4220
14800e9202K28280j09329q6086K0077m4734J29273m5694j20754J3812L2410M7753
14789E806N3259J28812J034j26093P1539J69527p3381k63745k8109J08159O7738
14778A14546N2977Q212R985Q3196r5546J44661J61842m7541m0047o981k16420
14767A68884M4763K9299j13887N5527R944p5465R0472M5598r6561J4088N8422
14756B31084p3419l4824J3339l474L9200j4100L1265M3384l0778K5659J34660
14745C61996K4242p4575n9079L1776M3235j27045j16189r3884J54321J55206n8495
$$ plain form
14822 113373 60608 46811 98090 63840 27315 -98021 -202210 -129195 -75167 -181933 -179355
14811 -179355 -50252 -15446 -56749 69365 186476 183375 77581 126 -102847 -133422 -59202
14800 -59202 169078 59749 -26337 -6260 -50994 78279 32585 -88169 -74357 -41947 5806
14789 5806 59065 187877 188911 62818 134357 303884 230503 -33242 -61351 46808 114546
14778 114546 167523 175735 185720 268916 173370 318031 479873 432332 392285 385304 168884
14767 168884 213647 242946 129059 184586 194530 119065 209537 255135 158574 172662 231084
14756 231084 157665 122841 136180 132706 171906 157806 189071 232455 201677 227336 361996
14745 361996 386238 311663 252584 284360 327595 200550 84361 -9523 144798 300004 241509
14734B41509j8869j26351j8453p6656n89J03455o1809N395M6786o0875N0677k9476
14722E4744j2338o9840j3341P1177l312N3050R3882p5336P0566N213L7287n8417
14710A53335j81193N1613J00531l7397K8712R4953j26207n6802P1581J06416p5778
14699A29764n6044P3352J3913K0798P8779J3880R711M9069L0142l2319J23729
14688D54774K0029k21226o6758J3448k4653l3145K756o9581r6786R1599J85453
14677B55910O2649n0510o2170j00032n9842j8211Q5879M8808J8495O1601j5893
14666B26684J7111J00119O1756M9428j38427j20453o4424k2450o0219j91491Q8370
14655e3996J41002J26052j133j28127q7813k4788m4768M3155P5697J6819K8562
$$ plain form
14734 241509 222640 96289 77836 1180 591 104046 42237 47632 94418 33543 84220 54744
14722 54744 42406 -27434 -40775 30402 27090 80140 174022 98686 169252 174465 211752 153335
14710 153335 -27858 23755 124286 86889 115601 210554 84347 27545 99126 205542 129764
14699 129764 73720 147072 160985 181783 260562 274442 284153 333222 363364 331045 454774
14688 454774 474803 253577 186819 200267 175614 142469 145225 75644 -21142 70457 255910
14677 255910 318559 268049 205879 105847 46005 27794 113673 162481 180976 242577 226684
14666 226684 243795 343914 405670 455098 316671 196218 131794 109344 49125 -142366 -53996
14655 -53996 87006 213058 211925 83798 -4015 -28803 -73571 -30416 45281 62100 90662
14644I0662J7052O1925K7790j18105j2311J83696j6752J0429o4391l4447j1332
14633A34216N1135j4189k090m9486L332J2911m9744p8810J11215K29758q2072
14622B66176o3844J05855P5120m6111L6387j2312L5033l6749n6130r0613p3259
14611A39553k1559Q3367j32640O2190R5392J800j85322j53861J20852J84762p7101
14600A17433J02278J2911K833r0882n5640j3880J54295q386R0560O4791o1191
14589C15122r6615L6214R54r3336o7626n0820L0296P3206j10865j09161N5731
14578a6900J43157Q3748J03151n5294j86183M961j2045P1513q6189m5794J85999
14567A90124J05002r7693k06853P5R0837J45063N6397k261n7841J2519L9289O4392
$$ plain form
14644 90662 107714 169639 197429 79324 67013 250709 233957 244386 179995 145548 134216
14633 134216 185351 171162 169072 119586 122918 135829 86085 7275 118490 348248 266176
14622 266176 202332 308187 383307 337196 373583 361271 396304 359555 303425 212812 139553
14611 139553 117994 201361 68721 130911 226303 228103 42781 -111080 9772 194534 117433
14600 117433 219711 232622 235455 144573 88933 75053 229348 220962 311522 376313 315122
14589 315122 218507 254721 255675 162339 94713 43893 74189 147395 36530 -72631 -16900
14578 -16900 126257 210005 313156 257862 71679 76640 64595 136108 49919 4125 190124
14567 190124 295126 197433 -9420 -9345 81492 226555 282952 280691 222850 235369 274658 339050
14555C39050n085n5323l9914k1284K0662l5850J34171N1933j13592K08987P1987
14544E55742j07064p4653q327q1780P0332O0108j46016l9368n2708J7906J1640
14533B05812m9884K4094j0030K3370K7285n8307m7999l7367K4184J6199q1381
14522C5976O440J03900P7563l4325j41269n4394j4835M9127J31043J54867J17543
14511D31636N3345M7348m1380J03878j4971l9726P3681J6416j83573j81196n9692
14500B05766K1243N7915J3069o5787n8565J37007l7753j10822r3340R5963R0273
14489B54969m1382m3934P0167O3542l6160M8436J36107j15518j04357Q34R1245
14478C23949n0751k18302r6053k4878J57471n9261j9791J21614K6782q2646m7254
$$ plain form
14555 339050 333965 278642 238728 217444 238106 202256 336427 388360 274768 483755 555742
14544 555742 448678 374025 365698 283918 354250 414358 268342 228974 176266 194172 205812
14533 205812 155928 180022 169992 193362 220647 162340 114341 76974 101158 117357 35976
14522 35976 42416 146316 223879 189554 48285 -6109 -20944 28183 159226 314093 431636
14511 431636 484981 532329 490949 594827 579856 540130 613811 630227 446654 265458 205766
14500 205766 227009 284924 297993 232206 173641 310648 272895 162073 68733 164696 254969
14489 254969 213587 169653 239820 303362 267202 315638 451745 336227 231870 232704 323949
14478 323949 273198 54896 -41157 -66035 91436 32175 12384 133998 160780 78134 30880
14467C0880K5699R3232L6135j1978m8084O7765k7016M6119k3013m0609m1332R995
14455A17793q791J11866j0147K4548O133K8245j6277p8086q2272L5887j112N3012
14443A80799J17465J21284Q5985p6844L5139l0295j34479l1221L2328m8022J5020
14432B67159J2375n5430j8318m7694O4180l0111j20858j27747O6369L06039k3117
14421B92847q2319O5814j1573P1886O364j32737j48837N4967J36099K32212l6383
14410D48340l5023n7832j49570m6416N6295O2211J14978k8530j02112O99k7182
14399B35858j28282M9639J8848m2906L4445n1325N3528Q5974K0421r2923N9588
14388B42865P8092j6499k9658R8670P0829j77504O9582R2207j11378m2495N7986
$$ plain form
14467 30880 56579 149811 185946 173968 125884 193649 166633 212752 189739 149130 107798 117793
14455 117793 109002 220868 210721 235269 241402 269647 253370 175284 93012 128899 127787 180799
14443 180799 298264 419548 505533 428689 463828 433533 299054 267833 300161 252139 267159
14432 267159 279534 224104 205786 158092 222272 192161 71303 -56444 9925 315964 292847
14421 292847 210528 276342 264769 336655 343019 210282 61445 116412 252511 484723 448340
14410 448340 413317 355485 205915 159499 215794 278005 392983 364453 262341 263040 235858
14399 235858 107576 157215 176063 133157 167602 116277 169805 255779 276200 183277 242865
14388 242865 320957 304458 274800 373470 444299 266795 336377 428584 317206 274711 332697
14377C32697m4752j81815J11710J02616m8102o0602L9611Q0025Q0934o0076j67047
14366A85199q3224J17895J60382l4708J8433M4875l1218J8538L0623M7723j19170
14355C55348p0714r7936r2476Q1937l963K4132M2273O7325k8306q8509o2658k1441
14343A05012J34168Q1217N308R8124M3372n0295o5422N294K7117P4252O9909o780
14331E21276K157r3594j09281R3068n3632j47867n4316L3569K8311Q4288J6733
14320C20712m4298n9062K1961R8895q787p1808p825O0925K142J9353Q5078Q926
14308D26212j47j18186j4224O914r5206K4923K273J24536m8374j0296O6853r582
14296C55696n3455J7316Q1813l820m8312L7008l6610q102Q1831m4951J1532k7663
$$ plain form
14377 332697 287945 106130 217840 320456 272354 211752 251363 331388 412322 352246 185199
14366 185199 101975 219870 380252 345544 363977 408852 377634 396172 426795 474518 355348
14355 355348 284634 186698 94222 176159 172196 196328 238601 305926 277620 189111 126453 105012
14343 105012 239180 320397 325705 423829 467201 416906 351484 356778 383895 458147 528056 521276
14331 521276 523433 429839 320558 413626 359994 212127 157811 191380 219691 303979 320712
14320 320712 276414 217352 239313 338208 329421 257613 249788 310713 312855 332208 417286 426212
14308 426212 426065 307879 293655 300569 205363 230286 232559 357095 308721 298425 365278 355696
14296 355696 302241 319557 401370 397550 349238 386246 349636 341534 423365 378414 389946 362283
14284C62283J4448r1504k2410k2807l3185M2187P7427Q8708K04502n3971r946
14273E55732j0194m9885j76357j51874o3716R7112J72680j22195P2172J48841
14263D72316j3399j07174o6577M8276m4057l3097J17917q7659k7415K8037j7773
14252B69395q307K7452j2501J06959L9905R8334Q46o0811M5096j45296j5238K9675
14240C75509j57298m9957J18933J6704N7889p3515j07804k1176n3439R9318O4819
14229B69983j9277q480O7275K05724L6791r7328K545O7673m3256p2092K5220j20608
14217C14170j70020j03770K6940R5659J1329n1265Q55K8494M2154L567O6076J24344
14205C88533K8043K278J04068P403j21224m5227Q9951O6205n3347j2982p7950
$$ plain form
14284 362283 376731 285227 262817 240010 206825 249012 326439 415147 619649 565678 555732
14273 555732 545538 495653 319296 167422 103706 200818 373498 251303 323475 472316
14263 472316 458917 351743 285166 333442 289385 256288 374205 286546 259131 287168 269395
14252 269395 261088 288540 276039 382998 422903 521237 522083 461272 506368 361072 345834 375509
14240 375509 218211 168254 287187 303891 361780 288265 180461 159285 105846 205164 269983
14229 269983 250706 242226 309501 515225 552016 454688 457233 524906 481650 409558 434778 314170
14217 314170 144150 40380 67320 162979 174308 123043 123898 152392 194546 198113 264189 388533
14205 388533 416576 418854 522922 530325 409101 363874 453825 520030 466683 453701 375751
14194C75751M0156P676m1755k42667j20781J43231J81597M5646L569k1788K9560
14183D00195Q411J65338J68993l194q0589n4090k3975n8707N0912l9428j34161
14172C99705p4590K9494K2701k4468L8528r973j06846Q1754O4533M3145k4465
14161D39518j4114j34265L0959R856m6696J45230Q4783p5279q0482Q239K2435
14150C90184N4245p3985J17111P8018j23508J24674l86j82064j09528L3195J05727
14139D13683j31794r8650Q2054Q8490k765J18122q123N2067J77401J843m6071
14128F46257n5075j48584j77832m5072K7893J16715L874J3496R8727m0921N8757
14117D98235j24648j78134O7393J28419q3039j75016L0232J31284J25139o2468
$$ plain form
14194 375751 415907 423583 381828 139161 18380 161611 343208 388854 392423 370635 400195
14183 400195 408606 573944 742937 739743 659154 605064 581089 522382 573294 533866 399705
14172 399705 325115 354609 377310 352842 391370 381397 274551 356305 420838 463983 439518
14161 439518 425404 291139 322098 331954 285258 430488 515271 439992 359510 367749 390184
14150 390184 444429 370444 487555 565573 442065 566739 566353 384289 274761 307956 413683
14139 413683 281889 183239 265293 353783 351018 469140 461017 513084 690485 692328 646257
14128 646257 591182 442598 264766 219694 247587 364302 368176 381672 480399 439478 498235
14117 498235 373587 195453 262846 391265 308226 133210 163442 294726 419865 357397
14107C57397P3142O2636k9439n1899o814l2000n1170l4101Q8691k9962L2630j44032
14095B35079J1389J38075J90306k0926J8398j2992p17q1467n9587k513J791L7724
14083D54560J4751P0889M1164N2661J07531j13437q7801m6491r0742N9941j6107
14072D46919O9517K9916J13783n1399j33060j10716r362N3415P0912M5664L7895
14061E63484o9895j73727L4732J44645M0377j09096n8040O8730R4356J2652j6959
14050E31259o2891l2398J04146M6848j07222n7945J48960L5689j70220p1570l8179
14039C26477K33591j63633k37990J11736J75994J8406k5093k2603j1466j07413
14029B98006O9607J14998K3004J37436q8209j44465K8083O1721r4914j25679J14109
$$ plain form
14107 357397 430539 493175 463736 411837 405023 373023 321853 287752 376443 346481 379111 235079
14095 235079 246468 384543 574849 553923 572321 559329 558612 477145 417558 415045 416836 454560
14083 454560 469311 540200 581364 634025 741556 628119 540318 493827 403085 463026 446919
14072 446919 516436 546352 660135 608736 475676 364960 355598 409013 479925 525589 563484
14061 563484 493589 319862 354594 499239 539616 430520 372480 441210 535566 548218 531259
14050 531259 468368 435970 540116 586964 479742 421797 570757 606446 436226 364656 326477
14039 326477 560068 396435 158445 270181 446175 464581 439488 416885 405419 298006
14029 298006 367613 482611 505615 643051 554842 410377 438460 500181 405267 279588 393697
14018C93697J02821J8176J1292l2192j34991n5074O7140P3979n8840r480p0328
14007C06200J6949j7010p1958O2538M7386J6321J7254l5173m3423J72363K3922
13996D95369O9221l6826r5568j49325p2948Q6905M647K1003L6441j00530n8328
13985B00061J05756L7842O5230J00758L1549j21546N9582M1688O18J5896M1913
13974E79347j96136p6119K24845R8506r703o4932j18525n165O4922j2989n6670
13963D27381P4823N1186q2742k8180j19R2382j27151J1507O3214j9221J28398
13952E91478J33929j0002j56973j62392N3402R2907N7567P3608J82146L040j78709
13941F80001R169j3674j13468N8210o9626k7169m1556j57009j01093M2124J28791
$$ plain form
14018 393697 496518 514694 525986 493794 358803 303729 370869 444848 386008 376528 306200
14007 306200 323149 306139 234181 296719 344105 360426 377680 342507 299084 471447 495369
13996 495369 564590 527764 432196 282871 209923 296828 301475 322478 358919 258389 200061
13985 200061 305817 343659 408889 509647 541196 419650 479232 520920 521538 537434 579347
13974 579347 383211 307092 531937 630443 620740 555808 437283 432118 497040 484051 427381
13963 427381 502204 553390 470648 442468 442349 534731 407580 419087 482301 463080 591478
13952 591478 725407 715405 558432 396040 449442 542349 599916 673524 855670 858710 680001
13941 680001 689170 675496 562028 620238 550612 523443 481887 324878 223785 265909 394700
13930C94700J11524P2800r4622L6491K9950j02727K8555N914J51802J16099O4958
13919H15444p2390j35902r0122J3151O3537o1047l2397L6869l8798m697J65745
13908F59393K0795o1629l677R530p8996m4377m0298k8449J52205k4087n1631Q929
13896E17708q9360o5469q48N9327l7654Q9184O4293J33749L661k4527p2882M4268
13884F21450J29054p3763j27479Q0496n812n4315q6182j5125j227J04316J88380
13873G59793K7085o430p1776p364n0900l9227o0944J22420J8442q16R6271j0862
13861G75692r819M2396j31421l5121m690R7298N0378L3897N961j7359k7997m9693
13849G29522L5833j0395j7442j0469M6095n612j00712O2221N6464o0293r5400
$$ plain form
13930 394700 506224 579024 484402 520893 550843 448116 476671 482585 634387 750486 815444
13919 815444 743054 607152 517030 530181 593718 532671 500274 537143 498345 493648 659393
13908 659393 680188 618559 614882 624412 545416 501039 460741 432292 584497 560410 508779 517708
13896 517708 428348 362879 362031 421358 383704 472888 537181 670930 674591 650064 577182 621450
13884 621450 750504 676741 549262 629758 623946 569631 483449 468324 467097 571413 759793
13873 759793 786878 780448 708672 701308 650408 611181 550237 672657 691099 690283 786554 775692
13861 775692 765873 808269 676848 641727 637037 734335 784713 818610 824571 807212 779215 729522
13849 729522 765355 754960 737518 727049 773144 767532 666820 729041 785505 725212 629812
13838F29812q5320l5937J27603K600p286Q2895q0137P8946j7789j26030j5213
13827E54144J5298Q4076m106k0548J08204j0060K526p0679m3937L5550L6314K9850
13815G16632J1590M8211K6606j12412o8496k8714m2607j2332l3107j8558J50931
13804F37744M2580j4118m7388o194L8464J2618q5421N855M7084P062j4459l6161
13792E87666K1314m370o0513M5386J72601K12706K0145j51446k35842R5379J40680
13781H43706l5877k44196k7589P3711m8497K0224j922J9420J3561P8150q456j08171
13769E74064o3307N3535O6256m6890j0260N2023J631J08426o2247l8604M6772
13758F81399j03J8061O7115O4644r3942j55093n50J60843n315l9542M0023K0335
$$ plain form
13838 629812 544492 508555 636158 638758 631472 714367 634230 713176 695387 569357 554144
13827 554144 569442 653518 649412 628864 737068 727008 729534 658855 614918 650468 686782 716632
13815 716632 728222 776433 803039 690627 622131 593417 550810 538478 505371 486813 637744
13804 637744 680324 666206 618818 612624 651088 663706 578285 584140 631224 638286 623827 587666
13792 587666 608980 604610 544097 589483 762084 974790 994935 843489 607647 703026 843706
13781 843706 807829 563633 536044 609755 561258 581482 579560 598980 612541 690691 682235 574064
13769 574064 510757 564292 630548 583658 573398 625421 627052 735478 673231 634627 681399
13758 681399 681296 699357 766472 831116 737174 582081 581531 742374 737059 697517 737540 757875
13746G57875N0337m8438m7916L9410j2604O1160K0975j3298k09595m2442J07114
13735F62578N0986j4468J20712L6465j50495j4258J6986j70874p7463J01440R2341
13724F53950k0763J5667q3490k1330Q895J02626n302m048J0157P8899n4759j7037
13712F63465J5199n4067o222J5915j56595K3542N4245J22645k5004N5358N8422
13701G66903n1513N5789J51167o3564j23427O4148n1260j43589p3490J1399J48749
13690F91312J06408Q562N7280m6052q2653o3564J29011N4741k12460q2213R2051
13679F52423K9704J37354j6129m6688j9072J30705J37812l8475k26244j7174N5528
13668G79744J10500o8102j55201J09438J36297j32154j63165M2570n555J04883
$$ plain form
13746 757875 808212 759774 711858 751268 738664 799824 820799 807501 597906 555464 662578
13735 662578 713564 699096 819808 856273 705778 691520 708506 537632 460169 561609 653950
13724 653950 633187 648854 565364 544034 552929 655555 650253 646205 656362 735261 680502 663465
13712 663465 678664 624597 618375 634290 477695 501237 555482 678127 653123 708481 766903
13701 766903 715390 771179 922346 858782 735355 799503 748243 604654 531164 542563 691312
13690 691312 797720 806282 863562 817510 734857 671293 800304 855045 642585 560372 652423
13679 652423 682127 819481 803352 756664 737592 868297 1006109 967634 741390 724216 779744
13668 779744 890244 822142 666941 776379 912676 780522 617357 659927 654372 759255
13658G59255M005L7819K6897m7787n1637r5733m7748N8307O3199j9359P4561P6786
13646H38565Q7461l5677K297J17847O1510j64343k7962J77401J3224r5454j07270
13635H67599j25020m1705m3449j7836P3677J04584J72651R288K9662M4973J39263
13624A213687l0510N7535j17015j13191K0517j0833n6660q7724M212J34131p3074
13613I41075k902N4455r2010o6817N3715o0329k9661L3125l0366O076M8090R416
13601H63867J368n2942q631J49563J68996M027p2676r1403r8321M6235r0580M1099
13589H60602J32816M6202l4321m688j20869j18965l0366N3126N0559J45304M3777
13578A023177j4048o4395m6884n1103k1788P0075l506J7095k4607N4958P2995
$$ plain form
13658 759255 763260 801079 827976 780189 728552 632819 585071 643378 706577 687218 761779 838565
13646 838565 926026 890349 892646 1010493 1072003 907660 879698 1057099 1070323 974869 867599
13635 867599 742579 700874 657425 639589 713266 817850 990501 999789 1029451 1074424 1213687
13624 1213687 1183177 1240712 1123697 1010506 1031023 1020190 963530 875806 880018 1014149 941075
13613 941075 938173 992628 900618 833801 887516 827187 797526 830651 800285 806361 854451 863867
13601 863867 865235 812293 803662 953225 1122221 1126248 1053572 962169 863848 910083 819503 860602
13589 860602 993418 1039620 1005299 1000611 879742 760777 730411 783537 834096 979400 1023177
13578 1023177 1009129 944734 897850 846747 824959 895034 891528 908623 884016 938974 1011969
13567A011969K2559l0551J43590l007o9371j20078r0323l4140n5876m2216N3487
13556G86043J19767R6728k5599J19029J05213J03384l2438j04079j99125n7502
13546I11421J7496J21182M5082O2564l6920j02111L443k6600J38284J04488m9150
13535A189179m2775j28702p8416R7168M9268k4976q678m8414J3174L7947J17048
13524A171823P689n972j51996q0338R8290Q8023n6574k9055J19238j50n7003l7795
13512A066180r866j42115j12021J8994P1450J9062L0755R5257M578M435j32966
13501I13743j79495L1954K18284M7206j1565O7261o4930j11255m1881Q3390K07791
13490A160503p7071J2561L8445p8511j12084K1779R5979J96720p473Q5105J248
$$ plain form
13567 1011969 1034528 1003977 1147567 1144560 1075189 955111 864788 830648 774772 732556 786043
13556 786043 905810 1002538 976939 1095968 1201181 1304565 1272127 1168048 968923 911421
13546 911421 928917 1050099 1095181 1157745 1120825 1018714 1022157 995557 1133841 1238329 1189179
13535 1189179 1146404 1017702 939286 1036454 1085722 1060746 1052068 1003654 1016828 1054775 1171823
13524 1171823 1179512 1173540 1021544 941206 1039496 1127519 1070945 1041890 1161128 1160978 1103975 1066180
13512 1066180 1056314 914199 802178 821172 892622 911684 942439 1037696 1042274 1046709 913743
13501 913743 734248 766202 984486 1031692 1020127 1087388 1022458 911203 869322 952712 1160503
13490 1160503 1083432 1095993 1134438 1055927 943843 965622 1061601 1258321 1250848 1335953 1337201
13479A337201o2129q6616O046M1891n6872j94466K9615R5867R578P6908n8519
13468A138504n2127q9817k3077J91657J05223j21095n7540J92565L9095k24608
13458A098780j48899o6957J56521O4021m272M7556L7253l984N8079M5400j48j11118
13446A172232Q8281M5563J1617q5973r5747J46009Q704l3861M9494P5349M5735
13435A427403K6394k3712o2855k4508j6596j2137J04199J02491L842k28112j18753
13424A177656K29574o4502j15101M2923l6102r989q757r3772o1663k216R9833
13413A157884k1924M9801P1144q8331j59876m62j4362J04455J13679n6344m0976
13402A114688n3473N845L6740J31437M8324Q2258j9536j63536r3802J518P2179
$$ plain form
13479 1337201 1275072 1188456 1194502 1236393 1179521 985055 1014670 1110537 1120115 1197023 1138504
13468 1138504 1086377 996560 973483 1165140 1270363 1149268 1091728 1284293 1323388 1098780
13458 1098780 949881 882924 1039445 1103466 1099194 1146750 1184003 1180019 1238098 1283498 1283350 1172232
13446 1172232 1260513 1306076 1317693 1231720 1135973 1281982 1290686 1256825 1306319 1381668 1427403
13435 1427403 1453797 1430085 1367230 1342722 1326126 1313989 1418188 1520679 1524521 1296409 1177656
13424 1177656 1407230 1342728 1227627 1270550 1234448 1224459 1215702 1121930 1060267 1058051 1157884
13413 1157884 1135960 1185761 1256905 1168574 1008698 1008236 993874 1098329 1212008 1155664 1114688
13402 1114688 1061215 1067060 1103800 1235237 1283561 1365819 1346283 1182747 1088945 1090463 1162642
13391A162642K5579K7982O3692O5613J8340N8451J3708j32478n8108j2691n397
13380A227333M7702l0022O7171J06928J2291j492J8747m6021j13663L2713R8376
13369A420063M8257p5671l8309k8696p5069R3445K8227J12508M4100o7813N044
13358A466086k32K0223J6318o5905o3201n0776O7625R141L0870j29322l6103l4592
13346A230132L2105O7177P8901J19212j02613o8373j5076N5639J17986j2923j79342
13335A322825j26166J0303J08065J59188J7960j04887L5718J72974Q3366j6643
13325A662703p1014O4594J00190J36930j19620o6096j19504j02101K7531J10687
13315A624300m7567j88899r5288M5113L2435k9017J26937J81079N1670N7490O146
$$ plain form
13391 1162642 1188221 1216203 1279895 1345508 1363848 1422299 1436007 1303529 1245421 1232730 1227333
13380 1227333 1275035 1245013 1312184 1419112 1431403 1429911 1448658 1402637 1288974 1321687 1420063
13369 1420063 1468320 1392649 1354340 1325644 1250575 1344020 1372247 1484755 1528855 1461042 1466086
13358 1466086 1465854 1486077 1502395 1436490 1373289 1322513 1390138 1399279 1430149 1300827 1264724 1230132
13346 1230132 1262237 1329414 1408315 1527527 1424914 1356541 1341465 1397104 1515090 1502167 1322825
13335 1322825 1196659 1206962 1315027 1474215 1492175 1387288 1423006 1595980 1679346 1662703
13325 1662703 1591689 1656283 1756473 1893403 1773783 1707687 1588183 1486082 1513613 1624300
13315 1624300 1576733 1387834 1292546 1337659 1370094 1341077 1468014 1649093 1700763 1758253 1764399
13304A764399l1779J1316j21724l8698n6704J9164J12935M4986j30843j24726
13294A448326l4452o1132K6832j621n2064P6165Q7115M1680J4594p5846R61J35652
13282A606210K2673m8323m3102j0797O1433m4651n8583N1317J21287m1772m20
13271A615272M6023J1235J48276K2902j43684j70777Q0382O4956k1635J97034
13261A849984O0957r2617K324P090j01795j7125O2159o6689r2283m9774M194m8024
13249A518401M7232R5621J05255J3393k2296M1064J44053Q2422r6927n9650m4238
13238A824330p9780N1720m4567J4148M5169L4131r433r5942r2485l8415J06571
13227A715447L6183K2181q3769q979L2647J6183J00305L8714K1559m4695l6775
$$ plain form
13304 1764399 1732620 1743936 1622212 1583514 1526810 1545974 1658909 1703895 1573052 1448326
13294 1448326 1413874 1352742 1379574 1377953 1325889 1402054 1489169 1530849 1545443 1469597 1470558 1606210
13282 1606210 1628883 1580560 1537458 1526661 1588094 1543443 1484860 1536177 1657464 1615692 1615272
13271 1615272 1661295 1672530 1820806 1843708 1700024 1529247 1609629 1674585 1652950 1849984
13261 1849984 1910941 1818324 1820648 1827738 1725943 1708818 1770977 1704288 1612005 1562231 1566425 1518401
13249 1518401 1565633 1661254 1766509 1779902 1757606 1798670 1942723 2025145 1928218 1868568 1824330
13238 1824330 1744550 1796270 1751703 1765851 1811020 1845151 1835718 1739776 1647291 1608876 1715447
13227 1715447 1751630 1773811 1690042 1681063 1713710 1729893 1830198 1868912 1890471 1845776 1809001
13216A809001Q4523r0800p3295o779M1375j9336K6095k5174M9551O2540r9886
13205A757815K8166P0083R0065j68800j7055P9338q5234j34254k296M6189J83045
13194A847062O5886K7124K3909m1640J8105N5353p4221L3928Q5095J0972n174
13183B046399L6142K2997l1158j09828j12798L533m4318l1694M4910J0560k2312
13172A812433K0509n7291N5134J64118K3405j60261O166j058M2396P4118K0916
13161B000585j24179k8568j2243L2975J30617q515J934p9522M2287J18962n947
13150B068386J764n5734N2784N2480M2450j1807j37460P7J0309l6410K8383J35869
13138B151091N7605n6721j57752o1952R0935J14679o7174r4043p8377P2063K35556
$$ plain form
13216 1809001 1893524 1802724 1729429 1722650 1764025 1744689 1770784 1745610 1795161 1857701 1757815
13205 1757815 1785981 1856064 1946129 1777329 1760274 1839612 1754378 1620124 1617828 1664017 1847062
13194 1847062 1912948 1940072 1963981 1922341 1940446 1995799 1921578 1955506 2040601 2051573 2046399
13183 2046399 2082541 2105538 2074380 1964552 1851754 1855287 1810969 1779275 1824185 1834745 1812433
13172 1812433 1832942 1775651 1830785 1994903 2018308 1858047 1864213 1863155 1905551 1979669 2000585
13161 2000585 1876406 1847838 1835595 1868570 1999187 1990672 1992606 1913084 1955371 2074333 2068386
13150 2068386 2070150 2014416 2067200 2119680 2162130 2150323 2012863 2012940 2023249 1986839 2015222 2151091
13138 2151091 2208696 2151975 1994223 1932271 2023206 2137885 2070711 1976668 1898291 1970354 2205910
13127B205910Q1193j33387j68731o9543j6973J82237k6608q4312J18842K10479
13117B299107m4463k00641p4577P3161N3929n0726K5083p2720R4292l3578O7599
13106B136466J35229M2572k3570p319r3515o6944p779r9298N8835P3407J25646
13095B273730Q0534M9813j25224q1727M323Q9353m7665M1547J61470J0971n9989
13084B397136R5711o1752j27230N7779r55M2422p734j6969k31699j39232N2259
13073B059736J23114K2823o615L1983j4675l8293L0190j17090j761J13187J28422
13062B331021J33386p8044j58637L715J65753Q9799M636j16033K3654K8606o1001
13051B366855k874P8357J0998n7001j0047k8809K5701j3273k51R8896R6285N0013
$$ plain form
13127 2205910 2287103 2153716 1984985 1915442 1898469 2080706 2054098 1969786 2088628 2299107
13117 2299107 2254644 2054003 1979426 2052587 2106516 2055790 2080873 2008153 2102445 2068867 2136466
13106 2136466 2271695 2314267 2290697 2283378 2189863 2122919 2115140 2015842 2074677 2148084 2273730
13095 2273730 2354264 2404077 2278853 2197126 2201449 2290802 2243137 2284684 2446154 2457125 2397136
13084 2397136 2492847 2431095 2303865 2361644 2360689 2403111 2395377 2378408 2146709 2007477 2059736
13073 2059736 2182850 2205673 2199058 2231041 2216366 2178073 2208263 2091173 2089412 2202599 2331021
13062 2331021 2464407 2386363 2227726 2231441 2397194 2486993 2491629 2375596 2399250 2427856 2366855
13051 2366855 2363981 2442338 2453336 2396335 2386288 2357479 2383180 2369907 2369656 2468552 2564837 2614850
13039B614850m9218O4476L8558r2354j6538j1252J38205J29238o455j00628j23040
13028B585842j32879j39394j70379m2535J62585J72784J58500j2367L64m6997
13018B535524L1565J53622j0853K373M7072j41273n8455J0855O1767j25460J2648
13007B519385O6065P2870m958l1532j30562q2498R3393Q979J25695O9543l0357
12996B676023m0462L6751J54891J5734j64571m2166q0783n2359J28407J7430R620
12985B658515R8875J8161L2846J5880l0244o7677K6992k995M5629p838p2239P2193
12973B788098J18581K390n1708j7741O6119q3489q9957j44391R6768l7328j63211
12962B484131m8534K12070J61397J8630J05069J09209r3995n3093K7452n6869
$$ plain form
13039 2614850 2565632 2630108 2668666 2576312 2559774 2548522 2686727 2815965 2809510 2708882 2585842
13028 2585842 2452963 2313569 2143190 2100655 2263240 2436024 2594524 2582157 2582521 2535524
13018 2535524 2567089 2720711 2709858 2712231 2759303 2618030 2559575 2570430 2632197 2506737 2519385
13007 2519385 2585450 2658320 2653362 2621830 2491268 2408770 2502163 2511142 2636837 2706380 2676023
12996 2676023 2635561 2672312 2827203 2842937 2678366 2636200 2555417 2503058 2631465 2648895 2658515
12985 2658515 2757390 2775551 2808397 2824277 2794033 2726356 2753348 2750353 2795982 2788144 2715905 2788098
12973 2788098 2906679 2909069 2857361 2839620 2905739 2822250 2732293 2587902 2684670 2647342 2484131
12962 2484131 2435597 2647667 2809064 2827694 2932763 3041972 2947977 2894884 2922336 2865467
12952B865467p6945K8041l082j20300m8099J61438J24970J49746j13887j3382
12942B953967R1700m9999r3138J06267k9478p6827M6880K8577l5664n2732k6828
12931B862725l0264m7058J27718R5655n791J29630L2587L8138j73839p8059Q8959
12920C040401P6420J0183o7725j31179J4450K0453J11716L1593Q6007N6964O9057
12909C318340J0534q7679j70623j28534r3772K965L9099o8039Q4516J67407L9527
12898C113741l4621O7653N3175K9629j4807n5548N7915L7781r4243n2389p0415
12887C037871o8338J47764l2243p8579k7053J10648m2535k640o2207M6667J31194
12876C160549m3911J80085p740j88992j82473j39522J53283J66497J55197N0630
$$ plain form
12952 2865467 2788522 2816563 2813481 2693181 2645082 2806520 2931490 3081236 2967349 2953967
12942 2953967 3045667 2995668 2902530 3008797 2979319 2902492 2949372 2977949 2942285 2889553 2862725
12931 2862725 2832461 2785403 2913121 3008776 3002985 3132615 3165202 3203340 3029501 2951442 3040401
12920 3040401 3116821 3127004 3059279 2928100 2942550 2963003 3074719 3106312 3192319 3249283 3318340
12909 3318340 3328874 3241195 3070572 2942038 2848266 2851231 2890330 2822291 2906807 3074214 3113741
12898 3113741 3079120 3146773 3199948 3229577 3214770 3159222 3217137 3254918 3160675 3108286 3037871
12887 3037871 2969533 3117297 3085054 3006475 2979422 3090070 3047535 3044895 2982688 3029355 3160549
12876 3160549 3116638 3296723 3288983 3099991 2917518 2777996 2931279 3097776 3252973 3303603
12866C303603k6343K4498M1692n1935J3700j14428N1825J26350n8484o6062J8833
12855C263249M7262J6607O529o2615l2937N6422O4277k5501q2332J3919M3048
12844C307928P3492O593j2897K8113q913J06101p1760k47769L4228K56965J87516
12833C659597n8630j22015L7422n2698J3571R1557M5125Q0998j9322l3327k0389
12822C621889j43306j0871l3963K3271P6587j6775N3531K2519m6221l4849q2977
12811C428835j79021q7236Q5984Q1912M0644J95661K36161j23466j48392M4487
12801C575569l1845J05274P1287L2293j22043n3418O2812L2444j35146O6424K3545
12790C627196Q6537m7043j32658j2097L2660K17196J24313Q088K1784j95803k09944
$$ plain form
12866 3303603 3277260 3301758 3343450 3291515 3305215 3190787 3242612 3368962 3310478 3244416 3263249
12855 3263249 3310511 3327118 3333647 3271032 3238095 3294517 3358794 3333293 3250961 3264880 3307928
12844 3307928 3381420 3388013 3375116 3403229 3394316 3500417 3428657 3180888 3215116 3472081 3659597
12833 3659597 3600967 3478952 3516374 3463676 3477247 3568804 3613929 3694927 3675605 3642278 3621889
12822 3621889 3478583 3467712 3433749 3457020 3533607 3516832 3570363 3592882 3546661 3511812 3428835
12811 3428835 3249814 3162578 3248562 3330474 3371118 3566779 3802940 3679474 3531082 3575569
12801 3575569 3543724 3648998 3720285 3752578 3630535 3577117 3639929 3672373 3537227 3603651 3627196
12790 3627196 3713733 3666690 3534032 3521935 3554595 3771791 3896104 3904192 3925976 3730173 3520229
12779C520229p6534J26294J46344P583j7105j9744k8790Q4184P2346K3003r6152
12768C741658j58810j3328K47624M1631j42210p0150J6093r0629p792M5882J09115
12757C719084P3834L6915q672O5971P6842K6690l1201p9731m6037p0446m8127
12746C715122J39660P3427J56742R6825j54429o6442r6951M3475l2860n5949N3508
12735C872128J33396Q9189j78346j1132J04134K47564n2390l7252j17469j26311
12725C923511r2928J6696K9369J14285J15584K7298P0767j09930k8585j1713m9597
12714D004757j29040m841P6361O5783Q8424P1167k2381m6064L2455l4218n3423
12703D048980K7952n9893j64520P7140J92625K0460R2336j4361n3013r027j85232
$$ plain form
12779 3520229 3443695 3569989 3716333 3723916 3706811 3687067 3658277 3742461 3814807 3837810 3741658
12768 3741658 3582848 3569520 3817144 3858775 3716565 3646415 3662508 3571879 3564087 3609969 3719084
12757 3719084 3792918 3829833 3821161 3887132 3963974 3990664 3959463 3879732 3833695 3763249 3715122
12746 3715122 3854782 3928209 4084951 4181776 4027347 3960905 3863954 3907429 3874569 3818620 3872128
12735 3872128 4005524 4094713 3916367 3905235 4009369 4256933 4204543 4167291 4049822 3923511
12725 3923511 3830583 3847279 3876648 3990933 4106517 4133815 4204582 4094652 4066067 4054354 4004757
12714 4004757 3875717 3870876 3947237 4013020 4101444 4172611 4150230 4104166 4136621 4102403 4048980
12703 4048980 4076932 4017039 3852519 3929659 4122284 4142744 4235080 4220719 4167706 4158679 3973447
12692C973447q4309m082k1785N6805J68694k5159J2083R3482M7522j4100q8429
12681D114169R05L2378j06432K3927J26720N4459r3452P115R0065q5509L6210
12670D200555q6035r4042O9991J02769M1157k7488N07o2994q438K55451p0079
12659D321354j07290J4005N5237L6469J03636j0060J05463k03375j04553J05665
12649D316551j9967k265J24134P948J2512L8493k7335r0205q3937L1032J04742
12638D411703m3054m0833j3345M3442J39870p5393l1435M8022N7592L7816O694
12627D541079N9990j9655j32405M1469L5704R1396k0727o3410O484j34731L7498
12616D442692P4137m3346j1185J02004P6153j98744o3758N8553L8116m273o8784
$$ plain form
12692 3973447 3889138 3885056 3863271 3920076 4088770 4063611 4075694 4169176 4216698 4202598 4114169
12681 4114169 4115074 4147452 4041020 4064947 4191667 4246126 4152674 4159789 4249854 4164345 4200555
12670 4200555 4114520 4020478 4090469 4193238 4234395 4206907 4207414 4144420 4135982 4391433 4321354
12659 4321354 4214064 4228069 4283306 4319775 4423411 4413351 4518814 4315439 4210886 4316551
12649 4316551 4296584 4294319 4418453 4426401 4438913 4477406 4450071 4359866 4275929 4306961 4411703
12638 4411703 4368649 4327816 4314471 4357913 4497783 4422390 4390955 4438977 4496569 4534385 4541079
12627 4541079 4601069 4581414 4449009 4490478 4526182 4617578 4596851 4533441 4539925 4405194 4442692
12616 4442692 4516829 4473483 4462298 4564302 4640455 4441711 4377953 4436506 4474622 4470349 4401565
12605D401565p9291k0706J26854J98169j6154p8173l2418M0128J52062q3047K2850
12594D631839p757j51887k9789L1203n1180M9505P0911J1277k3929R1741O2874
12583D684808j30577O9375J2635j18690q5602p9703K115J48860J36712P0404m887
12572D705450Q4998r0203N9555K1278j28498q9233l2466m1530M8489K6146R1149
12561D655135r0376m3699M1731N5075n2302q80J19624O0488J83j04210j79089
12550D461680M2653J0540o8793j25370L3062R0525M9947P3168j0990J07082J13849
12539D777353K2824O259p0252n9925l2131M7192J28087n6600q9348P396R5540
12528D776395p3443R1694p2565K1797Q9841r7030j48472l5678K24403J05575o7677
$$ plain form
12605 4401565 4322274 4301568 4428422 4626591 4610437 4532264 4499846 4539974 4692036 4608989 4631839
12594 4631839 4624082 4472195 4442406 4473609 4422429 4471934 4542845 4554122 4530193 4621934 4684808
12583 4684808 4554231 4623606 4636241 4517551 4431949 4352246 4354361 4503221 4639933 4710337 4705450
12572 4705450 4790448 4700245 4759800 4781078 4652580 4563347 4530881 4489351 4537840 4563986 4655135
12561 4655135 4564759 4521060 4562791 4617866 4565564 4564684 4684308 4744796 4744979 4640769 4461680
12550 4461680 4504333 4514873 4446080 4320710 4353772 4444297 4494244 4567412 4556422 4663504 4777353
12539 4777353 4800177 4806436 4736184 4676259 4644128 4691320 4819407 4762807 4673459 4680855 4776395
12528 4776395 4702952 4794646 4722081 4743878 4833719 4736689 4588217 4552539 4776942 4882517 4814840
12517D814840j5187N3199j44495J218n2098m907J14002O8648q6515L0857O0384
12506D839946J44251l3121k47385k9256J66793k5520j48224j21938l3756j9179
12496D492611J6145P200n6820J63012K34722L2898K9658n46j84963j35404L5001
12485D633514L5226j38063j06220o0298L0078K92365J43191j54550k19593q8331
12475D367319P5301L3369N1639P3655P2634Q037m5196r3575n052J74966O1158
12464D774255N1292k5605o8264j20557K02682k4155o824P2333j49842n4977k910
12453D647428k0189K4378O7728R517J69171l9121k16953j24840J12719P4995L4698
12442D739531J9042o8810K8544P6427o984R3089Q6019j33204j10272K6531Q8932
$$ plain form
12517 4814840 4799653 4852852 4708357 4709575 4657477 4652570 4766572 4835220 4748705 4779562 4839946
12506 4839946 4984197 4951076 4703691 4674435 4841228 4815708 4667484 4545546 4511790 4492611
12496 4492611 4508756 4515956 4459136 4622148 4856870 4889768 4919426 4918880 4733917 4598513 4633514
12485 4633514 4668740 4530677 4424457 4364159 4394237 4686602 4829793 4675243 4455650 4367319
12475 4367319 4442620 4475989 4527628 4601283 4673917 4681954 4636758 4543183 4538131 4713097 4774255
12464 4774255 4825547 4799942 4731678 4611121 4813803 4789648 4782824 4855157 4705315 4650338 4647428
12453 4647428 4627239 4651617 4719345 4728862 4898033 4858912 4641959 4517119 4629838 4704833 4739531
12442 4739531 4758573 4689763 4718307 4794734 4787750 4880839 4966858 4833654 4723382 4749913 4838845
12431D838845N4179r1870p6810m681L2571m2812j49552o5784k4592J33871m8574
12420D554791K2111r933P264K7374j8476R347j294L2446N9673r2624K2044l0063
12408D582660K1170K393k302Q3126N9183o9992j07565J10958j3339Q784J1257
12397D686333j07219j02501q0749n6617L8113J49109L3654m9287p0240j00068
12387D340528M1293P9598J07333r053K8461k6148o376o091n2384m6608L0442p9496
12375D401499j1108Q9062R2257j64101q2119l1022L1017l1172L2259J6281n2428
12364D290425J01884R6090j19237m7817j03271N4111J48717J25668n5930j27669
12354D362971J2518O2334j2670l1388M5615R6712K3207q4178j889P967M9939l1298
$$ plain form
12431 4838845 4893024 4801154 4724344 4719663 4752234 4709422 4559870 4494086 4469494 4603365 4554791
12420 4554791 4576902 4566969 4574233 4601607 4583131 4592478 4591184 4623630 4683303 4590679 4612723 4582660
12408 4582660 4603830 4606223 4603921 4687047 4746230 4676238 4568673 4679631 4666292 4675076 4686333
12397 4686333 4579114 4476613 4395864 4339247 4377360 4526469 4560123 4510836 4440596 4340528
12387 4340528 4381821 4461419 4568752 4559699 4588160 4562012 4555636 4549545 4497161 4450553 4480995 4401499
12375 4401499 4390391 4479453 4571710 4407609 4325490 4294468 4325485 4294313 4326572 4342853 4290425
12364 4290425 4392309 4488399 4369162 4321345 4218074 4272185 4420902 4546570 4490640 4362971
12354 4362971 4375489 4437823 4425153 4393765 4439380 4536092 4559299 4475121 4473232 4481199 4531138 4499840
12342D499840j31236j5758N1797j08757L1440K9221Q1607j25437n8330m1693j2692
12331D200002Q687J22767j3691n0835L4172j01394J6648J22757O4150O4862N7886
12320D526011O0657r5263j06407j4286l7541j18456P5613J490k0400r3962r9104
12309D078352M7764O1440R6666R017j20688m5750j77699o4379J5823N7433L4689
12298C992668K9473p1096j05851K4949J01118j8805M8578N2905k082L9427M9780
12287D141064J06391K2677P7784q749n7358m8064Q8008M5161k24227n8180n9483
12276D025024M2182N3715k229K8845M0669n7554j29421p8402O5731n8277O2657
12265C992940J45020j63166N323J560o6555k2641J2065J2276M8828J05242L3504
$$ plain form
12342 4499840 4368604 4352846 4404643 4295886 4327326 4356547 4438154 4312717 4254387 4212694 4200002
12331 4200002 4208689 4331456 4317765 4266930 4301102 4199708 4216356 4339113 4403263 4468125 4526011
12320 4526011 4586668 4491405 4384998 4370712 4333171 4214715 4290328 4291818 4271418 4177456 4078352
12309 4078352 4126116 4187556 4284222 4293239 4172551 4126801 3949102 3884723 3900546 3957979 3992668
12298 3992668 4022141 3951045 3845194 3870143 3971261 3952456 4001034 4053939 4051857 4091284 4141064
12287 4141064 4247455 4270132 4347916 4339167 4281809 4233745 4321753 4366914 4142687 4084507 4025024
12276 4025024 4067206 4120921 4118692 4147537 4188206 4130652 4001231 3922829 3988560 3930283 3992940
12265 3992940 4137960 3974794 3980117 3981677 3915122 3892481 3904546 3916822 3965650 4070892 4104396
12254D104396O4472J34388M319K6273J21400J19290j25093j6203O8951P326p4620
12243D434899j2333J67457j8077m0440j37591L0246Q0872j4119m7376j85593m2743
12232D215202R308L5538l0984M07o7068j25502J2866M4770L8812J19229J35436
12221D388014J03274r9587m8072J52500m1229m5935m8052R8238k4467J00665J32073
12210D667422k6221R1620K28841R2209Q5209k1128J16688K6597L6001o2850l50146
12199D884242j28728P3450r335j13552j44117j46400j03017n7830Q9254J09734
12189D453701O2159n9648j00709J7658j16002q4360J13811L8152q8500j48809
12179D087453j08071k9144Q0624J49319J4778j06780r3177M9395L8120R5533j179
$$ plain form
12254 4104396 4168868 4303256 4307575 4333848 4455248 4574538 4449445 4433242 4502193 4509519 4434899
12243 4434899 4422566 4590023 4571946 4531506 4393915 4424161 4505033 4490914 4443538 4257945 4215202
12232 4215202 4224510 4260048 4229064 4229471 4162403 4036901 4049767 4094537 4133349 4252578 4388014
12221 4388014 4491288 4391701 4343629 4496129 4454900 4408965 4360913 4459151 4434684 4535349 4667422
12210 4667422 4641201 4732821 4961662 5053871 5139080 5117952 5234640 5261237 5297238 5234388 4884242
12199 4884242 4755514 4828964 4819629 4706077 4561960 4415560 4312543 4254713 4343967 4453701
12189 4453701 4515860 4456212 4355503 4373161 4257159 4172799 4286610 4324762 4236262 4087453
12179 4087453 3979382 3950238 4030862 4180181 4194959 4088179 3995002 4044397 4082517 4178050 4176871
12168D176871K4757J3101M3223L6713o9664p5634j19969J9032j50907o5759n381
12157C826383j9096j53688j05661J75867j4607N0831P633m4842j54070N0483k0059
12146C599174j17503j6584m6862M1029j15498p4102M6250o6201M0793N2259J06677
12135C449432p0145p0215k8824Q5119N2215O8577k2411K3492j16583q5557K4056
12124C309156m394K4770m504n7128l053o4319J5985o2860k6128J51295K0232k9351
12112C269701O16j73986o4417J29481J1707q5943k9753o48l306j6008O5124L514
12100C106082K5345o552M0295j7122l4311j6080p8270O3343J58271l1341o6003
12089C143657K744P0714J16957j08242k31043q1271p7465K6482K02217J57026
$$ plain form
12168 4176871 4201628 4214729 4257952 4294665 4225001 4149367 4029398 4048430 3897523 3831764 3826383
12157 3826383 3807287 3653599 3547938 3723805 3709198 3760029 3767662 3722820 3568750 3619233 3599174
12146 3599174 3481671 3465087 3418225 3459254 3343756 3269654 3315904 3249703 3290496 3342755 3449432
12135 3449432 3379287 3309072 3280248 3365367 3417582 3486159 3463748 3487240 3370657 3285100 3309156
12124 3309156 3304762 3329532 3325028 3267900 3264847 3200528 3216513 3153653 3127525 3278820 3299052 3269701
12112 3269701 3270317 3096331 3031914 3161395 3173102 3087159 3057406 3056758 3053452 3037444 3102568 3106082
12100 3106082 3131427 3124875 3165170 3148048 3113737 3097657 3019387 3082730 3241001 3209660 3143657
12089 3143657 3146401 3217115 3334072 3225830 2994787 2913516 2836051 2862533 3064750 3221776
12079C221776k5543j31979m7664K6330N3612J41125m6532p2087P8873M2401m5218
12068C195094j8844K6750J2442J2721j2069j20480o5978k9874M1954R8636m3555
12057C096797m6389M3402O8519J9518L4430j17302m8733P7421O7580j34621q100
12046C052522O030o6446K6120o1212n5404Q6632l453J8243K0146N9975K491K6857
12034C112501k00083j54064O0799J45134O0612q6031l0887n0039j192O0814n5869
12023B861695J26158J48570N9617M8561K1083l5480n4489j17865q7955K5893r7339
12012B898449m0628l7216M5525Q9592o7697j96088r7298l6446J07753J27700M3896
12001B837542N7854P5513Q4142p711n6121J7726N3556o2346o0888M3660O8024
$$ plain form
12079 3221776 3196233 3064254 3016590 3042920 3096532 3237657 3191125 3119038 3197911 3240312 3195094
12068 3195094 3176250 3203000 3215442 3228163 3216094 3095614 3029636 2999762 3041716 3140352 3096797
12057 3096797 3050408 3093810 3162329 3181847 3216277 3098975 3050242 3127663 3195243 3060622 3052522
12046 3052522 3058552 2992106 3018226 2957014 2901610 2988242 2984789 3003032 3023178 3083153 3085644 3112501
12034 3112501 2912418 2758354 2819153 2964287 3024899 2938868 2907981 2857942 2856750 2917564 2861695
12023 2861695 2987853 3136423 3196040 3244601 3265684 3230204 3175715 3057850 2969895 2995788 2898449
12012 2898449 2857821 2820605 2866130 2955722 2888025 2691937 2594639 2558193 2665946 2793646 2837542
12001 2837542 2895396 2970909 3055051 3047340 2991219 3008945 3062501 3000155 2939267 2982927 3050951
11990C050951j2734j01285j9988j36874j4311J49329n0571l8685J07390J11175
11980C044397q5988J4452J7680j3461n1276j00150J42727k1725j0066l9132j48261
11969B749197o5583Q2267K0439j08814O4442J59831j05813k12306J78268J91489
11959B953417L1125L4780k2281n1140r2062N1380J49108m3855j82213n8931L0212
11948B799540K04964J54904j3217q1597M768j7442n6834l0671N1318m3419o8968
11937B903346J80180Q5807M3247J42833O8862k04962j0680K3607j563J5341r2597
11926C153421L6638K4103N2065J12277R7762m7699o6937q7235M9922m0071K6669
11915C310915O2992K31273M8194o804m6886K0469q8519l4763J16167Q4095M1419
$$ plain form
11990 3050951 3038217 2936932 2916944 2780070 2765759 2915088 2864517 2825832 2933222 3044397
11980 3044397 2958409 2972861 2990541 2977080 2925804 2825654 2968381 2946656 2936590 2897458 2749197
11969 2749197 2683614 2765881 2786320 2677506 2741948 2901779 2795966 2583660 2761928 2953417
11959 2953417 2984542 3019322 2997041 2945901 2853839 2905219 3054327 3010472 2828259 2769328 2799540
11948 2799540 3004504 3159408 3146191 3064594 3069362 3051920 2995086 2964415 3015733 2972314 2903346
11937 2903346 3083526 3169333 3212580 3355413 3424275 3219313 3208633 3232240 3230677 3246018 3153421
11926 3153421 3190059 3214162 3266227 3378504 3476266 3428567 3361630 3274395 3324317 3284246 3310915
11915 3310915 3373907 3605180 3653374 3646570 3599684 3620153 3531634 3496871 3613038 3697133 3738552
11904C738552J06455K7547L1441J29817K19072J43935R902L8733J28331P1301
11894D645086P3468J64141R9025R4427K16713K06093J07777J03868O6397J09384
11884E886379k0428O6793J68795O1134J39541k271n1791o5329P7329J48690k8932
11873F379910J24227J3279k8466J24860J05575J63132J50584M2404K6863j5298
11863G087070N0803J72499J07093J8596M3243J68362K36489J93608O144L0074
11853H113981J78983K49287K68906K83062L43482L71335K54309L76942M90096
11844A0930383O36953N55008O55884O45059P34286P68003N95806O86842O90449
11835A6898673Q03705R38615J081228J161671J053664R73353J299598J372170
$$ plain form
11904 3738552 3845007 3872554 3903995 4033812 4252884 4396819 4406721 4445454 4573785 4645086
11894 4645086 4718554 4882695 4981720 5076147 5292860 5498953 5606730 5710598 5776995 5886379
11884 5886379 5865951 5932744 6101539 6162673 6302214 6299943 6248152 6182823 6260152 6408842 6379910
11873 6379910 6504137 6517416 6488950 6613810 6719385 6882517 7033101 7075505 7102368 7087070
11863 7087070 7137873 7310372 7417465 7436061 7479304 7647666 7884155 8077763 8083907 8113981
11853 8113981 8292964 8542251 8811157 9094219 9437701 9809036 10063345 10440287 10930383
11844 10930383 11567336 12122344 12778228 13423287 14157573 14925576 15521382 16208224 16898673
11835 16898673 17702378 18640993 19722221 20883892 21937556 22910909 24210507 25582677
11827B5582677J298415J503026J667503J796411K082265K388938K809919L172412
11819D2301566L920265M523001N565145O556703P310280P973720Q420776Q600577
11811I5172033Q067806P268689O198452M457533K255403J46619j848401l167970
11803A18550164l996849m082076l324224k559252j365427l28328K88526R42763
11795A04125297J352077J841993K079790K197674K477461K645034K764004K773174
11787A22256504K735848K954442L100042L168855L233782L227309L282024L314545
11779A47273351L820064M379897N472033P068341R294562J2134405J4914480J7674022
11771B22031155J9749500K0607166K0035787J7922301J4497411R313320K547292
$$ plain form
11827 25582677 26881092 28384118 30051621 31848032 33930297 36319235 39129154 42301566
11819 42301566 46221831 50744832 56309977 62866680 70176960 78150680 86571456 95172033
11811 95172033 103239839 110508528 116706980 121164513 123419916 123566535 121718134 118550164
11803 118550164 114553315 110471239 107147015 104587763 103222336 102894008 103182534 104125297
11795 104125297 105477374 107319367 109399157 111596831 114074292 116719326 119483330 122256504
11787 122256504 124992352 127946794 131046836 134215691 137449473 140676782 143958806 147273351
11779 147273351 151093415 155473312 160945345 168013686 177308248 189442653 204357133 222031155
11771 222031155 241780655 262387821 282423608 300345909 314843320 324156640 326703932
11764C26703932n280409j3069459j9090915k2603388k3194312k1413013j8408641
11757B03643795j4939506j1612884q716367o631052n117133m377111l791172l373844
11749A45084726l389876l329713l313357l280753l155557l030849k885163k629979
11741A20069479k270216k015164j940695j790573j628130j230921n94648r822
11733A08589310P06211J707937K520177L468982M086633L936839L419763K538025
11725A30973877J109626o62280k842071n309524p551288q982623r943533j0091106
11717H6701078r637202q588872p276012o163012n239093m315199l405345k772160
11709C9304183k346747j991814j954927j723189j523527j401614j345194j181262
$$ plain form
11764 326703932 321423523 308354064 289263149 266659761 243465449 222052436 203643795
11757 203643795 188704289 177091405 168375038 161743986 156626853 152249742 148458570 145084726
11749 145084726 141694850 138365137 135051780 131771027 128615470 125584621 122699458 120069479
11741 120069479 117799263 115784099 113843404 112052831 110424701 109193780 108599132 108589310
11733 108589310 109295521 111003458 113523635 116992617 121079250 125016089 128435852 130973877
11725 130973877 132083503 131421223 128579152 123269628 115718340 106735717 96792184 86701078
11717 86701078 77063876 68475004 61198992 55035980 49796887 45481688 42076343 39304183
11709 39304183 36957436 34965622 33010695 31287506 29763979 28362365 27017171 25835909
11701B5835909j151061j101271j020207j085033j029133j127736j092318q83569
11693A7345581p96471p81488q20640p63408o88074o45111n95159n83649p34070
11684A0937511n07313l45546k06646j81015k75386m00342k96340j16989j90087
11675H417847k47581r4299n2113j13845l9187j41650j15819j28596j32962p9397
11665G272398k24522n5297n6659j71991K208o7411o752r5850j28584N0559n6948
11654F461151o9061J09550j25028j38572k04178j80916k17001r5839j21200k60988
11644E157918m9997K6128o7479j90518j64462j3438p0133j24108j50444q936j12396
11633D232135l50818k12949q291l5983j17967p2794j77691n5634j2985j42946
$$ plain form
11701 25835909 24684848 23583577 22563370 21478337 20449204 19321468 18229150 17345581
11693 17345581 16549110 15767622 14946982 14183574 13495500 12850389 12255230 11671581 10937511
11684 10937511 10430198 10084652 9878006 9696991 9421605 9021263 8724923 8607934 8417847
11675 8417847 8170266 8075967 8023854 7910009 7870822 7729172 7613353 7484757 7351795 7272398
11665 7272398 7047876 6992579 6935920 6763929 6766137 6698726 6691974 6596124 6467540 6518099 6461151
11654 6461151 6392090 6501640 6376612 6238040 6033862 5852946 5635945 5540106 5418906 5157918
11644 5157918 5107921 5134049 5066570 4876052 4711590 4698152 4628019 4503911 4353467 4344531 4232135
11633 4232135 3881317 3668368 3660077 3624094 3506127 3433333 3255642 3200008 3187023 3044077
11623C044077r4029K3720K7264j51066o2910j6479K1695M7542m839j94353k6855
11612B613767k4121J2750o8622Q790j45396n9678j31104m8060m843r6640J08826
11601B165669O6628j20275n1574J00910j8553q4968J8559p9296J9776J7273l2124
11590B002025j02179m7750Q1414J11311j846j11745q0268k32476J17907O8904
11580A805297o6389J3634L4701j34493p4027m5799O6023M0868P7695k4187j1753
11569A681570p5664p3200p0876m4401L2433N5402K2559P2070q072j12881k30857
11558A248083J5110J86313j9751j2039o5837m7845R2069J33336Q8170o1438q9031
11547A467140n3991o5051k7979n8071M1700L108K6788P38k8317r8768l9623J47080
$$ plain form
11623 3044077 2950048 2973768 3001032 2849966 2787056 2770577 2792272 2839814 2834975 2640622 2613767
11612 2613767 2589646 2602396 2533774 2542564 2397168 2337490 2206386 2158326 2153483 2056843 2165669
11601 2165669 2232297 2112022 2060448 2161358 2142805 2057837 2076396 1997100 2016876 2034149 2002025
11590 2002025 1899846 1852096 1933510 2044821 2042975 1931230 1850962 1618486 1736393 1805297
11580 1805297 1738908 1752542 1787243 1652750 1578723 1532924 1598947 1639815 1717510 1693323 1681570
11569 1681570 1605906 1532706 1461830 1417429 1449862 1505264 1527823 1599893 1591821 1478940 1248083
11558 1248083 1263193 1449506 1429755 1417716 1351879 1304034 1396103 1529439 1617609 1556171 1467140
11547 1467140 1413149 1348098 1320119 1262048 1303748 1306856 1333644 1334382 1306065 1207297 1167674 1314754
11535A314754n9593P640o7168k2353O2993M9130L7413r4183q3814j61079r8402
11524H85338J23357L7107J2635l0538P2362J82612m2135j54496K1402o1343k3626
11513A022675J1291l6705K197L0831J40716R6588L6095J538O4911l9906L5817
11502A366048j29039l5555m8261M6939M2317l4958j04565j26320j34302k1582
11492H20722K1637N966J519J95155Q3966m951L186j17179l9061q6203R984M7381
11480I42122j51711j6042J94363J4520j63590K5595Q2617J6223n9922J51995j1517
11469A024653j52517m2675J28027R0369j23824j31178j7176l0885N4162Q5309
11459H84265Q7447N371k847p8601j4278P6593K958J2050q5592k1780n550j2348
$$ plain form
11535 1314754 1255161 1262801 1195633 1173280 1236273 1285403 1322816 1228633 1144819 983740 885338
11524 885338 1008695 1045802 1058437 1027899 1100261 1282873 1240738 1086242 1107644 1046301 1022675
11513 1022675 1033966 997261 999458 1030289 1171005 1267593 1303688 1305226 1370137 1330231 1366048
11502 1366048 1237009 1201454 1153193 1200132 1242449 1207491 1102926 976606 842304 820722
11492 820722 842359 848325 849844 1044999 1128965 1124014 1127200 1010021 970960 884757 894741 942122
11480 942122 790411 774369 968732 983252 819662 845257 927874 944097 884175 1036170 1024653
11469 1024653 872136 829461 957488 1047857 924033 792855 775679 744794 798956 884265
11459 884265 971712 977083 974236 895635 881357 957950 960908 972958 887366 865586 860036 847688
11447H47688J0250J6280q8844k4573k1467J21629N2921O8183q6832R936J03595
11436A008766r1966j21205j8556k9755K3065n9826J8248J04937J9976j26009n8115
11425F69560J65506j117k5403P6136K8511k6880o4311M3704j4302j55294q3716
11414F12394P7289Q7946n0095r0003m0658k8770J09217Q9541K1466L7377n7585
11403G68119j56222L7248O3670Q2291O3252p190j45766o6803L5719l6479n4300
11392E83539R0263N0389J05171j4237n525j2538l0454k11029o2840K45728J37323
11381H75790N3250P6641P8111J3902r0458j01241j8128n333n9995O9367J52550
11370A044456N2281l4549j5186M4993r0315Q1352q3818N7591K20165J13466K3577
$$ plain form
11447 847688 857938 874218 785374 760801 739334 860963 913884 982067 895235 905171 1008766
11436 1008766 916800 795595 777039 747284 770349 710523 728771 833708 853684 727675 669560
11425 669560 835066 833949 808546 884682 913193 886313 822002 865706 851404 696110 612394
11414 612394 689683 777629 727534 637531 596873 568103 677320 766861 788327 825704 768119
11403 768119 611897 649145 712815 795106 858358 851168 705402 638599 674318 637839 583539
11392 583539 673802 724191 829362 815125 809600 797062 766608 555579 492739 738467 875790
11381 875790 929040 1005681 1083792 1097694 1007236 905995 887867 882534 822539 891906 1044456
11370 1044456 1096737 1062188 1047002 1091995 1001680 1083032 999214 1056805 1276970 1390436 1414013
11359A414013o2145p3428q8069k8914J7889j02922o3678O774N3229K9008m876
11348A096881n8089n132N7005Q9613P1244O5235m7660l5343j768J57604J28417
11337A518007L1473m1873q2120m0699j38952k3357N5920J34237J72597J36857
11327A722090L9505J95784K10948O1312m4245K2910N022j03395q8138j0988k624
11316B008181L0254j73349j27147o2205o8736j32243k7295j77353m9765R3334
11306A313676l3701j69992O6371N0860l3334n1844K6855o638K0930j82463J6616
11295A017336K48241O7759J45010O4820j02818o9103j3819j0626j08290l8823
11285A199687j3280k6427K6739P3153K1641p3781r2782l9801J57230R1859J24454
$$ plain form
11359 1414013 1351868 1278440 1190371 1161457 1179346 1076424 1012746 1019520 1072749 1101757 1096881
11348 1096881 1038792 1033660 1090665 1180278 1251522 1316757 1269097 1233754 1231986 1389590 1518007
11337 1518007 1549480 1507607 1425487 1384788 1245836 1222479 1278399 1412636 1585233 1722090
11327 1722090 1761595 1957379 2168327 2229639 2185394 2208304 2213326 2109931 2021793 2010805 2008181
11316 2008181 2038435 1865086 1737939 1675734 1606998 1474755 1447460 1270107 1220342 1313676
11306 1313676 1279975 1109983 1176354 1227214 1193880 1142036 1168891 1162253 1183183 1000720 1017336
11295 1017336 1265577 1333336 1478346 1543166 1440348 1371245 1357426 1346800 1238510 1199687
11285 1199687 1186407 1159980 1186719 1259872 1281513 1207732 1114950 1075149 1232379 1324238 1448692
11274A448692o2213j93313j33775o4278n1255L0112j75398k44234Q9155K32501
11264H75994j49920r0079p2036Q8000O209l8362k9669j39267l1659J78045R2169
11253F89425J0135K7061J8373Q8108k04446l8455J95917J00015p17j00773q0152
11242G04491J8335M3274j25328R075J8677j4552n2878j02407p5359L6339M5737
11231E05404P8134N9005K0616L3230l2356Q0403n3659j19106K2241n802R2718
11220F80828P8885n0765k9205N5539p8618k2577k6018Q1852n5100n2056p057J3159
11208E88867m984j38980j62646Q3421Q2109m2916j41894n0346J02737J17301J49339
11197E82008l9309j25163l603o6880m7113J58870j4814r7361j18998J5294m8196
$$ plain form
11274 1448692 1386479 1193166 1059391 995113 943858 973970 798572 554338 643493 875994
11264 875994 726074 635995 563959 651959 658168 619806 590137 450870 419211 597256 689425
11253 689425 699560 726621 744994 833102 628656 590201 786118 886133 885416 784643 704491
11242 704491 722826 766100 640772 649847 668524 653972 601094 498687 423328 459667 505404
11231 505404 583538 642543 663159 696389 664033 744436 690777 571671 593912 588110 680828
11220 680828 759713 708948 679743 735282 656664 634087 608069 689921 634821 582765 575708 588867
11208 588867 583883 444903 282257 365678 447787 404871 262977 212631 315368 432669 582008
11197 582008 542699 417536 413933 347053 299940 458810 443996 346635 227637 242931 194735
11186A94735j6082N8508K8417k6221O5895n4876O1512J62080r6582q1195K0260
11175C16451L4776k7216m6436M253J071m1027j2397P5202N8989M3779J06019j38844
11163C74620p1118m7432J673J04509J51439P3499K5502j8231k31576o0301J11305
11152D13889K9986p1726j3138J1423q323m8637n833Q0512J7843J1449m6728R8379
11140D69096r4186m2737L4446Q3265J2144j01458n6359q542m9489q8739j46121
11129A1320J33127K11573j2415Q813l5172l4812j32294m9444P819J67198N7196
11118C32909O4104L0711M3406K992P501q2167m5695L6359l2860M7632J35944M4670
11106E85506j18706k02539k853J6584m5565R9218K5998l0698j0569l2364M098
$$ plain form
11186 194735 178653 237161 265578 239357 305252 250376 311888 473968 377386 296191 316451
11175 316451 351227 324011 277575 281828 282899 241872 229475 304677 363666 407445 513464 374620
11163 374620 303502 256070 257743 362252 513691 587190 612692 594461 362885 302584 413889
11152 413889 443875 372149 359011 370434 362111 313474 307641 388153 405996 417445 370717 469096
11140 469096 374910 332173 366619 449884 462028 360570 304211 295669 246180 157441 11320
11129 11320 144447 356020 343605 352418 317246 282434 150140 100696 108515 275713 332909
11118 332909 397013 427724 471130 474122 481623 399456 353761 390120 357260 404892 540836 585506
11106 585506 466800 264261 261408 277992 232427 331645 357643 326945 316376 284012 288110
11095B88110J3839J45294N9392m7526j35010p6380L2621Q7061q2924L2954K7571
11084C45002p4760l1018O3186N6027Q8096j33359j48987J08050r1683q3480M7297
11073A44371J25842m6229J49229n8441l1401J50045m362l2434K287j08104J14532
11062D05335o3432N9596k6280K0965M8164J390O0195l4110K8488J20227J33482
11051G54020J1486M1693n9143J8979K1036l6433J25308L3787k5626K5970M5304
11040I56381J23065O1543n5357n0784r0906l2001q1689K2967J52652Q6877j34385
11029I58363j40823J21302K38713O7569M8446m84q8432j1514l0648k4217j56143
11018I82132j46948q4112M0458O7512L2350m6091M7300p23k332j7528p7452J8285
$$ plain form
11095 288110 301949 447243 506635 459109 324099 247719 280340 367401 284477 317431 345002
11084 345002 270242 239224 302410 358437 446533 313174 164187 272237 180554 97074 144371
11073 144371 270213 223984 373213 314772 283371 433416 429054 396620 398907 290803 405335
11062 405335 341903 401499 375219 396184 444348 445738 505933 471823 500311 620538 754020
11051 754020 765506 807199 748056 767035 788071 751638 876946 910733 885107 911077 956381
11040 956381 1079446 1140989 1085632 1034848 943942 911941 830252 853219 1005871 1092748 958363
11029 958363 817540 938842 1177555 1245124 1293570 1293086 1204654 1193140 1162492 1138275 982132
11018 982132 835184 751072 791530 859042 891392 845301 892601 891878 889546 872018 794566 812851
11006H12851n7581k2364L179l4529j15481Q6700J10981R3443n550p7725k2179
10995G71745R9659j06858j69525j21922O0645k0684r0267M238q5251Q0400J4623
10984D36803m3127p2895Q7822J6863j40089J1333m3073n0125j00033q3109l0887
10973a0517P4156j7247j8984N4805J05784L9150N0410q2514j02531L5173J05958
10962B33643J39278j23115j43169R6935J90482J24852j56964j9086K8955l6038
10952C35773k5171N7150m8833Q2204J53685J00595j12288p4176j02218p8086k0291
10941B68344M3858k6279J12893n6596l2104Q506L2677J11588k251m8746J65872
10930E77762j3328j5347j1836p4325j45586L1220J43521q9473j3559N9449J9864
$$ plain form
11006 812851 755270 732906 736085 701556 586075 672775 783756 877199 871649 793924 771745
10995 771745 871404 764546 595021 473099 533744 513060 422793 427031 341780 422180 436803
10984 436803 393676 320781 408603 425466 285377 296710 253637 203512 103479 20370 -10517
10973 -10517 63639 46392 27408 82213 187997 227147 277557 195043 92512 127685 233643
10962 233643 372921 249806 106637 203572 394054 518906 361942 342856 371811 335773
10952 335773 310602 367752 318919 401123 554808 655403 543115 468939 366721 288635 268344
10941 268344 312202 285923 398816 342220 310116 318622 351299 462887 460636 411890 577762
10930 577762 564434 549087 537251 462926 317340 348560 492081 402608 389049 448498 468362
10919D68362N7865k9408M5524N2578j33549k3466O0156J41359k7363M5700p9725
10908E78033j80855l6624p2174J77344N9135p1497j21125j24208k1558Q2074M9191
10897C17736M3126j4228O0995J34061K4457p1155j20487q8994j664J11500j22405
10886B72942p518K1560l6117M3029O5296r6936o726Q8617J01881K995j20875k33325
10874I4823l2807J13382R5810k8002R9185o3460L8299L0623L8218O0204M0363
10863D86638L9172n5892q0241J5741o111L2473J27999q55j18892L3900R2591o4601
10851E01922q5510N7595J02007N6688p2759n6755J8489p7545k9282n7808k9917
10840C27125q250j5554O938n6091m0041J6551J22422j37605M2588J68685p262
$$ plain form
10919 468362 526227 496819 542343 594921 461372 437906 498062 639421 612058 657758 578033
10908 578033 397178 360554 288380 465724 524859 453362 332237 208029 186471 268545 317736
10897 317736 360862 346634 407629 541690 566147 494992 374505 285511 283847 395347 272942
10886 272942 265424 286984 250867 293896 359192 262256 255530 344147 446028 449023 328148 94823
10874 94823 62016 175398 271208 243206 342391 278931 317230 347853 386071 446275 486638
10863 486638 525810 469918 389677 405418 399307 431780 559779 558924 440032 473932 566523 501922
10851 501922 416412 474007 576014 632702 559943 503188 521677 444132 414850 357042 327125
10840 327125 318875 303321 310259 254168 214127 230678 353100 215495 258083 426768 419506
10829D19506M4364m1887L0417p5755P1328j8371P3098k046r4573p587j80918K2282
10817B39858m9200k3236p6110k8233N9255J29947j8388L3760J8075M7892L0306
10806C63926k1661n2415k7368M8664n0304J3938N0605n6844n8804n9735o2262
10795H7740J04010M4185K4725Q7316l0513l1606K000L8495K5793k52l5337P0204
10783C86760M8950q9750n5894R4392Q8637J2808r2286j28749O9027Q7719j02700
10772C18914n3928M5499j01098o8450J43283J69503J43596J4923M1466m5155j53583
10761D54970p389l6960j53145K2259N3444m320J8041J12957J231k5280p1787j29530
10749B34491M1620J57182O4356J2628m9906O2969N0993n6010j11393j08012n985
$$ plain form
10829 419506 463870 421983 452400 376645 447973 429602 502700 500654 406081 398494 217576 239858
10817 239858 190658 167422 91312 63079 122334 252281 233893 267653 285728 333620 363926
10806 363926 342265 289850 262482 311146 260842 274780 325385 268541 209737 150002 87740
10795 87740 191750 235935 260660 347976 317463 285857 287857 326352 352145 351893 316556 386760
10783 386760 435710 345960 290066 384458 473095 485903 393617 264868 333895 421614 318914
10772 318914 264986 310485 209387 140937 284220 453723 597319 612242 653708 608553 454970
10761 454970 447581 410621 257476 279735 333179 328859 346900 459857 461088 435808 364021 234491
10749 234491 276111 433293 497649 510277 460371 523340 574333 518323 406930 298918 292933
10738B92933m754k6864J42433K29975N9345k1098L775q6319J7794J0917p6717
10727E41420L4093k3083J21115M0744m4443J7102j45545j71671J02373N9790o6708
10716D65187J29216n808j7793J08901J34874n8468k09865l2702l0229N6074m194
10705E35193J29009Q2538n6185p2721j1234J3558r0509q572P636k6380j9275N2906
10693E35964J9721J69918J4917m6809q830j0716o0988k6457o4950m8048Q1321
10682E55043J31557o1928n1814R6570l5427r4819Q6484j5659J55589J98451k7619
10671I36428K4213M7607j5914j06781n1953n0918J05247P5394J21570J29727M5100
10660A259720R838J02083P1022n6593J8273l4716O8414Q3172Q6974j53102K4543
$$ plain form
10738 292933 288179 261315 403748 633723 693068 671970 675745 589426 607220 618137 541420
10727 541420 575513 552430 673545 714289 669846 686948 541403 369732 472105 531895 465187
10716 465187 594403 588595 570802 679703 814577 756109 546244 513542 483313 539387 535193
10705 535193 664202 746740 690555 617834 606600 620158 529649 521077 528713 502333 483058 535964
10693 535964 555685 725603 740520 693711 684881 674165 613177 586720 521770 473722 555043
10682 555043 686600 624672 572858 669428 634001 539182 625666 610007 765596 964047 936428
10671 936428 960641 1008248 992334 885553 833600 782682 887929 963323 1084893 1214620 1259720
10660 1259720 1269558 1371641 1442663 1386070 1404343 1369627 1438041 1521213 1608187 1455085 1479628
10649A479628J25183J0852O7306J87963P2778R5643J91019J75020K24226J59926
10639B789544J32490J25502K91305M00813N06595O09633O59424P88778O85243
10630F989327P84926R55887J167886J425559J902626K485595K935350L602560
10622B2249716M370694M969684N447183N542203N324676M859450M031032L062519
10614E9857157K118013J792858K222455L699578N772763P416897Q402694Q253614
10606I9536029P507572O596095M812867J872548j186326k419289j293328J350334
10598A16776502M513349O938028Q076618P719010O449626M518358J546426l314945
10590A53222972q439511j0752708r554384o504355l383202o99472O43342Q57797
$$ plain form
10649 1479628 1604811 1615663 1682969 1870932 1943710 2039353 2230372 2405392 2629618 2789544
10639 2789544 2922034 3047536 3338841 3739654 4246249 4855882 5515306 6304084 6989327
10630 6989327 7774253 8730140 9898026 11323585 13226211 15711806 18647156 22249716
10622 22249716 26620410 31590094 37037277 42579480 47904156 52763606 56794638 59857157
10614 59857157 61975170 63768028 65990483 69690061 75462824 82879721 91282415 99536029
10606 99536029 107043601 113639696 118452563 120325111 119138785 116719496 115426168 116776502
10598 116776502 121289851 128227879 136304497 144023507 150473133 154991491 156537917 153222972
10590 153222972 144783461 134030753 124476369 117972014 114588812 113889340 114532682 115390479
10582A15390479K44878q12228k910737o071953q932613r918289r100971p068754
10574G0819812m696210l286004k333854j909480j992124k518434l357322m638529
10566D6087855n748998n984004n657800m664008l865163l239354k352444j901103
10558A2674981j667274j322043j143164r31242o66553o03377o03790m07562m62892
10549D867084k74422k61681j73068k87876m21231k92408j07083k3952r0940j11724
10539B822699j82843n5432j32682r5335L676J1817k35632j92287k9217n4866K8336
10528A888234o7934j75411j56583m7512J37634n8646m4802o8488p2282p2050q410
10517A253750L5258m2721k42057n3495j04439R0771L0501J1592k22230j23167
$$ plain form
10582 115390479 115635357 114823129 111912392 105840439 96907826 86989537 77888566 70819812
10574 70819812 66123602 62837598 60503744 58594264 56602140 54083706 50726384 46087855
10566 46087855 40338857 34354853 28697053 24033045 20167882 16928528 14576084 12674981
10558 12674981 11007707 9685664 8542500 7611258 6944705 6341328 5737538 5329976 4867084
10549 4867084 4592662 4330981 4157913 3870037 3448806 3156398 3049315 3025363 2934423 2822699
10539 2822699 2639856 2584424 2451742 2356407 2360083 2371900 2136268 1943981 1914764 1859898 1888234
10528 1888234 1820300 1644889 1488306 1440794 1578428 1519782 1474980 1406492 1334210 1262160 1253750
10517 1253750 1289008 1246287 1004230 950735 846296 937067 967568 979160 756930 633763
10507F33763l9342J03659j2107N1078J49808k3128q2402n5114j06791K49944O4248
10496I33616K3390l506j29703k02821L4961J40584L7931j74592l1982o6827K052
10485E63103m6225p3345N1063K3357O7472J90951O472j59052q2250n7504K9704
10474E13746M9090k6642j09702K9614j7709K7515P7289O4636N6019q4500k8964
10463E50392l0197j1485o1434j5852O8597O2707p4952p0957J29039K4079j13934
10452D56003p3171Q520J07350O8065j59708j47824P1659L2670L1993J07093r7841
10441D04809O387J35886J0970k1085r3278n2587j03681Q6146O5272o2638r073
10430C67128L3612j3869m8499j5801N9144M3758L9014o1367p1109l4500J31887
$$ plain form
10507 633763 594421 698080 685973 737051 886859 863731 781329 726215 619424 869368 933616
10496 933616 957006 953500 823797 620976 655937 796521 834452 659860 627878 561051 563103
10485 563103 516878 443533 494596 517953 585425 776376 782848 623796 541546 484042 513746
10474 513746 562836 536194 426492 456106 438397 465912 543201 607837 663856 579356 550392
10463 550392 520195 508710 447276 431424 500021 562728 487776 416819 545858 569937 456003
10452 456003 382832 391352 498702 566767 407059 259235 330894 363564 395557 502650 404809
10441 404809 411196 547082 558052 536967 443689 391102 287421 373567 438839 376201 367128
10430 367128 400740 386871 338372 322571 381715 425473 464487 403120 332011 297511 429398
10419D29398O2911m4646j94596Q918J85755p8696q7685R0745l000j60582j31305
10408G7217K905J02605J05247P3519j4188k9674J16665N921q7871k2607j5401
10397C14338J3696J40028r4723j3956n2162k6742M3534j84956M967J28186q0477
10386A91733J09066J01652r3443p7675r628n4035q874R3506p778j56466m1676
10375D6382J255N5536K2665O7571J43986N3781n0065N2151j26713K9991j1990
10364B84550k0831n8853j24587o2950J59789J14239Q1420p5617n4137J20996J46852
10353E10871K0865l7718j15959j11477p8390r914m5955N4885L3195K4606o9762
10342A75247j61812m7984J03552O1594O4558L2947n2458j9955q2335M5281r092
$$ plain form
10419 429398 492309 447663 253067 261985 447740 369044 281359 372104 369104 208522 77217
10408 77217 80122 182727 287974 361493 347305 317631 434296 440217 352346 329739 314338
10397 314338 328034 468062 373339 359383 307221 280479 324013 139057 144024 272210 191733
10386 191733 300799 402451 309008 231333 221705 167670 158796 252302 244524 88058 46382
10375 46382 47637 103173 125838 193409 337395 391176 341111 393262 266549 296540 284550
10364 284550 263719 204866 80279 17329 177118 291357 372777 297160 243023 364019 510871
10353 510871 531736 494018 378059 266582 188192 178278 132323 187208 220403 245009 175247
10342 175247 13435 -34549 69003 130597 195155 228102 175644 155689 73354 118635 109543
10331A09543R4515N1949Q7959K6972j86654m8752J8583n6515J967P5061k0722
10320A53906k5560N1485k4843j42701N1468Q5701K4869j31707O9458J2132j9992
10309A04216L701p489k4384J07756P6075L5184n6675Q0622j18863m1136J30607
10298B89614k2408r3788J9103J8989J4916n9113L6411M6023q361j23482r0186
10287B7718K7209J38259J04336p0874j35830J8033J01097L7373j44351n7226J96465
10276B42209J2649m7599j26170o2399J34687J39719J00353q1334k805j69035n0823
10265H9452l1373J37718O4754N1294p2325j41370L4995O4241j63060o1685j0144
10254c7503n0980O0633M2979R3761J00625r0424n1356J00240P6811j8477M21j47973
$$ plain form
10331 109543 204058 256007 343966 370938 184284 135532 154115 97600 99567 174628 153906
10320 153906 128346 179831 154988 12287 63755 149456 174325 42618 112076 124208 104216
10309 104216 107917 100428 76044 183800 259875 295059 238384 319006 200143 159007 289614
10298 289614 267206 173418 192521 211510 226426 167313 203724 249747 241386 117904 27718
10287 27718 54927 193186 297522 226648 90818 108851 209948 247321 102970 45744 242209
10276 242209 254858 207259 81089 18690 153377 293096 393449 312115 309310 140275 89452
10265 89452 58079 195797 260551 311845 239520 98150 133145 197386 34326 -27359 -37503
10254 -37503 -88483 -27850 15129 108890 209515 119091 67735 167975 244786 226309 226730 78757
10242G8757J32607J25295p544m0158J0056k6731J55335M3908O4019k0941m2724
10231D71879L7190N359P3813m8576j75711j49841R765n777R3099J29044k8344
10220D11900j86783q9438q6458L8159m7777m1636m9057K39808J87845N4146j5229
10209D15480o5675J10753R3340K9484L0695n4038J43828J6497j29725j19240Q6952
10198E58351J12941P1910K2819J4091O4027J09914k7868R1980j7775L9580k6056
10187A013914j77621J1981q6852j32297m0562J68749M6705L6761n7455N8599j10934
10176G30988j3870Q8829l1126K8375Q4352J41975N5749Q0459J32004M4588o5105
10165A277218j55662j6329Q5061N3373K54673J43075K7058M1356o5062N0843K45458
$$ plain form
10242 78757 211364 336659 329115 288957 299013 272282 427617 471525 535544 514603 471879
10231 471879 509069 514428 588241 539665 363954 214113 223878 218101 311200 440244 411900
10220 411900 225117 135679 49221 87380 39603 -2033 -51090 188718 376563 430709 415480
10209 415480 349805 460558 553898 583382 614077 560039 703867 720364 590639 471399 558351
10198 558351 671292 743202 766021 780112 844139 954053 926185 1018165 1000390 1039970 1013914
10187 1013914 836293 848274 761422 629125 588563 757312 804017 840778 783323 841922 730988
10176 730988 717118 805947 774821 803196 887548 1029523 1085272 1165731 1297735 1342323 1277218
10165 1277218 1121556 1105227 1190288 1243661 1498334 1641409 1668467 1709823 1644761 1695604 1941062
10154A941062J89005J39798j93783j3553L9281J59333l4852j07151q5730k2237
10144B011173r8768j22237j53325m8869j26746k05003j61952n4398o7613q3717
10134H88545O017r7736q4025K383j05717j42665M8775K08649J19800j14245n960
10123G23821O8709Q1191L9886o9432R8749l2137j07104m7762O4332J04391L0743
10112I55387Q161p6897J99968J33702J027M2543K6903j34037K4881J66876m6304
10101A302210q5514k10552j23572k5739l2507j59063r1172j07768J2897O3947
10091E43167r4517L0074j1543Q1679P3604o7633j26399j30802p1744J08012P4939
10080D08837L5092J05896o1971P2493R678k3749j18051J40179K16960k6682j90078
$$ plain form
10154 1941062 2130067 2269865 2076082 2062529 2101810 2261143 2226291 2119140 2033410 2011173
10144 2011173 1912405 1790168 1636843 1587974 1461228 1256225 1094273 1039875 972262 888545
10134 888545 894562 796826 712801 715184 609467 466802 515577 724226 844026 729781 723821
10123 723821 792530 873721 913607 844175 942924 910787 803683 755921 820253 924644 955387
10112 955387 963548 886651 1086619 1220321 1221348 1263891 1290794 1156757 1181638 1348514 1302210
10101 1302210 1216696 1006144 882572 856833 824326 665263 574091 466323 479220 543167
10091 543167 448650 478724 467181 548860 622464 554831 428432 297630 225886 333898 408837
10080 408837 443929 549825 487854 560347 570025 546276 428225 568404 785364 758682 568604
10069E68604p7465m535M848K5833J14455J0254k5584l0622j29168n2326k6776
10058C77518J0522q2449N2438J7299J3940m266J15525O8196j93514j72297m3685
10047A59227j110K6406l0331R3297J38976j01602r1848J70247Q6646r3714k0580
10036C35614k862m6595K4667N6941Q7796O6033K2423o2129L0289K4575N357j34267
10024D07842q9247M7777P689Q1910L5248J2062j9095M2061k5287j04026r8213
10013B98721R3853k8960J2331J06077n7182q6092k538q4309J4760J1024q5948
10002A91737m1982K00845K41681J34305K7047Q2709L8316r0081o8033m9761l5637
9991F31146k3565J11176J30583l3331m6329K4932j75717j92525J01739N4805q7172
$$ plain form
10069 568604 491139 486604 491452 517285 631740 641994 616410 585788 456620 404294 377518
10058 377518 388040 305591 358029 375328 389268 385002 500527 568723 375209 202912 159227
10047 159227 158117 184523 154192 247489 386465 284863 193015 363262 449908 356194 335614
10036 335614 332752 286157 310824 367765 455561 521594 544017 481888 512177 536752 542109 407842
10024 407842 318595 366372 374061 455971 491219 503281 484186 526247 500960 396934 298721
10013 298721 392574 363614 375945 482022 424840 338748 336210 251901 266661 277685 191737
10002 191737 149755 350600 592281 726586 753633 836342 874658 784577 716544 666783 631146
9991 631146 607581 718757 849340 816009 769680 794612 618895 426370 528109 582914 495742
9980D95742J32769M1804j10491j471N6444n5431r5947n8926o3497k8399J10048
9969D22645J31566l8532l8969Q4908K8054r6445o9335N8420M5947L3645j7254
9958E44650N7922K5097q4779M1643M9948r1991j22736p496j3540q940J44123O8734
9946F02635J22970n5683q2182l3597k945Q4508J01976o9766j04955M0093j37068
9935D65986J11771N0898m2549k5115R8279Q9875q8733j06657j7708O8779L3583
9924F38409J2400M8245k7222n4107P3353P0900l0252L0558j19705j67457N8157
9913E33279J98959P9822l5157m2553L1416N8572k0416L598J50570O528M2385j9103
9901I87900o9931P1341k7699J02086L9699j3522L152P1968m1378o9379m7421O6353
$$ plain form
9980 495742 628511 670315 559824 558353 614797 559366 463419 404493 340996 312597 422645
9969 422645 554211 515679 476710 561618 589672 493227 423892 482312 528259 561904 544650
9958 544650 602572 627669 542890 584533 634481 542490 419754 412258 398718 389778 533901 602635
9946 602635 725605 669922 587740 554143 551198 635706 737682 667916 562961 603054 465986
9935 465986 577757 628655 586106 560991 659270 749145 660412 553755 536047 604826 638409
9924 638409 650809 699054 671832 617725 691078 761978 731726 762284 642579 475122 533279
9913 533279 732238 812060 776903 734350 765766 824338 803922 807520 958090 964618 1007003 987900
9901 987900 917969 989310 961611 1063697 1103396 1089874 1093026 1164994 1123616 1054237 1006816 1073169
9889A073169O0196N7742n4160L3210K0060M0803Q3049P29n8939q8827Q4348J39571
9877A390951l0407J04210K27755j2456l3813Q0583R7969R1821p2238O0973J03832
9866B009180n9812k3324J17748J33642J89474K14711L8543J82150J49693J06382
9856C058387K10094K75943L58919K05512N4111K31897L47618K91865J59828R3906
9846E288080J95774O0426l4272J66060K06670R5888J3559J64429P2625j12005
9836F117234j13062J09332K07511L0315K20430J26854J2412K38766L76848L91731
9826G718371K62803M05364N86898O74658O68982N75805P79251P70549M72488K76951
9816A3192120K46543K25649J53937q9295k63079l55318j18705k5821j85972k95998
$$ plain form
9889 1073169 1133365 1191107 1136947 1170157 1190217 1231020 1314069 1314798 1255859 1167032 1251380 1390951
9877 1390951 1360544 1464754 1692509 1680053 1646240 1726823 1824792 1916613 1844375 1905348 2009180
9866 2009180 1949368 1926044 2043792 2177434 2366908 2581619 2620162 2802312 2952005 3058387
9856 3058387 3268481 3544424 3903343 4108855 4162966 4394863 4742481 5034346 5194174 5288080
9846 5288080 5483854 5544280 5510008 5676068 5882738 5978626 5992185 6156614 6229239 6117234
9836 6117234 6004172 6113504 6321015 6351330 6571760 6698614 6711026 6949792 7326640 7718371
9826 7718371 7981174 8386538 8973436 9648094 10317076 10892881 11672132 12442681 12915169 13192120
9816 13192120 13438663 13664312 13818249 13728954 13465875 13110557 12991852 12966031 12780059 12484061
9806A2484061j34664M3567K7976K37218L42626M20356N09382O95895R38230J018078
9796A6582725J161834J324895J368032J664276K051730K302522K738852L241228
9788C2436094L764063M393101N333977O448926P410007Q505999R411279J0055170
9780H7758616J0226332R778776Q624325O518595M133223J357629j482446l928410
9772A22986640n602312n971656n324350m172902k634130j114087N35457K058141
9764A00760801L485593M710472N644169O263847O509937O339242N846405N082502
9756A44642968M207089K962189J785298J143464K94250r1753l65245n5728O23528
9747A55146060J451896K572679M504195P038246J0073940J3628166J7457241K0832468
$$ plain form
9806 12484061 12349397 12392964 12420940 12658158 13000784 13421140 13930522 14626417 15564647 16582725
9796 16582725 17744559 19069454 20437486 22101762 24153492 26456014 29194866 32436094
9788 32436094 36200157 40593258 45927235 52376161 59786168 68292167 77703446 87758616
9780 87758616 97984948 107763724 116388049 122906644 127039867 128397496 126915050 122986640
9772 122986640 117384328 111412672 106088322 101915420 99281290 98167203 98702660 100760801
9764 100760801 104246394 108956866 114601035 120864882 127374819 133714061 139560466 144642968
9756 144642968 148850057 151812246 153597544 154741008 155035258 154943505 154578260 154522532 155146060
9747 155146060 156597956 159170635 163674830 170713076 180787016 194415182 211872423 232704891
9739B32704891K3377693K3882645K2199790J8286535J2337520M684184m629280
9732C32843978j4039696k1545304k5762244k6233860k3952878k0286091j6210934
9725A84812971j2333119q892531o160808l915463k198847q11232J98441N71665
9717A51271077N49665K93834j57791q57300j824693k900904m224592n196259o010061
9708A30942976o708130o940542o595830n884535m763780l381579j871764l53667
9700I4443149J296215K563600L671318M427421M700972M366122L219687J403362
9692A20091846p96876l399727o050934q432629r781914j0220704r840080q903182
9684F2665800p904626o719675n709545m846752l918585l278447k682311k371016
$$ plain form
9739 232704891 256082584 279965229 302165019 320451554 332789074 337473258 332843978
9732 332843978 318804282 297258978 271496734 245262874 221309996 201023905 184812971
9725 184812971 172479852 163587321 157426513 153511050 151312203 150500971 150699412 151271077
9717 151271077 151820742 152114576 151956785 151099485 149274792 146373888 142149296 136953037 130942976
9708 130942976 124234846 117294304 110698474 104813939 100050159 96668580 94796816 94443149
9700 94443149 95739364 98302964 101974282 106401703 111102675 115468797 118688484 120091846
9692 120091846 119294970 115895243 109844309 101411680 91629766 81409062 71568982 62665800
9684 62665800 54761174 48041499 42331954 37485202 33566617 30288170 27605859 25234843
9676B5234843j996003j670560j388019j199474j033058j078731q77010o22725
9668A5369263n88524m03738k93872k53609l50954j77657r5515K274M7182R2435
9658A3347285R8396J62802K46713M6873m9596j56538j63161m61973o24896n15957
9648A1929948o38581p13778p21405n94002o16520m70209l01895l21676k27772
9639G324110k56087j67102l18298k71095R57j52151j18281O7047j262J08389O6242
9628F282469j43467j17994j53899p6256q4544l38200o4953j26816k44606k35456
9618D696278j32259j44334j75589j74908k25075k38318j10694j89325l24065m7194
9608B934517J79281j6792l25827r0821J66945M0363k39082j06133j42052k29184
$$ plain form
9676 25234843 23238840 21568280 20180261 18980787 17947729 16868998 15991988 15369263
9668 15369263 14780739 14377001 14083129 13829520 13478566 13300909 13205394 13207668 13254850 13347285
9658 13347285 13445681 13608483 13855196 13902069 13852473 13695935 13532774 13070801 12445905 11929948
9648 11929948 11291367 10577589 9856184 9262182 8645662 8175453 7873558 7551882 7324110
9639 7324110 7068023 6900921 6582623 6311528 6312485 6160334 6042053 6109100 6107838 6216227 6282469
9628 6282469 6139002 6021008 5867109 5790853 5706309 5368109 5303156 5176340 4931734 4696278
9618 4696278 4564019 4419685 4244096 4069188 3844113 3605795 3495101 3305776 2981711 2934517
9608 2934517 3113798 3097006 2771179 2680358 2847303 2887666 2648584 2542451 2400399 2171215
9598B171215j89391j75816o2485J07325J24605k17119k34878J7804J65010J06414
9588A812684j07239q1736p731k00780j48043N3825l4242L5873r712r4512K2037
9577A240424L0368k0652o8427j92988m0399K4611J53271L4629O0724P2551m7358
9566A246754j09285m6071q5081R7612j7552j48371n851j8466j30910Q228P0397
9555H61404j2604j77477o6446R8787J84615n0961o8221J0571J9461j57394r8190
9544E43545j13890N4086p0584R9772J3011M0375j86702O0167J13665Q0676O5600
9533F99721o0680j5992M0980n0324P9861K089j43603L3975N4578j1887M3241n4438
9521F17521K1042L0481l6111l6727J0586R8469N3656r4877j18075j50584o0676
$$ plain form
9598 2171215 1981824 1806008 1743523 1850848 1975453 1758334 1523456 1541260 1706270 1812684
9588 1812684 1705445 1623709 1615978 1415198 1267155 1320980 1286738 1322611 1312899 1218387 1240424
9577 1240424 1270792 1250140 1181713 988725 948326 972937 1126208 1160837 1221561 1294112 1246754
9566 1246754 1137469 1091398 1006317 1103929 1086377 938006 932155 913689 782779 791007 861404
9555 861404 848800 671323 604877 703664 888279 837318 769097 779668 799129 641735 543545
9544 543545 429655 483741 413157 512929 525940 566315 379613 439780 553445 634121 699721
9533 699721 639041 623049 664029 613705 693566 695655 552052 586027 640605 628718 671959 617521
9521 617521 638563 669044 632933 596206 606792 705261 758917 664040 545965 395381 334705
9510C34705J101j58028l0684N6141k2682K70888O4484j67963j22426R3994K14596
9499E34126L4531q4004o6202j1998J57844J26716j28361j00499j4833k8543p436
9488D11341m5750m9262O2387L2155j20880N3581J12586L5068Q464r3796j51842
9477B54052j0844J22581k3146q2788r00l7718L2131j50929q2243R5523J49418
9466B65137k5591Q4439P2058j38297j19095J9873q1445n9511O2672J37652J38584
9455C56476J07141k3868p7198o229R8621o6821m0590m7007Q5572Q4195j02595
9444C67697j04456q0544J63884L0169J9595j96884j62614M0568J38338m3833J08790
9433B80710P0316J16104K7077Q7711l8283q2198o5271j41177l3415L0731J13265
$$ plain form
9510 334705 335806 177778 147094 203235 180553 451441 515925 347962 225536 319530 534126
9499 534126 568657 484653 418451 406453 564297 691013 562652 462153 447320 418777 411341
9488 411341 365591 316329 378716 410871 289991 343572 456158 491226 499690 405894 254052
9477 254052 243208 365789 342643 259855 258955 221237 253368 102439 20196 115719 265137
9466 265137 239546 323985 396043 257746 138651 158524 77079 17568 80240 217892 356476
9455 356476 463617 439749 362551 356322 454943 388122 347532 300525 386097 470292 367697
9444 367697 263241 182697 346581 376750 396345 199461 36847 77415 215753 171920 280710
9433 280710 351026 467130 494207 581918 543635 461437 396166 254989 221574 252305 365570
9422C65570r1122l7907o7066J2780J59229J0405r8890n395M3383J2020J2869p6809
9410B39067k2734O3651O9820j8787J5324P8799J7887k4583N3148L8214M8639n2247
9398E06198l054Q0311l1924r8599j6388k668N0700k7537r5457o9461Q1831k3224
9386C50728m6176m1390J8306M2778K3394l6447R6871o9962r9608M1872R0222O3310
9374D33898K4146J5426R0201j8648j62168n5366n3469J34124J17310J1496k4301
9363E12649Q7586J06339J44454K31073j2262j04424J3434J38186o7853j00237
9353I48945o7766j6139j57579l9754L6811R5019l6204p9113K3305P4463j09577
9342F72411j56477l0858j23456J1340Q7156J74996j36651j50427l5006L6547J27602
$$ plain form
9422 365570 274448 236541 169475 182255 341484 351889 252999 247604 290987 303007 315876 239067
9410 239067 216333 279984 349804 331017 346341 425140 443027 418444 471592 509806 558445 506198
9398 506198 503144 583455 551531 452932 436544 433876 484576 457039 361582 292121 373952 350728
9386 350728 304552 263162 281468 324246 347640 311193 408064 338102 238494 280366 370588 433898
9374 433898 458044 473470 563671 545023 382855 327489 274020 408144 525454 536950 512649
9363 512649 600235 706574 851028 1082101 1069839 965415 978849 1117035 1049182 948945
9353 948945 881179 865040 707461 667707 704518 799537 763333 684220 707525 781988 672411
9342 672411 515934 485076 361620 372960 460116 635112 498461 348034 313028 349575 477177
9331D77177O7388M3496l8710j60124R4616J90534J32114N4938J5866N3298N2736
9320I83329J37854J01201j11782J66569K28619J34492O4998j4467o2893j96240
9310A431680r2869L2847o1272j55494j40937j47787j34297Q575j35151j89204
9300D16091j33719l6562l648K1529L3859M9108Q7243k8919J9505N073L8714j50535
9288C17739J4434J03390k7800J3834J16207N6667J30215n631j03139j48903Q7796
9277E54809J65163q722l1162J42106P2375K4315O2746N0737O1642o2489n3083
9266I78437j4039p7697r5875L0445o3989k318p2468j06850o1354j85497m7196
9255B81599R2950J25014j28849m2716k5291P59j5615J8200j07704n2428J8635
$$ plain form
9331 477177 544565 588061 549351 389227 483843 674377 806491 861429 877295 930593 983329
9320 983329 1121183 1222384 1110602 1277171 1505790 1640282 1705280 1690813 1627920 1431680
9310 1431680 1338811 1371658 1310386 1154892 1013955 866168 731871 740446 605295 416091
9300 416091 282372 245810 242162 263691 297550 346658 433901 404982 424487 429560 468274 317739
9288 317739 332173 435563 407763 421597 537804 594471 724686 719055 615916 467013 554809
9277 554809 719972 711250 680088 822194 894569 918884 981630 1032367 1094009 1031520 978437
9266 978437 964398 886701 790826 821271 757282 754964 682496 575646 514292 328795 281599
9255 281599 374549 499563 370714 327998 302707 303466 287851 306051 198347 145919 164554
9244A64554K7995j2471J3821O3622K0082j46511r5334P353r5466N8826J44060
9233A50531J96920O6248l9021O185k7737n583J78046J09769j34054m2383j40370
9222C18551j00790k2282J70108L7878j90860r3340k2016K0111k0657M4496N0667
9211A91866o235O5822j01959j47809K4799J14222j3612n431N266K712P3523J3072
9199B16236m1588p9399L6060L9213R0301l2509l0277O637j53627M5886J7106k6534
9187H7505j47473m6691M088m6608q266J64026J96720M5824J33781k8156j89818
9176A64932j412n5797p5941N6546R6143K6866q059o0703L2195K1299m4661n7155
9164I4253o5756L016o4881K2200L6418K6939q0439N8708J25846R5526n3590j36625
$$ plain form
9244 164554 192549 180078 193899 257521 277603 131092 35758 43111 -52355 6471 150531
9233 150531 347451 413699 374678 380863 353126 347543 525589 635358 501304 458921 318551
9222 318551 217761 195479 365587 403465 212605 119265 97249 117360 96703 141199 191866
9211 191866 185631 251453 149494 1685 26484 140706 127094 121663 126929 129641 203164 216236
9199 216236 174648 95249 131309 170522 260823 228314 198037 204674 51047 96933 114039 87505
9187 87505 -59968 -106659 -102571 -149179 -157445 6581 203301 249125 382906 354750 164932
9176 164932 163520 107723 31782 88328 184471 211337 203278 142575 174770 196069 151408 94253
9164 94253 28497 31513 -33368 -11168 25250 52189 -28250 30458 156304 251830 198240 61615
9152F1615p3453o0684q572P0609P3658p3102j53460k898Q5575Q7509L8412N9858
9140A05067k856j13887n745M7343l8846k0840M0232m819L6687J583j23159l0162
9128a09402j4999L9484o2351L7741J56271o0153N543O0628r3516q6647K7585P0008
9116b9808M5044M1561p1870j0508N5304O5741k6198m6838N732M9425r7436K1680
9104A829J11112j42178k4836L7240j37662O2687J10259m3965j073K3777n7346
9093f0156o6252P7801k1124r6293P0425Q0421K4218p2207m430k2658l8j2517P5464
9080b7346l794m0471r9621L1443M7561Q3200N0255J21533j8315k65641p0468J40565
9068e1099J12379N0235j11276j12649R6230R665L3273J8689l6786k5689n5985
$$ plain form
9152 61615 -11838 -72522 -81094 -10485 63173 -9929 -163389 -166287 -80712 6797 45209 105067
9140 105067 102211 -11676 -17421 29922 -8924 -29764 10468 5649 42336 43919 -79240 -109402
9128 -109402 -124401 -84917 -147268 -109527 46744 -13409 -7866 52762 -40754 -127401 -99816 -29808
9116 -29808 15236 56797 -15073 -25581 29723 95464 69266 22428 28160 77585 -19851 1829
9104 1829 112941 -29237 -54073 -16833 -154495 -91808 18451 -25514 -26587 -2810 -60156
9093 -60156 -126408 -48607 -69731 -166024 -95599 -15178 9040 -63167 -67597 -90255 -90293 -102810 -27346
9080 -27346 -31140 -71611 -171232 -139789 -92228 -9028 41227 162760 144445 -121196 -191664 -51099
9068 -51099 61280 111515 239 -112410 -16180 -6515 26758 45447 8661 -17028 -73013
9057g3013j20968q5237K1389l126N639R7770M578Q483J5899K55540j4015l9489
9045G3450j91929p6451J43078P8588m7253O1026K8232M6194R181m8950j06621
9034c1455R778J05721J1777R1593L707r0419l233R073n7372K6500J8210P45j37262
9021d2637P5326p1159n3695K3235L2905r4920J21755J63404L9885K1848M5869
9010B61816o2287l1699m1244r1427O9057L5491n7269j80968j5955J4208k3358
8999a23635J85523J48582m3471N82J0095l0011O0388l1990k05987q11Q7058K1188
8987G7511j4343j3851j22256j62643O9784K42873J4021J8698P1098m7054p4061
8976E9777o3792p415l3970o758L9934N2805j18222k1385J79983P5771l5142K31
$$ plain form
9057 -73013 -193981 -279218 -257829 -260955 -255316 -157546 -152968 -144485 -128586 126954 112939 73450
9045 73450 -118479 -194930 -51852 26736 -20517 40509 68741 114935 124116 75166 -31455
9034 -31455 -21677 84044 95821 187414 191121 100702 97469 106542 49170 75670 93880 94625 -42637
9021 -42637 32689 -38470 -92165 -68930 -36025 -130945 -9190 154214 194099 215947 261816
9010 261816 199529 167830 126586 35159 104216 139707 82438 -98530 -114485 -100277 -123635
8999 -123635 61888 210470 166999 167581 177676 147665 208053 176063 -29924 -30735 56323 77511
8987 77511 63168 49317 -72939 -235582 -165798 77075 91096 109794 180892 133838 59777
8976 59777 -4015 -11430 -45400 -52158 -12224 40581 -77641 -99026 80957 156728 121586 121817
8964A21817n9278m8391j6476q8400j07245P548l1528J13611r8314o7574O9641
8953b04589J60618L2427L5909O923R865p5359o1599l9285n6379J6160J06083J9283
8941d9943Q2390J54149K5982j23842K3158j7983P4370k8176j13147k4032R0889
8930I3815k2141j30592j2624N7384J9340M8958r0236m0458J77230Q9857r8440
8919I2093j66549j26724j41992L0767K72297P8895k01598j41685Q6472K17607
8909d17L5755J0068j04780k9031k2070L5757k7467R3221O7275J08482j8698r42
8897A47153j64146j2363m2249M0556j6665L4840M6808m4811R8849J9869j4218
8886I3623P4638K3199j23458o9538J33355j9989j12674o6610Q1649P4838n4728
$$ plain form
8964 121817 62539 14148 -2328 -90728 -197973 -190425 -221953 -108342 -206656 -274230 -204589
8953 -204589 -43971 -11544 24365 31288 41153 -34206 -95805 -135090 -191469 -175309 -69226 -49943
8941 -49943 32447 186596 212578 88736 111894 93911 168281 140105 26958 2926 93815
8930 93815 71674 -58918 -71542 -14158 5182 54140 -36096 -76554 100676 190533 92093
8919 92093 -74456 -201180 -343172 -312405 -40108 38787 -162811 -304496 -218024 -417
8909 -417 35338 45406 -59374 -88405 -110475 -74718 -102185 -8964 58311 166793 148095 147153
8897 147153 -16993 -29356 -71605 -31049 -47714 -12874 33934 -10877 87972 107841 93623
8886 93623 168261 191460 68002 -1536 131819 111830 -844 -67454 14195 89033 34305
8875C4305o8670m5905M5466l5129L6261R0914l0494j17571M4396L8853K2600n972
8863I054q8659J1833o5158r458j166O2026j1574M8605m0214N883r5436o578K2100
8850a58742J03039o1124Q7034J57152P1220j14660m6257j6258O675J39558Q3569
8839B51206l7850j98498o0613O0592M3692M0911O4793l4499o0301j29373J42795
8828H2855J18847p7778J62k6660l8405K6533q658L1602O9888L4037m3184j9346
8816A49893j95451j41172l5193L8719M0353J79092J29822l9071m6269k0711k8394
8805C1618O5041J3086o5076j25565J00869J9090n8163L0425R1445L3885J2943
8794A49598p62o0275n8094l346M2279m2210q6580q1468j0938M0507o902N7834
$$ plain form
8875 34305 -34365 -80270 -34804 -69933 -33672 57242 26748 -90823 -46427 -7574 15026 9054
8863 9054 -79605 -67772 -132930 -142388 -143554 -81528 -93102 -44497 -84711 -78828 -174264 -180842 -158742
8850 -158742 -55703 -116827 -29793 127359 198579 83919 37662 21404 28079 167637 251206
8839 251206 213356 14858 -45755 14837 58529 99440 164233 129734 69433 -59940 82855
8828 82855 201702 123924 124086 97426 59021 85554 76896 108498 178386 212423 169239 149893
8816 149893 -45558 -186730 -221923 -183204 -142851 36241 166063 126992 80723 60012 31618
8805 31618 96659 109745 44669 -80896 19973 39063 -19100 11325 102770 136655 149598
8794 149598 148836 88561 30467 27121 69400 27190 -59390 -140858 -151796 -111289 -118191 -60357
8782f0357P2997J21038k0859m9273j12980p5950r9381l5775J32412Q3233J16475
8771G1580J26289N0824l623j02334l4679R4965L777j10619p8017m7657j23369
8760a52863M8335l8075M7346M821J18282J23432j16416j74798o9383o3454N6071
8749b16702Q0362J01550k3072N71J2799J4084k4353P2918J727j07919N6402J29317
8737I7684O3141O445l9901j7592j28373m7894o0163j7705K3733O4152O5612q3394
8725g4255n5653J00868J01340k7120l0198P789j46448k7084L7714N627J09756
8714B336J71957K8948K8280k22215j03274r9400Q9448K00244J29343J5838M8179
8703B89684j13839j46812Q3621J02996m4846L475j87557j05025n7499P1838J9176
$$ plain form
8782 -60357 12640 133678 112819 63546 -49434 -125384 -224765 -260540 -128128 -44895 71580
8771 71580 197869 248693 245070 142736 108057 203022 206799 96180 18163 -29494 -152863
8760 -152863 -104528 -142603 -95257 -90436 27846 151278 34862 -139936 -209319 -272773 -216702
8749 -216702 -136340 -34790 -57862 -57291 -44492 -30408 -54761 18157 19884 -88035 -31633 97684
8737 97684 160825 167270 127369 109777 -18596 -66490 -126653 -144358 -120625 -56473 9139 -74255
8725 -74255 -129908 -29040 72300 45180 14982 22771 -123677 -150761 -113047 -107420 2336
8714 2336 174293 203241 231521 9306 -93968 -193368 -103920 96324 225667 241505 289684
8703 289684 175845 29033 112654 215650 170804 174279 -13278 -118303 -175802 -103964 -84788
8692h4788R8113J2966j99707J21783J52622O4400j44035q593l3995k9274L7072
8681a3436K3037K6924o095o114n9247J87514p9384j04958p1260m5325M4155R8572
8669e617j6644P6660J29846k2030l0173j6299l8096M3798P4061k0958k04679k400
8657c2531J28909L2066j28966m9715K1526J47410l5610j92377p9908N2480K7644
8646a09072p367Q1299R2623m3469j51572j05311J7477Q3311J1600l9856K4581
8635a45756J28750J93341N4198j01342j06017K0927L9267l0408j7402L9132j03243
8624b8553o4924J80008J32511m2432j28403r9548j68242J53816J34766o5459j25836
8613a22296Q8447R8712K5401o8246L6057J35221m5973p1024N0837q4656n7451
$$ plain form
8692 -84788 13325 26291 -173416 -51633 100989 165389 21354 12761 -21234 -50508 -13436
8681 -13436 9601 36525 30430 24316 -34931 152583 73199 -31759 -103019 -148344 -104189 -5617
8669 -5617 -22261 54399 184245 162215 132042 115743 77647 121445 195506 174548 -30131 -32531
8657 -32531 96378 128444 -522 -50237 -28711 118699 83089 -109288 -189196 -136716 -109072
8646 -109072 -116439 -35140 57483 14014 -137558 -242869 -225392 -142081 -130481 -170337 -145756
8635 -145756 -17006 176335 230533 129191 23174 44101 83368 52960 35558 74690 -28553
8624 -28553 -93477 86531 219042 176610 48207 -51341 -219583 -65767 68999 3540 -122296
8613 -122296 -33849 64863 90264 22018 58075 193296 147323 76299 127136 42480 -14971
8602a4971J23100J2084j10619k2201J01686O1919j4807l9790o1139N2156j1956
8591G5462n5471N1615l5641n0588J38889p727L4231j0568K2664m9569L5474l2043
8579A16728j6139L2937O2418K4050o5191M244J5020j27057j06854M2682J55290
8568A38128j76848m6886m388K9312J16285O7376k0360j11357M6451J19717O447
8557A63877j2170n5206Q3466n74n8874r4537p4504p7641q3550K7790R7663k9065
8545a13325Q7201Q0085r7686r6434K8597R4344L2200j1631r2103q6162J14496
8534f0418R4396J9469J848K3615k987M9971p4867l9681J08994R369k09923m4585
8522a24799J44829Q1942L4556o9054p5159o5657l2099J4765K4149k8871J8969
$$ plain form
8602 -14971 108129 120213 9594 -12607 89079 150998 136191 96401 35262 87418 75462
8591 75462 19991 71606 35965 -14623 124266 116539 150770 140202 162866 113297 148771 116728
8579 116728 100589 133526 195944 219994 154803 159047 174067 47010 -59844 -17162 138128
8568 138128 -38720 -85606 -89994 -60682 55603 122979 102619 -8738 37713 157430 163877
8557 163877 151707 96501 179967 179393 120519 25982 -48522 -126163 -209713 -181923 -84260 -113325
8545 -113325 -26124 53961 -43725 -140159 -111562 -17218 14982 3351 -88752 -174914 -60418
8534 -60418 33978 53447 55295 78910 75923 125894 51027 11346 120340 129709 -80214 -124799
8522 -124799 20030 101972 136528 67474 -7685 -73342 -105441 -90676 -66527 -95398 -76429
8511g6429q9146J6679j61025j33352Q3748J31992N7572m2193O6917N9304O4128
8500b1805K2725r446N4524R743r8169p9280J73324J24383j08418p2539Q3487O92
8488G9221k6464J13096Q9706j20059p4312R0664o2663L2243p6641P338L9707j37393
8476d5557k7627Q0252m3213l302N5657r608p1284M3288P9599p9916k6064l885
8464e1660q6062n1458P8002k9865j5071N851k0953K7070j04080J17364O4069l971
8452g0764m0138j13428K2555K0871K8068j6040O5867J0731N1283l3939l575o1044
8440a39553J56310J80302J28445r7511k66420r6331J47994K19051j09669j17439
8430E179l110j69155n9190J26256J45914j4324k2618m0168L5986j31670j05860
$$ plain form
8511 -76429 -165575 -148896 -309921 -443273 -359525 -227533 -169961 -212154 -145237 -85933 -21805
8500 -21805 920 -8526 45998 55741 -42428 -121708 51616 175999 67581 -4958 78529 79221
8488 79221 52757 165853 255559 135500 61188 151852 89189 121432 44791 52129 91836 -45557
8476 -45557 -73184 7068 -36145 -39447 16210 6602 -64682 -21394 58205 -21711 -47775 -51660
8464 -51660 -137722 -189180 -111178 -141043 -156114 -150263 -171216 -144146 -248226 -130862 -66793 -70764
8452 -70764 -110902 -224330 -201775 -180904 -152836 -168876 -103009 -92278 -40995 -74934 -78509 -139553
8440 -139553 16757 197059 325504 227993 -38427 -134758 13236 232287 122618 5179
8430 5179 2069 -167086 -226276 -100020 45894 31570 8952 -31216 4770 -126900 -232760
8419b32760O6584L6457O6906P0510K3365o0660k5260J951n3404o3808J00940J04963
8407C5784J9533j17727L5655Q889q1005O2131p744o9345J7801p0564Q930L6956
8395a20706j5308J8420Q6139J67535M733k08898j31539N7969J34514k938o8075
8384g8154j41265o7102J12223J70506P7800K5990n4441j7258o8864j05722J24863
8373b1424J13841j46078j48914n9689J1742N9662Q2683P5928K2436j8470r8470
8362a26753q5090J05416J11045J2489j89485r2539L7165P9123J19592N9554o6163
8351c5646j01351N0988R3018L038k7736n9796n7045J04135J81171R4976j00527
8340A45225o8265p7889p6190n4303N7849j5460n8593J55313L5788j1743j9814
$$ plain form
8419 -232760 -166176 -129719 -62813 7697 31062 -29598 -54858 -52907 -106311 -170119 -69179 35784
8407 35784 55317 -62410 -26755 -17866 -98871 -36740 -44484 -113829 -96028 -166592 -157662 -120706
8395 -120706 -136014 -117594 -31455 136080 140813 -68085 -199624 -141655 -7141 -10079 -78154
8384 -78154 -219419 -286521 -174298 -3792 74008 99998 45557 28299 -40565 -146287 -21424
8373 -21424 92417 -53661 -202575 -262264 -250522 -190860 -108177 -32249 -9813 -28283 -126753
8362 -126753 -211843 -106427 4618 17107 -172378 -264917 -227752 -148629 -29037 30517 -35646
8351 -35646 -136997 -86009 7009 10047 -17689 -77485 -134530 -30395 150776 245752 145225
8340 145225 76960 -929 -77119 -131422 -73573 -89033 -147626 7687 43475 31732 11918
8329A1918L4150k019j05256M2362J40099N0177K2200o9122r4971n9036j00077
8318a29575p2599J58035M1546r9407K2024R3718o2510q8704O5635M0101j0356
8307d2092k5805k4691m5849L9270J22379l1853K8828L3177K054J31078q204k8650
8295A49642r4110r43K3585O051j2371j76797J7582J1060P5022k5807q0679l5834
8283a43599N235M5598J03946k8407K785o8686m4530p721M2508P2806r7440j05045
8271b22550L4742J28288Q4554N2303k7719j86534J042M5119N7117J36657l1413
8260G1606O9809O3718j32359k5615k6861k9323m9097J6464k7991L0354J26469
8249H7174j9274j06439k26790M0922J23048q8188o9701J03517P812J48919J56303
$$ plain form
8329 11918 46068 44049 -61207 -18845 121254 171431 193631 124509 29538 -29498 -129575
8318 -129575 -202174 -44139 -2593 -102000 -79976 13742 -48768 -137472 -71837 -31736 -42092
8307 -42092 -67897 -92588 -138437 -99167 23212 -8641 20187 53364 55418 186496 178292 149642
8295 149642 55532 54589 78174 84225 71854 -104943 -87361 -76301 -1279 -27086 -107765 -143599
8283 -143599 -138364 -92766 11180 -17227 -14442 -83128 -127658 -135379 -92871 -20065 -117505 -222550
8271 -222550 -187808 -59520 25034 77337 49618 -136916 -135874 -90755 -33638 103019 71606
8260 71606 141415 205133 72774 47159 20298 -9025 -58122 -41658 -69649 -39295 87174
8249 87174 67900 -38539 -265329 -224407 -101359 -189547 -259248 -155731 -147919 1000 157303
8238A57303N6859q6028l8589Q7098j0312j30226k891j0632l9571p7621j17778
8227b12388R6326J09598l6466M4743J00016o849j0494L1808j1588m279j36363
8216c5936j86726Q4231R2606o4110m381L0421q967o6220q3933m620J00514J9341
8204a27780N605K7870M5189J60812m8449q6014K9104N2639P983P7989j7385j20721
8192F842R0605J15385j29740m8248n4230j41339n4746Q9592j0259M31n3324P5112
8180a13919K00731J5078k187k4215p8882n3917n3264k3172k8724r2489j23723
8169c78683j21833K7471O9515O9082K7338Q4635M3473N8414O7594J385j2469N1569
8157a2509K8593l5335j51841m49L8663L2504P8547l3748k914P4062O3643P3975
$$ plain form
8238 157303 214162 128134 89545 176643 166331 36105 33214 22582 -16989 -94610 -212388
8227 -212388 -116062 -6464 -42930 1813 101829 94980 84486 116294 104706 100427 -35936
8216 -35936 -222662 -138431 -45825 -109935 -114316 -83895 -92862 -159082 -243015 -247635 -147121 -127780
8204 -127780 -122175 -94305 -49116 111696 63247 -22767 6337 58976 66959 144948 127563 6842
8192 6842 97447 212832 83092 34844 -19386 -160725 -215471 -125879 -136138 -135707 -189031 -113919
8180 -113919 86812 101890 99703 75488 -3394 -57311 -110575 -133747 -162471 -254960 -378683
8169 -378683 -500516 -473045 -403530 -334448 -307110 -222475 -179002 -120588 -52994 -51609 -64078 -12509
8157 -12509 16084 -19251 -171092 -171541 -132878 -100374 -21827 -55575 -58489 15573 79216 153191
8145A53191K9825N3989n9121j43219n2798O5873m5836n0094o0978J0909N1756
8134d6503L883K592k6172j0726q9169j0944j8713p0425J02649J12919O8963k3360
8122e006n1328o9806J7112O7997K9769j8120R5659m1254n056k4911j16047N1327
8110f9664P2677r8531m3194j55914M9773m696K054N6451L9667J045L4133J81965
8098F5766N7702r1168O5005k6287J9389j7122q0062j17450L0531L2687J15225
8087E4216o5809k5875j17540l6346j196R661N1417Q3457L5550j04316R0191J20740
8075I4150k1577n4947p347l1825j60503Q1024m2j1167M922O4105p9917M7370M5190
8062c0564j9846j66347p6387M4412M0370Q1127n3897p8939K3556Q4114J00095
$$ plain form
8145 153191 183016 237005 177884 34665 -18133 47740 1904 -48190 -109168 -98259 -46503
8134 -46503 -42620 -40028 -66200 -76926 -166095 -177039 -195752 -266177 -163528 -50609 18354 -5006
8122 -5006 -56334 -126140 -109028 -41031 -11262 -29382 66277 25023 19967 -4944 -120991 -69664
8110 -69664 3013 -95518 -138712 -294626 -244853 -249549 -247495 -191044 -151377 -150332 -116199 65766
8098 65766 123468 32300 97305 71018 90407 73285 -6777 -124227 -93696 -61009 54216
8087 54216 -11593 -37468 -155008 -191354 -192550 -182889 -131472 -48015 -12465 -116781 -26590 94150
8075 94150 72573 17626 10279 -21546 -182049 -101025 -101067 -112234 -107312 -43207 -123124 -75754 -30564
8062 -30564 -50410 -216757 -293144 -248732 -208362 -127235 -181132 -260071 -236515 -152401 -52306
8051e2306J2460O1579Q3764j9579n9634M0325K693K5955j37129k44991N4711J67686
8039f4466K00678j3506j26597J08741N6479j7060n8106j1991L8494p1141L9244
8028H0769N5m9346j12006P2230n8996r8136Q5657J12961j59247m8414N8449j9955
8016a35979M8110O2202j662O3802K0203l1335k8110P515l6253j7127O6681K05499
8004B23546k3835j58139o3390r601M7696K1341n7718j13616n4202R0343J1026
7993h6549K5944J13536n2145l8244m8525R5062n91p3351r6116J7920L8260l6524
7981a41323Q4956J59803M1068j16040q4711m2818j7293M4501k0634j1082O6485
7970c7088J0007R9906N5001J47748j21574j34783Q2325j0838N061r6215k65945
$$ plain form
8051 -52306 -39846 21733 105497 85918 26284 66609 69302 95257 -41872 -286863 -232152 -64466
8039 -64466 136212 122706 -3891 104850 161329 144269 86163 74172 112666 41525 80769
8028 80769 80824 31478 -80528 -8298 -67294 -165430 -79773 33188 -126059 -174473 -116024 -135979
8016 -135979 -87869 -25667 -27329 36473 56676 25341 -2769 4746 -31507 -48634 18047 223546
8004 223546 199711 41572 -21818 -31419 16277 37618 -20100 -133716 -187918 -97575 -86549
7993 -86549 -60605 52931 786 -37458 -85983 9079 8488 -64863 -160979 -143059 -104799 -141323
7981 -141323 -56367 103436 144504 28464 -56247 -99065 -116358 -71857 -92491 -103573 -37088
7970 -37088 -27081 72825 127826 275574 154000 19217 101542 90704 95765 -450 -266395
7959b66395q2890J34954K12841J54679m8706j22856n871Q5032r2538k392N7700
7948B3558k8749j8819K093Q4447j9626R1087K5488j15809j54159n9498J7051K07797
7936E4861O6036m3680j14151j50071N2508k920L8306m096j2440j34841R2164J27295
7924c1029L6623r8496j29709M3074N9566K19834P4344j05590k5614m1524j5581
7913a4102J94n0522K3838J1408k0700o6686M1063n3163p4113j40311L2215K05996
7901a04883l1723r6901j03609q381K3240J10208J18767J9717o2893L989J6540
7890a15929J40023K08214j08263j67343J09054O6040m0015p8577j35969M2579
7880h0186P8035j1756m9395P5767o016p9686k49615k8940J34003K7265n594m1466
$$ plain form
7959 -266395 -349285 -214331 -1490 153189 104483 -18373 -24244 60788 -31750 -34142 23558
7948 23558 -5191 -24010 -21917 62530 42904 133991 159479 43670 -110489 -169987 -152936 54861
7936 54861 120897 77217 -36934 -187005 -134497 -137417 -99111 -103207 -115647 -250488 -158324 -31029
7924 -31029 5594 -92902 -222611 -179537 -119971 99863 174207 68617 43003 1479 -14102
7913 -14102 -13908 -64430 -40592 -29184 -49884 -116570 -75507 -128670 -202783 -343094 -310879 -104883
7901 -104883 -136606 -233507 -337116 -345497 -322257 -212049 -93282 -73565 -136458 -132469 -115929
7890 -115929 24094 232308 124045 -43298 65756 131796 91781 13204 -122765 -80186
7880 -80186 -2151 -13907 -63302 12465 6449 -73237 -322852 -351792 -217789 -190524 -196118 -237584
7868b37584P4738R0585N3366L265j2192N9394K1211r4447K1188J4907p38N4317
7856D8010J12926l52l0443k14256j36261k9501J7505R3018L2568O7962L6766m7544
7844d9602N9237K2433n18j567k9410M7118N1018l7214J8060n8286n3846M7425
7832A4848M274n4215J10871J07799p1914o3910m7564j2936L2849k1693p392l4897
7820d3880l4685p1944O6778j0903j09934P4532p191K3224n9309Q541L8411P9603
7808d6757P7726l0995l3992L1402p7203J6579Q7347K5840R1857r759q0114j11824
7796e9893M094j6478J04870N5457j18807j9062P7151k2202j48395Q833m7605r5038
7784b77075J10M5548P602P1535k4087M7233Q7844O4497J7327j07361j4644j13021
$$ plain form
7868 -237584 -162846 -72261 -18895 -15630 -27822 31572 52783 -41664 -20476 -5569 -6307 48010
7856 48010 160936 160584 130141 -84115 -220376 -249877 -232372 -139354 -106786 -38824 -2058 -49602
7844 -49602 9635 32068 31550 29983 573 47691 98709 61495 79555 21269 -32577 14848
7832 14848 19122 -35093 75778 183577 111663 47753 189 -12747 20102 -1591 -8983 -43880
7820 -43880 -78565 -150509 -83731 -94634 -204568 -130036 -137227 -114003 -173312 -164771 -126360 -46757
7808 -46757 30969 -26 -34018 -2616 -79819 -63240 24107 49947 141804 132045 51931 -59893
7796 -59893 -55799 -72277 32593 88050 -30757 -49819 27332 5130 -143265 -134432 -182037 -277075
7784 -277075 -276965 -231417 -223815 -152280 -176367 -129134 -41290 23207 40534 -66827 -81471 -194492
7772a94492q1086M4299J57649j902q3321q312j404j6063j9450J0498L7490J966
7760a54128M7474K6416O7429j2054j044K4950l8945K7478J6697K135j2182L8671
7748C2897P3226L2836p0773l8746P4302p7683N3062l9119j87705o9996j02522
7737c20221l6416Q1067J53910M5383p2096k7372J8253M7354o1101P3642N4053
7726d3544J93976j0029j05952m0046L9631l0988n511o3426r1293J52735Q4591
7715H0144N8657K3408l6839K615M0168k6898J289n3922j37947k5270N9715j2107
7703b6987p5143q032p9307P638O3643L2637n957N20J9282K5979L5909P2243N7808
7690A20233M0484j22489o4841J52076p0076j41341K5622J21904N1713M2366L2524
$$ plain form
7772 -194492 -275578 -231279 -73630 -75532 -158853 -167165 -168569 -184632 -204082 -193584 -156094 -154128
7760 -154128 -106654 -80238 -12809 -24863 -25907 -957 -39902 -12424 4273 6408 -5774 32897
7748 32897 106123 138959 68186 29440 103742 26059 79121 40002 -147703 -217699 -320221
7737 -320221 -356637 -275570 -121660 -76277 -148373 -175745 -157492 -110138 -171239 -97597 -43544
7726 -43544 150432 140403 34451 -5595 34036 3048 -2463 -65889 -157182 -4447 80144
7715 80144 138801 162209 125370 127985 168153 141255 142544 88622 -49325 -74595 -14880 -26987
7703 -26987 -102130 -110162 -189469 -181831 -118188 -85551 -91508 -90988 -71706 -45727 -9818 62425 120233
7690 120233 160717 38228 -26613 125463 55387 -85954 -60332 61572 113285 155651 188175
7679A88175l3010m4800j01763p3816Q136J70320K1089m9287N7772J1412j1420
7668A42808O3573r0759O3759O8253l2758j65898r1408n6r7594l3244J03515J23410
7656E3601O914k3995k6622k7281J507p2897j16669r7522r010J77198Q0023j0962
7644f5715J23304j2675K103J6235k398l4532o7455N0127J0069J7275L4141P2450
7632A42929N092m8788q1996l1628k5552n8432K2935J02446J04157J08257j9504
7621B19916k2531j08797o4042j15092l241J1438r7406L3962P5509P8242J08985
7610A16943j30900n3470k587o0824M3839l8518j9273j9961J45931J65101p7942
7599F8339n2745o6871p3802M8498L9212Q133O9987O3807j03251j07652m8p7740
$$ plain form
7679 188175 155165 110365 8602 -65214 -57078 113242 134331 85044 142816 154228 142808
7668 142808 206381 115622 179381 247634 214876 48978 -42430 -42486 -140080 -173324 -69809 53601
7656 53601 60515 36520 9898 -17383 -15876 -88773 -205442 -302964 -311974 -134776 -54753 -65715
7644 -65715 57589 44914 47017 63252 60854 26322 -41133 8994 19063 36338 70479 142929
7632 142929 148021 99233 17237 -14391 -39943 -98375 -75440 27006 131163 239420 219916
7621 219916 197385 88588 24546 -90546 -93787 -82349 -179755 -145793 -70284 7958 116943
7610 116943 -13957 -67427 -70014 -130838 -86999 -125517 -144790 -164751 -18820 146281 68339
7599 68339 15594 -51277 -125079 -76581 -37369 -29236 40751 104558 1307 -106345 -106393 -184133
7587a84133M1356n7967p6665M5873P4035M7044k2844Q7983O816k8788j966k3538
7575i2794p7497m1757N8240K5222n697p1206ML0499L1377J28933M6145j2272P3200
7562I2397O763q5293p8160L3433M4769J701m6160l1703K6589M2772Q785n3193
7550c7300Q248L9619J37331k5197p6569k5479m0055J9672R4085R7590m9260k14264
7538g1579r5782n7332J37316J38954N3546j43488m2979N8186K5811k5523n3800
7527g6670j74645L8634K0125m3206J90266J86357J5786j23834L641q7611O4406
7516A3249q1921l9755N8431j04250J9468J02055N6359l2239q9217j6314J6049
7505i8085R0225P1657Q175j3754N4137R6618k1878j71533j07987N2860p4306l8287
$$ plain form
7587 -184133 -142777 -200744 -277409 -231536 -157501 -110457 -133301 -45318 -38502 -67290 -69256 -92794
7575 -92794 -170291 -212048 -153808 -128586 -134283 -205489 -205485 -174986 -143609 -14676 31469 19197 92397
7562 92397 99160 13867 -64293 -30860 13909 15610 -30550 -62253 -35664 7108 15893 -37300
7550 -37300 -29052 10567 147898 122701 46132 20653 -19402 270 94355 191945 142685 -71579
7538 -71579 -167361 -224693 -87377 51577 105123 -38365 -81344 -23158 2653 -22870 -76670
7527 -76670 -251315 -212681 -192556 -235762 -45496 140861 156647 32813 36454 -51157 13249
7516 13249 -68672 -108427 -49996 -154246 -134778 -32723 23636 -8603 -97820 -114134 -98085
7505 -98085 -7860 63797 71972 58218 112355 208973 187095 15562 -92425 -39565 -113871 -152158
7493a52158J23637o796p4684L888P6237o770O3710l961p1309J25336l7901j16211
7481g6982L611m7152Q0277J56670K1831q7222j18362N0001m2874N6369P642j18545
7469a14736q2081M7643J05321j6365l0824J9794J7492k2181M1296O7885k5839
7458G405r9034M8548Q3574L0037M8843K6259j22329j9438Q4383O0965k9989j17363
7446A861O1395P5845K5926j01953j53372r5196O3526J10918l8011j1981L6962
7435b4080r0411l9001J9153J41884q1257j34520Q3396L8548l1499J7782J10338
7424A0333J30339j63602j25471j76572r6509Q1403O5207P3186J08964N2431o7066
7413a07357o7022n5919P1499J9319J7735J30109K221j12085l9858o9558J27235
$$ plain form
7493 -152158 -28521 -35317 -110001 -106113 -29876 -36646 27064 23103 -48206 77130 39229 -76982
7481 -76982 -73371 -120523 -40246 116424 138255 51033 -67329 -17328 -60202 -3833 3809 -114736
7469 -114736 -196817 -149174 -43853 -60218 -91042 -71248 -53756 -75937 -34641 33244 7405
7458 7405 -91629 -43081 40493 70530 119373 145632 23303 3865 88248 149213 119224 1861
7446 1861 63256 139101 165027 63074 -90298 -185494 -121968 -11050 -49061 -61042 -24080
7435 -24080 -114491 -153492 -134339 7545 -73712 -208232 -124836 -86288 -117787 -100005 10333
7424 10333 140672 -22930 -148401 -324973 -421482 -340079 -274872 -201686 -92722 -40291 -107357
7413 -107357 -174379 -230298 -158799 -139480 -121745 8364 10585 -101500 -141358 -210916 -83681
7402h3681q8910J03065j3813M776J8898p5480l8786K8195N5911L2330K6376k0850
7390e1969q7043o0928J31977l9774j19878j05481J51168J82250P0026k0409q3201
7379c3262j87926l399n444O6349n9945j3506J09234J03077j6343l4238r6616j9476
7367a91495l743M4026j2093M8736Q8146J35064J03799O5383j18052o6862J1033
7356A03942J72800L8392k79206j68130n9726N9752n6755Q8033K4594L2669J6719
7345b6916j40338j59937P8571N9372n6943J9952O6914J22879J01180m4292m8188
7334b7746N9833k8946j66904n5984r1165L9581J7267m8198L4742K8755J25914
7323a12851N3829n6146J49964M5975J9565O731j7675K5128p9423j80393m8964
$$ plain form
7402 -83681 -172591 -69526 -83339 -78563 -59665 -135145 -173931 -145736 -89825 -57495 -31119 -51969
7390 -51969 -139012 -199940 -67963 -107737 -227615 -333096 -181928 322 70348 49939 -33262
7379 -33262 -221188 -224587 -230031 -163682 -223627 -237133 -127899 -24822 -41165 -75403 -172019 -191495
7367 -191495 -195238 -151212 -163305 -114569 -26423 108641 212440 277823 159771 92909 103942
7356 103942 276742 315134 35928 -132202 -191928 -132176 -188931 -100898 -76304 -43635 -26916
7345 -26916 -167254 -327191 -248620 -189248 -246191 -226239 -159325 -36446 64734 20442 -27746
7334 -27746 32087 3141 -163763 -219747 -310912 -271331 -254064 -302262 -267520 -238765 -112851
7323 -112851 -59022 -115168 34796 80771 100336 107067 89392 114520 35097 -145296 -194260
7312a94260j95681j54473J64753O4528m0422K3455J44439O4223m2993N9324M0755
7301f6352N0136j29119n1232J11456O4924o8179q0703o2951P5828J35257L947
7290a6988j048n3566o0470N7760J6250p379R1616o2244l0642M9560N9713R9850
7278A42412N1727p9336j20342n2147m2913N2529K5871j33569l9826M206Q3149
7267a08239Q7564j01795Q7979l1323r2723J01555K5768j2945Q3800l0727j0511
7256a597o8084P9333l632l5825n1012K231o3012J26657J0868m1087n4314m596
7244a04070n7397m6362M6267M2p1910Q2851K1090P8333P3915o5858p9211o1400
7232a83710J2879K02134J22346m6969j74196K7224J40689l35j16501L8747J47626
$$ plain form
7312 -194260 -389941 -544414 -379661 -315133 -355555 -332100 -187661 -123438 -166431 -107107 -66352
7301 -66352 -16216 -145335 -196567 -85111 -20187 -88366 -169069 -232020 -156192 -20935 -16988
7290 -16988 -18036 -71602 -132072 -74312 -58062 -65441 26175 -36069 -66711 -17151 42562 142412
7278 142412 194139 114803 -5539 -57686 -100599 -48070 -22199 -155768 -195594 -191388 -108239
7267 -108239 -20675 -122470 -34491 -65814 -158537 -56982 -31214 -44159 39641 8914 -1597
7256 -1597 -69681 9652 6020 -29805 -80817 -78586 -141598 -14941 -4073 -45160 -99474 -104070
7244 -104070 -161467 -207829 -161562 -161520 -233430 -150579 -129489 -51156 22759 -43099 -122310 -183710
7232 -183710 -170831 31303 153649 106680 -67516 -40292 100397 100062 -16439 22308 169934
7221A69934M1382j6900j78760j76133o7031L1447P0492j25758k7406J02241N8380
7210a18112J0427N1788L3462n1364m9762j314n914Q0322K1924n7011N1416q2647
7198a16785k5593N8348q522p3650O2584J1209N990J1441j20301K8073Q0472L2261
7186e4473K5838p3266R819K5565K6280j6763l9664K9575k9665O5199l1399p6719
7174a39673q6227J06659K15619P9006q1687P5965J0968j34016j76905j3681J30020
7163a3952J97669k1628j51633M764p532N9341j46713k49384j49042K3302J65635
7152b89173j0239j4535K34138J1402r4707m4929Q0043P3671k6566j5924j30475
7141b27294J31730N7121K7241j2852j04947M4537M4942o9395m3009R0377J37995
$$ plain form
7221 169934 211316 194416 15656 -160477 -227508 -196061 -125569 -251327 -278733 -176492 -118112
7210 -118112 -107685 -55897 -22435 -73799 -123561 -124875 -130789 -50467 -28543 -85554 -34138 -116785
7198 -116785 -142378 -84030 -92552 -166202 -103618 -92409 -86419 -74978 -195279 -167206 -86734 -54473
7186 -54473 -28635 -101901 -92082 -66517 -40237 -57000 -96664 -67089 -96754 -31555 -62954 -139673
7174 -139673 -225900 -119241 96378 175384 93697 169662 180630 46614 -130291 -143972 -13952
7163 -13952 183717 162089 10456 15220 7688 67029 -79684 -329068 -478110 -454808 -289173
7152 -289173 -299412 -313947 -79809 -68407 -163114 -208043 -128000 -54329 -80895 -96819 -227294
7141 -227294 -95564 -38443 -11202 -24054 -129001 -84464 -39522 -108917 -151926 -61549 76446
7130G6446j19933j40580j4778M5855m6041J16676O9655K17589P411j34704j19130
7119d1534p4404o0763K4M4232K9689k1244n571J55339J9326m2941N0913j08075
7107e5009k92434j65814K03048K84868J4006j09333k9950K5178Q91q4314M2950
7096a65913R0628q440N1574j42790n1575N6655J44558N0458k4551J6613M9841
7085F7058J3630O4791j0176j25046P700m7354l2287N0104P337j3581l6221J41872
7073H7827r0103j27634R7720P8142q1778K0017j3365n8797m6014J0855n465r8921
7061b27516q895M1285p6718Q7144J57546N1367j6493J3535j36246j43949K8013
7050b30927Q4148J96542O4456o0408n3255P5462j2210j05623j07577k906M6428
$$ plain form
7130 76446 -43487 -184067 -198845 -152990 -199031 -82355 -12700 204889 212300 77596 -41534
7119 -41534 -115938 -176701 -176677 -132445 -102756 -124000 -129571 25768 45094 2153 53066 -55009
7107 -55009 -347443 -513257 -310209 -25341 -11335 -120668 -150618 -125440 -124549 -208863 -165913
7096 -165913 -75285 -83725 -32151 -174941 -226516 -169861 -25303 25155 604 17217 67058
7085 67058 80688 145479 135303 10257 17957 -29397 -61684 -11580 -4243 -17824 -54045 87827
7073 87827 -2276 -129910 -32190 45952 -35826 -15809 -29174 -87971 -133985 -123130 -128595 -227516
7061 -227516 -236411 -195126 -271844 -184700 -27154 24213 7720 21255 -114991 -258940 -230927
7050 -230927 -146779 49763 114219 53811 556 76018 63808 -41815 -149392 -152298 -105870
7039a05870M4927L3882N4538M4556N6222m3931K3952O233j06138O2585J2199j12040
7027b8885j63544O0431J57060l8698j34557N2106L4931k4969O7752l6719j25597
7016a80689N5329R2119q4771N1304K5501p1758j90763K7844J36294J52023n9851
7005d7418j28481K3972J16972M2084O4211Q613N2942j03302N749O5506R3629O0083
6993B54560O994j34309j06946r4203J24354P6107k7206n0559q2878n9047n8685
6982a51818p1172Q9506J82000J13357l0932L732p2424O7613K1837r3939j07880
6971e0120l3437m419M1735m2877M5409O6073l6116j10208M5527J41303l0845p9581
6959d7556r4182q4799O6527L5576L1184J79403n7346q4933r3920N3273K4933O6171
$$ plain form
7039 -105870 -60943 -27061 27477 72033 128255 84324 108276 114509 8371 70956 83155 -28885
7027 -28885 -192429 -131998 25062 -13636 -148193 -96087 -61156 -86125 -18373 -55092 -180689
7016 -180689 -125360 -33241 -118012 -66708 -41207 -112965 -303728 -275884 -139590 12433 -47418
7005 -47418 -175899 -151927 -34955 7129 71340 79953 132895 29593 35342 100848 194477 254560
6993 254560 261554 127245 20299 -73904 50450 126557 99351 48792 -34086 -93133 -151818
6982 -151818 -222990 -133484 48516 161873 130941 134673 62249 129862 151699 57760 -50120
6971 -50120 -83557 -87976 -46241 -89118 -43709 22364 -13752 -123960 -78433 62870 32025 -47556
6959 -47556 -141738 -226537 -160010 -124434 -93250 86153 28807 -56126 -150046 -96773 -71840 -5669
6947e669R455L8547r8041p9935o3709j3467K903K2382J99213J21182O2188j10000
6935H5049r5203R8741M4088O337N254O9119j61105j08026K1484P5270l4144N5241
6923F2105J1379j05942O5200Q7183P0946k10523k5J17836j4145j03247n2207q3358
6911a54798N2300K60410J29044j66488k20733r6070q4086K27698k6477k01251
6901b80451o9750n8020J06238J44343l1513o824l380L801J35718J38175O0464
6890A38801j13095Q558l4771j14566j6868M6786J8803N255M7690N8639l2884o9431
6878e7083j38099j2441O0381M6577j11255l7045m9598Q8459K54161J2842Q9459
6867A46358k3375j59039k16382J5353J272m4501N5614K29407j9866m2991j07765
$$ plain form
6947 -5669 3786 42333 -55708 -135643 -199352 -212819 -209916 -187534 11679 132861 195049 85049
6935 85049 -10154 88587 132675 139012 144266 213385 52280 -55746 -34262 41008 6864 62105
6923 62105 73484 -32458 32742 119925 190871 -19652 -19677 98159 84014 -19233 -71440 -154798
6911 -154798 -102498 157912 286956 120468 -100265 -196335 -280421 -52723 -79200 -280451
6901 -280451 -350201 -408221 -301983 -157640 -189153 -195977 -199357 -195556 -59838 78337 138801
6890 138801 25706 34264 -507 -115073 -131941 -85155 -66352 -61097 -13407 45232 12348 -57083
6878 -57083 -195182 -207623 -147242 -100665 -211920 -248965 -298563 -210104 44057 56899 146358
6867 146358 122983 -36056 -252438 -237085 -235813 -280314 -224700 4707 -15159 -58150 -165915
6856a65915k2363J59964J1242j36759j96499J30543K00968J17366r4568J1150
6846A5129p629k5291O9031Q7953N13m6225J3220J3595J0459o244L6642k0118j60940
6833a9905q5043j04464J06217K17429k951m7523r9721K2161m3206L1189N18n0827
6821g6126M2292r0593l6422J37674P0864q6210M6490M0609J6389j26644p9334
6810a41011J06976R6048o4463n8577l8597o2821P3326J09286l6151j08435N0629
6799g3790L3208n5609j4785r5415j43515J39148Q6875M3219P247J06332n9630
6788b6715j61996M4954P1631N4480o0940q5846N590J4584p308j27395k8477k0741
6776c28179M9096M0821n5453m4877L9648R4166J07058J15009k189P1423j31436
$$ plain form
6856 -165915 -188278 -28314 -17072 -153831 -350330 -219787 -18819 98547 3979 15129
6846 15129 7500 -17791 51240 139193 139706 93481 106701 120296 130755 124511 161153 141035 -19905
6833 -19905 -104948 -209412 -103195 114234 111283 63760 -35961 -13800 -57006 -25817 -25299 -76126
6821 -76126 -33834 -124427 -160849 -23175 47689 -38521 7969 48578 64967 -61677 -141011
6810 -141011 -34035 62013 -2450 -61027 -99624 -162445 -89119 20167 -15984 -124419 -73790
6799 -73790 -40582 -96191 -110976 -206391 -349906 -210758 -123883 -80664 -73417 32915 -26715
6788 -26715 -188711 -143757 -72126 -17646 -78586 -164432 -158842 -144258 -151566 -278961 -307438 -328179
6776 -328179 -279083 -238262 -293715 -338592 -298944 -204778 -97720 17289 15100 86523 -44913
6765d4913j24673O2481L5167J3498j19623k1628Q4592J49340j40190j26581q813
6754b41343L0479J08561l7362p5992M9512J40748M5085K8263j44300m5748R3379
6743d8718L8402j83376N6789R517j30027M8536n1885J57478M2758o9374M1863
6732h8037Q110M3901P3653M1128j2346R6886m7760q6599J7359J99427L1044j49523
6720A27243q5754q9937m440j85539k9360J42920m1184Q3276J23327p2946n5549
6709h7943k0309R9191P9958J14324j90736j26202k287j04858Q2473N5408L0814
6698g0167K8912p210J2079R0452L016p9001p2984L5042J66538Q807L6059L963
6686A55506p4921j09485M8992p010j29342N3797J10694J18103j14827p5518O4694
$$ plain form
6765 -44913 -169586 -107105 -71938 -58440 -178063 -199691 -115099 34241 -105949 -232530 -241343
6754 -241343 -210864 -102303 -139665 -215657 -166145 -25397 19688 47951 -96349 -142097 -48718
6743 -48718 -10316 -193692 -136903 -127386 -257413 -208877 -260762 -103284 -60526 -129900 -88037
6732 -88037 -79927 -36026 37627 78755 66409 163295 115535 28936 46295 245722 276766 127243
6720 127243 41489 -48448 -52888 -238427 -267787 -124867 -166051 -82775 40552 -32394 -87943
6709 -87943 -108252 -9061 70897 185221 -5515 -131717 -134004 -238862 -156389 -100981 -70167
6698 -70167 -41255 -48465 -36386 54066 57082 -21919 -94903 -59861 106677 115484 151543 155506
6686 155506 80585 -28900 20092 13082 -116260 -62463 48231 166334 51507 -24011 40683
6675D0683K1441O7134n0302j01615n0003k7396J44528Q5913K4740m5670J871J4025
6663A25349j05355R987q7434j44650K29878Q6585j28527j8725l9156P8245M4682
6652E0879n4381M8530J3067m6672M0397j51227j63358J3092K9577J20652M9113
6641e0331R959J07238O451P8497k7637m5182j03618j6518L2282o4867n1938R7481
6629b8183J3456j77126O5643J26329p5514j50444J63502J02981M4709m7828j77617
6618a40092q5840n9659O7391N2348q222j3297M0578J17688K0549k5003J3049r6750
6606a17260n0700J13997J09039R4013J3616O2455l4356j86632j23912M2471l2568
6595a09837J37543L2725j76796k8159n6375Q1550L22350p1031j31648p477n7589
$$ plain form
6675 40683 62124 129258 78956 -22659 -72662 -100058 44470 130383 155123 109453 111324 125349
6663 125349 19994 29981 -57453 -202103 27775 114360 -14167 -32892 -72048 6197 50879
6652 50879 -3502 45028 58095 11423 51820 -99407 -262765 -249673 -220096 -99444 -50331
6641 -50331 -40372 66866 73317 151814 124177 78995 -24623 -41141 -8859 -73726 -125664 -28183
6629 -28183 -14727 -191853 -126210 119 -75395 -225839 -62337 40644 85353 37525 -140092
6618 -140092 -225932 -285591 -218200 -165852 -174074 -187371 -146793 -29105 -8556 -33559 -20510 -117260
6606 -117260 -167960 -53963 55076 149089 162705 225160 190804 4172 -119740 -77269 -109837
6595 -109837 27706 60431 -116365 -144524 -200899 -119349 203001 131970 322 -7155 -64744
6584f4744p9941P39j8776p558J75209Q5955o0765j77879J3952o0929J8713M7915
6572a28109M2568M1792R446k7804r6855R0609k7668n526r9504j70821J72027J10850
6560h8995m7266Q1962O1517Q5746j21664j71354j02633J00311J10530J16027k5237
6549a056L5315l8035l5070j60753j077J19647J98086k1151M8451k2665j71183
6538d9491o997N9067J20599M094r5396n5052j0212J7863k3456M9790J16460K2825
6526A50094o1591M0274o0354o4859p4003j54250m9815J72638K1479p2332k5661
6515a78380O598Q0960J4568N0033J8936Q3332J808o258j33983O546K2985K6858
6503e997o2757m0296k486Q1291R167M6533O6152J77858l5152o9138k44976k21278
$$ plain form
6584 -64744 -144685 -143946 -162722 -170280 4929 90884 30119 -147760 -133808 -194737 -176024 -128109
6572 -128109 -85541 -43749 -34303 -62107 -158962 -68353 -96021 -101547 -201051 -371872 -199845 -88995
6560 -88995 -136261 -54299 7218 92964 -28700 -200054 -302687 -202376 -91846 24181 -1056
6549 -1056 34259 -3776 -38846 -199599 -200676 -81029 117057 95906 144357 121692 -49491
6538 -49491 -56488 2579 123178 127272 31876 -23176 -33388 -15525 -38981 10809 127269 150094
6526 150094 88503 128777 68423 3564 -70439 -224689 -274504 -101866 -80387 -152719 -178380
6515 -178380 -171782 -90822 -76254 -26221 -7285 76047 77855 71597 -62386 -55840 -32855 -5997
6503 -5997 -68754 -109050 -111536 -30245 -21078 25455 91607 269465 234313 165175 -79801 -301079
6491c01079j5153O5611J33654K57089M7095R3148m2010k86894o1232J36098K7563
6480E3890m2898j26023n7941J36846J6346o0525j5222J6949n5240K2210J17353
6469E745K0314m4760n7293j00719k5003J08390q5390M1248P3725M9890L2019p8502
6457f0336o3833K2274L3375N3127k596m6475l0692J06675j1114K1590q7990K4141
6445d1854M1900n1489j20347j9936P0474Q2298P7474K3280l8827r213m6248O7613
6433C5125k4853L4752J16445j95220l0950j4007j8321Q502L4116o3985L3486L2938
6421e1972P995R5760k5008r5882q4434r2682J14137O9370Q4129k51389j93657
6410d23633k47J68546L4700P3561M4699p6746q5819Q345M512J2587L4227J2031
$$ plain form
6491 -301079 -316232 -250621 -116967 140122 187217 280365 238355 -48539 -109771 26327 53890
6480 53890 10992 -115031 -172972 -36126 -19780 -80305 -95527 -78578 -133818 -111608 5745
6469 5745 26059 -18701 -75994 -176713 -201716 -93326 -178716 -137468 -63743 -13853 18166 -60336
6457 -60336 -124169 -101895 -68520 -15393 -17989 -64464 -95156 11519 405 21995 -65995 -41854
6445 -41854 46 -51443 -171790 -191726 -121252 -38954 38520 61800 22973 13760 -32488 35125
6433 35125 10272 45024 161469 -33751 -64701 -78708 -97029 -88527 -54411 -118396 -84910 -51972
6421 -51972 -43977 51783 26775 -69107 -153541 -246223 -132086 -62716 21413 -229976 -423633
6410 -423633 -423880 -255334 -220634 -147073 -102374 -179120 -264939 -256594 -252082 -239495 -205268 -193237
6398a93237O606N4021K01016k5933k36663J7339m958n6563l2906O359M9597P1657
6386a43665j3643j22313j1594P4011J73462R369m6308J50247J74272j41j04549
6375A39148j69309n9558M8930K04546j3429j82642K4118J16304j18738l0047l3423
6364g4100M0263J86386K0872l02421k04984J26989J44039J88495j07112J3351
6354C1778l1802k9517R5555K0491m7577m0056p5523p0765q593L930p4153L7761
6342a88471P8931L016j7667p758R4859K39015R5198j39377r403m3459q0456j13240
6330h8812r8218q9967L258J02934J37191K34138M8897j01113j13686Q0476L0473
6319A45571r3451P5000R817p0535r081Q7889p4725r4218L0107O638L1294l0803
$$ plain form
6398 -193237 -186631 -132610 68406 42473 -194190 -176851 -181809 -238372 -271278 -264919 -215322 -143665
6386 -143665 -157308 -279621 -291215 -217204 -43742 -34373 -80681 69566 243838 243697 139148
6375 139148 -30161 -89719 -40789 163757 150328 -32314 -8196 108108 -10630 -40677 -74100
6364 -74100 -33837 152549 173421 -129000 -333984 -206995 -62956 125539 18427 31778
6354 31778 -24 -29541 66014 86505 38928 -1128 -76651 -147416 -156009 -152079 -226232 -188471
6342 -188471 -109540 -106524 -124191 -131949 -37090 201925 297123 157746 148343 104884 24428 -88812
6330 -88812 -187030 -276997 -273739 -170805 -33614 200524 249421 148308 34622 115098 145571
6319 145571 52120 127120 136937 66402 57321 145210 70485 -23733 6374 13012 44306 13503
6307A3503n6973J34965l2930n8338l0532l6207j3895j09683p112Q1559N2219J40222
6295G6798J83311l1877r6147j31796j6662L105n4242j10202r3562J48915J10951
6284a1408q8010j99106j4375Q9173K992J1171J26269l3534m3698n1169Q0806K4028
6272a06861n3652l8151l7577J54685J40714k1956j03259n7938p8557N7359P1137
6261g4056l6820j13480J38M0221m7157m9472J9293J0942j52094M8090R9395J6623
6249b38377n2217P3898l1131J79123O3351l4721M5087m3905K0417R6032j35892
6238e8335q1799M2321k0179j5886m7633O3886J07738m8294L876P345Q9509O1734
6226A04283L8075j21359j20170M0330K16623N0718m6782L8479r8665q3435J39560
$$ plain form
6307 13503 -43470 91495 58565 227 -30305 -66512 -80407 -190090 -197202 -115643 -63424 76798
6295 76798 260109 228232 132085 289 -16373 -13268 -67510 -177712 -271274 -122359 -11408
6284 -11408 -99418 -298524 -312899 -223726 -220734 -209563 -83294 -116828 -160526 -211695 -130889 -106861
6272 -106861 -160513 -198664 -236241 -81556 59158 37202 -66057 -123995 -202552 -145193 -74056
6261 -74056 -110876 -224356 -224218 -183997 -231154 -280626 -261333 -250391 -402485 -354395 -255000 -238377
6249 -238377 -290594 -216696 -247827 -68704 -5353 -40074 5013 -38892 -18475 77557 -58335
6238 -58335 -140134 -97813 -117992 -133878 -181511 -117625 -9887 -58181 -54305 -46960 42549 104283
6226 104283 142358 20999 -99171 -58841 157782 208500 161718 200197 101532 18097 157657
6215A57657J1013j15220r3734J2794p6997N0958k092J4932k949o0786k6740Q5099
6203d6065J28651K5795k10864j08932j1666o2541j33839j9363Q977J49079N2470
6192b28298r772q2301N8130N3183J07329R6373K9650J22739R1884o3394j63085
6181A2438j10983j7138R5809N3653L578j005J8761r2682N4929M1630j303j28729
6169g1042K1731J3039k781R8181J33735J0641q4116K6302r703P0626M2624J3723
6157B62960j45220r7330P8276N0512n8427j29958m988L0806J2747j4884R587p4909
6145h0828N9216K79878K6786j78623p7351J0686R565j14489N9795N3619q728j5487
6133B4039k2923J13424n695m0180Q6322p1747M3588m0153p1077K4522O1061O444
$$ plain form
6215 157657 168670 53450 -40284 -27490 -104487 -53529 -55621 -40689 -43638 -104424 -131164 -46065
6203 -46065 82586 108381 -102483 -211415 -223081 -285622 -419461 -438824 -429847 -280768 -228298
6192 -228298 -238070 -320371 -262241 -209058 -101729 -5356 24294 147033 238917 175523 12438
6181 12438 -98545 -115683 -19874 33779 37357 36352 55113 -37569 17360 58990 57687 -71042
6169 -71042 -49311 -36272 -39053 59128 192863 203504 119388 145690 135987 206613 249237 262960
6157 262960 117740 20410 98686 149198 90771 -39187 -44175 -13369 -622 -15506 -5919 -80828
6145 -80828 -21612 258266 285052 106429 29078 39764 49329 -65160 -5365 48254 39526 24039
6133 24039 1116 114540 108845 68665 154987 83240 126828 86675 15598 40120 101181 107625
6121A07625O231j72067n1014J35938J1370p161q6121k1343M7175L95M1496L1095
6109D3619j55881n7626q3512l5863R0452J36261r1175k4716J33028l499m0816
6098h9728p5304L3004J51786J02105l3303k9620j01836j9929P2364k09148L4884
6087a64725J92145K23l722L8468J09222J4652j63286j26056l7261q6395L8391
6076a88344r4429j02009m9723J46485J29931M2023L1914L7275K12705J473r727
6065A57574j22195j01683n2431Q435J19176l7201j02769p8163J37670o0121n459
6054a37167O9670l3471k7615J231n0922N6099J48746p1282l2289k9854l1378L3014
6042a05218N1106J4994P8939l1310j45654J77950J44055j06233p1027K9281p6438
$$ plain form
6121 107625 113856 -58211 -109225 26713 38083 30922 -55199 -76542 -29367 -28972 12524 43619
6109 43619 -112262 -169888 -253400 -289263 -198811 -62550 -153725 -178441 -45413 -48912 -89728
6098 -89728 -165032 -132028 19758 121863 88560 58940 -42896 -62825 9539 -199609 -164725
6087 -164725 27420 27643 23921 62389 171611 186263 22977 -103079 -140340 -226735 -188344
6076 -188344 -282773 -384782 -434505 -288020 -158089 -116066 -84152 -46877 165828 167301 157574
6065 157574 35379 -66304 -118735 -110300 8876 -28325 -131094 -209257 -71587 -131708 -137167
6054 -137167 -67497 -100968 -128583 -127352 -178274 -122175 26571 -44711 -77000 -106854 -138232 -105218
6042 -105218 -54112 -39118 39821 8511 -137143 40807 184862 78629 7602 36883 -39555
6031c9555m5704q769k9914L5749j60634q3050N9033J42893J79458o001j9809K1558
6019D5255m6992J32827J9863p9962m8671l4143o1718j27156J03284J31454J18596
6008A52637j00106J3764o2119K5896k639l2040j57415M543j30759n993J01629
5997a92602o4034J06346M3721L045l2982j06855m512j1866J905J9879P8275N0732
5985a08948m0585N4085L0278J0791L7158r4333L2498j31023R469o4622j219R1526
5973a74925J51291o3394p7529J14204j7137q362j52662p5327J01277P703m9910
5962b44771N7037q3085l1662J96713K09118J4649p5060r2222K2237L3561o5749
5951e9234k02921J10220M360P7166M5928N8128l0615l506k5128j53799q6324J27424
$$ plain form
6031 -39555 -85259 -94028 -123942 -88193 -248827 -331877 -272844 -129951 49507 43506 23697 45255
6019 45255 -1737 131090 150953 70991 22320 -11823 -73541 -200697 -97413 34041 152637
6008 152637 52531 66295 4176 30072 27433 -4607 -162022 -157479 -288238 -294231 -192602
5997 -192602 -256636 -150290 -106569 -103524 -136506 -243361 -247873 -259739 -257834 -237955 -159680 -108948
5985 -108948 -149533 -95448 -65170 -54379 -17221 -111554 -79056 -210079 -200610 -265232 -266451 -174925
5973 -174925 -23634 -87028 -164557 -50353 -67490 -75852 -228514 -303841 -202564 -194861 -244771
5962 -244771 -187734 -270819 -302481 -105768 103350 117999 42939 -49283 -27046 6515 -59234
5951 -59234 -262155 -151935 -147575 -70409 -24481 33647 3032 -474 -25602 -179401 -265725 -138301
5939a38301N613K3958j2042L8610Q5695J48124n3618j25226j318l1206k1214o7599
5927a48524j19147q5328Q1344J00340N9120q8k1246P0500J26371k2354m3069q5943
5915h8024o0179J02027J9037j22914N0729Q1195j0828m7703m3336P6128M9858
5904E990P6568k5900j6000L5579j38936J7934L5774n2661K4364j8331K8912O1126
5892C4419J2285o4074q4507Q0811P7084J4549M2483j21849K364J00480R806j80719
5880g6868k2574L5814o5127j0731l0278m5804J68943m7521q352j54456n2263J6423
5868b92794Q3769J496j6655J73745R349m1027l9545l3543Q245O8875n8256L3571
5856a02770O9627r062l5858J8716k6562j45785P1041J77936J38453j39950l6764
$$ plain form
5939 -138301 -132688 -108730 -120772 -82162 3533 151657 98039 -27187 -28505 -59711 -80925 -148524
5927 -148524 -267671 -352999 -271655 -171315 -112195 -112283 -133529 -63029 63342 40988 -2081 -88024
5915 -88024 -148203 -46176 -27139 -150053 -99324 -18129 -28957 -76660 -119996 -43868 5990
5904 5990 82558 56658 40658 76237 -62699 -44765 -8991 -61652 -37288 -55619 -26707 34419
5892 34419 46704 -17370 -101877 -21066 56018 70567 113050 -8799 -6435 94045 103851 -76868
5880 -76868 -99442 -63628 -128755 -139486 -169764 -215568 -46625 -94146 -102498 -256954 -309217 -292794
5868 -292794 -209025 -207529 -224184 -50439 -41090 -82117 -121662 -155205 -146960 -78085 -136341 -102770
5856 -102770 -33143 -42205 -78063 -59347 -85909 -231694 -160653 17283 155736 15786 -20978
5845b0978K01988N8220k9314j03813j59163J07235M2439j24292J42393J41757
5835B56472j20410j20257j07085j29856Q6337J18867M6134M4245j28185j84841
5825b38579k2349J18233J37921o167r7300j2286m654M2577j537J47949Q1022p0156
5813G4674o2785j19741r2310J9073J15535l888N0639M6491j347M1992o9229j05097
5801a05993l9465l1322k4680j45830j6389J56910q965J5774j09677N3169J73451
5790h3017j2308O4654N7788j4332p6879j58543j16010Q5584M0309N7171M89j35697
5778b90791k30028J37035K35944n9393K0487O0249L5630M7998M8374j34805p1460
5767b00760o143q2603M6129P092O3502l3286J02818M7436M8131m3521J44357P0931
$$ plain form
5845 -20978 181010 239230 209916 106103 -53060 54175 96614 -27678 114715 256472
5835 256472 136062 15805 -91280 -221136 -134799 -15932 30202 74447 -53738 -238579
5825 -238579 -260928 -142695 -4774 -10941 -108241 -120527 -125181 -82604 -84141 63808 144830 74674
5813 74674 11889 -107852 -200162 -181089 -65554 -69442 -18803 27688 26341 68333 -896 -105993
5801 -105993 -145458 -176780 -201460 -347290 -363679 -206769 -215734 -199960 -309637 -256468 -83017
5790 -83017 -95325 -30671 27117 12785 -64094 -222637 -338647 -253063 -212754 -155583 -155094 -290791
5778 -290791 -520819 -383784 -147840 -207233 -186746 -126497 -90867 -42869 5505 -129300 -200760
5767 -200760 -206903 -289506 -243377 -236285 -172783 -206069 -103251 -55815 -7684 -51205 93152 164083
5755A64083j19294j19039k7380O2941R309J06017P0397L6114j50274p4188L6218
5744e096O4773Q8602q1159j66785m4610N9613O6297M6577L9175k4161j35258J9752
5732g2280J05904j2721M792J27833o1252q2727Q3864J25773L3465k07815m1536
5721C300p2622L7746Q1410m1002j06341N7922r8487j34290k0946j6407J00664
5710b09053J20936J0485k8491j0244N8594Q3207p7947n1217p1399L3399K26349
5699H4619O3219j79881j81128k8113P8363R2328n8804j06890N2050P8073j302
5688a07466j4666Q122P3772M6381k2902O9135J87052j28920k31003k3091M8198
5677i5388l1826J21056J30672P3453J3032q4795j0858n1729J00035k2133J16571
$$ plain form
5755 164083 44789 -74250 -101630 -38689 -29380 76637 147034 183148 32874 -41314 -5096
5744 -5096 59677 148279 67120 -99665 -144275 -84662 -18365 28212 67387 43226 -92032 -72280
5732 -72280 33624 20903 25695 153528 92276 9549 93413 219186 252651 44836 3300
5721 3300 -69322 -31576 49834 8832 -97509 -39587 -138074 -272364 -293310 -309717 -209053
5710 -209053 -88117 -77632 -106123 -116367 -57773 25434 -52513 -103730 -175129 -141730 84619
5699 84619 147838 -32043 -213171 -241284 -162921 -70593 -129397 -236287 -184237 -106164 -107466
5688 -107466 -122132 -114010 -40238 6143 -16759 52376 239428 110508 -120495 -143586 -95388
5677 -95388 -127214 -6158 124514 197967 210999 126204 115346 63617 163652 141519 258090
5666B58090o9347k1519M3935q4484j6049j3544J5546j23671o6574n2050k7332
5655a56999j4149j4818K3851J5252J50416Q3568o8108k1845j11469p1165n3740
5644b39206P6133J6944N4059J30208O374k7406p5258M8240M9942j24561n9461
5633a43992R3478L7872k7874k831Q2969K8600k8624K2164j13827o8921l6388M5870
5621a11504J15736O8624p4448L2611J43537R3675j14200j5579n5163m9460m8510
5610a4681j04683N4056R959L7698K6630j21947j02216o6174k0648p9566Q1709
5599b99863J96419M9005J10923O0734n1145N364L2260q363p3947O0060M3489j20005
5587D931k1377J13949K689n2127K1801q0015j02354J9316j17259P2845N801N6639
$$ plain form
5666 258090 188743 167224 211159 126675 110626 97082 112628 -11043 -77617 -129667 -156999
5655 -156999 -171148 -185966 -162115 -146863 3553 87121 19013 -2832 -114301 -185466 -239206
5644 -239206 -163073 -146129 -92070 38138 44512 17106 -58152 -9912 40030 -84531 -143992
5633 -143992 -50514 -12642 -40516 -43347 39622 68222 39598 61762 -52065 -120986 -157374 -111504
5621 -111504 4232 72856 -1592 31019 174556 268231 154031 138452 83289 33829 -14681
5610 -14681 -119364 -65308 -55349 -17651 8979 -112968 -215184 -281358 -302006 -381572 -299863
5599 -299863 -103444 -54439 56484 117218 66073 71437 103697 95334 21387 81447 124936 4931
5587 4931 -16446 97503 100192 48065 69866 -10149 -112503 -93187 -210446 -137601 -131800 -75161
5575g5161P3550Q3138m4924m7174j50719J8374N5984P7559p8399J4006k7917R2116
5563i567R6440j8064n4947l5897N02N2797n3102L9930O291p5521l374o4414o2119
5550a81045M6008J5735q0356j22452M904J35432n175o9379K4773N622j34605P0489
5538b90049K3762J5327J11539q7947N5328J72675J03999j0661j80701n8678R5665
5527d9741J26345l9318l4233n4766R5294M438q1824j25798o2595J05174j9874
5516a36898j1936n73J09099l3974n9797Q5494J13371J59895r0148k02864m0369
5505a08700Q8605O2498j76118q3979N2465m5937k0111K3193R4869L692m7364Q3108
5493g3779L8794j07962O1658o401N8576j7073M7605N2837m519p783j0650n068
$$ plain form
5575 -75161 -1611 81527 36603 -10571 -161290 -142916 -86932 -9373 -87772 -73766 -101683 -9567
5563 -9567 86873 68809 13862 -22035 -21533 31264 -21838 18092 24383 -51138 -54512 -118926 -181045
5550 -181045 -135037 -119302 -199658 -322110 -317206 -181774 -186949 -256328 -231555 -225933 -360538 -290049
5538 -290049 -266287 -250960 -139421 -227368 -172040 635 104634 93973 -86728 -145406 -49741
5527 -49741 76604 37286 3053 -51713 43581 48019 -33805 -159603 -222198 -117024 -136898
5516 -136898 -148834 -149407 -40308 -74282 -134079 -48585 64786 224681 134533 -68331 -108700
5505 -108700 -20095 42403 -133715 -217694 -165229 -211166 -231277 -208084 -113215 -109523 -156887 -73779
5493 -73779 -34985 -142947 -81289 -87690 -29114 -46187 1418 54255 49736 41953 31303 26235
5481B6235r9812p9220M4845k5167L5583J0966K9357o9567o7622P5960p7283r6513
5469b92238n6579J8132J47112j1581k7000M7548Q2296j0237j3441M8876J12671
5458D5559O934Q8337n0936p0952P7541j3778k8820n6741n1167m9012k369Q0471
5446b4933M1482l6925M4954n9309j39346j9384j112J13701j2811m5955K2728N6577
5434f0333N6568Q554p6366N2105P7796Q4756r80l8131j20422M1716K9605o113
5422D8755j37364j46828p3902N5217J9741j03003N1497K03914P8961L8081o5670
5411c0601j8470N7680J7632O6841P3581j05963j11655j50932P065j269j78189
5400c74280q7538J82769J11822K3697M6707l8796R5969J24607k5866n3781n824
$$ plain form
5481 26235 -73577 -152797 -107952 -133119 -97536 -86570 -57213 -126780 -194402 -118442 -195725 -292238
5469 -292238 -348817 -330685 -183573 -195154 -222154 -174606 -92310 -102547 -115988 -67112 45559
5458 45559 52493 140830 89894 18942 96483 82705 53885 -2856 -54023 -103035 -105404 -24933
5446 -24933 16549 -20376 24578 -34731 -174077 -193461 -194573 -80872 -93683 -139638 -116910 -60333
5434 -60333 -3765 4789 -71577 -19472 58324 143080 142100 103969 -16453 25263 54868 48755
5422 48755 -88609 -235437 -309339 -254122 -234381 -337384 -285887 -81973 -3012 35069 -30601
5411 -30601 -49071 8609 26241 93082 166663 60700 -50955 -201887 -194822 -196091 -374280
5400 -374280 -461818 -279049 -167227 -143530 -96823 -135619 -39650 84957 59091 5310 -514
5389e14o8337j26588j06141j17615N275K38586Q9399L1512L6264Q2175l39j42812
5377g9135P2464r6110q0914J16381J10626l9721o6035j7638r0697l1848r7687
5366c00314R3917M8512O4961q4015n7750K1019O1440J92638l1487j90963k6906
5355b08948J3502J50361J40367J23944o8321N972K0480j18966j09456M3097J80753
5344A72785o8915j63209n3860j20373R1521R9439r953J61987j5559j38841J8973
5333b6005k20K428K1241j5790r1664o133j5407J07170L9616K9702l7548J18815
5321A26205L4676r0844O497j2931o2507n1079n5485N6962K54779r079r7863j84006
5309h4675P0702O8309j15813o0351J07580O0639l1927n3547J15065P4822j19015
$$ plain form
5389 -514 -68851 -195439 -301580 -419195 -413920 -175334 -85935 -54423 -18159 64016 63677 -79135
5377 -79135 -6671 -102781 -183695 -67314 43312 3591 -62444 -80082 -170779 -202627 -300314
5366 -300314 -206397 -157885 -92924 -176939 -234689 -213670 -152230 40408 8921 -182042 -208948
5355 -208948 -195446 -45085 95282 219226 150905 156877 177357 58391 -51065 -7968 172785
5344 172785 103870 -59339 -113199 -233572 -142051 -42612 -52565 109422 93863 -44978 -26005
5333 -26005 -26225 -23797 -2556 -18346 -110010 -116143 -131550 -24380 15236 44938 7390 126205
5321 126205 160881 70037 76534 63603 1096 -49983 -105468 -48506 206273 197194 99331 -84675
5309 -84675 -13973 54336 -61477 -121828 -14248 46391 14464 -39083 75982 150804 31789
5298C1789r0090O0175J84677N7931j50669j24599k5721O0699m0207n5586n4712
5287a46313j2721M4471p5363j7321K27753J1206q3260j0304O539m5037p5730p2382
5275b48462J19770K23432n365o7500k1573K5170R6825n9403l6911O4747J26220
5264B16950N9007P810j42461k18147k6578J26441q988J5312p728o9491j02453
5253a50326N3678P2453j074J5328r1075Q3911J06318j6660o4181J8858k5010J2766
5241A4986O6983j7897j65774o36J31216n524M8118K8959j2193R9733O9009j4651
5229B42329m7276j77547l1024L708p9943J8414N172J09212J03408J5368O7196
5218B29017n1440j25524K2145N3456m4749K503O1762Q8408j05693j64511l8799
$$ plain form
5298 31789 -58301 1874 186551 244482 93813 -30786 -56507 4192 -36015 -91601 -146313
5287 -146313 -159034 -114563 -189926 -207247 20506 31712 -51548 -61852 -55313 -100350 -176080 -248462
5275 -248462 -128692 94740 89375 21875 302 25472 122297 62894 25983 90730 216950
5264 216950 275957 283767 141306 -76841 -103419 23022 14034 29346 21618 -47873 -150326
5253 -150326 -96648 -24195 -25269 -9941 -101016 -17105 89213 72553 8372 27230 2220 14986
5241 14986 81969 64072 -101702 -102338 28878 23354 71472 100431 88238 187971 256980 242329
5229 242329 195053 17506 -13518 -9810 -89753 -71339 -66167 43045 146453 161821 229017
5218 229017 177577 52053 74198 127654 82905 85408 147170 235578 129885 -34626 -73425
5207g3425L656J2376j2557j231P0992J06187n8507L890l8975j6530K3311j6412
5195B775q6294K6817K3507q5063K8155J57457J80415j12194j10249j23390L0378
5184f7686j9398J32194n0344j17431K2957J22049K2319M0270j18694j11110M7814
5173i7060k3829j14604J5381J68820P1823r7907O7999k06385k7726J05911J06189
5162c1388l3479j5737o6789Q0789l270n3464K9605o7469r711q583J96611J10528
5150A27643r203m9969m3008q3720l5289o0235N8688J14780j3809P3196j21781
5139d2707j54286R2473J81663O2289j0484j09280M2147R9694p2322K7611O589
5128A23387j04017j10306p5433J25089M3722j50438Q5619J25306k8937J33817
$$ plain form
5207 -73425 -69769 -57393 -69950 -71181 -189 105998 47491 51381 12406 -4124 19187 2775
5195 2775 -83519 -56702 -33195 -118258 -90103 67354 247769 135575 25326 -98064 -67686
5184 -67686 -87084 45110 -5234 -122665 -99708 22341 44660 84930 -33764 -144874 -97060
5173 -97060 -120889 -235493 -220112 -51292 20531 -77376 -9377 -215762 -243488 -137577 -31388
5162 -31388 -64867 -80604 -147393 -66604 -69874 -123338 -93733 -161202 -170913 -179496 17115 127643
5150 127643 118440 68471 25463 -58257 -93546 -153781 -95093 19687 5878 79074 -42707
5139 -42707 -196993 -104520 77143 139432 128948 19668 61815 161509 89187 116798 123387
5128 123387 19370 -90936 -166369 -41280 2442 -147996 -62377 62929 33992 167809
5118A67809M1847j54634n3985k6902n6852k3100j4892J7021k0709N5351R0745
5107B1699k7804J08008L5329k6837q3591m4009O5756K1762j07539l7738N9579
5096a5385L9645l3505m0504l190l4340j29568o7523K7636k259q7240M844j7199
5084c58588j5040R3142J60229J8669j162q248J6097k4739n3694J43796o2646j49092
5072b41276P9101J03630K6169o010l8720J2581m3182n3743J23548Q1879P2137
5061A16114O1651j15034m5898Q1089O1738J33272m7123m1041j21799k7856J542
5050E6655j05983K4110L3825j10902k4207p0789N0213L0777r9713p213n025m1308
5038b69560L6345J8138M7313O6428J95j01647M8715P5605M9023j8405k1402M801
$$ plain form
5118 167809 209656 55022 1037 -25865 -82717 -105817 -120709 -103688 -124397 -69046 21699
5107 21699 -6105 101903 137232 110395 26804 -17205 48551 70313 -37226 -74964 -15385
5096 -15385 24260 -9245 -49749 -52939 -87279 -216847 -284370 -256734 -258993 -346233 -341389 -358588
5084 -358588 -373628 -280486 -120257 -101588 -102750 -110998 -94901 -119640 -173334 -29538 -92184 -241276
5072 -241276 -162175 -58545 -32376 -38386 -77106 -64525 -107707 -161450 -37902 43977 116114
5061 116114 177765 62731 16833 97922 159660 292932 245809 204768 82969 55113 56655
5050 56655 -49328 -25218 8607 -102295 -126502 -197291 -147078 -116301 -216014 -223227 -228252 -269560
5038 -269560 -233215 -215077 -167764 -101336 -101141 -202788 -154073 -78468 -29445 -47850 -69252 -64451
5026f4451M5756O9485p0240n2925K8110j50945o1651J36501J91712O7780l6098
5015A03034q4602j54178n5578J20654J74541J612j73531m2385K0867K6038J3120
5004e0408J28822K7408k6148r2868P9197K0207J03453Q9932o0534j77888o343
4993C4830Q3383N0604N384l5240O818J05783K1244j72430k30819r7090k3726n3316
4981c04575J29071P4619K1098j16229K9669O6194K0449j75226p5258J198J06296
4970b22694Q0621j70498J7355J11384R4037j9048j16131j40324K1705R9073l497
4959b48017N213M4087L3773J86l9953R0413J62339j4104M351J04225j060j3292
4947A28161p1243q3319j6628l8941l5152k2864J28021k3167M42m762q4056M5934
$$ plain form
5026 -64451 -18695 50790 -19450 -72375 -44265 -195210 -256861 -120360 71352 139132 103034
5015 103034 18432 -135746 -191324 -70670 103871 105483 -68048 -110433 -89566 -63528 -50408
5004 -50408 78414 105822 79674 -13194 66003 86210 189663 279595 219061 41173 34830
4993 34830 118213 168817 174201 138961 145779 251562 272806 100376 -130443 -227533 -251259 -304575
4981 -304575 -175504 -100885 -79787 -196016 -166347 -100153 -79704 -254930 -330188 -328990 -222694
4970 -222694 -142073 -312571 -295216 -183832 -89795 -108843 -224974 -365298 -343593 -244520 -248017
4959 -248017 -242804 -198717 -164944 -164758 -204711 -114298 48041 33937 38288 142513 141453 128161
4947 128161 56918 -26401 -43029 -81970 -117122 -139986 -11965 -35132 -34690 -39452 -123508 -77574
4935g7574q2000q676N0519o316K7173P4178j5882J4618O4411l7555J10383k1498
4923I1781K05676J09208k45717k08595J6107j19902q5867M9146J77491J62117
4913A51445l1271o7518o69O7397O9317o6938r785Q5940o5636p8305l2771r8549
4901g7343n9610K7259L3981L5556J2086Q6061L2024q4930L2761R0843j60344r8933
4889a30589q8704N1956M1468o2152q7652j39943J16440J24670j98297o8641J03563
4878c37881J74280J74706R1149q6717k6662q6658p3395j2056N2237r3778l7267
4867b62042k1332J17735J72919O1635n2088j28556q8757k7761L5968M6440J2190
4856a33649J16180p3831M58O2484Q18m8550L4892N6365M6517M5054K8506o8760
$$ plain form
4935 -77574 -159574 -168250 -117731 -124047 -96874 -22696 -38578 -23960 40451 2896 113279 91781
4923 91781 297457 406665 160948 -47647 -31540 -151442 -237309 -188163 -10672 151445
4913 151445 120174 52656 51987 119384 188701 121763 111978 197918 132282 53977 21206 -77343
4901 -77343 -136953 -109694 -75713 -40157 -28071 57990 90014 5084 37845 128688 -31656 -130589
4889 -130589 -219293 -167337 -125869 -188021 -275673 -415616 -299176 -174506 -372803 -441444 -337881
4878 -337881 -163601 11105 102254 15537 -11125 -97783 -171178 -183234 -130997 -224775 -262042
4867 -262042 -283374 -165639 7280 68915 16827 -111729 -200486 -228247 -192279 -145839 -133649
4856 -133649 -17469 -91300 -90842 -28358 -27540 -76090 -41198 15167 61684 106738 135244 66484
4844F6484l5443K94p1286n8436N9442l6041M5536Q75R9109m1643j18839q1913
4832a71861M4245M1403J5667L2252L2780j2643p8607R545K6596R9923p9q5106
4820d5885n065j00459q772l2336P7457N8635j8010J607P6536n8138K364l7344
4808h9410N8624k7496m6170N4458R0233K3142n2999q3934j8895M5637K67316p2979
4796A47527j53439j03637P6581K8721Q8634j00914j08144l7827K2125M8715N9454
4785c2204Q5505J43536l7029m7810q7955r3151N6635O1848m7054N4423Q0756Q2653
4773B20153j20407p4973R5120m0474j3055P3547j892j8495l1368m7662r0362N9081
4761I213m2388k7296M6302n823l5682J12115p1837M2040o5649p502Q0690J4463
$$ plain form
4844 66484 31041 31335 -39951 -98387 -38945 -74986 -29450 -28575 70534 28891 -89948 -171861
4832 -171861 -127616 -86213 -70546 -38294 -5514 -18157 -96764 -87219 -60623 39300 39221 -45885
4820 -45885 -50950 -151409 -160181 -192517 -115060 -56425 -74435 -72828 3708 -54430 -52066 -89410
4808 -89410 -30786 -58282 -104452 -49994 40239 63381 10382 -73552 -92447 -46810 220506 147527
4796 147527 -5912 -109549 -32968 -4247 84387 -16527 -124671 -162498 -140373 -91658 -32204
4785 -32204 53301 196837 159808 111998 24043 -69108 -12473 49375 2321 56744 137500 220153
4773 220153 99746 24773 119893 79419 66364 139911 138019 119524 88156 40494 -49868 9213
4761 9213 -33175 -60471 -14169 -19992 -55674 56441 -15396 26644 -39005 -46507 34183 48646
4749D8646j9496j53661o4682Q8935J08698R6536l250j04853j86178l1947J76167
4738d5085J0084n973M7380N9492j9613k8689p2935j1221K9898K9908K1168q4366
4726f9952P1464P9724j69224p6026l8084Q3552L1800L2161p0532j00173Q7095
4715a38195J38267O2932O1640j55268j18666J06076J24847o6704l7785J24662
4705A01806J01833q353j54791M4206r5618r8644k2264N2483J12438M0969K8607
4694A02672J6967J5235j50420r3791j903q8997J19193J22352m9448k3345N2459
4683B0974m2205K7901J15687J48848l7387q5207n434j6906J1206j03259q5850
4672e1632K0616J705m877m3721n0909o0161K7148J1116n7328j33616j0811J45540
$$ plain form
4749 48646 29150 -124511 -189193 -100258 8440 104976 101726 -3127 -189305 -221252 -45085
4738 -45085 -35001 -40974 6406 65898 46285 17596 -55339 -66560 -36662 -6754 14414 -69952
4726 -69952 1512 81236 -87988 -164014 -202098 -118546 -86746 -54585 -125117 -225290 -138195
4715 -138195 72 63004 124644 -30624 -149290 -43214 81633 14929 -22856 101806
4705 101806 203639 195286 40495 84701 -10917 -109561 -131825 -79342 33096 74065 102672
4694 102672 119639 134874 -15546 -109337 -111240 -200237 -81044 41308 -8140 -31485 20974
4683 20974 -21231 6670 122357 271205 233818 148611 143177 126271 137477 34218 -51632
4672 -51632 -31016 -29311 -34188 -77909 -128818 -188979 -161831 -150715 -208043 -341659 -352470 -206930
4660b06930J40968k2283L8841j6303M606O282k9540j02133l6314K1179J26311
4649g5316J59882K2228p5552l0200k26179q9874k2373N9500J43117J11143J82701
4638A59077n8289K023M377n4225r2576j07255j33954P4599P8363P6736J24921
4627G3797M2143k1508o1550J33245P9802j41991k27456k1888p4446q4102J08038
4616a95916m1439j2105j9606N4078L1484l419k7907O4614O4086j48500K5116J10338
4604i9176J740J82475Q3290p688j17133l1818J78748M9729j80590m4969l007J27970
4592A39571n0819j43476P5044l6375k2778j9972q2025J60704R6427j8258j05362
4581g319j10718j7860K7782n8249J9557Q1801q6767m8549O5895J27719j56859
$$ plain form
4660 -206930 -65962 -88245 -49404 -65707 -61101 -54819 -84359 -186492 -222806 -201627 -75316
4649 -75316 84566 106794 31242 1042 -225137 -315011 -337384 -277884 -134767 -23624 159077
4638 159077 100788 102811 107188 52963 -39613 -146868 -280822 -206223 -127860 -51124 73797
4627 73797 115940 94432 32882 166127 245929 103938 -123518 -145406 -219852 -303954 -195916
4616 -195916 -237355 -249460 -269066 -214988 -183504 -186923 -214830 -150216 -86130 -234630 -209514 -99176
4604 -99176 -97436 85039 168329 160641 43508 11690 190438 240167 59577 14608 11601 139571
4592 139571 88752 -54724 20320 -16055 -38833 -58805 -140830 19874 116301 98043 -7319
4581 -7319 -118037 -135897 -108115 -166364 -146807 -65006 -151773 -200322 -134427 -6708 -163567
4570a63567L0872m2925Q3724J64096R0982j48191r6995p1743J35352L9475q3261
4559f2181N612J9068k9788M4937J33713j17311J5291j7973q6834l6893P4633J07752
4547E0026p651r0002j5457O3681J83926j2430n1192j13132j2214M6173L1038R101
4535H1867O8938J9926j4772j62502M635L7737p2895j2776j638K8684o8532J886
4523h9442J4348J5618P0772m1471m3175L0498Q7615K9134j22344k01597J4452
4512b35592O7015m5997J2244O6490K9435L4249j6311J02489R3909O7017q1457
4501I3491k23976k954J37952J43635m8342j9502K9736k7702o0584q614p6381q8966
4489a52207J61197O2800k3225j2068j0548N052R554l5812n7263k24963J12447
$$ plain form
4570 -163567 -132695 -175620 -91896 72200 163182 14991 -82004 -153747 -18395 21080 -62181
4559 -62181 -56569 -37501 -67289 -22352 111361 -5950 9341 -8632 -95466 -132359 -57726 50026
4547 50026 42375 -47627 -63084 597 184523 172093 120901 7769 -4445 41728 72766 81867
4535 81867 150805 170731 155959 -6543 -1908 35829 -37066 -49842 -51480 -22796 -91328 -89442
4523 -89442 -75094 -59476 11296 -30175 -73350 -42852 44763 73897 -48447 -250044 -235592
4512 -235592 -168577 -214574 -202330 -135840 -106405 -72156 -88467 14022 107931 174948 93491
4501 93491 -130485 -133439 4513 148148 99806 80304 110040 82338 21754 13140 -63241 -152207
4489 -152207 8990 71790 48565 36497 25949 31001 40555 4743 -52520 -277483 -165036
4478a65036Q5456M2110l3863K4508K9513o8558p93L0933J0111j90303j7406K4743
4466b28585j2756p1855R2584J35086J54213P9476j05416j25223M6434K2947J32217
4455A19122R8135m6509o9109Q2979j848j52072o2172j05615p8056N4626J44491
4444a6028L6217o4859l9924J28280j02709n8518Q7368P1460m7015L7564N3457
4433H5293P8353l2686m2083l8639m0001q5977N3558J03267O3392j04301K587k3789
4421A8974N4497J31226r7352m9190n2771K082J28983M067L8482j7253q9183L6237
4409A08799r5185l0837k5372k4748O0733Q8559o2715l371N8298p5593j57916n5313
4397b14661l1344n329Q2364J54378L6547N4267P1032j88941p3836K4572J00681
$$ plain form
4478 -165036 -79580 -37470 -71333 -46825 -17312 -85870 -86663 -55730 -45619 -235922 -253328 -228585
4466 -228585 -241341 -313196 -220612 -85526 68687 148163 42747 -82476 -36042 -13095 119122
4455 119122 217257 170748 101639 184618 182770 30698 -31474 -137089 -215145 -160519 -16028
4444 -16028 20189 -44670 -84594 43686 -59023 -117541 -30173 41287 -5728 31836 85293
4433 85293 163646 130960 88877 50238 10237 -75740 -22182 81085 144477 40176 42763 18974
4421 18974 73471 204697 107345 58155 5384 7466 136449 140516 178998 161745 72562 108799
4409 108799 13614 -17223 -42595 -67343 -6610 81949 19234 15863 74161 -1432 -159348 -214661
4397 -214661 -246005 -251334 -168970 -14592 21955 76222 147254 -41687 -115523 -90951 9730
4386I730m0104M3758J08325R5421k7451k1205j7677l8483l4263j0795L4697J7739
4374A19692p7619m6823m7729o166J547J49841k3845j70865K820n6552m7615N989
4362a97325K3100N5930o1931K9507J14099l7013n5068J6143N9025J34634N4531
$$ plain form
4386 9730 -30374 13384 121709 217130 189679 168474 150797 112314 78051 67256 101953 119692
4374 119692 42073 -4750 -52479 -58645 -57098 92743 68898 -101967 -99147 -155699 -203314 -197325
4362 -197325 -174225 -118295 -180226 -150719 -36620 -73633 -128701 -112558 -53533 81101 135632
$$ [...]
##END NTUPLES=NMR SPECTRUM
##END=
