##TITLE=Analysis number 323198
Compound Code cc 41213
Project Code adrs
Chemist Name synthon
##JCAMPDX= 6.0         $$ Bruker NMR JCAMP-DX V2.0
##DATA TYPE= NMR SPECTRUM
##DATA CLASS= NTUPLES
##ORIGIN= Bruker BioSpin GmbH
##OWNER= nmr
$$ XWIN-NMR		Version 3.5
$$ Wed Oct 18 10:38:45 2006 GMT Daylight Time (UT+1h)  MAYBRIDGE\nmr@NMR_250MHZ
##.OBSERVE FREQUENCY= 250.131544655141
##.OBSERVE NUCLEUS= ^1H
##.ACQUISITION MODE= SIMULTANEOUS (DQD)
##.ACQUISITION SCHEME= undefined
##.AVERAGES= 16
##.DIGITISER RES= 18
##SPECTROMETER/DATA SYSTEM= dpx250
##.PULSE SEQUENCE= zg30
##.SOLVENT NAME= CDCl3
##.SHIFT REFERENCE= (INTERNAL, CDCl3, 0, 16.522)
##AUDIT TRAIL= $$ (NUMBER, WHEN, WHO, WHERE, WHAT)
$$ ##TITLE= Audit trail, XWIN-NMR		Version 3.5
$$ ##JCAMPDX= 5.01
$$ ##ORIGIN= Bruker BioSpin GmbH
$$ ##OWNER= nmr
$$ C:\u/data/dgb/nmr/ADRS/890/pdata/1/auditp.txt
$$ ##AUDIT TRAIL=  $$ (NUMBER, WHEN, WHO, WHERE, WHAT)
(   1,<2006-10-18 10:38:02.18 +100>,<MAYBRIDGE\nmr>,<NMR_250MHZ>,
      <created by zg, POWCHK disabled, PULCHK disabled
       configuration hash MD5:
       49 4B E0 1D 92 C2 6B 37 9F E6 65 BC 52 41 86 1D
       data hash MD5: 64K
       46 99 DA 94 14 41 06 74 4B 4B 35 E3 27 EE B7 4B>)
(   2,<2006-10-18 10:38:24.85 +100>,<MAYBRIDGE\nmr>,<NMR_250MHZ>,
      <Start of raw data processing
       ef LB = 0.3 FT_mod = 6 PKNL = 1 SI = 32K 
       data hash MD5: 32K
       D2 A7 B0 8E CF 0C 63 94 BD B1 35 16 79 69 41 64>)
(   3,<2006-10-18 10:38:32.04 +100>,<MAYBRIDGE\nmr>,<NMR_250MHZ>,
      <apk 
       data hash MD5: 32K
       CF 98 4A 00 F0 E3 1D 08 AE 30 AC 81 B8 0D 0C 0F>)
(   4,<2006-10-18 10:38:33.81 +100>,<MAYBRIDGE\nmr>,<NMR_250MHZ>,
      <abs ABSG = 5 
       data hash MD5: 32K
       B7 C6 48 54 DA BD FF 9B 63 A1 45 37 D7 67 4B EB>)
$$ ##END=
$$ 
$$ hash MD5
$$ E9 05 DE 46 D5 41 2E 35 AF 61 4E 85 4B 14 B8 E0
##$RELAX= 
##$RELAX= 
##$RELAX= 
##$RELAX= 
##$RELAX= 
##$RELAX= 
##$RELAX= 
$$ Bruker specific parameters
$$ --------------------------
##$DU= <C:\u>
##$EXPNO= 890
##$NAME= <ADRS>
##$PROCNO= 1
##$TYPE= <nmr>
##$USER= <dgb>
##$AMP= (0..31)
100 100 100 100 100 100 100 100 100 100 100 100 100 100 100 100 100 100 
100 100 100 100 100 100 100 100 100 100 100 100 100 100 
##$AQSEQ= 0
##$AQ_mod= 3
##$AUNM= <au_zg>
##$AUTOPOS= <8 >
##$BF1= 250.13
##$BF2= 250.13
##$BF3= 250.13
##$BF4= 250.13
##$BF5= 500.13
##$BF6= 500.13
##$BF7= 500.13
##$BF8= 500.13
##$BYTORDA= 1
##$CFDGTYP= 0
##$CFRGTYP= 5
##$CHEMSTR= <none>
##$CNST= (0..31)
1 1 145 1 1 1 1 1 1 1 1 1 1 1 1 1 1 1 1 1 1 1 1 1 1 1 1 1 1 1 1 1 
##$CPDPRG= <>
##$CPDPRG1= <>
##$CPDPRG2= <>
##$CPDPRG3= <>
##$CPDPRG4= <mlev>
##$CPDPRG5= <mlev>
##$CPDPRG6= <mlev>
##$CPDPRG7= <mlev>
##$CPDPRG8= <mlev>
##$CPDPRGB= <>
##$CPDPRGT= <>
##$D= (0..31)
0 1 0 0 0 0 0 0 0 0.06 0 0 0 0 0 0 0.0002 0 0 0 0 0 0 0 0 0 0 0 0 0 0 
0 
##$DATE= 1161164276
##$DBL= (0..7)
120 120 120 120 120 120 120 120 
##$DBP= (0..7)
150 150 150 150 150 150 150 150 
##$DBP07= 0
##$DBPNAM0= <>
##$DBPNAM1= <>
##$DBPNAM2= <>
##$DBPNAM3= <>
$$ [...]
##$SUBNAM7= <"">
##$SUBNAM8= <"">
##$SUBNAM9= <"">
##$SW= 20.6930455092707
##$SWIBOX= (0..15)
0 0 3 0 0 0 0 0 0 0 0 0 0 0 0 0 
##$SW_h= 5175.983436853
##$TD= 65536
##$TD0= 1
##$TE= 683.16
##$TE2= 300
##$TE3= 300
##$TEG= 300
##$TL= (0..7)
0 120 120 120 120 120 120 120 
##$TP= (0..7)
150 150 150 150 150 150 150 150 
##$TP07= 0
##$TPNAME0= <>
##$TPNAME1= <>
##$TPNAME2= <>
##$TPNAME3= <>
##$TPNAME4= <>
##$TPNAME5= <>
##$TPNAME6= <>
##$TPNAME7= <>
##$TPOAL= (0..7)
0.5 0.5 0.5 0.5 0.5 0.5 0.5 0.5 
##$TPOFFS= (0..7)
0 0 0 0 0 0 0 0 
##$TUNHIN= 0
##$TUNHOUT= 0
##$TUNXOUT= 0
##$USERA1= <user>
##$USERA2= <user>
##$USERA3= <user>
##$USERA4= <user>
##$USERA5= <user>
##$V9= 5
##$VALIST= <valist>
##$VCLIST= <CCCCCCCCCCCCCCC>
##$VD= 0
##$VDLIST= <DDDDDDDDDDDDDDD>
##$VPLIST= <PPPPPPPPPPPPPPP>
##$VTLIST= <TTTTTTTTTTTTTTT>
##$WBST= 1024
##$WBSW= 4
##$XGAIN= (0..3)
0 0 0 0 
##$XL= 0
##$YL= 0
##$YMAX_a= 556563
##$YMIN_a= -515493
##$ZGOPTNS= <>
##$ZL1= 120
##$ZL2= 120
##$ZL3= 120
##$ZL4= 120
##$ABSF1= 16.522
##$ABSF2= -4.171173
##$ABSG= 5
##$ABSL= 3
##$ALPHA= 0
##$AQORDER= 0
##$ASSFAC= 0
##$ASSFACI= 0
##$ASSFACX= 0
##$ASSWID= 0
##$AUNMP= <proc_1d>
##$AZFE= 0.1
##$AZFW= 0.1
##$BCFW= 0
##$BC_mod= 0
##$BYTORDP= 0
##$COROFFS= 0
##$CY= 12.5
##$DATMOD= 1
##$DC= 0
##$DFILT= <>
##$DTYPP= 0
##$F1P= 14.0000005364418
##$F2P= -0.99999901652339
##$FCOR= 0.5
##$FTSIZE= 32768
##$FT_mod= 6
##$GAMMA= 0
##$GB= 0
##$INTBC= 1
##$INTSCL= 1
##$ISEN= 128
##$LB= 0.3
##$LEV0= 0
##$LPBIN= 0
##$MAXI= 10000
##$MC2= 0
##$MEAN= 0
##$ME_mod= 0
##$MI= 0
##$NCOEF= 0
##$NC_proc= -4
##$NLEV= 6
##$NOISF1= 0
##$NOISF2= 0
##$NSP= 0
##$NTH_PI= 0
##$NZP= 0
##$OFFSET= 16.522
##$PC= 1
##$PHC0= 185.3215
##$PHC1= -38.34945
##$PH_mod= 1
##$PKNL= yes
##$PPARMOD= 0
##$PSCAL= 4
##$PSIGN= 0
##$REVERSE= no
##$SF= 250.13
##$SI= 32768
##$SIGF1= 0
##$SIGF2= 0
##$SINO= 400
##$SIOLD= 32768
##$SREGLST= <1H.CDCl3>
##$SSB= 0
##$STSI= 32768
##$STSR= 0
##$SW_p= 5175.98343685301
##$SYMM= 0
##$S_DEV= 0
##$TDeff= 65536
##$TDoff= 0
##$TI= <Analysis number 999999
Compound Code 99
Book Reference 9
Project Code 9>
##$TILT= no
##$TM1= 0
##$TM2= 0
##$TOPLEV= 0
##$USERP1= <user>
##$USERP2= <user>
##$USERP3= <user>
##$USERP4= <user>
##$USERP5= <user>
##$WDW= 1
##$XDIM= 32768
##$YMAX_p= 271494368
##$YMIN_p= -738061
$$ End of Bruker specific parameters
$$ ---------------------------------
##NTUPLES= NMR SPECTRUM
##VAR_NAME=  FREQUENCY,     SPECTRUM/REAL,   SPECTRUM/IMAG
##SYMBOL=    X,             R,               I
##VAR_TYPE=  INDEPENDENT,   DEPENDENT,       DEPENDENT
##VAR_FORM=  AFFN,          ASDF,            ASDF
##VAR_DIM=   32768,         32768,           32768
##UNITS=     HZ,            ARBITRARY UNITS, ARBITRARY UNITS
##FACTOR=    0.157963299565203, 1,           1
##FIRST=     4132.6476996994, 0,             0
##LAST=      -1043.33573715361, 0,           0
##MIN=       -1043.33573715361, -738061,     0
##MAX=       4132.6476996994, 271494368,     0
$$ Real data points
##PAGE= N=1
##DATA TABLE= (X++(R..R)), XYDATA
$$ [...]
16206a9949k725o781m694L593J901l17k227M284J1141K40n617j1612n347J073
$$ -19949 -22674 -29455 -34149 -30556 -28655 -28972 -31199 -26915 -15774 -15534 -21151 -32763 -38110 -37037
16192c7037L99M737P147j794k002N134P398Q80l930o859m163J957j164K932m615
$$ -37037 -36638 -31901 -24754 -26548 -28550 -23416 -16018 -15138 -19068 -25927 -30090 -28133 -29297 -26365 -30980
16177c0980q729m019J1470j832j5207m367J7673K071L494P22m788j440o277O811
$$ -30980 -39709 -43728 -32258 -34090 -49297 -53664 -35991 -33920 -30426 -29704 -34492 -35932 -42209 -35398
16163c5398Q588K650J986l739q661l681l542K590m819j984J360R56R816L36k184
$$ -35398 -26810 -24160 -22174 -25913 -34574 -38255 -41797 -39207 -44026 -46010 -44650 -43694 -33878 -33542 -35726
16148c5726K005j938p725P334J484O013p332j083O466M706l560l409j109j401
$$ -35726 -33721 -35659 -43384 -36050 -34566 -28553 -35885 -36968 -30502 -25796 -29356 -32765 -33874 -35275
16134c5275O871N090p522j1337q754J732L236j144J348R242n622M208l680j712
$$ -35275 -28404 -23314 -30836 -42173 -50927 -49195 -45959 -47103 -45755 -36513 -42135 -37927 -41607 -43319
16120d3319P421M440R962r34l558Q375j0967j4527o730J347N761K290P99j523
$$ -43319 -35898 -31458 -21496 -22430 -25988 -17613 -28580 -43107 -49837 -48490 -42729 -40439 -39640 -41163
16106d1163R027O60L631Q30L771P763p03p951j1241K73P398M450r632k688j241
$$ -41163 -32136 -31476 -27845 -27015 -23244 -15481 -16184 -24135 -35376 -35103 -27705 -23255 -32887 -35575 -36816
16091c6816J589j779k854j97J579K639P843l748L503J4029J621k0315q828R85
$$ -36816 -35227 -37006 -39860 -40057 -38478 -35839 -27996 -31744 -28241 -14212 -12591 -32906 -41734 -40749
16077d0749J436K803N206J515n014n270K74m018o12j033P513J1579l353j3524
$$ -40749 -39313 -36510 -31304 -29789 -34803 -40073 -39799 -43817 -44429 -45462 -37949 -26370 -29723 -43247
16063d3247k395l642k445J1925P663O28J069m297l297k275j822N530J035L343
$$ -43247 -45642 -49284 -51729 -39804 -32141 -31513 -30444 -34741 -38038 -40313 -42135 -36605 -35570 -32227
16049c2227O40l606m761l226n580m376j091O665N465M66k27Q2O802O853o901l108
$$ -32227 -31587 -35193 -39954 -43180 -48760 -53136 -54227 -47562 -42097 -41631 -41858 -41776 -34974 -28121 -35022 -38130
16033c8130M917M500n2k824P20K571q672m411N977N341P34P150j690r644m354
$$ -38130 -33213 -28713 -28765 -31589 -30869 -28298 -36970 -41381 -35404 -30063 -29329 -22179 -23869 -33513 -37867
16018c7867m352p17O666R249l369r077l691r03q95L695R084J562j0775L04K108
$$ -37867 -42219 -42936 -36270 -27021 -30390 -39467 -43158 -44061 -44956 -41261 -32177 -30615 -41390 -41086 -38978
16003c8978N779J351l749K588K940m318m585L33K562m862l471N743J0621N541
$$ -38978 -33199 -31848 -35597 -33009 -30069 -34387 -38972 -38639 -36077 -40939 -44410 -38667 -28046 -22505
15989b2505l821n195q852N75O419l367r961n691o1Q889P88R28j513M118m61j012
$$ -22505 -26326 -31521 -40373 -39798 -33379 -36746 -46707 -52398 -52459 -43570 -42782 -41854 -43367 -39249 -39710 -40722
15973d0722L023J425n362K3J698p915L108O039O107L225L673m289j0338j988O009
$$ -40722 -37699 -36274 -41636 -41613 -39915 -47830 -44722 -38683 -32576 -29351 -25678 -29967 -40305 -42293 -36284
15958c6284N307j910n707O2L815J102l570j3159n690J571N244R661N365J663J011
$$ -36284 -30977 -32887 -38594 -38532 -34717 -33615 -37185 -50344 -56034 -54463 -49219 -39558 -34193 -32530 -31519
15943c1519j864j128l609k437K038J450k710m194j794l65J82M484N03Q994R06
$$ -31519 -33383 -34511 -38120 -40557 -38519 -37069 -39779 -43973 -45767 -46132 -45950 -41466 -40963 -31969 -31063
15928c1063j0502m867p31M337n160M182K510q81L141k377j043K127L158l24l385
$$ -31063 -41565 -46432 -47163 -42826 -47986 -43804 -41294 -42175 -39034 -41411 -42454 -40327 -37169 -37493 -40878
15913d0878m222P555l091m911K443N246M431j377j2622m147J223j58Q451J3434
$$ -40878 -45100 -37545 -40636 -45547 -43104 -37858 -33427 -34804 -47426 -51573 -50350 -50508 -42057 -28623
15899b8623Q958J587r436p452L223J677K921K379J304m427k448p807P86K192J633
$$ -28623 -19665 -18078 -27514 -34966 -31743 -30066 -27145 -24766 -23462 -27889 -30337 -38144 -37358 -35166 -33533
15884c3533K314j33K134l873j990q825r36l851q447J3934L299o50L425M095m461
$$ -33533 -31219 -31352 -29218 -33091 -35081 -43906 -44842 -48693 -57140 -43206 -39907 -40557 -37132 -33037 -37498
15869c7498o60N278O684K577l904j1758j4912L041P71k138j779N115R485j104
$$ -37498 -38158 -32880 -26196 -23619 -27523 -39281 -54193 -51152 -50381 -52519 -54298 -49183 -39698 -40802
15855d0802N103M162q798k147j932O543l721p248l220Q31P868n16R48m911l83
$$ -40802 -35699 -31537 -40335 -42482 -44414 -37871 -41592 -48840 -52060 -51229 -43361 -43877 -42929 -47840 -48223
15840d8223O757J415j680J42J552k790n103o65o121j051Q486K264O30k884k544
$$ -48223 -41466 -40051 -41731 -41589 -40037 -42827 -47930 -48595 -54716 -55767 -47281 -45017 -44387 -47271 -49815
15825d9815O513K624J34N019n735l356O90k79L015m308P91M097K199o152r627
$$ -49815 -43302 -40678 -40544 -35525 -41260 -44616 -43926 -44205 -41190 -45498 -44707 -40610 -38411 -44563 -54190
15810e4190Q831O185M149l262n421N88P07R66L667M001K489l574o372m10N795
$$ -54190 -45359 -39174 -35025 -38287 -43708 -43120 -42413 -41447 -37780 -33779 -31290 -34864 -41236 -41646 -35851
15795c5851N64p690k127K077L207L337N02N679N749j843m361r311o463j895l809
$$ -35851 -35287 -42977 -45104 -43027 -39820 -36483 -35981 -30302 -24553 -26396 -30757 -40068 -46531 -48426 -52235
15780e2235L334K562P486K762k94M656L777r402j858O11o414L395P486p20o815
$$ -52235 -48901 -46339 -38853 -36091 -36385 -31729 -27952 -37354 -39212 -38601 -45015 -41620 -34134 -34854 -41669
15765d1669m623o33K412q12J468M156L20L320J05q567n800Q858M054L839M615
$$ -41669 -46292 -46925 -44513 -45325 -43857 -39701 -39381 -36061 -35956 -44523 -50323 -41465 -37411 -33572 -28957
15750b8957K68N05q727p116N618M517L089j011J356L944J322m670q530K942Q115
$$ -28957 -28689 -28184 -36911 -44027 -38409 -33892 -30803 -31814 -30458 -26514 -25192 -29862 -38392 -35450 -27335
15735b7335m60q422l813o082k590M683L29k595j0362K904M965R088N539k261k81
$$ -27335 -27795 -36217 -40030 -46112 -48702 -44019 -43690 -46285 -56647 -53743 -48778 -39690 -34151 -36412 -36693
15720c6693J521Q619P250j0729j6881q122J761P724K541K837J515m851k60r756
$$ -36693 -35172 -26553 -19303 -30032 -46913 -55035 -53274 -45550 -43009 -40172 -38657 -43508 -43768 -53524
15706e3524p765R298P901j054k741M16l358m777p5J3909O914j0409o814J518L10
$$ -53524 -61289 -51991 -44090 -45144 -47885 -47469 -50827 -55604 -55679 -41770 -34856 -45265 -52079 -50561 -50251
15691e0251L335P906M967l209p61L042j480j381O53m565L3J339M937o009L304
$$ -50251 -46916 -39010 -34043 -37252 -38013 -34971 -36451 -37832 -37179 -41744 -41711 -40372 -35435 -41444 -38140
15676c8140P49q290n016N423P152J672m091N34J665j587r46L359m491m81K632
$$ -38140 -37391 -45681 -50697 -45274 -38122 -36450 -40541 -40007 -38342 -39929 -40875 -37516 -42007 -42488 -39856
15661c9856n7j509M30l463q252M713K709n049M39J236q550K90K765j727P61l896
$$ -39856 -39913 -41422 -40992 -44455 -52707 -47994 -45285 -50334 -49895 -48659 -57209 -56919 -54154 -55881 -55120 -59016
15645e9016k075R313J3972N493r889k719L123L766K968q762J047J0624K713n628
$$ -59016 -61091 -51778 -37806 -32313 -42202 -44921 -41798 -38032 -35064 -43826 -42779 -32155 -29442 -35070
15631c5070k658k294L015N885J932p58k41l538k261o746M795Q15N336j288l414
$$ -35070 -37728 -40022 -37007 -31122 -29190 -29948 -30189 -33727 -35988 -42734 -37939 -37124 -31788 -33076 -36490
15616c6490j350k617J255m744K192q40K035P819J415j1144L34K941k601p002j376
$$ -36490 -37840 -40457 -39202 -43946 -41754 -42594 -40559 -32740 -31325 -42469 -42135 -39194 -41795 -48797 -50173
15601e0173K886k984k096n27J652O416P200o317m784K059l50m687p24M241O127
$$ -50173 -47287 -50271 -52367 -52894 -51242 -44826 -37626 -43943 -48727 -46668 -47018 -51705 -52429 -48188 -42061
15586d2061n69L122L022n13k412n620j757j839R243M038q25n2o138p01M779l353
$$ -42061 -42630 -39508 -36486 -36999 -39411 -45031 -46788 -48627 -39384 -35346 -36171 -36223 -42361 -43062 -38283 -41636
15570d1636j1302L613O942P052m197n47R711j986j1129o24L987L672j0595o222
$$ -41636 -52938 -49325 -42383 -35331 -39528 -40075 -30364 -32350 -43479 -44103 -40116 -36444 -47039 -53261
15556e3261P222M330k367L305L78m321o048j563O586Q650P165J365n550o195L922
$$ -53261 -46039 -41709 -44076 -40771 -40393 -44714 -50762 -52325 -45739 -37089 -29924 -28559 -34109 -40304 -36382
15541c6382K952r843J005k853k050J425O810n709N704j622l622N66k071m11k080
$$ -36382 -33430 -43273 -42268 -45121 -47171 -45746 -38936 -44645 -38941 -40563 -44185 -43619 -45690 -46101 -48181
15526d8181j323M29N518Q671K370K056r30j1427K733R65n525p324L685M002j367
$$ -48181 -49504 -49075 -43557 -34886 -32516 -30460 -31390 -42817 -40084 -39119 -44644 -51968 -48283 -44281 -45648
15511d5648N302l651k197k631J521o795N827p8k760k333L928l001J0306J0989
$$ -45648 -40346 -43997 -46194 -48825 -47304 -54099 -48272 -48350 -51110 -53443 -49515 -52516 -42210 -31221
15497c1221j280J106k301o906k936r572j257J720P699j375L66p070l555k227M237
$$ -31221 -32501 -31395 -33696 -40602 -43538 -53110 -54367 -52647 -44948 -46323 -45957 -53027 -56582 -58809 -54572
15482e4572k040L402L462l405L876N887N366l747J109l496n694J836R711N928
$$ -54572 -56612 -53210 -49748 -53153 -49277 -43390 -38024 -41771 -40662 -44158 -49852 -48016 -38305 -32377
15468c2377m467l63P38J80L002K256J25K937Q914O098n767j0437n762j318n064
$$ -32377 -36844 -37207 -36469 -36289 -33287 -31031 -30906 -27969 -19055 -12957 -18724 -29161 -34923 -36241 -41305
15453d1305L576m47l440K23l482R17k796L022P131k99K470O435J475j4402n013
$$ -41305 -37729 -38176 -41616 -41393 -44875 -43958 -46754 -43732 -36601 -36900 -34430 -27995 -26520 -40922 -45935
15438d5935Q9k711P055j330O21J681K66q214l302p881n101M92k631J187P250j919
$$ -45935 -45846 -48557 -41502 -42832 -42211 -40530 -40264 -48478 -51780 -59661 -64762 -64270 -66901 -65714 -58464 -60383
15422f0383j98N709M617J906J657l8m425o138o34m43K903l000p23P241J470J49
$$ -60383 -60581 -54872 -50255 -48349 -46692 -46730 -51155 -57293 -57927 -58370 -55467 -58467 -59190 -51949 -50479 -50330
15406e0330k962J566M238Q6k197l671K717m974L77J905P833J0609J334J213p755
$$ -50330 -53292 -51726 -47488 -47402 -49599 -53270 -50553 -55527 -55150 -53245 -45412 -34803 -33469 -32256 -40011
15391d0011p89P412L21m68n572K874P832l532L00L077K698p50O02K345o471j2365
$$ -40011 -40800 -33388 -33067 -33535 -39107 -36233 -28401 -31933 -31633 -28556 -25858 -26608 -26006 -23661 -30132 -42497
15375d2497n077j462l471l662j212K517J703P810j544M387m165l848K430J449
$$ -42497 -47574 -49036 -52507 -56169 -57381 -54864 -53161 -45351 -46895 -42508 -46673 -50521 -48091 -46642
15361d6642L056N07j656l035J131J642k010k011K665K221j0222p932N009j357
$$ -46642 -43586 -43079 -44735 -47770 -46639 -44997 -47007 -49018 -46353 -44132 -54354 -62286 -57277 -58634
15347e8634M764P38P031O849K547j0209j2343k54P837m829m315q096m530J2741
$$ -58634 -53870 -53132 -46101 -39252 -36705 -46914 -59257 -59511 -51674 -56503 -60818 -68914 -73444 -60703
15333f0703P719L279Q127q61O061K673p584o756J151J937J414J170M918N835l410
$$ -60703 -52984 -49705 -41578 -42439 -36378 -33705 -41289 -48045 -46894 -44957 -43543 -42373 -37455 -31620 -35030
15318c5030o086k090k2J710K961N178K289o913p026m906n222K992L424J479L441
$$ -35030 -41116 -43206 -43228 -41518 -38557 -33379 -31090 -38003 -45029 -49935 -55157 -52165 -48741 -47262 -43821
15303d3821m055k686J036l102l918k074l903Q478J947l039o327K177J97n396O87
$$ -43821 -47876 -50562 -49526 -52628 -56546 -58620 -62523 -54045 -52098 -55137 -61464 -59287 -59090 -64486 -63799
15288f3799J0938J1759K022l193n207k987l026M215M082J055n357o468n417m610
$$ -63799 -52861 -41102 -39080 -42273 -47480 -50467 -53493 -49278 -45196 -44141 -49498 -55966 -61383 -65993
15274f5993P792P210Q908j0482N614Q879n267j672r62n998q918L078L942M450
$$ -65993 -58201 -50991 -42083 -52565 -46951 -38072 -43339 -45011 -45973 -51971 -60889 -57811 -53869 -49419
15260d9419j892l215L433P999L725O168k330m467n896J174N030m841q877J0149
$$ -49419 -51311 -54526 -51093 -43094 -39369 -33201 -35531 -39998 -45894 -44720 -39690 -44531 -53408 -43259
15246d3259J0326n89q106o8k354j522k353R75m585r20J707k230M892K334o37M565
$$ -43259 -32933 -33522 -41628 -41696 -44050 -45572 -47925 -46950 -51535 -52455 -50748 -52978 -48086 -45752 -46389 -41824
15230d1824L950N843m847o156J824l626k105j096M251N676k245m518o241Q84j609
$$ -41824 -37874 -32031 -36878 -43034 -41210 -44836 -46941 -48037 -43786 -38110 -40355 -44873 -51114 -50230 -51839
15215e1839k291R19k22p410O97K95M27L516q2j559L687K335p376j1759p780J990
$$ -51839 -54130 -53211 -53433 -60843 -60146 -59851 -59424 -55908 -55990 -57549 -53862 -51527 -58903 -70662 -78442 -76452
15199g6452N587N327L449L205L290P21J2L030j008n647r6O539J68J224K636r449
$$ -76452 -70865 -65538 -62089 -58884 -55594 -54873 -54861 -51831 -52839 -58486 -58582 -52043 -51875 -50651 -48015 -57464
15183e7464q930M042O863o391J392k511M358M734m111O395m07o289K822l75J300
$$ -57464 -66394 -62352 -55489 -61880 -60488 -62999 -58641 -53907 -58018 -51623 -52030 -58319 -55497 -55872 -54572
15168e4572J980n613Q613J972l459O301n356q596m201N092P541J638p074p409
$$ -54572 -52592 -58205 -49592 -47620 -51079 -44778 -50134 -58730 -62931 -57839 -50298 -48660 -55734 -63143
15154f3143R652P844o753P301J405K890j397o936q644j015j318N077l19M36K486
$$ -63143 -53491 -45647 -52400 -45099 -43694 -40804 -42201 -49137 -57781 -58796 -60114 -55037 -55356 -54920 -52434
15139e2434m134j851k799l518J0522P688l520K833m0N75P759m077q579l883j527
$$ -52434 -56568 -58419 -61218 -64736 -54214 -46526 -50046 -47213 -47253 -46678 -38919 -42996 -51575 -55458 -56985
15124e6985j513J359o683o659l419N593J2691L124K596o29J355l676l302J146
$$ -56985 -58498 -57139 -63822 -70481 -73900 -68307 -55616 -52492 -49896 -50525 -49170 -52846 -56148 -55002
15110e5002O794J062l801o440l239k901j93j031K776M424K030n054J200L459N037
$$ -55002 -48208 -47146 -50947 -57387 -60626 -63527 -63720 -64751 -61975 -57551 -55521 -60575 -59375 -55916 -50879
15095e0879R840L721N47n294j478m453l13N246J887n580LO844O690j989k133j932
$$ -50879 -41039 -37318 -36771 -42065 -43543 -47996 -48309 -43063 -41176 -46756 -46753 -39909 -33219 -35208 -37341 -39273
15079c9273o46l676n984k316n932n733n5K948P361L640p190L536K592J891N382
$$ -39273 -39919 -43595 -49579 -51895 -57827 -63560 -63615 -60667 -53306 -49666 -56856 -53320 -50728 -48837 -43455
15064d3455L457k422m556m731R20n497m325M182L387j1041l772M826R607M202
$$ -43455 -39998 -42420 -46976 -51707 -50787 -56284 -60609 -56427 -53040 -64081 -67853 -63027 -53420 -49218
15050d9218m481P54Q487M991m922o938K727N613j592o293k405m79j984k037K889
$$ -49218 -53699 -52945 -44458 -39467 -44389 -51327 -48600 -42987 -44579 -50872 -53277 -53756 -55740 -57777 -54888
15035e4888R003j725n890j64J625k598o482M506P063J171l09o94p827m493P750
$$ -54888 -45885 -47610 -53500 -53664 -52039 -54637 -61119 -56613 -49550 -48379 -48688 -49382 -57209 -61702 -53952
15020e3952J542j918M117l767j818M806M235k654q016N623N718J0k225o395m72
$$ -53952 -52410 -54328 -50211 -53978 -55796 -50990 -46755 -49409 -57425 -51802 -46084 -46074 -48299 -54694 -55166
15005e5166n054Q78j070k779l192P916N436j364J86M645l298o963r438r88J764
$$ -55166 -60220 -59342 -60412 -63191 -66383 -58467 -53031 -54395 -54209 -49564 -52862 -59825 -69263 -70251 -68487
14990f8487M010K003L510N817m459n47n14l707r23j714N615j411k673r13M537
$$ -68487 -64477 -62474 -58964 -53147 -57606 -58153 -58667 -62374 -63297 -65011 -59396 -60807 -63480 -64393 -59856
14975e9856j807p51k012J641L834K75l202j7K569p587p513R848o43l056K999L316
$$ -59856 -61663 -62414 -64426 -62785 -58951 -58676 -61878 -61895 -59326 -66913 -74426 -64578 -65221 -68277 -65278 -61962
14959f1962j416N509P3j670L817j332J097j1168o350o386l67l021L803J0466m485
$$ -61962 -63378 -57869 -57796 -59466 -55649 -56981 -55884 -67052 -73402 -79788 -80155 -83176 -79373 -68907 -73392
14944g3392M048O087q326k400J0169Q44n988L659j991o814p06N540O873P403O716
$$ -73392 -69344 -63257 -71583 -73983 -63814 -62970 -68958 -65299 -67290 -74104 -74810 -69270 -62397 -54994 -48278
14929d8278k340l442k725j841n714m13P737M041j395p999m144j984l03M519M295
$$ -48278 -50618 -54060 -56785 -58626 -64340 -64753 -57016 -52975 -54370 -62369 -66513 -68497 -68800 -64281 -59986
14914e9986K509%J815O90P00p35l018l029n542j709J436Q891O347K68j989m744
$$ -59986 -57477 -57477 -55662 -54972 -54272 -55007 -58025 -61054 -66596 -68305 -66869 -57978 -51631 -51363 -53352 -58096
14898e8096m828l156r94L042J66m317O241L152l821o729O10k751M001M467N36
$$ -58096 -62924 -66080 -67074 -64032 -63866 -68183 -61942 -58790 -62611 -69340 -68730 -71481 -67480 -63013 -62477
14883f2477L571J983M201k449O01J416M358p161k096K113J425K748j2550o380
$$ -62477 -58906 -56923 -52722 -55171 -54570 -53154 -48796 -55957 -58053 -55940 -54515 -51767 -64317 -70697
14869g0697J565l87N795J3287k665j274n863J482j362l15l444j6207l599L860
$$ -70697 -69132 -69519 -63724 -50437 -53102 -54376 -60239 -58757 -60119 -60434 -63878 -80085 -83684 -79824
14855g9824M841P663r70j916Q62N278j943m00k510J879j900Q82N564J032o625
$$ -79824 -74983 -67320 -68290 -70206 -69344 -64066 -66009 -66409 -68919 -67040 -68940 -68058 -62494 -61462 -68087
14840f8087o121j731n403l350J0317P182K412J310Q474Q71m008m543m626J358
$$ -68087 -74208 -75939 -81342 -84692 -74375 -67193 -64781 -63471 -54997 -54126 -58134 -62677 -67303 -65945
14826f5945K326J01M626k190l240P731P400l445j526L283N641m799m934k476l677
$$ -65945 -63619 -63518 -58892 -61082 -64322 -56591 -49191 -52636 -54162 -50879 -45238 -50037 -54971 -57447 -61124
14811f1124k718j870l078M35L030m872p468N810O026N24r49J222N76J262k640
$$ -61124 -63842 -65712 -68790 -68355 -65325 -70197 -77665 -71855 -65829 -65305 -66254 -65032 -64456 -63194 -65834
14796f5834q18J285J133n658n422k731J357J221L743K746k472m873J0095Q823
$$ -65834 -66652 -65367 -64234 -69892 -75314 -78045 -76688 -75467 -71724 -68978 -71450 -76323 -66228 -57405
14782e7405N53j366l368k705l497k389J523K444L276l167k525M71j849R999m67
$$ -57405 -56852 -58218 -61586 -64291 -67788 -70177 -68654 -66210 -62934 -66101 -68626 -68155 -70004 -60005 -60472
14767f0472J172o794j0273N14N763O335l079j0936L481Q37o803j4J922P298J5557
$$ -60472 -59300 -66094 -76367 -75853 -70090 -63755 -66834 -77770 -74289 -73452 -80255 -80269 -78347 -71049 -55492
14752e5492K865o700m576q191l746J524J5662N915j2217n467R271K920M319q25
$$ -55492 -52627 -59327 -63903 -72094 -75840 -74316 -58654 -52739 -64956 -70423 -61152 -58232 -53913 -54738
14738e4738m819O36k023j342R59K27k954n395R669O57J234k128l293l573l340
$$ -54738 -59557 -58921 -60944 -62286 -61327 -61100 -64054 -69449 -59780 -59123 -57889 -60017 -63310 -66883 -70223
14723g0223k923l981R264L027o186r554J83L924O45m433n713J936k220J552J2349
$$ -70223 -73146 -77127 -67863 -64836 -71022 -80576 -80393 -76469 -75824 -80257 -85970 -84034 -86254 -84702 -72353
14708g2353J5790L410M032l56r849o569j917n890L339J512o317l29K941J302P149
$$ -72353 -56563 -53153 -49121 -49477 -59326 -65895 -67812 -73702 -70363 -68851 -75168 -75497 -72556 -71254 -64105
14693f4105M12l751%M666o048n023Q015N120K750l998m896o81j139K7l244q06
$$ -64105 -63693 -67444 -67444 -62778 -68826 -73849 -65834 -60714 -57964 -61962 -66858 -67539 -68678 -68651 -71895 -72701
14677g2701o441k569J0556N456R99j603N935m050q586q256q36M353P759J0670
$$ -72701 -79142 -81711 -71155 -65699 -64700 -66303 -60368 -64418 -73004 -81260 -82096 -77743 -69984 -59314
14663e9314K5o042k330k474l163l071N760N890O092P46r567k288n671m989O738
$$ -59314 -59289 -65331 -67661 -70135 -73298 -76369 -70609 -64719 -58627 -57881 -67448 -69736 -75407 -80396 -73658
14648g3658P18O25L154K453N092l100n800n822m536P026K404J888N955m238j2194
$$ -73658 -72940 -72315 -69161 -66708 -61616 -64716 -70516 -76338 -80874 -73848 -71444 -69556 -63601 -67839 -80033
14633h0033j485M073q32o437l940O108J2497M182m97j619k691M504O363o215j2740
$$ -80033 -81518 -77445 -78277 -84714 -88654 -82546 -70049 -65867 -66364 -67983 -70674 -66170 -59807 -66022 -78762
14618g8762j084m462R6m147J0075K538P326M768n71k826k281k871L933l337K714
$$ -78762 -79846 -84308 -84212 -88359 -78284 -75746 -68420 -63652 -64223 -67049 -69330 -72201 -68268 -71605 -68891
14603f8891J905p43P42l852p79N563M464m376j1115q364J284J1011L703J965p763
$$ -68891 -66986 -67729 -66987 -70839 -71618 -66055 -61591 -65967 -77082 -85446 -84162 -73151 -69448 -67483 -75246
14588g5246K491Q86L262k637l504N521j008N027K36L570K966k129O96q62Q19n254
$$ -75246 -72755 -71869 -68607 -71244 -74748 -69227 -70235 -65208 -64972 -61402 -58436 -60565 -59869 -60731 -59912 -65166
14572f5166j0676k980R96K72J147j494j09K852N92M554O370m650r970l669J108
$$ -65166 -75842 -78822 -77826 -77554 -76407 -77901 -78010 -75158 -74566 -70012 -63642 -68292 -78262 -81931 -80823
14557h0823j327M335P227J2607O568p18q873n014M775J549K074j6464k864O833
$$ -80823 -82150 -77815 -70588 -57981 -51413 -52131 -61004 -66018 -61243 -59694 -57620 -74084 -76948 -70115
14543g0115K203M697N406j324o601j2017l937N993J143j659L177l785J906K217
$$ -70115 -67912 -63215 -57809 -59133 -65734 -77751 -81688 -75695 -74552 -76211 -73034 -76819 -74913 -72696
14529g2696p935j0982L013O793M518L148L837O11l873l599p211j369K764m039
$$ -72696 -80631 -91613 -88600 -81807 -77289 -74141 -70304 -69693 -73566 -77165 -84376 -85745 -82981 -87020
14515h7020O128J71j739M198j140o01j284J0337P418j609m954l316M025Q06M74
$$ -87020 -80892 -80721 -82460 -78262 -79402 -80003 -81287 -70950 -63532 -65141 -70095 -73411 -69386 -68580 -68106
14500f8106N601l1o206j924O20o170n581J973M107j518l875j175M456M459l916
$$ -68106 -62505 -62536 -68742 -70666 -70046 -76216 -81797 -79824 -75717 -77235 -81110 -82285 -77829 -73370 -77286
14485g7286l9N484O700l483k496O430l25N40L078Lr42p486p781m575Q53K425L909
$$ -77286 -77325 -71841 -65141 -68624 -71120 -64690 -65015 -64475 -61397 -61394 -62336 -69822 -77603 -82178 -81325 -78900 -74991
14468g4991M331j333K203j539l95n971k822N912K15K630R407K25M68M490n284
$$ -74991 -70660 -71993 -69790 -71329 -71724 -77695 -80517 -74605 -74390 -71760 -62353 -62128 -61660 -57170 -62454
14453f2454j3039p77M125p611K187O458N399J394j817k515l304k214j527J589
$$ -62454 -75493 -76270 -72145 -79756 -77569 -71111 -65712 -64318 -66135 -68650 -71954 -74168 -75695 -74106
14439g4106l520o719K509P448Q080L615j370q772j481N548L440m068m056k936
$$ -74106 -77626 -84345 -81836 -74388 -66308 -62693 -64063 -72835 -74316 -68768 -65328 -69396 -73452 -76388
14425g6388p894P79k937n872m131k833O602K542K966K873L156M408M009J804l734
$$ -76388 -84282 -83503 -86440 -92312 -96443 -99276 -92674 -90132 -87166 -84293 -81137 -76729 -72720 -70916 -74650
14410g4650K611P16l12Q009m65k34o60k184j841l492n862M589l29m723j574K37
$$ -74650 -72039 -71323 -71635 -63626 -64091 -64325 -64985 -67169 -69010 -72502 -78364 -73775 -74104 -78827 -80401 -80164
14394h0164K447Q709J514O65M333J614r566m955l784J1502n936r450o059j240
$$ -80164 -77717 -69008 -67494 -66829 -62496 -60882 -70448 -75403 -79187 -67685 -73621 -83071 -89130 -90370
14380i0370P516R969J938q59j462J4j827N837L03l368K776j620n42j395k979l735
$$ -90370 -82854 -72885 -70947 -71806 -73268 -73254 -75081 -69244 -68941 -72309 -69533 -71153 -71695 -73090 -76069 -79804
14364g9804m411K179Q243M607j597M265j664p779n87o398N673O893J271J073l559
$$ -79804 -84215 -82036 -73793 -69186 -70783 -66518 -68182 -75961 -76548 -82946 -77273 -70380 -69109 -68036 -71595
14349g1595n96j1634M010O911K152k6m768K078M9N710m000L695J0824J461j1858
$$ -71595 -72191 -83825 -79815 -72904 -70752 -70778 -75546 -73468 -73419 -67709 -71709 -68014 -57190 -55729 -67587
14334f7587o358j381k012j267m91l464L805J089P97m448J801N887q177J63R151
$$ -67587 -73945 -75326 -77338 -78605 -79096 -82560 -78755 -77666 -76869 -81317 -79516 -73629 -81806 -81643 -72492
14319g2492K487j0095J46K03p813k810J5489N234k435Q03l20J936L438o672o81
$$ -72492 -70005 -80100 -79954 -79751 -87564 -90374 -74885 -69651 -72086 -71283 -71603 -69667 -66229 -72901 -73582
14304g3582p36q48K75J896o454J409m52Q889Q890p057m087Q0o890M541O304m199
$$ -73582 -74318 -75166 -74891 -72995 -79449 -78040 -78492 -69603 -60713 -67770 -71857 -71777 -78667 -74126 -67822 -72021
14288g2021k042J907K535O125K825l125o324l001O852J139M018N309K666j457
$$ -72021 -74063 -72156 -69621 -63496 -60671 -63796 -70120 -73121 -66269 -65130 -61112 -55803 -53137 -54594
14274e4594j2934m725k229O762Q583M445r706n972o959p435j667O924K661k614
$$ -54594 -67528 -72253 -74482 -67720 -59137 -54692 -64398 -70370 -77329 -84764 -86431 -79507 -76846 -79460
14260g9460o836P402M286J749j32n309L111L901m092n707o016q685P550R377o65
$$ -79460 -86296 -78894 -74608 -72859 -72991 -78300 -75189 -71288 -75380 -81087 -87103 -95788 -88238 -78861 -79526
14245g9526n01k66R54k496n758o427j195J0073N115j359m07j735k499K820P580
$$ -79526 -80027 -80293 -79339 -81835 -87593 -94020 -95215 -85142 -80027 -81386 -81793 -83528 -86027 -83207 -75627
14230g5627M488o230j452M457k576q66P498J1220j358o465q880m968P527j677
$$ -75627 -71139 -77369 -78821 -74364 -76940 -77806 -70308 -59088 -60446 -66911 -75791 -80759 -73232 -74909
14216g4909k075N16K543k367K145O028K505K277N00p852k990j489J858j857j213
$$ -74909 -76984 -76468 -73925 -76292 -74147 -68119 -65614 -63337 -62837 -70689 -73679 -75168 -73310 -75167 -76380
14201g6380p401K789k235m741j488j605n2j700J25p297N780N180L688l077M465
$$ -76380 -83781 -80992 -83227 -87968 -89456 -91061 -91113 -92813 -92688 -99985 -94205 -89025 -85337 -88414 -83949
14186h3949R815n440j157l477N76l484j853K805J1127J354p497J395Q091l613
$$ -83949 -74134 -79574 -80731 -84208 -83632 -87116 -88969 -86164 -75037 -73683 -81180 -79785 -71694 -75307
14172g5307k855j928N732K708J648j0213j1118o899o327R73M900M805K464M840
$$ -75307 -78162 -80090 -74358 -71650 -70002 -80215 -91333 -98232 -104559 -103586 -98686 -93881 -91417 -86577
14158h6577J003O50n580k349p327k195j79P232M066J20m045L04O482J0423j048
$$ -86577 -85574 -84924 -90504 -92853 -100180 -102375 -102554 -95322 -91256 -91136 -95181 -94877 -88395 -77972 -79020
14143g9020q425o940n142n377p37l834L737J3050M230L617J876n149r509K705
$$ -79020 -87445 -94385 -99527 -104904 -105641 -109475 -105738 -92688 -88458 -84841 -82965 -88114 -97623 -94918
14129i4918R912J464M590k174l651m520n415L59P814n596m703q453n306J1234
$$ -94918 -85006 -83542 -78952 -81126 -84777 -89297 -94712 -94353 -86539 -92135 -96838 -105291 -110597 -99363
14115i9363J4625m95N683l855j4449j938R002j94J537j92N495o409M838k983j0052
$$ -99363 -84738 -85233 -79550 -83405 -97854 -99792 -90790 -90984 -89447 -89639 -84144 -90553 -85715 -88698 -98750
14100i8750j117M114M930J653q097R20j334l15Q779Q089N544K277o828n624j2209
$$ -98750 -99867 -95753 -90823 -89170 -97267 -96347 -97681 -97996 -89217 -81128 -75584 -73307 -80135 -85759 -97968
14085i7968m476j349o395L608N233N745N980l280m613o198P1Q94P162p24j1128
$$ -97968 -102444 -103793 -110188 -106580 -101347 -95602 -89622 -92902 -97515 -103713 -103642 -102748 -95586 -96310 -107438
14070a07438j354l237r16R407K187p976L248J2548L421q472k713j725L898J314
$$ -107438 -108792 -112029 -112945 -103538 -101351 -109327 -106079 -93531 -90110 -98582 -101295 -103020 -99122 -97808
14056i7808J211p434l949L366L141Q476L589O570p59m396l650m397r038M470J6587
$$ -97808 -96597 -104031 -107980 -104614 -101473 -92997 -89408 -82838 -83597 -87993 -91643 -96040 -105078 -100608 -84021
14041h4021l083r358p221K288P054j870p9K638L532n95L205l356N7M58l766l567
$$ -84021 -87104 -96462 -103683 -101395 -94341 -96211 -96290 -93652 -90120 -90715 -87510 -90866 -90809 -90351 -94117 -97684
14025i7684l68J532J0812p88j2079l542N044O052j990o22j848n231j941L460o050
$$ -97684 -98052 -96520 -85708 -86496 -98575 -102117 -97073 -91021 -93011 -93633 -95481 -100712 -102653 -99193 -105243
14010a05243l292O872N298L325L316m089k352q757p585O551K578l116l616J450
$$ -105243 -108535 -101663 -96365 -93040 -89724 -93813 -96165 -104922 -112507 -105956 -103378 -106494 -110110 -108660
13996a08660r889q96K024P404K347O084p93L764N607j570j5587k912K328M710
$$ -108660 -118549 -119445 -117421 -110017 -107670 -101586 -102379 -98615 -93008 -94578 -110165 -113077 -110749 -106039
13982a06039l388n230M227K672l090N443L888O372o56l028q36m754j739L341o290
$$ -106039 -109427 -114657 -110430 -107758 -110848 -105405 -101517 -95145 -95801 -98829 -99665 -104419 -106158 -102817 -109107
13967a09107o681K860O411N364J2342K472j1227o379m327p452m947O527P770N903
$$ -109107 -115788 -112928 -106517 -101153 -88811 -86339 -97566 -103945 -108272 -115724 -120671 -114144 -106374 -100471
13953a00471j852o144L75m170N26O335N325O369k511l65K215J557L98r138n212
$$ -100471 -102323 -108467 -108092 -112262 -111736 -105401 -100076 -93707 -96218 -96583 -94368 -92811 -92413 -101551 -106763
13938a06763P66j331j684p267n368L041j789k998R276L175J256M638J100n31k029
$$ -106763 -105997 -107328 -109012 -116279 -121647 -118606 -120395 -123393 -114117 -110942 -109686 -105048 -103948 -104479 -106508
13923a06508m630N143l509j1547k781N653l562P967N637M23q42j503m441m618
$$ -106508 -111138 -105995 -109504 -121051 -123832 -118179 -121741 -113774 -108137 -107714 -108556 -110059 -114500 -119118
13909a19118O124N538L481q170p174M411K607P451j754p806J861M244O241R2M505
$$ -119118 -112994 -107456 -103975 -112145 -119319 -114908 -112301 -104850 -106604 -114410 -112549 -108305 -102064 -101972 -97467
13894i7467j238K306J188p554l485L67L981k571o349l975k044K735n811M461K381
$$ -97467 -98705 -96399 -95211 -102765 -106250 -105883 -101902 -104473 -110822 -114797 -116841 -114106 -119917 -115456 -113075
13879a13075r138R55M236l298J0359K660j454P424Q279n556j9389m661R312Q745
$$ -113075 -122213 -121258 -117022 -120320 -109961 -107301 -108755 -101331 -93052 -98608 -117997 -122658 -113346 -104601
13865a04601p175j715K806k017M508L516k085O725l326o485m103k644m31Q42J682
$$ -104601 -111776 -113491 -110685 -112702 -108194 -104678 -106763 -100038 -103364 -109849 -113952 -116596 -117027 -116185 -114503
13850a14503p348J0059J4951J994j0252J533n309q344k483p143r301M891O030
$$ -114503 -121851 -111792 -96841 -94847 -105099 -103566 -108875 -117219 -119702 -126845 -136146 -131255 -125225
13837a25225R660m854m40O056k721l824J335M994O190J583k66o812n267M036K047
$$ -125225 -115565 -120419 -120859 -114803 -117524 -121348 -120013 -115019 -108829 -107246 -107512 -114324 -119591 -115555 -113508
13822a13508o506L883Q153Q69o908L857Q075N194n877m546O118M748k648p3n418
$$ -113508 -120014 -116131 -107978 -107109 -114017 -110160 -102085 -96891 -102768 -107314 -101196 -96448 -99096 -99169 -104587
13807a04587p966o927K258l797m544k12j98K88L529P318k590o001L619K925k563
$$ -104587 -112553 -119480 -117222 -121019 -125563 -125775 -125973 -125685 -122156 -114838 -117428 -123429 -119810 -116885 -119448
13792a19448r68n508L771L735p12M146P680n63p589p943K996O819j036K976p696
$$ -119448 -120416 -125924 -122153 -118418 -119130 -114984 -107304 -107867 -115456 -123399 -120403 -113584 -114620 -111644 -119340
13777a19340j0343M102K632o910o111m561J207J681k41J622J1114O422q06k693
$$ -119340 -129683 -125581 -122949 -129859 -135970 -140531 -139324 -137643 -137884 -136262 -125148 -118726 -119532 -122225
13763a22225N12n065n851m130K615K829k15j874J172M234P038L710m307J73J265
$$ -122225 -121713 -126778 -132629 -136759 -134144 -131315 -131530 -133404 -132232 -127998 -120960 -117250 -121557 -121384 -120119
13748a20119j664m10J442J880o169K566J2121k606n661m290N49J311n603M287
$$ -120119 -121783 -122193 -120751 -118871 -125040 -122474 -110353 -112959 -118620 -122910 -122361 -121050 -126653 -122366
13734a22366k77n174J3466O977j0224j310L416k612M675K404m191r145j337K08
$$ -122366 -122643 -127817 -114351 -107374 -117598 -118908 -115492 -118104 -113429 -111025 -115216 -124361 -125698 -125490
13720a25490m732l346l260K291N016L165M219N663n967j008n835R9J649m451l948
$$ -125490 -130222 -133568 -136828 -134537 -129521 -126356 -122137 -116474 -122441 -123449 -129284 -129185 -127536 -131987 -135935
13705a35935K285O964M898Q190M56k176M8n640k015j790l946j639k775o947p035
$$ -135935 -133650 -126686 -121788 -113598 -113142 -115318 -115270 -120910 -122925 -124715 -128661 -130300 -133075 -140022 -147057
13690a47057j399P324q68j821P518N847j417k646j0229n436O164L225m834q86
$$ -147057 -148456 -141132 -142000 -143821 -136303 -130456 -131873 -134519 -144748 -150184 -144020 -140795 -145629 -146515
13676a46515R095l764n252k100Q572K776r82M572M307m994l803j045N233r93n152
$$ -146515 -137420 -141184 -146436 -148536 -139964 -137188 -138170 -133598 -129291 -134285 -138088 -139133 -133900 -134893 -140045
13661a40045o041l157k11N162K544l318j0676j390k007j483N027P603J0498R291
$$ -140045 -146086 -149243 -149454 -144292 -141748 -145066 -155742 -157132 -159139 -160622 -155595 -147992 -137494 -128203
13647a28203N345m368m184p874j0617j623R853K852k893l384k81O127O143l341
$$ -128203 -122858 -127226 -131410 -139284 -149901 -151524 -141671 -138819 -141712 -145096 -145377 -139250 -133107 -136448
13633a36448m570m113j818P486J0563l016p549L489K694j960l236J074K127m057
$$ -136448 -141018 -145131 -146949 -139463 -128900 -131916 -139465 -135976 -133282 -135242 -138478 -137404 -135277 -139334
13619a39334j558L681k961k554O120N834J602l978o759j887M262J311p11n912
$$ -139334 -140892 -137211 -140172 -142726 -136606 -130772 -129170 -133148 -139907 -141794 -137532 -136221 -136932 -142844
13605a42844R00r176l730L486O229Q591Q301L44q776r284N90O516p87l290o225
$$ -142844 -141944 -151120 -154850 -151364 -145135 -136544 -128243 -127899 -136675 -145959 -145369 -138853 -139640 -142930 -149155
13590a49155K724N910M227j541j0147L281P284k52M542q61o419l834L749L282
$$ -149155 -146431 -140521 -136294 -137835 -147982 -144701 -137417 -137669 -133127 -133988 -140407 -144241 -140492 -137210
13576a37210l053k649j4262p630N123L471O417J3j0352p710k038O946O383P276
$$ -137210 -140263 -142912 -157174 -164804 -159681 -156210 -149793 -149780 -160132 -167842 -169880 -162934 -156551 -149275
13562a49275n183k927J889M068J971M242j711m086n326j188M239n600j595K069
$$ -149275 -154458 -157385 -155496 -151428 -149457 -145215 -146926 -151012 -156338 -157526 -153287 -158887 -160482 -158413
13548a58413J237L016n901l17l387M31J347o670L305J592m41K691O464K57k513
$$ -158413 -157176 -154160 -160061 -160378 -163765 -163334 -161987 -168657 -165352 -163760 -164201 -161510 -155046 -154789 -157302
13533a57302m930J823P96l297Q865l54o052Q89l810j898p656L197J826o284Q042
$$ -157302 -162232 -160409 -159613 -162910 -154045 -154399 -160451 -159562 -163372 -165270 -172926 -169729 -167903 -174187 -166145
13518a66145N389j822m743j197N096r9q00m695q05L552J343O327J85m672P720
$$ -166145 -160756 -162578 -167321 -168518 -163422 -163521 -164321 -169016 -169821 -166269 -164926 -158599 -158414 -163086 -155366
13503a55366J810r69o345j444q830j1141L117P136Q00n482J809j5M629M823O105
$$ -155366 -153556 -154525 -160870 -162314 -171144 -182285 -179168 -172032 -171232 -176714 -174905 -174920 -170291 -165468 -159363
13488a59363O990M583l346n866k815N627Q58n123r112q462M50N485m401o496L54
$$ -159363 -152373 -147790 -151136 -157002 -159817 -154190 -153332 -158455 -167567 -176029 -175579 -170094 -174495 -180991 -180637
13473a80637N001N43L025M029l906n659Q261M917N528n005j0308j042M415p9J530
$$ -180637 -175636 -175093 -172068 -168039 -171945 -177604 -169343 -164426 -158898 -163903 -174211 -175253 -170838 -170917 -169387
13458a69387J47J932K798n238j055O79q47N649M312o97n183q643k156r21K22L991
$$ -169387 -169240 -167308 -164510 -169748 -170803 -170124 -170971 -165322 -161010 -161707 -166890 -175533 -177689 -178610 -178388 -174397
13442a74397j428p563J027k250N011Q736n273o371j778L536j221j427M145J863
$$ -174397 -175825 -183388 -182361 -184611 -179600 -170864 -176137 -182508 -184286 -180750 -181971 -183398 -179253 -177390
13428a77390k939j3982l963N201R715N147k332J32M965j226K16m238l420J316
$$ -177390 -180329 -194311 -198274 -193073 -183358 -178211 -180543 -180411 -175446 -176672 -176456 -180694 -184114 -182798
13414a82798K400L653J5365r669j8097N024O406J259l322l741O818L805l211L1
$$ -182798 -180398 -176745 -161380 -171049 -189146 -184122 -177716 -176457 -179779 -183520 -176702 -172897 -176108 -176077
13400a76077l389j0464m952J0476N833n579O93M773p185j390P130L025l360m408
$$ -176077 -179466 -189930 -194882 -184406 -178573 -184152 -183459 -178686 -185871 -187261 -180131 -177106 -180466 -184874
13386a84874l720n566j30P381L07j565J0674l626m523K841j779l428r621Q002
$$ -184874 -188594 -194160 -194290 -186909 -186602 -188167 -177493 -181119 -185642 -182801 -184580 -188008 -197629 -189627
13372a89627N481m558p158J314L301p726k034M91p434l182R669R403j082m9K699
$$ -189627 -184146 -188704 -195862 -194548 -191247 -198973 -201007 -200516 -207950 -211132 -201463 -192060 -193142 -193191 -190492
13357a90492l503l53L843q219L55J158Q86Q160N194l693l993l332Q522O014J644
$$ -190492 -193995 -194348 -190505 -198724 -198369 -197211 -196325 -188165 -182971 -186664 -190657 -193989 -185467 -179453 -177809
13342a77809j625Q68m745j2175k420K473m86J068L382o508j1103l045N818J1110
$$ -177809 -179434 -178566 -183311 -195486 -197906 -195433 -195919 -194851 -191469 -197977 -209080 -212125 -206307 -195197
13328a95197N499J937q237O582n186l979j006m444l035o301P281N826K140j312
$$ -195197 -189698 -187761 -195998 -189416 -194602 -198581 -199587 -204031 -207066 -213367 -206086 -200260 -198120 -199432
13314a99432n553k225P691r391l012o975k003P501k072n024L684L698o434q933
$$ -199432 -204985 -207210 -199519 -208910 -211922 -218897 -220900 -213399 -215471 -220495 -216811 -213113 -219547 -228480
13300b28480j403L038k008p3J156M427l91Q96M926o92o170k771L375L30j58k848
$$ -228480 -229883 -226845 -228853 -228926 -227770 -223343 -223734 -222838 -217912 -218604 -224774 -227545 -224170 -223840 -223998 -226846
13284b26846l890P584P218o237r536L826N292k150m2J917M345K513k613J130L780
$$ -226846 -230736 -223152 -215934 -222171 -231707 -227881 -222589 -224739 -224781 -222864 -218519 -216006 -218619 -217489 -213709
13269b13709j573k535l51R23m916N889O3j294J449n574j084M350K830p30l047
$$ -213709 -215282 -217817 -218168 -217245 -222161 -216272 -216209 -217503 -216054 -221628 -222712 -218362 -215532 -216262 -219309
13254b19309r975q535K739K034K338o10J090R223M494L929m511j753k136m532
$$ -219309 -229284 -237819 -235080 -233046 -230708 -231318 -230228 -221005 -216511 -212582 -217093 -218846 -220982 -225514
13240b25514J4450J9857J2181l67J5087K2333K5197J9801K4954L7224L3316K0161
$$ -225514 -211064 -191207 -179026 -179393 -164306 -141973 -116776 -96975 -72021 -34797 -1481 18680
13228A8680J4765J7030P750R400J1335M103N221Q018J1540J658k839o038p012
$$ 18680 33445 50475 58225 67625 78960 83063 88284 96302 107842 109500 106661 100623 93611
13215I3611r151n576j0531j9941j7951k5718j1775n874m963j881O810J2437J5829
$$ 93611 84460 78884 68353 48412 30461 4743 -7032 -12906 -17869 -19750 -12940 -503 15326
13202A5326J8316K4261K0458K1018J5258P844N955L321J231j305q521j3739j450
$$ 15326 33642 57903 78361 99379 114637 122481 128436 131757 132988 131683 123162 109423 107973
13189A07973k002l349j601k802j9785k6138k5326k7040k5426k6002k2108k8357
$$ 107973 105971 102622 101021 98219 78434 52296 26970 -70 -25496 -51498 -73606 -101963
13177a01963k8204j2919j2859j3052q762j308r924r857K801J613L410M663R629
$$ -101963 -130167 -143086 -155945 -168997 -177759 -179067 -188991 -198848 -196047 -194434 -191024 -186361 -176732
13164a76732K0254K7869K7944L7128L4165K5952K8958L0218K0380J7596J0080
$$ -176732 -156478 -128609 -100665 -63537 -29372 -3420 25538 55756 76136 93732 103812
13153A03812J5269J1345J014m342q310P414O161o802K592N108m105j3783j1524
$$ 103812 119081 130426 131440 127098 118788 126202 132363 125561 128153 133261 129156 115373 103849
13140A03849k2209k7279j3725j3847j4630j0847J17K56K1336K2356J3823J9816
$$ 103849 81640 54361 40636 26789 12159 1312 1429 1685 23021 45377 59200 79016
13128G9016O262R636J5026J9535J2445Q91r528q428r04K882J806p283n164j463
$$ 79016 85278 94914 109940 129475 141920 142811 133283 124855 123951 126833 128639 121356 116192 114729
13114A14729p955k2671k8444l8763l6714l2925k9278j8139k3818k5302k4929k3854
$$ 114729 106774 84103 55659 16896 -19818 -52743 -82021 -100160 -123978 -149280 -174209 -198063
13102a98063k3478j0554q836l927N338j1700r744r565j0241k814m986k854K678
$$ -198063 -221541 -232095 -240931 -244858 -239520 -251220 -260964 -270529 -280770 -283584 -288570 -291424 -288746
13089b88746l937r093J235N295j462O76K715M318k242n330j078m236j93k82l878
$$ -288746 -292683 -301776 -300541 -295246 -296708 -296032 -293317 -288999 -291241 -296571 -297649 -301885 -302078 -302360 -306238
13074c06238j1998r027l205m147m044N072K937M993P410n128j885p087p534p493
$$ -306238 -318236 -327263 -330468 -334615 -338659 -333587 -330650 -325657 -318247 -323375 -325260 -332347 -339881 -347374
13060c47374n716m771j421Q37P059Q165k87L178O749p345j0462o039k484k004
$$ -347374 -353090 -357861 -359282 -358445 -351386 -343221 -343508 -340330 -333581 -340926 -351388 -357427 -359911 -361915
13046c61915j71j0440l902M274J029k764n433L082K489q94l859l623J1119L849
$$ -361915 -362086 -372526 -376428 -372154 -371125 -373889 -379322 -376240 -373751 -374645 -378504 -382127 -371008 -367159
13032c67159l86R575J4835P470O18k486n46N769J1699k013n43n191m279m009L316
$$ -367159 -367545 -357970 -343135 -335665 -335047 -337533 -338079 -332310 -320611 -322624 -323167 -328358 -332637 -336646 -333330
13017c33330P382J931o191j4316p405l835Q763N730o52q371j461j1602N08p468
$$ -333330 -325948 -324017 -330208 -344524 -351929 -355764 -347001 -341271 -341923 -350294 -351755 -363357 -362849 -370317
13003c70317r005j708r654k686N108J0256L934K396p525j313k872Q458N779J114
$$ -370317 -379322 -381030 -390684 -393370 -388262 -378006 -374072 -371676 -379201 -380514 -383386 -374928 -369149 -368035
12989c68035j0886r56K463l000k947k501L075N97k019j0430r814m608l965k471
$$ -368035 -378921 -379877 -377414 -380414 -383361 -385862 -382787 -382190 -384209 -394639 -404453 -409061 -413026 -415497
12975d15497j698m593j0491p786j0606j976K329j4450j1163n300j0343j1465j292
$$ -415497 -417195 -421788 -432279 -440065 -450671 -452647 -450318 -464768 -475931 -481231 -491574 -503039 -504331
12962e04331N469N719M627R367J7158o452N215O551M780O933J0151K405O199J0264
$$ -504331 -498862 -493143 -488516 -479149 -461991 -468443 -463228 -456677 -451897 -444964 -434813 -432408 -426209 -415945
12948d15945Q940l920J989N73p967j305K684J846J605r801p558l482Q34l769n069
$$ -415945 -407005 -410925 -408936 -408363 -416330 -417635 -414951 -413105 -411500 -421301 -428859 -432341 -431507 -435276 -440345
12933d40345o298O35n553l811K591O01l518L376j534k08j228J4615N319L122j0674
$$ -440345 -446643 -446008 -451561 -455372 -452781 -452180 -455698 -452322 -453856 -454064 -455292 -440677 -435358 -432236 -442910
12918d42910j464j636l409J500M420k935j704n159m575J746K429j635l658q850
$$ -442910 -444374 -446010 -449419 -447919 -443499 -446434 -448138 -453297 -457872 -456126 -453697 -455332 -458990 -467840
12904d67840m537k203r365p813j1899l000Q93l044p597n577j4488j2552o680O089
$$ -467840 -472377 -474580 -483945 -491758 -503657 -506657 -505764 -508808 -516405 -521982 -536470 -549022 -555702 -549613
12890e49613n475j1062j1416p90m5m115L372p905j0258r151K036J1270N725K367
$$ -549613 -555088 -566150 -577566 -578356 -578401 -582516 -579144 -587049 -597307 -606458 -604422 -593152 -587427 -585060
12876e85060O615K819q585n520m17p18N002J4657J1208J489J238K356m47l608
$$ -585060 -578445 -575626 -584211 -589731 -590148 -590866 -585864 -571207 -559999 -558510 -557272 -554916 -555363 -558971
12862e58971r588j2808m647j5835j7506q213r930p563n690l658p267r142r476
$$ -558971 -568559 -581367 -586014 -601849 -619355 -627568 -637498 -645061 -650751 -654409 -661676 -670818 -680294
12849f80294P084O063o012o962l488k767J604K193l948q284l076k04O345J401
$$ -680294 -673210 -667147 -673159 -680121 -683609 -686376 -684772 -682579 -686527 -694811 -697887 -698091 -691746 -690345
12835f90345j0594q009l239j477j91M454j606p680n019q555n800N916R603j94
$$ -690345 -700939 -708948 -712187 -713664 -713855 -709401 -711007 -718687 -723706 -732261 -738061 -732145 -722542 -722736
12821g22736l868L699J7582K632M437O489J198P65j34J217O561O164L114J2007
$$ -722736 -726604 -722905 -705323 -702691 -698254 -691765 -690567 -689802 -689936 -688719 -682158 -675994 -672880 -660873
12807f60873J8841K3999K9800L5339M2728N0403N2388N5968O2183O6007Q5568
$$ -660873 -642032 -618033 -588233 -552894 -510166 -459763 -407375 -351407 -289224 -223217 -137649
12796a37649R3825Q7189R8211J09885J17108J29137J43581J72151K22429K90012
$$ -137649 -43824 43365 141576 251461 368569 497706 641287 813438 1035867 1325879
12786A325879L72717M58162N74508P62895J031895J454493K069258K864439L711077
$$ 1325879 1698596 2156758 2731266 3494161 4526056 5980549 8049807 10914246 14625323
12777A4625323M449936M974652N330421N674493N965349N890838N094054L695443
$$ 14625323 19075259 24049911 29380332 35054825 41020174 46911012 52005066 55700509
12769E5700509K495203J912336J462626Q08504N8499m41381m99088n26280q32712
$$ 55700509 58195712 60108048 61570674 62379178 62437677 61996296 61497208 60970928 60138216
12760F0138216j224198j220426q33475o74894j411262k705686l595963l466942
$$ 60138216 58914018 57693592 56860117 56185223 54773961 52068275 48472312 45005370
12752D5005370k517325j350217l45256M67200J199939K022974K912619L562470
$$ 45005370 42488045 41137828 40792572 41259772 42459711 44482685 47395304 50957774
12744E0957774L723235L222947K249407J446496J069913R39916P85416N45268
$$ 50957774 54681009 57903956 60153363 61599859 62669772 63609688 64395104 64940372
12736F4940372L56250K13838J02933k26504q86264j473020j743300j798878k105349
$$ 64940372 65296622 65510460 65613393 65386889 64500625 63027605 61284305 59485427 57380078
12727E7380078k915185l955754m930464n428720n056904m312148l795286l513057
$$ 57380078 54464893 50509139 45578675 40149955 35093051 30780903 26985617 23472560
12719B3472560l235790k689690k027492j441719r52798n35785j65429K00155O05808
$$ 23472560 20236770 17547080 15519588 14077869 13125071 12589286 12423857 12624012 13229820
12710A3229820J147243J806007K432525K948031L499011M291093N367944O280429
$$ 13229820 14377063 16183070 18615595 21563626 25062637 29353730 34721674 41002103
12702D1002103O315039N499097M761995M784507N087655M584296K692300N33100
$$ 41002103 47317142 52816239 57578234 62362741 67450396 72034692 74726992 75260092
12694G5260092k93325N6870L67037K00381k05494q02802j364452j647112j859240
$$ 75260092 74966767 75023637 75390674 75591055 75385561 74582759 73218307 71571195 69711955
12685F9711955k094544k308000k510310k718004k883226k866078k430173j349778
$$ 69711955 67617411 65309411 62799101 60081097 57197871 54331793 51901620 50551842
12677E0551842L11250K094946L333764L598915L133229K519766K296143K689846
$$ 50551842 50863092 52958038 56291802 59890717 63023946 65543712 67839855 70529701
12669G0529701K767383J957627Q49880J7599P2682R80736J493550R15485l91078
$$ 70529701 73297084 75254711 76104591 76122190 76194872 77175608 78669158 79584643 79193565
12660G9193565j568844k080053k329071k823927l659238m486946m808408m900238
$$ 79193565 77624721 75544668 73215597 70391670 66732432 62245486 57437078 52536840
12652E2536840n285283o005198o393981n813767m582391l386901k527339j947842
$$ 52536840 47251557 41246359 34852378 29038611 24456220 21069319 18541980 16594138
12644A6594138j544715j263995j054437q70673p33120o34141n49508m91407m50558
$$ 16594138 15049423 13785428 12730991 11860318 11127198 10493057 9943549 9452142 9001584
12635I001584m20260m13839l96851l83104l57323l39502l26542k95218k70797
$$ 9001584 8581324 8167485 7770634 7387530 7030207 6690705 6364163 6068945 5798148
12626E798148k49951k26919j99263j74052j55190j32438j04351q5208p3301n6966
$$ 5798148 5548197 5321278 5122015 4947963 4792773 4660335 4555984 4470776 4397475 4340509
12616D340509m7048m5260o6245p1516p8975r4242j04904j13228j07261j03467
$$ 4340509 4293461 4248201 4181956 4110440 4031465 3937223 3832319 3719091 3611830 3508363
12606C508363r7899p6283m0979k2674j5978j7163k5915l3978m0812n3193p3816
$$ 3508363 3410464 3334181 3293202 3270528 3254550 3237387 3211472 3177494 3136682 3083489 3009673
12595C009673j01341j15528j11252j11758j14026q9834p4902o6238n0437l9825
$$ 3009673 2908332 2792804 2681552 2569794 2455768 2365934 2291032 2224794 2174357 2134532
12585B134532l4300j5873M75J0203J1820K3101L4677K6428L4726L1262J4533L993
$$ 2134532 2100232 2084359 2084834 2095037 2106857 2129958 2164635 2191063 2225789 2257051 2271584 2275577
12573B275577j0049l9076m7335m4890m4156k9236m875R375J6862K7503L0140J6949
$$ 2275577 2265528 2226452 2179117 2134227 2090071 2060835 2055960 2065335 2082197 2109700 2139840 2156789
12561B156789J2021j1766m5524o8582p8359q4664r2378q7060q1987o1194n3849
$$ 2156789 2168810 2157044 2111520 2042938 1964579 1879915 1787537 1700477 1618490 1557296 1503447
12550A503447l6694k2839j3883n262J0308K7966L6378N7044O0566P0023P0944
$$ 1503447 1466753 1443914 1430031 1424769 1435077 1463043 1499421 1556465 1617031 1687054 1757998
12539A757998O1563N0753K6610N466j1469m3373n1527m5073m8201l7348j2065
$$ 1757998 1819561 1870314 1896924 1902390 1890921 1847548 1796021 1750948 1702747 1665399 1653334
12528A653334J8065K5080L9946L7302K6772J2143j4596l9686o7003j00001j14635
$$ 1653334 1671399 1696479 1736425 1773727 1800499 1812642 1798046 1758360 1691357 1591356 1476721
12517A476721j00766q9684p2011o4830n6217m1885j9195j3549j775M771K1016
$$ 1476721 1375955 1286271 1214260 1149430 1093213 1051328 1032133 1018584 1016809 1021580 1042596
12506A042596L2412M4528N7140P7948Q4836Q0146P6462N5597K1435j1852m2880
$$ 1042596 1075008 1119536 1176676 1254624 1339460 1419606 1496068 1551665 1573100 1561248 1518368
12495A518368o5560r3764r6974r9038r1552p5053n6088m4855l8096k7875k0190
$$ 1518368 1452808 1359044 1262070 1163032 1071480 996427 940339 895484 857388 829513 809323
12484H09323j5727j3797j7857o808P567j390m385J595m759o770l034q549n099
$$ 809323 793596 779799 761942 755134 762701 761311 756926 758521 753762 746992 743958 735409 730310
12471G30310J1092L786m049p976l651m040j5462k683r317j4176m799j733Np924
$$ 730310 741402 745188 741139 733163 729512 725472 710010 707327 698010 683834 679035 677302 677307 669383
12457F69383o505n763j3352k314L285J236m33n587j359O229P572k884o660j5711
$$ 669383 662878 657115 643763 641449 644734 645970 645537 639950 638591 644820 652392 649508 642848 627137
12443F27137q739j4788r086k163l175p939K908p46J546o534k669N03l140o473
$$ 627137 618398 603610 594524 592361 589186 581247 584155 583409 584955 578421 575752 576255 573115 566642
12429E66642q34O75k964l787m445l168k943k194L17m893l839M22R39p130p436
$$ 566642 565808 566483 563519 559732 555287 552119 549176 546982 547299 542406 538567 538989 539928 532798 525362
12414E25362o022n560m548L0K958j195M533M434N58l586l198l808k159o738j605
$$ 525362 519340 513780 509232 509262 512220 511025 515558 519992 520550 516964 513766 509958 507799 501061 499456
12399D99456l641q482j74qk649P89N159O30j1862p73j97q826j7060k211P40L293
$$ 499456 495815 487333 487159 487151 484502 485291 490450 491080 479218 478445 478248 469422 452362 450151 450891 454184
12383D54184m416r64o80p842o846O462J078l492Q82p037j895j146l109l443k031
$$ 454184 449768 448804 448124 440282 433436 439898 440976 437484 438366 431329 429434 428288 425179 421736 419705
12368D19705J0397M831p637p906j3309j2315L645K55n854P771R479l290k780m766
$$ 419705 430102 434933 427296 419390 406081 393766 397411 397666 391812 399583 409062 405772 402992 398226
12354C98226K019O804L044M642j3148q774j0445q192j696O774M53o66k38l326
$$ 398226 400245 407049 410093 414735 401587 392813 382368 374176 372480 379254 379707 379041 378803 375477
12340C75477p217P10L54m938o425K727K030n461p060l362M564R23o570n060Q543
$$ 375477 368260 368970 369324 364386 357961 360688 362718 357257 350197 346835 351399 352322 345752 340692 349235
12325C49235L125p495n943j129L451K629J732Q392J2353N513P277J8702K2709
$$ 349235 352360 344865 338922 337793 341244 343873 345605 353997 366350 371863 379140 397842 420551
12312D20551K8428M3605L6724K7331K5068J2177J0419J2831R084J2316J4600M509
$$ 420551 448979 492584 529308 556639 581707 593884 604303 617134 626218 638534 653134 657643
12300F57643p106r305m313Q501j052j940n907l392o064j1565j424R361J3713K5284
$$ 657643 650537 641232 636919 645420 644368 642428 636521 633129 627065 615500 614076 623437 637150 662434
12286F62434M3809N2747N7130N2331N5592N1084L6825K217j2224k4077l1450j3724
$$ 662434 706243 758990 816120 868451 924043 975127 1011952 1014169 1001945 977868 946418 932694
12274I32694J161J4383J9577K2603K8361J3666L624j713j9710m1060p2195r0181
$$ 932694 933855 948238 967815 990418 1018779 1032445 1036069 1034356 1014646 973586 901391 811210
12262H11210p8452o5694n7033m5521l7306l2291l5794l8974k3260k0925j5411
$$ 811210 732758 667064 610031 564510 527204 494913 459119 420145 396885 375960 360549
12251C60549n792l053j847o867k313J671j020J3089J6703K0070K7666L6758K9968
$$ 360549 354757 351704 349857 342990 340677 342348 341328 354417 371120 391190 418856 455614 485582
12238D85582J9484K7892K5302J6976J8868J9076J9907J9622J2555R706J19k547
$$ 485582 505066 532958 558260 575236 594104 613180 633087 652709 665264 674970 675089 672542
12226F72542M562k628o689K18j6917j1334j514N71L262J2185K1269K6040L3932
$$ 672542 677104 674476 667787 668005 651088 639754 638240 638811 642073 654258 675527 701567 735499
12213G35499M9286O8920Q6172R0646R4776Q8125P5613M4182J9846J466j8008l5076
$$ 735499 784785 853705 939877 1030523 1125299 1213424 1289037 1333219 1353065 1354531 1336523 1301447
12201A301447l7839k4558j1693m800J4137J6522K6327J7095j1619l8326n1910
$$ 1301447 1263608 1239050 1227357 1222557 1236694 1253216 1279543 1296638 1285019 1246693 1194783
12190A194783o5590q7663r0697r8228q9905p3494m6943l4252j0052K1672L9602
$$ 1194783 1129193 1041530 950833 852605 762700 689206 642263 608011 597959 619631 659233
12179F59233N2622O3406P1813O1294N1312K7031j471k1958l5863o4237p8091p9097
$$ 659233 711855 775261 847074 908368 959680 986711 985240 963282 927419 863182 785091 705994
12167G05994p1043n8870m9731l1938k1323j4305l832L371K6409L2833M6193O8366
$$ 705994 634951 576081 526350 494412 473089 458784 454952 458323 484732 517565 563758 632124
12155F32124P8164P9177O7765O0344M3581K5654j0471m2592o6020q1043q3249
$$ 632124 710288 789465 857230 917574 961155 986809 976338 933746 867726 786683 703434
12144G03434p0056n9165l6443r542M789J7771L6622N2149O7419P3750P3634P0624
$$ 703434 633378 574213 537770 528228 533017 550788 587410 639559 706978 780728 854362 924986
12132I24986O7850N9371M1628L6661J5014J848j174j2255l0422m1504n4488o3021
$$ 924986 992836 1052207 1093835 1130496 1145510 1147358 1146184 1133929 1103507 1062003 1007515 944494
12120I44494n8632o3970n8865n2228n2106n0755k9484r207K0952M8543O6547P5884
$$ 944494 885862 821892 763027 710799 658693 607938 578454 569247 590199 638742 705289 781173
12108G81173R0791Q7871R3022Q3154O8388L5180K0066J93k6470m9028n4966o4917
$$ 781173 871964 959835 1052857 1136011 1204399 1239579 1259645 1259838 1233368 1184340 1129374 1064457
12096A064457p5439p3286q2515q1023q5101p0118n6882n0388l3892k1724j3741
$$ 1064457 989018 915732 833217 752194 667093 596975 540093 489705 455813 434089 420348
12085D20348j5735r389L233J8214L3082N1559N8402M7088M5628L5649J9472r255
$$ 420348 404613 395224 398457 416671 449753 501312 559714 606802 652430 688079 707551 698296
12073F98296k4750m0131n9861p2648o1534n8491n2680m4421k7513j1752n154j0790
$$ 698296 673546 633415 573554 500906 439372 380881 328201 283780 256267 244515 239361 228571
12061B28571M888J7089K0197L0125M2344M8978N5261M9923M4334L9243K9033O142
$$ 228571 233459 250548 270745 300870 343214 392192 447453 497376 541710 580953 609986 616128
12049F16128l638j8749l3001n0007n6056m9778m4780l7016k9845k5706j7188k225
$$ 616128 612490 593741 560740 510733 454677 404899 360119 323103 293258 267552 250364 248139
12037B48139J8349L2518M1261N5750O5027P5801P7107P4285M6597K4691O405j8048
$$ 248139 266488 299006 340267 396017 461044 536845 613952 688237 734834 759525 765930 747882
12025G47882m6713o7533p6175o6144n3781l5590k6010k7696j9232q875j3065m924
$$ 747882 701169 633636 557461 491317 437536 401946 375936 348240 329008 320133 307068 302144
12013C02144r753k0721l1852k2823j4366k7320k3343j8812j3252m409n098l368
$$ 302144 292391 271670 239818 216995 202629 175309 151966 133154 119902 115493 110395 107027
12001A07027o297l409n348l293n034o041q017j3311j0267L639q0m685J632Q057
$$ 107027 100730 97321 91973 88680 83646 77605 69588 56277 46010 49649 49569 44884 46516 54573
11987E4573m149j358O811n643l202R783n783K503o45o957q38k600j0310k585Q152
$$ 54573 50424 49066 55877 50234 47032 56815 51032 53535 52890 45933 45095 42495 32185 29600 37752
11972C7752K224j0565r093K882l410l612r164j765L836j0818M108R149J3208K1240
$$ 37752 39976 29411 20318 23200 19790 16178 7014 5249 9085 -1733 2375 11524 24732 45972
11958D5972J8011R561J0699M815N382j044J536m203j482k407O146M447N86M316
$$ 45972 63983 73544 84243 89058 94440 93396 94932 90729 89247 86840 92986 97433 98019 102335
11944A02335P342J5529J5872Q436K609p65j83p383j4609j3087j6009j3684k886
$$ 102335 109677 125206 141078 149514 152123 151358 151175 143792 129183 116096 100087 86403 83517
11931H3517o663m497j2366l148o799r009q740j260J271N915k572n685N974k525
$$ 83517 76854 72357 59991 56843 50044 41035 32295 31035 32306 38221 35649 29964 35938 33413
11917C3413J193J830m116l337p930j928M755O509N393P227K866P832J6821L037
$$ 33413 34606 36436 32320 28983 21053 19125 23880 30389 35782 43009 45875 53707 70528 73565
11903G3565Q308p15k9J0238K2150K2884J9335J3826J4419J6260K2257O25p417
$$ 73565 81873 81158 81129 91367 113517 136401 155736 169562 183981 200241 222498 223123 215706
11890B15706J931K336N239J6613K4927K7994L0697M0855M1423L8217L8317N1030
$$ 215706 217637 219973 225212 241825 266752 294746 325443 366298 407721 445938 484255 535285
11878E35285M5968M7070M7131M7849O5491Q4297J02939J28325J62621J89514K27393
$$ 535285 581253 628323 675454 723303 788794 873091 976030 1104355 1266976 1456490 1683883
11867A683883K64374K97736L47993M15239M94554O10839P66918J009135J373741
$$ 1683883 1948257 2245993 2593986 3009225 3503779 4114618 4881536 5890671 7264412
11858G264412J882938K589758L606312N012493O663415Q043241Q440508P775495
$$ 7264412 9147350 11737108 15343420 20355913 27019328 35062569 43503077 51278572
11850E1278572O701349N742888M668518K795561m66262m031846n320582l957089
$$ 51278572 57979921 63722809 68391327 71186888 70720626 66688780 61368198 57411109
11842E7411109j828659o8606J436740K692386L278250L049918K274126J187483
$$ 57411109 55582450 55513844 56950584 59642970 62921220 65971138 68245264 69432747
11834F9432747l27769k417567m829470p090714q407948q293203p216051n909807
$$ 69432747 69104978 66687411 61857941 54767227 46359279 38066076 30850025 24940218
11826B4940218m592816l414209k510701j879228j429887j117916q81995o98210
$$ 24940218 20347402 16933193 14422492 12543264 11113377 9995461 9113466 8415256
11818H415256n60195m65278m06112l56371l03072k51475k02831j85248j80272
$$ 8415256 7855061 7389783 6983671 6627300 6324228 6072753 5869922 5684674 5504402
11809E504402j65741j53928j46459j30676j25044j03574q4927p3292n8354l3279
$$ 5504402 5338661 5184733 5038274 4907598 4782554 4678980 4594053 4520761 4462407 4429128
11799D429128K6359R3469J50858K20425K98676L83117M80643N82000P26546R28252
$$ 4429128 4455487 4548956 4699814 4920239 5218915 5602032 6082675 6664675 7391221 8319473
11789H319473J174317J500557J964467K662982L658689M948730O352847P719238
$$ 8319473 9493790 10994347 12958814 15621796 19280485 24229215 30582062 38301300
11781C8301300R042293J0389606J1699101J2441513J1988396J0470678Q314777
$$ 38301300 47343593 57733199 69432300 81873813 93862209 104332887 112647664
11774A12647664N871150L731481J420883j426376l590434l923037k969916j552335
$$ 112647664 118518814 122250295 123671178 122244802 118654368 114731331 111761415 110209080
11766A10209080J88798J730306K636406K972224K810631J488508j267677m432614
$$ 110209080 110397878 112128184 114764590 117736814 120547445 122035953 120768276 116335662
11758A16335662p174493r362486j0348073j0299787j0238824j0290224r724382
$$ 116335662 109161169 99798683 89450610 79150823 68911999 58621775 48897393
11751D8897393q306900o540998m997276l887720l143416k628178k152105j736611
$$ 48897393 40590493 34049495 29052219 25164499 22021083 19392905 17240800 15504189
11743A5504189j407788j140965r30095p82192o73120n95355n38396m76771m01544
$$ 15504189 14096401 12955436 12025341 11243149 10570029 9974674 9436278 8959507 8557963
11734H557963l44469k97956k64876k39877k24580k07645j87633j63284j27308
$$ 8557963 8213494 7915538 7650662 7410785 7186205 6978560 6790927 6627643 6500335
11725F500335j03435o6385l2253J676K9821O8659J02105J55593K01875K79759
$$ 6500335 6396900 6330515 6298262 6299938 6329759 6398418 6500523 6656116 6857991 7137750
11715G137750L92481N33123P28020R82712J349375J888645K618887L526440M607991
$$ 7137750 7530231 8063354 8791374 9774086 11123461 13012106 15630993 19157433 23765424
11706B3765424N742563O652126O999564O664631N857068M759211L304999J416027
$$ 23765424 29507987 36160113 43159677 49824308 55681376 60440587 63745586 65161613
11698F5161613r47199l159480l846933k937027j750822p00210P98270K469900
$$ 65161613 64214414 61054934 57208001 54270974 52520152 51819942 52618212 55088112
11690E5088112L336658K929327J544925r5406j313394k343210m039899o298151
$$ 55088112 58424770 61354097 62899022 62803616 61490222 59147012 55107113 48808962
11682D8808962p642922p125033n588880m252371l431770k871044k377818j916448
$$ 48808962 41166040 34041007 28452127 24199756 20767986 17896942 15519124 13602676
11674A3602676j567786j398110j257739j024500p87599o24509n15070m38467l76890
$$ 13602676 12034890 10636780 9379041 8354541 7566942 6942433 6427363 5988896 5612006
11665E612006l12984k72756k36086k15407j96284j75374j66566j51984j38919
$$ 5612006 5299022 5026266 4790180 4574773 4378489 4203115 4036549 3884565 3745646
11656C745646j31362j23583j22368r7846q1798p7119p9583o5591o1496o9512o6509
$$ 3745646 3614284 3490701 3368333 3270487 3188689 3111570 3031987 2966396 2904900 2835388 2768879
11645B768879o5918o5320o6729n8891n7041o3776o4124o2336m9677l2187l5308
$$ 2768879 2702961 2637641 2570912 2512021 2454980 2391204 2327080 2264744 2215067 2182880 2147572
11634B147572l4716l5253l8757l6351l8609l9046m5727n2808l3470l6022l2317
$$ 2147572 2112856 2077603 2038846 2002495 1963886 1924840 1879113 1826305 1792835 1756813 1724496
11623A724496k8742k7291k2918k9085k5072l4918k4781k1183k6696j9999k4803
$$ 1724496 1695754 1668463 1645545 1616460 1591388 1556470 1531689 1510506 1483810 1463811 1439008
11612A439008k2840k2431k0334k3527j3024k1936k2154l1424l5684k7327j5513
$$ 1439008 1416168 1393737 1373403 1349876 1336852 1314916 1292762 1261338 1225654 1198327 1182814
11601A182814j3242k0958l0335k4653j3610j0463j4947j3670q306l930l632q490
$$ 1182814 1169572 1148614 1118279 1093626 1080016 1069553 1054606 1040936 1032630 1028700 1025068 1016578
11589A016578n22o437M324p119o37K164k11m661q651L253k879L843L725J2710
$$ 1016578 1016056 1009619 1013943 1006824 1006187 1008351 1008140 1003479 994828 998081 995202 999045 1002770 1015480
11575A015480J1152k260k19L282O140J033p424q948m299J606j4547k0660p594
$$ 1015480 1026632 1024372 1024153 1027435 1033575 1034608 1027184 1018236 1013937 1015543 1000996 980336 972742
11562I72742j1254j4062r994j5917k5859j5075j624p088K611j941j2393j7208
$$ 972742 961488 947426 937432 921515 895656 880581 878957 871869 874480 872539 860146 842938
11550H42938j0961n730j1826k077o637m784J544n611r451k423j826o888j3359
$$ 842938 831977 826247 814421 812344 805707 800923 802467 796856 787405 784982 783156 776268 762909
11537G62909o052K452l30q518n879m148p282q430j0317l476n688j5797r242o588
$$ 762909 756857 759309 758979 750461 744582 740434 733152 724722 714405 710929 705241 689444 680202 673614
11523F73614M94J786o465p118M71K561L218M148k667m891k797o582n288o94m195
$$ 673614 674108 675894 669429 662311 662782 665343 668561 672709 670042 665151 662354 655772 650484 649790 645595
11508F45595j1470J28P654M501l795O572O789P356L383n373j1391m785k068N22
$$ 645595 634125 634253 641907 646408 642613 649185 655974 663330 666713 661340 649949 645164 643096 643618
11494F43618m401k980J0229O281K805k737L502j95j0876j2265l011r187o829j279
$$ 643618 639217 636237 646466 652747 655552 652815 656317 656122 645246 632981 629970 620783 613954 612675
11480F12675L846J298N110K910r26M362L50l899j552m237p717l914M038J341k881
$$ 612675 616521 617819 622929 625839 624913 629275 629625 625726 624174 619937 612220 608306 612344 613685 610804
11465F10804n585k924l137j5455Q472K129k596l296J020P049p84o198j459q486
$$ 610804 605219 602295 599158 583703 592175 594304 591708 588412 589432 596481 595697 589499 588040 579554
11451E79554r298P878j293o217l300l830M360J509N184q724q188r853m584r52
$$ 579554 570256 578134 576841 570624 567324 563494 567854 569363 574547 565823 557635 547782 543198 542246
11437E42246r337o085O386O587N88p62O851K4l047M250M065Q60R713K379R85l450
$$ 542246 532909 526824 533210 539797 540385 539623 546474 546498 543451 547701 551766 552626 562339 564718 565703 562253
11421E62253m616k44J1420J4384J1033J3163K5939L0020L3716M3561M2783M8468
$$ 562253 557637 557393 568813 583197 594230 607393 633332 663352 697068 740629 783412 831880
11409H31880L4383J6663J9355M691j7271l5095l3766j9244l897J5766J5183J9681
$$ 831880 866263 882926 902281 906972 889701 854606 820840 801596 797699 813465 828648 848329
11397H48329K6887K4756R56m810j1010l4465n4152n2536m8815n1790l5889k5360
$$ 848329 875216 899972 900928 896118 885108 850643 796491 743955 695140 643350 607461 582101
11385E82101j9079j2825m286k196l68n368m890n081m241j3064l675q568j0248
$$ 582101 563022 550197 545911 543715 543347 537979 533089 528008 523767 510703 507028 498460 488212
11372D88212n063J701o032j848L246K118N420l644j3021J203N537M00R698L914
$$ 488212 483149 484850 478818 476970 480216 482334 487754 484110 471089 472292 477829 478229 487927 491841
11358D91841k933m94N41N983N806O45m77N954O206J1516R736J487N005J5119K6003
$$ 491841 488908 488414 488955 494938 500744 501389 500912 506866 513072 524588 534324 535811 540816 555935 581938
11343E81938K9435L4614M4227N6920P0225P5695P2005O3628N6357L3861N190l375
$$ 581938 611373 645987 690214 747134 817359 893054 965059 1028687 1085044 1118905 1124095 1120720
11331A120720j1878k1698j2417k1913r646O198R521K4521L2963K4007J4774p220
$$ 1120720 1108842 1087144 1074727 1052814 1043168 1049366 1058887 1083408 1116371 1140378 1155152 1147932
11319A147932l3706m7153n6423o7501p0307p2067n9240m8153m8817l7643k0154
$$ 1147932 1114226 1067073 1010650 943149 872842 800775 741535 693382 644565 606922 586768
11308E86768j8238k4767k2422j893o093j0487j2499n120o913o452J09J492m997
$$ 586768 568530 543763 521341 519448 513355 502868 490369 485249 478336 471884 471993 473485 468488
11295D68488J813m686m172l324m888J927j664L906J849j346K265j2977q758J1498
$$ 468488 470301 465615 461443 458119 453231 455158 453494 457400 459249 457903 460168 447191 438433 449931
11281D49931J1026J130o363j28l885m545J053K038K053L756J0635J2128Q486J4184
$$ 449931 460957 462087 455724 455596 451711 447166 448219 450257 452310 456066 466701 478829 487315 501499
11267E01499K4588L2688L6111M0379L9498M4231L3276K2336R534n850k1898l3277
$$ 501499 526087 558775 594886 635265 674763 718994 752270 774606 784140 778290 756392 723115
11255G23115k7089j4284l782Q017K1697J7340K2989J6065Q570j45j1279k7972
$$ 723115 696026 681742 677960 685977 707674 725014 748003 764068 772638 772493 761214 733242
11243G33242m1081m9847m5135l5501l1532k2521j5725k1017j4128k818p230r831
$$ 733242 692161 642314 597179 561678 530146 507625 491900 470883 456755 453937 446707 436876
11231D36876n415N496q73j5497O29J1497Q535p53o942j0314J735j215l24M475
$$ 436876 431461 436957 436084 420587 421216 432713 441248 440495 433553 423239 424974 423759 423435 427910
11217D27910o481l034N824J2001Q686K38l983j712J002J577R94n409k604N29L771
$$ 427910 421429 418395 424219 436220 444906 445144 441161 439449 440451 442028 443022 437613 435009 435538 439309
11202D39309k538m590j315q227p407r77L529P69m168L193N338m431o471L134j432
$$ 439309 436771 432181 430866 422639 415232 414255 417784 418553 414385 417578 422916 418485 412014 415148 413716
11187D13716k449m733O318M310m844o66K885L189L311k199M776L140p99p973O02
$$ 413716 411267 406534 412852 417162 412318 411652 414537 417726 421037 418838 423614 426754 425955 417982 418584
11172D18584L928j007k181j431M44J523l993m895M511L949N882J676n870j0559
$$ 418584 422512 421505 419324 417893 418337 419860 415867 410972 415483 419432 425314 426990 421120 410561
11158D10561M268q183k840J0603k221k489r327l527n231j322M430O06P019M80
$$ 410561 414829 406646 403806 414409 412188 409699 400372 396845 391614 390292 394722 395328 402347 402827
11144D02827J812j68p781j102o61k219k360q35l679K733j807n392n593l016K311
$$ 402827 404639 404471 396690 395588 394927 392708 390348 389513 385834 388567 386760 381368 375775 372759 375070
11129C75070M053O029n440p559L451o327l446L551m695L976N665n422o943n22
$$ 375070 379123 385152 379712 372153 375604 369277 365831 369382 364687 368663 374328 368906 361963 361441
11115C61441o605L662J759k900N61N238j667N020O982j918q230q380J66N986N983
$$ 361441 354836 358498 360257 357357 357918 363156 361489 366509 373491 371573 363343 354963 355129 361115 367098
11100C67098O56m66N1P97L779m814j404j87l787p604M65M746K743K864L143l474
$$ 367098 367754 367288 367339 368136 371915 367101 365697 365510 361723 354119 354584 359330 362073 364937 368080 364606
11084C64606J866j493K629k478p916q81O376K958k550m74r206j481N439K60Q142
$$ 364606 366472 364979 367608 365130 357214 356333 362709 365667 363117 362643 353437 351956 357395 357655 365797
11069C65797n266p246K83M048M209L614J326m255l917k421Q775L030j099l298
$$ 365797 360531 353285 353568 357616 361825 365439 366765 362510 358593 356172 364947 367977 366878 363580
11055C63580J732N247P174J5841M366Q246J1094J9737J7725J3931P490P591J763
$$ 363580 365312 370559 377733 393574 397940 406186 417280 437017 454742 468673 476163 483754 485517
11042D85517l753n619j1621j6487j1551j1194p439M72l827q120p751j1960j410
$$ 485517 481764 476145 464524 448037 436486 425292 417853 418325 414498 406378 398627 386667 385257
11029C85257K076P667J2056Q062M501J4403J7087K0076K6829L1734L3740L7312
$$ 385257 387333 395000 407056 415118 419619 434022 451109 471185 498014 529748 563488 600800
11017F00800L8461K4252R183q551k3595k3343l0633l5739l5177k7753j7550j2221
$$ 600800 639261 663513 672696 664145 640550 617207 586574 550835 515658 487905 470355 458134
11005D58134l228J0715J5368J8492J2643K5919L6778L3164K8555L3198K2237K1029
$$ 458134 454906 465621 480989 499481 512124 538043 574821 607985 636540 669738 691975 713004
10993G13004K2495P641n789j4686q046j6665k2262j8766k0534j7210k3696k4812
$$ 713004 735499 743140 737351 722665 714619 697954 675692 656926 636392 619182 595486 570674
10981E70674k5005j7435j1184o588o49R647L1258L5865L3882L9369N7704O7380
$$ 570674 545669 528234 517050 510462 509813 519460 550718 586583 620465 659834 717538 784918
10969G84918O2504O1852M7324L4137N308j2336l5495m8036n8460o9879o1288n3069
$$ 784918 847422 909274 956598 990735 996043 983707 948212 900176 841716 771837 710549 657480
10957F57480k9733j2281R937L1432N4291Q3473J18795J57298J83717J96928J91112
$$ 657480 627747 615466 625403 656835 711126 794599 913394 1070692 1254409 1451337 1642449
10946A642449J74121J41773R5287K8849n4218j16086j51920j69551j59892j29142
$$ 1642449 1816570 1958343 2053630 2082479 2028261 1912175 1760255 1590704 1430812 1301670
10936A301670j03247j11122q7754q0104q0063p0688n4994l6810l3983k7048o711
$$ 1301670 1198423 1087301 999547 919443 839380 768692 713698 676888 642905 615857 609146
10925F09146J837K000O494J6376L1072L2746L0135K9425K9687J3923P743J5858
$$ 609146 610983 612983 619477 635853 666925 699671 729806 759231 788918 802841 810584 826442
10913H26442K3832L5663N8532J08430J40076J81445J85519J59408J22980O9881
$$ 826442 850274 885937 944469 1052899 1192975 1374420 1559939 1719347 1842327 1912208
10903A912208J5625n7850j62698k27452k42757k04112j51224j10935p8162m6207
$$ 1912208 1927833 1869983 1707285 1479833 1237076 1032964 881740 770805 692643 646436
10893F46436k1948j2030n644k059r546n113j930j1284j5108j4664j5980k1357
$$ 646436 624488 612458 606814 604755 595209 590096 588166 576882 561774 547110 531130 509773
10881E09773j9480k3018k3279j7082j7863r542K671k082o135n216m992m278L643
$$ 509773 490293 467275 443996 426914 409051 399509 402180 400098 393963 388747 383755 379477 383120
10868C83120Q824L962L712k537j286R736N315m136q895n947L457n821n983J872
$$ 383120 391944 395906 399618 397081 395795 405531 410846 406710 397815 391868 395325 389504 383521 385393
10854C85393m9o960k565k68K788n874k349m218q611l616O85L037l529n472J0486
$$ 385393 385344 378384 375819 375551 378339 372465 370116 365898 357287 353671 354356 357393 353864 348392 358878
10839C58878N494K510m66p861j6209r941j3728j3498r19k915p872o599L83J2215
$$ 358878 364372 366882 366416 358555 342346 332405 318677 305179 304260 301345 293473 286874 287257 299472
10825B99472M751N539J241J609J4247J7182L060M442k42j552K96L077m913j776
$$ 299472 304223 309762 311003 312612 326859 344041 347101 351543 351301 349749 350045 353122 348209 346433
10811C46433P50q810L313M453n13K844Q945J0151R76k701n666J859m773p377j0431
$$ 346433 347183 338373 341686 346139 345626 348470 357415 367566 368542 365841 360175 362034 357261 349884 339453
10796C39453j1104l587q832k604K296q87N474J2710K4677L2776K5430L3768M4983
$$ 339453 328349 324762 315930 313326 315622 314735 320209 332919 357596 390372 415802 449570 494553
10783D94553L4735J0612j535L474N003M561p740j6765k6319k5608j6060k3079
$$ 494553 529288 539900 538365 541839 546842 551403 543663 526898 500579 474971 458911 435832
10771D35832k6410j7594k0629k18k743k154q95j0741j4380p00J559K131j37L219
$$ 435832 409422 391828 371199 370981 368238 366084 365189 354448 340068 339368 340927 343058 342921 346140
10757C46140L307j206Q92J1768N371N701J0166J4152R976J6988K0184L2814K9763
$$ 346140 349447 348241 349133 360901 366272 371973 382139 396291 406267 423255 443439 476253 506016
10744E06016L1503L1381K3003Q495l668k539j1839j6039k1380l9311l8482l0831
$$ 506016 537519 568900 591903 600398 596730 594191 582352 566313 544933 505622 467140 436309
10732D36309j9296j3401j4459j1443j1900q087o079N799M888n410m344j4265j4921
$$ 436309 417013 403612 389153 377710 365810 357723 351644 357443 362331 356921 352577 338312 323391
10719C23391r882n683l572j087O144J3577J5529K6337L0561L5524L2223L1189
$$ 323391 313509 307826 304254 303167 309311 322888 338417 364754 395315 430839 463062 494251
10707D94251J9098J4145J1301M871L524n635j5865j7661j7015l617K140l969k055
$$ 494251 513349 527494 538795 543666 547190 541555 525690 508029 491014 487397 489537 485568 483513
10694D83513L897J7241J3192n632m648p369q697p318m822n673l239k826o060o115
$$ 483513 487410 504651 517843 512211 507563 500194 491497 484179 479357 473684 470445 467619 461559 455444
10680D55444j4409j6679j4109o791r814k328J2856K0584J7080K8897M9298N0976
$$ 455444 441035 424356 410247 403456 393642 391314 404170 424754 441834 470731 520029 571005
10668E71005L8218L6053L0879K6304K0955J1982j132k303L205K468Q88q543j1359
$$ 571005 609223 645276 676155 702459 723414 735396 734264 731961 735166 737634 738522 729979 718620
10655G18620j2627j0449j750Q177J7029J2824k126k1822k5435j7752k4574j4147
$$ 718620 705993 695544 693794 701971 719000 731824 729698 707876 682441 664689 640115 625968
10643F25968j1667j4628p700m955K97K286j436k454R336J1794o325L621J1581
$$ 625968 614301 599673 591973 587018 587315 589601 588165 585711 595047 606841 600516 604137 615718
10630F15718N620j922L831R558J4532J9698J6462K5491K4538L0993L6072L1521
$$ 615718 621338 619416 623247 632805 647337 667035 683497 708988 733526 764519 800591 832112
10618H32112J5552K673o433r480j8655j3135J2663K6289L0969J3081K867o803
$$ 832112 847664 850337 843904 834424 815769 802634 815297 841586 872555 885636 888503 881700
10606H81700q099j7122j3183O277R141M817K4832L2069J6925J6034J0243L963
$$ 881700 873601 856479 843296 849573 858714 863531 888363 920432 937357 953391 963634 967597
10594I67597k593O731L122r715k33K4135K3765K3473L3785L7587L0605L0235L4754
$$ 967597 965004 971735 974857 965142 964909 989044 1012809 1036282 1070067 1107654 1138259 1168494 1203248
10581A203248L4425N0495M9039O0445P2160Q5742R6941Q6369Q8874R6230R8824
$$ 1203248 1237673 1288168 1337207 1397652 1469812 1555554 1652495 1738864 1827738 1923968 2022792
10570B022792Q7768Q0463P9372P9529Q1452Q2042Q0862R4071R9839J14366J27128
$$ 2022792 2110560 2191023 2270395 2349924 2431376 2513418 2594280 2688351 2788190 2902556 3029684
10559C029684J36493J44714J59081J68465J82623J98435K31353K55835K78529
$$ 3029684 3166177 3310891 3469972 3638437 3821060 4019495 4250848 4506683 4785212
10550D785212L05843L57724M26794N20739O31991P54106R12610J090027J338824
$$ 4785212 5091055 5448779 5875573 6396312 7028303 7782409 8695019 9785046 11123870
10541A1123870J656502K047945K626934L478711M832825P088479J0711935J5944844
$$ 11123870 12780372 14828317 17455251 20933962 25766787 32855266 43567201 59512045
10533E9512045K2142268K7636247L0701176L0631641K7794826K3187370J6971226
$$ 59512045 81654313 109290560 139991736 170623377 198418203 221605573 238576799
10526B38576799P942595m272318j7108467k7158302l1761009l0699486k6316109
$$ 238576799 246519394 242247076 225138609 197980307 166219298 135519812 109203703
10519A09203703k0871891j5736200j1775068q969104o969688n547867m515662
$$ 109203703 88331812 72595612 60820544 51851440 44881752 39333885 34818223
10512C4818223l696681l003019k377422j809493j289777q34257m00934M3261M67042
$$ 34818223 31121542 28118523 25741101 23931608 22641831 21807574 21406640 21449901 21916943
10503B1916943Q28392J143742J455734J827618K321507L031070M143814N971350
$$ 21916943 22745335 23889077 25344811 27172429 29493936 32525006 36668820 42640170
10495D2640170R030708J3863715K0518618K8036307L4132877L5966374L2631116
$$ 42640170 51670878 65534593 86053211 114089518 148222395 184188769 216819885
10488B16819885K6087234J8467735J0119514k54357j4637194l1742361m3322230
$$ 216819885 242907119 261374854 271494368 271240011 256602817 224860456 181538226
10481A81538226m3609420l4920735k4326293j6521998j1550193q359442o202958
$$ 181538226 137928806 103008071 78681778 62159780 50609587 42250145 36047187
10474C6047187m685862l621623k936099k515593k215842j927237j643638j361893
$$ 36047187 31361325 27739702 24803603 22288010 20072168 18144931 16501293 15139400
10466A5139400j115876r25785p98650o97081o32869n73884n05513m35121l67197
$$ 15139400 14023524 13097739 12299089 11602008 10969139 10395255 9889742 9454621 9087424
10457I087424l20349k90204k74068k58263k47559k53975k86743l11762l22555
$$ 9087424 8767075 8476871 8202803 7944540 7696981 7443006 7156263 6844501 6521946
10448F521946l06509k74475k56283k48906k34958k29026k20032k17992j96352
$$ 6521946 6215437 5940962 5684679 5435773 5200815 4971789 4751757 4533765 4337413
10439D337413j79305j55629j34613j21368j16263r8755p5273p6316p4349p1025
$$ 4337413 4158108 4002479 3867866 3746498 3630235 3531480 3456207 3379891 3305542 3234517
10429C234517q9891r6968q1604q4243q7112q2898p5252o7120o0394n4929n8133
$$ 3234517 3144626 3047658 2966054 2881811 2794699 2711801 2636549 2569429 2509035 2454106 2395973
10418B395973o2355n4075n5037n6283m8770n2183m3527m1488k7111k3903k6831
$$ 2395973 2333618 2279543 2224506 2168223 2119453 2067270 2023743 1982255 1955144 1931241 1904410
10407A904410k6873k4974k5038l6167l4802l2987k6683k3950j7938j9848q101
$$ 1904410 1877537 1852563 1827525 1791358 1756556 1723569 1696886 1672936 1654998 1635150 1627049
10396A627049j5815l3108m0583n0086m5489m6239m8026m9293l5160k9575k6843
$$ 1627049 1611234 1578126 1537543 1487457 1441968 1395729 1347703 1298410 1263250 1233675 1206832
10385A206832l7500k8205j9822k2889k8340k1355j5001j2414q253L96p975j9202
$$ 1206832 1169332 1141127 1121305 1098416 1070076 1048721 1033720 1021306 1013053 1013449 1005474 986272
10373I86272k5360j5470L498R76j2282j138N22N636N113J836p453k892o686k0690
$$ 986272 960912 945442 948940 949916 937634 936496 937018 942654 947767 949603 942150 939258 932572 911882
10359I11882j1636j2658j8268j7632k4410k6290l2825m4778m4613m3871l8513
$$ 911882 900246 887588 869320 851688 827278 800988 768163 723385 678772 634901 596388
10348E96388k3150p918N495J1640L2853M0519L7548K8758J9218J8043N859k658
$$ 596388 573238 565320 570815 582455 615308 655827 693375 722133 741351 759394 765253 762595
10336G62595j3239j3276j7481j9417k5614k6644j3156j2297n470n186j5598r611
$$ 762595 749356 736080 718599 699182 673568 646924 633768 621471 616001 610815 595217 585606
10324E85606j5729j4510o458j4927j1533n882j1027p316p55l631K658o624r092
$$ 585606 569877 555367 548909 533982 522449 516567 505540 498224 497469 493838 496496 489872 480780
10311D80780j3337k1470k0930j1945l54O501J3426K7793L1273L1040M4797L9809
$$ 480780 467443 445973 425043 413098 412744 419245 432671 460464 491737 522777 567574 607383
10299F07383L0454J5887j991j0419r218j5601j3567j1122p046k426k936k698j1025
$$ 607383 637837 653724 651733 641314 632096 616495 602928 591806 584760 582334 579398 576700 565675
10286E65675j0335K800k495n467q50J0337Q392J1091M537q24p51k601n512q337
$$ 565675 555340 558140 555645 550178 549328 559665 568057 579148 583685 582861 582110 579509 573997 565660
10272E65660n21o034j3180m479k852M414Q122L555O480M310J1418P659o85n640
$$ 565660 565139 559105 545925 541446 538594 543008 551130 554685 561165 565475 576893 584552 583867 578227
10258E78227j7786j8366p170l4K612q89l485m835k142L797r4K472q783k198O010
$$ 578227 560441 542075 534905 534871 537483 536594 533109 528274 526132 529929 529835 532307 523524 521326 527336
10243E27336N00J29L746k013k143m693M450O460j80k334j75k65j202k141N240
$$ 527336 527836 527965 531711 529698 527555 522862 527312 533772 533592 531258 531083 530818 529616 527475 532715
10228E32715Q720K20P7j68m493J286P06k035p561m730m805m618n809j1670q213
$$ 532715 541435 541655 541732 541564 537071 538357 539063 537028 529467 524737 519932 515314 509505 497835 489622
10213D89622l246l847r130m334q872K128k193P6J986L680l210o602l162N776N161
$$ 489622 486376 482529 473399 469065 460193 462321 460128 460204 462190 465870 462660 456058 452896 458672 463833
10198D63833L636J55q969K85K804L83n831J28M986P244J120R635L214L735l2N184
$$ 463833 467469 467624 458655 458940 461744 462127 456296 456424 461410 468654 469774 479409 482623 486358 486326 491510
10182D91510J467m249p160l809j686o335m781r319j6366J060P810M00j694M139
$$ 491510 492977 488728 481568 477759 476073 469738 464957 455638 439272 440332 448142 448542 446848 450987
10168D50987l03k288j927M593Q222n578o281n21m961k895O21n547j8J619J759
$$ 450987 450684 448396 446469 451062 459284 453706 447425 446904 441943 439048 439669 434122 434104 435723 437482
10153D37482j820J148J999j714p112J0054K0237j961K564N379K350J918K460L782
$$ 437482 435662 436810 438809 437095 429983 440037 460274 458313 460877 466256 468606 470524 472984 476766
10139D76766k038J9o290j222J560L034q54m917m130j197j137J4560J0403O520
$$ 476766 474728 474747 468457 467235 468795 471829 470975 466058 461928 460731 459594 474154 484557 491077
10125D91077M347k715q546k742m88l366k38N632L850O769Q284J6631K5793M6341
$$ 491077 495424 492709 484163 481421 480933 477567 477329 482961 486811 493580 501864 518495 544288 590629
10111E90629M8194O3672J08887J26768J57449J62526J54271J30404J03095O8610
$$ 590629 638823 702495 811382 938150 1095599 1258125 1412396 1542800 1645895 1714505
10101A714505J319p3490j29125j52457j65067j49759j19438q2330o5000n1843
$$ 1714505 1715824 1642334 1513209 1360752 1195685 1045926 926488 844158 779158 727315
10091G27315m0490l3223l0224j7453j0855j3958r205j1395l985m90m931N743K062
$$ 727315 686825 653602 623378 605925 595070 581112 571907 560512 556527 556037 551106 556849 558911
10078E58911l315J0795J5173J1494J4053K2615K7794L8426N8088R6742J31500
$$ 558911 555596 566391 581564 593058 607111 629726 657520 695946 754034 850776 982276
10067I82276J67638J87851J90672J56618J13237O5103J1976o4893j61666k26813
$$ 982276 1149914 1337765 1528437 1685055 1798292 1863395 1875371 1810478 1648812 1421999
10057A421999k32811j95874j40141r6120o5146l8017k8841l1523k6088k3864j6771
$$ 1421999 1189188 993314 853173 757053 691907 653890 625049 593526 567438 543574 526803
10046E26803j4480j1960j6821j1076l344l805M442p62j4348m845j574j807o064
$$ 526803 512323 500363 483542 472466 469122 465317 469759 468997 454649 449804 448230 446423 440359
10033D40359m644l205m598P76j841n427l527l553L339J4576l492l860L283L657
$$ 440359 435715 432510 427912 428688 426847 421420 417893 414340 417679 432255 428763 424903 428186 431843
10019D31843m087o212k034L773L928K07J3255Q552j143k618l159p029R04K528
$$ 431843 427756 421544 419510 423283 427211 427418 440673 449225 448082 445464 442305 435276 436180 438708
10005D38708J75l749K745j219K573O74o44O971l830n863l603k248L295P649Q078
$$ 438708 438883 435134 437879 436660 439233 439907 439263 446234 442404 436541 432938 430690 433985 441634 449712
9990D49712j68n605j480q152M77K094j052l989k6k178j553j14L852J744p010q32
$$ 449712 449544 443939 442459 434307 434784 436878 435826 431837 431811 429633 428080 427966 431818 433562 426552 425720
9974D25720J832L573O888N117J5l653l751l615j980n137m188k897r66J2916R987
$$ 425720 427552 431125 438013 443130 443145 439492 435741 432126 430146 425009 420821 417924 416958 429874 439861
9959D39861k129o054R39j341o74J427N088m157n633n52m06k336l818p27PM537
$$ 439861 437732 431678 432617 431276 430602 432029 437117 432960 427327 426775 426369 424033 420215 419488 419495 424032
9943D24032R003N846L557o912p882Q42J515l53K24K021m16j668J718L138K99p56
$$ 424032 433035 438881 442438 435526 427644 428486 430001 429648 429872 431893 431477 429809 431527 434665 434964 434208
9927D34208M246K923Q44l133n715n987r29M517k410m600j272p87K964K66N007
$$ 434208 438454 441377 442221 439088 433373 427386 426457 430974 428564 423964 422692 421905 424869 425135 430142
9912D30142J0323P980M366j865l007m342K898K590K232j050L157N44J156l605
$$ 430142 440465 448445 452811 450946 447939 443597 446495 449085 451317 450267 453424 453968 455124 451519
9898D51519j71m090j1040m422L31J2327J660p513o170j878l966O234K83J389O808
$$ 451519 451348 447258 436218 431796 432127 444454 446114 438601 432431 430553 426587 432821 433104 434493 441301
9883D41301P100l229K545Q76j262J712J591r576J588L239K286J881q784o027R35
$$ 441301 448401 445172 447717 448593 447331 449043 450634 441058 442646 445885 448171 450052 441268 435241 436176
9868D36176K312N195o9j009n030j498K288k98Q200M193K932j712j2426K09R306
$$ 436176 438488 443683 443614 442605 437575 436077 438365 438067 446267 450460 453392 451680 439254 439463 448769
9853D48769J883l271m760K460L172k509n33M00K599L238j352m577q763K459N818
$$ 448769 450652 447381 442621 445081 448253 445744 445211 445611 448210 451448 450096 445519 436756 439215 445033
9838D45033N784L731l793m949n69m634J16R886M18n05J631q691p147J813P045
$$ 445033 450817 454548 450755 445806 445237 440603 440719 450605 451023 450518 452149 443458 436311 438124 445169
9823D45169K479O229Q931K855R40o038l02J892m643m743L3K012L981l088o523
$$ 445169 447648 453877 462808 465663 466603 460565 460263 462155 457512 452769 452802 454814 458795 455707 449184
9808D49184O35M560J0645q35K41L280k796j09k292k203l599l148P141R662j256
$$ 449184 449819 454379 465024 464189 464430 467710 464914 464805 462513 460310 456711 453563 460704 470366 469110
9793D69110l730m152k865P796N12O152M840n74K774J561l860q831m671J686j913
$$ 469110 465380 461228 458363 466159 466671 472823 477663 477089 479863 481424 477564 468733 464062 465748 463835
9778D63835q937q857K407M810P939Q355q96qm493l465L402j748N67Q487k275m524
$$ 463835 454898 446041 448448 453258 461197 469552 468656 468648 464155 460690 464092 462344 462911 471398 469123 464599
9762D64599J741M928K323o893K368P510J141k213N665k267J544p753l272K09N440
$$ 464599 466340 471268 473591 466698 469066 476576 477717 475504 481169 478902 480446 472693 469421 469630 475070
9747D75070j1878q166L672L065n116n083J0123l188k09L447o00p08n75j908l826
$$ 475070 463192 455026 458698 461763 456647 451564 461687 458499 458290 461737 461137 460429 459854 457946 454120
9732D54120L597L891m572M742j02n028N026Q916Q076P511N287n343j869L19L13
$$ 454120 457717 461608 457036 461778 461676 456648 461674 470590 478666 486177 491464 486121 484252 484571 484884
9717D84884k619N466J0965O11l136M468j014m454l598k445K96P736k030p592j401
$$ 484884 482265 487731 498696 499307 496171 500639 499625 495171 491573 489128 489424 497160 495130 487538 486137
9702D86137L261J0699m819q517O72K150p494m75K193J4164L152J539o115q919
$$ 486137 489398 500097 495278 486761 487433 489583 482089 481614 483807 497971 501123 502662 496547 487628
9688D87628M584K993J894J442P162J795j0609n954R90k066O568J1949O971j238
$$ 487628 492212 495205 497099 498541 505703 507498 496889 490935 491925 489859 496427 508376 515347 514109
9674E14109k657j343l180M020o430q841j2536J414L272o88P482J3494j583p859
$$ 514109 511452 510109 506929 510949 504519 495678 483142 484556 487828 487140 494622 508116 506533 498674
9660D98674q63Q121K802J940L036O139N554R36j2989j5406o856J359K142R259
$$ 498674 497811 505932 508734 510674 513710 519849 525403 526339 513350 497944 491088 492447 494589 503848
9646E03848K519J528m259k417M290P458J332M766R379Q4j1208j7472k105R059
$$ 503848 506367 507895 503636 501219 505509 512967 514299 519065 528444 528528 517320 499848 497743 506802
9632E06802O113J2992J184k653j1348j0042O700O886L178P775m375j2165L05O450
$$ 506802 512915 525907 527091 524438 513090 503048 509748 516634 519812 527587 523212 511047 511352 517802
9618E17802L107j371J208L14L556O01j15J60N697O489J3657J0821l875j569L947
$$ 517802 520909 519538 520746 521060 524616 525217 525102 525262 530959 537448 551105 561926 558051 556482 560429
9603E60429K41O473P913K02l97l558R734J0462M599O433Q78J408n936j076J0853
$$ 560429 560670 567143 575056 575258 574861 571303 581037 591499 596098 602531 603409 604817 598881 597805 608658
9588F08658J2610M970J3839J4086J1414J604n039M789p258J273L780j8087k0394
$$ 608658 621268 626238 640077 654163 665577 667181 662142 666931 659673 660946 664726 646639 626245
9575F26245j0569j1513j1119q524O914L462J783L954J3210J0870K0929K6425K1059
$$ 626245 615676 604163 593044 584520 591434 594896 596679 600633 613843 624713 645642 672067 693126
9562F93126K9584L1157K9208K1778J3537K828j98O497n50o630j5875j0755j0553
$$ 693126 722710 753867 783075 804853 818390 821218 821020 827517 826967 820337 804462 793707 783154
9549G83154m097j296L316q16j4091j9006j4490J870O976K191K091n561m36P307
$$ 783154 779057 777761 781077 780261 766170 747164 732674 734544 741520 743711 745802 740241 739805 747112
9535G47112J5284K3007J0370J6115J4305N752n98l076j004k454J480J222N625
$$ 747112 762396 785403 795773 811888 826193 831945 831347 828271 827267 824813 826293 827515 833140
9522H33140L476Q902P576J2562J8795Q207R941k858j4791j8725j2920j8647r445
$$ 833140 836616 845518 853094 865656 884451 892658 902599 899741 884950 866225 853305 834658 825213
9509H25213p849q667n713m53J0361L6996M2074O1428O5178O3222O8215O5365N2305
$$ 825213 817364 808697 802984 802531 812892 849888 891962 953390 1018568 1081790 1150005 1215370 1267675
9496A267675L7579K4329o064l5941m0698m0961m9295n2611o0960m9111m4712k4266
$$ 1267675 1305254 1329583 1323519 1287578 1246880 1205919 1156624 1104013 1043053 993942 949230 924964
9484I24964j9406j5561l273J5188L8680M4847N3340P7894R2448Q8339R0720Q7273
$$ 924964 905558 889997 886724 901912 940592 985439 1038779 1116673 1209121 1297460 1388180 1475453
9472A475453P2613N7438M2586L2830K8884N612k365K288l219o043J6541K6643
$$ 1475453 1548066 1605504 1648090 1680920 1709804 1715416 1713051 1715339 1712120 1706077 1722618 1749261
9460A749261K1905P078R346L777P438L2448N0709O1025M9928M8338M0646M8346
$$ 1749261 1771166 1778244 1787590 1791367 1798805 1831253 1881962 1942987 1992915 2041253 2081899 2130245
9448B130245M3134J3385k7924n3304o8775o4642m6610j9714N438J0824J7900K0807
$$ 2130245 2173379 2186764 2158840 2105536 2036761 1972119 1925509 1905795 1911233 1922057 1939957 1960764
9436A960764L5542L3090J5448R073J8162L0652L3000J2673p902j1240j5597j5514
$$ 1960764 1996306 2029396 2044844 2053917 2072079 2102731 2135731 2148404 2140502 2129262 2113665 2098151
9424B098151k4857n9004r6750j18911j30854j24341j00606q5706o4015k1299J1519
$$ 2098151 2073294 2014290 1917540 1798629 1667775 1543434 1442828 1357122 1293107 1271808 1283327
9413A283327L6728M8105O1000P9330R8649J24430J27567J23284J08420R5112Q2349
$$ 1283327 1320055 1368160 1429160 1508490 1607139 1731569 1859136 1982420 2090840 2185952 2268301
9402B268301O4414L2141j8914n6465r0808j13228j31104j24342j12984j12687
$$ 2268301 2332715 2364856 2345942 2289477 2198669 2085441 1954337 1829995 1717011 1604324
9392A604324q2810n6168n0367l3275p645O461L2957O4766Q5615R4172J04332J10123
$$ 1604324 1521514 1465346 1414979 1381704 1374059 1380520 1413477 1478243 1563858 1658030 1762362 1872485
9380A872485J05586R8990P6885L0110j1184m0164p1027j15026j43233j33290j07526
$$ 1872485 1978071 2077061 2153946 2184056 2172872 2132708 2061681 1946655 1803422 1670132 1562606
9369A562606j00192p9746n6124m0512k2016o156j0869p089j4824j7313l248J4824
$$ 1562606 1462414 1382668 1326544 1286032 1264016 1257860 1246991 1239902 1225078 1207765 1204517 1219341
9357A219341L2837L3133L4030L1688K7155J3288k200q008l1663n6369p2228m9884
$$ 1219341 1252178 1285311 1319341 1351029 1378184 1391472 1389272 1381264 1349601 1293232 1221004 1171120
9345A171120l7908k4736r711p03K676O238O298J3072J5730J7948K9918M1091M1826
$$ 1171120 1133212 1108476 1098765 1098062 1100738 1106976 1113274 1126346 1142076 1160024 1189942 1231033 1272859
9332A272859M6122M4792N3755M2123J6803j1822j9681j8157l3734m7864l1371
$$ 1272859 1318981 1363773 1417528 1459651 1476454 1464632 1444951 1426794 1393060 1345196 1313825
9321A313825k1654j338J8460K3407K5428J4168R437J054m346j4524k7556l7401
$$ 1313825 1292171 1290833 1309293 1332700 1358128 1372296 1381733 1382787 1378441 1363917 1336361 1298960
9309A298960l2787k8876k1966k8542l3107k3237j6275l838m719p174N629N343
$$ 1298960 1266173 1237297 1215331 1186789 1153682 1130445 1114170 1110332 1105613 1098439 1104068 1109411
9297A109411Q862J8860K1493K5828K4450K6687P488M817n863j8061j9187l0906
$$ 1109411 1118273 1137133 1158626 1184454 1208904 1235591 1243079 1247896 1242033 1223972 1204785 1173879
9285A173879l0324k4548k4231l4597k2257j6080j7093j8541l421j711Q237R712
$$ 1173879 1143555 1119007 1094776 1060179 1037922 1021842 1004749 986208 982787 981076 989313 999025
9273I99025J7038J7866J7768K2678K4585K4087K3919K2072Q2j1623j4958p507
$$ 999025 1016063 1033929 1051697 1074375 1098960 1123047 1146966 1169038 1169120 1157497 1142539 1135032
9261A135032j0114j5022l145o019L67J0870J952n008p411J722J0753J6117K5146
$$ 1135032 1124918 1109896 1106751 1100732 1101099 1111969 1113921 1108913 1101502 1103224 1113977 1130094 1155240
9248A155240L1992M1583L8096L6016K7694K4597J3173l603m455j2970k5277k5584
$$ 1155240 1187232 1228815 1266911 1302927 1330621 1355218 1368391 1364788 1360333 1347363 1322086 1296502
9236A296502j4823k1157k2840j2892p853r02Q463L615O629Q603J0522J2394J9625
$$ 1296502 1281679 1260522 1237682 1224790 1216937 1216035 1224498 1228113 1234742 1243345 1253867 1266261 1285886
9223A285886R336Q218J0737N558K632M4k404n135q558j578p21m433q711j3773
$$ 1285886 1295222 1303440 1314177 1319735 1322367 1322411 1320007 1314872 1306314 1304736 1304015 1299582 1290871 1277098
9209A277098o858m793N255J2407M571j402R180J5819J1044l643Q44l92O704l286
$$ 1277098 1270240 1265447 1270702 1283109 1287680 1286278 1295458 1311277 1322321 1318678 1319522 1319130 1325834 1322548
9195A322548r396P681k70m724N29O511m228M58l73J8663K3583Q024J485O567L332
$$ 1322548 1313152 1320833 1320563 1315839 1316368 1322879 1318651 1319109 1318736 1337399 1360982 1369006 1370491 1377058 1380390
9180A380390p94N975J7831J4323J6558J5913J6994J0743L774J0914J2375J5496
$$ 1380390 1379596 1385571 1403402 1417725 1434283 1450196 1467190 1477933 1481707 1492621 1504996 1520492
9168A520492J4978J0570k004j030p875M706j950n914N818Q191Q186J1977K0031
$$ 1520492 1535470 1546040 1544036 1543006 1535131 1539837 1537887 1531973 1537791 1545982 1554168 1566145 1586176
9155A586176K1312K4289L0254K4570K5773K6235K7575J5346J2660K0823J3974
$$ 1586176 1607488 1631777 1662031 1686601 1712374 1738609 1766184 1781530 1794190 1815013 1828987
9144A828987Q826N394J4164J1490M728J1225J8675K0235K5667K4181K1423K3172
$$ 1828987 1837813 1843207 1857371 1868861 1873589 1884814 1903489 1923724 1949391 1973572 1994995 2018167
9132B018167K4233K4698L8975L4238L7116L7525L4888L4855L7108L2332K8905
$$ 2018167 2042400 2067098 2106073 2140311 2177427 2214952 2249840 2284695 2321803 2354135 2383040
9121B383040L4784M4542M7484L4213M2255O5142P0716Q1915R5075R5392J05202
$$ 2383040 2417824 2462366 2509850 2544063 2586318 2651460 2722176 2804091 2899166 2994558 3099760
9110C099760J15783J31472J68273J95134K28850K91352L69878M63723N59787O76886
$$ 3099760 3215543 3347015 3515288 3710422 3939272 4230624 4600502 5064225 5624012 6300898
9100F300898Q01434R11213J027455J125058J188546J225584J222684J213879J193415
$$ 6300898 7102332 8013545 9041000 10166058 11354604 12580188 13802872 15016751 16210166
9091A6210166J226457J350482J546277J803530K104712K413290K736705L044711
$$ 16210166 17436623 18787105 20333382 22136912 24241624 26654914 29391619 32436330
9083C2436330L195086L116580K846881K417499J919406J403727R34460O36342
$$ 32436330 35631416 38747996 41594877 44012376 45931782 47335509 48269969 48906311
9075D8906311O34674R13329J306304J598987J725775J789248J883921J931923
$$ 48906311 49540985 50454314 51760618 53359605 55085380 56874628 58758549 60690472
9067F0690472J708234J067077K31226m51687q00360p43099m54930j07475K20749
$$ 60690472 62398706 63465783 63697009 63245322 62444962 61701863 61246933 61139458 61360207
9058F1360207M68643N46733N55242N18232L94838J15386l26765p96957j148853
$$ 61360207 61828850 62375583 62930825 63449057 63843895 63959281 63632516 62835559 61686706
9049F1686706j432637j599818j705079j702006j658190j756867k036237k407161
$$ 61686706 60254069 58654251 56949172 55247166 53588976 51832109 49795872 47388711
9041D7388711k721103k824159k729274k555449k378440k208617k035065j852470
$$ 47388711 44667608 41843449 39114175 36558726 34180286 31971669 29936604 28084134
9033B8084134j667006j493985j326709j225428j252080j332291j366719j300511
$$ 28084134 26417128 24923143 23596434 22371006 21118926 19786635 18419916 17119405
9025A7119405j134175r00944o04702k76351O6564M27045P73236J083402J317497
$$ 17119405 15985230 15084286 14479584 14203233 14269797 14696842 15470078 16553480 17870977
9016A7870977J401621J250310R16233N95521M27592M36393M74653N79256R78222
$$ 17870977 19272598 20522908 21439141 22034662 22462254 22898647 23373300 23952556 24930778
9007B4930778J694230K514139L235659L710103L877940L713752L126235K237646
$$ 24930778 26625008 29139147 32374806 36084909 39962849 43676601 46802836 49040482
8999D9040482J376902O44454J23971L7633K81717P28228J570636K647498L518276
$$ 49040482 50417384 51061838 51185809 51223442 51505159 52233387 53804023 56451521 59969797
8990E9969797M023242M104796L813204L139122K043785R76834O71706J004274
$$ 59969797 63993039 68097835 71911039 75050161 77093946 78070780 78742486 79746760
8982G9746760J349900J624060K227140L241030M065821M214836L676386K879766
$$ 79746760 81096660 82720720 84947860 88188890 92254711 96469547 100145933 103025699
8974A03025699K369014J845698N42321j504118l283167l880584l682491l672903
$$ 103025699 105394713 107240411 107782732 106278614 102995447 99114863 95432372 91759469
8966I1759469m231632m843113m792166m386431m316832m651867m815157m551492
$$ 91759469 87527837 82684724 77892558 73506127 69189295 64537428 59722271 55170779
8958E5170779m245363m178034m341575m285181l699069k954921k373163j897386
$$ 55170779 50925416 46747382 42405807 38120626 34421557 31466636 29093473 27196087
8950B7196087j506691j173333p94302k70115L65136P96199P89039N46135K54653
$$ 27196087 25689396 24516063 23721761 23451646 23816782 24612981 25402020 25948155 26202808
8941B6202808l964k99760j048025k422954l299632l043998k273164j549873j008010
$$ 26202808 26198844 25899084 24851059 22428105 19128473 16084475 13811311 12261438 11253428
8932A1253428o08039k89233m3148J30567K53592L25051L64806L73097L64596L77892
$$ 11253428 10645389 10356156 10313008 10443575 10697167 11022218 11387024 11760121 12124717 12502609
8922A2502609M59903O36279Q02505Q55809Q62458P98905O63726M57515J28805
$$ 12502609 12962512 13598791 14401296 15257105 16119563 16918468 17582194 18039709 18168514
8913A8168514l40026q70419j208478j178146r16030o03736l47377j55730l822
$$ 18168514 17828488 16958069 15749591 14571445 13655415 13051679 12704302 12548572 12544750
8904A2544750O8010Q9769O7959K2160M8664K26720N82965J002373J289979J346202
$$ 12544750 12612760 12702529 12770488 12792648 12841312 13068032 13650997 14653370 15943349 17289551
8894A7289551J156635Q48820N53441J80756l31952q78757j258841j290451r80865
$$ 17289551 18446186 19295006 19848447 20029203 19697251 18818494 17559653 16269202 15288337
8885A5288337n37734q8638L72118Q16885J234112J590719J808966J810362J637039
$$ 15288337 14750603 14661965 15034083 15850968 17085080 18675799 20484765 22295127 23932166
8876B3932166J328237Q97353L20918m06196j252099j906392k125171j982618j676961
$$ 23932166 25260403 26157756 26478674 26072478 24820379 22913987 20788816 18806198 17129237
8867A7129237j407367j209826j000734p03624l82940j5759M15688Q96134J427390
$$ 17129237 15721870 14512044 13511310 12807686 12424746 12408987 12824675 13720809 15148199
8858A5148199K019162K586629K966227L015798K723923K221362J666191R77837
$$ 15148199 17167361 19753990 22720217 25736015 28459938 30681300 32347491 33325328
8850C3325328N922j161404k237434k782378k671392k187946j729447j406395j152342
$$ 33325328 33331250 32169846 29932412 27150034 24478642 22290696 20561249 19154854 18002512
8841A8002512r18538o37141l23305K2400L55405N83373P23563Q02447P78201O10218
$$ 18002512 17083974 16446833 16123528 16145928 16501333 17084706 17808269 18610716 19388917 19999135
8831A9999135L24239P1403K4352J10625K29281K40929J44446M6163K0486r76p3252
$$ 19999135 20323374 20394777 20419129 20529754 20759035 20999964 21144410 21190573 21211059 21210083 21136831
8820B1136831k31754m56227o43445o32166l75503J3997L39802N23227O04151O55047
$$ 21136831 20905077 20448850 19805405 19173239 18797736 18811733 19151535 19674762 20278913 20933960
8810B0933960O51112N02937K07525j02414k22606j01501R4498J24781j06108n23057
$$ 20933960 21585072 22088009 22295534 22193120 21970514 21869013 21963511 22088292 21982184 21459127
8800B1459127r95453j343643j496440j448685j316939j170183r88408p41514m35182
$$ 21459127 20463674 19120031 17623591 16174906 14857967 13687784 12699376 11957862 11522680
8791A1522680r9752K31009N73751R51296J347449J731030K020191K120174K031276
$$ 11522680 11422928 11653937 12227688 13178984 14526433 16257463 18277654 20397828 22429104
8782B2429104J751164J282235O34867k22564j247801k259712k957311l153764
$$ 22429104 24180268 25462503 26097370 25874806 24627005 22367293 19409982 16256218
8774A6256218k835758k228943j594705j066529o13008k19136J39119M72151P65322
$$ 16256218 13420460 11191517 9596812 8530283 7917275 7698139 7837258 8309409 9074731
8765I074731J015156J234152J401844J466466J345681J017157N35048M3952l97276
$$ 9074731 10089887 11324039 12725883 14192349 15538030 16555187 17090235 17134187 16736911
8756A6736911p99978j211823j609217j834711j765712j440598j016460o20005
$$ 16736911 15936933 14725110 13115893 11281182 9515470 8074872 7058412 6438407
8748F438407k81355M4028L85018P29267J009961J178729J175619J016023P36248
$$ 6438407 6157052 6201080 6586098 7315365 8325326 9504055 10679674 11695697 12431945
8739A2431945L96979l5279n75056j127081j523450j635055j448860j129104q11691
$$ 12431945 12828924 12793645 12218589 11091508 9568058 7933003 6484143 5355039 4543348
8730D543348n61073l87886k57063j40303m1952P7407K05073L60427N25757O25106
$$ 4543348 3982275 3594389 3337326 3197023 3155071 3232478 3437551 3797978 4323735 4948841
8720D948841O54659N83086M39175K73884R7588j54554m79726p83502r33377q52644
$$ 4948841 5603500 6186586 6625761 6899645 6997233 6842679 6362953 5579451 4646074 3793430
8710C793430o63711m84472l45568k50671j83385j37640r7917p0541n5854l2928
$$ 3793430 3129719 2645247 2299679 2049008 1865623 1727983 1630066 1559525 1503671 1470743
8700A470743k3507k1520j2401j5265j7475k4356j1967o285j3246p594j4384l0493
$$ 1470743 1447236 1425716 1413315 1398050 1380575 1356219 1344252 1337967 1324721 1317127 1302743 1272250
8688A272250j5572k003N07k899R107J7822J7994K8479J3805J420j799p762n657
$$ 1272250 1256678 1254675 1255182 1252283 1261390 1279212 1297206 1325685 1339490 1340910 1339111 1331349 1325692
8675A325692j8589k1332q566K331J0536J1297M415J0379J2328Q758J0746P557
$$ 1325692 1307103 1285771 1277205 1279536 1290072 1301369 1305784 1316163 1328491 1337249 1347995 1355552
8663A355552m311M262J2089O921J2732K0025K2977K5756K0831R826J317k44o349
$$ 1355552 1351241 1355503 1367592 1374513 1387245 1407270 1430247 1456003 1476834 1486660 1487977 1487733 1481384
8650A481384p305k097j2391L0O52j021j664L993q136j0043q146j258k335p555
$$ 1481384 1474079 1471982 1459591 1459621 1460273 1459252 1457588 1461581 1453445 1443402 1435256 1433998 1431663 1424108
8636A424108q841l76K900Q779J7149K1314P563R541J1015J5193J4248J2876J5882
$$ 1424108 1415267 1414891 1417791 1426570 1443719 1465033 1472596 1482137 1493152 1508345 1522593 1535469 1551351
8623A551351R827J2098J9471J7555K6490J9616J2566J3487J1844J7920K7495K0242
$$ 1551351 1561178 1573276 1592747 1610302 1636792 1656408 1668974 1682461 1694305 1712225 1739720 1759962
8611A759962Q164L931M616R095J2807J4428K8149L1182M1034N5888O4516P1138
$$ 1759962 1768126 1772057 1776673 1785768 1798575 1813003 1841152 1872334 1913368 1969256 2033772 2104910
8599B104910P1163P5772P3206O2619M8807N1974O4786P7485N7485M8363N7959
$$ 2104910 2176073 2251845 2325051 2387670 2436477 2488451 2553237 2630722 2688207 2736570 2794529
8588B794529O5720P2262N3691J5251l897j0492j4970j3792l185J8876L1564L8197
$$ 2794529 2860249 2932511 2986202 3001453 2997556 2987064 2972094 2958302 2955117 2973993 3005557 3043754
8576C043754M2225M1366N2571P2389O7520P0367Q7593J07487J34941J61877J91618
$$ 3043754 3085979 3127345 3179916 3252305 3319825 3390192 3477785 3585272 3720213 3882090 4073708
8565D073708K20962K74593L30037L95386M91932O50141Q87794J196633J589228
$$ 4073708 4294670 4569263 4899300 5294686 5786618 6436759 7324553 8521186 10110414
8556A0110414K078127K663593L218862L632091L776043L635127L257558K699681
$$ 10110414 12188541 14852134 18070996 21703087 25479130 29114257 32371815 35071496
8548C5071496J904778Q32764m67623j683101k353167k618958k787416k811186
$$ 35071496 36976274 37809038 37341415 35658314 33305147 30686189 27898773 25087587
8540B5087587k583301k314790k063355j785504j513688j222731r07247o32447
$$ 25087587 22504286 20189496 18126141 16340637 14826949 13604218 12696971 12064524
8532A2064524l58539o5446K61520O32998J072094J583792K130325K617466K931836
$$ 12064524 11705985 11640539 11902059 12535057 13607151 15190943 17321268 19938734 22870570
8523B2870570L030326K956653K669722K153877J379527L81626o17064j358900
$$ 22870570 25900896 28857549 31527271 33681148 35060675 35442301 34825237 33466337
8515C3466337j776044k026078k282930k505161k460657k240180k016622j760447
$$ 33466337 31690293 29664215 27381285 24876124 22415467 20175287 18158665 16398218
8507A6398218j482324j263682j085311r07585p65137o45591n24849l88544k60293
$$ 16398218 14915894 13652212 12566901 11659316 10894179 10248588 9723739 9335195 9074902
8498I074902j53012k7623O9327J51554K30343K94344L97792N31294O79573Q52018
$$ 9074902 8921890 8894267 8963594 9115148 9345491 9639835 10037627 10568921 11248494 12100512
8488A2100512J051301J273537J531806J873529K315098K811513L230941L481134
$$ 12100512 13151813 14425350 15957156 17830685 20145783 22957296 26188237 29669371
8480B9669371L581889L657977L822012L984199L956793L608667L121272K866553
$$ 29669371 33251260 36909237 40731249 44715448 48672241 52280908 55402180 58268733
8472E8268733K943971K984147K522481J564483M83478n76298j673295k872280
$$ 58268733 61212704 64196851 66719332 68283815 68767293 68190995 66517700 63645420
8464F3645420m082778m917360n198303m924069m201407l311306k471693j646179
$$ 63645420 59562642 54645282 49446979 44522910 40321503 37010197 34538504 32892325
8456C2892325p87145M4977P22002J254390J667821J977853K253529K601983K951532
$$ 32892325 32105180 32150157 32872159 34126549 35794370 37772223 40025752 42627735 45579267
8447D5579267L107000K966543K745717K824946L078101L012253K315058J079814
$$ 45579267 48686267 51652810 54398527 57223473 60301574 63313827 65628885 66708699
8439F6708699k65669j474778k675635l894799n029785n808359n949234n468196
$$ 66708699 66443030 64968252 62292617 58397818 53368033 47559674 41610440 36142244
8431C6142244m786469m183764l511633k801163k254582j832133j485909j210700
$$ 36142244 31355775 27172011 23660378 20859215 18604633 16772500 15286591 14075891
8423A4075891r81174p70039n81978l88371j97982j3331J85736M13076O94755J008688
$$ 14075891 13094717 12324678 11742700 11354329 11156347 11143016 11328752 11741828 12436583 13445271
8413A3445271J329875J578214J724457J793246J842115J896069J997626K122642
$$ 13445271 14775146 16353360 18077817 19871063 21713178 23609247 25606873 27729515
8405B7729515K140175K059431K001121J975695K019249K097575K062835J636959
$$ 27729515 29869690 31929121 33930242 35905937 37925186 40022761 42085596 43722555
8397D3722555R68527O59045R05578J326074J436212J046830L37817l50673r43377
$$ 43722555 44691082 45350127 46255705 47581779 49017991 50064821 50402638 50051965 49108588
8388D9108588j652119k532854l256969l562780l317075k603633j774015j036334
$$ 49108588 47456469 44923615 41666646 38103866 34786791 32183158 30409143 29372809
8380B9372809l73266K45297Q34061J308968J548044J628278J674268J749818J766352
$$ 29372809 28999543 29244840 30078901 31387869 32935913 34564191 36238459 37988277 39754629
8371C9754629J624324J307078Q94857O79106P81997R22570Q32912N25059J35126
$$ 39754629 41378953 42686031 43580888 44259994 45041991 45964561 46797473 47322532 47457658
8362D7457658l67526j101214k054679l113054l979020m412909m458013m224329
$$ 47457658 47090132 45988918 43934239 40821185 36842165 32429256 27971243 23746914
8354B3746914l712580l015691k382062j889009j491721j131735q22699o06165
$$ 23746914 20034334 17018643 14636581 12747572 11255851 10124116 9301417 8695252
8346H695252m42065l20361k30486j82901j20209l6029L2129O6986R3597J20418
$$ 8695252 8253187 7932826 7702340 7519439 7399230 7363201 7395330 7462316 7555913 7676331
8336G676331J63220K03617K32580K58369L21243M29520N63911P05194Q15154Q72278
$$ 7676331 7839551 8043168 8275748 8534117 8855360 9284880 9848791 10553985 11369139 12241417
8326A2241417R28173R57435R43329Q51314P20391N38275K62540p0808k82703l42064
$$ 12241417 13169590 14127025 15070354 15921668 16642059 17180334 17442874 17372066 17089363 16747299
8316A6747299m74403p62100j001306j122952j163360j059394r06579p71631o10402
$$ 16747299 16272896 15510796 14509490 13386538 12223178 11163784 10257205 9485574 8875172
8307H875172m36139k72589j12875M7869K38868M36002O03628P23187Q57345J020580
$$ 8875172 8439033 8166444 8053569 8101438 8340306 8776308 9379936 10103123 10960468 11981048
8297A1981048J126033J155517J093153R65260Q15102O04884K40349k85539p76867
$$ 11981048 13107081 14262598 15355751 16321011 17136113 17740997 17981346 17695807 16918940
8288A6918940r94568j137456j350101j460244j468346j339151j048361p87568
$$ 16918940 15924372 14786916 13436815 11976571 10508225 9169074 8120713 7333145
8280G333145o20164m93974l86900k87357k08303j39533q9500p1647p4769o8447
$$ 7333145 6712981 6219007 5832107 5544750 5336447 5196914 5107414 5035767 4960998 4892551
8270D892551q1969j02563j25036j29991j13914q0526p3263o3481n0895m2541k3628
$$ 4892551 4810582 4708019 4582983 4452992 4339078 4258552 4185289 4121808 4070913 4028372 4004744
8259D004744l730qJ8263L7921M3230L9407M7679M2813M2744M0333M7901N7839
$$ 4004744 4001014 4001006 4019269 4057190 4100420 4139827 4187506 4230319 4273063 4313396 4361297 4419136
8247D419136N4553N7172N2860O1883O0375N5235N4674O4569O0677N0949O7009
$$ 4419136 4473689 4530861 4583721 4645604 4705979 4761214 4815888 4880457 4941134 4992083 5059092
8236E059092P1275P9142Q0168R6113R5760J10057J03941J06804J14251J26785
$$ 5059092 5130367 5209509 5289677 5385790 5481550 5591607 5695548 5802352 5916603 6043388
8226F043388J38336J41453J50169J52912J54506J68025J76869J82823J85608J81494
$$ 6043388 6181724 6323177 6473346 6626258 6780764 6948789 7125658 7308481 7494089 7675583
8216G675583K03559K10609K07864K18681K38260K49387K72306K77534K89801L02845
$$ 7675583 7879142 8089751 8297615 8516296 8754556 9003943 9276249 9553783 9843584 10146429
8206A0146429L24210L42906L58018L75633M01715M27019M36515M59042M84787
$$ 10146429 10470639 10813545 11171563 11547196 11948911 12375930 12812445 13271487 13756274
8197A3756274N13847N41170N76608O05320O44419O84891P32663P74868Q22062
$$ 13756274 14270121 14811291 15387899 15993219 16637638 17322529 18055192 18830060 19652122
8188A9652122Q84291R47374J010423J072073J151113J249780J339056J452088
$$ 19652122 20536413 21483787 22494210 23566283 24717396 25967176 27306232 28758320
8180B8758320J578421J703085J835263K000731K185775K374366K583950K814018
$$ 28758320 30336741 32039826 33875089 35875820 38061595 40435961 43019911 45833929
8172D5833929L070015L351748L671830M010423M375655M770593N185420N619417
$$ 45833929 48903944 52255692 55927522 59937945 64313600 69084193 74269613 79889030
8164G9889030O065239O499535O918130P290414P599283P786516P856958P772578
$$ 79889030 85954269 92453804 99371934 106662348 114261631 122048147 129905105 137677683
8156A37677683P491984P010983O318724N402245M264490K943160J489766l8250
$$ 137677683 145169667 152180650 158499374 163901619 168166109 171109269 172599035 172560785
8148A72560785j593745l092641m443351n600565o513969p189710p635995p847094
$$ 172560785 170967040 167874399 163431048 157830483 151316514 144126804 136490809 128643715
8140A28643715p882485p780069p552805p232509o856511o445459o028640n589921
$$ 128643715 120761230 112981161 105428356 98195847 91339336 84893877 78865237 73275316
8132G3275316n167154m766107m376754m017151l683275l374994l091432k825923
$$ 73275316 68108162 63342055 58965301 54948150 51264875 47889881 44798449 41972526
8124D1972526k583126k381002k196244k021214j866934j742688j611190j495501
$$ 41972526 39389400 37008398 34812154 32790940 30924006 29181318 27570128 26074627
8116B6074627j402038j303510j204813j123385j050602r74455r09879q48800p94042
$$ 26074627 24672589 23369079 22164266 21040881 19990279 19015824 18105945 17257145 16463103
8107A6463103p47028o95938o51490o12702n69835n35794n21662m90579m57484
$$ 16463103 15716075 15020137 14368647 13755945 13186110 12650316 12128654 11638075 11180591
8098A1180591m34037m13598l88528l63238l49472l26996l09275k96783k83748
$$ 11180591 10746554 10332956 9944428 9581190 9231718 8904722 8595447 8298664 8014916
8089H014916k60670k54277k43677k34490k19569k08696j97497j89378j75275j73518
$$ 8014916 7754246 7499969 7256292 7021802 6802233 6593537 6396040 6206662 6031387 5857869
8079E857869j52966j38209j46162j39636j45671j50854j55913j46733j39780j32375
$$ 5857869 5704903 5566694 5420532 5280896 5135225 4984371 4828458 4681725 4541945 4409570
8069D409570j31519j35447j33255j27574j24992j20212j19741j24818j18079j04969
$$ 4409570 4278051 4142604 4009349 3881775 3756783 3636571 3516830 3392012 3273933 3168964
8059C168964r0909q6664p6302o7960o3732n5531m8114l9532l5100m6262m5540
$$ 3168964 3078055 2991391 2915089 2847129 2783397 2727866 2679752 2640220 2605120 2558858 2513318
8048B513318m7050m8538m6792n2963m7538n1514n0557o5241p2006p0494n5611
$$ 2513318 2466268 2417730 2370938 2317975 2270437 2218923 2168366 2103125 2031119 1960625 1905014
8037A905014m9581o3332n7876o2953n7529n4839n0447m9480m4192l8662l0677
$$ 1905014 1855433 1792101 1734225 1671272 1613743 1558904 1508457 1458977 1414785 1376123 1345446
8026A345446m0496m0200l6423l6078l6522l4636k9210k4117j8850k2356k8341
$$ 1345446 1304950 1264750 1228327 1192249 1155727 1121091 1091881 1067764 1048914 1026558 998217
8015I98217j7584j3939k7783l0003k6880k0466j8153j0696r213O655O518k038
$$ 998217 980633 966694 938911 908908 882028 861562 843409 832713 823500 830155 836673 834635
8003H34635j134k803l926j1947k3821j7397j4241j9904j2638j8941j9935k0895
$$ 834635 833501 830698 826772 814825 791004 773607 759366 739462 726824 707883 687948 667053
7991F67053k6361l1790m3268m1115m1619m0351l8507k9849l3303k4112q137o035
$$ 667053 640692 608902 565634 524519 482900 442549 404042 374193 340890 316778 308641 302606
7979C02606L72J1302L367l57J1625J1991N332M902L28P112Q646j312m548M820
$$ 302606 302978 314280 317647 317290 328915 340906 346238 351140 351468 358580 367226 365914 361366 366186
7965C66186J1498n108p125j2554k0381j9256j9891k7006l3679l0161j8921r389
$$ 366186 377684 372576 365451 352897 332516 313260 293369 266363 232684 202523 183602 174213
7953A74213o023j3151k1603j0436j2943r196j561n268o047j713o817N828k754
$$ 174213 168190 155039 133436 123000 110057 100861 99300 94032 87985 86272 79455 85283 82529
7940H2529j1085k2979k104L046j958k092M03P47l163J444N436N172p181k590M02
$$ 82529 71444 48465 46361 49407 47449 45357 45760 46507 43344 44788 50224 55396 48215 45625 46027
7925D6027P620J1117N747O693J0707J1223L273n082j658j2692j5077j4536j5984
$$ 46027 53647 64764 70511 77204 87911 99134 102407 97325 95667 82975 67898 53362 37378
7912C7378j8911j8743j0855n975l462p529L094Q903K492n641Q801p165n747O688
$$ 37378 18467 -276 -11131 -17106 -20568 -28097 -25003 -16100 -13608 -19249 -10448 -17613 -23360 -16672
7898a6672j014j2262L960J9096J4807J2711Q808Q592O884J847o869k591p197j9081
$$ -16672 -17686 -29948 -25988 -6892 7915 20626 29434 38026 44910 46757 39888 37297 30100 11019
7884A1019k1374r650k514j0985j2678r288j6960j8592m530L145O55m063j591j1652
$$ 11019 -10355 -20005 -22519 -33504 -46182 -55470 -72430 -91022 -95552 -92407 -91752 -95815 -97406 -109058
7870a09058r329m13m668N885K098M914q048n699j043M154m176j660o803n351l074
$$ -109058 -118387 -118800 -123468 -117583 -115485 -110571 -118619 -124318 -125361 -121207 -125383 -127043 -133846 -139197 -142271
7855a42271P944O514m703r29P682N045j33j675m271j2156R40r69n907n93M401
$$ -142271 -134327 -127813 -132516 -133445 -125763 -120718 -120851 -122526 -126797 -138953 -138013 -138982 -144889 -145482 -141081
7840a41081L52j015k120l480l463j573m769j47j544k706J671L213n526m371k830
$$ -141081 -140729 -141744 -143864 -147344 -150807 -152380 -157149 -157296 -158840 -161546 -159875 -156662 -162188 -166559 -169389
7825a69389j0088n516p624p665K954J3513Q003j853l371n706K590l057Q529M691
$$ -169389 -179477 -184993 -192617 -200282 -197328 -183815 -175812 -177665 -181036 -186742 -184152 -187209 -178680 -173989
7811a73989m68r610j4690n85K611L607O824N974R176m505j0911j0654k519J1715
$$ -173989 -174457 -184067 -198757 -199342 -196731 -193124 -186300 -180326 -171150 -175655 -186566 -197220 -199739 -188024
7797a88024P873N263q312m50l216j3178k384K582K161m787J75N708k687N783j602
$$ -188024 -180151 -174888 -183200 -183650 -186866 -200044 -202428 -199846 -197685 -202472 -202297 -196589 -199276 -193493 -195095
7782a95095N455L116j936j047o74k514o810n871n644J87P871K613j560O80m349
$$ -195095 -189640 -186524 -188460 -189507 -190181 -192695 -199505 -205376 -211020 -210833 -202962 -200349 -201909 -201229 -205578
7767b05578q128J593Q029K517K379n598K258m692n87Q241J0141k547j482k149
$$ -205578 -213706 -212113 -204084 -201567 -199188 -204786 -202528 -207220 -207807 -199566 -189425 -191972 -193454 -195603
7753a95603k594j057n676J077j677o505O1M694J620N791M46o779q225o679L129
$$ -195603 -198197 -199254 -204930 -203853 -205530 -212035 -211974 -207280 -205660 -199869 -199423 -206202 -214427 -221106 -217977
7738b17977J0748k611l407l41P713Q057M280q673N64j421j630N09L31O46j615
$$ -217977 -207229 -209840 -213247 -213588 -205875 -197818 -193538 -202211 -201647 -203068 -204698 -204189 -203858 -203212 -204827
7723b04827J710L295l743L081k113j963k327k489m368l462m659K221k39k371p162
$$ -204827 -203117 -199822 -203565 -200484 -202597 -204560 -206887 -209376 -213744 -217206 -221865 -219644 -219883 -222254 -229416
7708b29416l674k138k868L649O781l72n636m210o294l840j640K411J473L509m142
$$ -229416 -233090 -235228 -238096 -234447 -227666 -228038 -233674 -237884 -244178 -248018 -249658 -247247 -245774 -242265 -246407
7693b46407J887q75O262R966J686M896q67j980l761o137q60Q021J729Q785R25
$$ -246407 -244520 -245395 -239133 -229167 -227481 -222585 -223452 -225432 -229193 -235330 -236190 -228169 -226440 -217655 -216730
7678b16730n952q60n463M026N337O372L920l714r820M202J4110L635q83j0215
$$ -216730 -222682 -223542 -229005 -224979 -219642 -213270 -209350 -213064 -222884 -218682 -204572 -200937 -201820 -212035
7664b12035o644K838n02j313j810K364j253L65J3316J054l636k055J31N256j251
$$ -212035 -218679 -215841 -216343 -217656 -219466 -217102 -218355 -217990 -204674 -203620 -207256 -209311 -209180 -203924 -205175
7649b05175l342O059o003n822m485L880K408q813J429J615l71O301P418o8n406
$$ -205175 -208517 -202458 -208461 -214283 -218768 -214888 -212480 -221293 -219864 -218249 -218620 -212319 -204901 -204969 -210375
7634b10375l373m718K348R62q09N448P173O724P575M223K003k635k746p640o667
$$ -210375 -213748 -218466 -216118 -215156 -215965 -210517 -203344 -196620 -189045 -184822 -182819 -185454 -188200 -195840 -202507
7619b02507k288N163N64L962P777N855l850p798K476N36m383r21p478l252O343
$$ -202507 -204795 -199632 -199068 -195106 -187329 -181474 -185324 -193122 -190646 -190110 -194493 -195414 -202892 -206144 -199801
7604a99801J544k65m165j790M262L202r284l935R932K917m736q11q106n32N269
$$ -199801 -198257 -198522 -202687 -204477 -200215 -197013 -206297 -210232 -200300 -197383 -202119 -202930 -211036 -211568 -206299
7589b06299M15K003J848J999N364j809k149k227P597n749l62J279o560k833k260
$$ -206299 -205884 -203881 -202033 -200034 -194670 -196479 -198628 -200855 -193258 -199007 -199369 -198090 -204650 -207483 -209743
7574b09743K327N865K746K985O52o20m533j772r06J0415J0197K767k606r491k409
$$ -209743 -207416 -201551 -198805 -195820 -195168 -195788 -200321 -202093 -202999 -192584 -182387 -179620 -182226 -191717 -194126
7559a94126J82n710k166K823m533q146K030M018N598R084J508n013p052j70M005
$$ -194126 -193944 -199654 -201820 -198997 -203530 -211676 -209646 -205628 -200030 -190946 -189438 -194451 -201503 -201673 -197668
7544a97668R685O874Q622L477n681j335k298l693p561l124n82m316j210N044K006
$$ -197668 -187983 -181109 -172487 -169010 -174691 -176026 -178324 -182017 -189578 -192702 -193284 -197600 -198810 -193766 -191760
7529a91760R879L197k061j725j325n187n233o38K699K078K453J0030j214r001
$$ -191760 -181881 -178684 -180745 -182470 -183795 -188982 -194215 -194853 -192154 -190076 -187623 -177593 -178807 -187808
7515a87808K823J783o080n54o658M808O288j985m934L533O710N61j678J003j9068
$$ -187808 -184985 -183202 -189282 -189836 -196494 -191686 -185398 -187383 -192317 -188784 -182074 -181513 -183191 -182188 -201256
7500b01256j510m2J477j129J972J3789m535q929r40K207K992j162l5R98Q023Q285
$$ -201256 -202766 -202808 -201331 -202460 -200488 -186699 -191234 -200163 -201103 -198896 -195904 -197066 -197101 -196103 -188080 -179795
7484a79795n276j89l006L347N73l756k046k595K957P914l050r079K339N749O825
$$ -179795 -185071 -185260 -188266 -184919 -184346 -188102 -190148 -192743 -189786 -181872 -184922 -194001 -191662 -185913 -179088
7469a79088j627j312J128L609N114L675L271l400n297L272o337l984J586L087
$$ -179088 -180715 -182027 -180899 -177290 -172176 -168501 -165230 -168630 -173927 -170655 -176992 -180976 -179390 -176303
7455a76303N493R188n55q307o205k273j145Q12k51P214l675L3J0791M224k080
$$ -176303 -170810 -161622 -162177 -170484 -176689 -178962 -180107 -179295 -179546 -172332 -176007 -175974 -165183 -160959 -163039
7440a63039n580j256R203k70p632J176k204J877Q63J843m972j878m039M250K246
$$ -163039 -168619 -169875 -160672 -160942 -168574 -167398 -169602 -167725 -166862 -165019 -169991 -171869 -175908 -171658 -169412
7425a69412n384J460N28l261j585J169n272p979K969Q810M084M703Q087M914k052
$$ -169412 -174796 -173336 -172808 -176069 -177654 -176485 -181757 -189736 -186767 -177957 -173873 -169170 -161083 -156169 -158221
7410a58221o973j405Q074K920k211k924n749K001J011N876k839j0907Q4N885p902
$$ -158221 -165194 -166599 -158525 -155605 -157816 -160740 -166489 -164488 -163477 -157601 -160440 -171347 -171263 -165378 -173280
7395a73280J016L67P841J0291m007J152J323o161N291K695j1044K085L64k003
$$ -173280 -172264 -171897 -164056 -153765 -157772 -156620 -155297 -161458 -156167 -153472 -164516 -162431 -162067 -164070
7381a64070j451M107q83p896n35N110L572L965j0768n586O231M627Q193K593o56
$$ -164070 -165521 -161414 -162297 -170193 -170728 -165618 -162046 -158081 -168849 -174435 -168204 -163577 -155384 -152791 -153447
7366a53447n901k753P34N565L937k442l74K219K251j938K910K897k547p550m222
$$ -153447 -159348 -162101 -161367 -155802 -151865 -154307 -154681 -152462 -150211 -152149 -149239 -146342 -148889 -156439 -160661
7351a60661j618Q43J983P616J737J24L417n359J323J639p174k041P807J679p231
$$ -160661 -162279 -161436 -159453 -151837 -150100 -149976 -146559 -151918 -150595 -148956 -156130 -158171 -150364 -148685 -155916
7336a55916J071K388m543m801N823M060K592J384K719K091o1n64j0956k798k316
$$ -155916 -154845 -152457 -157000 -161801 -155978 -151918 -149326 -147942 -145223 -143132 -143193 -143757 -154713 -157511 -159827
7321a59827Q646N193j1534l881Q288K145j798L422P63q80n11K293K712L160l688
$$ -159827 -151181 -145988 -157522 -161403 -153115 -150970 -152768 -149346 -148583 -149463 -149974 -147681 -144969 -141809 -145497
7306a45497j019k90n60K73L435M548J203j72l290j965n4j704m014n528k191J480
$$ -145497 -146516 -146806 -147366 -147093 -143658 -139110 -137907 -138079 -141369 -143334 -143388 -145092 -149106 -154634 -156825 -155345
7290a55345M218J0287L358j353o028j1330N737L195K913r11l812J878n034m219
$$ -155345 -151127 -140840 -137482 -138835 -144863 -156193 -150456 -147261 -144348 -145259 -149071 -147193 -152227 -156446
7276a56446l706N749J834K716n920m562M009l654J830M098K813K025j02O21L476
$$ -156446 -160152 -154403 -152569 -149853 -155773 -160335 -156326 -159980 -158150 -154052 -151239 -149214 -149316 -148695 -145219
7261a45219n615J04J1960m14k580j0755p549J299Q283k615J307O819N073K807
$$ -145219 -150834 -150730 -138770 -139184 -141764 -152519 -160068 -158769 -150486 -153101 -151794 -144975 -139902 -137095
7247a37095P7j231P69K725r422N337M826k378q081R28Q115n021J80K053M261Q047
$$ -137095 -137018 -138249 -137480 -134755 -144177 -138840 -134014 -136392 -144473 -143545 -135430 -140451 -140271 -138218 -133957 -125910
7231a25910j882k900L25K173l675l748J898P050O045o738l129m318K859R008m604
$$ -125910 -127792 -130692 -130367 -128194 -131869 -135617 -133719 -126669 -120624 -127362 -130491 -134809 -131950 -122942 -127546
7216a27546q233p305M523M719K628K102j0901o249n76L190R17N513J849m336O414
$$ -127546 -135779 -143084 -138561 -133842 -131214 -129112 -140013 -146262 -146838 -143648 -142731 -137218 -135369 -139705 -133291
7201a33291O260K232L284p74m640K069R63n668n906j219L026N238l681P87k736
$$ -133291 -127031 -124799 -121515 -122289 -126929 -124860 -123897 -129565 -135471 -136690 -133664 -128426 -132107 -131320 -134056
7186a34056p778J139R62n273n674L380M771M65O115K87Q87j38J1051Q19j020o492
$$ -134056 -141834 -140695 -139733 -145006 -150680 -147300 -142529 -142064 -135949 -135662 -134775 -134913 -123862 -123043 -124063 -130555
7170a30555j946K175N332o75k794n073L23J066L342J623m884N854M447o351l903
$$ -130555 -132501 -130326 -124994 -125669 -128463 -133536 -133213 -132147 -128805 -127182 -132066 -126212 -121765 -128116 -132019
7155a32019P455O138k205M439N916k801j744q271j928k523N97L346j307L754K82
$$ -132019 -124564 -118426 -120631 -116192 -110276 -113077 -114821 -123092 -125020 -127543 -126946 -123600 -124907 -121153 -120871
7140a20871r90j0050m851m001N526P818O29r19M305K67o45K961m020J668k436
$$ -120871 -121861 -131911 -136762 -140763 -135237 -127419 -126790 -127709 -123404 -123137 -123782 -120821 -124841 -123173 -125609
7125a25609J642M714O35l637J731M607k305q238m408m373l646q644J146O469K255
$$ -125609 -123967 -119253 -118618 -122255 -120524 -115917 -118222 -126460 -130868 -135241 -138887 -147531 -146385 -139916 -137661
7110a37661o77J079j719r577k584P832O935O496J4545q12j933n521J15O14m316
$$ -137661 -138338 -137259 -138978 -148555 -151139 -143307 -136372 -129876 -115331 -116143 -118076 -123597 -123482 -122868 -127184
7095a27184p157R332J3465j193O280k28L335P43m970m748r49p812m45M462n026
$$ -127184 -134341 -125009 -111544 -112737 -106457 -106685 -103350 -102607 -107577 -112325 -113274 -121086 -121531 -117069 -122095
7080a22095j310r17j479K204p249n506K450M831k367k81K51j88k607J0781M238
$$ -122095 -123405 -124322 -125801 -123597 -130846 -136352 -133902 -129071 -131438 -131719 -131468 -131656 -134263 -123482 -119244
7065a19244J87r64n70M110l246p77L090n096k865Q84L309O217J169l644o596N12
$$ -119244 -119057 -120021 -120591 -116481 -119727 -120504 -117414 -122510 -125375 -124491 -121182 -114965 -113796 -117440 -124036 -123524
7049a23524L880M073J1262L511N8n528j1953j813j289m158K161J3063L837r687
$$ -123524 -119644 -115571 -104309 -100798 -100740 -106268 -118221 -120034 -121323 -125481 -123320 -110257 -106420 -116107
7035a16107J248Q554L101p660m679O856Q00P18M002j0506l525Q617J912l45l062
$$ -116107 -114859 -106305 -103204 -110864 -115543 -108687 -107887 -107169 -103167 -113673 -117198 -108581 -106669 -107014 -110076
7020a10076M12O531L452m040j0011J190J949O217k360r995m786K445n093j292
$$ -110076 -109664 -103133 -99681 -103721 -113732 -112542 -110593 -104376 -106736 -116731 -121517 -119072 -124165 -125457
7006a25457M495J003j814Q28P852l553j887J279K668P50L22Q005M255O205J552
$$ -125457 -120962 -119959 -121773 -120945 -113093 -116646 -118533 -117254 -114586 -113836 -113514 -105509 -101254 -95049 -93497
6991i3497k317k818o748n379o861K918L745k078O569j424k293K173J3042L291
$$ -93497 -95814 -98632 -105380 -110759 -117620 -114702 -110957 -113035 -106466 -107890 -110183 -108010 -94968 -91677
6977i1677M96k614l969L258o97o447n610j685M574N76K100j691J460P44r549m173
$$ -91677 -91181 -93795 -97764 -94506 -95203 -101650 -107260 -108945 -104371 -103795 -101695 -103386 -101926 -101182 -110731 -114904
6961a14904K573J442K311q870o516l327M913O862L501O917M604q51n428K709K978
$$ -114904 -112331 -110889 -108578 -117448 -123964 -127291 -122378 -115516 -112015 -105098 -100494 -101345 -106773 -104064 -101086
6946a01086j122N625J513k656q303n507j18M652N668L277o26P536K659L92q938
$$ -101086 -102208 -96583 -95070 -97726 -106029 -111536 -111654 -107002 -101334 -98057 -98683 -91147 -88488 -88096 -97034
6931i7034q643k357J979k966k141N992K247K73R501L711M115k093q328r67l112
$$ -97034 -105677 -108034 -106055 -109021 -111162 -105170 -102923 -102650 -93149 -89438 -85323 -87416 -95744 -96711 -99823
6916i9823k454r39L699P228K152N84k874K75m003J30O790N593O611l202J659m452
$$ -99823 -102277 -103216 -99517 -92289 -90137 -89553 -92427 -92152 -96155 -96025 -89235 -83642 -77031 -80233 -78574 -83026
6900h3026n070m7K283j975K082l770q526m003L772R055O107J592M179L11j1871
$$ -83026 -88096 -88143 -85860 -87835 -85753 -89523 -98049 -102052 -98280 -89225 -83118 -81526 -77347 -77036 -88907
6885h8907k46l40j580k063k261K009L713N028L724k576M531j403r035k939J170
$$ -88907 -89153 -89493 -91073 -93136 -95397 -93388 -89675 -84647 -80923 -83499 -78968 -80371 -89406 -92345 -91175
6870i1175L526K060J0858q0K69k035P558Q084K192j354n029o979j1347J711J5044
$$ -91175 -87649 -85589 -74731 -74811 -74542 -76577 -69019 -60935 -58743 -60097 -65126 -72105 -83452 -81741 -66697
6855f6697k55k112o922m236o435r715M17M581N480k971j1206j767K673L211L556
$$ -66697 -66952 -69064 -75986 -80222 -86657 -96372 -95955 -91374 -85894 -88865 -100071 -101838 -99165 -95954 -92398
6840i2398M887L723J970o129K854K962p654o932M701K784l05L615J984m013P8
$$ -92398 -87511 -83788 -81818 -87947 -85093 -82131 -89785 -96717 -92016 -89232 -89537 -85922 -83938 -87951 -87873
6825h7873l781p166l55O174O406l140L531n475l321m515j2452j341K436O133Q165
$$ -87873 -91654 -98820 -99175 -93001 -86595 -89735 -86204 -91679 -95000 -99515 -111967 -113308 -110872 -104739 -96574
6810i6574Q720R523K128n848l012K718j252k725k717R57O524L635J227j190n897
$$ -96574 -87854 -78331 -76203 -82051 -85063 -82345 -83597 -86322 -89039 -88082 -81558 -77923 -76696 -77886 -83783
6795h3783k133M453M244N34M233l438k019p188L251L40j628l040j0936K516N644
$$ -83783 -85916 -81463 -77219 -76685 -72452 -75890 -77909 -85097 -81846 -81506 -83134 -86174 -97110 -94594 -88950
6780h8950k949M4J629N296O277j702J248p24p467n37J522p985j0652J450L606
$$ -88950 -91899 -91855 -90226 -84930 -78653 -80355 -79107 -79831 -87298 -87835 -86313 -94298 -104950 -103500 -99894
6765i9894L25N060O571K257N129N553j054l329o176j752P072l519m950O116k073
$$ -99894 -99569 -94509 -87938 -85681 -80552 -74999 -76053 -79382 -85558 -87310 -80238 -83757 -88707 -82591 -84664
6750h4664o573N33o474k287K22N127Q634N983K510N474r81l659r88j50l160K556
$$ -84664 -91237 -90704 -97178 -99465 -99243 -94116 -85482 -79499 -76989 -71515 -72496 -76155 -77143 -77293 -80453 -77897
6734g7897p058J73N242r76o064r27K666O683J876k524k151J538J308J190o495
$$ -77897 -84955 -84782 -79540 -80516 -86580 -87507 -84841 -78158 -76282 -78806 -80957 -79419 -78111 -76921 -83416
6719h3416J915J256j618L993j066j814L337o471l197k871j511K231K524p374P50
$$ -83416 -81501 -80245 -81863 -77870 -78936 -80750 -77413 -83884 -87081 -89952 -91463 -89232 -86708 -94082 -93332
6704i3332O304M791j72M089Q383J041p903k122J916K839J0429k030q843j237j755
$$ -93332 -87028 -82237 -82409 -78320 -69937 -68896 -76799 -78921 -77005 -74166 -63737 -65767 -74610 -75847 -77602
6689g7602Q55J511M47M768l043p156m841J5256K394J068Q99n159k605o770r930
$$ -77602 -76747 -75236 -74789 -70021 -73064 -80220 -85061 -69805 -67411 -66343 -65444 -70603 -73208 -79978 -89908
6674h9908o620m088R136N878L930n667l822L157K270M237P023L591P58m068K902
$$ -89908 -96528 -100616 -91480 -85602 -81672 -87339 -91161 -88004 -85734 -81497 -74474 -70883 -70125 -74193 -71291
6659g1291o490J819l451k01O050m288p32m190K266M002L146j929l245O745L685
$$ -71291 -77781 -75962 -79413 -79614 -73564 -77852 -78584 -82774 -80508 -76506 -73360 -75289 -78534 -71789 -68104
6644f8104L322m157k126L43J732M406P539J410m32k0L452p206o622N225Q445N591
$$ -68104 -64782 -68939 -71065 -70722 -68990 -64584 -57045 -55635 -56067 -56087 -52635 -59841 -66463 -61238 -52793 -47202
6628d7202o715j3409J202O809K26j22p150o756N856N832j89r33n311J816l13M24
$$ -47202 -53917 -67326 -66124 -59315 -59089 -59211 -66361 -73117 -67261 -61429 -61618 -62551 -67862 -66046 -66359 -65935
6612f5935O528P985L450o475q993o326n97j253l198m000K494M744J2J573O70N304
$$ -65935 -59407 -51422 -47972 -54447 -63440 -69766 -70363 -71616 -74814 -78814 -76320 -71576 -71564 -69991 -69321 -64017
6596f4017k352k797k104j7L916J182j750r426O263K752m873m3l460l075J709N599
$$ -64017 -66369 -69166 -71270 -71287 -67371 -66189 -67939 -77365 -71102 -68350 -73223 -73266 -76726 -79801 -78092 -72493
6580g2493J1914k169m635N782L347K089o211j2626p171j830P475O14l770j643
$$ -72493 -60579 -62748 -67383 -61601 -58254 -56165 -62376 -75002 -82173 -84003 -76528 -75914 -79684 -81327
6566h1327j245r392q05P505n1J0623P066n345m340L077Q06O328L619M5l136o834
$$ -81327 -82572 -91964 -92769 -85264 -85315 -74692 -67626 -72971 -77311 -74234 -73428 -67100 -63481 -63436 -66572 -73406
6550g3406m560k947J843M883p99j020J596K1L514k94l421K643J828p543o841N185
$$ -73406 -77966 -80913 -79070 -74187 -74986 -76006 -74410 -74389 -70875 -71169 -74590 -71947 -70119 -77662 -84503 -79318
6534g9318M838J379O153N377j835o529m404M670Q775r87q640m285N006O631M852
$$ -79318 -74480 -73101 -66948 -61571 -63406 -69935 -74339 -69669 -60894 -61881 -70521 -74806 -69800 -63169 -58317
6519e8317p733p267M453L274L246M995j512j3231k178J133p09R329O457M859q393
$$ -58317 -66050 -73317 -68864 -65590 -62344 -57349 -58861 -72092 -74270 -73137 -73846 -64517 -58060 -53201 -61594
6504f1594m055J737J516L3J769O201o090P656J973r277l01J916p50N023M303m260
$$ -61594 -65649 -63912 -62396 -62363 -60594 -54393 -60483 -52827 -50854 -60131 -60432 -58516 -59266 -54243 -49940 -54200
6488e4200q215L892Q872q353q420K464L524j1976l515j923J5377R520K511N84
$$ -54200 -62415 -58523 -49651 -58004 -66424 -63960 -60436 -72412 -75927 -77850 -62473 -52953 -50442 -49858
6474d9858o964p419j925L894M434k465Q17N841q63m765n898O367R55L40J04l527
$$ -49858 -56822 -64241 -66166 -62272 -57838 -60303 -59486 -53645 -54508 -59273 -65171 -58804 -57849 -57509 -57405 -60932
6458f0932L371R543m926j0083K11M405p311j0826L88J0140J094q557J581P140
$$ -60932 -57561 -48018 -52944 -63027 -62816 -58411 -65722 -76548 -76160 -66020 -64926 -73483 -71902 -64762
6444f4762N572K360K198k308m366k661n904K737O34J626j1051j531N981N688L565
$$ -64762 -59190 -56830 -54632 -56940 -61306 -63967 -69871 -67134 -66500 -64874 -75925 -77456 -71475 -65787 -62222
6429f2222j28J773O417j36p02J790J894J419o735p750o864j898M883m297o180
$$ -62222 -62350 -60577 -54160 -54296 -54998 -53208 -51314 -49895 -56630 -64380 -71244 -73142 -68259 -72556 -78736
6414g8736M013K097m232R877P440R06n466J777K364k529j849M46j591k159J210
$$ -78736 -74723 -72626 -76858 -66981 -59541 -58635 -64101 -62324 -59960 -62489 -64338 -63892 -65483 -67642 -66432
6399f6432M086j793L993L677k362M002J843J342l0r52l575K432L509k125l377
$$ -66432 -62346 -64139 -60146 -56469 -58831 -54829 -52986 -51644 -51674 -52626 -56201 -53769 -50260 -52385 -55762
6384e5762J214R30l39q55j097P131J1452m487p119k922o461o484n101J6Q282L685
$$ -55762 -54548 -53618 -53957 -54812 -55909 -48778 -37326 -41813 -48932 -51854 -58315 -64799 -69900 -69884 -61602 -57917
6368e7917P25m511l039N77J198n717N545J0055q82J759o032J276N599M001k057
$$ -57917 -57192 -61703 -64742 -64165 -62967 -68684 -63139 -53084 -53966 -52207 -58239 -56963 -51364 -47363 -49420
6353d9420q57P981l868k700k097q525k12Q288O920J152L496K707p072j665L907
$$ -49420 -50277 -42296 -46164 -48864 -50961 -59486 -59698 -51410 -44490 -43338 -39842 -37135 -44207 -45872 -41965
6338d1965j633k383j872k031L970K103o982K995K187n183r195k239P62K710M572
$$ -41965 -43598 -45981 -47853 -49884 -45914 -43811 -50793 -47798 -45611 -50794 -59989 -62228 -61466 -58756 -54184
6323e4184L497P7q9j744m749k067O805L783M870N307q250p643l338l682P753N829
$$ -54184 -50687 -50610 -50699 -52443 -57192 -59259 -52454 -48671 -43801 -38494 -46744 -54387 -57725 -61407 -53654 -47825
6307d7825o44m059l207R96L034n551j942P414J1551J681k59K162m377q932m183
$$ -47825 -48469 -52528 -55735 -54739 -51705 -57256 -59198 -51784 -40233 -38552 -38811 -36649 -41026 -49958 -54141
6292e4141l436M443K778m726k440Q267K781m512M85M876N870j717K67L475K226
$$ -54141 -57577 -53134 -50356 -55082 -57522 -49255 -46474 -50986 -50501 -45625 -39755 -41472 -41205 -37730 -35504
6277c5504J359p397n835j849N79L482j92m613J078N92p614l489M355L551N32k096
$$ -35504 -34145 -41542 -47377 -49226 -48647 -45165 -45357 -49970 -48892 -48300 -55914 -59403 -55048 -51497 -50965 -53061
6261e3061q62l250j515N483J551j397M847M044r185M875R941N175j1482m036n373
$$ -53061 -53923 -57173 -58688 -53205 -51654 -53051 -48204 -44160 -53345 -48470 -38529 -33354 -44836 -48872 -54245
6246e4245n583J924M895O670J402m747L328P530p161m169M484M94P120m038O205
$$ -54245 -59828 -57904 -53009 -46339 -44937 -49684 -46356 -38826 -45987 -50156 -45672 -45178 -38058 -42096 -35891
6231c5891L892l643p219r027j347J794O430J965n31j068n643l86L453l639O792
$$ -35891 -31999 -35642 -42861 -51888 -53235 -51441 -45011 -43046 -43577 -44645 -50288 -50674 -47221 -50860 -44068
6216d4068K591r69K288q777O43K848k681P067o504J083o35o618j121O722j569
$$ -44068 -41477 -42446 -40158 -48935 -48292 -45444 -48125 -41058 -47562 -46479 -47114 -53732 -54853 -48131 -49700
6201d9700k023J280l288P67R440K70L069J550J761L226K320J0784k160q091m002
$$ -49700 -51723 -50443 -53731 -52964 -43524 -43254 -40185 -38635 -36874 -33648 -31328 -20544 -22704 -30795 -34797
6186c4797l92n856j0570m673Q732N417N092L441p66n218L046J968j697j668q10
$$ -34797 -35189 -41045 -51615 -56288 -47556 -42139 -37047 -33606 -34372 -39590 -36544 -34576 -36273 -37941 -38751
6171c8751l476O522j328m794j529K691J828j870O08M543K768k65M406R199k088
$$ -38751 -42227 -35705 -37033 -41827 -43356 -40665 -38837 -40707 -40099 -35556 -32788 -33053 -28647 -19448 -21536
6156b1536m376r347m774o180k787M126O354j6p24K093R07J250O068j183j539m411
$$ -21536 -25912 -35259 -40033 -46213 -49000 -44874 -38520 -38536 -39260 -37167 -36260 -35010 -28942 -30125 -31664 -36075
6140c6075r16M458L501P602n393n076k113L309M2l939n299M02M072l718k785N434
$$ -36075 -36991 -32533 -29032 -21430 -26823 -31899 -34012 -30703 -30661 -34600 -39899 -39497 -35425 -39143 -41928 -36494
6124c6494m481K439p26M748l05m425M69j726l342k512L230J2867L199k363p30
$$ -36494 -40975 -38536 -39262 -34514 -34819 -39244 -38775 -40501 -43843 -46355 -43125 -30258 -27059 -29422 -30152
6109c0152N077L435j32n755m023n334J567j077k362l493k180M282p09o043Q024
$$ -30152 -25075 -21640 -21772 -27527 -31550 -36884 -35317 -36394 -38756 -42249 -44429 -40147 -40856 -46899 -38875
6094c8875J3947K83o110j498l123l239n927m44J1209Q284k768n144P613m639n993
$$ -38875 -24928 -24645 -30755 -32253 -35376 -38615 -44542 -44986 -33777 -25493 -28261 -33405 -25792 -30431 -36424
6079c6424o831m856L646m868l333l325J456Q316O467k224l313P967K325K629k554
$$ -36424 -43255 -48111 -44465 -49333 -52666 -55991 -54535 -46219 -39752 -41976 -45289 -37322 -34997 -32368 -34922
6064c4922l884l824n211j562Q801K350J063O469n753j0282k510L314j632k591
$$ -34922 -38806 -42630 -47841 -49403 -40602 -38252 -37189 -30720 -36473 -46755 -49265 -45951 -47583 -50174
6050e0174O939j277p024P173L787J200l324M159O473k317n480m695K192J033l331
$$ -50174 -43235 -44512 -51536 -44363 -40576 -39376 -42700 -38541 -32068 -34385 -39865 -44560 -42368 -41335 -44666
6035d4666j784k5J041L124P031l038k550O489L046q553qR309N813j277m5p09L968
$$ -44666 -46450 -46475 -45434 -42310 -35279 -38317 -40867 -34378 -31332 -39885 -39893 -30584 -24771 -26048 -26093 -26802 -22834
6018b2834m147k669j3763l667P404m999l046J0556O587M694k932j0349l955L817
$$ -22834 -26981 -29650 -43413 -47080 -39676 -44675 -47721 -37165 -30578 -25884 -28816 -39165 -43120 -39303
6004c9303J70q300L898O997L255j168j302l493m333O766P605j99J4M816M583j48
$$ -39303 -39133 -47433 -43535 -36538 -33283 -34451 -35753 -39246 -43579 -36813 -29208 -29407 -29393 -24577 -19994 -20142
5988b0142k905k234r815q063j523N146P610M888j3237j1449K556J0581l153j679
$$ -20142 -23047 -25281 -35096 -43159 -44682 -39536 -31926 -27038 -40275 -51724 -49168 -38587 -41740 -43419
5974d3419K678J2123l449j726q51M664K060J351j0762j274O353l561m667J530
$$ -43419 -40741 -28618 -32067 -33793 -34644 -29980 -27920 -26569 -37331 -38605 -32252 -35813 -40480 -38950
5960c8950j163l777k342K063Q57N002R259k204j2585r538Q336J2835M187n699
$$ -38950 -40113 -43890 -46232 -44169 -43312 -38310 -29051 -31255 -43840 -53378 -45042 -32207 -28020 -33719
5946c3719o760l608M745J3508O331n906o540L568j792q44N248M758L639k871j7018
$$ -33719 -40479 -44087 -39342 -25834 -19503 -25409 -31949 -28381 -30173 -31017 -25769 -21011 -17372 -20243 -37261
5931c7261o598O631K819k56J0255q74l105p191J349M624L916K977k447p44m605
$$ -37261 -43859 -37228 -34409 -34665 -24410 -25284 -28389 -35580 -34231 -29607 -25691 -22714 -25161 -25905 -30510
5916c0510J651K758l400k454L538O358n244P86J462j974m652k732J573M055R097
$$ -30510 -28859 -26101 -29501 -31955 -28417 -22059 -27303 -26517 -25055 -27029 -31681 -34413 -32840 -28785 -19688
5901a9688r534j1096K682j763l203j100N826R92P685P370p41K460j486j1572p619
$$ -19688 -29222 -40318 -37636 -39399 -42602 -43702 -37876 -36884 -29199 -21829 -22570 -20110 -21596 -33168 -40787
5886d0787j051l495J215K308P38O821N407n24m544l471m267M229O486k810p172
$$ -40787 -41838 -45333 -44118 -41810 -41072 -34251 -28844 -29368 -33912 -37383 -41650 -37421 -30935 -33745 -40917
5871d0917l778J811J41K101m566L951L24K931P199n61j770l792M536R334m789
$$ -40917 -44695 -42884 -42743 -40642 -45208 -41257 -40933 -38002 -30803 -31364 -33134 -36926 -32390 -23056 -27845
5856b7845m959l79o349q010j040N71J041j06k309J092L271O197l798j666R14J859
$$ -27845 -32804 -33183 -39532 -47542 -48582 -48011 -46970 -47076 -49385 -48293 -45022 -38825 -42623 -44289 -43375 -41516
5840d1516P947J0756n234n880m089j402o536M337Q784l660K039k320j932K51o123
$$ -41516 -33569 -22813 -28047 -33927 -38016 -39418 -45954 -41617 -32833 -36493 -34454 -36774 -38706 -38455 -44578
5825d4578M818M066M954O35q08M888R56J368J807n666m452r57O80J880j339j255
$$ -44578 -39760 -35694 -30740 -30105 -30913 -26025 -25069 -23701 -21894 -27560 -32012 -32969 -32289 -30409 -31748 -33003
5809c3003J593O734k767k63N68O62O253o99j0473k203M51J140J461n96L539P135
$$ -33003 -31410 -24676 -27443 -27706 -27138 -26476 -20223 -20922 -31395 -33598 -33147 -32007 -30546 -31142 -27603 -20468
5793b0468N790M544M092q207n911K016Q84o467R20n16r846L561Q069R922J24l586
$$ -20468 -14678 -10134 -6042 -14249 -20160 -18144 -17260 -23727 -22807 -23323 -33169 -29608 -21539 -11617 -11493 -15079
5777a5079J074N6L229J308J179k763R21K904j201n362R85m414m961K41k469r866
$$ -15079 -14005 -13949 -10720 -9412 -8233 -10996 -10075 -7171 -8372 -13734 -12749 -17163 -22124 -21883 -24352 -34218
5761c4218o039N263P168Q95m504M717k119R76j487k609k170j1118m933K022K527
$$ -34218 -40257 -34994 -27826 -26931 -31435 -26718 -28837 -27861 -29348 -31957 -34127 -45245 -50178 -48156 -45629
5746d5629k867L692L496N596J069j831o25j476J981k233r356m225M583N860m321
$$ -45629 -48496 -44804 -41308 -35712 -34643 -36474 -37099 -38575 -36594 -38827 -48183 -52408 -47825 -41965 -46286
5731d6286l897K860N481L439J502l953M226J33L368j587p576P017O259m680M162
$$ -46286 -50183 -47323 -41842 -38403 -36901 -40854 -36628 -36495 -33127 -34714 -42290 -35273 -29014 -33694 -29532
5716b9532m054k588M045j803j205J482L0k099q295n65m546Q018N877O060M358
$$ -29532 -33586 -36174 -32129 -33932 -35137 -33655 -33625 -35724 -44019 -44584 -49130 -41112 -35235 -29175 -24817
5701b4817J145o25j768k662K546L361n483j52L047Q3J000l258N756m867M03M693
$$ -24817 -23672 -24297 -26065 -28727 -26181 -22820 -28303 -28455 -25408 -25325 -24325 -27583 -21827 -26694 -26291 -21598
5685b1598N517r223o257J402M119J852n87q627O385Q569K292m279m029m884J690
$$ -21598 -16081 -25304 -31561 -30159 -26040 -24188 -24775 -33402 -27017 -18448 -16156 -20435 -24464 -29348 -27658
5670b7658K713N316K257O050K166n31j080l56J026j877k048p29k444m912N0p364
$$ -27658 -24945 -19629 -17372 -11322 -9156 -9687 -10767 -11123 -10097 -11974 -14022 -14751 -17195 -22107 -22057 -29421
5654b9421n196o303Q001R038j929M286m779j025M38L912K781l555J102L8M783
$$ -29421 -34617 -40920 -32919 -23881 -25810 -21524 -26303 -27328 -26890 -22978 -20197 -23752 -22650 -22612 -17829
5639a7829p04o948n400l140N831j174m156M89l528o019j648M417L04M462M156
$$ -17829 -18533 -25481 -30881 -34021 -28190 -29364 -33520 -33031 -36559 -42578 -44226 -39809 -39505 -35043 -30887
5624c0887l702l744J492P518R414J68K367M551m421k755n986k734m286l104L19
$$ -30887 -34589 -38333 -36841 -29323 -19909 -19741 -17374 -12823 -17244 -19999 -25985 -28719 -33005 -36109 -35790
5609c5790k305k609J715Q306N496j11o801P74J023K489j251N153m483k256l038
$$ -35790 -38095 -40704 -38989 -30683 -25187 -25298 -32099 -31325 -30302 -27813 -29064 -23911 -28394 -30650 -33688
5594c3688P632N868K370L508Q575p11j2162l406m469k033l547k490j929M864o63
$$ -33688 -26056 -20188 -17818 -14310 -5735 -6446 -18608 -22014 -26483 -28516 -32063 -34553 -36482 -31618 -32281
5579c2281k374N911P072R94n636N97j363K5j775l762P134R26j398K588m098k004
$$ -32281 -34655 -28744 -21672 -20678 -26314 -25717 -27080 -27055 -28830 -32592 -25458 -24532 -25930 -23342 -27440 -29444
5563b9444K34K273n25M374M791p027m426M070M31n247O209K370j056q688r558
$$ -29444 -29210 -26937 -27462 -23088 -18297 -25324 -29750 -25680 -25249 -30496 -24287 -21917 -22973 -31661 -41219
5548d1219K866P136m64j791j560O522J333R690l221R92k077N668M682n182m407
$$ -41219 -38353 -31217 -31681 -33472 -35032 -28510 -27177 -17487 -20708 -19716 -21793 -16125 -11443 -16625 -21032
5533b1032m55J2404Q99l616M906l064n658J844n81l192j3405j242R074K066Q531
$$ -21032 -21487 -9083 -8184 -11800 -6894 -9958 -15616 -13772 -14353 -17545 -30950 -32192 -23118 -21052 -12521
5518a2521j104n035o14K401j838k581o942N349j930M078J390k415J581O911M023
$$ -12521 -13625 -18660 -19274 -16873 -18711 -21292 -28234 -22885 -24815 -20737 -19347 -21762 -20181 -13270 -9247
5503i247R39r25r414p973J184P736l84p817j097R409p64K387m608m103L081J3184
$$ -9247 -8308 -9233 -18647 -26620 -25436 -17700 -18084 -25901 -26998 -17589 -18353 -15966 -20574 -24677 -21596 -8412
5487h412K33q585n271Q50l710l89N809O499k173l947K020O39m410O989L665L127
$$ -8412 -8179 -16764 -22035 -21185 -24895 -25284 -19475 -12976 -15149 -19096 -17076 -16437 -20847 -13858 -10193 -7066
5471g066J699n676k340J979M918m300J838o832j343m27p730m004P488M115N416
$$ -7066 -5367 -11043 -13383 -11404 -6486 -10786 -8948 -15780 -17123 -17550 -25280 -29284 -21796 -17681 -12265
5456a2265j162j802J111j472l010O31N82k677L065k004m252L036J768O279O708
$$ -12265 -13427 -15229 -14118 -15590 -18600 -17969 -17387 -20064 -16999 -19003 -23255 -20219 -18451 -12172 -5464
5441e464q098l026O647J40k870J262J07p353k503m579N073j703N025J124r80l
$$ -5464 -13562 -16588 -9941 -9801 -12671 -11409 -11302 -18655 -21158 -25737 -20664 -22367 -17342 -16218 -17198 -17201
5425a7201M592L805n635n804k881Q142J0298K031p156j3670m17M345o38l523L417
$$ -17201 -12609 -8804 -14439 -20243 -23124 -14982 -4684 -2653 -9809 -23479 -23896 -19551 -20189 -23712 -20295
5410b0295O486O621K173p200l514n829l101L890J410R47J927n578n557Q73j943
$$ -20295 -13809 -7188 -5015 -12215 -15729 -21558 -24659 -20769 -19359 -18412 -16485 -22063 -27620 -26747 -28690
5395b8690r1J626K00k577K041M928j305m919K539j251k650r647L515R198N299
$$ -28690 -28781 -27155 -26955 -29532 -27491 -22563 -23868 -28787 -26248 -27499 -30149 -39796 -36281 -27083 -21784
5380b1784M208Q454l393N444M706j2j0270j637M18P427L850j890J754j836o142
$$ -21784 -17576 -9122 -12515 -7071 -2365 -2377 -12647 -14284 -13866 -6439 -2589 -4479 -2725 -4561 -10703
5365a0703k154m562K88k57k078Q570Q192N927n02j0013K88J266k443j179k94R13
$$ -10703 -12857 -17419 -17131 -17388 -19466 -10896 -2704 3223 2721 -7292 -7004 -5738 -8181 -9360 -9654 -8741
5349h741m920n424L671K649K88J784O279L294p838n951J283P656J960k940p082
$$ -8741 -13661 -19085 -15414 -12765 -12477 -10693 -4414 -1120 -8958 -14909 -13626 -5970 -4010 -6950 -14032
5334a4032p791N88P24k892m147L104Q04O967n005J828l410K148R996J146m432
$$ -14032 -21823 -21235 -20511 -23403 -27550 -24446 -23642 -16675 -21680 -19852 -23262 -21114 -11118 -9972 -14404
5319a4404l735M37m343Q3m193J548N699K941O893r408l327P748M415J822j663
$$ -14404 -18139 -17702 -22045 -21962 -26155 -24607 -18908 -15967 -9074 -18482 -21809 -14061 -9646 -7824 -9487
5304i487p428l113k46K306o40O270n678l338M227L931M51Ln987O225Q16n79p523
$$ -9487 -16915 -20028 -20274 -17968 -18608 -12338 -18016 -21354 -17127 -13196 -12745 -12742 -18729 -12504 -11688 -12267 -19790
5287a9790O220Q96J969J888l943M307n33l185N426l521Q48K659k88l816M243k071
$$ -19790 -13570 -12674 -10705 -8817 -12760 -8453 -8986 -12171 -6745 -10266 -9418 -6759 -7047 -10863 -6620 -8691
5271h691m755j351l015o420M426R152M238M890q631q213K471j178J662O79L239
$$ -8691 -13446 -14797 -17812 -24232 -19806 -10654 -6416 -1526 -10157 -18370 -15899 -17077 -15415 -14736 -11497
5256a1497J435L060m552q301q327k36Q397P547l257p160P662P180L841j3210m178
$$ -11497 -10062 -7002 -11554 -19855 -28182 -28418 -20021 -12474 -15731 -22891 -15229 -8049 -4208 -17418 -21596
5241b1596L651K367k07k439M94J553M380l994o847M55o80M841R562J218m968j242
$$ -21596 -17945 -15578 -15785 -18224 -17730 -16177 -11797 -15791 -22638 -22183 -22863 -18022 -8460 -7242 -12210 -13452
5225a3452M49n46K149L803L799l422r89L223j3214Q43Q753m115k817k441Q656
$$ -13452 -13003 -13549 -11400 -7597 -3798 -7220 -8209 -4986 -18200 -17357 -8604 -12719 -15536 -17977 -9321
5210i321P078q241R26N101j224j278j431L563j301q247l401J367J154l110k683
$$ -9321 -2243 -10484 -9558 -4457 -5681 -6959 -8390 -4827 -6128 -14375 -17776 -16409 -15255 -18365 -21048
5195b1048O384l464n232L58K98k050q98M844K715J0383k603p691R773P587l947
$$ -21048 -14664 -18128 -23360 -23002 -22704 -24754 -25652 -20808 -18093 -7710 -10313 -18004 -8231 -644 -4591
5180d591j6083m971Q156j608m260j185M654K771n00N220O15j7O21J407J202Q261
$$ -4591 -20674 -25645 -17489 -19097 -23357 -24542 -19888 -17117 -17617 -12397 -11782 -11799 -11178 -9771 -8569 -308
5164c08q487p695P878N375n152o60l516K545l198n396J417l245o986L881P808
$$ -308 -8795 -16490 -8612 -3237 -8389 -9049 -12565 -10020 -13218 -18614 -17197 -20442 -27428 -23547 -15739
5149a5739J63l824o82L107J231j248L434m328L164N724m497P638K861m639L026
$$ -15739 -15576 -19400 -20082 -16975 -15744 -16992 -13558 -17886 -14722 -8998 -13495 -5857 -2996 -7635 -4609
5134d609M241q343j3385l128J769M846J546L566n5o20R322J908q093m191o505
$$ -4609 -368 -8711 -22096 -25224 -23455 -18609 -17063 -13497 -13552 -14172 -4850 -2942 -11035 -15226 -21731
5119b1731k337j852J0835O869M292n411p643j828j488k62J81k318k594m93J0197
$$ -21731 -24068 -25920 -15085 -8216 -3924 -9335 -16978 -18806 -20294 -20556 -20375 -22693 -25287 -25780 -15583
5104a5583J0099q156l992j134N054N211q083k311L658P251L077r13J589l755q047
$$ -15583 -5484 -13640 -17632 -18766 -13712 -8501 -16584 -18895 -15237 -7986 -4909 -5822 -4233 -7988 -16035
5089a6035n09K246j543n442k151J2324J3550p612r959m60L458O870N159M05q987
$$ -16035 -16544 -14298 -15841 -21283 -23434 -11110 2440 -5172 -15131 -15591 -12133 -5263 -104 301 -8686
5074h686k055j9m739J430q11N114L308L979K03J300L477q31l636J789k453P27
$$ -8686 -10741 -10760 -15499 -14069 -14880 -9766 -6458 -2479 -2276 -976 2501 1670 -1966 -177 -2630 -1903
5058a903k656m288p575n91P367M18P61J015n477K09L825j1203r0L554L860J1456
$$ -1903 -4559 -8847 -16422 -17013 -9646 -9228 -8467 -7452 -12929 -12720 -8895 -20098 -20188 -16634 -12774 -1318
5042a318m541n243k3N734l170L416R139K159j911j3444j972J0647P243n54p734
$$ -1318 -5859 -11102 -11125 -5391 -8561 -5145 3994 6153 4242 -9202 -11174 -527 6716 6162 -1572
5027a572n147k263l179L944r54l350k49P97p418N054j316o319L780J869m516Q598
$$ -1572 -6719 -8982 -12161 -8217 -9171 -12521 -12770 -11973 -19391 -14337 -15653 -21972 -18192 -16323 -20839 -12241
5011a2241Q854M210k618M589l76o566m989M192J008o55k697M23j199l632r250
$$ -12241 -3387 823 -1795 2794 2418 -4148 -9137 -4945 -3937 -4592 -7289 -6866 -8065 -11697 -20947
$$ [...]
##END NTUPLES=NMR SPECTRUM
##END=
